
##TITLE=AC1386_BRAAS12198_7519771_v0Zb4zdImy
##JCAMPDX= 6.0         $$ Bruker NMR JCAMP-DX V2.0
##DATA TYPE= NMR SPECTRUM
##DATA CLASS= NTUPLES
##ORIGIN= BRUKER
##OWNER= Administrator
$$ 1.72 TOPSPIN		Version 2.1
$$ 2013-02-20 18:09:30.040 -0500  Administrator@X
$$ Compression mode = diff/dup
##.OBSERVE FREQUENCY= 400.02188249412
##.OBSERVE NUCLEUS= ^1H
##.ACQUISITION MODE= SIMULTANEOUS (DQD)
##.ACQUISITION SCHEME= undefined
##.AVERAGES= 64
##.DIGITISER RES= 22
##SPECTROMETER/DATA SYSTEM= spect
##.PULSE SEQUENCE= noesygpps1d.comp
##.SOLVENT NAME= COFFEE_meoh
##.SHIFT REFERENCE= INTERNAL, COFFEE_meoh, 1, 14.96091
##AUDIT TRAIL= $$ (NUMBER, WHEN, WHO, WHERE, PROCESS, VERSION, WHAT)
$$ ##TITLE= Audit trail, TOPSPIN		Version 2.1
$$ ##JCAMPDX= 5.01
$$ ##ORIGIN= Bruker BioSpin GmbH
$$ ##OWNER= Administrator
$$ $$ E:\/data/COFFEE/nmr/AC1386_BRAAS12198_7519771_v0Zb4zdImy/12/pdata/1/auditp.txt
$$ ##AUDIT TRAIL=  $$ (NUMBER, WHEN, WHO, WHERE, PROCESS, VERSION, WHAT)
(   1,<2013-02-20 18:09:23.290 -0500>,<Administrator>,<X>,<go>,<TOPSPIN 2.1>,
      <created by zg
	started at 2013-02-20 17:57:53.224 -0500,
	POWCHK enabled, PULCHK disabled,
       configuration hash MD5:
       86 BA 57 50 F2 9D 5C 9B 26 00 A9 28 5F 66 2E 89
       data hash MD5: 64K
       8E 0B E4 31 D4 85 DF 2B EB E3 7B 99 32 35 D8 6C>)
(   2,<2013-02-20 18:09:26.540 -0500>,<Administrator>,<X>,<proc1d>,<TOPSPIN 2.1>,
      <Start of raw data processing
       efp LB = 0.3 FT_mod = 6 PKNL = 1 PHC0 = 0 PHC1 = 0 SI = 128K 
       data hash MD5: 128K
       DE 46 BE 99 70 48 E0 77 F9 7D 40 24 0C B5 46 5D>)
(   3,<2013-02-20 18:09:27.837 -0500>,<Administrator>,<X>,<proc1d>,<TOPSPIN 2.1>,
      <pk PHC0 = 252.757 PHC1 = 0 
       data hash MD5: 128K
       D2 EC 41 84 4F 11 1C CC 81 E5 40 5E 53 60 12 20>)
(   4,<2013-02-20 18:09:28.853 -0500>,<Administrator>,<X>,<proc1d>,<TOPSPIN 2.1>,
      <abs ABSG = 1 
       data hash MD5: 128K
       05 62 4E 76 FD 74 1D 36 9D 1D B0 87 C7 7F D1 52>)
(   5,<2013-02-20 18:09:29.072 -0500>,<Administrator>,<X>,<proc1d>,<TOPSPIN 2.1>,
      <abs ABSG = 2 
       data hash MD5: 128K
       52 AD 48 7D 60 EC 64 AB 23 35 10 B0 97 10 92 83>)
(   6,<2013-02-20 18:09:29.369 -0500>,<Administrator>,<X>,<proc1d>,<TOPSPIN 2.1>,
      <abs ABSG = 3 
       data hash MD5: 128K
       38 35 A0 D6 C8 B3 C8 AB 61 9F F3 54 72 F1 58 23>)
(   7,<2013-02-20 18:09:29.494 -0500>,<Administrator>,<X>,<proc1d>,<TOPSPIN 2.1>,
      <abs ABSG = 4 
       data hash MD5: 128K
       D3 EB 72 4B 35 9B 2A 0C 37 93 01 62 06 A0 6F C1>)
(   8,<2013-02-20 18:09:29.665 -0500>,<Administrator>,<X>,<proc1d>,<TOPSPIN 2.1>,
      <abs ABSG = 5 
       data hash MD5: 128K
       92 51 7C D5 EC 7A 2D 2A BD 28 50 8C 97 1B DE 2D>)
$$ ##END=
$$ 
$$ $$ hash MD5
$$ $$ 2F DA 95 71 46 77 E2 25 12 73 B8 02 0D C8 9C 57
##$RELAX= 
##$RELAX= 
##$RELAX= 
##$RELAX= 
##$RELAX= 
##$RELAX= 
##$RELAX= 
##$RELAX= 
$$ Bruker specific parameters
$$ --------------------------
##$DU= <E:\>
##$EXPNO= 12
$$ [...]
150 150 150 150 150 150 150 150
##$TP07= 0
##$TPNAME0= <>
##$TPNAME1= <>
##$TPNAME2= <>
##$TPNAME3= <>
##$TPNAME4= <>
##$TPNAME5= <>
##$TPNAME6= <>
##$TPNAME7= <>
##$TPOAL= (0..7)
0.5 0.5 0.5 0.5 0.5 0.5 0.5 0.5
##$TPOFFS= (0..7)
0 0 0 0 0 0 0 0
##$TUNHIN= 0
##$TUNHOUT= 0
##$TUNXOUT= 0
##$USERA1= <user>
##$USERA2= <user>
##$USERA3= <user>
##$USERA4= <user>
##$USERA5= <user>
##$V9= 5
##$VALIST= <valist>
##$VCLIST= <CCCCCCCCCCCCCCC>
##$VD= 0
##$VDLIST= <DDDDDDDDDDDDDDD>
##$VPLIST= <PPPPPPPPPPPPPPP>
##$VTLIST= <TTTTTTTTTTTTTTT>
##$WBST= 1024
##$WBSW= 4
##$XGAIN= (0..3)
0 0 0 0
##$XL= 0
##$YL= 0
##$YMAX_a= 6523784
##$YMIN_a= -11253630
##$ZGOPTNS= <>
##$ZL1= 120
##$ZL2= 120
##$ZL3= 120
##$ZL4= 120
##$ABSF1= 14.96091
##$ABSF2= -5.597272
##$ABSG= 5
##$ABSL= 3
##$ALPHA= 0
##$AQORDER= 0
##$ASSFAC= 0
##$ASSFACI= 0
##$ASSFACX= 0
##$ASSWID= 0
##$AUNMP= <proc_prof1d_extract.lims>
##$AXLEFT= 0
##$AXNAME= <>
##$AXNUC= <1H>
##$AXRIGHT= 0
##$AXTYPE= 0
##$AXUNIT= <>
##$AZFE= 0.1
##$AZFW= 0.1
##$BCFW= 0
##$BC_mod= 0
##$BYTORDP= 0
##$COROFFS= 0
##$CY= 15
##$DATMOD= 1
##$DC= 0
##$DFILT= <>
##$DTYPP= 0
##$F1P= 0
##$F2P= 0
##$FCOR= 0.5
##$FTSIZE= 131072
##$FT_mod= 6
##$GAMMA= 0
##$GB= 0
##$INTBC= 1
##$INTSCL= 1
##$ISEN= 128
##$LB= 0.3
##$LEV0= 0
##$LPBIN= 0
##$MAXI= 10000
##$MC2= 0
##$MEAN= 0
##$ME_mod= 0
##$MI= 0
##$NCOEF= 0
##$NC_proc= -2
##$NLEV= 6
##$NOISF1= 0
##$NOISF2= 0
##$NSP= 0
##$NTH_PI= 0
##$NZP= 0
##$OFFSET= 14.96091
##$PC= 1
##$PHC0= 252.757
##$PHC1= 0
##$PH_mod= 1
##$PKNL= yes
##$PPARMOD= 0
##$PPDIAG= 0
##$PPIPTYP= 0
##$PPMPNUM= 2147483647
##$PPRESOL= 1
##$PSCAL= 4
##$PSIGN= 0
##$PYNMP= <proc.py>
##$REVERSE= no
##$SF= 400.020009672516
##$SI= 131072
##$SIGF1= 0
##$SIGF2= 0
##$SINO= 400
##$SIOLD= 131072
##$SPECTYP= <>
##$SREGLST= <1H.CDCl3>
##$SSB= 0
##$STSI= 131072
##$STSR= 0
##$SW_p= 8223.68421052631
##$SYMM= 0
##$S_DEV= 0
##$TDeff= 65536
##$TDoff= 0
##$TI= <>
##$TILT= no
##$TM1= 0
##$TM2= 0
##$TOPLEV= 0
##$USERP1= <user>
##$USERP2= <user>
##$USERP3= <user>
##$USERP4= <user>
##$USERP5= <user>
##$WDW= 1
##$XDIM= 131072
##$YMAX_p= 370493476
##$YMIN_p= -12480
##$CURPLOT= <Network HP LaserJet P1505>
##$CURPRIN= <$Network HP LaserJet P1505>
##$DFORMAT= <normdp>
##$LAYOUT= <+/1D_H.xwp>
##$LFORMAT= <normlp>
##$PFORMAT= <normpl>
##$SURQMSG= 1
$$ End of Bruker specific parameters
$$ ---------------------------------
##NTUPLES= NMR SPECTRUM
##VAR_NAME=  FREQUENCY,     SPECTRUM/REAL,   SPECTRUM/IMAG
##SYMBOL=    X,             R,               I
##VAR_TYPE=  INDEPENDENT,   DEPENDENT,       DEPENDENT
##VAR_FORM=  AFFN,          ASDF,            ASDF
##VAR_DIM=   131072,        131072,          131072
##UNITS=     HZ,            ARBITRARY UNITS, ARBITRARY UNITS
##FACTOR=    0.0627417313425164, 1,          1
##FIRST=     8223.62146879497, 4355,         -65184
##LAST=      0,             5759,            -64847
##MIN=       0,             -12480,          0
##MAX=       8223.62146879497, 370493476,    0
$$ Real data points
##PAGE= N=1
##DATA TABLE= (X++(R..R)), XYDATA
$$ [...]
63907B411777j88210j73173j57240j41188j26227j12908j00777q9200p8203o8265
63897A176386n9574n1884m4992l9047l4267l0639k7900k5697k3721k1847k0209
63886G96609j8911j7661j5971j3852j1897j0364q580n810k468K81K124M031O868
63873G04399J0289J3492J6428J9606K3065K6242K8676L0312L1246L1726L2254
63862I67735L3066L3544L2750L0574K7790K4936K1717J7736J3189Q530L887p96
63850A214658n485j0190j5007j9674k3455k5956k7712k9513l1437l3097l4584
63839I58548l6301l7918l8329l7091l5146l3663l2635l1330k9722k8536k7929
63828E89948k7040k5255k3167k1717k0834j9587j7491j5060j3083j1856j1183
$$ y = [2411777, 2223567, 2050394, 1893154, 1751966, 1625739, 1512831, 1412054, 1322854, 1244651, 1176386, 1116812, 1064928, 1019936, 980889, 946622, 915983, 888083, 862386, 838665, 816818, 796609, 777698, 760037, 744066, 730214, 718317, 707953, 699373, 693563, 691095, 691376, 693500, 697531, 704399, 714688, 728180, 744608, 764214, 787279, 813521, 842197, 872509, 903755, 935481, 967735, 1000801, 1034345, 1067095, 1097669, 1125459, 1150395, 1172112, 1189848, 1203037, 1211567, 1215454, 1214658, 1209173, 1198983, 1183976, 1164302, 1140847, 1114891, 1087179, 1057666, 1026229, 993132, 958548, 922247, 884329, 846000, 808909, 773763, 740100, 707465, 676135, 646413, 617877, 589948, 562908, 537653, 514486, 492769, 471935, 452348, 434857, 419797, 406714, 394858, 383675]
63817C83675j0697j0087r303q567q008p397o612o072o149o266n412l656k350k473
63803B90626l392l770l139k080j314j207j768k523k748k278j864k177k913l399
63789B56054l632l936l953l035j542o74r24j558j897k127k482k459j588l24M45
63774B26368M78J56k56p32j075r68m37J40M83N24J84n72j428j834j570r83n43
63757B17935l43j37J87M28L82K15K88O06P04L17n8L10J372K199K062J234N29L59
63739B28589N53R17J538K491L496M029L781K904J889J237J276K095L372M372M451
63724B66990L820L438L934M857N342N164M703M128L323K490K164K399K550K043
63710C17345R32m68j939l096l411k839k089j767j722j509j119p85m07J96P37P70
$$ y = [383675, 372978, 362891, 353588, 345021, 337013, 329616, 323004, 316932, 310783, 304517, 299105, 295449, 293099, 290626, 287234, 283464, 280325, 278245, 276931, 275724, 273956, 271433, 268685, 266407, 264543, 262366, 259453, 256054, 252422, 248486, 244533, 241498, 239956, 239282, 238358, 236800, 234903, 232776, 230294, 227835, 226247, 225923, 226368, 226846, 227002, 226746, 226014, 224939, 223971, 223534, 223674, 224157, 224681, 224865, 224293, 222865, 221031, 219461, 218478, 217935, 217592, 217455, 217642, 218070, 218452, 218667, 218955, 219561, 220265, 220582, 220524, 220834, 222206, 224405, 226467, 227701, 228230, 228589, 229142, 230059, 231597, 234088, 237584, 241613, 245394, 248298, 250187, 251424, 252700, 254795, 258167, 262539, 266990, 270810, 274248, 278182, 283039, 288381, 293545, 298248, 302376, 305699, 308189, 310353, 312752, 315302, 317345, 318277, 317809, 315870, 312774, 309363, 306524, 304435, 302668, 300946, 299437, 298318, 297533, 297126, 297322, 298059, 298829]
63694B98829M27L32P47J387K039K827L728M368M530M491M538M436L728K423J064
63679C39894J33m03q98j556k163k294j693n85M49R17P82M46L23M80O95P97Q39
63662C36163Q63P07J74p03j746k871m042m983n221m534l217j894j151j269k008
63647C04268k659k639k123j857k187k611k375j310J24J376K178K625L040L599
63633B99449M025L965L658L864M825N822O066N691N422N629O161O841P554Q075
63619C77047Q374Q915J0087J1510J2519J3287J4688J6985J9407K1215K2469K3531
63607E60034K4502K5610K7337K9507L0788K9906K7114K3724K0405J6708J2229
63596H27864P439L139k51k588l729l834l664m151n678p977j0532j3005j5364j7738
$$ y = [298829, 299256, 299588, 300335, 301722, 303761, 306588, 310316, 314684, 319214, 323705, 328243, 332679, 336407, 338830, 339894, 340027, 339624, 338726, 337170, 335007, 332713, 331020, 330435, 330884, 331801, 332583, 333029, 333352, 333832, 334527, 335324, 336163, 337026, 337733, 337907, 337204, 335458, 332587, 328545, 323562, 318341, 313807, 310590, 308696, 307545, 306276, 304268, 301609, 298970, 296847, 294990, 292803, 290192, 287817, 286507, 286631, 288007, 290185, 292810, 295850, 299449, 303474, 307439, 311097, 314961, 319786, 325608, 331674, 337365, 342787, 348416, 354577, 361418, 368972, 377047, 385421, 394336, 404423, 415933, 428452, 441739, 456427, 473412, 492819, 514034, 536503, 560034, 584536, 610146, 637483, 666990, 697778, 727684, 754798, 778522, 798927, 815635, 827864, 835303, 838442, 838191, 835603, 831874, 828040, 824376, 820225, 814547, 806570, 796038, 783033, 767669, 749931]
63582G49931k0031k1705k2227k1784k1202k0904k0367j8896j6665j4506j2815
63571E38829j1175r133o891m988l588k310o91J269K996L801L653L411M018N498
63557E24699P004P934Q578R540J0934J2513J4248J6308J8613K0885K3215K6142
63545G00613K9931L4055L7549L9648L9817L7402L1848K3579J4469O886K005q43
63533I96959l073n283p008p750p709p494p634q579j0735j4034j7741k1074k3887
63520H54958k6449k8717l0322l1129l1339l1022l0059k8612k7172k5944k4531
63509E39662k2554k0235j8090j6203j4251j2229j0684j0092j0162j0006q995p365
63497C78796n896n066m634m062l215k463k170k213k149j801j516j636j829j301
$$ y = [749931, 729900, 708195, 685968, 664184, 642982, 622078, 601711, 582815, 566150, 551644, 538829, 527654, 518521, 511630, 506642, 503054, 500744, 500053, 501322, 504318, 508119, 511772, 515183, 519201, 524699, 531703, 539637, 548215, 557755, 568689, 581202, 595450, 611758, 630371, 651256, 674471, 700613, 730544, 764599, 802148, 841796, 881613, 919015, 950863, 974442, 988911, 995797, 997802, 996959, 993886, 988603, 981595, 973845, 966136, 958642, 951008, 942429, 931694, 917660, 899919, 878845, 854958, 828509, 799792, 769470, 738341, 707002, 675980, 645921, 617309, 590137, 564193, 539662, 517108, 496873, 478783, 462580, 448329, 436100, 425416, 415324, 405162, 395156, 386161, 378796, 372900, 367834, 363200, 359138, 355923, 353460, 351290, 349077, 346928, 345127, 343611, 341975, 340146, 338845]
63483C38845J42J603K112J899K037K882L661L786L717M008M236L714K723K045
63469C77410J588N05j280k695k920k388k035k171k546k940l227l191k704j920
63455C49486j063k46L80O04N05M88Q68J639K706L928M901N267N342N919P245Q698
63439C96667R774J0739J2016J3562J5339J7740K0930K4245K6866K8614K9429K8590
63427F34511K5457K0819J6501J3517J1363R326P732P604R442J2719J6395J9758
63415H05144K2893K6260K9750L2421L3327L2318K9662K5393J9643J3352P765L322
63403A081250l10l181m947n867o951q713j0602j2139j3945j6909k0829k4682k7934
63390I24241l0784l3174l4341l3714l1828k9928k8723k7789k6267k3928k1390
$$ y = [338845, 338987, 340590, 342702, 344601, 346638, 349520, 353181, 356967, 360684, 364692, 368928, 372642, 375365, 377410, 378998, 379503, 378223, 375528, 372608, 370220, 368185, 366014, 363468, 360528, 357301, 354110, 351406, 349486, 348423, 348177, 348557, 349161, 349666, 350154, 351022, 352661, 355367, 359295, 364196, 369463, 374805, 380724, 387969, 396667, 406441, 417180, 429196, 442758, 458097, 475837, 496767, 521012, 547878, 576492, 605921, 634511, 659968, 680787, 697288, 710805, 722168, 731494, 739226, 746830, 756272, 768991, 785386, 805144, 828037, 854297, 884047, 916468, 949795, 982113, 1011775, 1037168, 1056811, 1070163, 1077928, 1081250, 1080940, 1077759, 1072812, 1066945, 1059994, 1051281, 1040679, 1028540, 1014595, 997686, 976857, 952175, 924241, 893457, 860283, 825942, 792228, 760400, 730472, 701749, 673960, 647693, 623765, 602375]
63379F02375j9206j7143j4581j1510q617o387m592k783r10Q78K651M555O437Q033
63365E39200R372J0773J2474J4494J6811J9350K1870K4098K6001K7795K9737L2027
63353G84002L4608L6811L7456L5833L2504K8662K4628J9724J3796Q127M150J680
63341A061981o68l485n907p187q023r652j2195j4737j6878j9330k2776k6734k9936
63328H84473l1515l1504l0486k9038k7473k5765k3597k0582j6557j1848p391m432
63316F24285l772n244q034j1401j4779j7503j8997j9329j9040j8295j6845j4939
63304D56107j3524j2974j2361j0657q236o382n596n275m911m685m723m651m211
63291C57921l710l488l368l032k566k236k028j806j694j970k569l059l072k625
$$ y = [602375, 583169, 566026, 551445, 539935, 531318, 524931, 520339, 517556, 516646, 517524, 520175, 524730, 531167, 539200, 548572, 559345, 571819, 586313, 603124, 622474, 644344, 668442, 694443, 722238, 751975, 784002, 818610, 855421, 892877, 928710, 961214, 989876, 1014504, 1034228, 1048024, 1056151, 1060301, 1061981, 1061313, 1057828, 1051921, 1044734, 1036711, 1027059, 1014864, 1000127, 983249, 963919, 941143, 914409, 884473, 852958, 821454, 790968, 761930, 734457, 708692, 685095, 664513, 647956, 636108, 628717, 624285, 620513, 615269, 607235, 595834, 581055, 563552, 544555, 525226, 506186, 487891, 471046, 456107, 442583, 429609, 417248, 406591, 398355, 391973, 386377, 381102, 376191, 371506, 366783, 362132, 357921, 354211, 350723, 347355, 344323, 341757, 339521, 337493, 335687, 333993, 332023, 329454, 326395, 323323, 320698]
63277C20698j979j340p56k35J10J91J71L58P74J039R06P09R54J637K291K595K573
63260C30696K299J849J584J963K962M006M586M691M547M367M403M892N705O364
63246C84914O520O324O219O688Q078J0305J2626J4171J4846J5370J6323J7633
63234E20017J9059K0597K2182K3555K4742K6146K7774K8881K8914K8313K7887
63223G98067K7747K7527K7317K7601K8401K9169K9526K9531K9242K8639K7932
63212A110699K7269K6011K3053J8114J2169O313O69n158j1137j6822k2014k6792
63200A142374l0959l3959l5447l5583l4763l3318l1486k9314k6541k2893j8705
63189H09406j4943j2254j0164p593m093k09L428O875J0376J3592J5845J7100J8015
$$ y = [320698, 318719, 317379, 316623, 316388, 316498, 316689, 316860, 317218, 317992, 319031, 319937, 320646, 321600, 323237, 325528, 328123, 330696, 332995, 334844, 336428, 338391, 341353, 345359, 349945, 354636, 359183, 363550, 367953, 372845, 378550, 384914, 391434, 397758, 403977, 410665, 418743, 429048, 441674, 455845, 470691, 486061, 502384, 520017, 539076, 559673, 581855, 605410, 630152, 656298, 684072, 712953, 741867, 770180, 798067, 825814, 853341, 880658, 908259, 936660, 965829, 995355, 1024886, 1054128, 1082767, 1110699, 1137968, 1163979, 1187032, 1205146, 1217315, 1223628, 1224297, 1219139, 1208002, 1191180, 1169166, 1142374, 1111415, 1077456, 1042009, 1006426, 971663, 938345, 906859, 877545, 851004, 828111, 809406, 794463, 782209, 772045, 764452, 760359, 760150, 763578, 770453, 780829, 794421, 810266, 827366, 845381]
63176H45381J9001J9718J9873J9876K0263K0774K0591J9406J7777J6325J5054
63165A054039J3527J1410Q652N359J641k531p309j2670j8111k2917k6707k9566
63153I74817l1636l2911l3454l3497l3133l2180l0520k8349k6001k3755k1834
63142F47547k0291j8788j6871j4645j2793j1657j0725r410p890o620n489m163
63130E08205l013k740l090k890j603L8J265K288L482M398M427L923L747L999M080
63115E26516L840L745L906L878L538L322L362L180K593K160K251K383K002J378
63101E68054J034Q42L67k52n21m53m15k83M44J605K263J886J027M90M10M61N84
63084E77543R28J353J486J310J318J901K824L526L829M167M975O079O893P161
$$ y = [845381, 864382, 884100, 903973, 923849, 944112, 964886, 985477, 1004883, 1022660, 1038985, 1054039, 1067566, 1078976, 1087628, 1092987, 1094628, 1092097, 1084788, 1072118, 1054007, 1031090, 1004383, 974817, 943181, 910270, 876816, 843319, 810186, 778006, 747486, 719137, 693136, 669381, 647547, 627256, 608468, 591597, 576952, 564159, 552502, 541777, 532367, 524477, 517857, 512368, 508205, 505192, 502452, 499362, 496472, 494869, 494907, 496172, 498460, 501942, 506340, 510767, 514690, 518437, 522436, 526516, 530356, 534101, 538007, 541885, 545423, 548745, 552107, 555287, 557880, 560040, 562291, 564674, 566676, 568054, 569088, 569930, 570297, 570045, 569524, 569071, 568656, 568373, 568817, 570422, 572685, 574571, 575598, 576088, 576498, 576959, 577543, 578471, 579824, 581310, 582620, 583938, 585839, 588663, 592189, 596018, 600185, 605160, 611239, 618132, 625293]
63070F25293P232P592Q449R811J1544J3163J4014J4098J4392J5894J8548K1557
63058G81587K4474K7451L0570L3576L6396L9321M2608M6259N0236N4397N8206
63047A225081O1049O3055O5048O7442O9607P0637P0444O9727O9122O8680O8088
63036A967980O7185O6329O6161O6805O7371O6665O4336O0798N6071M9388M0263
63025B639352K9213J6938L423j1411k6590m0490n2316o2497p1516p8999q4150
63014B260957q6577q6444q4115q0020p4643o8343o1218n3383m5341l7765l0771
63003A552337k3697j5907p734j95O219J1967J7471K2238K5528K7544K9249L1139
62991A676159L2852L3980L4567L4723L4396L3760L3143L2326L0494K7216K2865
$$ y = [625293, 632525, 640117, 648566, 658377, 669921, 683084, 697098, 711196, 725588, 741482, 760030, 781587, 806061, 833512, 864082, 897658, 934054, 973375, 1015983, 1062242, 1112478, 1166875, 1225081, 1286130, 1349185, 1414233, 1481675, 1551282, 1621919, 1692363, 1762090, 1831212, 1899892, 1967980, 2035165, 2101494, 2167655, 2234460, 2301831, 2368496, 2432832, 2493630, 2549701, 2599089, 2639352, 2668565, 2685503, 2688926, 2677515, 2650925, 2610435, 2558119, 2495622, 2424106, 2345107, 2260957, 2174380, 2087936, 2003821, 1923801, 1849158, 1780815, 1719597, 1666214, 1620873, 1583108, 1552337, 1528640, 1512733, 1504999, 1504804, 1511023, 1522990, 1540461, 1562699, 1588227, 1615771, 1645020, 1676159, 1709011, 1742991, 1777558, 1812281, 1846677, 1880437, 1913580, 1945906, 1976400, 2003616, 2026481]
62980B026481J7715J1291L172o098j5522k4645l3457m1758m9225n5833o1501o5580
62968A705040o7389o7134o5721o3768o1385n8700n5902n2847m9308m5608m2418
62957A074860l9826l7285l4454l1547k8781k6197k4133k3133k3036k2809k1725
62946G61934k0217j9143j8606j8023j7065j5927j4831j3778j2848j2286j2078
62935E87132j1706j0601q924p563p155p200o572m993l522l164l506l336k404j603
62921E04883j459j355p57k68p21j717k117j709j523k201l043l085k517k328k802
62906D77281l159k765k041j825k253k771k968k847k412j542m63J71mn72q35o20
62890D50375l01k22m04p03r54j049j068j180j343j252q27m31l16j51M44J170J391
$$ y = [2026481, 2044196, 2055487, 2058659, 2052561, 2037039, 2012394, 1978937, 1937179, 1887954, 1832121, 1770620, 1705040, 1637651, 1570517, 1504796, 1441028, 1379643, 1320943, 1265041, 1212194, 1162886, 1117278, 1074860, 1035034, 997749, 963295, 931748, 902967, 876770, 852637, 829504, 806468, 783659, 761934, 741717, 722574, 703968, 685945, 668880, 652953, 638122, 624344, 611496, 599210, 587132, 575426, 564825, 555901, 548338, 541183, 533983, 527411, 522418, 518896, 515732, 512226, 508890, 506486, 504883, 503424, 502069, 501312, 501044, 500323, 498606, 496489, 494780, 493257, 491056, 488013, 484928, 482411, 480083, 477281, 474122, 471357, 469316, 467491, 465238, 462467, 459499, 456652, 454240, 452698, 452235, 452406, 452402, 451830, 450995, 450375, 450074, 449852, 449448, 448745, 447791, 446742, 445674, 444494, 443151, 441899, 441072, 440641, 440325, 440174, 440618, 441788, 443179]
62873D43179J084Q56R82J007N10k83q67j087j093r72p01l76j77j81k98l66k93
62856D40924j88k85o32r30q61m51M7M42N87K99k59l85L95J430J454J28j440k031
62838D38244j601r96q09r44r97o71k0N15M34j83o39m00L21J034J644K299K900
62821D40131L216L327L455L423K896K161K091L030M230M801M881N354O480P474
62807D96950P559O956O485O506O755O996P326P864Q655R872J1557J3085J3590
62794F10156J3275J3516J5210J7569J9334K0563K2322K4997K8052L1298L5247
62783H51539M0043M5138N0390N6474O3676P1158P8078Q4655R1432R8121J03947
62772A634651J08589J11905J13204J11649J07238J00462R1261P9113O4172M7458
$$ y = [443179, 444263, 445119, 446101, 447108, 447618, 447335, 446468, 445381, 444288, 443316, 442615, 442239, 442062, 441881, 441583, 441217, 440924, 440736, 440451, 439819, 438889, 438028, 437577, 437624, 438066, 438653, 438952, 438693, 438308, 438703, 440133, 441587, 441715, 440275, 438244, 436643, 435647, 434838, 433894, 432897, 432226, 432206, 432721, 433155, 432972, 432333, 431933, 432254, 433288, 434932, 437231, 440131, 443347, 446674, 450129, 453552, 456448, 458609, 460700, 463730, 467960, 472761, 477642, 482996, 489476, 496950, 504509, 511465, 517950, 524456, 531211, 538207, 545533, 553397, 562052, 571924, 583481, 596566, 610156, 623431, 636947, 652157, 669726, 689060, 709623, 731945, 756942, 784994, 816292, 851539, 891582, 936720, 987110, 1043584, 1107260, 1178418, 1256496, 1341151, 1432583, 1530704, 1634651, 1743240, 1855145, 1968349, 2079998, 2187236, 2287698, 2378959, 2458072, 2522244, 2569702]
62762B569702K9828J1551o924k4567m0528n4763o7518p8598q7519r4088r8459
62751B058117j00839j01430j00453r8007r4161q9285q4159p9400p4913p0169o4923
62740A100378n9435n4072m8954m4036l9395l5274l1900k9268k7122k5140k3078
62729F82704k0778j8144j5283j2557j0367q800p681o792n942m790l004p52J214
62716E69028K286K776L618N264P160Q513R408J0824J3441J6784J9774K2018K4237
62703G15131K7315L1251L5297L9000M2776M7343N2815N8544O3784O8266P2114
62692A253636P5456P8254Q0316Q1194Q0170P6706P1001O3685N4882M3998L0790
62681A990088J6172J486j2746k6662l9836n1070n9678o6240p1624p5737p7853
$$ y = [2569702, 2599530, 2611081, 2604157, 2579590, 2539062, 2484299, 2416781, 2338183, 2250664, 2156576, 2058117, 1957278, 1855848, 1755395, 1657388, 1563227, 1473942, 1389783, 1310383, 1235470, 1165301, 1100378, 1040943, 986871, 937917, 893881, 854486, 819212, 787312, 758044, 730922, 705782, 682704, 661926, 643782, 628499, 615942, 605575, 596775, 589094, 582302, 576360, 571570, 568566, 567814, 569028, 571314, 574090, 577708, 582972, 590132, 598645, 608053, 618877, 632318, 649102, 668876, 690894, 715131, 742446, 773697, 808994, 847994, 890770, 938113, 990928, 1049472, 1113256, 1181522, 1253636, 1329092, 1407346, 1487662, 1568856, 1649026, 1725732, 1796733, 1860418, 1915300, 1959298, 1990088, 2006260, 2007746, 1995000, 1968338, 1928502, 1877432, 1817754, 1751514, 1679890, 1604153, 1526300]
62670A526300p7855p6507p4509p1814o8098o3541n8949n5088n1961m8776m4776
62659H34426m0142l5914l2905l0821k8666k5802k2432j9231j6822j5525j5171
62648E50995j5063j4399j2918j1113r698q903q338p476o243n102m481m230l791
62635D39240k907j851r47j57N23O45k61j887l193l402k697j816j229q70n05p0
62619D18616L62P70J184J604K011K475L107L814M286M407M574N322O622P856Q594
62604D75604R038R638J0557J1782J3477J5822J8681K1714K4806K8081L1574L5207
62592G05981L9034M3194M7441N1078N3541N4860N5288N4635N2259M7792M1553
62581A246656L4160K5973J7168Q155n49q848j6997k4846l1635l6928m1205m4981
$$ y = [1526300, 1448445, 1371938, 1297429, 1225615, 1157517, 1093976, 1035027, 979939, 927978, 879202, 834426, 794284, 758370, 725465, 694644, 665978, 640176, 617744, 598513, 581691, 566166, 550995, 535932, 521533, 508615, 497502, 487804, 478901, 470563, 463087, 456844, 451742, 447261, 443031, 439240, 436333, 434482, 433535, 433378, 433901, 434546, 434285, 432398, 429205, 425803, 423106, 421290, 420061, 419191, 418686, 418616, 418978, 419748, 420932, 422536, 424547, 427022, 430129, 433943, 438229, 442636, 447210, 452532, 459154, 467010, 475604, 484642, 494280, 504837, 516619, 530096, 545918, 564599, 586313, 611119, 639200, 670774, 705981, 745015, 788209, 835650, 886728, 940269, 995129, 1050417, 1105052, 1157311, 1205103, 1246656, 1280816, 1306789, 1323957, 1332112, 1331563, 1322715, 1305718, 1280872, 1249237, 1212309, 1171104, 1126123]
62569A126123m7718m8429m7263m5638m4535m3455m1376l8171l4610l1455k9005
62558F74468k7111k5220k2710j9548j6410j3857j1860j0337r544r403q995p493
62546D91980n291l541k777k681k879l228l404l022k178j299n06K81P38M26l75
62531D62244r09j012j112j080j26J896M063N718P341R397J1243J2062J2383J3583
62517E35691J6186J9503K2832K6175K9635L2939L5805L8329M0726M2988M4948
62506H85757M6415M7164M6945M5509M2495L7542L0858K3510J6558R962K928m579
62494A231064j1296j5992j8696k0179k0698k0018j8314j6228j3876j0597o030
62483A059140q57M021Q550J3190J7806K1615K4213K5895K6752K6136K3492J9279
$$ y = [1126123, 1078405, 1029976, 982713, 937075, 892540, 849085, 807709, 769538, 734928, 703473, 674468, 647357, 622137, 599427, 579879, 563469, 549612, 537752, 527415, 517871, 508468, 499473, 491980, 486689, 483148, 480371, 477690, 474811, 471583, 468179, 465157, 462979, 461680, 461174, 461455, 462193, 462619, 462244, 461335, 460323, 459211, 458131, 458005, 459901, 463964, 469682, 477023, 486420, 497663, 509725, 522108, 535691, 551877, 571380, 594212, 620387, 650022, 682961, 718766, 757095, 797821, 840809, 885757, 932172, 979336, 1026281, 1071790, 1114285, 1151827, 1182685, 1206195, 1222753, 1232715, 1235643, 1231064, 1219768, 1203776, 1185080, 1164901, 1144203, 1124185, 1105871, 1089643, 1075767, 1065170, 1059140, 1058283, 1062304, 1070854, 1084044, 1101850, 1123465, 1147678, 1173573, 1200325, 1226461, 1249953, 1269232]
62471A269232J4485R486L881k636r723j6803k3611l0144l6272m1572m5527m7893
62459A042903m8915m9051m8427m6748m3979m0768l7855l5124l1811k7621k3261
62448F09343j9680j7125j5133j3157j0992q743o624m730k955j184N03J932L060
62435E14515L857M124L645K586J376K14r95k225l219l935m698n712o703p300p507
62420D88023p590p703p873q128q377q320p717o689n588m658l968l530l279l016
62406D01587k608k234k196k444k414j579j85P89O33j61l26P41K319L309L420L069
62390D01720K558K018J833K298K955L031K591K439K809L049K959L433N128P286
62376D46107Q612Q853Q686Q579Q496Q441Q532Q660Q781R291J0500J1915J2846
$$ y = [1269232, 1283717, 1293203, 1297084, 1294448, 1284725, 1267922, 1244311, 1214167, 1177895, 1136323, 1090796, 1042903, 993988, 944937, 896510, 849762, 805783, 765015, 727160, 692036, 660225, 632604, 609343, 589663, 572538, 557405, 544248, 533256, 524513, 517889, 513159, 510204, 509020, 509523, 511455, 514515, 518372, 522496, 526141, 528727, 530103, 530317, 529322, 527097, 523878, 519943, 515245, 509533, 502830, 495530, 488023, 480433, 472730, 464857, 456729, 448352, 440032, 432315, 425626, 420038, 415380, 411412, 407882, 404603, 401587, 398979, 396745, 394549, 392105, 389691, 388112, 387927, 388716, 389349, 389188, 388862, 389603, 391922, 395231, 398651, 401720, 404278, 406296, 408129, 410427, 413382, 416413, 419004, 421443, 424252, 427301, 430260, 433693, 438821, 446107, 454719, 463572, 472258, 480837, 489333, 497774, 506306, 514966, 523747, 533038, 543538, 555453, 568299]
62363E68299J3491J4723J6922J9813K3298K7476L1877L5648L8827M2436M6931
62352H79741N1370N4552N6151N6193N4275N0179M4726L9021L3155K6457J8865
62341A364685J1234M281k033q000j3685j9165k4638k9947l4384l7271l8546l8611
62329A133920l7825l6366l4423l2280l0243k8524k7138k5893k4647k3528k2744
62318H10309k2250k1879k1706k1954k2466k2719k2505k2147k1810k0976j9093
62307E70804j6506j4256j2950j2269j1560j0466q896o841m540k602j602j589k033
62294D64694k181j494j2J568K422K400K125K164K370K330K176K448L186L730L587
62279D91513L126L074L553L946L666K847K173K230L034M138N059N592N876O282
$$ y = [568299, 581790, 596513, 613435, 633248, 656546, 684022, 715899, 751547, 790374, 832810, 879741, 931111, 985663, 1041814, 1098007, 1152282, 1202461, 1247187, 1286208, 1319363, 1345820, 1364685, 1375919, 1380200, 1378167, 1370167, 1356482, 1337317, 1312679, 1282732, 1248348, 1211077, 1172531, 1133920, 1096095, 1059729, 1025306, 993026, 962783, 934259, 907121, 881228, 856581, 833053, 810309, 788059, 766180, 744474, 722520, 700054, 677335, 654830, 632683, 610873, 589897, 570804, 554298, 540042, 527092, 514823, 503263, 492797, 483901, 477060, 472520, 469918, 468316, 466727, 464694, 462513, 461019, 461007, 462575, 464997, 467397, 469522, 471686, 474056, 476386, 478562, 481010, 484196, 487926, 491513, 494639, 497713, 501266, 505212, 508878, 511725, 513898, 516128, 519162, 523300, 528359, 533951, 539827, 546109]
62265E46109P256R064J1500J4035J6376J8858K2031K5961L0195L4394L8652M3074
62253H17505M7425N1457N5221N8650O0969O1077N8621N4318M8938M2344L3976
62242A390501K4185J4546O358p49q259j6814k5390l2622l8406m3601m8463n2160
62230A169126n3958n4142n3418n1912m9352m5939m2371l9053l5784l2341k8945
62219F81911k5941k3360k1038j8919j7003j5167j3352j1849j1023j0705j0161
62208E03393q900p278o097n624n317m552l352k217j441q30q7P84J569K182K819
62193D65052L691M662N292N413N528O404Q164J0030J1206J1716J2141J2766J3406
62180E75471J3876J4130J3980J3242J2227J1579J1454J1345J1025J1104J2245
$$ y = [546109, 553365, 562429, 573929, 587964, 604340, 623198, 645229, 671190, 701385, 735779, 774431, 817505, 864930, 916387, 971608, 1030258, 1091227, 1152304, 1210925, 1265243, 1314181, 1356525, 1390501, 1414686, 1429232, 1435590, 1434841, 1426582, 1409768, 1384378, 1351756, 1313350, 1269749, 1221286, 1169126, 1115168, 1061026, 1007608, 955696, 906344, 860405, 818034, 778981, 743197, 710856, 681911, 655970, 632610, 611572, 592653, 575650, 560483, 547131, 535282, 524259, 513554, 503393, 494493, 487215, 481118, 475494, 470177, 465625, 462273, 460056, 458615, 457785, 457698, 458482, 460051, 462233, 465052, 468743, 473405, 478697, 484110, 489638, 496042, 504206, 514236, 525442, 537158, 549299, 562065, 575471, 589347, 603477, 617457, 630699, 642926, 654505, 665959, 677304, 688329, 699433, 711678]
62169G11678J4296J6660J9218K2241K5600K8825L1894L5347L9265M2716M4559
62158A032299M4469M2813L9834L5440K9768K3499J7376J1606N921M7n983j1938
62146A265151j7584k2692k7063l0731l3943l6748l8636l8915l7439l4781l1551
62135I15068k7909k3860j9769j6209j3475j1474r964q651p180n379l473j806l77
62122G65542J051K471L687M869O550Q845J0973J1922J1365R700P427M884K423
62109H51709M52q54j600j917j907j902k385l542n011o354p454q231q249p125n223
62094G90407l518k510j759n98R97K554L787M736N416N760N855N948O209O728P571
62079H37583Q613R446R893J0433J1710J3641J5514J6931J8104J9131J9711J9763
$$ y = [711678, 725974, 742634, 761852, 784093, 809693, 838518, 870412, 905759, 945024, 987740, 1032299, 1076768, 1119581, 1159415, 1194855, 1224623, 1248122, 1265498, 1277104, 1283025, 1283072, 1277089, 1265151, 1247567, 1224875, 1197812, 1167081, 1133138, 1096390, 1057754, 1018839, 981400, 946619, 915068, 887159, 863299, 843530, 827321, 813846, 802372, 792408, 783757, 776577, 771198, 767725, 765919, 765542, 766593, 769064, 772751, 777620, 784170, 793015, 803988, 815910, 827275, 836975, 844402, 849286, 851709, 852161, 851307, 849707, 847790, 845883, 843981, 841596, 838054, 833043, 826689, 819235, 811004, 802755, 795630, 790407, 786889, 784379, 782620, 782022, 783019, 785573, 789360, 794096, 799512, 805272, 811127, 817075, 823284, 830012, 837583, 846196, 855642, 865535, 875968, 887678, 901319, 916833, 933764, 951868, 970999, 990710, 1010473]
62067A010473J9785K0204K0812K1266K1766K2726K4179K5874K7626K9082K9451
62056A273244K8068K5154K1544J7797J3961J0040O078J925k595p296j1892j6582
62044A359446k1782k7259l2136l5858l8631m0738m2054m2541m2574m2360m1481
62033I52032l9539l6871l4182l1607k8793k5757k3085k1145j9594j7891j5996
62022F57572j4301j3063j2183j1465j0864j0371r876r245q484p672o802n827m871
62009E32548m201l870l549k883j898r27j08Q11K134L691M807M912M249L813M273
61994E43802N052M876L287J157m41j368k058k651l091l740n065o807q177q936
61980E15840r565j0284j0616j0139r145q118p186o354n865n823n890n688n254
$$ y = [1010473, 1030258, 1050462, 1071274, 1092540, 1114306, 1137032, 1161211, 1187085, 1214711, 1243793, 1273244, 1301312, 1326466, 1348010, 1365807, 1379768, 1389808, 1395886, 1397811, 1395216, 1387920, 1376028, 1359446, 1337664, 1310405, 1278269, 1242411, 1203780, 1163042, 1120988, 1078447, 1035873, 993513, 952032, 912493, 875622, 841440, 809833, 781040, 755283, 732198, 711053, 691459, 673568, 657572, 643271, 630208, 618025, 606560, 595696, 585325, 575449, 566204, 557720, 550048, 543246, 537419, 532548, 528347, 524477, 520928, 518045, 516147, 515220, 515112, 515923, 518057, 521748, 526555, 531467, 535716, 539529, 543802, 548854, 553730, 557017, 558174, 557733, 556365, 554307, 551656, 548565, 544825, 539760, 532953, 524776, 515840, 506275, 495991, 485375, 475236, 466091, 457973, 450787, 444433, 438568, 432745, 426855, 421167, 415913]
61967D15913m722l949k910k085j964k344k591k488k278k027j506p20p6J54J51
61952C86558K10M09P16J153J703K263K789L316L836M392N283O862R006J1096J2671
61937D52263J3784J4629J5155J5393J5830J6837J7931J8090J7023J5599J4715
61926F27249J4211J3306J1730R867P829N195J914j137l031l850m360m821m778
61913F69324l996k959k153j328J33K383M939P183Q783R744J0296J0621J0584R850
61899G33404Q421O846N583M317K276p80m186p004q780r577r616r155q554q140
61885F95055p914p635p243p068p376p843p827p269o927p464q549r211q993q268
61871E85468p547o961o504o232n983n366m272l114k179j265k49N20R95K084M621
$$ y = [415913, 411191, 407242, 404332, 402247, 400283, 397939, 395348, 392860, 390582, 388555, 387049, 386329, 386253, 386407, 386558, 386768, 387177, 387893, 389046, 390749, 393012, 395801, 399117, 402953, 407345, 412628, 419490, 428496, 439592, 452263, 466047, 480676, 495831, 511224, 527054, 543891, 561822, 579912, 596935, 612534, 627249, 641460, 654766, 666496, 676363, 684192, 689387, 691301, 690164, 687133, 683283, 678923, 674102, 669324, 665328, 662369, 660216, 658888, 659021, 661404, 666343, 673526, 682309, 692053, 702349, 712970, 723554, 733404, 741825, 748671, 754254, 758571, 760847, 760067, 755881, 748877, 740097, 730520, 720904, 711749, 703195, 695055, 687141, 679506, 672263, 665195, 657819, 649976, 642149, 634880, 627953, 620489, 611940, 602729, 593736, 585468, 577921, 570960, 564456, 558224, 552241, 546875, 542603, 539489, 537310, 536045, 535796, 536316, 537311, 539395, 544016]
61856E44016P914J0204J0740J0542J0932J2161J3834J5835J8123K0181K1483K2263
61844G18228K3056K3667K3300K1656J9277J6755J4158J1331Q195M643P48k860
61832H82154n441p122q699j0192j0447q720n814k864K46M063P749R639R517Q910
61818H62979Q721P992N682K328j037m577q922j3502j6986j9074k0542k1733k2296
61805G59033k2402k2769k3212k2521k0296j7775j6172j5209j4036j2650j1470
61794E60521j0306q812p402o656o173n096l539k396j874j330n59j78m16o26l58
61779E04800n5j32j50L98J082J061K69n57p99l46O61J858K544K233J311P08Q33
61762E15719J259J575K024L037M384N252N123M373L876M050M412M149L052J731
$$ y = [544016, 551930, 562134, 572874, 583416, 594348, 606509, 620343, 636178, 654301, 674482, 695965, 718228, 741284, 764951, 788251, 809907, 829184, 845939, 860097, 871428, 879623, 884266, 885014, 882154, 876713, 869591, 860892, 850700, 840253, 831533, 825719, 822855, 823101, 827164, 834913, 844552, 854069, 862979, 871700, 879692, 885374, 887702, 886665, 882088, 873166, 859664, 842678, 823604, 803062, 781329, 759033, 736631, 713862, 690650, 668129, 647833, 630058, 613886, 598677, 584641, 571991, 560521, 550215, 541403, 534001, 527345, 521172, 516076, 512537, 510141, 508267, 506937, 506378, 506200, 505784, 505158, 504800, 504745, 504613, 504463, 504861, 505943, 507004, 507273, 506716, 505917, 505571, 506232, 508090, 510634, 512867, 514178, 514886, 515719, 516978, 518553, 520577, 523614, 527998, 533250, 538373, 542746, 546622, 550672, 555084, 559233, 562285, 564016]
61748E64016Q25K70n02j794l313m524n089m979m490m143m333m933n395n382n100
61733E11134m869m560l738k390j118m69k39K22J143K055K485K449K123J400L39
61718E05967k41O22K638M224M221L184K409K161J628L95r04j556j662j756k081
61703E19249k595l275l959m220l826l156k757k734k874l164l659l997l680k841
61689D72512k226k303k820l339l711l806l316k258j269r58j150j209r15n70l55
61674D42307j20J17L2m71r42r78q08r94j594k034j800j035k88N2k9l52o88p34
61656D29641k97L82P43N55K56L84P65P30J50k00L89J617K528K667K450K431K657
61639D47848K846K868K807K632K102J050k61j222j363q42l67o06j619k844l571
$$ y = [564016, 564841, 565111, 564609, 562815, 559502, 554978, 549889, 544910, 540420, 536277, 531944, 527011, 521616, 516234, 511134, 506265, 501705, 497967, 495577, 494459, 493990, 493751, 493973, 495116, 497171, 499656, 502105, 504228, 505628, 505967, 505726, 506348, 508986, 513210, 517431, 520615, 523024, 525185, 526813, 527208, 526304, 524748, 523086, 521330, 519249, 516654, 513379, 509420, 505200, 501374, 498218, 495461, 492727, 489853, 486689, 483030, 479033, 475353, 472512, 470286, 467983, 465163, 461824, 458113, 454307, 450991, 448733, 447464, 446506, 445356, 444147, 443232, 442662, 442307, 442187, 442304, 442336, 441865, 440923, 439945, 439137, 438143, 436549, 434515, 432715, 431680, 431392, 431444, 431415, 431063, 430375, 429641, 429344, 429726, 430469, 431024, 431280, 431664, 432429, 433159, 433309, 433109, 433498, 435115, 437643, 440310, 442760, 445191, 447848, 450694, 453562, 456369, 459001, 461103, 462153, 461892, 460670, 459307, 458465, 458098, 457492, 455873, 453029, 449458]
61624D49458l464k822k281k147k055j513p20m19q38j264r71k18J06m11j356k097
61608D26988k384k434k765l740n028n734n467m969n092n459m971l605k692l136
61594C69512m176m439l645k634k145k217k588l065l447l533l295k891k496k226
61580C26715k104k043j940j860j972k209k300k168k000j835j388n79J66L37j24
61565C04696q37j273r90k4Q51Q12J51M6Q49J425P89l12m61L72R83Q89Q60J448
61547C10274K135K325K155J873J266K81m84n88m54n76n47L55J847K791K663K125
61531C27441J979K100J770P10n95j473j693j467j059o03l21o00j552k573k797
61516C19267k098j272j041j193j057m79Q6K90J96j46q18j605j835j097J21Q50
$$ y = [449458, 445994, 443172, 440891, 438744, 436689, 435176, 434456, 434037, 433199, 431935, 430964, 430746, 430852, 430441, 429085, 426988, 424604, 422170, 419405, 415665, 410637, 404903, 399436, 394467, 389375, 383916, 378945, 375340, 372648, 369512, 365336, 360897, 357252, 354618, 352473, 350256, 347668, 344603, 341156, 337623, 334328, 331437, 328941, 326715, 324611, 322568, 320628, 318768, 316796, 314587, 312287, 310119, 308119, 306284, 304896, 304317, 304483, 304820, 304696, 303859, 302586, 301596, 301572, 302423, 303235, 303386, 303432, 304281, 305706, 306495, 306183, 305722, 306094, 307077, 307966, 308826, 310274, 312409, 314734, 316889, 318762, 320028, 320309, 319825, 319237, 318783, 318207, 317660, 318015, 319862, 322653, 325316, 327441, 329420, 331520, 333290, 334000, 333405, 331932, 330239, 328772, 327713, 327110, 326789, 326189, 324637, 322064, 319267, 317169, 315897, 314856, 313663, 312606, 312127, 312213, 312503, 312699, 312553, 311735, 310130, 308295, 307198, 307319, 308169]
61500C08169O35j11o43n57L3O69Q94O32L52O29J376J788J248J21o53o55k40K09
61482C13896P45J372J594J001Ln08j68N91J207J450J254O42K9P0Q39J484J144
61465C26645K0r11j086q13n90m57k51j09l72j074j786j956j315r0J097J606J276
61448C19834N75R8l2j22k98k37L79J369K183K452K216J746J339J240J516J976
61432C36234K383K692K931K936K487J723J092Q55Q65R60J172J401J281P04J96
61417C59912L69J114J724J823J758J984K378K372J652N17m09q02r44j308j948
61402C70192k437k431k036j509r66o00q37j725k521k409j589j018j059j093o33
61387C47329q4R8L30J226K345K587J837J317J863K674K470J416R93J933L227L491
$$ y = [308169, 308804, 308693, 308050, 307493, 307526, 308195, 309089, 309721, 310073, 310702, 312078, 313866, 315114, 315235, 314582, 313927, 313687, 313896, 314641, 316013, 317607, 318608, 318611, 318103, 317935, 318526, 319733, 321183, 322437, 323079, 323108, 323178, 324017, 325501, 326645, 326665, 325754, 324668, 323855, 323265, 322808, 322557, 322448, 322076, 321002, 319216, 317260, 315945, 315855, 316952, 318558, 319834, 320409, 320507, 320475, 320353, 320055, 319818, 320197, 321566, 323749, 326201, 328417, 330163, 331502, 332742, 334258, 336234, 338617, 341309, 344240, 347176, 349663, 351386, 352478, 353333, 354198, 355158, 356330, 357731, 359012, 359716, 359912, 360281, 361395, 363119, 364942, 366700, 368684, 371062, 373434, 375086, 375603, 375194, 374392, 373448, 372140, 370192, 367755, 365324, 363288, 361779, 360813, 360213, 359376, 357651, 355130, 352721, 351132, 350114, 349055, 347962, 347329, 347245, 347343, 347673, 348899, 351244, 353831, 355668, 356985, 358848, 361522, 363992, 365408, 366401, 368334, 371561, 375052]
61371C75052K665J789J519J667J926K276K587K530K139J878J904J776J269Q83
61357D01860J108J647J984K257K815L340L341L354M509O692Q176P659N920M728
61343D59390M674M866M463L631L019K918L177L434L295K559J531Q25O98P63N05
61328D99748j06p21j155j504j822k002k054k174k341k154j341k81M65R77J816
61313D85351L043M071M696N571P098Q485Q730Q217Q373R814J1687J2982J3587
61300E91705J3676J2923J0976Q228N458K988O91j395l010m083m771n149n257n332
61286F17648n670o244o757o985o859o405n809n374n046m269k661p45N79J127J503
61271E58033K127K777L213L598M020M123L637K886K405K292K367K780L875N538
$$ y = [375052, 377717, 379506, 381025, 382692, 384618, 386894, 389481, 392011, 394150, 396028, 397932, 399708, 400977, 401860, 402968, 404615, 406599, 408856, 411671, 415011, 418352, 421706, 426215, 432907, 441083, 448742, 454662, 459390, 464064, 468930, 473393, 477024, 480043, 482961, 486138, 489572, 492867, 495426, 496957, 497782, 498480, 499243, 499748, 499642, 498921, 497766, 496262, 494440, 492438, 490384, 488210, 485869, 483715, 482374, 482093, 482558, 483535, 485351, 488394, 492465, 497161, 502732, 509830, 518315, 527045, 535262, 543635, 553449, 565136, 578118, 591705, 605381, 618304, 629280, 637508, 642966, 645954, 646645, 645250, 642240, 638157, 633386, 628237, 622980, 617648, 611978, 605734, 598977, 591992, 585133, 578728, 572919, 567545, 562499, 558230, 555569, 554824, 555403, 556530, 558033, 560160, 562937, 566150, 569748, 573768, 577891, 581528, 584414, 586819, 589111, 591478, 594258, 598133, 603671]
61257F03671P117Q055Q280P858O760N107L413K153J280M10n46j265j544j669k035
61242F47045k626l034l061k991l191l609l849l713l453l377l404l166k498j571
61228F03502n53N44J590K187K174J992K223K843L380L786M549N799O870P186P106
61213F55178P319P708P514O550N518M995M696M041K940J740Q13N36J287L022N140
61198G18997P075Q833J0537J1855J2489J2934J4044J5739J6874J6526J4894J2687
61186H73484J0278P890N995M910M224L270J949O09o83k119l524m477n131o168
61172H90507p682q784q765q090p777q193q987r768j0319j0460j0337j0563j1462
61159G69320j2383j2498j2031j1885j2126j1821j0532q976p799o609m864k953
$$ y = [603671, 610788, 618843, 627123, 634981, 641741, 646848, 650261, 652414, 653694, 654104, 653558, 652293, 650749, 649080, 647045, 644419, 641385, 638324, 635333, 632142, 628533, 624684, 620971, 617518, 614141, 610737, 607571, 605073, 603502, 602949, 603493, 605083, 607270, 609444, 611436, 613659, 616502, 619882, 623668, 628217, 634016, 640886, 648072, 655178, 662497, 670205, 677719, 684269, 689787, 694782, 699478, 703519, 706459, 708199, 709012, 709548, 710835, 713857, 718997, 726072, 734905, 745442, 757297, 769786, 782720, 796764, 812503, 829377, 845903, 860797, 873484, 883762, 891652, 897647, 902557, 906781, 910051, 912000, 912609, 911926, 909807, 906283, 901806, 896675, 890507, 882825, 874041, 865276, 857186, 849409, 841216, 832229, 822461, 812142, 801682, 791345, 780782, 769320, 756937, 744439, 732408, 720523, 708397, 696576, 686044, 677068, 669269, 662660, 657796, 654843]
61147F54843j718j338j490k154l502n177o513p378q146q824q910q212p245o518
61133E77718n855m731l040j281j3O89J223J947K830L739M930O826R315J1734J3727
61118F19758J5603J7553J9102J9814K0138K0871K2182K3639K4974K6120K6790
61107H56544K6698K6110K5473K4620K3026K0777J8534J6424J3773J0170O105K282
61095A070536j183m558p955j1274j4279j6583j7902j8564j9353k0648k2012k2820
61083H93405k2863k2254k1124j9725j8504j7730j7181j6428j5281j3919j2693
61072F95703j1773j0930r699p970o267n163m614m155l533k805k000j102k27N87
61058F26052J544K592L174L086L202M495O628Q405R444J0362J1417J2200J2859
$$ y = [654843, 653125, 651787, 650297, 648143, 644641, 639464, 632951, 625573, 617427, 608603, 599693, 591481, 584236, 577718, 571863, 567132, 564092, 562811, 562798, 563487, 564710, 566657, 569487, 573226, 578156, 584982, 594297, 606031, 619758, 635361, 652914, 672016, 691830, 711968, 732839, 755021, 778660, 803634, 829754, 856544, 883242, 909352, 934825, 959445, 982471, 1003248, 1021782, 1038206, 1051979, 1062149, 1068254, 1070536, 1069353, 1064795, 1056840, 1045566, 1031287, 1014704, 996802, 978238, 958885, 938237, 916225, 893405, 870542, 848288, 827164, 807439, 788935, 771205, 754024, 737596, 722315, 708396, 695703, 683930, 673000, 663301, 655331, 649064, 643901, 639287, 635132, 631599, 628794, 626794, 625692, 625465, 626052, 627596, 630188, 633362, 636448, 639650, 644145, 650773, 659178, 668622, 678984, 690401, 702601, 715460]
61045G15460J4330J6809J9083K0087K0280K0859K2257K4043K5723K7033K7873
61034I53837K8580K9852L1948L4286L6199L7736L9314M1005M2542M3706M4471
61023A363476M4998M5612M6578M8008N0239N3988N9537O6154P3057Q0503Q8950
61012B021100R7856J06836J17560J32658J53188J79355K13676K60544L22237L98320
61002D003330M89805O00610P34338Q95140J093950J343659J633889J908767K082092
60993A4785580K086583J911732J597401J203152P94318M47859K41753K11382L10777
60984B3590537M27930M49742L19364M2702l39978p74826j196665j536770j748179
60975A9233857j826054j799868j707272j576963j428772j277451j131605r93496
$$ y = [715460, 729790, 746599, 765682, 785769, 806049, 826908, 849165, 873208, 898931, 925964, 953837, 982417, 1012269, 1044217, 1078503, 1114702, 1152438, 1191752, 1232757, 1275299, 1319005, 1363476, 1408474, 1454086, 1500664, 1548672, 1598911, 1652899, 1712436, 1778590, 1851647, 1932150, 2021100, 2118956, 2225792, 2343352, 2476010, 2629198, 2808553, 3022229, 3282773, 3605010, 4003330, 4493135, 5093745, 5828083, 6723223, 7817173, 9160832, 10794721, 12703488, 14785580, 16872163, 18783895, 20381296, 21584448, 22378766, 22826625, 23068378, 23279760, 23590537, 24018467, 24468209, 24787573, 24830275, 24490297, 23715471, 22518806, 20982036, 19233857, 17407803, 15607935, 13900663, 12323700, 10894928, 9617477, 8485872, 7492376]
60967G492376q63775p44976o39523n47285m67180l99245l43446k97975k60371
60958B928600k29176k03316j81121j61287j43710j28363j14279j00785q8620p8746
60948A499197p0914o4416n9311n5741n2831m9499m5874m2802m0423l8179l5808
60937I43399l3391l0761k7799k5101k3452k2802k2357k1560k0408j9013j7393
60926F79362j5654j3988j2534j1385j0514r596q368p200o730o790o448n335m219
60913E60601l838l934l888l643l421l188k957l013l321l238k442j602j525k107
60899E18484k688k951k910k480j672r17o64q88j307j672j618q15L11O83j20j224
60883D97552j638j449j295j303j256j240j340j180m67L61P24P91J109J709K193
$$ y = [7492376, 6628601, 5883625, 5244102, 4696817, 4229637, 3830392, 3486946, 3188971, 2928600, 2699424, 2496108, 2314987, 2153700, 2009990, 1881627, 1767348, 1666563, 1577943, 1499197, 1428283, 1363867, 1304556, 1248815, 1195984, 1146485, 1100611, 1057809, 1017386, 979207, 943399, 910008, 879247, 851448, 826347, 802895, 780093, 757736, 736176, 715768, 696755, 679362, 663708, 649720, 637186, 625801, 615287, 605691, 597323, 590123, 583393, 576603, 570155, 564820, 560601, 556763, 552829, 548941, 545298, 541877, 538689, 535732, 532719, 529398, 526160, 523718, 522116, 520591, 518484, 515796, 512845, 509935, 507455, 505783, 504866, 504202, 503314, 502007, 500335, 498717, 497902, 498213, 498896, 498776, 497552, 495914, 494465, 493170, 491867, 490611, 489371, 488031, 486851, 486384, 486745, 487469, 488260, 489369, 491078, 493271]
60868D93271K460K743L176L829M781N767O174N944N941O784P868Q200P791P443
60854E72172P556P934Q366Q669Q416P459O477O281O755P137P046O665O114N411
60840F72458M792M472M231L834L495L391L148K510K088K608L741M626N215O182
60826G26791P651Q924R525R643R557R331R085Q930Q648Q004P182O350N091L095
60812H37807J078L4k25p77j978l150l989n076o763q516r773j0662j1402j1712
60798G64896j1320j0554j0035j0082j0598j1198j1342j0784r909r250q803q245
60786F42776p696p586p829p855p499p145o959o708o411o464o905p236p140o798
60772E42545o400n887n317m823m238l370k674k906l936m776m895m792m996n313
$$ y = [493271, 495731, 498474, 501650, 505479, 510260, 516027, 522201, 528145, 534086, 540870, 548738, 556938, 564729, 572172, 579728, 587662, 596028, 604697, 613113, 620572, 627049, 633330, 640085, 647222, 654268, 660933, 667047, 672458, 677250, 681722, 685953, 689787, 693282, 696673, 699821, 702331, 704419, 707027, 710768, 715394, 720609, 726791, 734442, 743366, 752891, 762534, 772091, 781422, 790507, 799437, 808085, 816089, 823271, 829621, 834712, 837807, 838885, 838919, 838694, 837917, 835939, 832789, 828800, 823724, 816961, 808445, 798672, 788010, 776608, 764896, 753576, 743022, 732987, 722905, 712307, 701109, 689767, 678983, 669074, 659824, 651021, 642776, 635080, 627494, 619665, 611810, 604311, 597166, 590207, 583499, 577088, 570624, 563719, 556483, 549343, 542545, 536145, 530258, 524941, 520118, 515880, 512510, 509836, 506930, 502994, 498218, 493323, 488531, 483535, 478222]
60758D78222n358n106m673m174l977m377m815m321l010k144k333k646k096j041
60744D28151m13l87o10j007j512j613j150r52j791l095l698l434l031k707k021
60729D00730j003l56l24l52p3J59L4k06l59o82j288j712j577j265j383j891k291
60712C86161k486k870l537l972l664k782k014j873k263k659k594k092j669j843
60698C49843k535l062k786j762o02J20K23j91q60j395j440r81k96M05J088J585
60682C37354J573J030M54L75Q63J641K432K996L144K981K891L032L138L066L120
60667C70090L486L749L411K604J770R72R7n37m41L00J102J640J990K216K340K534
60651C97323K806K738K185J923K774M193M770M101L147K576J862M42j203k277
$$ y = [478222, 472864, 467758, 463085, 458911, 454934, 450557, 445742, 441421, 438411, 436267, 433934, 431288, 429192, 428151, 427738, 427351, 426741, 425734, 424222, 422609, 421459, 420507, 418716, 415621, 411923, 408489, 405458, 402751, 400730, 399727, 399371, 399047, 398695, 398622, 398781, 398815, 398609, 398250, 397568, 396280, 394568, 392991, 391726, 390343, 388452, 386161, 383675, 380805, 377268, 373296, 369632, 366850, 364836, 362963, 360700, 358041, 355447, 353355, 351686, 349843, 347308, 344246, 341460, 339698, 339096, 339216, 339439, 339248, 338388, 336993, 335553, 334572, 334276, 334681, 335769, 337354, 338927, 339957, 340411, 340786, 341649, 343290, 345722, 348718, 351862, 354843, 357734, 360766, 363904, 366970, 370090, 373576, 377325, 380736, 383340, 385110, 386082, 386179, 385642, 385201, 385501, 386603, 388243, 390233, 392449, 394789, 397323, 400129, 402867, 405052, 406975, 409749, 413942, 418712, 422813, 425960, 428536, 430398, 430840, 429637, 427360]
60637D27360k770l183l696m207m724n154n086m303l210k356j894j814k225k869
60623C79869k869j669J0P94J93r50j572j453j094r26q89p03l77l14q33j628j982
60606C63607j499n16K48L64M2q2L56R15Q37J83j2Q40J904K039J409J023J043P31
60588C73432kl24R8N68O86R88J722K099J549P36N17O38M31J48N70J686K745L352
60570C91639L771M267M866N638O666P827Q992J0139J1044J1206J0515R519Q581
60557D94670P300N256K782M14j834l939n229n159m256l403k576j189O12K060K983
60542D88492L951N268O710Q185R755J1132J1997J2753J3953J5100J5031J3557
60530F15884J1611R551O646K684j099l458m625n514o222o298n944n878o136n966
$$ y = [427360, 424590, 421407, 417711, 413504, 408780, 403626, 398540, 394237, 391027, 388671, 386777, 384963, 382738, 379869, 377000, 375331, 375341, 376135, 376328, 375378, 373806, 372353, 371259, 370333, 369444, 368741, 368364, 368050, 367217, 365589, 363607, 362108, 361592, 361840, 362204, 362246, 362164, 362520, 363435, 364272, 364455, 364443, 365283, 367187, 369226, 370635, 371658, 372701, 373432, 373430, 373106, 373204, 373772, 374458, 375446, 377168, 379267, 380816, 381552, 382069, 382707, 383138, 383286, 383856, 385542, 388287, 391639, 395410, 399677, 404543, 410181, 416847, 424674, 433666, 443805, 454849, 466055, 476570, 486089, 494670, 501970, 507226, 510008, 510422, 508588, 504649, 499420, 494261, 490005, 486602, 484026, 482837, 483449, 485509, 488492, 492443, 497711, 504421, 512606, 522361, 533493, 545490, 558243, 572196, 587296, 602327, 615884, 627495, 637046, 643692, 646376, 645277, 641819, 637194, 631680, 625458, 619160, 613216, 607338, 601202, 595236]
60516E95236m997l783l008k671k350j879j431j071n77L17J594K995M309N575O957
60501E95216Q589J0559J2982J5923J9303K2928K6570L0011L3177L6209L9187M1676
60489H92330M2888M2391M0325L6802L1588K4744J7001R004N71q645j8039k6341
60477A084619l2865l7724m1017m2600m2701m1966m0653l8468l5468l2410k9851
60466F68896k7465k4685k1577j8677j6355j4650j3357j2024j0244q311p158p180
60454D87213p583p345o493n796n490n070m301l716l837m410m678m224l248k270
60440D18752j707j602j632j449j069q31r99j485k001k254j964j064J2N03Q4o76
60424D00618r69p03m45m82n01k27J13K70M18P28R71J003J299K282L350L398K289
$$ y = [595236, 590239, 586456, 583448, 580777, 578427, 576548, 575117, 574046, 573469, 573786, 575380, 578375, 582684, 588259, 595216, 603805, 614364, 627346, 643269, 662572, 685500, 712070, 742081, 775258, 811467, 850654, 892330, 935218, 977609, 1017934, 1054736, 1086324, 1111068, 1128069, 1137073, 1137644, 1128999, 1110960, 1084619, 1051754, 1014030, 973013, 930413, 887712, 845746, 805093, 766625, 731157, 698747, 668896, 641431, 616746, 595169, 576492, 560137, 545487, 532130, 520106, 509862, 501551, 494393, 487213, 479630, 472285, 465792, 459996, 454506, 449436, 445135, 441419, 437582, 433172, 428494, 424270, 421022, 418752, 417045, 415443, 413811, 412362, 411293, 410462, 409463, 407978, 405977, 403723, 401759, 400695, 400707, 401210, 401294, 400618, 399649, 398946, 398501, 398019, 397518, 397291, 397404, 397674, 398092, 398820, 399791, 400794, 402093, 404375, 407725, 411123, 413412]
60407D13412J062O15Q12J148J436J580J339Q50P13J054J144N72J70R24K414L312
60391D32557L188K851K896K899K340J565J339J881K696L094K723J781R04N98P85
60376D64097J074J300J501J543J252R29J078J592J748J221N83M52O30N14M8j86
60360D79376K09R30J359J241Q61O09N31N09P33J600K999M150M509M523M946N702
60344E14787O065N804N364M939M112K719J316M27j54q74j731k512l300m199m888
60329E27875m965m579m196l880l402k898k842l236l403k873k081j788k106k422
60315D83204k205j456m16P10J594J821J463J325K117L503M582N338O847R760J3152
60300E31339J5535J6560J6963J7080J6260J3917J0378O446K536j341n092q372
$$ y = [413412, 414474, 415089, 415901, 417049, 418485, 420065, 421404, 422254, 422967, 424021, 425165, 425737, 425907, 426831, 429245, 432557, 435745, 438596, 441492, 444391, 446731, 448296, 449635, 451516, 454212, 457306, 460029, 461810, 462714, 463312, 464097, 465171, 466471, 467972, 469515, 470767, 471696, 472774, 474366, 476114, 477335, 477918, 478370, 479000, 479514, 479562, 479376, 479585, 480515, 481874, 483115, 483976, 484585, 485116, 485625, 486358, 487958, 490957, 495107, 499616, 504139, 509085, 514787, 520852, 526656, 532020, 536959, 541071, 543790, 545106, 545533, 545379, 544505, 542774, 540262, 536962, 532763, 527875, 522910, 518331, 514135, 510255, 506853, 503955, 501113, 497877, 494474, 491601, 489520, 487732, 485626, 483204, 480999, 479543, 479127, 479837, 481431, 483252, 484715, 486040, 488157, 491660, 496242, 501580, 508427, 518187, 531339, 546874, 563434, 580397, 597477, 613737, 627654, 638032, 644478, 647014, 645673, 640581, 632209]
60288F32209j0746j1849j1679j0824j0149r951r692q749p296o148n870o216o423
60275E16617n941m948m213m328n035n522n390n065n077n299n244m805m283l748
60261D47719k945j921j271j390j859j943j563j248j202r60j69P58J153R28M76
60246D34563m9p63j460j605j071l85l8N1J80M42Q50J533K392K928K763K139J619
60229D44089J534J946K757L543L700L215K912L408M118M005L076K451K874L861
60215D87489M476M436M185M223M641N124N339N409N848O846P804Q001P561P259
60201E68641P437P621P306O580N790M991M077L155K498K198K038J761J304Q34
60187F26231M33j61j299k809l932m117l701l497l891m559m980m863m256l528l115
$$ y = [632209, 621463, 609614, 597935, 587111, 576962, 567011, 557319, 548570, 541274, 535126, 529256, 523040, 516617, 510676, 505728, 501515, 497187, 492152, 486630, 481240, 476175, 471098, 465799, 460555, 455750, 451467, 447719, 444774, 442853, 441582, 440192, 438333, 436390, 434827, 433579, 432377, 431417, 431248, 432006, 433159, 434087, 434563, 434514, 433751, 432291, 430686, 429615, 429230, 429192, 429243, 429423, 429865, 430715, 432248, 434640, 437568, 440331, 442470, 444089, 445623, 447569, 450326, 453869, 457569, 460784, 463696, 467104, 471222, 475227, 478303, 480754, 483628, 487489, 491965, 496401, 500586, 504809, 509450, 514574, 519913, 525322, 531170, 538016, 545820, 553821, 561382, 568641, 576078, 583699, 591005, 597585, 603375, 608366, 612443, 615598, 618096, 620294, 622332, 624093, 625397, 626231, 626664, 626503, 625204, 622395, 618463, 614346, 610645, 607148, 603257, 598698, 593718, 588855, 584599, 581071, 577956]
60172E77956l113l168k944k461j912j443j353j927k795l028k371j772k053k617
60158E44999k356j414r97j597k392k415j518j47J071J529J240J157K112L450L720
60143E46442K685J659J648K285K895L533M355M908M824M515M531M737M702M442
60129E98161M189L916L585L466L618L451K435J007K17N05J265J610J290Q30Q17
60114F30362J159J240Q81P43J307J940J752J052R35J420J243k21j905k559k397
60099F36952k498l180l737l496k549j617j466k159k821k589j755j243r98j3J751
60084F08582K703J727m2o07L95J577J782J088R1q59j626k136k496k924l551m358
60068E99346n151n575n567n703o539p546p606o695o102o526p030o530n346m412
$$ y = [577956, 574843, 571675, 568731, 566270, 564358, 562915, 561562, 559635, 556840, 553812, 551441, 549669, 547616, 544999, 542643, 541229, 540232, 538635, 536243, 533828, 532310, 532163, 533234, 534763, 536003, 537160, 539272, 542722, 546442, 549127, 550786, 552434, 554719, 557614, 561147, 565502, 570410, 575234, 579749, 584280, 589017, 593719, 598161, 602350, 606266, 609851, 613317, 616935, 620386, 622821, 623828, 624045, 624550, 625815, 627425, 628715, 629545, 630362, 631521, 632761, 633642, 634385, 635692, 637632, 639384, 640436, 641371, 642791, 644034, 643813, 641908, 639349, 636952, 634454, 631274, 627537, 624041, 621492, 619875, 618409, 616250, 613429, 610840, 609085, 607842, 606844, 606831, 608582, 611285, 613012, 612970, 612363, 612758, 614335, 616117, 617205, 617296, 616437, 614811, 612675, 610179, 607255, 603704, 599346, 594195, 588620, 583053, 577350, 570811, 563265, 555659, 548964, 542862, 536336, 529306, 522776, 517430, 513018]
60054E13018l886l429l127l046k593j354p4L15J70N55J663K868L962N134O051
60039E16227O189N940O188O789O664N460L991K928K066J115K89k87r29j885l022
60024E57723m169n207n882o135o516p451q321q170p338p165p901q117o697m415
60010D64239k835k423k423k075j259k63M92P13N35M43O45Q71Q96Q99J062J169
59994D60686R53N66M81J000J995L022L664L904M080M289M153L455K721K650L111
59979E00730L387L228K996K768K100Q94k26p40r13j219j555j428o96K65J014J404
59963E12009J552J583J427J005N97P71J685K708L045K555J651P17J9j73J37M37
59947E31725L04o2l53p97j617k277k190j882k364l420l670k596j408j440k458
$$ y = [513018, 509132, 505703, 502576, 499530, 496937, 495583, 495509, 495824, 495994, 496549, 498212, 501080, 505042, 510176, 516227, 522416, 528356, 534544, 541333, 547997, 553457, 557448, 560376, 562442, 563557, 563846, 563559, 562630, 560745, 557723, 553554, 548347, 542465, 536330, 529814, 522363, 514042, 505872, 498534, 491369, 483468, 475351, 468654, 464239, 461404, 458981, 456558, 454483, 453224, 452961, 453453, 454166, 454701, 455144, 455789, 456660, 457556, 458455, 459517, 460686, 461639, 462205, 462686, 463686, 465681, 468703, 472367, 476271, 480351, 484640, 488793, 492248, 494969, 497619, 500730, 504117, 507345, 510341, 513109, 515209, 516103, 515877, 515137, 514224, 513005, 511450, 510022, 509326, 509591, 510605, 512009, 513561, 515144, 516571, 517576, 518173, 518944, 520629, 523337, 526382, 528937, 530588, 531305, 531324, 531151, 531288, 531725, 532029, 531967, 531614, 530817, 529200, 526923, 524733, 522851, 520487, 517067, 513397, 510801, 509393, 507953, 505495]
59932E05495l171k812j762r17q73j376j489n64R47K014K235K037J919K117K836
59917E06636L964M694M399L816M278N719O633O257N581N652O147O298O143N967
59903E82184N432M193K738J691Q90j11j216k224l409m751n301m380k864k119k100
59888E68653j693p11q2n5L92J872L529M295M323M409M662M607M284M353N044N700
59872F13582N542M556L340K322J400K98r94k246l245l874m065l804l192k389j637
59857F05594j290j555k039j969j240p77j204j583l90K327M858N987O237O504O532
59842F25992N616L984K453J219k7r77q45L28J393J420O37k91j283k714m557o196
59826F26152p025o972o382n717n371n558o119o448n991m917m023l740l539k714
$$ y = [505495, 502324, 499512, 497750, 496833, 495960, 494584, 493095, 492531, 493478, 495492, 497727, 499764, 501683, 503800, 506636, 510600, 515294, 519693, 523509, 527787, 533506, 540139, 546396, 551977, 557629, 563776, 570074, 576217, 582184, 587616, 591809, 594547, 596238, 597128, 597017, 595801, 593577, 590168, 585417, 580116, 575736, 572872, 570753, 568653, 566960, 566249, 566167, 566112, 566504, 568376, 571905, 576200, 580523, 584932, 589594, 594201, 598485, 602838, 607882, 613582, 619124, 623680, 627020, 629342, 630742, 631040, 630046, 627800, 624555, 620681, 616616, 612812, 609620, 607231, 605594, 604304, 602749, 600710, 598741, 597501, 596724, 595520, 593937, 593547, 595874, 600732, 606719, 612956, 619460, 625992, 631608, 635592, 638045, 639264, 639237, 638260, 637415, 637743, 639136, 640556, 641193, 640902, 639619, 636905, 632348, 626152, 619127, 612155, 605773, 600056, 594685, 589127, 583008, 576560, 570569, 565652, 561629, 557889, 554350, 551636]
59812E51636j502p95q08p57j17N03K02r48j991k223j794j293j174j516k106k650
59796E32667l020l286l519l794m258m844m977m038k316j008r63j776k427k414
59782D90027j969j483j240j355j583j353m76L26J05j099k112j832l55J162J667
59767D78430J184O46Q07J467J938K065K378L191M108M597M673M697M840N046N259
59752E25326N425N428N305N377N877O643P288P551P348O732N952N267M618L736
59738F07873K701J996J836J824J540J096Q56Q98J124J505J894J866J209L37j55
59723F28400k38l62p46j062q55j04P16J055Q52N74N61M99%m99q6J259K416K539
59705F34919K142K235K995L808M280M530M713M831M937N120N304N363N277N023
$$ y = [551636, 550134, 549339, 548531, 547774, 547657, 548160, 548362, 547414, 545423, 543200, 541406, 540113, 538939, 537423, 535317, 532667, 529647, 526361, 522842, 519048, 514790, 509946, 504969, 500931, 498615, 497607, 496644, 494868, 492441, 490027, 488058, 486575, 485335, 483980, 482397, 481044, 480568, 480894, 480999, 479900, 477788, 475956, 475601, 476763, 478430, 479614, 480260, 481067, 482534, 484472, 486537, 488915, 492106, 496214, 500811, 505484, 510181, 515021, 520067, 525326, 530751, 536179, 541484, 546861, 552738, 559381, 566669, 574220, 581568, 588300, 594252, 599519, 604137, 607873, 610574, 612570, 614406, 616230, 617770, 618866, 619722, 620620, 621744, 623249, 625143, 627009, 628218, 628555, 628400, 628162, 627800, 627054, 625992, 625137, 625033, 625749, 626804, 627656, 628230, 628791, 629290, 629290, 628791, 628705, 629964, 632380, 634919, 637061, 639296, 642291, 646099, 650379, 654909, 659622, 664453, 669390, 674510, 679814, 685177, 690454, 695477]
59691F95477M484L712K976K367J663Q22K24J09J20j60o42j071j546k227k836k993
59675G00479k901l165m006n043n744n840n446n047n147n672n992n711n043m234
59661F31488l131j776q05o59p86k64R21J994K533K870L373L922M201M096L686
59646F51663L079K236Q86j198l585n351o093o432p024p559p336o490n881n874
59632E95041n948n511m547l390k393j889k089k884l909m825n378n409n047m746
59618E37076m778m926m828m490m129l844l612l401l036k336j548j201j283j127
59604D92537m42K29M86P26J173J103l9j418j752j094n22m33k96J10L84M88Q28
59587D92068J262J002j77j446j980j763j176n06n7j26o08j186j935l062m066m004
$$ y = [695477, 699961, 703673, 706649, 709016, 710679, 711501, 711725, 711834, 711954, 711794, 711152, 710081, 708535, 706308, 703472, 700479, 697578, 694413, 690407, 685364, 679620, 673780, 668334, 663287, 658140, 652468, 646476, 640765, 635722, 631488, 628357, 626581, 625776, 625117, 624331, 624067, 624988, 626982, 629515, 632385, 635758, 639680, 643881, 647977, 651663, 654742, 656978, 657864, 656666, 653081, 647730, 641637, 635205, 628181, 620622, 613286, 606796, 600915, 595041, 589093, 583582, 579035, 575645, 573252, 571363, 569274, 566390, 562481, 557656, 552278, 546869, 541822, 537076, 532298, 527372, 522544, 518054, 513925, 510081, 506469, 503068, 500032, 497696, 496148, 494947, 493664, 492537, 492095, 492324, 492810, 493536, 494709, 495812, 495773, 494355, 492603, 491509, 490987, 490554, 490258, 490368, 490752, 491240, 492068, 493330, 494332, 494155, 492709, 490729, 488966, 487790, 487284, 487227, 487101, 486493, 485307, 483372, 480310, 476244, 472240]
59571D72240k825j661j443j925k358k443k243j799j288j108j336j476j087l78
59557D48870J54L59M72P35J164J492J353P10J08J10O38J208J746K625L955N339
59541D71038O459P418Q436R699J1507J4013J6676J8392J8241J5898J1599O295
59529F15671J611j216k361k820k917k233q58L84J151J966L020L553K959J720N78
59514F20208n03j891l437m762n976p358q612r129q894q536q446q292p543o243
59500E30586n085m724n056n313m939m166l463k758j695m86J38j19p06r37o17Q3
59484D90743R63J889K766L493L768L286K426K275L270M302M047K788J884J656
59470E29556J219L17j19L33P34K94l78l23M20J242J936K493K670K501K675L601
$$ y = [472240, 469415, 467754, 466311, 464386, 462028, 459585, 457342, 455543, 454255, 453147, 451811, 450335, 449248, 448870, 449024, 449383, 449855, 450590, 451754, 453246, 454599, 455309, 455417, 455527, 456165, 457373, 459119, 461744, 465699, 471038, 477497, 484915, 493351, 503050, 514557, 528570, 545246, 563638, 581879, 597777, 609376, 615671, 617282, 616066, 613705, 610885, 607968, 605735, 604877, 605261, 606412, 608378, 611398, 614951, 617910, 619630, 620208, 619705, 617814, 614377, 609615, 603639, 596281, 587669, 578540, 569646, 561110, 552664, 544372, 536829, 530586, 525501, 520777, 515721, 510408, 505469, 501303, 497840, 495082, 493387, 492901, 493039, 492920, 492214, 491277, 490660, 490743, 491706, 493595, 496361, 499854, 503622, 506908, 509334, 511609, 514879, 519181, 523228, 526016, 527900, 529556, 530775, 531092, 530973, 531306, 532040, 532334, 531956, 531633, 532053, 533295, 535231, 537724, 540394, 542895, 545570, 549171]
59454E49171M722N396N841O560P414Q009Q417Q725Q414P087N372M199L468K254
59440F35049J37k438m903o969q360q883q694q023o839n264m033l798m174m176
59426E58632l495k708k157j338L79K842N186O737P740R187J1634J4303J5895J6399
59412F39236J7345J9723K2347K2953K0500J5655R532K926l341q320j1396j2302
59400G34858j0802p060k302J588L392L057R20k783p458j1915j5103j6865j7651
59387F51876j7764j7194j5967j4318j2518j0707q938p283n810m468l086j632m26
59374E31765J51J42K6J62N25R83J549K185K716L090L477L952M323M463M550M822
59358E68881N337O052O892P601P948Q100Q480R169R937J0902J2554J4921J7343
$$ y = [549171, 553893, 559289, 565130, 571690, 579104, 587113, 595530, 604255, 612669, 619756, 625128, 629327, 632795, 635049, 635186, 632748, 627845, 620876, 612516, 603633, 594939, 586916, 580077, 574813, 570780, 566982, 562808, 558632, 555137, 552429, 550272, 548934, 549313, 552155, 557341, 564078, 571818, 581005, 592639, 606942, 622837, 639236, 656581, 676304, 698651, 721604, 742104, 757759, 767291, 770217, 766876, 758556, 747160, 734858, 724056, 716996, 714694, 716282, 719674, 722731, 723651, 720868, 713410, 701495, 686392, 669527, 651876, 634112, 616918, 600951, 586633, 574115, 563408, 554470, 547187, 541377, 536909, 533823, 532191, 531765, 531916, 532058, 532084, 532246, 532771, 533754, 535303, 537488, 540204, 543294, 546771, 550723, 555046, 559509, 564059, 568881, 574218, 580270, 587162, 594763, 602711, 610811, 619291, 628460, 638397, 649299, 661853, 676774, 694117]
59345F94117J9267K0677K1468K1240K0128J9107J8780J8552J7584J5940J4033
59334I00893J1560Q005L803P2k639m598o111p371q828j0841j2972j4399j4943
59321H41631j5022j4727j3855j2789j2369j2656j2658j1666j0153q968q276p701
59309G00791p030o272n301l931k270o68O35J696K781M152N956Q285J1206J4442
59295G24472J6959J7340J4987J0702N790Q74l898p924j0270j0702j0002r077q253
59282G30998p483o664n644m284k791j553n75N08J778K835L499M295N803P835R555
59267G38112J0381J0473J0314J0008R071O993M003J125q04k035l561n806p995
59254G80279r075r035q958r691j0786j1032r937q342p416p366p402o884o023n413
$$ y = [694117, 713384, 734061, 755529, 776769, 796897, 816004, 834784, 853336, 870920, 886860, 900893, 912453, 920458, 924261, 924333, 921694, 917096, 910985, 903614, 894786, 883945, 870973, 856574, 841631, 826609, 811882, 798027, 785238, 772869, 760213, 747555, 735889, 725736, 716768, 708492, 700791, 693761, 687489, 682188, 678257, 675987, 675319, 675954, 677650, 680431, 684583, 690539, 698824, 710030, 724472, 741431, 758771, 773758, 784460, 790250, 791124, 787226, 779302, 769032, 758330, 748328, 739251, 730998, 723515, 716851, 711207, 706923, 704132, 702579, 702004, 702512, 704290, 707125, 710624, 714919, 720722, 728557, 738112, 748493, 758966, 769280, 779288, 788359, 795352, 799355, 800480, 799676, 797641, 794080, 788274, 780279, 771204, 762169, 753211, 743520, 732734, 721702, 711765, 703423, 696007, 688641, 681239, 674355, 668332, 662919]
59240F62919n217m992m175k671r90K32Q60J247J547J517J181J109J442J280n7
59225F55232j713k356k321l155n079o513o555o334o976p710p218n771m674m285
59211E84572l995l581l270k786j637j77P15R82J412K292L023L099K786K680L195
59196E89310M342N479N638M691L794L955M699N007N006N531O446O765O279N764
59182F62706N578N378N231N602O040N305L298J540J160J527J548J216J069J019
59168G08217P32N02Q69J772K779L725M630N309N631N773N774N216L851K066L83
59153G57229j126k516l615m457n495o814p558o989n740n218n806o445o056m812
59139F84582l781l742m562n396n363m242k706j708j572j713j365m41N03J023J305
$$ y = [662919, 657702, 652710, 648535, 645864, 644874, 645106, 645966, 647213, 648760, 650277, 651458, 652567, 654009, 655289, 655232, 653519, 651163, 648842, 645687, 640608, 634095, 627540, 621206, 614230, 606520, 599302, 593531, 588857, 584572, 580577, 576996, 573726, 570940, 569303, 569126, 569841, 570823, 572235, 574527, 577550, 580649, 583435, 586115, 589310, 593652, 599131, 604769, 609460, 613254, 617209, 621908, 626915, 631921, 637452, 643898, 650663, 656942, 662706, 668284, 673662, 678893, 684495, 690535, 695840, 699138, 700678, 701838, 703365, 704913, 706129, 707198, 708217, 708949, 709451, 710320, 712092, 714871, 718596, 723226, 728535, 734166, 739939, 745713, 750929, 754780, 756846, 757229, 756103, 753587, 749972, 745515, 740020, 733206, 725648, 718659, 712919, 707701, 701895, 695450, 689394, 684582, 680801, 677059, 672497, 667101, 661738, 657496, 654790, 653082, 651510, 649797, 648432, 647991, 648494, 649517, 650822]
59124F50822J796K521L115L490M047N051O141O816P162P663Q442R124R438R548
59110G35176R703R845R654Q867P543O158N304N098M950M212K914J632P18l6r82
59095H10756k106l059l550l707l922m313m460l990l259l001l336l699l796l988
59081G60570m580n422o391p443p996p334o027n852p431r090r020p658o639o324
59067F63363n806m886m381m655n168n541n856n966n617n153n000m733l849l162
59053E93590l897n476n876m485k928k633l045k977k324j611r13j73J87j45p83
59038E56511j194j276r89m7J471K838L457L401L008K554K502L301M705O004P046
59023E93292Q221R414J0084J0496J1649J3558J4863J4673J3604J2345J0504P758
$$ y = [650822, 652618, 655139, 658254, 661744, 665791, 670842, 676983, 683799, 690961, 698624, 707066, 716190, 725628, 735176, 744879, 754724, 764378, 773245, 780788, 786946, 792250, 797348, 802298, 806510, 809424, 811056, 811774, 811738, 810756, 808650, 805591, 802041, 798334, 794412, 790099, 785639, 781649, 778390, 775389, 772053, 768354, 764558, 760570, 755990, 750568, 744177, 736734, 728738, 721404, 715377, 709525, 702094, 693004, 683984, 676326, 669687, 663363, 657557, 652671, 648290, 643635, 638467, 632926, 627070, 621104, 615487, 610334, 605334, 600601, 596752, 593590, 589693, 584217, 578341, 573856, 570928, 568295, 565250, 562273, 559949, 558338, 557425, 557252, 557439, 557294, 556511, 555317, 554041, 553052, 553005, 554476, 557314, 560771, 564172, 567180, 569734, 572236, 575537, 580242, 586246, 593292, 601513, 610927, 621011, 631507, 643156, 656714, 671577, 686250, 699854, 712199, 722703, 730461]
59011G30461M962L022J473o19k965m356m297l416k511j810j025L16K277M008M429
58996G29949L633K909L072L604L755L493K885J609j86j564k102k592l657m649
58982G40159m853m727m909m827l658j901p02q5R21K726M907P069Q957J0091J0384
58967G59552J0733J1838J2848J2530J1338J0943J1712J2148J1110R200P533O225
58955H87710M741K858O62j841m529o990q973j0754j2658j4475j5567j5487j4367
58942G90330j2782j1297j0017q694p274o107n401m908m340l841l704l837l879
58929G04249l626l131k611k429k759l078k543j176j32l34j335k048k150k131k346
58914F72420k639k765k597k102j459j019q23m48M13J596K943M582O384P806Q704
$$ y = [730461, 735423, 738445, 739918, 739299, 736334, 731978, 727681, 724265, 721754, 719944, 718919, 719235, 721512, 725520, 729949, 733582, 736491, 739563, 743167, 746922, 750415, 753300, 754909, 754723, 753159, 751057, 748465, 744808, 740159, 735306, 730579, 725670, 720843, 717185, 715284, 714582, 714497, 715418, 718144, 723051, 730120, 739077, 749168, 759552, 770285, 782123, 794971, 807501, 818839, 829782, 841494, 853642, 864752, 873952, 881485, 887710, 892451, 895309, 895971, 894130, 889601, 882611, 873638, 862884, 850226, 835751, 820184, 804697, 790330, 777548, 766251, 756234, 747540, 740266, 734159, 728758, 723850, 719510, 715669, 711965, 708128, 704249, 700623, 697492, 694881, 692452, 689693, 686615, 684072, 682896, 682764, 682430, 681095, 679047, 676897, 674766, 672420, 669781, 667016, 664419, 662317, 660858, 659839, 659016, 658568, 658981, 660577, 663520, 668102, 674486, 682292, 690996]
58899F90996R723J1316J2885J3583J3443J3114J2946J2963J3291J3902J4363J4541
58887H47066J5097J6581J8458J9740K0194K0093J9255J7239J4297J1272Q573N933
58875A033798L060o2l334o415q683r907j0689j1690j2717j3170j3023j2700j2320
58862I22148j1791j1313j1090j0799j0073r253q865q732q332p833p895q554r146
58849G98472r279r138q829q142p089o133n746o060o834p520p575p101o817p165
58835F95044p760q068q030p659o673n175m002l682l676l346k988l087l115k222
58821F25561n83Q83J824K469K779K633K529L089M015M455M190L578K700J528O72
58806F62322P73J361J301L24q55j750k441k878k895k907l546m602n194n107n029
$$ y = [690996, 700719, 712035, 724920, 738503, 751946, 765060, 778006, 790969, 804260, 818162, 832525, 847066, 862163, 878744, 897202, 916942, 937136, 957229, 976484, 993723, 1008020, 1019292, 1027865, 1033798, 1036858, 1036796, 1033462, 1027047, 1018364, 1008457, 997768, 986078, 973361, 960191, 947168, 934468, 922148, 910357, 899044, 887954, 877155, 867082, 857829, 848964, 840232, 831900, 824067, 816172, 807618, 798472, 789193, 780055, 771226, 763084, 755995, 749862, 744116, 738056, 731222, 723702, 716127, 709026, 702209, 695044, 687284, 679216, 671186, 663527, 656854, 651679, 647677, 643995, 640319, 636973, 633985, 630898, 627783, 625561, 624978, 625861, 627685, 630154, 632933, 635566, 638095, 641184, 645199, 649654, 653844, 657422, 660122, 661650, 662322, 663095, 664456, 665757, 666081, 665226, 663476, 661035, 658157, 655262, 652355, 648809, 644207, 639013, 633906, 628877]
58791F28877n421n880n757m822l385k154j707j634p42J283L134L634L450L959
58777F12835N176O067O289O162N426L641J540L25k52j564l843n776o447o227n665
58762F17687m904m318m330m488m002l188k980l031k039r3J092P42O4J79O56Q49
58746E87896J141J904K601K876L343M415N434N862O331P531Q925R531R274Q848
58732F65912Q740R042R601R845R148P773O729O323N717M267K365N40j207k718
58718G42077l386l244l287l960m273l246j348L64J594K375K183O48j287k196k030
58703G20984k183l696o067p958q633q639r180j0758j2498j3099j2360j1282j0721
58690F03910j0585j0389r873q983p801o759o222n894n225m364l955m025l996l759
$$ y = [628877, 623456, 617576, 611819, 606997, 603612, 601458, 599751, 598117, 597375, 598658, 601792, 605426, 608876, 612835, 618011, 624078, 630367, 636529, 641955, 645596, 647136, 647461, 647209, 645645, 641802, 636026, 629579, 623352, 617687, 612783, 608465, 604135, 599647, 595645, 592457, 589477, 586446, 584407, 584314, 585406, 586148, 586212, 586391, 587047, 587896, 589037, 590941, 593542, 596418, 599761, 604176, 609610, 615472, 621803, 629334, 638259, 647790, 657064, 665912, 674652, 683694, 693295, 703140, 712288, 720061, 726790, 733113, 738830, 743097, 745462, 746002, 744795, 742077, 738691, 735447, 732160, 728200, 723927, 720681, 719333, 719697, 721291, 723666, 725849, 726497, 725210, 723014, 720984, 718801, 715105, 709038, 701080, 692447, 683808, 674628, 663870, 651372, 638273, 625913, 614631, 603910, 593325, 582936, 573063, 564080, 556279, 549520, 543298, 537404, 532179, 527815, 523860, 519835, 515839, 512080]
58676E12080l690l531k500p36N20O74N78J075J841K328K918M270O242Q162R622
58661E39853J0431J0300R178P568O021M594K934P04k037m574n945o111o225p017
58647E59674p542o637m932l921l559k558r40j65n90p95NQ32R29J010J596J859
58631E34266J165K70j01m99j436k158j924j337j257j417j243r67q54l45R31K211
58615E25305K746L002L729M714N428N977O395O034M645L215K595K271J532Q47
58601E78435R20J263R69J31o86j653l094m384m625l880k777j470L1J208J847K807
58585E65042M823P186Q732R582J0670J2008J2684J2286J1326J0410R812R548R195
58572F93304Q052O162M710M694N768P048Q381J0095J2121J4230J6584J9305K2028
$$ y = [512080, 508390, 504859, 502359, 501623, 502143, 502817, 503395, 504470, 506311, 508639, 511557, 515827, 522069, 530231, 539853, 550284, 560584, 569762, 577330, 583351, 587945, 590879, 591583, 589546, 584972, 579027, 572916, 566691, 559674, 552132, 545495, 540563, 536642, 533083, 530525, 529585, 529420, 528830, 528035, 528040, 528872, 529801, 530811, 532407, 534266, 535431, 535701, 535600, 535101, 533665, 531507, 529583, 528246, 526989, 525572, 524329, 523362, 522508, 522163, 523094, 525305, 528051, 531053, 534782, 539496, 544924, 550901, 557296, 563330, 567975, 571190, 573785, 576056, 577588, 578435, 579355, 580618, 581587, 581718, 581032, 579379, 576285, 571901, 567276, 563396, 560619, 559149, 559180, 560388, 562235, 565042, 569865, 577051, 585783, 595365, 606035, 618043, 630727, 643013, 654339, 664749, 674561, 684109, 693304, 701356, 707518, 712228, 716922, 722690, 729738, 738119, 748214, 760335, 774565, 791149, 810454, 832482]
58559H32482K4464K6719K8487K8733K6983K4109K1130J8040J4501J0851P617M814
58547A068930K431P58m59k207m802p333r191j1036j3380j5565j7115j8849k1396
58534I50786k3770k4712k4398k3544k1952j9431j7085j6045j5601j4206j1789
58523G38253r698q712q334p688o146l588q83N91N68K48L51J51p67j260m89L79
58507F92976j60j713k911l445l616l089j666l74n7O7Q97J608J073J3k11J9n05
58490F78906j313q02J191L320M874O195P405Q362R470J1046J2441J3213J4351
58477G68659J6675J8952J9416J8352J7161J5750J2928Q881N049J880j280m400
58465H98023o766q444r907j0629r889q486p766p423o100l694j106J671N089Q231
$$ y = [832482, 856946, 883665, 912152, 940885, 967868, 991977, 1013107, 1031147, 1045648, 1056499, 1064116, 1068930, 1071361, 1072119, 1071660, 1069453, 1064651, 1057318, 1048127, 1037091, 1023711, 1008146, 991031, 972182, 950786, 927016, 902304, 877906, 854362, 832410, 812979, 795894, 779849, 764248, 750042, 738253, 728555, 719843, 711509, 703821, 697675, 694087, 693204, 693795, 694363, 694611, 694962, 695113, 694346, 693086, 692597, 692976, 692816, 691103, 688192, 684747, 681131, 678042, 676376, 676002, 675945, 676012, 676909, 678517, 679590, 679603, 679392, 679411, 678906, 677593, 676791, 677982, 681302, 686176, 692371, 699776, 708138, 717608, 728654, 741095, 754308, 768659, 785334, 804286, 823702, 842054, 859215, 874965, 887893, 896774, 901823, 903703, 902423, 898023, 891257, 882813, 872906, 862277, 852388, 843902, 836136, 828713, 822613, 818919, 817813, 819484, 824573, 832804]
58451H32804R641R664R723R640P969M749J581r61l674o508q256q705q990r450
58437H39227r103p524n574m033l021k725l111k964r46K456N449P174Q056Q485
58423H31846Q796R835J1719J2754J1525R251P935P062M721J227j236k209l355
58410I09871n288o825p523q302r227r228q317p743p658o861n068l285j832j76
58396H22538J269J526J174J700K826K924K103K220L692M901N019M882M755L786
58382H65315K112J100J091J088Q42J021J334Q59J53N77J691J928J642K712N146
58367H88611P081Q059R317J0889J1602J1950J3682J6280J7287J6423J5914J6371
58355A043466J5896J3896J2160J1358J0001P700O095N581M576K899K454L628M505
$$ y = [832804, 842445, 852109, 861832, 871472, 879441, 884190, 885771, 884810, 881136, 874628, 866372, 857667, 848677, 839227, 830124, 822600, 817026, 812993, 809972, 807247, 804136, 801172, 800226, 802682, 808131, 815305, 823361, 831846, 840642, 850477, 862196, 874950, 886475, 895726, 903661, 910723, 915444, 916671, 915435, 913226, 909871, 904583, 897758, 890235, 881933, 872706, 863478, 855161, 847418, 839760, 832899, 827831, 824546, 822714, 822538, 823807, 825333, 826507, 828207, 831033, 833957, 836060, 838280, 841972, 846873, 851892, 856774, 861529, 865315, 867427, 868527, 869618, 870706, 871548, 872569, 873903, 874762, 874915, 875492, 877183, 879111, 880753, 883465, 888611, 895692, 903751, 913068, 923957, 935559, 947509, 961191, 977471, 994758, 1011181, 1027095, 1043466, 1059362, 1073258, 1085418, 1096776, 1106777, 1114477, 1120572, 1126153, 1130729, 1133628, 1136082, 1139710, 1144215]
58342A144215M563N533P610Q566P849P852R708J1462J1915J2603J4369J5603J5533
58329A277381J5769J6843J6808J5041J3857J4394J4368J2034R028P237O063M853
58317A423676M806O319P429P018O723P841R196R807J0632J2076J2855J2895J4064
58304A545337J6567J7975J7420J7172J8441J9360J8828J8559J9511K0118J9884
58293A749172K0748K3027K4100K3129K2861K4661K6102K5729K5713K7335K8335
58282B020912K7469K7245K9311L1479L2104L3102L5777L8081L8806M0004M2550
58271B396840M3969M3471M4187M7460N0094N0379N1474N5411N9307O1084O3345
58260B967021O7657P0787P0836P1337P4732P7508P6589P4941P5943P7778P8384
$$ y = [1144215, 1148778, 1154311, 1161921, 1170487, 1178336, 1186188, 1195896, 1207358, 1219273, 1231876, 1246245, 1261848, 1277381, 1293150, 1309993, 1326801, 1341842, 1355699, 1370093, 1384461, 1396495, 1405523, 1412760, 1418823, 1423676, 1428482, 1434801, 1442230, 1449248, 1455971, 1463812, 1473008, 1482815, 1493447, 1505523, 1518378, 1531273, 1545337, 1561904, 1579879, 1597299, 1614471, 1632912, 1652272, 1671100, 1689659, 1709170, 1729288, 1749172, 1769920, 1792947, 1817047, 1840176, 1863037, 1887698, 1913800, 1939529, 1965242, 1992577, 2020912, 2048381, 2075626, 2104937, 2136416, 2168520, 2201622, 2237399, 2275480, 2314286, 2354290, 2396840, 2440809, 2484280, 2528467, 2575927, 2626021, 2676400, 2727874, 2783285, 2842592, 2903676, 2967021, 3034678, 3105465, 3176301, 3247638, 3322370, 3399878, 3476467, 3551408, 3627351, 3705129, 3783513]
58249C783513Q0209Q4922Q9273R1393R5245J03393J11517J15861J19844J27235
58239D802405J35261J40776J46851J56568J66670J74146J82624J95394K08861
58230F309556K20009K33128K51660K70868K86519L03262L26059L51269L74918
58221H927248M01505M35352M71851N07097N47118N97181O51559P05098P64893
58212A4008902Q38637R22004J010655J113491J239978J386295J549485J742793
58204B3812240J980557K261978K588832K985132L479766M087798M834151N777744
58196E1808198O981934Q476274J0276719J2425052J4979861J7999052K1553884
58189A44500974K5651127K9960720L3581072L5235057L3889585K9287250K1974744
$$ y = [3783513, 3863722, 3948644, 4037917, 4129310, 4224555, 4327948, 4439465, 4555326, 4675170, 4802405, 4937666, 5078442, 5225293, 5381861, 5548531, 5722677, 5905301, 6100695, 6309556, 6529565, 6762693, 7014353, 7285221, 7571740, 7875002, 8201061, 8552330, 8927248, 9328753, 9764105, 10235956, 10743053, 11290171, 11887352, 12538911, 13244009, 14008902, 14847539, 15769543, 16780198, 17893689, 19133667, 20519962, 22069447, 23812240, 25792797, 28054775, 30643607, 33628739, 37108505, 41196303, 46030454, 51808198, 58790132, 67266406, 77543125, 89968177, 104948038, 122947090, 144500974, 170152101, 200112821, 233693893, 268928950, 302818535, 332105785, 354080529]
58182C54080529J2968921L444026n460719j2851569j8291726k1825253k3782871
58175B88281338k4561536k4512059k3890790k2833049k1394353j9649233j7734787
58168A33705531j5794733j3921319j2169108j0585481r196724p989607o936502
58161E7112057o025698n250444m588382m014328l520027l102797k747175k435048
58153B5428158k162729j931836j733247j555069j397134j263210j146951j038929
58145A3199053r39885q54393p78437p05322o37258n79532n29213m80520m35671
58136G258822l99929l71146l44030l19661l01199k85118k66118k46240k30267
58127D495114k16563k01020j85578j74141j64271j51546j38317j29612j23842
$$ y = [354080529, 367049450, 370493476, 365032757, 352181188, 333889462, 312064209, 288281338, 263719802, 239207743, 215316953, 192483904, 171089551, 151440318, 133705531, 117910798, 103989479, 91820371, 81234890, 72038166, 64048559, 57112057, 51086359, 45835915, 41247533, 37233205, 33713178, 30610381, 27863206, 25428158, 23265429, 21333593, 19600346, 18045277, 16648143, 15384933, 14237982, 13199053, 12259168, 11404775, 10626338, 9921016, 9283758, 8704226, 8175013, 7694493, 7258822, 6858893, 6487747, 6143717, 5824056, 5522857, 5237739, 4971621, 4725381, 4495114, 4278551, 4077531, 3891953, 3717812, 3553541, 3401995, 3263678, 3134066, 3010224]
58118C010224j15942j06568r9993r5718r0052q3609p9565p6742p1716o5747o2623
58107B061949o1421n8252n3440n0525m9642m8081m5865m4930m4269m1658l8556
58096A525310l7720l7705l5293l1712l0663l1614l0878k8118k6230k5706k4524
58085A185147k2802k2392k2538k0870j8124j7222j8246j8817j8671j9445k0623
58074I65397k0142j8502j8085j8878j8851j7938j7756j7999j6940j4928j3782
58063G71596j3336j2075j0363r598r138p632o284p187r373j0238r891j0358j1394
58050F44729j0964r198q123q016p515o743o883p318o585n358n292n762n156m310
58036E47506n063o482o261m999n103o310o356n539o354q764r945q920p703p565
$$ y = [3010224, 2894282, 2787714, 2687721, 2592003, 2501951, 2418342, 2338777, 2262035, 2190319, 2124572, 2061949, 2000528, 1942276, 1888836, 1838311, 1788669, 1740588, 1694723, 1649793, 1605524, 1563866, 1525310, 1487590, 1449885, 1414592, 1382880, 1352217, 1320603, 1289725, 1261607, 1235377, 1209671, 1185147, 1162345, 1139953, 1117415, 1096545, 1078421, 1061199, 1042953, 1024136, 1005465, 986020, 965397, 945255, 926753, 908668, 889790, 870939, 853001, 835245, 817246, 800306, 785378, 771596, 758260, 746185, 735822, 726224, 717086, 709454, 703170, 695983, 686610, 676372, 666481, 656123, 644729, 633765, 624567, 616444, 608428, 600913, 594170, 587287, 579969, 573384, 568026, 562734, 556972, 551816, 547506, 542443, 535961, 529700, 524701, 519598, 513288, 506932, 501393, 495039, 486275, 476330, 467410, 459707, 452142]
58022D52142p661p582p933q216p203n467m585m130k563o25l91j327r70N82P96
58007C94867o06r92N53J748J091j2j89q9m39p70r76j729k745l004k926l856n221
57990C74705m986l089j606j279p70K13J82j164k136k020k047k709k849k210k181
57975C46054l072l277k139j221j654k484k673k541k340j445M3R27Q72R32J518
57960C27500J746J344J153J239O25n60q28J27Q09M95L36J156K151K593K858L102
57944C45846K757K091K350L748N017N538O069O968P579P805Q282Q669P804O081
57930D26604N384O096O349M950K872J062j009l674o033p532q803j0047j0453r954
57916C95812r697r989r704q461p455p330p130o195n192m497l446k036j393j763
$$ y = [452142, 444481, 436899, 428966, 420750, 413547, 408080, 403495, 399365, 396802, 396177, 395786, 394459, 393489, 394071, 394867, 394261, 393269, 393822, 395570, 396661, 396649, 396460, 396371, 395932, 395162, 394186, 392457, 389712, 386708, 383782, 379926, 374705, 369719, 366630, 365024, 363745, 362975, 363188, 363370, 362206, 360070, 358050, 356003, 353294, 350445, 348235, 346054, 342982, 339705, 337566, 336345, 334691, 332207, 329534, 326993, 324653, 323208, 323251, 324178, 325050, 325982, 327500, 329246, 330590, 331743, 332982, 333607, 333047, 332219, 332346, 333155, 333650, 333986, 335142, 337293, 339886, 342744, 345846, 348603, 350694, 353044, 356792, 361809, 367347, 373416, 380384, 387963, 395768, 404050, 412719, 420523, 426604, 431988, 438084, 444433, 449383, 452255, 453317, 452308, 448634, 442601, 435069, 426266, 416219, 405766, 395812, 386115, 376126, 366422, 357961, 350506, 343176, 336046, 329851, 324659, 320162, 316716, 314680, 313287, 311524]
57902C11524j956j561j630k349k248p92N14O83Q20J812K638K403K067K525K812
57887C17262J918O86L16L58j43q40r73q73j204j796k373l302m500m935m303l839
57871B91459m339m728l903k603k093k197k039j647j501j413j011m51J68J176K368
57856B67246K878K691K931L939M596M367M299M984N312M503L615L555L305J756
57842C19977j82j048j137j577k242k259j729j274p33K31R95Q25K17J43P34J710
57826C12651L105M497M694L460K408K812L732L663K846K339J971J040J00K05R64
57811C50487J081L04o89j804l384n061o173o935p835q418p975p018o639o830o665
57796B76446n800m626l379k159j414j296j051p5J069J588J727K073K445K636L331
$$ y = [311524, 309568, 308007, 306377, 304028, 301780, 300988, 301502, 302185, 303005, 304817, 307455, 309858, 311925, 314450, 317262, 319180, 319866, 320182, 320540, 320397, 319557, 318584, 317711, 316507, 314711, 312338, 309036, 304536, 299601, 295298, 291459, 287120, 282392, 278489, 275886, 273793, 271596, 269557, 267910, 266409, 264996, 263985, 263534, 263702, 264878, 267246, 270124, 272815, 275746, 279685, 284281, 288648, 292947, 297931, 303243, 307746, 311361, 314916, 318221, 319977, 319795, 318747, 317610, 316033, 313791, 311532, 309803, 308529, 307796, 308027, 309022, 309847, 310064, 310207, 310941, 312651, 315756, 320253, 324947, 328407, 330815, 333627, 337359, 341022, 343868, 346207, 348178, 349218, 349318, 349523, 350487, 351568, 351872, 351183, 349379, 345995, 340934, 334761, 327826, 319991, 311573, 303598, 296580, 289941, 283111, 276446, 270646, 266020, 262641, 260482, 259068, 257772, 256721, 256646, 257715, 259303, 261030, 263103, 265548, 268184, 271515]
57781B71515M992O603O954O449O302O601O622O396O372O154N122L906L594L821
57767C51403L204J492j29q94j273j974l159m595n719n864n179m851n521o218n849
57752C04874m897m461m432m065l576l578l631k976k195k384l182l409l254l913
57738B54921n182n454m260k961k513k213j224J27J167J860K357K546K509K658
57724B44338L106L525L686L503K792J672R23R82R96k2j515k122j815j773k289
57709B55987k344j474n99n56j056j470j653j623j317r53q61q75o60n48j037j623
57693B37338j240M7J029J097Q61Q68R38J024J531K330K558J967J494J990L178
57678B57010M421N808P872J0820J4502J8817K3757K9420L6214M4665N4767O5481
$$ y = [271515, 276507, 283110, 290064, 296513, 302815, 309416, 316038, 322434, 328806, 334960, 340082, 343988, 347582, 351403, 354607, 356099, 355970, 355076, 353803, 351829, 348670, 344075, 338356, 332492, 327313, 322462, 316941, 310723, 304874, 299977, 295516, 291084, 287019, 283443, 279865, 276234, 273258, 271063, 268679, 265497, 262088, 258834, 254921, 249739, 244285, 240025, 237064, 234551, 232338, 231114, 231241, 232408, 234268, 236625, 239171, 241680, 244338, 247444, 250969, 254655, 258158, 260950, 262622, 263545, 264527, 265523, 265501, 263986, 261864, 260049, 258276, 255987, 253643, 252169, 251570, 251014, 249958, 248488, 246835, 245212, 243895, 242942, 242081, 241206, 240546, 239998, 238961, 237338, 236098, 236145, 237174, 238271, 239132, 240000, 240938, 241962, 243493, 245823, 248381, 250348, 251842, 253832, 257010, 261431, 267239, 275111, 285931, 300433, 319250, 343007, 372427, 408641, 453306, 508073, 573554]
57666E73554P4692P9532P7324O7067N0022K8653N445j6935l5416m7799n4067n5710
57654G46362n4093n0304m5768m1583l7487l2751k7816k3842k0880j7988j5041
57643C78809j2843j1398r586o965m510l096k453k080k004k123j889j159n26l54
57629C17823l11k30m43r18j011n53k98p85j548j947k042k107k019j630j179q92
57613B99910o34k90NK10M77P74R16R58J032Q75K81j91J89J018J134L24l50j91
57595C06447K50K52j33o10j203j804j964j599j233j128r35m76j53k01k75j29q7
57578B95019l98p30p41n44l75k27j09r7k1L22N76J26r24j690j640j058l69L18
57560B87438Q82J206J544K166K591K054P95r9k21j99l83k45N29J399J823J908
$$ y = [573554, 648246, 727778, 805102, 872169, 922191, 950844, 956289, 939354, 903938, 856139, 802072, 746362, 692269, 641965, 596197, 554614, 517127, 484376, 456560, 432718, 411838, 393850, 378809, 365966, 354568, 344982, 338017, 333507, 330411, 327958, 325878, 323874, 321751, 319862, 318703, 318177, 317823, 317512, 317282, 316839, 315921, 314910, 314357, 314059, 313274, 311726, 309779, 307737, 305630, 303611, 301981, 300802, 299910, 299276, 298986, 298991, 299201, 299678, 300452, 301368, 302326, 303358, 304233, 304514, 304323, 304512, 305530, 306664, 306988, 306638, 306447, 306697, 306949, 306816, 306206, 305003, 303199, 301235, 299636, 298403, 297275, 296340, 295864, 295711, 295510, 295235, 295106, 295019, 294621, 293891, 293150, 292606, 292231, 292004, 291895, 291798, 291777, 292099, 292675, 292801, 291877, 290187, 288547, 287489, 287120, 287438, 288320, 289526, 291070, 293236, 295827, 297881, 298676, 298577, 298356, 298157, 297774, 297529, 298058, 299457, 301280, 303188]
57544C03188J874J643J317J269J467J487J357J524J896J887J554J583K007K114
57530C26167J858K028K663K690J761J016J261J706J445J033J470K606L644M396
57516C55744N019N217M759M253M416N050N540N821O072O002N323M504M148M042
57502D25910L552K706K124K078K187J921J028k53j194j147l56K64K73L5j68m53
57486D38507o28j65O97R73M78L37J250K418K883K951L280L571L213K477J995J666
57470D65903J072M57L00M60N75P76J210J425J180J180K101L430M263M646N084
57455D94062N314M787L981L989M889N640N535M864M201L863M011M512M818M569
57441E59035M237M473N129N570N623N538N362N046M918N208N453N136M572M399
$$ y = [303188, 305062, 306705, 308022, 309291, 310758, 312245, 313602, 315126, 317022, 318909, 320463, 322046, 324053, 326167, 328025, 330053, 332716, 335406, 337167, 338183, 339444, 341150, 342595, 343628, 345098, 347704, 351348, 355744, 360763, 365980, 370739, 374992, 379408, 384458, 389998, 395819, 401891, 407893, 413216, 417720, 421868, 425910, 429462, 432168, 434292, 436370, 438557, 440478, 441506, 441253, 440059, 438912, 438556, 438820, 439093, 439128, 438960, 438507, 437879, 437714, 438411, 439384, 439862, 440199, 441449, 443867, 446750, 449701, 452981, 456552, 459765, 462242, 464237, 465903, 466975, 467432, 467732, 468192, 468767, 469543, 470753, 472178, 473358, 474538, 476639, 480069, 484332, 488978, 494062, 499376, 504163, 508144, 512133, 517022, 522662, 528197, 533061, 537262, 541125, 545136, 549648, 554466, 559035, 563272, 567745, 572874, 578444, 584067, 589605, 594967, 600013, 604931, 610139, 615592, 620728, 625300, 629699]
57427F29699M532M487M447M976N836O084N401M476L965L820L769L827M194M977
57413F94490O068O975P095O477N989O174O468O110N420N339N996O603O648O433
57399G82285O454O822P289P406O889O102N869O400O941O979P055P702Q337Q190
57385H80720P718P960Q848R360R114Q688Q447Q190P816P468P015O403O275P187
57371I91209Q296Q055O348M710M264M559M832N218O134P273P990Q144Q045P930
57357A083007P887Q010Q296Q612Q876R071R176R406J0219J1636J2782J2775J1876
57344A211629J1129J1009J1216J1594J2286J2972J2956J2214J1528J1285J1055
57333A340873J0642J0668J1517J2466J2551J1900J1527J2040J3017J3630J3535
$$ y = [629699, 634231, 638718, 643165, 648141, 653977, 660061, 665462, 669938, 673903, 677723, 681492, 685319, 689513, 694490, 700558, 707533, 714628, 721105, 727094, 733268, 739736, 745846, 751266, 756605, 762601, 769204, 775852, 782285, 788739, 795561, 802850, 810256, 817145, 823247, 829116, 835516, 842457, 849436, 856491, 864193, 872530, 880720, 888438, 896398, 905246, 914606, 923720, 932408, 940855, 949045, 956861, 964329, 971344, 977747, 984022, 991209, 999505, 1007560, 1013908, 1018618, 1022882, 1027441, 1032273, 1037491, 1043625, 1050898, 1058888, 1067032, 1075077, 1083007, 1090894, 1098904, 1107200, 1115812, 1124688, 1133759, 1142935, 1152341, 1162560, 1174196, 1186978, 1199753, 1211629, 1222758, 1233767, 1244983, 1256577, 1268863, 1281835, 1294791, 1307005, 1318533, 1329818, 1340873, 1351515, 1362183, 1373700, 1386166, 1398717, 1410617, 1422144, 1434184, 1447201, 1460831, 1474366]
57322A474366J3126J3065J3600J4269J4438J4017J3413J2972J2768J2883J3377
57311A622294J3941J4017J3425J2591J2050J1922J2005J2129J2317J2670J3180
57300A762541J3700J4142J4604J5119J5358J5008J4384J4170J4494J4875J5103
57289A923498J5448J5811J5618J4934J4686J5218J5585J5123J4649J5086J5770
57278B091426J5474J4458J3967J4107J3740J2471J1316J1169J1832J2815J4013
57267B236788J5213J5850J5731J5382J5430J6090J7274J8553J9120J8484J7269
57256B421184J6675J7098J7850J8128J7669J6640J5574J5192J5573J5790J5179
57245B602552J4557J5098J6373J6776J5892J4986J5053J5635J5968J6044J6072
$$ y = [1474366, 1487492, 1500557, 1514157, 1528426, 1542864, 1556881, 1570294, 1583266, 1596034, 1608917, 1622294, 1636235, 1650252, 1663677, 1676268, 1688318, 1700240, 1712245, 1724374, 1736691, 1749361, 1762541, 1776241, 1790383, 1804987, 1820106, 1835464, 1850472, 1864856, 1879026, 1893520, 1908395, 1923498, 1938946, 1954757, 1970375, 1985309, 1999995, 2015213, 2030798, 2045921, 2060570, 2075656, 2091426, 2106900, 2121358, 2135325, 2149432, 2163172, 2175643, 2186959, 2198128, 2209960, 2222775, 2236788, 2252001, 2267851, 2283582, 2298964, 2314394, 2330484, 2347758, 2366311, 2385431, 2403915, 2421184, 2437859, 2454957, 2472807, 2490935, 2508604, 2525244, 2540818, 2556010, 2571583, 2587373, 2602552, 2617109, 2632207, 2648580, 2665356, 2681248, 2696234, 2711287, 2726922, 2742890, 2758934, 2775006]
57234B775006J5907J5586J5569J5913J5982J5440J4870J4943J5532J6023J5982
57223B946753J5326J4353J3742J3961J4595J4877J4768J4826J5173J5496J5999
57212C109869J7198J8674J9296J8938J8848J9791K0939K1214K0702K0041J9265
57201C324775J8092J6787J5916J5624J5629J5576J5096J3982J2582J1504J0729
57190C486292R626Q037O615N778N065L969K778K155K308K985L736M029L525K521
57176C549419J665J159O95J94q2j12j47j87m6M1k66o33m54J0j7l72j07Q17J284
57157C552861P88J59L2j19q22j575j681j166k49J168K899M320N339O637Q322R385
57141C586298R079P920O612N008K833O31q44j451j318m57P38J475J639K027L097
$$ y = [2775006, 2790913, 2806499, 2822068, 2837981, 2853963, 2869403, 2884273, 2899216, 2914748, 2930771, 2946753, 2962079, 2976432, 2990174, 3004135, 3018730, 3033607, 3048375, 3063201, 3078374, 3093870, 3109869, 3127067, 3145741, 3165037, 3183975, 3202823, 3222614, 3243553, 3264767, 3285469, 3305510, 3324775, 3342867, 3359654, 3375570, 3391194, 3406823, 3422399, 3437495, 3451477, 3464059, 3475563, 3486292, 3495918, 3503955, 3510570, 3516348, 3521413, 3525382, 3528160, 3530315, 3532623, 3535608, 3539344, 3543373, 3546898, 3549419, 3551084, 3552243, 3552938, 3553132, 3553050, 3552938, 3552791, 3552604, 3552558, 3552599, 3552333, 3551700, 3551246, 3551256, 3551239, 3550867, 3550760, 3551577, 3552861, 3553649, 3553808, 3553840, 3553721, 3552899, 3551324, 3549643, 3548477, 3548228, 3549396, 3552295, 3556615, 3561954, 3568591, 3576913, 3586298, 3595377, 3603297, 3609909, 3614917, 3617750, 3618381, 3617537, 3616086, 3614768, 3614311, 3615049, 3616524, 3618163, 3620190, 3623287]
57126C623287M470O157R050J3375J7845K1278K4054K6972K9785L2025L4466L8580
57114C881344M5109N4066O5382P8554R2420J06328J21075J37862J57131J79397
57104D918668K06581K41481K86341L42854M13160N00135O07326P39291R01617
57095I157454J100036J339653J624409J955096K326616K727822L144471L561153
57087B6936710L960145M319510M611816M802540M852319M729872M429805L975518
57079F2618235L399234K719885J945280J095031K15080o33067j395142k038128
57071F7926408k551245k941458l227006l428447l560482l629792l638370l587575
57063D1362033l480416l322886l124565k897839k655985k411295k173582j949445
$$ y = [3623287, 3627757, 3633914, 3642964, 3656339, 3674184, 3695462, 3719516, 3746488, 3776273, 3808298, 3842764, 3881344, 3926453, 3980519, 4045901, 4124455, 4216875, 4323203, 4444278, 4582140, 4739271, 4918668, 5125249, 5366730, 5653071, 5995925, 6409085, 6909220, 7516546, 8255837, 9157454, 10257490, 11597143, 13221552, 15176648, 17503264, 20231086, 23375557, 26936710, 30896855, 35216365, 39828181, 44630721, 49483040, 54212912, 58642717, 62618235, 66017469, 68737354, 70682634, 71777665, 71992745, 71359678, 69964536, 67926408, 65375163, 62433705, 59206699, 55778252, 52217770, 48587978, 44949608, 41362033, 37881617, 34558731, 31434166, 28536327, 25880342, 23469047, 21295465, 19346020]
57055A9346020j742795j556032j390210j244360j115861j002091r01355q12150
57047I581166p32485o60549n95487n37086m85058m38850l97791l61160l28461
57038E044239k99692k74954k53722k34812k17059j99793j82803j66202j50128
57029C065074j34222j17653r9801q0434n9248l6601j5422r54K974l260j6988l6534
57017B466931o0481q4835j03923j14713j18296j16894j11608j03568r4870q6869
57007A470874p9032p0642o2391n5190m8659m2049l5741l0613k6667k3358k0600
56996I75932j8519j6703j4668j2647j1164j0159r224q237p197n762l630j081J217
56983H58158K735L164K402O72j799n244r844j4658j7965j9037j8792j8353j7902
$$ y = [19346020, 17603225, 16047193, 14656983, 13412623, 12296762, 11294671, 10393316, 9581166, 8848681, 8188132, 7592645, 7055559, 6570501, 6131651, 5733860, 5372700, 5044239, 4744547, 4469593, 4215871, 3981059, 3764000, 3564207, 3381404, 3215202, 3065074, 2930852, 2813199, 2713398, 2632964, 2573716, 2537115, 2521693, 2520739, 2523713, 2520453, 2503465, 2466931, 2406450, 2321615, 2217692, 2102979, 1984683, 1867789, 1756181, 1652613, 1557743, 1470874, 1391842, 1321200, 1258809, 1203619, 1154960, 1112911, 1077170, 1046557, 1019890, 996532, 975932, 957413, 940710, 926042, 913395, 902231, 892072, 882848, 874611, 867414, 861652, 858022, 856941, 858158, 860893, 864057, 866459, 867131, 865332, 860088, 850244, 835586, 817621, 798584, 779792, 761439, 743537]
56970G43537j7280j6709j6216j5208j3321j0977q487n391j459K498N699Q585J1873
56957F67144J4915J6100J4688J1295O791J601l857q885j2935j5763j7203j7219
56945F56672j6281j5188j4305j3299j1724r594p237m716j634K410P195J1987J6295
56932F00581K0111K3163K4386K2747J8391J2342N310k411j0030j6250k0381k2756
56920F55203k3851k3801k2962k2046k1253j9975j7823j5343j3241j1490r722p993
56908D45703o698n985n638n241m352k891j449p11n73l23K91R11J480K382L556
56893D20462M440N079O321Q475J0737J2482J4146J6074J7381J6804J4109R968
56881E56478N014k43n046q724j1140j2395j2531j1863j0945r744p569m311r32
$$ y = [743537, 726257, 709548, 693332, 678124, 664803, 653826, 645339, 639948, 638489, 640987, 646686, 655271, 667144, 682059, 698159, 712847, 724142, 730933, 732534, 728677, 719792, 706857, 691094, 673891, 656672, 640391, 625203, 610898, 597599, 585875, 576281, 569044, 564328, 562694, 565104, 572299, 584286, 600581, 620692, 643855, 668241, 690988, 709379, 721721, 727031, 724620, 714590, 698340, 677959, 655203, 631352, 607551, 584589, 562543, 541290, 521315, 503492, 488149, 474908, 463418, 453696, 445703, 439005, 433020, 427382, 422141, 417789, 414898, 413449, 412738, 412165, 411842, 412133, 413044, 414524, 416906, 420462, 424902, 429981, 436302, 444777, 455514, 467996, 482142, 498216, 515597, 532401, 546510, 556478, 561492, 561249, 556203, 547479, 536339, 523944, 511413, 499550, 488605, 478861, 471292, 466981, 466049]
56868D66049J954N108R435J4520J9494K4651L0913L7924M3846M6973M6599M2457
56856G89923L4449K3257J0462k191j3270k1496k6024k7151k6207k4377k1822j8132
56844F77421j3282p854k338L587J0728J9276K8368L7240M6447N6951O7831P5744
56832A000119P7193P0777N7238L8377J6678m856k3670l8496m9032n5223n7405
56821A031700n6521n3498m8755m2649l5865k8800k1139j2762m419L266J0940J9726
56809G61224K9535L8848M5844M8961M6888L9090K6470J0858n971k2264l5787m4599
56797I39097m8529m9125m8010m5777m2407l8002l2922k7647k2614j7815j2689
56786E53560o812n34N496J1158J6548K1062K3464K2995J9772J4145O308l225j3157
$$ y = [466049, 468003, 473111, 482546, 497066, 516560, 541211, 572124, 610048, 653894, 700867, 747466, 789923, 824372, 847629, 858091, 855900, 842630, 821134, 795110, 767959, 741752, 717375, 695553, 677421, 664139, 656285, 653947, 657534, 668262, 687538, 715906, 753146, 799593, 856544, 924375, 1000119, 1077312, 1148089, 1205327, 1243704, 1260382, 1255526, 1231856, 1193360, 1144328, 1089105, 1031700, 975179, 921681, 872926, 830277, 794412, 765612, 744473, 731711, 727292, 730558, 741498, 761224, 790759, 829607, 875451, 924412, 971300, 1010390, 1036860, 1047718, 1041747, 1019483, 983696, 939097, 890568, 841443, 793433, 747656, 705249, 667247, 634325, 606678, 584064, 566249, 553560, 546748, 546214, 551710, 562868, 579416, 600478, 623942, 646937, 666709, 680854, 687162, 683937, 670780]
56773F70780k1809k7883l1018l1795l1184k9859k8025k5915k3968k2332k0647
56762C76345j8608j6392j4273j2283j0506r192q197o972n536m752n012n350m738
56749B54534l520k739k557k423k308k533k681j957o15J32k05q74j128j039q61
56734B29226n84m31q24j472j370l02N78K82n63o11L06J094J052P15Q91J511J879
56717B31377J726J489J522J565J239P57O17Q50J074J239J661K245K365J786J071
56702B52583P28N20N6n48j015j335j446j076m09k18p41j099o39r0m84j506j955
56685B41326j480p44j70L64P47O81M76P53J322J389R20P73J257J585J138L50j12
56668B50575k97n19o08k21M57R21J060J268J886K782L521L851L957M086M081L605
$$ y = [670780, 648971, 621088, 590070, 558275, 527091, 497232, 469207, 443292, 419324, 396992, 376345, 357737, 341345, 327072, 314789, 304283, 295091, 286894, 279922, 274386, 269634, 264622, 259272, 254534, 251014, 248275, 245718, 243295, 240987, 238454, 235773, 233816, 233201, 233333, 233128, 232254, 231126, 230087, 229226, 228642, 228211, 227387, 225915, 224545, 224243, 224821, 225103, 224540, 223929, 224235, 225329, 226381, 227096, 227987, 229498, 231377, 233103, 234592, 236114, 237679, 238918, 239675, 240292, 241142, 242216, 243455, 245116, 247361, 249726, 251512, 252583, 253311, 253831, 253887, 253339, 252324, 250989, 249543, 248467, 248058, 247840, 247099, 246000, 245361, 245271, 244787, 243281, 241326, 239846, 239102, 238932, 239296, 240043, 240724, 241200, 241953, 243275, 244664, 245584, 246357, 247614, 249199, 250337, 250687, 250575, 250278, 249759, 249151, 248930, 249387, 250308, 251368, 252636, 254522, 257304, 260825, 264676, 268633, 272719, 276800, 280405]
56652B80405K894K716L242L557K818J469N90M52M36J14l34p48j268j953k629l108
56636B88653l244k922k329j966j938j697r53l38m97j002j023o09m24n48n46m64
56620B68153o93j009q18k82j72n49p03l83j73m28q71j384k239l269l762l466k943
56603B45009k603k217j705j533j884k144j727q70k28n8j92m40o48o96o16n16m24
56586B26508l70m76n90j73R40J904J745O74j52r2N05J092J407J204L45p25j254
56569B32492j009k74Q42K409M044N071N331N364N787O969Q940J0986J1867J1208
56555C10027J0083R351Q135N326J916M5N0K34l65r11q43r96j990l037l305l171
56539C30549l193l074k535k216k715l530l803l457k902k384k126k431l057l213
$$ y = [280405, 283299, 286015, 289257, 292814, 295632, 297101, 297691, 298143, 298579, 298693, 298359, 297611, 296343, 294390, 291761, 288653, 285409, 282487, 280158, 278192, 276254, 274557, 273604, 273266, 272769, 271767, 270744, 270135, 269711, 269163, 268617, 268153, 267460, 266451, 265633, 265351, 265179, 264630, 263927, 263544, 263371, 262943, 262072, 260688, 258449, 255180, 251418, 247952, 245009, 242406, 240189, 238484, 236951, 235067, 232923, 231196, 230326, 230098, 230040, 229848, 229408, 228760, 228064, 227448, 226932, 226508, 226138, 225662, 225072, 224899, 225839, 227743, 229488, 230162, 230010, 229918, 230423, 231515, 232922, 234126, 234471, 233746, 232492, 231483, 231209, 232051, 234460, 238504, 243575, 248906, 254270, 260057, 267026, 275966, 286952, 298819, 310027, 320110, 329461, 337596, 342922, 344838, 344883, 344933, 345167, 344802, 343891, 343048, 342052, 340062, 337025, 333720, 330549, 327356, 324282, 321747, 319531, 316816, 313286, 309483, 306026, 303124, 300740, 298614, 296183, 293126, 289913]
56525B89913k707k266k274k072j181k69j54n37n79j61J84J67r2m65r16j389j826
56508B73376k065j770r12k05k24m34j8N21Rj221j457k21Q83O15k34n01m36p17
56490B64989r51n18J39K93K38N71R54P12Q9j93j22j13j13R7K11o4k56J84Q82J056
56470B68085P05M54O32J145J860K427K316J562J001J103J262Q79L54K24J16m47
56454B83678q95l95O94J223Q04N8m27n02j09O26J174J132P92O07M94K10l1J8J01
56435B89252l1m2L68P45N65J38J10M19M82N8o16j269j588j224l15M96R46J438
56417B89932J963J645P8j708k465k247j844j493j074r40j390j786j231J57J621
56402B79218K920M168M922M602L642L184L586M167M324M169L915L347K120K56
$$ y = [289913, 287206, 284940, 282666, 280594, 279413, 279144, 278990, 278453, 277874, 277713, 277897, 278064, 277972, 277507, 276591, 275202, 273376, 271311, 269541, 268629, 268424, 268200, 267766, 267748, 268269, 268278, 267057, 265600, 265379, 266262, 266877, 266643, 266142, 265706, 264989, 264038, 263520, 263659, 263952, 264190, 264761, 265715, 266427, 266516, 266323, 266201, 266088, 265975, 266072, 266283, 266219, 265963, 266147, 267029, 268085, 268790, 269244, 269876, 271021, 272881, 275308, 277624, 279186, 280187, 281290, 282552, 283431, 283785, 284009, 284125, 283678, 282783, 282388, 283082, 284305, 285109, 285167, 284740, 284238, 284129, 284755, 285929, 287061, 287853, 288460, 288954, 289164, 289133, 289151, 289252, 289221, 289179, 289547, 290292, 290857, 290995, 291105, 291524, 292006, 292064, 291448, 290179, 288591, 287367, 287052, 287548, 288494, 289932, 291895, 293540, 293618, 291910, 289445, 287198, 285354, 283861, 282787, 281847, 280457, 278671, 277440, 277597, 279218, 282138, 286306, 291228, 295830, 299472, 302656, 306242, 310409, 314733, 318902, 322817, 326164, 328284, 328540]
56388C28540j709l000l267l006l011l377l631l687l837l750k690r13L61P12R15
56373B94650J126L49j469k454j258Q31J715J279R07J165J567J887K172J933P31
56358C05131p71j540j511j231q18k27J50K42Q22K133K963K359J259J027J376J302
56342C12666J141J849K982L343L034L002L068K400J542J909L374M322M189L985
56328C52806M212M035K992J892J567J999K831L632L559K106K54m15K52R94J106
56313C83822J022J048Q20K50k54n00m60K46J668K708K392J576J840L013L524L048
56297D05763K858L502M015L847L750M237M678M552M308M395M556M537M495M482
56283D63975M414M663N674P019P872Q274Q741Q971Q379P641Q024R272R907R736
$$ y = [328540, 326831, 323831, 320564, 317558, 314547, 311170, 307539, 303852, 300015, 296265, 293575, 292662, 293023, 293735, 294650, 295776, 296125, 294656, 292202, 290944, 291775, 293490, 294769, 295676, 296841, 298408, 300295, 302467, 304400, 305131, 304360, 302820, 301309, 300078, 299260, 299033, 299183, 299425, 300247, 302380, 305343, 307702, 308961, 309988, 311364, 312666, 313807, 315656, 318638, 321981, 325015, 328017, 331085, 333485, 335027, 336936, 340310, 344632, 348821, 352806, 357018, 361053, 364045, 365937, 367504, 369503, 372334, 375966, 379525, 381631, 381885, 381470, 381722, 382716, 383822, 384844, 385892, 386712, 386962, 386708, 386208, 385748, 385994, 387662, 390370, 392762, 394338, 396178, 399191, 402715, 405763, 408621, 412123, 416138, 419985, 423735, 427972, 432650, 437202, 441510, 445905, 450461, 454998, 459493, 463975, 468389, 473052, 478726, 485745, 493617, 501891, 510632, 519603, 527982, 535623, 543647, 552919, 562826, 572562]
56269E72562J0190J1867J3640J4703J5776J7542J9365K0518K1486K3250K6150
56258G67049K9981L4351L8615M2357M6207N1359N8075O5530P3144Q1116Q9623
56247A377407R8455J07369J15932J23279J29034J33916J38269J40602J39103J34003
56237B637369J26631J16765J03058Q5799O6944M7334K6168L549j8576l8586n6366
56226C100089p1855q4315r3680j00992j06836j10830j12912j13604j12763j09825
56216B082477j05443j01114r7005r2011q6190q0978p6687p1971o6355o1106n6906
56205A186711n2779m8102m3648l9821l5837l1583k8315k6549k5039k2800k0393
56194H11845j8416j6514j4714j3893j3946j3302j1240r007p717o831n592m345
$$ y = [572562, 582752, 594619, 608259, 622962, 638738, 656280, 675645, 696163, 717649, 740899, 767049, 797030, 831381, 869996, 912353, 958560, 1009919, 1067994, 1133524, 1206668, 1287784, 1377407, 1475862, 1583231, 1699163, 1822442, 1951476, 2085392, 2223661, 2364263, 2503366, 2637369, 2764000, 2880765, 2983823, 3069622, 3136566, 3183900, 3210068, 3213617, 3195041, 3156455, 3100089, 3028234, 2943919, 2850239, 2749247, 2642411, 2531581, 2418669, 2305065, 2192302, 2082477, 1977034, 1875920, 1778915, 1686904, 1600714, 1519736, 1443049, 1371078, 1304723, 1243617, 1186711, 1133932, 1085830, 1042182, 1002361, 966524, 934941, 906626, 880077, 855038, 832238, 811845, 793429, 776915, 762201, 748308, 734362, 721060, 709820, 700813, 693096, 686265, 680673, 676328]
56182F76328l503k777k182k185k378j683m00rn10j76J397K463K205K129L229M237
56166F76185M083L777M332M949M953N362O944Q541R079R374J0364J1301J1356
56153G70600J1399J2548J4447J6409J8773K1844K5080K8581L3665M0748M8400
56142A042494N5741O3885P3671Q3852R2779R9987J04774J05396J01281R4170Q5794
56131B003824P6482O7278O0727N7657N5339N0867M4356L7052K8752J9260J0291
56120B511885L449k101p981j4394k1378l0290m1851n4480o6458p7827q8287r5394
56108B014893r7265r5161r1229q5507p7464o8444o0116n2141m3735l5876k9705
56097A278250k4465j9187j4732j2025j0120q065o724o575n881l442r73k59j10
$$ y = [676328, 672825, 670048, 667866, 665681, 663303, 661620, 661220, 661211, 660701, 660525, 661922, 664385, 666590, 668719, 671948, 676185, 680268, 684045, 688377, 693326, 698279, 703641, 710585, 719126, 728205, 737579, 747943, 759244, 770600, 781999, 794547, 808994, 825403, 844176, 866020, 891100, 919681, 953346, 994094, 1042494, 1098235, 1162120, 1235791, 1319643, 1412422, 1512409, 1617183, 1722579, 1823860, 1918030, 2003824, 2080306, 2147584, 2208311, 2265968, 2321307, 2372174, 2416530, 2453582, 2482334, 2501594, 2511885, 2515334, 2513233, 2505252, 2490858, 2469480, 2439190, 2397339, 2342859, 2276401, 2198574, 2110287, 2014893, 1917628, 1822467, 1731238, 1645731, 1568267, 1499823, 1439707, 1387566, 1343831, 1307955, 1278250, 1253785, 1234598, 1219866, 1207841, 1197721, 1189656, 1182932, 1176357, 1170476, 1167034, 1166061, 1165802, 1165692]
56084A165692J260K945L255K923L532M648N197N829P300Q466Q477Q883J0854J2672
56070A251933J2768J2844J4787J6965J7030J6147J6809J8500J9177J9229K0298
56059A436487K1888K2640K3255K4705K5399K3687K1325K0866K1505K1116K0368
56048A683241K0987K1855K0952J9395J9585K0971K1519K1744K3339K5515K6574
56037A925677K7429K9669L2074L2879L3445L5698L8186L8802L9098M1487M4541
56026B318985M5636M5873M7637M9772N0113N0342N3180N7144N9367O1056O4683
56015B903788O8460O9447O9612P2722P7596Q0727Q3125Q8122R4642R9217J02499
56004C809957J07288J12456J15539J18690J25206J32888J38041J42988J51904
$$ y = [1165692, 1166952, 1169897, 1173152, 1176075, 1179607, 1184255, 1189452, 1195281, 1202581, 1211047, 1219524, 1228407, 1239261, 1251933, 1264701, 1277545, 1292332, 1309297, 1326327, 1342474, 1359283, 1377783, 1396960, 1416189, 1436487, 1458375, 1481015, 1504270, 1528975, 1554374, 1578061, 1599386, 1620252, 1641757, 1662873, 1683241, 1704228, 1726083, 1747035, 1766430, 1786015, 1806986, 1828505, 1850249, 1873588, 1899103, 1925677, 1953106, 1982775, 2014849, 2047728, 2081173, 2116871, 2155057, 2193859, 2232957, 2274444, 2318985, 2364621, 2410494, 2458131, 2507903, 2558016, 2608358, 2661538, 2718682, 2778049, 2839105, 2903788, 2972248, 3041695, 3111307, 3184029, 3261625, 3342352, 3425477, 3513599, 3608241, 3707458, 3809957, 3917245, 4029701, 4145240, 4263930, 4389136, 4522024, 4660065, 4803053, 4954957]
55995D954957J62482J70084J76888J88038K01899K13541K24788K40815K59775
55986F793267K76232K92116L13287L38083L60818L83917M14418M50918M86775
55977A0109831N23652N68517O19681O70293P23535P89329Q68076R53467J049134
55968A6875515J165743J303945J458514J637149J856019K119910K428738K801107
55960C1646640L268337L850210M565774N464940O615415Q057027R801854J1878171
55952H5148368J4339353J7240421K0644856K4586960K8842036L2635268L4707174
55945B58144436L3886910K9722317K2614749J3486537L452570o295018j4623373
55938C40389128k0764180k4541991k6271801k6453976k5564147k4006236k2097814
$$ y = [4954957, 5117439, 5287523, 5464411, 5652449, 5854348, 6067889, 6292677, 6533492, 6793267, 7069499, 7361615, 7674902, 8012985, 8373803, 8757720, 9172138, 9623056, 10109831, 10633483, 11202000, 11821681, 12491974, 13215509, 14004838, 14872914, 15826381, 16875515, 18041258, 19345203, 20803717, 22440866, 24296885, 26416795, 28845533, 31646640, 34914977, 38765187, 43330961, 48795901, 55411316, 63468343, 73270197, 85148368, 99487721, 116728142, 137372998, 161959958, 190801994, 223437262, 258144436, 292031346, 321753663, 344368412, 357854949, 361307519, 355012501, 340389128, 319624948, 295082957, 268811156, 242357180, 216793033, 192786797, 170688983]
55931A70688983k0041065j7943606j5883345j3934511j2144677j0529627r099177
55924G1112975p863094o811197n913994n147715m500455l954902l486426l080332
55916C0354860k733197k436049k172845j936523j730463j552633j392866j247036
55908A5153248j119735j011197r14397q26562p51278o87659o29028n73784n26633
55899H112975m87619m50450m13159l80262l52893l26491k99855k77058k58668
55890D866520k40004k19859k02333j88374j73861j57796j44211j34000j22871
55881C283211j09614r8853r3129q9277q5008q2466q2723q2997q1710q0684q0300
55870B316450p8059p3843p1051p0637o9298o5370o1342n8769n5861n1828m8630
$$ y = [170688983, 150647918, 132704312, 116820967, 102886456, 90741779, 80212152, 71112975, 63249881, 56438684, 50524690, 45376975, 40876520, 36921618, 33435192, 30354860, 27621663, 25185614, 23012769, 21076246, 19345783, 17793150, 16400284, 15153248, 14033513, 13022316, 12107919, 11281357, 10530079, 9842420, 9213392, 8639608, 8112975, 7625356, 7174906, 6761747, 6381485, 6028592, 5702101, 5402246, 5125188, 4866520, 4626516, 4406657, 4204324, 4015950, 3842089, 3684293, 3540082, 3406082, 3283211, 3173597, 3074744, 2981615, 2892338, 2807330, 2724864, 2642141, 2559144, 2477434, 2396750, 2316450, 2238391, 2164548, 2093497, 2022860, 1953562, 1888192, 1826850, 1768081, 1712220, 1660392, 1611762]
55859A611762m6671m3586l9111l6287l6168l5900l3884l2240l2268l2036l0410
55848A213201k9291k9777l0062k9023k8138k8072k7135k4780k2989k2563k1674
55837I19697j9600j8279j8521j8335j6642j5093j4555j3363j0882r242r669j0261
55825G45255r412q372q473q784q405q352r302j0026r771r698j0402j0563r570
55812F24125q921r424r541q108o293n340m601l392k467k195j361P07K801L845
55798E69835M299M476L591J622M1m44r46k213l477m263n246o337o275m908l813
55783E45942l725l694l584m757p269q957q740q344r320j0563j0276q411n830k962
55769D49510m82N36L05M02J313J859J675J919K732K444M50j673k945m422o650
$$ y = [1611762, 1565091, 1521505, 1482394, 1446107, 1409939, 1374039, 1340155, 1307915, 1275647, 1243611, 1213201, 1183910, 1154133, 1124071, 1095048, 1066910, 1038838, 1011703, 986923, 963934, 941371, 919697, 900097, 881818, 863297, 844962, 828320, 813227, 798672, 785309, 774427, 765185, 755516, 745255, 735843, 727471, 718998, 710214, 701809, 693457, 684155, 674129, 664358, 654660, 644258, 633695, 624125, 615204, 605780, 596239, 588131, 581838, 576498, 571897, 568505, 566038, 563843, 562482, 563189, 565990, 569835, 574134, 578610, 582201, 583823, 583864, 583420, 582474, 580261, 576784, 572521, 567275, 560938, 554663, 549755, 545942, 542217, 538523, 534939, 530182, 522913, 513956, 505216, 496872, 487552, 476989, 466713, 458302, 452472, 449510, 449028, 449564, 449869, 450271, 451584, 453443, 455118, 457037, 459769, 462213, 462663, 460990, 458045, 453623, 446973]
55754D46973q355r006j0058j2027j2988j1782j0212j0097j0447r715q585q292
55742C25409q080o724m951m148m016l533k894k673k389j674j464k315k957k289
55728B75302j417j847l003l405l120l206l797m395n041n638n235l512j796j243
55714B28647j132m33L95O80J112K294L117K468J361J457K463K844K206J193Rj288
55698B47393j882j370r42j796l241l904l834l782l440k255j025q13j055n75K77
55683B17756L89O2N66J960L180L817M235M285L618K750K358J959P81o13j165j135
55667B44803j423j721j130j75l00j549k493k425j941j482q80l44l39m45K24J427
55651B29807J938J348M29k80r69j591j700j468j724k747l894m528m581m180l533
$$ y = [446973, 438618, 429612, 419554, 407527, 394539, 382757, 372545, 362448, 352001, 342286, 333701, 325409, 317329, 310605, 305654, 301506, 297490, 293957, 291063, 288390, 286001, 284327, 282863, 280548, 277591, 275302, 273885, 272038, 269035, 265630, 262510, 259304, 255507, 251112, 246071, 240433, 235198, 231686, 229890, 228647, 227515, 227082, 227477, 228157, 229269, 231563, 234680, 237148, 238509, 239966, 242429, 245273, 247479, 248672, 248681, 247393, 245511, 244141, 243199, 241403, 238162, 234258, 230424, 226642, 223202, 220947, 219922, 219109, 218054, 217479, 217756, 218145, 218207, 218773, 220733, 223913, 227730, 231965, 236250, 239868, 242618, 244976, 246935, 247716, 247103, 245938, 244803, 243380, 241659, 240529, 240354, 240054, 238505, 236012, 233587, 231646, 230164, 229284, 228940, 228601, 228156, 228380, 229807, 231745, 233093, 233522, 233242, 232273, 230682, 228982, 227514, 225790, 223043, 219149, 214621, 210040, 205860, 202327]
55636B02327l123l266l588l559l317l286l381l298l107k872k269j318q03j063
55622A64077j157k88P18O12l61j066j309j577j622r84m44j186k677l118k056q96
55606A46666o27o86m35k90p99j663k321k595k416j668o47n5k25q72j596k088j996
55589A25687j218k72K87N42P36N85k06j126j474j390j358j118k00Q96J314J341
55573A23026K001L276M043L835L357L135K821K160J485J018N35Ml64q39j968l458
55557A44067m147l522k354j509q68Q6J236J908J674Q29J36J66O86R16O12M45R04
55540A41265J416J167L74r7nK51N03Q27R00L60l40l48L80J079J250J014N24j96
55522A50324r36j489j960k327k111j258p53j409k492k723k169j916k142j959j132
$$ y = [202327, 199204, 195938, 192350, 188791, 185474, 182188, 178807, 175509, 172402, 169530, 167261, 165943, 165140, 164077, 162920, 162632, 163350, 163962, 163601, 162535, 161226, 159649, 158027, 157043, 156599, 155413, 152736, 149618, 147562, 146666, 146039, 145353, 144918, 144628, 143829, 142166, 139845, 137250, 134834, 133166, 132519, 132464, 132239, 131367, 129771, 127683, 125687, 124469, 124197, 124484, 125026, 125762, 126347, 126141, 125015, 123541, 122151, 120793, 119675, 119475, 120371, 121685, 123026, 125027, 128303, 132346, 136181, 139538, 142673, 145494, 147654, 149139, 150157, 150692, 150696, 150332, 149493, 147525, 144067, 139920, 136398, 134044, 132535, 131667, 131753, 132989, 134897, 136571, 137400, 137536, 137702, 138388, 139304, 139916, 140361, 141265, 142681, 143848, 144222, 144125, 144120, 144371, 144874, 145701, 146601, 146961, 146621, 146273, 146653, 147732, 148982, 149996, 150520, 150324, 149388, 147899, 145939, 143612, 141501, 140243, 139490, 138081, 135589, 132866, 130697, 128781, 126639, 124680, 123548]
55507A23548n27o68j031j048p98m81j91l53j417k956l913l927l520k950j887l85
55491I7496P83J112Q84N48K86L10P85J352J357P37L8l64m49k17J01j95j397k592
55473A00575k718k098j852k037j722p18J56N42Q80J187Q37j19p18n13o7J59L13
55456I2087L37j61q90r83m08l5j02J31Q50J223R45Q31J247J295L52q11j271j242
55438I3395j241j041l67K51K48j2J55P33J250J458J324R13O08P46Q42N7j337k072
55420I5910j787j549j927k001j031K01O91O98Q47R08N21K07M30N88R1l75M1P87
55402I3250P47N1l58l85o12q70m66L64O07J02k18J47O31O38K94n4k58j56L39Q21
55382I4614P13J24k67k03r9k54m70n98q24j201j371r92j75O78J255J492J544J573
$$ y = [123548, 123021, 122353, 121322, 120274, 119476, 118995, 118804, 118451, 117034, 114078, 110165, 106238, 102718, 99768, 97881, 97496, 98279, 99391, 100275, 100823, 101109, 101419, 102204, 103556, 104913, 105650, 105688, 105324, 104875, 104658, 104759, 104564, 103167, 100575, 97857, 95759, 93907, 91870, 90148, 89430, 89586, 90128, 91008, 92195, 93032, 92913, 92195, 91682, 91615, 91774, 92087, 92424, 92263, 91373, 90390, 89982, 89947, 89845, 89976, 90826, 92049, 92994, 93825, 95072, 96367, 96719, 95908, 94637, 93395, 92154, 91113, 90746, 90997, 91245, 91233, 91388, 92121, 93371, 94829, 96153, 97066, 97674, 98420, 99262, 99319, 97982, 95910, 94123, 92574, 90647, 88646, 87615, 87816, 88507, 89205, 90052, 90960, 91481, 91688, 92118, 92706, 92797, 92422, 92463, 93250, 93997, 94048, 93690, 93305, 92693, 91823, 91357, 91721, 92328, 92430, 92212, 92359, 92990, 93628, 93922, 93868, 93610, 93454, 93793, 94614, 95327, 95451, 95184, 94981, 94882, 94628, 94158, 93560, 92736, 91535, 90164, 89172, 88997, 89675, 90930, 92422, 93966, 95539]
55364I5539J475J009L48R0M97R96Q58J48m46m83j27J72R1l57p12m90J49M56R0
55345I9303l99m06p6J36K75O14R41P85J27n98j051j136p79o7N73P52N44K39j09
55326I9668n08p57p08n68n34m06M7N82P80N75J84k14m12j80L03M25k1m24k70K1
55306I7583j76o20o54l54l50o43m59N40J647J904J050l80j541j746r13L69J315
55289I6572J545J125L31l79n34j43J62m8m07l65j05k16o87q76m70J01L27K25J81
55270I6339M49R04J159R55M75J06r0l38m96r9P37J110N88J6L95J433J968J498
55252A07109M90n07j240j434r29k03J0l08n05k11K92O93R00P09p7j070j526j269
55234A00924q47n75j08P56J499J509Q84J77l43q00j266j556j425q01Q7P23O43
$$ y = [95539, 97014, 98023, 98371, 98461, 98958, 99954, 100812, 100960, 100514, 100031, 99904, 100076, 100167, 99810, 99098, 98608, 98757, 99213, 99303, 98904, 98498, 98422, 98558, 98833, 99447, 100388, 101173, 101300, 100702, 99651, 98515, 97736, 97669, 98242, 98994, 99538, 99777, 99668, 99160, 98403, 97695, 97127, 96593, 96187, 96234, 96816, 97596, 98171, 98355, 98141, 97729, 97549, 97852, 98277, 98256, 97832, 97562, 97583, 97407, 96787, 96133, 95779, 95429, 94786, 94327, 94867, 96514, 98418, 99468, 99088, 97547, 95801, 94888, 95257, 96572, 98117, 99242, 99573, 99194, 98660, 98517, 98679, 98631, 98224, 97859, 97754, 97538, 96851, 95975, 95505, 95606, 95933, 96158, 96339, 96788, 97692, 98851, 99806, 100281, 100387, 100297, 99959, 99463, 99364, 100101, 101211, 101799, 101815, 102210, 103643, 105611, 107109, 107599, 107092, 105852, 104418, 103489, 103286, 103296, 102988, 102483, 102272, 102564, 103257, 104157, 104866, 104789, 103719, 102193, 100924, 100077, 99502, 99394, 100150, 101649, 103158, 104042, 104219, 103876, 103076, 101810, 100254, 98829, 98028, 98115, 98838, 99481]
55217I9481n0o53m67M69J377J488Q35J85J69O05Q30N80J49j60k87j33M16R56P34
55198A06524l30j283j275n87j12j97n28p68p19k30N26R15N49q0k08J59L85J74
55180A02915j37j30K69Q20J098Q00K56K20P90J040L24o64q90m97l72n81m31J01
55162A04931K54j51l30J30N55K24n97j102q53M2J118J691J343M56j78l52n07q33
55144A05841r57o66j76M38J308K085J983R24k12p54r69j147q87N2R08P54k01r37
55126A07387r14m07J50N00M59P3j87N1N00O64O12P75J140J262J045Q62Q49O86
55108A15507K27j56j55K8N8l7r1j63l40m30k20P5R5o2J3L19M01K04L44J170K041
55087A18828K114J423O37No70j158q56J29Q41P22K68M4j32n03o48j67M84O69N82
$$ y = [99481, 99431, 98778, 98311, 98780, 100157, 101645, 102480, 102665, 102834, 103439, 104269, 104849, 104998, 104838, 104551, 104418, 104834, 105790, 106524, 106194, 104911, 103636, 103049, 102937, 102740, 102212, 101444, 100725, 100495, 101021, 101936, 102485, 102405, 102197, 102356, 102741, 102915, 102778, 102648, 102917, 103737, 104835, 105635, 105891, 106111, 106901, 107941, 108265, 107601, 106711, 106214, 105842, 105261, 104830, 104931, 105185, 105034, 104704, 104834, 105389, 105613, 105016, 103914, 103061, 103103, 104221, 105912, 107255, 107711, 107533, 107181, 106674, 105841, 104884, 104218, 104042, 104480, 105788, 107873, 109856, 110780, 110568, 109814, 108845, 107698, 106811, 106863, 107771, 108525, 108324, 107387, 106473, 106066, 106216, 106716, 107175, 107248, 107061, 107112, 107612, 108276, 108888, 109663, 110803, 112065, 113110, 113972, 114821, 115507, 115734, 115578, 115423, 115451, 115509, 115472, 115381, 115218, 114878, 114448, 114228, 114303, 114398, 114336, 114349, 114668, 115069, 115273, 115617, 116787, 118828, 120942, 122365, 123002, 123007, 122337, 121179, 120323, 120452, 121293, 122015, 122283, 122327, 122195, 121692, 121044, 120877, 121361, 122030, 122612]
55068A22612P50R41M91m91j222j382j288r92k13Q00J213O85j75o79p05m05K1J37
55050A20098l96j101j025j18N39K11m92o44l16k03l76k62L20P73M99k98q25n98
55032A15786N2M38M31N83J161J515R40j73q02p34p16j128j417j122o25m31l69
55015A13389m3M28O42N24L02J58J77M53Q98J307J645J958J937J178jo76m93r8
54997A23685o5j65o9k1k02j42N11J257J492J428J488J389P41N6N0K86k17j240
54979A30262j469n65K44J4o02n63OL34L33M57O98O30K92J55K85K83J66M60J191
54960A32611J522Q19l86r93n77L98J284J647J249K05q22j171r31o96o24l52J17
54943A33300K10k52o27m10K0J23R3L13N30L55J70N58J201J318J018J099J529J403
$$ y = [122612, 123362, 124303, 124794, 124303, 123081, 121699, 120411, 119419, 119206, 120006, 121219, 121904, 121729, 121050, 120345, 119940, 119961, 120098, 119702, 118601, 117576, 117458, 117997, 118208, 117716, 117072, 116756, 116553, 116177, 115915, 116235, 117008, 117507, 117209, 116384, 115786, 115838, 116276, 116707, 117290, 118451, 119966, 120906, 120733, 119931, 119197, 118481, 117353, 115936, 114814, 114189, 113758, 113389, 113346, 113774, 114416, 114940, 115242, 115400, 115577, 116030, 116928, 118235, 119880, 121838, 123775, 124953, 124952, 124276, 123783, 123685, 123620, 123455, 123386, 123365, 123163, 123021, 123532, 124789, 126281, 127709, 129197, 130586, 131327, 131383, 131433, 131719, 131502, 130262, 128793, 128228, 128472, 128486, 127884, 127321, 127327, 127661, 127994, 128451, 129149, 129779, 130071, 130226, 130511, 130794, 130960, 131420, 132611, 134133, 134952, 134566, 133573, 132996, 133394, 134678, 136325, 137574, 137779, 136957, 135786, 134855, 134159, 133535, 133183, 133300, 133510, 133258, 132631, 132221, 132241, 132364, 132457, 132770, 133300, 133655, 133825, 134383, 135584, 136902, 137920, 139019, 140548, 141951]
54925A41951O06L34J410L052M077M491N135O291P450Q108Q116P603O963O628O323
54910B18538N031K312p94k859l788m656o011p140p205o394n640n533n822n800
54896A64239n034l747k534j730j217q44o94p51o94l24N1J08J04N28J304J824J849
54879A52438J880K479L531M445M957N463O443P660Q194P419N742M087K825J552
54865B19115n8j775l323m812o347p542p850p184o036n006m414m173l947l617l506
54850A49525l883m299l978k937k050j814j713j151l65J08K70L70K41k86p44n19
54834A26775J35M05J02j26J44N24M33j28o59o93j38O45J045P13o6o41o33j59M02
54815A28080O74M25k58r40j169q14o8P09J107R54N87N50Q77J061Q36N83O62Q34
$$ y = [141951, 142557, 142891, 144301, 147353, 151430, 155921, 161056, 167347, 174797, 182905, 191021, 198624, 205587, 212215, 218538, 223569, 225881, 225087, 222228, 218440, 213784, 207773, 200633, 193428, 187034, 181394, 175861, 170039, 164239, 159205, 155458, 152924, 151194, 149977, 149133, 148439, 147688, 146994, 146670, 146721, 146829, 146933, 147461, 148765, 150589, 152438, 154318, 156797, 160328, 164773, 169730, 175193, 181636, 189296, 197490, 204909, 210651, 214738, 217563, 219115, 219057, 217282, 213959, 209147, 202800, 195258, 187408, 180224, 174188, 169182, 164768, 160595, 156648, 153031, 149525, 145642, 141343, 137365, 134428, 132378, 130564, 128851, 127700, 127335, 127443, 127713, 128083, 128324, 128038, 127294, 126775, 126910, 127315, 127417, 127291, 127435, 127959, 128392, 128264, 127605, 126912, 126774, 127419, 128464, 129177, 129111, 128470, 127837, 127678, 128080, 128754, 129179, 128921, 127981, 126812, 125998, 125930, 126639, 127746, 128700, 129287, 129837, 130714, 131775, 132611, 133194, 133856, 134690]
54797A34690P44N13M05L14O7j26m4M2k14n86n68j02M58Q63J038R18O90Q24J330
54778A41256J432O96m0L36J548K278K041J663J897K514L042L484L971M422M902
54763A75442N748O960P917Q051P382O221M728K950R76j112l112m583n229n404
54749B06935n652n866n506m669m150m226m163l296j996j115r75j267j538j440
54735A61076r35n34q99j837k227j325L41J689K290K410K372K453L032M216N474
54720A77596O204O463O658O790O514N834N076M169K593K59k115l770m715n436
54706B12120o102o390o094n487n000m715m345l695k964k518k444k451k174j574
54692A56167j036j065j811k772l153k582j473n72k41k82l07r7K73N04L11k37p71
$$ y = [134690, 135434, 135947, 136352, 136666, 136733, 136607, 136563, 136605, 136391, 135805, 135237, 135135, 135593, 136456, 137494, 138412, 139102, 139926, 141256, 142688, 143384, 143344, 143680, 145228, 147506, 149547, 151210, 153107, 155621, 158663, 162147, 166118, 170540, 175442, 181190, 188150, 196067, 204118, 211500, 217721, 222449, 225399, 226375, 225263, 222151, 217568, 212339, 206935, 201283, 195417, 189911, 185242, 181092, 176866, 172703, 169407, 167411, 166296, 165321, 164054, 162516, 161076, 160141, 159607, 158708, 156871, 154644, 153319, 153660, 155349, 157639, 160049, 162421, 164874, 167906, 172122, 177596, 183800, 190263, 196921, 203711, 210225, 216059, 221135, 225304, 227897, 228156, 226041, 222271, 217556, 212120, 206018, 199628, 193534, 188047, 183047, 178332, 173987, 170292, 167328, 164810, 162366, 159915, 157741, 156167, 155131, 154066, 152255, 149483, 146330, 143748, 142275, 141703, 141462, 141180, 140873, 140776, 141049, 141553, 141864, 141627, 140856]
54675A40856j063j277j573j722j396o48J68P98J084P95r1j049j397j071o23m90
54659A31301n83o18m40l7M88R08J092J195J364J418J190Q99Q19P12J83n43q53
54642A38495o94o25q70r62n50J13O92J205J605J445M04j116k227k252j204J69
54626A33628Q21L38n64q70n07k30l87n44l32N7M48R38J318J062K65j88J89Q37
54608A36279J122J202J349J223N43k01m92o34j052j270n95N67J128Q50M92M52
54592A40963K52m43j083r29M0J116J507R38j26q26q16o08p72j058q22l0P68J256
54574A39327J449J177K74p67j127q16p02j186j586j206l20L53O38Q21R66Q58M86
54557A38639R0j42j53J40P57J382J448O29o87j493r75N95J914J920R14Q0L5M00
$$ y = [140856, 139793, 138516, 136943, 135221, 133825, 133177, 133345, 134143, 135227, 136022, 135931, 134882, 133485, 132414, 131791, 131301, 130718, 130100, 129660, 129623, 130111, 131019, 132111, 133306, 134670, 136088, 137278, 138177, 138996, 139708, 139891, 139348, 138495, 137801, 137176, 136306, 135344, 134794, 134907, 135599, 136804, 138409, 139854, 140258, 139142, 136915, 134663, 133459, 133628, 134449, 134787, 134223, 133353, 132846, 132616, 132229, 131685, 131353, 131410, 131858, 132796, 134114, 135176, 135441, 135253, 135442, 136279, 137401, 138603, 139952, 141175, 141718, 141517, 141025, 140391, 139339, 138069, 137474, 138041, 139169, 140019, 140511, 140963, 141215, 140772, 139689, 138760, 138800, 139916, 141423, 142361, 142235, 141409, 140593, 139985, 139213, 138155, 137333, 137303, 138071, 139327, 140776, 141953, 142227, 141460, 140333, 139517, 138815, 137629, 136043, 134837, 134517, 134870, 135508, 136329, 137295, 138153, 138639, 138729, 138587, 138434, 138574, 139331, 140713, 142161, 142790, 142103, 140610, 139635, 140230, 142144, 144064, 144978, 145058, 145093, 145493]
54539A45493P48J245K042K669K643K247K105K214K012J313N38k8n84j181j352
54524A62124p89LK80P0K2L05K26p55k144k902k596j720r84o77n90k89M93J445
54506A51522J754R55l77j170j044n37j81L2J70K0m10o77n54m40n72l73O94J964
54488A50776K140R47n11j168j104j013j207j476j520j135j95J117K170K269J312
54473A51402Ko01P6J561K633K415J212J52pN43J133J339J129O97L48L71O98P67
54455A65870Qj448k661k653j392R9P75O39N64J051J505J061j69j166j233p17l68
54438A59765m04m53k37P4J88J50K30M54M59K6m57m15J29N58N08K94K97M27M59
54419A62052M76N75N14J53j01J30M38J32o65j104q30l64k02k08j31j07k73l67
$$ y = [145493, 146241, 147486, 149528, 152197, 154840, 157087, 159192, 161406, 163418, 164731, 165269, 165241, 164657, 163476, 162124, 161335, 161338, 161618, 161688, 161710, 162015, 162241, 161486, 159342, 156440, 153844, 152124, 151140, 150463, 149873, 149584, 150077, 151522, 153276, 154231, 153854, 152684, 151640, 151103, 150922, 150954, 151124, 151144, 150734, 150057, 149503, 149063, 148491, 148118, 148812, 150776, 152916, 153863, 153352, 152184, 151080, 150067, 148860, 147384, 145864, 144729, 144534, 145651, 147821, 150090, 151402, 151404, 150803, 150879, 152440, 155073, 157488, 158700, 158852, 158845, 159388, 160521, 161860, 162989, 163686, 164034, 164405, 165103, 165870, 165878, 164430, 161769, 159116, 157724, 157823, 158598, 159237, 159801, 160852, 162357, 163418, 163249, 162083, 160850, 160133, 159765, 159361, 158908, 158671, 158745, 158933, 159083, 159313, 159767, 160226, 160252, 159795, 159380, 159509, 160067, 160575, 160869, 161166, 161593, 162052, 162528, 163103, 163617, 163770, 163669, 163799, 164237, 164369, 163704, 162600, 161770, 161406, 161204, 160996, 160865, 160758, 160485, 160118]
54401A60118p5M94R80J136R54O22M81O58P76M72J78P21K002K827K389J225K32
54384A76190n47j448k125j867p24M79J136J177O39l10r98p91m0K34k24n74j99
54367A70008M23N83L50J88J28o0k42j38P7M5q0J62O97Q86M80J8R3N76Q69O41Q8
54346A75792l48l31J31O52Q07O28O13J089J805K308K556K799K999K794K116J505
54330A97915J499J942K148J702Q19r0r08j758k645l409l923m121l864l076k060
54315A80171j331j065r24o28l80m55o84p54p95j127j536j428p57k01k03m33n11
54298A66959o66j152j543j325q10p14r21n38O92J809J839J013L29K65M44M16K40
54281A66337K21M62Q62J327J733J742J052j13r86j058o13j69L93J441K530K574
$$ y = [160118, 160043, 160537, 161517, 162653, 163607, 164229, 164710, 165368, 166144, 166616, 166794, 167515, 169517, 172344, 174733, 175958, 176190, 175643, 174195, 172070, 170203, 169479, 169958, 171094, 172271, 172910, 172600, 171602, 170811, 170771, 171005, 170781, 170207, 170008, 170431, 171014, 171364, 171552, 171680, 171620, 171378, 171240, 171317, 171362, 171282, 171444, 172141, 173027, 173507, 173525, 173618, 174194, 175063, 175704, 175792, 175444, 175113, 175244, 175896, 176703, 177331, 177944, 179033, 180838, 183146, 185702, 188501, 191500, 194294, 196410, 197915, 199414, 201356, 203504, 205206, 206025, 205935, 205027, 203269, 200624, 197215, 193292, 189171, 185307, 182231, 180171, 178840, 177775, 176851, 176223, 175843, 175388, 174704, 173950, 173155, 172028, 170492, 169064, 168307, 168106, 167903, 167470, 166959, 166293, 165141, 163598, 162273, 161463, 160749, 159828, 159290, 159982, 161791, 163630, 164643, 164972, 165237, 165681, 166097, 166337, 166558, 167020, 167882, 169209, 170942, 172684, 173736, 173623, 172637, 171579, 170966, 170797, 171190, 172631, 175161, 177735]
54265A77735J398J41l37n82j284j799j155J03N41L5j66L41M28n04j315p96M56
54248A73240R64L38o25j251j400j009j69N65O82L10j44o27j126j236p47k06j29
54231A67430r9M79J138R07q6o85l83Q8P9r5N6L55L33q6o81j212j419j109n25j29
54211A64356M0L54Q29R31M15k20m10k46j10l3K38P04J062J062P64M71M66O86P30
54192A72089L72j0J03O26R49P26J60n27j253j695j354k83O95Q84M99K57M32O40
54174A73310L79l80j103j120k96O88J018O13J26O3L19M94L09l33j299k152k438
54157A68198k117j424m47P38J612J565P01k12p05q94q07j89Q15J469J349Q35M15
54140A70902L1m76r04j054j090j134j002p04o39q40n80O17K113K904K795K233
$$ y = [177735, 179133, 179274, 178937, 178355, 177071, 175272, 174117, 174220, 174761, 174796, 174630, 174971, 175399, 174895, 173580, 172784, 173240, 174204, 174542, 173917, 172666, 171266, 170257, 170088, 170653, 171335, 171645, 171501, 170874, 169748, 168512, 167765, 167559, 167430, 167331, 167810, 168948, 169855, 169769, 169084, 168701, 168789, 168868, 168773, 168829, 169184, 169517, 169431, 168750, 167538, 166119, 165010, 164485, 164356, 164396, 164750, 165579, 166510, 166925, 166705, 166295, 166049, 165939, 165906, 166144, 166848, 167910, 168972, 169736, 170207, 170673, 171359, 172089, 172461, 172451, 172554, 173180, 174129, 174855, 175015, 174488, 173235, 171540, 170186, 169903, 170598, 171482, 171981, 172238, 172670, 173310, 173689, 173309, 172206, 171086, 170790, 171478, 172496, 173109, 173235, 173298, 173617, 174111, 174420, 174087, 172788, 170636, 168198, 166081, 164657, 164210, 164948, 166560, 168125, 168826, 168614, 167909, 167015, 166208, 166019, 166834, 168303, 169652, 170487, 170902, 170933, 170457, 169553, 168499, 167409, 166275, 165273, 164569, 163930, 163090, 162510, 163127, 165240, 168144, 170939, 173172]
54124A73172J406K97o46p80j24O93J326J856K131J658M10q15j167n75K90P10M89
54107A80331O8O0O02J147J117N40j13n69r04j183j285j109o96j88K08L40L20M73
54089A79159Q43J020P04J95M2L28O38O12K45j92l32L9O90J082R84P30O44N88L97
54070A88416L92R89J960K631K622K071J241L76k20l64k33p6J22M28O85P81R51
54053B02772J309J451J032N10O47J428K153K462K645K932L249L666M436N398N983
54038B42073O038O119O770P960R368J0761J1874J2426J2461J2173J1393R694P189
54025C66299M684K773J319J5j066j805k355k753k750k424k445l215m170m549m469
54010C43089m553m827m731m175l815m141m876n461n685n576n149m544m119m093
$$ y = [173172, 174578, 174875, 174229, 173449, 173325, 174018, 175344, 177200, 179331, 180989, 181399, 180584, 179417, 178842, 179132, 179842, 180331, 180399, 180459, 181061, 182208, 183325, 183865, 183752, 183183, 182279, 181096, 179811, 178702, 178006, 177818, 178026, 178366, 178686, 179159, 180002, 181022, 181726, 181921, 181963, 182291, 182929, 183541, 183786, 183594, 183262, 183301, 183991, 185073, 186057, 186787, 187431, 188019, 188416, 188808, 189797, 191757, 194388, 197010, 199081, 200322, 200698, 200478, 200114, 199881, 199805, 199927, 200355, 201040, 201821, 202772, 204081, 205532, 206564, 207074, 207721, 209149, 211302, 213764, 216409, 219341, 222590, 226256, 230692, 236090, 242073, 248111, 254230, 261000, 268960, 278328, 289089, 300963, 313389, 325850, 338023, 349416, 359110, 366299, 370983, 373756, 375075, 375090, 374024, 372219, 369864, 367111, 364361, 361937, 359492, 356277, 352107, 347558, 343089, 338536, 333709, 328978, 324803, 320988, 316847, 311971, 306510, 300825, 295249, 290100, 285556, 281437, 277344]
53996B77344m220m113l717l245k813k367j912j577j420j439j698k221k722k768
53982B41112k292j757j556j586j625j830k409k987k861j960j022o53o72n86l21
53967B16995j23r2j37j41Q5P17J493J688R74M4j40M97J237J628J884K204K324
53950B31137J924J162N39M62R58J715K375K936L651M456M833M592M416N053O229
53935B76438O917O621N731M733L781L070K842K843K551K128K480L907N378N694
53921C35114M943M191M139M633N301O014O678P063P040O806O789P293Q164Q823
53907D22991Q783Q107P240O377N358M149L055K350K000J848J755J515R76L60l0
53892D76834m42j489l132m468m891m954n552o678p536p589p006o193n329m265
$$ y = [277344, 273124, 269011, 265294, 262049, 259236, 256869, 254957, 253380, 251960, 250521, 248823, 246602, 243880, 241112, 238820, 237063, 235507, 233921, 232296, 230466, 228057, 225070, 222209, 220249, 219227, 218574, 217902, 217316, 216995, 216872, 216780, 216643, 216502, 216587, 217304, 218797, 220485, 221459, 221503, 221363, 221860, 223097, 224725, 226609, 228813, 231137, 233061, 234223, 234762, 235224, 236182, 237897, 240272, 243208, 246859, 251315, 256148, 260740, 265156, 270209, 276438, 283355, 289976, 295707, 300440, 304221, 307291, 310133, 312976, 315527, 317655, 320135, 324042, 329420, 335114, 340057, 344248, 348387, 353020, 358321, 364335, 371013, 378076, 385116, 391922, 398711, 406004, 414168, 422991, 431774, 439881, 447121, 453498, 458856, 463005, 466060, 468410, 470410, 472258, 474013, 475528, 476504, 476864, 476834, 476392, 474903, 471771, 467303, 462412, 457458, 451906, 445228, 437692, 430103, 423097, 416904, 411575, 407310]
53878D07310k585Q8L420O180P116O017L617P08k370n528q608j1299j3143j3783
53864C77140j3418j2781j2379j2002j1244j0210r331q675p960p083o142n083l827
53851B57005k697k128k069k049j931j955k128k078j721j464j512j451r06j59J80
53836B32937r0o94j266j461j045k43J69l74j362j599n64R68J796J541P97L25L82
53819B30217P69J155J286J124R00R03J118J248J180J225J711K503L224L747M196
53804B56506M559M675M596M563M636M672M735N030N409N372M802M233M140M319
53790C22247M320M042L575K807J725Q10O35J080J451J311P83Q8p93j899l084m108
53774C34990m792n111n224n354n463n230m557l811l371l189l139l396m049m544
$$ y = [407310, 404725, 404813, 408233, 414413, 421529, 427546, 431163, 431871, 429501, 423973, 415365, 404066, 390923, 377140, 363722, 350941, 338562, 326560, 315316, 305106, 295775, 287100, 279140, 272057, 265915, 260832, 257005, 254308, 252180, 250111, 248062, 246131, 244176, 242048, 239970, 238249, 236785, 235273, 233822, 232916, 232757, 232937, 232847, 232153, 230887, 229426, 228381, 228138, 228307, 227933, 226571, 224972, 224408, 225376, 227172, 228713, 229510, 229835, 230217, 230986, 232141, 233427, 234551, 235451, 236354, 237472, 238720, 239900, 241125, 242836, 245339, 248563, 252310, 256506, 261065, 265740, 270336, 274899, 279535, 284207, 288942, 293972, 299381, 304753, 309555, 313788, 317928, 322247, 326567, 330609, 334184, 336991, 338716, 339526, 340161, 341241, 342692, 344003, 344786, 344874, 344081, 342182, 339098, 334990, 330198, 325087, 319863, 314509, 309046, 303816, 299259, 295448, 292077, 288888, 285749, 282353, 278304, 273760]
53760B73760m215l240k480k384k599k685k610k483k301k172k262k420k271j821
53746B37817j496j455j338r18m76l09l53m86p94j144j068m31J91K77R7K18O01
53729B28933P33M31j5l13k86L11J520K726L084K501J770J626K009K346K226J666
53713B51268J013P69J268K320L304L682L369K620J827J399J616K351L102L409
53699B83317L195K701K208J874J661J474J386J720K656L772M288L839K815J812
53685C18718J000J99o18j196j325j117r06r42j163j253r61m68k78o68j296j541
53669C06185j203p27p04j216j724j616q31P5N27N00L82L61K48p1l47l93n02r90
53651B97954j518j334k87Q94J458J396J083O05j10p74q53k84M11P88R37J154J477
$$ y = [273760, 269545, 266305, 263825, 261441, 258842, 256157, 253547, 251064, 248763, 246591, 244329, 241909, 239638, 237817, 236321, 234866, 233528, 232610, 232134, 231825, 231472, 230986, 230192, 229048, 227980, 227549, 227740, 228017, 228114, 228332, 228933, 229666, 230097, 230082, 229769, 229483, 229794, 231314, 234040, 237124, 239625, 241395, 243021, 245030, 247376, 249602, 251268, 252281, 253050, 254318, 256638, 259942, 263624, 266993, 269613, 271440, 272839, 274455, 276806, 279908, 283317, 286512, 289213, 291421, 293295, 294956, 296430, 297816, 299536, 302192, 305964, 310252, 314091, 316906, 318718, 319718, 319917, 319299, 318103, 316778, 315661, 314755, 313813, 312650, 311397, 310436, 309968, 309690, 309022, 307726, 306185, 304982, 304255, 303551, 302335, 300611, 298995, 298164, 298239, 298766, 299266, 299648, 300009, 300257, 300186, 299839, 299446, 298944, 297954, 296436, 295102, 294815, 295709, 297167, 298563, 299646, 300251, 300141, 299367, 298514, 298230, 298641, 299429, 300366, 301520, 302997]
53634C02997J780K034K236K167J606O89o1k16K13R11J601K181K544K502K012J412
53618C26608J289J936L028L963M451M625M635M451M066L688L539L609L718L730
53604C77336L596L317K954K612K340K111J982K070K311K371J983J270O34L23K77
53589D07487K49Q1j96l86l52j81o0m1q1k38n49p26l35N49J205J085M48r7l64n51
53569D06947o85n92l08j70m36j054j731k089j957j689j823k204j919o21O57Q07
53553C91133K75L40J056J228N50K84J185K147J909J104J259K434L272L170K971
53538D14317L361L837L782L564L924M894N948O788P444P912Q222Q642R356J0084
53524E02075J0404J0413J0630J1327J2298J3295J4371J5607J6768J7532J7954
$$ y = [302997, 304777, 306811, 309047, 311214, 312820, 313509, 313448, 313232, 313445, 314356, 315957, 318138, 320682, 323184, 325196, 326608, 327897, 329833, 332861, 336824, 341275, 345900, 350535, 354986, 359052, 362740, 366279, 369888, 373606, 377336, 380932, 384249, 387203, 389815, 392155, 394266, 396248, 398318, 400629, 403000, 404983, 406253, 406887, 407210, 407487, 407736, 407817, 407621, 407235, 406883, 406702, 406642, 406601, 406520, 406282, 405733, 405007, 404672, 405221, 406426, 407511, 407959, 407862, 407498, 406947, 406262, 405670, 405362, 405192, 404756, 403702, 401971, 399882, 397925, 396236, 394413, 392209, 390290, 389669, 390326, 391133, 391408, 391748, 392804, 394032, 394582, 394866, 396051, 398198, 400107, 401211, 402470, 404904, 408176, 411346, 414317, 417678, 421515, 425297, 428861, 432785, 437679, 443627, 450415, 457859, 465771, 473993, 482635, 491991, 502075, 512479, 522892, 533522, 544849, 557147, 570442, 584813, 600420, 617188, 634720, 652674]
53513F52674J8454J9302K0274K1001K1510K2183K3185K4238K5039K5620K6044
53502H99524K6100K5633K5014K4748K4681K4144K2960K1796K1249K1059K0582
53491A157490J9686J8793J8276J8242J8768J9796K0793K0994K0215J9123J8458
53480A370634J8204J7787J6976J6223J5972J5936J5341J3855J1929J0042Q013
53469A530912N393K341m31k603m642o955r158j0555j1105j1423j1932j2475j2811
53456A444556j3170j4129j6003j8358k0166k0669k0181j9780k0035k0415k0232
53445A241418j9671j9302j8920j7772j5855j4063j2793j1347r189p069o079o085
53433A083273n988n250m326l515k370n70J277K319K650L225M615O379P783Q825
$$ y = [652674, 671128, 690430, 710704, 731705, 753215, 775398, 798583, 822821, 847860, 873480, 899524, 925624, 951257, 976271, 1001019, 1025700, 1049844, 1072804, 1094600, 1115849, 1136908, 1157490, 1177176, 1195969, 1214245, 1232487, 1251255, 1271051, 1291844, 1312838, 1333053, 1352176, 1370634, 1388838, 1406625, 1423601, 1439824, 1455796, 1471732, 1487073, 1500928, 1512857, 1522899, 1530912, 1536305, 1538646, 1538215, 1535612, 1530970, 1524015, 1514857, 1504302, 1493197, 1481774, 1469842, 1457367, 1444556, 1431386, 1417257, 1401254, 1382896, 1362730, 1342061, 1321880, 1302100, 1282065, 1261650, 1241418, 1221747, 1202445, 1183525, 1165753, 1149898, 1135835, 1123042, 1111695, 1102506, 1095437, 1089358, 1083273, 1077285, 1072035, 1067709, 1064194, 1061824, 1061254, 1062531, 1064850, 1067500, 1070725, 1075340, 1081719, 1089502, 1098327]
53419A098327J0146J2092J4223J5967J7358J8811K0402K1820K3003K4307K5866
53408A302322K7321K8445K9622L1273L3171L4799L6158L7716L9682M1810M3889
53397A686208M5982M8111N0153N1952N3298N3906N3827N3818N4696N6257N7406
53386B265614N7442N6688N5659N4244N2134M9540M6942M4406M1583L8261L4563
53375B797076L0736K7052K3695K0500J6887J2390P141J523m334j0498j6824k3009
53363B882335k8891l4361l9073m2697m5417m7809n0175n2226n3467n3626n2779
53352B381814n1311m9743m8344m6923m5225m3429m1998m1140m0733m0683m0908
53341A891377m1007m0452l9209l7737l6216l4277l1750k9181k7169k5491k3398
$$ y = [1098327, 1108473, 1120565, 1134788, 1150755, 1168113, 1186924, 1207326, 1229146, 1252149, 1276456, 1302322, 1329643, 1358088, 1387710, 1418983, 1452154, 1486953, 1523111, 1560827, 1600509, 1642319, 1686208, 1732190, 1780301, 1830454, 1882406, 1935704, 1989610, 2043437, 2097255, 2151951, 2208208, 2265614, 2323056, 2379744, 2435403, 2489647, 2541781, 2591321, 2638263, 2682669, 2724252, 2762513, 2797076, 2827812, 2854864, 2878559, 2899059, 2915946, 2928336, 2935477, 2937000, 2932666, 2922168, 2905344, 2882335, 2853444, 2819083, 2780010, 2737313, 2691896, 2644087, 2593912, 2541686, 2488219, 2434593, 2381814, 2330503, 2280760, 2232416, 2185493, 2140268, 2096839, 2054841, 2013701, 1972968, 1932285, 1891377, 1850370, 1809918, 1770709, 1732972, 1696756, 1662479, 1630729, 1601548, 1574379, 1548888, 1525490]
53330A525490k0654j7875j5823j4794j4616j5008j5676j6328j6682j6563j5974
53319A345497j5204j4685j4583j4480j3743j2222j0450r061q120p178n864m371
53307A215536l215k595k054r20Q94K822M409N938P967J0382J2426J3712J4798
53294A280100J6516J9013K1724K3991K5413K5893K5741K5592K5783K5823K4986
53283A540575K3341K1701K0517J9361J7679J5470J2923R967O592L199J42k659
53271A688808n214p042p953q820j0784j3742j6532j8507k0086k1722k3211k4377
53259A510818k5573k7013k8232k8708k8511k8003k7347k6745k6589k6860k6878
53248A210359k6168k5151k4407k3824k3144k2830k3446k4403k4398k3150k1829
$$ y = [1525490, 1504836, 1486961, 1471138, 1456344, 1441728, 1426720, 1411044, 1394716, 1378034, 1361471, 1345497, 1330293, 1315608, 1301025, 1286545, 1272802, 1260580, 1250130, 1241069, 1232949, 1225771, 1219907, 1215536, 1212321, 1209726, 1207672, 1206752, 1207646, 1210468, 1214877, 1220815, 1228782, 1239164, 1251590, 1265302, 1280100, 1296616, 1315629, 1337353, 1361344, 1386757, 1412650, 1438391, 1463983, 1489766, 1515589, 1540575, 1563916, 1585617, 1606134, 1625495, 1643174, 1658644, 1671567, 1681534, 1688126, 1691325, 1691467, 1688808, 1683594, 1676552, 1668599, 1659779, 1648995, 1635253, 1618721, 1600214, 1580128, 1558406, 1535195, 1510818, 1485245, 1458232, 1430000, 1401292, 1372781, 1344778, 1317431, 1290686, 1264097, 1237237, 1210359, 1184191, 1159040, 1134633, 1110809, 1087665, 1064835, 1041389, 1016986, 992588, 969438, 947609]
53237I47609k1473k1688k1315j9842j7746j5762j4210j2933j1657j0370r378q900
53225G62335q767q723q851r479j0668j2137j3554j4612j5001j4715j4315j4473
53213F17040j5155j5635j5276j4094j2587j1340j0706j0524j0212r446q608q223
53201D75234q198q055p780p784q211q835r553j0303j0553r722q162o968o603o494
53187C58013o162n857n719n217m073l031k910l423l628l234k714k385k056j483
53173C06121o88N3K64m37j696k450k087j189o73n67l57j21m50j333k034k144k048
53156B88164k131k167j805j127n07k15l44p47r69o04J27N02J38p00j561k136k052
53139B71866j042L79J037L56q84j496j244p47m07n6M33Q26Q71N56m7p91j307j186
$$ y = [947609, 926136, 904448, 883133, 863291, 845545, 829783, 815573, 802640, 790983, 780613, 771235, 762335, 753568, 744845, 735994, 726515, 715847, 703710, 690156, 675544, 660543, 645828, 631513, 617040, 601885, 586250, 570974, 556880, 544293, 532953, 522247, 511723, 501511, 492065, 483457, 475234, 467036, 458981, 451201, 443417, 435206, 426371, 416818, 406515, 395962, 386240, 378078, 371110, 364507, 358013, 351851, 345994, 340275, 335058, 330985, 327954, 325044, 321621, 317993, 314759, 312045, 309660, 307604, 306121, 305433, 305486, 305750, 305313, 303617, 301167, 299080, 297891, 297218, 296651, 296294, 296173, 295723, 294390, 292356, 290212, 288164, 286033, 283866, 282061, 280934, 280427, 280212, 279868, 279121, 278152, 277548, 277675, 278177, 278315, 277615, 276054, 273918, 271866, 270824, 271203, 272240, 272596, 271712, 270216, 268972, 268225, 267818, 267762, 268195, 269021, 269892, 270448, 270401, 269610, 268303, 267117]
53121B67117m37N34J418K092K272J595L05o62o63j27P6k25n07n38o94j239j794
53104B68523j824j343q52p05q16q33n26l3K30J8m22o03m13k10l21o92j081j275
53086B56822j100n34O6K20p0l26l12k72k74M5P78J327J196O85L10O3j50J23J134
53067B59731K002J655M86p2L92P74L04l55m27l47q96j741j847r96RN09O10N97
53049B60388M18ql86k96K37O67N12l2k85K5L55P1o79j242j369j354j407j436j414
53030B52765j385j140m78K37M26J90K27P63J337J630J765J705J268Q78J229J947
53014B63364J700J46j341j513q00k20J79Q31J459J514J161Q62N00q3l43J88Q71
52997B68475P95J73j27K2J81M00R33J305R42L97N99J132P64m13r15j60P18P57
$$ y = [267117, 266680, 267214, 268632, 270724, 272996, 274591, 274896, 274234, 273571, 273444, 273520, 273295, 272788, 272250, 271556, 270317, 268523, 266699, 265356, 264504, 263799, 262983, 262150, 261624, 261591, 261821, 261839, 261417, 260814, 260401, 260191, 259870, 259178, 258097, 256822, 255722, 255188, 255254, 255474, 255404, 255078, 254766, 254494, 254220, 254265, 255043, 256370, 257566, 258251, 258561, 258624, 258474, 258597, 259731, 261733, 263388, 263874, 263802, 264194, 264968, 265272, 264917, 264490, 264143, 263247, 261506, 259659, 258663, 258672, 259181, 259791, 260388, 260806, 260798, 260412, 260116, 260353, 261020, 261532, 261500, 261215, 261240, 261595, 261666, 260987, 259745, 258376, 257022, 255615, 254179, 252765, 251380, 250240, 249762, 249999, 250425, 250615, 250842, 251605, 252942, 254572, 256337, 258042, 259310, 260188, 261417, 263364, 265064, 265210, 263869, 262356, 261556, 261336, 261515, 262346, 263805, 265319, 266480, 267342, 267842, 267759, 267416, 267604, 268475, 269270, 269443, 269316, 269338, 269519, 269919, 270852, 272157, 273099, 273496, 274095, 275227, 275991, 275578, 274663, 274503, 275221, 275978]
52979B75978M74P31J405J882J936J609R56M18O09J376J834J670J581K020K499
52964B96978K530K331K132J658R15N16O21M31n17j423j384p66n06p41j037j423
52948C00315k164k879k927k438k136k201k118j589q67k19L19O37N70K65O5N2m
52931B82681k06m25n43m98k35J49M01M15M01M49K99j99p48j021j121j240j274
52914B77285j099q87o81j65O47R66J74j102j660j248o62m66m14k24j36l77o59
52897B69292n50j4O16R62Q14L09n8J47Q09J355J356Q03l3p82j123j096j107j339
52879B70361j329o11M66J102J120J041J063P49k9n78k85M58Q17P04P90J418K120
52862B79377K288J942J539J334J177Q96N71L92L78L29op00j530k057j993j540
$$ y = [275978, 276452, 277183, 278588, 280470, 282406, 284015, 284971, 285389, 285998, 287374, 289208, 290878, 292459, 294479, 296978, 299508, 301839, 303971, 305629, 306544, 307060, 307681, 308112, 307595, 306172, 304788, 304022, 303516, 302775, 301738, 300315, 298151, 295272, 292345, 289907, 287771, 285570, 283452, 281863, 280996, 280777, 281096, 281733, 282303, 282568, 282633, 282685, 282681, 282475, 282050, 281507, 281009, 280774, 280923, 281324, 281739, 282140, 282589, 282888, 282689, 281941, 280920, 279799, 278559, 277285, 276186, 275299, 274618, 274453, 275100, 276066, 276240, 275138, 273478, 272230, 271568, 271102, 270688, 270464, 270328, 269951, 269292, 268742, 268728, 269344, 270306, 271120, 271429, 271371, 271518, 272327, 273682, 275038, 275841, 275808, 275026, 273903, 272807, 271700, 270361, 269032, 268421, 268887, 269989, 271109, 272150, 273213, 273962, 273933, 273355, 273070, 273528, 274345, 275049, 275839, 277257, 279377, 281665, 283607, 285146, 286480, 287657, 288553, 289124, 289516, 289894, 290223, 290217, 289517, 287987, 285930, 283937, 282397]
52846B82397j285j671k634l795m771n225m872l789k509j570j029o63m43m99p57
52831B46885j005j148j078n78K30O67L82J05O67J487J194k19j169p53lj74r01
52814B44589j081p08o36r88r82j73J048K159K926L205K987K571K184J550L83r54
52798B58080j847k229k397k332j913j471j411j424r76l03r8l69m94l64m95r21
52782B39036r56k86O07J298J831K046J403qj117j090k83M88R97J386J471R85J80
52765B47988m49q24j191j539j516q83J83J147J404Q48J63J53O71P45Kp69q03m36
52747B44894l92n65l08M19J035J275J359J302Q35J68J0O47J520K070K407K788
52731B59464K980K654K095J887K000J823J086K21l42o92r71q99k47M71M60l03
$$ y = [282397, 281112, 279441, 276807, 273012, 268241, 263016, 258144, 254355, 251846, 250276, 249247, 248584, 248141, 247642, 246885, 245880, 244732, 243654, 243076, 243306, 243973, 244355, 244460, 245127, 246614, 247808, 247589, 246420, 245667, 245664, 245490, 244589, 243508, 242800, 242164, 241176, 240194, 240021, 241069, 243228, 246154, 249359, 252346, 254917, 257101, 258651, 259034, 258080, 256233, 254004, 251607, 249275, 247362, 245891, 244480, 243056, 242080, 241777, 241679, 241310, 240816, 240452, 239957, 239036, 238080, 237794, 238401, 239699, 241530, 243576, 244979, 244971, 243854, 242764, 242481, 242969, 243966, 245352, 246823, 247808, 247988, 247539, 246715, 245524, 243985, 242469, 241586, 241769, 242916, 244320, 245168, 245331, 245484, 246155, 246900, 246902, 246133, 245330, 244894, 244502, 243937, 243629, 244048, 245083, 246358, 247717, 249019, 249854, 250022, 250032, 250679, 252199, 254269, 256676, 259464, 262444, 265098, 267193, 269080, 271080, 272903, 273989, 274210, 273868, 273176, 272205, 271306, 271059, 271530, 271990, 271687]
52715B71687r95j060q34q67j075r75m75n5j74p41j129p65J23N05l36j670k001
52698B59163r83O6ro43n70L03J015J128J078J070P37O0k97M0O82J255J898K571
52680B68564K591J481j13r99p05J80P22M09n44j375j428q18k39r4j46j48k96p39
52662B66303j132j080o93l10N8N91J195J647K084K838L780M261L833K769J717
52647B87861R98M24l07j160j865k266k457k527k402k005j347m31O27J259P53p42
52631B74413j989j987j106l55J14Q42J732J974J360O69M12J19o48j402j465r60
52615B71723m46p7K45L26q1o79q63m20L36R90J331J401J479J738J858J348L92
52598B80601j46J77Q08R86O64K88J79M72J200K004K189J504N08j88n03m59J38
$$ y = [271687, 270692, 269632, 268798, 267931, 266856, 265881, 265406, 265351, 265177, 264436, 263307, 262542, 262665, 263170, 262834, 261164, 259163, 258180, 258246, 258237, 257594, 257024, 257327, 258342, 259470, 260548, 261618, 262355, 262415, 262118, 262158, 262840, 264095, 265993, 268564, 271155, 272636, 272523, 271524, 270819, 270999, 271721, 272130, 271586, 270211, 268783, 267965, 267726, 267632, 267486, 267338, 267042, 266303, 265171, 264091, 263398, 263088, 263146, 263737, 264932, 266579, 268663, 271501, 275281, 279542, 283375, 286144, 287861, 288859, 289283, 288976, 287816, 285951, 283685, 281228, 278701, 276299, 274294, 272947, 272516, 273143, 274402, 275155, 274413, 272424, 270437, 269331, 268976, 269090, 269932, 271664, 273638, 274998, 275667, 276079, 276198, 275550, 274148, 272683, 271723, 271277, 271200, 271445, 271771, 271690, 271011, 270148, 269728, 270064, 271054, 272385, 273786, 275265, 277003, 278861, 280209, 280601, 280455, 280632, 281440, 282426, 283090, 283378, 283557, 284029, 285229, 287233, 289422, 290926, 291434, 291246, 290743, 290284, 290422]
52581B90422J105J577J029Q5l02J5O47J386J996J875Q51j91m56m90j225k176j966
52564B94182m71Q43R41L23j74n53j148j807k181k195j890j273o29l80m55l67j32
52547B82634l49j120j578j020J37R81J193J028O53O5o01j107j342j256q82m86
52531B76950l99n41m90j53J24K08L52N41M18J15L67J239J645Q69j40J2J105J625
52513B83847R45L8j7P39J751K762L570L748L227K642K501K382J607L51n87j023
52497C08483j579k532l234l047k332j899j886j814j591j652j982j811p19N09P66
52482B83680O1n99n53j42M4l6L3N98J618K566K641J561J60k58O38J861K362K182
52464B98417K030K252K626K839K764K380J847J451J216O93m74j931k960l296l330
$$ y = [290422, 291527, 293104, 294133, 294218, 293916, 293931, 294578, 295964, 297960, 299835, 300686, 300495, 300039, 299549, 298324, 296148, 294182, 293711, 294554, 295495, 295818, 295644, 295091, 293943, 292136, 289955, 287760, 285870, 284597, 283968, 283588, 283133, 282766, 282634, 282285, 281165, 279587, 278567, 278704, 279685, 280878, 281906, 282559, 282624, 282023, 280916, 279574, 278318, 277436, 276950, 276551, 276010, 275520, 275367, 275491, 275699, 276051, 276592, 277010, 277125, 277492, 278731, 280376, 281245, 281105, 281117, 282222, 283847, 284792, 284830, 284813, 285552, 287303, 290065, 293635, 297383, 300610, 303252, 305753, 308135, 309742, 310093, 309506, 308483, 306904, 304372, 301138, 298091, 295759, 293860, 291974, 290160, 288569, 286917, 284935, 283124, 282405, 282914, 283680, 283741, 283142, 282589, 282447, 282491, 282455, 282488, 283086, 284704, 287270, 289911, 291472, 291632, 291374, 292012, 293873, 296235, 298417, 300447, 302699, 305325, 308164, 310928, 313308, 315155, 316606, 317822, 318515, 318041, 316110, 313150, 309854, 306524]
52449C06524l515l924m279m240l583k448j325o86o35r78j447j704j421p28k71
52434B75340m78r34r22l86J51M34O45P39M27j18k07L54Q65P58M23N35J035J415
52416B80076J611J869K014J639R76P58J149J512J504J676K632M168N733P185Q544
52401C23046R320Q836P069M693K336K26j499k723l611m423n003m942m330l824
52387C25171l755l605k748j369k53J42P8J14N80J420K305K914L207L370L477L439
52371C34487L360L651M468N337N600N147M401L657K810J743O23k30o50o67l91
52356C73346P5N99R42Q22J99m73n42J24R56J354J376J485J858K209K262K100K029
52339C90721K382L335M707N890O324O087N890O364P493Q774R835J0786J2011J3587
$$ y = [306524, 303009, 299085, 294806, 290566, 286983, 284535, 283210, 282524, 281889, 280911, 279464, 277760, 276339, 275611, 275340, 274862, 273928, 273006, 272620, 272771, 273205, 273850, 274589, 275016, 274898, 274691, 275045, 275910, 276668, 277091, 277626, 278661, 280076, 281687, 283556, 285570, 287209, 288185, 288943, 290092, 291604, 293108, 294784, 297416, 301584, 307317, 314502, 323046, 332366, 341202, 348271, 352964, 355300, 355526, 354027, 351304, 347693, 343270, 338267, 333325, 328995, 325171, 321416, 317811, 315063, 313694, 313441, 313583, 313661, 313775, 314355, 315775, 318080, 320994, 324201, 327571, 331048, 334487, 337847, 341498, 345966, 351303, 356903, 362050, 366451, 370108, 372918, 374661, 375284, 375054, 374404, 373737, 373346, 373421, 374020, 374962, 375784, 375983, 375510, 374968, 375092, 376048, 377402, 378778, 380263, 382121, 384330, 386592, 388692, 390721, 393103, 396438, 401145, 407035, 413359, 419446, 425336, 431700, 439193, 447967, 457802, 468588, 480599, 494186]
52325D94186J5039J5787J5932J6306J7593J9535K1161K1744K1375K0766K0618
52314G00042K1067K1620K1738K1500K1479K1914K2444K2786K3174K3800K4219
52303I45783K3850K2794K1641K0660J9698J8711J7806J6807J5307J3207J0781
52292A147045Q151N220K112o94k874m555n987p221q196q864r205r271r186q940
52278A087535q271p062n595m184k790j395l48K00R83K922N877Q763J0898J2486
52264A100019J3810J4755J5310J5755J6147J6343J6627J7502J8593J8759J7698
52253A281318J6542J6208J6069J5064J3342J1791J0471Q609N974L179O32j865
52241A397334m338o348p742r043j0642j2086j2726j2773j3125j4115j4957j4741
$$ y = [494186, 509225, 525012, 540944, 557250, 574843, 594378, 615539, 637283, 658658, 679424, 700042, 721109, 742729, 764467, 785967, 807446, 829360, 851804, 874590, 897764, 921564, 945783, 969633, 992427, 1014068, 1034728, 1054426, 1073137, 1090943, 1107750, 1123057, 1136264, 1147045, 1155196, 1160416, 1162528, 1161834, 1158960, 1154405, 1148418, 1141197, 1133001, 1124137, 1114932, 1105661, 1096475, 1087535, 1079264, 1072202, 1066607, 1062423, 1059633, 1058238, 1057890, 1058090, 1059073, 1061995, 1067872, 1076635, 1087533, 1100019, 1113829, 1128584, 1143894, 1159649, 1175796, 1192139, 1208766, 1226268, 1244861, 1263620, 1281318, 1297860, 1314068, 1330137, 1345201, 1358543, 1370334, 1380805, 1389414, 1395388, 1398567, 1399199, 1397334, 1392996, 1386648, 1378906, 1369863, 1359221, 1347135, 1334409, 1321636, 1308511, 1294396, 1279439, 1264698]
52229A264698j3725j3091j3395j3882j3642j2889j2377j1963j0832r061p857p827
52217A124157p984p083n202l300j825n74N11J297J982K958M164N143N565N348
52203A125157M518L412K754K932L491L831M100M745N529N809N572N387N436N441
52189A188114N510O077O873O812N327L148J362J65j024k715m869o982q400q778
52175A190620q474q193q167q019p474o756o140n548m839m111l488k873k144j303
52161A113091l24Q90K176L062L219K781K124J520J071P05J99m98r99q73l47m1
52145A127756l7K89J201J968J775Q55K19M83J376K242K622K429J947J717K159
52130A149001L312M980O998R219J1435J3607J6025J8938K2110K5005K7399K9501
$$ y = [1264698, 1250973, 1237882, 1224487, 1210605, 1196963, 1184074, 1171697, 1159734, 1148902, 1139841, 1131984, 1124157, 1116173, 1109090, 1103888, 1100588, 1098763, 1098189, 1098700, 1099997, 1101979, 1104937, 1109101, 1114244, 1119809, 1125157, 1129675, 1133087, 1135841, 1138773, 1142264, 1146095, 1150195, 1154940, 1160469, 1166278, 1171850, 1177237, 1182673, 1188114, 1193624, 1199701, 1206574, 1213386, 1218713, 1221861, 1223223, 1223388, 1222364, 1219649, 1214780, 1207798, 1199398, 1190620, 1182146, 1173953, 1165786, 1157767, 1150293, 1143537, 1137397, 1131849, 1127010, 1122899, 1119411, 1116538, 1114394, 1113091, 1112767, 1113657, 1115833, 1118895, 1122114, 1124895, 1127019, 1128539, 1129610, 1130315, 1130514, 1130016, 1129017, 1128144, 1127797, 1127756, 1127719, 1128008, 1129209, 1131177, 1132952, 1133807, 1134026, 1134509, 1135885, 1138127, 1140749, 1143178, 1145125, 1146842, 1149001, 1152313, 1157293, 1164291, 1173510, 1184945, 1198552, 1214577, 1233515, 1255625, 1280630, 1308029, 1337530]
52118A337530L1386L2613L2698L1901L1235L1489L2310L2486L1155K8549K5563
$$ y = [1337530, 1368916, 1401529, 1434227, 1466128, 1497363, 1528852, 1561162, 1593648, 1624803, 1653352, 1678915]
$$ [...]
##END NTUPLES=NMR SPECTRUM
##END=
