
##TITLE=AC1387_PERAH12199_7519419_4k6hK59VIW
##JCAMPDX= 6.0         $$ Bruker NMR JCAMP-DX V2.0
##DATA TYPE= NMR SPECTRUM
##DATA CLASS= NTUPLES
##ORIGIN= BRUKER
##OWNER= Administrator
$$ 1.72 TOPSPIN		Version 2.1
$$ 2013-02-20 00:42:28.780 -0500  Administrator@X
$$ Compression mode = diff/dup
##.OBSERVE FREQUENCY= 400.02188249412
##.OBSERVE NUCLEUS= ^1H
##.ACQUISITION MODE= SIMULTANEOUS (DQD)
##.ACQUISITION SCHEME= undefined
##.AVERAGES= 8
##.DIGITISER RES= 22
##SPECTROMETER/DATA SYSTEM= spect
##.PULSE SEQUENCE= zg30
##.SOLVENT NAME= COFFEE_meoh
##.SHIFT REFERENCE= INTERNAL, COFFEE_meoh, 1, 14.98509
##AUDIT TRAIL= $$ (NUMBER, WHEN, WHO, WHERE, PROCESS, VERSION, WHAT)
$$ ##TITLE= Audit trail, TOPSPIN		Version 2.1
$$ ##JCAMPDX= 5.01
$$ ##ORIGIN= Bruker BioSpin GmbH
$$ ##OWNER= Administrator
$$ $$ E:\/data/COFFEE/nmr/AC1387_PERAH12199_7519419_4k6hK59VIW/10/pdata/1/auditp.txt
$$ ##AUDIT TRAIL=  $$ (NUMBER, WHEN, WHO, WHERE, PROCESS, VERSION, WHAT)
(   1,<2013-02-20 00:42:20.312 -0500>,<Administrator>,<X>,<go>,<TOPSPIN 2.1>,
      <created by zg
	started at 2013-02-20 00:41:13.749 -0500,
	POWCHK enabled, PULCHK disabled,
       configuration hash MD5:
       86 BA 57 50 F2 9D 5C 9B 26 00 A9 28 5F 66 2E 89
       data hash MD5: 64K
       30 F7 8E 57 40 A3 FC 5C 1B 8B B7 A7 44 B5 04 50>)
(   2,<2013-02-20 00:42:23.515 -0500>,<Administrator>,<X>,<proc1d>,<TOPSPIN 2.1>,
      <Start of raw data processing
       efp LB = 0 FT_mod = 6 PKNL = 1 PHC0 = 0 PHC1 = 0 SI = 32K 
       data hash MD5: 32K
       0C D4 D3 DA 5D A5 57 3E DC 73 3C 70 7D 4D 82 21>)
(   3,<2013-02-20 00:42:23.984 -0500>,<Administrator>,<X>,<proc1d>,<TOPSPIN 2.1>,
      <pk PHC0 = 70.45532 PHC1 = 0 
       data hash MD5: 32K
       F5 D2 ED A0 2E 47 BE 3A 3A 83 BA 49 A4 8A 22 73>)
(   4,<2013-02-20 00:42:24.234 -0500>,<Administrator>,<X>,<proc1d>,<TOPSPIN 2.1>,
      <abs ABSG = 1 
       data hash MD5: 32K
       BE 77 26 E3 EC 92 96 02 26 25 B3 B0 92 79 64 77>)
(   5,<2013-02-20 00:42:24.374 -0500>,<Administrator>,<X>,<proc1d>,<TOPSPIN 2.1>,
      <abs ABSG = 2 
       data hash MD5: 32K
       D4 E9 BB 38 26 80 FE C7 E9 F5 7D 68 CF CA EA 4C>)
(   6,<2013-02-20 00:42:24.593 -0500>,<Administrator>,<X>,<proc1d>,<TOPSPIN 2.1>,
      <abs ABSG = 3 
       data hash MD5: 32K
       B0 26 2A 79 BF 04 CB 9C 12 05 71 72 4B 0C 64 B1>)
(   7,<2013-02-20 00:42:24.749 -0500>,<Administrator>,<X>,<proc1d>,<TOPSPIN 2.1>,
      <abs ABSG = 4 
       data hash MD5: 32K
       05 95 4B 8A 7B 42 8E A5 78 32 AE FA 23 3C 97 62>)
(   8,<2013-02-20 00:42:24.905 -0500>,<Administrator>,<X>,<proc1d>,<TOPSPIN 2.1>,
      <abs ABSG = 5 
       data hash MD5: 32K
       1C ED 62 ED C7 0D 58 D6 F8 2D 5E 10 79 B0 3A 13>)
$$ ##END=
$$ 
$$ $$ hash MD5
$$ $$ 81 35 19 0E 30 E7 B3 BF B0 82 D4 08 E2 C3 A8 FD
##$RELAX= 
##$RELAX= 
##$RELAX= 
##$RELAX= 
##$RELAX= 
##$RELAX= 
##$RELAX= 
$$ Bruker specific parameters
$$ --------------------------
##$DU= <E:\>
##$EXPNO= 10
##$NAME= <AC1387_PERAH12199_7519419_4k6hK59VIW>
$$ [...]
##$TP= (0..7)
150 150 150 150 150 150 150 150
##$TP07= 0
##$TPNAME0= <>
##$TPNAME1= <>
##$TPNAME2= <>
##$TPNAME3= <>
##$TPNAME4= <>
##$TPNAME5= <>
##$TPNAME6= <>
##$TPNAME7= <>
##$TPOAL= (0..7)
0.5 0.5 0.5 0.5 0.5 0.5 0.5 0.5
##$TPOFFS= (0..7)
0 0 0 0 0 0 0 0
##$TUNHIN= 0
##$TUNHOUT= 0
##$TUNXOUT= 0
##$USERA1= <user>
##$USERA2= <user>
##$USERA3= <user>
##$USERA4= <user>
##$USERA5= <user>
##$V9= 5
##$VALIST= <valist>
##$VCLIST= <CCCCCCCCCCCCCCC>
##$VD= 0
##$VDLIST= <DDDDDDDDDDDDDDD>
##$VPLIST= <PPPPPPPPPPPPPPP>
##$VTLIST= <TTTTTTTTTTTTTTT>
##$WBST= 1024
##$WBSW= 4
##$XGAIN= (0..3)
0 0 0 0
##$XL= 0
##$YL= 0
##$YMAX_a= 498965
##$YMIN_a= -497287
##$ZGOPTNS= <>
##$ZL1= 120
##$ZL2= 120
##$ZL3= 120
##$ZL4= 120
##$ABSF1= 14.98509
##$ABSF2= -5.573092
##$ABSG= 5
##$ABSL= 3
##$ALPHA= 0
##$AQORDER= 0
##$ASSFAC= 0
##$ASSFACI= 0
##$ASSFACX= 0
##$ASSWID= 0
##$AUNMP= <proc_prof1d_extract_pilot.lims>
##$AXLEFT= 0
##$AXNAME= <>
##$AXNUC= <1H>
##$AXRIGHT= 0
##$AXTYPE= 0
##$AXUNIT= <>
##$AZFE= 0.1
##$AZFW= 0.1
##$BCFW= 0
##$BC_mod= 0
##$BYTORDP= 0
##$COROFFS= 0
##$CY= 15
##$DATMOD= 1
##$DC= 0
##$DFILT= <>
##$DTYPP= 0
##$F1P= 0
##$F2P= 0
##$FCOR= 0.5
##$FTSIZE= 32768
##$FT_mod= 6
##$GAMMA= 0
##$GB= 0
##$INTBC= 1
##$INTSCL= 1
##$ISEN= 128
##$LB= 0
##$LEV0= 0
##$LPBIN= 0
##$MAXI= 10000
##$MC2= 0
##$MEAN= 0
##$ME_mod= 0
##$MI= 0
##$NCOEF= 0
##$NC_proc= -8
##$NLEV= 6
##$NOISF1= 0
##$NOISF2= 0
##$NSP= 0
##$NTH_PI= 0
##$NZP= 0
##$OFFSET= 14.98509
##$PC= 1
##$PHC0= 70.45532
##$PHC1= 0
##$PH_mod= 1
##$PKNL= yes
##$PPARMOD= 0
##$PPDIAG= 0
##$PPIPTYP= 0
##$PPMPNUM= 2147483647
##$PPRESOL= 1
##$PSCAL= 4
##$PSIGN= 0
##$PYNMP= <proc.py>
##$REVERSE= no
##$SF= 400.02
##$SI= 32768
##$SIGF1= 0
##$SIGF2= 0
##$SINO= 400
##$SIOLD= 32768
##$SPECTYP= <>
##$SREGLST= <1H.CDCl3>
##$SSB= 0
##$STSI= 32768
##$STSR= 0
##$SW_p= 8223.68421052631
##$SYMM= 0
##$S_DEV= 0
##$TDeff= 65536
##$TDoff= 0
##$TI= <>
##$TILT= no
##$TM1= 0
##$TM2= 0
##$TOPLEV= 0
##$USERP1= <user>
##$USERP2= <user>
##$USERP3= <user>
##$USERP4= <user>
##$USERP5= <user>
##$WDW= 1
##$XDIM= 32768
##$YMAX_p= 418208712
##$YMIN_p= -689943
##$CURPLOT= <Network HP LaserJet P1505>
##$CURPRIN= <$Network HP LaserJet P1505>
##$DFORMAT= <normdp>
##$LAYOUT= <+/1D_H.xwp>
##$LFORMAT= <normlp>
##$PFORMAT= <normpl>
##$SURQMSG= 1
$$ End of Bruker specific parameters
$$ ---------------------------------
##NTUPLES= NMR SPECTRUM
##VAR_NAME=  FREQUENCY,     SPECTRUM/REAL,   SPECTRUM/IMAG
##SYMBOL=    X,             R,               I
##VAR_TYPE=  INDEPENDENT,   DEPENDENT,       DEPENDENT
##VAR_FORM=  AFFN,          ASDF,            ASDF
##VAR_DIM=   32768,         32768,           32768
##UNITS=     HZ,            ARBITRARY UNITS, ARBITRARY UNITS
##FACTOR=    0.250966925370066, 1,           1
##FIRST=     8223.43324360094, 56592,        -37423
##LAST=      0,             -54852,          99277
##MIN=       0,             -689943,         0
##MAX=       8223.43324360094, 418208712,    0
$$ Real data points
##PAGE= N=1
##DATA TABLE= (X++(R..R)), XYDATA
$$ [...]
19564g1371m5312B23714a04410j27225a10440G7392k0044h2363m6439C6324f393
19552D5714b73338B7293R493J94010I764b09947o1262i8067b2898l53237a41351
19540A90620o2958a77618K9979d9755G1314J43950o3655N246F5138a47094G9622
19528a45938K3753A69555a40364k24045B28815a70504Q479B06478i0696l4857
19518a25553N3830j71466d4310B2056L4311A4880b42121A43506a9195A45961F2404
19506B12767E2091N7653e5818k11198g1486q323H126c02442C3176P7780a24323
19494a58666j410j27139J03825A33149F4170b42739O1008H4059a17380j0403n03899
19483f31682I8619a27471I7048j3556A2010M8709K8938J6512h736A64759a20409
$$ y = [-71371, -116683, 223714, -104410, -231635, -110440, 77392, 57348, -82363, -128802, 36324, -6393, 45714, -273338, 27293, 36786, 230796, 9764, -209947, -271209, -98067, -22898, -376135, -141351, 190620, 127662, -177618, -147639, -49755, 71314, 215264, 151609, 156855, 65138, -147094, 79622, -145938, -122185, 169555, -140364, -364409, 228815, -170504, -162025, 206478, -90696, -125553, -71723, -243189, -44310, 22056, 56367, 14880, -242121, 143506, -19195, 145961, 62404, 212767, 52091, 109744, -55818, -267016, -71486, -79809, 8126, -302442, 33176, 110956, -124323, -158666, -160076, -287215, -183390, 133149, 64170, -242739, -181731, 84059, -117380, -127783, -631682, 98619, -127471, 97048, 83492, 12010, 60719, 89657, 106169, -8736, 164759, -120409]
19471i3457E1192c9728l9773A42174n7233c17355d489l2158j33289r1202a13875
19459C03069g321k6414C04346F0372N0161c8811l80057a9571j33932A53710h4173
19447a40452A1065g2259k786m6204m0537A23063K61330C0459J765e8606A3797
19435D6568J297e3824j83545b6098k71092a7158H7658R3509o4907A6668J23911
19424A40579l1835b29232g3053q6146A8472J45189e7194j83480B06901b26520
19413B74495g4410Q061j21206Q5413A93649b04556g5430l5886j13435J4534O3107
19402a47110r7269a04606b1530D618J24025c08566P3065j15361a03528o2220H898
19390C2981b59549a08682B9485b55353R166K5705c2172B45940a1703C03019c93758
$$ y = [-93457, 51192, -39728, -79501, 142174, 84941, -317355, -4489, -36647, -169936, -261138, -113875, 303069, -7321, -33735, 304346, 60372, 110533, -38811, -418868, -19571, -153503, 153710, -84173, -140452, 11065, -72259, -75045, -121249, -161786, 123063, 384393, 30459, 32224, -58606, 13797, 46568, 47865, -53824, -237369, -26098, -297190, -17158, 87658, 181167, 116260, 16668, 140579, 108744, -229232, -73053, -159199, 18472, 163661, -57194, -240674, 206901, -226520, 274495, -74410, -66349, -187555, -102142, 193649, -204556, -75430, -111316, -224751, -210217, -147110, -244379, -104606, -21530, 4618, 128643, -308566, -235501, -350862, -103528, -165748, 8898, 32981, -259549, -108682, 29485, -255353, -246187, -220482, -32172, 245940, -11703, 303019, -393758]
19378a74149F1824c48123A59340j221k4895b6016A23773d4032J8171o2702j36424
19367b24987J8616O6019H8097d31425a33857j11702b1335H6835a13847d887A49008
19355D3129J30918c55825G4952P6548b11317A87422J77c8011q8468j55973B4667
19343C9685a77153f6792j85423a7073K222j15932L321A06356b00852L0775j82053
19332c52130A06766J38972I2760b76715P7524R6174j4026p7601k4332h4537Q907
19321g5630E7686b11043L5988D5950K1458b81301a28465j04058C3558d7448k45130
19310b92578h9507A26795O9382f1671k57776g949m54890A41744f6262p3732C697
19298G2111O7268b29472F1350a08781G6415b94754e9899j99016m17J28985l18397
$$ y = [-174149, 61824, -348123, 159340, 158119, 133224, -26016, 123773, -44032, -25861, -88563, -224987, -206371, -140352, 88097, -431425, -133857, -245559, -21335, 86835, -113847, -4887, 149008, 43129, 174047, -355825, 74952, 151500, -211317, 187422, 187599, -38011, -126479, -282452, 24667, 39685, -177153, -66792, -252215, -17073, -14851, -130783, -127462, 106356, -200852, -170077, -352130, 106766, 245738, 92760, -276715, -199191, -103017, -117043, -194644, -218976, -84537, -75630, 57686, -211043, -175055, 45950, 67408, -281301, -128465, -232523, 33558, -47448, -292578, -89507, 126795, 196177, -61671, -319447, -7949, -462839, 141744, -66262, -139994, 3697, 72111, 139379, -229472, 61350, -108781, 76415, -294754, -59899, -258915, -259332, -130347, -448744]
19287d48744A16621c8928k03206A1206c15581C19127A5801f5466A2282P869a34147
19275a83008C8226d6578C72368a94308B79594c69720B71478o5962a87754Q1271
19265a06483A72561d03531a51430A14503M3895f8602D0198a79120f7740A58039
19254F7271C3040c13692R1932J1002j27860a0565C7903d4A07590b31155m0124
19243b71279A93617c0204A19370b72877c5928J727k55601F163a03140j66953A9617
19231a88459M1124N8509I9189c5280B13572g7009A14385b68520k46647a30377
19220b11759B54286d26333d8015k74368h8440B0423b88391c9867j232J2585j60518
19209a89032A92619g2002j16420p8309b748E6406P7279m0203a52177k16110a04081
$$ y = [-448744, 116621, -38928, -242134, 11206, -315581, 319127, 15801, -65466, 12282, 20151, -134147, -183008, 38226, -46578, 372368, -194308, 279594, -369720, 271478, 205516, -187754, -106483, 172561, -403531, -151430, 114503, 158398, -68602, 40198, -179120, -67740, 158039, 67271, 33040, -313692, -221760, -210758, -338618, -10565, 37903, -44, 107590, -231155, -271279, 193617, -30204, 119370, -272877, -35928, -34201, -289802, 6163, -103140, -270093, 19617, -188459, -147335, -88826, 99189, -35280, 213572, -77009, 114385, -268520, -515167, -130377, -211759, 254286, -426333, -48015, -322383, -88440, 20423, -288391, -39867, -41099, -28514, -189032, 192619, -72002, -188422, -266731, -2748, 56406, 133685, 93482, -152177, -368287, -104081]
19197F3822b7449l33332a479l60581I454e7553E1556J36309b63147B8570g4144
19185a70072J3413A0891b48235A7484e9870m8346c2229p5635Q230j49538f6906
19173H8891L2329c09777a00847b5391k05939Q8411I5297b323G7226J71969g0608
19161B3020M9542b5774j72786B02457b97028a48291c2776A19649J01049d0166
19150a74538K5373L6087A29772E2347a44523j02015B07794b77482Q9785b0416
19139B36878A323J62029b36270a01307k4279K9878A5874R6024b399A02462J75399
19128B77861b50503A86118c3220l20745I4368J4044K72031a96083r864c4722i409
19116A69665g6672p1463n9167a9962k4383j76496B19379a97523D8383I110c18881
$$ y = [63822, -27449, -360781, -1479, -362060, 9454, -57553, 51556, 187865, -263147, 28570, -74144, -170072, -156659, 10891, -248235, 17484, -59870, -108216, -32229, -107864, -99634, -249172, -66906, 88891, 121220, -309777, -100847, -25391, -231330, -142919, 95297, -2323, 77226, 249195, -70608, 23020, 72562, -25774, -198560, 202457, -297028, -148291, -32776, 119649, 220698, -40166, -174538, -149165, -113078, 129772, 52347, -144523, -246538, 207794, -277482, -187697, -20416, 236878, 1323, 163352, -236270, -101307, -125586, -95708, 15874, 111898, -2399, 102462, 277861, -250503, 186118, -33220, -353965, 94368, 108412, 380443, -196083, -205947, -34722, -9409, 169665, -76672, -148135, -207302, -19962, -44345, -220841, 219379, -197523, 48383, 9110, -318881]
19104a09680M0340B26533o2712a72032C45167a53257P6382B6173b75767F339a0823
19092c8019j29189Q2303A14210c8580k9175m7002j7915d4073j66157R0961j0588
19081a29857o4134B2852a35021A9545G539a40861r5375a13661I0660b10082k42737
19070d52819A37739b76507o1090A68516C7010O7143N6875J35237A45557b54523
19059b30112i009C5608N7302i0945A36212A1750K1085M6370b22529E1374N033
19048E6407c83928i4671m7141B12213A7242a84992a359p8170k09622a35337G4613
19036a40453n1310g6053b7173A37701e27771B9937L3819a70023b7893A39816A1238
19024B11357e5737A19005b27750A79443a07725e249E5648b28897A30537E5185
$$ y = [-109680, -69340, 226533, 163821, -172032, 345167, -153257, -76875, 26173, -275767, 6339, -10823, -38019, -167208, -84905, 114210, -38580, -67755, -114757, -132672, -44073, -210230, -119269, -129857, -193991, 22852, -135021, 19545, 7539, -140861, -236236, -113661, 90660, -210082, -452819, 137739, -276507, -337597, 168516, 37010, 104153, 161028, 296265, 145557, -254523, -230112, -9009, 35608, 92910, -90945, 136212, 11750, 32835, 79205, -222529, 51374, 56407, -383928, -94671, -141812, 212213, 17242, -184992, -1359, -79529, -289151, -135337, 74613, -140453, -191763, -76053, -27173, 137701, -527771, 29937, 63756, -170023, -27893, 139816, 11238, 211357, -55737, 119005, -227750, 179443, -107725, -5249, 55648, -228897, 130537, 55185]
19013B05766I5628M4226A7151i1080j9763B3245Q3964f9652F3843J08540a58457
19001A71680A1176c1334B20736a09463L4728j93682a09072A80514a22898k67634
18991c90532J38194M5197R3356m7068a9959l3734B23915d329j70070b1643H3689
18979g9897p7751K0055f878m3934j70336L7516E5300b48381r389A51621M2083
18968A93704c09087A8505f0391G9532O8167a31577q7491j92068A02242c46293
18957d5881a8428m7036j49137A39405o2360L1494a59699J5061j17612A333i0980
18945B5150e5469j6285k01928C8152g3085c718A91716b21891Q9112L5503M4562
18934e2714I207L52362F1254j2797C679c4790A70843e6935B26408r6572k6444
$$ y = [205766, 95628, 139854, 17151, -91080, -110843, 23245, 107209, -69652, 63843, 172383, -158457, 171680, 11176, -31334, 220736, -109463, -74735, -268417, -109072, 180514, -122898, -390532, -252338, -207141, -113785, -160853, -19959, -53693, 223915, -4329, -174399, -21643, 83689, -79897, -157648, -137593, -6878, -50812, -221148, -183632, 55300, -248381, -257770, 151621, 193704, -309087, 18505, -60391, 79532, 147699, -131577, -219068, -411136, 102242, -346293, -45881, -18428, -65464, -214601, 139405, 77045, 108539, -159699, -144638, -262250, 1333, -90980, 25150, -55469, -71754, -273682, 38152, -73085, -3718, 191716, -221891, -132779, -97276, -52714, 9207, 361569, 61254, 48457, 3679, -34790, 170843, -56935, 226408, 129836, 103392]
18923A03392o741f2757k10380R2890n412D6830I235a28112d2763A54214j2206
18912A42008h592j20824p5827M4472q6930J07640l1542b5753C01815a84547Q9554
18901i4993C4047K8958j3369a57248a9150j73164o9862A23241b67314d8201r5239
18890a43440B66098F4554a28676d9452I4041A49K0945a41485B10340G4090K205
18879G6295g9777J313B1843a42397B85201i9577j25816M3792b788j1632j69897
18868a84317B58436c5234j5226j76291A71492L3726c352B2739b19566H3998f2066
18856A39904b46911a10480A98181J37260C206Q2195j5905k9803K12649j5467b1945
18844a25491j7813G1861a40402C24569a01502D3339e3297b6580A42856c06309
$$ y = [103392, 96651, -62757, -273137, -180247, -185659, 46830, 9235, -128112, -42763, 154214, 142008, -8592, -129416, -205243, -160771, -247701, -140061, -171603, -25753, 301815, -184547, -94993, 34047, 63005, 49636, -157248, -19150, -192314, -262176, 123241, -267314, -48201, -143440, 266098, 64554, -128676, -49452, 94041, 149, 21094, -141485, 210340, 74090, 76295, -79777, -78464, 21843, -142397, 285201, -99577, -225393, -181601, -2788, -14420, -184317, 258436, -35234, -50460, -226751, 171492, 205218, -3352, 22739, -219566, 83998, -62066, 139904, -246911, -110480, 198181, 335441, 3206, 85401, 69496, 39693, 252342, 236875, -21945, -125491, -143304, 71861, -140402, 324569, -101502, 43339, -53297, -26580, 142856, -306309]
18833a93096c5752G29b57464H7866c93090b0699A57023b86623G5768d6179j65553
18822b11732a3620B0182Q8770b4104B70346A34496l7285d6215B19093j03627c6735
18810A06858J8467J32434A19811C5325a83083H5469b92511a30268b7587H234N8980
18799F7214i2577A62885f0946j2355A41741i6125l2084H5901c8431A64228b51613
18787B5197a16991A29520g2173B5741L46384A4495a57365H0978a11766j06161
18777b17927B33411C1939J37889a49290F9974a0645G2891a1020k10543P7042M6936
18766i7585A68558a65100M6512G4883a15031j91835A02011J04342a03789k13897
18756c17686A63658a24141o27A72456d24746a13330A6231h9788o7629C35833a35378
$$ y = [-193096, -35752, 729, -257464, 87866, -393090, -20699, 157023, -286623, 75768, -46179, -211732, -13620, 20182, 108952, -24104, 270346, 134496, 97211, -46215, 219093, 115466, -36735, 106858, 125325, 257759, 119811, 35325, -183083, 85469, -292511, -130268, -27587, 8234, 67214, -92577, 162885, -60946, -73301, 141741, -96125, -128209, 85901, -38431, 164228, -251613, 25197, -116991, 129520, -72173, 25741, 372125, 14495, -157365, 80978, -111766, -217927, 233411, 31939, 169828, -149290, 69974, -10645, 72891, -11020, -221563, -144521, -97585, 168558, -165100, -118588, 74883, -115031, -306866, 102011, 206353, -103789, -317686, 163658, -124141, -124768, 172456, -424746, -113330, 16231, -89788, -157417, 335833, -135378]
18744B05081b26310L7454a5181q490j43831j4255g1856A31411a17086e1500j32337
18733a83837E15758i6096o6679a7986E1240b59070B36895d7355r1451K1701D8946
18721a00429l33888d1153j83518A36455D6067i2893R49c0148r4k69976a27693
18709B57454J1412D5525K5472a5640j51479A62899a18696M3667a833B5267d26783
18697A10045b96056A78989g9089E8075e1611C4681f9559L1329l36994B2232J77265
18686A99497h4007I3175a37393p938j68748a9679A29409k1190D0365M0778b42733
18674b82138Q1782j32663h4025H0979K7826a20741o9612I197a33797A5137b83156
18662A96969B4729b43126G7454a34970g609B48124b10140A80229b43515J20991
$$ y = [205081, -226310, -188856, -15181, -23671, -167502, -181757, -71856, 131411, -117086, -51500, -183837, 515758, -96096, -162775, -17986, 51240, -259070, 236895, -47355, -138806, -117105, 48946, -100429, -434317, -41153, -224671, 136455, 46067, -92893, -91944, -30148, -30242, -300218, -127693, 257454, 268866, 45525, 70997, -15640, -167119, 162899, -118696, -75029, -1833, 25267, -426783, 110045, -296056, 178989, -79089, 58075, -51611, 34681, -69559, -38230, -375224, 22232, 199497, -84007, 93175, -137393, -145331, -314079, -19679, 129409, 108219, 40365, 81143, -242733, -282138, -200356, -333019, -84025, 80979, 108805, -120741, -190353, 9197, -133797, 15137, -283156, 196969, 24729, -243126, 77454, -134970, -7609, 248124, -210140, 180229, -243515, -122524]
18652a22524k69782E4732j8586r027K53050A24572a04474F0580P2924R2786h3152
18640D6004a55946F4347R1114d1856l88898b061A27526a58686D43219c4917l97527
18629d32444A24826a36297d2144I2080b77374G3839a64140f3559A57375c00157
18618B1204M8503b77932A76526a23922D5424e6708j78221e8377j58686D4840K2755
18607F7595b97275d7853m3919E7036a48374E1542L7440e2018j42505m7569c8279
18595c9901B31809a22783j6017c9567D6150J39723f2154C98476a48223A31998
18584C6721c624r8003j12465B3060b27298A2668P6889b59988C7994a12523E0157
18572G0576e7473E9471O450a40866d4926l2157o8786M1962K2520B41841c10365
$$ y = [-122524, -392306, 54732, 36146, 27119, 280169, 124572, -104474, 60580, 133504, 226290, -83152, 46004, -155946, 64347, 155461, -41856, -430754, -2061, 127526, -158686, 443219, -34917, -432444, 124826, -136297, -42144, 92080, -277374, 73839, -164140, -63559, 157375, -300157, 21204, 69707, -277932, 176526, -123922, 45424, -56708, -234929, -58377, -217063, 44840, 67595, -297275, -47853, -91772, 57036, -148374, 51542, 88982, -52018, -194523, -242092, -38279, -39901, 231809, -122783, -138800, -39567, 46150, 185873, -62154, 398476, -148223, 131998, 36721, -3624, -101627, -214092, 23060, -227298, 12668, 89557, -259988, 37994, -112523, 50157, 70576, -57473, 59471, 65921, -140866, -44926, -77083, -145869, -103907, -81387, 241841, -310365]
18560A12560b37393B80550B1079F427a87420G2407c93594a6890m0939k10987B8119
18548b35930F9158a94730j10238B00615f1696j059A6856a75629E9996b13707A28429
18536b00684d7852F9536i7439A1515b27429G1288N8985k359b27908a05923B78911
18524G3151a01581j33082D1706a26738d7530j83173F7311N5563A9518a90985R3136
18513i7849k9801j93770D1326b65688N6864b8950C7125c87440e8575B01876a6558
18501B70910d7606l47341F8500R1311g4896j67634a3874k5060A67431p6571c84194
18489h0699k28514M8832F8756e4182k84342D5615b15028e0873a599G9662d18278
18477d22044i6027D1264I509J78836a31901I0780f0730C42846a17040L5871A01912
$$ y = [112560, -237393, 280550, 21079, 6427, -187420, 72407, -393594, -16890, -57829, -268816, 28119, -235930, 69158, -194730, -304968, 200615, -61696, -62755, 16856, -175629, 59996, -213707, 128429, -200684, -47852, 69536, -97439, 11515, -227429, 71288, 130273, 127914, -227908, -105923, 278911, 73151, -101581, -234663, 41706, -126738, -47530, -230703, 67311, 122874, 19518, -190985, -97849, -127650, -321420, 41326, -265688, -208824, -28950, 37125, -387440, -58575, 201876, -16558, 270910, -47606, -394947, 68500, 159811, -74896, -242530, -13874, -38934, 167431, 90860, -384194, -80699, -309213, -260381, 68756, -54182, -338524, 45615, -215028, -50873, -1599, 79662, -418278, -422044, -96027, 41264, 9509, 188345, -131901, 90780, -60730, 342846, -117040, -81169, 101912]
18465A02159E759b12206c2298k93790F1113b33821A14932a31286c5732A49054
18454c7339l68089h7937B360O0279k5365b55895d1006j39742P3551C25762B7900
18442g7828j53250A09270a69217K7834L3490O370e085k80947J05299P0496G3594
18430f7335P727K3335B2256a84128h994l030j08330G3153c18007f2955K3948l1691
18418g0698C3925b92767B243d7430j17738A02940B9830J01889f6523E885a20506
18406b9809k6546N062E8321M0963D3986b2326p5524j5703B07614n6413a6340A56162
18393e04530A40672J2750B2611b6095l53359B08168a88750I3557J41068K2345
18383B56970b14847B7655a68630r4047A88305c4175o161H9018a6636A123b08019
$$ y = [102159, 5759, -212206, -32298, -326088, 61113, -233821, 114932, -131286, -35732, 149054, -37339, -405428, -87937, 2360, 62639, 37274, -255895, -41006, -180748, -107197, 325762, 27900, -77828, -231078, 109270, -169217, -141383, -107893, -101523, -5085, -286032, -180733, -110237, 73594, -67335, -59608, -36273, 22256, -184128, -8994, -12024, -120354, 73153, -318007, -62955, -39007, -70698, 33925, -292767, 2243, -47430, -165168, 102940, 29830, 131719, -66523, 5885, -120506, -29809, -56355, -51293, 58321, 99284, 43986, -22326, -97850, -113553, 207614, 151201, -16340, 156162, -504530, 140672, 153422, 22611, -26095, -379454, 208168, -188750, 93557, 234625, 256970, -214847, 27655, -168630, -262677, 188305, -34175, -40336, 89018, -16636, 1123, -208019]
18371b15455M3638I6418b40694D82859c80764C5626J78248A5968J720b43229B93289
18359g7679k1369k73678a16325K2457G2399c6906n6177m4314F0329K63428a98542
18347F6103f1356B13818c6810E2569h2825B69739j27048L3379e5329o3408p9072
18336a97809B07978a82022A52690F4115J28379D5487J47446b33139F7302L7597
18326A04899k6815K90250a60737k00329d2496j52721L4773n3056Q7139A15571
18315a1429j20972E9519L51997A65087E8967a23040j82147h2032B53206m4036
18305B09170a84423Q0284j28935B1217L53792A16784J35791A02855c02768I4581
18294i6991l29250B67125j27762K9535a34850A32526o3174O4424b11787i4191
$$ y = [-215455, -171817, 96418, -240694, 482859, -380764, 35626, 213874, 15968, 17688, -243229, 293289, -77679, -99048, -372726, -116325, -93868, 72399, -36906, -93083, -137397, 60329, 323757, -198542, 66103, -61356, 213818, -36810, 52569, -82825, 269739, 142691, 176070, -55329, -118737, -197809, 207978, -182022, 152690, 64115, 192494, 45487, 192933, -233139, 67302, 104899, 78084, 368334, -160737, -361066, -42496, -195217, -160444, -213500, -126361, 115571, -11429, -132401, 59519, 411516, 165087, 58967, -123040, -305187, -82032, 253206, 209170, -184423, -104139, -233074, 21217, 375009, 116784, 252575, 102855, -302768, 94581, -96991, -426241, 267125, 139363, 168898, -134850, 132526, 69352, 133776, -211787, -94191]
18283b51410H1131J48702C7168b07270A1683a97348n1990J11796h195j41315A37799
18271h6073J1964A46501b571A5263f4283B08740c7429o7944j62569B56632j20043
18260A36589E6580k097P5570g7804k25437d7912B02284m1607a57618D795M0551
18249D5346d32704h2463A3005L6020b06013P6842d29k9856m7371A21960J51066
18238B73026p0544b7649A81942J82068a5472A51005E6523a58757P5659j81325
18228b64423A07081J83221a44023L7766J5997c6712n0268j07625C7956b76998
18217a69624H8024c232j08444C0733g5726k65447d4582H0621J25310I325a2208
18205a25271j02508j46119f0877B28032g0316j55985m2158F0416b57083o4404
$$ y = [-251410, 81131, 229833, 37168, -207270, 11683, -197348, -249338, -137542, -8195, -149510, 137799, -86073, -74109, 146501, -2571, 15263, -64283, 208740, -37429, -105373, -267942, 256632, 136589, 56580, 54483, 130053, -77804, -303241, -47912, 202284, 160677, -157618, 4795, 45346, -432704, -82463, 13005, 49025, -206013, -129171, -429, -30285, -77656, 121960, 273026, 202482, -27649, 181942, 364010, -15472, 151005, 56523, -158757, -83098, -264423, 107081, 290302, -144023, -106257, -90260, -36712, -86980, -194605, 37956, -276998, -169624, 88024, -3232, -111676, 30733, -75726, -341173, -44582, 80621, 205931, 9325, -12208, -125271, -227779, -373898, -60877, 228032, -70316, -226301, -268459, 60416, -257083, -321487]
18195c21487H5640k2936i2972j11412H2258J77981B3175a93224A42045a50577
18184A51829a21196L8134C29693H2022f0357j37883A68246a20570j7326A42715
18173f6678c1882B28661q7381h3329k2119j27195Q6051o7014A49737d3542j22560
18162a66102P1123A0923c18102A29140a76241j13732A97776a2281k04677j07387
18152c24345h0100A09832d4062B12119c81994a10930d5255l6712j05663B68668
18141b09285J04489A34530h9415H581M3875I789K82671c6718B29225H6799D1759
18129B9841i3272B59590d04803d1434l2445B22312b09846A00840a55691c022k19438
18118b22460B1145e4805p5791l2594a8854A90693D084N2292L6126d8280B143R591
$$ y = [-321487, 85640, 62704, -92972, -204384, 82258, 260239, 23175, -193224, 142045, -150577, 151829, -121196, -83062, 329693, 82022, -60357, -198240, 168246, -120570, -137896, 142715, -66678, -31882, 228661, 141280, -83329, -105448, -232643, -146592, -213606, 149737, -43542, -166102, -94979, 10923, -318102, 129140, -176241, -289973, 197776, -12281, -216958, -324345, -80100, 109832, -44062, 212119, -381994, -110930, -45255, -81967, -187630, 268668, -209285, -104796, 134530, -89415, 8581, 52456, 9789, 292460, -36718, 229225, 86799, 41759, 29841, -93272, 259590, -404803, -41434, -73879, 222312, -209846, 100840, -155691, -3022, -222460, 21145, -54805, -130596, -163190, -18854, 190693, 4084, 56376, 92502, -48280, 2143, 11734]
18106A1734h0296E5266c6173r8487A17093J3231L1360L9546a81505E3832a93674
18094b47730D8072j6531q240J82394a61370j49001F0213A8718a3343B71280b0220
18082A31127i2146A10883a16091k82008J49674j6297G436N4322a206o0718A9309
18070H4317j9293K70408d8946B07088o0725l3187a64209A06431a67650l3367B45873
18058A32148B5102N261J0579E981d8796A9762J1258b4604B59473a5987P40A51554
18045B15944D8393a78660B81062f0667j52744G3118a79776n10167a11047A06010
18034c06622C28468c55066n7555b4454A7618a909l6002m63490f0236J2686E1945
18022A6739a51226l4764A36139l3095d6283k9442a3152A10477J32231G7021k2868
$$ y = [11734, -80296, 55266, -36173, -134660, 117093, 130324, 161684, 201230, -181505, 53832, -193674, -247730, 48072, 31541, 23301, 205695, -161370, -310371, 60213, 18718, -13343, 271280, -20220, 131127, -92146, 110883, -116091, -398099, -248425, -264722, 7436, 61758, -1206, -61924, 19309, 84317, 65024, 335432, -48946, 207088, 146363, 113176, -164209, 106431, -167650, -201017, 245873, 132148, 25102, 30363, 40942, 5981, -48796, 19762, 31020, -24604, 259473, -15987, -15247, 151554, 215944, 48393, -178660, 281062, -60667, -213411, 73118, -179776, -689943, -111047, 106010, -306622, 328468, -355066, -412621, -24454, 17618, -1909, -37911, -501401, -60236, -47550, 51945, 16739, -151226, -185990, 136139, 103044, -46283, -75725, -13152, 110477, 242708, 77021, 54153]
18011E4153f8256B6717c41836J66750B40001I7702c63923E1310N2525b38401E7049
17999A49798a97251A82204a05130k15304L9738a5081A07909b0641j26285B21727
17988a67449D29683A57418L3238A7143l507J49855a24823j33034Q1145e2558C54748
17976b34125M9887G3895g143I9771D4706O5018K76764b03295d742n6018B61108
17964I7000c01951A15644A2767k320M0099M101a36408D2918h9970j45176g8561
17952a45232G9028a40889l4582B80853A294J1853A863b20413N715N9558c6702
17940a73600A99509e16216h6361B7994J77466b06103N1377e9080Q646l26596d2846
17928a55795L9976C0195g1633B6845J0110b95574A09359K593e3708j6118A69280
$$ y = [54153, -68256, 26717, -341836, -175086, 240001, 97702, -363923, 51310, 103835, -238401, 57049, 149798, -197251, 182204, -105130, -320434, -280696, -15081, 107909, -20641, -146926, 221727, -167449, 429683, 157418, 190656, 17143, 13636, 163491, -124823, -257857, -176712, -52558, 354748, -234125, -184238, 73895, -7143, 99771, 44706, 109724, 386488, -203295, -4742, -60760, 261108, 97000, -301951, 115644, 12767, 10447, 50546, 54647, -136408, 42918, -89970, -235146, -78561, -145232, 79028, -140889, -175471, 280853, 1294, 13147, 1863, -220413, -214698, -155140, -36702, -173600, 199509, -516216, -86361, 27994, 205460, -206103, -154726, -59080, -50434, -377030, -42846, -155795, -115819, 30195, -71633, 26845, 36955, -295574, 109359, 111952, -53708, -69826, 169280]
17916A78001c2088p9795a0062G176K06965a3823H5955J63214r237f6226q9399
17905a55625o1273B0154J5124a0619C61792c6122j97630j5446A45702a45682h477
17893C4385K38946b23772i6988r0280L1572f051A3457R0757g69j10905A41775
17881C44852b95507a5250E4067J74680a03856B51512N4732o7284k3711a20776
17870a46451e0276B98244J12437a94802F9553b91241j7468A32681J12567b55935
17859B87059f1871C03812d2047A08174L9278i4550J6730l5401M1407j4986A91964
17847g5571m5511n799c6070A73755b47992g1323j8121A57576b74083b9205b447
17835c68054a15216M2151A16287a85515q9292E8606L062a37282A75249C7785l436
$$ y = [178001, -32088, -111883, -10062, 7176, 214141, -13823, 85955, 249169, 239932, -66226, -155625, -216898, 20154, 35278, -10619, 361792, -36122, -233752, -249198, 145702, -145682, -8477, 34385, 273331, -223772, -96988, -187268, -155696, -6051, 13457, 104214, -769, -111674, 141775, 344852, -295507, -15250, 54067, 228747, -103856, 251512, 306244, 238960, 215249, -120776, -146451, -50276, 298244, 410681, -194802, 69553, -291241, -308709, 132681, 245248, -255935, 287059, -61871, 303812, -42047, 108174, 147452, -94550, -77820, -113221, -71814, -86800, 191964, -75571, -121082, -126881, -36070, 173755, -247992, -71323, -89444, 157576, -274083, -29205, -2447, -368054, -115216, -73065, 116287, -185515, -274807, 58606, 61668, -137282, 175249, 37785, 34349]
17824C4349L7111M9248j4087d2282l1152m2303j47768M7494e6256H7373h8858
17812b3389A7188e521A86884E5518P890L0444a48516g4122j30505R4702A08479
17800B9728J57070m6657c4015B54143p6255o6422G362J61K89173D4962a02081
17788A62017b14046o7687G0876a25172E1873J02402a25969j03869b5499j73909
17778a99408d5425A74418B6690I560b04621l1265J3948A05511l0895C5680J39602
17767A75282b2045B14818D7558f5116D77800c6166A16150k5112l3816b31566e9712
17755b60330R7859A53353b17055A7252b92696J38314l911A59031e2899o811A83584
17743a06583r7674c3960j00086H1115L91183h224j36740q8600B49602e7505a5124
$$ y = [34349, 71460, 120708, 106621, -42282, -73434, -115737, -263505, -216011, -56256, 87373, -88858, -23389, 17188, -5521, 186884, 55518, 63408, 93852, -148516, -74122, -204627, -109925, 108479, 29728, 186798, 140141, -34015, 254143, 177888, 111466, 7362, 7523, 296696, 44962, -102081, 162017, -214046, -281733, 70876, -125172, 51873, 154275, -125969, -229838, -25499, -199408, -45425, 174418, 26690, 9560, -204621, -235886, -221938, 105511, 74616, 35680, 175282, -22045, 214818, 47558, -65116, 477800, -36166, 116150, 91038, 57222, -231566, -59712, -260330, -162471, 153353, -217055, 17252, -292696, -154382, -158293, 159031, -52899, -59710, 183584, -106583, -204257, -33960, -134046, 81115, 472298, -8224, -144964, -233564, 249602, -57505, -15124]
17731G9926b50891A68024A1082b88531J14512I8115J5160J12822a4582n1551A47575
17719g3916j0969k10752g0273H0879g6965A6814K823P693L3521h3314K8216b6236
17706c10919c5794j47603B80372I3458i7490A03874c33681A51040a61116d8843
17695H6464b35546N8190d6463g948k23713E2360N9876B9690P6166a9973D6679
17683A0685d157j563o5593F0129b82774E1592b02557A1080J50846a34797I1560
17671c04626A71591O9053r0308b52776I383J48528b47485B15148g6407G7701K6210
17660A03911a28000l09489B93482P2445b05734i0741q7301C81033j80400i6143
17649b47010C9931h5101j011A70043b37046A10365b0969k66742A03158Q6681M4163
$$ y = [79926, -250891, 168024, 11082, -288531, -174019, 98115, 113275, 226097, -14582, -66133, 147575, -73916, -84885, -295637, -70273, 80879, -76965, 16814, 19637, 27330, 60851, -83314, -55098, -26236, -310919, -35794, -183397, 280372, 93458, -97490, 103874, -333681, 151040, -161116, -48843, 86464, -235546, -177356, -46463, -7948, -231661, 52360, 112236, 29690, 105856, -19973, 46679, 10685, -4157, -5720, -71313, 60129, -282774, 51592, -202557, 11080, 161926, -134797, 91560, -304626, 171591, 240644, 150336, -252776, 9383, 157911, -247485, 215148, -76407, 77701, 103911, -128000, -437489, 293482, 365927, -205734, -90741, -178042, 381033, 200633, -96143, -247010, 39931, -85101, -86112, 170043, -237046, 110365, -20969, -287711, 103158, 189839, 234002]
17638B34002D5489J37749c68431g1360A4476L2365a05689A33880l9394b84555
17627b69654E089J35279P6684d2635B55551H0405L8273K52668a18118l0341H4118
17615h235A16766a24861A90071J6657n3641F1227h9362J0113B5000P5052O2366
17604A62418M6718h3978B13391O0643j23824a82162A84464a40869j33228B2702
17593B67955Q2283j72211n0914J10681q0821a44555k653b3909B19508D1987M0331
17582H2318l3547J59149a3422B57852F3901c9548E0444K01756F8520d4494j37490
17571a81984B59407c1620j71737I0655Q6467b20573h7504G2853f9556A5833J92543
17560B08376h0653M457F5502J45117K685g802C62513B5333a50216F5838r882a45473
$$ y = [234002, 45489, 183238, -368431, -71360, 14476, 46841, -105689, 133880, 94486, -284555, -269654, 5089, 140368, 217052, -42635, 255551, 80405, 118678, 371346, -118118, -148459, 84118, -8235, 116766, -124861, 190071, 206728, 153087, 61227, -89362, -79249, 25000, 100052, 162418, 209136, -83978, 213391, 274034, 150210, -182162, 184464, -140869, -274097, 22702, 267955, 350238, 178027, 127113, 237794, 156973, -144555, -147208, -23909, 219508, 41987, 82318, 48771, 207920, -13422, 257852, 63901, -39548, 50444, 252200, 68520, -44494, -181984, 259407, -31620, -203357, 90655, 177122, -220573, -87504, 72853, -69556, 15833, 208376, -80653, -76196, 65502, 210619, 213304, -7802, 362513, 25333, -150216, 65838, 55956, -145473]
17547D03398h3907A16497a84126I767J51420A6556a81851c1781n0346A35416a80734
17535G3280J81855h4122H9780j3005K02365a51906A95687C2606d2271A21826b25775
17523C20491A0303O7378J8087J94107H8116a27251I9907J89514a54122A06431
17512F6031J75030r704L0717j4517i9486A52235J60887a4854B52751c13630A24258
17500b38422B45738G0118J1404O0200j0023g6824G613R6369K15913A47435K75148
17489D22583j97837o0606R2466A7427C34K0591J6063J77136d7231n4371B78326
17477a25745A32741m0089e9661F75757a41137C83678j27377K4165J15083g361
17466B61471j06748a4203A69489a16418B56634b7908H7890J37782m530R7043H880
$$ y = [403398, -83907, 116497, -184126, 9767, 161187, 16556, -181851, -31781, -82127, 135416, -180734, 73280, 255135, -84122, 89780, 76775, 279140, -151906, 195687, 32606, -42271, 121826, -225775, 320491, 10303, 77681, 95768, 289875, 88116, -127251, 99907, 289421, -154122, 106431, 66031, 241061, 231357, 262074, 247557, -99486, 152235, 313122, -14854, 252751, -313630, 124258, -238422, 245738, 70118, 81522, 141722, 131699, -76824, 7613, 103982, 319895, 147435, 422583, 224746, 164140, 256606, 17427, 334, 20925, 36988, 214124, -47231, -101602, 278326, -125745, 132741, 92652, -59661, 675757, -141137, 383678, 256301, 280466, 395549, -7361, 261471, 154723, -14203, 169489, -116418, 256634, -27908, 87890, 225672, 221142, 318185, 8880]
17454B11070G2102J40598m8483P2083K286j9071n8110c6350A5796K87694A25885
17442A85449H93J53752i9543l6059d776C27582d1484B30831o3859J06267f8225
17430d8236b342A87310M3488C0755L19551p6426J60839C3332J49086F9618O4721
17419A34339n7413a37744H1562K61421a23551C28287B9226Q9314l7979J11461
17409A92022J69656j46669d0376B2328N07893k51013j142J1552N6577a07241D6321
17397C89929j72940j862j01400P5842L27413f2600A70873J61449D5613K33840
17387B79453a79381A29573b369C21674h2300A86288K0147J4337E1972J1021b99188
17375b01840F9742e8895A8214J62362o736a11643I2727J1278K2893a91695B3186
$$ y = [211070, 72102, 212700, 164217, 236300, 238586, 219515, 161405, -36350, 15796, 303490, 125885, 185449, 893, 154645, -99543, -135602, -4776, 327582, -41484, 230831, 166972, 273239, -68225, -48236, -2342, 187310, 230798, 30755, 350306, 273880, 434719, 33332, 182418, 69618, 134339, 76926, -137744, 81562, 342983, -123551, 328287, 29226, 118540, 80561, 192022, 361678, 215009, -40376, 22328, 530221, 279208, 278066, 289618, 346195, -107241, 46321, 389929, 216989, 215127, 113727, 189569, 516982, -62600, 170873, 332322, 45613, 279453, -179381, 129573, -2369, 321674, -82300, 186288, 206435, 220772, 51972, 62993, -299188, -201840, 69742, -58895, 18214, 180576, 173840, -111643, 92727, 104005, 126898, -191695, 23186]
17363c31831A149J79648J02908G0667J1004M30120B44315a11350b4852I4172a86889
17351a2601C1873R6582Q6877G0583M4540a6888A64987F1294K23676j41132R2389
17340B36227q1720o5834j445J78392j16025g1719B55783F1794a19563G518J03067
17329A10585j2510O4226o0222R7869E2919i4842D5557f4021A41960E5622N45958
17318F01580A45K83932i1135n4622A00295C6928b26957e787q9475A35709J12351
17307B48060q6711d7370k0168B90352f4119B25018G1706l1835J27537J26049d7937
17295A38037K04813A05053N614d2309a1022A47824p2397m538M3880e7572D18353
17283g5673F1022J06225K01503k0266j62450J1208q5913N6219L43279A00827O6845
$$ y = [-331831, 1149, 180797, 283705, 70667, 81671, 511791, 244315, -111350, -24852, 94172, -186889, -12601, 31873, 128455, 215332, 70583, 115123, -16888, 164987, 61294, 284970, 143838, 236227, 154507, 88673, 87228, 265620, 149595, -71719, 255783, 61794, -119563, 7518, 110585, 98075, 162301, 102079, 199948, 52919, -94842, 45557, -64021, 141960, 55622, 601580, 145, 284077, -91135, -145757, 100295, 36928, -226957, -5787, -95262, 135709, 248060, 161349, -47370, -67538, 290352, -64119, 225018, 71706, 39871, 167408, 293457, -47937, 138037, 342850, 105053, 110667, -42309, -11022, 147824, 75427, 70889, 114769, -57572, 418353, -75673, 61022, 167247, 368750, 348484, 186034, 197242, 111329, 167548, 510827, 100827, 167672]
17272A67672L79846a51206D20181a32884D2686L08377j21051k8210k620O399Q6429
17261B92010B3975J09843m7178J20589b4658l6276A43937K98208H3981L29533
17251D13514j59836j18541J57646N0867A43308J65254E8284b14127A33853g1582
17240b86363C23515G3306N1962j9821A0547J81217F4904m418K85934k4538l2372
17229B89510o2879a48330A33045D637f3406A95433F976K19089O835J57281E733
17217C44856I1949K26827k7239H2003g2640G3675O6598k2994L38989c8729A43524
17205F74455B84414C4636J59083C6257J87318O0861A19993n1888A1428K49566
17195B60994e5237A38245J1723a39069B93255b7297C64756a55832C44788H9948
$$ y = [167672, 547518, -151206, 420181, -132884, 42686, 351063, 230012, 201802, 199182, 205581, 292010, 23975, 133818, 86640, 207229, -24658, -60934, 143937, 442145, 83981, 413514, 253678, 135137, 292783, 343650, 143308, 308562, 58284, -214127, 133853, -71582, -286363, 323515, 73306, 125268, 105447, 10547, 191764, 64904, 60486, 346420, 321882, 289510, 226631, -148330, 133045, 4637, -63406, 195433, 6976, 226065, 232900, 390181, 5733, 344856, 91949, 318776, 291537, 82003, -72640, 73675, 140273, 117279, 456268, -38729, 143524, 674455, 284414, 34636, 193719, 36257, 223575, 284436, 119993, 68105, 11428, 260994, -55237, 138245, 149968, -139069, 293255, -27297, 364756, -155832, 344788, 89948]
17184A89749H5845K85581A01160J16446J96613k0180r3395l8123j12147c017C17704
17172A36394E157L34238A28190L66330B04357O8214R1183p7312H0016K4132K86926
17161C91074n4824L0432P7511j65419Q998q3930f4811E22900p0547A73053F1037
17149I548N92936A48461L34934j56700K2075l4094M21308C58505k9588m7661r0286
17138A90970B5038M94940G8710R6634J07265r7450J2698J30666j05976q9264E8905
17126B64633r7767J1089l7548M19681j12782A14022J84053N4655A50456h0864
17115G66696B08295M58388a3693B21319L55850B84308m9117N95500B08323J65995
17105C74318J97279k07790J27008j34740H9394L29992j31181A37671J24248J17668
$$ y = [189749, 85845, 371426, 101160, 217606, 414219, 394039, 300644, 262521, 150374, -3017, 317704, 136394, 5157, 339395, 128190, 494520, 204357, 272571, 363754, 286442, 80016, 104148, 391074, 336250, 366682, 444193, 278774, 287772, 203842, -64811, 522900, 452353, 173053, 61037, 9548, 602484, 148461, 483395, 326695, 348770, 314676, 735984, 358505, 328917, 281256, 190970, 25038, 519978, 78710, 175344, 282609, 185159, 197857, 328523, 222547, 133283, 58905, 264633, 166866, 177955, 140407, 560088, 447306, 114022, 298075, 352730, 150456, -80864, 766696, 208295, 666683, -13693, 221319, 577169, 284308, 235191, 830691, 208323, 374318, 571597, 363807, 490815, 356075, 89394, 419386, 288205, 137671, 261919, 379587]
17095C79587L64612B92006O1292J88164A95566R9454p6851K07286J1779k374j10835
17084C24025Q9037j85103K32527l1024J66916B30780M8882q6080L29585k0887
17074E02280p9682j28219P226j29367M7408L96294o4923J71391k40779j26886
17064C54743N19112j56685C17296O9133K458J47412j04513N0663A57541K90065
17054D47606J82606j32010j48298K32805k06443m6378L4807J34264o5676p1857
17044C61426A41993K30940J97056j02827j36273j0805K25281j22347J48580j36749
17034D34849J49977J97640C13092L03803j2702L20190k73524O5108M3314q6562
17024F72719j20778K7097j81443q0613J65518r1033M75970J9572l22333O512K08749
$$ y = [379587, 744199, 292006, 353298, 541462, 195566, 295020, 218169, 425455, 437234, 434860, 324025, 413062, 227959, 460486, 429462, 596378, 230780, 279662, 193582, 523167, 502280, 422598, 294379, 301605, 172238, 219646, 615940, 551017, 722408, 481629, 354743, 873855, 717170, 317296, 386429, 388887, 536299, 431786, 482449, 157541, 447606, 630212, 498202, 349904, 582709, 376266, 329888, 364695, 498959, 433283, 361426, 141993, 372933, 569989, 467162, 330889, 320084, 545365, 423018, 571598, 434849, 584826, 782466, 313092, 616895, 604193, 924383, 650859, 715967, 759281, 672719, 551941, 579038, 397595, 316982, 482500, 391467, 867437, 887009, 564676, 571188, 779937]
17013G79937j55021Q0032L1322k36188J67313J36434l72973L1729K88887k51053
17003E00419J42095K75348C53539K76807J64532l05871L33051k21780R2417j08296
16993E84399L44909p7701n6107J65947l91530K94865R6485o3860r0070k94871
16983E12466j44829N56909j15371k02521k49403O17470j32438J9581j71486J10937
16973H01315m9746r1148K32948l3420J8697J24551j48084K4818j83482p4070Q8643
16962G11022J44333K09686k81555L00966r2543j20026m7059K90953J22268p7631
16952A160414l98432l7750K26853L62014m25437J43125K48292k24305j39046J53391
16942A069119J00868j66275M3638j03857M17134l03362p4276K19037M2434M9339
$$ y = [779937, 624916, 704948, 736270, 500082, 667395, 803829, 430856, 462585, 751472, 500419, 642514, 917862, 353539, 630346, 794878, 489007, 822058, 600278, 692695, 584399, 929308, 851607, 795500, 961447, 569917, 864782, 961267, 897407, 807337, 512466, 367637, 924546, 809175, 606654, 357251, 974721, 842283, 861864, 690378, 801315, 751569, 660421, 893369, 859949, 878646, 1003197, 855113, 879931, 696449, 622379, 711022, 855355, 1065041, 783486, 1084452, 991909, 871883, 824824, 1115777, 1238045, 1160414, 761982, 724232, 951085, 1313099, 887662, 1030787, 1279079, 1054774, 915728, 1069119, 1169987, 1003712, 1047350, 943493, 1360627, 1057265, 982989, 1202026, 1244460, 1293799]
16932A293799j56598Q3861k45234J05703l7479K03637K14285o1270M1941n42927
16922H99718N50158m0404n4644k12113J02033J45513m0764K6473J58753N5134
16912A589857l67337L18988j96307J66446J031n9198p6500p1154K73859L22696
16902A902381n19223K33732k74702M52432k60162J91514l04661L88942P1776l44379
16892A537650k2917L68393R0129k06299k8817n07301P21807m8128M51320m63355
16882A892482K15069k17515J48750L30886n07867K37076K25039k14888P4256L4183
16872B217471L87343n38047N00082j54229l7356q9806j40627K75570r7919N09968
16862B832450k92937K5078j66877K15950o5197j69648M35089J08455l16428M95315
$$ y = [1293799, 1137201, 1221062, 975828, 1081531, 1044052, 1247689, 1461974, 1400704, 1442645, 899718, 1449876, 1409472, 1354828, 1142715, 1244748, 1390261, 1349497, 1375970, 1534723, 1589857, 1222520, 1541508, 1345201, 1511647, 1512678, 1453480, 1376980, 1305826, 1579685, 1902381, 1383158, 1616890, 1342188, 1794620, 1534458, 1725972, 1421311, 1810253, 1882029, 1537650, 1514733, 1883126, 1973255, 1766956, 1738139, 1230838, 1952645, 1904517, 2355837, 1892482, 2107551, 1890036, 2038786, 2369672, 1861805, 2098881, 2323920, 2109032, 2183288, 2217471, 2604814, 2066767, 2566849, 2412620, 2375264, 2285458, 2144831, 2420401, 2322482, 2832450, 2539513, 2564591, 2397714, 2613664, 2548467, 2378819, 2813908, 2922363, 2605935, 3101250]
16852C101250J00491k58516L51681n7517R0742j07882k9426K45199M9408l25890
16842C159540K7414J81706L24137k27335M45922m6308j67112J88531k04292K92273
16832C974476k2682j60838N34531J32577j49358L10948k39265J88625j4748L28884
16822D883150J98183r4997K93082k07956L96820j2572j32577K45302L12408j16598
16812E764245L4376K90373j32159N60771p0271p8393M66003j45820M98406k26964
16802F960567J76838J19168J93244K47033N06871L1334p33M20419J68389K85596
16792I108726L58806K15752J32822L71164K8898N99650L3950K52958N86562J08141
16782A1797429P55247J88611K04653L76188P30583M19900K27701O15475K19597
$$ y = [3101250, 3201741, 2943225, 3294906, 3237389, 3328131, 3220249, 3190823, 3436022, 3485430, 3159540, 3186954, 3368660, 3692797, 3465462, 3911384, 3865076, 3697964, 3886495, 3682203, 3974476, 3951794, 3790956, 4325487, 4458064, 4308706, 4619654, 4380389, 4569014, 4554266, 4883150, 5081333, 4986336, 5279418, 5071462, 5468282, 5455710, 5323133, 5568435, 5880843, 5764245, 5798621, 6088994, 5956835, 6517606, 6447335, 6368942, 6834945, 6689125, 7187531, 6960567, 7137405, 7256573, 7449817, 7696850, 8203721, 8235055, 8234322, 8654741, 8823130, 9108726, 9467532, 9683284, 9816106, 10187270, 10216168, 10815818, 10849768, 11102726, 11689288, 11797429, 12552676, 12741287, 12945940, 13322128, 14052711, 14472611, 14700312, 15315787, 15535384]
16773A5535384R40984J91598M10869J094441M00607Q23315P19482P60214J099889
16764B1976783M11586R84408R07100J051523R56935J088427J397614J197198J036635
16755C1008209J756460J327140J675016J928433J629620J938586J946440K039459
16747D5249363K416088K436113K628512L128236K974384L264721L708571L579653
16739F9385641L544134M213802M667914M653557N183481N261214N750218N665393
16731A08325354O233362O073416O708093O220774O604014O168322O023426N219035
16723A57575796N243029M264606L494232K374613J046918K65159r51028k312307
16715A71001018k783929m206048n440740n497744o218772o348273o524143o801052
$$ y = [15535384, 16476368, 16667966, 17078835, 18173276, 18573883, 19397198, 20116680, 20876894, 21976783, 22388369, 23372777, 24279877, 25331400, 26288335, 27376762, 28774376, 29971574, 31008209, 32764669, 34091809, 35766825, 37695258, 39324878, 41263464, 43209904, 45249363, 47665451, 50101564, 52730076, 55858312, 58832696, 62097417, 65805988, 69385641, 72929775, 77143577, 81811491, 86465048, 91648529, 96909743, 102659961, 108325354, 114558716, 120632132, 127340225, 133560999, 140165013, 146333335, 152356761, 157575796, 162818825, 167083431, 170577663, 172952276, 173999194, 174264353, 173313325, 171001018, 168217089, 164011041, 158570301, 153072557, 146853785, 140505512, 133981369, 127180317]
16707A27180317o504587o621411o247864o191430o205884n285450n219274m693276
16699H0211141m818652m281819m212788l570084l330096l710743l089916k448254
16691E0748789k589442k602850k634782j710591k170473j624380k209782j518443
16683C3688046j928836j012785j238554j554616j317482q67749j122794r54687
16675B3690543r14068j003477j000372j284317j27831o45592j006354o76084o46874
16666A6385574o8999r02664o34178j97427o16704m37548m40968n20248n67261
16657A1999577N6350m11951n49351j36242m15026o8355l46671k34026o67264p8153
16647I148888j47537k62614m07963j77594m98k13906m08330j55979J01744l09953
$$ y = [127180317, 120675730, 114054319, 107806455, 101615025, 95409141, 90123691, 84904417, 80211141, 75392489, 71110670, 66897882, 63327798, 59997702, 56286959, 53197043, 50748789, 48159347, 45556497, 42921715, 41211124, 39040651, 37416271, 35206489, 33688046, 31759210, 30746425, 29507871, 27953255, 26635773, 25768024, 24645230, 23690543, 22776475, 21772998, 20772626, 19488309, 19360478, 18714886, 17708532, 17032448, 16385574, 16316575, 15413911, 14779733, 14582306, 13965602, 13528054, 13087086, 12566838, 11999577, 12055927, 11643976, 11094625, 10958383, 10543357, 10475002, 10128331, 9894305, 9227041, 9148888, 9001351, 8738737, 8330774, 8153180, 8152682, 7938776, 7530446, 7374467, 7476211, 7166258]
16637G166258j95594l85654j54213j33740l09110j52076k0638J09680k78916J80981
16627E826978k52943K5138n56735J55965l89618o0144N8739j05372N9886p1298
16617D690596m23080J23176j57167m40463J00029J5773J65896k35735j21871o7263
16607C649891Q9870k38894N9871j09096l72185Q1226R1183J5954q2016j49332
16597C036472Q4899k07777l2391o0176j2529L26523k77635k438j06678m1668N2131
16586B758733j63660Q3486k53273K19200m36830L08726K38240m85442P2965k41873
16576B100272J22502k11750k2535K42514l39275M76205p90771K61740J76814o8541
16566A947175J58172m38739N09309m14482J05766p5214p2044r9233n3435P9614
$$ y = [7166258, 6970664, 6585010, 6430797, 6297057, 5987947, 5835871, 5815233, 5924913, 5645997, 5826978, 5574035, 5599173, 5042438, 5198403, 4808785, 4748641, 4807380, 4702008, 4761894, 4690596, 4267516, 4390692, 4233525, 3793062, 3893091, 3908864, 4074760, 3839025, 3717154, 3649891, 3739761, 3500867, 3560738, 3451642, 3079457, 3160683, 3251866, 3267820, 3185804, 3036472, 3121371, 2913594, 2881203, 2821027, 2808498, 3135021, 2857386, 2854948, 2748270, 2706602, 2758733, 2595073, 2678559, 2425286, 2644486, 2207656, 2516382, 2754622, 2269180, 2342145, 2100272, 2222774, 2011024, 1988489, 2231003, 1891728, 2367933, 1577162, 1838902, 2015716, 1947175, 2105347, 1666608, 2175917, 1761435, 1867201, 1791987, 1719943, 1620710, 1567275, 1646889]
16556A646889k26027J40159K31355k47037j9143K11787n1331q7047j54076K74106
16546A719635q266l01452j56827O7527O3516J72653m12990r9678L20J53132K41844
16535A439414K6022k99952m4499L48369m03198K15317J56043o8230j91391J9172
16525A197067K32164k90396j51140j17464J21448J19150J92405j16823k65379
16516I21032N20348l06400j61090N7425j59671l7626J98372O3413L5874k00616
16506I31061j98526K80841R8053j37888k10075M2615J63284k72090J77261j56642
16496G17894O698K39194m46127L34113k81001M04781O3114j39963j52814j06471
16486F39418K00412l13446J70550J63242P522k81386j51771L55004o7880l5423
$$ y = [1646889, 1420862, 1561021, 1792376, 1545339, 1526196, 1737983, 1686652, 1599605, 1445529, 1719635, 1711369, 1409917, 1253090, 1320617, 1384133, 1556786, 1143796, 1044118, 1044438, 1197570, 1439414, 1465436, 1165484, 1120985, 1469354, 1066156, 1281473, 1437516, 1369286, 1177895, 1197067, 1429231, 1138835, 987695, 870231, 991679, 1110829, 1303234, 1186411, 921032, 1441380, 1134980, 973890, 1031315, 871644, 834018, 1032390, 1095803, 1131677, 931061, 732535, 1013376, 1111429, 973541, 763466, 806081, 969365, 697275, 874536, 717894, 724592, 963786, 517659, 851772, 570771, 975552, 1038666, 898703, 745889, 639418, 839830, 526384, 696934, 860176, 867698, 586312, 434541, 789545, 721665, 686242]
16476F86242k0533J36870o8674j97478N56387n40438L23241l32757q7093J05136
16466E60903M9196o4866J63482k72665K95533l37132K19680l05943M05101j26564
16456E86725L4375j39888J99001O5951k0911j75251n0559N7374K14213l11420
16446D59610L60527D01876L15392J50310j11723C17317L34722P0459n8715P4254
16436G38037l29216o5696K29277J96746L3449r6867M8672k35217j75420R6634
16426D40399K03243n2333k03114K02319J71679C00181J1643A17453K87946j3179
16416C92220A92191L61955B19922J85259R4874L1458j22548l7407A79415K21590
16406D01005K98541j09169k3425J1353j54793p0251J16731A7838M22024J3255
$$ y = [686242, 665709, 802579, 733905, 536427, 1092814, 552376, 875617, 542860, 455767, 560903, 610099, 545233, 708715, 436050, 731583, 394451, 614131, 308188, 713289, 586725, 621100, 481212, 680213, 746164, 725253, 550002, 499443, 556817, 771030, 459610, 820137, 401876, 717268, 867578, 755855, 317317, 652039, 722498, 663783, 738037, 408821, 343125, 572402, 769148, 802597, 705730, 754402, 519185, 343765, 440399, 643642, 591309, 388195, 590514, 762193, 300181, 311824, 117453, 405399, 392220, 192191, 554146, 219922, 405181, 500055, 531513, 408965, 371558, 179415, 401005, 699546, 590377, 566952, 578305, 423512, 353261, 469992, 17838, 439862, 453117]
16396D53117N5051k01926J59331J10963A64378K66975K6981J37996A18700N37906
16386F56606A1265K78881p6926J86726M6798j95900I5932J35640o489J86580A37360
16374C51852A40501K63006Q6315O3716n2890n9203r2827G8331J06370J38497J16082
16363D39280j76430n1827E3176L23977J3783A04452K08235A29827R5108L8823
16353B63758J72061J32607j67769Q5361B18988g4530D31780a36181E16549j87935
16343C28614K6320o5057K04155B23984J23466L06163B63142q5382J22723J07489
16333D07972k02450k3260m5603L57361j60365A22318f4543A63435L63896B38102
16322B51791G6551K40040A02938m7329L74070B00644L6469r0721l2037K47872
$$ y = [453117, 508168, 306242, 465573, 576536, 164378, 431353, 458334, 596330, 118700, 656606, 11265, 290146, 213220, 399946, 446744, 250844, 95932, 231572, 225083, 411663, 137360, 351852, 140501, 403507, 489822, 553538, 500648, 441445, 348618, 78331, 184701, 323198, 439280, 262850, 211023, 53176, 377153, 390936, 104452, 312687, 129827, 224935, 263758, 435819, 568426, 400657, 486018, 218988, -74530, 431780, -136181, 516549, 328614, 354934, 289877, 494032, 223984, 347450, 653613, 263142, 177760, 300483, 407972, 205522, 182262, 136659, 494020, 333655, 122318, -64543, 163435, 527331, 238102, 251791, 76551, 316591, 102938, 55609, 429679, 200644, 237113, 146392, 114355, 362227]
16312C62227C839J31563g2967B40684O2627q8456n2534k6417r156J47263A14640
16300F59581k79219C3405P2301R8811g6670A64888J37187j0498j41594J50539
16290C00522j13386K07400A58274p0314K51962H1266K62628L00004l20979q2738
16280B40181K61937M7583j70468A38829J45929j05671D6675L6639J81000l6909
16270B27405L39907k03394D1467a01131B73028j22459l3747A3633h4841C38434
16259a29174A85792L3512R1769d6496C6695j1045M66096r5509f1968j18640d9885
16247C10519D053L26429A42410i280D1413R5344b701j33887C05009A0664L72430
16236C83094a06724e0997A76673H2102K55595C467f5926C31812B4968K98185H5200
$$ y = [362227, 3839, 135402, -72967, 240684, 303311, 214855, 162321, 135904, 126748, 274011, 114640, 659581, 380362, 33405, 105706, 204517, -76670, 164888, 302075, 291577, 149983, 300522, 187136, 394536, 158274, 87960, 339922, 81266, 343894, 643898, 322919, 240181, 502118, 549701, 379233, 138829, 284758, 179087, 46675, 83314, 264314, 227405, 567312, 363918, 41467, -101131, 273028, 150569, 116822, 13633, -84841, 338434, -129174, 185792, 219304, 311073, -46496, 36695, 25650, 491746, 396237, -61968, -180608, -49885, 310519, 4053, 330482, 142410, -9280, 41413, 136757, -2701, -136588, 305009, 10664, 383094, -106724, -50997, 176673, 82102, 337697, 3467, -65926, 331812, 24968, 323153, 85200]
16224B19182G0655P7784K86171A57725n2834m897c1406B85757p2128b1151C64597
16212D0447D090L50381j36749L0324a24767A0693b83312H7831c7347K816C118
16200A81631Q1551j3841c7216D2864b32240J12774A96000a03334L6835A98859
16189A13312J94785A49055b49379A72198m2618n3479d7819A19346k8311K81718
16179C72753a89498b2487F8188a7661H3216C2461a08C92433A60069a00289M744
16168i5545j20586i8448B69965c09321a08411B41647b32557B20780m2816p0833
16158A07131g6843C6276a21597C2186a48646K3867B9739J03171K02036g8856b0127
16146A4461f0588A04068c19811F9639L4225J09621G0159o381b5456A76367m6253
$$ y = [219182, 70655, 148439, 434610, 157725, 104891, 99994, -31406, 285757, 213629, -21151, 364597, 40447, 4090, 354471, 217722, 248046, -124767, 10693, -283312, 87831, -37347, -34531, 3118, 181631, 263182, 249341, -37216, 42864, -232240, -119466, 196000, -103334, -66499, 198859, 113312, 308097, 149055, -249379, 172198, 129580, 76101, -47819, 119346, 91035, 372753, -189498, -22487, 68188, -17661, 83216, 32461, -108, 392433, 160069, -100289, -95545, -216131, -98448, 269965, -309321, -108411, 241647, -232557, 220780, 177964, 107131, -76843, 36276, -121597, 32186, -148646, -124779, 29739, 132910, 334946, -78856, -20127, 14461, -60588, 104068, -319811, 69639, 103864, 213485, 70159, 63778, -25456, 176367, 130114]
16135A30114b46647B7496b37068A48390j2024i8700A48485b09902B75435A9833
16124A12912f4394k6379C8454H393M131a27347D45747A5500Q250P0918J87320
16113B81988j05921a62232G0952K67943I0095J70608h319A10253a86559H8417
16102b8960A55715o9264D692N02225A58291a3777k6371n0982c5906I3792l3791
16091F0001k3490L7029J98699a67534Q1084a3766k90926e6288j6402B62805m7320
16080B15485G9167C6722a81205q848C1219J83702P3726a85080Q340F3296b6914
16068d6015a5042C25990D2336g8307A68059a6888B14909e5572E9602B8084J90135
16057B18219q4658a42082N7235b9617D66667B18566J33316b1731A56924p7051
$$ y = [130114, -246647, 27496, -237068, 148390, 136366, -98700, 148485, -209902, 275435, 19833, 112912, -64394, -90773, 38454, 8393, 12524, -127347, 445747, 15500, 23750, 94668, 281988, 176067, -162232, 70952, 338895, 90095, 260703, -8319, 110253, -186559, 88417, -28960, 155715, 86451, 4692, 506917, 158291, -13777, -40148, -91130, -35906, 93792, 60001, 36511, 73540, 272239, -167534, -86450, -13766, -304692, -56288, -72690, 262805, 215485, 79167, 36722, -181205, -190053, 31219, 214921, 288647, -185080, -176740, 63296, -26914, -46015, -15042, 325990, 42336, -78307, 168059, -16888, 214909, -55572, 59602, 28084, 218219, 133561, -142082, -84847, -29617, 466667, 218566, 351882, -21731, 156924, 79873]
16047G9873c55527d3285a2670n9155B53891e9551A77597a71541K0500k9106A7582
16035b09088D8275a11761A33649A9103J4729a96598A66761a2526F0681a51447
16024B48102j01324h3865Q668C3190J5285K0929L1434M2837g6572B682b80888
16012e2419J5659F3655a35457G1979Q5941n0126C1005h3139A18934c8111G8051
16000h3782k88958a19645j73152b8303j9981j42673i694A13007a73202b8649H8414
15988A22004Q037J25370a44290f5201o4857H788M78794A94302C3348J33203K59692
15977D26243b04496B85055j34498b09527L7380I8853h4545k64965A47665o063
15967A41602E7363a79112B62326F2979N5060P1600B212L44801K6987f5611I8535
$$ y = [79873, -355527, -43285, -12670, -71825, 253891, -59551, 177597, -171541, -151041, -180147, 17582, -209088, 48275, -111761, 133649, 19103, 33832, -196598, 166761, -12526, 60681, -151447, 248102, 146778, -83865, -75197, 33190, 48475, 69404, 100838, 143675, -76572, 2682, -280888, -52419, -36760, 63655, -135457, 71979, 157920, 107794, 31005, -83139, 118934, -38111, 78051, -83782, -372740, -119645, -292797, -28303, -48284, -190957, -9694, 113007, -173202, -28649, 88414, 122004, 130041, 255411, -144290, -65201, -130058, 8788, 487582, 194302, 33348, 166551, 426243, -204496, 285055, 150557, -209527, -172147, 98853, -84545, -349510, 147665, 141602, 57363, -179112, 262326, 62979, 118039, 189639, 2212, 347013, 374000, -65611, 98535]
15955A70190a33231A33062b41769I3685b67961A17728Q6154J00482f3649l5172
15945i8821j6602n7468C5581F98b23665c5270o4972l5549K3270j52327A39355
15933G6965d19212a37682B06455r3127a8057m93341E1080i7361k60162A272a86112
15921I9272b4372k07559A47268l68J1127p8469b60238R240a11779C131J14784
15910A17915J62798b68387j82195A14589J5670a15359p3170B61163J8200b16520
15899g7421n6072A31898c96883H005R151i9994j24866A36373l0154a03470B3161
15887B5671c9998J0668j16234o4448B04575D8332i7544c880A41866o6724l2936
15876D2206c69553A30634L4211c51543J54087J2578l7125G2884a11727J153e314
$$ y = [170190, -133231, 133062, -241769, 93685, -267961, 117728, 203882, 304364, -63649, -98821, -115423, -172891, 35581, 698, -223665, -35270, -100242, -135791, -112521, -264848, 139355, 76965, -419212, -137682, 206455, 113328, -18057, -511398, 51080, -97361, -357523, 1272, -186112, 99272, -24372, -231931, 147268, 146900, 158027, 79558, -260238, -250998, -111779, 3131, 117915, 280713, -268387, -450582, 114589, 130259, -115359, -188529, 261163, 279363, -216520, -77421, -133493, 131898, -396883, 8005, 17156, -99994, -224860, 136373, 106219, -103470, 23161, 25671, -39998, -29330, -145564, -210012, 204575, 48332, -97544, -3880, 141866, 75142, 42206, -369553, 130634, 164845, -351543, -197456, -184878, -222003, 72884, -111727, -110574, -5314]
15864b84961H9604a89666O1682L9583A24656n6214b01112R8350E6118a40756M9051
15853i1705C36304a28849D7073L4503g7129B0451J10811a15445C91993j02193
15843B89800c11970E345a997o4802A41686h9727G4173N4022M9234C5735O5962
15832A01697d21432c7468G5461b48137A21991c04163c3922r8234A45862a33757
15821A46340a13291A81490B4815b7496k84068O5990f5325N110q8187A8401e6277
15809b37172a3935k51426Q3566k39b1332a589k89559A58379C2261J05222j2808
15798A24675c74746c0789L741B11831E1340a04059A34391A4714J1148J26032R4764
15787B46658b1582A75302a12131a8978m5599C10g6150B22228c35958c4994J6399
$$ y = [-284961, 89604, -189666, -127984, -88401, 124656, 68442, -201112, -102762, 56118, -140756, -91705, 336304, -128849, 47073, 81576, -77129, 20451, 131262, -115445, 391993, 289800, -311970, 5345, -1997, -66799, 141686, -89727, 74173, 128195, 177429, 35735, 101697, -421432, -37468, 75461, -248137, 121991, -304163, -33922, -132156, 145862, -133757, 146340, -113291, 181490, 24815, -27496, -311564, -245574, -65325, -60215, -148402, 18401, -56277, -237172, -13935, -265361, -181795, -182034, -21332, -1589, -291148, 158379, 32261, 137483, 124675, -374746, -30789, -27048, 211831, 51340, -104059, 134391, 14714, 25862, 151894, 246658, -21582, 175302, -112131, -18978, -64577, 310, -76150, 222228, -335958, -34994, -18595]
15776a8595A44073c39421a04607I8846a84025e5285F5837j8996c3962I1323J6310
15765A07633C8253a56875A5674P7416K5751K29412j64327b98235C4198O6654K00049
15754C00901a57327p6994d2682F48b41900g4583K2763b3548j81776d3656H756
15742B5792a24572A51576h5781O101a749C5038a91393P3487B31544a56728n5248
15731b11976K1273k2487A70069l8658b19477g3668j36089B28948n8558E0680K09092
15720B59772e8179j59908d9988l8836j58772N9160o5433C9199b00603L3359A4708
15708D4101c31172A9906i1910L3247J1319C213a77179k9020d566j41717M373l02952
15696d44862d9304m2631L7229D7304a43287A26371K07325A45732o145a11934G725
$$ y = [-18595, 144073, -339421, -104607, 98846, -184025, -55285, 65837, 46841, -33962, 91323, 107633, 38253, -156875, 15674, 93090, 118841, 348253, 183926, -298235, 34198, 100852, 300901, -157327, -234321, -42682, 648, -241900, -74583, -51820, -23548, -205324, -43656, 8756, 25792, -124572, 151576, -85781, -79680, -1749, 35038, -191393, -117906, 231544, -156728, -211976, -190703, -213190, 170069, 131411, -219477, -73668, -209757, 228948, 170390, 50680, 259772, -58179, -218087, -49988, -88824, -247596, -188436, -253869, 39199, -200603, -167244, 14708, 44101, -331172, 19906, -91910, -58663, -47344, 3213, -177179, -206199, -4566, -146283, -141910, -444862, -49304, -91935, -54706, 47304, -143287, 126371, 333696, 145732, 139587, -111934, 7725]
15684A04189J4026q13b72250A87142o5388J47944c42578B18844C6489L6066a1565
15672a94236A87899N9337b2590D4394K01716a01774K8976m7009a375j00736A24612
15660d617A22821j3369j6444b74228K5335C0304a08816o5675j23942B30211C3857
15648e04847a63153n4515b9775C9770Q8759a00023j53620O5022d9745l7297r9012
15637a86054o1895Q3967A07873a6220C77679A23660c38752C4366d5858I7495J28769
15626B26264P7919a11991K9579C80169A13353d10706A20805E4427N9497b22032
15615a77512p0647r033f1586A49142c46926D9081d8434k65882j17575a2868C23944
15603C06396a44962N3639Q7M0275m10358B04343i7791j54344A94735i6260j6454
$$ y = [104189, 118215, 117402, -272250, 187142, 121754, 269698, -342578, 218844, 36489, 72555, -11565, -194236, 187899, 247236, -22590, 44394, 246110, -101774, -72798, -119807, -1375, -102111, 124612, -4617, 122821, 109452, 93008, -274228, -248893, 30304, -108816, -174491, -298433, 230211, 33857, -504847, -163153, -217668, -29775, 39770, 128529, -100023, -253643, -188621, -49745, -87042, -186054, -247949, -163982, 107873, -16220, 377679, 123660, -338752, 34366, -45858, 97495, 226264, 304183, -111991, -82412, 380169, 113353, -410706, 120805, 54427, 113924, -222032, -177512, -248159, -257192, -61586, 149142, -346926, 49081, -48434, -314316, -431891, -12868, 323944, 306396, -144962, -91323, -91236, -50961, -461319, 204343, -97791, -252135, 194735, -96260, -112714]
15592a12714j80698b5958G4453h6714A7517h3389j7151F5925f2939A42259d6190
15580A81810m4547A2782A398a20993q8579N6320l4322o5486b4251q4677J8452
15569i0476r7160G8252L8420K04097q4652o5424a9156q9764B0072a1865k7107
15558c8972o2039D8493j5771P2069C0831a975k27584F7038b90119b9478I4766
15546G9237C3720j5024a49256c6276p8471m3467A15957J63389A21631D700Q2722
15535H7422n415L16926a30797f081k9178q5682e1901n7202C63539a21176C85137
15523A74600O5807a68006L7956R847d8317j4258j53720D6337c9731k1986A71167
15511a57901f092C75374c1814A24016b17767L2185k50261K17031D4967b64648
$$ y = [-112714, -293412, -25958, 74453, -86714, 17517, -83389, -100540, 65925, -62939, 142259, -46190, 181810, 137263, 12782, 1398, -120993, -209572, -153252, -187574, -253060, -24251, -108928, -90476, -187636, 78252, 116672, 320769, 236117, 170693, -19156, -108920, 20072, -11865, -38972, -101011, 48493, 32722, 104791, 30831, -1975, -229559, 67038, -290119, -29478, 94766, 79237, 33720, 18696, -149256, -36276, -114747, -158214, 115957, 279346, 121631, 4700, 87422, 82007, 398933, -130797, -6081, -35259, -120941, -51901, -109103, 363539, -121176, 385137, 174600, 240407, -168006, -130050, -120203, -48317, -62575, -216295, 46337, -39731, -61717, 171167, -157901, -6092, 375374, -31814, 124016, -217767, -185582, -435843, -218812, 44967, -264648]
15500h1833B21969c144n4306E623c02975C4586b08134J8763h4100E2360K75027
15489C27387a15352B02794E5708e2352D6981L6756J96511a92772c0360n533n1040
15478h6933k4418C74072b35881F1898c29220A3924L35897g7060B63568a47489
15467a22455B73289i822C71256a10528B97422a34271B49682a9076b610B5920b61272
15455C43801b14044a3284r5662G6381E50J80330A282a71174F1153b47403a06789
15443e9947j20778k13846a75925j20247a2697C173L0580a10850q2401B88022i0095
15431a62596A4137C777M19625j62351c39536g0529q8834B82822h4830q3603J5296
15420a53137B0005M9101M6908a08626I9852d60557b13445C50949I8815A6841b1816
$$ y = [-81833, 221969, -3144, -57450, 5623, -302975, 34586, -208134, -189371, -84100, 52360, 327387, -115352, 202794, 55708, -52352, 46981, 83737, 280248, -192772, -30360, -35893, -86933, -111351, 374072, -235881, 61898, -329220, 13924, 349821, -77060, 263568, -147489, -122455, 273289, -9822, 371256, -110528, 297422, -134271, 249682, -19076, -2610, 25920, -261272, 343801, -214044, -13284, -108946, 76381, 550, 180880, 1282, -171174, 61153, -247403, -106789, -59947, -180725, -394571, -175925, -296172, -12697, 3173, 33753, -110850, -193251, 288022, -90095, -162596, 14137, 3777, 423402, 261051, -339536, -70529, -159363, 282822, -84830, -168433, -153137, 20005, 69106, 116014, -108626, 99852, -460557, -213445, 350949, 98815, 16841, -21816]
15408i1417A62370a37697C8774J78251b07003e0025a1496k35311a02357A4014
15397D3573J74862a61309B5320K28120b0762j42703g8165q9936C78650A22030
15386B76390b71196A05022a0914A92202a73076c3492B16977G6841K341Q0001E4520
15374a14322B33570R23a17148A2134L28386j61455b56235F5301j3698a9196j5746
15363c4942B90218K245b84899D70777b02314B06570b55117a08277j54909E31958
15352f5877J350A91108b6754A40830J60971h2913G5206g8659l178B91057b14959
15340A22803k7652b60975a03640G4097a56521a1121A36584e2235B30710m8096
15330A82614a27809A27393N8524M2544G9118C9023K2531a12714A50567g5128A48873
$$ y = [-91417, 162370, -137697, 38774, 217025, -207003, -50025, -11496, -246807, -102357, 14014, 43573, 218435, -161309, 25320, 253440, -20762, -163465, -78165, -168101, 378650, 122030, 276390, -271196, 105022, -10914, 192202, -173076, -33492, 216977, 76841, 79182, 159183, 54520, -114322, 233570, 234493, -117148, 12134, 340520, 179065, -256235, 65301, 51603, -19196, -34942, 290218, 292463, -284899, 470777, -202314, 206570, -255117, -108277, -263186, 531958, -65877, -64527, 191108, -26754, 140830, 301801, -82913, 75206, -78659, -81837, 291057, -214959, 122803, 95151, -260975, -103640, 74097, -156521, -11121, 136584, -52235, 230710, 182614, -127809, 127393, 185917, 228461, 79118, 39023, 61554, -112714, 150567, -75128, 148873]
15318a85304A426K77563I8824K38807b4043b182j23634A04807J41426b1799G750
15306b10153i62A04362B202K390J44975d5851a7564j69288H6822J30501l7852
15295A79471m8057R2888k1435a9353A52814j6011a33706n2493F8247O8796K2000
15284A59043g1614A77137H5951N3539a61133F6078Q1434D6876j7049a03634A39744
15272B6125i1164A7531K48444N0332j42734B8676M6628O3840G410b709A48114
15260a19799m9369e3829C55739G3461J73500F9112M07287E571L50102a08055C825
15248E32260M48522Q44555H98842O10083j64308D21763l6732j24454a17741a6308
15237b1913E442a02248m6084A87112G5081d8340A17667A4817E842J83086H3091
$$ y = [-185304, 1426, 278989, 98824, 337631, -24043, -2182, -125816, 104807, 246233, -21799, 7750, -210153, -962, 104362, 2202, 4592, 149567, -45851, -17564, -186852, 86822, 217323, 179471, 131414, 224302, 202867, -19353, 152814, 136803, -133706, -186199, 68247, 137043, 159043, -71614, 177137, 85951, 139490, -161133, 66078, 147512, 46876, 29827, -103634, 139744, 26125, -91164, 17531, 265975, 316307, 173573, 28676, 75304, 139144, 7410, -2709, 148114, -119799, -169168, -53829, 355739, 73461, 246961, 69112, 476399, 5571, 355673, -108055, 3825, 532260, 980782, 1825337, 898842, 1508925, 1344617, 421763, 385031, 260577, -117741, -16308, -21913, 5442, -102248, -148332, 187112, 75081, -48340, 117667, 14817, 5842, 188928, 83091]
15225f0129C7996J06131b36945B30414g6678A12154J71101c01649P4787A07585
15214b4475B808b90941d1014B94955e9003b8955D1391i4138D2847b17367j63747
15203c81114B36526b24977B09073c78810A06383a83563H8894M6981g8539G1827
15192a91979C48446q2398I119K6824R1000J81319E0914g3586j69333C982K882
15181F864c5973J5657A94383K79164A01711a5658H2698E252M08296p7767J8872
15170C54653a79959F6112M18394d2143B81470a61816P8894I1104K44803j07592
15160B28315r2937E0377c5140n5880C28900r7708a77275B75265J2893a20095A27086
15148B08069I3151M4301k2049P0924f7028C79084n7896A26206F2973B5677K96247
$$ y = [-60129, 37996, 144127, -236945, 230414, -76678, 112154, 283255, -301649, -226862, 107585, -24475, 2808, -290941, -41014, 294955, -59003, -28955, 41391, -94138, 42847, -217367, -381114, 236526, -224977, 209073, -378810, 106383, -183563, 88894, 135875, -78539, 71827, -191979, 348446, 266048, 9119, 35943, 126943, 308262, 50914, -73586, -242919, 3982, 6864, -35973, -20316, 194383, 473547, 101711, -15658, 82698, 5252, 413548, 335781, 354653, -179959, 66112, 484506, -42143, 281470, -161816, -82922, 91104, 335907, 228315, 135378, 50377, -35140, -91020, 328900, 231192, -177275, 275265, 288158, -120095, 127086, 208069, 93151, 137452, 115403, 186327, -67028, 379084, 321188, 126206, 62973, 25677, 321924]
15137C21924J7768i2782a8133A58709E3907c12234a0329A68917k6650J70310G3587
15125a57100A93435g101B69060H7935J25509a91602I1333j1186f0906A08155K20417
15114C28572b6866A76596Q7081G0293K5773a89782E5418N0218J774J46498I998
15102A01745C8646J52457p9146f71k0302C00585f7865A24004J62002o9034j0522
15091B06450G306c2381A56452C5951J51143O8517A27149q131l48a69707a1380
15079E1402K09258i0918B78615O1386f46l6685A38807o819l0410L39975G4088
15067A90671a11864B19961l2400a40554A3573J2883L79190a62510C32439J58740
15057D91179I4007J9154j0333K3863a45813o833C60071P9737o6693a20159A6901
$$ y = [321924, 339692, -92782, -18133, 158709, 53907, -312234, -10329, 168917, 142267, 312577, 73587, -157100, 193435, -7101, 269060, 87935, 213444, -191602, 91333, 80147, -60906, 108155, 328572, -26866, 176596, 263677, 70293, 96066, -189782, 55418, 105636, 107410, 253908, 9998, 101745, 38646, 191103, 111957, -671, -20973, 300585, -67865, 124004, 286006, 216972, 206450, 7306, -32381, 156452, 35951, 187094, 255611, 127149, 119018, 118670, -169707, -11380, 51402, 260660, -90918, 278615, 340001, -646, -37331, 138807, 131988, 101578, 441553, 74088, 190671, -111864, 219961, 187561, -140554, 13573, 26456, 405646, -162510, 332439, 491179, 94007, 113161, 102828, 126691, -145813, -152646, 360071, 439808, 373115, -120159, 16901]
15045C42765A27770D2840K06927j13189b63250A53858a1328G8025J36374K6008
15035B40407j9389A2261c02637A39962P1490M6130p041a32689A67768l867J47424
15024C11325A45023b28920b0152B97200A23611J64337J49925j56502E776K35443
15014B41219F7441J20031J82453j44863H7273J9080D8453J48034l99H4666f1318
15002D8628j9280J71863J08531A19994H4K74423a63690B4781J80227Q8846e7680
14990C93318A68881J892j0181g501C72295J01878B24190M3709r1301k6355L59699
14979E09942A96959N1079J52253q1493n7988I2985R0852J11962O5976E9164M7218
14968A06382f3033B20427o5997R4451j00642J85912M6359A37571b1101C08882
$$ y = [342765, 127770, 42840, 249767, 136578, -263250, 153858, -11328, 78025, 214399, 240407, 221018, 12261, -302637, 139962, 211452, 257582, 250541, -132689, 167768, 163901, 311325, 145023, -228920, -20152, 297200, 123611, 287948, 437873, 281371, 5776, 241219, 67441, 187472, 369925, 225062, 87273, 106353, 48453, 196487, 196088, 84666, -61318, 48628, 29348, 201211, 309742, 119994, 84, 274507, -163690, 24781, 205008, 293854, -57680, 393318, 168881, 170773, 160592, -7501, 372295, 474173, 224190, 267899, 176598, 150243, 509942, 196959, 248038, 400291, 318798, 260810, 92985, 183837, 295799, 361775, 59164, 106382, -63033, 220427, 154430, 248881, 148239, 334151, 380510, 137571, -21101, 308882]
14957C05070J45947j13875O5431J0606j82948o8104Q5146G8971R1303f2181D61580
14945g996j12181A34422L95447B17471J03143j33260J31425G2377L42971O744
14935D22092k4396K9656j56382r1621M77122B01710r4870J19784M8268J37302
14925D12194n9918I0423J21374L12347J15051A22499J81617q9579g841C49707
14914C13860p9633L24847A70519L72473A10615Q5068j6456N586J84265P518j61554
14903B15042Q5294J08500C4310K17820n2822O8715A31029b4405D28576E0326O81400
14892G31726B80066K5019A14046L7427J64448J3352O7871k2062A44373D6745J53786
14881B00531R4996C6691K78163L04424H5494J56963L50928j61780j9028A68512
$$ y = [305070, 451017, 337142, 402573, 413179, 230231, 162127, 247273, 78971, 170274, -62181, 461580, -7996, -120177, 134422, 529869, 217471, 320614, 187354, 318779, 72377, 415348, 422092, 397696, 427352, 270970, 179349, 656471, 201710, 106840, 226624, 274892, 412194, 352276, 90423, 211797, 524144, 639195, 122499, 304116, 214537, -7841, 349707, 313860, 234227, 559074, 170519, 542992, 110615, 195683, 179227, 184813, 369078, 376596, 215042, 300336, 408836, 34310, 252130, 199308, 268023, 131029, -24405, 428576, 50326, 731726, 280066, 305085, 114046, 151473, 315921, 329273, 397144, 375082, 144373, 46745, 200531, 295527, 36691, 314854, 619278, 85494, 242457, 593385, 431605, 412577, 168512]
14870F22360B91559J7966M5498A8240L51073n996j66634L52350k63427J27940
14860D13546k03916L46691Q5144k49685j30396K58560A42911M51804F8879K85764
14850C54643J90567k15390h224C64425k6297K61436m1333j4277j85657L09422
14840F67719A28594K18616C820J09508L57946j19853r695J97312k52524q806J68478
14829D46186p7039L05792C31320c6775D58800j1660j16843J18858n9458m1538
14819C48159K82015l3680j67586m5958n382l1083J25712O9372K5995k0387K81937
14808H29114D07297J17432j77581r4826J07672L25193k67745o4406J85919L97158
14798I36113l06128j4971N3711p5190j14500k5495j78366J13705O538p186j53107
$$ y = [622360, 291559, 309525, 355023, 18240, 369313, 363317, 196683, 549033, 285606, 413546, 209630, 556321, 641465, 391780, 261384, 519944, 142911, 594715, 68879, 354643, 545210, 329820, -8224, 364425, 338128, 599564, 558231, 543954, 358297, 667719, 128594, 347210, 3820, 113328, 471274, 351421, 341726, 539038, 286514, 277708, 446186, 369147, 674939, 331320, -36775, 458800, 447140, 330297, 449155, 389697, 348159, 630174, 596494, 428908, 382950, 377568, 346485, 472197, 541569, 567564, 547177, 829114, 407297, 524729, 347148, 252322, 359994, 685187, 417442, 353036, 538955, 936113, 629985, 615014, 668725, 593535, 479035, 453540, 275174, 388879, 395417, 388231, 235124]
14787B35124J08971L55211k75749j9897K19779k04753J96976j79243K16549k69270
14777C83698N49709C51051K73420k92760K07517k37550M07037K8467p9458j42172
14767E15552j16771K41056p7034J13423j28872J15362k12231K20052k03542L40309
14757H07304l56830J66373j17156o3592K50443j99526J34344P5501j59577p1882
14747D65402N13727l67966J06400o6132B95892J70887M1999K77930j30736J90839
14737H46811l26697J14939B59999K61684M75162m22166L44650m16502L81421J4413
14727H98661J22373p7597C59495K17469m4981L44792l08553M96159K11216n45941
14717G29656K17822j9174j88806R5623j57545J31811J36219j09458n6838J06544
$$ y = [235124, 344095, 699306, 423557, 403660, 623439, 418686, 615662, 436419, 652968, 383698, 933407, 351051, 624471, 331711, 539228, 301678, 708715, 737182, 657724, 515552, 398781, 639837, 562803, 676226, 547354, 662716, 450485, 670537, 466995, 807304, 450474, 616847, 499691, 436099, 686542, 487016, 621360, 696861, 537284, 465402, 979129, 611163, 717563, 651431, 295892, 466779, 508778, 786708, 655972, 846811, 520114, 635053, 259999, 521683, 996845, 574679, 919329, 502827, 884248, 898661, 1021034, 943437, 359495, 576964, 531983, 876775, 568222, 1064381, 1275597, 729656, 947478, 928304, 739498, 835121, 677576, 809387, 945606, 836148, 779310, 885854]
14707H85854j89140J38540J31885m58078K30511J08957Q391k64489M27849k75626
14697G44654J2570M4085j41716N544J3647J22601M56742E92389n529N66667j64395
14686I89132k34040M5718n1476r8806M01167k41608n9103j38335J78649L8640
14676H29938N6002j35884L01215j1405j65836q1904L20675K8512j54565r0237
14666H96511J80408M3737r2748K09137k72616k8735J78176k04780r9707P5308
14656H84691L16490j62111J32332J03748k37066J67875R4796p385j25355j29185
14646A038830J54602k50933P6243J55070j34072O3432j5404P8563J21378J37096
14636A424805j64723L02530n8037k14367l8632q602j10192J28781l81045M42608
$$ y = [885854, 696714, 835254, 967139, 509061, 739572, 848529, 856920, 592431, 1020280, 744654, 757224, 801309, 659593, 665137, 678784, 801385, 1258127, 592389, 586860, 1153527, 989132, 755092, 800810, 749334, 650528, 1051695, 810087, 750984, 612649, 791298, 829938, 885940, 750056, 1051271, 1039866, 874030, 792126, 1112801, 1141313, 986748, 896511, 1076919, 1120656, 1027908, 1237045, 964429, 935694, 1113870, 909090, 809383, 884691, 1201181, 1039070, 1171402, 1275150, 1038084, 1205959, 1300755, 1293370, 1168015, 1038830, 1193432, 942499, 1018742, 1173812, 1039740, 1103172, 1087768, 1166331, 1287709, 1424805, 1260082, 1562612, 1504575, 1290208, 1251576, 1242974, 1132782, 1261563, 880518, 1323126]
14626A323126m60607M47782q5690L88453n66367N47809k4547o59619N08895M4883
14616A464118J3433l02055K20656k05401K90860J41569k98561L51424m41716K60372
14606A494699l11302K73217j3335K1303K44466l781l93640J04743p1057P2029
14596A417342K4492K49933J4993j75854p626K39593q9327J64374J82740L0885
14586B051545l76305j54539M90164l28202M01478l78867N900K10351l53974O12774
14576B180325l34905J12909n5728J58741j61483K15190Q5648j57104K9322N0017
14566B122932k0747J22863J19259o2806k2487K66553L80632j96777J49233O2015
14556B920670l9431L34665K49895J72561L79013Q60372R41837J201627L637690
$$ y = [1323126, 862519, 1310301, 1224611, 1613064, 1046697, 1594506, 1569959, 910340, 1419235, 1464118, 1477551, 1175496, 1396152, 1190751, 1481611, 1623180, 1324619, 1676043, 1234327, 1494699, 1183397, 1456614, 1443279, 1464582, 1709048, 1705267, 1311627, 1416370, 1345313, 1417342, 1441834, 1691767, 1706760, 1530906, 1523280, 1762873, 1673546, 1837920, 2020660, 2051545, 1675240, 1520701, 2010865, 1682663, 2084141, 1705274, 1711174, 1921525, 1567551, 2180325, 1845420, 1958329, 1902601, 2061342, 1899859, 2115049, 2200697, 2043593, 2072915, 2122932, 2102185, 2225048, 2344307, 2281501, 2259014, 2525567, 2906199, 2709422, 2858655, 2920670, 2881239, 3215904, 3465799, 3638360, 4017373, 4877745, 5819582, 7021209, 10658899]
14547A0658899P504640J6124847O486879k0287238I819238D430110j299274j100409
14539B030427k92433J71866K29469j83764k56966J56542J31532j10944K42882
14530B118611K8817j4343Q6649P6450j28152k217J46089K41485m79436N37935
14520B611888k61721p5526J68451r8847K11449k0736k02360J70171J50369j48446
14510B504692K28486r434O589j65286J32252j95254J34816L39195j61042M6893
14500B861907l4969N38099l53376J83566k10003M93320j19444j36383L08846m21062
14490C110501P87j47687O44957j81207J02149j12742L8427J22067o6067J00473
14480C611658j45556N9378K89747J22273l43637L23803m8317J77531k33625L47238
$$ y = [10658899, 18163539, 34288386, 40775265, 20488027, 9819238, 4430110, 3130836, 2030427, 1737994, 1909860, 2139329, 1955565, 1698599, 1855141, 1986673, 1875729, 2118611, 2147428, 2133085, 2219734, 2296184, 2168032, 2165815, 2311904, 2553389, 2073953, 2611888, 2350167, 2274641, 2443092, 2344245, 2555694, 2534958, 2332598, 2502769, 2653138, 2504692, 2733178, 2723744, 2730333, 2565047, 2697299, 2502045, 2636861, 2976056, 2815014, 2861907, 2826938, 3365037, 3011661, 3195227, 2985224, 3478544, 3359100, 3222717, 3531563, 3110501, 3111288, 2963601, 3608558, 3427351, 3529500, 3416758, 3455185, 3577252, 3511185, 3611658, 3466102, 3525480, 3815227, 3937500, 3593863, 3917666, 3869349, 4046880, 3813255, 4160493]
14470D160493k98544K79544l65290O76732k6272q2140l8648J5196J01010L47870
14460D769951l07713R1854J79194j41429J74390M8868L04211k55538N23994k86255
14450E101527Q541K49738P3346l23893K38014j23873K6097N84558j79815M55897
14440F110137n38280K49228k5658K19537L4325J17972k31928N03506l19240O44748
14430F764347l49743q9585N26551J72939j63976K55359l67453K47347K65006J16687
14420G377479j04389J32070K07861K44364j1816J16446l72713M78360L71052M5321
14410H484035K30728J33425n6861J22633L89674j30910K89333K28932o5219L63819
14400I989589j54135L31451L52276j11984J78693K90553J78869L5616K22375r3111
$$ y = [4160493, 3861949, 4141493, 3776203, 4452935, 4426663, 4344523, 4305875, 4321071, 4422081, 4769951, 4462238, 4554092, 4733286, 4591857, 4766247, 4815115, 5119326, 4863788, 5387782, 5101527, 5110068, 5359806, 5433152, 5109259, 5347273, 5223400, 5249497, 5834055, 5654240, 6110137, 5571857, 5821085, 5795427, 6014964, 6049289, 6167261, 5935333, 6438839, 6119599, 6764347, 6414604, 6325019, 6851570, 7024509, 6860533, 7115892, 6748439, 6995786, 7260792, 7377479, 7273090, 7405160, 7613021, 7857385, 7845569, 7962015, 7589302, 8067662, 8438714, 8484035, 8714763, 8848188, 8791327, 8913960, 9303634, 9172724, 9462057, 9690989, 9625770, 9989589, 9835454, 10166905, 10519181, 10407197, 10585890, 10876443, 11055312, 11090928, 11313303, 11220192]
14390A1220192Q13472J14931P3324J36419K58642K28839P7643o168M46938K91502
14380A3655734K75842K55290N44830o7236R3202O32045J73145N91595l66920J050388
14370A6837915K7029O05131p3980L12850P27343o2781O51547P91436L17497M1552
14360B0175539P71507k5550Q50374L58676N40973N79552L95484N07296O20183
14351B4774034R13402L86736O06685N08174N26074J026694Q96328O07592Q46479
14342C1092198P80106Q46433P86307R73080J044598R68017J068936J017787J127905
14333C9705367J119801J423817J070414J539052J472853J457027J327005J674745
14325E0790081J281027J997419J977686J809294K036285K177462K088873K775026
$$ y = [11220192, 12033664, 12148595, 12221919, 12358338, 12616980, 12845819, 12923462, 12917294, 13364232, 13655734, 13931576, 14186866, 14731696, 14664460, 14757662, 15389707, 15562852, 16154447, 15787527, 16837915, 16864944, 17470075, 17396095, 17708945, 18436288, 18373507, 19025054, 19816490, 20133987, 20175539, 20947046, 20921496, 21771870, 22130546, 22671519, 23251071, 23646555, 24153851, 24774034, 25687436, 26074172, 26680857, 27189031, 27715105, 28741799, 29638127, 30245719, 31092198, 31872304, 32718737, 33505044, 34478124, 35522722, 36490739, 37559675, 38577462, 39705367, 40825168, 42248985, 43319399, 44858451, 46331304, 47788331, 49115336, 50790081, 52071108, 54068527, 56046213, 57855507, 59891792, 62069254, 64158127, 66933153]
14317F6933153K233964K320935L491372K340155L211381K757259L644630L342447
14309I0275296M043102L541964M030333M269280M755223M836363N182012N585685
14301A26519258N730566O002295O605813O820547P211624P418398P882024Q569888
14293A82760413Q739950R185186R869754J0327064J0626553J0734040J1394773
14286B53637733J1950275J2194148J2370163J2906357J2539412J2991413J3122907
14279C41712408J2305826J2206936J1613053J0647108R691633Q227049O740344
14272D13144357L537135P58305P68915j137687j493817l064556n302423q487987
14264C98722242j0211224j1592230j1975393j3151867j3702424j4073153j3923940
$$ y = [66933153, 69167117, 71488052, 74979424, 77319579, 80530960, 83288219, 86932849, 90275296, 94318398, 97860362, 101890695, 106159975, 110915198, 115751561, 120933573, 126519258, 132249824, 138252119, 144857932, 151678479, 158890103, 166308501, 174190525, 182760413, 191500363, 200685549, 210555303, 220882367, 231508920, 242242960, 253637733, 265588008, 277782156, 290152319, 303058676, 315598088, 328589501, 341712408, 354018234, 366225170, 377838223, 388485331, 398176964, 406404013, 413144357, 416681492, 417439797, 418208712, 417071025, 415577208, 412512652, 407210229, 398722242, 388511018, 376918788, 364943395, 351791528, 338089104, 324015951, 310092011]
14257C10092011j3901022j3779079j3324664j2012754j2464574j1967668j1414092
14250B21228158j0957707j0240960r694844r482868q642720q218625p198262p464211
14242A49327961p241654o473209o047289n981750m921335n261878m940576m787156
14234A03673114m439939l901864m129352k857873l395267l667748l418223k633020
14226G5229828k938411k688344k626090k068193k527624j867829k185165k043902
14218E6284270j911500j831008j604330j800211j020234j152805j699569j546395
14210D3718218j193599j479201j367164m98210r14259j352652j308858q78397
14202C4725878p94014r48476r3450j519320q52104q37459p67493o30958o35046
$$ y = [310092011, 296190989, 282411910, 269087246, 257074492, 244609918, 232642250, 221228158, 210270451, 200029491, 190334647, 180851779, 172209059, 163990434, 156792172, 149327961, 142086307, 135613098, 129565809, 123584059, 118662724, 113400846, 108460270, 103673114, 99233175, 95331311, 91201959, 88344086, 84948819, 81281071, 77862848, 75229828, 72291417, 69603073, 66976983, 64908790, 62381166, 60513337, 58328172, 56284270, 54372770, 52541762, 50937432, 49137221, 48116987, 46964182, 45264613, 43718218, 42524619, 41045418, 39678254, 39180044, 38265785, 36913133, 35604275, 34725878, 33931864, 32983388, 32889938, 31370618, 30518514, 29681055, 28913562, 28282604, 27647558]
14193B7647558m80856n82306q34194n87361n13067r30458q33101L353q33349o58057
14183B1398162j84612k93107p89892k89520l52403m97742q6006p69242k45873
14174A7889765p57054o0280j45101o12264n3562m32456l90762l61220k96407K6538
14164A4807197k74925o13193j25246J25275p31340j58500j07147k35390j50039
14155A2536692L5938p12171j19425k50394j76960n4597l06128j11831j90130j99452
14145A0451542K38655m53688k07035j54546N0768m98164j3980j60958l67276K51370
14135I136688r2136m51908P092k33395M6475j6280p2134l44094n8225K46236o81611
14124G486708j09284J42413j36407m8193l17542J12589m40729K0460K65156l23393
$$ y = [27647558, 27166702, 26584396, 25750202, 25162841, 24649774, 23719316, 22886215, 22889568, 22056219, 21398162, 21213550, 20920443, 20130551, 19841031, 19488628, 18990886, 18904880, 18135638, 17889765, 17132711, 17072431, 16927330, 16315066, 16261504, 15829048, 15438286, 15077066, 14780659, 14807197, 14532272, 13919079, 13793833, 13919108, 13187768, 13029268, 12922121, 12686731, 12536692, 12572630, 11860459, 11741034, 11490640, 11313680, 11259083, 10952955, 10841124, 10650994, 10451542, 10690197, 10236509, 10029474, 9874928, 9925696, 9427532, 9413552, 9252594, 8885318, 9136688, 9044552, 8592644, 8599736, 8366341, 8412816, 8396536, 8324402, 7980308, 7922083, 8168319, 7486708, 7377424, 7519837, 7383430, 7335237, 7017695, 7130284, 6689555, 6710015, 6975171, 6651778]
14114F651778k29499r2143K80478L1930l15316M2506j40404N8944m40235L50791
14104F198830k83409j73237M0283j1044P9880M7751m36866p0967k13657J00969
14094E278533r2804l11631L08674R6244p13188L86079k27554M2877K5390n5537
14084D737083k46185J38218k33722J09531k48267L13522l23146O9862M7211p6032
14074D288075j21972R1222l83127K70204P3532n7712k69972j46923q5608J36082
14064C793801j47783q6954N18404n30200q2915K65908J76063m58209J7221j39080
14054C326256L9061n5490K70370j84803M8873K546k11507J37613J7659n31943
14044B858635K47513P5410K5136l07276P1627L02244l50062K597j51372O444R112
$$ y = [6651778, 6422279, 6330136, 6610614, 6642544, 6327228, 6369734, 6229330, 6288274, 5848039, 6198830, 5915421, 5742184, 5782467, 5771423, 5851303, 5899054, 5462188, 5391221, 5177564, 5278533, 5185729, 4874098, 5182772, 5279016, 4565828, 4951907, 4724353, 4767230, 4792620, 4737083, 4490898, 4629116, 4395394, 4504925, 4256658, 4570180, 4247034, 4316896, 4364107, 4288075, 4166103, 4257325, 3874198, 4144402, 4217934, 4160222, 3890250, 3743327, 3657719, 3793801, 3646018, 3559064, 4077468, 3547268, 3464353, 3730261, 3906324, 3448115, 3465336, 3326256, 3365317, 3309827, 3580197, 3395394, 3444267, 3446813, 3235306, 3372919, 3390578, 2858635, 3106148, 3181558, 3206694, 2899418, 2971045, 3273289, 2923227, 2925824, 2774452, 2780896, 2790008]
14033B790008L72434o47855L58852j99329M58190j41563l11013K45358k90722
14024B634360J9956N3711k50955J41924n3420J84425k78658k92120N04744j07177
14014B556790j16858M0153j71630j6545J62404m6903o16358M84900n47337L51443
14004B080059P1090j0426j76983K88292j78769K0864J57916l57594J04749p4271
13994A924927p121L73181k79065J93618O65661Q44150K142601O239392J6021423
13985B8118767J3852628j7727184j1992730m768055j832780r69780r33752l62359
13977C384755K8317n41078J04046l08632o326M6524k29467r9666l69175J07297
13967B116595J34790j04869k09008P4564K42618J40797k84751j11076Q8152j5149
$$ y = [2790008, 3162442, 2514587, 2873439, 2674110, 3132300, 2990737, 2679724, 2925082, 2634360, 2654316, 2708027, 2457072, 2598996, 2545576, 2730001, 2451343, 2159223, 2663967, 2556790, 2439932, 2480085, 2308455, 2291910, 2454314, 2407411, 1791053, 2275953, 1728616, 2080059, 2151149, 2140723, 1963740, 2252032, 2073263, 2094127, 2252043, 1894449, 1999198, 1924927, 1917806, 2290987, 2011922, 2205540, 2871201, 3715351, 5857952, 12097344, 28118767, 41971395, 24244211, 12251481, 7483426, 5650646, 4680866, 3747114, 3384755, 3413072, 2871994, 2976040, 2667408, 2661082, 2707606, 2478139, 2378473, 2009298, 2116595, 2251385, 2146516, 1937508, 2012072, 2254690, 2395487, 2110736, 1999660, 2087812, 2072663]
13957B072663l52272L52064l08813O2534J66306n03145L58388j71821K97372m94092
13947A479184R9980J07433k16024O1792j10142L99217l28979J22696N2692j41998
13937A525851K57220k29444q9594J67281J0099k22313n8053K98300n8123l24660
13927A276564L05776J1082j48851K26729m79394M79272j76007o6992r3107q0273
13917A254799K36203l45974J69734K06567m27748J97553M2682j8299L04369p43275
13907H76611O72421p8305l0063j71692J14478k43553K31466m58849N41035l61073
13897A092476J45544m8730J07296J11231k89233L6060J65646j84631L09992j09876
13887A335775N4324j65008l0434K50090k54077j64130j27160J48679J6394j30567
$$ y = [2072663, 1720391, 2072455, 1763642, 1826176, 1992482, 1489337, 1847725, 1675904, 1973276, 1479184, 1579164, 1686597, 1470573, 1532365, 1422223, 1821440, 1492461, 1615157, 1667849, 1525851, 1783071, 1553627, 1464033, 1631314, 1641413, 1419100, 1361047, 1659347, 1601224, 1276564, 1582340, 1593422, 1444571, 1671300, 1191906, 1671178, 1495171, 1428179, 1335072, 1254799, 1491002, 1145028, 1314762, 1521329, 1093581, 1291134, 1333816, 1315517, 1619886, 876611, 1549032, 1470727, 1440664, 1268972, 1383450, 1139897, 1371363, 912514, 1453549, 1092476, 1238020, 1189290, 1296586, 1407817, 1118584, 1154644, 1320290, 1135659, 1445651, 1335775, 1390099, 1225091, 1194657, 1444747, 1190670, 1026540, 899380, 1048059, 1064453, 933886]
13877I33886K28012j08416p8999l48292N62252l43782j9151L45207j83498J95284
13867A182503l31195J75930k06411j70304M16566Q8312q7304J06324m93211J50536
13857H31746J9585j1222O0871J73017m68164L60749l5613J50249L4422k80367
13847H35273J69539k74723L97527J88829n4532k53290j07514k38804M21997k78903
13837H05399o3303J7055m7853N42525D61214M17577j59734K75715j32424o9112
13827G93236R7480j88767k56441K13607K16184K716k44669K22621K7702Q8400
13817I72069k43166O5765q1361K06360J33903R3956k12518m01030L55508m3859
13807H45627B90524N28387O3438j27770O8997n2587j40261k9998n5468M3109L19483
$$ y = [933886, 1161898, 1053482, 974483, 626191, 1188443, 844661, 825510, 1170717, 987219, 1182503, 851308, 1027238, 820827, 650523, 1067089, 1155401, 1068097, 1174421, 681210, 831746, 851331, 840109, 900980, 1073997, 605833, 966582, 930969, 1081218, 1115640, 835273, 1004812, 730089, 1127616, 1316445, 1261913, 1008623, 901109, 662305, 1084302, 805399, 742096, 759151, 711298, 1253823, 461214, 878791, 719057, 994772, 862348, 793236, 890716, 701949, 445508, 659115, 875299, 878015, 633346, 855967, 883669, 972069, 728903, 794668, 713307, 919667, 1053570, 1147526, 935008, 533978, 889486, 845627, 290524, 818911, 882349, 754579, 823576, 770989, 630728, 600730, 545262, 588371, 907854]
13796I07854l56507K69536M5212L448l37550M76063k62157l4478n306k4151J33673
13785H15637j96416O2203r4713o536N8698j53845K51111l01578M1069P8307j25110
13774D28827K5823J08632k21358L01265k31200J52029P7556Q1163o3073q9671
13764E69993J89081j33180N9118B69588M65234j29272K1176J49988j47191o5694
13754E63829K0414k29907O61548D43753m4491L34071L151C59179K21988J16484
13744F97651k17771k01163L757K54914J51020j39513M9449j36429N9666L43963
13734H65544l78497L82921j07635j67034J13779l14586K23621L2468p5578R6186
13724F71189l09000j40453J56521J37045j23674P244R1111k7947m5774j2279R6573
$$ y = [907854, 551347, 820883, 866095, 869543, 531993, 1008056, 745899, 711421, 706115, 681964, 815637, 619221, 681424, 586711, 580175, 638873, 485028, 736139, 434561, 475630, 553937, 428827, 454650, 563282, 341924, 643189, 411989, 564018, 641574, 722737, 659664, 569993, 759074, 625894, 685012, 269588, 734822, 605550, 626726, 776714, 629523, 563829, 584243, 354336, 1015884, 443753, 399262, 733333, 736484, 359179, 581167, 697651, 479880, 278717, 282474, 537388, 688408, 548895, 598344, 461915, 521581, 865544, 487047, 869968, 762333, 595299, 709078, 394492, 618113, 650581, 575003, 671189, 362189, 221736, 378257, 515302, 391628, 398872, 489983, 462036, 416262, 403983, 500556]
13713E00556j78942J83670Q5791o2662j98606L88395m7142k59293j53248q655
13703B49864L81902J37002k42710q9777J95236j68771N04k18009Q7281N45564
13693H78086C27579m4717M1783m363N4527r8424K44102j3184j17436j0275J49372
13682E28964j69495P7542j04849J49924J56573k4055A95917J28521J67462j70046
13672C21854K53980k20165j28607K68806L5818A53089Q2871L05636j45995J45964
13662E41565l4179m6716n7840j3678l3045k1815o2110M62747k26279B24913L76916
13651F01829o7358B01806K76701l1795r7370Q8986J9306N0904A83085L59465k44283
13640B98267J30436o086J36207j99928o6131P7934o3859K6392J13092J02586A38962
$$ y = [500556, 321614, 505284, 591075, 528413, 329807, 718202, 671060, 411767, 258519, 249864, 631766, 768768, 526058, 436281, 631517, 462746, 463250, 245241, 332522, 878086, 327579, 282862, 324645, 320282, 374809, 276385, 520487, 507303, 389867, 379592, 528964, 359469, 437011, 332162, 482086, 638659, 614604, 195917, 324438, 491900, 321854, 575834, 355669, 227062, 495868, 531686, 153089, 235960, 541596, 395601, 541565, 507386, 460670, 402830, 389152, 356107, 334292, 272182, 734929, 508650, 224913, 601829, 534471, 201806, 478507, 446712, 349342, 438328, 457634, 508538, 183085, 542550, 298267, 428703, 422617, 558824, 358896, 292765, 370699, 306840, 333232, 446324, 548910, 138962]
13628B41506f5301C44052r181J05865Q581N9337F2397L34835J144J21913k11763
13617C08526J10870K118a2307D63560G9577M68465H8003N79904j36818k7859q1194
13606D22036A57690L08434j5547j00144d468B44199j04063K88483L165K48664
13596F80448C03001M141K45990j83025k3264q6399L64435A60730K41964j81933
13586B20761M8444J35606p8712K89161j12245B00521o7744K37567A74552o8676
13576A05876K32115L29950j95974G7211K12564o8447C1570g7435C43736A34347
13565A29945L43832j70846L0494J52505M7488j90566A21553K80778G7381J37271
13555B14652K86079c9941E75256B05107r8551J21438n0987L10319B8117a2003
$$ y = [241506, -65301, 344052, 334871, 440736, 449317, 508654, 62397, 397232, 398376, 520289, 308526, 419396, 421514, -12307, 463560, 79577, 548042, 88003, 667907, 531089, 503230, 422036, 157690, 466124, 450577, 350433, -4468, 244199, 140136, 428619, 431784, 680448, 303001, 307142, 553132, 370107, 346843, 260444, 624879, 160730, 402694, 220761, 269205, 404811, 326099, 615260, 503015, 200521, 132777, 370344, 174552, 105876, 337991, 667941, 471967, 77211, 289775, 221328, 31570, -77435, 343736, 134347, 129945, 473777, 302931, 333425, 485930, 533418, 342852, 121553, 402331, 77381, 214652, 500731, -39941, 575256, 205107, 106556, 227994, 177007, 487326, 28117, -12003]
13544B68990J42465K16817k50487j87663M3845L78950j94388A64736o5727K33465
13534C32474p6575k899b6560E19218H8695K64903j71378j8009a58850D09846q478
13523D01368F4772J79074J29416E2869J2169J59587B8490K28157L98682C22384
13512E98689B71166l1916j01942J04292o5011G7733r370J91023L8360L999r1846
13501B09899d3670C25456L9025H0056j6640J89316e0262A44640f0557A04153q790
13490I5363L56611a82786c246B52437r2019F3123O6034g1898B15805L6474O7612
13479C19891A25876L06812f2449B50099J12966j37779J71280A78056K11681L5392
13469D25129A2721J39231o6489a90573g1543A59993k2222O6679J5265M22761k54710
$$ y = [268990, 411455, 628272, 377785, 190122, 233967, 612917, 418529, 164736, 99009, 332474, 255899, 253000, -26560, 519218, 88695, 353598, 182220, 164211, -158850, 409846, 401368, 64772, 243846, 373262, 52869, 65038, 224625, 28490, 256647, 655329, 322384, 598689, 271166, 239250, 137308, 241600, 176589, 77733, 68363, 259386, 297746, 301745, 209899, -43670, 325456, 364481, 80056, 63416, 252732, -50262, 144640, -60557, 104153, 95363, 451974, -182786, -3246, 252437, 160418, 63123, 129157, -71898, 215805, 252279, 319891, 125876, 432688, -62449, 250099, 363065, 225286, 396566, 178056, 389737, 425129, 12721, 151952, 85463, -190573, -71543, 159993, 137771, 204450, 219715, 642476, 387766]
13458C87766F2008J61208A2146L46083A38700a07670A78761a11655L2990A07658
13447B47795Q2445A4267J05396J99782A40197R6210l9651K4937O1534j23117b3442
13435E7304c4619G2059N0547f5591C70463J2086A13474h8169I6378K03175O3052
13424C62605c6752C49907o4890N3202n5030i073F7988a8846A56375L6299R848
13413B02522J80902J28245C4921J9876J09604K41665A57845L7936J14820B2329
13402D41490F1440J26666J51971g1344A82394K9185l5930n0790K29605c9927E1117
13390C84626A02371J57375A20403c28545B85595l6132k1030i197E9057K88540
13380C47597M4352p5066m5447b01883C31062A33676a05616C33500j38309L52977
$$ y = [387766, 62008, 223216, 12146, 358229, 138700, -107670, 178761, -111655, -78665, 107658, 247795, 330240, 14267, 119663, 319445, 140197, 236407, 196756, 221693, 283227, 160110, -23442, 57304, -34619, 72059, 122606, -65591, 370463, 382549, 113474, -88169, 96378, 299553, 362605, -36752, 349907, 285017, 338219, 283189, -9073, 67988, -18846, 156375, 192674, 202522, 383424, 511669, 34921, 54797, 164401, 406066, 157845, 195781, 310601, 22329, 441490, 61440, 188106, 340077, -71344, 182394, 211579, 175649, 124859, 354464, -39927, 51117, 384626, 102371, 259746, 120403, -328545, 285595, 249463, 228433, -9197, 59057, 347597, 391949, 316883, 271436, -201883, 331062, 133676, -105616, 333500, 195191, 548168]
13370E48168A31667K0300L22426A06914C1147J47864q1623R7954E4552K38557
13360B93109a539D24360k06046a3743A35238R7190a17700A47907h9019b1316D72337
13348A51021h8934B44287J28097A80572K02494r882a06364C36678F4946P1680
13338A36626J21890K11527k20635p9269J77909j03484G7720a33357A54784g7425
13327B85676a5562D4982L35253D5669J59307G1694K11666E4591R2964A5283Q7300
13316A02583J85493J48506l0388e5753B65469R9667j14363R9371j64507E5152
13305A20027a0622C11177j24799L3320f9563D0785L18506A74493H475L05484b2062
13293d1326A23477K40268a27332f667A55430J6458b60710A35580L243B5276J84276
$$ y = [548168, 131667, 151967, 474393, 106914, 31147, 179011, 97388, 195342, 54552, 293109, -1539, 424360, 218314, -13743, 135238, 232428, -117700, 147907, -89019, -21316, 472337, 151021, -88934, 244287, 372384, 180572, 383066, 373184, -106364, 336678, 64946, 136626, 258516, 470043, 249408, 170139, 348048, 244564, 77720, -133357, 154784, -77425, 285676, -15562, 44982, 380235, 45669, 204976, 71694, 283360, 54591, 147555, 15283, 102583, 288076, 436582, 406194, -55753, 265469, 365136, 250773, 350144, 185637, 55152, 120027, -10622, 311177, 186378, 219698, -69563, 40785, 359291, 174493, 8475, 313959, -22062, -41326, 123477, 363745, -127332, -6667, 155430, 171888, -260710, 135580, 138823, 25276, 209552]
13282B09552b4608C12624i0830C26642B2539K25437A7476J4866a64367B95515
13271A59807E4143d56296G3581K6011K92039a52868C37433b66414A56561b2038
13260B91622b4531G0974J60595d31I7617l4704L181j5157J80598J19277H6271
13248A30616K62108F9000l1220J87373B1040J96907Q192A09106l3329O0370c293
13236F2119M4918k2895a64623A22709K10380A64917a04101j1029B31662K2231
13226B53893r3927O3840a55527C32170h9580A5206K00190J63110j40518M1946
13216B79934K3159A280K95890A43076i4359d2276A58988J1479j3669B3935h3702
13204A64448f4906n4935b5234B60581q4445O9025a1770B24190D1318O6289C2135
$$ y = [209552, -24608, 312624, -90830, 326642, 22539, 247976, 17476, 32342, -164367, 295515, 159807, 54143, -456296, 73581, 99592, 391631, -152868, 337433, -266414, 156561, -22038, 291622, -24531, 70974, 231569, -431, 97617, 62913, 66094, 50937, 231535, 350812, 86271, 130616, 392724, 69000, 37780, 225153, 21040, 217947, 226139, 109106, 75777, 136147, -3293, 62119, 107037, 84142, -164623, 122709, 333089, 164917, -104101, -115130, 231662, 253893, 159966, 223806, -155527, 332170, -89580, 15206, 215396, 378506, 237988, 279934, 303093, 1280, 297170, 143076, -94359, -42276, 158988, 170467, 156798, 23935, -83702, 164448, -64906, -119841, -25234, 260581, 176136, 245161, -11770, 224190, 41318, 107607, 32135]
13192g2521A59610L13925a93823B9864G84J59858Q3722a28825B93635m7542L736
13181B49829a09457M8667j40928a226n457G019K22703b3283A41906b59295a22650
13169H6310K36547D3603K83344b18335C14691i2576H6708k8686a03725D4890J06463
13158A51353f633B6564J02625A6178N5493B7248J74896a17497k9932D4632P4194
13147A18826D4585b98658J42709A79853d21069C8775Q8978J60990e363j48533
13137a53896e176k2840k1734H9525J50253p5631n4019A0622j545a10367B47070
13125I715K0202d7480A08637E3300J00195J9422b08368C68089j01855j04149P9311
13114B41396j5207k8075a49509f2223C75416A58254b01153G0412D425J37121c60192
$$ y = [-72521, 159610, 473535, -193823, 29864, 784, 160642, 244364, -128825, 293635, 246093, 249829, -109457, -60790, -201718, -1226, -6683, 7019, 229722, -23283, 141906, -259295, -122650, 86310, 322857, 43603, 326947, -218335, 314691, -92576, 86708, 58022, -103725, 44890, 151353, -6633, 26564, 129189, 16178, 71671, 27248, 202144, -117497, -147429, 44632, 118826, 44585, -298658, -155949, 179853, -421069, 38775, 127753, 288743, -5363, -153896, -5176, -28016, -49750, 89525, 239778, 164147, 110128, 10622, 9077, -110367, 247070, 9715, 29917, -47480, 108637, 53300, 153495, 172917, -208368, 368089, 266234, 162085, 241396, 226189, 198114, -149509, -62223, 375416, 158254, -201153, 70412, 4425, 141546, -360192]
13102A9733a18924A83697l0926A283J28911M0864a62958e9701I457L03159a23251
13090f0001C84071j21257c80125f8032j75372D4012a07327G2706C2120b7280A11011
13078I7554c043G6508c7045H6034e7981B11337a45162c7584k26507a04045B21308
13066C6380L2604a13987A07684n3617J22312D7975Q039R4454a74420j9367G9480
13054A04727f1175B00474f9550A00063g2825C56398b3626B79098H7644c7096D0824
13042H3134L7950B045J38852E3421L70017A24211M5321A3561E321Q800a24755
13030a27279B11012I7474J57813M015c8786I628J1224L74633i9547o1552B19121
13018B81837i8715B02584m8882h3320C40765F8405L9213K35187C2827N2574R9030
$$ y = [19733, -118924, 183697, 152771, 1283, 130194, 171058, -162958, -59701, 9457, 312616, -123251, -60001, 384071, 262814, -380125, -68032, -243404, 44012, -107327, 72706, 32120, -27280, 111011, 97554, -3043, 76508, -37045, 86034, -57981, 211337, -145162, -37584, -264091, -104045, 221308, 36380, 68984, -113987, 107684, 54067, 176379, 47975, 56014, 150468, -174420, -193787, 79480, 104727, -61175, 200474, -69550, 100063, -72825, 356398, -23626, 279098, 87644, -37096, 40824, 83134, 121084, 2045, 140897, 53421, 423438, 124211, 169532, 13561, 5321, 14121, -124755, -127279, 211012, 97474, 255287, 259302, -38786, 9628, 20852, 395485, -99547, -161099, 219121, 281837, -98715, 202584, 153702, -83320, 340765, 68405, 107618, 342805, 32827, 85401, 184431]
13007A84431o7289a19381E3816a39614I4176m0646J48522k6243g6191c0311q3411
12996a13722I456b1214A70497m9506J26151F2815J61841j2413I9497M6239Q1253
12985B26989P043b50610J17942C61310a44041E4672K8657b6783B70902O5306k9480
12974C06728h6173J745e415A24984a8066A50338d5358k56845F0146d5946B94699
12962C69589f7701k31572H5901K30795f2211k3705L3466Q357A65089A4281a33795
12950A3768K29268H3949b02026B73083j20288n4193b84166a41598A48642B7960
12939C19421A08731l3271C3390P930a18799k76453B10330J57027A66725n4370
12929A12355J49070i2342b7848a2389A7321i9944H1260K95705A12393e9831j3378
$$ y = [184431, 117142, -119381, 53816, -139614, 94176, 53530, 202052, 175809, -76191, -30311, -113722, 9456, -21214, 170497, 120991, 247142, 62815, 224656, 212243, 99497, 145736, 226989, 234032, -250610, -132668, 361310, -144041, 54672, 83329, -26783, 270902, 336208, 306728, -86173, -84428, -5415, 124984, -18066, 150338, -45358, -302203, 60146, -45946, 294699, 369589, -67701, -299273, 85901, 316696, -62211, -85916, -52450, -44093, 165089, 14281, -133795, 13768, 243036, 83949, -202026, 273083, 152795, 98602, -284166, -141598, 148642, 27960, 319421, 108731, 75460, 33390, 41320, -118799, -395252, 210330, 367357, 166725, 112355, 261425, -92342, -27848, -12389, 17321, -99944, 81260, 376965, 112393, -59831, -73209]
12918g3209l4576C91399c34807C42814a2846B33863R7376a12654B43848a09049
12907a39415A01736b77665C4743a80790f737j54606O4407A21383c58810A54606
12896B04894c5589A83924j6006a55766C4688J24599n4558k7268J08590f9098A57490
12884a53433g66j3057j55755B63471J00398b72617h7697a3396j02968J9528B61503
12872A42883J10318d7612A19732i9657a0223C0514L06453j66979a35366e6619
12861C16096A18655J71114a57883A7371e8599B82550A24330h2849A1587J78745
12851A90332c30254c5194r8432I0559M0131A2021a47635A72633n1098b5054G8654
12839h6864B67413f2263l0772I879O9398a29550A66181o210h612l300p0218D8808
$$ y = [-73209, -107785, 391399, -334807, 342814, -12846, 233863, 331239, -112654, 243848, -109049, -139415, 101736, -277665, 34743, -180790, -6737, -161343, -96936, 121383, -358810, 154606, 204894, -35589, 183924, 167918, -155766, 34688, 159287, 104729, 77461, 186051, -69098, 157490, -153433, -766, -13823, -169578, 263471, 363869, -272617, -87697, -13396, -116364, -96836, 261503, 142883, 253201, -47612, 119732, -99657, -10223, 30514, 336967, 169988, -135366, -56619, 316096, 118655, 289769, -157883, 17371, -58599, 282550, 124330, -82849, 11587, 190332, -330254, -35194, -133626, 90559, 130690, 12021, -147635, 172633, 121535, -25054, 78654, -86864, 267413, -62263, -93035, 9879, 79277, -129550, 166181, 159971, -8612, -11912, -82130, 48808]
12826F3727K01423g7652C12642e1814E4312K15302a61874J7872K7412B06970I6443
12814E2841R8017b94496B07438J15376m3180m4599h6092I3176a63959h1846F7343
12802d3866A2363Q453P6733L31794f4159F934R2229a47634D8294b44518d481p4443
12790g8924D09612j89812H0752a3511k8003j67956j81690C31368b5874j9452B6714
12778E9988n021b83600a2761A12539l3310d8574A72994d20502J93173a5772j04129
12767a19901B00176B6177b49624A58823d760k81543H0058i7402A113a81932g2889
12755B17466e0603B40b90465A15482b7862j95011G3415b78606b4408m2552A01258
12743B0767J35115R1650H7548J36215b5308C06980b35289B22047l6444H6722L4086
$$ y = [63727, 265150, -77652, 312642, -51814, 54312, 269614, -161874, -144002, -116590, 206970, 96443, 52841, 150858, -294496, 207438, 322814, 279634, 235035, -86092, 93176, -163959, -81846, 67343, -43866, 12363, 20816, 97549, 429343, -64159, 6934, 99163, -147634, 48294, -244518, -4481, -78924, 409612, 219800, 80752, -13511, -41514, -209470, -391160, 331368, -25874, -45326, 26714, 59988, 54967, -283600, -12761, 112539, 79229, -48574, 172994, -420502, -227329, -15772, -119901, 200176, 26177, -249624, 158823, -4760, -286303, 80058, -97402, 1113, -181932, -72889, 217466, -50603, 240, -290465, 115482, -27862, -222873, 73415, -278606, -24408, -66960, 101258, 20767, 155882, 247532, 87548, 223763, -25308, 306980, -235289, 222047, 185603, 86722, 120808]
12732A20808c44993J06692Q9853F4791J64653a74941M7362A6370b63693B34874
12721A32008B0761R3516b0299B31920b445m6230A83648n8943a62607A65790d2933
12709B57668A20966n7559N0561a9156I2875J42511i3389C32672j22204a95684
12698C5714J64036n4015B0280J2776a025G6485J5267g7450D56032h2363j46942
12687b29305d8074d33o9817j00286a1003C4797O688e0722B37288r3340E8055M0049
12675I8104m1367K932L28411k0658A79676N5247G6287e2922A08330J31643i4915
12663g7978A38376B8162J51482a18489D9489J54007d0139o074C59472A5190M5277
12652F0467J1928B8930J06641L49448B3874L7197K4835b3524A37954a11937J8456
$$ y = [120808, -344993, -238301, -148448, 64791, 229444, -174941, -127579, 16370, -263693, 234874, 132008, 20761, 114277, -20299, 231920, -2445, -48675, 183648, 124705, -162607, 165790, -42933, 257668, 120966, 63407, 113968, -19156, 92875, 235386, -93389, 332672, 210468, -195684, 35714, 199750, 145735, 20280, 33056, -1025, 76485, 91752, -77450, 456032, -82363, -229305, -48074, -433, -70250, -170536, -11003, 34797, 41485, -50722, 237288, 143948, 58055, 98104, 56737, 59669, 388080, 367422, 179676, 234923, 76287, -52922, 108330, 239973, -94915, -77978, 138376, 28162, 179644, -118489, 49489, 203496, -40139, -46213, 359472, 15190, 60467, 72395, 28930, 135571, 485019, 23874, 61071, 85906, -23524, 137954, -111937, -93481]
12641i3481j04528C54662F2384R1422a76738e239A4406L8717J62248a55293B33331
12629g314A31151J12978F1872L27484a34189f455B43100i7994l4852C14207b07908
12617a87055M212h1566B61635I6660m6733Q1815c9238k97348I0561d1298A73769
12605D30212j38866B964a99647A56328O5561O5944f5158E6494L59252m2019C3728
12593C5652b07523A65697a04528B27045n3950d4824I8560a2032A44378m8360K4978
12582A20996d7177B6052K9673g6992g518I9109a0693j40726r3427a3067l3923
12571d6990j36264r1989A98823o8253a49297M3355b9915j67495K1422I0377a95678
12559a11666B9833e1109D0190b1720B91367J00787j92529p1044L15454i1192I7022
$$ y = [-93481, -198009, 354662, 62384, 153806, -176738, -5239, 14406, 53123, 215371, -155293, 233331, -7314, 131151, 244129, 61872, 389356, -134189, -6455, 243100, -97994, -132846, 314207, -207908, -187055, -182843, -81566, 261635, 96660, 49927, 131742, -39238, -336586, 90561, -41298, 173769, 430212, 291346, 2964, -199647, 156328, 221889, 287833, -65158, 56494, 415746, 373727, 33728, 35652, -207523, 165697, -104528, 227045, 173095, -44824, 98560, -12032, 144378, 96018, 120996, -47177, 26052, 55725, -76992, -7518, 99109, -10693, -151419, -244846, -13067, -46990, -183254, -275243, 198823, 130570, -149297, -105942, -29915, -197410, -175988, 90377, -195678, -111666, 29833, -51109, 40190, -21720, 291367, 392154, 199625, 128581, 444035, -91192, 97022]
12547f9831B32646l6157b01862A72870p1243a13674B06220c54996a0539k77158
12537b87697A21975a14975B91165b14277q1761d7895j62622F8956J68689n1104
12527A86541b41725o9631A5848f2299B17029o9547D3311M3030J664C6118P1930
12516A08048J93918k9591a175r1316M6035C65930G9291O5895J66250b4858E7562
12504A91426J2844F1337J6636m217a91851P3203D48964a61625n2988C61920A01786
12492a53726a2854l11399B40585F7300J03401G2400e8369B22881n0033R269R7420
12481B79537o6547b50065d6933p5210I7256J96824A6124a67541A21140n0937c02692
12469D8295a38586H1094A145a58708a806B5667Q3790d7021D3412L26857A29211
$$ y = [-69831, 232646, 196489, -201862, 172870, 101627, -113674, 206220, -354996, -10539, -287697, 121975, -114975, 291165, -214277, -296038, -47895, -210517, 68956, 237645, 186541, -241725, -311356, 15848, -62299, 217029, 147482, 43311, 86341, 88005, 36118, 108048, 301966, 272375, -1175, -92491, -46456, 365930, 79291, 145186, 311436, -24858, 57562, 191426, 204270, 61337, 77973, 73756, -191851, -118648, 448964, -161625, -214613, 361920, 101786, -153726, -12854, -324253, 240585, 67300, 170701, 72400, -58369, 222881, 172848, 182117, 279537, 212990, -250065, -46933, -122143, 97256, 294080, 16124, -167541, 121140, 70203, -302692, 48295, -138586, 81094, 1145, -158708, -1806, 25667, 109457, -47021, 43412, 370269, 129211]
12457A54632d4299j01017N4642E1801b22993r72G8762P0264b29613C2939a64705
12445A59124D9593J76424A9188b95901C56212A29018b32319B6751a86720A9045
12434b70003A40372a61169r6987K1057A43967a31395L9813j9847D43421A31263
12423F2339M7135a9332j47580A04282b2829m40159Q6877a87342A05601E5K03977
12412B04032i1363B51279Q6220H9765a5982m2030k68494e3027j15016A77766o5245
12401A12521l0696a70301A87692c7243j23552B4020R9772b72707J21673A93628
12390a2016j06988B89217a40161n2208o6196i6379R485A18474D2919g5991B4111
12378a7613k97599N3193B0078K39566B2073M4377M9660n3212K37949h2104B38299
$$ y = [154632, -44299, -145316, -90674, 51801, -222993, -223965, 78762, 149026, -229613, 32939, -164705, 159124, 49593, 226017, 19188, -295901, 356212, 129018, -232319, 26751, -186720, 19045, -270003, 140372, -161169, -258156, -237099, 143967, -131395, -91582, -111429, 443421, 131263, 62339, 109474, -19332, -166912, 104282, -22829, -462988, -376111, -187342, 105601, 55, 204032, -91363, 251279, 337499, 89765, -15982, -58012, -326506, -53027, -168043, 177766, 112521, 81825, -170301, 187692, -37243, -160795, 24020, 123792, -272707, -151034, 193628, -12016, -119004, 289217, -140161, -192369, -258565, -96379, -86894, 118474, 42919, -75991, 24111, -17613, -315212, -262019, 20078, 259644, 22073, 66450, 116110, 62898, 300847, -82104, 238299]
12366A60787J6967h0097k20025b7700B92942a36434A5706c38354J27416Q5693
12356a25245A52066L6304N7597L9650E4439J18029j9201p0905J21070b14659F2263
12344a28830B19343e21132B1065C775K05355a2836l55710J24320d0075p460b3354
12332H7114a49123E2271a91538A03572d5213j15713A01934L1164d7775C196i0744
12320a9398j11129M7894p2707m4759A14834q179c91067G678K10165G7411K23021
12309C00432D7310c5389a4459j31934M4523A48766N0687a81482b3058n1659A36092
12297f3094B65516r6556a5220q1421B06933a63163E5773J86692a52609C0766P3995
12286A04761a66869B64440l4914B8559J42672B5747h6507B57655d5699a2950A06947
$$ y = [160787, 177754, -80097, -300122, -27700, 292942, -136434, 15706, -338354, -210938, -125245, 152066, 188370, 245967, 285617, 54439, 172468, 153267, 82362, 203432, -214659, 62263, -128830, 219343, -521132, 21065, 3775, 209130, -12836, -368546, -244226, -40075, -47535, -23354, 87114, -149123, 52271, -191538, 103572, -45213, -160926, 101934, 133098, -47775, 3196, -90744, -19398, -130527, -82633, -155340, -200099, 114834, 106655, -391067, 7678, 217843, 77411, 300432, 47310, -35389, -14459, -146393, -101870, 148766, 199453, -181482, -23058, -74717, 136092, -63094, 265516, 168960, -15220, -96641, 206933, -163163, 55773, 242465, -152609, 30766, 104761, -166869, 264440, 229526, 28559, 171231, 25747, -86507, 257655, -45699, -12950, 106947]
12274C54315a24419B01881q7969c0905A74966G6062M4296a63870B27688b86164
12263e1659a3211j0224j79585B03011m4900R601E5534b80204J15188A99559L2261
12252B31820c5947A94407H1030Q821b54181a02734B8737J78055M5852K3491m6865
12241B29270J45292A36582J64393J42723h239l12773B53153A25578B6889J04777
12231A31666M6457A2091K49718I1469J35933b8322D55759A140K70195K70679B41938
12219E86976G9042K68280M9954a64084B13584B4701K12632l3541K0541b1043q029
12208b9072l7733B48676P9911A61901J91002I8528K9925K05285j07199J33664
12198C60203F9018Q7716J44619l1619I7749N2382p3537K82995D639L7883J43754
$$ y = [354315, -124419, 201881, 113912, -30905, 174966, 76062, 120358, -163870, 227688, -286164, -51659, -13211, -23435, -203020, 203011, 158111, 167712, 55534, -280204, -165016, 199559, 231820, -35947, 194407, 81030, 89851, -254181, -102734, 28737, 206792, 252644, 276135, 229270, 374562, 136582, 300975, 443698, -8239, -321012, 253153, 125578, 26889, 131666, 178123, 12091, 261809, 91469, 227402, -28322, 455759, 1140, 271335, 542014, 241938, 586976, 79042, 347322, 397276, -164084, 213584, 24701, 237333, 203792, 224333, -21043, -29072, -66805, 248676, 328587, 161901, 352903, 98528, 128453, 333738, 226539, 360203, 69018, 156734, 301353, 269734, 97749, 150131, 76594, 359589, 4639, 42522, 186276]
12187A86276R0700O567j19532i5670C2285J08384J18183j13794g7101A84549r398
12176A75151b57439I4017J26753b0373B37338A07267J87769j26428c04752A92256
12165A9899a51711B38826G5385L5984B8502i7499n7063B82876H0175c3316q3381
12154a16697A56741a92024R4298h414r7152Q281n138E5237Q3457a50629g0203
12142a93930B29444J32224d2213m00127F202J56886C3440a0038C9f1037k13247
12131b74284F22439b164B18765j01655i79D0387g9476j59480B23024k5716J6718
12120B14026l7515c734B67025b27989C7967J42455a43163B1203O3973B4612L5351
12109E9963K79523g278q06k61371A81917J6295a67079g1155k34657J44171m7678
$$ y = [186276, 276976, 283543, 164011, -95670, 32285, 140669, 258852, 145058, -77101, 184549, 175151, -257439, 94017, 220770, -20373, 237338, 107267, 295036, 168608, -304752, 192256, 19899, -151711, 238826, 75385, 111369, 28502, -97499, -154562, 282876, 80175, -33316, -116697, 156741, -192024, -97726, -8414, -105566, -97285, -102423, 55237, 138694, -150629, -70203, -193930, 229444, 361668, -42213, -442340, 6202, 163088, 33440, -10038, 39, -61037, -274284, 622439, -2164, 218765, 117110, -979, 40387, -79476, -238956, 223024, 197308, 214026, 176511, -3734, 267025, -227989, 37967, 180422, -143163, 21203, 85176, 24612, 59963, 339486, -7278, -8084, -269455, 181917, 198212, -167079, -71155, -305812, -161641, -209319]
12098b09319R0471p6566k92960a14j3872j6207A03580a52032A74827c08567h1813
12086A41340C7061O6354M0378k3318c56384K7402c5890o1755c2312j49549C8113
12074B48962C8312a88172A68947a38053B5939a55288B41952c09959A41187c9474
12063D0959i1566k4099L7451J6522j28890f9739J5225B02768a48566A31790N30677
12052F62467Q75709n24249E03055a53453D49251a22346C07641E4799c7632G6678
12041f8184m8629j07372b3210h691j26978A7074a54851e2503j79065D02569i4305
12029H4474l494a65966A80022a61170J0703e970A6812b4931A65935b01743R9863
12018a01880C9451P3749J43459h8359m6267C2250d2072k34117f4906n9662A14191
$$ y = [-209319, -118848, -195414, -488374, -114, -13986, -30193, 103580, -152032, 174827, -308567, -81813, 141340, 37061, 103415, 143793, 120475, -356384, -328982, -35890, -97645, -32312, -181861, 38113, 248962, 38312, -188172, 168947, -138053, 25939, -155288, 241952, -309959, 141187, -39474, 40959, -91566, -115665, -78214, -61692, -190582, -69739, -54514, 202768, -148566, 131790, 662467, 1538176, 1013927, 503055, -153453, 449251, -122346, 307641, 54799, -37632, 76678, -68184, -116813, -224185, -23210, -8691, -135669, 17074, -154851, -52503, -231568, 402569, -94305, 84474, 80980, -165966, 180022, -161170, -150467, -5970, 16812, -24931, 165935, -201743, -101880, 39451, 113200, 256659, -88359, -134626, 32250, -42072, -276189, -64906, -124568, 114191]
12006a1007k32610A57181a19476A51933a33054d8733n6114L8533H5518K69139
11996C54657b3870C87453d7739j44027j3762A40290a9014o5599J4158b0901A2740
11984A43858a19492B54136K86348c22568H9004g4830o0864A55846J04720B3628
11973A07509c2947j02774A94425b01652A75533J49180A61268d3731n5011n7813
11963a56555B91K4929a41451K6489A48540a62601j52073a31645I152d0740K771
11952c7969B50399d8483r3220r9892I8439i951j22349A6492J5469a81304n8943
11941b40247A08209K49062A8532e8405B14243b6999m8434G5596N0482o2785P9096
11930A42389b52725C9913R6443N6955b45919D0544g26B2518d1524a7145M17A1224
$$ y = [-11007, -243617, 157181, -119476, 151933, -133054, -48733, -104847, -66314, 85518, 354657, -23870, 387453, -47739, -191766, -205528, 140290, -19014, -84613, -70455, -20901, 12740, 143858, -119492, 254136, 540484, -322568, 89004, -74830, -135694, 155846, 260566, 23628, 107509, -32947, -135721, 194425, -201652, 175533, 324713, 161268, -43731, -98742, -156555, 291, 25220, -141451, -114962, 148540, -162601, -314674, -131645, 9152, -40740, -37969, 250399, -48483, -141703, -241595, 98439, -9951, -132300, 16492, 31961, -181304, -240247, 108209, 357271, 18532, -58405, 214243, -26999, -75433, 75596, 126078, 63293, 142389, -252725, 39913, 136356, 193311, -245919, 40544, -726, 22518, -41524, -17145, -16728, 11224]
11917I7438a41982B01004a93949f2439j9098c4424k0290A2769f580C41376c08523
11905A78878b4957o2941j49465a5436k74731A14557a84505A71941b3986m8759
11895g2745k40133G3130a12074A69381a2382A40802r16J22733G5543d1802l8518
11884h0320k64639J19598A71424F5769a72768M6901C7703J90493H1189a69771
11873h3270b8393r0841H282K6221J57376a33351M8337p8232B91018a26095D2079
11861a15932d3707r5685D14735b951B4625b38616h4735L5012A51718a0180G8653
11849b36066B62694c13249D9329b0571p9597p6912Q7868I7a10108F3437N2581
11838A16018a58637G0106b7571A84889c1067n8851c9457A07211e6570B0922M5415
$$ y = [97438, -141982, 201004, -193949, -62439, -81537, -34424, -54714, 12769, -6580, 341376, -308523, 178878, -24957, -87898, -237363, -15436, -290167, 114557, -184505, 171941, -23986, -72745, -312878, 73130, -112074, 169381, -12382, 140802, 139886, 262619, 75543, -41802, -80320, -344959, -225361, 171424, 65769, -172768, -125867, 37703, 228196, 81189, -169771, -83270, -28393, -119234, 8282, 34503, 191879, -133351, -85014, -163246, 291018, -126095, 42079, -115932, -43707, -139392, 414735, -2951, 24625, -238616, -84735, -49723, 151718, -10180, 78653, -236066, 262694, -313249, 49329, -20571, -100168, -177080, -89212, 97, -110108, 63437, 116018, -158637, 70106, -27571, 184889, -31067, -89918, -39457, 107211, -56570, 20922, 66337]
11827F6337B2755d2561A54629L3949A927L3589d9293j16648j7437N5636r6663
11816b24405L3042k0244A26548J084C7347J04388c47669A38007D9739a54669k42194
11805c96863A3009b65391p3334J37577i3874G7707f6845j48238a1808C27236B4064
11793F1699b18205H1131Q6842D0320L0465L4673g7296B54971A7125J12825d37454
11781A99570a2162l05867b4494p4402l26745D3204b08111B40935G3118d5506J0655
11770c4851l297j12279B0904b45858B0119e9846n899A50401J43761B1396e9636
11758a56404L274k24190A44796q319i8624D53374F512J20465R633f6884k61483
11747c28367f7204A94426N8154F6383a77988B369b34430f6851B20091E8517k58
$$ y = [66337, 22755, -42561, 154629, 188578, 1927, 35516, -49293, -165941, -183378, -127742, -224405, -191363, -211607, 126548, 127632, 37347, 141735, -347669, 138007, 49739, -154669, -396863, 13009, -265391, -338725, -201148, -93874, 77707, -66845, -215083, -11808, 327236, 24064, 61699, -218205, 81131, 167973, 40320, 70785, 105458, -77296, 254971, 17125, 129950, -437454, 199570, -12162, -318029, -24494, -98896, -425641, 43204, -208111, 240935, 73118, -45506, -34851, -38148, -150427, 20904, -245858, 20119, -59846, -65745, 150401, 294162, 21396, -59636, -156404, -153130, -377320, 144796, 136477, -98624, 453374, 6512, 126977, 136610, -66884, -328367, -67204, 194426, 252580, 66383, -177988, 2369, -234430, -66851, 220091, 58517, 58259]
11736E8259a31567O2543A94328i2083G6529f5741p5358O9047j74733F2148a76577
11724g9824e311j23374A932K41433a85668h5678C4594K8703a87305E619b56693
11712D3305A8610a45046c5113A5884J18675g7114A44926a78977A93711K2440r2502
11701A23649Q55b43738g1220E1316j1063J79942q1765r727D2754J53802J55229
11690C51785h4879E4427K3646f2389l25F8726g8625A34796D0738J67047b40163
11678B6819a10415A7018L28347E0195K19174D1690g9004A91024b63879B0388h3954
11666A39759c8429A62100a04969A52364J73337A11609J18270a96404B2186Q0278
11656A02464K9976l2398d4187B51494I3778c0926A16185E0347c5813B10321f2977
$$ y = [58259, -131567, -69024, 194328, -92083, 76529, -65741, -141099, -72052, -246785, 62148, -176577, -79824, -5311, -128685, 1932, 243365, -185668, -85678, 34594, 63297, -187305, 5619, -256693, 43305, 18610, -145046, -35113, 15884, 134559, -77114, 144926, -178977, 193711, 216151, 123649, 124504, -243738, -71220, 51316, 40253, 220195, 138430, 128703, 42754, 196556, 351785, -84879, 54427, 78073, -62389, -62714, 68726, -78625, 134796, 40738, 207785, -240163, 26819, -110415, 17018, 345365, 50195, 269369, 41690, -79004, 191024, -263879, 20388, -83954, 139759, -38429, 162100, -104969, 152364, 325701, 111609, 229879, -196404, 22186, 102464, 132440, 100042, -44187, 251494, 93778, -30926, 116185, 50347, -35813, 210321, -62977]
11644B9154f2523B56297I2541g8797a4140k14675d3815B39811a3538p7232B45423
11632a78853a2994k9494B45333h4220o6675A25221a7263n3734D123K3773R2274
11621A20170j3153b58253N3746E12e476j90821C63078C3309Q1184b14184G9705
11609a00484L4337j17249P7217E558Q9893B8458m202M63163C5326J60869E1982
11597A09478L9420p195i0676L5673B81859F2112a26056b6640k82494A97405d6147
11585A3805K79335p1019l2405c23758A03212l9141K49047j55017e5921j74920
11575b30841b731A15940C5833b0720B46150p8868B2245J76352c173A59049J03812
11564B62861C9468j2978i7330b0612j15270k66963B38954r8254i1864A87450E343
$$ y = [29154, -62523, 256297, 92541, -78797, -14140, -228815, -43815, 239811, -13538, -90770, 245423, -178853, -12994, -42488, 245333, -84220, -150895, 125221, -17263, -70997, 4123, 27896, 120170, 107017, -258253, -204507, 512, -5476, -196297, 363078, 33309, 114493, -214184, 79705, -100484, -66147, -183396, -106179, 5558, 95451, 28458, 24256, 487419, 35326, 196195, 51982, 109478, 148898, 141703, -90676, -55003, 281859, 62112, -126056, -26640, -309134, 197405, -46147, 13805, 293140, 222121, 189716, -323758, 103212, 64071, 313118, 158101, -55921, -230841, -2731, 115940, 35833, -20720, 246150, 167282, 22245, 198597, -3173, 159049, 262861, 39468, 26490, -97330, -20612, -135882, -402845, 238954, 140700, -91864, 187450, 5343]
11552F289P4668Q0855a06358E9520M6009n088c367E78749A91309A0174M5992J42044
11540A98210M09425C6846a4161A21872j3104E0546Q7227a185B01845B7989K5904
11529E3893J68465J40380J2972d7801A36491d388D68151a06289B64017r0101C2064
11517A64423q852K53327c4208A61294N9102q7935a06524A25078J03035o0179p2851
11506I5083a01055A71692g9165L8519g369A45306i1840B64637m954N9309d0254
11494C21512L73394j19196b3038j92179A45889R4584g6600B42662l1324E8093
11483B06368A03040i9499A42750Q7286j6392q8475E3891K14303l6857A3157O3423
11472G6580M0847O5559R821q3054K4073N7602c7227j4689A01176M9333J42284
$$ y = [6289, 80957, 161812, -106358, 59520, 105529, 100441, -3367, 578749, 191309, 10174, 56166, 198210, 607635, 36846, -14161, 121872, 108768, 50546, 137773, -1185, 201845, 27989, 53893, 222358, 362738, 375710, -47801, 136491, -4388, 468151, -106289, 264017, 173916, 32064, 164423, 155571, 408898, -34208, 161294, 220396, 132461, -106524, 125078, 228113, 167934, 95083, -101055, 171692, -79165, -40646, -7369, 145306, -91840, 264637, 259683, 318992, -40254, 321512, 694906, 575710, -23038, -215217, 145889, 240473, -76600, 242662, 211338, 58093, 206368, 103040, -99499, 142750, 230036, 213644, 125169, 53891, 268194, 231337, 13157, 76580, 117427, 182986, 192807, 109753, 133826, 191428, -37227, -51916, 101176, 150509, 292793]
11461B92793H5327M3113N7324M7171K0308q6233n4170j979J25382C0690J06259
11450A36949Q1126a20031B41315I9967E387b29414A81931b1508A67011A3381N0962
11439F4343Q7627E0034K01186r2428J0070G0903A3884M1884J7412J43095b48152
11427e6942K2825j58663C0390J21761k3567K56595a93369A72828K47499e3817
11416a66232B51957J40445i3717j09156P066B01479f8578j39767e8171A78401
11405a51068f5345k48055A4934K27312c9047j35302o095I9928A9591a4582A32592
11393i6372A74414b486l5523j22405A4196c13306c6227j24342g3705j33387m612
11382b11704K5391A39644Q6819q9524m2972O2052g382n4241j61884A66522I013
$$ y = [292793, 85327, 128440, 185764, 232935, 253243, 167010, 112840, 110861, 236243, 30690, 136949, 218075, -120031, 241315, 99967, 5387, -229414, 181931, -21508, 167011, 13381, 64343, 151970, 50034, 251220, 158792, 168862, 70903, 13884, 55768, 73180, 216275, -248152, -56942, -34117, -192780, 30390, 152151, 128584, 385179, -193369, 172828, 420327, -53817, -166232, 251957, 392402, -93717, -202873, -195807, 201479, -68578, -208345, -58171, 178401, -151068, -65345, -313400, 14934, 242246, -39047, -174349, -180444, 99928, 19591, -14582, 132592, -96372, 174414, -2486, -38009, -160414, 14196, -313306, -36227, -160569, -73705, -207092, -211704, -186313, 139644, 226463, 136939, 93967, 156019, -7382, -61623, -223507, 166522, 9013]
11370a79903B10342a97716K844D0266O8055d06193F6169a36377l294j08287j813
11359b49771F5304k0238J11682b46993f3073n798p9581e0961k7502B90572a03412
11347h9633A75893K4433a36370O4852D4975c1181l8019G2326J83992d01989N055
11336c96934a50067B243i8393A33722b98303E4436B0897J78415d6707F2273b66251
11324b9013C8128A8932a66553r8247g3280B32464a3773k64675B1475K70669E1320
11312D5077A3838i4033H3798b99797g5040E852K5276J07930b57o2363k06431G4106
11299a15245e3407B71493a51063G7185a68839b4545i16A48565c9412p4493A60927
11287C07832e5169C01310A8997a21125b2179l0125D03291h6642k94926A94044
$$ y = [-179903, 210342, -197716, -194872, 40266, 108321, -406193, 66169, -136377, -139671, -247958, -249771, 65304, 45066, 156748, -246993, -63073, -68871, -148452, -50961, -78463, 290572, -103412, -89633, 175893, 200326, -136370, -71518, 44975, -31181, -69200, 72326, 256318, -401989, -396934, -150067, 2243, -98393, 133722, -298303, 54436, 20897, 199312, -46707, 62273, -266251, -29013, 38128, 18932, -166553, -264800, -73280, 232464, -13773, -278448, 21475, 292144, 51320, 45077, 13838, -94033, 83798, -299797, -75040, 5852, 31128, 139058, -257, -62620, -269051, 74106, -115245, -53407, 271493, -151063, 77185, -168839, -24545, -916, 148565, -39412, -113905, 160927, 307832, -55169, 301310, 18997, -121125, -22179, -52304, 403291, -86642, -381568, 194044]
11276E682j147c31428B29019J14730b03808g7655N407j45813A08150K34473h8227
11264c53292A09667h2227J9004j5804l2829B19969a04490b2535k469A85392h3250
11252a92534R99e6698J3269J6378B00377c83605L4601Q8264A00077C251K62406
11241B65657h0832B79627a02544C41091g4031A71904j5635B8915a17979H4934
11230E0946P0589b13516c2988k69280c5730c605H8987d2350A2429K9411b19858
11218b3617k44625j15788O6454I6984J95289d7928r9607l14764B01077q0894d6393
11206g9278Q022k7650B27728G72f8314j54362e2952A08523a37892a0861m7617
11195e8478j30839f3900k27140F9508J20558a61777O9836E0649L02038a65319
$$ y = [5682, 4535, -331428, 229019, 343749, -203808, -77655, -72248, -218061, 108150, 342623, -88227, -353292, 109667, -82227, -63223, -79027, -111856, 219969, -104490, -22535, -25004, 185392, -83250, -192534, -191535, -56698, -43429, -27051, 200377, -383605, -349004, -260740, 100077, 3251, 265657, -80832, 279627, -102544, 341091, -74031, 171904, 156269, 28915, -117979, 84934, 50946, 121535, -213516, -32988, -302268, -35730, -3605, 88987, -42350, 12429, 41840, -219858, -23617, -268242, -384030, -317576, 96984, 292273, -47928, -147535, -462299, 201077, 120183, -46393, -79278, -71256, -98906, 227728, 772, -68314, -222676, -52952, 108523, -137892, -10861, -58478, -189317, -63900, -291040, 69508, 190066, -161777, -91941, 50649, 352687, -165319]
11184a84037E6325j2239b38348Q5055o1048d5890A9048L7339B1409M0925a42575
11172a27199D4495N6774J73722a97110A32265N7335O6808i6850k84486d502D1950
11160a6433j99015e9448A90970c24015B16983b2667D5202c45081J65387B6747
11149A50087a53799b7468j99698h2904A98062g89j56058R369B51941j11509c46882
11137A8891b13162n4849A26690J67780j14243O1002j19786C0851P6080J31134
11127B38065c58117H2032b69717B0314m270M27817A90285k6021l3965P659k9449
11116A08509D1623h1096n5088F1209J19928c3919A14638b47821B84413E6499a1030
11104A67171l4636a31545B33507g8446L0473B45243I6023O7328O4241k4167k4303
$$ y = [-184037, 56325, 44086, -238348, -153293, -214341, -45890, 19048, 56387, 21409, 62334, -142575, -127199, 44495, 101269, 274991, -197110, 132265, 189600, 256408, -96850, -381336, -4502, 41950, -16433, -215448, -59448, 190970, -324015, 216983, -22667, 45202, -345081, -179694, 26747, 150087, -153799, -27468, -227166, -82904, 198062, -789, -156847, -147478, 251941, 140432, -346882, 18891, -213162, -268011, 126690, 294470, 180227, 241229, 121443, 30851, 106931, 238065, -358117, 82032, -269717, 20314, 16044, 443861, 190285, 164264, 130299, 137958, 108509, 41623, -81096, -136184, 61209, 181137, -33919, 114638, -247821, 284413, 56499, -11030, 167171, 132535, -131545, 233507, -78446, -47973, 245243, 96023, 163351, 227592, 203425, 179122]
11093A79122m0602J09729b0153H6607J94493q3748K70538a13265B55425k5483
11083B29942o4380K22186j23324N586j23470L279K05876A38029K70673I2957J73081
11072B66038K3505J66442j54456J97901j13806q9710n8884J24800j09687L23729
11062E75872J5240k71249o445L54637q5710q6341N5364k4489J61561J7005j30527
11051E74918j15159J28596K49635k02298q5984K48669R5568k47889J00243M1998
11041G88297J00105k67712L16917k69955N8926o7269K09662m0694k75087K99816
11031H53006k61720Q9487R7936j97407L30215O0474j70576r2394M9574O2224J87481
11020A008300m89625J12906L37788j73897p8713M5012k04999K43139q9179J06455
$$ y = [179122, 138520, 248249, -20153, 86607, 281100, 197352, 467890, -113265, 255425, 229942, 165562, 387748, 264424, 270010, 146540, 149819, 355695, 138029, 408702, 92957, 266038, 289543, 455985, 301529, 499430, 385624, 295914, 237030, 361830, 252143, 575872, 591112, 319863, 313418, 668055, 582345, 496004, 551368, 526879, 688440, 705445, 574918, 459759, 588355, 837990, 635692, 549708, 798377, 893945, 646056, 746299, 788297, 888402, 620690, 937607, 667652, 726578, 659309, 868971, 828277, 553190, 853006, 591286, 680773, 778709, 581302, 911517, 971991, 801415, 709021, 758595, 820819, 1008300, 518675, 631581, 969369, 795472, 716759, 761771, 556772, 799911, 710732, 817187]
11010H17187k76572k34053L93226k25124J3579J14966J29168J13866k49997j36146
11000D60100R0856L70038j51424M7013j41026K05325j96126M84216l98461l1983
10990G38528j28160L96978j5282j15070Q727j64502O65483n52119M41968j45117
10980A131434K12868j33878L39609K94956k14704N99762J52622P6728K56443K31343
10970B947183M38268n57901L70986l73481k53704l89092k23047n4820j61039k7623
10960A715730j54629L10826K61300l75990R1647j89936J10633n81035J19761m17157
10950H91150j94172J2354j51400L7390j62280B09160K0125k6706l2235m1626Q477
10939A37195R9648k7168f7445F7750d5788B3263D568J12246J39610A26844h3562
$$ y = [817187, 540615, 306562, 699788, 474664, 488243, 603209, 732377, 846243, 596246, 460100, 550956, 920994, 769570, 816583, 675557, 880882, 684756, 1168972, 770511, 738528, 610368, 1007346, 992064, 876994, 885721, 721219, 1386702, 834583, 1276551, 1131434, 1344302, 1210424, 1550033, 1844989, 1630285, 2230047, 2382669, 2459397, 2715840, 2947183, 3385451, 2827550, 3198536, 2825055, 2571351, 2182259, 1959212, 1904392, 1743353, 1715730, 1561101, 1871927, 2133227, 1757237, 1848884, 1658948, 1769581, 1188546, 1308307, 891150, 696978, 709332, 557932, 595322, 433042, 209160, 229285, 202579, 170344, 128718, 137195, 236843, 209675, -67445, 67750, -45788, 23263, 4568, 116814, 256424, 126844, -83562]
10927b37269G6701e4423j29864f8538B81371e4762o5154H8007a3515B13126A8387
10915H3345b15979B38098a90044B84217a9903D60996j81517a26065A17597N9387
10905A76984a61567c2864A11443l9236a22568q4048i6751A31282b90530Q9468
10895b01062k82116a83536A663J84061J0804m0045f1564B96595R0160e1409A29077
10883A67961n3487a2341l24000I4656J19408R9784b2546k73749p6192F4b28838
10871D0821a00125A47800o4506B2720K17268k1624c720H9816c10543B08421d3343
10859b53655Q4140A73547M362C6421J08932M025K06497a74500B93621A03459m2488
10848F0971P8842m6793a42466B86597a25187I1451b46751C6794K7256a7045k28988
$$ y = [-237269, 76701, -54423, -184287, -68538, 281371, -54762, -119916, 88007, -13515, 213126, 18387, 83345, -215979, 238098, -190044, 284217, -19903, 460996, 279479, -126065, 117597, 176984, -161567, -32864, 111443, 72207, -122568, -206616, -96751, 131282, -290530, -201062, -483178, -183536, 1663, 185724, 196528, 156483, -61564, 296595, 386755, -51409, 129077, 167961, 114474, -12341, -336341, 94656, 214064, 313848, -22546, -296295, -372487, 64, -228838, 40821, -100125, 147800, 83294, 22720, 239988, 218364, -3720, 89816, -310543, 208421, -43343, -253655, -169515, 173547, 177909, 36421, 145353, 149378, 355875, -174500, 293621, 103459, 60971, 139813, 93020, -142466, 286597, -125187, 91451, -246751, 36794, 64050, -17045, -246033]
10837b46033a5394B86604j38768j3552B6317f6712k08086A37856a19414k0574
10827a39988K1278N256j70993K3738a4313G0978a45318j16342a06529B56084o3755
10816A92329a73377L4945D1381P226g4746o6519O1786A49446F2695k5152h6368
10804b65854A36653c18820F8826k5807J2428g2975H9223a29361H1783b04273i3710
10792b83376i357n0396k66126a7692m47402B38591e9493j33189c54B11626a59589
10780h1012d184j64230A18338C5949a55414A65047C0158e5243l6233m5444p7112
10769b14032o3880a08143o8842b0165j41035k66673J24442A71877k7887b31422
10758A72526c19188c7926A0589a83528a2556D09392b46238c9244r9785A98298
$$ y = [-246033, -15394, 286604, 147836, 134284, 26317, -66712, -274798, 137856, -119414, -139988, -118710, -113454, -284447, -260709, -14313, 70978, -145318, -261660, -106529, 256084, 192329, -173377, -138432, 41381, 48607, -74746, -141265, -79479, 149446, 62695, 37543, -86368, -265854, 136653, -318820, 68826, 43019, 55447, -72975, 89223, -129361, 81783, -204273, -93710, -283376, -9357, -59753, -325879, -17692, -465094, 238591, -59493, -192682, -354, 211626, -159589, -81012, -4184, -168414, 118338, 35949, -155414, 165047, 30158, -55243, -91476, -136920, -214032, -277912, -108143, -176985, -20165, -161200, -427873, -303431, 171877, 143990, -231422, 172526, -319188, -37926, 10589, -183528, -12556, 409392, -246238, -39244, -139029, 198298]
10747c130A09057n3435A6332N9637L426a5593l60068J20503M0954A3502c36104
10735c9589k35114N2230j10825F2933b41628k9883G4112Q3158a66727N9253p8053
10724a85527O2519o133n0612a2312l04975a50967O0430G4746a00465B45205a89432
10712A00327a3052B03510a7737C0445K12826a79653H0513a29008k49438J31288
10702b47158R0149K9183f2027A2653c23537J21148D6689h9194a0654E9465K27916
10691B87381g715n8163k63254K4939A61294r953m0644b4904j08855c300l18477
10680c21777G0817a87197H3621K3801J8710a00453A08446a32510D578a83011N6562
10669a26449j04919o8897H7126A8903J11048m5967e2017k55205A41576a75876
$$ y = [-3130, 109057, 55622, 16332, 75969, 79395, -15593, -375661, -255158, -214204, 13502, -336104, -39589, -274703, -222473, -333298, 62933, -241628, -271511, 74112, 157270, -166727, -107474, -185527, -123008, -129141, -179753, -12312, -317287, -150967, -90537, 74746, -100465, 245205, -189432, 100327, -13052, 203510, -17737, 30445, 243271, -179653, 80513, -129008, -378446, -247158, -157009, -127826, -62027, 12653, -323537, -202389, 46689, -89194, -10654, 59465, 287381, -7715, -65878, -329132, -304193, 161294, 151341, 110697, -24904, -133759, -3300, -321777, 70817, -187197, 83621, 107422, 126132, -100453, 108446, -132510, 4578, -183011, -126449, -231368, -300265, 87126, 18903, 129951, 83984, -52017, -307222, 141576, -175876]
10658e2985F7784C0920a6886j26614j27273B60752b98472C73881d37607C9861
10647H0566b75923h2692l32605K07534F6013a71490G7358H165a13953A05371b03440
10635d43263E8248g2187A01969J71887D6356f0656n9711A90060b63328J17309
10625a46019R370p7585d3243k18631c7278k02814b4911E1568J70681F6178D046
10613h4821A66367H1631r121a55234G0979a65016i107j57062d6004k69614F6371
10601b34539B90741b72286A80783q7536a50003D8758d4179B01657D0382N9692
10591A00074h2699j17549D8340j1323a74523A40994g0723h31C36635C6035a96796
10579A73240K5716O241c09335o4439J73193i5001I244a12385A01113a86801L6761
$$ y = [-52985, 67784, 30920, -16886, -143500, -270773, 260752, -298472, 373881, -437607, 39861, 80566, -275923, -82692, -415297, -207763, 66013, -171490, 77358, 8165, -113953, 105371, -203440, -443263, 58248, -72187, 101969, 273856, 46356, -60656, -120367, 190060, -263328, -146019, -136649, -214234, -43243, -261874, -37278, -240092, -24911, 51568, 222249, 66178, 4046, -84821, 166367, 81631, 72510, -155234, 70979, -165016, -9107, -166169, -46004, -315618, 66371, -234539, 290741, -272286, 180783, 93247, -150003, 48758, -44179, 201657, 40382, 100074, -82699, -200248, 48340, 37017, -174523, 140994, -70723, -831, 336635, 36035, -196796, 173240, 198956, 205197, -309335, -373774, -200581, -95001, 9244, -112385, 101113, -186801, -150040]
10568a50040H831K62426b1298F8108J73205a73100J5768c0883J3334j18552A10291
10556A02830b61542a16193j71052o9666C1650a93401q830A23523b34694I5733
10545A1232c29073h5013k4490C22257a81722I2248n263L1343C7301g9761B16914
10533a47249f6158A90195b5612k33954E9295J9338J73525a89450e5098A39000
10522f9630l25685B9416J84604F2671A0847c44647B13847I2947a47244A69129
10511A16679J09482a64898N1764d2684k301B4512E79J61472K0828E9327J62154
10500B21481a18138j13715b6740a1485k65229F81R6277K11282D9043K14569k951
10489B60661j14622a13729k7392C01165e2327l45160B02520N826l2209l203J30983
$$ y = [-150040, 8831, 271257, -21298, 68108, 241313, -173100, -157332, -30883, -17549, -136101, 110291, 102830, -261542, -116193, -287245, -356911, 31650, -193401, -202231, 123523, -234694, 95733, 11232, -329073, -85013, -109503, 322257, -181722, 92248, 86985, 118328, 37301, -79761, 216914, -147249, -66158, 190195, -25612, -259566, 59295, 78633, 252158, -189450, -55098, 139000, -69630, -395315, 29416, 214020, 62671, 10847, -344647, 213847, 92947, -147244, 169129, 116679, 226161, -164898, -113134, -42684, -44985, 24512, 579, 162051, 182879, 59327, 221481, -118138, -231853, -26740, -11485, -276714, 681, 96958, 308240, 49043, 263612, 260661, 146039, -113729, -141121, 301165, -52327, -397487, 202520, 208346, 176137, 172934, 303917]
10478C03917A47561E2795b7204E312J78118d2393B0176a43027d8816f439C32912
10466d3062j79245A12296b36725B80483b07638B89146a45976N0208A92566C8344
10455H6283A9831f0722a358k78071a37945c5128E814Q2820a59541A74958a21923
10443b23093M6338A93229a08820B17284K0909F0805b80777e1101j10202A36367
10432a31172N5919j64667Q3009B34921b8398B36963b6469A45116A9482J50159
10422A69641J20878e9194A89038m4667i2775k82869B07344a53175q0466i7774
10411f0340n0222A66409R9963b92745C32566F4843a0488A13900n1110L1658m670
10400H9778a10791j2537k39016G3137a32000C48137j38372o7342a06386B10096
$$ y = [303917, 147561, 52795, -27204, 5312, 183430, -42393, 20176, -143027, -48816, -6439, 332912, -43062, -222307, 112296, -236725, 280483, -207638, 289146, -145976, -95768, 192566, 38344, 86283, 19831, -60722, -1358, -279429, -137945, -35128, 5814, 88634, -159541, 174958, -121923, -223093, -176755, 193229, -108820, 217284, 238193, 60805, -280777, -51101, -161303, 136367, -131172, -75253, -239920, -156911, 234921, -28398, 236963, -26469, 145116, 19482, 169641, 290519, -59194, 189038, 144371, -92775, -375644, 207344, -153175, -233641, -97774, -60340, -110562, 166409, 266372, -292745, 332566, 64843, -10488, 113900, 62790, 94448, 89778, -110791, -123328, -362344, 73137, -132000, 348137, 209765, 142423, -106386, 210096]
10389E5026j1025K43971l6072a410C37242A5683J29024j8408J3292a27995B77289
10377B98164A40559e6439A42826K75916J17759B40765M784n3042L7824J39677
10367C70008C7281N09867K06549l70584j72802L56229A45963J64732J113B9449
10356I0701L2089Q3729K02350l0245L1990p687R6688K6611R8379B5346M01552
10345D26898e9243B92502K46123o4258B31970A29K56040K6119P038A12584K66061
10334C78645E0989K19884d6553G4864J54386K1556n0533a08618A1486K40246b0134
10322i6621B82448J72056k06062L41336e1815A55009a11724B0453a10207A19908
10311A36183a49565E6333b9911F1103O4995E2687J75082A02639g0585j44337p5145
$$ y = [55026, 44001, 287972, 251900, -1410, 337242, 15683, 144707, 126299, 139591, -127995, 277289, 298164, 140559, -56439, 142826, 418742, 536501, 240765, 245549, 192507, 230331, 370008, 37281, 547148, 753697, 383113, 210311, 566540, 145963, 310695, 311808, 29449, 90701, 122790, 206519, 408869, 378624, 410614, 402927, 499615, 526226, 624605, 25346, 426898, -59243, 292502, 538625, 474367, 231970, 129, 256169, 282288, 289326, 112584, 378645, 50989, 270873, -46553, 74864, 229250, 250806, 200273, -108618, 11486, 251732, -20134, -96621, 282448, 454504, 248442, 589778, -51815, 155009, -111724, 20453, -110207, 119908, 136183, -149565, 56333, -29911, 61103, 126098, 52687, 227769, 102639, -70585, -214922, -290067]
10300b90067E1006R1418a51832A839f212k8259p3794F1746J10902a44424I8905
10288f4017p2799I6867A8318J15342N3472a89353J2964B5993d1713Q082B6207
10276b0457A87105G9487l7760g3779j6835B24174d36762H2632f2621a9348p5476
10265i4824A37043p179b2056B23917m5226b2036B63117M8533j13320r8036N49
10254A00843f6146A03017J00658C4974f2861G1416b44451A37334J68595b1600
10243H8909a57719F9057a93537b1155j2355A50739b45275K3470j43260G1619M2771
10232A14390M6724a40843b9773C37644a01172G7382b26049B14797b594j17763
10222a20357j142K8825a6567j27009N6423A55550l6088g0211l0142l1405e0426
$$ y = [-290067, 51006, 142424, -151832, 1839, -6212, -34471, -108265, 61746, 172648, -144424, 98905, -64017, -136816, 96867, 18318, 133660, 187132, -189353, -176389, 25993, -41713, -33631, 26207, -20457, 187105, 79487, 41727, -73779, -90614, 224174, -436762, 82632, -62621, -19348, -94824, 137043, 129864, -22056, 223917, 178691, -22036, 263117, 311650, 198330, 100294, 100843, -66146, 103017, 203675, 34974, -62861, 71416, -244451, 137334, 305929, -21600, 88909, -157719, 69057, -193537, -21155, -33510, 150739, -245275, -221805, -365065, 71619, 114390, 161114, -140843, -29773, 337644, -101172, 77382, -226049, 214797, -2594, -120357, -121499, -92674, -16567, -143576, -87153, 155550, 119462, -70211, -100353, -131758, -50426]
10210a08995E3513h9596a6933o1201K6974j5934o4459k56613R5853c5512G4248
10198f7272n6241l71749E54557F0360a92182I175c42984f6460G1501i6529d4421
10186h3520j30289B70444b93561j3083B37779a09926B66591a07648d6498j62972
10176b09470J44j14813G356c02323D601a59819p4183E4349c3379l38061c7458
10164a94899C83057q8890b19807N8488a1821C14128i6620H0465J10125a7996A66883
10152i7882H2979h4182A20282n6993b34116C4324j0060a7256k66711p5543C17463
10140F6455d7783Q782j25539O7459o2980K4935j52449A6234J08797N1937G9892
10128B41421b58317a1454j86337O209N2143k06131n8921i8033M2528A19224a99444
$$ y = [-108995, 53513, -89596, -16933, -78134, -51160, -67094, -131553, -388166, -292313, -35512, 74248, -67272, -123513, -495262, 554557, 60360, -192182, 9175, -342984, -66460, 71501, -96529, -44421, -83520, -213809, 270444, -293561, -306644, 237779, -109926, 266591, -107648, -46498, -209470, -209326, -324139, 7356, -302323, 4601, -159819, -234002, 54349, -33379, -371440, -37458, -194899, 383057, 294167, -219807, -161319, -11821, 314128, -96620, 80465, 190590, -17996, 166883, -97882, 82979, -84182, 120282, 63289, -234116, 34324, 24264, -17256, -283967, -359510, 317463, 66455, -47783, -39001, -164540, -97081, -160061, -135126, -287575, 16234, 125031, 176968, 79892, 241421, -258317, -11454, -197791, -191582, -139439, -345570, -404491, -98033, -55505, 119224, -199444]
10116a63496A19955d1119j33125I3494e02665a81601c0689A35090a90974A58935
10105B8319g5436B5279B431a40832e390j77860A27020d3607k3893j79003c0331
10093E6703a11629j62530c4311l8217A09398c00784g7244A9398M1560g5102j66039
10082b41141Q9115c7820p1139m0987L8369r2743A16105J19367g5107a8129k8729
10071d6858A07168E887B11b09304H1789a43004E5913A5902M1907K25965h6907
10059b3072E9365a39411K4633e4622a3570C3317a09226F035J05028J56851a69974
10047a7351j44643j17779b6758r9093c6556j73705M7504C53821a86480k42312
10037d28792J76682j02168d3708H1597K29833c23533A97697a8466k49374O9459
$$ y = [-163496, 119955, -41119, -174244, 93494, -502665, -181601, -30689, 135090, -190974, 158935, 28319, -75436, 25279, 2431, -140832, -5390, -183250, 127020, -43607, -67500, -246503, -30331, 56703, -111629, -274159, -34311, -72528, 109398, -300784, -77244, 19398, 60958, -75102, -241141, -152026, -37820, -108959, -149946, -111577, -204320, 116105, 235472, -75107, -18129, -46858, 107168, 5887, 211, -209304, 81789, -143004, 55913, 15902, 57809, 283774, -86907, -23072, 59365, -139411, -114778, -54622, -13570, 33317, -109226, 6035, 111063, 267914, -169974, -17351, -161994, -279773, -26758, -125851, -36556, -210261, -162757, 353821, -186480, -428792, -252110, -354278, -43708, 81597, 311430, -323533, 197697, -18466, -267840, -198381]
10027a98381B79553b13979R0817G9435d34388J87566I6223a26314k08650j70075
10017e05039J25192C7602L0725c0916H2380I121J59698c8458k006k87432L3364
10006b94532A21673c61184g4165j00428j00818A13195d14264j5172A9740b12164
9995h3603k22344A71579m3359b80476B20665a22986A52106d4492A81536a59526
9984F0600c27316M5218J35877B11354b20643A3022K30600g791D909L00459a45900
9972A06617a94660i66A88144j8894C9365A7173K0807d17784D1229a71428K0218
9961a51210G3277O1724c6385l02550d1329I6467d21502c0276j91753A31171i550
9949f735k8190B72506c8204a4729D7511c44461J56708E027P4086h1137A37766
$$ y = [-198381, 279553, -213979, -123162, 79435, -434388, -246822, 96223, -126314, -334964, -505039, -379847, 37602, 68327, -30916, 82380, 9121, 168819, -38458, -40464, -327896, -294532, 121673, -361184, -74165, -174593, -275411, 113195, -414264, -429436, 19740, -212164, -83603, -305947, 171579, 128220, -280476, 220665, -122986, 152106, -44492, 181536, -159526, 60600, -327316, -282098, -146221, 211354, -220643, 13022, 243622, -7791, 4909, 305368, -145900, 106617, -194660, -966, 188144, 169250, 39365, 17173, 37980, -417784, 41229, -171428, -151210, 73277, 135001, -36385, -338935, -41329, 96467, -421502, -30276, -222029, 131171, -9550, -6735, -34925, 272506, -38204, -14729, 47511, -344461, -187753, 5027, 79113, -81137, 137766]
9937A52774A7949f7467D4348d23454h4552I7993K3918b03779b0897m4860A13056
9925h7690C807a32518N7317j28874b4627A74656a45906q68J1081l18345b19329
9913A96219a33343i31B27780A5836a13213L7024H2885N2772l2636a12810J8005
9902i4805j13223M3415j60493J07512B64769a65357A33710b73833a3153H9117
9891b14983g8549J2499D6438N6294m1386b36347i9408C699K70748b27300B928
9879c69013J02787G955g6856E4910P5676d7994l4386F0585a66468k23020G0459
9867c04699D3938a03647H7310C4234i8849n4277B84530j31084G1379a58239P8118
9856h0121C0285c77200a10024a6029l86771J02267f9847A82552g9128a8463B29788
$$ y = [152774, 17949, -67467, 44348, -423454, -84552, 97993, 121911, -203779, -20897, -65757, 113056, -87690, 3807, -132518, -75201, -204075, -24627, 174656, -145906, -146774, -135693, -454038, -219329, 196219, -133343, -931, 227780, 15836, -113213, -76189, 82885, 135657, 103021, -112810, -94805, -208028, -164613, -325106, -217594, 264769, -165357, 133710, -273833, -13153, 89117, -214983, -78549, -66050, 46438, 102732, 61346, -236347, -99408, 3699, 274447, -227300, 2928, -369013, -266226, 7955, -76856, 54910, 130586, -47994, -82380, 60585, -166468, -389488, 70459, -304699, 43938, -103647, 87310, 34234, -98849, -153126, 284530, 153446, 71379, -158239, -80121, 30285, -377200, -110024, -16029, -402800, -300533, -69847, 182552, -79128, -18463, 229788]
9844B34523a78969A52813D9978K1848c66030J41907k89803e6348D0642g8684C24567
9832A77265c3419A5536J94050G9311a83130h3945l9835c6904j25459A14121a11662
9820a87936j08700J43725k59177a23380j29539P3436R594P5136K2478j42029B28480
9808b41848j03556j10222b0558B902b55022I6380j6530b83683i3214B42585B2187
9796a10734n8392g1942l99684L1312i8993B57040a47609j9635A25031b40946c7948
9784a39256j96572I393i8417l8017L1634k1835I1939m2757j8809g1545I6077K3240
9772A19317J9278k0041f2438j6579j79423J06939F6249c7007j99646J03836e758
9760A71322C5323a62983m4474B39685c48450a43333m651D7684a84316A47849d4128
$$ y = [234523, -178969, 152813, 49978, 71826, -366030, -224123, -513926, -56348, 40642, -78684, 324567, 177265, -33419, 15536, 209586, 79311, -183130, -83945, -123780, -36904, -162363, 114121, -111662, -187936, -296636, -152911, -412088, -123380, -252919, -179483, -169889, -94753, -72275, -214304, 228480, -241848, -345404, -455626, -20558, 2902, -255022, 96380, 79850, -283683, -93214, 242585, 22187, -110734, -169126, -71942, -471626, -440314, -98993, 257040, -147609, -167244, 125031, -240946, -37948, -139256, -335828, 9393, -98417, -136434, -104800, -126635, 91939, 49182, 30373, -71545, 96077, 119317, 138595, 118554, -62438, -79017, -258440, -151501, 66249, -37007, -236653, -132817, -5758, 171322, 35323, -162983, -207457, 239685, -348450, -143333, -147984, 47684, -184316, 147849, -44128]
9748b17364e7463k1099a362o5033B36226c58161d4725J0637D4753b56905k0491
9737b77396B37156c7111H1229j1186b54304K3665H051f5242I4939P2227a1877
9725d86m8347C09015a6093A89488b24544C36990A47389b67287l762N8814m130
9714b16365e0187j10545P9807l2575b6018m331j52579L3267b7333C55237A31335
9702B01255c83561J79137f5601n1136q1683C09490g9584j98242B287J82195D761
9690c2052k26618n0508d8257a0055B0272b59031j30711R3826a39384e6213k27253
9679b83466a29292e3915P969m23209C1017a1101A29254K93535a46436n3696j45937
9668c46069a07468B9749d67237K27474b3971k75844A25133a54554A72495q473
$$ y = [-217364, -57463, -78562, -1362, -66395, 236226, -358161, -44725, -34088, 44753, -256905, -277396, 237156, -37111, 81229, 70043, -254304, -230639, 8051, -65242, 94939, 167166, -11877, -486, -48833, 309015, -16093, 189488, -224544, 336990, 147389, -267287, -271049, -212235, -216365, -50187, -160732, -80925, -113500, -26018, -30349, -182928, -149661, -27333, 355237, 131335, 201255, -383561, -204424, -65601, -116737, -198420, 309490, -79584, -277826, 2287, 184482, 4761, -32052, -258670, -309178, -48257, -10055, 20272, -259031, -389742, -295916, -139384, -56213, -283466, -129292, -53915, -45946, -469155, 31017, -11101, 129254, 422789, -146436, -200132, -346069, -107468, 29749, -467237, -239763, -23971, -299815, 125133, -154554, 172495, 164022]
9658A64022a40148I9746e8812o0589d3655l9408A04045Q3126C345a58553j25442
9647b83995c9102A99975d18767f5046m40649A8302h3501f734j36746j21637m6416
9636c11533A4725M0941N1561f6695j38189j15765A24263k3789a19060E9965L3530
9625I3495H514b63558A35733h4745A3743J92072G4690a34883k46728A95659b01888
9613a06326C01120D732d130l1761G2013c61358a48907K9626J419j91851j12819
9602d22532H8449D1957d65799a31900B8037J9211L2994g3070j86830N6869n3260
9591b56291k4424O3246N6533B36063g0322A92546i5522B0549J66122l3459B7138
9579G8606g1959K9501p781A06952P693B1728Q9373g9008e897F1236A6714K09277
$$ y = [164022, -140148, 99746, -58812, -119401, -43655, -83063, 104045, 187171, 3345, -158553, -283995, -39102, 199975, -418767, -65046, -505695, 18302, -83501, -6734, -143480, -265117, -311533, 14725, 55666, 107227, -66695, -204884, -320649, 124263, 100474, -119060, 59965, 93495, 8514, -263558, 135733, -84745, 13743, 205815, 74690, -134883, -381611, 195659, -201888, -106326, 301120, 4732, -4130, -35891, 72013, -361358, -148907, -119281, -117862, -309713, -422532, 88449, 41957, -465799, -131900, 28037, 47248, 80242, -73070, -259900, -203031, -256291, -280715, -217469, -160936, 236063, -70322, 192546, -95522, 20549, 186671, 153212, 27138, 78606, -71959, -42458, -50239, 106952, 114645, 21728, 111101, -79008, -5897, 61236, 16714, 225991]
9567B25991c82930a80502F8875a97086M7220C8304b84419L0288A04246O4209i6171
9555c13020A40142J26256a35273k14072C68300a69367b1445l7126B11858a91870
9544b08357P1697r9544b072k12369H9340a2224j11375m3604A71216g2850k82125
9533c54975c4361A51953n7076i5282C2972a58626k09345a53559N858A18284E117
9521a36874E6440e4105m6662A78814d7560C3732a66289O0239J269H5691b14926
9509a25835j47611A01073b22971P5909Q390B35778J05635g6302J7743l18433L0289
9498c46703D8142a31205r8035I344O6920a73155p0860c8893n7975B35026c94155
9486b14243j68804a07367j07685i5741K4622H1224a10170A08415A4470h1989D4690
$$ y = [225991, -382930, -180502, 68875, -197086, -149866, 38304, -284419, -254131, 104246, 168455, -96171, -313020, 140142, 266398, -135273, -349345, 368300, -169367, -21445, -58571, 211858, -191870, -208357, -136660, -236204, -2072, -214441, 89340, -12224, -123599, -167203, 171216, -72850, -354975, -34361, 151953, 94877, -95282, 32972, -158626, -367971, -153559, -147701, 118284, 5117, -136874, 56440, -54105, -100767, 178814, -47560, 33732, -166289, -106050, -104781, 85691, -214926, -125835, -273446, 101073, -222971, -147062, -138672, 235778, 341413, -76302, -58559, -376992, -346703, 48142, -131205, -229240, 9344, 76264, -173155, -244015, -38893, -96868, 235026, -394155, -214243, -383047, -107367, -215052, -95741, -71119, 81224, -110170, 108415, 14470, -81989, 44690]
9474a09728M6538r2830B33902d59454a03246n2562j36592D3042R3305a24341M3240
9463h1101j41068m33366f6323a3113A35086R3979a15722p1225o7787A5868a06441
9451c11570A3509J66893G331N9042f7273k94891J31241n5335F7450b3570H8851
9439b85480I3777h4617B44b5284j7223B94446H2667j0756g6761j76426i3122G1588
9426b90089J11940E9729J8251K0828C1710J95004a07095A52550c32496A8025J09065
9415A27090b56767B21567B8953L1921e5588j39167G8004l4762J5239B72b24781
9403h0639j02949c9905m16848d9953m0389A126a03073F4503j4825b08664J4343
9392a94321M705E6404a35161N6512A06849R7791i4144k72656j42450J59177B17048
$$ y = [-109728, -63190, -156020, 233902, -459454, -103246, -155808, -292400, 43042, 136347, -124341, -81101, -222169, -655535, -66323, -13113, 135086, 229065, -115722, -186947, -254734, 15868, -106441, -311570, 13509, 180402, 7331, 66373, -67273, -362164, -230923, -286258, 67450, -23570, 88851, -285480, 93777, -84617, 244, -25284, -42507, 294446, 82667, 71911, -76761, -253187, -93122, 71588, -290089, -178149, 59729, 77980, 98808, 31710, 226714, -107095, 152550, -332496, 18025, 127090, -256767, 221567, 28953, 60874, -55588, -194755, 78004, 43242, 58481, 272, -224781, -80639, -183588, -39905, -456753, -49953, -90342, 1126, -103073, 64503, 49678, -208664, -194321, -189616, 56404, -135161, -78649, 106849, 204640, -94144, -366800, -509250, -350073, 217048]
9380b72582h31D3518J25659h4326j09782G782b99931D1491e8608k40504C23396
9368b9735q262p8686c22A64310d612j05926l04655E1298L9981g8081A65866B2621
9355a37800n1158E7388e76961g2755j2638j08268L1850j76883E3300L336g5439
9343A11563O9598B5090b51955j65704b01489p2293a33569e2236A84856h2059G5444
9331C71981a41721k49156J74569n0378a29136c211k55337J20541j39328B6943
9320A63415a94627L0512q5888a00551B31298b48424A7732b25711K6189L5848j26493
9309b90167J0464I3418d36997b17891L2748C3725e7749F00136a05306I2122i2724
9297b46322j89675H730a61395K4754A14668a07208d0122G7655b34717J04807d1921
$$ y = [-272582, -831, 43518, 169177, -84326, -194108, 7782, -299931, 41491, -58608, -299112, 323396, -29735, -37997, -116683, -322, 164310, -4612, -110538, -415193, 51298, 91279, -78081, 165866, 22621, -137800, -188958, 57388, -576961, -72755, -85393, -193661, -161811, -338694, 53300, 56636, -75439, 111563, 181161, 25090, -251955, -417659, -201489, -273782, -133569, -52236, 184856, -82059, 75444, 371981, -141721, -390877, -216308, -266686, -129136, -3211, -258548, -138007, -277335, 26943, 163415, -194627, -164115, -250003, -100551, 231298, -248424, 17732, -225711, -199522, -163674, -290167, -279703, 93418, -436997, -217891, -185143, 33725, -57749, 600136, -105306, 92122, -92724, -246322, -435997, 8730, -161395, -136641, 114668, -107208, -40122, 77655, -234717, -129910, -41921]
9285D77817e08657e2552A01626a26813q4981D7032b17650B21042a6190o7147O877
9274g6460N537j17540B5703c00068h3819I0671M1454E1610b6509A4603b33790
9262a07683A4072b21678k4132Q2561m6915n6732c114F8571J2046B522e0309r0800
9250a41109J650H9699K01394I2305c36277N941O8123E2626a68735e2619r6318
9239a48937L3962q5135j497D13736a70524k23682c3078j32359e8B5061J90014
9228B15075c47434D9583b39794B9774c3604A92277H4687b70522A7845P7578g3776
9216c89543L4605a37701p0619a03036k02209c4366C19438H2631f4317A61616m5102
9205A16514a8287j60920K0037A61340c2499k61795a8543k96521a49125L5863A10655
$$ y = [477817, -508657, -52552, 101626, -126813, -211794, 47032, -217650, 221042, -16190, -83337, -76460, -70923, -188463, 25703, -300068, -83819, 90671, 132125, 51610, -26509, 14603, -233790, -107683, 14072, -221678, -245810, -163249, -210164, -266896, -3114, 68571, 80617, 2522, -50309, -141109, -139459, 89699, 291093, 92305, -336277, -330336, -262213, 52626, -168735, -52619, -148937, -114975, -200110, -201607, 413736, -170524, -394206, -33078, -165437, -58, 25061, 215075, -347434, 49583, -239794, 29774, -33604, 192277, 84687, -270522, 17845, 95423, -73776, -389543, -354938, -137701, -208320, -103036, -305245, -34366, 319438, 82631, -64317, 161616, 116514, -18287, -179207, -159170, 161340, -32499, -294294, -18543, -315064, -149125, -113262, 110655]
9193d30908k07617A15100J60747G1304a44896O8477j30982d3702m5175j61146
9183b50023c5479a3882m5156j09942d4547A83504b69445g2284A07352a00368B71653
9171a3402o3158j03256n3465A9106d77001B32373A3633d9401j47106M0208c4836
9159G8665L7951c67216d825r5473j56652A815a88365L4340j32599C26756i2844
9147A84934K9192c58756K7308M046j8939i6276d7425k0324O974A0782Q4558b73248
9134f9790m70731A14759c10493F6436a91666L369e1773J6555J186B18693n0665
9123A68028R3511b1406B9501b00125J9780B34807a93732A18003C7186c322j41880
9112a45202I2780d3189j99402d8983k4157A10136k4343L1542k5327j0443b54520
$$ y = [-430908, -638525, 115100, 275847, 71304, -144896, -76419, -207401, -43702, -88877, -250023, -35479, -13882, -59038, -168980, -44547, 183504, -269445, -72284, 107352, -100368, 271653, -13402, -76560, -179816, -233281, 19106, -477001, 232373, 13633, -49401, -196507, -156299, -34836, 78665, 116616, -367216, -4825, -100298, -256950, 1815, -188365, -154025, -286624, 326756, -92844, 184934, 214126, -358756, -331448, -327402, -346341, -96276, -47425, -67749, -60775, 10782, 95340, -273248, -69790, -540521, 114759, -310493, 66436, -191666, -188297, -51773, -35218, -34032, 218693, 168028, 261539, -21406, 29501, -200125, -180345, 234807, -193732, 118003, 37186, -3322, -145202, 92780, -43189, -242591, -48983, -73140, 110136, 85793, 117335, 92008, 81565, -254520]
9100G7184h9971I6043l7705J7167b75379O6880P8545A1383Q3535b3710r681a1151
9087B3257J01660a65335A13883E026J85368d24923D2951e2927k4363m7267d8066
9075c06224m5285B7971a9386j60027H6381A8847a70330A92430a94103l7673f6228
9063c43905O0090E0639K83504a47005n0841B1801f0598j17970d07E94c02288b9415
9050a49041L7736A02240c06916b9645k44114O9362j08638G0701e5134C2673a31135
9038d3290q2687A362a20947b2131m8135j34194D8661c6394n031a5428k56347D4352
9025F4010f7022G4555e3922j41046G8306a46802k31738g5417n5890D2298c10016
9013a79391A29276o3825J75615o328G8720a58336k3300b2816B1321J06128l0920
$$ y = [77184, -89971, 96043, 58338, 75505, -275379, -208499, -129954, 11383, 94918, -23710, -33391, -11151, 23257, 124917, -165335, 113883, 5026, 190394, -424923, 42951, -52927, -77290, -124557, -48066, -306224, -351509, 27971, -19386, -179413, 86381, 18847, -170330, 192430, -194103, -231776, -66228, -343905, -283815, 50639, 334143, -147005, -197846, 21801, -60598, -178568, -407, 594, -302288, -29415, -149041, -111305, 102240, -306916, -29645, -273759, -204397, -313035, 70701, -55134, 32673, -131135, -43290, -125977, 1362, -120947, -22131, -70266, -204460, 48661, -36394, -41425, -15428, -271775, 44352, 64010, -67022, 74555, -53922, -194968, 78306, -146802, -378540, -75417, -131307, 42298, -310016, -179391, 129276, 65451, 241066, 234738, 78720, -158336, -181636, -22816, 21321, 127449, 96529]
9002I6529B3140M561b69549A74131b55968k11769A23799b60038k7399c2815q6862
8991a19677M4506k98871A99161P3076a29122p3351Q6411d372l09289a26055B10746
8979B81977g7789j35102A9567J34912b41309c6523q8890A75622H6757e8992k53630
8968c12622A33507j4126a11190j00961c8797k80256Q9409c4671C64842j70333
8958A94509c71314h703A28456a31145A06556M196B1120J29387a48624c8745A55985
8946E9431b46916E46L8728b0585A21925O039m515g5604D2779i0945J4203D44805
8933E27185g7149C52867o7230c64310F2019O8670L61908C5113N83060R78038K190053
8922C786264J0359766m446645B265211C68432j7179f6471b5360B63593j19613
$$ y = [96529, 23140, 27701, -269549, 174131, -255968, -467737, 123799, -260038, -287437, -32815, -119677, -75171, -374042, 199161, 272237, -129122, -202473, -116062, -4372, -313661, -126055, 210746, 281977, -77789, -212891, 19567, 154479, -241309, -36523, -125413, 175622, 86757, -58992, -312622, 133507, 119381, -111190, -212151, -38797, -319053, -229644, -34671, 364842, 194509, -371314, -8703, 128456, -131145, 106556, 110752, 21120, 150507, -148624, -38745, 155985, 59431, -246916, 546, 39274, -20585, 121925, 127964, 123449, -75604, 42779, -90945, -76742, 444805, 527185, -77149, 352867, 285637, -364310, 62019, 130689, 492597, 35113, 618173, 1596211, 3786264, 14146030, 9699385, 2265211, 368432, 351253, -66471, -25360, 263593, 143980]
8913A43980a83520B69803a15516F4822L43424A41403j9718b62330D1752d1647
8902E5791c694o7495B26370d9571K407F6001b74601B2930a61966I686K4641N6785
8890I1112b35893C55668H5873P8669c11313Q4345j84929Q5216R6801b3556D0570
8878C56441E2251a46579H7853J63445a0725A85598E1036c11635h2425C2528j3495
8867A9033O5269P626c27836a36507J368d4206j21789P8481n5569H0169N7364b57468
$$ y = [143980, -183520, 269803, -115516, 64822, 408246, 141403, 121685, -262330, 41752, -41647, 55791, -3694, -71189, 226370, -49571, -47164, 66001, -274601, 22930, -161966, 9686, 34327, 91112, -235893, 355668, 85873, 164542, -311313, -226968, -411897, -326681, -229880, -23556, 40570, 356441, 52251, -146579, 87853, 251298, -10725, 185598, 51036, -311635, -82425, 32528, 19033, 84302, 91928, -327836, -136507, -135139, -44206, -165995, -87514, -143083, 80169, 137533, -257468]
$$ [...]
##END NTUPLES=NMR SPECTRUM
##END=
