
##TITLE=AC1387_PERAH12199_7519419_4k6hK59VIW
##JCAMPDX= 6.0         $$ Bruker NMR JCAMP-DX V2.0
##DATA TYPE= NMR SPECTRUM
##DATA CLASS= NTUPLES
##ORIGIN= BRUKER
##OWNER= Administrator
$$ 1.72 TOPSPIN		Version 2.1
$$ 2013-02-20 00:55:31.581 -0500  Administrator@X
$$ Compression mode = diff/dup
##.OBSERVE FREQUENCY= 400.02188249412
##.OBSERVE NUCLEUS= ^1H
##.ACQUISITION MODE= SIMULTANEOUS (DQD)
##.ACQUISITION SCHEME= undefined
##.AVERAGES= 64
##.DIGITISER RES= 22
##SPECTROMETER/DATA SYSTEM= spect
##.PULSE SEQUENCE= noesygpps1d.comp
##.SOLVENT NAME= COFFEE_meoh
##.SHIFT REFERENCE= INTERNAL, COFFEE_meoh, 1, 14.9609
##AUDIT TRAIL= $$ (NUMBER, WHEN, WHO, WHERE, PROCESS, VERSION, WHAT)
$$ ##TITLE= Audit trail, TOPSPIN		Version 2.1
$$ ##JCAMPDX= 5.01
$$ ##ORIGIN= Bruker BioSpin GmbH
$$ ##OWNER= Administrator
$$ $$ E:\/data/COFFEE/nmr/AC1387_PERAH12199_7519419_4k6hK59VIW/12/pdata/1/auditp.txt
$$ ##AUDIT TRAIL=  $$ (NUMBER, WHEN, WHO, WHERE, PROCESS, VERSION, WHAT)
(   1,<2013-02-20 00:55:25.503 -0500>,<Administrator>,<X>,<go>,<TOPSPIN 2.1>,
      <created by zg
	started at 2013-02-20 00:43:55.515 -0500,
	POWCHK enabled, PULCHK disabled,
       configuration hash MD5:
       86 BA 57 50 F2 9D 5C 9B 26 00 A9 28 5F 66 2E 89
       data hash MD5: 64K
       30 EE 8E 67 CF 0B 01 9B B7 E7 AA CC F8 AB 1A EB>)
(   2,<2013-02-20 00:55:28.737 -0500>,<Administrator>,<X>,<proc1d>,<TOPSPIN 2.1>,
      <Start of raw data processing
       efp LB = 0.3 FT_mod = 6 PKNL = 1 PHC0 = 0 PHC1 = 0 SI = 128K 
       data hash MD5: 128K
       8B AD DB D7 E4 2F 97 2C 89 A2 B7 B3 A9 92 64 B6>)
(   3,<2013-02-20 00:55:29.800 -0500>,<Administrator>,<X>,<proc1d>,<TOPSPIN 2.1>,
      <pk PHC0 = 252.713 PHC1 = 0 
       data hash MD5: 128K
       CC 51 D3 2C AF 76 F8 61 DC B1 02 12 37 7D 1D 68>)
(   4,<2013-02-20 00:55:30.503 -0500>,<Administrator>,<X>,<proc1d>,<TOPSPIN 2.1>,
      <abs ABSG = 1 
       data hash MD5: 128K
       FF 6F 82 92 86 28 EC 69 74 8B 50 9E A1 0D 4D 26>)
(   5,<2013-02-20 00:55:30.706 -0500>,<Administrator>,<X>,<proc1d>,<TOPSPIN 2.1>,
      <abs ABSG = 2 
       data hash MD5: 128K
       DB A1 8C B1 B1 05 B4 EF 7B 5D D1 64 7C DF 6B 45>)
(   6,<2013-02-20 00:55:30.878 -0500>,<Administrator>,<X>,<proc1d>,<TOPSPIN 2.1>,
      <abs ABSG = 3 
       data hash MD5: 128K
       39 AD 1C AA 70 47 0F A7 B6 10 0C A2 38 6C 21 F3>)
(   7,<2013-02-20 00:55:31.081 -0500>,<Administrator>,<X>,<proc1d>,<TOPSPIN 2.1>,
      <abs ABSG = 4 
       data hash MD5: 128K
       8B 91 C5 58 63 0C 38 CA F0 0D DA 34 38 81 91 8A>)
(   8,<2013-02-20 00:55:31.253 -0500>,<Administrator>,<X>,<proc1d>,<TOPSPIN 2.1>,
      <abs ABSG = 5 
       data hash MD5: 128K
       12 47 AC F4 8D 7B 29 E1 E4 55 3D 86 81 6A C0 38>)
$$ ##END=
$$ 
$$ $$ hash MD5
$$ $$ D1 14 0A DA B6 3C 80 0C F0 9F 3A 64 11 67 5B A1
##$RELAX= 
##$RELAX= 
##$RELAX= 
##$RELAX= 
##$RELAX= 
##$RELAX= 
##$RELAX= 
##$RELAX= 
$$ Bruker specific parameters
$$ --------------------------
##$DU= <E:\>
##$EXPNO= 12
$$ [...]
150 150 150 150 150 150 150 150
##$TP07= 0
##$TPNAME0= <>
##$TPNAME1= <>
##$TPNAME2= <>
##$TPNAME3= <>
##$TPNAME4= <>
##$TPNAME5= <>
##$TPNAME6= <>
##$TPNAME7= <>
##$TPOAL= (0..7)
0.5 0.5 0.5 0.5 0.5 0.5 0.5 0.5
##$TPOFFS= (0..7)
0 0 0 0 0 0 0 0
##$TUNHIN= 0
##$TUNHOUT= 0
##$TUNXOUT= 0
##$USERA1= <user>
##$USERA2= <user>
##$USERA3= <user>
##$USERA4= <user>
##$USERA5= <user>
##$V9= 5
##$VALIST= <valist>
##$VCLIST= <CCCCCCCCCCCCCCC>
##$VD= 0
##$VDLIST= <DDDDDDDDDDDDDDD>
##$VPLIST= <PPPPPPPPPPPPPPP>
##$VTLIST= <TTTTTTTTTTTTTTT>
##$WBST= 1024
##$WBSW= 4
##$XGAIN= (0..3)
0 0 0 0
##$XL= 0
##$YL= 0
##$YMAX_a= 6529880
##$YMIN_a= -11639126
##$ZGOPTNS= <>
##$ZL1= 120
##$ZL2= 120
##$ZL3= 120
##$ZL4= 120
##$ABSF1= 14.9609
##$ABSF2= -5.597281
##$ABSG= 5
##$ABSL= 3
##$ALPHA= 0
##$AQORDER= 0
##$ASSFAC= 0
##$ASSFACI= 0
##$ASSFACX= 0
##$ASSWID= 0
##$AUNMP= <proc_prof1d_extract.lims>
##$AXLEFT= 0
##$AXNAME= <>
##$AXNUC= <1H>
##$AXRIGHT= 0
##$AXTYPE= 0
##$AXUNIT= <>
##$AZFE= 0.1
##$AZFW= 0.1
##$BCFW= 0
##$BC_mod= 0
##$BYTORDP= 0
##$COROFFS= 0
##$CY= 15
##$DATMOD= 1
##$DC= 0
##$DFILT= <>
##$DTYPP= 0
##$F1P= 0
##$F2P= 0
##$FCOR= 0.5
##$FTSIZE= 131072
##$FT_mod= 6
##$GAMMA= 0
##$GB= 0
##$INTBC= 1
##$INTSCL= 1
##$ISEN= 128
##$LB= 0.3
##$LEV0= 0
##$LPBIN= 0
##$MAXI= 10000
##$MC2= 0
##$MEAN= 0
##$ME_mod= 0
##$MI= 0
##$NCOEF= 0
##$NC_proc= -2
##$NLEV= 6
##$NOISF1= 0
##$NOISF2= 0
##$NSP= 0
##$NTH_PI= 0
##$NZP= 0
##$OFFSET= 14.9609
##$PC= 1
##$PHC0= 252.713
##$PHC1= 0
##$PH_mod= 1
##$PKNL= yes
##$PPARMOD= 0
##$PPDIAG= 0
##$PPIPTYP= 0
##$PPMPNUM= 2147483647
##$PPRESOL= 1
##$PSCAL= 4
##$PSIGN= 0
##$PYNMP= <proc.py>
##$REVERSE= no
##$SF= 400.020009677908
##$SI= 131072
##$SIGF1= 0
##$SIGF2= 0
##$SINO= 400
##$SIOLD= 131072
##$SPECTYP= <>
##$SREGLST= <1H.CDCl3>
##$SSB= 0
##$STSI= 131072
##$STSR= 0
##$SW_p= 8223.68421052631
##$SYMM= 0
##$S_DEV= 0
##$TDeff= 65536
##$TDoff= 0
##$TI= <>
##$TILT= no
##$TM1= 0
##$TM2= 0
##$TOPLEV= 0
##$USERP1= <user>
##$USERP2= <user>
##$USERP3= <user>
##$USERP4= <user>
##$USERP5= <user>
##$WDW= 1
##$XDIM= 131072
##$YMAX_p= 362497932
##$YMIN_p= -12256
##$CURPLOT= <Network HP LaserJet P1505>
##$CURPRIN= <$Network HP LaserJet P1505>
##$DFORMAT= <normdp>
##$LAYOUT= <+/1D_H.xwp>
##$LFORMAT= <normlp>
##$PFORMAT= <normpl>
##$SURQMSG= 1
$$ End of Bruker specific parameters
$$ ---------------------------------
##NTUPLES= NMR SPECTRUM
##VAR_NAME=  FREQUENCY,     SPECTRUM/REAL,   SPECTRUM/IMAG
##SYMBOL=    X,             R,               I
##VAR_TYPE=  INDEPENDENT,   DEPENDENT,       DEPENDENT
##VAR_FORM=  AFFN,          ASDF,            ASDF
##VAR_DIM=   131072,        131072,          131072
##UNITS=     HZ,            ARBITRARY UNITS, ARBITRARY UNITS
##FACTOR=    0.0627417313425164, 1,          1
##FIRST=     8223.62146879497, 2129,         -68412
##LAST=      0,             4691,            -69142
##MIN=       0,             -12256,          0
##MAX=       8223.62146879497, 362497932,    0
$$ Real data points
##PAGE= N=1
##DATA TABLE= (X++(R..R)), XYDATA
$$ [...]
67803 91213 89484 88541 88236 88075 87339 85561 83022 80637 79194 78623 78065 76759 74874 73391 73120 73923
67787 73923 74958 75547 75658 75676 75930 76423 76809 76552 75387 73735 72522 72427 73356 74707 75990 77100 78135
67770 78135 79182 80308 81615 83230 85176 87228 88977 90162 90918 91558 92111 92305 91995 91389 90752 90182
67754 90182 89829 90036 90959 92205 93160 93564 93563 93286 92729 91978 91241 90606 90031 89591 89489 89772 90194 90429 90229
67735 90229 89425 88000 86190 84304 82382 80262 78018 76098 74921 74491 74499 74617 74606 74328 73820 73276 72861
67718 72861 72587 72397 72265 72182 72146 72168 72153 71832 71009 69918 69146 69125 69809 70815 71662 71898 71314 70184 69095
67699 69095 68383 67907 67442 67073 67042 67371 67829 68203 68456 68687 68994 69306 69370 69016 68434 68008 67898 67943 67974 68021 68219
67678 68219 68705 69588 70770 71867 72567 72977 73295 73300 72724 72042 72115 72922 73433 73086 72634 72967 73823 74390 74626
67659 74626 75070 75611 75458 74314 72810 71654 71021 70901 71434 72620 74134 75619 76875 77690 77886 77599 77140
67642 77140 76549 75683 74731 74166 74080 74057 73866 73779 73993 74199 74041 73668 73578 74130 75353 76875 77914 77805 76851
67623 76851 76245 76802 78048 78934 79161 79306 79785 80232 80001 78946 77512 76227 75263 74473 73803 73539 74014 75131
67605 75131 76383 77356 78016 78490 78823 78990 78876 78204 76854 75341 74552 74769 75297 75355 74989 74729 74675 74445 73904
67586 73904 73418 73327 73560 73897 74348 75132 76375 77851 78950 79022 77975 76502 75525 75345 75483 75330 74805 74294
67568 74294 74075 73932 73473 72809 72631 73366 74354 74352 72943 71028 69753 69360 69406 69625 70030 70417 70424 70049 69647 69399
67548 69399 69198 69086 69274 69663 69812 69564 69300 69299 69256 68779 68092 67779 67956 68071 67627 66809 66291 66546 67459 68489
67528 68489 69101 69085 68611 68102 68031 68669 69849 70971 71396 70953 70079 69429 69351 69681 69993 70000 69771 69569 69556 69691
67508 69691 69850 69915 69742 69214 68450 67832 67629 67669 67535 67058 66483 66148 66175 66544 67254 68260 69262 69789 69635
67489 69635 69184 69097 69563 69995 69714 68846 68279 68650 69629 70362 70403 69980 69549 69321 69210 68969 68400 67590 66948 66848
67469 66848 67257 67794 68134 68233 68253 68466 69198 70595 72317 73600 73807 72993 71913 71400 71673 72246 72613 72858
67451 72858 73378 74069 74260 73644 72900 72996 74081 75442 76451 77109 77668 78120 78249 77955 77375 76752 76237 75766
67433 75766 75207 74746 74898 75913 77283 78246 78695 79157 79854 80242 79734 78497 77229 76363 75800 75313 74894 74673
67415 74673 74700 74913 75220 75551 75868 76169 76467 76723 76774 76388 75535 74577 73937 73532 72808 71544 70344 70034 70721
67396 70721 71785 72637 73116 73286 73350 73772 74953 76627 77989 78566 78653 78740 78909 79004 78984 78820 78394 77859 77837 78818
67376 78818 80493 81983 82612 82244 81143 79921 79462 80328 82086 83542 83877 83340 82768 82682 83063 83708 84404
67359 84404 84765 84330 83078 81661 80835 80754 81111 81893 83447 85603 87279 87535 86755 86187 86359 86586 86130 85242
67341 85242 84720 84913 85519 86113 86500 86728 87031 87620 88338 88683 88347 87558 86747 86129 85816 86016 86822 87996 89244
67322 89244 90588 92188 93906 95352 96287 96767 96947 96935 96757 96373 95825 95407 95411 95630 95474 94815 94304 94500 95034
67303 95034 95084 94481 93881 93961 94838 96153 97355 97978 97955 97580 97008 96145 95304 95460 97191 99677 101518 102394
67285 102394 103135 104228 105135 105278 104906 104617 104606 104744 104893 104861 104508 104124 104294 105094 105916 106340 106651 107195 107707
67266 107707 107721 107202 106403 105521 104920 105184 106395 107682 108144 107950 107948 108371 108573 107931 106499 104775 103339 102717
67248 102717 103100 104112 105191 106163 107140 107952 108184 107820 107408 107461 108031 108890 109757 110271 110120 109382 108557 108175
67230 108175 108522 109624 111191 112625 113524 114223 115489 117544 119740 121252 121786 121532 120816 119990 119326 118818
67214 118818 118357 118239 119124 121231 123836 125850 126750 126771 126479 126382 126749 127460 128100 128358 128279 128056 127805 127734 128236
67195 128236 129510 131194 132690 133739 134440 134831 134759 134202 133479 133083 133414 134593 136348 138104 139390 140180
67179 140180 140763 141332 141842 142195 142359 142288 141876 141089 140153 139580 139874 141050 142497 143538 144149 144825 145698 146215
67161 146215 145955 145430 145631 146934 148785 150347 151079 150835 149883 148942 148780 149561 150759 151782 152543 153332 154353
67144 154353 155424 156101 156167 156097 156837 158856 161480 163510 164445 164785 165193 165765 166212 166431 166687 167395 168716 170191
67126 170191 170914 170434 169514 169585 171366 174365 177645 180610 182952 184505 185497 186480 187635 188511 188814 189052 189915
67109 189915 191271 192270 192334 191719 191262 191807 193606 195903 197398 197566 197322 197940 199559 201245 202296 202855 203355
67092 203355 204070 205243 206945 208638 209432 209056 208096 207171 206405 205967 206445 208179 210649 213078 215354 217844
67076 217844 220507 222773 224272 225270 226321 227783 229659 231626 233220 234270 235174 236522 238438 240500 242264
67061 242264 243610 244545 245039 245239 245611 246652 248489 250858 253406 255908 258311 260664 263038 265423 267674
67046 267674 269601 271118 272318 273410 274619 276124 278100 280714 283955 287464 290665 293246 295421 297575
67032 297575 299643 301093 301631 301735 302311 303844 306095 308571 311033 313465 315791 317893 319814 321741 323839
67017 323839 326272 329317 333135 337394 341377 344630 347334 349949 352744 355836 359355 363255 367109 370475
67003 370475 373424 376365 379399 382199 384668 387345 390923 395473 400406 405127 409580 414094 418829 423467
66989 423467 427492 430739 433592 436630 440198 444308 448777 453332 457790 462241 466924 471764 476299 480300
66975 480300 484242 488843 494247 500032 505894 511906 518116 524278 530124 535643 541060 546721 552995 560049
66961 560049 567725 575817 584333 593234 602171 610852 619468 628257 636874 644870 652650 661189 670733 680589
66947 680589 690329 700328 710874 721683 732809 745050 758725 772798 786048 798575 811283 824383
66935 824383 837382 850204 863330 877033 891323 906517 922888 939831 956377 972635 989822
66924 989822 1008641 1028498 1048547 1068639 1088825 1108827 1128619 1148897 1170295 1192506 1214771
66913 1214771 1237005 1259871 1283961 1309345 1335777 1362894 1390270 1417616 1445002 1472748 1501161
66902 1501161 1530401 1560418 1590906 1621561 1652504 1684169 1716634 1749373 1781830 1813990 1846163
66891 1846163 1878523 1911020 1943420 1975210 2005871 2035594 2065304 2095528 2125485 2153837 2180152
66880 2180152 2205096 2229277 2252479 2274094 2293787 2311505 2327254 2341137 2353441 2364408 2373973
66869 2373973 2381792 2387455 2390639 2391241 2389444 2385533 2379542 2371165 2360096 2346426 2330643 2313287 2294625
66856 2294625 2274616 2253070 2229829 2204883 2178387 2150592 2121629 2091367 2059617 2026617 1993192
66845 1993192 1960204 1927840 1895603 1862913 1829521 1795382 1760516 1725119 1689628 1654535 1620264
66834 1620264 1587173 1555252 1523702 1491278 1457503 1423336 1390345 1359318 1329923 1301501 1273738
66823 1273738 1246542 1219711 1192939 1166088 1139392 1113413 1088686 1065240 1042540 1020047 997731
66812 997731 975867 954536 933662 913461 894405 876541 859138 841272 822658 803769 785286
66801 785286 767654 751112 735818 721700 708290 694906 681077 666733 652051 637359 623294
66790 623294 610680 599850 590111 580297 569918 559502 549732 540603 531656 522681 513830 505152 496424
66777 496424 487512 478683 470444 463086 456397 449801 442802 435293 427416 419281 411094 403409 396804 391204
66763 391204 385887 380323 374650 369079 363309 356956 350275 343991 338499 333592 328853 324035 319222 314929
66749 314929 311795 309786 307925 305311 302162 299267 296619 293404 289380 285431 282368 279870 277047 273541
66735 273541 269530 265160 260606 256499 253612 252041 251057 249782 247742 244830 241165 237112 233194 229839
66721 229839 227243 225349 223769 221825 219028 215616 212387 209863 207821 205719 203388 201091 199034 197060
66707 197060 194885 192513 190299 188612 187450 186408 185070 183440 181907 180733 179645 178115 176025 173883
66693 173883 172250 171115 169983 168522 166923 165646 164973 164820 164811 164521 163804 162906 162061 161050 159439 157323
66677 157323 155446 154406 154003 153587 152778 151574 150006 148123 146193 144587 143475 142837 142632 142671 142507 141814
66661 141814 140773 139709 138525 136921 135067 133495 132300 131023 129443 127908 126693 125623 124624 124102 124288
66646 124288 124652 124518 123968 123545 123241 122464 121008 119476 118517 118093 117751 117309 116913 116550 115896 114767 113491
66629 113491 112602 112190 111825 111191 110563 110345 110381 110140 109542 109032 108711 107931 106188 103994 102355 101624 101345 101083
66611 101083 100840 100691 100553 100461 100648 101130 101557 101620 101369 100988 100528 100037 99674 99455 99100 98378 97467 96722 96171
66592 96171 95497 94501 93396 92592 92321 92487 92817 93143 93528 94060 94522 94406 93399 91770 90152 88988 88321
66575 88321 88074 88247 88805 89540 90238 90867 91419 91641 91166 89932 88314 86727 85305 84098 83415 83609 84576
66558 84576 85783 86879 87959 89045 89618 89031 87282 85069 83184 82107 82046 82840 83750 83942 83476 83424 84554
66541 84554 86219 87029 86476 85329 84495 84053 83565 82798 81843 80900 80282 80313 80824 80991 80117 78496 77127 76648
66523 76648 76907 77538 78406 79376 80082 80232 79927 79425 78789 77946 76958 76020 75284 74848 74829 75254 75936 76567 76956
66504 76956 77112 77140 77044 76584 75443 73784 72495 72481 73598 74663 74709 73884 72987 72584 72901 74046 75719 76995
66486 76995 77092 76339 75816 76017 76374 76149 75301 74314 73632 73455 73713 74038 74019 73640 73244 73012 72830 72734 73018 73677
66466 73677 74143 73903 73128 72384 71926 71555 71029 70324 69578 68993 68760 68945 69459 70085 70420 69892 68285 66303
66448 66303 65220 65645 66870 67658 67512 66978 66913 67644 68652 68979 68135 66665 65534 64946 64311 63475 63292 64485
66430 64485 66473 67941 68263 67747 66803 65597 64427 63732 63594 63733 64005 64462 64864 64712 63886 62832 62000
66413 62000 61479 61293 61596 62379 63346 64315 65453 66875 68217 68837 68381 67105 65783 65251 65776 66832 67671
66396 67671 68077 68292 68354 67993 67220 66515 66247 66288 66433 66803 67494 68130 68174 67568 66781 66290 66220 66386 66486 66291
66376 66291 65829 65377 65191 65301 65583 65893 66068 65975 65696 65521 65605 65716 65442 64656 63712 63180 63336 63830 63994 63645
66356 63645 63466 64283 65988 67499 67827 66920 65417 63970 62980 62624 62826 63277 63686 63942 64017 63963 64047 64622 65719
66337 65719 66968 68051 68983 69861 70605 71115 71427 71594 71657 71807 72213 72534 72017 70371 68174 66141 64409
66320 64409 62930 62098 62321 63207 63831 63833 63682 63793 63935 63721 63270 63051 63245 63550 63637 63681 64278 65690 67270
66301 67270 67995 67676 67250 67597 68493 69134 69305 69428 69656 69661 69320 68984 68886 68844 68716 68707 68953 69198 69112 68642 67866
66280 67866 66863 65950 65668 66264 67338 68221 68512 68180 67489 67031 67435 68676 69879 70068 69015 67288 65759
66263 65759 65194 65828 66954 67349 66597 65693 65818 66788 67417 67225 66963 67351 68131 68800 69583 70998 72808 74103
66245 74103 74372 73994 73554 73166 72615 71906 71408 71516 72284 73335 74148 74491 74608 74878 75381 75948 76540 77280 78058
66226 78058 78449 78277 77981 78063 78266 77726 76060 73989 72694 72717 73633 74617 75105 74945 74216 73102 71940 71217
66208 71217 71311 72128 73115 73855 74521 75485 76511 76783 75946 74727 74178 74487 74922 74767 73936 72717 71436 70497
66190 70497 70370 71247 72846 74627 76045 76612 76059 74680 73290 72623 72805 73484 74233 74723 74763 74482 74377 74828
66172 74828 75575 75907 75464 74674 74324 74795 75780 76724 77401 78030 78829 79651 80165 80331 80490 80946 81669 82430 83017
66153 83017 83215 82794 81703 80199 78642 77299 76434 76339 77051 78119 78878 78970 78457 77643 76954 76864 77600 78915
66135 78915 80335 81551 82427 82826 82813 82928 83821 85477 87128 88049 88176 87924 87744 87962 88683 89610 90245 90458
66117 90458 90581 90818 90930 90759 90622 90806 91031 90958 90924 91521 92563 93169 92942 92436 92351 92804 93608 94627 95547
66098 95547 95831 95416 95041 95390 96215 96738 96648 96148 95370 94382 93688 93988 95365 97153 98691 99734 100209 100160
66080 100160 99997 100165 100466 100317 99775 99570 99882 99959 99406 98983 99335 99705 98969 97465 96651 97109 98001 98606 99250
66061 99250 100409 101806 102922 103702 104210 104186 103467 102426 101483 100613 99759 99304 99534 99993 99988 99575 99470 100122 101372
66042 101372 102907 104520 105904 106770 107293 108052 109363 110928 112203 112843 112737 111923 110638 109291 108302 107980
66026 107980 108443 109491 110645 111561 112337 113211 114086 114664 114969 115387 116169 117169 118081 118702 119028 119360 120218 121806
66008 121806 123566 124671 124966 125113 125793 127129 128901 130845 132647 134088 135462 137444 140313 143610 146730
65993 146730 149528 152067 154197 155768 156995 158223 159531 160868 162317 163807 164731 164335 162530 160000 157566
65978 157566 155660 154292 153124 151588 149375 146974 145372 145022 145333 145399 145027 144694 144602 144183 142782 140585
65962 140585 138467 136941 135657 134142 132645 131789 131577 131283 130392 129220 128485 128637 129743 131600 133668 135261
65946 135261 136181 136981 138352 140442 142972 145710 148476 150898 152584 153534 154151 154899 156076 157670 159276
65931 159276 160421 161220 162384 164276 166311 167704 168419 168909 169318 169646 170429 172323 174978 177219 178636 180240
65915 180240 183149 187148 191037 194022 196271 198340 200504 202657 204585 206292 208088 210261 212666 214856
65901 214856 216591 217986 219147 219885 219864 218823 216718 213897 211052 208628 206365 203789 201046 198714 196807
65886 196807 194665 191944 189048 186274 183218 179437 175203 171123 167400 163888 160537 157336 154182 151197
65872 151197 148826 147213 145852 144318 143021 142632 143066 143548 143560 143236 142984 143147 143858 144787 145181 144624 143587
65855 143587 142807 142367 141903 141409 141237 141448 141816 142323 143024 143519 143281 142537 142127 142409 142981 143533 144235 145051 145441
65836 145441 145163 144855 145427 147185 149762 152506 154720 156002 156646 157366 158462 159705 161166 163447 166722
65821 166722 170166 172906 175157 177835 181328 185181 188763 191714 193911 195493 196885 198352 199542 199777
65807 199777 198795 196972 194870 192797 190697 188236 185146 181679 178560 176240 174373 172349 170104 168110
65793 168110 166656 165573 164594 163647 162746 161881 161132 160795 161409 163585 167460 172174 176318 179327 182242 186658
65777 186658 193057 200542 207991 214949 221407 227324 232608 237226 241149 244336 246808 248468 248915 247695
65763 247695 244851 240947 236553 231946 227275 222603 217777 212701 207943 204719 203953 205572 208867 213351
65749 213351 218965 225730 233633 242871 253856 266711 280848 295196 308894 321721 333749 344710
65737 344710 353892 360764 365502 368673 370471 370400 367664 361737 352668 341069 327782 313429 298282 282695
65723 282695 267460 253383 240574 228467 216641 205380 195365 187015 180225 174567 169681 165554
65711 165554 162374 159950 157431 153957 149653 145625 142874 141454 140784 140461 140478 140852 141393 141891 142421 143375
65695 143375 145056 147159 148809 149360 149134 149116 149906 151297 152830 154345 155819 157084 158060 159019 160348 162212
65679 162212 164663 167898 172084 177089 182678 188878 195899 203788 212486 222155 233074 245172 258062
65666 258062 271649 286334 302305 318902 335177 351041 367369 384616 401636 416268 427116
65655 427116 434416 439230 442323 444020 444707 444804 444366 443202 441449 439701 438516 438112 438502 439464 440221 439597
65639 439597 436815 431970 425520 417554 407770 395938 382147 366727 350161 332992 315652 298444
65627 298444 281702 265744 250618 236167 222535 210307 199887 190929 182669 174770 167651 162013
65615 162013 158120 155411 152850 149858 146922 144912 143798 142574 140664 138785 137935 138037 138229 138182 138318 138834
65599 138834 139353 139656 140108 141033 142170 143054 143579 143898 144043 144011 144080 144757 146378 148829 151646 154398 157041
65582 157041 159854 163032 166560 170632 175854 182612 190434 198466 206569 215561 226356 239244 253903
65569 253903 269547 284999 299256 312267 324805 337338 349368 359948 368412 374425 377815 378620
65557 378620 376867 372107 363691 351831 337869 323039 307470 290912 273941 257749 243008 229663
65545 229663 217608 206835 197025 187823 179613 173338 169287 166582 164104 161512 159125 157248 155914 154977
65531 154977 154193 153379 152598 152055 151744 151489 151304 151339 151370 150753 149096 146638 143854 141094 138758 137300 136661
65514 136661 136091 134976 133582 132553 131977 131455 130860 130451 130277 130078 129870 130105 131024 132187 132869 132761 132178
65497 132178 131805 132297 133850 135958 137746 138684 138944 139074 139586 140799 142781 145316 148177 151501 155546 159941
65481 159941 163625 165882 167107 168170 169284 169981 170032 169737 169227 168063 165881 163066 160429 158345 156459
65466 156459 154178 151220 147807 144481 141733 139667 137998 136398 134768 133232 132043 131537 131867 132614 132981
65451 132981 132635 132195 132497 133537 134558 135096 135474 136178 137194 138209 139106 139940 140679 141301 142014 143060 144351
65434 144351 145543 146447 147184 147985 149010 150329 151855 153271 154206 154530 154425 154179 153997 153941 153959 154016 154224 154680
65416 154680 155180 155325 155042 154657 154233 153284 151629 150173 150124 151541 153346 154782 156037 157287 157986 157679 156843
65399 156843 156308 156258 156444 157007 158376 160532 163007 165524 168009 170078 171140 171100 170454 169625 168643 167497 166256
65382 166256 164844 163287 162172 162209 163164 163973 164121 164195 164630 164766 163884 162555 162040 162585 163242 163356 163399 164115
65364 164115 165516 167106 168686 170592 173306 177028 181456 185908 189857 193440 197346 202163 208019 214770
65350 214770 222197 229927 237426 244204 249896 254113 256450 256804 255540 253289 250666 248114 245700 243018
65336 243018 239537 235152 230218 225011 219504 213789 208347 203524 199010 194196 188978 183914 179618 176302
65322 176302 173877 172175 170969 170034 169316 168876 168538 167830 166474 164810 163422 162380 161169 159458 157593
65307 157593 156020 154522 152546 150281 148823 148974 150226 151341 151741 151905 152492 153548 154672 155595 156398 157333
65291 157333 158597 160122 161501 162271 162325 161951 161413 160679 159613 158252 156779 155370 154191 153425 153137 153163 153234
65274 153234 153230 153342 154040 155769 158453 161271 163157 163683 163386 163145 163311 163477 163017 161788 160372 159620 159893
65257 159893 160855 162070 163541 165373 167097 167944 167825 167524 167657 167832 167182 165403 162990 160629 158689 157105
65241 157105 155444 153220 150447 147821 146122 145525 145630 145978 146296 146506 146770 147418 148473 149417 149740 149591 149510
65224 149510 149665 149829 150016 150557 151384 151789 151238 150082 149099 148546 148029 147252 146476 146162 146411 146966 147629 148445
65206 148445 149400 150252 150853 151483 152476 153534 153829 153010 151729 150884 150634 150528 150311 150078 149745 148975 147751 146620
65188 146620 146164 146562 147754 149608 151719 153359 154015 153892 153627 153646 153992 154686 155894 157632 159465 160711
65172 160711 161044 160816 160717 161074 161618 161937 161954 161896 162002 162460 163360 164390 164763 163930 162315 160960 160425 160418 160482 160472
65152 160472 160257 159623 158949 159445 162060 166260 170464 173719 176517 179914 184299 189310 194568 200101 206047
65137 206047 212275 218396 224024 228973 233340 237548 242122 247229 252421 257103 261256 265399 269738 273687
65123 273687 276534 278309 279589 280602 280980 280427 279153 277501 275460 272739 269172 264918 260357 255779 250989
65108 250989 245342 238441 230757 223209 216185 209397 202704 196553 191390 187095 183264 179669 176189 172682
65094 172682 169232 166155 163478 160837 158294 156821 157319 159334 161392 162516 162914 163184 163532 163946 164582 165528
65078 165528 166423 166706 166216 165335 164548 163952 163297 162440 161653 161383 161770 162548 163423 164302 165115 165681 165941 166066 166167
65059 166167 166100 165779 165426 165295 165383 165658 166300 167350 168394 168996 169223 169299 168996 167949 166456 165228 164293 162825
65041 162825 160369 157689 155992 155684 156176 156596 156299 154981 152778 150292 148252 147022 146435 146012 145365 144580
65025 144580 144220 144725 145750 146353 145905 144540 142743 140948 139718 139761 141266 143511 145527 147028 148365 149807
65009 149807 151319 152893 154573 156173 157473 158759 160685 163462 166607 169700 172902 176376 179574 181658
64995 181658 182548 183071 183991 185208 186045 186030 185249 184149 183271 183084 183876 185718 188544 192128 195910 199076 201107
64978 201107 202248 203164 204042 204324 203436 201546 199328 197172 194933 192414 189733 187124 184647 182316 180279
64963 180279 178642 177226 175739 174216 172995 172218 171608 170905 170302 170055 169859 169058 167661 166636 166788 167633
64947 167633 167899 167052 165787 164994 164817 164877 164885 164650 163906 162658 161466 160959 161148 161579 161982 162395 162771 162961 163031
64928 163031 163222 163531 163697 163560 163155 162501 161653 160898 160481 160217 159809 159473 159684 160314 160676 160567 160565 161056 161675
64909 161675 162135 162936 164568 166534 167940 168868 170404 173356 177472 181969 186356 190690 195372 200774 206820
64894 206820 213004 218984 224940 230998 236650 241327 245385 249896 255450 261735 268290 274922 281199 286228
64880 286228 289477 291456 293074 294496 294923 293386 289541 283921 277598 271474 265732 260083 254541 249668
64866 249668 245947 243311 241466 240267 239482 238528 236860 234476 231718 228788 225759 222817 220028 216964 213034
64851 213034 208240 203295 198956 195476 192681 190314 188249 186562 185385 184560 183549 181924 179820 177680
64837 177680 175715 173963 172674 172115 172064 172016 171937 172239 172886 173176 172736 172205 172387 173110 173483 173125 172606 172734 173903
64818 173903 176152 179321 182906 186168 188764 191228 194560 199259 204826 210253 214965 219212 223519 227992
64804 227992 232364 236594 240959 245443 249430 252340 254274 255655 256429 256030 254092 250813 246642 241969 237138
64789 237138 232417 227852 223441 219550 216821 215504 215131 215013 214912 215055 215722 216905 218287 219392 219984 220459
64773 220459 221646 224020 227219 230505 233592 236853 240788 245534 250892 256647 262711 269038 275456 281650
64759 281650 287307 292305 296764 300997 305359 309950 314387 318067 320907 323642 327102 331282 335433 338939
64745 338939 341693 343630 344440 343984 342482 340052 336398 331296 325050 318112 310575 302445 294230 286743 280378
64730 280378 274945 270174 266068 262784 260507 259411 259429 260060 260665 260973 261122 261284 261592 262361 263993 266554
64714 266554 269725 273222 277023 281120 285284 289201 292604 295234 296845 297326 296701 294987 292234 288634 284335
64699 284335 279193 273019 266092 259096 252430 245923 239354 232956 227200 222332 218356 215246 212885 210954
64685 210954 209204 207801 207176 207560 208827 210721 213019 215462 217803 220060 222606 225853 229886 234495 239547
64670 239547 245133 251310 257807 264130 269902 274889 278827 281503 283072 283890 283853 282225 278532 273431 268178
64655 268178 263313 258296 252594 246707 241843 238765 237236 236534 236275 236656 237940 239950 242229 244710 247838
64640 247838 251879 256401 260780 265077 270029 276248 283693 291866 300185 308276 316205 324430 333187 341997
64626 341997 350045 356893 362299 365482 365272 361218 354102 345178 335300 324871 314144 303315 292691
64613 292691 282897 274506 267345 260756 254697 249914 246712 244283 241795 239440 237676 236023 233574 230492
64599 230492 227976 226700 226064 225161 223817 222397 221194 220396 220264 220960 222345 224198 226506 229378 232788
64584 232788 236566 240596 244914 249649 254884 260658 267151 274824 284081 294651 305497 315519 324276
64571 324276 331923 338735 344888 350430 355134 358450 359820 359003 356041 351308 345677 340120 334724 328598
64557 328598 321310 314013 308409 304815 302017 298917 295504 292188 289134 286568 284992 284566 284719 284789 284680
64542 284680 284574 284383 283860 282963 281751 280194 278304 276249 274093 271623 268603 264890 260254 254577 248510
64527 248510 243374 239881 237374 234821 232190 230178 228882 227620 226139 225149 225316 226218 226747 226277 225126
64512 225126 224159 224242 225839 228712 231983 234726 236638 238053 239473 241241 243617 246824 250845 255317 259831
64497 259831 264333 269103 274363 280011 285805 291615 297293 302334 305905 307472 307376 306612 305954 305373 304441 303142
64481 303142 302036 301605 301749 302112 302612 303284 303763 303414 302020 299989 297722 295205 292405 289650 287283 285267
64465 285267 283556 282569 282838 284295 286401 288857 291607 294204 295891 296571 297120 298276 299581 299936 299013 297629
64449 297629 296718 296415 296281 296097 296123 296706 297945 299857 302680 306798 312401 319354 327345 335995 344878 353795
64433 353795 363181 373947 386714 401439 418055 437168 459731 486246 516768 551638 591618 637263
64421 637263 688643 745945 809874 881222 960234 1046559 1139370 1237169 1337612 1437864 1535164
64410 1535164 1627072 1711543 1787123 1852912 1907933 1950456 1978176 1989308 1983586 1962282 1927239
64399 1927239 1879814 1820651 1750307 1669911 1581152 1485923 1386267 1284513 1183117 1084360 990353
64388 990353 903083 823883 752829 689131 632246 582262 539162 502326 471075 445163 424261
64377 424261 407319 392941 380291 369221 359685 351484 344483 338623 333619 328916 324060 318848 313144
64364 313144 306840 300092 293346 286962 280924 275058 269390 264154 259516 255488 252176 249924 249054 249466 250637
64349 250637 252031 253414 254811 256432 258639 261666 265144 268180 270156 271254 271913 272065 271251 269275 266302
64334 266302 262563 258518 255084 252985 251831 250541 248756 247185 246382 245990 245580 245526 246432 248141 249928 251422
64318 251422 252857 254589 256746 259201 261558 263357 264571 265645 266814 267655 267576 266427 264385 261552 258017
64303 258017 253996 249581 244679 239458 234424 229724 224887 219773 215224 212115 210138 208283 206231 204482
64289 204482 203281 202294 201402 201037 201524 202677 204248 206311 209050 212568 217014 222437 228373 233969 238700
64274 238700 242762 246718 251039 255936 261255 266472 271090 275038 278441 281139 282868 283848 284661 285450 285678
64259 285678 284821 283070 281274 280368 280708 281638 281847 280544 278120 275267 271717 266538 259600 252053 245217
64244 245217 239563 234842 230590 226386 222146 218422 215900 214522 213601 212869 212757 213440 214303 214710 214783 215009
64228 215009 215586 216542 218047 220141 222455 224575 226411 227996 229204 229933 230273 230311 230091 229909 230115 230449 230103
64211 230103 228794 227214 226033 225028 223695 222240 221302 221053 221165 221423 221773 221982 221856 221677 221930 222686 223745
64194 223745 225182 227216 229639 232002 234458 237932 243253 250413 258719 267384 275918 284222 292402 300404
64180 300404 307882 314450 319852 323689 325304 324265 320761 315253 307998 299316 290045 281165 273073 265651
64166 265651 258886 252921 247580 242434 237357 232595 228284 224428 221308 219264 217966 216566 214879 213831
64152 213831 214267 215856 217694 219681 222554 226598 230970 234593 237373 240222 243989 248607 253226 256932
64138 256932 259312 260518 261042 261335 261454 261016 259677 257656 255566 253706 251808 249622 247488 246002 245315
64123 245315 245053 244886 244917 245558 247212 250027 253756 257833 261812 265723 269958 274895 280691 287227 294014
64108 294014 300352 305904 311021 316232 321461 326019 329380 331655 333301 334644 335804 336907 338242 340198
64094 340198 343016 346556 350394 354185 357651 360085 360275 357460 352330 346582 341407 336694 331716 326184
64080 326184 320408 314731 309139 303390 297402 291481 286207 282114 279470 278254 278118 278365 278325 277999 278068 278990
64064 278990 280445 282007 284029 287201 291361 295439 298726 301698 305288 309748 314531 319040 323240 327604
64050 327604 332554 337911 342913 346937 350097 352891 355442 357464 358927 360190 361354 361903 361284 359570 357415
64035 357415 355528 354254 353373 352242 350442 348316 346539 345146 343516 341461 339743 339156 339569 340382 341549
64020 341549 343502 346238 349078 351421 353267 354794 355775 355683 354279 351868 348899 345483 341495 337185 333378
64005 333378 330773 329151 327599 325519 323056 320560 318093 315681 313616 312179 311302 310804 310777 311439 312751
63990 312751 314460 316484 319030 322387 326637 331481 336322 340704 344817 349347 354775 361014 367793 375039
63976 375039 382749 390882 399545 408915 418680 428019 436559 445028 454427 464772 475172 485041 494739 505093
63962 505093 516792 530260 545627 562632 580914 600562 622193 646494 673972 705154 740756
63951 740756 781504 827953 880547 939751 1006275 1081321 1166455 1262940 1371294 1491729 1624711
63940 1624711 1770505 1928235 2095973 2271810 2454321 2641827 2831790 3021219 3207131
63931 3207131 3386224 3554475 3707675 3842251 3955288 4044024 4105897 4139185 4143277 4118309
63921 4118309 4064820 3983864 3877155 3746983 3596150 3428117 3247051 3057430 2863458 2668817
63911 2668817 2476821 2290486 2112228 1943630 1785822 1640137 1507990 1389918 1285083
63902 1285083 1192117 1110239 1039127 977936 925200 879734 841001 808282 780206 755605 734292
63891 734292 716358 701058 687161 674287 663124 654215 647184 641379 636690 633369 631514 631198 632789
63878 632789 636666 642741 650695 660606 672986 688237 706408 727522 751771 779221 809591 842458
63866 842458 877594 914977 954635 996522 1040468 1086104 1132858 1180059 1227026 1273128 1317815
63855 1317815 1360546 1400585 1437031 1469239 1497008 1519999 1537111 1547016 1549419 1545232 1535292 1519401
63843 1519401 1497043 1468546 1434946 1396972 1354882 1309211 1260991 1211162 1160221 1108576 1056788
63832 1056788 1005386 954882 906043 859640 815830 774304 735183 699087 666045 635035 605245
63821 605245 577305 552553 531290 512462 495003 478872 464657 452644 442491 433573 425482 418284
63809 418284 412263 407346 402995 398819 394981 391601 388036 383301 377159 370324 363576 357112 350731 344182
63795 344182 337260 330050 323204 317536 313132 309236 305176 301025 297148 293499 289717 285612 281232 276639
63781 276639 271973 267594 263913 261102 259091 257680 256531 255311 254075 253275 253122 253129 252610 251565 250668 250406
63765 250406 250532 250484 250077 249567 249114 248434 247105 245219 243502 242644 242611 242782 242686 242295 241668 240726 239558 238607
63747 238607 238296 238694 239714 241333 243313 245074 246275 247380 249200 251905 254888 257544 259779 261746 263558
63732 263558 265487 268072 271679 276063 280574 284723 288468 292091 296005 300544 305736 311237 316604 321662
63718 321662 326585 331633 336870 342054 346678 350088 351775 351745 350600 349094 347457 345197 341693 336958 331798
63703 331798 327250 323939 321855 320533 319472 318556 318095 318344 319108 320074 321427 323672 326828 330276 333597
63688 333597 337034 340753 344105 346227 347096 347395 347540 347554 347840 349222 351853 354661 356358 356639 356114 355490
63672 355490 355254 355812 357323 359422 361598 363851 366662 370335 374653 379105 383017 385517 385927 384440 381955
63657 381955 378984 375156 370140 364646 359795 355702 351399 346266 340862 336050 331962 328354 325536 324170
63643 324170 324274 325066 325867 326719 328070 330244 333253 336746 340178 343520 347718 353749 361105 368055 373752
63628 373752 379218 385642 392521 398477 403399 408618 415051 422314 429834 437913 447284 458334 471154 485806
63614 485806 502075 519391 537376 556220 576349 598126 621993 648344 676874 706516 736342
63603 736342 766070 795358 823131 848076 869340 886237 897795 903463 904069 901409 896852 890860 883698
63590 883698 875853 867655 858976 849487 838829 826532 812146 795522 776675 755550 732499 708842
63578 708842 686268 665440 645796 626878 609214 593599 580123 568531 559074 552316 548273 546317
63566 546317 545916 546985 549491 553155 557714 563147 569447 576425 583912 592025 601040 611062 622043 634113
63552 634113 647720 663353 681297 701853 725620 753167 784272 817891 853170 890279 929756
63541 929756 971029 1011834 1049008 1079513 1100961 1112061 1113227 1106562 1094879 1080675 1065939 1052277
63529 1052277 1040558 1030445 1020742 1010408 999024 986248 971071 951949 927813 898947 866843
63518 866843 833169 798982 764880 731525 699647 669649 641637 615854 592632 571792 552591
63507 552591 534523 517889 503272 490757 479949 470473 462062 454413 447333 440897 435100 429569 424011
63494 424011 418829 414769 411956 409704 407315 404696 402140 399935 398306 397396 397086 397151 397780 399668 403316
63479 403316 408371 413841 418923 423461 427706 431842 435865 439794 443746 447595 450684 452273 452345 451568 450210
63464 450210 447539 442816 436626 430607 425918 422516 419874 417796 416363 415664 415861 417036 418729 420075 420705
63449 420705 421172 422255 424284 427423 432065 438368 445731 453372 461370 470699 482309 496527 513238 532154
63435 532154 552932 575433 599982 627143 657267 690342 725882 762388 796976 826188 847655
63424 847655 861018 867516 869140 868175 866890 867140 870228 877076 888346 904326 924889 949548 977328
63411 977328 1006680 1035929 1063801 1089172 1110355 1125331 1133077 1134387 1131113 1124849 1116503 1106638 1095675
63398 1095675 1083871 1071375 1058160 1043615 1026444 1005410 980145 951049 918704 883908 848136
63387 848136 813263 780507 749917 721082 694048 669328 647283 627784 610466 595172 582123
63376 582123 571679 563897 558390 554784 553185 553916 556776 560948 565906 572142 580686 592020 605765 621366
63362 621366 638762 658248 679954 703704 729358 757162 787622 820985 856767 893845 931048
63351 931048 967587 1002873 1036029 1065833 1091173 1111439 1126449 1136167 1140631 1140108 1135230 1127034 1116846
63338 1116846 1105834 1094357 1081779 1067207 1050442 1031978 1012014 989860 964691 936664 906905
63327 906905 876498 846001 816075 788018 763181 741969 723761 707813 694029 682968 675294 670996
63315 670996 668737 665945 659939 649157 633339 612920 588875 563092 538034 515434 495570 478068
63303 478068 462945 450369 439799 430111 420606 411397 402867 395274 388923 384109 380611 377670 374671
63290 374671 371591 368630 365833 363238 360947 358691 355745 351786 347616 344542 343057 342489 341913 341057 340272
63275 340272 339964 340171 340558 340808 341057 341771 343074 344453 345443 346334 347808 349952 352142 353864 355219 356563
63259 356563 358141 360183 362937 366348 370092 374158 379010 384892 391302 397527 403413 409246 415112 420890
63245 420890 426709 432916 439607 446680 454406 463396 473770 484804 495867 507450 520807 536551 553999
63232 553999 572027 590239 609033 628762 649248 670200 691681 713891 736646 759414 781891
63221 781891 804264 826863 849737 872669 895401 917747 939608 960967 981674 1001133 1018347
63210 1018347 1032408 1042790 1049115 1050941 1048086 1040880 1029699 1014341 994384 970285 943731 916629
63198 916629 889989 863959 838682 814730 792788 773303 756601 743111 733260 727230 724976 726490
63186 726490 731899 741195 754007 769798 788252 809276 832550 857253 882447 907679 933038 958649
63174 958649 984283 1009544 1034255 1058507 1082342 1105403 1126855 1145697 1161303 1173715 1183228 1189510
63162 1189510 1191279 1187146 1176733 1160711 1139736 1113797 1082869 1047829 1010216 971156 931004 890133
63150 890133 849573 810607 774081 740383 709753 682166 657136 634145 613209 594600 578098
63139 578098 563075 549409 537807 528873 522201 516643 511278 505931 500983 496925 493923 491656 489769
63126 489769 488531 488661 490300 492577 494555 496268 498341 500925 503595 506135 508773 511597 514384 517144
63112 517144 520294 523992 527770 531149 534310 537745 541454 544849 547388 549053 550284 551652 553537 555845
63098 555845 558033 559622 560752 562101 564236 567127 570368 573701 577179 580768 583982 586184 587305 588075
63084 588075 589304 591026 592564 593432 593855 594312 594893 595493 596497 598780 602860 608288 614125 619895 625836
63069 625836 632333 639507 647463 656528 666940 678523 691036 704692 719956 736907 755233 774845
63057 774845 795997 818811 843289 870060 900456 935300 973986 1015262 1058589 1104188 1152095
63046 1152095 1201873 1253208 1306078 1360207 1414870 1469414 1523629 1577546 1631279 1685109 1739308
63035 1739308 1793746 1847946 1901504 1954042 2004707 2052169 2095205 2132924 2164357 2188259 2203423
63024 2203423 2208779 2203274 2186249 2158101 2120022 2072994 2017789 1956128 1890909 1824744 1758983 1694811
63012 1694811 1634445 1580110 1532272 1490101 1453652 1424541 1404151 1392125 1387150 1388638 1397030 1412718
63000 1412718 1435160 1463001 1494791 1529574 1566946 1606591 1647887 1690136 1733052 1776728 1821029
62989 1821029 1865272 1908614 1950564 1990956 2029521 2065512 2097646 2124352 2144182 2156122 2159559
62978 2159559 2153957 2138621 2112785 2076029 2028785 1972377 1908401 1838112 1762702 1684091 1604799
62967 1604799 1526709 1450414 1376201 1305278 1239378 1179360 1124802 1074910 1029181 987160 948252
62956 948252 912145 879028 849081 821973 797022 773655 751568 730639 710777 691674 672828
62945 672828 654079 636047 619561 604608 590366 576431 563396 551907 541721 532226 523461 515894
62933 515894 509392 503165 496864 491053 486289 482247 478229 474255 471031 468794 466728 463825 460028 456162
62919 456162 452921 450363 448307 446679 445255 443549 441359 439174 437664 436983 436879 437226 437904 438368 437961 436738
62903 436738 435484 434792 434588 434626 434904 435338 435504 435083 434281 433568 433261 433516 434370 435554 436619 437512 438628 439985
62885 439985 440824 440476 439341 438458 438343 438789 439627 440947 442462 443298 442786 441214 439535 438390 437521 436046
62869 436046 433349 429831 426718 424931 424224 423621 422580 421368 420335 419287 417837 416084 414624 413882 413637
62854 413637 413262 412419 411385 410581 409889 408774 407224 406110 406242 407291 408164 408355 408417 409094 410528 412437 414542
62837 414542 416470 417728 418174 418341 418876 419873 421006 422160 423527 425192 426996 428817 430678 432579 434506
62822 434506 436656 439381 442759 446382 449658 452264 454314 456251 458619 461755 465539 469551 473518 477549
62808 477549 481864 486484 491305 496420 502158 508823 516451 524827 533626 542573 551637 561178 571748 583634
62794 583634 596648 610520 625451 642071 660759 681221 702974 726190 751866 781148 814693
62783 814693 852699 895248 942346 993812 1049490 1109627 1174768 1245105 1320091 1398768 1480255
62772 1480255 1563649 1647561 1730059 1809150 1883099 1950209 2008539 2056127 2091444 2113557 2121959
62761 2121959 2116474 2097298 2064938 2020110 1963936 1898298 1825704 1748524 1668366 1586322 1503687
62750 1503687 1422228 1343711 1269311 1199435 1133956 1072588 1015290 962467 914682 872022 833807
62739 833807 799060 767252 738475 712965 690647 671197 654342 639919 627710 617454 609010 602327
62727 602327 597125 592818 588961 585720 583635 582932 583368 584829 587696 592333 598477 605619 613851 623807 635698
62712 635698 649004 663388 679428 697985 719206 742753 768863 798547 832701 871493 914754
62701 914754 962419 1014428 1070689 1131438 1197186 1267960 1342979 1421473 1503378 1588525 1675372
62690 1675372 1761299 1844245 1923343 1997688 2065036 2122205 2166485 2196339 2211056 2210333 2194279 2163457
62678 2163457 2118718 2061140 1992297 1914478 1830396 1742497 1652516 1561773 1471793 1384400 1301149
62667 1301149 1222935 1150301 1083660 1022872 966991 915138 867524 824940 787265 753219 721851
62656 721851 693441 668506 646602 626814 608930 593304 579804 567667 556346 545780 535794 525971
62644 525971 516324 507509 500006 493476 487287 481396 476385 472753 470390 468738 467335 466229 465797 466139 466762
62629 466762 467077 467022 466894 466662 465844 464129 461804 459481 457619 456302 455317 454497 454174 455028 457038 458877 459161
62612 459161 458318 458465 461134 465835 471215 476874 483343 490812 498799 507033 516050 526832 540226 556634
62598 556634 575830 597037 619515 643201 668701 696757 727901 762290 799515 838638 878699
62587 878699 919027 958822 996758 1031483 1062345 1089042 1110628 1125486 1132457 1131543 1123393 1108556
62575 1108556 1087514 1061031 1030095 995647 958592 919943 880768 842055 804634 769026 735292
62564 735292 703294 673215 645636 620948 598935 579099 561218 545398 531731 520090 510130 501301
62552 501301 492997 484923 477296 470593 465155 461084 458305 456498 455134 453878 452969 452922 453807 455039 456043
62537 456043 456985 458640 461558 465522 469816 473892 477650 481193 484610 488191 492674 498919 507161 516816
62523 516816 527174 538252 550828 565796 583651 604483 628124 654280 682809 714041 748573
62512 748573 786641 827919 872098 919175 968714 1019120 1068377 1115558 1160874 1203968 1242848
62501 1242848 1275024 1299253 1315544 1323867 1323710 1314925 1298299 1275207 1247299 1216595 1185149 1154169
62489 1154169 1123893 1094611 1067374 1043394 1023258 1007206 995759 989445 988071 990806 996950 1006187
62477 1006187 1018080 1031682 1045687 1058742 1069661 1077589 1081965 1082208 1077631 1067939 1053582 1035226
62465 1035226 1012963 986411 955539 921080 884193 846068 807769 770000 732963 696779 662059
62454 662059 629756 600464 574244 551153 531452 515124 501607 490261 480867 473401 467528 462547
62442 462547 457833 453217 449052 445926 444209 443823 444460 445822 447486 448762 449071 448458 447380 446056 444354
62427 444354 442264 439980 437462 434390 430681 426662 422613 418649 415175 412854 411652 410418 407957 404315
62413 404315 400592 397669 395624 394201 393254 392620 392013 391272 390502 389851 389316 388883 388707 388991 389714 390627 391547
62396 391547 392645 394357 396964 400334 404127 408106 412084 415716 418650 420924 423016 425513 428919 433588
62382 433588 439444 445784 451828 457587 463844 471190 479483 488324 497527 506962 516507 526455 537386 549217
62368 549217 560970 572068 583379 596305 611236 627713 645838 666523 690310 716946 746503
62357 746503 780077 818780 862367 909487 959043 1010849 1064945 1120615 1176139 1229338 1278309
62346 1278309 1321736 1358661 1388138 1409306 1421741 1425613 1421568 1410536 1393523 1371258 1343966 1311701
62334 1311701 1274927 1234625 1191942 1147954 1103790 1060623 1019377 980501 944046 909837 877620
62323 877620 847255 818775 792167 767200 743671 721658 701225 681942 663060 644177 625476
62312 625476 607354 590193 574463 560598 548591 538044 528628 520157 512221 504340 496804 490798 487234
62299 487234 485706 484942 484026 482795 481394 480039 479150 479169 480124 481643 483447 485537 487945 490636 493694 497253
62283 497253 501081 504491 506926 508567 510222 512556 515459 518228 520431 522570 525674 530100 535052 539544
62269 539544 543708 548715 555502 564092 574324 586731 602215 621051 642743 666913 693967 724663
62257 724663 759297 797640 839592 885506 935680 989658 1046196 1103840 1161339 1217520 1270917
62246 1270917 1319614 1361421 1394353 1417280 1430226 1433955 1429130 1415966 1394613 1365595 1329846 1288555
62234 1288555 1243075 1194605 1143729 1090619 1036083 982092 930777 882977 838272 796331 757657
62223 757657 722916 692135 664919 641051 620426 602614 586877 572667 559901 548789 539456 531623
62211 531623 524654 518077 512132 507476 504157 501251 497824 494011 490750 488656 487643 487509 488295 489923 491986
62196 491986 494253 497060 500882 505697 511126 517138 524271 533053 543408 554751 566581 578797 591432
62183 591432 604232 616662 628320 639204 649487 659112 667719 674909 680563 685010 688977 693301 698636
62170 698636 705492 714509 726315 741036 758305 778136 801481 829400 861839 897720 936086 976451
62158 976451 1017868 1058363 1095794 1128893 1157131 1179947 1196580 1206488 1209579 1206142 1196839 1182562
62146 1182562 1163935 1141050 1113963 1083267 1049892 1014561 977911 941070 905651 872992 843637
62135 843637 817556 794634 774919 758635 746007 736988 731204 728305 728180 730654 735255 741613 749879
62122 749879 760291 772507 785901 800462 816758 834972 854561 875036 896401 918387 939796
62111 939796 959194 976045 990718 1003547 1014341 1022741 1028661 1032306 1034118 1034820 1035255 1035956 1036807 1037125
62097 1037125 1036121 1033462 1029596 1025615 1022692 1021503 1021976 1023487 1025410 1027674 1030789 1035233 1040958 1047639
62083 1047639 1055259 1064082 1074148 1085253 1097491 1111388 1127323 1145182 1164776 1186216 1209535 1234156
62071 1234156 1259126 1283759 1307851 1331312 1353795 1374718 1393611 1410611 1426648 1442926 1460145
62060 1460145 1478344 1497406 1517266 1537463 1556882 1574267 1588823 1600215 1608258 1612844 1613896 1611150
62048 1611150 1604195 1592861 1577279 1557398 1532840 1503432 1469486 1431284 1388820 1342473 1293579
62037 1293579 1243782 1194151 1145318 1098012 1052795 1009545 967961 928424 891690 857915 826746
62026 826746 798345 773479 752413 734397 718484 704235 691395 679491 668160 657440 647410
62015 647410 637835 628433 619183 610220 601783 594383 588566 584264 580840 578052 576563 577137 579713 583601
62001 583601 588260 593480 599090 604963 611125 617444 623300 627888 630775 631937 631479 629618 626744 623063
61987 623063 618214 611611 603160 593389 582940 572165 561173 550000 538770 527913 518128 509828 502706
61974 502706 496121 489844 484080 478849 473844 469067 465105 462444 460692 458863 456404 453739 451804 451146
61960 451146 451377 451463 450656 449298 448593 449434 451572 454135 456793 460071 464534 470108 476388 483243 490825 499243
61944 499243 508647 519531 532470 547525 564244 582303 601774 622641 644489 666911 689899 713476
61932 713476 737221 760475 782830 804047 823708 841436 857389 872027 885215 895918 903004 906183
61920 906183 906049 903443 898977 893093 886348 879448 872902 866767 861046 856470 854527 856404 862127 871034
61906 871034 882813 897428 914151 931343 947528 962203 975294 986161 993555 996502 994878 989092
61894 989092 979381 965687 948330 928627 908392 888645 869110 849268 829447 810380 792062 773813
61882 773813 755420 737427 720179 703362 686799 671046 656726 643734 631497 619661 608164
61871 608164 597067 586779 578122 571646 567045 563568 560900 559345 559412 561566 566185 573328 582603 593529
61857 593529 605998 620236 636591 655524 677527 702685 730549 760721 793307 828391 865331
61846 865331 903065 940988 979051 1016951 1053630 1087645 1117820 1143503 1164385 1180132 1190215
61835 1190215 1194275 1192721 1186711 1177433 1165797 1153058 1141220 1132220 1126869 1125020 1126526 1131469 1139635
61822 1139635 1150361 1162936 1176680 1190507 1202785 1211675 1215468 1212872 1203490 1187958 1167111 1141124
61810 1141124 1109884 1074060 1035138 994476 952990 911813 872382 835520 801139 769250 740612
61799 740612 715817 694236 674588 656277 639612 624916 612104 601063 591790 583992 577054 570646
61787 570646 565044 560639 557344 554683 552282 550101 548326 547164 546632 546370 545820 544736 543411 542141 540610
61772 540610 538207 534988 531853 529595 528170 527238 526904 527264 527542 526622 524582 522865 522582 523362 524354 525597
61756 525597 527592 530060 532158 533797 535805 538612 541531 543590 544513 544631 544328 543837 543215 542275 540840 539177
61740 539177 537786 536638 535101 532859 530477 528767 527969 527855 528314 529375 530868 532466 534016 535642 537631
61725 537631 540332 543927 548049 551895 555043 557991 561605 566160 571172 576043 580533 584703 588703 592674
61711 592674 596597 600175 602956 604548 604674 603192 600301 596621 592834 589250 585877 582786 580155 578006
61697 578006 576185 574650 573562 573020 572899 573066 573638 574856 576708 578760 580409 581359 581807 582144 582410 582152
61681 582152 580784 578139 574664 571220 568599 567001 565900 564533 562577 560206 557551 554448 550882 547359
61667 547359 544482 542287 540283 538071 535642 533157 530788 528860 527814 527846 528693 529874 531009 531833 532140
61652 532140 531955 531725 532127 533517 535595 537678 539362 540910 542941 545749 549041 552354 555473 558259 560301
61637 560301 561196 561242 561388 562153 562844 562270 560102 557059 553727 549785 544769 539155 534139 530429 527800 525833
61621 525833 524526 523971 523890 523908 524011 524330 524664 524605 524098 523472 522875 522003 520452 518011 514487 509574 503216 495998
61603 495998 488961 482910 477923 473449 468838 463890 459009 454834 451667 449229 446950 444496 441960 439582
61589 439582 437324 434875 432129 429538 427748 426907 426514 425946 424857 423039 420308 416814 413161 409937 407286
61574 407286 405093 403245 401421 399028 395853 392491 389563 386744 383268 379306 376031 374211 373466 373158 373202
61559 373202 373493 373214 371502 368649 366021 364764 364885 365533 365916 365981 366398 367756 369722 371216 371596 371357 371390
61542 371390 371884 372330 372418 372457 372979 374270 376317 378890 381612 384135 386245 387798 388712 389151 389439 389554 388982
61525 388982 387394 385225 383095 380825 377554 372902 367556 362593 358598 355580 353334 351603 350156 349005
61511 349005 348435 348608 349251 349927 350452 350808 350713 349685 347705 345586 344349 344258 344695 344988 345066 345108 344909 344062 342720
61492 342720 341672 341483 341893 342302 342545 342863 343346 343802 344161 344620 345243 345634 345208 343846 342192 341208 341350 342251
61474 342251 343325 344526 346164 348018 349172 349017 348021 347120 346615 346191 345819 346033 347139 348597 349496 349462 348915
61457 348915 348551 348664 348884 348541 347433 346303 346321 347969 350551 352911 354551 355832 357197 358459 359110 359188
61441 359188 359493 360804 363105 365816 368586 371457 374330 376768 378594 380300 382529 385315 388117 390400
61427 390400 391915 392569 392406 391774 391269 391418 392445 394189 396194 398092 400093 402794 406239 409430 411219
61412 411219 411512 411154 410734 410062 408841 407228 405503 403652 401609 399572 397689 395673 393104 390017 386882
61397 386882 384076 381655 379553 377694 375867 373825 371632 369700 368314 367281 366237 365183 364511 364538 365264
61382 365264 366527 368116 369636 370605 370981 371330 372154 373224 373987 374502 375435 377095 379043 380887 382931 385645
61366 385645 388854 391917 394448 396475 398059 399268 400417 401896 403725 405650 407683 410205 413472 417372
61352 417372 421792 426925 433067 440328 448660 457982 468108 478654 489198 499503 509545 519318 528636
61339 528636 537131 544538 550949 556571 561224 564315 565533 565337 564543 563563 562299 560567 558275 555297 551575
61324 551575 547368 543126 539054 535000 530779 526420 522191 518606 516320 515680 516374 517740 519413 521443 523926
61309 523926 526783 529840 532841 535523 538117 541656 547269 555072 564158 573632 583077 591943 599213 604176
61295 604176 607112 608683 608835 606735 601749 594272 585662 577500 570679 564922 559260 553121 546891 541380
61281 541380 536961 533422 530407 527748 525541 524205 524400 526580 530530 535451 540562 545634 551021 557240
61267 557240 564437 572231 580122 587964 595905 603974 612061 620360 629446 639688 650849 662480 674471
61254 674471 686976 700018 713337 726447 738476 748220 754826 758508 760225 760591 759335 755933 750445
61241 750445 743505 735690 727202 718226 709349 701412 694899 689535 684587 679610 674888 671093 668503 666621
61227 666621 664622 662237 660109 659169 659774 661578 664160 667417 671217 675067 678510 681670 685009 688609 692083
61212 692083 695178 698029 700718 702960 704514 705610 706692 707908 709130 710371 711834 713584 715463 717507
61198 717507 720319 724802 731472 740148 750423 762324 776266 792329 809933 828413 847655 867832
61186 867832 888554 908688 926996 942760 955834 966440 975060 982340 988907 995201 1001253 1006439 1009694
61173 1009694 1010336 1008672 1005473 1000989 994912 987133 977949 967439 955335 941779 927605 913451 898978
61160 898978 883505 867124 850679 834803 819493 804614 790346 777039 764967 754430 745856 739540
61148 739540 735319 732650 731124 730808 731985 734486 737423 739649 740360 739148 735813 730508 723957 717054 710251
61133 710251 703655 697704 693152 690347 689027 689062 690831 694554 699821 706330 714719 726004 740345 756894
61119 756894 774914 794544 816406 840751 867148 894752 922746 950645 978304 1005697 1032827
61108 1032827 1059846 1086953 1113965 1140082 1164343 1186257 1205855 1223222 1238212 1250538 1259931
61097 1259931 1266092 1268558 1266696 1259934 1248235 1232320 1213207 1191432 1166948 1139907 1111241 1082158
61085 1082158 1053249 1024356 995312 966539 938845 912760 888208 864888 842992 823359 806764
61074 806764 793052 781202 770231 759885 750496 742369 735377 729044 723143 718271 715520 715206 716294
61061 716294 717590 719238 722302 727061 732700 738785 746036 755226 766164 778314 791598 805903 820552
61048 820552 835189 850759 868705 889410 912151 936340 961991 989056 1017148 1046087 1076142
61037 1076142 1107521 1140028 1173349 1207390 1242311 1278469 1316288 1355947 1397249 1439951 1484030
61026 1484030 1529501 1576223 1624148 1673408 1723946 1775492 1828299 1883526 1942537 2006272 2075702
61015 2075702 2152390 2238104 2334348 2442877 2566154 2706839 2867587 3052308 3267296 3520651
61005 3520651 3821516 4180955 4612662 5131409 5751184 6485712 7349224 8354413 9510629
60996 9510629 10826203 12308939 13954434 15726020 17545463 19305074 20889056 22188752
60988 22188752 23117570 23639756 23801806 23730110 23577526 23451101 23372936 23291111 23112399 22726929
60978 22726929 22028275 20946625 19487306 17741813 15854393 13967573 12185141 10566728
60970 10566728 9138981 7905903 6855948 5969705 5226665 4607399 4092891 3665185 3309181
60961 3309181 3012718 2765017 2556061 2377410 2222649 2086957 1966759 1859689 1764177 1678981
60951 1678981 1603198 1536255 1477255 1424622 1376896 1333462 1293769 1256166 1218434 1179578 1140480
60940 1140480 1102605 1066520 1031712 997423 963516 930710 899962 871440 844340 817927 792377
60929 792377 768221 745381 723382 702267 682624 664840 648929 634952 622891 612125 601795
60918 601795 591864 583159 576149 570225 564434 558396 552297 546501 541486 537756 535394 533974 533151 533081 533994
60903 533994 535670 537601 539421 540916 541904 542407 542689 542772 542154 540426 538062 536125 535189 534853 534336 533158
60887 533158 531182 528448 525297 522357 519982 517753 514834 510879 506341 501868 497715 493907 490618 487984
60873 487984 485615 482752 479035 474893 471008 467599 464380 461087 457858 455147 453403 452754 452930 453491 454236
60858 454236 455325 457020 459401 462379 465805 469467 473050 476301 479195 481877 484489 487136 489993 493339
60844 493339 497384 501961 506426 509990 512332 513719 514386 514045 512387 509956 507959 507118 507096 507182 506995 506298
60828 506298 504694 502126 499406 497669 497295 497711 498182 498436 498584 498799 499116 499272 498753 497236 495014 492724
60812 492724 490646 488418 485401 481180 475859 470141 464991 460922 457581 454293 450868 447558 444363 440915
60798 440915 437153 433583 430596 427890 424925 421689 418653 416086 413833 411758 410053 408925 408236 407719 407449
60783 407449 407767 408719 409893 411022 412481 414842 417958 420927 423000 424185 424875 425347 425920 427192 429566
60768 429566 432720 436063 439680 444341 450505 457717 465156 472385 479278 485551 490801 494998 498614 502169
60754 502169 505755 509118 512016 514380 516140 517171 517551 517798 518624 520363 522737 525160 527168 528540 529226
60739 529226 529276 528639 526960 523761 518995 513312 507613 502363 497401 492293 486819 481233 476093 471697 467670
60724 467670 463423 459063 455514 453445 452409 451323 449624 447651 446144 445747 446815 449195 452117 454649
60710 454649 456410 457721 459165 461196 464061 467786 472205 477184 482685 488497 494089 499091 503748 508555
60696 508555 513605 518710 524043 530074 536791 543464 549419 554692 559763 564917 570074 574993 579459 583428
60682 583428 587147 591118 595903 601925 609209 617173 624949 632318 640030 648734 657827 666153 673758 682074
60668 682074 692089 703151 714033 724443 734830 745253 755260 764657 773587 781897 789037 794661
60656 794661 798869 801813 803504 804069 803802 802826 801027 798431 795344 792020 788425 784396 779772 774299 767685
60641 767685 759880 751108 741549 731269 720567 710074 700241 690909 681646 672392 663489 655177 647375
60628 647375 640004 633258 627334 622060 617078 612439 608744 606438 605053 603416 600736 597282 593833 590647
60614 590647 587260 583243 578807 574542 570845 567748 565067 562436 559400 555737 551660 547404 542710 537066
60600 537066 530565 524148 518794 514644 511095 507546 503843 500174 496916 494502 493120 492439 491786 490652 488913
60585 488913 486719 484448 482693 481813 481394 480525 478894 477287 476686 477104 477708 477934 478067 478765 480478 483430
60569 483430 487742 493307 499842 507327 516204 526784 538580 550596 562275 573760 585082 595447
60557 595447 603721 609406 612765 614026 612953 609382 603839 597370 590947 585311 581158 579093 579361 581895
60543 581895 586596 593387 602012 612075 623293 635504 648405 661483 674273 686448 697615 707233
60531 707233 714738 719606 721334 719672 714950 707988 699690 690922 682630 675602 670004 665495 661885 659308
60517 659308 657643 656291 654807 653465 652903 653487 655222 657923 661216 664662 668259 672568 678059 684630 692118
60502 692118 701052 712530 727416 745896 767695 792524 820437 851911 887424 926847 969487 1014676
60490 1014676 1061822 1109703 1156206 1199041 1236196 1265491 1284521 1291692 1286853 1270422 1242611 1204252
60478 1204252 1157718 1105998 1051184 994784 939001 886369 838178 794432 755399 721890 693714
60467 693714 669111 646427 625515 606923 590577 575908 562641 550715 539931 530277 522148 515586
60455 515586 509723 503656 497606 492545 488871 486109 483821 482122 481113 480285 478854 476565 473940 471703
60441 471703 470028 468548 467083 466005 465589 465356 464672 463843 463834 464797 465578 465067 463379 461349 459409 457524 455761
60424 455761 454312 453113 451946 450771 449641 448465 447180 445991 445173 444813 444985 445887 447489 449312 450876
60409 450876 452141 453263 454212 454974 455836 457122 458818 460721 462699 464546 465898 466679 467333 468243 469250 470160
60393 470160 471351 473373 476160 479192 482210 485230 488025 490207 491832 493381 495162 497116 499190 501420
60379 501420 503675 505800 507966 510427 512945 514969 516424 517809 519456 521169 522720 524202 525672 526879
60365 526879 527636 528129 528611 529077 529455 529860 530410 531039 531702 532579 533848 535413 537054 538736 540616 542880 545748
60348 545748 549483 554175 559560 565180 570748 576340 582345 589250 597279 606061 614754 622614 629366 634895
60334 634895 638778 640439 639749 637175 633174 627663 620367 611567 602198 593144 584659 576622 569090 562368
60320 562368 556699 552173 548897 546974 546268 546408 547081 548193 549763 551867 554655 558216 562479 567471 573591
60305 573591 581291 590570 601247 613773 629160 647713 668144 688304 706508 721879 733772 741463
60293 741463 744446 742710 736630 726819 714136 699730 684958 671171 659387 650015 642959 637933 634593
60280 634593 632529 631428 631157 631324 630822 628379 623640 617193 609459 600232 589611 578618 568268 558522
60266 558522 548846 539469 531349 525029 520160 516131 512634 509573 506888 504557 502535 500705 499072 497858
60252 497858 497121 496551 495905 495376 495134 494782 493751 492082 490374 489114 488457 488455 488932 489361 489432 489646 490747 492648
60234 492648 494516 495959 497490 499782 503020 507114 511945 517199 522424 527487 532610 537793 542558 546413
60220 546413 549304 551545 553618 556029 558982 562127 564986 567672 570803 574674 578960 583323 587861 592771
60206 592771 597938 603049 607932 612669 617544 622790 628098 632542 635424 637158 638846 641056 643464 645614
60192 645614 647368 648561 648952 648690 648289 647903 647145 645792 644111 642278 640091 637502 634822 632096 628896
60177 628896 625123 621377 618077 614874 611511 608645 607000 606114 604846 602993 601497 601007 601013 600706 600058 599599
60161 599599 599503 599425 599218 599417 600741 603204 605889 607710 608300 608118 607874 608081 608954 610338 611748 612822 613759
60144 613759 615070 616947 619304 622331 626425 631520 637065 642855 649288 656551 664107 671323 678067 684317
60130 684317 689703 693894 696969 698946 699462 698473 696755 695050 693110 690341 687057 684249 682311 680898 679998
60115 679998 680191 681610 683422 684740 685466 685901 686030 685638 684769 683650 682324 680671 678678 676486 674276 672183
60099 672183 670167 667974 665506 663236 661894 661605 661727 661746 661941 662919 664884 667762 671693 676801 682597 688276
60083 688276 693670 699442 706076 713132 719726 725348 729801 732728 733785 733258 731897 729944 726760 721694
60069 721694 714969 707396 699454 691067 682205 673268 664813 657123 650098 643381 636626 629819 623385 617791
60055 617791 613098 609046 605450 602210 599016 595444 591482 587691 584719 582814 581878 581755 582366 583768 586108
60040 586108 589355 593072 596746 600372 604418 609163 614324 619372 623834 627195 628922 628855 627320 624654 620898
60025 620898 616151 610835 605317 599485 593081 586291 579656 573479 567637 561905 556253 550778 545484 540202
60011 540202 534766 529404 524860 521870 520454 519932 519635 519277 518653 517490 515865 514352 513438 513143 513427 514546
59995 514546 516594 519052 521307 523438 526035 529371 533166 536989 540471 543319 545621 548099 551556 555951
59981 555951 560328 563744 565994 567489 568757 570102 571410 572178 571970 570876 569351 567637 565598 563123 560446
59966 560446 558010 556248 555523 556054 557771 560304 563175 565977 568478 570610 572283 573208 573123 572281 571407 570886
59950 570886 570306 569053 567082 564755 562261 559721 557610 556378 555597 554131 551358 547768 544233 541139 538471
59935 538471 536202 534216 532134 529706 527249 525340 524110 523102 521796 520096 518303 516854 516148 516495 518087
59920 518087 520946 524822 529122 533030 535868 537447 538220 539112 541093 544652 549482 554646 559196 562763 565671
59905 565671 568463 571334 573966 575888 576867 577039 576859 577012 578028 579661 580845 580724 579713 579141 579894 581864
59889 581864 584707 588418 592866 597422 601641 605969 611208 617544 624577 632100 640196 648634 656690 663728
59875 663728 669593 674446 678493 681892 684570 686101 686061 684559 682190 679455 676359 672511 667440 661035 653969
59860 653969 647484 642384 638343 634554 630857 627705 625216 622936 620596 618525 617154 616627 617091 618860 622033
59845 622033 626389 631852 638517 645867 652508 657265 660269 662449 664161 664896 664301 662902 661665 661199 661509
59830 661509 662112 662133 660560 656808 651073 644026 636200 627838 619175 610528 602059 593737 585702 578406 572116
59815 572116 566457 560793 555027 549694 545276 541765 538899 536418 533974 531252 528438 526206 524895 524023
59801 524023 522901 521465 520145 519194 518534 518054 517583 516720 515140 513000 510704 508455 506426 505124 504949 505420
59785 505420 505500 504806 503988 503761 504122 504717 505421 506217 506904 507372 507917 508884 510178 511449 512631 513939 515349
59768 515349 516459 517017 517432 518537 520798 523862 526980 529859 532896 536586 540955 545738 550839 556248 561662
59753 561662 566611 571012 575279 579772 584405 588862 593066 597316 602056 607437 612978 617770 621285 623918
59739 623918 626459 629100 631294 632553 632950 632768 632086 631032 630086 629754 630007 630361 630523 630711 631252 632088 632917
59722 632917 633747 635007 636880 638827 640116 640769 641543 642937 644663 646225 647561 648849 650145 651578 653499
59707 653499 656044 658867 661743 665074 669259 673934 678448 682855 687736 693097 698122 702030 704694 706516
59693 706516 708218 710654 714161 718015 720997 722499 722554 721005 717422 711982 705774 700010 695403 692247 690446
59678 690446 689313 687959 686002 683455 680089 675764 671283 667833 665335 662454 658646 655058 652691 650728
59664 650728 647714 643681 639915 637048 634486 631622 628660 626149 624409 623512 623208 622855 622024 621302 621944 624528
59648 624528 628248 631679 633924 634943 635107 634625 633292 630634 626388 620814 614565 608262 602242 596585 591365
59633 591365 586904 583681 581783 580609 579445 578241 577360 576722 575886 574995 574791 575346 575585 574617 572892 571314
59617 571314 569850 567806 565109 562369 559819 557093 554088 551296 549120 547490 546335 545862 546098 546673 547302
59602 547302 548161 549490 551099 552498 553372 553755 553907 554138 554608 555189 555596 555749 555923 556483 557488 558574 559179
59585 559179 558966 558079 556969 555985 555186 554468 553588 552081 549523 546124 542785 540225 538183 535736 532342 528358
59569 528358 524590 521552 519190 517165 515333 513954 513431 513923 515271 517098 518743 519354 518550 517078 516335
59554 516335 517090 518982 521289 523696 526152 528546 530892 533495 536634 540366 544802 550150 556283 562798
59540 562798 569845 578360 589011 601376 614617 628536 643425 659207 675228 690508 703605 712734
59528 712734 716927 717131 715604 714301 714219 715877 719469 724458 729757 734582 738754 742146 744346 744958 743837
59513 743837 740926 736215 729889 722196 713197 702981 691986 680715 669221 657401 645693 634925
59501 634925 625434 616902 609148 602556 597499 593786 590915 588555 586608 585061 583947 583272 582959 583049 583848
59486 583848 585545 587819 590305 593347 597734 603588 610150 616849 624038 632318 641645 651586 662087 673378
59472 673378 685169 696474 706362 714566 721168 725906 728145 727638 725106 721884 719080 717306 717099 719064
59458 719064 723365 729479 736902 745955 757480 771844 788541 806690 825624 845001 864681 884531
59446 884531 904197 923081 940551 955893 967875 974722 974951 968190 955044 936575 914320 890383
59434 890383 866763 844521 823912 805055 787970 772198 757206 743271 731370 722111 715227 710228
59422 710228 707069 706092 707782 712703 721272 733376 748405 765630 784322 803789 823783 844670 866492
59409 866492 887903 906691 921290 931071 935163 932158 921573 905022 885474 865856 848629 835752
59397 835752 828018 824513 823315 822538 820310 814289 802297 783844 760645 735468 710632 687477 666617
59384 666617 648259 632340 618695 607281 598204 591458 586636 583044 580193 578037 576641 575792 575167 574744
59370 574744 574772 575342 576256 577316 578533 580120 582462 585893 590215 594576 598278 601584 605370 610091 615642
59355 615642 622145 630189 640131 651772 664925 679774 696369 714289 733165 753111 774227 796032
59343 796032 817781 839023 859488 878691 896104 911502 924726 935184 942069 945064 944496 940730
59331 940730 933759 923562 910677 896169 880943 865190 848651 831405 814179 797767 782440 768219
59319 768219 755500 744911 736549 729782 723843 718191 712348 706037 699816 695029 692560 691841 691541 691084
59305 691084 691117 692573 695727 700218 705640 711892 719108 727471 737110 748020 759936 772220 783881 793680
59291 793680 800272 802481 799830 792986 783462 772663 761342 750039 739706 731532 726264 723936 724108
59278 724108 726099 729241 733354 739034 747166 758109 771458 786438 802287 818411 834459 850194
59266 850194 865194 878956 891409 902812 912822 920164 923776 923839 921055 915446 906724 895442 882749
59253 882749 869100 854276 838668 823504 809582 796762 784957 774671 766136 758821 752324 747044
59241 747044 743435 741253 740069 739975 741201 743529 746600 750313 754398 758021 760408 761619 762231 762431 761801
59226 761801 759772 755944 750152 742529 733400 723006 711539 699490 687540 676044 665006 654642
59214 654642 645462 637634 630788 624572 618933 613767 608920 604665 601453 599012 596472 593643 591388 590361
59200 590361 590276 590850 592504 595411 598762 601862 605222 609586 614410 618421 621358 624148 627469 631044 634329
59185 634329 637169 639777 642648 646438 651378 656913 662408 667968 674030 680440 686663 692745 699374 706960
59171 706960 715274 723995 733052 742332 751509 760304 768695 776927 785484 794784 804630 814195 822835 830449
59157 830449 836747 840769 841807 840349 837324 832791 826196 817687 808268 798698 789031 779193 769245 759072
59143 759072 748603 738478 729738 722660 716439 710195 703784 697594 692146 687958 685175 683150 680981 678631
59129 678631 677011 676851 678102 680665 684954 691229 698868 706880 714968 723706 733802 745454 758287 771683
59115 771683 785203 798854 812860 827182 841424 855280 868800 882089 894914 906810 917527
59104 917527 927195 935935 943398 948895 952226 954270 956362 958915 960999 961423 959916 956983 953034 948184
59090 948184 942681 937034 931636 926563 921657 916574 910863 904305 897135 889715 882005 873534 863760 852417
59076 852417 839798 826833 814542 803116 791836 780117 768287 757050 746714 737334 729143 722198
59064 722198 715924 709603 703130 696803 690709 684875 679672 675339 671298 666709 661607 656790 652633 648694
59050 648694 644600 640611 637151 634283 631800 629544 627543 626117 625666 626057 626492 626449 626490 627544 629669 632250
59034 632250 635216 639144 644150 649578 655043 661061 668291 676738 685981 695792 706294 717859 730896
59021 730896 745358 760463 775396 790274 805749 821556 836127 847947 856848 863657 868994 872711
59009 872711 874220 873168 869990 865867 861916 858524 855750 854093 854216 856058 858954 862678 867561 873468
58995 873468 879500 885068 890468 895819 900089 901925 901149 898781 895756 892087 887181 880512 871991 862094
58981 862094 851731 841722 832305 823248 814464 806428 799925 795460 793013 792413 793798 797468 803304 810727
58967 810727 819325 829180 840384 852571 865197 877943 890539 902552 913678 923826 932519 938670
58955 938670 941555 941594 939543 935227 927861 917392 904747 890888 876342 861583 847095 833013 819368
58942 819368 806689 795735 786705 779367 773808 770258 768281 767045 766362 766456 766638 765337 761857 757108 752138
58927 752138 746802 740462 733243 725887 718867 712263 706109 700342 694727 689262 684362 680383 677373 675544
58913 675544 675419 677019 679394 681537 683507 686206 690277 695671 702106 709431 717532 726207 735275 744773
58899 744773 755085 766815 780319 795268 810834 826320 841505 856514 871652 887341 903945
58888 903945 921660 940680 961235 983185 1005828 1028408 1050535 1071672 1090623 1106098 1117541
58877 1117541 1124898 1127988 1126780 1121872 1113745 1101891 1085720 1066182 1045360 1024444 1003226 981734
58865 981734 961187 942897 927058 913005 899921 887074 874232 862102 851571 842301 832873 822441
58853 822441 811358 800078 788695 777847 768730 761489 754674 747055 739075 731781 725230 718796 712261
58840 712261 705704 698949 691995 685475 679910 674953 669987 664949 660031 655196 650676 647240 645130 643267
58826 643267 640401 636684 633376 631339 630546 630611 631040 631222 630882 630410 630270 630464 631044 632582 635307 638230 640000
58809 640000 640485 640755 641599 642733 643390 643053 641633 639429 636985 634668 632452 630283 628450 627313 626934 627176
58793 627176 627806 628264 627742 625945 623518 621472 620464 620783 622532 625519 629322 633703 638595 643707 648736
58778 648736 653995 659966 666065 670785 673489 675110 676626 677864 678435 678685 678731 677452 673723 668125 662365
58763 662365 657373 652968 649008 645780 643401 641748 640932 641099 641846 642536 643149 644284 646422 649588 653451
58748 653451 657392 660825 663908 667497 671985 676800 681538 686896 693707 701650 709807 718037 726876 736409
58734 736409 746167 755919 765740 775465 784837 794046 803401 812594 820912 828008 833950 838745 842408 845263
58720 845263 847663 849692 851530 853720 856587 859875 863428 867577 872267 876541 879694 882274 884963 887064
58706 887064 887117 884603 879962 873295 864182 852629 839177 824079 807192 788610 768762 748067 727138
58693 727138 706949 688158 670674 654565 640725 629662 620269 611011 601929 594236 588284 583240 578562
58680 578562 574402 570528 566203 561422 557124 553923 551527 549645 548540 548473 549394 551411 554782 559328 564527
58665 564527 570317 577098 584965 593606 602880 612697 622320 630631 637124 641944 645024 645970 644800 642065
58651 642065 638244 633688 628982 624467 619579 613651 607340 602233 598942 596501 593823 590837 588000 585573
58637 585573 583687 582439 581724 581507 582274 584569 588049 591712 595000 597991 600575 602329 603243 603706 603668 602661
58621 602661 600816 599091 598270 598434 599571 602028 606164 612114 619965 629587 640253 651008 661486 671764
58607 671764 681430 689469 695140 698495 700108 700781 701347 702145 702694 702335 700960 698720 695541 691684 688259
58592 688259 686286 685607 685563 686337 688608 692328 696973 702744 710263 719286 728939 739182 750769 763652
58578 763652 776653 788874 800410 811468 821781 831124 839628 847524 855360 864326 875388 888145
58566 888145 901499 915350 930588 947544 965634 984549 1004631 1025920 1047840 1069920 1091836
58555 1091836 1112688 1131222 1146788 1159155 1167585 1171231 1170349 1165972 1158525 1148034 1135474 1122360
58543 1122360 1108861 1093789 1076687 1058498 1039937 1020672 1000545 980172 959815 938926 917421
58532 917421 896328 876630 858478 841967 827657 815846 806206 798528 792966 789319 786912 785386 784744
58519 784744 784604 784417 784359 784910 785614 785527 784857 784779 785535 786160 786284 786722 787976 789578 791226 793214 795410 797185
58501 797185 798655 800551 802587 803472 802969 802337 802217 801609 799643 796996 794848 793694 793728 795128 797375 799500
58485 799500 801626 805092 810601 817481 825168 834117 844756 856839 870224 884996 900407 914996 928013
58472 928013 939404 948332 953376 954484 952902 948912 941620 931521 921080 911870 903059 893694 884661
58459 884661 877316 871873 868184 866559 866784 867924 870006 874240 880648 887187 892256 896348 900132 902717
58445 902717 903065 901443 898199 892730 885041 876813 869696 863925 859661 857847 858381 859218 858975 858968 861215 865828
58429 865828 871873 879314 888422 898496 908758 919489 931054 942978 955132 968341 982532 995698
58417 995698 1006007 1013467 1018286 1019412 1016337 1010716 1004382 997119 988110 978113 968428 959083 949829 941659
58403 941659 935483 930487 925578 921308 918670 917212 916119 915931 917363 919578 921458 923496 926634 930296
58389 930296 933378 936026 938637 940227 939809 938466 938161 939272 941068 943648 947611 952585 957856 963706 970533
58374 970533 977498 983634 989446 995939 1002900 1009615 1016327 1023600 1031250 1039172 1048084 1058119 1067996 1076960
58360 1076960 1086218 1097047 1108955 1121029 1133486 1146328 1158188 1168138 1176961 1185087 1191261 1195015
58348 1195015 1198340 1202837 1207322 1210520 1213999 1219849 1227439 1235159 1243570 1254010 1265797 1277678 1290554
58335 1290554 1305806 1322357 1338279 1353963 1370810 1388120 1404256 1419686 1435918 1452458 1467605
58324 1467605 1481192 1493834 1504670 1512574 1518486 1523977 1528893 1533002 1538256 1546374 1555853 1564480 1573238
58311 1573238 1584414 1597453 1610309 1623514 1639131 1656788 1674462 1692311 1712166 1734022 1756410
58300 1756410 1779365 1803663 1828056 1850630 1872005 1893978 1916198 1937515 1959217 1983318 2008930
58289 2008930 2033989 2059261 2086784 2115738 2143951 2172251 2203189 2236586 2270513 2305502 2343447
58278 2343447 2383428 2423084 2463155 2506261 2552080 2598236 2645067 2695038 2748286 2803181 2860391
58267 2860391 2921867 2986747 3052854 3121168 3194124 3270671 3347880 3426249 3508402 3593714 3679434
58256 3679434 3765920 3855410 3946754 4036848 4126160 4217470 4310616 4404222 4500958 4604853 4714907
58245 4714907 4827802 4945396 5072729 5210163 5354579 5506895 5670829 5845459 6026916
58236 6026916 6216480 6419174 6635425 6862214 7101332 7357892 7631721 7919136 8222306
58227 8222306 8547741 8896608 9266283 9660319 10086511 10546029 11035438 11558878 12126868
58218 12126868 12743669 13407878 14125279 14908685 15765513 16698916 17721375 18853596 20110368
58209 20110368 21502639 23053935 24799592 26770843 28998266 31532740 34446109 37812752
58201 37812752 41713210 46259027 51593577 57869093 65249329 73936695 84166292 96164719
58193 96164719 110136104 126276899 144751266 165634321 188906051 214457887 241945649
58186 241945649 270491297 298515542 323910469 344398557 357833477 362497932 357573180
58179 357573180 343599329 322463570 296776682 269055794 241210887 214438383 189342228
58172 189342228 166148516 144948132 125847590 108945021 94229559 81563670 70752809
58165 70752809 61591697 53858912 47326259 41796930 37116072 33145151 29753427 26837867
58157 26837867 24326526 22155900 20262947 18600548 17139787 15851445 14700908 13663791
58149 13663791 12729970 11888163 11120519 10415222 9770474 9182541 8641955 8143875 7689901
58140 7689901 7276891 6895279 6540882 6217232 5923712 5651865 5395907 5156661 4932624
58131 4932624 4717221 4508020 4309589 4124298 3948693 3781336 3625659 3482310 3346677
58122 3346677 3216753 3095856 2985077 2880378 2779706 2685822 2599549 2517068 2436491 2360621
58112 2360621 2290701 2223672 2157953 2095875 2038186 1982046 1926646 1874922 1827455 1780406 1731822
58101 1731822 1684554 1640732 1598629 1557149 1518163 1482181 1446704 1411037 1377876 1348169 1319228
58090 1319228 1289969 1263164 1240342 1219119 1197734 1177755 1160122 1142887 1125052 1108460 1093767
58079 1093767 1078514 1061221 1043513 1026412 1008379 988789 969433 950918 931439 910700 891094
58068 891094 873488 855990 838447 823756 812738 802045 789405 776866 766542 757105 747016 737494
58056 737494 729682 722212 714015 706265 699357 691258 681171 671559 664211 657520 649992 643100 638150 633377
58042 633377 626929 619935 614050 608523 602219 596007 590638 584640 576767 568390 561232 554824 548189 541777
58028 541777 535744 528634 519806 510952 503242 495292 485928 476615 469004 462418 455881 450342 446616 443278
58014 443278 438935 434642 431823 429683 426851 423782 421410 419147 416316 413828 412477 411238 409172 407277
58000 407277 406564 406093 404845 403751 403921 404734 405758 408736 415381 424736 434835 445403 456779 467750
57986 467750 476821 484434 491734 498307 503151 506722 509917 512041 511777 509310 505797 501707 497288 493480
57972 493480 490658 487450 482501 476426 470590 465126 459706 454977 451494 448342 444548 440830 438339 436689
57958 436689 434830 432863 431415 430083 428018 425200 421895 417914 413668 410753 410100 410671 411213 412060 413905
57943 413905 416210 418353 421011 424880 429316 433744 439086 446217 454334 462430 471020 480767 490815 500150
57929 500150 509213 518356 526152 531182 534144 536211 536685 534421 530264 525680 520027 511661 500995 490000
57915 490000 479232 467625 454895 442046 429758 418180 407957 399619 392304 384824 377588 371805
57903 371805 367276 362745 357965 353635 349697 345467 341114 337362 334076 330729 327797 326093 325202 324233 323638
57888 323638 324524 326580 328461 329879 331632 333898 336295 339222 343287 347563 350316 351387 352193 353408 354326
57873 354326 354530 354489 354364 353753 352762 352007 351446 350488 349227 348406 348278 348721 350180 353094 356610 359387 361671
57856 361671 365138 370645 377370 384139 390411 396022 401197 406718 412925 418703 422627 424868 426772 428799
57842 428799 430169 430286 429188 426746 422822 418155 413800 409728 405073 399604 393878 388289 383167 379402
57828 379402 377557 376706 375512 374149 373729 374291 375013 376131 378759 382790 386731 389853 392910 396455 400000
57813 400000 403140 406130 408975 411154 412444 412827 411491 407273 400341 392185 383782 374958 365665 356566
57799 356566 348113 340290 333390 327872 323246 318341 312913 307875 303778 300285 297180 294670 292540 290300
57785 290300 288326 287578 288034 288709 289395 290982 293860 297394 301296 306035 311455 316396 320330 324126 328596
57770 328596 333373 337763 341584 344625 346304 346492 345759 344405 342109 338920 335542 332207 328277 323384 318052
57755 318052 312796 307589 302576 298247 294508 290669 286781 283877 282334 281135 279394 277581 276520 276144
57741 276144 276012 276153 276574 276668 276016 275222 275196 276011 277098 278144 279151 279932 280128 279654 278859 278438 279171 281319
57723 281319 284185 286720 288611 290335 292172 293812 294904 295367 295160 294422 293768 293658 293525 292379 290256 288135
57707 288135 286401 284493 282244 280449 279613 279128 278199 276896 275711 274725 273679 272486 271335 270623 270798 271875
57691 271875 273209 274293 275510 277422 279636 281333 282711 284754 287676 290799 294104 298688 305457 314518
57677 314518 326170 341360 360706 384013 411213 442899 479599 521319 568083 619978 676197
57666 676197 734634 792417 845976 890588 921077 933516 925956 898160 852241 793590 729416 665479
57654 665479 604881 549679 501787 461726 428247 400193 377562 360070 346122 334256 324471 317149
57642 317149 311659 307036 303149 300192 297833 295752 294365 294121 294718 295674 296997 298675 300242 301466 302630
57627 302630 303585 303510 302291 301117 300913 301094 300724 299907 299066 297802 295588 292867 290345 287891 285206 282896
57611 282896 281692 281115 280073 278413 276831 275612 274533 273762 273785 274480 275113 275203 274780 273952 272915 272218 272375
57594 272375 273270 274344 275088 274970 273430 270534 267283 264623 262451 260105 257478 255060 253139 251512 249790
57579 249790 247621 244888 241997 239646 238047 236818 235804 235364 235585 235900 235870 235634 235205 234169 232610 231568
57563 231568 231894 233285 234991 236776 238567 239949 240759 241551 242770 244082 245205 246696 249086 251852 254058
57548 254058 255555 256805 258026 259284 260904 263068 265417 267633 269914 272311 274260 275446 276506 278205
57534 278205 280522 283162 286201 289499 292282 294139 295686 297435 298864 299574 300415 302239 304289 305154 304778
57519 304778 304218 303912 303544 303278 303737 304918 306306 307933 310184 312704 314642 315921 317240 318870 320470
57504 320470 321974 323658 325402 326849 328182 329795 331341 332159 332494 333208 334330 335048 335235 335823 337392 339360
57488 339360 340900 341849 342420 342785 343295 344464 346350 348318 349622 349965 349517 348728 348045 347546 347110 347106 348349
57471 348349 350936 353812 356162 358565 361842 365431 368036 369500 370917 373117 376086 379584 383160 385746
57457 385746 386539 386342 387037 389621 393674 398577 404102 409745 414585 418162 420712 422581 424213 426519 430173
57442 430173 434503 438178 441030 444103 447874 451672 455051 458413 461855 464672 466644 468788 472096 476315
57428 476315 480622 484830 489247 493855 498315 502428 506220 509802 513445 517522 522173 527285 532739 538333
57414 538333 543617 548297 552694 557216 561578 565304 568817 573144 578496 584015 589040 593804 598774 604096
57400 604096 609861 616083 622224 627492 631826 635985 640625 645949 652179 659476 667340 675020 682572 690597
57386 690597 698878 706416 713020 719718 727198 734965 742576 750664 759952 769962 779422 787441 793866 799080
57372 799080 803970 809562 816274 823787 831737 839990 848288 856437 864861 874025 883270 891353 898390 906005
57358 906005 915089 924715 933934 943310 953692 964588 975040 985333 996540 1008854 1021545 1034215
57346 1034215 1046999 1059681 1071642 1082780 1093764 1105360 1117963 1131560 1145612 1159177 1171799
57335 1171799 1184135 1197175 1211019 1225019 1238912 1253135 1267930 1282799 1297096 1310882 1324919
57324 1324919 1339940 1355991 1372533 1389161 1406013 1423283 1440575 1457288 1473609 1490556 1508824
57313 1508824 1528038 1547251 1565788 1583482 1600641 1617976 1636182 1655369 1675231 1695645 1716565
57302 1716565 1737453 1757695 1777736 1798927 1821872 1845651 1869044 1891737 1914004 1936057 1958251
57291 1958251 1981146 2004709 2028095 2050852 2073699 2097453 2121821 2145972 2169779 2193750 2218196
57280 2218196 2243228 2269167 2296132 2323492 2350486 2377221 2404463 2432665 2461785 2491762 2522513
57269 2522513 2553699 2585187 2617605 2651762 2687557 2724054 2760630 2797553 2835363 2874164 2913595
57258 2913595 2953160 2992511 3031627 3070712 3109884 3149045 3188103 3227019 3265588 3303607 3341426
57247 3341426 3379826 3419072 3458624 3498101 3537959 3578713 3619939 3660690 3700603 3740049 3779408
57236 3779408 3818744 3858048 3897313 3936426 3975284 4013890 4052115 4089647 4126506 4163372 4201111
57225 4201111 4240170 4280553 4321989 4363907 4405718 4447523 4490191 4534424 4580092 4626672 4673749
57214 4673749 4720752 4766821 4811444 4854764 4896858 4937304 4976005 5013863 5051983 5090672 5129792
57203 5129792 5169524 5210051 5251034 5292334 5334885 5379881 5427237 5475638 5523998 5572102 5619925
57192 5619925 5667196 5713705 5759409 5804107 5847564 5889903 5931401 5971848 6010658 6047598 6082920
57181 6082920 6116795 6149068 6179632 6208675 6236561 6263685 6290269 6316076 6340631 6364061 6387231
57170 6387231 6410500 6432738 6452284 6468664 6482759 6495604 6507731 6519457 6530880 6541604 6551202
57159 6551202 6560086 6569219 6578901 6588432 6597096 6604845 6611906 6618259 6623768 6628402 6632179 6635208 6637728 6639593
57145 6639593 6639567 6635569 6625801 6609422 6586295 6556632 6521100 6480881 6437416 6392243 6347055 6303639
57133 6303639 6263696 6228808 6200301 6178761 6163792 6154502 6149929 6148607 6148089 6145669 6139644 6129527 6115409
57120 6115409 6098021 6079556 6063719 6054485 6054943 6067126 6092148 6130092 6180112 6241149 6312844 6396316
57108 6396316 6494609 6612359 6754622 6926106 7132006 7379528 7678185 8038882 8473755 8997320
57098 8997320 9627260 10383708 11287953 12361675 13626196 15101142 16802922 18743634 20930035
57089 20930035 23362505 26034903 28935521 32047614 35348218 38806129 42379539 46009989
57081 46009989 49608800 53041036 56123339 58650078 60442044 61390868 61473252 60732705 59248986
57072 59248986 57116198 54435118 51313026 47863814 44205318 40453456 36714471 33078574
57064 33078574 29617374 26384134 23414460 20727114 18325977 16202988 14341155 12717723
57056 12717723 11307635 10086080 9029204 8114294 7320801 6631174 6030193 5503969 5040516
57047 5040516 4630881 4268567 3947658 3662188 3407139 3179058 2975303 2793168 2629851
57038 2629851 2482798 2350102 2230912 2125249 2032871 1952374 1881890 1820503 1768452 1726174
57028 1726174 1693738 1671223 1659126 1658203 1668674 1688857 1714260 1738879 1757967 1768613 1766959 1746499
57016 1746499 1701451 1631962 1544740 1448702 1351106 1257010 1169711 1090392 1018560 953765 896386
57005 896386 846554 803470 766257 734498 707390 683386 661380 641555 624460 609847 596884
56994 596884 584875 573339 561995 551159 541679 534137 528594 525214 524371 525901 528940 532813 537304
56981 537304 541819 545135 546272 544814 540103 531217 518415 503647 488925 474887 461502 449231 438631
56968 438631 429600 421999 416398 413336 412407 413084 415944 421980 430978 441686 453455 466567 480740 494350
56954 494350 505527 513310 517170 516040 508669 495074 477169 457655 438410 420100 403135 388391
56942 388391 376741 368375 363099 360992 362112 365800 371150 378253 388227 401850 418827 438486 460236
56929 460236 482774 503482 519301 527973 528363 520250 504434 482727 457361 430421 403842 379295
56917 379295 357641 338764 322170 307472 294255 282026 270581 260115 250802 242729 236218 231624
56905 231624 228641 226468 224817 224104 224447 225200 225859 226744 228398 230982 234633 239701 246172 253501 261542
56890 261542 271096 283061 297517 313981 331967 350853 369774 387988 404721 418419 427079 429950
56878 429950 428170 423264 415851 406471 396665 388172 381717 377517 376369 379198 385941 395950 409227 426342
56864 426342 447425 472241 501061 534436 571980 612062 652629 691562 726119 752810 768320
56853 768320 770674 759883 737974 708367 674846 640950 609911 584291 565280 552966 547578 549813
56841 549813 559661 576012 598260 627457 664989 710791 763746 822949 887044 952643 1014696 1068376
56829 1068376 1109478 1133358 1135415 1113785 1071261 1014195 949662 883345 819064 759532 707244
56818 707244 664370 631735 608628 594087 587954 590247 600347 617636 642307 674456 712666 754398
56806 754398 797309 839080 876285 904666 920624 921733 906420 874722 829632 776463 720427 665281
56794 665281 613788 567935 528315 494525 466734 446002 432758 425987 424425 427742 436013 448785
56782 448785 465199 484431 505443 526715 546526 563036 573807 575961 567515 548603 521345 488820
56770 488820 454062 419294 385686 353963 325093 299925 278358 259614 243329 229660 218294
56759 218294 208312 199282 191644 185630 180560 175682 171072 167196 164062 161305 158714 156269 154016 152210
56745 152210 151208 150900 150629 149926 148942 147913 146703 145186 143681 142550 141734 141044 140689 141067 142182 143549
56729 143549 144606 145083 145089 144989 145090 145421 145880 146535 147528 148790 150141 151594 153154 154412 154822 154479 154234
56712 154234 154880 156455 158358 159903 160804 161390 162331 163931 165803 167446 168814 169972 170603 170423 169868 169712
56696 169712 170164 170861 171513 171918 171607 170298 168581 167302 166348 164928 163087 161987 162391 163673 164648 164796
56680 164796 164413 164064 164130 164482 164536 164035 163604 163971 164836 165266 164982 164369 163349 161431 158984 157296 157015 157497
56662 157497 158034 158695 159560 160184 160434 160965 162129 163171 163251 162675 162497 163315 164978 166980 168667 169515 169653
56645 169653 169695 169844 169719 169353 169594 170998 173003 174731 176084 177469 178941 180158 180887 181163 181226 181527 182365
56628 182365 183435 184263 185107 186602 188374 189092 188307 187183 186872 187173 187544 188364 190110 192113 193312 193797
56612 193797 194455 195401 195854 195462 194818 194610 194973 195759 196807 197861 198617 198894 198582 197646 196393 195425 194998 194740
56594 194740 194268 193729 193431 193374 193477 193777 194062 193808 192895 191945 191502 191385 191238 191195 191488 191908 192124 192102 191853 191318
56574 191318 190924 191635 193905 197125 200555 204120 207820 211231 214325 218019 223032 228851 234698 240910 248371
56559 248371 257156 266754 277151 288584 300534 311977 322411 331713 339346 344882 349173 353861 359576
56546 359576 365474 370520 374340 376797 377731 377452 376717 375881 374454 371681 367213 361284 354557 347715 340861
56531 340861 333536 325564 317461 309600 301613 293311 285543 279228 273987 268730 263231 258036 253084 247724
56517 247724 242091 237258 233712 230715 227533 224422 221936 219956 217864 215316 212517 210078 208633 208243
56503 208243 208118 207374 206002 204693 203825 203156 202397 201497 200417 199236 198417 198390 198914 199369 199595 199886 200318 200719
56485 200719 201153 201707 201901 201058 199284 197391 195897 194787 194190 194394 195068 195281 194571 193425 192544 192198 192396
56468 192396 193072 193968 194868 196042 197887 200124 201942 202998 203640 204117 204263 204103 204054 204280 204446 204361 204359 204811
56450 204811 205681 206753 207821 208608 208865 208640 208059 206969 205368 204099 204387 206454 209167 211222 212196 212378
56434 212378 212172 211887 211653 211295 210588 209719 209192 209240 209671 210228 210798 211347 211974 212842 213761 214223 214239 214637 215816
56415 215816 216783 216382 215151 214824 216073 217819 218806 218811 218151 217068 216018 215662 216176 217104 218149 219454 220987
56398 220987 222355 223431 224516 225718 226830 227958 229545 231618 233662 235352 236736 237718 238167 238583 239749
56383 239749 241600 243355 244855 246705 248823 250121 250185 250204 251439 253551 255255 255987 256151 256293 256784 257928
56367 257928 259596 261010 261431 260971 260326 260015 260229 261095 262575 264177 265164 265057 263900 262215 260804 260324
56351 260324 260902 262170 263607 264726 265306 265776 267028 269337 271735 273049 273260 273207 273327 273577 274268 275857
56335 275857 277881 279224 279653 280183 281701 284044 286649 289249 291721 294041 296631 300013 303935 307524 310375
56320 310375 312741 314640 315721 316068 316144 315827 314546 312576 311137 310925 311554 312726 314789 317736 320763 323410
56304 323410 326142 329294 332374 335012 337707 341061 345033 349383 353995 358301 361304 362755 363530 364380 365174
56289 365174 365811 366858 368587 370268 371189 371745 372877 375002 377978 381556 385419 389328 393485 398111 402630
56274 402630 406256 409489 413962 420481 428329 436703 445516 454438 462675 470401 479033 489301 500389 511740
56260 511740 524291 538890 554925 571733 590125 611136 634328 658808 685153 714845 748362
56249 748362 785095 824689 867365 913318 962776 1016181 1073363 1132891 1193016 1252782 1311556
56238 1311556 1368112 1420942 1468866 1510789 1545631 1573127 1593718 1606930 1610914 1604483 1588591 1564938
56226 1564938 1534360 1497721 1457068 1414216 1369006 1320596 1269883 1219141 1169716 1121568 1074692
56215 1074692 1029553 986279 944755 905513 869455 836711 806627 778707 752858 728973 707031
56204 707031 687337 670001 654511 640294 627248 615257 603940 593376 584306 577041 571057 566258
56192 566258 563407 562512 562005 560570 558695 557364 556439 555581 555570 557190 559677 561742 563334 565043 566657 567788
56176 567788 569118 571469 574252 576294 577635 579165 581128 583374 586433 590958 596582 602579 609005 616036
56162 616036 623006 629421 636154 644350 653983 664716 677041 691037 705185 718242 731434 746987
56150 746987 765335 785611 807974 833452 862164 893805 929364 970435 1017333 1069831 1129252
56139 1129252 1197840 1276380 1364302 1461594 1568588 1684028 1805179 1929555 2054803 2177275
56129 2177275 2292543 2397282 2489482 2567870 2633057 2688393 2737375 2780386 2815569 2841915 2859295
56118 2859295 2866326 2860961 2843104 2814541 2776666 2730355 2677358 2619018 2553648 2477590 2389105 2289458
56106 2289458 2180867 2065933 1948898 1834780 1726852 1626782 1536754 1459115 1394025 1339712
56096 1339712 1294869 1258710 1229274 1204345 1183805 1168626 1157837 1149119 1142050 1137994 1136956 1137355
56084 1137355 1138753 1141933 1146361 1150509 1154752 1161029 1169494 1178371 1187228 1197435 1209267 1221484 1233947
56071 1233947 1247631 1261991 1275431 1288572 1303861 1321680 1340017 1358184 1377445 1397716 1417196
56060 1417196 1435849 1455709 1477105 1498074 1518189 1539341 1561904 1583762 1604156 1624911 1646783
56049 1646783 1668104 1688274 1709168 1731856 1755163 1778609 1803554 1830398 1857942 1886401 1917649
56038 1917649 1951580 1985800 2019822 2055877 2094721 2134560 2175105 2218545 2265282 2312860 2360432
56027 2360432 2410157 2462830 2516459 2570623 2627794 2688723 2751053 2814243 2881222 2953191 3027489
56016 3027489 3102735 3181412 3265018 3351337 3439034 3530402 3627020 3727125 3829839 3937529 4051548
56005 4051548 4170148 4292954 4422774 4560636 4703985 4852188 5008651 5174977 5348520
55996 5348520 5528415 5718475 5921248 6134992 6359472 6598723 6854908 7125627 7410650
55987 7410650 7715024 8042202 8390782 8761467 9160096 9590059 10049240 10538640 11066317
55978 11066317 11638628 12255911 12921523 13646542 14440640 15307652 16255817 17303016 18466440
55969 18466440 19757732 21194998 22809203 24632908 26695889 29040897 31732715 34845715
55961 34845715 38459048 42675442 47631211 53479335 60381353 68527310 78141238 89447675
55953 89447675 102645747 117918538 135426952 155264464 177437845 201876553 228321834
55946 228321834 256028596 283516397 308668979 329132869 342700195 347577564 342744953
55939 342744953 328427603 306282081 278955897 249252292 219471019 191201915 165398602
55932 165398602 142499113 122558294 105412832 90813129 78470355 68071078 59314543
55925 59314543 51943784 45736561 40489511 36029392 32224555 28968925 26164714 23730170
55917 23730170 21609025 19757677 18131389 16691642 15415078 14283536 13273251 12362446
55909 12362446 11540472 10800119 10128365 9512657 8948666 8433759 7959550 7518134 7108996
55900 7108996 6732672 6383800 6057027 5753480 5474691 5215955 4972159 4744562 4535427
55891 4535427 4341260 4157733 3986358 3829961 3685998 3550340 3423580 3307787 3200937
55882 3200937 3100076 3006395 2921796 2843854 2769144 2698167 2632022 2567509 2500513 2431326 2362116
55871 2362116 2292095 2219757 2146996 2076520 2007706 1939187 1872906 1811427 1753776 1697961 1645136
55860 1645136 1597309 1553311 1510911 1470648 1433803 1398894 1363968 1330228 1299679 1271197 1242482
55849 1242482 1213937 1187166 1161506 1135419 1109483 1084841 1060552 1035529 1011127 988867 967642
55838 967642 946128 925668 907591 890042 870960 852141 836778 824718 813583 802802 793121 783722
55826 783722 773336 762889 753858 745319 735618 725464 716322 707303 696763 685472 675040 664783
55814 664783 653436 642446 634119 627725 620901 613799 608456 605060 602311 600668 601716 604841 607817 610381
55800 610381 614197 619630 625456 631398 638115 644855 649803 652502 653595 652647 648666 642244 634737 625872
55786 625872 614641 602013 590254 580072 570739 562329 555187 547827 538119 526326 514511 503390
55774 503390 492262 481582 472988 467015 463226 462137 464455 468668 472013 473604 474185 473183 468841 461225
55760 461225 452397 443355 433312 422168 411225 401151 391519 382662 375764 370833 366647 362923 360473
55747 360473 359048 357146 354224 351049 347716 343370 338172 333499 329856 326434 322983 320258 318392 316660
55733 316660 314975 313784 312423 309596 305619 302193 299748 297051 293692 290765 288620 286001 282141 277938
55719 277938 274362 271337 268803 267279 266769 266444 265875 265381 265043 264809 265564 268433 272848 276928 279858 282200
55703 282200 283868 283860 282269 280498 278949 276415 272283 267475 262656 257410 251921 247511 244584 241822 238405
55688 238405 235401 233925 233475 233217 233555 235169 237607 239996 242318 245029 248119 251304 254493 257461 259760
55673 259760 261283 262262 262528 261771 260539 259803 259371 258008 255468 253048 251740 251126 250639 250647 251653 253519 255984
55656 255984 258929 261747 263590 264671 266207 268711 271501 274167 277127 280273 282408 282732 281674 279689
55642 279689 276410 271631 265990 260052 253722 247045 240461 233871 226680 219273 213149 208929 205458 201522
55628 201522 197248 193226 189546 186429 184482 183471 182018 179434 176718 174898 173578 172014 170455 169337
55614 169337 168183 166468 164680 163386 162057 159957 157551 155893 155120 154495 153523 152189 150518 148715 147334
55599 147334 146685 146405 146089 145769 145340 144293 142627 141306 141080 141434 141360 140591 139492 138376 137599 137713 138776
55582 138776 139915 140215 139700 139020 138575 138334 138058 137466 136652 136502 137938 140610 143132 144838 146384 148318
55566 148318 150146 151291 151932 152322 152258 151894 152065 153106 154145 154286 153660 152720 151423 149846 148679 148318 148201
55549 148201 147789 147388 147308 147109 146456 145886 145887 146055 146020 146336 147542 149090 150187 150936 151749 152384 152621 153129 154518
55530 154518 156101 156762 156596 156591 157079 157532 157542 156942 155359 152675 149710 147460 145820 143939 141574 139198 136980
55513 136980 134627 132125 129761 127433 124711 121579 118507 115825 113592 111931 110976 110575 110505 110764 111306 111828
55497 111828 112282 113155 114697 116295 117224 117617 118103 118844 119517 119875 119756 118974 117890 117643 119039 121450 123461
55480 123461 124348 124352 123885 123205 122637 122354 122018 121165 119827 118397 117132 116099 115239 114175 112519 110772 110270
55463 110270 111608 113738 115254 115971 116518 117022 117066 116543 115678 114589 113571 113356 114253 115451 115980 115935 115882 115617
55445 115617 114625 113451 113377 114754 116682 118328 119677 120926 122006 122844 123392 123307 122220 120366 118463 117008
55429 117008 116149 115999 116470 117009 117150 117171 117581 118166 118221 117545 116571 115706 115191 115291 115904 116252 115790 115174 115421
55410 115421 116312 116612 115846 114849 114460 114645 115183 116228 117710 118834 118755 117411 115339 112984 110468 107832
55394 107832 105297 103337 102420 102535 103135 103743 104405 105279 106132 106650 106982 107461 108018 108326 108379 108491 108835 109352
55376 109352 109895 110194 109939 109264 108726 108445 107723 106049 104021 102695 102393 102750 103488 104416 105036 104909 104255 103620
55358 103620 103260 103335 104224 105913 107554 108396 108702 108964 108778 107579 106046 105548 106354 107553 108630 109933 111515
55341 111515 112709 113136 113125 112839 111894 110208 108401 106994 105878 104918 104473 104950 106289 108092 109895 111227
55325 111227 111850 111989 111944 111534 110442 108995 107980 107714 107856 108108 108486 108954 109341 109644 109879 109778 109189 108632
55307 108632 108774 109442 109801 109409 108494 107342 106141 105317 105241 105619 105858 106017 106705 108145 109987 111897 113615
55290 113615 114630 114687 114436 114643 114926 114301 112934 112138 112435 112752 111934 110113 108141 106472 105148 104282 104095
55273 104095 104759 106326 108445 110258 111138 111409 111693 111843 111352 110570 110389 110771 110744 109989 109313 109272 109450 109458 109661
55254 109661 110415 111471 112497 113424 114007 113910 113510 113652 114289 114328 113271 112056 111739 112232 112896 113536 114233 114889
55236 114889 115479 116152 116715 116728 116369 116357 116653 116293 115007 114009 114436 115877 117140 117646 117340 116120 114287 112892
55218 112892 112667 113087 113208 112961 112864 113035 113242 113466 113631 113224 112019 110813 110678 111729 113275 114789 116070
55201 116070 116813 116836 116577 116681 117236 117889 118479 119002 119217 118932 118489 118425 118741 118966 118822 118424 118010 117793 117892 118124
55181 118124 118145 118028 118287 119032 119598 119473 119095 119185 119666 119832 119328 118395 117389 116559 116150 116286 116841 117692 118867
55162 118867 120234 121360 121932 121999 121557 120449 118991 118124 118421 119344 119979 120104 120092 120162 120234 120256 120208 120050 119944
55143 119944 120168 120535 120409 119680 119102 119183 119320 118647 117233 115824 114885 114511 114792 115530 115988 115688 115154 115166 115573
55124 115573 115632 115274 115242 116022 117332 118621 119505 119843 119912 120383 121564 122832 123301 122865 122058 121154 120083 119123
55106 119123 118871 119434 120229 120731 121010 121452 122344 123766 125617 127654 129663 131559 133263 134684 135875 136871
55090 136871 137360 137028 136431 136744 138267 139856 140341 139800 138826 137350 135211 133280 132764 133531 134185 133817 132786
55073 132786 131764 130916 130209 129725 129335 128620 127349 125765 124288 123264 122932 123232 123748 124137 124492 124953 125302
55056 125302 125422 125723 126473 127014 126446 124864 123200 121986 121068 120387 120123 120066 119775 119527 120219 122047 123981
55039 123981 124941 124900 124526 124321 124447 124955 125751 126619 127495 128442 129296 129774 130056 130779 132185 133683 134510 134498 133883
55020 133883 132717 130893 128612 126447 124883 123939 123313 122782 122406 122345 122642 123232 124022 124730 124825 124039 122885
55003 122885 122171 121997 121823 121604 122055 123472 125123 126358 127523 129058 130424 130910 131011 131900 133731 135485
54987 135485 136409 136707 136840 136990 137281 137737 138023 137913 137983 139036 140841 142281 142839 143123 143815 144954 146498
54970 146498 148648 151160 153006 153323 152324 150943 149880 149216 148626 147739 146590 145790 145921 146799 147714 148377 149107
54953 149107 150101 151088 151756 152052 152028 151881 152103 152952 153826 153791 152802 151692 150910 150105 149123 148547 148814 149483 149869
54934 149869 149898 149977 150458 151535 153180 154914 156133 156924 158103 160205 163069 166681 171672 178416 186135 193558
54918 193558 200162 206303 212441 218724 225037 230905 235464 237943 238145 236251 232394 226768 219980 212927
54904 212927 206277 200178 194400 188685 183084 177971 173594 169764 166291 163571 162213 162058 162084 161431 160053
54889 160053 158348 156757 155848 156113 157369 158933 160669 163203 166777 170691 174485 178970 185165 192647 199898
54874 199898 206113 211778 217461 222911 227580 231250 233713 234363 232700 229064 224426 219505 214364 208793
54860 208793 202754 196388 189926 183779 178423 173876 169427 164343 158869 154149 150971 149008 147427 145819
54846 145819 144184 142474 140694 139228 138489 138357 138434 138716 139521 140830 142215 143418 144512 145422 145799 145409
54830 145409 144362 142945 141528 140489 139829 139047 137844 136768 136559 137065 137495 137680 138253 139477 140711 141265
54814 141265 141182 140924 140810 140997 141511 142098 142429 142496 142420 142046 141371 141181 142338 144382 145883 146345 146714 147672 148566
54795 148566 148658 148407 148646 149209 149303 148744 147989 147348 146895 146870 147466 148440 149440 150461 151550 152474 153174 154116 155637
54776 155637 157387 159008 160917 163653 166763 169243 171012 173183 176835 182097 188487 195559 203041 210716
54762 210716 218352 225603 232084 237668 242506 246511 249095 249729 248450 245450 240533 233577 225291 216878
54748 216878 208967 201427 194284 188201 183791 180798 178329 175815 173509 171958 171086 170068 168319 166393
54734 166393 165460 165929 167048 167944 168531 169215 170299 172025 174719 178427 182718 187238 192169 197766 203767
54719 203767 209643 215159 220251 224673 228208 230995 233190 234437 234061 231702 227516 221930 215518 208872
54705 208872 202277 195650 188995 182685 177076 172170 167953 164701 162613 161404 160590 159882 159075 157953 156699
54690 156699 156028 156423 157458 158190 158006 156835 154984 153117 151948 151471 150900 149803 148850 148916 149941 151247
54674 151247 152522 153724 154423 154210 153561 153361 153547 153037 151214 148830 147190 146903 147583 148387 148638 148303 147969
54657 147969 148228 149060 150012 150775 151316 151613 151612 151331 150728 149712 148587 148182 149056 150759 152324 153263 153639 153439
54639 153439 152576 151413 150663 150669 151119 151503 151501 151052 150449 150252 150777 151735 152672 153489 154161 154244 153295 151620 150075
54620 150075 149171 148828 148877 149260 149761 150033 149974 149767 149632 149759 150287 151042 151548 151644 151765 152252 152755 152799 152515 152255
54600 152255 151919 151331 150905 151134 151722 152006 152037 152379 153037 153411 153238 152785 152276 151958 152504 154295 156332 156958
54582 156958 155864 154393 153705 153646 153744 154238 155540 157358 158959 159827 159780 158934 157876 157303 157303 157432 157571 158011
54564 158011 158620 158727 158109 157305 156680 155951 154972 154150 153673 153116 152320 151843 151987 152202 152146 152558 154160 156253
54546 156253 157409 157303 156961 157319 158332 159466 160406 161154 161881 162777 163750 164440 164745 165136 166073 167366 168551
54529 168551 169617 170858 172170 173089 173511 173852 174428 175102 175688 176303 177090 177859 178268 178259 178087 177887 177417 176392
54511 176392 175010 173844 173109 172336 171046 169532 168581 168490 168819 169062 169104 168961 168520 167750 166820 165894 165082 164627
54493 164627 164781 165399 166046 166587 167248 168025 168535 168634 168705 169091 169663 170183 170725 171457 172392 173517 174808 175927
54475 175927 176401 176314 176318 176628 176595 175740 174664 174355 174962 175923 176979 178356 180006 181422 182346 183096 183953 184637
54457 184637 184735 184418 184382 185008 185757 185656 184432 182995 182548 183372 184690 185628 185895 185604 184939 184204 183740 183568
54439 183568 183376 183042 182845 182924 182895 182279 181069 179673 178543 178006 178140 178553 178602 178113 177646 177836 178715 179855
54421 179855 180863 181529 181802 181929 182311 182945 183304 183084 182808 183279 184589 186025 186823 186754 186092 185277 184580 183955
54403 183955 183224 182472 182037 182075 182430 183036 184098 185627 187132 188065 188370 188420 188611 189216 190362 191868 193284
54386 193284 194269 194778 194830 194394 193673 193155 193130 193348 193302 192665 191406 189850 188666 188351 188563 188428 187676 186957 186837
54367 186837 187048 187093 187044 187315 188105 189447 191292 193041 193543 192286 190248 188967 188959 189620 190342 191040 191732 192289
54349 192289 192701 193048 193191 192883 192202 191476 190839 190132 189202 188011 186559 185008 183731 182958 182525 182227 182149 182370
54331 182370 182595 182481 182060 181510 180810 180075 179894 180757 182313 183717 184561 184952 184912 184336 183431 182639 182095 181695
54313 181695 181589 182040 182858 183591 184291 185442 187062 188488 189282 189735 190144 190129 189170 187526 186114 185540 185576 185651
54295 185651 185604 185842 186837 188626 190826 192935 194479 195063 194717 194161 194257 194996 195448 194910 193673 192451 191545
54278 191545 190928 190635 190517 190005 188683 186880 185237 184001 183184 183006 183525 184165 184318 184182 184335 184673 184590 184061
54260 184061 183696 183712 183748 183829 184626 186382 188260 189234 189165 188663 188244 187959 187583 186921 186114 185684 185988 186633 186840
54241 186840 186407 185870 185671 185651 185483 185091 184393 183147 181420 179870 179186 179422 180073 180644 180948 181046 181105 181241 181408
54222 181408 181471 181346 180985 180304 179401 178749 178853 179689 180632 180953 180275 178770 177155 176237 176166 176326 176228 176139 176426
54203 176426 176709 176354 175550 175105 175329 175813 176203 176468 176490 176222 176243 177246 178896 180119 180669 181418 182790 183984
54185 183984 184273 184096 184120 184069 183355 182296 181779 182012 182385 182371 181913 181131 180261 179735 179750 179845 179343 178129 176612
54166 176612 175135 173839 172888 172375 172041 171550 170955 170587 170626 171048 171791 172652 173333 173948 175180 177385 179801
54149 179801 181265 181616 181769 182382 183102 183278 182909 182588 182817 183661 184863 186088 187121 187953 188650 189240 189766
54132 189766 190254 190440 189781 188116 186160 184932 184679 184841 185053 185634 186882 188343 189261 189484 189490 189630 189764 189748
54114 189748 189863 190488 191553 192621 193413 193961 194197 193780 192613 191323 190847 191518 192784 193812 194206 194140 194059
54097 194059 194311 194871 195297 195069 194005 192277 190223 188369 187423 187742 188792 189637 190150 191206 193361 195842
54081 195842 197351 197583 197328 197191 196892 196043 195139 195277 196943 199355 201185 201830 201860 202235 203274 204519 205393
54064 205393 205660 205299 204380 203286 202726 203183 204406 205613 206203 206148 205837 205688 205882 206399 207271 208710 210840
54047 210840 213358 215731 217801 219942 222567 225792 229628 234134 239107 244007 248551 253185 258524 264472
54033 264472 270307 275671 281047 287109 293872 300675 306832 312104 316676 320897 325051 329177 332927 335699
54019 335699 337107 337321 336850 335973 334604 332726 330612 328405 325789 322458 318664 314815 310702 305691 299760
54004 299760 293712 288201 283029 277725 272378 267500 263368 259868 256806 253964 251021 247797 244602 242127
53990 242127 240891 240854 241423 241770 241342 240293 239364 239163 239587 239936 239494 237986 235731 233482 231939 231308 231417
53973 231417 232142 233405 234746 235379 234921 233793 232707 232074 232069 232803 234024 234980 235076 234607 234525 235550 237746 240728
53955 240728 243952 246911 249461 252011 255224 259550 265140 272011 280063 289094 299084 310345 323154 337377
53941 337377 352702 369067 386495 404491 421862 437121 448930 456370 459145 457724 453165 446755
53929 446755 439637 432427 425034 417181 409288 402532 397744 394638 392524 391419 391841 393773 396521 399644
53915 399644 403353 407846 412847 418081 423762 430192 437124 443897 450063 455566 460326 463924 465858 466006
53901 466006 464700 462321 458947 454590 449710 445096 441059 437056 432377 426950 421078 414652 407206 398768
53887 398768 390101 381908 374190 366530 358704 350767 342874 335334 328594 322833 317676 312569 307441 302715
53873 302715 298698 295252 292146 289422 287174 285087 282606 279596 276508 273705 270899 267635 264158 261288
53859 261288 259361 257764 255724 253222 250875 249202 248304 247987 247841 247396 246576 245865 245683 245788 245706 245577 246029
53842 246029 247128 248070 248116 247403 246551 245874 245354 245111 245409 246179 246918 247158 246814 246026 244926 243727 242816 242464
53824 242464 242449 242250 241694 241190 241185 241647 242274 243027 244054 245196 246096 246912 248420 251049 254126 256543 258051
53807 258051 259521 261928 265423 269488 273709 278197 283336 289278 295739 302278 308699 315035 321246 327109
53793 327109 332462 337309 341593 345089 347671 349547 351057 352415 353750 355178 356614 357680 358013 357539 356294
53778 356294 354245 351516 348543 345612 342442 338662 334697 331701 330538 331096 332722 335069 338342 342938
53764 342938 349051 356660 365828 376876 389997 404490 418513 429883 437142 439746 437453 430020 417658
53751 417658 401511 383357 364845 347054 330645 316161 303997 294098 285886 278723 272475 267462
53739 267462 263873 261399 259516 257939 256665 255734 255096 254648 254317 254180 254514 255554 257186 259040 260860 262547
53723 262547 263932 264875 265625 266614 267774 268570 268928 269550 270887 272383 273287 273825 274840 276503 278177 279564
53707 279564 281310 284250 288463 293270 297862 301861 305450 309041 312700 316070 319042 322081 325476 328557
53693 328557 330374 331077 331953 333956 336775 339533 341821 343727 345277 346349 346927 347169 347238 347215 347072 346701 346151
53676 346151 345896 346610 348584 351544 355101 359079 363291 367300 370686 373460 375981 378448 380578 381820 381877
53661 381877 380921 379211 376548 372406 366717 360338 354479 349783 346112 342965 339864 336585 333387 330917
53647 330917 329485 328537 327236 325484 323972 323231 323082 323110 323271 323810 324809 326025 327089 327852 328545 329524 330793
53630 330793 331984 332964 334175 336035 338256 340186 341653 343082 344905 347295 350335 353964 357808 361514
53616 361514 365205 369160 373220 377014 380715 384884 389559 394147 398385 402736 407569 412442 416544 419509
53602 419509 421591 423395 425612 428607 432035 435109 437335 438716 439311 439189 438876 439235 440517 442016 442919
53587 442919 443066 442607 441435 439410 436836 434269 432071 430390 429264 428444 427329 425417 422665 419327 415776
53572 415776 412662 410739 410095 409893 409287 408336 407628 407271 406835 406178 405733 405821 406066 405828 405034 404325 404296 404817 405302
53553 405302 405532 405835 406364 406741 406827 407415 409482 412924 416671 419969 422855 425479 427839 430378 433964 438891
53537 438891 444541 450393 456674 463585 470650 477454 484436 492264 500901 509998 519781 530798 543006 555864
53523 555864 569208 583343 598341 613847 629653 645978 663154 681384 700753 721116 742100
53512 742100 763631 786338 810966 837456 865059 893283 922215 951932 982118 1012414 1042668
53501 1042668 1072695 1102173 1131029 1159630 1188378 1217273 1246027 1274394 1302151 1328830 1353705
53490 1353705 1376233 1396548 1415517 1434188 1453122 1472222 1491129 1509601 1527574 1545136 1562562
53479 1562562 1580156 1597877 1615223 1631558 1646439 1659683 1671349 1681661 1690626 1697646 1701888 1703131
53467 1703131 1701865 1698411 1692446 1683699 1672613 1659879 1645611 1629598 1612145 1594150 1576240 1558192
53455 1558192 1539310 1519179 1498030 1476444 1454705 1432534 1409579 1386080 1362664 1339535 1316406
53444 1316406 1293308 1270873 1249536 1229114 1209629 1191954 1177011 1164621 1153729 1143584 1134264
53433 1134264 1126338 1120526 1117397 1116835 1117932 1119890 1122813 1127217 1133076 1139979 1147973 1157557 1168967 1182122
53419 1182122 1197177 1214402 1233471 1253594 1274544 1296999 1321662 1348516 1377115 1407170 1438607
53408 1438607 1471428 1505760 1541840 1579813 1619700 1661615 1705768 1752298 1801323 1853044 1907447
53397 1907447 1963967 2021842 2080821 2141188 2203085 2266202 2330146 2394682 2459521 2524215 2588410
53386 2588410 2651894 2714273 2774849 2832979 2888369 2940970 2990705 3037342 3080459 3119568 3154413
53375 3154413 3185137 3212044 3235273 3254726 3270084 3280788 3286331 3286763 3282414 3272812 3256325 3231445
53363 3231445 3198126 3157370 3109985 3056579 2998530 2937890 2876029 2812980 2748346 2682363 2615990
53352 2615990 2550510 2487217 2426983 2369788 2314887 2261441 2208755 2156138 2103184 2050218 1997949
53341 1997949 1946617 1896018 1846345 1798398 1752801 1709571 1668563 1629788 1593184 1558698 1526776
53330 1526776 1498159 1472916 1450249 1429396 1410120 1392068 1374435 1356765 1339522 1323308 1308089
53319 1308089 1293667 1280390 1268665 1258127 1247994 1238147 1229326 1222353 1217664 1215424 1215544 1217569 1220935
53306 1220935 1225387 1230883 1237184 1243991 1251524 1260630 1272150 1286286 1302649 1320824 1340838 1363102
53294 1363102 1387869 1414773 1443012 1471974 1501515 1531673 1562340 1593234 1623913 1653765 1682263
53283 1682263 1709268 1734833 1758660 1780122 1798946 1815452 1829944 1842204 1851745 1858233 1861490 1861470
53271 1861470 1858443 1852820 1844559 1833154 1818466 1801116 1781740 1760339 1736794 1711479 1684664 1655690
53259 1655690 1623602 1588617 1552314 1516206 1480665 1445343 1410123 1375329 1341288 1307982 1275085
53248 1275085 1242326 1209953 1178792 1149555 1121939 1094613 1066267 1036664 1006695 977577 950006
53237 950006 923883 898647 873814 849293 825395 802762 782201 764204 748436 733917 719899
53226 719899 706440 693963 682484 671563 660780 649857 638373 625837 612187 597958 583741
53215 583741 569664 555551 541456 527849 515264 503894 493534 483851 474587 465573 456720 448110
53203 448110 439986 432440 425161 417756 410366 403625 397788 392096 385408 377478 369306 362060 355886 350121
53189 350121 344536 339852 336705 334503 331924 328478 324896 321819 318898 315717 312861 311156 310235 308936
53175 308936 307104 305877 305908 306339 306152 305634 305666 306136 306062 305099 304027 303646 303824 303820 303064 301526 299746 298640
53157 298640 298891 300279 301819 302637 302555 301870 300925 300061 299630 299755 300168 300492 300634 300737 300875 300948 300843 300522 299949
53138 299949 299215 298753 299151 300434 301736 302105 301644 301360 301771 302215 301955 301420 301639 302681 303488 303338 302698 302378
53120 302378 302448 302432 302037 301182 299673 297419 294901 293014 292370 292873 293856 294495 294298 293389 292219 290927 289259
53103 289259 287205 285285 283854 282498 280574 278176 276100 274899 274343 273817 272947 271842 270922 270495 270383 270100
53087 270100 269532 269195 269536 270261 270764 271002 271445 272206 272786 272828 272640 272690 272906 272808 272227 271558 271260 271354 271562 271817
53067 271817 272303 272840 272537 270559 267280 264159 262235 261118 259830 258249 257175 257134 257802 258662 259616 260690
53051 260690 261624 262221 262872 264235 266372 268584 270226 271407 272661 274096 275214 275572 275343 275048 274943 274953
53035 274953 275033 275318 275886 276662 277606 278721 279779 280228 279607 277985 275951 274233 273259 272881 272562 272024 271760
53018 271760 272618 274768 277284 278900 279067 278281 277565 277664 278492 279244 279221 278571 278036 278050 278359 278538 278508 278486 278763
52999 278763 279577 280884 282133 282628 282206 281241 280091 279034 278704 279816 282123 284334 285495 285958 286590 287653
52983 287653 288961 290592 292703 294927 296680 297891 298921 299888 300596 301004 301254 301381 301449 301833 302855 304235
52967 304235 305361 306052 306642 307379 308179 308966 309900 311257 313214 315591 317623 318371 317673 316341 315083 313683
52951 313683 311729 309603 307998 306855 305599 304163 302897 301613 299703 297206 294856 292958 291145 289387
52937 289387 288289 287996 287705 286836 285977 285983 286674 287102 286812 286196 285710 285349 284891 284322 283864 283712 283778 283735 283450 283243
52917 283243 283452 283791 283560 282569 281478 281066 281452 282130 282501 282260 281593 281113 281329 282064 282659 282706 282246 281317 279912
52898 279912 278461 277739 277989 278629 279125 279668 280618 281735 282469 282709 282751 282767 282736 282797 283184 283828 284298 284175 283357
52879 283357 282095 280882 280151 279914 279792 279487 279031 278438 277517 276279 275268 275151 276078 277662 279419 280974
52863 280974 282094 282820 283487 284329 285192 285838 286310 286712 286853 286516 285954 285684 285847 286105 286118 285740 284746 282933
52845 282933 280629 278596 277058 275187 272069 268014 264455 262478 261874 261718 261421 260913 260142 258976 257587
52830 257587 256440 255726 255129 254393 253813 253832 254324 254621 254249 253343 252320 251390 250489 249543 248696 248267 248453 249045
52812 249045 249589 249829 249900 250071 250650 252222 255423 259996 264385 266955 267625 267807 268688 269993 270513 269381 266716
52795 266716 263414 260545 258611 257180 255427 253169 251120 249995 249617 249115 247827 245884 244040 243025 242983
52780 242983 243510 244218 245107 246174 246940 246815 245893 244928 244492 244563 244949 245628 246546 247519 248538 249741 250929 251548
52762 251548 251413 251058 251029 251235 251299 251261 251530 252382 253795 255517 256999 257531 256967 256166 256246 257375 258619 259023
52744 259023 258574 258022 258047 258711 259602 260291 260615 260677 260773 261381 262942 265350 267855 269808 271411 273289 275408
52727 275408 276988 277622 277852 278277 278584 277974 276296 274257 272566 271279 269941 268130 265892 263792 262439
52712 262439 261859 261507 261020 260675 260850 261347 261685 261896 262540 263872 265396 266428 266826 266997 267274 267517 267349 266684
52694 266684 265908 265579 266028 267238 268876 270346 271031 270783 270117 269721 269907 270743 272372 274727 277075 278486
52678 278486 278824 278753 278733 278643 278527 279002 280401 282056 282960 282927 282649 282877 283906 285633 287673 289489 290726 291382
52660 291382 291575 291425 291267 291591 292472 293433 294161 294977 296175 297347 297941 298200 298892 300165 301216 301078 299280
52643 299280 295924 291703 287902 285677 285031 284818 284028 282755 281780 281506 281644 281773 281884 282318 283364 284991
52627 284991 286958 289056 291227 293478 295804 298124 300164 301438 301580 300728 299382 297861 296161 294406 293039
52612 293039 292356 292063 291560 290491 288933 287256 286018 285662 286051 286498 286539 286506 287097 288499 290217 291613 292393
52595 292393 292672 292790 293024 293270 293115 292383 291501 291198 291929 293637 295868 298081 300088 302343 305466 309307
52579 309307 312782 314913 315758 316011 315981 315371 313928 311923 309983 308640 308076 308139 308579 309155 309409 308561 306157
52562 306157 302858 300091 298704 298285 297879 296895 295272 293412 292169 292239 293154 293556 292901 292212 292615 293849 294925
52545 294925 295556 296026 296198 295787 295366 295958 297553 298960 299295 298890 298605 298902 299728 300683 301185 300990 300647 300913
52527 300913 301698 302168 301933 301500 301449 301773 302257 302926 303814 304651 305077 304937 304325 303597 303306 303749 304646 305668 307224
52508 307224 310084 314173 318275 321098 322220 321939 320793 319400 318230 317172 315636 313304 310508 307767
52494 307767 305314 303217 301589 300449 299667 299176 298983 298893 298538 297825 297077 296631 296493 296490 296563 296843 297594 299048
52476 299048 301105 303279 305104 306484 307526 308358 309370 311158 313712 316050 317283 317784 318595 319974 321367
52461 321367 322614 324180 326167 328080 329728 331405 332880 333171 331785 329435 327011 324537 321658 318517
52447 318517 315559 312934 310617 308751 307363 306085 304570 302892 301253 299646 298086 296791 295860 295152 294734
52432 294734 294962 295821 296679 297028 297054 297187 297565 298164 298893 299267 298657 297335 296628 297500 299535 301848 304328 307259
52414 307259 310348 313034 315425 318080 321100 324221 327590 331690 336624 342234 348766 356605 365353 373963
52400 373963 381804 388838 394667 398262 398992 397254 393716 388573 381976 374696 367715 361425 355736 350853
52386 350853 347337 345288 343967 342583 341257 340791 341497 342661 343385 343666 344234 345552 347514 350071 353517
52371 353517 357904 362674 367223 371534 375903 380311 384420 387944 390691 392397 392853 392178 390792 389248 388111
52356 388111 387711 387859 388127 388563 389720 391776 394120 396176 398186 400668 403503 406158 408636 411584 415471
52341 415471 420094 424831 429058 432492 435510 439103 444139 450746 458560 467271 476634 486361 496513 507692
52327 507692 520293 533874 547846 562503 578581 596012 613946 631981 650516 669750 689128
52316 689128 708080 726663 745190 763766 782495 801586 820966 840281 859559 879306 899594
52305 899594 919596 938517 956543 974374 992091 1009026 1024543 1038472 1050935 1062168 1072386
52294 1072386 1081451 1088722 1093538 1095719 1095376 1092571 1087644 1081618 1075641 1070018 1064302 1058248 1052063 1045688
52280 1045688 1038647 1031015 1023947 1018690 1015497 1013950 1013913 1015460 1018169 1021405 1025363 1031018 1038838 1048232
52266 1048232 1058568 1070060 1083117 1097404 1112225 1127488 1143568 1160437 1177540 1194485 1211240
52255 1211240 1227704 1243690 1259324 1274846 1289948 1303832 1316034 1326621 1335517 1342238 1346535 1348739
52243 1348739 1349186 1347848 1344783 1340424 1335089 1328737 1321530 1314098 1306792 1299191 1290891 1282360 1274441 1267389
52229 1267389 1260939 1255015 1249693 1244717 1239675 1234563 1229655 1225010 1220607 1216844 1214266 1212897 1212361 1212598
52215 1212598 1213887 1216198 1219116 1222473 1226537 1231487 1237142 1243294 1249905 1256908 1264228 1272000 1280360 1288973
52201 1288973 1297244 1305029 1312692 1320371 1327700 1334367 1340491 1346340 1352168 1358448 1365704 1373746 1381551 1388203
52187 1388203 1393568 1397748 1400416 1401253 1400724 1399696 1398323 1395803 1391335 1384884 1376880 1367519 1356756 1344905
52173 1344905 1333029 1322470 1313952 1307144 1301177 1295533 1290308 1285742 1281860 1278724 1276677 1275952 1276221 1276928
52159 1276928 1278081 1280259 1283632 1287357 1290294 1292110 1293232 1293848 1293585 1292363 1290983 1290387 1290620 1291039 1291330
52144 1291330 1291765 1292528 1293414 1294291 1295301 1296350 1296853 1296306 1294871 1293192 1291885 1291328 1291590 1292397 1293542 1295568
52128 1295568 1299730 1307058 1317674 1331101 1346765 1364095 1382729 1402964 1425438 1449963 1475259 1500322
52116 1500322 1525493 1551543 1578231 1604510 1629758 1653947 1676913 1698382 1718637 1738285 1757283
52105 1757283 1774892 1790674 1804852 1817659 1829039 1839179 1848704 1857992 1866678 1874049 1879604 1883223
52093 1883223 1885102 1885520 1884274 1880472 1873325 1863043 1850473 1836090 1820055 1803096 1786477 1770975
52081 1770975 1756681 1743893 1733377 1725454 1719603 1715327 1712786 1712227 1713462 1716337 1721092 1727824 1736112
52068 1736112 1745608 1756498 1768924 1782497 1796789 1811788 1827336 1842647 1857054 1870855 1884734
52057 1884734 1898615 1911723 1923535 1934022 1943078 1950427 1956106 1960401 1963117 1963374 1960400 1954265 1945646
52044 1945646 1935047 1922376 1907182 1889240 1869012 1847570 1826075 1805265 1785362 1766276 1747835
52033 1747835 1730005 1713042 1697359 1683142 1670117 1657684 1645267 1632662 1620136 1608114 1596597
52022 1596597 1585104 1573402 1561997 1551474 1541599 1531683 1521668 1512112 1503091 1493899 1484097 1474160 1464688
52009 1464688 1455561 1446228 1436262 1425124 1411871 1395705 1376601 1355103 1331797 1307285 1282208 1256821
51997 1256821 1230851 1204144 1177062 1149966 1122877 1096200 1071259 1049320 1030260 1012782 995711
51986 995711 978505 960905 942927 925139 908221 892127 876262 860417 844920 829847 814782
51975 814782 799565 784689 770779 758087 746690 736668 727936 720311 714009 709668 707681 707829 709776
51962 709776 713487 718791 724831 730402 734775 737960 740233 741653 741979 740855 738070 733786 728547 722934
51948 722934 717224 711386 705407 699614 694738 691643 690899 692524 696118 701220 707522 714871 723152 732187
51934 732187 741598 750777 759032 765747 770425 772668 772220 768933 762657 753291 741108 726935 711767 696119
51920 696119 679884 662878 645414 628285 612245 597639 584485 572748 562400 553345 545552 539289
51908 539289 534956 532616 531904 532560 534659 538040 541872 545387 548904 553591 560111 567913 575768 582445 586879
51893 586879 588371 586930 582977 576511 567122 555076 541878 529334 518484 509761 503620 500363 499689
51880 499689 500902 503472 507058 511369 516509 523200 532067 542799 554358 565797 576453 585643 592854
51867 592854 598187 602126 604826 605991 605342 602768 598142 591540 583649 575561 568118 561824 557226 554847
51853 554847 554649 555997 558261 561129 564368 567717 571077 574415 577458 579926 582151 584996 588938 593547
51839 593547 598009 601816 604719 606399 606512 604958 601912 597678 592659 587327 582058 577003 572102 567123
51825 567123 561768 555949 550052 544700 540151 535952 531296 525775 519868 514704 511197 509311 508310 507685
51811 507685 507589 508282 509557 511013 512599 514517 516659 518436 519069 517963 515038 510904 506400 501809 496924
51796 496924 492045 488240 486087 484803 483335 481807 480985 480725 480100 478934 478086 478057 478347 478471 478622 478934 478937
51779 478937 478274 477250 476185 474867 473164 471556 470531 469954 469672 470266 472561 476683 482083 488169 494480
51764 494480 500689 506958 513929 521744 529389 535588 539966 542696 543398 541369 536790 530798 524218 517018
51750 517018 509254 501731 495245 489705 484561 479778 475921 473420 472224 472131 473113 475210 478315 482188 486778
51735 486778 492463 499868 509243 520004 530999 541235 550189 557548 562993 566510 568670 570255 571575
51722 571575 572374 572467 572256 572352 572757 572588 570780 567005 561922 556662 552188 548940 546737 544964 543010 540647
51706 540647 537952 534997 531870 528963 526901 526067 526492 528289 531680 536204 540290 542314 542158 541233 540873
51691 540873 541138 541425 541685 542489 544070 545883 547215 547741 547196 544887 540055 532815 524459 516665 510507 506167
51675 506167 503364 501904 501938 503796 507520 512550 518048 523621 529567 536336 543950 552139 560812 570121 580042
51660 580042 590046 599054 605574 608130 606011 599713 590512 579729 568585 558496 550857 546322 544501
51647 544501 544486 545409 546470 546881 546033 543542 538993 531969 522580 511761 500697 489990 479611 469546
51633 469546 460198 452098 445381 439692 434593 430038 426393 423950 422478 421386 420304 419351 418826 418828 419234 419850
51617 419850 420471 420925 421210 421521 422084 422967 424043 425050 425706 425901 425691 425019 423622 421582 419782 419277 420064
51600 420064 421079 421739 422994 426222 431372 436949 441833 446482 452104 459237 467581 476739 486340 495394
51586 495394 502331 506159 507402 507504 507466 507475 507760 509201 512838 519124 528026 539611 554094 571369 590912
51571 590912 612231 635167 659675 685558 712627 741032 771274 803786 838393 874198 910150
51560 910150 945880 981905 1019085 1058110 1099419 1142965 1187535 1230675 1269791 1303122 1329154
51549 1329154 1345508 1349356 1339270 1316114 1282050 1239234 1189631 1135309 1078288 1020292 962920
51538 962920 907736 855954 808292 765316 727526 694882 666715 642470 622170 605745 592268
51527 592268 580426 569587 559934 551658 544538 538286 532843 528145 523831 519346 514308 508832 503515 499001
51513 499001 495418 492380 489537 486896 484517 482246 479977 477821 475711 473126 469603 465290 460724 456287
51499 456287 452272 449088 446869 445055 442992 440852 439350 438587 437827 436627 435517 435307 436191 437891 440147
51484 440147 442581 444453 445198 445127 445072 445279 445070 443699 441174 438088 434978 432141 429813 427998 426112 423214
51468 423214 418919 413924 409401 405998 403633 402076 401259 400959 400656 400070 399611 399953 401234 403009 404938 407215
51452 407215 410209 413979 418350 423321 429147 435999 443695 451911 460595 470081 480713 492485 505150
51439 505150 518562 532706 547266 561252 573169 581691 586393 587987 587767 586672 584844 582046 578193
51426 578193 573239 566845 558683 549070 538873 528775 519082 510254 503037 497688 493466 489347 485077 481284
51412 481284 478781 477988 478728 480237 481579 482434 483366 485091 487626 490392 492878 494878 496357 497602 499422
51397 499422 502686 507590 513601 520093 526778 533665 541030 549402 559211 570442 582994 597366 614623
51384 614623 635655 660883 690687 725533 765485 810029 858714 911617 968830 1029748 1093110
51373 1093110 1157443 1220926 1280952 1334273 1377742 1408850 1425813 1427734 1414906 1388661 1350732
51362 1350732 1302815 1246776 1184851 1119301 1051961 984435 918599 856497 799572 748188 702120
51351 702120 661315 626037 596395 571983 551938 535220 520897 508364 497347 487634 478908 470954
51339 470954 463872 457769 452316 446900 441306 435925 431188 426999 422899 418637 414450 410868 408365 407060
51325 407060 406608 406389 405869 404917 403899 403418 403702 404114 403566 401694 399360 397717 397096 397237 398158 400008 402246
51308 402246 403917 404901 406020 407665 409202 410202 411322 413233 415381 416738 417317 417940 418713 418726 417387 415254
51292 415254 413254 411678 410207 408509 406542 404591 403208 402889 403588 404645 405312 405380 405322 405910 407553 409840
51276 409840 411839 412985 413537 414090 414850 415552 415841 415515 414663 413839 413837 414979 416830 418850 421024 423505 425988
51259 425988 427953 429342 430538 431809 433193 434731 436320 437454 437644 437060 436358 435902 435564 435140 434488 433311
51243 433311 431279 428465 425271 421955 418545 415113 411770 408458 405097 401817 398762 395902 393427 391986
51229 391986 391936 392652 393223 393653 394604 396148 397628 398741 399816 400867 401278 400745 399809 399118 398811 399015 400218
51212 400218 402681 405945 409363 412730 416105 419412 422558 425541 428233 430468 432520 434960 437780 440255
51198 440255 442040 443819 446361 449444 452214 454226 455607 456485 456878 457025 457378 458238 459564 460986 461909 461892
51182 461892 461047 459849 458547 457138 455866 455078 454465 453210 451148 449000 447121 444905 442021 439369 437905
51167 437905 437202 436148 434599 433341 432826 432989 434085 436447 439352 441318 441891 442283 443824 446457 449147
51152 449147 451153 452345 452704 452036 450151 447129 443520 440250 437988 436458 434688 432025 428662 425241 422281
51137 422281 420069 418653 417782 417151 416806 416971 417445 417635 417397 417428 418520 420714 423419 426052 428280 429975
51121 429975 431386 433195 435969 439505 443043 446165 449201 452688 456636 460507 463750 466140 467636 468234
51107 468234 468138 467916 468144 468848 469580 470131 470933 472601 475258 478544 482048 485473 488496 490855 492589 493960
51091 493960 495167 496341 497689 499280 500632 500901 499647 497258 494527 492032 490000 488495 487466 486734 486130
51076 486130 485708 485694 486186 487002 487831 488580 489484 490820 492628 494877 497912 502331 508206 514688 520785 526436
51060 526436 532555 540056 549178 559575 570561 581116 590086 596787 601345 604412 606746 609144 612404
51047 612404 617052 623162 630621 639321 648881 658362 666713 673537 679219 684271 688812 692709 696003 698978
51033 698978 701903 704802 707348 708798 708078 704190 696740 686148 673369 659422 645113 631084 617974
51020 617974 606426 596889 589446 583918 580192 578319 578216 579413 581306 583687 586882 591353 597339 604781
51006 604781 613286 622095 630443 638220 646040 654433 663131 671372 678710 685253 691326 697234 703230 709352
50992 709352 715426 721513 728221 736127 745093 754592 764624 775824 788754 803732 821226 841599 864240
50979 864240 887745 911405 935950 962348 990381 1018882 1046939 1074338 1101195 1127735 1154342
50968 1154342 1181471 1209714 1240139 1274082 1312098 1353476 1397335 1443850 1493778 1547048 1602540
50957 1602540 1659225 1716793 1775164 1833885 1892106 1948616 2001898 2050735 2094941 2135118 2171609
50946 2171609 2204025 2231859 2255104 2274240 2290026 2303429 2315329 2326073 2335564 2343734 2350508 2355272
50934 2355272 2356904 2354564 2348117 2337648 2323086 2304465 2282029 2255633 2224472 2187912 2146367 2100868
50922 2100868 2051830 1998731 1941038 1879093 1813995 1746988 1679253 1612186 1547441 1486376 1429454
50911 1429454 1376368 1326842 1281115 1239478 1201584 1166654 1134332 1104969 1078927 1055926 1035354
50900 1035354 1017024 1001308 988483 978104 969103 960490 951897 943494 935622 928739 923572 920736 919867
50887 919867 919530 918467 916855 915932 916544 918543 921513 925406 930226 935644 941310 947335 954113 961810 970280
50872 970280 979364 989134 999887 1012014 1025734 1040899 1057226 1074798 1094160 1115784 1139585 1165126
50860 1165126 1192263 1221530 1253961 1290579 1331938 1378110 1429151 1485531 1548066 1617530 1694471
50849 1694471 1779263 1872079 1972884 2081681 2198685 2323857 2456336 2594664 2737613 2884348
50839 2884348 3033688 3183597 3331616 3475352 3612236 3739134 3852717 3950437 4031199 4095266
50829 4095266 4143601 4177083 4196299 4202262 4197346 4185236 4169836 4154427 4141787 4134330 4133505 4139102
50817 4139102 4149485 4162407 4175437 4185851 4190561 4186237 4169441 4136934 4086372 4016938 3929338 3825226
50805 3825226 3706615 3575514 3433884 3283966 3128773 2972074 2817707 2668888 2528096
50796 2528096 2397245 2277687 2170175 2074983 1991908 1920189 1858776 1806937 1764350 1730473 1704309
50785 1704309 1685026 1672282 1665342 1662321 1661038 1660435 1660432 1660527 1659411 1656055 1650309 1642160 1631268 1617777
50771 1617777 1602819 1587420 1571287 1553401 1533518 1512244 1489784 1465558 1439271 1411578 1383343
50760 1383343 1354839 1326188 1298072 1271358 1246292 1222766 1201245 1182769 1167835 1155862 1146068
50749 1146068 1138432 1133471 1131431 1132151 1135568 1141876 1151219 1163626 1179330 1198844 1222585 1250602 1282772
50736 1282772 1319049 1359468 1404096 1453085 1506624 1564714 1627136 1693729 1764513 1839325 1917387
50725 1917387 1997388 2078090 2158812 2239446 2319939 2399599 2476752 2549112 2614612 2671834 2719642
50714 2719642 2756663 2781523 2793702 2793970 2783937 2765412 2740494 2712112 2683935 2659284 2640036 2626611
50702 2626611 2618813 2616369 2618733 2624818 2633145 2642002 2649270 2652316 2648417 2635279 2611155 2574884 2526310
50689 2526310 2466624 2397918 2322378 2242158 2159870 2078610 2001191 1929431 1864200 1805874 1754768
50678 1754768 1711484 1677030 1652357 1637688 1632505 1636169 1648147 1667544 1693055 1723784 1759720 1800826
50666 1800826 1845793 1892138 1937450 1980148 2019203 2053785 2083486 2108588 2129840 2148002 2163587
50655 2163587 2176739 2187257 2194917 2199996 2203441 2206372 2209423 2212561 2215544 2218611 2222746 2229158 2238414
50642 2238414 2250280 2264651 2282384 2304814 2332399 2364361 2399748 2438266 2479662 2522766 2565857
50631 2565857 2607898 2648768 2688241 2725349 2759049 2789033 2815357 2837432 2853645 2861759 2859410 2844564
50619 2844564 2816189 2774866 2722850 2663737 2602063 2542592 2489098 2443513 2406356 2377732 2357485
50608 2357485 2344721 2337999 2336135 2338102 2341932 2344461 2342689 2334966 2320529 2298510 2267982 2228605 2180619
50595 2180619 2124656 2062138 1995464 1926975 1857831 1788553 1720349 1655045 1593740 1536422 1483042
50584 1483042 1434108 1389960 1350257 1314682 1283602 1257468 1235983 1218302 1203789 1192187 1183408
50573 1183408 1177594 1175184 1176419 1180884 1187832 1196884 1208065 1221206 1235659 1250660 1265777 1280977
50561 1280977 1296447 1312506 1329626 1348334 1368957 1391519 1416137 1443532 1474808 1510499 1550103
50550 1550103 1592771 1638087 1685771 1734946 1784343 1833060 1880504 1925716 1967621 2006124 2042332
50539 2042332 2077536 2112699 2149171 2189031 2233972 2284183 2338842 2397443 2460317 2528268 2602170
50528 2602170 2682699 2769982 2863649 2963471 3069688 3182346 3300465 3422133 3545189 3667613
50518 3667613 3787588 3903444 4013248 4114176 4202689 4275741 4331611 4369330 4387748 4385640 4362509
50507 4362509 4318904 4256298 4177083 4084364 3981251 3870536 3755397 3640037 3529032 3426174
50497 3426174 3334293 3255850 3193023 3147266 3119214 3108788 3114787 3134528 3164465 3201139 3241035
50486 3241035 3279643 3311345 3330446 3332210 3313376 3272569 3210462 3129170 3031367 2920186 2799531
50475 2799531 2673625 2546105 2419948 2297973 2182526 2074510 1973473 1879019 1791644 1712048
50465 1712048 1640260 1575758 1517914 1465995 1419169 1376866 1338837 1304720 1273988 1246522 1222668
50454 1222668 1202363 1184692 1168811 1154958 1144070 1136580 1131972 1129343 1127991 1127570 1128028 1129408 1131622
50441 1131622 1134517 1138226 1143092 1149011 1155161 1160838 1166388 1172964 1181424 1191754 1203483 1216275 1230098
50428 1230098 1245056 1261252 1278793 1297932 1319069 1342402 1367491 1393494 1420085 1447976 1478246
50417 1478246 1511318 1546809 1584312 1624064 1666921 1713936 1765872 1822826 1884208 1949173 2017080
50406 2017080 2087457 2159623 2232541 2305023 2375904 2444043 2508229 2567049 2618811 2661850 2695238
50395 2695238 2719119 2733992 2739588 2734707 2718214 2689927 2650461 2600627 2541448 2474772 2403485 2330834
50383 2330834 2259484 2191135 2126864 2067739 2015141 1970596 1935274 1909516 1892743 1883754 1881188 1883754
50371 1883754 1890089 1898381 1906200 1910844 1909995 1902106 1886258 1861901 1828931 1787950 1740247 1687413 1631033
50358 1631033 1572632 1513627 1455188 1398248 1343684 1292260 1244310 1199729 1158391 1120423 1085908
50347 1085908 1054670 1026545 1001642 979962 961054 944464 930318 918999 910310 903487 898071 894202
50335 894202 891957 890873 890300 889793 888988 887549 885520 883406 881674 880430 879713 879665 880279 881389 883134 885993
50319 885993 890048 894682 899355 904316 910146 916985 924577 932734 941283 949904 958510 967532 977381 987816
50305 987816 998338 1008890 1019644 1030236 1039783 1047620 1053726 1058558 1062829 1067295 1072327 1077767 1083428
50292 1083428 1089415 1095694 1101804 1107480 1113088 1118805 1123887 1127625 1130767 1135066 1141547 1150114 1160791 1174183
50278 1174183 1190360 1208080 1225578 1241529 1254953 1264862 1270603 1272367 1271161 1268496 1266046 1264992 1265460
50265 1265460 1266827 1268602 1270525 1271865 1271279 1267637 1260579 1250272 1237216 1222445 1207278 1192531 1178295
50252 1178295 1164589 1151672 1139639 1128289 1117717 1108568 1101463 1096518 1093522 1092155 1091988 1092739 1094557
50239 1094557 1097559 1101230 1105069 1109616 1115830 1123326 1130345 1135742 1139856 1143101 1145014 1145355 1144758 1143287
50225 1143287 1139503 1132337 1123014 1113716 1104925 1095450 1084604 1072842 1060462 1047224 1033449 1020255
50213 1020255 1008394 997804 988491 980813 974680 969390 964538 960240 956288 952104 947945 945152 944646 945940
50199 945940 948169 951249 955307 959745 963944 968555 975222 984979 997524 1011969 1027808 1045236 1065073
50186 1065073 1088424 1115893 1147047 1181013 1217673 1257918 1302523 1351056 1402087 1454290 1507003
50175 1507003 1559694 1611144 1659572 1703723 1743757 1780824 1815832 1848849 1879643 1908270 1934724
50164 1934724 1958161 1976776 1988393 1990973 1982754 1962515 1930074 1886425 1833280 1772623 1706845 1639032
50152 1639032 1572625 1510518 1454421 1404979 1362216 1325752 1294835 1268481 1245683 1225540 1207292
50141 1207292 1190295 1173835 1156854 1138087 1116785 1093325 1068991 1045122 1022574 1001799 983105
50130 983105 966818 953334 942992 935627 930328 925951 921988 918668 916205 914260 912343 910468 909152
50117 909152 908867 909642 911181 913255 915899 919137 922572 925603 928244 931360 935682 940877 946115 951297 956982
50102 956982 963160 968977 973926 978592 983867 990053 997065 1004881 1013306 1021867 1030435 1039547 1049683 1060733
50088 1060733 1072643 1086027 1101486 1118814 1137548 1157825 1179934 1203340 1227138 1251384 1277182
50077 1277182 1305463 1336369 1369807 1405797 1444175 1484713 1527775 1574296 1624993 1680103 1740011
50066 1740011 1805444 1876763 1953549 2035143 2121094 2210722 2302655 2395145 2486647 2575936 2662078
50055 2662078 2744565 2823300 2898355 2970016 3039022 3106186 3171403 3233244 3289541 3337823 3374933
50044 3374933 3396939 3400334 3383510 3346965 3292361 3221819 3137858 3043363 2941255 2834256 2724978
50033 2724978 2616056 2510012 2408950 2314267 2226611 2146195 2073109 2007240 1947975 1894362 1845731
50022 1845731 1801914 1762601 1726649 1692392 1658700 1625551 1593499 1562715 1532620 1502351 1471437
50011 1471437 1440002 1408450 1377150 1346420 1316589 1287946 1260737 1235358 1212355 1191990 1173880
50000 1173880 1157409 1142593 1130367 1121905 1117706 1117293 1119607 1123569 1128389 1133443 1138034 1141529 1143852
49987 1143852 1145549 1147018 1147703 1146314 1141908 1134592 1125280 1115013 1104456 1093656 1082191 1069840 1057203
49974 1057203 1045413 1035199 1026514 1019203 1013591 1010051 1008243 1007272 1006618 1006602 1007807 1010358 1014011 1018780
49960 1018780 1025119 1033385 1043409 1054875 1068007 1083565 1102135 1123778 1148529 1176986 1210009 1247932
49948 1247932 1290365 1336762 1386903 1440734 1497864 1557395 1618216 1679427 1740497 1800970 1859958
49937 1859958 1916034 1967687 2013843 2053898 2087408 2114065 2134133 2148853 2160235 2170095 2178919 2185422
49925 2185422 2187120 2181267 2165336 2137123 2095094 2038987 1970044 1890720 1804366 1714877 1625894 1539903
49913 1539903 1458254 1381999 1312272 1249794 1194637 1146776 1106405 1073370 1046837 1026002 1010675
49902 1010675 1000651 994964 992429 992660 995854 1001674 1008952 1016414 1023163 1028458 1031643 1032423 1030848 1026898
49888 1026898 1020328 1010938 998724 983861 966743 947915 927778 906593 884934 863706 843339 823447
49876 823447 803728 784724 767098 750658 734972 720512 708204 698043 689196 681453 675490 671609
49864 671609 669273 668233 669104 672290 677099 682548 688530 695696 704611 715461 728218 742642 758238
49851 758238 774394 790365 805262 818527 830389 841260 850670 857540 861602 863752 864678 863908 860583
49838 860583 854492 845892 835012 822316 808755 795143 781665 768447 756188 745668 737036 730099
49826 730099 725001 722011 720896 721024 722069 724267 728116 734116 742613 753607 766790 781827 798316
49813 798316 815445 832218 848262 863901 879138 893041 904547 913472 920342 925621 929507 932025
49801 932025 932825 931222 926916 920480 912782 904262 895086 885564 875879 865671 854418 842080 829025
49788 829025 815630 802360 789949 778993 769521 761278 754218 748446 744020 741145 740143 740736 741733 742015
49774 742015 741667 741710 742937 745375 748626 752342 756577 761975 769254 778145 787302 795631 803215 810396 816631
49759 816631 821034 823583 824853 824845 823025 819342 814261 807776 799288 788623 776395 763234 749347 735051
49745 735051 721130 708383 697267 688058 680850 675217 670364 665845 661890 658972 657424 657407 658811 661107
49731 661107 663687 666454 669759 673888 678925 684881 691440 697722 703058 707999 713999 722004 731871 743112
49717 743112 755479 768678 782108 795142 807224 817609 825589 831098 834514 835723 834027 829240 822243
49704 822243 814096 805100 795101 784163 772553 760482 748375 737125 727597 719982 713864 708701 704065
49691 704065 699698 695695 692457 690279 689127 688888 689621 691439 694498 699188 705923 714574 724481 735289
49677 735289 747398 761370 777274 794837 813738 833291 852230 869400 884457 897419 907718
49666 907718 914327 916917 916437 914359 911625 908483 905142 902167 900062 898492 896191 891854 884912 875156
49652 875156 861823 843906 821686 797432 773953 752645 733321 715644 700020 687024 676615
49641 676615 668283 661718 657011 654233 653004 652539 652108 651497 650978 650780 650572 649616 647400 644014 639875 635270
49625 635270 630324 625291 620596 616485 612795 609282 606037 603345 601161 599073 596861 594793 593167 591831
49611 591831 590472 589219 588535 588559 588890 589143 589461 590313 591901 593844 595392 595984 595709 595269 595381 596165 597119
49594 597119 597607 597378 596772 596467 596853 597560 597817 597370 596800 596808 597535 598817 600686 603152 605818 608237 610472
49577 610472 612828 615204 617391 619918 623833 629469 636029 642718 649764 657927 667382 677530 687757 698023
49563 698023 708655 719646 730210 739101 745481 749437 751574 752342 751950 750583 748212 744475 739365 733898
49549 733898 729437 726337 723919 721834 720658 720884 722070 723418 724622 725710 726603 727362 728424 730036 731745
49534 731745 733039 734238 736269 739654 744203 749554 755634 762714 771386 782365 795852 811100 827069
49521 827069 843530 861132 880237 899974 918661 935014 948737 960051 968997 975515 980172 984344
49509 984344 989273 995024 1000721 1005696 1009944 1013428 1015460 1014932 1010835 1002513 989938 974035 956297 937803
49495 937803 919014 900650 884059 870073 858002 846528 835387 825496 817503 810914 804864 799195
49483 799195 794472 791175 789095 787519 785927 784499 783748 783692 783745 783580 783632 784353 785351 785873 785970 786558 788369 791407
49465 791407 795455 800494 806373 812602 818793 824936 830931 836137 839812 841910 843134 844180 845045 845014 843192
49450 843192 839108 833022 825737 818122 810764 803938 797694 791869 786184 780523 775186 770762 767698 765959
49436 765959 765167 765138 766273 769227 774168 780466 787301 794527 802885 813390 826662 842729 861215 881633
49422 881633 903715 927630 953788 982115 1011393 1039420 1063881 1082914 1094835 1097821 1090742 1074727
49410 1074727 1053613 1032294 1014461 1001724 994263 991638 993097 997859 1005494 1015833 1028390 1042189
49398 1042189 1056342 1070579 1085001 1099538 1113807 1127329 1139670 1150495 1159592 1166800 1171904 1174666
49386 1174666 1174962 1172675 1167572 1159538 1148968 1136652 1123281 1109387 1095707 1083135 1072129 1062536
49374 1062536 1054184 1047297 1042136 1038642 1036698 1036396 1037755 1040425 1043948 1048071 1052558 1056947 1060723 1063506
49360 1063506 1064925 1064633 1062696 1059544 1055288 1049528 1042269 1034595 1027828 1022275 1017380 1012898 1009288 1006998
49346 1006998 1005999 1006028 1006742 1007512 1007603 1006777 1005372 1003653 1001434 998511 995043 991241 986857 981345 974515 966896
49330 966896 959418 952724 946816 941412 936632 933077 931134 930497 930689 931757 934028 937306 940863 944239 947585
49315 947585 951101 954582 957757 960701 963637 966622 969729 973285 977465 981743 985215 987592 989556 991931
49301 991931 994774 997587 1000236 1003219 1006948 1011161 1015345 1019422 1023678 1028135 1032374 1036012 1038997 1041408
49287 1041408 1043214 1044391 1045027 1045322 1045606 1046275 1047348 1048125 1047763 1046397 1045367 1046171 1049373 1054572 1060981 1067886
49271 1067886 1074906 1082130 1089816 1097877 1105905 1113673 1121216 1128327 1134565 1139958 1145137 1150572 1156247 1162447
49257 1162447 1170174 1180241 1192504 1206622 1223136 1243040 1266508 1292590 1319915 1347110 1372832
49246 1372832 1396003 1415849 1431219 1440318 1441886 1436470 1425845 1411367 1393631 1373554 1352824 1333094
49234 1333094 1315329 1300016 1287381 1277385 1270060 1265870 1265188 1267553 1272151 1278910 1288236 1299595 1311374
49221 1311374 1322407 1332736 1342396 1350309 1355068 1356306 1354761 1351524 1347824 1345058 1344208 1345192 1347216 1349719
49207 1349719 1352784 1356899 1362719 1370903 1381804 1395323 1411215 1429369 1449588 1471238 1493390 1515275
49195 1515275 1536486 1556749 1575522 1591819 1604720 1614256 1621659 1628310 1634570 1640059 1644847 1649687 1655084
49182 1655084 1660942 1667413 1675469 1686190 1700019 1717073 1737753 1762546 1791529 1824439 1861062 1901211
49170 1901211 1944508 1990346 2037710 2084807 2129158 2168217 2199683 2221346 2231596 2230805 2221866 2208826
49158 2208826 2195033 2182611 2172918 2166648 2163699 2163600 2166057 2170798 2177140 2184281 2191935 2200378 2209982 2220994
49144 2220994 2233496 2247087 2260860 2274131 2287046 2300060 2313064 2325568 2337524 2349370 2361355
49133 2361355 2373402 2385594 2398163 2410965 2423603 2436200 2449484 2463834 2478698 2493283 2507496
49122 2507496 2521958 2537353 2553979 2571709 2590227 2609514 2630234 2653422 2679680 2708874 2740734
49111 2740734 2775503 2813890 2856754 2905105 2960188 3023159 3094483 3173501 3258241 3345600 3432109
49100 3432109 3515011 3592701 3664054 3727439 3780326 3819325 3840273 3838953 3813168 3765071 3701228
49089 3701228 3629563 3555422 3480065 3402430 3322159 3241301 3163751 3093364 3032305 2980730 2937740
49078 2937740 2902418 2873930 2850982 2831852 2815225 2800679 2788052 2776603 2765227 2753367 2741277
49067 2741277 2729380 2717786 2706576 2696139 2686915 2678886 2671495 2664081 2656421 2648946 2642400 2637121 2632731
49054 2632731 2628649 2624748 2621214 2617947 2614573 2611044 2607734 2604816 2602061 2599395 2597175 2595660 2594681 2594231
49040 2594231 2594951 2597625 2602463 2609305 2618142 2628894 2641004 2653951 2668107 2684316 2702491 2721251
49028 2721251 2739270 2756453 2773261 2789174 2802368 2810981 2814383 2813186 2808439 2801157 2792498 2783893 2776615
49015 2776615 2771223 2767611 2765567 2765095 2766273 2769035 2773203 2778481 2784429 2790729 2797624 2805808 2815656 2826703
49001 2826703 2838064 2849082 2859388 2868580 2876260 2882336 2886972 2890262 2892095 2892325 2890941 2888135 2884293
48988 2884293 2879796 2874709 2868854 2862328 2855709 2849528 2843709 2837781 2831434 2824611 2817316 2809721 2802315 2795597
48974 2795597 2789664 2784388 2779800 2775922 2772421 2768895 2765385 2762099 2758749 2754843 2750741 2747755 2746931 2748225
48960 2748225 2751189 2755957 2763072 2772661 2784226 2797084 2810678 2824674 2839169 2854703 2871737 2890164
48948 2890164 2909593 2929979 2951649 2974842 2999563 3025807 3053476 3082035 3110736 3139444 3168983
48937 3168983 3200450 3234406 3270858 3309743 3351126 3395114 3441919 3491918 3545298 3601657 3660249
48926 3660249 3720699 3783284 3848404 3916115 3986273 4058835 4133678 4210260 4287821 4365905 4444336
48915 4444336 4522567 4599362 4673360 4743880 4811015 4875040 4936035 4994112 5049683 5103130 5154187
48904 5154187 5202006 5246045 5286687 5324673 5360100 5392424 5421502 5448065 5472871 5495794 5516192
48893 5516192 5533858 5549009 5561433 5570293 5575050 5576175 5574642 5570878 5564389 5554306 5540227 5522637
48881 5522637 5502535 5480584 5456667 5430362 5401543 5370170 5335637 5296907 5253350 5204998 5151936
48870 5151936 5094078 5031824 4966370 4898887 4829723 4758816 4686638 4614266 4542730 4472714 4404783
48859 4404783 4339455 4277029 4217572 4161100 4107590 4056940 4009130 3964279 3922361 3883089 3846411
48848 3846411 3812911 3783333 3757717 3735324 3715376 3697655 3682463 3670328 3661701 3656599 3654545 3655080
48836 3655080 3658320 3664720 3674296 3686386 3700230 3715582 3732626 3751541 3772192 3794158 3816998 3840556
$$ [...]
##END NTUPLES=NMR SPECTRUM
##END=
