##TITLE=AC1388_PERAH12200_7519727_yzSkyq3V2s
##JCAMPDX= 6.0         $$ Bruker NMR JCAMP-DX V2.0
##DATA TYPE= NMR SPECTRUM
##DATA CLASS= NTUPLES
##ORIGIN= BRUKER
##OWNER= Administrator
$$ 1.72 TOPSPIN		Version 2.1
$$ 2015-07-09 21:35:31.691 -0700  Administrator@X
$$ Compression mode = diff/dup
##.OBSERVE FREQUENCY= 400.02188249412
##.OBSERVE NUCLEUS= ^1H
##.ACQUISITION MODE= SIMULTANEOUS (DQD)
##.ACQUISITION SCHEME= undefined
##.AVERAGES= 8
##.DIGITISER RES= 22
##SPECTROMETER/DATA SYSTEM= spect
##.PULSE SEQUENCE= zg30
##.SOLVENT NAME= COFFEE_meoh
##.SHIFT REFERENCE= INTERNAL, COFFEE_meoh, 1, 14.98509
##AUDIT TRAIL= $$ (NUMBER, WHEN, WHO, WHERE, PROCESS, VERSION, WHAT)
$$ ##TITLE= Audit trail, TOPSPIN		Version 2.1
$$ ##JCAMPDX= 5.01
$$ ##ORIGIN= Bruker BioSpin GmbH
$$ ##OWNER= Administrator
$$ $$ E:\/data/COFFEE/nmr/AC1388_PERAH12200_7519727_yzSkyq3V2s/10/pdata/1/auditp.txt
$$ ##AUDIT TRAIL=  $$ (NUMBER, WHEN, WHO, WHERE, PROCESS, VERSION, WHAT)
(   1,<2015-07-09 21:35:24.394 -0700>,<Administrator>,<X>,<go>,<TOPSPIN 2.1>,
      <created by zg
	started at 2015-07-09 21:34:18.519 -0700,
	POWCHK enabled, PULCHK disabled,
       configuration hash MD5:
       21 0F 79 D6 B3 7B B4 F6 88 20 88 DB 03 48 BD 9F
       data hash MD5: 64K
       9B E1 C1 BD F2 61 E7 6B F4 85 9E 4C 94 39 B8 24>)
(   2,<2015-07-09 21:35:27.566 -0700>,<Administrator>,<X>,<proc1d>,<TOPSPIN 2.1>,
      <Start of raw data processing
       efp LB = 0 FT_mod = 6 PKNL = 1 PHC0 = 0 PHC1 = 0 SI = 32K 
       data hash MD5: 32K
       17 A1 6C 78 2D CA D5 52 29 01 6F 3F B2 7E 62 46>)
(   3,<2015-07-09 21:35:27.863 -0700>,<Administrator>,<X>,<proc1d>,<TOPSPIN 2.1>,
      <pk PHC0 = 90.84595 PHC1 = 0 
       data hash MD5: 32K
       F7 BD 5D C9 36 43 BF AF 3F A3 B5 20 0C 42 F1 FE>)
(   4,<2015-07-09 21:35:27.972 -0700>,<Administrator>,<X>,<proc1d>,<TOPSPIN 2.1>,
      <abs ABSG = 1 
       data hash MD5: 32K
       E0 F8 B1 D2 66 17 FC 6E FE AA AB AA AA 35 F9 3D>)
(   5,<2015-07-09 21:35:28.035 -0700>,<Administrator>,<X>,<proc1d>,<TOPSPIN 2.1>,
      <abs ABSG = 2 
       data hash MD5: 32K
       EF 3B 9A 50 8D 7A C0 4D EC CD 89 8F D8 9F 74 2B>)
(   6,<2015-07-09 21:35:28.113 -0700>,<Administrator>,<X>,<proc1d>,<TOPSPIN 2.1>,
      <abs ABSG = 3 
       data hash MD5: 32K
       52 E6 E2 D6 EF 90 4F BC 10 6C 96 F2 9B 34 FA 8C>)
(   7,<2015-07-09 21:35:28.175 -0700>,<Administrator>,<X>,<proc1d>,<TOPSPIN 2.1>,
      <abs ABSG = 4 
       data hash MD5: 32K
       58 81 48 F1 1D D0 B8 EB DF 1B 88 50 87 4A 9F 83>)
(   8,<2015-07-09 21:35:28.222 -0700>,<Administrator>,<X>,<proc1d>,<TOPSPIN 2.1>,
      <abs ABSG = 5 
       data hash MD5: 32K
       07 6C 1C 78 72 FA C3 CE 28 92 64 FB B0 40 64 23>)
$$ ##END=
$$ 
$$ $$ hash MD5
$$ $$ 81 2C 91 76 82 F2 3D 22 C2 7A D3 0D CE 27 16 E3
##$RELAX= 
##$RELAX= 
##$RELAX= 
##$RELAX= 
##$RELAX= 
##$RELAX= 
##$RELAX= 
$$ Bruker specific parameters
$$ --------------------------
##$DU= <E:\>
##$EXPNO= 10
##$NAME= <AC1388_PERAH12200_7519727_yzSkyq3V2s>
$$ [...]
150 150 150 150 150 150 150 150
##$TP07= 0
##$TPNAME0= <>
##$TPNAME1= <>
##$TPNAME2= <>
##$TPNAME3= <>
##$TPNAME4= <>
##$TPNAME5= <>
##$TPNAME6= <>
##$TPNAME7= <>
##$TPOAL= (0..7)
0.5 0.5 0.5 0.5 0.5 0.5 0.5 0.5
##$TPOFFS= (0..7)
0 0 0 0 0 0 0 0
##$TUNHIN= 0
##$TUNHOUT= 0
##$TUNXOUT= 0
##$USERA1= <user>
##$USERA2= <user>
##$USERA3= <user>
##$USERA4= <user>
##$USERA5= <user>
##$V9= 5
##$VALIST= <valist>
##$VCLIST= <CCCCCCCCCCCCCCC>
##$VD= 0
##$VDLIST= <DDDDDDDDDDDDDDD>
##$VPLIST= <PPPPPPPPPPPPPPP>
##$VTLIST= <TTTTTTTTTTTTTTT>
##$WBST= 2048
##$WBSW= 25
##$XGAIN= (0..3)
0 0 0 0
##$XL= 0
##$YL= 0
##$YMAX_a= 592991
##$YMIN_a= -508516
##$ZGOPTNS= <>
##$ZL1= 120
##$ZL2= 120
##$ZL3= 120
##$ZL4= 120
##$ABSF1= 14.98509
##$ABSF2= -5.573092
##$ABSG= 5
##$ABSL= 3
##$ALPHA= 0
##$AQORDER= 0
##$ASSFAC= 0
##$ASSFACI= 0
##$ASSFACX= 0
##$ASSWID= 0
##$AUNMP= <proc_prof1d_extract_pilot.lims>
##$AXLEFT= 0
##$AXNAME= <>
##$AXNUC= <1H>
##$AXRIGHT= 0
##$AXTYPE= 0
##$AXUNIT= <>
##$AZFE= 0.1
##$AZFW= 0.1
##$BCFW= 0
##$BC_mod= 0
##$BYTORDP= 0
##$COROFFS= 0
##$CY= 15
##$DATMOD= 1
##$DC= 0
##$DFILT= <>
##$DTYPP= 0
##$F1P= 0
##$F2P= 0
##$FCOR= 0.5
##$FTSIZE= 32768
##$FT_mod= 6
##$GAMMA= 0
##$GB= 0
##$INTBC= 1
##$INTSCL= 1
##$ISEN= 128
##$LB= 0
##$LEV0= 0
##$LPBIN= 0
##$MAXI= 10000
##$MC2= 0
##$MEAN= 0
##$ME_mod= 0
##$MI= 0
##$NCOEF= 0
##$NC_proc= -8
##$NLEV= 6
##$NOISF1= 0
##$NOISF2= 0
##$NSP= 0
##$NTH_PI= 0
##$NZP= 0
##$OFFSET= 14.98509
##$PC= 1
##$PHC0= 90.84595
##$PHC1= 0
##$PH_mod= 1
##$PKNL= yes
##$PPARMOD= 0
##$PPDIAG= 0
##$PPIPTYP= 0
##$PPMPNUM= 2147483647
##$PPRESOL= 1
##$PSCAL= 4
##$PSIGN= 0
##$PYNMP= <proc.py>
##$REVERSE= no
##$SF= 400.02
##$SI= 32768
##$SIGF1= 0
##$SIGF2= 0
##$SINO= 400
##$SIOLD= 32768
##$SPECTYP= <>
##$SREGLST= <1H.CDCl3>
##$SSB= 0
##$STSI= 32768
##$STSR= 0
##$SW_p= 8223.68421052631
##$SYMM= 0
##$S_DEV= 0
##$TDeff= 65536
##$TDoff= 0
##$TI= <>
##$TILT= no
##$TM1= 0
##$TM2= 0
##$TOPLEV= 0
##$USERP1= <user>
##$USERP2= <user>
##$USERP3= <user>
##$USERP4= <user>
##$USERP5= <user>
##$WDW= 1
##$XDIM= 32768
##$YMAX_p= 433168543
##$YMIN_p= -677951
##$CURPLOT= <Network HP LaserJet P1505>
##$CURPRIN= <$Network HP LaserJet P1505>
##$DFORMAT= <normdp>
##$LAYOUT= <+/1D_H.xwp>
##$LFORMAT= <normlp>
##$PFORMAT= <normpl>
##$SURQMSG= 1
$$ End of Bruker specific parameters
$$ ---------------------------------
##NTUPLES= NMR SPECTRUM
##VAR_NAME=  FREQUENCY,     SPECTRUM/REAL,   SPECTRUM/IMAG
##SYMBOL=    X,             R,               I
##VAR_TYPE=  INDEPENDENT,   DEPENDENT,       DEPENDENT
##VAR_FORM=  AFFN,          ASDF,            ASDF
##VAR_DIM=   32768,         32768,           32768
##UNITS=     HZ,            ARBITRARY UNITS, ARBITRARY UNITS
##FACTOR=    0.250966925370066, 1,           1
##FIRST=     8223.43324360094, 33255,        -99205
##LAST=      0,             139115,          -339611
##MIN=       0,             -677951,         0
##MAX=       8223.43324360094, 433168543,    0
$$ Real data points
##PAGE= N=1
##DATA TABLE= (X++(R..R)), XYDATA
$$ [...]
23844 105857 -156234 216332 -136832 -19084 6022 106723 187604 122900 111822 43268 94966
23833 94966 -10913 237819 -41801 171051 228024 277981 -31457 -151705 76539 -8992 3760
23821 19961 76136 -11143 -486253 -3643 -75700 210552 -156349 -287666 -179458 314193 -55927
23809 -221492 164862 133557 -97235 -207924 -109875 102736 186858 135398 -221371 -104781
23798 16978 -209361 -66295 -138175 279844 -11914 30476 92212 71654 -142297 -174959 287662
23786 -24136 -263799 -44471 -332611 129877 -123973 -11423 99085 371661 -370633 -86141
23775 -135567 -416448 -210838 128054 240511 54108 94735 -277448 314723 172398 -27840
23764 144430 95322 -70528 -89079 -10005 -123459 -70735 -40959 -135932 63926 -203202 302722
23752 13765 -15504 159541 161973 -56322 100894 15218 -30817 -8454 39522 -169661 -232675
23741 -232675 86907 -445179 57568 -175233 35695 -44204 4964 -290940 -229601 74563 -38883
23729 60319 -4898 -144964 166125 -22173 -436596 -212257 -156601 18889 33287 -126907 -221316
23718 -221316 -239849 -90855 -46105 -207159 17024 -24338 204338 167055 117076 103029 -5374
23706 98207 -193639 -101402 -397517 91972 163224 -26369 59704 -109258 163795 172579 -161175
23694 9324 -212198 22098 244732 551059 167505 4928 262060 8416 40049 -220150 -8809
23682 25894 -10155 -339983 -79053 132694 -258995 -232252 224359 214930 89051 -121221 152039
23670 -171305 -205330 70241 -216977 -168279 42523 300154 123262 13367 71718 -211935 -52187
23658 -116769 -135085 110242 103566 -329523 119262 -105217 167468 160038 -207389 -161464 58896
23646 253205 61768 -362679 348142 155345 -71087 71470 -184804 -63194 83448 52659 248883
23635 248883 98136 -50829 117980 97421 -22982 -214047 -113521 -16812 76776 -356303 148921
23623 121446 -20907 -97151 132813 -212644 -156413 -70186 44838 -224890 -32554 196400 -253515
23611 -431910 -196360 -278695 71712 -176177 76822 10838 143588 -147587 -148913 87483 16236
23599 51335 -84571 319316 125696 22239 135124 -143255 76084 302463 109988 196560
23589 196560 575901 136036 49107 -268617 1923 -284657 -116475 -195981 141327 177987
23579 177987 130128 -394865 -280553 166828 135882 -307844 -11883 235324 146183 -55970
23568 -297770 -102333 -274959 -288171 291306 -504953 159592 -8514 -102911 249430 276301
23558 276301 5468 241166 -170543 -38110 80924 -103517 -189543 299320 -29464 183948 -24306
23546 129122 -119370 175226 131319 44113 -244366 -232139 42397 -108129 195401 276951
23536 276951 163937 300091 18866 -47142 -233744 -90556 -29053 -82016 -169593 -192108 -28556
23524 7930 -234258 -201355 296824 -12132 -18396 -7586 7585 209721 160077 -164628 73206 -7995
23511 -27629 -44979 -89308 -28603 -43691 14209 69625 -256314 -254439 -1979 76299 84222 25492
23498 -12864 20566 6554 -106913 85856 -99042 -231320 -118653 -26528 -113611 108735 -28608
23486 199483 -63847 220572 159892 -195213 -27904 72156 50320 -68618 80516 194803 -86282
23474 -27230 -68546 74094 125716 129437 -114301 362262 163571 -36911 133746 -244426 41468
23462 -216838 -100020 -154110 -33004 25437 -13506 137412 -37830 140123 -35461 -19099 -19225
23451 -19225 204104 7154 54176 91502 -114460 395523 78148 7394 171496 95782 210768
23440 210768 -192985 226090 -214463 40210 -327656 -281470 -15597 78990 -172308 359207
23429 -62806 -83686 46139 129550 96293 35265 -42265 1366 -220327 311313 -19520 -222923
23418 -222923 328334 127485 167547 -290734 17540 -303782 -304412 58093 -87631 -81601 200344
23406 198140 252464 -258804 31007 -459581 -61709 -17843 -177585 -91660 -14212 -383766 198720
23394 157331 -248072 -354446 -12353 -78467 83943 127562 90634 -85796 -123446 -172315 -12156
23382 -36234 73646 -77006 -137621 54570 -14080 -12579 96037 -178197 -186778 72856 102791 -166678
23369 77239 -100792 67316 -304255 -13689 -119263 65176 -201561 19721 100079 180393 180424
23358 180424 68668 -189601 30572 -35632 -116239 61485 94639 -230022 -196229 -98590 112563
23346 258275 -229853 184934 -98019 113090 -12385 262079 -101494 -98981 -59375 -24658 320
23334 -185642 -58749 -170243 282120 -169566 -243745 89732 -36023 46488 145694 -301385 29445
23322 -104819 -57571 -74380 49819 -7796 -28521 339937 -66294 53160 48725 -285786 -69211
23310 14571 -23056 -234013 -89954 -331234 -66755 174428 -91121 244375 -302764 156352
23299 -213357 173691 -294827 -159171 -220493 -49625 -153825 -153028 -288892 -263396 -262376 -138370
23288 -138370 172409 148584 -282084 -202172 65219 -75262 64991 63438 -22648 44497 -89058
23276 44264 -114381 -158139 -341172 -84017 -182233 -112527 -53193 -6618 17295 151505 58676
23264 110693 -34711 135522 119128 -344634 -25024 285656 -195420 24921 -177631 26665
23253 -63814 -47636 315104 -178115 37545 166641 99748 -161042 -201958 299021 -300028
23242 -85615 -160140 -71444 130069 -37114 -236704 66019 -20353 -114167 -164111 -14954 -475775
23231 -475775 297008 -55059 80083 -37085 -109448 -215055 -197263 177606 -78358 -91400 41249
23219 -101009 100056 51465 -60015 48349 -5762 -63070 149212 -34394 -288724 150572 97526
23208 97526 96312 83274 -175720 -140330 187951 -251856 -213178 -148468 22860 -101171 -161329
23197 -161329 -131494 171540 -19373 -48692 109619 -66576 -153610 37070 206703 289363 62749
23185 101807 -135978 276050 127490 -122178 -22870 76223 -148732 14381 128786 -323459
23174 897 -198270 138949 -127894 -107744 -130208 -112038 -177566 122970 -154979 -204702 -38121
23162 -125120 -55191 241344 -106443 -161943 72760 9571 -175836 -218533 97270 -337230 -406285
23151 -406285 213012 75971 -205155 -296856 -68279 -280389 -235974 -40329 -203859 -100207
23140 206231 -114898 249531 -9930 -85117 -160527 112017 -807 87139 67826 -176699 21468
23128 159891 -159736 -91251 155698 44023 -49244 1414 -40112 -30958 261613 137817 47318
23116 202549 85309 -12044 192048 -220051 206460 156901 -307068 -161779 148357 -186806
23105 -285657 44890 311094 251818 -36826 -241288 -54062 -154397 70031 -118102 277613
23094 -232094 -303481 -222825 144023 89070 214266 -50500 -107724 35766 1784 216203 148958
23083 148958 64858 26944 -48050 -131969 -218515 185234 -234586 56488 54177 -31873 -119740
23072 -119740 101531 1616 -107426 208846 105654 10936 -74482 122680 -32237 153918
23061 -19432 -199762 -13567 -52888 -28984 -130529 -261126 204350 -33762 38895 197585 -72472
23049 -141656 -184333 -286492 -70441 237716 472 -207971 11484 314120 -7280 227545 25945
23037 269466 152255 -81308 -68556 11909 -241436 178900 64386 -115729 -115703 -100848 32012
23025 -109320 37335 365044 55347 -197073 -142784 -136982 -88986 229439 -34546 -157460 -29937
23013 137528 -96958 66953 278258 -3402 -150681 -54640 -145905 -29540 -70479 -204883 100777
23001 106167 -127229 64966 -33895 90490 -333925 -132278 -42268 -39085 -102655 149020 -115523
22989 148976 148193 -141589 200518 -75885 55264 -31843 -94007 -251805 -113912 134845 -102312
22977 -348634 -325969 30279 73460 -38804 144170 28417 -222637 75592 158669 317542 -22114
22965 80194 -34731 -197169 -370539 -128350 159769 -59480 -299638 151106 -35548 -277634
22955 -277634 171346 226698 -40022 -1452 -120024 -88866 -123698 51639 95307 41981 -197680
22943 -84956 22800 43731 -118470 -123585 99348 80879 -196714 380648 57386 -79244 -170390
22932 -170390 -213437 76570 -81588 217807 12117 -190772 -121378 -145379 129650 -2151 63483
22920 231620 -140791 6810 -212642 -4832 -36999 87770 85296 -33637 -75158 -59371 144398
22908 -61790 -112754 -395976 88286 201303 69031 330099 -92034 -22578 -192950 -317908 -325142
22897 -325142 -51154 -92560 154837 -54033 120535 67801 152987 127666 21614 -184338 -182108
22886 -182108 -66024 74108 -242995 -13778 103982 147539 -237311 -38659 110986 241754
22876 241754 -349328 -223005 309709 -127893 -265161 202838 -395624 -305735 44298 -255084
22865 -94361 -203285 -204430 158865 60367 8753 -1984 -54176 -109295 -131794 103108 -46611 108992
22852 -159187 -120705 -119879 -78161 -234615 119635 239391 149661 176106 -72569 -109522 56446
22840 -168022 295408 7970 60284 250439 -193296 -135505 -210064 454771 -92117 125234 -123752
22828 -100358 -114457 403890 109044 -303196 -162899 -37513 -242117 80274 -388174 65917
22817 67838 115019 168988 263233 -2370 150955 186083 10874 77664 7541 -12878 55195 211580
22805 211580 64565 -268051 -184452 -65503 -377054 -291614 -135891 86798 24660 -7819 -344358
22794 -344358 111855 -449842 -5157 -132502 -194720 157028 51156 77992 -138617 -72141 145882
22782 -212007 -105613 26422 243670 -157076 233106 -49807 -343427 -41460 26736 211509
22772 211509 194759 -101207 -86174 16751 -93270 200900 -120003 -458463 61214 -116873
22761 4961 -183686 78796 -217740 401340 13208 -64044 -113034 -50316 -69678 78882 -238486
22749 -90685 138847 63294 -108037 -80134 162613 -203271 100305 -181083 -15087 -71714
22739 -71714 316915 -388955 41158 -127401 24891 -90176 24926 -92949 179733 200776 -300309
22727 -94425 -93926 -163524 -268627 107139 -258725 -33573 -111825 252221 12188 -205505 219469
22715 -193801 10823 -14553 -79613 3466 -69534 168402 -168669 -143266 11990 79492 193673
22704 193673 -157077 245284 87628 -160407 107647 -18894 104175 157165 304024 -17338
22693 -79907 49358 -199846 98993 -297026 240461 -160897 -159804 -24799 -88226 297510 -446378
22681 -61087 268493 150454 281921 -221738 -257944 37895 -6184 -299609 -399127 181813 -8519
22669 144378 254840 -76742 -45755 -84158 -8283 -33684 301160 -128336 -134262 -311704 -41084
22657 -389058 -200022 298956 282664 63493 -331183 -289958 -76932 196107 -148546 20255
22646 361311 72984 -232885 94039 177923 85008 694 343517 -124997 -223630 214813 -201436
22634 59393 -102861 -212692 141445 79125 167999 291717 55384 149930 -9060 299112 147814
22622 -215701 -223482 126471 -111723 1662 27323 22359 -103501 -153578 -280743 64948 28002
22610 -81375 -73416 -124473 109739 -90388 -167935 -153970 -372380 33069 289805 -284746 61706
22598 81834 270100 -281021 249154 67840 205377 -235372 -341311 -17916 9511 -113078
22587 208561 -13927 73460 -579 -395321 -156961 367031 -187396 102604 -131211 177639
22576 -204742 -422079 -125777 -51650 -394996 10384 373480 -505027 -177123 -6346 -5977 -176577
22565 -176577 25369 77877 -113209 -141573 24793 -559554 184940 -45927 -58634 -74713 45882
22553 16753 179103 -160877 107458 -6664 -35367 59366 205672 -497906 67090 -187184 -146870
22542 -146870 37080 -8029 -27760 -81603 -157981 -180789 69082 -17016 -100982 53379 273177
22531 273177 72968 212149 -103776 -142090 56144 -103406 -393566 5410 -278322 -62315 -103347
22520 -103347 -43015 -109551 -59523 -88252 -214996 -64902 -283239 345679 -91003 -69545 10447
22508 189431 -269639 -24476 259126 -134779 -89655 -307572 -78510 43704 15879 -45015 -253621
22497 -253621 -6472 -115827 140811 9694 -107803 -17188 17358 -276437 -231219 -421263 -51336
22485 139600 209868 400886 115248 48831 -139031 -117589 85510 285474 -11537 226685
22474 -77643 -18973 380430 165628 263771 -83150 300902 93858 -77978 268202 -12671 -113919
22463 -113919 -73960 37588 -85786 -77553 106764 -145470 41565 58541 -103395 -120533 -7194
22451 57803 187355 59822 -49953 -117592 43848 -62045 -21773 -165765 -118858 -16035 98055
22439 134561 129292 469811 -222878 55857 -340093 119468 196677 16701 -256026 -147743
22429 -147743 -83902 -111259 310003 -81369 -108210 115800 -86104 -450508 243803 38621 114803
22418 114803 -20812 -60634 10614 -108507 -89280 -16418 87654 -206101 -7542 87538 -100605
22406 50047 -84404 -185239 263003 27891 -195779 -184297 -41812 -144002 -228461 161096 34726
22394 -200828 191994 -232104 12880 -43925 260896 -35953 92315 -341178 61255 -150041
22383 -160407 78453 -197331 -373893 -3108 47186 -107779 239999 95164 -563619 -236706
22372 5068 -105654 28765 -5403 108571 210081 41636 -80533 115398 -12342 -226151 -165507
22361 -165507 201427 29471 362340 -171575 -259647 51390 187499 190338 227283 290525 142898
22349 -122869 128039 -83300 -55138 -53058 -222531 -12173 -57750 -98664 -34348 -120265 -212470
22338 -212470 -176268 -273237 -61503 16212 -115749 -67287 13732 -511846 100316 140887 -24315
22326 68576 114488 -187042 -280079 5187 -78967 -46930 -95425 -37404 -199917 119951 -345367
22314 -8431 94510 -276938 -277648 108638 126449 248849 -259321 298286 -304680 -380375 53916
22302 -119131 -234184 -162162 148275 -124862 -248148 -217633 -36895 103814 -58890 -10281
22291 -209788 -27546 -20308 -74280 -71304 -547683 51828 -290555 -44227 -53320 -157568 -57314
22279 9763 -159337 -136284 -190829 223223 -329355 65223 239875 -112200 -272318 120494
22268 44404 49013 81751 120745 114452 69341 2354 -62422 48972 22312 28234 -166609 -128746
22256 -128746 139069 264932 -56558 -182564 12470 -3381 -124932 58242 141331 47807 234381
22245 234381 -103929 -89496 119337 -210942 -139108 -253989 44969 -100059 5675 -306836
22234 193367 -49339 227372 59173 18501 -100275 -179004 360576 17951 -129191 55886 -142837
22222 -18674 171592 -14327 174231 172419 -125712 103716 32154 -404966 188500 -37928 301869
22210 116590 127003 -104431 155627 -33185 -76153 -5946 -195582 120579 -169648 -112660 -74812
22199 -74812 -169877 -128778 143928 155724 -83838 -271362 -189031 160900 45391 -29083 -191611
22188 -191611 55197 35729 -34449 195737 -96099 94512 124514 -87702 51102 91023 216236
22177 216236 -66228 -135735 210232 -130163 136452 -4704 3056 -251043 -135824 -122451 13659
22165 -203532 -336845 195128 -112870 -357393 66052 -66750 157341 -294346 -223558 -113897
22155 -113897 177233 111013 -193786 204834 -57839 84644 -365395 -224573 -116921 -32158
22144 275544 -193739 -27605 -226240 179907 91054 -231491 -117593 -114832 37545 -314087
22133 -40515 -84177 -21138 90485 -591600 34937 59211 -18541 -3129 -126033 -199566 57293
22121 146423 100589 91820 -570899 -63042 -31027 -152640 173681 -352143 114109 3999 43207
22110 43207 -34040 -37242 -276771 272025 234489 124387 -168978 84357 -225917 33571 -115326
22098 49796 -193851 -147705 -207708 -313443 -143689 239446 -259362 -640265 -154696 -4904
22087 -17580 71007 -209634 -39221 100079 83448 260291 -31467 -137474 287161 -304369
22076 -235994 -112048 124877 -238154 -661247 -150102 -191325 -405221 -98062 37732 -91899
22065 137090 -389968 40680 49404 -258410 38088 -311782 -164571 79256 184395 35907 151086
22054 151086 6523 62737 -366503 -111842 -320953 188105 -217412 -166108 104003 -338929
22043 -67728 165092 96640 76222 236224 -395500 -545 -82701 86552 -238341 51661 418069
22032 418069 155232 7307 -217652 74244 84961 154313 -166245 -154845 -24971 -90539 -16319
22020 67232 -137651 -211559 -315951 129392 95591 53656 -155884 -80497 -192247 -12009 12550
22008 212995 -207141 76640 -248005 -115575 -111457 -212037 71778 369541 -158767 173883
21997 -177531 287731 -64291 175843 -144843 -85844 -100665 344723 -258042 229129 -110275
21986 -56079 -112512 -14208 8331 199815 -46900 -201380 -107062 -141620 -31904 325433 10553
21974 -22647 -7798 -115542 -375712 66193 -163484 -88517 23898 63893 238673 41822 -89899
21962 -46041 -153144 129088 6310 134779 -430412 -10851 -5626 -137110 -18908 -23229 -184492
21951 -184492 34800 41280 147212 -71762 -168877 17036 -174916 -11350 -28154 -81984 -367444
21940 -367444 -134426 -81716 -158696 86102 -19823 -121376 -1802 68122 82714 53018 396464
21929 396464 -355434 -214710 74425 -142953 335893 94125 122123 169922 -185212 -232715
21919 -232715 -239225 197374 -326760 -52513 351598 -230757 307276 168625 477719 42100
21908 -292181 -139930 -145686 -169053 90598 -131941 166219 -452092 -379023 -174323 -5866 17324
21896 211059 36310 -674 -87854 265044 -75662 91527 -21208 28225 22439 5084 345546 58853
21883 318394 -47850 -161656 57285 -198928 -14944 282956 -129787 131557 254132 -91003
21872 54313 -84431 -315688 -187 -394314 -81494 -211291 220971 -188676 -196716 10715 -127130
21860 -32188 237606 -128075 -17451 354180 84365 -136335 -389915 -109311 -19752 -261785
21850 -261785 170673 132483 -313331 -38587 -337075 1851 -20133 162772 -169356 -166598 -277602
21839 -277602 -187568 278659 -26643 42270 -174149 -48058 -169934 -25252 -137420 84035 330426
21828 330426 -68097 -112420 -195526 169452 -111742 -534446 -483339 -157100 79774 -316934
21817 -115273 -51364 138656 148678 3882 147220 205918 -64225 -156219 -182792 -41647 -9986
21805 37376 43012 -113274 41482 -22511 -21951 -131592 -117711 217342 85438 176329 -95156 -131984
21793 -131984 146923 -238382 -64097 -46298 -277414 -93793 -64277 -10618 34584 4814 88276
21782 88276 -436887 10591 -211602 51828 88199 -73372 63859 -60964 -245116 -534004 -150735
21770 56356 250656 145881 183525 -115757 198116 -214408 -114500 7991 -141737 -252892
21760 -252892 165172 66158 10849 125748 -5977 -64257 -213895 -198977 58238 -445873 -159307
21748 169113 -79044 -150805 44442 -262247 337712 159363 -68298 157033 -122421 17390
21737 -103121 -378982 -72808 -412921 -12667 -149586 269232 -229591 243302 -251528 -20505
21726 -52186 -156382 -145316 110856 284577 -205890 -294987 152679 -262078 22897 32080 21426
21715 21426 -260244 247916 261761 -160297 -70829 -28858 -318976 -14593 -330046 -76191 -249018
21704 -249018 -91357 -35101 -166576 -488705 -100849 -78134 -142290 98475 200072 178700 -102673
21692 -426618 -253772 -40732 -137967 -72203 101195 49570 39969 -67842 -140568 -141125 97332 -38348
21679 -95247 -278218 142431 71280 -88473 237817 -99067 -120415 -39655 -175886 -93423 45197
21667 -84691 -265967 -80956 -65404 -93370 -396272 -38116 6837 130179 91802 -493090 -247102
21656 -247102 150266 99582 -43916 252893 121630 -68682 195846 141308 240077 -154683
21645 -158061 16617 -82525 -138487 87361 282248 35416 8843 -160031 -369221 -30430 128444
21633 -282483 -220129 -122861 128440 -4787 -122662 12863 198753 -137868 -59318 25040 71775
21622 71775 82161 -177478 264524 -22653 191672 97836 301060 -186078 -274767 -251517 75788
21610 239216 -107969 -221442 -168663 -58803 -153529 -208649 -38299 5536 -20428 -139165 44439
21598 132633 62137 -237509 -68167 97765 -134671 22423 -266660 45257 123891 -105272 -274113
21587 -274113 -13464 168324 -98183 173878 86414 -72880 270544 -150680 150744 -50692
21576 -38851 -143433 -118760 -368387 -236395 -413208 -47868 -85827 -37280 4777 18900 40527
21565 40527 266481 -137393 240485 -18994 346584 74453 -184910 -252910 -50652 -66730 114585
21553 7995 -188869 -43170 -31271 -158938 43221 -89180 201869 107935 156711 23673 221651
21542 221651 62092 108514 114903 -54145 -108134 -84015 -118488 135438 -351291 373428 -3977
21530 66546 24920 12193 76703 49843 -257182 105651 66411 146282 410536 -246946 95404
21518 317278 42000 -185782 -239902 -179236 -228846 9451 -667 223826 -159135 -89382 -39725
21506 -92571 130614 53372 -386323 296034 -15533 3749 -274575 275368 201865 21703 -193994
21494 -244117 -367608 -192630 -23301 -285183 -277140 -27188 -256384 -161517 269780 62082 86156
21483 86156 -107552 -249672 191379 -167552 -43853 -79131 101191 -124371 -34070 42521
21472 209937 9145 -50271 282413 76593 113903 -193164 149848 -66696 -207018 83843 -2754
21460 -102502 120305 235593 -100148 41325 -227011 53222 256608 -55118 57148 -156918
21449 91865 -47946 -188394 232617 -142124 53630 58801 -184158 88261 233723 49665 -25821
21437 -170296 540149 56095 115139 115970 31681 -129634 742 -46129 -229896 -86278 76430 67466
21425 67466 70974 -56099 -22184 -10119 -48333 -166982 -32708 57858 -304659 65580 196326
21414 196326 267614 -58726 -265365 -83251 126684 -63713 104156 331340 -4288 188827 3741
21402 71715 85369 -61919 127993 201379 -235882 -117607 -157643 18852 -362952 -147227 26421
21390 -58595 84515 -203870 -11385 280955 -284703 -332514 -204085 -19843 35600 -236786 -194010
21379 -194010 -100260 244963 -28202 -141167 -114334 110173 -95187 -161088 52440 166279 -287131
21367 -46252 -77478 117946 -66584 -231502 46407 -60116 -258497 -152533 -183667 -34449 -304452
21356 -304452 19307 239147 64569 -32922 168883 -96917 298889 -197449 -73347 253647
21345 -42844 58273 -19051 -72989 23496 243194 -37886 -98618 -90556 -359525 -273567 14196
21333 -244706 -76363 184887 181047 -269805 183478 25921 -151312 75888 3525 -51094 52653
21321 -281943 -54217 92249 -118087 119181 110200 -91329 -86116 -120207 35388 18883 31767
21310 31767 77393 240385 -40500 88228 -188675 23302 53762 -127535 50268 -236539 92229
21298 151839 -422537 -203300 -131886 95254 -78596 436 152234 -163567 -55584 -83375 -201997
21287 -201997 -30830 -191033 -194249 12396 -355953 79755 90879 84695 336592 151368 79014
21276 79014 300104 -321328 184078 70027 127435 -29242 67467 -131956 -182218 90476 -106657
21264 61780 -231725 -70982 22129 -83939 350062 -126939 -65239 -177198 -88798 46819 14903
21252 1163 -19424 -257431 37630 -121742 4848 -174813 -182055 -128941 147784 -141401 -25286
21240 -288136 121124 113391 227687 78761 -237086 -151508 -90758 -259813 -149656 159977
21229 -204761 203543 -48535 206845 -324982 82300 -13806 58673 -81551 -159885 141194 34746
21217 79267 131713 12779 -161625 -153592 -124669 -404327 36305 -44633 75714 165291 -55797
21205 141946 42072 -145397 24126 -62599 -475735 -66054 -100065 -87056 122040 -35120 77
21193 -52785 -136800 -132264 31646 101353 45862 -168592 288325 189928 -154918 -154500 74612 -143470
21180 192370 128088 116759 303747 87764 -112881 6677 -25473 159118 -40863 -101903 -389939
21169 -389939 -42136 96319 108833 -368566 -59493 41020 -133142 -17131 69182 48496 -63700
21157 110913 -37349 67150 -58592 26108 147531 -45680 -215104 -109923 -54985 -364259 -134811
21145 -56668 68995 -40690 -36291 63969 -209172 -281378 110263 75053 1391 28015 -52745 -143620
21133 -143620 26953 -58576 -59109 -262491 -16748 23343 -295616 51491 -21473 62119 -183202
21121 -9998 -140624 10835 -198019 -234679 -30768 21088 -34697 102908 -128367 -10625 170654
21109 -101210 -131190 176671 -263723 -198057 114314 250290 187027 -5958 -182589 -183471 -28121
21097 -281287 -193741 -281176 -410087 -87189 41779 -169571 128829 57346 -67446 -233630 110031
21085 -227301 255352 -22631 -70953 -306176 -144974 106746 -12554 -38675 -231953 128639
21074 -50282 14086 52374 10827 -232454 143403 79116 -189010 -145859 -221082 -135385 28010
21062 -162599 -88060 51047 13258 196853 430985 -267449 104113 -101055 -177159 -10929
21051 -106277 -86023 -66891 -237927 59822 173445 -235748 15463 55915 117006 -267650 -30090
21039 -323151 -530200 7579 11364 -203 77087 -92487 -63443 59037 -207169 -183606 61253 206560
21027 206560 -119937 88642 -48239 57379 27566 -414491 68895 -125797 -257003 -157238 197716
21015 -191851 -234229 -122751 -135318 -92098 -92108 56496 -121347 -176628 -182554 -20757 -26881 188354
21002 81003 -30844 -71654 70872 -90918 -306106 243164 53240 -350470 -125326 -80615 -370203
20991 -370203 -22822 15207 98830 -106490 27610 -253953 -109682 -46272 85611 -57304 -153138
20980 -153138 -69199 -293753 -8447 -238640 -179535 -21803 -14836 150877 -68335 -183492 151967
20968 152930 -35264 -9411 -63689 -144701 64700 6284 -120016 39961 -139169 604 -342350 -5562
20955 -214224 139173 -218369 32544 113416 -38492 66214 -225639 9409 -25750 235164 -81319
20943 -41229 58024 -191958 -444290 -115319 281279 -102859 -404394 -120570 -50007 -210138
20933 -210138 293938 -193346 254700 -125636 1489 26975 -134388 93993 -26476 -153671
20923 -153671 61085 -108131 105148 279136 130205 -44977 16562 -205729 -52923 -37783
20913 -37783 89534 150722 60129 -119062 -218705 178206 -33903 47712 -118366 -19781 -211379
20902 -211379 -35766 129198 -408980 164014 -140496 -72571 7857 2392 -130391 150606 91489
20891 91489 -519890 428881 -80576 -71939 -237003 -215433 -276306 -249557 39147 -136109 -220636
20880 -220636 172183 40311 36419 -75126 -126868 229554 -420 -405646 118050 219657 -86603
20868 47104 -352884 139798 -226414 -27323 -224938 -180422 159353 -50604 -104708 -102363 218935
20856 31429 97981 -339821 44102 -185157 69279 -325168 -110115 54217 -406362 -321873 -29888
20844 225685 -172019 191438 -101587 -100984 -48742 -312891 228058 -131949 -339800 -9269 -184948
20833 -184948 -145109 362695 -263211 -3020 -135579 17995 -408637 -50631 45716 -167180 -47034
20821 20437 -238821 208840 63320 -105293 -267502 19937 -119740 271975 -56289 -124002
20811 -124002 -18423 282294 -248297 92564 -214950 -7652 -254508 -68216 48158 -189561 -140214
20800 -140214 -60459 -82716 -133369 -62707 96534 105844 -260257 1887 -381593 -133037 -275614
20789 -275614 67635 -472088 14848 -119385 8100 73490 -30239 48279 142220 -163039 90450
20777 -56027 73179 273186 -272068 -41709 -107705 -183048 229726 199081 -13553 -158164 -194597
20766 -194597 -12905 -19078 -132217 411127 257190 -48552 -141322 -159607 -161493 -69560 -6664
20754 -157579 49503 106459 50759 -195150 -480386 -109500 -36866 -2174 -87362 90850 37337
20742 -29905 384668 174968 -117564 -139596 -13076 -509485 -264053 -212276 -45186 105097
20731 -26074 -329288 -143355 -40870 16423 220138 -42206 176844 66670 -141835 -164319 -65872
20719 -88126 132863 -82140 -216219 -216524 18794 15572 -42213 134373 -140625 -241735 -183181
20708 -183181 52359 -109513 12173 -167297 2686 -131429 45207 -11050 100758 -55653 111151
20696 112425 -238668 -269601 75272 -59230 -97300 -281665 -21462 133391 279080 -221794
20685 -108066 197953 80757 -205911 93157 40621 -331760 45081 36381 -77517 -117866 45843
20673 -82848 -229266 -211210 -42039 -148302 -55264 -140818 153986 138960 -35094 156912 -239553
20661 -186657 -140426 20114 79250 -261057 -148954 -98368 -385434 101903 -71588 163024
20650 -264427 160954 65024 -136641 -113648 -176953 -43680 -69369 -339843 -368066 -7054 272270
20638 26158 144257 -162585 -116413 -87611 -116468 -31918 90775 29377 -312436 -117120 -5211
20626 -260256 -414727 -114191 185452 26492 45105 -56062 -64499 -239830 164080 259413 -304160
20614 307490 55957 -7270 -388798 -62611 -28536 -70367 -79220 -127306 -116998 -127458 -293260
20603 -293260 2837 -75601 76549 -67832 21127 -202143 316877 -36094 58819 -24918 -472540
20592 -472540 25708 104708 -435076 350647 -67230 -34730 171836 154449 98381 -109364 202082
20580 310121 30613 -89571 -104543 -155465 291642 201399 111955 179951 145946 155063 -419938
20568 -66322 213530 169703 -206909 -91495 -18688 278563 5343 -192054 -312727 -166759 68521
20556 23219 -87340 128295 347290 247386 71983 -212007 -102275 -13124 359641 -174264
20545 -132169 -110846 -330315 46378 -262028 -113607 -253597 -78300 -197888 -113922 -156931
20535 -156931 -215750 65608 231992 -66357 -215908 -345795 303021 -239997 111559 -267550
20524 909 120388 63425 36218 50274 -486989 -98268 -56847 -106383 235496 100848 -59658
20512 -125390 285964 -192394 -292653 -106690 137344 -272646 70395 -98681 -24226 -199018
20502 -199018 -149756 -97783 -337780 -377179 -378308 -21979 -167536 -268592 -358194 -313532 -32947
20490 -54905 -17434 -119604 -222337 45333 12826 -168762 -31111 57938 126901 12217 -144079
20478 -22656 -115114 201714 256099 -176414 -106016 98153 -60028 -103942 51202 -146420 -339554
20467 -339554 -9686 -69348 -125131 80791 7463 28298 160975 -107263 -129335 -23736 11021
20455 512390 154214 -23376 -498350 -56375 5274 4509 -240804 -96841 158756 -53997 24180
20443 10271 -228947 22864 35951 -252198 -202005 -313588 145639 18513 -34426 -180317 -141189
20432 -141189 -79035 -116554 152837 53578 -191871 -58067 145973 -163684 -29148 -197698
20422 -197698 -84349 306308 22754 -525516 130146 -173056 -1471 -202991 190179 119400
20412 119400 48599 -313789 21731 -111821 182527 -155057 218265 -313606 -239195 357141
20401 170445 203502 -27303 -286195 -415992 -135296 -161308 -264019 133891 -42908 181622
20390 129800 -236622 -224479 -120489 -168350 -119050 -9602 471723 68674 54209 58803 384200
20379 384200 -290858 19261 -71540 -103443 3588 171884 39844 -136715 -25243 90026 178545
20368 178545 -65998 -266339 -111819 -73010 14956 -25245 -160820 -235695 -157304 -46017 -38017
20357 -38017 124974 -363213 171867 -314902 -336722 -92816 -39703 25178 223405 77767 59497
20346 59497 174296 61315 8524 288424 -29211 -157892 -139400 -8127 165376 -102618 -190955
20335 -190955 43439 -193939 183379 79838 35107 105080 175103 40247 -35560 -139425 -325210
20324 -325210 -57033 -36112 -171500 -26708 109050 -157787 29631 -22336 183171 -223977
20313 196038 -96109 191332 -25044 253524 -38546 -302774 -20507 25062 -95781 149467 -116345
20301 73520 212199 -170178 -231865 136722 35010 -25999 -33526 19625 -391668 -289337 -98676
20289 -309332 -151305 -50314 -334101 161355 -84065 -169866 -322069 18454 416818 -81934
20278 78769 -3963 -119428 -52986 7392 -11785 -207040 61487 129650 136075 -98181 -4775 -69810
20266 -69810 -266025 -152680 52589 -177241 -10775 43327 -73454 -78990 -269571 75659 122205
20255 122205 -201806 139386 -135556 92525 -428348 32763 -279006 -436120 -79743 -158002
20245 -158002 -482546 -116384 -41578 -62532 -237358 113511 -45815 -83932 93577 -82448 -69309
20234 -69309 -464377 -297455 114443 -273301 -42050 -6131 -87435 31074 -48464 -190112 -97254
20223 -97254 121936 -167075 -208368 -299327 -79671 -39096 85685 -363085 -13644 -118865 -356325
20212 -356325 -365742 163870 -213295 57251 -234080 137039 252430 19402 -21219 257533
20201 -46369 -218710 -379272 -114534 133822 -88027 -159538 -22697 63314 -160029 -197576 110733
20189 -372441 -137159 89969 -202625 -35629 -8514 -89247 110729 215869 -258350 334012
20178 188608 -78750 275505 312135 17996 -103011 -310043 -204829 82922 107424 -77180 -135034
20167 -135034 78450 -130691 44941 73144 -122897 160394 293002 -147001 -145512 -317358
20157 -317358 -2734 -102156 -137148 -113235 86803 -67950 -197526 -181352 -56034 -117885 36418
20145 -168800 36314 -48129 70030 -50503 -317048 334151 -136340 258383 -118466 333879
20134 -15686 -383769 -91419 80890 -45975 -110119 424884 -4910 -3117 12274 -144619 -73137
20123 -73137 -217413 59261 211964 -342733 -288960 53023 -204462 -46648 150288 45322 39569
20112 39569 93473 61875 -153611 12653 -305251 -28118 -115450 62891 150091 243758 48872
20100 114119 -363538 -53837 -197962 -56633 116744 -219005 -138316 186795 -89547 -179309
20090 -179309 -33297 54991 -322840 240686 180821 83388 65946 -230469 135918 -18575 -173127
20079 -173127 -366236 42980 87832 56216 -116459 -15145 60279 46135 -43193 -175048 107981
20067 -107423 -83661 -381006 -2877 -142842 -168889 -50982 -33814 1602 -183630 -215301 70726
20055 -210639 53586 -308411 -203329 -172371 -161909 -135264 -729 5319 -21648 -92549 209664
20043 -42554 -235154 74348 -67311 101684 81209 -54113 -307829 -321579 -77424 -47410 19758
20031 -39284 34042 -68049 49896 85578 56738 -54499 -246397 -189166 -159085 -1264 -148266
20020 -148266 -185989 188834 -224145 178292 32216 -330471 96493 10876 -158585 73572
20009 241331 -19267 -208777 59598 -285962 -126591 -81439 -50324 -345139 11160 -143229
19998 -311249 85869 -148652 229839 55825 -15522 43216 -73420 -125915 228201 -56743 -113630
19987 -113630 -31696 -129475 -26237 -275660 -180139 -1163 -12331 103730 129221 8857 -133465
19975 324388 -135386 -285534 -296926 144945 -362247 -81196 207613 -200972 -46709 259898
19964 -130873 50051 12368 -17971 -114871 126456 -266284 -146483 -59540 -33226 343291 -68033
19952 -73 53472 -57112 -105301 121752 148056 -192111 -127776 144949 3303 -20038 38533 -228682
19939 155593 349115 195439 277307 -353814 70489 -234520 3898 -329489 -470716 266767
19928 44770 46823 -338501 -4510 -9367 -83308 -61081 -305169 -188142 -535114 12102 -57877
19916 161019 -104936 94957 11942 79605 115755 -120917 -40780 -10248 -256615 -429075 -59525
19904 -263186 62195 189827 -140160 -228557 91955 -64953 344883 -418994 -266062 110278
19893 -199751 -293963 51876 -160204 -41452 184231 -214835 -135658 -28604 -5544 -54213 -120127
19882 -120127 -78199 126226 58708 -110868 115350 -191094 -199840 -69269 -134209 -210793 319784
19870 -17967 -107576 -59577 -197231 -175430 -140810 -173029 110138 -42038 -145842 133767 64816
19858 3431 72686 -151467 142200 -70307 16636 -45574 115165 30544 -142245 -15333 -465806
19847 -465806 -159724 -93609 -244393 16511 -38367 -163805 180970 -45197 -19989 -8103 -65732
19836 -65732 -240991 -123938 -382901 -75234 132323 -280427 -193931 -203539 -30426 28000 -99912
19824 -104105 14410 288076 -50836 -131275 -124221 -31889 -139805 158336 206728 -170604 -173065
19813 -173065 -243820 -109666 -291948 -41105 7532 142518 -73804 117619 -181101 -145052 -35549
19801 52475 -57467 -395132 -380884 -93359 -12216 101218 -58410 -22298 189069 -255423 -7097
19789 -118112 -375857 -146803 -48021 -265426 -1897 -74284 46298 21775 -467169 -594160 -89114
19777 -241740 -153295 30190 -193892 -235879 76479 75288 -85808 -38015 -16071 -78865 -409792
19766 -409792 -325179 -187857 26716 -178970 233057 -18979 -233553 156307 180010 -71764
19755 -206001 69030 153 252015 139109 11101 388449 -178071 -283875 -460850 -75423 16054
19743 384594 115432 -106007 -138630 -195164 -390907 118268 -101205 -5114 -101770 -95355 -270626
19732 -270626 -3793 -69321 54022 -57760 -8541 -190528 270380 197026 -170133 -54785 299667
19720 76946 23747 48369 3414 -94009 -279202 -157099 104579 -118901 215981 45230 -70345
19708 5383 91014 -82055 -9183 -44111 -92449 103131 -107590 68518 -259010 314454 -49382
19696 923 -106923 122078 172519 168556 139707 -29380 -220880 160531 73279 38044 130246
19685 130246 -341469 287775 -204741 45287 -139153 -19666 205294 70794 -164071 -121667
19675 -121667 42876 -61566 72098 -154504 163295 -108327 100985 -42254 49069 86916 -19517
19663 202216 124986 -88716 -108537 -14024 -45116 -420107 -288454 -210743 -67226 463584 -159767
19651 -138767 -182058 -232618 -128834 164946 -886 -48883 150905 268447 51005 -260801 170012
19639 -241390 -178651 100913 160395 -141347 -44547 -47181 -153797 73232 8121 363489 -4230
19627 -350279 -103510 -185112 -37983 -270142 384950 192708 -123096 -205887 -167532 -64892
19616 -23365 276834 12611 -19164 119499 -84451 78510 -84847 156883 -41233 -90050 -111031
19605 -111031 8016 -97386 -232213 168918 -444980 96924 -17500 -308772 -48291 10260 -58889
19593 259952 -192344 -62908 -251515 -140920 -118841 -278756 118220 50874 77591 -71066
19582 -445393 98092 -131194 -117196 -33305 -46214 -209814 -172826 -90534 -141656 -130432 -135906
19571 -135906 96855 -83644 -166952 -262413 -140627 -159053 -170201 -56297 146061 117693 46204
19559 -1218 -365968 -204704 98360 34203 -261731 -349758 -115115 104734 -263206 -144070
19549 -144070 -72048 -60661 -37355 -41500 -180678 -352495 -86003 -2702 -16168 150195 -133562
19537 -307920 235349 30923 -4663 -50290 -50790 18822 -281895 67025 266180 29736 -106537
19525 -188505 -204353 -21369 -47808 -269014 -118790 -341951 -157887 -72076 109594 -365237
19514 38952 -344059 -319327 102311 -63304 152524 -40896 -160802 -303310 -71263 33495 126127
19503 126127 325948 -238025 18586 60595 -60962 -94692 -181034 194541 -99825 -52848 -450698
19492 -450698 234298 24937 21905 -40160 -102084 -45131 84539 -52188 -98958 -27834 -9485 123369
19479 43736 -202089 -167125 -86918 58137 -41622 76957 152872 -29709 33737 -127342 -365962
19468 -365962 -71528 -144046 6456 -47675 52911 106796 173963 67985 -57292 -33947 -289052
19457 -289052 63234 -43349 -23693 -228234 -121784 -106327 -37250 74132 171188 -110618 46378
19445 -150642 62423 -21375 -150375 -153504 -55789 -393378 -430717 116869 28253 -60076 197377
19433 -133794 -91909 333330 -26762 -100150 114130 -217895 103588 -204085 168559 31741
19422 -203502 23322 -118925 -25763 -62802 33385 -87308 57934 113051 -223367 73621 -110389
19410 -40016 191140 -120489 19311 -296901 -16258 14786 -397545 -19740 -75798 32263 -90901
19398 317561 -161096 31625 -385006 24803 -271660 -157334 -109119 -323965 -158226 -204710
19388 -204710 266308 -32430 -185271 -313284 -54396 -99618 -171605 -44064 -5482 -275310 139593
19376 -444556 -114063 -281159 112768 39512 84831 -126448 121306 21267 -12523 -44778
19366 -44778 187375 73299 -275668 1092 116875 -158000 -198994 -98911 -72184 314041 -205669
19354 63722 187187 61920 -46596 -23638 -185534 -13806 -369088 13153 59070 -150366 -60036
19342 40803 -114951 -193563 -91168 123578 51878 67761 -85063 -177932 214820 49874 -121239
19330 -213362 124956 98163 -281002 -98453 -10150 -135246 148119 -300019 51882 -1715 -276903
19319 -276903 -239485 -294065 -409586 -60134 7188 -175697 -144672 -216474 112925 145668 2451
19307 102554 234410 -207066 74664 5852 -124613 67228 -203248 162974 234218 5646 -133269
19295 159474 -61355 -260203 -326064 -212666 174816 -338280 -119954 -121199 -96419 -38311 -429531
19284 -429531 2044 150421 100280 -299095 -155408 -199070 -251860 -44533 -23756 242328 46904
19272 82274 -41392 65041 -187954 -9727 -219685 -145398 -196332 116275 -38540 52121 -226121
19260 129412 -42475 9162 36370 -75149 -322645 -265185 63534 -31011 -155216 87912 157397
19249 157397 79125 6617 87581 321321 184026 -574467 -335251 167188 -112406 -4533 -11658
19238 -11658 9301 71575 -147046 163490 -174420 34108 186708 -46174 162522 -325152 -148395
19226 -124839 -121636 270 -251277 93584 209808 92416 65148 71216 41293 139434 -97414 236497
19213 30262 -382424 -239963 -15293 -225197 -125499 -107445 -243546 -70746 13014 -251164 64773
19201 -80839 17594 -146803 -201492 -111702 -124561 181106 -99693 36260 9056 -17410 -90857
19190 -90857 30014 -36665 55567 102974 -174321 53478 -77102 -11510 -281134 145862 -230932
19178 57845 78206 -76917 106526 -227002 -172016 44730 17201 -280938 -208629 -57215 -62225
19167 -62225 111905 -272695 460730 -148737 -122465 37160 37548 -322633 -258467 -111571 -95403
19156 -95403 -317981 80067 -70518 -46521 139027 -231583 18515 -77610 -62519 -397860 -205802
19145 -205802 10201 184446 178221 325275 -136052 83174 -355024 117395 -460003 -38125
19134 -323696 255608 -484771 338463 -300482 18248 119038 -326753 -522491 98185 -167137
19123 -73062 -10360 209282 64497 -45081 242102 -123066 -122468 -139985 125158 53589 -24707
19111 38625 -52848 -103424 -1365 57123 -36440 -302510 -167050 -99159 105834 -137280 -366548
19100 -366548 165141 -43188 69464 298083 -95687 -72088 135518 -233662 12749 98138 -77330
19088 -49889 -135875 47945 -416697 108651 181141 192273 -164401 -35831 -146229 -70303 -305989
19077 -305989 207511 -309373 -62923 124371 -101040 -79306 142386 230134 -274813 272275
19066 -494239 31205 137152 -324618 40834 -35364 75184 242727 -33188 341413 44808 -130487
19054 70946 138428 268651 30317 -113743 113573 22282 -315565 -190676 -61385 -337383
19044 -337383 154452 -71854 -353472 191483 -100371 74321 -195319 -39166 99741 34979
19033 248713 102642 24865 -207174 -60531 370 -33145 -187757 162247 380324 85203 5510
19021 -271946 -124445 -240589 -98719 89914 -9115 -411012 46570 -167874 -36907 45060 134427
19010 134427 72676 -26948 -269933 -192089 -243510 95446 -262989 187536 114014 -224212 -65955
18998 153166 15707 1018 16500 -115301 31888 -5694 56040 -110005 147152 -260583 -197001
18987 -197001 -242117 175681 -215057 94752 -109672 74701 -253075 -33913 142223 -94073
18976 -489373 39326 15793 172697 -157750 64410 -209859 -153643 53882 -140839 134034
18965 -27478 196869 -93921 -67367 170471 -322212 59424 -252210 -66016 46403 -114276 -62598
18954 -62598 -178920 30108 -3323 -107956 -78899 -148667 -204305 -117406 -320957 226985 189190
18943 189190 246759 -287059 72243 -23151 64118 -110285 515021 -30493 -439001 -37898 59169
18931 -16921 -22542 -116000 -173592 -137516 -32516 128386 -98936 -145900 -147550 312926 -101906
18919 22026 -200375 -269573 -290262 -272688 -32882 -522717 122873 43818 137418 -7321 -117923
18908 -117923 -35798 343179 117700 -281115 -209234 -100209 -20123 -237226 110399 110077 82344
18897 82344 118643 -36426 -65768 -104735 53859 -438797 203803 370835 -28322 194311 -47689
18885 -104477 28897 -13540 5480 -64984 -63463 -132198 105433 -164412 98778 -141296 213206
18873 -113924 24994 64938 -305186 -317101 -40744 163508 -118043 175867 -299377 -227499
18863 -227499 -238963 -55637 181126 -152184 -27469 -48359 19609 -201809 -32514 -294784 -279025
18852 -279025 -33196 -85253 89607 -416719 154759 -306876 22534 288665 -247558 268506
18841 135220 190378 71910 -284666 -90146 -157205 154460 -191965 147841 -132272 5081 75940
18830 75940 -201371 82876 -43382 37834 -230356 -4654 114008 -247086 -202317 -84499 -130746
18819 -130746 12517 122124 -64037 95739 -330109 215143 -51328 -21115 177545 509207
18809 509207 103678 39085 55526 -230722 33189 -181741 -240950 -370610 135959 -264813
18798 -8352 159680 -113607 -27277 -108053 162631 -160780 -324406 -287520 80272 15952 43305
18787 43305 22658 -113550 -42195 -156383 -38289 -74422 -208691 -207584 4043 -204974 -88746
18775 -277405 -234997 183872 341549 21132 14287 -95694 -105532 -114979 51520 300597 -220022
18763 -122962 100694 27328 -122473 -78077 -9825 233621 -151582 -209800 -133337 -198231 169276
18751 -438219 -185470 -84074 -188902 -209517 32827 -53588 -30273 197068 41141 17491 87547
18740 87547 -107392 58651 -398096 -304121 69259 267449 -236876 522710 -303216 -238934
18730 -238934 17759 16210 114774 -14468 12728 -240960 -35008 -310481 -281072 -154491 16396
18718 -113073 -159861 32630 185012 -22525 -108405 -72839 -21100 189943 -48620 21301 -63631
18706 -61086 -193339 21665 -272599 -149664 -105754 66592 -143156 -325427 47394 -115486
18695 42178 -282709 -97414 22070 -45230 -92926 -169115 -341803 -363393 -132339 -77445 117519
18683 -64721 -17164 117846 -314036 117657 -95907 -240335 44836 -331512 176738 52221
18672 -206978 -94996 202925 -390026 -114304 8877 -13882 -47079 -70397 -101826 989 -190836
18660 -2562 275559 -71353 23184 -138829 145359 -175339 19736 84654 -149168 -201358 -98982
18648 -149961 -219207 180626 141386 -67596 141957 5998 -109113 -101632 -232190 32602 -282426
18636 124117 -183729 260730 -269595 -21394 -63368 336105 62759 104792 -152642 -37990
18625 74022 -18987 287852 116638 86932 100968 -247653 -267377 305620 61188 5955 -135962
18613 -100553 215362 -336658 -307560 -81074 -84715 -93050 176451 77455 -229831 -182268 -11453
18601 -7489 -6033 295442 -1679 -376808 -144757 -20209 175996 -4623 -66154 18011 -59078 -128624
18589 -128624 7566 89594 -292320 -48562 142952 -308387 -218194 242754 -131394 -232392
18579 -232392 -389240 348990 274876 -413692 100408 167126 -241548 28279 -205273 253188
18568 175677 -263618 -143314 231856 272792 -89020 97233 215164 -34329 70815 -37500 -56919
18557 -56919 71079 -4201 135619 -257207 -145447 -160769 78428 -178707 -27354 -125664 -95884
18546 -95884 -304186 -140858 -255738 135143 90338 -178280 47388 -269128 1744 70773 -226959
18534 175589 -191564 -225053 90970 -173203 -122420 162334 -114005 20319 -403952 -179522
18523 -54216 123955 -58028 81679 112268 -193387 -182048 67404 -30266 -64053 -130879 -58941
18511 -40475 -192090 200936 195058 -42458 -128227 -364906 230277 -138171 152669 -234145
18500 -43744 -338467 -226361 -123086 104811 -2020 -293761 -44497 34984 -116875 -274411
18490 -274411 53730 -385476 -38923 250556 -195218 -109648 51340 -85667 -140442 -116989 -361367
18479 -361367 -103994 151685 304132 24187 -11454 -109185 -282632 -59060 127178 -30930
18468 -263258 75882 -50430 -127210 -123019 82715 123122 -186420 -242398 160937 -309713 -400274
18457 -400274 36140 -229395 50642 73288 38748 63354 12898 -350668 44583 -94881 -393737
18446 -393737 498650 302446 -113188 -122324 -73627 64676 -173088 -186469 -15023 -32165 117728
18434 112040 -278053 486917 -148106 43812 -225530 -169020 -140500 137186 188058 -23784
18423 48395 -252169 -98599 26346 141692 209142 238444 49932 100178 93740 180031 -75067
18411 60423 6181 -120050 -155586 82404 -85073 215509 -7261 72426 -98153 -43402 -93607 38895
18398 -141880 -50839 404430 52539 -261358 105087 -253354 -129876 -62738 -107821 -292611
18388 -292611 -7570 134720 -97182 81672 -129250 -152427 80125 -31678 -11944 86216 -29721
18376 168870 297303 11112 70921 279380 8485 -129909 -244946 30339 278020 -304188
18365 -299192 175758 84305 -60041 -47921 -163173 51513 -179112 -200090 -238291 -25785 193579
18353 -160070 223634 -159558 -317313 -45140 12796 -163644 -184987 -11493 -19445 -297874 -60048
18341 -4258 -93374 23107 -16104 -172661 -126211 216734 -264870 -357624 -177428 -85584 -39405
18329 -37551 179254 11322 -173256 128462 -1987 -183268 65140 -134658 -111354 -123386 -204310
18318 -204310 -76057 -22232 -256252 40452 366557 -130632 -119235 -185515 120242 113958 -53283
18306 -38300 -39722 103675 -272915 -229868 -57802 -194607 -228272 -39185 137872 -165397 -35713
18294 -2116 68326 -332339 397639 65138 83765 -109811 -261174 96630 -18134 -85178 -190667
18283 -190667 72186 -133257 79157 222451 96706 -51432 -135202 -57696 -111872 -80168 -339822
18272 -339822 -353271 -382038 156492 -508588 -104485 70734 2044 -128601 -55095 95799 -39037
18260 133836 -11355 -7601 449157 -140179 -71069 -362739 218036 -231278 -145807 -219467 7539
18248 -164275 16137 -64228 -266217 -122565 -136559 -240218 35704 -318127 73154 -154617
18237 121017 193608 58316 -101778 -21034 -108317 45950 223402 -72333 -273133 -369975 -10619
18225 -23282 115907 133387 34913 37884 -72553 -90417 -375154 -88473 -156936 208042 -157993
18213 171438 324122 -248542 -58816 24912 -28950 -209161 -104896 3210 -4879 -22579 -256571
18202 -256571 111460 -383084 -225652 97507 -119288 -221501 -88024 -201896 -41697 -291125
18192 -291125 15437 -107280 32128 -165315 -154764 -83414 158891 179077 195382 75006 196548
18181 196548 152677 2141 33791 73741 200293 26723 -153623 4900 29501 -59206 -209735
18170 -209735 -222338 -142811 75775 430525 -14842 45068 3679 89626 179354 -152525 -118422
18159 -118422 3628 66330 -96321 -290858 -49560 68049 203163 234275 41505 -40194 -137734
18148 -137734 241356 -137588 -48823 -34505 271598 -225058 -288222 12690 81056 -231711
18137 -128628 -78858 -158800 -117384 -42695 -119252 -76516 153247 64478 40067 -177856 -218070
18126 -218070 2349 -108217 -331971 -4346 -162254 -172211 -149702 -102191 -59943 141097 -123230
18114 89888 -14767 -192366 -237779 -264844 20614 274290 -509957 -1896 -169648 -4819 -103752
18103 -103752 16335 -106538 -109873 216163 -64359 -16249 80991 -38540 65009 -25503 -230843
18092 -230843 -2249 -18297 -201416 144600 83014 -41579 11482 -57105 -168970 237088 191347
18081 191347 -24663 -129097 -82428 200085 -94956 108713 -12812 174474 -71956 -61430 -228266
18070 -228266 76757 256998 293502 -17090 -100361 -96916 157961 -97307 -184418 -10946 151539
18058 -336459 -43377 161916 353003 76389 277960 -137783 -319305 337329 -224261 127191
18047 61743 -21878 275372 -92136 -67534 91252 -138344 -176585 -206151 -57889 -21688 -223796
18036 -223796 -63058 -175671 -207156 72569 238968 -93342 -52885 30157 97504 -7967 -160435
18025 -160435 -381849 206819 -346 -51696 188069 182636 -158413 -39226 -86954 -193629 -228323
18014 -228323 -155283 -324078 137413 -89461 54694 -283849 100797 -87869 -373135 -313777
18004 -313777 93811 -161912 -258033 -275783 -106400 -135194 293941 -153235 -97302 -152525 -84179
17993 -84179 -40822 -350213 -307361 83896 -57130 -281928 133959 45315 -104346 -216188 -3566
17981 -104818 -154973 84230 276086 -122909 52802 1620 -173734 62746 142825 -89232 -212696
17970 -212696 297096 85995 -188795 356061 21949 128645 -157758 -138364 270088 103080
17959 40753 159948 17694 99433 -165749 -116706 -16715 -16227 -110942 -124143 134068 -137584
17947 -261353 -188342 -224489 68421 39321 218483 -337601 335903 -40482 -61018 -155763 -322304
17936 -322304 278651 -169792 -224727 -31873 170360 -1014 170851 164145 -137311 -341052 156744
17924 62159 -242670 -140115 142342 165508 -367409 12227 -139942 -26434 -267178 184485
17913 249432 -343738 -18263 -134965 121478 196514 21889 58907 6262 -89496 68596 -353559
17901 -141126 193314 -5747 510502 237922 -84006 28952 299439 -102193 -47089 176991
17890 126019 183749 91674 16627 -123529 77038 101366 109726 91915 -272912 -179429 1183
17878 236748 -254059 26513 -146439 67423 59934 336026 -243981 -34901 -229305 -98358 182847
17866 -33294 -161677 -282267 130242 110383 -90614 17221 -67962 116481 -46037 -129397 -34540
17854 -156714 -148193 -677951 168615 -274814 160175 -12274 -238485 -148492 19015 183207
17844 183207 -6398 239649 271949 -18372 -119601 -76431 94415 -132511 -86704 42683 -136051
17832 145432 42436 -28387 -61965 -100991 -81950 -122638 -207169 7111 -85953 77896 18833 166775
17820 166775 381271 69151 -291013 69996 75371 -71956 89668 -183966 -166271 -277740 22997
17808 -4438 -22486 29292 87586 159547 -110101 -170142 221070 -155922 394848 41339 -69745
17796 83270 -210089 -79907 189957 -166735 -68308 -63732 -267609 -188509 -215843 -45600 -300750
17785 -300750 -15704 -135330 -147674 -170921 251577 21120 -6979 -40104 -193146 -253471 -68068
17773 -148642 144666 75501 -351577 132372 32299 -119918 111139 18449 71026 -92587
17762 -143901 78486 64746 234577 -76297 30273 134519 -117934 184565 -209624 58801
17751 112045 -250820 302831 106416 39335 -275588 120424 40540 126416 -24693 -233202
17741 -233202 -75822 -147548 -266274 86428 -144461 -23363 -27082 -105059 24923 66114 -254360
17729 300190 -180429 -275897 145345 6956 253000 -86285 -374551 28541 -8695 -2970 66958
17717 183264 77185 108717 81463 -289357 -139363 121623 -354950 -53078 227916 260625
17707 260625 -192224 -162079 -121060 169379 439399 -66563 -33086 -51796 -296137 79115 -256395
17695 134757 286328 80763 -364163 -139154 174242 -53019 332975 -170198 -230834 140994
17684 138072 173921 -52636 -82495 -53356 170929 -175367 -38369 60688 -213178 116787 210949
17673 210949 -85786 141261 -21332 -127581 88779 226408 247878 -238028 90412 -71451 232467
17661 184602 135341 115406 165316 -44089 447168 -223801 108887 338424 52188 18159 278882
17650 278882 -38275 -9106 -256472 203865 -34348 -25746 320257 84162 -95474 -19684 103073
17638 57041 106071 176295 -211791 253716 253221 183556 200987 70095 -157572 -263367 92010
17626 -74596 176656 108243 -34722 35936 -501325 76346 163705 -97235 45124 -58536 -134775
17615 -134775 -49485 7524 26103 27722 34755 -20685 125058 95749 161004 -61341 126593 -326921
17602 -69490 90420 34341 -69914 275777 -80304 -196589 187529 153520 -72521 -88389 303656
17590 -170650 43854 -129411 151370 -105668 39890 277040 264260 -127551 -25157 -24554 91288
17578 -237079 -96268 -33027 127795 27690 240663 66739 -15320 18698 106618 -29350 136728
17566 -151641 -372457 -62702 234324 -98303 86551 176231 -3479 176258 -135217 64210 -430114
17554 -209649 -128509 32355 -16470 -53450 31447 192914 101765 30090 -90361 -67139 -103479
17543 -103479 122067 330141 70248 -5761 140323 40026 285535 71686 -113045 45501 130995
17532 130995 260290 -72695 -81474 -4804 -258311 495501 -34088 38238 -91674 367833 428632
17521 428632 102987 166769 -212468 77342 169314 357346 58371 -124699 224191 88327
17510 174654 171986 34693 88788 181937 142180 -130205 -88418 72720 -170642 -116931 -12598
17498 44282 75043 255711 68999 202009 -96432 368146 68581 260954 303597 -54184 -49696
17487 -49696 752617 139719 276308 38312 267129 145532 -126053 -3038 141911 158866
17477 158866 17040 -96807 75931 -7274 80260 -96692 -57731 389848 143440 273841 128970
17465 312563 245734 430656 53155 131946 17537 -257633 74541 215454 165902 102329 223590
17454 223590 6078 119813 136030 308342 226090 13938 665695 351360 115344 397864
17444 397864 142890 491423 -12381 112012 391230 371609 49141 185749 100920 277680
17434 277680 226333 120685 88626 305238 48658 340873 43435 284444 160704 142 50831
17423 50831 104156 159616 261404 164751 -64796 157991 152432 278068 326197 117790 270968
17412 270968 34660 154430 153478 174419 403014 272641 116768 73576 128628 168616 129993
17401 129993 -6026 45468 62477 101133 439208 436968 382532 297272 237965 51061 -146607
17389 -59838 156390 65420 7109 157299 363644 46913 329170 131780 250740 19485 -12941
17377 -2306 340156 197695 -127587 313192 202547 39690 77030 -233871 180433 279092
17367 279092 24845 215070 67221 255901 183239 -83165 1250 239943 -165342 132449 72248
17356 72248 -148708 251691 141049 351216 162658 -37459 38179 -30857 133049 358532
17346 358532 317566 140517 246605 82990 118472 318062 258437 62207 -215218 293380
17335 16836 171857 99205 186525 156019 53052 113604 210477 -289858 30696 146996 263810
17324 263810 -208203 359527 239298 187974 -33656 329018 217442 80901 101567 334252
17314 334252 181802 398445 211959 35463 65468 209874 177685 96435 -99458 95270 13714
17302 186192 183182 275956 -242161 122932 -49358 -282034 269281 156781 16485 208619
17292 208619 19071 159507 144478 238909 223921 297495 130517 161470 249372 459611 636170
17281 636170 -115659 263622 217883 321039 278801 63690 186263 50624 213892 -84729
17270 146109 250034 -104054 338716 82147 -3766 -147855 163419 535048 119477 39332
17259 -160525 49874 4452 222606 413544 103591 115326 50254 273080 -8079 7431 253633
17248 253633 -147765 -51804 217785 304000 270244 494328 218394 192920 229386 -101296
17237 216469 -167939 191698 -34134 138779 429728 185483 308313 132501 152336 -15154
17226 210607 -178666 85164 -120387 271021 545808 158786 -76066 503334 220197 345530
17216 345530 -56063 391318 217035 293639 250831 413815 50542 187009 395341 -122455
17205 100621 143429 -10680 641313 382073 385528 495361 27159 154970 130664 103722 153990
17194 153990 -171081 -476812 344504 201868 132980 46854 289332 212394 47876 299238
17184 299238 466528 642300 274154 120423 205220 -53430 328125 414961 -18816 522455
17173 362483 257094 388751 -173725 441960 426959 533080 236325 427949 433123 197450
17162 55545 555678 276179 257212 136141 -16393 379129 115537 394703 230714 108418
17151 428019 169603 664808 274017 162887 425552 353401 143079 415420 395620 295437
17141 295437 212064 279232 477200 319507 266822 254434 -18114 398251 325174 397646 243511
17130 243511 275343 305157 144782 241560 437391 78371 325970 92883 315500 541397
17120 541397 264970 370886 234270 174713 479429 701787 390633 468997 327385 317460
17110 317460 454142 126863 687134 528179 614126 419868 613460 236845 390790 400150
17100 400150 399086 264059 458911 348949 412691 301340 343806 418898 497560 458132 431523
17089 431523 582197 105405 200664 525006 520423 338130 432685 753345 547845 237102
17078 289183 564708 504705 246995 571573 293969 241039 580311 267631 598966 425280
17068 425280 271662 547326 544130 421337 408137 449880 497751 781929 233694 394761
17058 394761 346275 104301 467384 557447 379415 467853 433270 347734 717079 568376
17048 568376 510502 392988 255680 506091 611960 490304 559685 615872 574406 730648
17038 730648 766987 533467 532449 427934 529549 664812 589064 851867 451444 911440
17028 911440 538408 473225 565356 725780 878275 780847 544334 736089 87896 564583
17018 564583 657209 577714 639176 789896 653774 493149 461555 766436 713970 720053 353166
17006 1133374 1024390 723841 789625 757766 784866 919586 748212 613535 610960 644826
16996 644826 606421 801840 624948 772157 659436 476934 747683 534451 365993 947032
16986 947032 981211 1230268 739681 718041 797706 870690 1047592 905352 795096 854328
16976 854328 741637 948477 974454 1038777 510375 939745 677658 1002757 798683 829357
16966 829357 667983 1068872 1130676 1019955 1017618 1119669 1103902 883097 1096287 1329569
16956 1329569 1247061 1014959 682437 1005503 1135487 888778 1039230 1054988 1204104 1357487
16946 1357487 1120247 1176409 1034167 1129612 1253574 1083289 1509574 1349542 1165990 1016158
16936 1016158 1350205 1239549 986214 1352300 1199957 1301857 1287322 1212724 1345615 1444168
16926 1444168 1751646 1382247 1017175 1385805 1694870 1256512 1578005 1483519 1494092 1334458
16916 1334458 1680259 1703061 1466978 1585227 1649038 1549673 1423429 1548053 1501221 1478978
16906 1478978 1716660 1788566 1628626 1780873 1700293 1941137 1799975 1733100 1527529 1743841
16896 1743841 2043459 1865697 2109754 1959250 1688028 2096264 1831873 1996545 2134924
16887 2134924 2096476 1918594 2223659 2196073 2045660 2131053 2402803 2322900 2215294 2232499
16877 2232499 2487910 2380416 2362140 2130872 2699727 2433809 2230970 2587482 2522209 2860827
16867 2860827 2385934 2821674 2894482 2846607 3164142 2972242 2962234 2786834 2902413 3006891
16857 3006891 3155594 3304537 3349285 3491100 3416842 3219097 3224646 3357312 3457274 3620380
16847 3620380 3510420 3781685 3678660 3778196 3584612 3666558 3825419 3916974 4061861 4224729
16837 4224729 4228223 4437909 4532409 4547344 4709415 4861465 4510241 4772629 4958077 4855194
16827 4855194 4719329 5020734 4896002 5326693 5376193 5217647 5587474 5684025 5839681 5687103
16817 5687103 5855522 5824728 6103504 6213007 6340998 6393502 6969132 6928295 6900589 6974893
16807 6974893 7428425 7442129 7570027 8011905 8122626 8081012 8486506 8827484 9017049 8869813
16797 8869813 8900848 9160887 9783820 9759617 9815171 10296309 10662136 10910625 11487182 11354685
16787 11354685 11960504 11986150 12893915 12862110 13030991 13698153 14113220 14506113 14841785 15601244
16777 15601244 15854996 16359994 16772765 17217437 18110958 18241441 19596858 20180342 20671688
16768 20671688 21196605 22137454 22967956 23784844 24674130 25327950 26414871 27546723 28405987
16759 28405987 29791856 30796474 32181671 33414090 34968388 36456072 38071109 39926564
16751 39926564 41478937 43288924 45351953 47426886 49404801 52037602 54792084 56830879
16743 56830879 59985171 63050791 65961877 69252863 72817132 76685150 80723009 84604746
16735 84604746 89280745 93506840 97893039 102755126 107731164 112865965 117820249 123108300
16727 123108300 128174423 132802698 137678476 141993033 146316907 149677350 153041056 155611196
16719 155611196 156562793 157706209 157732513 157434456 156032844 153536969 150518816 147005705
16711 147005705 143040744 138466199 133517302 128360689 123323964 117984010 112537621 107318942
16703 107318942 102247400 97179204 92279718 87881420 83482431 79155522 74807097 71289928
16695 71289928 67613272 64318921 61142642 57901418 55010385 52615299 49510023 47578734
16687 47578734 45394693 43568609 41191955 39065564 37782552 36047613 34127917 32978596
16679 32978596 31816427 30332224 28979696 28090086 26845111 25793008 24673884 23969884
16671 23969884 23133492 22284890 21523199 20649556 19726946 19144714 18802932 17851052 17660622
16662 17660622 16731758 16213716 15575674 15571623 14745370 14361739 13908240 13970557 13320142 12782671
16652 12782671 12579208 11921525 11698307 11332929 11246750 10830066 10617755 10460511 10016988
16643 10016988 9501159 9407438 9355823 9366739 8911019 8436700 8236273 7720228 7928249 7849253
16633 7849253 7554524 7321780 7677446 7103688 6976062 6855618 6579841 6384542 6462313 6451002
16623 6451002 6269285 5940631 5983024 5677628 5613954 5284952 5508014 5164436 5133628 5102300
16613 5102300 4889540 4780212 4811727 5292221 4600904 4447307 4219793 4442574 4594992 4175810
16603 4175810 4322336 4202275 4057947 3872681 4233697 3781469 3623450 3530262 3687543 3285701
16593 3285701 3606171 3614288 3483920 3159201 3274074 3215072 3348790 3305346 3223860 3183352
16583 3183352 3056627 2780791 2922768 3026024 2921097 3129842 2549290 2990478 2411009
16574 2411009 2600423 2684591 2514185 2537603 3050638 2352216 2440265 2537697 2192650 2242015
16564 2242015 2153701 2185463 2114056 2142181 2316529 1992719 2186348 2434534 1947312 2159485
16554 2159485 1803960 1972289 1996945 2025657 1930165 1818068 1860831 1878396 1871299 2004791 2184865
16543 2184865 1696900 1764631 1803206 1627952 1531979 1560491 1824238 1217608 1465562 1361746
16533 1361746 1524526 1362817 1307088 1410055 1398267 1738656 1563906 1395564 1265582 1287543
16523 1287543 1598873 1353533 1500244 1278720 1351226 1301473 1466732 1339988 1063312 1234673
16513 1234673 1205354 1297704 1134335 1327978 1191623 1371647 1596881 1016628 1096404 755297
16503 755297 1045848 939720 1008945 1159634 1234740 1347132 970659 1110150 1289026 1273406
16493 1273406 1179242 744002 1078559 743363 769573 891693 829406 1072172 965156 1036629
16483 1036629 793833 694716 1076794 968698 808573 994000 1032871 765689 856428 1052611
16473 1052611 830725 684124 824970 891654 952127 806778 915240 1227860 613063 883401
16463 883401 1029963 840605 755792 975149 799071 726049 709105 486485 692188 916804
16453 916804 597565 899867 583928 1098927 1014627 611778 626717 731505 752544 839487
16443 839487 781593 452786 784765 835633 893368 571365 645088 524876 538584 865561
16433 865561 647511 631024 551274 655080 702970 848368 530712 629205 447885 647986
16423 647986 506736 614988 674316 844171 736978 264049 534784 512636 583311 393346
16413 393346 498246 977197 586790 259321 769098 394946 245112 346555 297186 593571
16403 593571 658860 611256 374991 463076 647206 350492 486151 508201 223824 522750
16393 522750 477510 584695 872190 662491 402434 244911 464867 434078 257975 -23280
16382 614940 571624 434903 479150 619461 288236 83562 87927 344260 282931 272978 599560
16371 599560 522560 503178 300342 143864 510493 145186 311078 417874 590874 162680
16360 537335 604367 230297 243850 366466 262603 364345 582160 160739 188267 253406
16350 253406 287867 438421 430268 233327 370331 287539 218281 522455 363631 51563 490555
16339 490555 195021 269255 506608 349385 578078 416843 404186 253210 371927 345450
16329 345450 144745 475824 190709 270843 590775 319353 65262 376347 135720 45131
16318 371461 70046 605493 524657 374394 -21195 473596 -67364 295002 24731 112035 130140
16307 130140 310282 20699 241420 99920 25607 147435 43682 283663 246251 403957
16297 403957 398199 164379 192962 304374 210965 111126 277070 91503 188824 61937 339268
16286 339268 592479 234996 495480 187965 359043 109190 80389 490853 88838 11000
16275 289146 192761 216662 52054 44017 70025 245537 166904 180850 192282 440661 -23657
16263 -322395 153559 361608 63080 -157146 55654 160779 143429 18641 399834 26679
16252 396983 131932 -61431 251974 356496 12242 103549 4027 357582 -65366 146821 42767
16240 -37298 110111 77762 117034 120387 228936 371284 24761 183779 395234 94966 249315
16229 249315 31277 291591 210981 82362 137863 266419 177729 -27651 60841 223171 -44448
16217 253536 53354 545516 348273 -60295 258998 75774 293236 -35655 344188 16460
16206 -192054 331843 187404 -5251 -117380 -185181 69511 235074 287701 231039 108709 292790
16195 292790 36314 178076 132709 80637 -40416 327586 8112 -13331 34964 446329 102591
16183 354846 536063 -30717 -3747 78341 216552 -58989 39516 186018 -10443 277991 219562
16172 219562 108190 205582 -122080 119161 -74534 73446 -120127 -171385 102099 55164
16162 55164 237705 -71004 64591 -33640 469097 -144665 -153751 98600 100439 254372 4921
16150 29061 4194 -77666 -56982 20780 -173672 -15124 77100 -58974 267120 150842 36615
16138 66648 40455 -125351 -130654 226018 -222001 218848 55791 312421 48456 -84121 108884
16126 98690 277218 -16519 244281 -213873 145805 -175796 -275914 94765 -256333 101522
16115 11227 347092 156170 -309845 75310 337767 76540 30108 -150312 377019 -109205
16104 118594 202046 28032 269159 -235626 201093 31729 -91937 334837 384503 889275
16094 889275 -147499 28830 290970 173372 97884 -55642 -93628 -348016 -47991 90581 35027
16082 271551 189455 -78003 -158466 39738 16735 24671 -140431 193271 858 10123 -13414 62555
16069 -118119 -247898 83863 142625 88062 193300 264600 111587 -78631 -138292 78363 -47749
16057 -68196 -101441 79511 182898 -74948 121388 233049 -45622 50604 347182 -128225 -365718
16046 -365718 174150 83604 194726 -346039 -161134 140529 210893 -11656 215725 -392235
16035 -131458 -26911 71452 323998 274939 255560 -6379 262123 -193674 325560 25586 129205
16024 129205 -106331 -116758 -306318 -114010 205552 62213 90769 127891 104028 130632 223888
16013 223888 -157166 180827 -177125 -19281 111586 277659 300694 -145323 -175723 -9591
16002 76429 -17240 246802 -149543 -66896 -16407 -378410 -91849 1085 144429 -5573 -258777
15991 -258777 -85002 5540 333175 44809 -76545 -172924 -167346 162244 330145 -253805 540543
15979 330105 403782 55394 78631 -85473 -194879 116901 66274 -116518 63654 -167530 36493
15967 9967 85208 147922 240922 -131974 47785 -207187 103489 25937 99831 172233 -83121
15955 -32393 -295605 121737 -303067 -183913 -12031 -56864 53362 -74410 -222401 93561 -10955
15943 -242725 121755 -171357 -98088 153749 18064 128706 256063 -63198 -146382 -174578
15933 -174578 -7890 375765 -232366 -215067 -59376 -362446 -131405 -38822 -53211 -314779 159836
15921 8894 57596 7697 -54655 -150776 19610 -160724 -173207 37325 50393 -225791 -189091 113341
15908 -130688 -360026 155858 -178738 -57275 55233 -158999 158776 -24727 -100364 -138353
15898 -138353 146323 -345355 122374 393963 -208596 -10793 39945 39381 -8407 -307590 404202
15886 -190535 -164321 152139 139660 83095 -116730 84422 263953 -63189 -320446 -243419 -185720
15875 -185720 -25746 -352598 42151 195764 275800 -76895 33506 237826 -283806 332347
15864 275345 -315190 -299758 -39321 -114272 207213 -268569 -354336 23645 -96771 154615 72077
15852 57590 105594 -62461 70924 186533 -113174 108881 -80806 222518 -441681 -267521
15842 -267521 290653 235791 -308283 -26081 45947 -107340 200785 -41173 -156597 -185425
15832 -185425 -71792 296280 -52812 -142766 23965 -48224 -236091 12219 -93633 -414691 402721
15820 -366721 183252 -222482 15660 -174712 -44236 -257604 -235027 -47061 -312004 -150608
15809 64112 -154975 -15836 -318318 15491 -146395 -118725 -205826 33542 -117310 -70343 57632
15797 -176424 -126745 -343257 -172015 40393 -66425 37371 30568 -45153 16524 197662 -109223
15785 -136766 165139 -110911 63651 -22930 -252590 -31934 -57727 20840 153431 -49207 -148026
15774 -148026 -153299 -121056 -213144 121174 -216764 138482 57795 251128 -306405 -327203 106752
15762 -197353 -173612 34420 72229 -127995 -191314 11856 20591 -45635 -336285 -95418 -152989
15751 -152989 4272 117950 162616 197313 -103040 -162476 80529 129918 447653 128578 4535
15739 -149233 -171933 81589 188945 -73526 -355445 255011 89482 158459 77833 32871 56683
15728 56683 -240505 -69672 37654 -195173 -52477 -27735 24837 -122089 -110594 -8118 -158455
15717 -158455 -283521 -149990 -170324 -216322 109905 49285 -234839 85499 182200 64056 -131317
15705 192071 -189377 188867 273499 50417 109438 -38522 -207780 -149419 -102341 -159961 104730
15693 -59870 -48766 -38932 425874 -150418 16758 -47898 120973 29622 -84133 -300267 89352
15681 84378 56164 289263 -31289 89681 -65551 -110001 -56444 173637 -93449 191326 188455
15670 188455 10985 36987 253650 214468 -117571 -346939 -233465 -145446 -276822 -338396
15660 -338396 -239950 -155996 57420 -469482 -257750 318874 13753 20546 12172 121030 -2775
15648 -287665 71093 -161361 -124979 -171797 -305230 -11398 -101645 -226263 89918 -111442 101793
15636 -221611 109144 -176184 -175136 110658 126100 35790 -194922 74120 -91213 34702 -337967
15624 275738 35187 -253464 -56714 -19219 66903 -68467 259802 -227935 -267562 -137343 -163487
15613 -163487 -119479 107514 10035 -4379 111606 -118785 194583 -390794 162176 -150639
15602 118352 284572 -113234 -178608 -365632 -178901 371326 -118256 72340 -305643 69067
15591 32245 119527 -57325 -76995 197639 -171620 84668 -538082 -186550 -48449 123719 199908
15580 199908 272957 23347 145458 -139760 -83247 232020 93904 54434 274276 -268974
15569 -83593 60 14430 -326998 52585 -374892 -200703 -155852 88608 62963 -173521 237003
15557 35465 -190449 54509 -85408 -161634 -59885 28515 71045 22513 236997 -131831 -64251
15545 153787 -297926 81940 -351590 -389663 -16661 -190202 105580 264054 -29514 64348
15534 -132954 -129951 -223513 -21451 -188446 -27900 -178135 149188 121408 13454 -62835 -1686
15522 227110 -307903 30863 273114 -324068 -226100 355596 118932 48083 75999 106920
15512 106920 199900 7269 140941 57364 60219 -148543 -161428 82685 -80524 318803 -244130
15500 95950 152922 -252730 -125292 -114264 -156321 9936 -176086 -261822 124335 -197040 -306134
15489 -306134 -54615 -21134 84663 -53775 -243141 -51 59312 29443 82576 196380 1991 102789
15477 102789 51156 121259 -75714 17710 -75190 60685 -390703 37754 -210497 53024 9002
15465 375209 -112896 -112626 271578 169061 207593 15673 227259 -155480 -318838 -264625 48787
15453 -86093 -180159 243997 82671 -346084 -48212 222274 -29602 -100455 177107 -187525 -248587
15442 -248587 133009 -15427 -119376 90260 -221239 -83771 28582 10871 83911 83970 87331 62111
15430 62111 -60832 141685 -115150 36544 224697 -184133 -407062 -262205 -112080 60535
15419 192210 -119862 376676 -154204 124066 149952 294169 75401 145159 85076 -80164
15408 156574 -141367 32168 134881 59645 -233812 83562 34942 -88401 -24654 -122162 -197153
15397 -197153 290058 -280068 -161523 24805 -26951 83211 -86094 93069 -150386 -30288 131075
15385 186473 138167 -137544 -217280 -266961 200684 85312 -72869 200555 107307 -7043 184785
15373 -189876 3241 310327 92999 55897 48768 -45977 298461 247778 17313 74580 -15946
15361 164627 15032 -226936 243944 -316772 147370 -101379 -303928 155064 42081 -205872
15350 -29373 72711 -4921 114445 99402 -89707 78904 195990 115479 22285 -300070 -89142
15338 16182 80230 -60832 96383 9137 227798 380391 -12060 -168041 131085 217794 169808
15327 169808 -200056 -3677 43916 118801 147322 -224242 -131664 134545 -141788 215883 25521
15315 170148 -103830 134718 105636 -13104 -17452 -330196 67905 -177855 -366456 -149072
15304 -181696 -194987 -35793 -42059 -41098 176150 64761 -116200 -3958 -73889 211292 -6618 66671
15291 127193 39936 42288 372091 -135731 50727 -4543 15090 35713 -17026 17939 356721
15280 356721 477070 170428 128824 103414 156786 172853 13617 -168264 286161 -393142
15269 -345319 -138784 122617 -181487 -130107 -132118 -37601 110382 59500 357702 -257639
15258 -28400 316918 -515291 139611 -56741 86020 50335 14405 92258 435739 768744 1820552
15247 1820552 999946 1437350 1311097 581447 587013 -59862 -29232 227027 84450 261111
15237 261111 235280 58741 -8872 -75317 196473 62344 131882 13409 32466 -116491 268777
15225 -18587 -186303 -57699 -25021 97185 110834 202562 -24477 67899 112948 -34060 293930
15213 -168301 140412 -102453 35931 132986 138134 -105719 146857 191377 98007 -73946 -311644
15202 -311644 84854 105925 100801 -239766 -9203 22011 170944 49991 133241 -39156 146594
15190 157682 28604 121227 -242329 88793 -2982 148670 -160133 109165 -143502 70434 171967
15179 171967 134531 42791 73422 -312729 94326 184572 175726 59345 23554 298916 -79492
15167 322022 272522 -49108 48559 868 200616 -9209 30717 41963 -134671 -141687 179118 104935
15155 104935 291392 100709 178265 110985 227659 66023 18784 96767 -63800 -24525 155282
15143 -18092 96661 54512 77030 -94864 -95910 163910 136824 25061 210148 276602 273141 257824
15131 257824 258262 101968 315747 249818 108005 442998 64545 59576 11471 30462 292886
15120 292886 73452 149812 -80671 -59228 -5754 153885 207671 -341667 134446 82739 109246
15109 109246 -70470 134793 31695 -20785 13795 -205473 -325673 140582 231928 -84327 164588
15097 -33760 166500 235574 151060 -225418 140740 101600 219182 137769 106528 314196 156602
15085 72909 372776 100008 128041 -1786 -72099 328657 175781 165777 233390 -85031 -26260
15073 345720 348327 170448 118909 69542 128729 11285 123340 120352 514003 138100 406885
15062 406885 308633 61870 26011 118024 -117851 -104946 107992 93402 -176977 62477 69831
15051 69831 252153 326275 303139 145180 -108168 261664 -28618 130957 18784 337815
15041 337815 132216 176636 135423 -183724 21007 -73648 116920 561461 175988 156041
15031 156041 117338 147123 195279 53806 208048 120955 9614 93652 476191 43927 382090
15020 382090 90857 535921 208377 267494 213608 147503 243481 258580 142149 276388 1793
15008 323757 49923 177755 366760 133291 184232 160027 145649 271005 102563 219268
14998 219268 47259 234548 268334 172294 -295121 -109608 309787 278947 382658 -82549
14987 -1262 -114567 228300 -43174 466321 -108587 224633 -15471 280807 -125052 139592
14976 289229 421672 105303 74913 360620 310221 360031 -75037 168351 435982 163856
14965 198303 -96547 -36481 60957 -141763 364875 256744 -154776 467327 284606 32045
14954 -8737 329557 247669 378119 56025 133344 441633 -18553 41869 128687 369600 606435
14943 606435 230893 393719 207225 609645 442537 380074 325685 343821 271900 9166 473419
14932 473419 181636 371312 153833 171647 318851 127697 66573 345455 333461 415628
14922 415628 356787 580305 282183 552702 169095 338603 294573 -47641 368040 104554
14911 194177 106317 286911 329696 372395 197711 279198 125148 275367 264781 297256 605259
14900 605259 -26143 266342 442057 198381 479126 300747 288958 631617 434909 241411
14890 241411 641392 174747 392745 400307 302168 461173 258869 333585 100842 454437
14880 454437 324027 221513 475475 195946 200401 180786 324764 246335 46300 536881
14870 536881 176059 248509 131333 902574 258724 6776 306968 161087 353533 160800
14859 -90666 475858 345568 247177 376383 599282 593761 259867 887365 438961 497882
14849 497882 141008 434638 715131 -21378 315664 522987 278470 298242 424975 485524
14839 485524 202777 79426 327643 406487 493110 327011 568239 433521 221985 429605
14829 429605 114349 288226 252558 365066 349301 514608 352627 248478 677171 580561
14819 580561 467640 396112 543227 128946 760735 613692 305257 348842 365004 342104
14809 342104 364307 728542 399027 462856 311642 278970 399111 656904 147879 534981
14799 534981 667255 455469 523360 605018 361242 341732 162245 625571 280881 248350
14789 248350 748224 493165 556883 235715 451071 462641 301199 402869 255324 409479
14779 409479 664467 712179 391914 414926 481929 510169 451231 242851 797186 671891
14769 671891 600002 394843 547785 668834 374351 545261 442858 384799 374585 754179
14759 754179 588271 341695 453389 529422 661533 769775 354260 564669 496423 225823
14748 669778 404529 336318 499194 723691 728172 505714 685686 838992 1048571 825157
14738 825157 873157 549356 621929 766680 743012 613674 688529 603402 664002 479968 904976
14727 904976 818518 738342 540798 417585 706736 519271 781455 590118 636985 944116
14717 944116 858163 820404 349643 976179 805465 492456 776255 742399 779116 639829
14707 639829 907257 1001084 676097 736938 949361 780084 592883 825991 791545 814343
14697 814343 503590 690320 747576 553969 1089583 991585 674749 1167072 919264 976926
14687 976926 643540 1018681 739583 817288 745703 863166 667641 812352 882259 1054552
14677 1054552 619423 1128653 723415 873210 1011512 1117281 827661 1111577 811382
14668 811382 997406 752519 655319 945036 857225 1231626 917738 813133 688402 729195
14658 729195 860327 679996 1041648 887878 1106059 779156 988969 945945 973732 1152567
14648 1152567 1230452 1150162 1250333 1172511 1479044 779557 793200 1164641 1063666 1029633
14638 1029633 1119316 1299280 1116053 857532 1311293 1087510 1290388 1114274 965607 1010719
14628 1010719 1289655 1221211 878356 1425273 1142641 1200625 1240147 1328280 1328801 1420565 1228515
14617 1228515 1577976 1220240 1471563 1704020 1478323 1480510 1416959 1194387 1570664 1364013
14607 1364013 1439109 1196670 1303938 1404270 1482353 1265054 1302077 1338585 1440194 1787572
14597 1787572 1731379 1241367 1609436 1503069 1413962 1646167 1597344 1350832 1629282 1783556
14587 1783556 1809248 1628030 1880864 1630897 1645129 1692900 1832472 1928107 1751032 1728697
14577 1728697 1983807 1796720 1783873 1684713 2088973 1845482 2217204 2056782 2145364 2053174
14567 2053174 2079509 2053595 2318051 2222649 2544255 2192279 2626169 2668760 2296196 2436451
14557 2436451 2969403 3055362 2886465 3545599 3846860 4278802 4475640 5739789 7749251
14548 7749251 11451116 19425783 35359570 44678957 19568358 6679484 3417459 2389419
14540 2389419 1806791 1713315 1693139 1424139 1562555 1825948 1925347 1889619 1990081 1972687
14530 1972687 2154246 1912281 1975289 2081207 2209736 2183942 1908116 2189836 2038574 1850860
14520 1850860 2308212 2309238 1974995 2313310 2272464 2100868 2497305 2539881 2615162 2341229
14510 2341229 2677345 2670125 2581134 2792781 2732672 3016872 2754813 2752980 2735303 2787171 2700593
14499 2700593 2852917 2993985 3110458 3015979 3180237 2778181 3017514 3340328 3267613 3235007
14489 3235007 3059628 3106417 3429946 3462416 3334961 3324257 3534220 3438870 3643275 3756148
14479 3756148 3600197 3607318 3679970 3706147 3661389 3837771 3732536 4161152 3999277 4034794
14469 4034794 3946219 4306085 4232489 4429562 4054831 4193001 4327336 4333168 4044954 4404646
14459 4404646 4813893 4654398 4634207 4617433 5037729 4474632 4951645 4594596 5180589 4901065
14449 4901065 5001729 4969915 5569900 5175431 5573180 5276277 5348681 5839367 5552939 5534473
14439 5534473 5643388 5643741 5639851 6000947 5986616 6083250 6252261 6248072 6286079 6490138 6427472
14428 6427472 6794842 6581647 6744192 6785684 6928760 6927142 7142049 7080013 7471302 7578181
14418 7578181 7526424 7388658 8017799 8220737 7907342 8025618 8275951 8147015 8609416 8373032
14408 8373032 8683998 9163596 8891247 9188332 9256499 9292811 9576486 9487615 9800267 10218672
14398 10218672 10172746 10166644 10326675 10316165 10560134 10743868 11215534 11496872 11646719 12230013
14388 12230013 12046004 11851663 12143163 12531202 12628824 13130329 13414956 13375467 14030311 13868093
14378 13868093 14170549 14517656 14853457 15080794 15894714 15779330 16253395 16638930 16803165
14369 16803165 17215923 17447483 17781518 18159712 18474218 18877191 18990933 20171356 19946814
14360 19946814 20560293 20896655 21230931 22147298 22744311 22809952 23543033 24030095 24458067
14351 24458067 25463896 26106334 26638789 27211946 27957022 28855274 29404406 30380589 31101910
14342 31101910 32072092 32795690 33810953 34809629 35597709 36760378 37920125 38897163 40267431
14333 40267431 41139712 42900194 43804430 45405548 46631642 48374315 49861033 51467171
14325 51467171 53159470 54849155 57010051 59195341 61012876 63349035 65597532 67851699
14317 67851699 70540208 72984592 76356639 79150229 82599716 85644343 89397240 92800098
14309 92800098 96996618 100967824 105631160 110083422 115126716 120213856 125295508 131364286
14301 131364286 137529037 143978391 150880945 158007545 165799080 174120273 182648877 191527956
14293 191527956 201070556 211066531 221536717 232579426 244342908 255549382 267797581
14286 267797581 280412873 293279480 306933611 320467929 333948613 347720131 361370705
14279 361370705 374173917 387031363 398567563 409287850 418661141 426067949 431015870
14272 431015870 432694265 433144715 433168543 432673986 430314304 426343504 418980979 408856683
14264 408856683 396885041 383665690 369472538 355111795 340198277 325065785 310285280
14257 310285280 295360470 280916864 267592192 254571668 241763014 229569245 217812486
14250 217812486 206781824 196372015 186294757 177237494 168444690 160119979 153160315
14243 153160315 145179163 138548029 132124116 125936321 120140895 115258355 110361141 105153374
14235 105153374 100513635 96419030 92549167 88918439 85685686 82083780 78791421 75644043
14227 75644043 72818419 70028559 67751017 65364504 62589469 60610479 58454264 56703711
14219 56703711 54629723 52671748 50960180 49152565 47887464 46437558 45533315 43802689
14211 43802689 42386692 41200701 40108597 39127343 38675231 37317050 35817196 35026497
14203 35026497 33824958 33236093 32261150 31974546 30757571 29902329 29131949 28233960 27738424
14194 27738424 26758460 26409280 25898708 24940105 24531633 23804829 23351764 22690510 22549126
14185 22549126 21505866 21467793 20700133 20387184 19958445 19259174 18604773 18549261 18080661
14176 18080661 17986613 17585472 17157520 17000237 16166021 16133613 15661638 15512249 15310431 15151729
14166 15151729 14465399 14485698 14301999 14044918 13537114 13444201 13172629 12955632 12825069 12662473
14156 12662473 12209486 12314740 11968431 11710600 11578306 11284632 11249423 11316534 10837247 10621505
14146 10621505 10629264 10410990 10189254 10062959 9788017 9669875 9801553 9568963 9222719 9117507
14136 9117507 9272552 8651514 9137984 8972940 8295815 8657821 8424583 8159703 7923797
14127 7923797 7989123 7838707 7710844 7954241 7503361 7830381 7331215 6812056 7154270 7222418
14117 7222418 6881081 6833834 6743311 6776926 6456565 6809060 6405917 6321935 6134524 6252258
14107 6252258 5961226 6276086 6205148 5828413 5784549 5725870 5902646 5869527 5538979 5672990
14097 5672990 5456547 5380100 5273804 5233340 4957216 5242759 4996979 5153437 4971328 4677713
14087 4677713 4864260 4974692 4676485 4765033 4787337 4577356 4528559 4458893 4592523 4385287
14077 4385287 4004575 4299038 4424960 4096641 4201741 3883607 4241069 4112301 4159447 3681182
14067 3681182 3598598 3654619 3914957 3769434 3817906 3832846 3678948 3746173 3405450 3605294
14057 3605294 3634387 3529273 3371300 3467980 3220616 3272567 3343785 2933580 3382736 3232901
14047 3232901 3111792 3209246 3319231 2928651 2962235 2888767 3161200 3042352 2935744 2715100
14037 2715100 2754619 3009065 3077330 2788935 2680548 2513072 3089483 2666466 2982068 3069473
14027 3069473 2635393 2792561 2776290 2233707 2554798 2521193 2318129 2644928 2594710 2433361
14017 2433361 2394387 2353978 3030408 2346083 2294971 2279843 2467061 2529237 1946274 2404974
14007 2404974 2197699 2459903 2142260 2352720 2093189 1789473 2097159 1948217 2058602
13998 2058602 2105750 2178514 1908043 2384494 2231857 2383305 2229164 2446009 3142553 3941984
13988 3941984 6900249 12754482 27708698 45119429 23898487 11410326 6997858 5031619
13980 5031619 3958945 3428699 3362303 3023994 2884288 2698711 2559216 2701419 2207286
13971 2207286 2609069 2606546 2355896 2110834 2488899 2678511 2122170 1850817 2024785 2245388
13961 2245388 1942652 1807859 2094731 2157666 1685317 1672818 2061254 1630192 1872097 1989099
13951 1989099 1942485 1823447 1829674 2124556 1583230 1761194 1542038 1890808 1780308 1840644
13941 1840644 1254376 1450540 1685804 1576247 1457615 1668768 1626545 1712618 1757365 1386257
13931 1386257 1441684 1595562 1193138 1678402 1711453 1491914 1159825 1564878 1450391 1367657
13921 1367657 1586750 1674010 1466484 1314667 1554321 1637268 1512011 1297980 1241424 1614120
13911 1614120 1540161 1305169 1091290 1015741 1529648 1248139 1472993 1224234 1555444 1130021
13901 1130021 1224901 1204785 971756 1470389 1504154 1388839 846037 1085291 1212610 1057763
13891 1057763 1380735 1548149 1036696 1213729 898062 1344945 977849 1260764 1117503
13882 1117503 1018478 1151265 1096200 915042 1141315 1115269 1042887 845881 1259845 1135427
13872 1135427 1168568 1015322 1081231 1170501 1039834 1213439 1064832 839652 1111675 1095287
13862 1095287 1048847 965664 862472 1226569 843815 915397 891414 1332339 985976 1016425
13852 1016425 1160234 755432 794044 1148497 859583 666882 1024576 1187928 990269 967912
13842 967912 867144 874241 1239992 997542 957142 842121 701492 907991 1067024 903346
13832 903346 880584 575305 1016428 1150236 1006144 689026 780409 930073 586862 640806
13822 640806 486891 491630 1037586 870395 670214 751575 643671 961826 979300 678124
13812 678124 861888 493128 1105741 1177561 637446 1080646 667422 399360 992573 785997
13802 785997 762557 719202 810967 501056 867652 740840 642129 825293 548151 910942
13792 910942 872519 828527 724467 783696 720323 315653 1143183 820755 841311 795402 872684
13781 872684 718589 437279 519373 751951 1106154 985764 536484 572534 675813 922983
13771 922983 504421 541643 763426 942090 770433 648163 897259 642215 824217 568091
13761 568091 674309 588666 603555 541506 685996 779512 703291 989029 417350 585471
13751 585471 783926 845272 719586 909873 780580 678927 442111 470284 623042 599076
13741 599076 507421 397337 421224 488821 521486 796923 504802 645700 658657 711539 525096
13730 525096 715397 780947 429001 696206 539180 490670 402157 618544 691824 669507
13720 669507 588133 388660 551554 630815 491842 542094 720429 431818 336953 535007
13710 535007 506004 593588 412509 678105 561930 106511 309543 409546 509197 377318
13700 377318 536522 963263 306919 453804 555895 494546 194838 560320 644186 624716
13690 624716 125490 263840 581137 688091 197877 385898 479250 462176 529719 473988
13680 473988 123599 275451 460736 598959 359602 697453 191812 292981 471351 485467
13670 485467 245051 385863 343591 362523 555186 294976 370281 -40025 492835 349276
13660 349276 861568 612508 396240 539640 700824 275449 543635 701481 -6429 293541
13649 687040 228090 491579 311211 269447 493448 441514 620690 525564 964792 621173
13639 621173 328350 368178 245103 506500 509518 624206 273256 329609 -48479 339781
13628 603044 453790 252268 518018 285917 174903 121662 87106 323460 367784 196027
13618 196027 286405 287487 117828 228133 580799 396021 262178 294613 267652 578501
13608 578501 37181 -72844 414280 332078 586912 537383 127021 192615 454132 130702
13597 383790 -236971 318741 437149 349688 278086 366817 461763 217146 650835 98052
13586 301495 136595 306647 415578 694655 359981 506987 603652 364733 218380 383352
13576 383352 544460 589906 622736 241465 545732 176751 36648 226768 258699 148876
13566 148876 209569 226692 340338 494605 253065 434568 529608 279536 519151 179474
13555 522504 165373 343297 361391 111861 481131 358511 390751 429947 223306 197727
13545 197727 472352 254635 409713 -35811 351848 89291 324317 498606 350088 542566
13535 542566 234715 9103 486023 205963 -162804 320297 47312 290647 172193 214977
13525 214977 224965 545512 258447 370890 160908 117524 291853 532882 423550 169444
13514 722853 487602 205223 279228 458300 163013 13508 616672 253641 63875 184129
13504 184129 145632 360916 -6769 189166 45298 47386 533197 77919 29077 226312 201671
13493 201671 87850 -202764 42772 220988 119335 146368 433358 118633 196412 219703
13483 219703 94941 84622 261423 364112 316538 -34077 148276 152019 185076 273068 490614
13472 490614 370687 253167 447506 492300 291405 -93228 421503 -139645 465379 206089
13461 125438 203155 124717 295324 92652 279824 217105 602244 51047 263766 12226 490857
13450 490857 284711 498565 -45598 142055 153809 -99295 360969 187362 252612 41536
13439 165169 381089 211957 306242 374030 55401 177662 -44162 284871 50401 -55283 323402
13427 134465 153781 75313 158731 512782 188813 280569 118843 232803 147135 89305 94803
13416 94803 331771 71205 33273 160855 -44548 -13534 162650 382105 -70421 28431 307259
13405 307259 307342 168910 90434 -12679 543063 269924 233991 127854 238141 -72689 290477
13393 44464 190038 323506 241933 -12739 332236 100551 98184 -58090 171987 -10643 275303
13381 240130 127409 354298 374031 155806 84126 197177 37263 664477 25850 339479
13371 339479 263787 217758 108130 121073 141400 417192 164126 101974 264010 131085
13360 189301 470566 241215 104794 21856 432997 510723 73573 349323 74303 185162
13350 185162 369118 228969 495224 477875 221243 497119 290817 306184 302080 255194
13340 255194 151702 244746 247910 154167 334998 407062 241634 405521 -86853 129156 219731
13329 219731 249792 327987 128190 250883 258873 123244 -4004 -15600 -194933 745951 117864
13317 240806 -311015 361627 356140 66644 317727 183130 311578 199356 39099 -115556
13306 186552 73716 232655 90765 106375 305924 159618 -72131 -384591 404017 81003
13295 -223326 334017 406335 -239277 -99563 298426 215721 140104 271082 179473 -47664 84274
13283 167389 86619 73809 216030 28074 14499 152185 151615 -255759 157084 110273 84657
13272 84657 240101 457793 -21976 85148 174368 205497 112263 18156 239205 -161787 204629
13260 177382 365216 -83728 205200 -175267 67265 -55881 7288 186309 290460 287408 370820
13249 370820 -1559 95103 280365 -22442 57 479975 154009 117480 -76444 166998 31453
13237 160179 -196435 337257 65025 77818 338737 359563 104314 119792 428648 -274699
13226 79547 63012 569870 118327 243465 368792 58586 -123722 258379 125599 418618
13216 418618 388994 -246354 -214301 124530 -67084 -421485 214546 -82465 221600 202889
13206 202889 -214251 135459 7367 33268 285604 -53762 317567 401043 131281 113566 202590
13195 202590 2926 -386711 -89342 111841 113123 -14385 21062 27341 -22857 -108296 -372045
13184 -372045 38243 80460 307402 393815 295743 19477 -424026 -108712 13910 -20385 -155776
13173 -155776 144402 -68891 58588 -306537 -511 73318 -34508 138491 293099 22924 41790
13162 41790 434870 104436 -4468 83086 274196 -40082 216790 -24113 153047 -20624 130334
13150 -24523 -78027 188847 194335 -63085 86724 271073 58083 284244 366973 226247 166132
13139 166132 -11999 189692 78628 184987 -52533 207082 -8056 150343 -122407 157441
13128 -127221 337154 -62077 307581 113764 95025 -98801 30292 271493 105918 -5845 -407099
13117 -407099 239474 -115514 112959 67160 -385447 -122470 397666 141826 -98093 -190275
13107 -190275 131250 162406 102140 420369 182216 225051 339396 22683 80249 152947 136553
13096 136553 167089 305533 397089 -97818 -139058 31157 -16215 -77165 7099 213502 -42114
13084 8110 -108563 -4795 -114614 -256586 34605 175967 339190 28839 -83074 -35835 54296
13072 243929 -67452 23127 227083 20517 155607 238444 182567 32293 253768 111452 -107525
13060 90311 104738 103707 -330990 251128 -192642 -54535 44672 141782 28301 -83375 142601
13048 296878 257598 158610 146202 9718 387873 28926 62697 -110873 235272 -37572 -17714
13036 38382 293610 444083 -146614 77697 -104364 -367215 -50855 -21778 151314 -171569
13025 249698 224203 263653 338067 231023 98380 174641 -21999 88689 325424 370243 217445
13014 217445 -31579 116595 316209 202842 139637 116653 -194320 -96712 50089 241642
13004 241642 -8851 126307 -57345 -15029 69525 -1502 153783 42237 321823 -48279 -75333
12993 -75333 -37276 434216 141265 204707 255794 317411 349325 105664 -180770 109068 -256976
12981 219103 14015 174375 15389 -177347 217957 -132948 34082 149739 -214428 -113023
12971 -113023 -116847 -38590 126839 -20675 10107 -224858 -65581 272542 204092 318884 -387802
12959 -198523 147790 130544 130144 1280 -166772 150884 -34638 352872 -281391 250871 427139
12948 427139 4599 153442 268362 170826 259165 -149379 177878 135485 373309 320345 102322
12936 -19795 203424 -85789 51417 35998 -81210 393346 231076 71898 -186781 70681 -196094
12924 37514 358070 15841 62258 183379 -69118 64550 -96612 8985 -180229 -7264 -159274
12913 -159274 235830 67702 -108540 27668 -210084 -299566 107899 3891 -310645 105607
12902 282719 -32568 86411 -53898 188882 32279 241261 -58558 163125 294891 386660 19542
12890 145123 230972 217333 23640 -70951 156325 -20342 83325 189612 249216 -206299 237876
12878 40367 -261834 190817 -152309 -114486 468578 27244 -64005 117544 77212 52507 -77993
12866 -306118 316279 271395 -173608 248955 -125146 -57369 13815 -173486 -30439 -260111
12856 -260111 200070 -16386 -188653 -158885 114610 237403 95581 -11672 189909 11538
12845 -25801 130543 -47564 146334 167734 -68934 -22072 -192118 -139825 24274 -174450 -149097
12834 -149097 -241556 27800 -93234 -167605 -81622 -88480 104585 401578 -97772 57986 -205948
12822 175464 -139673 -252182 292148 90614 -92434 100792 -268709 67223 14398 -83177
12811 203272 -295372 209003 161226 239600 58073 303858 -100488 -39492 -322269 -102729
12800 -12078 7302 -150624 -233981 -219290 -285053 -31358 10461 36240 -35381 -93616 -103009 86358
12787 167945 -65447 36066 22919 -9540 162427 -62990 -119767 15172 30660 -35906 -98243
12776 -98243 27864 -200292 19628 215325 -22241 -144405 -99105 -33111 342788 -21223 -147004
12765 -147004 -116135 -84094 -80912 262416 -193056 -73147 250809 37511 79935 232073 -78316
12753 -45061 -25030 -103494 78600 210215 557736 -78242 -202772 17472 34614 -78475 609960
12741 -87683 28270 -198273 -193322 51244 -23374 225987 -13033 60046 233169 251516 15161
12729 62872 -15080 -27728 47595 34081 -44549 136058 117488 -93978 -229568 -61435 -130516
12718 -130516 389521 -28605 202433 -78866 254776 225909 -97135 -364052 240504 489253
12708 489253 136291 -98041 404799 22525 -49505 33235 85243 -104399 62046 109499 368348
12697 368348 35095 225687 -94494 91075 33757 135234 188080 -83722 -75542 46653 60738
12686 60738 -56465 334392 100674 -32639 170268 -85945 260890 176687 108036 260991 118196
12674 176290 354085 380324 217256 -147846 56156 -103650 447226 -46698 233549 106917
12663 16663 264973 289895 140438 -75871 110543 98275 349357 -107877 -86201 427255
12652 40503 123363 132429 181186 284577 406140 83922 319234 134734 246664 -252477 54599
12640 119208 -62472 -345438 -131156 -55815 -76475 165198 82607 63635 -78639 220711 -74508
12628 309985 34354 23161 193572 121430 153863 98213 114273 -174082 -149023 242612 58202
12616 -87621 20726 235422 98145 -91996 85000 46624 -28001 233380 -84606 -140445 -144843
12605 -144843 -83665 -57133 280646 71802 78309 411837 246860 89574 74593 -87930 -58572
12594 -58572 -10278 220488 66257 129439 207942 129877 292138 -156099 357481 274321 -243430
12582 189606 84451 250776 169719 327362 267320 -85540 192721 -70067 69291 111035 -194104
12570 -128100 228969 259095 -228739 -302573 -20511 -129404 156604 84942 211928 -468178
12559 6014 53599 -204426 -63672 317013 128329 56971 253347 26071 381784 150538 26375
12547 -48816 230982 77062 19551 60990 141085 -187177 -113050 -222686 296683 143238 32806
12535 11943 -272579 -81976 260326 69939 37225 -78965 35008 -162938 -155725 281016 54991
12523 -37154 155077 189538 -142719 117639 69264 97348 -64082 -221215 -84916 -31565 101600
12511 -30242 -140447 -323416 52965 88187 107735 100628 -173870 -209475 51659 115606 -9000
12499 143041 77147 -77857 -32836 321205 429998 132877 -12683 7604 171642 149382 86886
12488 86886 -167613 138228 -182585 -52289 13430 155849 14574 -120179 -47593 88333 22660
12476 -149095 85774 75094 192721 74419 157616 176038 126650 -249587 66314 -55210 355212
12464 -96038 109730 9820 162623 -58564 234741 -11010 -132956 53762 4340 478891 90418
12452 197217 91843 -46554 -287059 -170176 -107056 -337338 -11566 118423 -115256 71336
12441 61712 -77989 -266859 -202653 124042 -44228 31060 -224140 96551 304935 114052 -41199
12429 133942 -46911 -232604 -153537 225339 -128962 -163391 -271246 278690 -198949 212041
12418 -62982 -233516 165783 30177 -70508 20056 -5759 42831 -105823 1612 -182097 260582
12406 -113978 -115307 -348755 -122448 4188 207065 3023 30232 -182585 93821 -168745 80150
12394 74734 36971 50890 42504 213846 27354 164889 130050 42055 -259865 -167466 -195485
12383 -195485 -159973 -80244 -50972 225986 -2316 -892 -8192 252025 -273034 -101491 -199512
12372 -199512 -286485 65180 28635 181995 135174 -338653 326212 124395 -212518 -153424
12362 -153424 -74023 -58946 85810 -61494 322745 -47610 348430 -264004 312072 -62233 177354
12350 202444 241080 4700 174961 129029 301994 -57998 206967 206530 185305 59682 36762
12339 36762 -113488 75604 4046 30693 -158749 98141 94614 4319 83125 61325 242438 185240
12327 185240 -401790 -26947 81153 -85734 -24850 210871 74091 -207682 -208525 -133241 29436
12315 -152800 413680 149580 -469013 -141072 112849 -347662 -204304 -172502 -98434 262247
12304 -39565 -406938 182018 1791 -252782 71892 -112924 228899 173259 56999 -207043 190805
12292 40480 62628 24259 57600 -58831 37110 -307410 -14980 -81496 230618 25981 434834
12281 434834 319679 -137148 -134000 -63358 28794 77891 -172893 250745 153827 362553 235928
12270 235928 -185070 275522 75856 163702 112788 -42816 161498 -40120 -25603 -111275 10043
12258 335252 -134347 -329506 190088 -215550 84749 -19832 -112948 166489 -57037 125619
12247 200156 89772 -74526 -106527 22534 -79636 -81098 67142 134543 175473 307081 -35945
12235 -74625 448273 -10053 -62113 -102646 -388164 117269 437135 69871 297737 166441
12225 166441 31463 131082 392567 181118 399007 56876 312470 81594 83054 452659 411513
12214 411513 270804 398858 63352 357934 348238 71921 -136882 25126 123373 349395 117249
12202 80549 80343 108927 -55221 126001 145529 148095 255904 -45320 -73276 -208832 489475
12190 -14822 439163 19893 223158 218088 -46244 77525 -246484 -41494 190973 36315 269946
12179 269946 -47523 64193 188044 344292 44461 180843 418751 19573 254614 -30535
12168 -176471 -11910 184041 130577 64486 161919 -114720 -247799 253488 66725 -188467
12157 -15951 -424295 321301 -151558 71378 -72342 117735 158296 314851 136369 137387 -285691
12145 47936 56906 -72540 137215 -10781 131254 63750 246661 -23203 -216128 -174184 -13519
12133 185931 -40811 104621 -51336 72220 15968 -119964 -74195 59635 -106122 -56249 -49060
12122 -49060 212918 259713 54816 -197602 272933 -137654 -131148 81058 -260454 135184 -155842
12110 186948 -164928 -17402 291828 -177504 27822 153716 29028 287179 238798 91085
12099 175507 108465 -106166 22193 -39433 11443 79418 -357937 30016 -166925 -190579 -72408
12087 -23321 -101964 68508 -19718 -158439 55327 129666 -81682 265458 -454282 100189 244615
12076 244615 -277573 -154518 98587 102013 -37643 307726 436438 1010114 1931191 314942
12065 89398 80291 106584 70117 5417 -70184 34285 -119954 46397 -107168 -197018 178124
12053 -237403 -98177 38402 350105 181315 -74654 178862 260818 50544 -145821 -205410 -108757
12042 -108757 16240 327246 -279254 -483693 208513 -53243 71145 -26774 252460 198971
12032 198971 -310833 152497 67886 174988 135539 23115 30611 -154422 -204783 186779 -443257
12020 209935 358682 34229 265555 42922 231238 -153512 -54764 22786 -323346 160025
12009 241327 37426 175766 43715 -48148 -78621 -125682 96554 -48612 -52674 168565 161567
11998 161567 396737 -123809 105406 -272174 271278 37782 355704 192454 -205694 92324
11987 -285846 -227239 -218233 162478 215865 70613 -16601 53273 58087 206486 -139093 -22600
11975 290389 -181917 -169043 -221489 18953 187592 -30702 -151321 -84861 53551 94713 126846
11964 126846 270512 -12327 -67111 100692 -92658 -83708 -47957 295078 2693 151752 60093
11952 -81394 -276108 -179174 -100429 -130855 135448 13909 -78731 -104788 -36901 -45643 -222796
11941 -222796 -141816 11776 288281 -304719 -367590 -165281 10854 -107182 -228305 -129446
11931 -129446 -99033 262757 232546 -150924 -200825 180682 151789 -433153 -203282 -42363
11920 37271 -136335 -310619 225256 -105034 76488 36459 261595 80548 7684 58408 -298112
11908 -387439 188730 -209436 -112055 -167314 -281816 33421 -172331 -84837 53443 122496 232957
11897 232957 -67777 -155847 -76175 54759 -71786 -196394 269212 -61424 -276062 -96336 -41100
11885 76878 -162964 -3629 -60703 -31807 -180617 -144653 -31644 -135421 -25481 -20854 -162567
11874 -162567 417969 -106269 149393 -66294 -145262 182255 -144701 -178510 -241872 -22132
11863 137337 149303 -16427 -210654 -85676 -155269 149732 14637 -115729 -39295 -17614 -188030
11852 -188030 27821 395363 40744 263474 212595 -155404 215978 -95545 -447721 66693
11841 -146015 5971 -65530 -394420 62007 73524 -6112 75378 97614 14471 153582 166772
11830 166772 -120717 227377 8185 -284049 -131122 332835 30273 -354874 -308003 67700
11819 205994 -51910 -110117 -177283 303000 -48516 -161433 -104980 -52666 83149 -167590 122373
11807 -329935 110924 -22151 60387 -228333 11212 182835 84804 273667 93666 -82388 -111182
11796 -111182 -383921 290646 250321 -293143 39096 -175063 98400 -297690 83295 -94064
11785 -105022 -114846 -156280 -40353 221484 180564 -108727 338771 -227914 -409040 132439
11774 -86957 -39462 -178739 36844 257158 77502 -168932 -20868 -33501 -106510 -148329 -29759
11762 74254 29405 153281 -108144 -288205 6512 90603 -36260 -78232 345760 -287303 -10846
11750 -13487 -11393 -2825 -15188 -191145 253308 -124961 -128624 -35963 -166156 -47854 -283499
11739 -283499 186100 386888 -74665 -89638 164784 -174579 122572 48014 -224553 75246
11728 -133775 166584 205907 363752 121981 -196762 -161682 -53032 -8316 -274387 225059
11717 218310 215093 15534 50952 63545 9224 159018 195704 199230 -55003 -47795 -79135 -152354
11705 -152354 -82639 107231 340966 78230 285556 -127758 302688 182595 -177439 126273
11694 -107859 240716 109161 -193574 215249 -194663 153102 164504 324905 252584 108123
11683 145926 125107 237794 -13821 -51063 -6248 213344 141142 28624 209322 184185 -16684
11671 -35204 84988 327608 -244622 225117 -212440 163250 138310 171041 202129 132034 44654
11659 -45072 -433922 -89879 -340088 -39483 -185417 160306 -115367 144923 -29120 -125187
11649 -125187 72701 128145 3175 -48832 293510 -6166 60035 -83205 -81759 -213270 162345
11637 -122090 22454 -147244 46421 50131 -131370 280302 436372 277228 276789 38417 -275084
11625 -227894 -72200 -108881 139400 -49388 -135252 -129038 113740 -215404 -123209 111926 17297
11613 240161 -76912 -28837 56158 105003 -27872 392979 -53355 -279113 -184858 -250897 381138
11601 45207 -107966 -184427 127983 142830 4296 8965 -217165 -7201 84650 181638 252250 38002
11588 231784 341348 166670 264173 415066 326857 195108 182062 108849 -80471 -181944
11578 -181944 186758 279502 61820 117761 128107 -150860 215163 -93201 199794 279467 262699
11567 262699 -16886 37986 17396 -94642 393822 236559 3476 329155 135706 -230495 139576
11555 -21987 104348 61239 170015 398809 28726 -193281 -18229 -65940 85709 28214 -10813
11543 84707 -55234 -18923 -3448 19223 219543 -30351 70409 -68056 178170 121286 -108653
11531 66978 57917 -93059 375335 117108 10065 88582 5700 98490 150640 171681 105035 18244
11518 379392 -3728 57625 -38657 -33930 -65237 80706 124400 -143746 241923 267880 290710
11507 290710 338910 37617 -42183 -83635 94090 187602 222941 -105692 -74886 168203 -56132
11495 55025 -113306 -57988 -93640 -103144 171927 221065 -112386 53760 200318 566098 -127255
11483 385510 14064 371658 391656 209378 159758 140946 -84347 -60092 184249 245732 305502
11472 305502 227560 228627 26721 82455 314979 -66941 -67266 197614 -299221 -38965 193158
11460 661851 38078 137055 113563 192156 65221 -5537 122137 114980 347735 393636 174182
11448 234706 113292 -106571 -120240 -2624 296276 163127 -353092 141811 -118003 13073
11437 -89070 312057 -116939 190049 197878 25989 -53882 -31302 304087 95639 5083 -135869
11425 369207 228354 -5546 379138 118821 -69081 -102794 119776 -127688 34484 -132048
11414 133723 -666 -51772 114606 107899 374125 -40617 99922 -211117 93108 57595 -37925
11402 160387 126184 -252231 3728 -153704 -233520 93874 363635 133491 -351472 38155 32838
11391 32838 328573 -111044 46292 -92802 -216659 221465 -132172 -102138 -380829 135975
11380 -156737 -41959 145250 263360 392020 -228677 -10285 -83251 162807 80311 -32783
11369 104682 -16942 170678 -46912 -117026 256806 -208546 202860 -188170 -87808 -64767
11359 -64767 -333857 -43827 -40049 33898 -81435 -22428 181056 10803 -78357 100507 198506
11348 198506 -114718 289273 175646 -28993 -84552 278080 35978 49266 -58189 83596 -41813
11336 244701 359850 -85102 105257 -7157 -78011 -221534 238117 32606 -10070 -278707 -147645
11325 -147645 55043 22542 25327 -81540 -27823 96082 -6349 -147936 130654 214001 199562
11314 199562 -59120 -134808 -107191 183101 -174651 -239194 -325847 121776 72756 123202 -127688
11302 -109879 36298 -24582 383774 -155431 -48084 42501 -109092 -169802 -130373 -182752 -169636
11291 -169636 -107312 -122130 35086 -38518 -166739 -164080 -437971 30930 185677 -183053 214054
11279 7087 -50496 100272 -191955 -159306 -367882 -98459 -277277 -23095 -20375 -25676 -246693
11268 -246693 -87979 -211795 -173744 -124726 -162714 -59176 -236197 73083 122560 -176718 149754
11256 -229980 339846 -354252 -7844 123064 256901 -43895 -2444 -169229 -130725 -134706 158237
11244 -32006 -46839 75767 -119272 -120419 284219 4368 10876 132999 -353913 314494 -267104
11232 -183220 -38957 6188 -45438 96443 72795 -185954 -226022 -179078 -20859 -221066 -315326
11221 -315326 -152360 -273582 -349305 26554 52060 -49934 -1301 -281513 -22777 234903 205414
11210 205414 180581 -274358 142671 78193 -206509 131399 36407 43356 -5721 63252 6797
11198 189741 27741 17728 -45479 -260674 -22031 -5740 -443078 -194861 -40990 -13365 21347
11186 -105780 167988 -160973 -157915 -139324 -69740 14948 -135654 24942 -428078 256370 -33446
11174 -167923 96489 -123654 -210240 -19540 -8929 39446 -7219 142497 -272577 -443719 177115
11162 139982 55530 -19258 207223 136585 -54751 16782 -88592 -44895 -233039 -245802 -212260
11151 -212260 24652 181274 -48031 258504 -16879 -180447 -246189 267144 -131510 41938
11140 56204 10862 125488 -132281 -22883 133529 204590 -121200 146189 226461 208740 -146837
11128 238947 -23043 99565 94215 -162431 344920 220338 -20396 248033 101525 -27944 -6866
11116 380078 -35820 -45739 125093 -13156 162326 -80405 61477 56847 61419 -34348 177311
11104 290045 -291191 158100 210087 315049 188093 92283 -141983 9442 -367497 -130358
11093 662821 95097 272556 129846 285962 493893 82691 270725 35310 307444 295706
11083 295706 330829 302743 449657 142500 329496 445679 340113 334807 -39508 3535 280576
11072 280576 498342 511301 276454 264105 407844 354016 406572 204846 418230 237000
11062 237000 298669 454292 586268 727100 810291 551957 639579 410148 142698 812200
11052 812200 1197437 713483 760744 725959 750174 924301 883207 1024132 983276 881399
11042 881399 915072 1071725 545988 978530 801333 344898 859816 641738 609831 895726
11032 895726 756352 602119 452764 722463 831732 768135 1055774 802490 908021 729992
11022 729992 787868 783634 635208 716828 812597 662618 440201 908964 743404 758540 868850
11011 868850 563916 648143 798047 904670 865396 723140 642012 830244 814699 634011
11001 634011 415107 754446 566912 1073742 584343 822081 547349 492239 699486 834402
10991 834402 925494 925102 624090 1039729 750201 802762 925990 909251 1102101 1304518 1135161
10980 1135161 1195828 1227148 1556783 1382520 1983959 2293241 2053638 2757676 2842834 3224653
10970 3224653 3178859 3185795 3009264 2831173 2424442 2265166 1887147 1773817 2030436 1664674
10960 1664674 2041181 1972201 1571529 1657774 1376066 1872664 1161121 1027388 1316350 947894
10950 947894 758983 599790 579769 492252 636915 616031 155118 450851 421021 239650
10940 239650 246861 336430 80501 -100997 320736 74455 97309 -231093 84023 -99700 175786
10928 281597 -45811 58332 -2885 389425 251877 38145 209129 -271827 -13023 -13324 112221
10916 13769 44463 151786 -49497 -150119 -245633 81009 104455 -38708 -150472 86100 265828
10905 265828 301374 59776 -115773 -39693 -199138 -53138 80700 37133 205566 246529 25317
10893 -19354 -30819 -304711 -15121 -93824 157874 84441 -14865 -76925 -193414 253820 116588
10881 -212873 157096 -50361 -22611 -151946 -203584 313719 -247286 -62458 85483 292088
10871 292088 -34044 76485 259427 182972 32421 149573 243219 -126198 348485 -264459
10860 397784 71211 75280 122436 -56166 -124822 -231634 107773 117729 -86746 43069 156034
10849 156034 -170813 -23222 124868 -235235 340321 -131504 -55704 174233 -187592 191506
10838 260455 -110616 115320 222626 64539 -47199 -44132 -3395 -38593 -79601 201531 -146492
10826 -63488 -216009 -267150 -154687 -19606 -68919 -148998 -15666 396924 -70787 9472 154318
10815 154318 77054 235107 208150 -297894 -430490 50727 -154463 -142042 -6760 -209600 -50621
10803 6973 208048 -330883 1983 75398 -131357 29171 98609 110638 199509 74993 -121824
10791 21796 -162274 -251356 46226 136938 -211814 178440 -9565 3667 88744 -28142 15576
10779 -162503 -316454 -162573 -140089 -97191 -85561 160368 -324680 -47146 -80599 138883
10768 152766 -98569 -171068 -242679 -137589 85246 -188177 -175423 329269 -190759 -86246 -208817
10757 -208817 48768 -374581 -208450 -70036 36345 -187955 171047 418673 -99170 -212608
10747 -212608 -177951 59649 21942 171115 90116 -307059 -224574 -101349 2007 44222 19506
10735 259539 -114246 -125203 69653 -382848 -150477 -197650 13193 -387211 -23967 -104702 67280
10723 -230053 188658 66457 -65107 29213 -88689 -92950 19001 -141846 8145 -172008 117524
10711 -103522 80299 -392888 243335 -87617 -129572 -216977 -75747 241904 -9880 227180 27105
10699 -177314 29783 229976 -161987 -175577 3366 -46642 -174382 -294363 6388 253108 -245130
10687 63115 -113454 -63485 -41069 -19000 -270175 -9948 -139643 -451320 -463006 -23130 -235648
10676 -235648 -77866 -121102 -9106 24652 93823 206921 -282566 81908 -39764 -338148 -137485
10664 107259 201597 -161744 -196617 -111224 -189810 39124 117692 124403 -182379 4546 -76812
10652 -270962 22247 82609 27713 -113626 -178862 210136 475600 34040 34051 146381 -222459
10640 -142717 72070 192671 -46084 -154979 24055 -294158 -374971 -294097 -348422 -194088 1786
10628 -9139 -301726 -284708 -35309 -36824 32759 -107448 -115889 -275854 -227222 123245 -166128
10616 -69392 -43522 44077 83669 -286027 194515 -272331 -282571 -139038 -133633 8108 -47052
10604 24934 131460 -64406 -183995 -518479 -413026 -32389 9549 -235859 -271625 12436 -270859
10592 -22976 33408 40966 -284252 -204630 96492 -165873 237729 -64686 -215466 -43686 -4036
10580 101409 76974 -16413 -115204 -81905 -19575 -104151 -222566 -182892 10625 -200433 -342534
10569 -342534 33466 -522510 -128070 -179459 120663 180213 52143 34990 28207 27670 321148
10558 321148 302362 211081 -100702 201274 -126507 -223454 162647 -93498 -246536 38042
10547 -67900 -63008 -148537 249174 -25246 -27077 11735 75922 200406 70798 -179941 44124
10535 -39240 132439 22875 -47020 12172 -331885 -103155 -129172 -71954 -40523 -236054 216146
10523 -140544 -49439 174788 -273545 -189980 -91097 -8429 314866 471596 88053 -114037 179161
10511 232642 62667 -144785 102569 -144055 21624 146709 146414 -24413 -89668 -230234 -169086
10500 -169086 201353 310251 303385 -397040 -21067 -15479 379041 19453 -150024 -191367 120408
10488 66763 -8785 -46729 -23980 -183515 126595 145760 -317180 336315 518587 382356 527737
10477 527737 263715 -89501 -92540 90084 -165876 -134363 -20167 208419 -132091 98162 -72471
10465 54734 -44885 85452 40394 -13950 15568 143245 -212584 -74032 218453 -212010 238131
10453 72143 -8640 -274780 257646 -342317 163221 -63828 -131737 129556 -120176 189623
10442 20698 -175028 -129499 102270 -65218 92425 -281335 -159351 -355637 -137716 263035
10431 -296849 -78724 194305 -82358 -264368 130526 -49073 189944 138315 -281354 -54150
10420 -3780 -239971 -169619 66232 2704 -359978 142132 153996 170690 -207872 65657 182363
10409 182363 -73775 53909 27666 -24772 -152463 -328108 86267 20536 158717 22507 13790
10398 13790 -154645 -31572 -178323 -79811 259347 -203455 -198490 440174 350774 72155 157588
10387 157588 331670 8173 311550 103250 70903 166174 -60894 -18616 128958 165132 277087
10376 277087 118849 449225 211738 354876 360103 95320 402535 292215 428262 235575
10366 235575 545806 521976 620732 391892 275053 236687 135744 361724 21 -60414 269875
10354 352090 187924 122727 333943 146358 774603 638999 883609 234018 217103 225870
10344 225870 535155 414379 408801 267786 49792 239578 118389 101332 382689 5384 163307
10333 163307 152856 -39769 -215165 126220 223588 237113 -39643 303431 236126 237229 19470
10321 41002 488729 130636 300434 305660 92190 86438 288004 -194721 -134536 127766 96914
10310 96914 18817 -29052 250683 -326278 -48296 89654 -348947 -103802 -450110 -203823
10299 -107762 396122 73672 87178 55001 43702 30139 307406 -59978 -157272 15936 -167939
10287 -26427 119257 -92438 -135127 193838 58737 -208456 -28399 -249564 -59943 241935 -168520
10275 -239512 111846 -114459 227063 -45556 -273744 -226115 10380 -37673 -63167 -31875 28654
10263 123011 132317 7830 176379 -46743 484161 141692 364324 559939 146408 190719 269116
10252 269116 294193 392844 -70701 33495 -103276 29838 -188326 149796 -23881 -179580 92264
10240 -21556 -78090 84958 33978 -18267 -171991 -346216 -248043 -170352 -156229 -61594 112519
10228 -219610 -159357 335049 261160 19309 184061 131154 -62761 -33985 64324 -307860 155532
10216 -105115 206151 -285339 25181 -100534 -106249 -90513 286510 4202 23476 -10089 6300
10204 -58982 117122 192426 -315531 69758 144130 -426517 -108867 24403 -92039 -234260 -72556
10192 13101 57299 -84966 -215046 -99456 88329 -99628 -496335 -197105 -103426 -185607 -13161
10180 -217862 -56777 -137977 342010 220704 133463 -146605 -240335 59632 -24680 -505307 362425
10168 -180827 -16817 -154249 -227644 -92126 -316754 -143004 -400002 -58219 -97459 265495
10157 -74920 128233 -76097 103659 -76461 -224875 41887 41372 380 10174 -41991 35297 202493
10145 202493 -297978 -23634 -15020 -45866 364988 -15382 -73440 -67565 -199655 176250 -108265
10133 286959 -633702 150694 -51986 -244047 -208536 -506370 279416 56721 50828 -26779 -53283
10122 -53283 -298099 -263800 33882 -80285 -25400 -91465 20384 234085 -127422 97674 -98713
10110 -253750 -43265 -128566 48859 25630 -106463 -229707 116270 -24371 81159 105033 118561
10099 118561 51919 247464 82839 -96986 6497 -14391 90189 -313432 -280168 -208580 -150257
10088 -150257 -192195 -209497 -66913 -297002 -13793 -131418 116441 -153014 -81397 -288527
10078 -288527 -59409 -263779 -56028 -164585 -301099 -15665 -9701 -366715 -213162 -76156 -128478
10067 -128478 -113015 -39638 120622 252553 -122739 369473 -211611 146360 -113403 59261
10056 61667 -155549 -376867 -152070 -226262 59835 -193797 74473 84157 -151126 -244600 -112567
10044 -75251 -159600 -356404 96373 -83204 -10327 97530 -136541 -190519 -56854 -107666 86875
10032 -227121 -9086 232789 -49803 -644506 224414 5039 -205602 -261369 -217791 -54915 247174
10020 125898 83361 58320 27042 31586 55221 10972 -373550 120239 -144922 97030 2754
10008 -145312 -446361 -8909 -233206 -163401 -144362 -297774 160796 -67475 -115296 -148835 -49494
9996 -285239 -446685 -220999 -78223 97548 -261425 276366 -1691 323118 61491 -44876 -150581
9985 -150581 -49843 3950 -335358 94250 56609 39968 94410 43376 -198354 173658 116974
9974 116974 -216307 -390246 138511 -413810 209183 -49647 -67078 -21735 -66074 -271463
9964 -271463 -150754 -64622 -239713 -95093 95629 -286184 141960 31127 89127 -35822 -183869
9953 -183869 -27449 -12486 -2417 -334735 -108396 -75862 92852 -83849 -63366 -79234 -61177
9942 -61177 -156496 -210626 -407495 -256166 -106252 -211740 -243295 152040 -1940 -63075 -10237
9930 115139 80270 -92017 -254440 -180506 -259404 7038 4350 -244671 116149 -159562 -99623
9919 -99623 17064 -88815 79604 -94450 31815 -191619 -127607 142690 -185885 102006 -158671
9907 -318329 -64190 47004 -187346 -81768 238495 -35210 36635 30112 -337547 -193902 177766
9895 -49054 -249096 -41940 -269138 102453 -31405 7409 -144225 32431 -394027 -350317 -9560
9883 -230805 -62206 7733 70398 -383385 34461 175901 -443679 179762 188329 -118627 41864
9871 -240542 -475830 234095 -126999 -128401 -189703 -99096 83748 -7984 205851 30472 266763
9860 266763 -44108 -183153 -252738 -86953 23596 213701 126835 -125235 -107027 -298726 38189
9848 14991 -112704 290037 111700 43104 -21490 -171165 -248419 -83474 24395 -96421 -117220
9837 -117220 -60608 174501 52217 -146383 112565 -115389 -256714 -124421 -146913 -100322
9827 -100322 52101 -116817 -312980 -23071 -2712 264596 -18319 -136018 92106 -51310 -188918
9816 -188918 -833 -250030 -156809 114310 -16406 31732 -175418 34534 205639 244640 -280075
9804 -234548 -184273 -32368 94669 -172275 -157912 36597 -374384 -96771 -79369 195116 -24033
9792 -326341 -175333 -239219 -235303 -255630 41 113246 -275574 3484 185048 -249471 121545
9780 118587 -104454 -22325 -181616 -66877 -147672 -12477 -607518 -356428 140388 200533 -50637
9768 -186202 -66552 34831 -15294 -92137 34761 -169825 -172202 19362 4557 -190350 -70960 97146
9755 -168393 185423 127621 140526 9334 -96064 -118357 -240850 78333 -284638 -7167 -243606
9744 -243606 -82220 60910 -313556 -356516 98071 41777 136816 88795 360810 368 150813
9733 150813 -157927 95008 -97633 -72422 19521 42907 100660 101027 -300178 -109971 286445
9721 -277131 -49444 -150788 121720 -185534 -60895 397921 -38064 -374512 -79209 -245893
9711 -245893 -81854 -133725 -147186 117237 -281278 39757 104895 272701 -145458 67855 -226064
9699 -436582 -130776 78010 -203093 -77629 45529 -165416 -75136 2271 -77202 -180118 -394370
9688 -394370 44239 225056 -205269 -164746 -46808 -4485 -186295 -183641 -141868 -59494 -202121
9677 -202121 -527400 88668 -166558 -367238 -340830 -6399 -14637 -139058 -25934 60741 85449
9666 85449 24979 120253 -126092 23554 -268 5566 -145418 -74714 -82533 -47531 -199664 213045
9653 -363093 -137994 -272645 -144731 46946 -376063 -3120 41491 -409290 -353727 -223608 -85275
9641 146278 -134662 -85452 248557 -309205 173761 -46870 -214935 -109537 8652 170806
9631 170806 -180841 -138574 -225982 -85833 -349720 -266354 -322356 42309 308944 12512 49666
9620 49666 71699 346325 246222 -3002 51291 -39160 48947 -135396 314172 -368170 -119490
9608 -154338 -207240 32276 16322 39691 82582 37951 50650 -219498 -160839 7491 -8975 -201794
9596 -201794 -28431 -393225 170438 -77678 -94712 -65348 -252280 -150652 97657 -309880 -11970
9584 -154523 -281338 13255 -160642 25790 -211232 -177477 -12974 -98063 -187953 -433026 -107239
9572 -106953 296385 -301162 -233442 30555 -51533 -113030 -184325 1807 -37601 289841 -164016
9560 -82020 -53728 259563 -152960 -220216 -16111 42259 46183 -200842 -311573 263036 88108
9548 -96166 298436 -108366 42078 147225 25660 -106708 -284100 -70725 -313989 -110706
9537 -529638 269748 272299 -130949 -122342 161261 -392149 7508 -115718 -241715 -92192 66247
9525 -229195 -247221 -203045 -302106 -35212 -11315 -159481 57817 133029 -17071 -188708 130898
9513 -33105 -46055 280127 -149619 347730 -180748 357277 -272912 -16998 -115661 7882 -383190
9501 -175 52555 -378865 300000 54319 -219745 -115435 43793 -68399 66649 -31536 -117865
9490 -117865 -38757 -75548 -101751 -122946 110693 -316683 -417835 19101 107313 187765 -176741
9478 -230740 223968 -94427 -17868 -191706 25425 254197 143749 -83317 -398563 -222862
9468 -222862 -107766 157927 -262415 -185809 -196479 326421 -72700 -202301 -138669 -78248 -52140
9457 -52140 140964 -20775 -54209 -75319 -254478 114549 -78103 -82586 -217111 307313 -8768
9445 -152749 56978 27463 49532 -389554 -241381 -81996 59676 -128880 -26537 -7514 175469
9433 -119462 248611 -328195 132727 -90586 22695 -138952 -5494 -112330 83191 -408836 -5666
9421 -62391 -168709 -192420 161512 -288771 256821 -90883 330291 -225208 -120615 -62668
9411 -62668 -96598 112217 -224120 -315194 122825 72227 9735 144970 -198211 -83269 -114055
9400 -114055 -52675 107105 210760 -61563 101461 -125871 -167754 130660 -117072 -132287
9390 -132287 -20265 94169 55702 40906 -328365 171964 63089 120951 214439 -48623 -92601
9379 -92601 -203539 41805 149966 -34734 278348 120449 -195453 202295 -39575 -375143
9369 -375143 -58418 -106308 -152119 34490 69459 -148773 -31171 5189 -385696 157654 -197122
9357 -395281 -157901 -30784 98041 -46209 -52453 -3260 268049 -472280 -40740 -546591 52042
9345 -288095 -123833 183409 120127 -17280 -205878 -282427 -57646 -81289 9520 -48149 -119601
9334 -119601 -161437 -24270 53015 206644 -214556 -135890 -82048 -194982 171014 26961 32713
9323 32713 -266025 110707 -163125 -345125 -345125 -7207 292810 -92231 45816 -56770 -127607 36208
9310 210951 257011 -24179 -187843 -335458 -287070 -179500 -190359 -46510 107942 70382 110741
9299 110741 187500 -196045 64767 -40594 -90976 129399 -171676 -7945 -194483 -111337 185844
9287 276779 55972 -210822 -145878 43600 -40438 159240 99961 200023 321 239284 65758
9275 43904 151902 -293511 -106864 -328705 -154504 107094 122346 -65458 -52177 -273017
9265 -273017 -64349 107390 5313 -304081 -28130 -73030 -8897 76196 114589 8135 -216372 -104232
9252 -16190 -235593 -39982 -96182 73804 387210 -270669 -197396 -118155 13051 31608 30137
9241 30137 19090 -51653 -141052 -199714 175478 -113985 338062 -156298 -136570 -139911 -365131
9230 -365131 116183 -81371 -173367 104795 -367601 51928 -199426 -166260 62259 -45 106256
9218 5470 83910 -31688 -67080 -48558 -161208 -131772 -98079 -175236 -49447 78478 103898 95949
9206 95949 33352 -21735 352391 66900 -236955 52276 -27526 -85538 87961 96060 -78022 -142289
9194 -142289 -436222 -251845 -68984 78493 -269725 1998 -140887 -88062 -18535 51646 -338769
9182 251886 -345860 118184 -106193 -46451 -166027 -42091 -14008 32512 -183219 158633
9171 86318 -145384 -203572 69088 -15423 57951 -104180 -74953 -265461 125000 264866 -280400
9159 80150 -107878 -99826 -138211 -144681 70189 46375 166262 2149 8491 165688 192047 -7683
9146 127059 -193056 224718 -34339 -34849 -19345 -134636 -297058 154449 -293080 38694 9584
9134 -229036 -66406 169034 207736 139220 -358868 13785 155320 -120209 -310968 74991 -2463
9122 -241952 -66167 -102978 -2632 -141916 31686 -357731 -210053 -239239 178249 -85420 90000
9110 97075 80547 -244898 -518485 -21301 154520 37861 -224226 44813 -142134 2755 -114805
9098 -304987 -196184 -49949 -148819 -103829 54031 19729 -151751 -179393 -201638 86219 -418622
9086 -116857 125574 140921 305248 -140530 -199058 -226366 6488 -283952 -10932 -378853 -318679
9075 -318679 172483 -70400 -50936 131967 -229871 68463 -76005 190271 -102811 99270 -150964
9063 -72947 -77877 -10974 -96375 -128722 198142 -114986 -87150 102534 13328 186886 -161524
9051 165555 -128125 41752 -127733 93272 17802 -74010 -20674 -37316 -206277 -231755 175572
9039 -469175 -84061 -1179 79681 -396799 124591 8359 -168007 -497916 -149445 -317207 -97880
9027 -256090 -292560 -56473 -39376 -95080 -89286 91025 114008 -16771 -237336 102173 -289092
9015 78572 181631 39619 8012 -148767 -155239 -135479 -128093 9012 45920 -21711 119790 -64964
9002 -80802 18025 -233562 180970 164503 21425 504 64090 -374152 173009 27370 55203
8991 55203 -219062 -192736 108465 -7171 -122079 -387322 -220488 -2978 -120877 22280 -106463
8979 111819 258433 51761 -341878 16662 -289709 -214640 -95437 -30572 -195051 -169482 -12687
8967 37812 -73054 -511777 -200035 208440 43934 -169402 226691 405834 -23701 -49744 -164552
8956 -164552 -398694 -300234 -39075 -152688 -224349 -21434 -391118 -35792 -269234 -435869 -42357
8944 -138660 86179 -42609 193773 -311329 217012 -316816 -67974 135096 -131830 139333
8933 -309900 124958 82124 -254510 -64926 197321 -162590 89935 -384093 52561 12473 -51700
8921 626675 876639 142994 78183 228434 -48276 14724 -275356 -81071 -170599 -35476 10657
8909 142443 -16523 23921 42416 -127184 94988 32557 -501220 44617 378212 82091 -69778
8897 -168316 210438 -126210 -10478 131226 -75057 -148131 3303 198928 92647 167844 -32622
8885 -217826 -15119 123134 140081 7160 -97219 -137434 -55773 74754 -106736 -32330 122463
8873 -220104 332802 39288 -5359 43413 178304 -36535 -89419 -132404 -186752 -102229 -139341
8862 -139341 -70691 -110743 -15129 -54520 -128257 -86275 -30668 -160578 -27401 -193200 -305426
8851 -305426 -84598 -68943 -59243 -188850 -147830 -29020 -196918 -41578 -56135 87287 -78770
8839 -41169 -119607 -160118 -142240 -167520 -182249 85493 1322 94117 -9914 82745 92131 -408383
8826 11655 -29968 14461 -516653 -126480 -280075 -168903 -403992 233153 -119306 -155269
8816 -155269 -266034 -210389 -90146 -100139 -29502 166153 59181 102511 -163443 -118519 -145140
8805 -145140 -3411 -221440 -171380 -41969 -218791 -304377 231730 -315465 -203104 -224256 -232310
8794 -232310 443525 88711 -8392 -139199 -7656 -56021 110401 -24009 183449 55028 161517
8783 161517 -68131 -136649 103887 -98963 -64252 -53274 -235238 44476 -6468 113531 167565
8772 167565 47291 -17852 -80133 139183 -239705 190495 -158 -140763 -34691 172233 28644
8760 108212 -201581 -37350 217653 16904 -197267 212755 78623 -100477 149144 -350963
8749 40388 67956 -148198 52289 -278063 -55883 86955 -414099 -63777 302829 107388 130065
8738 130065 -51174 139086 64208 -159341 178275 -109058 -223254 27202 1425 52592 124167
8727 124167 -163689 -185246 -41896 42756 -447344 137982 62589 -120023 -250975 -41121 -93629
8716 -93629 -113719 38185 -160497 -253982 -187070 -8248 54776 -290568 -58649 -323243 -4850 -202643
8704 -202643 273352 -288739 82648 -134490 -7495 298404 -185744 -362248 177915 -204841
8693 92175 -257286 -33151 -127152 227118 -256436 248933 -325771 -499369 -281345 -93958
8682 35616 -39720 143692 387825 -68817 -507734 86586 12110 -140564 284540 149919 -5001
8670 -96064 46309 48456 175362 232944 -139852 -25384 55995 177509 -86892 -140824 -337610
8659 -337610 358408 -284019 -80312 240660 -32899 -49584 162649 90373 10454 -184290 -125524
8648 -125524 181210 -39704 -106364 -92371 188267 107548 231814 172779 -133192 31418 -39538
8636 -482249 -52225 -346034 91806 -155480 -65239 54415 -131345 -190120 71133 238719 55040
8624 45312 327643 -108973 322116 271231 167793 137645 -27949 27378 -85877 31891 152318
8613 152318 -6421 -129217 -50454 -273556 -269528 172005 -69750 -158239 71739 -79945 -12115
8601 -16304 -76497 -330924 -25871 -323122 246379 81501 254894 -100615 -87336 152432 -99831
8589 -16937 -22306 66710 9239 258056 346530 4673 200010 -370442 139631 68586 234218
8578 234218 96660 -411279 343684 -187507 -74650 -109316 98272 195657 137640 -45753 -71463
8567 -71463 43181 314810 -52729 32355 -280178 -54952 -78301 245476 126983 -301170 179818
8555 -58706 422576 53339 -63198 -7751 -100257 138443 -197332 -167451 -55777 -58319 -198431
8544 -198431 27856 -247218 70646 -318634 21653 -233718 -42490 142927 -198744 240672
8533 10648 -20259 -146133 -285449 79004 68839 -320991 -46811 -126913 216927 -107968 -252289
8522 -252289 -99976 -100655 105512 68084 274621 -69607 202941 -279295 -5694 11174 5176 9314
8510 9314 111092 -242183 20449 -204610 308258 61020 -105043 -91296 -172600 114639 121237
8499 121237 21860 -90755 -124005 -117575 -323395 121208 -376616 -26932 -179821 -122270 -89691
8488 -89691 -15331 -2268 26293 -154289 -343995 -150840 -332968 196797 -344992 82266 -269875
8476 -396195 29516 -118145 395710 -216380 -26518 -95505 -118250 71910 78814 231294 -121446
8464 75149 -341591 -221581 8371 31330 15070 -150077 -287387 -114488 23976 215090 144241
8453 144241 -140430 509 -356697 -126185 -189165 -6891 -115064 93320 254906 41712 -276770
8441 -67140 91793 -12816 -33379 -310907 -32777 -97120 286214 -167538 -341544 93413 44928
8429 -88192 161829 -421246 102272 184875 -180621 110825 -405158 4774 244862 6581 -90583
8417 -7012 118586 -214071 43515 73431 -23415 -60290 -154765 128565 -88353 -149210 62467
8405 -142763 48634 -315833 -154522 -162142 -53645 -10833 50641 -324739 -162397 -201429 89994
8393 -163005 -182670 -74327 -89809 219280 88961 -206015 157776 85018 48249 93242 -4304
8381 -27206 99820 100674 337017 -225525 -150818 -59997 -141924 33890 77721 -138314 172517
8369 -49479 101404 104734 -158381 29743 144576 23323 187816 127319 -102773 157946 58459
8357 43447 134668 21128 -37125 118131 -269194 48297 -97983 24871 120842 48686 140069
8346 140069 -52243 -152957 108529 159708 -34458 -69665 -79621 -3266 -290794 9982 -210277
8334 -101427 -410491 -11437 282273 -305902 131898 -89059 -132817 88532 -282407 54424 -421626
8322 194663 -248729 -309667 -168156 -46826 39957 124002 -239732 142143 266463 117516
8311 -31448 112748 248089 146368 -691 -84056 -44776 -131855 85730 14662 29860 99125 285916
8299 285916 -94102 -227009 55736 14528 -219600 -128620 16946 -51055 66619 -329865 -123888
8287 -154419 -174231 8869 78386 -472892 -28082 -133606 46302 38014 -30055 62055 -15365 -144981
8275 -144981 -272881 -288580 -5474 -86436 -107791 -176614 27987 -82830 -362652 -142724 -98429
8264 -98429 160235 219607 214325 -87812 -77458 -252319 339259 37081 -72598 -183906 -46851
8252 146545 -212796 -352359 -181516 174444 121008 -192227 145443 119235 -6814 179683
8241 -236970 -97097 -224890 -47608 156947 -91170 29912 -475 -138509 70686 -7407 340423
8229 -194174 129690 239371 8816 16683 -43884 111809 -196800 1729 -59117 -157628 -100080
8218 -100080 -288466 -411041 7251 -151837 -53264 20036 105373 -59542 -105349 -62995 38536
8206 264131 55192 -91116 -175629 30821 232679 9658 -31711 -63935 -76820 -637113 -241617
8194 -58913 -286535 -212207 104293 -110429 -97586 49056 -70686 178517 -347001 56720 -316864
8182 -9218 -264350 -228234 280058 25053 -149935 -157570 112185 -88910 -71899 199101 88858
8170 -329540 226551 11053 155227 -92216 -196513 -51282 -197313 -281568 32398 -583 79238
8158 -101954 -116537 257667 -277711 36766 174521 100213 194375 -17906 65111 -129441 -307593
8147 -307593 174272 -251860 88276 -37060 -85819 -81761 90139 -315495 225699 -70697 207222
8135 133748 -170066 -62108 20196 -82142 55636 235725 -36393 196056 68131 -80749 -259920
8124 -259920 -77668 -73805 40305 -120236 115035 -150574 -121973 85943 -35621 -8623 -253622
8113 -253622 303762 -142136 21366 -218956 -112347 -257475 -312896 -10408 -265445 -57628
8102 -104282 -4155 -33497 -49068 -56760 -222368 104585 304380 50692 140002 -314497 -240328
8091 -240328 -27907 19795 -365317 130473 117672 185169 63618 80238 -104543 64672 -235423
8079 -3199 128660 -342837 -170162 -112371 -262683 -284751 -255265 281040 -178930 163476 -57639
8067 95202 141859 -328633 104688 -87745 254397 -107835 -119434 -250637 -113332 -178249 132485
8055 44802 123682 -285585 138346 -322439 109818 52437 33758 -75871 242530 37811 -47166
8043 48774 221670 -309496 -110449 12823 -45203 -258721 333506 -6474 -178586 45801 312540
8032 312540 52488 -408853 -428288 91220 234003 -208056 -138903 -123477 127913 -154811 166723
8020 -188327 -60487 -156552 31006 216142 -91895 -65898 55550 131779 201589 49774 -153363
8008 327622 -213131 -249820 8468 -59048 268404 -248731 48160 143651 63013 131804 -178412
7996 -94685 -98872 -438803 91192 68962 -171360 100951 -213788 245559 -166095 19990 204763
7985 204763 167430 -151702 102330 -109829 -271612 -133883 277261 -437065 456598 -49164
7974 142850 94343 -79359 -164643 -258342 -282313 -28806 -517981 -3779 -183861 187264 39759
7962 44244 -506342 34329 188364 -179629 123146 -309035 34531 -92200 -118463 26972 75727
7951 75727 13133 246336 -115491 -335194 -21032 -327869 -117269 98686 -155552 -33534 -48368
7940 -48368 -69445 123825 -39670 -159525 -89690 69582 -151676 -67209 -315904 -95265 34975
7928 -110256 74613 107012 163334 -79623 158473 135562 150881 -81972 -151087 -28079 -55344
7917 -55344 -248492 239156 -95930 92214 -22139 -219489 41562 281807 181788 146788 -130309
7905 -33515 -149793 92230 411 155251 -82136 9609 95965 -149338 38172 -74004 5646 -44102
7892 -18595 48402 68304 -129941 -20673 -26742 -546263 -218371 -206943 -145957 -318273 -206666
7881 -206666 -122888 -254733 -83869 -25455 -6180 -157883 -22081 188652 -198084 -92868 39634
7869 173353 -45777 -202269 -259928 -68794 -6730 -4257 -284323 73652 -332951 30335 201018
7858 201018 124578 50749 -334577 -120707 86614 -134189 -215015 -200565 300267 -285130 193539
7846 -153104 -105703 34280 -47499 -224433 -57944 1684 -38637 115177 -286721 -244104 195415
7834 -11086 -307443 218086 31099 -139440 -69793 214798 -124215 98998 246149 71005 104741
7823 104741 98436 -283157 -105679 -109819 287949 145695 -22561 189436 -142722 -184371 -35323
7811 -72381 38509 33409 -200417 90178 -106020 -149100 226526 -42200 51041 -119181 -24832
7799 -39480 -71733 -237361 -329517 -118506 -104553 178612 4532 -324919 383582 -47748 -72357
7788 -72357 45676 10777 -154103 -112066 136773 -216005 274612 -1884 103595 -130930 196341
7776 -256897 -107190 -3060 85803 79593 -15074 166311 114159 -130968 68108 298721 -25475
7764 -131124 -57972 101950 -194276 -13974 119165 236165 -156697 -77336 -358799 -144502
7753 38130 226839 246888 -492029 -108065 -41471 -122659 -175410 -102706 -259172 -187085 -117242
7742 -117242 69893 -43767 -250644 -264147 48281 253435 -64830 -97182 195282 -58041 482
7730 -75256 -55980 -437064 70276 185494 -141603 -116073 -201614 89692 95129 -4628 -134100
7719 -134100 -81171 -171254 27440 306873 -151757 -144470 -246194 32195 26700 -12252 -170917
7708 -170917 23137 -337361 -441393 126567 141209 -19949 5736 -26069 103190 -321506 61299
7696 -380917 221193 -73323 114513 28297 -222006 192468 259348 -47885 -7079 -282610 206254
7684 112071 53619 -504654 -69448 -118062 -405209 -146630 43550 39056 -143564 -314276 10776
7672 -137341 105368 -187087 -72596 120561 195677 -45033 -146998 -53584 24952 32889 -213370
7660 27735 -60984 -127910 -72087 -226180 -194832 141923 -19683 93059 82719 205524 -434139
7648 42874 -93030 -378314 155746 -257259 -282897 316288 -77242 -346056 -99135 17166 171855
7637 171855 -124637 -157886 -96880 -15014 -463125 -194040 231736 -379330 -38074 -61659 -103144
7626 -103144 33419 27706 154394 412828 48307 8628 221058 -130929 -204110 -25364 -153081
7615 -153081 -94170 -297443 79481 11396 -154721 -203251 -349418 -27940 65614 -220027 178414
7603 6491 -158792 113063 -307880 -5933 99495 -112922 128790 -243129 -137789 67337 -66501
7591 -52611 38126 -130185 178977 152755 -243824 58145 59473 -62792 125416 122161 95631
7580 95631 215553 -182633 69529 40527 -70090 -27307 104674 148320 -5969 422355 -358199
7568 78472 25003 167430 -60807 -204926 -130212 -50587 -76878 -64835 130720 -222024 59804
7556 -129589 98025 -160501 97633 -120904 -442865 -50713 199081 168264 201839 -51788 -17115
7544 97827 -354332 61843 74144 165409 -98420 -53626 -95237 26125 14571 -126178 178720
7532 -139401 -108926 195231 -145798 -97452 45553 122262 56383 3528 -314941 86809 93130
7521 93130 -181642 -27831 -23666 -1117 57170 -95795 -203850 -353912 -14582 -298355 104178
7509 -6215 -412629 10972 -93327 -30776 -157716 -287023 -151594 -87882 -54012 -225532 -96895
7497 -176651 -49644 -219117 -195102 -146443 31082 19569 190325 -7960 -34583 228678 98718
7485 25986 254428 36028 277881 -254249 -36780 -101984 56322 102207 -99000 -334505 -168759
7474 -168759 -47159 44924 -339944 95172 49001 -81565 -168945 -41623 -59841 -120127 95587
7462 61354 45373 -71978 228226 -276247 -72845 -207272 140546 -87680 2261 -2955 -93339
7451 -93339 -27916 -247307 44304 139965 11378 156716 -144662 -83852 79083 -101867 253327
7439 139381 175668 231638 -70911 66658 159232 -16308 -269379 110683 204408 -38613 -33910
7428 -33910 -359729 -107770 298351 -43491 33736 -200118 -79782 -276138 -398005 -13658 -124608
7417 -124608 -51318 -136981 -45630 -124650 105651 -337274 286392 -59188 25850 33608 -165550
7405 288028 13650 -229704 -187513 -121342 10045 -551544 -122335 43813 193895 -151451 -249308
7394 -249308 -183756 188297 44634 22992 -61069 43698 -172624 3792 159401 -231022 -233748
7383 -233748 126980 -51530 -174844 -108697 -55328 42904 -50135 -152566 -192278 -271639 -122739
7371 225079 -106491 -294915 6938 -168689 124459 -53140 83985 -420936 -24394 -104609 -131386
7360 -131386 195603 -95532 -228644 -27062 178379 -51381 338147 -74897 -46126 -119431 19439
7348 -288360 -96306 80198 63112 -63977 -144955 91304 -310013 -165901 48154 -33172 -154522
7337 -154522 6580 -169790 -2764 -52752 -65071 144261 -273011 -185961 108523 81373 185000
7326 185000 -351651 14117 61429 -83235 -216685 5368 -45485 4012 302927 4754 -180611
7314 -303978 -291576 -195516 -145651 206612 99099 48965 -37058 70608 -296277 47354 420175
7303 420175 193303 253659 -182767 245520 -23309 -248102 148673 -2014 27598 -55441 74924
7291 -225670 -22348 106277 88614 148234 -283768 -6780 305137 10292 -48301 -135856 -105781
7280 -105781 -14902 -159821 32437 -16272 88769 82010 179671 -98879 -196873 -113927 -76623 -268233
7268 -268233 214968 -81240 -104884 206856 66555 -94972 149101 -93069 -581515 -39601 -118763
7257 -118763 -421312 11563 -49519 -57752 -521842 -185472 -88443 51125 -55272 -22870 -37607
7246 -37607 -231193 218856 -88195 -631425 44811 -143435 -36546 33521 -51148 62623 199530
7235 199530 -5539 172178 41339 7771 197324 225804 -216675 -161103 -28000 -204882 132612
7223 -108664 321041 71725 33718 21880 205500 -187814 -378772 -12258 63797 247432 -29625
7211 -88013 257812 170493 -104224 210669 -233532 67005 255339 -159960 -237456 -56912 -175769
7200 -175769 73079 -243397 -157444 78325 -73193 -24418 -312212 -55740 -83344 -145976 -112135
7189 -112135 -132642 -61149 253427 129507 -197407 176824 81566 -292190 -390456 -24026 136566
7177 110646 122771 41357 6349 -378926 -55020 12441 135944 -85361 -99865 -242063 192824
7165 -197628 96825 88136 71484 -90866 -8553 -236107 37390 -83880 -96953 26506 -250093 -252793
7153 -252793 134377 -186799 -15086 162427 96871 54436 235086 22116 338635 116138
7142 -32376 -133523 -35211 140298 -173102 136264 192643 91215 -182419 -48107 -115403 159483
7130 107394 34743 -18645 33822 13178 -58192 -97267 4649 -91035 190733 180577 -132811
7118 315415 -62293 24811 107868 -42300 -228163 -64613 222437 -60742 40645 -74451 -112020
7107 -112020 167563 -62251 -247524 -522035 -83283 -287049 -59384 -198437 72310 23316 -43775
7095 -85492 342195 -99965 -454727 187070 -114206 -109239 -106387 -241230 50409 -92243 129760
7083 -280793 64453 -300864 91590 -44960 -187231 -6321 -46530 358323 90891 -203928 -13974
7071 245133 -89263 -96918 -79807 -29223 134435 -52315 -203656 -110965 -249248 -152863 9400
7059 -111235 558 -90389 -268467 -21924 221732 13907 37964 -226961 74969 -166987 13577
7047 182536 47014 -254715 -122687 -13164 -62807 -1173 -98838 -251038 -7890 115856 82179
7036 82179 103561 166157 -533129 -41834 71014 -290580 -208881 99744 -519374 136022 55400
7024 240054 -193767 -167289 -77413 -232019 -108140 182742 138515 81189 -167897 -43305 -337770
7013 -337770 -78612 -144012 21361 -42165 331024 -61071 3343 25949 288287 -1180 -295107
7002 -295107 38628 182560 -261118 -472970 -10856 92286 221959 -377942 -15487 -87121 -2021
6990 -175315 100945 290691 141217 230966 -32959 -37876 -100027 49279 142024 -241960 92434
6978 81111 105253 -210911 53370 -167480 312715 344883 -114217 -2674 -50042 55695 62697
6967 62697 -48959 -29122 105438 116869 -128626 21879 -92948 -109002 178947 136115 297990
6956 297990 -260709 -63526 -164611 -347441 -308663 51770 -123267 -23861 -121944 49605 -480334
6944 -86044 16264 -205069 -255482 31562 62475 -94646 127256 227890 -138794 336012 -36864
6932 60182 -102417 -99980 170965 -373388 -159551 62493 -458395 208818 -245135 -2910 58876
6920 17504 -328179 -264917 -141465 246430 -112238 -88551 13464 183035 144383 -315736 -170159
6909 -170159 -52905 -84253 -159641 75276 -337925 19346 46712 179994 -130375 -280578 -105360
6897 -149717 -415071 9803 -9583 12880 -328487 -128087 -178420 -296462 31178 35110 -196548
6885 -223170 91367 142513 124726 108594 61578 -230999 -46303 107582 -173902 140729 171056
6874 171056 -133919 -220015 -144129 70170 -42050 128435 -43022 -26985 321647 -36154 -67285
6863 -67285 263816 -42142 -16242 88966 -281319 -115412 152562 39163 28611 66940 -153651
6851 105927 -34321 65670 -85224 12053 -209449 -238907 -99322 41691 16560 -102745 51155
6839 -118515 -31258 -7948 81758 -169603 -193958 342563 66292 97119 -176467 65409 74847
6828 74847 -211412 65992 7385 77524 409624 84565 338473 56686 -190417 -209702 -10369
6816 31360 133403 92987 -156357 -290462 49232 -141087 -128497 101494 219556 11813 -15011
6804 -168871 -236220 251690 111746 -222029 -77235 -33910 -183963 -84646 25037 22619 -33274
6792 -32184 -417947 -40595 -175705 225939 57721 -189649 74655 96053 -29145 113400 -245713
6780 -242437 -82732 70880 -201696 171974 36123 -173365 -144462 94755 -198325 360937 -210530
6768 180155 -78869 -201586 246193 -122883 119319 225820 95433 39080 236314 -104133
6757 -278845 25151 -125897 44798 -149501 -212473 174945 94762 40640 225922 -318136 -21565
6745 -89128 -139315 -184715 203279 -255273 39929 -184376 -13167 40683 -59461 64851 -180546
6733 -36193 -171439 -97423 50593 189636 103559 -12603 167002 -164075 -95436 385277 -20039
6721 79591 -44043 -14883 -193769 -75920 129351 298593 175597 287506 -359990 -110748
6710 -57182 -74351 211252 244196 11567 -48091 21242 -131004 -165781 13461 91340 -94781
6698 158940 42603 32592 14318 -9232 -337200 96822 -1945 72191 119460 -175662 307606
6686 -28288 -248906 -355810 100623 169710 433547 -46434 -82867 -206858 -76046 -3859 28771
6674 125792 -24288 -36204 -178758 -113786 119728 -4508 241951 -124201 -31059 17519 -24150
6662 -139403 256291 -214608 -28957 -358375 -236681 -11449 170258 287005 -107132 -191330
6652 -191330 101893 53434 -166431 7480 -64800 -49736 172726 -117903 166663 -292915 380292
6640 196119 45915 -122006 50073 -70904 -50335 204683 -167692 281143 100705 -7936 60088
6628 -7685 -77457 290265 -104669 172642 212098 -29325 183647 111681 78700 89946 -295330
6616 222798 -116325 -20990 -266045 -190285 -432649 175230 57185 -280413 178719 -77676
6605 -369077 -287894 -55426 -12995 95364 49658 -227720 -88004 44124 -166081 49166 50007 -68652
6592 156602 -173158 30646 -301120 -192367 -26423 181146 314501 108374 50742 -50969
6581 -57825 -42664 101674 177592 -183099 -19453 -8245 59845 -59412 -35793 -25920 36057 164486
6569 164486 137382 228748 -116000 -87012 -53645 -9561 101646 72883 30500 -118838 84711
6557 -198490 -254534 19040 -254034 15567 -138452 98491 280637 134497 74279 -33833 95555
6545 -265747 140860 284627 202329 -70057 -257569 -55639 163880 -51677 56540 185331 -180921
6533 -316158 -8175 -218121 -280328 -175557 -248092 163315 3704 17648 -26841 146655 -53535
6521 4852 -259336 15911 224067 -86279 27833 -52353 141797 -30153 25457 -218832 59952
6509 264971 60463 4223 194341 92636 83706 -70235 8721 -372997 -94909 283091 -72789 -328410
6497 -328410 191102 -76841 37418 73568 -301898 165290 94383 -95693 -83881 -222516 -35125
6485 -86878 -98797 68748 -328343 92797 222672 143236 -144338 -212362 205455 32767 -396451
6473 -259697 2358 14606 -54843 22971 -5780 216500 -52779 66141 -193328 104155 177165
6462 177165 115385 -120075 116202 399583 -137818 -106139 -57387 59987 10773 -73608 -237131
6451 -237131 270080 135105 125194 -275268 -207389 -102882 -25841 -149787 -396594 427151
6440 62403 25917 -72828 409999 51657 207394 14963 -131969 -44219 -237119 -399519 48376
6428 49056 179091 -414346 53666 -324536 -293599 48044 -305022 229047 143074 -117607 -281332
6417 -281332 281555 68948 -87363 -104468 -210243 -63734 141866 -45736 70885 -18455 -154928
6406 -154928 103580 192381 383863 6769 188840 209129 46228 -7149 -69131 -86771 -108949
6395 -108949 251821 -123566 -79671 -101084 -326716 269395 16326 35990 421170 -65295 -105804
6384 -105804 231248 86413 43716 -175491 -190910 48688 -67791 13103 -52550 -137749 -376693
6373 -376693 212368 70169 183762 -101819 206081 114875 -196999 -107162 25570 99080 -298033
6361 -52388 -123007 148089 -127820 -141729 -78971 -340445 -184831 -130403 -155176 -4978 -188144
6350 -188144 279675 155449 295978 3230 -37078 140508 -182768 -255751 295365 -95363 -96717
6339 -96717 -68289 -49902 -289160 97186 -13167 251015 -111767 70746 -2808 -187568 120336
6327 -257185 -77325 -17636 -281341 246488 18617 -93727 345944 306977 71893 38303 -279581
6315 143320 -281122 16138 105037 170936 -54291 -3926 211627 -2522 78302 1175 -73787 -240215
6303 -240215 164971 -231441 -57987 -11267 118039 -28470 -244441 -240936 -98949 -36245 42016
6291 178882 -19563 60988 -331771 157143 -75951 -345323 153625 -939 30900 -104413 188859
6279 -270488 182757 -124836 -34792 -63482 -351242 -6785 -53144 219868 -308477 -89618 -55634
6268 -55634 -159132 -325312 -138686 -38103 340121 97106 -5543 154429 223513 105701 -151042
6256 -270599 135257 -233854 132762 231199 -108877 -132574 341865 -144112 219395 -154193
6245 -489453 -4445 -40830 34255 230426 23239 99840 126096 57711 108885 153457 -3439 -186676
6233 -186676 -14301 -380445 -33632 34702 -140154 -30111 131361 -349840 153389 -111761
6222 -58528 -48025 -301668 364668 -88563 -86445 370055 -181318 -14150 -294316 205117 -7453
6210 165155 248123 -27828 21700 136622 416026 321794 194024 60656 -286086 47146 92226
6199 92226 -52049 119392 -110975 -94298 -182647 227365 252225 54675 136937 174258 -115068
6187 -108865 -16586 27489 89574 19677 93701 -215566 -178695 169343 117351 -40478 -202151
6176 -202151 173321 -26028 -99026 89905 -28683 32134 -145884 -161185 69930 -198134 -18554
6164 247708 -238292 -24181 -83849 -4224 -230799 -318970 -157189 -295201 -52969 91960 12046
6152 109560 -263774 -8173 -20478 91543 8674 -95046 166581 -97951 79917 220424 -79099
6140 72525 241347 -12621 -248962 205951 -119428 108948 136737 130860 94963 -183147 104144
6128 9373 -62497 405444 35631 -294099 365935 10447 -63477 -126701 -150179 83996 -211671
6116 315009 6209 -27074 95518 -222596 -417322 -204499 -217635 154663 18698 15322 244303
6105 244303 -61745 103157 5526 -182980 58472 -7217 214349 -359428 -148893 57613 212743
6094 212743 -94380 -33605 -95837 -213882 -97650 -86929 -267057 10981 292631 -62343 -24358
6082 -2419 189557 -107800 -78908 199177 108939 -67370 -110669 54039 -131904 -335827 76233
6070 -88398 -27699 -204351 -34409 122849 -60664 89167 -103776 -26910 -21054 123614 -171141
6058 -321382 -395973 -336393 104051 101506 -89590 -123722 -86793 14513 58701 84227 -184541
6046 149178 -6532 -12708 101039 38903 29238 -115381 -98508 205263 36257 -486995 20074
6034 -48112 -90884 23565 -1099 -157274 -226115 -288628 6636 -53971 -227426 -153336 -52566 -123537
6022 -123537 -91379 110885 104050 322417 -94210 -190826 -24410 -41312 -257387 -93474 15771
6010 -397299 176107 -84810 35567 287880 106319 112743 -20136 7383 70085 332310 3171
5998 64664 229568 176954 56788 68933 132046 -215046 221408 -161257 -43425 -105506 17953
5986 44743 -245020 81603 -88385 -194249 396506 225601 -105918 46532 -157773 81786 -276441
5974 -198570 -169566 187239 -128665 -20019 -163153 -90820 -131348 29459 -99158 -306367 205275
5962 -215162 258910 -218421 -51864 210470 378762 172243 10400 114318 -85291 54017
5951 -63884 109443 -260718 -300130 194771 -144371 42830 66146 104940 77954 -148877 12657
5939 170217 67245 -95053 -72481 -117516 144054 3929 -416606 -164009 -126604 -206826 -234 -404065
5927 -404065 41894 -305192 129477 -224916 145529 -114033 156110 -262052 -6337 -139441
5917 -139441 202155 1642 49790 -98413 -85523 114937 -28861 65753 -424870 -1348 -43796
5906 -43796 37822 317501 33664 69489 35753 169484 -140879 67066 -3600 -2814 -151702 53713
5893 100192 45383 54451 381148 -94984 -219185 147521 -147582 208320 -226035 174989
5882 -300643 300769 -140275 -141951 -109499 -74860 -115039 -82585 -309527 -206675 50031 -125501
5870 -72784 389278 -193018 -41768 14796 -5397 79681 138474 -297234 -30476 -41967 135683
5858 -53850 -157186 50384 -43244 96780 -58820 -3721 -49849 309451 -63457 -177268 363021
5846 36460 230676 -170447 57374 -304275 102994 19710 -211152 97778 98160 172093 94478
5835 94478 19724 -138084 176528 197762 -108098 -94915 103532 -172526 100378 156492 99227
5824 99227 -204924 190328 80920 -47805 121969 -36850 -39972 -51215 28579 -74243 248850
5812 -22349 -110541 62783 19318 100957 -65339 -112705 -132768 79622 -158488 22112 96908 -128644
5799 265880 -113634 124842 -137051 -77795 380539 -25585 -45185 534139 -370605 76902
5788 -110278 9606 -86494 205376 35418 33979 106948 -142915 127161 21520 114609 -100986
5776 -14578 25550 -214695 -75661 -64338 33208 125671 -142513 67103 -19086 46940 238603
5765 238603 57206 101165 41300 -808 -75621 -202750 -195895 5154 -128398 113802 -28382 48615
5752 14909 56747 -109903 -16730 -180767 -69144 -305160 -32550 -173626 348755 -45055 101321
5740 401455 -253616 57825 -49591 -36434 -284601 -21605 199706 -6838 184856 -8520 2905
5728 95450 -96090 -105947 -57188 106856 -61652 136745 -119840 162703 3944 135453 -346402
5716 -87599 -89455 -48947 -227369 123283 102278 -168369 270961 -127545 -113077 354199 153290
5704 96442 108654 -89322 8673 -146385 18219 -262211 442906 -7087 208307 136469 -194998
5692 168371 290292 60561 122855 -119202 -48548 100550 36789 82775 337321 -152741 44430
5680 -150523 -55778 -232421 -4429 -147644 -301159 -73397 138375 200701 142606 27460 -310909
5668 -100418 124614 -366283 100204 -169589 263237 199941 91045 155348 113685 -248480
5657 -245128 -221261 224207 -124242 35130 72791 186348 201299 141997 183035 -596086 2065
5645 -188542 -173110 -171159 319207 -120456 330475 142509 -446497 -80072 -260373 50037 -302338
5633 -379809 27970 -79831 191351 32890 232928 -121744 -48292 19566 -218511 123284 -255527
5621 256294 235575 -63232 -68890 78340 270001 -170566 256606 -33956 2114 -70852 12729
5609 124834 -144427 61676 210525 -244114 22557 -315580 -153441 37920 76226 -165954
5598 121417 295441 -80399 -79580 58487 243 132014 -395686 103200 15085 -27894 -117082 284578
5585 -73474 39610 22678 -48659 -126755 -5767 -181186 -78283 60144 364277 -5782 -12538 -154084
5573 -154084 -261360 136099 -386676 -66802 231296 -207460 -210381 -258776 227489 -20942 -104591
5562 -104591 289369 150684 -210462 -273415 -2 235989 123070 196654 -97458 -204746 49405
5550 -29121 78960 -52882 -137400 76694 60459 -138873 18625 -104103 -217447 -82943 248752
5538 -248704 -87349 -168292 49728 221461 212407 -8123 -192102 1844 322140 146572 61309
5526 272094 -79711 -96385 -153375 101730 -81547 227516 280636 -32804 -191221 -99490 -35131
5514 367740 -229374 3078 54048 15670 257871 1894 259013 66707 -185079 355209 -141344
5502 260062 -197822 -136192 191491 -173705 208015 -141789 -139267 -28935 57112 136670 -16132
5490 56978 -270377 -258221 89969 -168982 90673 73416 41274 70430 -42899 -2488 -102633
5479 -102633 -262174 106811 71659 334940 270545 155212 201563 257288 13773 -176642 -126109
5468 -126109 97415 204949 152299 54104 -282580 -31348 77986 -177979 -120565 -328283 15258
5456 216543 212992 166805 18370 965 427682 -59671 -20105 9944 28167 50063 216217 -320972
5443 22117 199076 -28193 250894 -145923 -106474 -172767 -98487 178533 -67849 285117 -213254
5431 -6036 88456 -23757 -155849 -50450 -458196 17218 -154833 -212229 -4030 -236090 -214574
5420 -214574 12896 -20212 1125 -206648 92714 -77425 -189197 -100159 -42253 -521491 -13744
5408 178410 51750 46636 117928 112106 461282 -43441 232370 337188 -115234 196831 -172323
5396 -140259 -138672 78152 -120155 17435 -29031 187389 -7805 85634 -506185 -56774 -239849
5385 -239849 -164000 -50918 470757 178984 131415 -28022 -2849 -189034 -214933 -232495 -116996
5374 -116996 280797 298714 -91834 271530 -207143 -160475 -258556 102754 141117 -172732 12806
5362 43584 27156 -10459 -358823 -6262 -33690 -105397 -118085 94785 60635 -126848 -6860 130985
5349 154986 50755 -181422 28429 -329206 -1060 -136428 7377 222371 -347138 68262 -32459
5337 -41294 16488 229568 -219912 164688 -130008 -156030 -173175 -213294 99575 -132305 -94733
5326 -94733 -250290 -22630 121442 223645 77143 -3299 -143960 -435399 -265032 277587 -185428
5314 74969 439702 36823 -159596 -132758 20846 180425 60296 84358 -107499 223093 190532
5303 190532 202026 -141579 361965 -149535 -107218 59969 -168121 130566 -249093 116394
5292 294725 162600 156800 -269481 -56781 -106116 183493 39126 51464 -126625 147698 -225008
5280 26928 -33266 157420 -139255 394642 -138683 -145275 -166805 302931 300667 -130885 165123
5268 92040 130013 -109627 -159370 62038 -401892 19205 333959 61903 -280849 149747 -185416
5256 246108 -9962 -184215 39962 126279 9628 -353941 -170084 131359 115141 -18473 117015
5244 -50822 -56082 89218 11411 92175 142028 81669 24173 -143393 -204497 65570 -208599 -89568
5231 88725 -197012 352226 -59278 327194 -72336 176865 104560 -69324 128099 44315 -86447
5219 52178 66257 115309 377631 -162986 -90305 -100830 20373 -83188 -191814 -75349 81964
5207 93509 154548 -63085 -204550 16963 57473 63373 -245529 277528 -168634 -64705 182997
5195 84069 -89912 -84400 139031 -132172 250176 359127 -48822 135261 83547 -365085 -122927
5183 168111 95592 36044 184945 -153852 42065 -5713 -348603 8738 -216851 -227126 112206
5171 -271088 117689 -282594 17322 -190131 -52475 -88787 75776 208042 -160775 -27141 71107
5159 170122 -175470 63394 -87188 200974 18593 -7976 -42535 -136796 63131 -195613 172390
5147 146328 375951 370400 31073 210943 253955 56836 -63547 288006 5051 -198851 -31583
5135 378596 187642 -257845 -170485 51267 9855 -2707 -202822 -153124 124047 -311968 -326302
5124 -326302 55860 2905 120966 -46473 66617 84636 -333365 215285 -129854 25715 144885
5113 144885 1655 25322 -296429 -307551 -95227 -86022 40729 20728 -137229 108785 334871
5102 334871 108444 -405623 160025 -79712 22791 221048 49221 -47456 252030 61600 -282136
5090 -211037 253370 30206 -103331 -30607 59156 -213552 152778 103239 78467 86814 -82524
5078 -150006 -1837 212241 88083 -19658 223960 -365801 -228222 -126193 314942 -232819
5067 188029 66241 -57407 -127973 281728 67942 353793 321262 34329 -144687 136659 -111929
5055 211895 23224 -320219 63973 181811 22221 -154 533723 350541 157182 -289427 -285431
5044 -285431 -76182 43793 -252976 275854 -102857 -75823 61902 -393116 115470 359264
5034 359264 -231677 -183029 -197593 -107920 -20207 -244517 288763 -338 129649 -223580 -435417
5023 -435417 335847 -22160 222976 47566 -278058 291430 -198118 -117866 -303966 52664
5012 163241 -72428 41606 -51636 18769 197923 -327050 -41180 31495 -25916 -172902 -141826
5001 -141826 -225816 -297520 -121355 104019 -150192 74330 -1676 -316508 25389 -177382 -76712
4989 -86800 -167421 -195636 -14700 -441673 67748 -100807 62902 187173 126974 139281 149885
4978 149885 284476 -2557 -237577 -180520 -249714 106072 1628 72836 -45572 -204964 -51179
4966 -17574 -142750 242655 -11137 -376002 79196 115835 280428 -330429 -2927 -203280 189687
4954 -3275 -75246 -188531 143258 192251 -26185 204421 39972 -221406 -12202 -103708 295750
4942 -61738 115582 -30138 -5122 -43178 249829 184179 -154665 -15874 129252 -214208 2352
4930 -177229 85658 -96772 -54864 20104 110288 195358 152382 -381997 -119246 159096 -171052
4918 -110031 245110 160901 61093 -71511 -12278 93214 -17159 -5996 -41491 233067 31722
4906 82632 -167369 150648 27652 -234243 -49641 -147306 133161 165938 219032 189654 199916
4895 199916 -105863 23328 274967 113122 434 -26536 -99195 141258 -198410 -188043 247893
4883 56508 28557 48681 -12184 230988 -168731 -275212 34276 41235 -22039 -253283 156923
4871 -123859 164005 128142 -75791 -126485 -83344 174400 -104221 18441 92206 49677 120592
4860 120592 475630 64420 153127 -83446 -258752 244552 22294 15636 -121582 -124200 -194428
4849 -194428 13796 8942 -17910 209018 -179369 -61432 -92880 -69803 54621 -343525 60592
4837 111578 -34643 232280 -39654 -206751 -112130 198291 -104448 171230 -17409 48653 217930
4826 217930 55585 15005 182844 210588 63414 79112 -319956 -166556 -76378 -88661 189808
4814 95391 287883 82680 15394 -183301 -162772 -85779 21561 -383737 82302 -371604 -86286
4802 -155815 -54699 -220650 72726 -194657 -173534 -179884 -198211 -193301 11654 461707 6701 -200056
4789 64679 102314 -271537 -170745 -66414 -199727 -82010 1448 54204 12716 -37048 -3874 -217193
4777 -217193 -103017 -231188 -80910 116526 66161 134936 186954 56739 362486 -88351 -36054
4765 225122 -112907 125035 -329124 -223244 -19784 -132704 -89782 100664 156571 68932
4754 -125073 -63373 172975 118793 48034 -260868 36817 11560 -217277 -80752 -158526 -171469
4743 -171469 -78248 -114900 18567 70210 -24726 165447 253418 36081 8550 -9071 231910 -38417
4730 5322 -155453 41737 65170 206086 -581485 -20618 67435 240484 191984 -126800 -190239
4719 -190239 -135570 53930 239929 -16042 -152992 -123181 96398 -114162 31431 -265569 -224920
4708 -224920 398237 110281 4367 102820 5379 -222589 389368 -79092 -219790 148248 265528
4697 265528 -3881 7692 6241 67253 -203792 100373 187557 -43470 -188347 287620 16597
4685 -105334 219470 136444 -45188 43458 -57986 -15641 12809 -72282 -241119 355128 106698
4673 -361919 48729 -362421 -194098 187902 49966 101569 -60753 111110 -244454 31919 -7556
4661 28934 202360 252 43621 -164223 34541 -188076 239798 129234 -2772 -21017 221826
4649 1472 -92622 194730 159252 -162178 98132 -277332 146895 -78093 239248 27804 -191131
4637 68128 82212 167644 -180556 404995 114029 110337 111237 -281268 -168229 205403 -23324
4625 -82291 -58115 122337 -215619 -35473 -14862 -226544 -51392 5517 114990 -59711 111877
4613 -50789 -335506 -526285 -131489 166786 320928 -127959 10676 358837 48130 -2889 -54169
4602 -54169 -86118 145456 193058 -216037 -194015 151811 139901 44929 203763 36536 158763
4591 158763 437265 72032 15316 -227030 -280565 250898 142033 -247025 117952 15275
4580 169114 101194 337584 -109874 88605 88055 175445 259340 117567 52794 23068 -61177
4568 28239 215797 172441 53524 -31440 286167 -79079 275468 -89363 -128043 -215295 -114716
4557 -114716 217881 -301196 -68150 163279 -176346 48918 57364 60862 -69466 -261295 -154649
4546 -154649 2038 180570 -201436 -44472 -23540 -230024 78041 43180 26298 74565 -16798
4534 148830 -81843 -50959 3647 -49891 164461 -155864 33899 -251020 135710 -151830 -319234
4523 -319234 61690 88441 263079 -163186 183503 -291954 313171 -6501 -149662 -212237 69292
4511 -143031 260645 104023 272762 -5549 -60357 -53055 -98051 -381066 -56376 -314730 -76271
4499 -7829 -92606 200855 212623 -144812 -150950 82074 -107738 -78435 256414 -107192 98316
4487 -56840 -154344 -34806 45044 -228243 -423833 34971 -134537 224236 -123755 119609 29459
4475 41240 72554 110830 128480 166989 -145322 28320 177782 69087 -77364 -99021 -31201
$$ [...]
##END NTUPLES=NMR SPECTRUM
##END=
