##TITLE=AC1388_PERAH12200_7519727_yzSkyq3V2s
##JCAMPDX= 6.0         $$ Bruker NMR JCAMP-DX V2.0
##DATA TYPE= NMR SPECTRUM
##DATA CLASS= NTUPLES
##ORIGIN= BRUKER
##OWNER= Administrator
$$ 1.72 TOPSPIN		Version 2.1
$$ 2015-07-09 21:48:35.847 -0700  Administrator@X
$$ Compression mode = diff/dup
##.OBSERVE FREQUENCY= 400.02188249412
##.OBSERVE NUCLEUS= ^1H
##.ACQUISITION MODE= SIMULTANEOUS (DQD)
##.ACQUISITION SCHEME= undefined
##.AVERAGES= 64
##.DIGITISER RES= 22
##SPECTROMETER/DATA SYSTEM= spect
##.PULSE SEQUENCE= noesygpps1d.comp
##.SOLVENT NAME= COFFEE_meoh
##.SHIFT REFERENCE= INTERNAL, COFFEE_meoh, 1, 14.961
##AUDIT TRAIL= $$ (NUMBER, WHEN, WHO, WHERE, PROCESS, VERSION, WHAT)
$$ ##TITLE= Audit trail, TOPSPIN		Version 2.1
$$ ##JCAMPDX= 5.01
$$ ##ORIGIN= Bruker BioSpin GmbH
$$ ##OWNER= Administrator
$$ $$ E:\/data/COFFEE/nmr/AC1388_PERAH12200_7519727_yzSkyq3V2s/12/pdata/1/auditp.txt
$$ ##AUDIT TRAIL=  $$ (NUMBER, WHEN, WHO, WHERE, PROCESS, VERSION, WHAT)
(   1,<2015-07-09 21:48:30.175 -0700>,<Administrator>,<X>,<go>,<TOPSPIN 2.1>,
      <created by zg
	started at 2015-07-09 21:37:00.253 -0700,
	POWCHK enabled, PULCHK disabled,
       configuration hash MD5:
       21 0F 79 D6 B3 7B B4 F6 88 20 88 DB 03 48 BD 9F
       data hash MD5: 64K
       D1 72 AC 8D 9C BB 44 E1 7D 16 58 DF 9F E8 2D CB>)
(   2,<2015-07-09 21:48:33.691 -0700>,<Administrator>,<X>,<proc1d>,<TOPSPIN 2.1>,
      <Start of raw data processing
       efp LB = 0.3 FT_mod = 6 PKNL = 1 PHC0 = 0 PHC1 = 0 SI = 128K 
       data hash MD5: 128K
       93 32 44 2D C3 B6 FA 72 D0 51 F5 48 51 EA DA D6>)
(   3,<2015-07-09 21:48:34.613 -0700>,<Administrator>,<X>,<proc1d>,<TOPSPIN 2.1>,
      <pk PHC0 = -87.85767 PHC1 = 0 
       data hash MD5: 128K
       07 32 C4 A4 49 64 17 1D C6 7F 77 76 14 A4 88 5E>)
(   4,<2015-07-09 21:48:35.003 -0700>,<Administrator>,<X>,<proc1d>,<TOPSPIN 2.1>,
      <abs ABSG = 1 
       data hash MD5: 128K
       DE 34 A8 77 A8 E7 70 E7 D0 5A 6D C5 B8 B4 2F F5>)
(   5,<2015-07-09 21:48:35.113 -0700>,<Administrator>,<X>,<proc1d>,<TOPSPIN 2.1>,
      <abs ABSG = 2 
       data hash MD5: 128K
       C7 06 F4 8E 5C 52 6C 30 27 28 11 B1 AE 9B 46 39>)
(   6,<2015-07-09 21:48:35.206 -0700>,<Administrator>,<X>,<proc1d>,<TOPSPIN 2.1>,
      <abs ABSG = 3 
       data hash MD5: 128K
       B1 BF 9E 38 62 1F AB A6 E1 51 37 BF 17 27 28 D3>)
(   7,<2015-07-09 21:48:35.300 -0700>,<Administrator>,<X>,<proc1d>,<TOPSPIN 2.1>,
      <abs ABSG = 4 
       data hash MD5: 128K
       67 7A FE 17 CB 05 87 F0 46 14 2C 1A B6 6E 4A 40>)
(   8,<2015-07-09 21:48:35.425 -0700>,<Administrator>,<X>,<proc1d>,<TOPSPIN 2.1>,
      <abs ABSG = 5 
       data hash MD5: 128K
       FC DD 93 4A A6 51 A2 C8 3A D7 70 4E 9F C0 47 38>)
$$ ##END=
$$ 
$$ $$ hash MD5
$$ $$ B3 DB 4E 42 D7 61 71 34 B7 10 C4 04 0C 47 A2 A9
##$RELAX= 
##$RELAX= 
##$RELAX= 
##$RELAX= 
##$RELAX= 
##$RELAX= 
##$RELAX= 
##$RELAX= 
$$ Bruker specific parameters
$$ --------------------------
##$DU= <E:\>
##$EXPNO= 12
$$ [...]
150 150 150 150 150 150 150 150
##$TP07= 0
##$TPNAME0= <>
##$TPNAME1= <>
##$TPNAME2= <>
##$TPNAME3= <>
##$TPNAME4= <>
##$TPNAME5= <>
##$TPNAME6= <>
##$TPNAME7= <>
##$TPOAL= (0..7)
0.5 0.5 0.5 0.5 0.5 0.5 0.5 0.5
##$TPOFFS= (0..7)
0 0 0 0 0 0 0 0
##$TUNHIN= 0
##$TUNHOUT= 0
##$TUNXOUT= 0
##$USERA1= <user>
##$USERA2= <user>
##$USERA3= <user>
##$USERA4= <user>
##$USERA5= <user>
##$V9= 5
##$VALIST= <valist>
##$VCLIST= <CCCCCCCCCCCCCCC>
##$VD= 0
##$VDLIST= <DDDDDDDDDDDDDDD>
##$VPLIST= <PPPPPPPPPPPPPPP>
##$VTLIST= <TTTTTTTTTTTTTTT>
##$WBST= 2048
##$WBSW= 25
##$XGAIN= (0..3)
0 0 0 0
##$XL= 0
##$YL= 0
##$YMAX_a= 6895834
##$YMIN_a= -12525871
##$ZGOPTNS= <>
##$ZL1= 120
##$ZL2= 120
##$ZL3= 120
##$ZL4= 120
##$ABSF1= 14.961
##$ABSF2= -5.597181
##$ABSG= 5
##$ABSL= 3
##$ALPHA= 0
##$AQORDER= 0
##$ASSFAC= 0
##$ASSFACI= 0
##$ASSFACX= 0
##$ASSWID= 0
##$AUNMP= <proc_prof1d_extract.lims>
##$AXLEFT= 0
##$AXNAME= <>
##$AXNUC= <1H>
##$AXRIGHT= 0
##$AXTYPE= 0
##$AXUNIT= <>
##$AZFE= 0.1
##$AZFW= 0.1
##$BCFW= 0
##$BC_mod= 0
##$BYTORDP= 0
##$COROFFS= 0
##$CY= 15
##$DATMOD= 1
##$DC= 0
##$DFILT= <>
##$DTYPP= 0
##$F1P= 0
##$F2P= 0
##$FCOR= 0.5
##$FTSIZE= 131072
##$FT_mod= 6
##$GAMMA= 0
##$GB= 0
##$INTBC= 1
##$INTSCL= 1
##$ISEN= 128
##$LB= 0.3
##$LEV0= 0
##$LPBIN= 0
##$MAXI= 10000
##$MC2= 0
##$MEAN= 0
##$ME_mod= 0
##$MI= 0
##$NCOEF= 0
##$NC_proc= -2
##$NLEV= 6
##$NOISF1= 0
##$NOISF2= 0
##$NSP= 0
##$NTH_PI= 0
##$NZP= 0
##$OFFSET= 14.961
##$PC= 1
##$PHC0= -87.85767
##$PHC1= 0
##$PH_mod= 1
##$PKNL= yes
##$PPARMOD= 0
##$PPDIAG= 0
##$PPIPTYP= 0
##$PPMPNUM= 2147483647
##$PPRESOL= 1
##$PSCAL= 4
##$PSIGN= 0
##$PYNMP= <proc.py>
##$REVERSE= no
##$SF= 400.020009635754
##$SI= 131072
##$SIGF1= 0
##$SIGF2= 0
##$SINO= 400
##$SIOLD= 131072
##$SPECTYP= <>
##$SREGLST= <1H.CDCl3>
##$SSB= 0
##$STSI= 131072
##$STSR= 0
##$SW_p= 8223.68421052631
##$SYMM= 0
##$S_DEV= 0
##$TDeff= 65536
##$TDoff= 0
##$TI= <>
##$TILT= no
##$TM1= 0
##$TM2= 0
##$TOPLEV= 0
##$USERP1= <user>
##$USERP2= <user>
##$USERP3= <user>
##$USERP4= <user>
##$USERP5= <user>
##$WDW= 1
##$XDIM= 131072
##$YMAX_p= 434212179
##$YMIN_p= -11523
##$CURPLOT= <Network HP LaserJet P1505>
##$CURPRIN= <$Network HP LaserJet P1505>
##$DFORMAT= <normdp>
##$LAYOUT= <+/1D_H.xwp>
##$LFORMAT= <normlp>
##$PFORMAT= <normpl>
##$SURQMSG= 1
$$ End of Bruker specific parameters
$$ ---------------------------------
##NTUPLES= NMR SPECTRUM
##VAR_NAME=  FREQUENCY,     SPECTRUM/REAL,   SPECTRUM/IMAG
##SYMBOL=    X,             R,               I
##VAR_TYPE=  INDEPENDENT,   DEPENDENT,       DEPENDENT
##VAR_FORM=  AFFN,          ASDF,            ASDF
##VAR_DIM=   131072,        131072,          131072
##UNITS=     HZ,            ARBITRARY UNITS, ARBITRARY UNITS
##FACTOR=    0.0627417313425164, 1,          1
##FIRST=     8223.62146879497, 133,          -62826
##LAST=      0,             1931,            -63249
##MIN=       0,             -11523,          0
##MAX=       8223.62146879497, 434212179,    0
$$ Real data points
##PAGE= N=1
##DATA TABLE= (X++(R..R)), XYDATA
$$ [...]
$$ plain form
63889 612512 607065 602673 599326 597290 596906 598619 602811 609462 618317 629489 643572 661070 681900
63876 681900 705481 731128 758384 787150 817481 849242 882274 917000 954394 994963 1038080
63865 1038080 1082757 1128655 1175854 1223950 1271967 1318971 1364196 1406784 1445953 1481321 1512525
63854 1512525 1538657 1558531 1571370 1576853 1574821 1565461 1549451 1527269 1498618 1463253 1422074 1376622
63842 1376622 1327706 1275413 1220363 1163963 1107359 1051004 995413 941421 889495 839557 791821
63831 791821 747073 705834 667878 632874 600834 571612 544665 519717 497100 476967 458653
63820 458653 441287 424743 409568 396260 384873 375032 366022 357140 348277 340032 333061 327459 322805
63807 322805 318534 314180 309542 304742 299937 295011 289872 284941 280845 277564 274320 270488 266216 262075
$$ packed form
63889F12512n447m392l347k036l84J713M192O651Q855J1172J4083J7498K0830
63876F81900K3581K5647K7256K8766L0331L1761L3032L4726L7394M0569M3117
63865A038080M4677M5898M7199M8096M8017M7004M5225M2588L9169L5368L1204
63854A512525K6132J9874J2839N483k032r360j6010k2182k8651l5365m1179m5452
63842A376622m8916n2293n5050n6400n6604n6355n5591n3992n1926m9938m7736
63831G91821m4748m1239l7956l5004l2040k9222k6947k4948k2617k0133j8314
63820D58653j7366j6544j5175j3308j1387r841r010q882q863q245o971n602m654
63807C22805m271m354m638m800m805m926n139m931m096l281l244l832m272m141
$$ plain form
63793 262075 258440 255388 252868 250850 249414 248672 248374 247791 246390 244448 242634 241215 240178 239801 240310
63778 240310 241106 241188 240393 239471 238883 238318 237545 236854 236343 235602 234448 233331 232630 232155 231735 231655 232077 232569 232669
63759 232669 232474 232304 232183 231980 231646 231082 230229 229468 229382 229925 230448 230767 231456 232775 234120 234978 235637 236446
63741 236446 237249 238242 240482 244513 249070 252330 254188 256218 259510 263597 267579 271349 275343 279814 284768
63726 284768 290221 296115 302195 308233 314278 320592 327351 334393 341221 347319 352457 356535 359164 359743
63712 359743 358067 354476 349326 342727 335132 327719 321685 317309 313968 310916 307846 304974 302816 301730
63698 301730 301495 301586 301929 303017 305147 308025 311290 314845 318383 321245 323253 325120 327436 329715 331105
63683 331105 331651 332104 332751 333200 333188 332905 332532 332147 332213 333590 336768 341336 346317 350936 355125 359454 364400
$$ packed form
63793B62075l635l052k520k018j436p42k98n83j401j942j814j419j037l77N09
63778B40310P96Q2p95r22n88n65p73o91n11p41j154j117p01m75m20q0M22M92J00
63759B32669j95j70j21k03l34n64q53p61q6N43N23L19O89J319J345Q58O59Q09
63741B36446Q03R93K240M031M557L260J858K030L292M087L982L770L994M471M954
63726B84768N453N894O080O038O045O314O759P042O828O098N138M078K629N79
63712C59743j676l591n150o599p595p413o034m376l341l052l070k872k158j086
63698C01730k35R1L43J088K130K878L265L555L538K862K008J867K316K279J390
63683C31105N46M53O47M49j2k83l73l85O6J377L178M568M981M619M189M329M946
$$ plain form
63666 364400 369546 373824 376668 378486 379563 379169 376460 371920 366949 362112 356686 350095 342953 336244
63652 336244 330088 323863 317306 311034 305984 302562 300351 298597 296956 295719 295292 295619 296273 296950 297665
63637 297665 298642 300280 303100 307369 312654 317994 322610 326489 330358 335104 341081 347859 354829 362055
63623 362055 370287 380061 391196 403350 416623 431257 447072 463650 480910 499167 518773 539989
63611 539989 562985 587665 613649 640592 668148 695298 720107 740653 755991 765906 770262 769365
63599 769365 764781 758890 753387 748608 744296 740445 737160 734049 730024 723612 713584 699627 682474
63586 682474 663242 642685 621172 599154 577353 556647 538018 522288 509518 498812 489196 480586
63574 480586 473616 468792 466230 465932 467713 470976 475166 480418 487127 494885 502497 509271 515807 523221
$$ packed form
63666C64400N146M278K844J818J077l94k709m540m971m837n426o591p142o709
63652C36244o156o225o557o272n050l422k211j754j641j237m27L27O54O77P15
63637B97665R77J638K820M269N285N340M616L879L869M746N977O778O970P226
63623C62055Q232R774J1135J2154J3273J4634J5815J6578J7260J8257J9606K1216
63611E39989K2996K4680K5984K6943K7556K7150K4809K0546J5338R915M356q97
63599G69365m584n891n503m779m312l851l285l111m025o412j0028j3957j7153
63586F82474j9232k0557k1513k2018k1801k0706j8629j5730j2770j0706r616q610
63574D80586o970m824k562k98J781L263M190N252O709P758P612O774O536P414
$$ plain form
63560 523221 531975 541669 551729 562110 573465 586696 602223 619860 639622 662379 689276 720704
63548 720704 756294 795476 836889 876978 910249 932009 940983 939204 929917 916075 900317 885183
63536 885183 872657 863590 857871 855151 855186 857383 860192 861406 859242 852947 842244 826603 805591 779829
63522 779829 751021 720846 690095 659095 628595 599844 573737 550125 528187 507493 488523
63511 488523 471967 457685 444772 432676 421789 412741 405482 399377 393822 388413 382890 377431 372773
63498 372773 369495 367304 365437 363610 362108 361147 360776 361273 362934 365392 367790 369823 372053 374973 378306
63483 378306 381608 385116 389548 395292 402150 409718 417635 425448 432509 438168 442081 444325 445185 444728 442599
63468 442599 438328 431866 423809 415163 406877 399434 392763 386620 381059 376375 372591 369357 366494 364348
$$ packed form
63560E23221Q754R694J0060J0381J1355J3231J5527J7637J9762K2757K6897L1428
63548G20704L5590L9182M1413M0089L3271K1760Q974j779r287j3842j5758j5134
63536H85183j2526r067n719k720L5K197K809J214k164o295j0703j5641k1012k5762
63522G79829k8808l0175l0751l1000l0500k8751k6107k3612k1938k0694j8970
63511D88523j6556j4282j2913j2096j0887r048p259o105n555n409n523n459m658
63498C72773l278k191j867j827j502r61l71M97J661K458K398K033K230K920L333
63483C78306L302L508M432N744O858P568P917P813P061N659L913K244Q60m57k129
63468D42599m271o462q057q646q286p443o671o143n561m684l784l234k863k146
$$ plain form
63454 364348 363366 363642 365028 367398 370558 374271 378668 384269 391282 399335 408254 418669 431304 446144
63440 446144 462951 482245 505079 532085 563268 598047 634320 667735 693377 708849 715245 715138
63428 715138 710610 703434 695935 690611 689162 692360 700497 713487 730808 751809 776060 803263 832962
63415 832962 864244 895268 923104 944712 958552 965065 965609 961471 954025 945061 936226 928273 921180
63402 921180 914725 908501 901512 892128 878602 859738 835389 806520 774723 741650 708909 678058
63390 678058 650024 624516 600654 578339 558490 541765 527663 515271 504382 495394 488454 483231
63378 483231 479444 477204 476842 478602 482390 487704 493936 500867 508726 517747 527912 539232 551988 566612
63364 566612 583499 602972 625108 649518 675622 703131 731967 761767 791930 822137 852155
$$ packed form
63454C64348r82K76J386K370L160L713M397N601P013Q053Q919J0415J2635J4840
63440D46144J6807J9294K2834K7006L1183L4779L6273L3415K5642J5472O396j07
63428G15138m528p176p499n324j449L198Q137J2990J7321K1001K4251K7203K9699
63415H32962L1282L1024K7836K1608J3840O513N44m138p446q964q835p953p093
63402I21180o455o224o989r384j3526j8864k4349k8869l1797l3073l2741l0851
63390F78058k8034k5508k3862k2315j9849j6725j4102j2392j0889q988o940n223
63378D83231l787k240l62J760L788N314O232O931P859R021J0165J1320J2756J4624
63364E66612J6887J9473K2136K4410K6104K7509K8836K9800L0163L0207L0018
$$ plain form
63353 852155 880859 906023 925528 938523 945255 946321 942573 935383 926460 917393 909471 903448 899004
63340 899004 894585 888252 878708 865482 848452 827638 803361 776372 747843 719360 692566 668518
63328 668518 647396 629002 613333 600678 591538 586669 586619 590486 595122 596181 590391 577013 557501
63315 557501 534262 509807 486455 465998 449128 435178 422817 411284 400928 392443 385854 380488
63303 380488 375701 371225 366946 362870 359335 356716 354761 352695 350219 348029 347056 347396 348169 348227 346907
63288 346907 344364 341365 338618 336228 333925 331726 330001 328912 328225 327742 327544 327675 327978 328342 328774 329137
63272 329137 329188 328969 328746 328511 327982 327224 326789 327055 327895 329132 330803 332736 334399 335561 336674 338257 340260
63255 340260 342360 344567 347226 350662 355031 360193 365616 370784 375844 381400 387538 393663 399554 405917
$$ packed form
63353H52155K8704K5164J9505J2995O732J066l748p190q923r067p922o023m444
63340H99004m419o333r544j3226j7030k0814k4277k6989k8529k8483k6794k4048
63328F68518k1122j8394j5669j2655r140m869n0L867M636J059n790j3378j9512
63315E57501k3239k4455k3352k0457j6870j3950j2361j1533j0356q485o589n366
63303C80488m787m476m279m076l535k619j955k066k476k190r73L40P73N8j320
63288C46907k543k999k747k390k303k199j725j089o87m83j98J31L03L64M32L63
63272C29137N1k19k23k35n29p58m35K66Q40J237J671J933J663J162J113J583K003
63255C40260K100K207K659L436M369N162N423N168N060N556O138O125N891O363
$$ plain form
63241 405917 413497 422241 431884 442741 455236 469031 483382 498162 513932 531143 549754 569534
63229 569534 590166 611108 631836 652294 672842 693752 714934 736044 756677 776694 796561
63218 796561 817145 838935 861597 884397 906662 927638 946349 962020 974357 983045 987277 986181
63206 986181 979504 967599 951022 930466 906821 880945 853559 825536 797952 771622 746996 724702
63194 724702 705631 690167 677957 668957 664045 663910 667893 674763 684199 696581 711628 728298 746073
63181 746073 765433 786877 810220 835002 860889 887331 913440 938576 962771 986420 1009861
63170 1009861 1033358 1057031 1080517 1102847 1122783 1139108 1150719 1156781 1156999 1151481 1140236 1122953
63158 1122953 1099379 1069817 1035217 996922 956399 915102 874367 835130 797620 761611 727250
$$ packed form
63241D05917P580Q744R643J0857J2495J3795J4351J4780J5770J7211J8611J9780
63229E69534K0632K0942K0728K0458K0548K0910K1182K1110K0633K0017J9867
63218G96561K0584K1790K2662K2800K2265K0976J8711J5671J2337Q688M232j096
63206I86181o677j1905j6577k0556k3645k5876k7386k8023k7584k6330k4626k2294
63194G24702j9071j5464j2210r000m912j35L983O870R436J2382J5047J6670J7775
63181G46073J9360K1444K3343K4782K5887K6442K6109K5136K4195K3649K3441
63170A009861K3497K3673K3486K2330J9936J6325J1611O062K18n518j1245j7283
63158A122953k3574k9562l4600l8295m0523m1297m0735l9237l7510l6009l4361
$$ plain form
63147 727250 695447 667012 641637 618409 597232 578946 563880 551182 539906 529935 521332 513630
63135 513630 506490 500371 495765 492304 489363 486988 485395 484073 482355 480513 479269 478550 477738 476951 476952 477846
63119 477846 478944 480003 481571 483892 486421 488678 490775 492784 494384 495516 496650 498006 499060 499225
63105 499225 498589 497740 497297 497718 498953 500081 499917 498345 496587 495874 496354 497525 499098 500935 502672 504014
63089 504014 505147 506418 507787 508986 510075 511473 513451 515855 518324 520727 523411 526989 531712 537127
63075 537127 542571 547938 553656 559997 566840 574140 582109 590805 599912 609199 618921 629597 641565 654903
63061 654903 669602 685747 703686 723935 746704 771594 798132 826519 857462 891278 927603
63050 927603 966024 1006540 1049264 1094059 1140636 1188664 1237632 1286842 1335693 1383883 1431366
$$ packed form
63147G27250l1803k8435k5375k3228k1177j8286j5066j2698j1276r971q603p702
63135E13630p140o119m606l461k941k375j593j322j718j842j244p19q12p87JQ94
63119D77846J098J059J568K321K529K257K097K009J600J132J134J356J054J65
63105D99225o36q49m43M21J235J128j64j572j758p13M80J171J573J837J737J342
63089E04014J133J271J369J199J089J398J978K404K469K403K684L578M723N415
63075E37127N444N367N718O341O843P300P969Q696R107R287R722J0676J1968J3338
63061F54903J4699J6145J7939K0249K2769K4890K6538K8387L0943L3816L6325
63050I27603L8421M0516M2724M4795M6577M8028M8968M9210M8851M8190M7483
$$ plain form
63039 1431366 1478352 1525217 1572104 1618745 1664989 1711290 1758095 1804838 1850093 1892653 1931787
63028 1931787 1966372 1994537 2014411 2024690 2024221 2011823 1987097 1951113 1905869 1853303 1795069 1732873
63016 1732873 1668583 1604169 1541748 1483382 1430493 1383619 1342981 1309116 1282715 1264099 1253118
63005 1253118 1249475 1252847 1262741 1278510 1299596 1325732 1356849 1392677 1432407 1474838 1518988 1564432
62993 1564432 1610969 1658203 1705694 1753274 1800854 1848022 1894139 1938646 1980900 2019860 2054317
62982 2054317 2083288 2105734 2120036 2124239 2116791 2096800 2063915 2018648 1962628 1897904 1826074 1748610
62970 1748610 1667730 1586003 1505111 1425856 1349390 1277390 1210761 1149062 1091671 1038740 990602
62959 990602 946969 907281 871260 838668 809044 782115 757909 736033 715418 695350 676183
$$ packed form
63039A431366M6986M6865M6887M6641M6244M6301M6805M6743M5255M2560L9134
63028A931787L4585K8165J9874J0279m69j2398k4726l5984m5244n2566n8234o2196
63016A732873o4290o4414o2421n8366n2889m6874m0638l3865k6401j8616j0981
63005A253118l643L372R894J5769K1086K6136L1117L5828L9730M2431M4150M5444
62993A564432M6537M7234M7491M7580M7580M7168M6117M4507M2254L8960L4457
62982B054317K8971K2446J4302M203p448j9991l2885m5267n6020o4724p1830p7464
62970A748610q0880q1727q0892p9255p6466p2000o6629o1699n7391n2931m8138
62959I90602m3633l9688l6021l2592k9624k6929k4206k1876k0615k0068j9167
$$ plain form
62948 676183 658467 641816 625332 608868 593242 579366 567585 557610 548618 539625 530251 521080
62936 521080 512946 506023 499849 494000 488395 483165 478537 474759 471885 469728 468062 466595 464751 461937
62922 461937 458281 454627 451553 448812 445993 443241 440925 438995 437113 435131 433072 430930 428760 426708
62908 426708 424729 422708 420969 420068 419805 419126 417498 415748 414953 415105 415494 415857 416336 416755 416847 416954 417613
62891 417613 418644 419479 420208 421394 422914 423911 424063 424032 424443 425150 425825 426517 427217 427518 427190 426689 426524 426409
62873 426409 425519 423522 420998 418832 417415 416414 415232 413680 412210 411394 411235 411234 411091 411079 411592 412627 413882
62856 413882 415162 416420 417534 418367 419009 419701 420437 420878 420834 420594 420534 420549 420307 419989 420233 421106 421663 421018 419540
62837 419540 418421 418235 418505 418575 418245 417512 416418 415467 415540 416961 419028 420810 422095 423246 424511 425894
$$ packed form
62948F76183j7716j6651j6484j6464j5626j3876j1781r975q992q993r374r171
62936E21080q134o923o174n849n605n230m628l778k874k157j666j467j844k814
62922D61937l656l654l074k741k819k752k316j930j882j982k059k142k170k052
62908D26708j979k021j739r01k63o79j628j750p95J52L89L63M79M19R2J07O59
62891D17613J031Q35P29J186J520R97J52l1M11P07O75O92P00L01l28n01j65j15
62873D26409q90j997k524k166j417j001j182j552j470q16j59jj43j2N13J035J255
62856D13882J280J258J114Q33O42O92P36M41m4k40o0J5k42l18K44Q73N57o45j478
62837D19540j119j86K70P0l30p33j094r51P3J421K067J782J285J151J265J383
$$ plain form
62821 425894 427448 429258 431264 433381 435752 438685 442429 447017 452044 456570 459724 461693 463803 467334
62807 467334 472487 478653 485195 491699 497914 504047 510947 519439 529432 539952 550120 560007 570610
62794 570610 583091 597850 614319 631745 650229 670767 694370 721419 751772 785026 820794
62783 820794 859392 902214 950732 1004966 1063637 1125920 1192136 1262492 1336179 1412203 1490036
62772 1490036 1568582 1645352 1717666 1784045 1843478 1893923 1932665 1957823 1968511 1963999 1944062
62761 1944062 1910148 1864986 1810777 1748572 1679522 1605711 1529369 1452033 1374877 1299307 1226837
62750 1226837 1158649 1095374 1036941 982660 931990 885281 843271 805973 772667 742962 717112
62739 717112 695041 675807 658432 642788 629252 617881 608277 600028 592956 587117 582734 579985 578661
$$ packed form
62821D25894J554J810K006K117K371K933L744M588N027M526L154J969K110L531
62807D67334N153O166O542O504O215O133O900Q492R993J0520J0168R887J0603
62794E70610J2481J4759J6469J7426J8484K0538K3603K7049L0353L3254L5768
62783H20794L8598M2822M8518N4234N8671O2283O6216P0356P3687P6024P7833
62772A490036P8546P6770P2314O6379N9433N0445L8742K5158J0688m512j9937
62761A944062l3914m5162n4209o2205o9050p3811p6342p7336p7156p5570p2470
62750A226837o8188o3275n8433n4281n0670m6709m2010l7298l3306k9705k5850
62739G17112k2071j9234j7375j5644j3536j1371r604q249p072n839m383k749j324
$$ plain form
62726 578661 578138 577816 577555 577785 579220 582306 586769 591912 597586 604541 613509 624256 636037 648753
62712 648753 663091 679732 699011 721234 746684 775316 806982 841983 880855 923700 970341
62701 970341 1021132 1076956 1138357 1205249 1277539 1355322 1438263 1525377 1615582 1707755 1800016
62690 1800016 1889557 1973516 2049525 2115176 2167699 2204671 2224675 2226980 2211208 2177860 2128746
62679 2128746 2066287 1992595 1909649 1819960 1726456 1631797 1538168 1447502 1361307 1280288 1204530
62668 1204530 1134024 1068708 1008237 952376 901669 857102 818770 785273 754846 726844 701687
62657 701687 679502 659451 640628 623094 607488 593847 581354 569303 557821 547445 538423 530657
62645 530657 523966 518132 512895 508198 504188 500808 497668 494564 491790 489650 488020 486678 485624 484661
$$ packed form
62726E78661n23l22k61K30J435L086M463N143N674O955Q968J0747J1781J2716
62712F48753J4338J6641J9279K2223K5450K8632L1666L5001L8872M2845M6641
62701I70341N0791N5824O1401O6892P2290P7783Q2941Q7114R0205R2173R2261
62690A800016Q9541Q3959P6009O5651N2523L6972K0004K305j5772l3348m9114
62679B128746o2459p3692q2946q9689r3504r4659r3629r0666q6195q1019p5758
62668A204530p0506o5316o0471n5861n0707m4567l8332l3497l0427k8002k5157
62657G01687k2185k0051j8823j7534j5606j3641j2493j2051j1482j0376r022p766
62645E30657o691n834n237m697m010l380l140l104k774k140j630j342j054r63
$$ plain form
62631 484661 483136 480744 478234 476618 475909 475341 474613 474106 473952 473778 473462 473356 473521 473520 473307 473725 475660 479086
62613 479086 483280 487655 492037 496404 500695 504843 508988 513721 519959 528266 538424 550077 563501
62600 563501 579210 596969 616010 636278 658696 684065 712402 743491 777246 813149 850107
62589 850107 887394 925123 963148 999965 1033292 1061424 1083530 1098962 1106992 1107210 1099766 1085198
62577 1085198 1064272 1037918 1007098 972803 936244 898784 861481 824869 789289 755252 723378
62566 723378 694243 668191 644928 623295 602169 581887 564206 550414 539892 530923 522424 514374
62554 514374 506999 500318 494393 489359 485087 481227 477655 474592 472258 470708 469967 470014 470536 471062 471477 472213
62538 472213 473668 475553 477096 478001 478931 480706 483186 485541 487793 491414 497833 506773 516788 527165
$$ packed form
62631D84661j525k392k510j616p09n68p28n07j54j74l16j06J65jk13M18J935L426
62613D79086M194M375M382M367M291M148M145M733O238Q307J0158J1653J3424
62600E63501J5709J7759J9041K0268K2418K5369K8337L1089L3755L5903L6958
62589H50107L7287L7729L8025L6817L3327K8132K2106J5432Q030K18p444j4568
62577A085198k0926k6354l0820l4295l6559l7460l7303l6612l5580l4037l1874
62566G23378k9135k6052k3263k1633k1126k0282j7681j3792j0522q969q499q050
62554E14374p375o681n925n034m272l860l572l063k334j550p41M7N22N26M15P36
62538D72213J455J885J543R05R30J775K480K355K252L621O419Q940J0015J0377
$$ plain form
62524 527165 538432 551183 565470 581580 600370 622293 646842 673556 703000 736091 772970
62513 772970 813162 856431 902738 951519 1001653 1052054 1101778 1149605 1193938 1233088 1265431
62502 1265431 1289498 1304365 1309837 1306012 1292873 1270696 1240706 1204951 1165625 1124669 1083655 1043551
62490 1043551 1004745 967749 933722 903880 878558 857323 839851 826114 815784 808099 802441 798485
62478 798485 795545 792252 787265 780146 771310 761298 750218 737691 723147 706267 687351 667276
62466 667276 647059 627405 608593 590557 573025 555787 538993 523195 508937 496285 484877
62455 484877 474513 465575 458641 453702 450021 446897 444257 442296 440869 439672 438820 438730 439492 440855 442774
62440 442774 445359 448238 450620 452218 453506 454753 455423 454965 453641 452003 449966 447094 443501 439737 435871
$$ packed form
62524E27165J1267J2751J4287J6110J8790K1923K4549K6714K9444L3091L6879
62513G72970M0192M3269M6307M8781N0134N0401M9724M7827M4333L9150L2343
62502A265431K4067J4867N472l825j3139k2177k9990l5755l9326m0956m1014m0104
62490A043551l8806l6996l4027k9842k5322k1235j7472j3737j0330p685n658l956
62478G98485k940l293m987p119q836j0012j1080j2527j4544j6880j8916k0075
62466F67276k0217j9654j8812j8036j7532j7238j6794j5798j4258j2652j1408
62455D84877j0364q938o934m939l681l124k640j961j427j197q52r0P62J363J919
62440D42774K585K879K382J598J288J247O70m58j324j638k037k872l593l764l866
$$ plain form
62425 435871 431384 426104 420690 415953 412051 408521 404923 401265 397927 395250 393175 391346 389574 388061
62411 388061 387026 386299 385460 384275 382900 381806 381562 382378 383713 384666 384989 385356 386372 387739 388891 390084
62395 390084 392132 395175 398437 401337 404237 407826 412182 416794 421296 425834 430828 436551 442949 449766
62381 449766 456884 464448 472573 480999 489308 497464 505872 514785 523912 532815 541564 550725 560685 571231
62367 571231 581988 593193 605854 621082 639376 660649 684782 711973 742619 777038 815308
62356 815308 857162 902023 949183 997879 1046997 1094866 1139531 1179155 1212022 1236552 1251993
62345 1251993 1259127 1259714 1255020 1245278 1230572 1211569 1188960 1162739 1132586 1098739 1062089 1023723
62333 1023723 984850 946945 911338 878513 848112 819655 793008 768175 744971 723033 702001
$$ packed form
62425D35871m487n280n414m737l902l530l598l658l338k677k075j829j772j513
62411C88061j035p27q39j185j375j094k44Q16J335R53L23L67J016J367J152J193
62395C90084K048L043L262K900K900L589M356M612M502M538M994N723O398O817
62381D49766P118P564Q125Q426Q309Q156Q408Q913R127Q903Q749R161R960J0546
62367E71231J0757J1205J2661J5228J8294K1273K4133K7191L0646L4419L8270
62356H15308M1854M4861M7160M8696M9118M7869M4665L9624L2867K4530J5441
62345A251993P134N87m694r742j4706j9003k2609k6221l0153l3847l6650l8366
62333A023723l8873l7905l5607l2825l0401k8457k6647k4833k3204k1938k1032
$$ plain form
62322 702001 681580 661542 641771 622371 603672 585975 569234 553202 538079 524706 513737
62311 513737 504773 496783 489258 482361 476100 470198 464972 461483 460215 460221 460130 459591 459195 459424 460310 461821
62295 461821 463940 466430 469028 471803 474969 478507 482273 486229 490164 493479 495750 497367 499179 501602
62281 501602 504424 507302 510042 512619 515319 518606 522438 526058 529039 532244 537075 543923 552134 561362
62267 561362 572064 584586 598632 614143 632030 653490 678898 707774 739636 774526 812861
62256 812861 855036 901079 950441 1002055 1054527 1106179 1154914 1198338 1234186 1260837 1277718
62245 1277718 1285484 1285638 1279550 1267691 1249849 1225917 1196174 1160972 1120646 1075853 1027768 977883
62233 977883 927804 879188 833487 791547 753580 719563 689474 663119 639968 619330 600706
$$ packed form
62322G02001k0421k0038j9771j9400j8699j7697j6741j6032j5123j3373j0969
62311E13737q964p990p525o897o261n902n226l489j268Or1n39l96K29Q86J511
62295D61821K119K490K598K775L166L538L766L956L935L315K271J617J812K423
62281E01602K822K878K740K577K700L287L832L620K981L205M831O848Q211R228
62267E61362J0702J2522J4046J5511J7887K1460K5408K8876L1862L4890L8335
62256H12861M2175M6043M9362N1614N2472N1652M8735M3424L5848K6651J6881
62245A277718P766J54o088j1859j7842k3932k9743l5202m0326m4793m8085m9885
62233I77883n0079m8616m5701m1940l7967l4017l0089k6355k3151k0638j8624
$$ plain form
62222 600706 584040 569698 558058 548847 540932 533078 525002 517555 511828 508119 505751 503757 501731
62209 501731 500072 499399 499819 500982 502829 505950 511008 518061 526637 536280 546821 558315 570956 584876
62195 584876 599848 615423 631498 648370 665945 683287 699394 714142 727982 740929 752432
62184 752432 762195 770549 777872 784006 788347 790239 789277 785566 779830 773124 766358 760205 755445 753227
62170 753227 754912 761488 772979 788593 807867 831553 860724 894831 931400 968007 1003730 1038000
62158 1038000 1068845 1093465 1110369 1120034 1123594 1121875 1115726 1106163 1093593 1077388 1056659 1031175
62146 1031175 1001492 968672 934131 899309 865164 832203 801044 772609 747603 726116 707846
62135 707846 692512 679970 670187 663090 658275 654959 652531 651103 651252 653335 657397 663500 671621 681324
$$ packed form
62222F00706j6666j4342j1640r211p915p854q076p447n727l709k368j994k026
62209E01731j659o73M20J163J847L121N058P053Q576R643J0541J1494J2641J3920
62195E84876J4972J5575J6075J6872J7575J7342J6107J4748J3840J2947J1503
62184G52432R763Q354P323O134M341J892r62l711n736o706o766o153m760k218
62170G53227J685O576J1491J5614J9274K3686K9171L4107L6569L6607L5723L4270
62158A038000L0845K4620J6904R665L560j719o149r563j2570j6205k0729k5484
62146A031175k9683l2820l4541l4822l4145l2961l1159k8435k5006k1487j8270
62135G07846j5334j2542r783p097m815l316k428j428J49K083M062O103Q121R703
$$ plain form
62121 681324 692195 704654 719777 738018 758424 779126 798198 814027 825470 832223 834989 835085
62109 835085 833851 832193 830352 828029 824807 820309 813934 805009 793737 781711 770823 761806 754442
62096 754442 748988 746562 747971 752858 760278 769584 780483 792674 805745 819228 832734 846359 860896
62083 860896 877138 894915 913278 931630 950233 969594 989991 1011732 1035250 1060581 1087062
62072 1087062 1113732 1139719 1164280 1186999 1208080 1227984 1246657 1263606 1278803 1292985 1306911
62061 1306911 1320777 1334388 1347195 1357994 1365314 1368543 1368218 1365088 1359562 1352337 1344601 1336799 1327632
62048 1327632 1314990 1297679 1275866 1250332 1221962 1191668 1160045 1127062 1092567 1057064 1021610
62037 1021610 986952 953208 920435 889095 859763 832653 807720 785140 765420 748841 734887
$$ packed form
62121F81324J0871J2459J5123J8241K0406K0702J9072J5829J1443O753K766R6
62109H35085j234j658j841k323l222m498o375q925j1272j2026j0888r017p364
62096G54442n454k426J409M887P420R306J0899J2191J3071J3483J3506J3625J4537
62083H60896J6242J7777J8363J8352J8603J9361K0397K1741K3518K5331K6481
62072A087062K6670K5987K4561K2719K1081J9904J8673J6949J5197J4182J3926
62061A306911J3866J3611J2807J0799P320L229l25l130n526p225p736p802r167
62048A327632j2642j7311k1813k5534k8370l0294l1623l2983l4495l5503l5454
62037A021610l4658l3744l2773l1340k9332k7110k4933k2580j9720j6579j3954
$$ plain form
62026 734887 722511 711001 700289 690297 680416 670093 659498 649036 638417 627031 615120 603801
62014 603801 593739 584554 575778 567663 560739 555245 551443 549858 550639 553178 556941 562273 569805 579331
62000 579331 589830 600368 610357 619072 625558 629169 629859 627895 623620 617560 610391 602511 593667 583204
61986 583204 570873 557407 544160 532013 520776 509895 499454 490096 482101 475125 468927 463793
61974 463793 459986 457208 454906 452839 451155 450084 449712 449864 450261 451003 452807 456255 460840 465311 469080
61959 469080 472763 477253 482901 489814 498244 508126 518724 529296 539920 551260 563773 577587 592945
61946 592945 610364 630292 652847 677794 704719 733364 763890 796596 831360 867536 904435
61935 904435 941612 978670 1015068 1050210 1083478 1114301 1142481 1168246 1191450 1210935 1225346
$$ packed form
62026G34887j2376j1510j0712r992r881j0323j0595j0462j0619j1386j1911j1319
62014F03801j0062r185q776q115o924n494l802j585P81K539L763N332P532R526
62000E79331J0499J0538R989Q715O486L611O90j964m275o060p169p880q844j0463
61986E83204j2331j3466j3247j2147j1237j0881j0441r358p995o976o198n134
61974D63793l807k778k302k067j684j071l72J52L97P42J804L448M585M471L769
61959D69080L683M490N648O913Q430R882J0598J0572J0624J1340J2513J3814J5358
61946E92945J7419J9928K2555K4947K6925K8645L0526L2706L4764L6176L6899
61935I04435L7177L7058L6398L5142L3268L0823K8180K5765K3204J9485J4411
$$ plain form
61924 1225346 1234481 1239007 1238898 1233195 1221663 1205825 1187913 1169620 1152408 1138146 1128518 1124161 1125003
61911 1125003 1131177 1143062 1160769 1184012 1212097 1243545 1276081 1307401 1335724 1359368 1376453
61900 1376453 1385586 1386448 1379283 1364338 1342310 1314763 1283351 1248918 1211934 1173431 1134829 1097105
61888 1097105 1060708 1025987 993100 961741 931641 903167 876865 852589 829652 807682 786805
61877 786805 767242 749313 733617 720525 709523 699690 690802 683459 678203 675076 674078 675417 679150
61864 679150 685049 693077 703715 717604 734960 755421 778448 804030 833046 866720 905599 949314
61852 949314 997387 1049787 1106356 1166105 1227593 1289775 1352121 1414035 1474376 1531230 1581908
61841 1581908 1623553 1654293 1673694 1682037 1679721 1667779 1648426 1624427 1598177 1571860 1547977 1528918
$$ packed form
61924A225346R135M526j09n703j1532j5838j7912j8293j7212j4262r628m357Q42
61911A125003O174J1885J7707K3243K8085L1448L2536L1320K8323K3644J7085
61900A376453R133Q62p165j4945k2028k7547l1412l4433l6984l8503l8602l7724
61888A097105l6397l4721l2887l1359l0100k8474k6302k4276k2937k1970k0877
61877G86805j9563j7929j5696j3092j1002r833q888p343n256l127r98J339L733
61864F79150N899Q028J0638J3889J7356K0461K3027K5582K9016L3674L8879M3715
61852I49314M8073N2400N6569N9749O1488O2182O2346O1914O0341N6854N0678
61841A581908M1645L0740J9401Q343k316j1942j9353k3999k6250k6317k3883j9059
$$ plain form
61829 1528918 1516167 1510503 1512670 1523115 1541134 1564947 1592534 1621808 1650058 1673951 1690307 1696617
61817 1696617 1691043 1672687 1642065 1600876 1551108 1494548 1432958 1368199 1302075 1236410 1173309
61806 1173309 1114858 1062273 1015348 972814 933323 896438 862903 833745 808878 786844 766127
61795 766127 746427 728370 712365 698179 685386 673744 663208 653903 645961 639171 632986 627107
61783 627107 621769 617249 613404 609951 606785 603745 600515 597055 593671 590386 586826 583140 580316 578998
61769 578998 578567 578066 577454 577209 577271 577265 577328 577842 578661 579519 580844 583210 586239 589009 591384 593900 596417 598009
61751 598009 598274 597789 597013 595604 593174 589981 586508 582893 579133 575485 572404 570268 569173 568774 568474
61736 568474 568067 567990 568596 569571 570552 571916 574285 577522 580884 583960 586885 589967 593752 598953 605472 611887
$$ packed form
61829A528918j2751n664K167J0445J8019K3813K7587K9274K8250K3893J6356O310
61817A696617n574j8356l0622m1189m9768n6560o1590o4759o6124o5665o3101
61806A173309n8451n2585m6925m2534l9491l6885l3535k9158k4867k2034k0717
61795G66127j9700j8057j6005j4186j2793j1642j0536r305p942o790o185n879
61783F27107n338m520l845l453l166l040l230l460l384l285l560l686k824j318
61769E78998m31n01o12k45O2oO3N14Q19Q58J325K366L029K770K375K516K517J592
61751E98009K65m85p76j409k430l193l473l615l760l648l081k136j095l99l00
61736E68474m07p7O06R75R81J364K369L237L362L076K925L082L785N201O519O415
$$ plain form
61720 611887 616895 620958 625515 630891 636124 640578 644360 647155 648079 646996 644770 641893 638004 633087
61706 633087 627938 622853 616957 609538 601227 593228 586129 580051 575160 571371 568132 565169 562876 561448
61692 561448 560189 558253 555655 553015 550701 548697 546936 545313 543651 541985 540563 539411 538284 537203
61678 537203 536509 536179 535705 534880 534091 533437 532277 530136 527517 525286 523693 522448 521320 520140 518622 516766
61662 516766 515148 514294 513915 513203 511827 510356 509742 510518 512292 513947 514592 514445 514554 515614 517411 519468
61646 519468 521743 524516 527982 532201 537152 542619 548201 553421 557583 559726 559229 556402 551997 546273
61632 546273 539189 531366 524023 517796 512359 507365 502956 499166 495620 492256 489635 488182 487697 487948 489051
61617 489051 490889 492800 494265 495346 496059 495854 494177 491015 486527 480649 473443 465378 456883 448099 439290
$$ packed form
61720F11887N008M063M557N376N233M454L782K795R24j083k226k877l889m917
61706F33087n149n085n896p419q311p999p099o078m891l789l239k963k293j428
61692E61448j259j936k598k640k314k004j761j623j662j666j422j152j127j081
61678E37203o94l30m74q25p89o54j160k141k619k231j593j245j128j180j518j856
61662E16766j618q54l79p12j376j471o14P76J774J655O45j47J09J060J797K057
61646E19468K275K773L466M219M951N467N582N220M162K143m97k827m405n724
61632E46273p084p823p343o227n437m994m409l790l546l364k621j453m85K51J103
61617D89051J838J911J465J081P13k05j677l162m488n878p206q065q495q784q809
$$ plain form
61602 439290 430910 422966 414954 406850 399495 393566 388742 384370 380370 376911 373758 370518 367210 364116
61588 364116 361435 359338 357867 356419 353993 350429 346834 344190 342092 339442 335950 332342 329450 327612
61574 327612 326629 325856 324636 322987 321533 320530 319548 318336 317293 316670 316096 315379 314971 315048 314971 314408 314119
61557 314119 314681 315227 314589 313103 312111 312087 312459 312996 314112 315834 317595 319117 320541 321685 322169 322365 323214
61540 323214 324913 326734 328368 330528 333751 337422 340567 343068 345520 348219 350753 352450 352905 352184 350695
61525 350695 348795 346477 343565 340147 336585 333148 329918 327044 324781 323214 322162 321420 320931 320719 320795
61510 320795 321055 321228 321025 320447 319738 318960 317937 316733 315745 315036 314020 312266 310258 308877 308379 308400 308722
61493 308722 309403 310226 310625 310301 309589 309153 309562 311048 313346 315790 317836 319442 320803 321948 322847 323643
$$ packed form
61602D39290q380p944q012q104p355n929m824m372m000l459l153l240l308l094
61588C64116k681k097j471j448k426l564l595k644k098k650l492l608k892j838
61574C27612r83p73j220j649j454j003r82j212j043o23n74p17m08P7p7n63k89
61557C14119N62N46o38j486r92k4L72N37J116J722J761J522J424J144M84J96Q49
61540C23214J699J821J634K160L223L671L145K501K452K699K534J697M55p21j489
61525C50695j900k318k912l418l562l437l230k874k263j567j052p42m89k12P6
61510C20795K60J73k03n78p09p78j023j204r88p09j016j754k008j381m98K1L22
61493C08722O81Q23L99l24p12m36M09J486K298K444K046J606J361J145Q99P96
$$ plain form
61477 323643 324422 324960 325107 325244 325926 327156 328354 328980 328881 328209 327329 326661 326268 325751 324905 324276 324628 325943
61459 325943 327331 327928 327582 326756 326146 326304 327324 328836 330487 332335 334568 337074 339558 341920 344218
61444 344218 346446 348666 351211 354441 358445 363223 368922 375510 382407 388881 394693 399991 404669 408342
61430 408342 410998 413301 416032 419352 422713 425500 427747 430175 433400 437216 440952 444459 448244 452502
61416 452502 456530 459314 460329 459532 457080 453345 448824 443737 438146 432676 428417 425608 423019 419321
61402 419321 414685 410342 406900 403891 400802 397814 395408 393846 393154 393199 393652 394154 394610 395201 396122 397387
61386 397387 398732 399671 399979 400213 401373 403731 406314 407828 407843 406945 406072 405929 406676 407979 409676 412307
61370 412307 416426 421365 425589 428477 430855 433412 435703 437386 439362 442648 446921 451283 455823 461258
$$ packed form
61477C23643P79N38J47J37O82J230J198O26r9o72q80o68l93n17q46o29L52J315
61459C25943J388N97l46q26o10J58J020J512J651J848K233K506K484K362K298
61444C44218K228K220K545L230M004M778N699O588O897O474N812N298M678L673
61430D08342K656K303K731L320L361K787K247K428L225L816L736L507L785M258
61416D52502M028K784J015p97k452l735m521n087n591n470m259k809k589l698
61402D19321m636m343l442l009l089k988k406j562o92M5M53N02M56N91R21J265
61386C97387J345R39L08K34J160K358K583J514J5q98q73j43P47J303J697K631
61370D12307M119M939M224K888K378K557K291J683J976L286M273M362M540N435
$$ plain form
61356 461258 467526 474032 481028 489468 499539 510499 522069 534950 549659 565585 581458 596165
61344 596165 609041 619981 629418 637782 645009 650961 656021 660628 664477 666901 667903 668004 667153 664580
61330 664580 659842 653353 645798 637685 629531 621844 614736 608016 601758 596386 592168 589034 586847 585430
61316 585430 584372 583217 581825 580247 578452 576614 575496 576094 578929 583923 590621 598239 605967 613721
61302 613721 622174 631477 640399 647226 651081 651842 649540 644714 638740 632712 626362 619106 611736 605867
61288 605867 601893 598689 595256 591583 587913 584396 581619 580420 580875 582256 584136 586764 590285 594343
61274 594343 598609 602978 607322 611764 617029 623693 631166 638339 645060 652017 659378 666819 674876 684992
61260 684992 698002 713650 731666 751994 773625 794457 812823 828224 840306 848358 852284 852885
$$ packed form
61356D61258O268O506O996Q440J0071J0960J1570J2881J4709J5926J5873J4707
61344E96165J2876J0940R437Q364P227N952N060M607L849K424J002J01q51k573
61330F64580m738o489p555q113q154p687p108o720o258n372m218l134k187j417
61316E85430j058j155j392j578j795j838j118N98K835M994O698P618P728P754
61302F13721Q453R303Q922O827L855P61k302m826n974o028o350p256p370n869
61288F05867l974l204l433l673l670l517k777j199M55J381J880K628L521M058
61274E94343M266M369M344M442N265O664P473P173O721O957P361P441Q057J0116
61260F84992J3010J5648J8016K0328K1631K0832J8366J5401J2082Q052L926O01
$$ plain form
61248 852885 850590 844904 835677 823821 810105 794409 777005 759599 744050 730701 718813 708024
61236 708024 698450 689814 681453 673022 664588 656326 648694 642606 638857 637525 638195 640396 643482 646605
61222 646605 649277 651653 653933 655857 657107 657824 658408 659185 660532 662823 665941 669247 672229 674704 676228
61207 676228 676095 674372 672352 671397 671811 673270 675823 679831 685328 692140 700524 711177 724614 740791
61193 740791 759146 778749 798485 817247 833953 847496 857178 863288 866966 869340 871043 872370 873342
61180 873342 873528 872361 869730 865885 860818 854415 847219 840259 833860 827240 819591 811011 802040 792774
61166 792774 782778 771581 759090 745805 732581 719730 706495 692109 677334 664127 653650 645427
61154 645427 638695 633654 630925 630484 631764 634337 637920 641978 645720 648329 648952 646689 640855 631356 619015
$$ packed form
61248H52885k295n686r227j1856j3716j5696j7404j7406j5549j3349j1888j0789
61236G08024r574q636q361q431q434q262p632o088l749j332O70K201L086L123
61222F46605K672K376K280J924J250P17N84P77J347K291L118L306K982K475J524
61207F76228j33j723k020r55M14J459K553M008N497O812Q384J0653J3437J6177
61193G40791J8355J9603J9736J8762J6706J3543R682O110L678K374J703J327R72
61180H73342J86j167k631l845n067o403p196o960o399o620p649q580q971r266
61166G92774r996j1197j2491j3285j3224j2851j3235j4386j4775j3207j0477q223
61154F45427o732n041k729m41J280K573L583M058L742K609O23k263n834r499j2341
$$ plain form
61139 619015 605679 593505 583577 575456 568536 563349 560833 560875 562649 566004 571290 578024 585107 592428
61125 592428 600996 611261 622546 634415 647357 661732 677195 693602 711350 730307 749450 768078
61113 768078 786413 804559 821898 838073 853567 868645 882635 894873 905614 915406 924243 931693
61101 931693 937049 939096 936683 929968 920164 907791 892343 874059 854673 835654 816877 797824
61089 797824 778955 760989 743897 727588 712714 699749 688017 676572 665470 655323 646207 637879
61077 637879 630514 624453 619636 615856 613128 611381 610282 609769 610139 611331 612847 614621 617146 620529 624331
61062 624331 628496 633381 638707 643779 648986 655697 664307 673884 684164 696124 709923 724122 737939
61049 737939 752642 769587 788447 808567 830459 854559 879907 905516 931868 959692 988505
$$ packed form
61139F19015j3336j2174r928q121o920n187k516M2J774L355N286O734P083P321
61125E92428Q568J0265J1285J1869J2942J4375J5463J6407J7748J8957J9143J8628
61113G68078J8335J8146J7339J6175J5494J5078J3990J2238J0741R792Q837P450
61101I31693N356K047k413o715r804j2373j5448j8284j9386j9019j8777j9053
61089G97824j8869j7966j7092j6309j4874j2965j1732j1445j1102j0147r116q328
61077F37879p365o061m817l780k728j747j099n13L70J192J516J774K525L383L802
61062F24331M165M885N326N072N207O711Q610R577J0280J1960J3799J4199J3817
61049G37939J4703J6945J8860K0120K1892K4100K5348K5609K6352K7824K8813
$$ plain form
61038 988505 1017689 1047746 1079149 1111190 1143387 1176797 1212623 1250752 1290995 1334306 1381185
61027 1381185 1430250 1479978 1530651 1583131 1637287 1693409 1753724 1820718 1895393 1978877 2073924
61016 2073924 2182622 2304218 2437480 2583802 2746276 2928360 3136509 3382069 3677304
61007 3677304 4031487 4453954 4958169 5558819 6268878 7106623 8103904 9301252 10737802
60998 10737802 12451093 14467299 16744426 19090977 21160113 22586994 23191898 23079700
60990 23079700 22555405 21952065 21522252 21424719 21714599 22282382 22820106 22921871 22290604
60981 22290604 20890925 18929226 16705880 14477382 12406703 10576028 9009663 7692968
60973 7692968 6594081 5681965 4930376 4313934 3808443 3394316 3055749 2777590 2546040
$$ packed form
61038I88505K9184L0057L1403L2041L2197L3410L5826L8129M0243M3311M6879
61027A381185M9065M9728N0673N2480N4156N6122O0315O6994P4675Q3484R5047
61016B073924J08698J21596J33262J46322J62474J82084K08149K45560K95235
61007C677304L54183M22467N04215O00650P10059Q37745R97281J197348J436550
60998A0737802J713291K016206K277127K346551K069136J426881O04904j12198
60990B3079700n24295o03340m29813r7533K89880N67783N37724J01765o31267
60981B2290604j399679j961699k223346k228498k070679j830675j566365j316695
60973G692968j098887r12116p51589o16442n05491m14127l38567k78159k31550
$$ plain form
60964 2546040 2351010 2184874 2040118 1910793 1794861 1692202 1601031 1518614 1444430 1379939
60954 1379939 1325574 1279999 1241732 1209351 1180498 1152594 1124474 1095969 1066548 1035984 1005681
60943 1005681 977515 951659 927039 903476 881679 861449 841602 821691 802471 784672 768436
60932 768436 753795 740605 728214 716236 705333 696233 688378 680689 673233 666912 661780 656860 651424
60919 651424 645398 638758 631687 625159 620192 616549 613176 609778 606992 605170 604007 603322 603210 603440 603634
60904 603634 604034 605234 607169 609185 611082 613310 616083 619049 621843 624295 626211 627644 629345 632235
60890 632235 636412 641272 646520 652483 659518 667718 677077 687291 697546 707222 716818 727582 740138
60877 740138 753984 768334 782996 798374 814961 832715 850790 868135 884682 901503 919404
$$ packed form
60964B546040j95030j66136j44756j29325j15932j02659r1171q2417p4184o4491
60954A379939n4365m5575l8267l2381k8853k7904k8120k8505k9421l0564l0303
60943A005681k8166k5856k4620k3563k1797k0230j9847j9911j9220j7799j6236
60932G68436j4641j3190j2391j1978j0903r100p855p689p456o321n132m920n436
60919F51424o026o640p071o528m967l643l373l398k786j822j163o85j12K30J94
60904F03634M00J200J935K016J897K228K773K966K794K452J916J433J701K890
60890F32235M177M860N248N963P035Q200R359J0214J0255R676R596J0764J2556
60877G40138J3846J4350J4662J5378J6587J7754J8075J7345J6547J6821J7901
$$ plain form
60866 919404 937916 956276 974849 994660 1015765 1036969 1057094 1075705 1092513 1106796 1117637
60855 1117637 1124346 1126603 1124560 1118791 1109825 1097879 1083336 1067171 1050331 1032767 1013584 992127
60843 992127 968556 943562 917969 892510 867517 842760 817863 792827 767960 743569 720078
60832 720078 698250 678818 661887 646924 633236 620331 608083 596766 586780 578150 570473 563397
60820 563397 556822 550657 544859 539712 535470 531686 527684 523817 521308 520470 520133 519474 519359 520900 523576
60805 523576 525968 527777 529839 532437 534881 536804 538705 540931 543011 544354 544967 545147 544942 544264 543306
60790 543306 542529 542194 541919 540770 538109 534402 530842 528099 525838 523497 520861 517576 512956 506893 500374
60775 500374 494428 488962 483230 477000 470687 464732 459511 455408 452305 449361 445980 442647 440121 438202
$$ packed form
60866I19404J8512J8360J8573J9811K1105K1204K0125J8611J6808J4283J0841
60855A117637O709K257k043n769q966j1946j4543j6165j6840j7564j9183k1457
60843I92127k3571k4994k5593k5459k4993k4757k4897k5036k4867k4391k3491
60832G20078k1828j9432j6931j4963j3688j2905j2248j1317r986q630p677p076
60820E63397o575o165n798n147m242l784m002l867k509q38l37o59j15J541K676
60805E23576K392J809K062K598K444J923J901K226K080J343O13J80k05o78r58
60790E43306p77l35k75j149k661l707l560k743k261k341k636l285m620o063o519
60775E00374n946n466n732o230o313n955n221m103l103k944l381l333k526j919
$$ plain form
60761 438202 436024 433283 430400 427680 425088 422727 420877 419655 419160 419740 421521 423869 425935 427592 429329
60746 429329 431517 434346 438133 442976 448286 453288 457798 461937 465365 467525 468411 468480 468015 467177 466315 465517
60730 465517 464172 461755 458716 455771 452639 448483 443401 438457 434261 430494 426828 423318 419793 415826
60716 415826 411511 407450 403726 399739 395289 391037 387600 384843 382377 380055 377715 375059 372138 369420
60702 369420 367150 365158 363488 362509 362043 361115 359102 356646 354849 353965 353477 353163 353393 354320 355385 355932
60686 355932 356041 356446 357661 359512 361671 364418 368429 373839 379918 385825 391275 396337 401034 405516 410219
60671 410219 415399 420723 425639 429865 433214 435402 436542 437446 438875 440713 442410 443976 445933 448478
60657 448478 451258 453960 456639 459532 462861 466590 470023 472006 472027 470829 469470 468138 466418 464191 461418
$$ packed form
60761D38202k178k741k883k720k592k361j850j222m95N80J781K348K066J657J737
60746D29329K188K829L787M843N310N002M510M139L428K160Q86O9m65q38q62p98
60730D65517j345k417l039k945l132m156n082m944m196l767l666l510l525l967
60716D15826m315m061l724l987m450m252l437k757k466k322k340k656k921k718
60702C69420k270j992j670r79m66r28k013k456j797q84m88l14K30R27J065N47
60686C55932J09M05J215J851K159K747M011N410O079N907N450N062M697M482M703
60671D10219N180N324M916M226L349K188J140R04J429J838J697J566J957K545
60657D48478K780K702K679K893L329L729L433J983K1j198j359j332j720k227k773
$$ plain form
60642 461418 457436 451518 444118 436639 429895 423530 417044 410615 404721 399618 395383 392006 389262 386906
60628 386906 385093 384164 384081 384453 385024 385667 386068 385977 385664 385551 385527 385235 384854 384855 385103 385000 384540 384406 384901 385575
60608 385575 386079 386636 387385 387933 387881 387293 386394 385318 384332 383780 383583 383311 382952 383084 384027 385330 386394 387204
60590 387204 388127 389334 390678 391890 392687 392923 392747 392478 392312 392369 392831 393655 394303 394300 394048 394553 396310 398974
60572 398974 402154 405967 410610 415892 421453 427123 432923 439054 445961 454095 463435 473421 483274 492138
60558 492138 499091 503515 505474 505385 503469 499958 495724 492077 489875 489231 490060 492399 496197 501269 507592
60543 507592 515267 524278 534620 546546 560254 575517 592105 610168 629366 647782 662696 672631
60531 672631 677931 679303 676722 670114 660295 648740 636929 626216 617619 611150 605737 600329 594882
$$ packed form
60642D61418l982n918p400p479o744o365o486o429n894n103m235l377k744k356
60628C86906j813r29q3L72N71O43M01r1l13j13k4k92l81JK48j03m60j34M95O74
60608C85575N04N57P49N48n2n88q99j076r86n52j97k72l59J32R43J303J064Q10
60590C87204R23J207J344J212P97K36j76k69j66N7M62Q24O48lk52N05J757K664
60572C98974L180L813M643N282N561N670N800O131O907Q134R340R986R853Q864
60558D92138O953M424J959q9j916l511m234l647k202o44Q29K339L798N072O323
60543E07592P675R011J0342J1926J3708J5263J6588J8063J9198J8416J4914R935
60531F72631N300J372k581o608r819j1555j1811j0713q597o469n413n408n447
$$ plain form
60518 594882 590094 586502 584161 582876 582404 582622 583734 586145 589978 594875 600372 606317 612862 620255 628756
60503 628756 638633 650290 664425 681894 703231 728538 758017 792169 831046 873617 918359 964084
60491 964084 1009616 1052919 1091290 1122257 1143728 1153661 1150565 1134478 1106798 1069220 1023589 972646
60479 972646 919921 868448 820038 775756 736291 701603 670898 643304 618393 596052 576379
60468 576379 559557 545321 532668 520814 510201 501751 495178 489020 482374 475585 469087 462638 456160
60455 456160 450391 446055 442966 440443 438080 435738 433264 430674 428230 426089 424200 422639 421588 420897
60441 420897 420178 419361 418675 418138 417748 417984 419249 420769 421108 419992 418662 418102 417895 417303 416497 416038 415946 415986
60423 415986 416306 417093 418069 418894 419710 420848 422349 424084 425900 427438 428340 428846 429551 430303 430124 428629 426767
$$ packed form
60518E94882m788l592k341j285m72K18J112K411L833M897N497N945O545P393Q501
60503F28756R877J1657J4135J7469K1337K5307K9479L4152L8877M2571M4742M5725
60491I64084M5532M3303L8371L0967K1471R933l096j6087k7680l7578m5631n0943
60479I72646n2725n1473m8410m4282l9465l4688l0705k7594k4911k2341j9673
60468E76379j6822j4236j2653j1854j0613q450o573o158o646o789o498o449o478
60455D56160n769m336l089k523k363k342k474k590k444k141j889j561j051o91
60441D20897p19q17o86n37l90K36J265J520L39j116j330n60k07n92q06m59r2M0
60423D15986L20P87R76Q25Q16J138J501J735J816J538R02N06P05P52j79j495j862
$$ plain form
60406 426767 425667 425406 425496 425898 426802 427877 428514 428612 428638 429143 430552 433086 436495 440107 443381 446087 448022
60389 448022 449209 450510 453110 456950 460488 462606 463995 465971 468630 471085 473026 475078 477800 481154
60375 481154 484854 488605 491964 494481 496042 496827 497058 496993 496893 496711 496148 495295 494874 495467 496787 498096 499070
60358 499070 499966 501179 503026 505700 509147 513110 517461 522345 527923 534326 541833 550611 560169 569555
60344 569555 578224 586097 592636 596557 596897 593903 588587 581883 574458 566700 558551 549897 541428 534456
60330 534456 529527 525886 522744 520363 519220 518694 517358 514345 509944 505120 500903 497933 496150 495054
60316 495054 494438 494534 495361 496450 497446 498504 499895 501865 505096 510523 518300 527577 537777 549436 563371
60301 563371 579586 597355 615545 632356 645622 654125 658102 657895 652899 642598 627936 610779
$$ packed form
60406D26767j100k61R0M02R04J075O37R8K6N05J409K534L409L612L274K706J935
60389D48022J187J301K600L840L538K118J389J976K659K455J941K052K722L354
60375D81154L700L751L359K517J561P85K31o5j00j82n63q53m21N93J320J309R74
60358D99070Q96J213J847K674L447L963M351M884N578O403P507Q778R558R386
60344E69555Q669P873O539L921L40k994n316o704p425p758q149q654q469o972
60330E34456m929l641l142k381j143n26j336l013m401m824m217k970j783j096
60316D95054o16R6Q27J089R96J058J391J970L231N427P777R277J0200J1659J3935
60301E63371J6215J7769J8190J6811J3266Q503L977k07m996j0301j4662j7157
$$ plain form
60289 610779 592523 574123 556869 542019 529761 519394 510435 502886 496602 491176 486467 482658 479785
60276 479785 477590 475763 473986 471959 469690 467546 465790 464362 463310 462910 463053 463112 462849 462913 463908 465459
60260 465459 466768 467663 468580 469851 471429 472944 473714 473200 471793 470571 469879 468906 467104 465208 464192 463987
60244 463987 463981 464094 464488 464846 464871 465040 465886 466958 467402 467277 467444 468408 470057 472278 474995 477739 479949 481613
60226 481613 483079 484458 485755 487271 489315 491711 494086 496304 498230 499577 500492 501718 503638 505764
60212 505764 507797 510417 514208 518510 522311 525676 529280 532996 536029 538151 539867 541702 544173 547921
60198 547921 552784 557145 559350 559560 559142 558569 557187 554883 552621 551107 550014 548851 547738 547074 547034 547538
60182 547538 548203 548432 548079 547807 548176 548692 548536 547871 547535 547674 547660 547182 546508 545751 544839 544136 544161 544665 544829
$$ packed form
60289F10779j8256j8400j7254j4850j2258j0367q959p549o284n426m709l809k873
60276D79785k195j827j777k027k269k144j756j428j052m00J43N9k63O4R95J551
60260D65459J309Q95R17J271J578J515P70n14j407j222o92r73j802j896j016k05
60244D63987oJ13L94L58K5J69Q46J072M44j25J67R64J649K221K717K744K210J664
60226D81613J466J379J297J516K044K396K375K218J926J347R15J226J920K126
60212E05764K033K620L791M302L801L365L604L716L033K122J716J835K471L748
60198E47921M863M361K205K10m18n73j382k304k262j514j093j163j113o64m0N04
60182E47538O65K29l53k72L69N16j56o65l36J39j4m78o74p57r12p03K5N04J64
$$ plain form
60163 544829 544380 543753 543217 542652 542179 542226 542928 544067 545523 547160 548528 549398 550280 551681 553256 554593 556391
60146 556391 559671 564105 568286 571551 574396 577241 580001 582871 586300 590082 593651 597274 601712 606603
60132 606603 610517 612889 614552 615980 616339 614916 612292 609272 605674 601019 595690 590499 585695 581160
60118 581160 577184 574304 572499 571078 569372 567344 565619 564902 565149 565457 565043 564078 563107 562020 560331 558228
60102 558228 556447 555247 554400 554154 555171 557381 559864 562209 565203 569825 576213 583821 591940 599732 606417
60087 606417 611804 616393 620913 626038 632160 638757 644231 647258 648203 648397 648185 646694 643473 639136 634188
60072 634188 628349 621370 613615 605422 596729 587717 579032 570996 563247 555429 547652 540120 532956 526533
60058 526533 521218 516717 512365 508147 504562 501502 498316 495136 493083 492758 493535 494673 496163 498043 499815
$$ packed form
60163E44829m49o27n36n65m73M7P02J139J456J637J368Q70Q82J401J575J337J798
60146E56391L280M434M181L265K845K845K760K870L429L782L569L623M438M891
60132F06603L914K372J663J428L59j423k624l020l598m655n329n191m804m535
60118E81160l976k880j805j421j706k028j725p17K47L08m14r65r71j087j689k103
60102E58228j781j200q47k46J017K210K483K345K994M622O388P608Q119P792O685
60087F06417N387M589M520N125O122O597N474L027R45J94k12j491l221m337m948
60072F34188n839o979p755q193q693r012q685q036p749p818p777p532p164o423
60058E26533n315m501m352m218l585l060l186l180k053l25P77J138J490J880J772
$$ plain form
60043 499815 501187 502634 504621 506821 508534 509340 509068 507764 505989 504483 503174 501088 497483 492537 486881
60028 486881 481165 476154 472289 468841 464402 458613 452647 447698 443742 440081 436329 432505 428863 425965
60014 425965 424240 423272 422202 420946 420231 420411 421202 422607 424870 427302 428508 428275 428002 428688 429681 430089
59998 430089 430198 430597 430990 430937 430967 431894 433618 435513 437472 439793 442473 445378 448682 452516 456564 460489
59982 460489 464292 467846 470647 472407 473281 473181 471724 469331 467432 466845 466712 465820 464267 463005 462391 462031
59966 462031 461620 461226 461125 461892 464119 467488 470741 473172 475502 478615 482082 484768 486399 487662 489104
59951 489104 490677 492114 493141 493543 493482 493457 493610 493542 493068 492541 492025 490898 488865 486653 485085 484050 483021
59934 483021 481910 480776 479330 477513 475960 475157 474645 473807 472897 472503 472520 472478 472420 472626 472872 472888 473253 474957
$$ packed form
60043D99815J372J447J987K200J713Q06k72j304j775j506j309k086l605m946n656
60028D86881n716n011l865l448m439n789n966m949l956l661l752l824l642k898
60014D25965j725r68j070j256p15J80P91J405K263K432J206k33k73O86R93M08
59998D30089J09L99L93n3L0R27J724J895J959K321K680K905L304L834M048L925
59982D60489L803L554K801J760Q74j00j457k393j899n87j33q92j553j262o14l60
59966D62031m11l94j01P67K227L369L253K431K330L113L467K686J631J263J442
59951D89104J573J437J027M02o1k5J53o8m74n27n16j127k033k212j568j035j029
59934D83021j111j134j446j817j553q03n12q38r10l94J7m2n8K06K46J6L65J704
$$ plain form
59916 474957 478188 482252 486520 490853 495283 499911 505001 510669 516543 522040 526742 530260 532276 533089
59902 533089 533622 534407 535031 535026 534696 534529 534372 533855 533169 532786 532845 533407 534792 537050 539515 541558 543370 545424
59884 545424 547694 550092 553122 557272 562078 566582 570427 573738 576232 577349 577188 576565 576025 575263 573516
59869 573516 570255 565662 560718 556617 553754 551499 549122 546588 544313 542653 541870 541995 542493 542635 542543 543198
59853 543198 545157 548003 551446 556070 562510 570667 580288 591348 603057 613290 620018 622950 623267 622373
59839 622373 621489 621665 623209 625443 627581 629344 630274 629336 625927 620579 613971 606057 596970 587897 580026
59824 580026 573216 566552 559624 552515 545311 538549 533350 530082 527541 524416 520870 517778 515244 513018
59810 513018 511493 511002 510797 510071 509347 509521 510142 510086 509437 509212 509558 509675 509217 508403 507082 505171 503714 503891
$$ packed form
59916D74957L231M064M268M333M430M628N090N668N874N497M702L518K016Q13
59902E33089N33P85O24nl30j67j57n17o86l83N9N62J385K258K465K043J812K054
59884E45424K270K398L030M150M806M504L845L311K494J117j61o23n40p62j747
59869E73516l261m593m944m101k863k255k377k534k275j660p83J25M98J42r2O55
59853E43198J959K846L443M624O440Q157R621J1060J1709J0233O728K932L17q94
59839F22373q84J76J544K234K138J763R30r38l409n348o608p914r087r073p871
59824E80026o810o664o928p109p204o762n199l268k541l125l546l092k534k226
59810E13018j525m91k05p26p24J74O21n6o49k25L46J17m58q14j321j911j457J77
$$ plain form
59792 503891 505070 505413 504429 503384 503060 502712 501571 499906 498173 496337 494581 493487 493016 492345 491163 490265
59776 490265 490389 491381 492912 495134 498078 501139 503698 505762 507642 509423 511062 512598 514071 515579 517384
59761 517384 519583 521767 523501 525009 526830 528957 530943 532698 534547 536592 538622 540575 542555 544531
59747 544531 546541 548879 551575 554084 556146 558411 561443 564574 566711 567875 568944 570274 571595 572972
59733 572972 574702 576512 577917 579158 580697 582028 582204 581366 580566 580194 579908 579963 581148 583275 585118 586143
59717 586143 587058 588379 589641 590420 591037 591866 593015 594962 598399 603038 607662 611804 616349 621988 628054
59702 628054 633471 637967 641753 644808 647116 648946 650338 650863 650275 648889 646980 644464 641509 638783 636666
59687 636666 634726 632383 629650 626867 624130 621275 618101 614377 609993 605235 600611 596353 592364 588508
$$ packed form
59792E03891J179L43r84j045l24l48j141j665j733j836j756j094m71o71j182q98
59776D90265J24R92J531K222K944L061K559K064J880J781J639J536J473J508J805
59761E17384K199K184J734J508J821K127J986J755J849K045K030J953J980J976
59747E44531K010K338K696K509K062K265L032L131K137J164J069J330J321J377
59733E72972J730J810J405J241J539J331J76q38q00l72k86N5J185K127J843J025
59717E86143R15J321J262P79O17Q29J149J947L437M639M624M142M545N639O066
59702F28054N417M496L786L055K308J830J392N25n88j386j909k516k955k726k117
59687F36666j940k343k733k783k737k855l174l724m384m758m624m258l989l856
$$ plain form
59673 588508 584494 579707 573784 567287 561233 556047 551509 547540 544304 541692 539405 537482 536052 534692
59659 534692 532775 530422 528456 527518 527783 529223 531368 533212 534191 534985 536354 537576 537205 535144 532689
59644 532689 530595 528424 525899 523542 521586 519404 516537 513483 511116 510038 510559 512508 514911 516645
59630 516645 517479 517832 517718 516817 515305 513477 510787 506566 501587 497592 495146 493311 491450 489824 488121
59615 488121 485070 480250 475038 471048 468657 467588 467834 469313 471540 474255 477641 481487 484971 487637
59601 487637 489733 491340 492124 492317 492872 494208 495681 496776 497864 499399 501227 503179 505483 508162 510830
59586 510830 513387 516098 518709 520419 520995 521033 520802 519739 517308 513482 508279 501852 495162 489430 484693
59571 484693 480009 475149 470858 467326 463917 460702 458709 458098 457630 456553 455614 455537 455930 456485 457833 460261
$$ packed form
59673E88508m014m787n923o497o054n186m538l969l236k612k287j923j430j360
59659E34692j917k353j966r38K65J440K145J844R79P94J369J222l71k061k455
59644E32689k094k171k525k357j956k182k867l054k367j078N21J949K403J734
59630E16645Q34L53j14r01j512j828k690m221m979l995k446j835j861j626j703
59615D88121l051m820n212l990k391j069K46J479K227K715L386L846L484K666
59601D87637K096J607P84J93N55J336J473J095J088J535J828J952K304K679K668
59586E10830K557K711K611J710N76L8k31j063k431l826n203o427o690n732m737
59571D84693m684m860m291l532l409l215j993o11m68j077r39p7L93N55J348K428
$$ plain form
59555 460261 462835 464675 466013 467261 468311 469584 472433 477508 483858 490506 497709 505831 514423 523481
59541 523481 534277 547682 563019 579879 599544 622539 645512 662540 669644 667103 658122 646723
59529 646723 636531 629788 626899 627268 630343 635396 641073 646074 649967 652719 654040 653819 652473 650071
59515 650071 645783 639051 630581 621322 611173 599685 587395 575395 564087 553368 543574 535286 528439
59502 528439 522448 516898 511608 506503 502030 499063 497711 496857 495554 494160 493327 492670 491382 489542 487889
59487 487889 486812 486361 486699 487661 488459 488688 489124 490709 493237 495819 498108 500301 502501 504820 507586 510706
59471 510706 513404 515271 516870 518668 520199 521054 521849 523261 524947 526477 528508 531939 536547 541555 546926
59456 546926 552991 559435 565797 572384 579536 586540 592512 597862 603667 609844 615078 618240 618864 616595
$$ packed form
59555D60261K574J840J338J248J050J273K849N075O350O648P203Q122Q592R058
59541E23481J0796J3405J5337J6860J9665K2995K2973J7028P104k541q981j1399
59529F46723j0192o743k889L69L075N053N677N001L893K752J321k21j346k402
59515F50071m288o732q470r259j0149j1488j2290j2000j1308j0719r794q288o847
59502E28439n991n550n290n105m473k967j352q54j303j394q33o57j288j840j653
59487D87889j077m51L38R62P98K29M36J585K528K582K289K193K200K319K766L120
59471E10706K698J867J599J798J531Q55P95J412J686J530K031L431M608N008N371
59456E46926O065O444O362O587P152P004N972N350N805O177N234L162O24k269
$$ plain form
59442 616595 611349 603870 595231 585948 576349 567368 560088 554811 551338 549609 549221 548992 548088 547169 547455
59427 547455 549197 552065 556356 562628 570677 580042 590992 603715 617154 630161 643309 657931 673670
59414 673670 688891 703592 719794 738053 754865 764615 763677 752417 734263 713639 694213 678086
59402 678086 666146 659027 657452 661563 669840 678487 682202 676739 661699 640728 618660 598617 581568
59389 581568 567385 555454 545081 536217 529425 524689 521040 517976 516293 516646 518177 519603 520924 522929
59375 522929 525706 528795 532283 536575 541452 546401 551475 556867 562095 566642 571021 576263 582697 589979
59361 589979 597753 605492 612432 618582 625099 632725 640757 648648 657553 668740 681343 693427 704728
59348 704728 716592 729572 742871 756004 769262 782321 793877 802911 809251 812839 813534 811624 807500
$$ packed form
59442F16595n246p479q639r283r599q981p280n277l473j729l88k29r04r19K86
59427E47455J742K868M291O272Q049R365J0950J2723J3439J3007J3148J4622J5739
59414F73670J5221J4701J6202J8259J6812R750r38j1260j8154k0624j9426j6127
59402F78086j1940p119j575M111Q277Q647L715n463j5040k0971k2068k0043j7049
59389E81568j4183j1931j0373q864o792m736l649l064j683L53J531J426J321K005
59375E22929K777L089L488M292M877M949N074N392N228M547M379N242O434P282
59361E89979P774P739O940O150O517P626Q032P891Q905J1187J2603J2084J1301
59348G04728J1864J2980J3299J3133J3258J3059J1556R034O340L588O95j910m124
$$ plain form
59335 807500 800950 791763 780725 768925 756408 742707 728394 714741 702069 689814 678125 667941
59323 667941 659361 651295 643046 635233 628938 624707 622370 621022 619370 616913 614535 613186 612524 611836 611631
59308 611631 613024 616068 620151 625587 633246 642840 653224 664424 677875 694362 712720 730414 744258
59295 744258 750969 748729 738641 723772 706772 689207 672457 657693 645067 634246 625547 619329
59283 619329 614734 610597 607276 605939 606366 607276 608685 611957 617403 623704 630092 637315 645883 654891 663164
59268 663164 670369 676588 681947 686910 691776 695739 697600 697362 695885 693092 688067 680896 672806 664379
59254 664379 655242 645589 636344 627633 618802 610199 603231 598266 594243 590769 588877 589130 590578 592237
59240 592237 594159 596546 599261 602655 607335 612626 616741 618935 619975 620175 618897 616483 614550 613356
$$ packed form
59335H07500o550r187j1038j1800j2517j3701j4313j3653j2672j2255j1689j0184
59323F67941q580q066q249p813o295m231k337j348j652k457k378j349o62o88k05
59308F11631J393L044M083N436P659R594J0384J1200J3451J6487J8358J7694J3844
59295G44258O711k240j0088j4869j7000j7565j6750j4764j2626j0821q699o218
59283F19329m595m137l321j337M27R10J409L272N446O301O388P223Q568R008Q273
59268F63164P205O219N359M963M866L963J861k38j477k793n025p171q090q427
59254F64379r137r653r245q711q831q603o968m965m023l474j892K53J448J659
59240E92237J922K387K715L394M680N291M115K194J040K00j278k414j933j194
$$ plain form
59226 613356 610773 605155 597666 590506 584250 578306 572692 567914 563972 560716 558573 557893 558241 559022 560082
59211 560082 561133 561601 561711 562700 565198 568308 571070 573763 576946 580134 582379 583512 584076 584617 585549 587044
59195 587044 588639 589698 590546 592317 595362 598771 601758 604418 606893 608955 610830 613172 615785 617601
59181 617601 618403 619193 620354 620843 619965 618629 617997 618156 618979 621071 624859 629676 634684 639885 645485 651204
59165 651204 656894 662894 669132 674778 679388 683385 686858 689004 689404 688732 687551 685573 682738 679820 677144
59150 677144 673953 669885 665905 662814 659925 656212 651786 647243 642521 637371 632155 627256 622373 617193
59136 617193 612072 607477 603552 600687 599463 599444 599117 597742 596225 595633 596046 597554 600957 606426 612643
59121 612643 618412 624234 631349 640121 650270 661774 674580 688233 702565 717976 734453 751245
$$ packed form
59226F13356k583n618p489p160o256n944n614m778l942l256k143o80L48P81J060
59211E60082J051M68J10R89K498L110K762K693L183L188K245J133N64N41R32J495
59195E87044J595J059Q48J771L045L409K987K660K475K062J875K342K613J816
59181F17601Q02P90J161M89q78j336o32J59Q23K092L788M817N008N201N600N719
59165F51204N690O000O238N646M610L997L473K146M00o72j181j978k835k918k676
59150F77144l191m068l980l091k889l713m426m543m722n150n216m899m883n180
59136F17193n121m595l925k865j224j9l27j375j517n92M13J508L403N469O217
59121F12643N769N822P115Q772J0149J1504J2806J3653J4332J5411J6477J6792
$$ plain form
59109 751245 768023 785172 802330 818050 831781 844845 858386 871602 883022 892306 899607 904360
59097 904360 906066 905340 903006 899018 893388 887241 881783 877058 872744 869247 866878 864803 861956 858184
59083 858184 853469 846958 837968 827201 815872 804325 792512 780999 770405 760515 750941 741936 733679
59070 733679 725604 717411 709926 703950 698973 693906 688281 681900 674279 665477 656648 648827 641908 635570
59056 635570 630199 626027 622368 618686 615472 613210 611570 610475 610726 612524 614561 615739 616606 617944 619189
59041 619189 619580 619725 620618 622073 623500 625239 627850 631016 634430 638770 644490 650747 656931 664223 674157
59026 674157 686543 700296 715327 732123 750374 769532 789812 811085 831510 848850 862451
59015 862451 872673 879352 882374 882865 882095 879926 875858 870845 866536 863467 861583 861686 864633 869718 875442
$$ packed form
59109G51245J6778J7149J7158J5720J3731J3064J3541J3216J1420R284P301M753
59097I04360J706p26k334l988n630o147n458m725m314l497k369k075k847l772
59083H58184m715o511q990j0767j1329j1547j1813j1513j0594r890r574r005q257
59070G33679q075q193p485n976m977n067n625o381p621q802q829p821o919o338
59056F35570n371m172l659l682l214k262j640j095K51J798K037J178Q67J338J245
59041F19189L91J45Q93J455J427J739K611L166L414M340N720O257O184P292R934
59026F74157J2386J3753J5031J6796J8251J9158K0280K1273K0425J7340J3601
59015H62451J0222O679L022M91p70k169m068n013m309l069j884J03K947N085N724
$$ plain form
59000 875442 881293 887260 892460 895906 897916 899025 898266 894344 887860 880451 872274 862224 850221 837392
58986 837392 824278 810679 797067 784424 772821 761747 751651 743621 737745 733296 730328 729627 731324
58973 731324 734921 740332 747497 755392 762888 770207 778110 786147 793295 799868 807124 815271 823423 831253
58959 831253 839076 846458 852238 855743 856771 854755 849349 841394 831933 820772 807401 792735 778368
58946 778368 764717 751518 739450 729458 721039 713179 706483 702353 700338 698377 695516 692373 689023
58933 689023 684593 679175 674187 670423 667297 664251 661313 658103 653851 648694 643666 639265 635262 631821
58919 631821 629372 627451 625117 622551 620864 620356 620358 620741 622234 625167 629140 633876 639279 644934 650765
58904 650765 657870 667460 679256 692104 705549 719450 732777 744490 755183 766219 777749 789208
$$ packed form
59000H75442N851N967N200L446K010J109p59l922o484p409q177j0050j2003j2829
58986H37392j3114j3599j3612j2643j1603j1074j0096q030n876m449k968p01J697
58973G31324L597N411P165P895P496P319P903Q037P148O573P256Q147Q152P830
58959H31253P823P382N780L505J028k016n406p955r461j1161j3371j4666j4367
58946G78368j3651j3199j2068r992q419p860o696m130k015j961k861l143l350
58933F89023m430n418m988l764l126l046k938l210m252n157n028m401m003l441
58919F31821k449j921k334k566j687n08KL83J493K933L973M736N403N655N831
58904F50765P105R590J1796J2848J3445J3901J3327J1713J0693J1036J1530J1459
$$ plain form
58892 789208 801250 815301 831545 849127 867972 888552 910102 930793 949403 965213 976832
58881 976832 983120 984966 984298 981578 975991 967472 956588 943036 926533 908771 892157 876902 861652
58868 861652 846613 833509 822590 812344 802265 793317 785412 777000 767532 757985 748577 738384 727616
58855 727616 717835 709352 700805 691857 683910 677450 671079 664034 657395 651847 646429 640572 635295 631186
58841 631186 627024 621633 615601 610094 605401 601532 598906 597569 596852 596443 596687 597552 598572 599933 602120
58826 602120 604359 605088 604185 603047 602318 601408 600396 600332 601239 601823 601703 601995 603122 603916 603529 602508 601416
58809 601416 600107 598812 598107 597374 595149 591503 588230 586244 584668 582911 581532 580481 578587 575557 572584
58794 572584 570245 567654 564388 561408 559373 557876 556908 557256 558930 561123 564179 569477 576768 583817 589467
$$ packed form
58892G89208J2042J4051J6244J7582J8845K0580K1550K0691J8610J5810J1619
58881I76832O288J846o68k720n587q519j0884j3552j6503j7762j6614j5255j5250
58868H61652j5039j3104j0919j0246j0079q948p905q412r468r547r408j0193j0768
58855G27616r781q483q547q948p947o460o371p045o639n548n418n857n277m109
58841F31186m162n391o032n507m693l869k626j337p17m09K44Q65J020J361K187
58826F02120K239P29r03j138p29r10j012o4R07N84j20K92J127P94l87j021j092
58809F01416j309j295p05p33k225l646l273j986j576j757j379j051j894l030k973
58794E72584k339k591l266k980k035j497r68L48J674K193L056N298P291P049N650
$$ plain form
58779 589467 594954 601491 608804 616850 626543 637546 647434 654263 658160 659372 656844 650064 640548 630254
58765 630254 620044 610577 602855 596825 591148 585351 580612 577625 575558 573986 573872 575516 577397 578246
58751 578246 578690 579797 581548 583589 585947 588366 590553 593560 598944 606082 612547 617819 624215 633274
58737 633274 643673 653820 664065 674972 685755 695999 706942 719438 732329 744072 754240
58726 754240 762374 767358 769167 769398 768951 767076 763682 760496 758781 758035 758040 759963 764103 768702 772234 774753
58710 774753 775925 774239 769609 764310 759651 753941 745285 734120 721421 706807 690244 673356 657142
58697 657142 640458 622540 604985 589498 575821 563555 553708 546568 540277 533539 527604 523648 520441
58684 520441 516708 513503 511992 511096 509692 509089 510777 513593 515627 517179 519516 522420 525454 530049 537777
$$ packed form
58779E89467N487O537P313Q046R693J1003R888O829L897J212k528o780r516j0294
58765F30254j0210r467p722o030n677n797m739k987k067j572j14J644J881Q49
58751E78246M44J107J751K041K358K419K187L007N384P138O465N272O396R059
58737F33274J0399J0147J0245J0907J0783J0244J0943J2496J2891J1743J0168
58726G54240Q134M984J809K31m47j875l394l186j715p46NJ923M140M599L532K519
58710G74753J172j686m630n299m659n710q656j1165j2699j4614j6563j6888j6214
58697F57142j6684j7918j7555j5487j3677j2266r847p140o291o738n935l956l207
58684E20441l733l205j511q96j404o03J688K816K034J552K337K904L034M595P728
$$ plain form
58669 537777 547900 558845 570769 584639 600265 617289 636413 657350 677008 691852 700759 703902
58657 703902 700884 692209 680716 669071 657307 644889 633264 623956 615957 607650 599723 593660 588952
58644 588952 584391 580598 578603 577300 574936 571892 569528 567650 565556 564173 564529 565365 564833 563372 562468
58629 562468 561849 560424 558749 558010 557740 557089 557190 559777 564445 569628 575160 581671 588775 596142 604911
58614 604911 615607 626053 633855 639543 644753 648896 650422 649834 648548 646058 641276 635496 630992 627616
58600 627616 623673 619185 615441 612160 608049 603436 599700 596878 594375 593074 594145 596765 599675 603912
58586 603912 611211 620736 630296 639904 651164 663848 675881 686175 694941 702013 707415 712743 719369
58573 719369 726072 730922 734599 739407 746086 754155 764242 777306 792577 808914 827131 848409 871596
$$ packed form
58669E37777J0123J0945J1924J3870J5626J7024J9124K0937J9658J4844Q907L143
58657G03902l018q675j1493j1645j1764j2418j1625r308p999q307p927o063m708
58644E88952m561l793j995j303k364l044k364j878k094j383L56Q36n32j461r04
58629E62468o19j425j675p39k70o51J01K587M668N183N532O511P104P367Q769
58614F04911J0696J0446P802N688N210M143J526n88j286k490m782n780m504l376
58600F27616l943m488l744l281m111m613l736k822k503j301J071K620K910M237
58586F03912P299R525R560R608J1260J2684J2033J0294Q766P072N402N328O626
58573G19369O703M850L677M808O679Q069J0087J3064J5271J6337J8217K1278K3187
$$ plain form
58560 871596 894712 917635 940489 961053 977110 990059 1002759 1014962 1024231 1030257 1034617 1037156
58548 1037156 1036199 1031766 1025172 1016138 1003607 988735 973723 958299 940754 921775 903840 887320
58536 887320 870534 853254 836907 821784 807251 794206 784121 776173 768497 761672 757786 756716
58524 756716 756578 757217 759910 764272 768756 773616 780073 787222 793065 797804 802701 806656 807502 805916 804256
58509 804256 802308 798004 791631 785350 779127 771175 761923 753516 745804 736959 727741 720873 716287 711132
58495 711132 704630 698930 695091 692165 690363 691125 693789 695927 697321 700112 705050 711057 718318 728113
58481 728113 739754 751317 763101 776666 790962 803325 813722 823794 832276 835929 834758 831768
58469 831768 827659 820492 810585 800946 792505 783546 774267 767297 763196 759941 757362 757624 760773 764289
$$ packed form
58560H71596K3116K2923K2854K0564J6057J2949J2700J2203R269O026M360K539
58548A037156r57m433o594r034j2531j4872j5012j5424j7545j8979j7935j6520
58536H87320j6786j7280j6347j5123j4533j3045j0085p948p676o825l886j070
58524G56716j38O39K693M362M484M860O457P149N843M739M897L955Q46j586j660
58509H04256j948m304o373o281o223p952r252q407p712q845r218o868m586n155
58495G11132o502n700l839k926j802P62K664K138J394K791M938O007P261R795
58481G28113J1641J1563J1784J3565J4296J2363J0397J0072Q482L653j171k990
58469H31768m109p167r907r639q441q959r279o970m101l255k579K62L149L516
$$ plain form
58455 764289 767602 772685 779658 786215 791856 798207 804652 808220 808366 807437 805983 802286 797002 793444 792473
58440 792473 791768 790794 791684 794581 796998 798660 802080 807503 812224 815820 821141 829160 837866 847222 860066
58425 860066 876884 894653 911995 930306 948564 962294 969329 971753 970879 965414 956002 946269 937627
58412 937627 927936 916775 906903 898891 889601 877842 866560 857666 849685 842217 837636 836533 836489 836964
58398 836964 840374 846776 852844 857755 864588 874086 882600 888191 893179 898586 901714 901550 901018 901492 900567
58383 900567 897583 895800 896580 896898 895193 894303 896111 898699 901181 905911 913397 920640 926898 935416 946957
58368 946957 957520 965194 973349 984164 994857 1003358 1011913 1021984 1031217 1038478 1046325 1055691 1063757
58355 1063757 1069704 1076596 1085018 1091227 1094319 1098599 1105845 1112087 1115398 1119913 1128373 1137499 1144756 1153079
$$ packed form
58455G64289L313N083O973O557N641O351O445L568J46r29j454l697n284l558r71
58440G92473p05r74Q90K897K417J662L420N423M721L596N321Q019Q706R356J2844
58425H60066J6818J7769J7342J8311J8258J3730P035K424q74n465r412r733q642
58412I37627r691j1161r872q012r290j1759j1282q894p981p468m581j103m4M75
58398H36964L410O402O068M911O833R498Q514N591M988N407L128j64n32M74r25
58383I00567k984j783P80L18j705q90J808K588K482M730P486P243O258Q518J1541
58368I46957J0563P674Q155J0815J0693Q501Q555J0071R233P261P847R366Q066
58355A063757N947O892Q422O209L092M280P246O242L311M515Q460R126P257Q323
$$ plain form
58341 1153079 1164828 1177550 1189780 1204634 1223623 1243358 1262127 1282998 1306499 1327265 1342203
58330 1342203 1355042 1368496 1379148 1384578 1388369 1393199 1396130 1395614 1396046 1400413 1405455 1408877 1414078 1422880
58316 1422880 1431216 1437210 1445738 1459611 1474082 1485727 1498846 1517105 1536772 1554380 1573187 1595796
58304 1595796 1618274 1637954 1659080 1684303 1708745 1729057 1749926 1774809 1798921 1818568 1838666
58293 1838666 1863363 1888081 1908762 1930185 1956732 1983778 2006973 2031406 2062577 2096743 2129252
58282 2129252 2163900 2204747 2247234 2286965 2328852 2377862 2429146 2477089 2525607 2579566 2634743
58271 2634743 2686497 2739618 2799140 2860191 2917503 2976057 3041619 3109916 3176077 3245216 3322386
58260 3322386 3401762 3477408 3554622 3638618 3722473 3799164 3875065 3958250 4044079 4126200 4211101
$$ packed form
58341A153079J1749J2722J2230J4854J8989J9735J8769K0871K3501K0766J4938
58330A342203J2839J3454J0652N430L791M830K931n16M32M367N042L422N201Q802
58316A422880Q336N994Q528J3873J4471J1645J3119J8259J9667J7608J8807K2609
58304A595796K2478J9680K1126K5223K4442K0312K0869K4883K4112J9647K0098
58293A838666K4697K4718K0681K1423K6547K7046K3195K4433L1171L4166L2509
58282B129252L4648M0847M2487L9731M1887M9010N1284M7943M8518N3959N5177
58271B634743N1754N3121N9522O1051N7312N8554O5562O8297O6161O9139P7170
58260C322386P9376P5646P7214Q3996Q3855P6691P5901Q3185Q5829Q2121Q4901
$$ plain form
58249 4211101 4307263 4410377 4513928 4623655 4746531 4876502 5006641 5144114 5297192 5459180
58239 5459180 5621856 5792668 5981339 6181915 6386125 6601547 6837567 7086714 7339957
58230 7339957 7607048 7900916 8215810 8542514 8890612 9272736 9681820 10108285 10564461
58221 10564461 11066646 11609014 12182098 12800304 13482695 14224176 15016252 15878182 16835359
58212 16835359 17886247 19025644 20280779 21687492 23252552 24980366 26914768 29111193
58204 29111193 31592766 34383434 37561103 41229324 45469505 50383635 56155819 63008393
58196 63008393 71134754 80750821 92170932 105749018 121808499 140758351 163230821
58189 163230821 189953955 221497854 258155742 299597049 343763083 385699901 418108390
$$ packed form
58249D211101R6162J03114J03551J09727J22876J29971J30139J37473J53078J61988
58239E459180J62676J70812J88671K00576K04210K15422K36020K49147K53243
58230G339957K67091K93868L14894L26704L48098L82124M09084M26465M56176
58221A0564461N02185N42368N73084O18206O82391P41481P92076Q61930R57177
58212A6835359J050888J139397J255135J406713J565060J727814J934402K196425
58204B9111193K481573K790668L177669L668221M240181M914130N772184O852574
58196F3008393Q126361R616067J1420111J3578086J6059481J8949852K2472470
58189A63230821K6723134L1543899L6657888M1441307M4166034M1936818L2408489
$$ plain form
58182 418108390 434212179 431000384 410234210 376802433 336303959 293573929 252218811
58175 252218811 214500256 181408470 153055784 129163474 109294763 92889095 79352772
58168 79352772 68190006 59005115 51425074 45109114 39813723 35373069 31626863 28422824
58160 28422824 25666431 23304066 21265417 19470384 17877390 16474509 15231780 14105177
58152 14105177 13077178 12151662 11316288 10546963 9840859 9208981 8642786 8120743 7640438
58143 7640438 7212641 6830612 6475529 6145715 5851054 5584160 5325325 5071506 4834043
58134 4834043 4612331 4395398 4185459 3994940 3822972 3657687 3498557 3354546 3223498
58125 3223498 3094923 2970221 2859333 2760173 2661460 2563306 2475402 2397285 2319556 2242489 2174700
$$ packed form
58182D18108390J6103789l211795k0766174l3431777m0498474m2730030m1355118
58175B52218811l7718555l3091786k8352686k3892310j9868711j6405668j3536323
58168G9352772j1162766r184891p580041o315960n295391m440654l746206l204039
58160B8422824k756393k362365k038649j795033j592994j402881j242729j126603
58152A4105177j027999r25516q35374p69325p06104o31878n66195n22043m80305
58143G640438m27797l82029l55083l29814k94661k66894k58835k53819k37463
58134D834043k21712k16933k09939j90519j71968j65285j59130j44011j31048
58125C223498j28575j24702j10888r9160r8713r8154q7904p8117p7729p7067o7789
$$ plain form
58114 2174700 2115097 2054223 1992034 1936918 1888446 1838021 1785409 1738191 1695897 1650735 1603108
58103 1603108 1560804 1523640 1484124 1442524 1406267 1375116 1341749 1306552 1277181 1253626 1228039
58092 1228039 1199580 1175507 1157033 1137589 1115843 1097529 1083551 1068625 1052484 1040310 1031278
58081 1031278 1018314 999976 981361 962925 939851 912960 888916 868782 847239 823799 803881
58070 803881 788066 771114 752688 738533 729803 721306 711424 703919 698954 692188 683851 679071 678026
58057 678026 675109 668800 663063 658145 649555 637373 627192 620453 612908 603860 597717 594922 590444 582981
58043 582981 576898 573359 568258 560703 554913 551682 546355 537471 529384 524164 518661 511637 506114 502539
58029 502539 497101 488868 481364 475267 466904 455874 446823 441595 436717 430542 425770 422907 418436 411698
$$ packed form
58114B174700n9603o0874o2189n5116m8472n0425n2612m7218m2294m5162m7627
58103A603108m2304l7164l9516m1600l6257l1151l3367l5197k9371k3555k5587
58092A228039k8459k4073j8474j9444k1746j8314j3978j4926j6141j2174r032
58081A031278j2964j8338j8615j8436k3074k6891k4044k0134k1543k3440j9918
58070H03881j5815j6952j8426j4155q730q497r882p505m965o766q337m780j045
58057F78026k917o309n737m918q590j2182j0181o739p545r048o143k795m478p463
58043E82981o083l539n101p555n790l231n327q884q087n220n503p024n523l575
58029E02539n438q233p504o097q363j1030r051n228m878o175m772k863m471o738
$$ plain form
58015 411698 406725 405059 403378 400221 398354 398517 397612 395127 394655 396937 398097 396905 397080 400108 402507
58000 402507 402664 403756 407283 410131 410815 412390 416416 420021 421666 423795 427063 427886 424684 420875 418871
57985 418871 416729 413369 411324 411345 409914 405251 400407 397432 393811 387816 382090 378615 375177 370148 365924
57970 365924 364212 362546 358822 354968 352853 350761 347143 343894 342843 342740 342420 343181 345443 346894 346484
57955 346484 346486 348340 350364 351726 354447 359130 363039 364901 367434 372569 378398 383500 389994 399384 409434
57940 409434 418137 427015 437663 448654 458704 469337 481743 494442 506518 519462 533416 545281
57928 545281 553107 558585 562755 563228 558500 551134 543624 534674 522501 508393 494090 479024 462942
57915 462942 447928 434984 421969 407626 394337 384198 375857 368040 362596 360961 360963 360333 360195 361997
$$ packed form
58015D11698m973j666j681l157j867J63r05k485m72K282J160j192J75L028K399
58000D02507J57J092L527K848O84J575M026L605J645K129L268Q23l202l809k004
57985D18871k142l360k045K1j431m663m844k975l621n995n726l475l438n029m224
57970C65924j712j666l724l854k115k092l618l249j051j03l20P61K262J451m10
57955C46484KJ854K024J362K721M683L909J862K533N135N829N102O494R390J0050
57940D09434Q703Q878J0648J0991J0050J0633J2406J2699J2076J2944J3954J1865
57928E45281P826N478M170M73m728p366p510q950j2173j4108j4303j5066j6082
57915D62942j5014j2944j3015j4343j3289j0139q341p817n444j635Ko30j38J802
$$ plain form
57901 361997 364153 364976 365873 368420 371102 372137 372831 375078 378176 381053 384867 390401 395653 399093 402660
57886 402660 408475 415142 420274 424162 427948 430721 431458 431417 431583 430131 425334 418607 411804 403984 393867
57871 393867 383008 373383 364139 353849 343855 336252 330574 325455 321559 319910 319299 318287 317908 319598
57857 319598 322350 324610 327021 330647 334561 337863 341945 347909 353858 357566 359766 361961 363152 361781
57843 361781 358893 356341 353704 349938 346159 343772 341661 338242 334500 332036 329948 326794 323877 323419
57829 323419 325002 326832 328998 332440 336224 338927 341390 345154 349544 353174 356908 362386 368975 375013
57815 375013 380723 387022 392791 396152 397160 396556 393352 386605 378121 370471 363623 356338 349350 344097
57801 344097 339728 334593 329495 326280 324292 321416 317598 314237 311116 307111 303114 301054 300636 299989 298928
$$ packed form
57901C61997K156Q23Q97K547K682J035O94K247L098K877L814N534N252L440L567
57886D02660N815O667N132L888L786K773P37m1J66j452m797o727o803p820j0117
57871C93867j0859r625r244j0290r994p603n678n119l896j649o11j012l79J690
57857C19598K752K260K411L626L914L302M082N964N949L708K200K195J191j371
57843C61781k888k552k637l766l779k387k111l419l742k464k088l154k917m58
57829C23419J583J830K166L442L784K703K463L764M390L630L734N478O589O038
57815C75013N710O299N769L361J008o04l204o747q484p650o848p285o988n253
57801C44097m369n135n098l215j988k876l818l361l121m005l997k060m18o47j061
$$ plain form
57786 298928 298757 299541 300313 301345 303536 306322 308810 312093 317701 324636 330814 336555 343753 352275 360110
57771 360110 366496 372032 376281 378074 377819 376902 375269 372083 368145 365049 362538 359219 355221 351593 347833
57756 347833 342710 336889 332074 328155 323824 319356 316097 313848 311357 308718 306671 304322 300414 296046
57742 296046 293184 291119 287422 281872 276420 271788 267188 263021 260669 259674 258120 255740 253867 252517
57728 252517 250460 248032 246910 247093 246898 245974 245547 245758 245560 245177 245822 246918 246466 244236 241870 239817
57712 239817 237040 233774 231550 230237 227953 224252 220633 217605 214108 210178 207276 205468 203148 200137
57698 200137 198259 198100 197934 196711 195576 195564 196138 196896 198492 201044 203608 205892 208531 211361 213549 215694
57682 215694 219478 224886 230209 235262 242152 252293 265107 280367 299307 322672 350031 381919
$$ packed form
57786B98928j71P84P72J032K191K786K488L283N608O935O178N741P198Q522P835
57771C60110O386N536M249J793k55r17j633l186l938l096k511l319l998l628l760
57756C47833n123n821m815l919m331m468l259k249k491k639k047k349l908m368
57742B96046k862k065l697n550n452m632m600m167k352r95j554k380j873j350
57728B52517k057k428j122J83j95r24m27K11j98l83O45J096m52k230k366k053
57712B39817k777l266k224j313k284l701l619l028l497l930k902j808k320l011
57698B00137j878j59j66j223j135j2N74P58J596K552K564K284K639K830K188K145
57682B15694L784N408N323N053O890J0141J2814J5260J8940K3365K7359L1888
$$ plain form
57670 381919 420457 467052 521687 585045 658213 738060 814247 872399 900275 892177 850824 786530
57658 786530 712451 638504 569469 507677 454896 411344 375534 346282 323321 305524 290623
57647 290623 277402 266376 257753 250574 244342 239529 235912 232289 228394 225206 222990 221016 219545 219850
57633 219850 221708 223088 223025 222654 222771 222575 221599 220628 219851 218209 215568 213478 212745 212166 210612 208595 206887
57616 206887 205408 204196 203674 203266 201714 199350 198045 198255 198330 197475 196979 197568 197922 197029 195841 195294 194770
57599 194770 193757 193038 192989 192620 191486 190581 190200 189033 186629 184566 183736 182633 179986 177090 175644 175120
57583 175120 174127 172836 172109 171592 170458 168978 167785 166625 165157 163847 162924 161693 160039 159229 160000 161198
57567 161198 161475 160968 160171 158704 156516 154815 154461 154704 154685 154783 155303 155406 154642 154040 154349 154729 154494 154527 155542
$$ packed form
57670C81919L8538M6595N4635O3358P3168P9847P6187N8152K7876q098m1353o4294
57658G86530p4079p3947o9035o1792n2781m3552l5810k9252k2961j7797j4901
57647B90623j3221j1026q623p179o232m813l617l623l895l188k216j974j471L05
57633B19850J858J380o3l71J17j96r76r71p77j642k641k090p33n79j554k017j708
57616B06887j479j212n22m08j552k364j305K10P5q55m96N89L54q93j188n47n24
57599A94770j013p19m9l69j134r05l81j167k404k063q30j103k647k896j446n24
57583A75120r93j291p27n17j134j480j193j160j468j310r23j231j654q10P71J198
57567A61198K77n07p97j467k188j701l54K43j9R8N20J03p64o02L09L80k35L3J015
$$ plain form
57548 155542 156594 156885 157431 159268 161549 163103 164482 166666 169181 171291 173689 177072 180291 181947 182749
57533 182749 184339 186643 188321 189026 189420 189625 189374 189105 189389 189938 190421 191339 192700 193012 191265 188904 188118
57516 188118 189086 190555 192123 194028 195586 195938 195843 196806 198803 200585 201778 202947 204001 204307 204138 204342
57500 204342 204760 204486 203525 202726 202216 201278 199748 198300 197421 197141 197544 198547 199415 199459 198942 198496 198150 197754
57482 197754 197690 198172 198528 198260 198099 198870 199963 200179 199597 199431 200427 202358 204592 206273 206603 205878 205546 206389
57464 206389 207534 208158 208991 210882 213019 214161 214733 216123 218569 221348 224402 228154 232143 235372 237737
57449 237737 239863 241948 244016 246684 250312 253899 256214 257581 259224 261383 263494 265720 268699 272096
57435 272096 274884 277014 279458 282644 285974 288860 291329 293772 296803 300927 305632 309489 311969 314363
$$ packed form
57548A55542J052K91N46J837K281J554J379K184K515K110K398L383L219J656Q02
57533A82749J590K304J678P05L94K05k51k69K84N49M83R18J361L12j747k361p86
57516A88118R68J469J568J905J558L52r5R63J997J782J193J169J054L06j69K04
57500B04342M18k74r61p99n10r38j530j448q79k80M03J003Q68M4n17m46l46l96
57482A97754o4M82L56k68j61P71J093K16n82j66R96J931K234J681L30p25l32Q43
57464B06389J145O24Q33J891K137J142N72J390K446K779L054L752L989L229K365
57449B37737K126K085K068K668L628L587K315J367J643K159K111K226K979L397
57435B72096K788K130K444L186L330K886K469K443L031M124M705L857K480K394
$$ plain form
57421 314363 318007 322473 326562 330030 333089 335266 336248 337018 338652 340746 342472 344354 347368 351064 354288
57406 354288 357192 360849 365386 370045 374514 378740 382061 384171 386333 389955 394610 399095 403697 409446
57392 409446 415840 421403 426120 431233 436930 442314 447515 453761 461307 469137 476757 484509 492147 498908
57378 498908 505016 511441 518172 524394 530244 536698 543893 551347 559612 569654 580623 590354 598287 605925
57364 605925 614208 622454 630238 638225 646547 654217 660844 667349 674434 681853 689649 698574 708750 719396
57350 719396 730268 741927 754257 766324 778087 790640 804313 818154 831742 845880 860895
57339 860895 875891 890353 904958 920102 935077 949463 963927 978861 993511 1007236 1020499
57328 1020499 1033948 1047604 1061547 1076182 1091311 1106102 1120523 1135654 1152072 1169183 1186625
$$ packed form
57421C14363L644M466M089L468L059K177R82P70J634K094J726J882L014L696L224
57406C54288K904L657M537M659M469M226L321K110K162L622M655M485M602N749
57392D09446O394N563M717N113N697N384N201O246P546P830P620P752P638O761
57378D98908O108O425O731O222N850O454P195P454Q265J0042J0969R731P933P638
57364F05925Q283Q246P784P987Q322P670O627O505P085P419P796Q925J0176J0646
57350G19396J0872J1659J2330J2067J1763J2553J3673J3841J3588J4138J5015
57339H60895J4996J4462J4605J5144J4975J4386J4464J4934J4650J3725J3263
57328A020499J3449J3656J3943J4635J5129J4791J4421J5131J6418J7111J7442
$$ plain form
57317 1186625 1205068 1224961 1245662 1266446 1287264 1308014 1328202 1347872 1367744 1387989 1408043
57306 1408043 1428048 1449117 1471667 1494828 1518097 1542125 1567178 1592338 1617181 1642848 1670310
57295 1670310 1698720 1726653 1754097 1782074 1811060 1840887 1871670 1903733 1936845 1970193 2003037
57284 2003037 2035184 2067255 2100522 2135768 2172123 2207816 2242155 2275981 2310207 2345013 2380623
57273 2380623 2417588 2455942 2495234 2535710 2578269 2622881 2668255 2713581 2759387 2806186 2853426
57262 2853426 2900407 2947102 2993488 3039185 3084388 3130112 3176867 3224094 3271480 3319806 3369815
57251 3369815 3421174 3473170 3525597 3578462 3631636 3685256 3739608 3794276 3848341 3901654 3954889
57240 3954889 4008130 4060626 4112273 4164062 4216706 4270115 4324600 4381141 4439931 4500072 4561373
$$ packed form
57317A186625J8443J9893K0701K0784K0818K0750K0188J9670J9872K0245K0054
57306A408043K0005K1069K2550K3161K3269K4028K5053K5160K4843K5667K7462
57295A670310K8410K7933K7444K7977K8986K9827L0783L2063L3112L3348L2844
57284B003037L2147L2071L3267L5246L6355L5693L4339L3826L4226L4806L5610
57273B380623L6965L8354L9292M0476M2559M4612M5374M5326M5806M6799M7240
57262B853426M6981M6695M6386M5697M5203M5724M6755M7227M7386M8326N0009
57251C369815N1359N1996N2427N2865N3174N3620N4352N4668N4065N3313N3235
57240C954889N3241N2496N1647N1789N2644N3409N4485N6541N8790O0141O1301
$$ plain form
57229 4561373 4625080 4692129 4761959 4833629 4906593 4979699 5050990 5119561 5186310 5251975 5315766
57218 5315766 5376858 5435811 5493359 5549046 5602220 5653312 5703100 5751743 5799545 5847570 5896541
57207 5896541 5946179 5996520 6048570 6102585 6157007 6210457 6263699 6318338 6374615 6431775 6489682
57196 6489682 6548653 6608426 6668554 6729167 6790299 6851178 6911136 6970408 7029057 7086002 7140116
57185 7140116 7191381 7239917 7284894 7325528 7362211 7395495 7424913 7449999 7471628 7491227 7509602
57174 7509602 7527627 7546890 7568222 7590572 7612902 7636331 7662893 7692986 7725626 7760421 7797567
57163 7797567 7836608 7877123 7920390 7968667 8022778 8081648 8143819 8207883 8271483 8331281 8384158
57152 8384158 8427635 8459464 8477916 8482381 8472791 8448859 8410926 8361265 8303564 8241344 8177614 8115359
$$ packed form
57229D561373O3707O7049O9830P1670P2964P3106P1291O8571O6749O5665O3791
57218E315766O1092N8953N7548N5687N3174N1092M9788M8643M7802M8025M8971
57207E896541M9638N0341N2050N4015N4422N3450N3242N4639N6277N7160N7907
57196F489682N8971N9773O0128O0613O1132O0879N9958N9272N8649N6945N4114
57185G140116N1265M8536M4977M0634L6683L3284K9418K5086K1629J9599J8375
57174G509602J8025J9263K1332K2350K2330K3429K6562L0093L2640L4795L7146
57163G797567L9041M0515M3267M8277N4111N8870O2171O4064O3600N9798N2877
57152H384158M3477L1829J8452M465r590k3932l7933m9661n7701o2220o3730o2255
$$ plain form
57140 8115359 8057044 8003720 7955291 7911101 7869379 7826823 7780029 7727131 7667424 7600319 7526105
57129 7526105 7447369 7368443 7293558 7226092 7168514 7121355 7082228 7046764 7010374 6968781 6918327
57118 6918327 6857659 6789076 6717186 6646417 6580322 6521965 6473325 6434692 6406091 6389114 6386518
57107 6386518 6400707 6433842 6488944 6569816 6680618 6826884 7016706 7260243 7569189 7958015
57097 7958015 8444918 9050385 9795902 10705256 11805368 13123207 14681624 16498388 18586306
57088 18586306 20949912 23579453 26444979 29489860 32625671 35738653 38712821 41454902
57080 41454902 43899897 45997385 47699534 48962652 49751534 50035413 49783680 48974992 47615594
57071 47615594 45748786 43447032 40795960 37883566 34798169 31629808 28468982 25400952
$$ packed form
57140H115359n8315n3324m8429m4190m1722m2556m6794n2898n9707o7105p4214
57129G526105p8736p8926p4885o7466n7578m7159l9127l5464l6390m1593n0454
57118F918327o0668o8583p1890p0769o6095n8357m8640l8633k8601j6977k596
57107F386518J4189L3135N5102Q0872J10802J46266J89822K43537L08946L88826
57097G958015M86903O05467P45517R09354J100112J317839J558417J816764K087918
57088A8586306K363606K629541K865526L044881L135811L112982K974168K742081
57080D1454902K444995K097488J702149J263118P88882K83879k51733q08688j359398
57071D7615594j866808k301754k651072k912394l085397l168361l160826l068030
$$ plain form
57063 25400952 22498239 19815153 17385883 15225200 13330993 11688677 10276365 9068733
57055 9068733 8039255 7162206 6414522 5776199 5229401 4758117 4348795 3990598 3674975
57046 3674975 3395449 3147365 2926733 2729239 2551045 2390070 2245339 2115357 1998296
57037 1998296 1893524 1801400 1721420 1651956 1592168 1543027 1506121 1482460 1472881 1478890 1502648
57026 1502648 1545468 1604032 1665824 1709534 1714153 1670673 1585706 1474785 1353578 1233891 1123284
57015 1123284 1025189 939867 866644 805040 753819 710583 673225 640862 612942 588682 567945
57004 567945 551333 538564 527911 518018 509207 502227 496757 491952 487513 483473 479799 476882 475560
56991 475560 475964 477193 478694 481044 484816 489727 495696 503710 514635 527664 540464 550141 553701 548775
$$ packed form
57063B5400952k902713k683086k429270k160683j894207j642316j412312j207632
57055I068733j029478q77049p47684o38323n46798m71284m09322l58197l15623
57046C674975k79526k48084k20632j97494j78194j60975j44731j29982j17061
57037A998296j04772r2124p9980o9464n9788m9141l6906k3661r579O009K3758
57026A502648M2820N8564O1792M3710M619m3480q4967j10921j21207j19687j10607
57015A123284r8095q5322p3223o1604n1221m3236l7358l2363k7920k4260k0737
57004E67945j6612j2769j0653r893q811o980n470m805m439m040l674k917j322
56991D75560M04J229J501K350L772M911N969Q014J0925J3029J2800R677L560m926
$$ plain form
56977 548775 535059 514763 491091 466647 443279 422262 403932 387895 374215 363727 356860 353078
56965 353078 351900 353537 358012 364710 373444 385150 400893 420980 445295 473131 501732 525960
56953 525960 540576 542697 532109 510637 482057 451352 422473 396892 374738 356456 342560 332651
56941 332651 325881 322101 321773 325130 332081 342542 356311 373076 393062 417295 446628 480488 516322
56928 516322 549445 573537 582796 574904 551902 518301 478998 438595 400862 367672 339064 314705
56916 314705 294506 277749 263117 250261 240073 232672 226441 219988 213860 209210 205865 202959 200584
56903 200584 199473 199639 200490 201868 204012 206894 210399 214726 219934 225697 232126 240087 249959 260914
56889 260914 272322 285141 300981 320358 342541 366130 388624 406250 415761 416422 409627 397194
$$ packed form
56977E48775j3716k0296k3672k4444k3368k1017j8330j6037j3680j0488o867l782
56965C53078j178J637M475O698Q734J1706J5743K0087K4315K7836K8601K4228
56953E25960J4616K121j0588k1472k8580l0705k8879k5581k2154j8282j3896r909
56941C32651o770l780l28L357O951J0461J3769J6765J9986K4233K9333L3860L5834
56928E16322L3123K4092R259p892k3002l3601l9303m0403l7733l3190k8608k4359
56916C14705k0199j6757j4632j2856j0188p401o231o453o128m650l345k906k375
56903B00584j111J66Q51J378K144K882L505M327N208N763O429P961R872J0955
56889B60914J1408J2819J5840J9377K2183K3589K2494J7626R511O61o795j2433
$$ plain form
56877 397194 381007 363635 347850 335336 326490 321181 319005 319274 321659 326722 335250 347454 363484
56864 363484 384195 410619 442971 480956 524668 574173 627781 680689 725179 752751 757828 740808
56852 740808 707530 665485 620767 577913 540452 510186 486890 469931 459686 456743 460727 471036
56840 471036 488025 512548 545038 586046 636871 698551 770693 851911 939763 1028108 1104909
56829 1104909 1155234 1168341 1142763 1085799 1009306 925180 842405 766311 699677 643938 599401
56818 599401 565307 540602 524511 516220 514867 520412 533867 556062 586864 626136 674518 732141
56806 732141 796603 862196 920151 959712 971408 951879 905884 843043 772855 702501 637064
56795 637064 579515 530645 490232 458151 433911 416131 403582 396065 393410 394663 399465 409322
$$ packed form
56877C97194j6187j7372j5785j2514q846n309k176K69K385N063Q528J2204J6030
56864C63484K0711K6424L2352L7985M3712M9505N3608N2908M4490K7572N077j7020
56852G40808l3278m2045m4718m2854l7461l0266k3296j6959j0245k943L984J0309
56840D71036J6989K4523L2490M1008N0825O1680P2142Q1218Q7852Q8345P6801
56829A104909N0325J3107k5578n6964p6493q4126q2775p6094o6634n5739m4537
56818E99401l4094k4705j6091q291j353N545J3455K2195L0802L9272M8382N7623
56806G32141O4462O5593N7955L9561J1696j9529m5995o2841p0188p0354o5437
56795F37064n7549m8870m0413l2081k4240j7780j2549p517k655J253M802R857
$$ plain form
56783 409322 426074 449755 479052 512736 548674 581850 605276 613414 604325 579491 543076 500874
56771 500874 458091 417452 379818 346009 317023 293038 273443 257654 245015 234402 224999 217099
56759 217099 211224 206976 203575 200781 198277 195008 190378 185334 181003 177028 172594 168224 164938 162304
56745 162304 159086 155414 152684 151583 151672 152510 153690 154197 153343 152024 151585 151774 151393 150476 150085 150255 150020
56728 150020 149368 149355 150220 151080 151603 152338 153208 153282 152353 151379 151081 151305 151869 152853 154008 154968 155995 157425
56710 157425 158677 159019 158958 159468 160261 160396 160237 161039 162704 163741 163497 162778 162218 161642 161103 160893 160457 158971
56692 158971 157120 156573 157510 158310 157946 157110 156681 156693 157084 157961 158805 158834 158357 158343 158619 158139 157088 156962 158288
56673 158288 159991 161304 162561 163765 164173 163839 163816 164313 164282 163404 162779 163050 163499 163713 164533 166533 168991
$$ packed form
56783D09322J6752K3681K9297L3684L5938L3176K3426Q138r089k4834l6415m2202
56771E00874m2783m0639l7634l3809k8986k3985j9595j5789j2639j0613r403p900
56759B17099n875m248l401k794k504l269m630n044m331l975m434m370l286k634
56745A62304l218l672k730j101Q9Q38J180N07q54j319m39J89l81r17l91J70k35
56728A50020o52j3Q65Q60N23P35Q70P4r29r74k98K24N64R84J155R60J027J430
56710A57425J252L42o1N10P93J35j59Q02J665J037k44p19n60n76n39k10m36j486
56692A58971j851n47R37Q00l64q36m29J2L91Q77Q44K9m77j4K76m80j051j26J326
56673A58288J703J313J257J204M08l34k3M97l1q78o25K71M49K14Q20K000K458
$$ plain form
56656 168991 171156 173264 175591 177812 179934 182671 186224 189810 192856 195584 198132 200341 202649 205829
56642 205829 209578 212757 215203 217790 220494 222135 222292 221749 220746 218681 215929 213860 212460 210005 205935
56627 205935 202002 199514 197449 194450 190872 187513 184014 179984 176315 173950 172446 170891 169171 167412
56613 167412 165389 163433 162630 163144 163597 163093 162528 162891 163564 163409 162387 161155 160173 160060 161555 164153 166021
56596 166021 166163 165491 165072 164788 164582 165353 167430 169604 170879 171844 173258 174688 175786 177425 180188 183019
56580 183019 184734 185696 186694 187453 187634 188090 189652 191687 193245 194609 196375 198053 199024 199940 201778 204393
56564 204393 207340 211220 216813 223662 230825 238336 246717 255769 265003 274501 284221 293286 301115 308503
56550 308503 316395 324317 331141 336713 341624 346025 349645 352370 353933 353705 351595 348483 345113 341417
$$ packed form
56656A68991K165K108K327K221K122K737L553L586L046K728K548K209K308L180
56642B05829L749L179K446K587K704J641J57n43j003k065k752k069j400k455m070
56627B05935l933k488k065k999l578l359l499m030l669k365j504j555j720j759
56613A67412k023j956q03N14M53n04n65L63O73j55j022j232r82j13J495K598J868
56596A66021J42o72m19k84k06P71K077K174J275R65J414J430J098J639K763K831
56580A83019J715R62R98P59J81M56J562K035J558J364J766J678R71R16J838K615
56564B04393K947L880N593O849P163P511Q381R052R234R498R720R065P829P388
56550C08503P892P922O824N572M911M401L620K725J563k28k110l112l370l696
$$ plain form
56536 341417 337394 333513 329603 324587 318057 310886 303617 295662 286936 278687 271670 265015 257994 251439
56522 251439 246191 241706 237462 234192 232289 230468 227555 224339 222085 220489 218563 216283 213908 210947
56508 210947 207333 204389 203073 202450 201327 200080 199334 198319 196307 194349 193672 193558 192667 191348 190782 190897
56492 190897 190992 191338 192308 192910 192070 190458 189277 188328 187081 186542 187967 190631 192852 194380 195885 197036
56476 197036 197120 196770 197038 197504 197233 196791 197282 198184 198168 197401 197088 197413 197841 198734 200684 202931 204367 205395
56458 205395 206946 208551 209336 209969 211413 212660 212042 210047 208517 207730 206650 205410 205041 205189 204625 203712
56442 203712 203985 205503 206930 207989 209520 211333 212386 212964 214337 216260 217082 216404 215516 215128 214755 214407
56426 214407 214815 215861 216590 216884 217378 217908 217820 217577 218122 218903 218546 217238 216474 216642 216905 217234 218340 219677
$$ packed form
56536C41417m023l881l910n016o530p171p269p955q726q249p017o655p021o555
56522B51439n248m485m244l270j903j821k913l216k254j596j926k280k375k961
56508B10947l614k944j316o23j123j247p46j015k012j958o77j14q91j319n66J15
56492A90897R5L46R70O02q40j612j181r49j247n39J425K664K221J528J505J151
56476A97036Q4l50K68M66k71m42M91R02j6p67l13L25M28Q93J950K247J436J028
56458B05395J551J605P85O33J444J247o18j995j530p87j080j240l69J48n64r13
56442B03712K73J518J427J059J531J813J053N78J373J923Q22o78q88l88l73l48
56426B14407M08J046P29K94M94N30q8k43N45P81l57j308p64J68K63L29J106J337
$$ plain form
56408 219677 219764 218605 217836 218295 219283 220236 221297 222291 222900 223688 225279 226835 227202 227110 228230 230456 232172
56391 232172 232847 233255 233561 233406 233518 234892 236711 237396 237409 238580 240942 242786 243664 244761 246372 247617
56375 247617 248680 250747 253523 255317 255747 255987 256315 255938 255290 255804 257173 257484 256429 255765 256221 256543 256119
56358 256119 255968 256441 256353 255135 253720 252699 251616 250523 250156 250294 249976 249547 250332 252213 253739 254675 256087
56341 256087 257939 259080 259707 261231 263648 265648 267305 269794 272454 273285 272683 273381 276125 278598 279432
56326 279432 280046 281536 282891 283604 285088 288064 291116 293235 295355 298078 300229 300992 301364 302312 303448
56311 303448 304457 305882 307715 309247 310844 313663 317143 319194 319443 319871 321701 324135 326639 329714 332800
56296 332800 334263 334202 334589 335927 336576 336130 336533 338944 342307 345869 350199 354905 358359 360627 363737 368117
$$ packed form
56408B19677Q7j159p69M59R88R53J061R94O09P88J591J556L67r2J120K226J716
56391B32172O75M08L06j55J12J374J819O85J3J171K362J844Q78J097J611J245
56375B47617J063K067K776J794M30K40L28l77o48N14J369L11j055o64M56L22m24
56358B56119j51M73q8j218j415j021j083j093l67J38l18m29P85J881J526R36J412
56341B56087J852J141O27J524K417K000J657K489K660Q31o02O98K744K473Q34
56326B79432O14J490J355P13J484K976L052K119K120K723K151P63L72R48J136
56311C03448J009J425J833J532J597K819L480K051K49M28J830K434K504L075L086
56296C32800J463o1L87J338O49m46M03K411L363L562M330M706L454K268L110M380
$$ plain form
56280 368117 371878 374510 378045 383483 389336 394895 401537 409408 416232 421049 425914 432321 439139 445738
56266 445738 453863 464541 476175 487523 499592 512921 526171 539296 554967 574820 597265 620910
56254 620910 647080 677000 709663 744626 783865 828589 877147 928194 982890 1041695 1102084
56243 1102084 1161940 1222310 1284205 1345363 1402708 1455381 1502865 1542775 1573087 1594191 1606436
56232 1606436 1608142 1598407 1579324 1553146 1519757 1479219 1434110 1386887 1337482 1285867 1234350 1184873
56220 1184873 1136595 1088610 1042436 999395 958161 917494 878855 843798 811328 780343 752109
56209 752109 727676 705376 683479 662948 645082 628991 613879 601251 592231 585076 577793 570808
56197 570808 564825 558780 552212 546869 543640 540749 537221 534949 534979 535137 534000 533684 535766 537951 538036 537853
$$ packed form
56280C68117L761K632L535N438N853N559O642P871O824M817M865O407O818O599
56266D45738Q125J0678J1634J1348J2069J3329J3250J3125J5671J9853K2445K3645
56254F20910K6170K9920L2663L4963L9239M4724M8558N1047N4696N8805O0389
56243A102084N9856O0370O1895O1158N7345N2673M7484L9910L0312K1104J2245
56232A606436J706r735j9083k6178l3389m0538m5109m7223m9405n1615n1517m9477
56220A184873m8278m7985m6174m3041m1234m0667l8639l5057l2470l0985k8234
56209G52109k4433k2300k1897k0531j7866j6091j5112j2628r020p155p283o985
56197E70808n983o045o568n343l229k891l528k272L0J58j137l16K082K185Q5j83
$$ plain form
56181 537853 539868 543025 545381 547777 551457 555058 557385 560272 565313 570728 574716 578792 584442 589822
56167 589822 593339 597181 603569 610783 616696 622900 631369 640387 647963 656029 666958 679141 690318
56154 690318 702202 717295 734280 751106 769597 792321 817899 844199 873343 908704 949813
56143 949813 995049 1046635 1107926 1178453 1256713 1345298 1448085 1564536 1691269 1826129 1965220
56132 1965220 2098625 2215188 2310535 2386427 2445356 2491019 2531024 2572256 2614074 2650312 2676050
56121 2676050 2688367 2684015 2662637 2630548 2595947 2561589 2525809 2487122 2442341 2383555 2303679
56110 2303679 2203672 2089686 1966142 1837020 1710454 1595031 1493208 1403762 1327988 1267546
56100 1267546 1219137 1177939 1144070 1119669 1102356 1088000 1077224 1072431 1070990 1068254 1064909 1064530
$$ packed form
56181E37853K015L157K356K396L680L601K327K887N041N415L988M076N650N380
56167E89822L517L842O388P214N913O204Q469R018P576Q066J0929J2183J1177
56154F90318J1884J5093J6985J6826J8491K2724K5578K6300K9144L5361M1109
56143I49813M5236N1586O1291P0527P8260Q8585J02787J16451J26733J34860J39091
56132A965220J33405J16563R5347P5892N8929M5663M0005M1232M1818L6238K5738
56121B676050J2317m352k1378l2089l4601l4358l5780l8687m4781n8786p9876
56110B303679j00007j13986j23544j29122j26566j15423j01823q9446p5774o0442
56100A267546m8409m1198l3869k4401j7313j4356j0776m793j441k736l345l79
$$ plain form
56088 1064530 1066387 1067620 1069901 1076558 1085373 1091577 1095783 1101794 1109038 1114699 1120833 1131527 1145131
56075 1145131 1157067 1168106 1182030 1197583 1210949 1223917 1241056 1260906 1278539 1294849 1314577
56064 1314577 1337096 1357984 1377865 1400649 1424772 1445336 1463298 1483475 1505165 1524031 1541330
56053 1541330 1561657 1583367 1601166 1616538 1635483 1657605 1677822 1697368 1722275 1752101 1780927
56042 1780927 1808481 1839481 1873132 1904491 1935286 1972071 2014365 2055863 2096410 2141189 2189140
56031 2189140 2234367 2278246 2327798 2382554 2435485 2486364 2541486 2600700 2657839 2713620 2774784
56020 2774784 2840815 2905110 2968992 3040482 3119350 3197790 3275759 3360863 3453108 3545035 3637184
56009 3637184 3737792 3846831 3956274 4066471 4185918 4314535 4444144 4575805 4719087
$$ packed form
56088A064530J857J233K281O657Q815O204M206O011P244N661O134J0694J3604
56075A145131J1936J1039J3924J5553J3366J2968J7139J9850J7633J6310J9728
56064A314577K2519K0888J9881K2784K4123K0564J7962K0177K1690J8866J7299
56053A541330K0327K1710J7799J5372J8945K2122K0217J9546K4907K9826K8826
56042A780927K7554L1000L3651L1359L0795L6785M2294M1498M0547M4779M7951
56031B189140M5227M3879M9552N4756N2931N0879N5122N9214N7139N5781O1164
56020B774784O6031O4295O3882P1490P8868P8440P7969Q5104R2245R1927R2149
56009C637184J00608J09039J09443J10197J19447J28617J29609J31661J43282
$$ plain form
56000 4719087 4873804 5030799 5191282 5366331 5556559 5752105 5953536 6172053 6408010
55991 6408010 6650884 6901935 7174411 7469792 7777355 8099046 8450041 8832428 9234206
55982 9234206 9657060 10118160 10621503 11155937 11724998 12348804 13032631 13765378 14553625
55973 14553625 15423916 16386737 17434126 18578559 19856253 21286252 22867783 24625801
55965 24625801 26615966 28878208 31434955 34345960 37714863 41635168 46191198 51526055
55957 51526055 57846151 65349765 74227633 84747010 97249295 112061366 129538002
55950 129538002 150228648 174862089 204094711 238325202 277491374 320230038 362514294
55943 362514294 397378947 417174280 417308482 398498474 365794077 325650878 283545734
$$ packed form
56000D719087J54717J56995J60483J75049J90228J95546K01431K18517K35957
55991F408010K42874K51051K72476K95381L07563L21691L50995L82387M01778
55982I234206M22854M61100N03343N34434N69061O23806O83827P32747P88247
55973A4553625Q70291R62821J047389J144433J277694J429999J581531J758018
55965B4625801J990165K262242K556747K911005L368903L920305M556030N334857
55957E1526055O320096P503614Q877868J0519377J2502285J4812071J7476636
55950A29538002K0690646K4633441K9232622L4230491L9166172M2738664M2284256
55943C62514294L4864653J9795333J34202j8810008l2704397m0143199m2105144
$$ plain form
55936 283545734 243187230 206676970 174854448 147708378 124848025 105800346 90050786
55929 90050786 77047787 66297548 57417355 50076983 43960488 38815876 34479042 30815631
55921 30815631 27685130 24979404 22642495 20625057 18858624 17291775 15909168 14694129
55913 14694129 13608007 12622844 11738855 10951992 10235974 9572165 8966861 8423296 7924360
55904 7924360 7457575 7030575 6647349 6293653 5959436 5652575 5377472 5121851 4876872
55895 4876872 4649554 4443907 4249869 4061916 3889144 3736160 3592613 3451996 3322650
55886 3322650 3209857 3104718 3001001 2906018 2824319 2746476 2664198 2581625 2502368 2420339 2333009
55875 2333009 2249390 2175301 2103991 2030112 1959674 1897456 1837633 1775731 1717430 1666931 1618610
$$ packed form
55936B83545734m0358504l6510260l1822522k7146070k2860353j9047679j5749560
55929I0050786j3002999j0750239q880193p340372o116495n144612m336834l663411
55921C0815631l130501k705726k336909k017438j766433j566849j382607j215039
55913A4694129j086122r85163q83989p86863p16018o63809o05304n43565m98936
55904G924360m66785m27000l83226l53696l34217l06861k75103k55621k44979
55895D876872k27318k05647j94038j87953j72772j52984j43547j40617j29346
55886C322650j12793j05139j03717r4983q1699p7843q2278q2573p9257q2029q7330
55875B333009q3619p4089p1310p3879p0438o2218n9823o1902n8301n0499m8321
$$ plain form
55864 1618610 1568524 1522360 1483750 1446175 1404694 1364634 1330724 1298523 1264520 1233946 1210484
55853 1210484 1188514 1163494 1140066 1122104 1104444 1082284 1059361 1039226 1017706 991674 966300
55842 966300 945949 926518 904154 882961 866549 850395 830311 810612 796274 784415 770831
55831 770831 757737 747893 738188 726031 715254 708932 703180 694582 686779 682962 678784 669621 658330
55818 658330 648981 639314 626334 613250 603917 596123 587003 579452 576622 575575 572793 570693 572451 575733
55804 575733 577731 581102 588683 597470 603972 610378 619229 627024 629437 628150 626288 621788 611551 597845
55790 597845 584455 570668 554989 540667 531471 525628 519431 512984 507072 498564 484669 468148 453006
55777 453006 438740 423873 411065 403256 398532 394022 391108 391659 393121 392715 392584 395330 398205 397279
$$ packed form
55864A618610n0086m6164l8610l7575m1481m0060l3910l2201l4003l0574k3462
55853A210484k1970k5020k3428j7962j7660k2160k2923k0135k1520k6032k5374
55842I66300k0351j9431k2364k1193j6412j6154k0084j9699j4338j1859j3584
55831G70831j3094r844r705j2157j0777o322n752q598p803l817m178r163j1291
55818F58330r349r667j2980j3084r333p794r120p551k830j047k782k100J758L282
55804E75733J998L371P581Q787O502O406Q851P795K413j287j862m500j0237j3706
55790E97845j3390j3787j5679j4322r196n843o197o447n912q508j3895j6521j5142
55777D53006j4266j4867j2808p809m724m510k914N51J462m06j31K746K875r26
$$ plain form
55763 397279 393744 390644 386919 380315 372809 367553 363515 358458 354084 352823 352574 349935 345695 341964
55749 341964 337035 328461 318366 310289 303519 295679 288104 283336 280034 275647 271486 269916 269141 266089
55735 266089 261953 259628 258146 255027 251701 251112 252057 251316 249393 248793 248486 245524 240615 236857 234350
55720 234350 230978 227171 225119 224503 223524 222724 223473 224305 223163 221608 222353 224414 225140 225193 226852 229220
55704 229220 229927 229964 231897 234702 235223 233500 231961 230472 226978 222022 218114 215486 212747 210604 210634 211472
55688 211472 210570 208654 208210 208799 208295 207548 209228 213005 216360 219294 223784 229359 233648 236632 240084
55673 240084 243508 244824 244426 244422 244548 243006 240622 239994 241150 242093 242933 245334 248618 250622 251836 254496
55657 254496 258188 260529 261637 263630 266254 267311 266990 267417 268156 266562 262440 258150 254079 248266 240589
$$ packed form
55763C97279l535l100l725o604p506n256m038n057m374j261k49k639m240l731
55749C41964m929q574j0095q077o770p840p575m768l302m387m161j570p75l052
55735B66089m136k325j482l119l326n89R45p41j923o00l07k962m909l758k507
55720B34350l372l807k052o16r79q00P49Q32j142j555P45K061P26N3J659K368
55704B29220P07L7J933K805N21j723j539j489l494m956l908k628k739k143L0Q38
55688B11472r02j916m44N89n04p47J680L777L355K934M490N575M289K984L452
55673B40084L424J316l98mJ26j542k384o28J156R43Q40K401L284K004J214K660
55657B54496L692K341J108J993K624J057l21M27P39j594m122m290m071n813p677
$$ plain form
55642 240589 233255 226933 220351 213791 209021 205523 200686 194096 187993 183306 178901 174886 172887 172667
55628 172667 172035 170424 169231 168520 166865 164508 163121 162394 160431 157620 156327 156546 155568 152449 149269
55613 149269 147468 146318 145394 145209 144973 143085 140213 138695 138692 138222 137094 137199 138589 138963 137665 136694 137044
55596 137044 137413 137144 137140 137152 135452 132020 129007 127379 126037 124732 124646 125569 125741 125173 125925 128399 130455
55579 130455 130986 131268 132087 132613 132858 134092 136011 136585 135602 135259 136340 136914 135911 134986 135567 136872 138020
55562 138020 139503 141373 142428 142327 142227 142499 142098 140848 139944 139600 138721 137437 137286 138311 138717 138104 138261
55545 138261 139947 141645 142355 142996 144170 145143 145864 147399 149598 150952 151455 152893 155507 157171 156804 155823
55529 155823 155288 154352 152552 150892 149580 147372 144207 141836 140743 139091 135888 132567 130262 128088 125346
$$ packed form
55642B40589p334o322o582o560m770l498m837o590o103m687m405m015j999k20
55628A72667o32j611j193p11j655k357j387p27j963k811j293K19r78l119l180
55613A49269j801j150r24j85k36j888k872j518lm70j128J05J390L74j298r71L50
55596A37044L69k69mJ2j700l432l013j628j342j305q6R23J72n68P52K474K056
55579A30455N31K82Q19N26K45J234J919N74r83l43J081N74j003r25N81J305J148
55562A38020J483J870J055j01j00K72m01j250r04l44q79j284j51J025M06o13J57
55545A38261J686J698P10O41J174R73P21J535K199J354N03J438K614J664l67r81
55529A55823n35r36j800j660j312k208l165k371j093j652l203l321k305k174k742
$$ plain form
55514 125346 122917 121242 119362 117104 115829 115869 115662 114489 113561 113399 112771 111380 110855 111780 112424 111822 111454
55497 111454 112372 113260 112991 112619 113174 113786 113638 113496 113719 112986 110649 108247 107091 106449 105598 105458 106624
55480 106624 107918 108475 109165 110420 110873 109817 108833 109251 110061 110060 109974 110662 111225 110779 110205 110301 110078 108744 107554
55461 107554 107740 108315 107889 107064 107077 107522 107360 106924 107144 107883 108553 109246 109958 109976 109246 108932 109470 109685 109003
55442 109003 108738 109799 110934 110768 109846 109153 108374 107278 107010 108166 109123 108193 106109 104627 103988 103460 103125
55425 103125 103379 103726 103608 103475 103773 104045 104151 104984 106782 108203 108347 108181 108699 109309 109392 109727 110858 111643
55407 111643 111010 109624 108329 106612 104148 102144 101401 100685 98877 97166 97186 98399 99217 99387 99416 99008 98019
55390 98019 97669 98852 100403 100931 101201 102743 105210 107020 107670 107651 107048 105990 105498 106202 107131 107303 107352 108062
$$ packed form
55514A25346k429j675j880k258j275M0k07j173r28j62o28j391n25R25O44o02l68
55497A11454R18Q88k69l72N55O12j48j42K23p33k337k402j156o42q51j40J166
55480A06624J294N57O90J255M53j056r84M18Q10jq6O88N63m46n74R6k23j334j190
55461A07554J86N75m26q25J3M45j62m36K20P39O70O93P12J8p30l14N38K15o82
55442A09003k65J061J135j66r22o93p79j096k68J156R57r30k084j482o39n28l35
55425A03125K54L47j18j33K98K72J06Q33J798J421J44j66N18O10Q3L35J131P85
55407A11643o33j386j295j717k464k004p43p16j808j711K0J213Q18J70K9m08r89
55390I8019l50J183J551N28K70J542K467J810O50j9o03j058m92P04R29J72M9P10
$$ plain form
55372 108062 108604 108002 107105 107195 107827 107929 107866 108437 108901 108103 106647 105953 105985 105864 105817 106534 107388 107320 106855 107269
55352 107269 108351 108812 108337 107509 106332 104587 103014 102371 101956 100735 99316 99066 99968 101072 102382 104453
55336 104453 106740 108147 108800 109574 110407 110686 110741 111216 111560 110854 109639 109236 109691 110053 110165 110533 110866 110414
55318 110414 109367 108364 107123 105125 103110 102267 102389 102456 102538 103416 104688 105012 104083 102896 102231 102111 102401
55301 102401 102647 101901 100040 98669 99303 101255 102755 103404 103998 104649 104919 105284 106682 108846 110619 111572
55285 111572 111948 111620 110642 110158 111067 112308 112188 110901 110025 110074 110366 110827 111917 113071 113158 112430 112303 113252
55267 113252 114541 115792 117150 118109 117927 117097 116771 116841 116231 114887 113765 112952 111575 109624 108172 107648
55251 107648 107415 107178 107344 107888 108260 108463 108886 109141 108448 107155 106463 106627 106775 106510 106329 106454 106491 106271 105949
$$ packed form
55372A08062N42o02q97R0O32J02o3N71M64p98j456o94L2j21m7P17Q54o8m65M14
55352A07269J082M61m75q28j177j745j573o43m15j221j419k50R02J104J310K071
55336A04453K287J407O53P74Q33K79N5M75L44p06j215m03M55L62J12L68L33m52
55318A10414j047j003j241j998k015q43J22O7Q2Q78J272L24r29j187o65j20K90
55301A02401K46p46j861j371O34J952J500O49N94O51K70L65J398K164J773R53
55285A11572L76l28r78m84R09J241j20j287q76M9K92M61J090J154Q7p28j27R49
55267A13252J289J251J358R59j82q30l26P0o10j344j122q13j377j951j452n24
55251A07648k33k37J66N44L72K03M23K55o93j293o92J64J48k65j81J25L7k20l22
$$ plain form
55232 105949 105370 104469 103973 104519 105384 105406 104805 104763 105568 106608 107815 109526 111145 111566 110809 109875 109150 108401
55214 108401 108022 108685 109872 110333 109941 109636 109703 109592 109275 109282 109546 109660 110071 111455 113133 113792 113535 113593 114101
55195 114101 113953 112815 111558 110616 109631 108846 109155 110488 111665 112063 112070 111870 111208 110415 110190 110342 110147 109876
55177 109876 110466 111786 112777 113197 113681 114197 114211 114228 115302 117022 117874 117728 118053 119449 120833 121381 121442 121215
55159 121215 120379 119415 119504 120648 121571 121888 122578 123880 124539 123813 122538 121553 120685 119861 119617 119823 119432 118192
55141 118192 117195 117119 117419 117824 119099 121555 124212 126138 127359 127887 127242 125594 124049 123117 122131 120667
55125 120667 119271 118276 117294 116382 116311 117129 117856 118131 118722 119860 120600 120515 120474 120994 121354 121184 121436 122778 124397
55106 124397 125405 126162 127166 127838 127523 126672 125955 125094 123583 121835 120682 120360 120665 121472 122523 123360 123887
$$ packed form
55232A05949n79r01m96N46Q65K2o01m2Q05J040J207J711J619M21p57r34p25p49
55214A08401l79O63J187M61l92l05O7j11l17PK64J14M11J384J678O59k57N8N08
55195A14101j48j138j257r42r85p85L09J333J177L98Pk00o62p93k25J52j95k71
55177A09876N90J320R91M20M84N16J4J7J074J720Q52j46L25J396J384N48O1k27
55159A21215q36r64Q9J144R23L17O90J302O59p26j275r85q68q24k44K06l91j240
55141A18192r97p6L00M05J275K456K657J926J221N28o45j648j545r32r86j464
55125A20667j396r95r82r12p1Q18P27K75N91J138P40q5m1N20L60j70K52J342J619
55106A24397J008P57J004O72l15q51p17q61j511j748j153l22L05Q07J051Q37N27
$$ plain form
55089 123887 124298 124255 123114 121198 119746 119255 119022 118651 118730 119559 120495 121093 121667 122200 122017 121130 120642 121110
55071 121110 121782 122059 122410 123142 123592 123391 123306 123886 124417 124062 123042 121922 120791 119891 119916 120890 121791 122061
55053 122061 122369 123162 123691 123379 122937 123102 123343 122887 122069 121607 121422 121197 121283 122017 122927 123506 124121 125235 126447
55034 126447 127119 127338 127465 127374 126810 125883 124647 122967 121321 120870 122028 123812 125182 126209 127362 128631
55018 128631 130067 132158 134769 136581 136468 134835 132965 131737 131455 132058 132801 132606 131414 130455 130642 131522
55002 131522 132272 132697 132690 131851 130373 129333 129265 129354 128752 127813 127309 127300 127474 127740 127916 127683 127370 127800 128905 129583
54982 129583 129414 129268 129692 130066 130040 130368 131470 132554 133108 133862 135317 136728 137603 138774 140738 142400 142858
54965 142858 143098 144390 146194 147272 147788 148609 149452 149470 148931 148677 148506 147724 146771 146695 147373 147759 147608 147550 147756
$$ packed form
55089A23887M11m3j141j916j452m91k33l71P9Q29R36N98N74N33j83q87m88M68
55071A21110O72K77L51P32M50k01q5N80N31l55j020j120j131r00K5R74R01K70
55053A22061L08P93N29l12m42J65K41m56q18m62j85k25Q6P34R10N79O15J114J212
55034A26447O72K19J27r1n64r27j236j680j646m51J158J784J370J027J153J269
55018A28631J436K091K611J812j13j633j870j228k82O03P43j95j192r59J87Q80
55002A31522P50M25pq39j478j040o8Q9o02r39n04rJ74K66J76k33l13M30J105O78
54982A29583j69j46M24L74k6L28J102J084N54P54J455J411Q75J171J964J662M58
54965A42858K40J292J804J078N16Q21Q43J8n39k54j71p82r53p6O78L86j51n8K06
$$ plain form
54946 147756 147825 147782 147985 148209 147905 147167 146545 146225 146229 146916 148374 149837 150682 151397 152619 153906 154634 155448 157549
54927 157549 161079 165451 170768 177504 185145 192519 199306 205970 212311 217309 220444 222109 222623 221688 218870
54912 218870 213951 206990 198667 190345 183075 176776 170904 165529 161076 157477 154372 151820 150122 149228
54898 149228 148890 148982 149277 149450 149718 150697 152161 152942 152705 152768 154327 156898 159492 162281 165910 170133 174422
54881 174422 179130 184755 190769 196457 202186 208485 214491 218711 220822 221368 220216 216745 211208 204573
54867 204573 197354 189821 182951 177726 173681 169410 164402 159353 154966 151498 149165 147886 146917 145689
54853 145689 144594 143972 143000 140807 138098 136338 135727 135300 134566 133734 132721 131376 130361 130387 130907 130932 130760
54836 130760 131377 132518 133051 133096 133952 135752 136918 136446 135272 134830 135399 136393 137289 137818 137990 138256 139077 140243
$$ packed form
54946A47756O9m3K03K24l04p38o22l20MO87J458J463Q45P15J222J287P28Q14K101
54927A57549L530M372N317O736P641P374O787O664O341M998L135J665N14r35k818
54912B18870m919o961q323q322p270o299n872n375m453l599l105k552j698q94
54898A49228l38R2K95J73K68R79J464P81k37O3J559K571K594K789L629M223M289
54881A74422M708N625O014N688N729O299O006M220K111N46j152l471n537o635
54867B04573p219p533o870n225m045m271n008n049m387l468k333j279r69j228
54853A45689j095o22r72k193k709j760o11m27p34q32j013j345j015K6N20K5j72
54836A30760O17J141N33M5Q56J800J166m72j174m42N69R94Q96N29J72K66Q21J166
$$ plain form
54818 140243 141174 141690 141849 141372 140115 138761 138086 137850 137376 136846 136933 137514 137923 138184 138753 139299 139025 138071
54800 138071 137338 137044 136697 136391 136816 138007 139286 140479 141979 143595 144571 144798 144902 145131 145282 145688 147045
54783 147045 149196 151238 152938 154971 157709 160806 164027 167455 170890 174049 177302 181260 185783 190438
54769 190438 195596 201938 209144 216340 223465 230759 237187 241008 241866 240729 237801 232283 224378 215763
54755 215763 207624 199778 192195 185770 180941 176981 173345 170534 168992 168254 167841 167888 168366 168647 168405 167987
54739 167987 167505 166517 165095 164214 164552 165680 166812 167676 168430 169534 171785 175645 180462 185289 190330 196464
54723 196464 203467 210095 215944 221653 226951 230001 229329 225240 218952 211529 204045 197398 191444 185393
54709 185393 179464 174866 171825 169149 166275 164195 163537 163199 161935 160113 158840 158351 158282 158629 159395 160005
$$ packed form
54818A40243R31N16J59m77j257j354o75k36m74n30Q7N81M09K61N69N46k74r54
54800A38071p33k94l47l06M25J191J279J193J500J616R76K27J04K29J51M06J357
54783A47045K151K042J700K033K738L097L221L428L435L159L253L958M523M655
54769A90438N158O342P206P196P125P294O428L821Q58j137k928n518p905q615
54755B15763q139p846p583o425m829l960l636k811j542p38m13M7M78K81k42m18
54739A67987m82r88j422q81L38J128J132Q64P54J104K251L860M817M827N041O134
54723A96464P003O628N849N709N298L050o72m089o288p423p484o647n954o051
54709A85393n929m598l041k676k874k080o58l38j264j822j273m89o9L47P66O10
$$ plain form
54693 160005 159946 159380 158502 157017 154957 153223 152496 152307 151850 151067 150291 149548 148916 148889 149654 150477 150470 149586 148417
54674 148417 147506 147203 147655 148557 149387 150053 150762 151269 151119 150683 150878 151640 151843 151072 150362 150672 151751 153049
54656 153049 154574 156152 156974 156752 156420 156802 157349 157056 155891 154583 153559 152838 152396 152020 151313 150355 149787
54639 149787 149822 149864 149501 149097 148994 148943 148781 148766 148784 148155 146830 145798 145663 145817 145717 145962 147157 148598 149173
54620 149173 148899 148584 148509 148429 148457 148925 149596 149782 149166 148033 146902 146233 146161 146247 145951 145514 145792 147001 148359
54601 148359 149249 149848 150276 150051 148954 147672 147010 147097 147749 148819 149828 150118 149807 149711 149967 149792 149038 148757
54583 148757 149471 150162 149905 149424 149911 151192 152222 152686 153003 153325 153504 153639 153789 153627 153123 153058 154092 155839
54565 155839 157468 158652 159357 159450 159173 159211 159611 159558 158951 159087 160748 162658 163106 162294 161681 161682 161491 160772 160094
$$ packed form
54693A60005n9n66q78j485k060j734p27j89m57p83p76p43o32k7P65Q23pq84j169
54674A48417r11l03M52R02Q30O66P09N07j50m36J95P62K03p71p10L10J079J298
54656A53049J525J578Q22k22l32L82N47k93j165j308j024p21m42l76p07r58n68
54639A49787L5M2l63m04j03n1j62j5J8o29j325j032j35J54j00K45J195J441N75
54620A49173k74l15p5q0K8M68O71J86o16j133j131o69p2Q6k96m37K78J209J358
54601A48359Q90N99M28k25j097j282o62Q7O52J070J009K90l11r6K56j75p54k81
54583A48757P14O91k57m81M87J281J030M64L17L22J79J35J50j62n04o5J034J747
54565A55839J629J184P05R3k77L8M00n3o07J36J661J910M48q12o13Jj91p19o78
$$ plain form
54546 160094 159829 159858 160312 161464 162931 163969 164578 165458 166901 168513 169967 171310 172529 173417 173815 173535
54530 173535 172316 170324 168341 166916 165736 164370 163147 162602 162543 162424 162239 162308 162495 162414 162136 161992 161940 161737
54512 161737 161422 161070 160418 159342 158333 157885 157786 157583 157360 157457 157813 158147 158431 158675 158707 158614 158912 159795 160809
54493 160809 161692 162772 164018 164585 164056 163320 163417 164265 165328 166630 168119 168957 168620 168012 168278 169147 169662
54476 169662 169872 170407 170910 170403 169017 167991 167962 168526 169375 170689 172341 173783 174821 175589 175858 175302 174393
54459 174393 174072 174576 175415 176367 177538 178577 178901 178711 178816 179386 179755 179555 179162 178937 178794 178649 178522 178151
54441 178151 177183 175876 174927 174522 174108 173224 172069 171224 171143 171764 172322 171874 170445 169238 169213 169951 170472 170593
54423 170593 170670 170608 170166 169867 170617 172506 174771 176686 177768 177537 176056 174431 173794 173948 173909 173522 173599 174625
$$ packed form
54546A60094k65K9M54J152J467J038O09Q80J443J612J454J343J219Q88L98k80
54530A73535j219j992j983j425j180j366j223n45n9j19j85O9J87q1k78j44n2k03
54512A61737l15l52o52j076j009m48r9k03k23R7L56L34K84K44L2r3K98Q83J014
54493A60809Q83J080J246N67n29p36R7Q48J063J302J489Q38l37o08K66Q69N15
54476A69662K10N35N03n07j386j026k9N64Q49J314J652J442J038P68K69n56r09
54459A74393l21N04Q39R52J171J039L24j90J05N70L69k00l93k25j43j45j27l71
54441A78151r68j307r49m05m14q84j155q45q1O21N58m48j429j207k5P38N21J21
54423A70593P7o2m42k99P50J889K265J915J082k31j481j625o37J54l9l87P7J026
$$ plain form
54405 174625 176277 178107 179790 180856 181115 181256 182149 183609 184657 184916 184886 184989 185155 185319 185565 185851 186208
54388 186208 186927 187899 188170 187028 185177 183954 183751 184141 185074 186716 188384 188935 188242 187242 186579 186225 186257
54371 186257 186874 187624 187748 187355 187310 187935 188794 189625 190493 191128 191234 191360 192287 193621 194195 193914 193887 194616 195340
54352 195340 195495 195516 195806 196036 195958 195904 196018 195946 195715 196031 197231 198776 200154 201522 203003 204160 204595 204416
54334 204416 203737 202332 200141 197540 194825 192012 189352 187469 186732 186919 187563 188110 187889 186673 185345 185224
54318 185224 186563 188238 188998 188487 187199 186057 185848 186370 186344 184938 183078 182326 182825 183441 183657 184017 184795
54301 184795 185590 186338 187421 188580 188975 188589 188290 188190 187219 184832 181937 179584 177786 176187 174904 174114
54285 174114 173653 173520 173964 174662 174704 173848 172939 172669 172746 172716 172732 173049 173555 174235 175292 176427 176825 176319 175766
$$ packed form
54405A74625J652J830J683J066K59J41Q93J460J048K59l0J03J66J64K46K86L57
54388A86208P19R72K71j142j851j223k03L90R33J642J668N51o93j000o63l54L2
54371A86257O17P50J24l93m5O25Q59Q31Q68O35J06J26R27J334N74k81k7P29P24
54352A95340J55K1K90K30p8n4J14p2k31L16J200J545J378J368J481J157M35j79
54334B04416o79j405k191k601k715k813k660j883p37J87O44N47k21j216j328j21
54318A85224J339J675P60n11j288j142k09N22k6j406j860p52M99O16K16L60P78
54301A84795P95P48J083J159L95l86k99j00r71k387k895k353j798j599j283p90
54285A74114m61j33M44O98M2q56r09k70P7l0J6L17N06O80J057J135L98n06n53
$$ plain form
54266 175766 175864 176373 176902 177681 178990 180551 181899 182779 182973 182490 182140 183054 185307 187758 189465 190361 190435
54249 190435 189451 187894 187005 187236 187650 187412 186880 186623 186350 185591 184597 183844 183389 183335 184121 185642 186832 186842
54231 186842 185985 184854 183312 181085 178767 177361 177189 177824 178686 179200 178903 177934 177031 176663 176560 176386 176257
54214 176257 176302 176349 176338 176423 176388 175691 174434 173513 173477 174005 174780 175987 177536 178723 179256 179831 181159 183112 185179
54195 185179 187017 188112 187828 186295 184467 182916 181370 179755 178617 178066 177396 176336 175559 175333 174830 173555
54179 173555 172338 172013 172172 172130 172115 172542 173068 173400 174081 175371 176268 175890 175061 175218 176311 177048 176811 176140
54161 176140 175592 175171 174701 173979 172812 171528 170983 171481 172301 172911 173765 175114 176034 175760 175118 175372 176304 176826
54143 176826 176937 177618 179117 180764 182301 184103 186081 187620 188652 189745 191069 192223 193091 193925 194585
$$ packed form
54266A75766R8N09N29P79J309J561J348Q80J94m83l50R14K253K451J707Q96P4
54249A90435r84j557q89K31M14k38n32k57k73p59r94p53m55n4P86J521J190J0
54231A86842q57j131j542k227k318j406j72O35Q62N14k97r69r03l68j03j74j29
54214A76257M5M7j1Q5l5o97j257r21l6N28P75J207J549J187N33N75J328J953K067
54195A85179J838J095k84j533j828j551j546j615j138n51o70j060p77k26n03j275
54179A73555j217l25J59m2j5M27N26L32O81J290Q97l78q29J57J093P37k37o71
54161A76140n48m21m70p22j167j284n45M98Q20O10Q54J349R20k74o42K54R32N22
54143A76826J11O81J499J647J537J802J978J539J032J093J324J154Q68Q34O60
$$ plain form
54128 194585 194627 194230 194180 194760 195391 195503 195160 194815 194959 195943 197627 199249 200072 200027 199414 198387 197175 196296
54110 196296 195920 195512 194678 193815 193252 192506 191283 190539 191314 192989 193942 193716 193284 193295 193277 192698 191745 190847 190274
54091 190274 190354 191291 192610 193465 193582 193357 193147 193128 193657 194897 196166 196534 196171 196299 197685 199819 201698
54074 201698 202838 203412 203919 204826 206171 207571 208923 210721 213210 215679 217343 218607 220634 223909 228044
54059 228044 232821 238556 245528 253895 264085 276506 290958 307064 324966 344370 362816 376120
54047 376120 381176 377959 368768 356370 343042 330417 319396 310240 302952 297422 293369 290648 289583
54034 289583 290577 293357 297020 300732 304027 306619 308515 310272 312494 315020 317073 318199 318654 318868 318925
54019 318925 318590 317544 315716 313588 311825 310329 308055 304241 299325 294143 288766 282856 276697 271041
$$ packed form
54128A94585M2l97n0N80O31J12l43l45J44R84J684J622Q23m5o13j027j212q79
54110A96296l76m08q34q63n63p46j223p44P75J675R53k26m32J1j8n79r53q98n73
54091A90274Q0R37J319Q55J17k25k10j9N29J240J269L68l63J28J386K134J879
54074B01698J140N74N07R07J345J400J352J798K489K469J664J264K027L275M135
54059B28044M777N735O972Q367J0190J2421J4452J6106J7902J9404J8446J3304
54047C76120N056l217r191j2398j3328j2625j1021r156p288n530m053k721j065
54034B89583R94K780L663L712L295K592J896J757K222K526K053J126M55K14N7
54019C18925l35j046j828k128j763j496k274l814m916n182n377n910o159n656
$$ plain form
54005 271041 266180 261977 258519 255883 253504 250647 247434 244618 242445 240439 238200 235699 232931 230011
53991 230011 227466 225746 224559 223345 222143 221289 220589 219677 218863 218709 218907 218568 217528 216469 215838 215474
53975 215474 215202 214878 214040 212502 211144 211118 212368 213992 215896 218775 222421 225437 227059 228125 229805
53960 229805 232385 235754 240124 245590 251713 258046 264547 271129 277405 283081 288031 291787 293639 293463
53946 293463 291868 289430 286495 283725 281944 281249 281127 281611 283421 286700 290621 294642 299169 304455 309727
53931 309727 314096 317665 321094 324571 327826 330779 333656 336731 340232 344170 348107 351526 354592 358044
53917 358044 362209 366752 371589 377367 384737 393626 403445 413477 422937 431296 438797 446072 453055 458921
53903 458921 463328 467091 471401 477087 484858 495547 509528 526145 543655 559052 568095 566922 554530
$$ packed form
54005B71041m861m203l458k636k379k857l213k816k173k006k239k501k768k920
53991B30011k545j720j187j214j202q54p00r12q14j54J98l39j040j059o31l64
53975B15474k72l24q38j538j358k6J250J624J904K879L646L016J622J066J680
53960B29805K580L369M370N466O123O333O501O582O276N676M950L756J852j76
53946B93463j595k438k935k770j781o95j22M84J810L279L921M021M527N286N272
53931C09727M369L569L429L477L255K953K877L075L501L938L937L419L066L452
53917C58044M165M543M837N778P370Q889R819J0032R460Q359P501P275O983N866
53903D58921M407L763M310N686P771J0689J3981J6617J7510J5397R043j173j2392
$$ plain form
53890 554530 533328 507024 478624 450487 424805 402855 384312 368211 354245 342556 332814 324365
53878 324365 317026 311012 306197 301990 297853 293556 289142 285005 281718 279419 277521 275350 272740 269756
53864 269756 266277 262338 258554 255582 253265 250791 247669 244180 240911 238246 236391 235518 235601 236166 236441
53849 236441 235887 234557 232831 230926 228922 227210 226363 226348 226402 226047 225764 226174 227034 227653 227899 228079 228200 228196
53831 228196 228596 230063 232298 234234 235213 235285 234534 233076 231593 230859 230736 230571 230573 231633 233691 235467 236195
53814 236195 236503 237159 238061 239084 240938 244353 248997 253890 258359 262142 265171 267849 271049 275255 279996
53799 279996 284534 288815 293408 298791 304862 310799 315418 318144 319696 321297 323317 325315 327184 329219
53785 329219 331039 331599 330629 329055 327577 325716 322709 318539 313641 308368 303193 298578 294273 289488 284162
$$ packed form
53890E54530k1202k6304k8400k8137k5682k1950j8543j6101j3966j1689r742q449
53878C24365p339o014m815m207m137m297m414m137l287k299j898k171k610k984
53864B69756l479l939l784k972k317k474l122l489l269k665j855q73Q3N65K75
53849B36441n54j330j726j905k004j712q47j5N4l55k83M10Q60O19K46J80J21m
53831B28196M00J467K235J936R79P2p51j458j483p34j23j65KJ060K058J776P28
53814B36195L08O56R02J023J854L415M644M893M469L783L029K678L200M206M741
53799B79996M538M281M593N383O071N937M619K726J552J601K020J998J869K035
53785C29219J820N60r70j574j478j861l007m170m898n273n175m615m305m785n326
$$ plain form
53770 284162 279201 275135 271483 267855 264622 261934 259187 256223 254068 253515 253747 253283 251714 249661 247644
53755 247644 245747 243998 242347 240658 239160 238395 238246 237776 236507 235123 234330 233815 233039 232286 232140 232571
53739 232571 233274 234260 235486 236514 237163 237786 238341 238144 237255 237031 238355 240291 241590 242522 243996 245774
53723 245774 247083 248330 250573 253666 256436 258531 260674 263203 265714 268101 270635 272950 274201 274405
53709 274405 274522 275110 275969 277250 279749 283680 288081 291842 294705 297027 299297 302099 305889 310589 315829
53694 315829 321523 327566 333055 336708 338223 338522 338600 338775 339103 339678 340278 340499 340508 341000 342109 343016 342991 342302
53676 342302 341693 341429 341178 340549 339424 337969 336552 335490 334796 334305 333941 333660 333257 332586 331842 331277 330785
53659 330785 330164 329579 329235 328700 327200 324698 322099 320265 319247 318647 318225 317908 317559 317085 316601 316251 315958
$$ packed form
53770B84162m961m066l652l628l233k688k747k964k155n53K32m64j569k053k017
53755B47644j897j749j651j689j498p65j49m70j269j384p93n15p76p53j46M31
53739B32571P03R86J226J028O49O23N55j97q89k24J324J936J299R32J474J778
53723B45774J309J247K243L093K770K095K143K529K511K387K534K315J251K04
53709B74405J17N88Q59J281K499L931M401L761K863K322K270K802L790M700N240
53694C15829N694O043N489L653J515K99P8J75L28N75O00K21RM92J109R07k5o89
53676C42302o09k64k51o29j125j455j417j062o94m91l64k81m03o71p44n65m92
53659C30785o21n85l44n35j500k502k599j834j018o00m22l17l49m74m84l50k93
$$ plain form
53642 315958 315552 315151 315255 316282 317965 319440 320165 320608 321621 323311 325045 326521 328110 330008 331843
53627 331843 333480 335479 338209 341142 343654 346025 348986 352672 356633 360549 364284 367641 370669 373907
53613 373907 377700 381568 384911 388045 391885 396776 402211 407482 412072 415711 418715 422073 426566 431888
53599 431888 437160 442001 446558 450805 454508 457718 460652 463201 465170 466884 468987 471690 474647 477434
53585 477434 479779 481631 483385 485685 488577 491253 493041 494036 494242 492864 489353 484498 479466 474275 468308
53570 468308 461859 455879 450447 444858 439212 434568 431302 428541 425605 423014 421574 421287 421616 422196 422822
53555 422822 423211 423204 422950 422767 422977 423802 425088 426387 427720 429830 433108 436676 439369 441290 443476 446299
53539 446299 449255 452199 455649 459794 464259 469021 474547 480796 487090 493342 500554 509643 520466 532285
$$ packed form
53642C15958m06m01J04J027J683J475P25M43J013J690J734J476J589J898J835
53627C31843J637J999K730K933K512K371K961L686L961L916L735L357L028L238
53613C73907L793L868L343L134L840M891N435N271M590L639L004L358M493N322
53599D31888N272M841M557M247L703L210K934K549J969J714K103K703K957K787
53585D77434K345J852J754K300K892K676J788R95K06j378l511m855n032n191n967
53570D68308o449n980n432n589n646m644l266k761k936k591j440k87L29N80O26
53555D22822L89pk54j83K10Q25J286J299J333K110L278L568K693J921K186K823
53539D46299K956K944L450M145M465M762N526O249O294O252P212R089J0823J1819
$$ plain form
53525 532285 544558 556947 569274 581824 595208 609698 625126 641493 659030 677627 696836
53514 696836 716553 736992 757998 779222 801113 824800 850651 877676 904690 931348 957786
53503 957786 984037 1010258 1036860 1063967 1091188 1118292 1145571 1173289 1201290 1229410 1257740
53492 1257740 1286172 1314183 1341310 1367382 1392154 1415355 1437277 1458704 1479958 1500640 1520544
53481 1520544 1540159 1559898 1579512 1598756 1618144 1638473 1659805 1681299 1701760 1720128 1735707
53470 1735707 1748302 1758091 1765323 1770171 1772642 1772313 1768393 1760537 1749394 1735897 1720368 1702900 1684272
53457 1684272 1665543 1646890 1627729 1607824 1587253 1565425 1541346 1515147 1488260 1461752 1435440
53446 1435440 1408963 1382631 1356773 1331164 1305765 1281189 1257919 1235754 1214599 1195128 1178136
$$ packed form
53525E32285J2273J2389J2327J2550J3384J4490J5428J6367J7537J8597J9209
53514F96836J9717K0439K1006K1224K1891K3687K5851K7025K7014K6658K6438
53503I57786K6251K6221K6602K7107K7221K7104K7279K7718K8001K8120K8330
53492A257740K8432K8011K7127K6072K4772K3201K1922K1427K1254K0682J9904
53481A520544J9615J9739J9614J9244J9388K0329K1332K1494K0461J8368J5579
53470A735707J2595R789P232M848K471l29l920p856j1143j3497j5529j7468j8628
53457A684272j8729j8653j9161j9905k0571k1828k4079k6199k6887k6508k6312
53446A435440k6477k6332k5858k5609k5399k4576k3270k2165k1155j9471j6992
$$ plain form
53435 1178136 1163827 1152095 1142827 1135436 1128862 1122582 1117130 1113226 1111053 1110739 1112722 1117068 1123091 1130279
53421 1130279 1139003 1149799 1162537 1176896 1193142 1211803 1232955 1256221 1281041 1306617 1332190
53410 1332190 1357836 1384520 1413016 1443352 1475550 1510052 1546984 1585783 1626190 1668836 1714246
53399 1714246 1762063 1811989 1864740 1921123 1980695 2042248 2105218 2169738 2235665 2302406 2369570
53388 2369570 2437091 2504848 2572728 2640761 2708575 2774967 2838661 2899342 2957437 3013153 3066262
53377 3066262 3116657 3164469 3209685 3251998 3290970 3326143 3357285 3384746 3409120 3430202 3446547
53366 3446547 3456229 3457502 3448588 3427737 3394338 3349666 3296088 3235914 3171258 3104085 3035564 2965789
53354 2965789 2894773 2823332 2752478 2682604 2613960 2547355 2483538 2422283 2362840 2304817 2247809
$$ packed form
53435A178136j4309j1732r268p391o574o280n452l904k173l14J983M346O023P188
53421A130279Q724J0796J2738J4359J6246J8661K1152K3266K4820K5576K5573
53410A332190K5646K6684K8496L0336L2198L4502L6932L8799M0407M2646M5410
53399A714246M7817M9926N2751N6383N9572O1553O2970O4520O5927O6741O7164
53388B369570O7521O7757O7880O8033O7814O6392O3694O0681N8095N5716N3109
53377C066262N0395M7812M5216M2313L8972L5173L1142K7461K4374K1082J6345
53366C446547R682J273q914k0851l3399m4672n3578o0174o4656o7173o8521o9775
53354B965789p1016p1441p0854o9874o8644o6605o3817o1255n9443n8023n7008
$$ plain form
53343 2247809 2190627 2131974 2071822 2011478 1952468 1895936 1842633 1792562 1744876 1698930 1655313
53332 1655313 1615107 1578456 1544732 1513864 1486524 1463050 1443060 1426054 1411409 1397706 1383053
53321 1383053 1366440 1348313 1329801 1312091 1296408 1283505 1272795 1262749 1252672 1243528 1236685 1232400
53309 1232400 1229976 1228909 1229287 1231255 1234560 1238718 1243503 1249242 1256667 1266405 1278632 1293205 1309906
53296 1309906 1328460 1348609 1370407 1394231 1420208 1447925 1476970 1507411 1539330 1572202 1605285
53285 1605285 1638344 1671407 1703984 1735180 1764560 1792397 1819061 1844649 1869150 1892352 1913486
53274 1913486 1931372 1945115 1954437 1959474 1960688 1958893 1954835 1948540 1939280 1926166 1908544 1886067 1858994
53261 1858994 1828482 1796075 1762688 1728257 1692430 1655201 1616889 1577862 1538534 1499399 1460905
$$ packed form
53343B247809n7182n8653o0152o0344n9010n6532n3303n0071m7686m5946m3617
53332A655313m0206l6651l3724l0868k7340k3474j9990j7006j4645j3703j4653
53321A383053j6613j8127j8512j7710j5683j2903j0710j0046j0077r144o843m285
53309A232400k424j067L78J968L305M158M785N739P425R738J2227J4573J6701
53296A309906J8554K0149K1798K3824K5977K7717K9045L0441L1919L2872L3083
53285A605285L3059L3063L2577L1196K9380K7837K6664K5588K4501K3202K1134
53274A913486J7886J3743R322N037J214j795m058o295r260j3114j7622k2477k7073
53261A858994l0512l2407l3387l4431l5827l7229l8312l9027l9328l9135l8494
$$ plain form
53250 1460905 1423349 1386905 1351673 1317680 1284916 1253262 1222339 1191554 1160423 1128678 1096040
53239 1096040 1062223 1027407 992443 958344 925725 894906 866238 840012 816229 794697 775254
53228 775254 757777 742191 728516 716573 705627 694778 683834 673258 663054 652350 640416
53217 640416 627418 613744 599274 583922 568309 553199 538737 524917 512239 501079 490825
53206 490825 480534 470243 460766 452446 444946 438054 431750 425537 418609 410877 403067 395716 388741 382027
53192 382027 375706 369687 363608 357483 351812 346842 342222 337593 333131 329281 326345 324410 323273 322329
53178 322329 320896 318811 316423 314050 311798 309883 308605 307898 307298 306487 305579 304753 303863 302522 300429 297627
53162 297627 294615 292067 290278 288961 287755 286653 285772 285046 284454 284159 284073 283735 283067 282792 283476 284492 284684
$$ packed form
53250A460905l7556l6444l5232l3993l2764l1654l0923l0785l1131l1745l2638
53239A096040l3817l4816l4964l4099l2619l0819k8668k6226k3783k1532j9443
53228G75254j7477j5586j3675j1943j0946j0849j0944j0576j0204j0704j1934
53217F40416j2998j3674j4470j5352j5613j5110j4462j3820j2678j1160j0254
53206D90825j0291j0291r477q320p500o892o304o213o928p732p810p351o975o714
53192C82027o321o019o079o125n671m970m620m629m462l850k936j935j137r44
53178C22329j433k085k388k373k252j915j278p07o00q11r08q26q90j341k093k802
53162B97627l012k548j789j317j206j102q81p26n92k95q6l38o68k75O84J016J92
$$ plain form
53145 284684 283770 282427 281208 280169 279381 278967 278588 277641 276124 274762 274246 274830 276502 278870 280926 281725
53129 281725 281473 281337 282043 283193 284027 284253 283951 283269 282476 281941 281830 282025 282344 282569 282435 281994 281847 282529
53111 282529 283731 284616 284740 284232 283334 282385 282001 282447 282908 282163 280047 277581 275663 274408 273737 273748 274233
53094 274233 274616 274712 275002 275816 276741 277117 276780 276146 275859 276347 277331 277903 277554 277047 277732 280056 283237 286212
53076 286212 288277 289006 288397 287137 286069 285444 285256 285956 287825 289863 290520 289579 288199 286964 285154 282319
53060 282319 279293 276986 275258 273701 272589 272233 272096 271460 270499 269962 270146 270733 271289 271457 271057 270381 270015
53043 270015 270020 269733 268721 267404 266422 265886 265606 265519 265537 265544 265775 266602 267632 267801 266820 265745 265548 265881 265935 265854
53023 265854 266404 267689 269013 269793 270003 269952 270109 270840 271845 272258 271809 271426 272146 273907 275966 278029 280177
$$ packed form
53145B84684r14j343j219j039p88m14l79r47j517j362n16N84J672K368K056P99
53129B81725k52j36P06J150Q34K26l02o82p93n35j11J95L19K25j34m41j47O82
53111B82529J202Q85J24n08q98r49l84M46M61p45k116k466j918j255o71J1M85
53094B74233L83R6K90Q14R25L76l37o34k87M88R84N72l49n07O85K324L181K975
53076B86212K065P29o09j260j068o25j88P00J869K038O57r41j380j235j810k835
53060B82319l026k307j728j557j112l56j37o36r61n37J84N87N56J68m00o76l66
53043B70015Nk87j012j317r82n36k80q7J8PK31Q27J030J69r81j075j97L33N4q1
53023B65854N50J285J324P80K10n1J57P31J005M13m49l83P20J761K059K063K148
$$ plain form
53006 280177 282064 283031 282904 282047 280777 279322 278111 277494 277311 277278 277596 278599 280044 281333 282264 282894 282941
52989 282941 282122 281001 280703 281609 283023 284254 285358 286550 287561 288063 288334 288984 290141 291290 291907 291976
52973 291976 291844 291825 292113 292947 294506 296536 298370 299594 300509 301653 303052 304371 305578 306834 307748 307527
52957 307527 306090 304381 303234 302491 301647 300832 300586 300988 301507 301553 300889 299718 298601 297993 297643 296846 295437
52940 295437 294046 293053 291920 290054 287812 285999 284756 283557 282101 280610 279374 278483 277916 277514 277001
52925 277001 276339 275843 275681 275558 275192 274702 274183 273425 272502 272118 272698 273549 273687 273201 273015 273454 273912 273899 273675
52906 273675 273661 273904 274270 274671 274918 274802 274488 274436 274881 275685 276755 278168 279808 281221 282014 282208 282184 282435
52888 282435 283302 284590 285504 285221 283625 281318 279028 277210 276023 275332 274760 274047 273327 272873 272680 272591 272678
$$ packed form
53006B80177J887R67j27q57j270j455j211o17j83l3L18J003J445J289R31O30M7
52989B82941q19j121k98R06J414J231J104J192J011N02K71O50J157J149O17O9
52973B91976j32j9K88Q34J559K030J834J224R15J144J399J319J207J256R14k21
52957C07527j437j709j147p43q44q15k46M02N19M6o64j171j117o08l50p97j409
52940B95437j391r93j133j866k242j813j243j199j456j491j236q91n67m02n13
52925B77001o62m96j62j23l66m90n19p58r23l84N80Q51J38m86j86M39M58j3k24
52906B73675j4K43L66M01K47j16l14n2M45Q04J070J413J640J413P93J94k4K51
52888B82435Q67J288R14k83j596k307k290j818j187o91n72p13p20m54j93q9Q7
$$ plain form
52871 272678 273197 274194 275409 276533 277411 278106 278976 280417 282341 284130 285382 286373 287459 288364 288527 287876
52855 287876 286709 285012 282508 279303 275874 272429 268806 265073 261748 259260 257538 256262 255204 254258
52841 254258 253381 252597 251873 251066 250206 249690 249814 250242 250352 250086 250091 250966 252693 254798 256732 258034 258465 258165
52823 258165 257605 257339 257833 259233 261074 262440 262885 263074 264155 266652 270409 275421 281935 289524 296582
52808 296582 301119 301926 298977 293179 285969 278797 272506 267165 262542 258639 255737 254097 253708 254190 254849
52793 254849 254982 254268 252923 251464 250288 249374 248373 247119 246080 246072 247372 249270 250689 251148 251018 251036 251756
52776 251756 253237 255035 256549 257575 258387 259209 259869 260121 260032 259788 259356 258640 257753 256862 255987 255246 255021 255482
52758 255482 256120 256176 255475 254515 253832 253555 253419 252973 251927 250583 249695 249627 249934 250149 250662 252275 255045 258107
$$ packed form
52871B72678N19R97J215J124Q78O95Q70J441J924J789J252R91J086R05J63o51
52855B87876j167j697k504l205l429l445l623l733l325k488j722j276j058r46
52841B54258q77p84p24q07q60n16J24M28J10k66NQ75J727K105J934J302M31l00
52823B58165n60k66M94J400J841J366M45J89J081K497L757N012O514P589P058
52808B96582M537Q07k949n798p210p172o291n341m623l903k902j640l89M82O59
52793B54849J33p14j345j459j176r14j001j254j039qJ300J898J419M59j30J8P20
52776B51756J481J798J514J026Q12Q22O60K52q9k44m32p16q87q91q75p41k25M61
52758B55482O38N6p01r60o83k77j36m46j046j344q88o8L07K15N13J613K770L062
$$ plain form
52740 258107 260592 262261 263304 264006 264633 265282 265867 266521 267863 270379 273647 276666 278924 280637 281977
52725 281977 282622 282241 280958 279144 277100 275102 273470 272385 271804 271618 271703 271853 271881 271758 271445 270775 269796
52708 269796 269090 269235 269979 270420 270085 269435 269123 269202 269329 269520 270295 272060 274508 276769 278170 278754 278954 278953
52690 278953 278705 278516 279016 280344 281877 283030 283793 284096 283352 281349 279150 278178 278596 279355 279711 279815 279839
52673 279839 279492 278685 277941 277760 278104 278787 279845 281182 282296 282742 282609 282318 282240 282619 283523 284620 285336 285529
52655 285529 285820 287082 289697 293318 297004 299487 299707 297433 293366 288550 283786 279590 276429 274805 275034
52640 275034 276853 279227 280863 281250 281021 281058 281425 281548 281210 280803 280713 280928 281346 281940 282577 283024 283211 283166 282722
52621 282722 281716 280501 279814 279983 280541 280724 280124 278938 277850 277575 278212 279130 279783 280402 281421 282518 282942
$$ packed form
52740B58107K485J669J043P02O27O49N85O54J342K516L268L019K258J713J340
52725B81977O45l81j283j814k044j998j632j085n81j86Q5J50K8j23l13o70r79
52708B69796p06J45P44M41l35o50l12P9J27J91P75J765K448K261J401N84K00j
52690B78953k48j89N00J328J533J153P63L03p44k003k199r72M18P59L56J04K4
52673B79839l47q07p44j81L44O83J058J337J114M46j33k91p8L79R04J097P16J93
52655B85529K91J262K615L621L686K483K20k274m067m816m764m196l161j624K29
52640B75034J819K374J636L87k29L7L67J23l38m07r0K15M18N94O37M47J87m5m44
52621B82722j006j215o87J69N58J83o00j186j088k75O37R18O53O19J019J097M24
$$ plain form
52604 282942 282738 282941 284377 286836 289495 291651 292919 293242 292933 292326 291373 289982 288629 288018 288096 288095 287637
52587 287637 287167 287127 287439 288045 289225 290987 292744 293988 294817 295425 295661 295516 295508 295985 296439 296056 294737 293182
52569 293182 292155 292008 292604 293295 293199 291880 289664 287176 284884 283244 282774 283496 284588 285053 284556 283348
52553 283348 281700 279871 278353 277582 277467 277579 277751 278122 278717 279354 279908 280330 280444 280115 279614 279476 279831 280170
52535 280170 279903 279023 278033 277343 276882 276355 275800 275757 276762 278638 280396 281008 280355 279339 278956 279276 279510 279131
52517 279131 278601 278724 279548 280484 281390 282803 284884 286910 288317 289637 291677 294178 296010 296505 295914 294732
52501 294732 293265 291773 290391 288916 287250 285922 285562 285963 286334 286446 286742 287339 287772 287890 288215 289181 290683
52484 290683 292578 294956 297578 299705 300850 301257 301359 301267 300991 300659 300272 299730 299242 299228 299696 300306 301114 302586
$$ packed form
52604B82942k04K03J436K459K659K156J268L23l09o07r53j391j353o11P8jm58
52587B87637m70m0L12O06J180J762J757J244Q29O08K36j45qM77M54l83j319j555
52569B93182j027j47N96O91r6j319k216k488k292j640m70P22J092M65m97j208
52553B83348j648j829j518p71j15J12J72L71N95O37N54M22J14l29n01j38L55L39
52535B80170k67q80r90o90m61n27n55m3J005J876J758O12o53j016l83L20K34l79
52517B79131n30J23Q24R36R06J413K081K026J407J320K040K501J832M95n91j182
52501B94732j467j492j382j475j666j328l60M01L71J12K96N97M33J18L25R66J502
52484B90683J895K378K622K127J145M07J02r2k76l32l87n42m88j4M68O10Q08J472
$$ plain form
52466 302586 304736 306973 308997 311059 313099 314465 314851 314666 314077 312582 310083 307497 305595 303971 301970
52451 301970 299922 298621 298099 297881 298025 298909 300178 300771 300053 298305 296159 294101 292452 291269 290268 289207
52435 289207 288283 287836 287855 288057 288236 288188 287638 286650 285872 285970 287017 288727 290890 293177 294921 295623 295509 295213
52417 295213 295208 295853 297590 300559 304360 308637 313611 319541 326081 332770 339918 348371 358468 369624 380631
52402 380631 389880 395612 396687 393236 386308 377123 366924 357061 348517 341452 335677 331275 328348 326477
52388 326477 325002 323678 322545 321453 320253 319229 318797 318994 319745 321285 323717 326461 328832 330955 333401
52373 333401 336119 338508 340443 342494 345123 348285 351774 355313 358336 360313 361349 361965 362330 362340 362315 362896
52357 362896 364174 365569 366694 367745 368939 370191 371503 373176 375404 378011 380711 383303 385674 387977
$$ packed form
52466C02586K150K237K024K062K040J366L86j85n89j495k499k586j902j624k001
52451C01970k048j301n22k18J44Q84J269N93p18j748k146k058j649j183j001j061
52435B89207r24m47J9K02J79m8n50r88p78R8J047J710K163K287J744P02j14k96
52417B95213nO45J737K969L801M277M974N930O540O689P148Q453J0097J1156J1007
52402C80631R249N732J075l451o928r185j0199r863q544p065n775m402k927j871
52388C26477j475j324j133j092j200j024m32J97P51J540K432K744K371K123K446
52373C33401K718K389J935K051K629L162L489L539L023J977J036O16L65J0k5N81
52357C62896J278J395J125J051J194J252J312J673K228K607K700K592K371K303
$$ plain form
52343 387977 390695 394067 397604 400700 403649 407428 412513 418540 425092 432096 439394 446705 454232 462618
52329 462618 471988 481653 491120 500930 512108 525113 539600 554882 570389 585905 601524 617249
52317 617249 632709 647678 662769 679020 696731 715236 733867 752543 771254 789658 807573
52306 807573 825345 843282 861130 878459 895270 911871 928377 944591 960074 974125 985992
52295 985992 995397 1002588 1007747 1010733 1011715 1011616 1011436 1011230 1010167 1007519 1003356 998306 992942 987444 981762
52280 981762 976037 970799 966629 963705 961861 961048 961387 962760 964753 967257 970875 976432 984140 993333 1002958
52265 1002958 1012295 1021399 1030943 1041571 1053380 1066095 1079612 1094051 1109379 1125293 1141514 1157797
52253 1157797 1173610 1188254 1201545 1214042 1226236 1237673 1247218 1254100 1258487 1261089 1262501 1263003 1262788
$$ packed form
52343C87977K718L372L537L096K949L779N085O027O552P004P298P311P527Q386
52329D62618R370R665R467R810J1178J3005J4487J5282J5507J5516J5619J5725
52317F17249J5460J4969J5091J6251J7711J8505J8631J8676J8711J8404J7915
52306H07573J7772J7937J7848J7329J6811J6601J6506J6214J5483J4051J1867
52295I85992R405P191N159K986R82r9j80k06j063k648m163n050n364n498n682
52280I81762n725n238m170k924j844q13L39J373J993K504L618N557P708R193R625
52265A002958R337R104R544J0628J1809J2715J3517J4439J5328J5914J6221J6283
52253A157797J5813J4644J3291J2497J2194J1437R545O882M387K602J412N02k15
$$ plain form
52240 1262788 1262101 1261015 1259193 1256073 1251409 1245534 1239058 1232429 1225858 1219482 1213405 1207591 1201856 1195984
52226 1195984 1189964 1184236 1179574 1176366 1174020 1171488 1168523 1166018 1164938 1165388 1166949 1169383 1172577 1176281
52212 1176281 1180496 1185729 1192283 1199552 1206568 1212970 1218923 1224423 1229447 1234542 1240440 1247122 1253963 1260765
52198 1260765 1267918 1275572 1283397 1291250 1299300 1307282 1314380 1320106 1324698 1328399 1330904 1331848 1331330 1329574
52184 1329574 1326520 1322074 1316466 1310123 1303494 1297094 1291313 1285980 1280463 1274344 1267689 1260627 1253184 1245655
52170 1245655 1238709 1232871 1228246 1224782 1222366 1220570 1218817 1216930 1215105 1213326 1211461 1210021 1209972 1211365
52156 1211365 1212873 1213197 1212427 1211523 1210951 1210412 1209495 1208063 1206256 1204690 1204363 1205767 1208209 1210425 1211691 1211903
52140 1211903 1210902 1208378 1204451 1199807 1195116 1190690 1186731 1183572 1181500 1180681 1181441 1184386 1190014 1198223
$$ packed form
52240A262788o87j086j822l120m664n875o476o629o571o376o077n814n735n872
52226A195984o020n728m662l208k346k532k965k505j080M50J561K434L194L704
52212A176281M215N233O554P269P016O402N953N500N024N095N898O682O841O802
52198A260765P153P654P825P853Q050P982P098N726M592L701K505R44n18j756
52184A329574l054m446n608o343o629o400n781n333n517o119o655p062p443p529
52170A245655o946n838m625l464k416j796j753j887j825j779j865j440m9J393
52156A211365J508L24p70r04n72n39r17j432j807j566l27J404K442K216J266K12
52140A211903j001k524l927m644m691m426l959l159k072q19P60K945N628Q209
$$ plain form
52126 1198223 1208367 1219799 1232341 1246204 1261562 1278283 1296005 1314324 1332859 1351425 1370276
52115 1370276 1389935 1410593 1431878 1453324 1474710 1495660 1515443 1533758 1551403 1569461 1587959
$$ packed form
52126A198223J0144J1432J2542J3863J5358J6721J7722J8319J8535J8566J8851
52115A370276J9659K0658K1285K1446K1386K0950J9783J8315J7645J8058J8498
$$ [...]
##END NTUPLES=NMR SPECTRUM
##END=
