##TITLE=AC1388_PERAH12200_7519727_yzSkyq3V2s
##JCAMPDX= 6.0         $$ Bruker NMR JCAMP-DX V2.0
##DATA TYPE= NMR SPECTRUM
##DATA CLASS= NTUPLES
##ORIGIN= BRUKER
##OWNER= Administrator
$$ 1.72 TOPSPIN		Version 2.1
$$ 2015-07-10 21:57:13.394 -0700  Administrator@X
$$ Compression mode = diff/dup
##.OBSERVE FREQUENCY= 400.02188249412
##.OBSERVE NUCLEUS= ^1H
##.ACQUISITION MODE= SIMULTANEOUS (DQD)
##.ACQUISITION SCHEME= undefined
##.AVERAGES= 8
##.DIGITISER RES= 22
##SPECTROMETER/DATA SYSTEM= spect
##.PULSE SEQUENCE= zg30
##.SOLVENT NAME= COFFEE_meoh
##.SHIFT REFERENCE= INTERNAL, COFFEE_meoh, 1, 14.98509
##AUDIT TRAIL= $$ (NUMBER, WHEN, WHO, WHERE, PROCESS, VERSION, WHAT)
$$ ##TITLE= Audit trail, TOPSPIN		Version 2.1
$$ ##JCAMPDX= 5.01
$$ ##ORIGIN= Bruker BioSpin GmbH
$$ ##OWNER= Administrator
$$ $$ E:\/data/COFFEE/nmr/AC1388_PERAH12200_7519727_yzSkyq3V2s/20/pdata/1/auditp.txt
$$ ##AUDIT TRAIL=  $$ (NUMBER, WHEN, WHO, WHERE, PROCESS, VERSION, WHAT)
(   1,<2015-07-10 21:57:06.003 -0700>,<Administrator>,<X>,<go>,<TOPSPIN 2.1>,
      <created by zg
	started at 2015-07-10 21:56:00.144 -0700,
	POWCHK enabled, PULCHK disabled,
       configuration hash MD5:
       21 0F 79 D6 B3 7B B4 F6 88 20 88 DB 03 48 BD 9F
       data hash MD5: 64K
       72 EA 88 7F B5 59 86 26 9F CE CA 09 71 AA FD 69>)
(   2,<2015-07-10 21:57:09.222 -0700>,<Administrator>,<X>,<proc1d>,<TOPSPIN 2.1>,
      <Start of raw data processing
       efp LB = 0 FT_mod = 6 PKNL = 1 PHC0 = 0 PHC1 = 0 SI = 32K 
       data hash MD5: 32K
       DA 3C AF 24 49 E9 1C 23 AA 9E 8A 7A 18 AA 31 35>)
(   3,<2015-07-10 21:57:09.519 -0700>,<Administrator>,<X>,<proc1d>,<TOPSPIN 2.1>,
      <pk PHC0 = 92.6532 PHC1 = 0 
       data hash MD5: 32K
       BF 21 B5 6A 52 80 87 DC 89 A5 C5 25 81 FD 50 82>)
(   4,<2015-07-10 21:57:09.628 -0700>,<Administrator>,<X>,<proc1d>,<TOPSPIN 2.1>,
      <abs ABSG = 1 
       data hash MD5: 32K
       FA BB 5E 6C 4D 9A 47 1A F1 CB 10 38 9C 79 65 A6>)
(   5,<2015-07-10 21:57:09.691 -0700>,<Administrator>,<X>,<proc1d>,<TOPSPIN 2.1>,
      <abs ABSG = 2 
       data hash MD5: 32K
       89 42 93 75 86 78 BB 6D FB 93 2C D5 BF 50 3B 45>)
(   6,<2015-07-10 21:57:09.753 -0700>,<Administrator>,<X>,<proc1d>,<TOPSPIN 2.1>,
      <abs ABSG = 3 
       data hash MD5: 32K
       D6 27 AC 72 C7 B2 1A BE 58 83 B5 18 80 BA 99 BE>)
(   7,<2015-07-10 21:57:09.816 -0700>,<Administrator>,<X>,<proc1d>,<TOPSPIN 2.1>,
      <abs ABSG = 4 
       data hash MD5: 32K
       7E ED ED 18 37 74 75 DB 65 D5 71 F2 6D 76 32 CB>)
(   8,<2015-07-10 21:57:09.878 -0700>,<Administrator>,<X>,<proc1d>,<TOPSPIN 2.1>,
      <abs ABSG = 5 
       data hash MD5: 32K
       5A 6E 51 7D E2 BB 5D 77 0C 0D 4F 24 67 77 DE C7>)
$$ ##END=
$$ 
$$ $$ hash MD5
$$ $$ 6D C3 98 E7 E4 51 EA 08 B9 5D 1D 6E CE 69 48 D0
##$RELAX= 
##$RELAX= 
##$RELAX= 
##$RELAX= 
##$RELAX= 
##$RELAX= 
##$RELAX= 
$$ Bruker specific parameters
$$ --------------------------
##$DU= <E:\>
##$EXPNO= 20
##$NAME= <AC1388_PERAH12200_7519727_yzSkyq3V2s>
$$ [...]
150 150 150 150 150 150 150 150
##$TP07= 0
##$TPNAME0= <>
##$TPNAME1= <>
##$TPNAME2= <>
##$TPNAME3= <>
##$TPNAME4= <>
##$TPNAME5= <>
##$TPNAME6= <>
##$TPNAME7= <>
##$TPOAL= (0..7)
0.5 0.5 0.5 0.5 0.5 0.5 0.5 0.5
##$TPOFFS= (0..7)
0 0 0 0 0 0 0 0
##$TUNHIN= 0
##$TUNHOUT= 0
##$TUNXOUT= 0
##$USERA1= <user>
##$USERA2= <user>
##$USERA3= <user>
##$USERA4= <user>
##$USERA5= <user>
##$V9= 5
##$VALIST= <valist>
##$VCLIST= <CCCCCCCCCCCCCCC>
##$VD= 0
##$VDLIST= <DDDDDDDDDDDDDDD>
##$VPLIST= <PPPPPPPPPPPPPPP>
##$VTLIST= <TTTTTTTTTTTTTTT>
##$WBST= 2048
##$WBSW= 25
##$XGAIN= (0..3)
0 0 0 0
##$XL= 0
##$YL= 0
##$YMAX_a= 624421
##$YMIN_a= -527537
##$ZGOPTNS= <>
##$ZL1= 120
##$ZL2= 120
##$ZL3= 120
##$ZL4= 120
##$ABSF1= 14.98509
##$ABSF2= -5.573092
##$ABSG= 5
##$ABSL= 3
##$ALPHA= 0
##$AQORDER= 0
##$ASSFAC= 0
##$ASSFACI= 0
##$ASSFACX= 0
##$ASSWID= 0
##$AUNMP= <proc_prof1d_extract_pilot.lims>
##$AXLEFT= 0
##$AXNAME= <>
##$AXNUC= <1H>
##$AXRIGHT= 0
##$AXTYPE= 0
##$AXUNIT= <>
##$AZFE= 0.1
##$AZFW= 0.1
##$BCFW= 0
##$BC_mod= 0
##$BYTORDP= 0
##$COROFFS= 0
##$CY= 15
##$DATMOD= 1
##$DC= 0
##$DFILT= <>
##$DTYPP= 0
##$F1P= 0
##$F2P= 0
##$FCOR= 0.5
##$FTSIZE= 32768
##$FT_mod= 6
##$GAMMA= 0
##$GB= 0
##$INTBC= 1
##$INTSCL= 1
##$ISEN= 128
##$LB= 0
##$LEV0= 0
##$LPBIN= 0
##$MAXI= 10000
##$MC2= 0
##$MEAN= 0
##$ME_mod= 0
##$MI= 0
##$NCOEF= 0
##$NC_proc= -8
##$NLEV= 6
##$NOISF1= 0
##$NOISF2= 0
##$NSP= 0
##$NTH_PI= 0
##$NZP= 0
##$OFFSET= 14.98509
##$PC= 1
##$PHC0= 92.6532
##$PHC1= 0
##$PH_mod= 1
##$PKNL= yes
##$PPARMOD= 0
##$PPDIAG= 0
##$PPIPTYP= 0
##$PPMPNUM= 2147483647
##$PPRESOL= 1
##$PSCAL= 4
##$PSIGN= 0
##$PYNMP= <proc.py>
##$REVERSE= no
##$SF= 400.02
##$SI= 32768
##$SIGF1= 0
##$SIGF2= 0
##$SINO= 400
##$SIOLD= 32768
##$SPECTYP= <>
##$SREGLST= <1H.CDCl3>
##$SSB= 0
##$STSI= 32768
##$STSR= 0
##$SW_p= 8223.68421052631
##$SYMM= 0
##$S_DEV= 0
##$TDeff= 65536
##$TDoff= 0
##$TI= <>
##$TILT= no
##$TM1= 0
##$TM2= 0
##$TOPLEV= 0
##$USERP1= <user>
##$USERP2= <user>
##$USERP3= <user>
##$USERP4= <user>
##$USERP5= <user>
##$WDW= 1
##$XDIM= 32768
##$YMAX_p= 452032444
##$YMIN_p= -692665
##$CURPLOT= <Network HP LaserJet P1505>
##$CURPRIN= <$Network HP LaserJet P1505>
##$DFORMAT= <normdp>
##$LAYOUT= <+/1D_H.xwp>
##$LFORMAT= <normlp>
##$PFORMAT= <normpl>
##$SURQMSG= 1
$$ End of Bruker specific parameters
$$ ---------------------------------
##NTUPLES= NMR SPECTRUM
##VAR_NAME=  FREQUENCY,     SPECTRUM/REAL,   SPECTRUM/IMAG
##SYMBOL=    X,             R,               I
##VAR_TYPE=  INDEPENDENT,   DEPENDENT,       DEPENDENT
##VAR_FORM=  AFFN,          ASDF,            ASDF
##VAR_DIM=   32768,         32768,           32768
##UNITS=     HZ,            ARBITRARY UNITS, ARBITRARY UNITS
##FACTOR=    0.250966925370066, 1,           1
##FIRST=     8223.43324360094, -155938,      -167182
##LAST=      0,             -113944,         -162713
##MIN=       0,             -692665,         0
##MAX=       8223.43324360094, 452032444,    0
$$ Real data points
##PAGE= N=1
##DATA TABLE= (X++(R..R)), XYDATA
$$ [...]
19546C36980j21510f2852A0430J92669f694A62907a14273l3831j04213c8782B06200
19534b9285n4174b7490E1266M1272a47199A21774J28231a94208h1613l58840K0282
19523d20171a27913C7307a57165j28249D11949A67047b54893p6888J59881H857
19512A95487g1151d593k87143a4645A5917R6179J43517j0547h1872D6183a06334
19500f271A7127d7276j94713a4683M998m3A72510B9981b24574D9159b47726A0808
19487a33961c7197l27917E6240K0258a69419k31322B18974b55233H3717g970l07201
19476c15171f0144F6790a3698o3816k81337a38084O1365D6490a09403A8658a12909
19464i0880j08813m9858h8377A00404b38816B88834j27873k5042F4403f0568G8006
$$ y = [336980, 215470, -62852, 10430, 203099, -6694, 162907, -114273, -148104, -252317, -38782, 206200, -29285, -83459, -27490, 51266, 92538, -147199, 121774, 250005, -194208, -81613, -440453, -420171, -127913, 37307, -157165, -285414, 411949, 167047, -254893, -331781, -171900, 8857, 195487, -71151, -4593, -291736, -14645, 15917, 112096, 255613, 245066, -81872, 46183, -106334, -6271, 17127, -47276, -241989, -14683, -9685, -9728, 172510, 29981, -224574, 49159, -247726, 10808, -133961, -37197, -365114, 56240, 76498, -169419, -400741, 218974, -255233, 83717, -7970, -315171, -60144, 66790, -13698, -77514, -358851, -138084, -76719, 46490, -109403, 18658, -112909, -90880, -199693, -249551, -88377, 100404, -238816, 288834, 160961, 135919, 64403, -60568, 78006]
19452a11989A39698J58643a41843m2018K3523C144J56150h9600l6435B71080A15403
19440A52553l1991a42946L0627J7257g237k67840o384B7256L47204I6617C3352
19428h6883j09A33068n2893M77D020e7547j19195J338r1740m4916B0871a63172
19415d7147r600A23343a69227k44271A43010b10161C61921e7213k96172C41272
19404C2117J46040A733c9418l2623p9909c6755r7716e1618j20435q4281L7798
19393b18536G4064k0314N2500Q1304c46362N5865k6984B72371q7534O4548b3381
19381c92752J37298g2491C5754A5844b45300C6159f3128B59137i898q6491A96610
19369A9599c55943J58646l5417f3045B97972d8887A03024a4083A24665a01912
$$ y = [-111989, 139698, 298341, -141843, -183861, -160338, 3144, 159294, -89600, -126035, 271080, 115403, 152553, 120562, -142946, -112319, -95062, -7237, -275077, -281461, 27256, 374460, 96617, 33352, -86883, -86992, 133068, 80175, 80652, 4020, -57547, -176742, -175404, -267144, -312060, 20871, -163172, -47147, -56747, 123343, -169227, -413498, 143010, -210161, 361921, -57213, -353385, 341272, 32117, 178157, 1733, -39418, -72041, -151950, -36755, -134471, -51618, -172053, -256334, -218536, 74064, 53750, 106250, 187554, -346362, -290497, -317481, 272371, 184837, 249385, -23381, -392752, -255454, -72491, 35754, 15844, -245300, 36159, -63128, 259137, -9898, -96389, 196610, 19599, -355943, -197297, -232714, -63045, 297972, -48887, 103024, -14083, 124665, -101912]
19358A94245b75291a1815k91199R0115D2327F572a049A07657a15153N5783K883
19347e6487H1861k4545Q8260R4841q9957b56118d0712j17268l05506P7533a67905
19335b89237B5567b54832A60795a95503M27A83820i6117A668R5680a47317K0368
19324a26949C72921a21814C6122b16237p4671A47134F5715J47368I462b92962
19313b66184B760a42047j96082F0712b07332A18405a52807A42652c6408k52289
19303b88697O1052B28138b33318D8373a57538p7174A30555O1706a41032j14851
19293b55883J22606k15013A5305b59695E2625L7068B6096a16098E4261b7328J3038
19282a4290N922k42408j9144M7998A51637b09639B83326j34864b42578q4825d4533
$$ y = [194245, -275291, -11815, -303014, -212899, 42327, 6572, -1049, 107657, -115153, -59370, -56487, 81861, 57316, 145576, 240417, 150460, -256118, -40712, -157980, -463486, -385953, -167905, -289237, 25567, -254832, 160795, -195503, -195076, 183820, -96117, 1668, 97348, -147317, -126949, 372921, -121814, 36122, -216237, -290908, 147134, 65715, 213083, 9462, -292962, -266184, 2760, -142047, -338129, 60712, -207332, 118405, -152807, 142652, -36408, -288697, -227645, 228138, -233318, 48373, -157538, -234712, 130555, 192261, -141032, -255883, -133277, -348290, 15305, -259695, 52625, 89693, 26096, -116098, 54261, -27328, -14290, -8368, -250776, -269920, -221922, 151637, -209639, 283326, 148462, -242578, -327403, -44533]
19270B52637b4993o4928A48858b06062K4862L1084r8010A94323e8189K5150j47121
19259a80160E4190j2165M8594P7980i8296k852A30689a22865l5528k1695L278
19248a76810B62789a68513M713N4140A59993a94765A96005a17555j54484m4188
19238c16227f8920D0477b80843J1824L8656D1229R046R7426B6059J7334c25101
19226B9714a50498o1868d8112k27354a6446A1799i9479j5945C69151C0351J94989
19215B25340q3422n4836e6350p3191L8931A26881M876b37265L722b7789C3830
19203h240H8887b54145M3978q9370e6474C17345a21388M2982B6194f6061A85039
19191B22684b25716A6770f0604q4795J8292d3525k10905g8296k62099a5899B44064
$$ y = [252637, -24993, -89921, 148858, -206062, -181200, -150116, -248126, 194323, -58189, -33039, -180160, 54190, 42025, 90619, 168599, -98296, -101148, 130689, -122865, -158393, -180088, -176810, 262789, -168513, -163800, -109660, 159993, -194765, 196005, -117555, -272039, -316227, -68920, 40477, -280843, -269019, -230363, 41229, 50275, 147701, 26059, 43393, -325101, 29714, -150498, -212366, -48112, -275466, -16446, 11799, -99479, -115424, 369151, 30351, 225340, 141918, 87082, -56350, -129541, -90610, 126881, 131757, -237265, -233543, -27789, 33830, -8240, 88887, -254145, -210167, -299537, -56474, 317345, -121388, -78406, 26194, -66061, 185039, 222684, -225716, 16770, -60604, -145399, -127107, -43525, -254430, -78296, -340395, -15899, 244064]
19179I1196a3366A09067J87667H8969J36521e27815a9578C9611c7654B74563a50819
19167c09836J3907a40672o7771O912C16806a8230j94543i4419A50558P5986G9596
19155A41483o310k5038h6039A36129b48781A05586a94276G0401P1072i7333F166
19143B01126d4222A05270h7499l8261j38049a19533I0531b15279F8465R7215p3858
19132I1822C7180c15315C60877c9900q7669C28123A39034C8370b01322F6957i1371
19120E4083j1818e2154A37580P7396b67543K7043b9311B29818a02491j15733j87756
19109d05980J17836a25727K4413K4973j83683A3586h8424a1555D3909a95152k2053
19098b17205E0912e1229c46j60198E4022B2813a41755N4687b9543B03317o8472
$$ y = [91196, -13366, 109067, 296734, 88969, 225490, -527815, -19578, 39611, -37654, 274563, -150819, -309836, -295929, -140672, -208443, -201531, 316806, -18230, -212773, -94419, 150558, 226544, 79596, 141483, 135173, 110135, -86039, 136129, -248781, 105586, -194276, 70401, 141473, -97333, 6166, 201126, -44222, 105270, -87499, -125760, -263809, -119533, 90531, -215279, 68465, 165680, 91822, 37180, -315315, 360877, -39900, -127569, 328123, 139034, 38370, -201322, 66957, -91371, 54083, 42265, -52154, 137580, 214976, -267543, -240500, -29311, 229818, -102491, -218224, -405980, -288144, -125727, -101314, -76341, -260024, 13586, -88424, -11555, 43909, -195152, -217205, 50912, -51229, -346, -160544, 54022, 22813, -141755, -87068, -29543, 203317, 134845]
19087A34845A5328d08198a30804e1014E9084a63896P6064j09003j46389h4162
19076d40967i6710j94460D6170d1009k9400o0738E6295n658N4644b76610a00618
19064a50514D7646J9703a93970f3014I7488C8132i4479A15359h4704g60j07906
19053a08666A8996a99425O7777n5650K4379Q0581l14350I0153a91961N9306A07648
19041a59404a3508j41787M9248I8556j9669J11879A9739b77587C5888J86182L11522
19030E33592d0247A71603p7603Q3972a7885F5655e734I6676c3403A52892K2356
19019A75248A3472J21341n4967b19666p7023c5595k03572i4179A53785M0968d43806
19007b4541l40025d3651l610m16448a81644B34388d36354E3507J71417q3368j1943
$$ y = [134845, 15328, -408198, -130804, -51014, 59084, -163896, -87832, -196835, -343224, -84162, -440967, -96710, -291170, 46170, -41009, -70409, -131147, 56295, 50637, 105281, -276610, -100618, -150514, 47646, 67349, -193970, -63014, 97488, 38132, -94479, 115359, -84704, -760, -108666, 18996, -199425, -131648, -187298, -162919, -82338, -396688, 90153, -191961, -132655, 107648, -159404, -13508, -155295, -106047, 98556, 78887, 190766, 19739, -277587, 35888, 222070, 533592, -40247, 171603, 94000, 177972, -17885, 65655, -5734, 96676, -33403, 152892, 175248, 13472, 134813, 79846, -219666, -296689, -35595, -239167, -94179, 153785, 194753, -443806, -24541, -364566, -43651, -47261, -463709, -181644, 234388, -436354, 53507, 224924, 141556, 129613]
18996A29613b02822A39128N833c5057A06026L2810e07q4853b4498l08845a56185
18984A4300c3057A05173A5410J00492d821r8602n4486j545H1322K2529i9919A11875
18971c2641k70686I1375d50814A9689J21906A000J33299a90610A26054N2008o9802
18960A08260f7002m7839a4752o178G7497b10991j20769a14368A283b03335M5559
18949a57776c0100k25709M2987J01031e5724j19126B74344b23405D6389a17533
18938e8637J8204H2703G701Q0493a26612M5018F4131i1249a3294m99481J82233
18927c30542Q4654Q4968F452J56069a35539l3412L563G5538J87630b78363H9661
18915i5899I6155c20085E7454b52628i9992J452C7925b20144A1130J20941n001
$$ y = [129613, -202822, 139128, 144961, -35057, 106026, 138836, -507, -85360, -24498, -333343, -156185, 14300, -33057, 105173, 15410, 115902, -4821, -103423, -157909, -159454, 81322, 103851, -99919, 111875, -32641, -303327, 91375, -450814, 19689, 141595, 1000, 134299, -190610, 126054, 178062, 108260, -67002, -114841, -14752, -20930, 77497, -210991, -331760, -114368, 1283, -203335, -157776, -30100, -255809, -212822, -111791, -55724, -174850, 274344, -223405, 46389, -117533, -58637, -40433, 82703, 7701, 88194, -126612, -81594, 64131, -91249, -13294, -512775, -330542, -245888, -160920, 6452, 162521, -135539, -168951, -165388, 75538, 263168, -278363, 89661, -95899, 96155, -320085, 57454, -252628, -99992, -98540, 37925, -220144, 11130, 132071, 127070]
18904A27070a53664H1178a9536k00109j4494h5325k17458A72028a69035c8703
18893A85969C0475f7A0273h9265A29460a57458H1440b91297H550a68023A85453
18881h8990P853A84942B5643b23438H0374F306b4063A27060j6017a8333j68575
18870a86908f2314j91503C00580A02036a7685o1599A26691b05261b6458J1719
18860a4739j70331j7495B4112K1103N2303a41081j64910a22867j11803N6851B42724
18848D74876i6170k5721a7902p3728E4545A6208a44285f8281j11714A10690a66683
18836a97791O4810k38019g4595a2635m1516p6838E7499c7908A1226i9794j13078
18825b12872B11390F8295b2460j34534F0334B433K23485f0247E1472J90955H8694
$$ y = [127070, -153664, 81178, -19536, -219645, -234139, -85325, -302783, 172028, -169035, -38703, 185969, 30475, -67, 10273, -89265, 129460, -157458, 81440, -291297, 8550, -168023, 185453, -88990, -81137, 184942, 25643, -223438, 80374, 6306, -24063, 127060, 111043, -18333, -186908, -62314, -253817, 300580, 102036, -17685, -79284, 126691, -205261, -26458, -14739, -185070, -202565, 24112, 45215, 97518, -141081, -305991, -122867, -234670, -177819, 242724, 474876, -96170, -121891, -17902, -91630, 54545, 16208, -144285, -68281, -179995, 110690, -166683, -197791, -132981, -371000, -74595, -12635, -54151, -130989, 57499, -37908, 11226, -99794, -212872, 211390, 68295, -22460, -156994, 60334, 2433, 225918, -60247, 51472, 242427, 88694]
18813I4548a50089L7969B15079A5414N0560J51917b02708I3204M3993c88795A86643
18801c47612l976b3190m7823l60847a00531F2844a79787A39140K3880A7247d3908
18789g7914j08890B65979a6419l2702E447e9729b4162p7954L7908A06554a50968
18777E322f7104l3920l48449a10812n147m9342M1004A45752e0733o7786b2484
18765f0869A34496K7940a32488B0779h1803A31505F5348a85210N7828j8122A36582
18753d63768a35986c9020j92442c8137p890H2634a20138e8729k21509I7632c50542
18741a8746A07960a73607B28404j03290J97961E1743a94155f6898k7193I6321
18730b43788J2359a6107q3845a4935D0096b44344F5534k2632J38323j0989E0711
$$ y = [94548, -150089, -112120, 215079, 15414, 65974, 217891, -202708, 93204, 137197, -388795, 186643, -347612, -351588, -23190, -71013, -431860, -100531, 62844, -179787, 139140, 163020, 17247, -43908, -77914, -186804, 265979, -16419, -49121, 5447, -59729, -24162, -102116, -64208, 106554, -150968, 5322, -67104, -101024, -449473, -110812, -115959, -165301, -124297, 145752, -50733, -118519, -22484, -60869, 134496, 162436, -132488, 20779, -81803, 131505, 65348, -185210, -127382, -145504, 136582, -463768, -135986, -39020, -231462, -38137, -46027, 82634, -120138, -58729, -280238, 97632, -350542, -18746, 107960, -173607, 228404, 125114, 323075, 51743, -194155, -66898, -94091, 96321, -243788, -231429, -16107, -99952, -14935, 40096, -244344, 65534, 42902, 181225, 170236, 50711]
18718i8769l49414B20293a10837M8697A3406J2549i9587I7867a10305B20828A9517
18706D2563b71857c1441j09296j17191c9782G9318e83747a72730j5488B2556f6209
18694d5524A3806L54473a73387M1747p2617A99899c4129A45590B1635L62545d0535
18682g3675k4873d542C84581b19955B3390c18111B7015C179i0205j16916A787
18670A33385b54749J14905d7784p1396E6609f6416m0392j26641g0539k47632J29876
18659a88295L4660B0038O9090l234B7480a44475A876b12053O5709m11128g2546
18647B1919f3602j77574R2406j77421J04074K0437A03281C7261b36653M026B05927
18635c5882G3400a66468d5956j24554O001f859A85156R0965b09876M9166J947
$$ y = [-98769, -448183, 220293, -110837, -62140, 13406, 25955, -99587, 97867, -110305, 220828, 19517, 42563, -271857, -31441, -140737, -257928, -39782, 79318, -583747, -172730, -188218, 22556, -66209, -45524, 13806, 368279, -173387, -131640, -204257, 199899, -34129, 145590, 21635, 384180, -40535, -73675, -98548, -4542, 384581, -219955, 23390, -318111, 27015, 3179, -90205, -207121, 1787, 133385, -254749, -139844, -47784, -119180, 56609, -66416, -106808, -233449, -70539, -318171, -188295, -153635, 20038, 89128, 85894, 27480, -144475, 1876, -212053, -146344, -557472, -72546, 21919, -63602, -241176, -148770, -326191, -222117, -201680, 103281, 37261, -236653, -232627, 205927, -35882, 73400, -166468, -45956, -170510, -164509, -6859, 185156, 276121, -209876, -160710, -158763]
18624a58763l40164I0665m3345b14308h1605k81423a45653M0306K5589k44593
18614c24351D4893c14719h5193P893K5549B6354n838C797K75626c78816B8436
18602c11666e8351A21506A8286a41340l5156a3029A36702A8304a09382C20730
18591a33082A86677h1940F4591K51704f9789q6343c8196r2008k20977d6738A50376
18579a47443M5328K7106m902H3445a39816A1350c39065I5167m6710J16558a69151
18567a85975A2834c10698A53103a38537d0801k77327J58647A07626a94858B07988
18556f0005D7599J50903a39476A46392c83829J66004B08221i2303m27977A57971
18545A62107b03612K1685l569c0946F5810f5302j5735l03945J45796C98445a61454
$$ y = [-158763, -498927, 90665, 47320, -214308, -81605, -363028, -145653, -105347, -79758, -324351, 44893, -314719, -85193, -77300, -51751, 26354, 20516, 3797, 279423, -378816, 28436, -311666, -58351, 121506, 18286, -141340, -176496, -13029, 136702, 18304, -109382, 320730, -133082, 186677, -81940, 64591, 316295, -69789, -156132, -38196, -130204, -351181, -46738, 150376, -147443, -102115, -75009, -79911, 83445, -139816, 11350, -339065, 95167, 48457, 165015, -169151, -185975, 12834, -310698, 153103, -138537, -40801, -318128, -159481, 107626, -194858, 207988, -60005, 47599, 198502, -139476, 146392, -383829, -217825, 208221, -92303, -520280, 157971, 162107, -203612, -181927, -185496, -30946, 65810, -65302, -81037, -384982, -239186, 398445, -161454]
18533b64094R8840e0772j71374F3386b36097A13660a8512j06110F1691a89125
18522b0215k331A65561c0234A04332a45624j62507F7432a21971B57036g90j95883
18511a96673P0975H8858b54162J11316A0314a16630a5540o1561B34072o3818b7338
18499a70629k3973E1004K26303G8084f4734q2328q02k5133A70888A9929i0216
18487a00262I2443B5085M44673b71049B15983b12784e5110j9371I1235a62490
18476c7158j21932A14131K46192o1649A0443b23432a1915j74468g8152j75556
18466b53708C6682O3013N5210A4314h1102B51860b68334e7675I6665c99649E5578
18454b05302j35562g9054C9963b24355A76746D6009k1445K0235L1841a5874l769
$$ y = [-264094, -165254, -50772, -222146, 63386, -236097, 113660, -18512, -124622, 61691, -189125, -20215, -22546, 165561, -30234, 104332, -145624, -308131, 67432, -121971, 257036, -790, -196673, -125698, 88858, -254162, -142846, 10314, -116630, -15540, -77101, 234072, 170254, -27338, -170629, -194602, 51004, 277307, 78084, -64734, -147062, -147864, -172997, 170888, 19929, -90216, -100262, 92443, 25085, 469758, -271049, 215983, -212784, -55110, -74481, 91235, -162490, -37158, -159090, 114131, 360323, 298674, 10443, -223432, -11915, -186383, -78152, -253708, 36682, 99695, 154905, 14314, -81102, 251860, -268334, -57675, 96665, -399649, 55578, -205302, -340864, -79054, 39963, -224355, 176746, 46009, 24564, 44799, 76640, -15874, -19643]
18443a9643k75379M543B9934b56768j86570i0212k18939A84197R0838d58984a19089
18431b55609L9730A7681M0447k7177a20471f094o5270b2996E8407R9445f6682
18419a16271H2205a86980o740C547f1321I220M31490A01026J06680c12491b8106
18407H3038K3504A9993M36166e6199A26603K938a08660d6336B83037m8106A2264
18395A2177J73203a33656k49632g7369j71040D8665M0425K00799b60749e0067
18384a59776I4957c8588j37936q0364A70939a29195A63263b36484A26158E8742
18373A90892k1067J37971a03081A73891B9574a78873B6850c2021j25975B28066
18362a15245H0416a60842n8540i7991A60481b87734J34536m9203Q1479A47380
$$ y = [-19643, -295022, -290479, 29934, -256768, -443338, -90212, -309151, 184197, 275035, -458984, -119089, -255609, -215879, 17681, 58128, 30951, -120471, -6094, -71364, -22996, 58407, 157852, -66682, -116271, 82205, -186980, -193720, 3547, -61321, 9220, 440710, 101026, 207706, -312491, -28106, 83038, 106542, 19993, 456159, -56199, 126603, 129541, -108660, -46336, 283037, 234931, 12264, 12177, 185380, -133656, -383288, -77369, -248409, 48665, 89090, 289889, -260749, -50067, -159776, 94957, -38588, -176524, -256888, 170939, -129195, 163263, -236484, 126158, 58742, 190892, 169825, 307796, -103081, 173891, 29574, -178873, 26850, -32021, -157996, 228066, -115245, 80416, -160842, -219382, -97991, 160481, -287734, -153198, -202401, -120922, 147380]
18351a82888Q8263j52773A3260d08566J84074L8822A36325a94770I0087c26146
18340E2096b75836J36838B42537i3026o3600D0467a04602c1271D6155c51426a06196
18328c17095A39516e0899k8520A24454J5674b17585P9952j4254A06315a51899
18317a57482b4642j25493l9749H4626c08917a28538k15843J63842b2379l8503
18307f0882m5803e1992L21I9716i3470k7258j6453B53342a49861A18759a15164
18295C73767i8922M716j83183N2044D5305a80023G7256h7143L0883R900h436C9315
18282a70129B39650f704B27651h0765F4814a5833l80886F2554K98724g3603K8982
18271d4621A97199g9509o8208A78761b63642C3223g7867c1596C33776e0088o0053
$$ y = [-182888, -94625, -247398, 13260, -408566, -224492, -185670, 136325, -194770, 90087, -326146, 52096, -275836, -138998, 242537, -93026, -156626, 40467, -104602, -31271, 46155, -351426, -106196, -317095, 139516, -50899, -79419, 124454, 140128, -217585, -137633, -151887, 106315, -151899, -157482, -24642, -150135, -189884, 84626, -308917, -128538, -344381, -180539, -22379, -60882, -106685, -51992, -51671, 99716, -93470, -120728, -137181, 253342, -149861, 118759, -115164, 373767, -98922, -94206, -277389, -225345, 45305, -180023, 77256, -87143, -56260, -46360, -8436, 39315, -170129, 239650, -6704, 227651, -80765, 64814, -15833, -396719, 62554, 361278, -73603, -44621, 197199, -79509, -147717, 178761, -263642, 33223, -77867, -31596, 333776, -50088, -110141]
18260a10141e0146m8955a6362j24572L644c5099k6094M739j48580A02409D08O65
18248A073b14339A31476C2940d09970d6310j07599g1335A09553a45192F0195a36196
18236a98482d4027A48046a19604j56226h362j63199I3104a35310b7133A68501
18225a0908C6780f343j09932A76809b43907A0646J6689R150b20002G2582b19704
18213H334a11503A17239M9559E5665j1099A0516P2952J23556h3682B79106a07541
18201a67181F7930R842a3863r4163A11537Q1357a9361L055A2015a78264b1620
18189h6228n6261k8701e3443A56932a03194B4352K67818a7383j53997p0040J3460
18178b27960L4959b5862C6238a66945G1393b40914b3939J0502p8202k13569a46707
$$ y = [-110141, -50146, -99101, -16362, -140934, -137290, -35099, -61193, -56454, -205034, 102409, 408, 1073, -214339, 131476, 32940, -409970, -46310, -153909, -71335, 109553, -145192, 60195, -136196, -198482, -44027, 148046, -119604, -275830, -8362, -171561, 93104, -135310, -27133, 168501, -10908, 36780, -6343, -116275, 176809, -243907, 10646, 27335, 36485, -220002, 72582, -219704, 8334, -111503, 117239, 166798, 55665, 44566, 10516, 83468, 207024, -83682, 279106, -107541, -167181, 67930, 77772, -13863, -108026, 111537, 192894, -19361, -16306, 12015, -178264, -21620, -86228, -142489, -171190, -53443, 156932, -103194, 24352, 292170, -17383, -171380, -241420, -227960, -193001, -25862, 36238, -166945, 71393, -240914, -23939, -13437, -91639, -305208, -146707]
18166D4488a9731j73832h3681H897J49100o3100a30600G9863J30037a37917L8139
18155i9778A09216m4552J02619d3511l5730l54420F9719j874b08005C1451a90519
18143f8508R075G5810c4822j97313B3589b63357J22362A88070A957L3427a77779
18131D2736a21673A80254i5008k1735C44102b82777A11387J41727A788b89777
18120B33926a25587C9547b85372d9875I2084i475j91692N2710J1062k7747J4118
18109a51024A03179Q8447a8180A33676k4724a37163A20308a4063A95860E9106
18098H9223B2204i7676j16115I5509b59311B5995a44799F3168a48532C15384a55627
18086c9485p2564M6507D77802a12970N0439P076A40629c0473r6206A01129g3950
$$ y = [44488, -19731, -193563, -83681, 8897, 157997, 94897, -130600, 79863, 209900, -137917, -99778, 109216, 64664, 167283, -43511, -79241, -433661, 69719, 67845, -208005, 31451, -190519, -68508, -59433, 75810, -34822, -232135, 23589, -263357, -140995, 188070, 1957, 35384, -177779, 42736, -121673, 180254, -95008, -116743, 344102, -282777, 111387, 253114, 1788, -289777, 233926, -125587, 39547, -285372, -49875, 92084, -9475, -201167, -148457, -137395, -165142, -151024, 103179, 191626, -18180, 133676, 108952, -137163, 120308, -14063, 195860, 59106, 89223, 22204, -97676, -213791, 95509, -259311, 25995, -144799, 63168, -148532, 315384, -155627, -39485, -112049, -65542, 477802, -112970, -62531, -55455, 140629, -30473, -126679, 101129, -73950]
18074A06414k1858I116g6158F9642R8188n1498a63400d1870k02875d5509A30037
18062C3731J13408O8818a14553j83103P5314j2657c5629f7j93537h3474j48956
18051b32430F3245N2725a7520j41755O3489j13883D9549J77444b99193G6844a93433
18039c36243J47961h2630J5739E7545P394b36900f5294b5168k14140K5612A00327
18027c54476A51717Q3006I7860j3714K27778m0133i7468Q543D35204E2941p681
18016D5260i7337B83625b16813o7813J14752B24018F9358a63226B32600a10515
18005a4184j56880E7651a71873I5249K0065n7382i0130A66302a30898B15669L7425
17994B53094f1455A11044g3522a7541A08070J24862a96046A4168g3528j2539A4589
$$ y = [106414, 84556, 9116, -76158, 69642, 167830, 116332, -163400, -41870, -244745, -45509, 130037, 33731, 147139, 215957, -114553, -297656, -222342, -234999, -35629, -67, -193604, -83474, -232430, 63245, 115970, -17520, -159275, -95786, -209669, 49549, 226993, -299193, 76844, -193433, -336243, -188282, -82630, -66891, 57545, 64939, -236900, -65294, -25168, -239308, -213696, 100327, -354476, 151717, 234723, 97860, 84146, 311924, 271791, -97468, -88925, 435204, 52941, 45260, -97337, 283625, -216813, -284626, -169874, 224018, 69358, -163226, 232600, -110515, -14184, -171064, 57651, -171873, 95249, 115314, 57932, -90130, 166302, -130898, 215669, 253094, -61455, 111044, -73522, -17541, 108070, 232932, -196046, 14168, -73528, -86067, 14589]
17982a29436L3752o7660B21232B0999i6773j99057D57355A0267a50374I2581a02453
17970a33032A15902E1365b34512f5089C69204i8998L807B5588J36289o5859l4565
17959F1453h3650E9939a1268Q02l5411l50161J41761A16735K50586E5025f17p3905
17947g4522l25828J24242A34308I332J29174A1990J03053d9898n180j27062f057
17935I3023O0861J4902b3187j46659G0097m337l204h7863A76153h5977p4514N9136
17923a01355D4455b28022J13769b6429A11928b99804M0082d2562j54587j47615
17913c44764i7795j62803H3953a32528J6890L6556K955O358B75037I451a48557
17901A57288q81i6737b5095k9652o9222a1224A10799J3906a2293n9471A13665
$$ y = [-129436, -95684, -163344, 221232, 20999, -96773, -295830, 457355, 10267, -150374, 92581, -102453, -133032, 115902, 51365, -234512, -65089, 369204, -98998, -95191, 25588, 161877, 96018, 61453, -83650, 59939, -11268, -10466, -45877, -396038, -254277, 116735, 367321, 55025, -617, -74522, -400350, -276108, 134308, 9332, 138506, 11990, 115043, -49898, -55078, -182140, -6057, 93023, 153884, 168786, -23187, -169846, 70097, 65760, 62556, -87863, 176153, -85977, -160491, -101355, 44455, -228022, -114253, -26429, 111928, -299804, -259722, -42562, -197149, -344764, -97795, -260598, 83953, -132528, -115638, -79082, -76127, -69769, 275037, 9451, -148557, 157288, 156407, -96737, -25095, -54747, -123969, -11224, 110799, 124705, -12293, -71764, 113665]
17889A46346h9600h636j40384f855k30189F7087L53342i6677k11649J15854c8674
17877B66831c4051A10034b16998A73638o3093d23231a11490B41078i2109j07880
17867a99989I8212a79567C29653j18265E9096h7180Q862k909G652b66261J20286
17856a45975D5464J58023K30388c07214A82998R0602D2800d8431k4953k28287
17846c01671f3707C8426g32k30381B05852B3155d7263o2678j20931C9753a4377
17834c514G7871J55274e1781A17775K6587b55080g7877I620K76278A39134a0878
17822B38334d3758B98213p9181J5477r9183D2902N0250a56648A52082b6921A08368
17810B32486e2475A86986J28127J36627g531m08705G2087C2458d04438a58243
$$ y = [146346, -89600, -8636, -149020, -6855, -237044, 67087, 420429, -96677, -308326, -192472, -38674, 266831, -34051, 110034, -216998, 173638, 110545, -423231, -111490, 241078, -92109, -199989, 98212, -179567, 329653, 211388, 59096, -87180, -78318, -81227, 7652, -266261, -145975, 45464, 203487, 433875, -307214, 182998, 273600, 42800, -48431, -73384, -301671, -63707, 38426, -732, -231113, 205852, 23155, -47263, -109941, -230872, 39753, -14377, -3514, 77871, 233145, -51781, 117775, 144362, -255080, -77877, 9620, 285898, 139134, -10878, 238334, -43758, 298213, 219032, 234509, 135326, 42902, 93152, -156648, 152082, -26921, 108368, 232486, -52475, 186986, 315113, 451740, -7531, -416236, 72087, 32458, -404438, -158243]
17799G5892i4546A8668a50431B45944h6674j94922A79781b06831B55871b52141
17788A03313J64766a19611A13878C7286b93274f8243a5348A22927D0664b5524
17777d2798r8738F7603C199b69982I4405f4201j0583n557J5649F1260h7131j6115
17765a03246A2387K46459d0577A80123a33773B69338d4364j57809C2064R5550
17755A27614i3268B2389g2095C38828b199p7269B25933H4099g1027k57108a43514
17743H8439a38828k13191e9641E5718b23037A24355R3482L14144G0078j3101J3548
17732G0525b26570A25917K15546j09220b754k57275F0191g3796G0627a59231D5083
17720e989p446I4901a13354A90275l890a16549G7920K5335b89317G8864J15665
$$ y = [75892, -94546, 18668, -150431, 245944, -86674, -281596, 179781, -206831, 255871, -252141, 103313, 268079, -119611, 113878, 37286, -293274, -68243, -15348, 122927, 40664, -25524, -42798, -141536, 67603, 3199, -269982, 94405, -64201, -74784, -80341, -64692, 61260, -87131, -103246, 12387, 258846, -40577, 180123, -133773, 269338, -44364, -202173, 32064, 127614, -93268, 22389, -72095, 338828, -2199, -79468, 225933, 84099, -71027, -328135, -143514, 88439, -138828, -352019, -59641, 55718, -223037, 124355, 217837, 531981, 70078, 56977, 70525, -226570, 125917, 341463, 232243, -2754, -260029, 60191, -73796, 70627, -159231, 45083, -5989, -13435, 94901, -113354, 190275, 186385, -116549, 77920, 103255, -289317, 78864, 194529]
17709A94529c33381A16940c71680h9049C6325e716A00282R3634e6585I4182R5900
17698A90082g7536K915A33622c7305E6871h2374E6237a13115b1595B00798G1144
17686B8328a74100j0436j46528n6721a71074E1942A1521f7674H1750g9641E1138
17674a21649J1868l1631e5274B59627a51958g0897L150j41175A08860c4379A27508
17662b5774n9342B44654N6354o8075B8028b70875A92063c22621a9042A3573L00572
17651C14145H6686b86385A55180c6757B36527c3857A02635J447m547a87863C3766
17639b48916B6879h7197A67318D1323A1874Q0977d1110k29436a28868a2717B0805
17627b00872G8971l3005J22959k2650J02746a1752I9147F008a83918A94683k3293
$$ y = [194529, -333381, 116940, -371680, -89049, 36325, -5716, 100282, 193916, -56585, 94182, 190082, -77536, -74621, 133622, -37305, 56871, -82374, 56237, -113115, -21595, 200798, 71144, 28328, -174100, -184536, -331064, -387785, -171074, 51942, 11521, -67674, 81750, -79641, 51138, -121649, -109781, -141412, -55274, 259627, -151958, -70897, -67747, -208922, 108860, -34379, 127508, -25774, -85116, 244654, 301008, 232933, 28028, -270875, 192063, -322621, -19042, 13573, 314145, 86686, -286385, 155180, -36757, 236527, -33857, 102635, 104082, 99535, -187863, 33766, -248916, 26879, -87197, 167318, 41323, 11874, 92851, -41110, -270546, -128868, -12717, 20805, -200872, 78971, 45966, 168925, 146275, 249021, -11752, 99147, 6008, -183918, 194683, 171390]
17616A71390c42611A19610a12703A41635a79168M9688B88030O4211A1629K9949
17606D1578O9431B9356N0468I83J26420K07699g2505j0979A29532O4971a43826
17594A70782D089J04311J60368o6681a41355c9033B10495Q802a53874d9753B51155
17582c89083a07745j39049f6025A71057H4794G868d3826A44647K5820j7564a471
17570A09909K07823a00126C22034b66032G5051Q5475i6535j16701Q5964K3368
17560a03904L0108B3490b47191A42465D0497C288a35127l5317D4335c1074k74146
17549c05220A10989C1788a33286A70740d0937k77220D10132b37578B29190b7551
17538B24003I6746e8776j30000B0294K93102j03047B0202a09525j45078B80297
$$ y = [171390, -342611, 119610, -112703, 141635, -179168, -129480, 288030, 352241, 11629, 41578, 111009, 29356, 79824, 983, 127403, 335102, -72505, -83484, 129532, 194503, -143826, 170782, 4089, 108400, 268768, 202087, -141355, -39033, 210495, 219297, -153874, -49753, 251155, -389083, -107745, -246794, -66025, 171057, 84794, 7868, -43826, 144647, 170467, 152903, -1471, 109909, 317732, -100126, 322034, -266032, 75051, 160526, -96535, -213236, -127272, -103904, -73796, 23490, -247191, 142465, 40497, 3288, -135127, -170444, 44335, -31074, -305220, 110989, 31788, -133286, 170740, -40937, -318157, 410132, -237578, 229190, -27551, 224003, 96746, -58776, -188776, 20294, 313396, 210349, 20202, -109525, -254603, 280297]
17527B61482l8593f3062k1881B41184b66035H6018B7262J44598L5871a178r1787
17516i2965B61842C3392R4654c2273D27045A2642J64407k9333p2475a31272B21599
17504A95174E5243P4191b15938J05696M5825l35489a71132C64633j21787j0326
17494B32520K5043r1429J4188J3652a00309A01145M68190k72074F933a81175A97846
17482C08440n2457A14887d2821C6561a6692A06337K22384K92867a38421q5951
17472b24372B2816J62789R5628J7556i1247m987A17840a82412B47609K5596L2196
17461C05401c118A89418a12459B18201J54984j27934J66935j49507M5058D2976
17450C75865q6896P920r6988N9284L6454P0460m5521J65964J1649o3415j90579
$$ y = [261482, 222889, -63062, -84943, 241184, -266035, 86018, 27262, 171860, 207731, -1178, -92965, 261842, 33392, 128046, -32273, 427045, 12642, 177049, 147716, 75241, -131272, 221599, 195174, 55243, 129434, -215938, -110242, -64417, -399906, -171132, 364633, 242846, 232520, 257563, 166134, 180322, 193974, -100309, 101145, 569335, 297261, 6933, -181175, 197846, 308440, 255983, 114887, -42821, 36561, -16692, 106337, 328721, 621588, -138421, -224372, 22816, 185605, 281233, 298789, -91247, -96234, 117840, -182412, 247609, 273205, 305401, -3118, 189418, -112459, 218201, 373185, 245251, 412186, 262679, 307737, 42976, 375865, 288969, 296889, 199901, 259185, 295639, 366099, 320578, 486542, 498191, 434776, 244197]
17439B44197P4486M1842J27237k38374M03082a1356B47223r3645J45745k659A46336
17427D10371a79214C24187O1269O7861A66712P9873K24468A28151a6877I1359
17416B33817e9670C5928M58008j95665p7092J17813g0683C98962c6040B8821J70313
17405A99134N2323B5586K16308I7023N7307J4809L91065a01553D0944J7702a11749
17393A18844C2780N42617a68693D2426R5322a20550B95913l0119M63888E5670
17382e7736A20391J83553h262D71496b9228I8981K83019J05447A27954N5347R7525
17371B80826Q6411e0878B85107A00612N3160J36816A18042A6863K6969J03391
17361A47223C5231K0529Q843L1127J59291I7012J28852I827K42415a47154C53462
$$ y = [244197, 318683, 360525, 487762, 249388, 652470, -11356, 247223, 153578, 299323, 296664, 146336, 410371, -179214, 324187, 385456, 453317, 166712, 246585, 471053, 128151, -16877, 91359, 233817, -59670, 35928, 493936, 298271, 221179, 338992, -70683, 398962, -36040, 28821, 199134, 251457, 25586, 241894, 97023, 154330, 169139, 560204, -101553, 40944, 58646, -111749, 118844, 32780, 575397, -168693, 42426, 137748, -120550, 295913, 265794, 729682, 55670, -57736, 120391, 303944, -8262, 471496, -29228, 98981, 382000, 487447, 127954, 183301, 280826, 367237, -50878, 285107, 100612, 153772, 290588, 118042, 16863, 43832, 147223, 35231, 55760, 64603, 95730, 255021, 97012, 225864, 9827, 252242, -147154, 353462]
17349B55436r9609J54787j37118l5573L0336D5152J10458M5367d3988I5738J91247
17338B86985C6223O7456K05798l2341r1875l9823P6021o2600K64230b3880A39390
17326C47756p9068q0110a36B91989o1614a17892B03778R3032C3783Q9504d0922
17314c2868A24439m0396L333P4806h3236D30420j91998A4907Q6896e1211A80587
17302A96513K00347F9173P107K94343d1809A96713n4106C6363i3223C49219j55692
17291A93527J3056K13373A55881a71587B74117o1318J08076p0765M4655A15977
17280D5804f3109B3302L8498a67496D27781j59856J390Q5413a06944B56796K20379
17269D77175j78374A32836K6057P9333A03331L91209B10456N2673J20048A60208
$$ y = [255436, 155827, 310614, 173496, 137923, 168259, 45152, 155610, 200977, -43988, 95738, 286985, 36223, 103679, 309477, 277136, 185261, 145438, 221459, 158859, 423089, -23880, 139390, 347756, 268688, 188578, -136, 291989, 230375, -117892, 203778, 296810, 33783, 123287, -40922, -32868, 124439, 84043, 87376, 162182, -83236, 430420, 238422, 14907, 101803, -51211, 180587, 196513, 396860, 69173, 76280, 370623, -41809, 196713, 142607, 36363, -93223, 349219, 193527, 206583, 419956, 155881, -171587, 274117, 212799, 320875, 250110, 294765, 115977, 45804, -63109, 23302, 61800, -167496, 427781, 267925, 269315, 354728, -106944, 256796, 477175, 298801, 132836, 158893, 238226, 103331, 494540, 210456, 263129, 383177, 160208]
17258d9758C85898j87527M8472J74252j01762g6547E49526B11094O5720m2063
17248B34751j09129J7381K03387A40110o2151c1604C97596p8570A04601O2077
17238A66678J28411P261A16790c4715F04121B04959o1433J57126I8012J80886
17228B78898j18545L01566j41478L7446m8204n7229C5919J98006K793J59853a0049
17216A89840K33707J71184A23266n013M55558j70545m3208c1896C40129O02L13791
17205F54522l19092A49252K38437n9755k1008O404J19611A63637l7513J88682
17195C14806n0504p7089j0143J49726J62274B18144H8560J17527A0266J88895
17185A99161J02205K8976P0407B7219L11001j10069Q8328q7756K19908k19480
$$ y = [-49758, 385898, 198371, 246843, 421095, 319333, -76547, 549526, 211094, 276814, 234751, 125622, 143003, 346390, 140110, 77959, -31604, 397596, 319026, 104601, 166678, 295089, 302350, 116790, -34715, 604121, 204959, 143526, 300652, 98012, 278898, 160353, 461919, 320441, 357887, 309683, 252454, 35919, 233925, 236718, 396571, -10049, 189840, 423547, 594731, 123266, 118253, 573811, 403266, 360058, -31896, 340129, 340731, 654522, 335430, 149252, 387689, 327934, 306926, 313330, 432941, 163637, 126124, 314806, 264302, 187213, 177070, 326796, 489070, 218144, 88560, 206087, 10266, 199161, 301366, 330342, 400749, 27219, 338220, 228151, 316479, 228723, 448631, 229151]
17175B29151J36897q7202K9597E0083K75303m6604K3279b27163D01788r7313a4003
17163D66565B21451M32609A74013j5939R3677k5246G1036J2431N0349L49102O2300
17152E45218B37118J42198A22694K43966j25909M6713f8574D41364q2301j43050
17142B16013l8841M47444j43853F2146K9517K70981k8729G2645N49509K4587k87134
17131C59607o8823J64361A18185K35753R712K05402j55567K34496l14327K65199
17121E98853k84999J07258m6504F1105L42295j09733K43224K7535L9431k49800
17111C54057N9318J49949j3270j17897M7003J49520n9190B37787N23214C13803
17100E17674j80496J25580j7807J75570B98889k1159J01952m0331J77268k0008
$$ y = [229151, 366048, 278846, 308443, 50083, 325386, 278782, 302061, -227163, 401788, 304475, -14003, 466565, 221451, 654060, 174013, 158074, 251751, 226505, 71036, 83467, 133816, 482918, 545218, 237118, 379316, 122694, 366660, 240751, 287464, -68574, 441364, 359063, 216013, 177172, 624616, 480763, 62146, 91663, 362644, 333915, 72645, 622154, 646741, 359607, 290784, 455145, 118185, 353938, 363650, 569052, 413485, 647981, 333654, 598853, 313854, 421112, 374608, 61105, 403400, 293667, 536891, 564426, 603857, 354057, 413375, 563324, 550054, 432157, 479160, 628680, 569490, 237787, 761001, 313803, 517674, 337178, 462758, 444951, 620521, 298889, 277730, 379682, 339351, 516619, 496611]
17090D96611M0620L3638l0594j18719m6695J090K2100A72374O04710l3918k49505
17079D93661n3407M37755A34489M76137j23022A79307M03596k30689O7478J03807
17069E23499J47039l25177K59221j53892k16075P7906K90920O3j22434N91K28076
17058G09737k67981L26674j99611J71114K83207j51799l93312L41746k99929J51151
17048F70997j94659O0624j7675J74798k1747k35015Q8752J65540R4521j29865
17038F56271m4829J24670j01053J44973p863r043j03223J82159k288q6838J37655
17027H90591q3538j96374p9929N6827K98518n5906D12903K55240O1142Q764K84876
17016A022925k00117j90720J92815J7031J62213l88076k0533P3476P2142j95951
$$ y = [496611, 537231, 570869, 540275, 421556, 374861, 375951, 398051, 172374, 777084, 743166, 493661, 440254, 878009, 134489, 610626, 487604, 179307, 582903, 352214, 419692, 523499, 670538, 345361, 604582, 450690, 234615, 312521, 603441, 603504, 481070, 481661, 709737, 441756, 768430, 568819, 739933, 1023140, 871341, 478029, 819775, 519846, 670997, 476338, 536962, 519287, 694085, 672338, 437323, 526075, 691615, 786136, 656271, 611442, 736112, 635059, 780032, 772169, 763126, 659903, 842062, 839774, 752936, 890591, 807053, 610679, 530750, 587577, 886095, 830189, 412903, 668143, 729285, 738049, 1022925, 822808, 632088, 824903, 841934, 1004147, 616071, 595538, 669014, 741156, 545205]
17006E45205L22743M9263l65292K37983M1439k68860O0945K17358l0021L0435
16996H41198L59694l75593L74748l91494M6845j63505K01559l639M8483J55032
16986A093328p1507l18571o1664L79880J88709k55737n6523k0771M8151j91461
16976G33834L12537K00169l90439K65995q6250K08450l93463J44335J58249R4257
16966A247674R2970k17595K3359n2924J33220P9038J95742l01720R5015n790o2922
16955A226067j9604m872l4839n2528j8414K571K66030J47067k72117k84738K66213
16944A220836L23434n44005K87234K37018J0039P5486P8615k98275k7400K56369
16934A619351j95563j36421L19266m5332j5871j18629P8416O2R4342n9803J87302
$$ y = [545205, 867948, 917211, 551919, 789902, 831341, 562481, 623426, 840784, 810763, 841198, 1200892, 825299, 1200047, 808553, 855398, 691893, 893452, 889813, 938296, 1093328, 1021821, 703250, 641586, 1021466, 1210175, 954438, 897915, 877144, 925295, 733834, 1046371, 1246540, 856101, 1122096, 1035846, 1244296, 850833, 995168, 1153417, 1247674, 1340644, 1123049, 1146408, 1093484, 1226704, 1305742, 1501484, 1199764, 1294779, 1288989, 1226067, 1206463, 1201591, 1166752, 1114224, 1095810, 1098381, 1364411, 1511478, 1239361, 954623, 1220836, 1544270, 1000265, 1287499, 1524517, 1534556, 1610042, 1688657, 1390382, 1362982, 1619351, 1423788, 1287367, 1606633, 1561301, 1545430, 1426801, 1505217, 1505279, 1599621, 1539818, 1727120]
16923A727120J45706m38451L02239l37896M50467K459j79084N9869J02008j34792
16913A699645o8219p5392K90567j49526l3429k0230J00868N6125l2829L69728
16903B137308M9638j00728K19566j89777J15889o7805p28k59679k12684N79700
16893B270700j11821L15558k21456K1912j96283K08395L76805j59444l39671L80320
16883B545015Q7133j47779J66401k77731J11409k5768J85680K43308l62227L08227
16873B833668K90118m53102K24309J2798k56519N76820K1595j20295K26368j52544
16863C203216l1145j45718N45658l8890J05916k14592J38875Q7713k76728M45988
16853C820293j56928P4423r9177J96175J97519J14324j12334O4358J75398l97573
$$ y = [1727120, 1872826, 1434375, 1736614, 1398718, 1849185, 1851644, 1672560, 1732429, 1834437, 1699645, 1631426, 1556034, 1846601, 1697075, 1663646, 1643416, 1744284, 1800409, 1767580, 2137308, 2186946, 2086218, 2305784, 2116007, 2231896, 2164091, 2163363, 1903684, 1691000, 2270700, 2158879, 2474437, 2252981, 2274893, 2078610, 2287005, 2663810, 2504366, 2164695, 2545015, 2632148, 2484369, 2650770, 2373039, 2484448, 2458680, 2644360, 2887668, 2525441, 2833668, 3123786, 2670684, 2894993, 2907791, 2651272, 3228092, 3249687, 3129392, 3355760, 3203216, 3172071, 3026353, 3572011, 3533121, 3639037, 3424445, 3563320, 3651033, 3374305, 3820293, 3663365, 3737788, 3638611, 3834786, 4032305, 4146629, 4034295, 4098653, 4274051, 3876478]
16843C876478O50103k57552l0064L93223j16456o1627L37774J29237l44530M59075
16833E035661J51720j20273K21543K03166p198O8567n0408L52928k85839L64298
16823E934165K73344l0060l03988K72849M51112k30413K06092j706K79058J48506
16813F998959N9835M74480K06023R1801J71866l70149O10357M4291o5879M19606
16803H641190M19432o4801M23672j9829j46745N98022K56647M46564J912J10369
16793A0666433N99275J24529N00107M13414k7842L54978N44398J37658L60919
16784A3673869L18992L61279O75778J56327N67837K03937O77498M11705O35006
16775A7682228O83497N99720N13917M05173O46352P21099P44416P65115P02094
$$ y = [3876478, 4526581, 4269029, 4238965, 4632188, 4515732, 4454105, 4791879, 4921116, 4576586, 5035661, 5187381, 5067108, 5288651, 5491817, 5484619, 5553186, 5502778, 5855706, 5569867, 5934165, 6207509, 6177449, 5873461, 6146310, 6597422, 6367009, 6573101, 6571395, 6850453, 6998959, 7058794, 7533274, 7739297, 7831098, 8002964, 7632815, 8243172, 8287463, 8221584, 8641190, 9060622, 8995821, 9419493, 9399664, 9252919, 9850941, 10107588, 10554152, 10556064, 10666433, 11265708, 11390237, 11890344, 12303758, 12275916, 12630894, 13175292, 13312950, 13673869, 13992861, 14354140, 15029918, 15186245, 15754082, 15958019, 16635517, 17047222, 17682228, 18365725, 18965445, 19479362, 19884535, 20530887, 21251986, 21996402, 22761517, 23463611]
16766B3463611R37189O27784J142091Q93499J133966J009751Q71838J433949R43793
16757C2457471J308681J578847J634632J399154J522432J719562J891789J818063
16749D5330631K010141K379021K300987K450852K598977K620413K884627K987480
16741F5563129L769700L129808L227371M429100L573793M450509M298663M704041
16733I7146114M685014M855437N306300N062849M940895N529359M962210N042136
16725A37530314M584096M586002L549238L862287K834563K105163J499906L65423
16717A60916992J62864p14473j763964k466266k735138l554716l868548m765504
16709A41211247m636313m739701n258266n242986n337194n232204n109465m696347
$$ y = [23463611, 24400800, 25028584, 26170675, 27064174, 28198140, 29207891, 30079729, 31513678, 32457471, 33766152, 35344999, 36979631, 38378785, 39901217, 41620779, 43512568, 45330631, 47340772, 49719793, 52020780, 54471632, 57070609, 59691022, 62575649, 65563129, 69332829, 72462637, 75690008, 80119108, 83692901, 88143410, 92442073, 97146114, 101831128, 106686565, 111992865, 117055714, 121996609, 127525968, 132488178, 137530314, 142114410, 146700412, 150249650, 154111937, 156946500, 159051663, 160551569, 160916992, 161079856, 160365383, 158601419, 156135153, 153400015, 149845299, 145976751, 141211247, 136574934, 131835233, 126576967, 121333981, 115996787, 110764583, 105655118, 100958771]
16701A00958771n155653m763578m236631m505212m373533l567301l749542l609785
16693F6997536l240398l226616k698126k982753k612754k359063k258553k376435
16685D5242838j846907k549126j242670j618774j914561j652875j331738j025945
16677C2060242j629892r60525j368593j272182p20322p99865j080463j022273
16669B3206127p44330j073612o49997o36968o53882p76694n21394p39285p24385
16660A6685580k11204p71237k43259l70477l86765o37212k90051k37172n76766
16651A2961437l9639q09495l10858k78725k5754o68738j13557r5579l76080m98762
16641I744250J6570l43071n81052r4392J07587j12213j45925m13290j08759l8440
$$ y = [100958771, 95803118, 91039540, 86802909, 82297697, 77924164, 74356863, 70607321, 66997536, 63757138, 60530522, 57832396, 54849643, 52236889, 49877826, 47619273, 45242838, 43395931, 40846805, 39604135, 37985361, 36070800, 34417925, 33086187, 32060242, 30430350, 29469825, 28101232, 26829050, 26108728, 25308863, 24228400, 23206127, 22461797, 21388185, 20738188, 20101220, 19447338, 18670644, 18149250, 17409965, 16685580, 16474376, 15703139, 15459880, 15089403, 14702638, 14065426, 13775375, 13538203, 12961437, 12921798, 12112303, 11801445, 11522720, 11496966, 10828228, 10714671, 10619092, 10243012, 9744250, 9760820, 9417749, 8836697, 8742305, 8849892, 8737679, 8591754, 8178464, 8069705, 8031265]
16631H031265p10454K84257n40049J31445r1706k58789r4466m6560j91386l65481
16621F148076M1185j92339J64991n72004j1590P1616l95221L1070j13347l12913
16611D859524j17595M20772n40877q2089L46491J07190m33758j2873l14522L9382
16601D271645M3137k10887J80535k87875J49632l68266K55383l17417q8108L5385
16591C663164k8576J52396j80161l31071K29186j01085j40714K20059m16337k44551
16581B822310K66474K3828J31183n50112L01782k44735L14378l43002o970j17373
16571B597763j18740K70465l9268j95849j28129N15050n54066O9399k44346L34223
16561B506502P1606l07669k53929L47348k24582q7693K79376m02454J37957k62178
$$ y = [8031265, 7320811, 7605068, 7065019, 7196464, 7104758, 6845969, 6751503, 6704943, 6513557, 6148076, 6189261, 5996922, 6161913, 5589909, 5578319, 5649935, 5254714, 5285784, 5172437, 4859524, 4741929, 5162701, 4621824, 4539735, 4886226, 4993416, 4559658, 4546785, 4232263, 4271645, 4314782, 4103895, 4284430, 3996555, 4146187, 3777921, 4033304, 3715887, 3627779, 3663164, 3634588, 3786984, 3606823, 3275752, 3504938, 3403853, 3263139, 3483198, 3066861, 2822310, 3088784, 3112612, 3243795, 2693683, 2995465, 2750730, 3065108, 2722106, 2715136, 2597763, 2479023, 2749488, 2710220, 2514371, 2386242, 2901292, 2347226, 2416625, 2172279, 2506502, 2578108, 2270439, 2016510, 2363858, 2139276, 2051583, 2330959, 1928505, 2066462, 1804284]
16551A804284L12386J73151k76052J85551l96757j6381J26329r8547j53407N70578
16541B231135m64579O9148j72636J41496m16456L47905J25206L1027j84146l3607
16531A674493J36594k42604k88910J7317L00461Q5502l45955M25557j39151l44351
16521A278953J83322j12573J93176j0466k94226j61623K88618J89078k01832j85890
16511A166537K85753j85294m89180K60412J07351l0902J67428k16875J28522k8738
16501A165014M2501N48093p96845J71103M8262n50048K97060L17999k11109p5590
16491I56440J73431j94659p2677K84613n41198N64336q2816k36002k50821M95744
16481A096391k98038N27990k25863J09861l70322m4961K71387j61307j30803j32019
$$ y = [1804284, 2116670, 2289821, 2013769, 2199320, 1802563, 1786182, 1912511, 1813964, 1660557, 2231135, 1766556, 1835704, 1663068, 1804564, 1388108, 1736013, 1861219, 1892246, 1708100, 1674493, 1811087, 1568483, 1279573, 1296890, 1597351, 1682853, 1336898, 1762455, 1623304, 1278953, 1462275, 1349702, 1542878, 1532412, 1238186, 1076563, 1365181, 1554259, 1352427, 1166537, 1452290, 1266996, 777816, 1038228, 1145579, 1114677, 1282105, 1065230, 1193752, 1165014, 1207515, 1755608, 958763, 1129866, 1178128, 628080, 925140, 1243139, 1032030, 956440, 1129871, 935212, 862535, 1147148, 605950, 1170286, 1087470, 851468, 600647, 1096391, 798353, 1326343, 1100480, 1210341, 840019, 795058, 1066445, 905138, 774335, 642316]
16471F42316j75724N82663k24992j71748K02272k65541Q4381p0429K34805r5266
16461G42737J84486o7277j29324L02941k46795j21870L30048o9297r9349k11015
16451F15285L85556j14136l21165k04M02838K2114l94754j21418K75226k19799
16441E29543L05943k34008K23606B05781M44295J97913k21709j6926j82474L25314
16431G52194j952l66964L14855R2355C12397K93606j5208K06575C73351M13795
16421G87146J00269l94557L20538l37388r2852K08466j35954K84385K44868l22940
16411F61981k01901m758J27167O3731j45953K01775k43123R3784N2470J6842A45068
16399G31021k30712M899O95P120j90171j12202J64980J74847K18878C37388J84631
$$ y = [642316, 466592, 1049255, 824263, 652515, 854787, 589246, 673627, 603198, 838003, 742737, 927223, 859946, 730622, 1033563, 786768, 664898, 994946, 925649, 826300, 615285, 1000841, 886705, 565540, 565336, 968174, 990288, 595534, 474116, 749342, 529543, 835486, 601478, 825084, 205781, 650076, 847989, 626280, 609354, 426880, 752194, 750242, 383278, 698133, 790488, 312397, 606003, 590795, 797370, 373351, 787146, 887415, 492858, 813396, 476008, 383156, 591622, 455668, 740053, 984921, 661981, 460080, 455322, 582489, 646220, 500267, 702042, 458919, 552703, 605173, 622015, 145068, 731021, 500309, 505208, 505903, 513023, 322852, 210650, 375630, 550477, 769355, 337388, 522019]
16388E22019J49679A88273K01010K8929q5404K47775q1279A88395K81014K22026
16378F91435j11503B35976r8360M47734O827A42944K59302j05127J35855j1777
16368D21197J66876n4438A01836N36822l16644k1675J05444N9220r3370J23581
16358D95214j49409E1120M4921J99401J18711B9207M97340j89579m9208P2593
16348C60353J65565A52163n157Q2986J12081P8195r8859p6002O4042A20231J1945
16337A32176N3217M22834l0310k09891l0807l8019q3424A03989A819K76277R7211
16326C75307j55705N28077l67366j40430O4829A39610K18711k8221r1610G3511
16315B87687J13102L6691E6375J71089K03120j48764l654K85941A61284J3152
$$ y = [522019, 671698, 188273, 389283, 418212, 332808, 580583, 499304, 188395, 469409, 691435, 579932, 235976, 137616, 585350, 592177, 142944, 402246, 297119, 432974, 421197, 588073, 533635, 101836, 638658, 322014, 300339, 405783, 465003, 371633, 495214, 345805, 51120, 96041, 295442, 414153, 29207, 526547, 336968, 287760, 360353, 525918, 152163, 147006, 229992, 342073, 420268, 321409, 245407, 309449, 120231, 132176, 185393, 608227, 577917, 368026, 337219, 299200, 215776, 103989, 1819, 278096, 375307, 219602, 747679, 380313, 239883, 304712, 139610, 358321, 330100, 238490, 73511, 287687, 400789, 437480, 56375, 227464, 430584, 281820, 278166, 564107, 161284, 174436]
16305A74436a2814B77537K48968A75026G2677J19214J1282m6640k6066m9387R1352
16294A72432J62370I8434J57319R5077a31204E3846N993R9794D9273e6438B48656
16282C59400C4671K28911j172C386N12201j61864N8211A14723K41990P7708A75275
16270A07025J68826M7997N5262C6252f1381E99174B09970r1522D153J50586m441
16259A50298B3968J20038J72321i107B23969e5048C65289A24037K50453l2850
16249C41640F9885A8695f8792A82588M3595n5054p3269a01470A31123B3663a17394
16237C50407M901j08462J9529H4617b762F845K62798N7150A04784J15632n5008
16226A65408Q6910b1901B15244l1463G7485C3465L07638A38721J70767b91172
$$ y = [174436, -12814, 277537, 526505, 175026, 72677, 191891, 203173, 156533, 130467, 81080, 172432, 334802, 98434, 255753, 350830, -131204, 53846, 59839, 159633, 49273, -56438, 248656, 359400, 34671, 263582, 262410, 3386, 515587, 353723, 411934, 114723, 356713, 434421, 175275, 107025, 275851, 323848, 379110, 36252, -61381, 599174, 209970, 118448, 4153, 154739, 150298, 23968, 144006, 316327, -9107, 223969, -55048, 365289, 124037, 374490, 341640, 69885, 18695, -68792, 182588, 226183, 171129, 97860, -101470, 131123, 23663, -117394, 350407, 355308, 246846, 266375, 84617, -2762, 6845, 269643, 326793, 104784, 220416, 165408, 252318, -21901, 215244, 183781, 77485, 33465, 341103, 138721, 309488, -291172]
16215A07307a4698C3973K52544q5591F389a5351A49570h6124C24886j01155M3533
16204B67264G7168d7318A28626a43000A55010a72472H0956J58280J8423a24256
16193h8329L2694p8612K460B27175C0087A1917P4693d289B2119L7710e5552C26045
16180A3636L76477A00871B1636R140d8465C68352I1421K94921j07264m0290a03662
16168C41699a8071k49992B02900m2547p9097M4554D1932a6827D4164A8154K40896
16157B59050C7075L28602D7877J0943J34379g7697I1460M4694C7657M7501b40607
16145a3993B19417B9929J79928n2930a58466D30214A08706k0634a70829m7319
16135b18148A04192N7350g7715H8837K2159a7390F5586J24967k5531e3779A82371
$$ y = [107307, -14698, 33973, 286517, 200926, 6389, -15351, 149570, -86124, 324886, 223731, 267264, 77168, -47318, 128626, -143000, 155010, -172472, 80956, 239236, 257659, -124256, -88329, -55635, -134247, -131787, 227175, 30087, 11917, 86610, -4289, 22119, 59829, -55552, 326045, 13636, 390113, 100871, 21636, 30776, -48465, 368352, 91421, 386342, 279078, 238788, -103662, 341699, -18071, -268063, 202900, 160353, 81256, 125810, 41932, -16827, 44164, 18154, 259050, 37075, 365677, 47877, 58820, 193199, -77697, 91460, 136154, 37657, 85158, -240607, -13993, 219417, 29929, 209857, 156927, -158466, 430214, 108706, 88072, -170829, -218148, 104192, 161542, -77715, 88837, 110996, -17390, 65586, 190553, 165022, -53779, 182371]
16123d5249E0499n183J49488J29531a7164A09666A4574a27949A89361e9584I3650
16111A50070h334A11803a41256d5413A88440J17092g3952p9250A26838j4236J78176
16100B90778j37134a6735B46747F7120J96660i3117B73413a23334B39815J2668
16090B52483g7033A47270P2476D0613f0267A84904b15874G5899c4948B32129F9945
16078A81998N7641g9081E6241J6201h1236j49758f9066c1811k69242C52505B1323
16066b44037B0713r849a42632j5174A84256J7130a73083L8614j25418A52708J15740
16055B68448j04188l7791a87083F0834J89384c02114A27659d449l58689d4723
16044A0048P0768J25324a58218P2856r9018h3973A86876B9692J03626a37470K7167
$$ y = [-45249, 50499, 45316, 194804, 324335, -17164, 109666, 14574, -127949, 189361, -59584, 93650, 150070, -8334, 111803, -141256, -45413, 188440, 305532, -73952, -153202, 126838, 112602, 290778, 153644, -16735, 246747, 67120, 263780, -93117, 273413, -123334, 239815, 252483, -77033, 147270, 219746, 40613, -60267, 184904, -215874, 75899, -34948, 232129, 69945, 181998, 239639, -79081, 56241, 72442, -81236, -230994, -69066, -31811, -301053, 352505, 21323, -244037, 20713, 10864, -142632, -157806, 184256, 201386, -173083, -134469, -259887, 152708, 268448, 164260, 126469, -187083, 60834, 250218, -302114, 127659, -4449, -363138, -44723, 10048, 80816, 206140, -158218, -85362, -184380, -83973, 186876, 29692, 133318, -137470, -110303]
16033a10303j63905B18681J586a75641B53372c5758B19157e6966j34121A80296
16022B41289c3714k33019R4344h3478K2393A24867a80441G101a13476C1115L3369
16011F4484N1159a21314L9182K6759H5599K25585A07779J545R5301l3497N6538
16000B27666a47436j40175A55490a05352l4341l8135a2794j9142p1154K4999C664
15988b55954C23777a51254N0724A21016M38123A49145e9306B16129J0395e1882
15977B84564F8936K7243J64584b50149c0610j12027d7138L033g703q2674j57526
15966b47903e1619j43213B38101B12b70A30673l2618d6228B18058L3736I83a54719
15953a35787F0141B0183K44875b09369j6593H7762a53527m7766O4902E8126f2566
$$ y = [-110303, -274208, 218681, 220267, -175641, 253372, -35758, 219157, -56966, -191087, 180296, 241289, -33714, -266733, -172389, -83478, -61085, 124867, -180441, 7101, -113476, 31115, 64484, 115643, -121314, -82132, -55373, 85599, 311184, 107779, 109324, 204625, 171128, 227666, -147436, -287611, 155490, -105352, -139693, -177828, -12794, -31936, -103090, -78091, 3664, -255954, 323777, -151254, -100530, 121016, 559139, 149145, -59306, 216129, 226524, -51882, 284564, 68936, 96179, 260763, -250149, -30610, -142637, -47138, -44105, -7703, -90377, -247903, -51619, -194832, 238101, 212, -270, 130673, 98055, -46228, 218058, 251794, 983, -154719, -135787, 60141, 20183, 265058, -209369, -225962, 87762, -153527, -201293, -136391, 58126, -62566]
15941A47352e8887B6982m396b5655j07933A01380d02769c9367j29579N8153D9932
15929B66246a06443b8729j18320H4951a88096A75531f7107c0475k40760A12750
15918i1810k0501m16402H6450a64100A65161a31920B89327e5980E9524J99008
15908B58532A16418J6534K90856j04043a746G7184a32097j04999p4579J05644
15898b06031B46451D4118P117a6745A24884L3590j4322g964B14009h3359j1300
15887i4659k64079N2993e8352m0073A74454d98533B28670m861F1410l365J55841
15876B13886a3042j6574q5417A45313a51267B44483a08431j80683E5871k4375
15866C1496a387A53627a90553I8208a54286A60091i8450A0923j934M7406a37919
$$ y = [147352, -58887, 26982, 22586, -25655, -133588, 101380, -402769, -39367, -168946, -110793, 49932, 266246, -106443, -28729, -147049, 84951, -188096, 175531, -67107, -30475, -271235, 112750, -91810, -112311, -528713, 86450, -164100, 165161, -131920, 289327, -55980, 59524, 258532, 116418, 132952, 423808, 319765, -1746, 77184, -132097, -237096, -311675, -206031, 246451, 44118, 51235, -16745, 124884, 158474, 144152, -7964, 214009, -83359, -94659, -358738, -305745, -58352, -98425, 174454, -498533, 228670, 223809, 61410, 58045, 213886, -13042, -29616, -115033, 145313, -151267, 244483, -108431, -289114, 55871, 31496, -1387, 153627, -190553, 98208, -154286, 160091, -98450, 10923, 8989, 56395, -137919]
15854c12709R0518B6625P9060a55746F213c10774i7026A95276K4634n7859d2100
15842D5837b95755A61051f5138G4217b03935C48034C6887K85744e3788a2488A20285
15830E2497G611a89151e8667k18424j17011J50369F1170a57941d337A47749b93750
15818c1007j9587j67034g6996p7116A13023f5228k78999g3755a4086n3566r8823
15807a66475N3898D1134g7754q5823A35462g4365q4100b7162j99414H4148J72657
15796B56805c86426B03597p3840a43615A78346p3142O9720i2854A09657d16H7323
15784A52534b44988b8116A9331M8707q692a22296G4138p984h7955D7748a67470
15772a31694q3538O4303j36410H6846a3050m80476a20597A70069D3239a18330
$$ y = [-312709, -222191, 26625, 105685, -155746, 6213, -310774, -97026, 195276, 219910, 162051, -42100, 45837, -295755, 161051, -65138, 74217, -203935, 348034, 36887, 322631, -53788, -12488, 120285, 52497, 7611, -189151, -58667, -277091, -394102, -243733, 61170, -157941, -4337, 147749, -293750, -31007, -50594, -217628, -76996, -154112, 113023, -65228, -344227, -73755, -14086, -67652, -166475, -112577, 41134, -77754, -163577, 135462, -74365, -158465, -27162, -226576, 84148, 256805, -386426, 203597, 129757, -143615, 178346, 105204, 174924, -92854, 109657, -416, 87323, 152534, -244988, -28116, 19331, 68038, 59346, -122296, 74138, 66154, -87955, 47748, -167470, -131694, -215232, -150929, -287339, 86846, -13050, -493526, -120597, 170069, 43239, -118330]
15761a55102B02408i6171E6962Q0711g1678A07020D6515L105J75226b4162o4793
15750h8955l1255M0416j32060B4276L24529a03174B5282a34978c4327A92076F5765
15738b17523F8881a68434G6396a88681D5318b46693B36354G3831a533B66634a90954
15726a10008B99559c5292C63389E150a92018a8742m3332B87078F327a19838A44953
15714I5339c39193F8486J09803q2526a76940P4796d8559J0167P556m0922r3886
15703a65644e0958j24376D3910b17138a7491f920C4567K97368a82809D8400J05685
15692A54085P6385J27336j65781M5312C5236a85482C5085J58037f1299k6047C40861
15680A92349a8966m03q1712l0921G3261a62996E4524k1148d5026A96158C7734
$$ y = [-155102, 202408, -96171, 56962, 137673, -71678, 107020, 46515, 49620, 224846, -24162, -88955, -120210, -79794, -211854, 24276, 348805, -103174, 25282, -134978, -34327, 192076, 65765, -217523, 68881, -168434, 76396, -188681, 45318, -246693, 236354, 73831, -1533, 266634, -190954, -110008, 299559, -35292, 363389, 5150, -192018, -18742, -62074, 287078, 6327, -119838, 144953, 95339, -339193, 68486, 178289, 95763, -176940, -102144, -48559, -38392, -30836, -71758, -165644, -50958, -175334, 43910, -217138, -17491, -6920, 34567, 331935, -182809, 48400, 154085, 230470, 357806, 192025, 237337, 35236, -185482, 35085, 193122, -61299, -87346, 340861, 192349, -18966, -19369, -101081, -132002, 73261, -162996, 54524, 33376, -45026, 196158, 37734]
15668A10215K0580h5654L7812A71694b4718A99030a9831C314d9696m3657j37366
15657b30719A71655a0446m39473B448f3863n2721I5769a0426A12650b53760b397
15645a79044E4559a5725l74970e0332j07965H3186d848q505B6556i0460C91552
15633b6708l00437F2710J63929h5663a6558A25018c28727g0240j76889g3773l14423
15622c88196N1772c2598D0591c99807A37697b24601I2411a87670G774b82554A49821
15610c03202d859l8363F8375a80969g1039j24068G0743c57118O1500C80014e5659
15598a31853G2942c92066H5178d93460C2377b67774D3579h9757G3746a53978j23055
15587b77033A05539M1663a60144D1035b46550i040n4149j27172B73773f4062C2338
$$ y = [110215, 130795, -85654, -47842, 171694, -24718, 199030, -19831, 3314, -49696, -93353, -230719, 171655, -10446, -449919, 2448, -63863, -116584, 95769, -10426, 112650, -253760, -2397, -179044, 54559, -15725, -390695, -50332, -158297, 83186, -4848, -13353, 26556, -90460, 391552, -26708, -327145, 62710, 226639, -85663, -16558, 125018, -328727, -70240, -247129, -73773, -388196, -336424, -32598, 40591, -399807, 137697, -224601, 92411, -187670, 7774, -282554, 149821, -303202, -4859, -43222, 68375, -180969, -71039, -195107, 70743, -357118, -295618, 380014, -55659, -131853, 72942, -392066, 85178, -493460, 32377, -267774, 43579, -89757, 73746, -153978, -277033, 105539, 147202, -160144, 41035, -246550, -9040, -63189, -190361, 273773, -64062, 32338]
15575a2049m0497j53029d4698k21131e9415J1985k1786A57984K08773a24895j65704
15564b90599a24423G1903g8198j67438F9002a68076g777l7316j95752q024j52845
15553d01714C15581b44922a0031j46843m3425A31955n6770J77375A08425c2137
15542b97851H6352i4290L2225n6194l5478C82728D6856J37529c10804c2945A55785
15530a99348A74178e5957H5744b4144C21245g4865C05229m4903J127D2527b1536
15518d2263A56734J19582k6642b3952B32896a15133a9334d08C060K168a55730
15506C7960b59117A41750C999b65646D20040k09020r355C8844J27983n6474I385
15494a67565F9388a44867G2145a77373b425p4516A3108d3576B4107a91247H682
$$ y = [-12049, -52546, -205575, -44698, -265829, -59415, -47430, -69216, 157984, 366757, -124895, -290599, -124423, 71903, -78198, -245636, 69002, -168076, -7777, -45093, -240845, -248869, -401714, 315581, -244922, -10031, -156874, -200299, 131955, 75185, 252560, 108425, -32137, -297851, 86352, -94290, -62065, -118259, -153737, 382728, 46856, 184385, -310804, -32945, 155785, -199348, 174178, -55957, 85744, -24144, 321245, -74865, 305229, 260326, 261453, 42527, -21536, -42263, 156734, 276316, 249674, -23952, 232896, -115133, -19334, -408, 3060, 5228, -155730, 37960, -259117, 141750, 3999, -265646, 420040, 211020, 201665, 38844, 166827, 110353, 9385, -167565, 69388, -144867, 72145, -177373, -2425, -76941, 13108, -43576, 24107, -191247, 8682]
15482i0870A52065b06244L4120B03600J8789a03248D6037h8667B70980A07537
15471H1803b55253B84988q2419o6869C2100J63102E6841a18861o3980A88026g2535
15459A80357m6301h6905f467m5420A09465b83252I3722p571f6758D9142J18354
15448A67496E8615L777K02128p8633G1693a72855K2398O1731m1551k00790A00956
15436b52521N3473a251A35212b51444A25522K1672o0902a97972b3445B1071b39340
15424D02779c22327e5232j27783k0489c4178D9969J803a52001p4917G0167R8328
15413A68495a35195M650C04979H6795a98192J5309A26427D6902B48a49282n0944
15402b00226L5421A8612K018a7059O117p7342A16087a8277B88429A14085J130
$$ y = [-90870, 152065, -206244, -172124, 203600, 222389, -103248, 46037, -88667, 270980, 107537, 81803, -255253, 284988, 202569, 135700, 32100, 195202, 56841, -118861, -182841, 188026, -72535, 180357, 134056, -86905, -6467, -51887, 109465, -283252, 93722, 86151, -66758, 49142, 167496, 58615, 62392, 264520, 185887, 71693, -172855, -150457, -88726, -130277, -331067, 100956, -252521, -199048, -1251, 135212, -251444, 125522, 147194, 86292, -197972, -23445, 21071, -239340, 402779, -322327, -55232, -183015, -203504, -34178, 49969, 51772, -152001, -226918, 70167, 168495, -135195, -130545, 304979, 86795, -198192, -182883, 126427, 46902, 248, -149282, -200226, -164805, 18612, 20630, -17059, -10942, -88284, 116087, -18277, 288429, 114085, 115215]
15391A15215K445B0699J18781c42518a1770A06253E2144c99405a66517A47156
15380c47355b391A88069g9363p7713A37824K06373b74418d4442A98852J79740
15370C78592d5059A04101L58413A0654B590a30086k0885B11502R4414g9521J4264
15359f5257G7276c9881H129J16173r074n0746A6063e6466E6244b01452P1240a8043
15346D9311b070C7393J91619m2644p0606M9913d94091a39148C88797e5945K6685
15335b9260A34194N3879c52549H0898J27589A01252c6228j0099A43738m1990a86001
15323a13499l3242O1468a0641j86966B10725n1142k0151K724m4899J0377a0413
15311I951N0200b11170D4070J4935a56828C14787L3613a19564A9799L09714e1058
$$ y = [115215, 117660, 20699, 139480, -342518, -11770, 106253, 52144, -399405, -166517, 147156, -347355, -2391, 188069, -79363, -157076, 137824, 344197, -274418, -44442, 198852, 378592, -45059, 104101, 462514, 10654, 2590, -130086, -150971, 211502, 305916, -79521, -65257, 77276, -39881, 8129, 124302, 115228, 64482, 16063, -56466, 56244, -201452, -130212, -18043, 49311, -2070, 37393, 229012, 186368, 115762, 165675, -494091, -139148, 388797, -55945, -29260, 134194, 188073, -352549, 80898, 208487, 101252, -36228, -46327, 143738, 101748, -186001, -113499, -146741, -85273, -10641, -197607, 210725, 159583, 139432, 142156, 97257, 107634, -10413, 9951, 60151, -211170, 44070, 59005, -156828, 314787, 348400, -119564, 19799, 329513, -51058]
15299B20579a42640C61267I5678a8423j40210J6277j70438a2438k14957J00690
15289a26705B13495a2912p075B9815O3857Q4967l3943b0049m9843E0640L00570
15278C51210q9698J0018f8158J5983A81027b99259B61765B7336L69163I9661b9789
15266C63848H2964b06517D3031a47434n158B90161A03981J3787K45674I1676J91036
15255B82712C0629L24505a31822C94843A34175L82R75772L57520K3868n49n93754
15244H97414k10657B82696e4776k05243C61594A64145C5504b0096B19999l6454
15234A83545a07513B85906j08799a37963a6869G4981O0073a83259B71064a15074
15223B01312J95352D5174a05251C04651A46488j6000K538c9511B4144L5704k2299
$$ y = [220579, -142640, 361267, 95678, -18423, -158633, -142356, -312794, -12438, -227395, -126705, 213495, -12912, -19987, 29815, 93672, 178639, 144696, -20049, -69892, 50640, 351210, 261512, 271530, -68158, -52175, 181027, -299259, 261765, 27336, 396499, 99661, -29789, 363848, 82964, -206517, 43031, -147434, -152592, 290161, 103981, 117768, 363442, 91676, 282712, 30629, 355134, -131822, 394843, 134175, 134557, 1110329, 1467849, 1491717, 1491168, 897414, 686757, 282696, -54776, -260019, 361594, 164145, 35504, -20096, 219999, 183545, -107513, 285906, 177107, -137963, -16869, 74981, 135054, -183259, 271064, -115074, 201312, 396664, 45174, -105251, 304651, 146488, 130488, 133026, -39511, 24144, 59848, 37549]
15212C7549g9134B15682i7885C60700a65782B64168a76147C46955H2706B6253
15201E5694a67516E0147J93515j14260E1241P2P562J194K62276p0999J06776f4299
15188B47052a82748O9334I7014a4296q9155A61589a86797D3581a33231f3198F5655
15176B34759F8510K7364f1580B12253m468B9096K47871a377A11999P0186C2041
15164g688B96485J48619A15673C6684O1351d3515A7721K79302a45897H7074J80555
15153B67629A12917B2123a49435g1964m7725C04181l0388j03355J4247h5203D0954
15141A30245a33918A16418rn6712c0139B46538H5198k8698L804a6581k0158A91206
15128d3167C21174j55800P8783A05366O6660R284K17504q5457N1684a18340F8772
$$ y = [37549, -79134, 215682, -97885, 360700, -165782, 264168, -176147, 346955, 82706, 26253, 55694, -167516, 50147, 243662, 129402, 51241, 51313, 58875, 60069, 322345, 251346, 358122, -64299, 247052, -182748, -113414, 97014, -14296, -103451, 161589, -186797, 43581, -133231, -63198, 65655, 234759, 68510, 95874, -61580, 212253, 207785, 29096, 276967, -1377, 111999, 182185, 32041, -7688, 296485, 445104, 115673, 36684, 98035, -43515, 17721, 297023, -145897, 87074, 267629, 112917, 22123, -149435, -71964, -119689, 304181, 273793, 170438, 184685, -85203, 40954, 130245, -133918, 116418, 116409, 59697, -30139, 246538, 85198, 56500, 60304, -16581, -36739, 191206, -43167, 321174, 165374, 244157, 105366, 172026, 181310, 398814, 313357, 365041, -118340, 68772]
15116A18590J3429a38169B40671a48584A76483H0132C7781g8824C3697J34856
15106A68553a3805l7259B1364K6223J91976D5805L41402A57353J23643d4908H5279
15094B1458H071J9549b8764D6834P1719J67603R1092F8027B7865K33116J27756
15083C88737b5973B60304E3765a37424A59192p9152b1530A12851a8844F7114A1935
15071B98613q6817H9055M22166B2779K09774I7854M3763J61383P798o4264l2004
15060B14530e804A39371E7840P265P5483h2233F3201J54374i9095C35661N821
15049C41482q41k2399d5523C69186j16213j11303B0162L01113j32719D9207K03631
15038B52838F0180J23025l8823j8404L37J23060n1270b05513H6632D2115J96674
$$ y = [118590, 132019, -138169, 240671, -148584, 176483, 80132, 37781, -78824, 33697, 168553, -13805, -51064, 21364, 47587, 239563, 45805, 387207, 157353, 280996, -44908, 85279, 21458, 8071, 27620, -28764, 46834, 118553, 286156, 377248, 68027, 27865, 260981, 388737, -25973, 260304, 53765, -137424, 159192, 80040, -21530, 112851, -18844, 67114, 11935, 298613, 211796, 89055, 511221, 22779, 232553, 97854, 141617, 303000, 310798, 246534, 214530, -5804, 139371, 57840, 65105, 140588, -82233, 63201, 217575, -99095, 335661, 341482, 340641, 318242, -45523, 369186, 252973, 141670, 20162, 321275, 188556, 49207, 252838, 60180, 183205, 144382, 125978, 126315, 249375, 198105, -205513, 86632, 42115, 238789]
15027B38789A8196g8647B10351B5402J01270Q2594q0939J8472K07079E3154J81222
15016B34376J16932j56654J0324e7455E0126K95529C5700Q03268B48534O7544
15006C16078O8732j90911O3740A26979b9315A77588C1705N4150J74438J29928
14996C90221K5871A93657N5957e4797A15247a0300B26951J5166F0772J50538J88264
14985C99574C6765K36020k0466F4636R2435K28292j51519L09578A0787K52404
14975B63191K73459k30958J79627j21866j15024m4022m0737N7789K00284a07049
14964G4945M17974B34417P7060R7999A81714J68533P6460I4746M8846L97461B22029
14952a06785C62080J44606j16502j00585J26243F2749M26346r4092A60959N352
$$ y = [238789, 18196, -78647, 210351, 25402, 126672, 209266, 128327, 146799, 353878, 53154, 234376, 351308, 194654, 204978, -57455, 50126, 345655, 35700, 838968, 248534, 316078, 384810, 193899, 257639, 126979, -29315, 177588, 31705, 85855, 260293, 390221, 416092, 193657, 249614, -54797, 115247, -10300, 226951, 242117, 60772, 211310, 399574, 36765, 272785, 252319, 64636, 157071, 385363, 233844, 543422, 10787, 263191, 536650, 305692, 485319, 363453, 248429, 204407, 163670, 221459, 421743, -107049, 74945, 492919, 234417, 311477, 409476, 181714, 350247, 426707, 94746, 143592, 541053, 222029, -106785, 362080, 506686, 390184, 289599, 415842, 62749, 489095, 395003, 160959, 166311]
14942A66311J73D7009J97181L96488D3600K88953j18828K79541M455j64717Q0846
14931D13850j71973J03956P0244j82027L7080J44233K3727j83098N273O4732j62630
14920A63367D3459K22515q7593P0109q4060K7391J48705A11053J66143j1310j00391
14909A65495M14233B25518B9769M60149A62986L59318j41919o5344G7294K58047
14899C35341l1152n9978Q212K37896i71G74960B04989K7307d643C12593L21503
14888F34096l14143M12309l48803j30280p2577k6654L73719k09567J21973m7961
14878C92112K79741C25899c7670D45024p746J38073B50666L79318j67035j97668
14868B65281K78425o0411N2443J78094C15729J23886M5675J90070j93744A85791
$$ y = [166311, 166484, 47009, 244190, 640678, 43600, 332553, 213725, 493266, 497721, 333004, 413850, 241877, 345833, 416077, 234050, 271130, 415363, 439090, 255992, 261265, 325997, 163367, 43459, 265974, 178381, 248490, 164430, 191821, 340526, 111053, 277196, 265886, 165495, 579728, 225518, 29769, 489918, 162986, 522304, 380385, 315041, 77294, 335341, 304189, 244211, 252423, 490319, -971, 774960, 204989, 232296, -4643, 312593, 634096, 319953, 732262, 383459, 253179, 180602, 153948, 527667, 318100, 440073, 392112, 671853, 325899, -37670, 445024, 437278, 575351, 250666, 629984, 462949, 265281, 543706, 483295, 535738, 713832, 315729, 439615, 485290, 675360, 481616, 185791]
14857E36958m7766J49901k21876K62552k38162j05765P3323Q9196P8723k8901
14847E48183G1798L02813o3325J23869K81475B09191L12127j41461A88722M23225
14837F11947k1009J35307d4769E78419k3898K2779j38822J96331j10740j50665
14827C73404Q4580J49078L8686c099F47462k13385M5031J60974J8778k09768j00281
14816C48811M501m8785J88970K18913r1740L7499j98687J15319n6034J7222J33136
14805F69125p4810B92053K48663n9229j44321M6836K18790L29863C19808K58843
14795E78651o3506J78845k1694J56703l80350J29960m335B75991K88561j02262
14785D62290J17888k25304K1987p6098M50939l37204P8045K0301L87014j51240
$$ y = [536958, 489192, 639093, 417217, 679769, 441607, 335842, 409165, 498361, 577084, 548183, 71798, 374611, 311286, 435155, 716630, 209191, 521318, 379857, 188722, 611947, 590938, 726245, -44769, 578419, 554521, 577300, 438478, 634809, 524069, 373404, 457984, 607062, 645748, -3099, 647462, 434077, 479108, 640082, 658860, 449092, 348811, 353312, 304527, 493497, 712410, 620670, 658169, 459482, 574801, 518767, 535989, 669125, 594315, 292053, 540716, 481487, 337166, 384002, 602792, 932655, 319808, 578651, 515145, 693990, 672296, 828999, 448649, 578609, 574274, 275991, 564552, 462290, 580178, 354874, 376861, 300763, 751702, 414498, 492543, 512844, 899858, 748618]
14775G48618j19875J7928l02820M83751k61784j07743L53466C34274N24063j73528
14765F84809O0747k54278K82019l16598P4674M11919C95296K19119J44742k33582
14755E25575m5431K20473k90367K12055K11907m4752j49958K34855k16631M10091
14745A067817R0830m27525j7721j86392O112L47880k30478P2125L62898m81408
14735F04138K81291M9724k33027O683J08724j06066k87481L71752m667J98775
14725I89846j63103k87825K20780j52975K82758K11532l76774Q9565k6099k3986
14715G63719j26168J48313L6771R9022j19417L69165l10167j22409K76278J28192
14705A143299j30890k20124K33526j15942J06447j68086K98484j57427j57259
$$ y = [748618, 628743, 646671, 343851, 827602, 565818, 458075, 811541, 334274, 858337, 684809, 745556, 491278, 773297, 456699, 531373, 943292, 395296, 614415, 759157, 525575, 480144, 700617, 410250, 622305, 834212, 789460, 639502, 874357, 657726, 1067817, 1158647, 731122, 713401, 527009, 533121, 881001, 650523, 722648, 1085546, 604138, 885429, 935153, 702126, 708809, 817533, 711467, 423986, 795738, 791071, 989846, 826743, 538918, 759698, 606723, 889481, 1101013, 724239, 813804, 787705, 763719, 637551, 785864, 822635, 921657, 802240, 1171405, 861238, 738829, 1015107, 1143299, 1012409, 792285, 1025811, 909869, 1016316, 848230, 1146714, 989287, 832028]
14696H32028O412p647j65079K41226K20451l40220p666R793r5793K68907j68403
14685G94009L166K59998L62138m12113Q7191j37423n4223J72981l56477L07264
14675A026511k88571R9444J85586J78089l23539j49963M22629l86531M00123p9873
14665A083905J91669l48736L561m3085J36207k09780M07000k0912j66280P4962
14655A108511n0533K21894l26822r6600O2838O59098l97014N89705p88902K31857
14645A214032K44510j49420K8225J50573n43150L08688P6315J49688j25251m2540
14635A311670L18113j16851j45455R4839p4475k72074N89166k16716M6934k92180
14625A242971q6411L19523n6364j60108L66865j89126M0304j71778K56869j79578
$$ y = [832028, 838440, 830793, 665714, 906940, 1127391, 787171, 779505, 789298, 693505, 962412, 794009, 797175, 1057173, 1419311, 1007198, 1094389, 956966, 902743, 1075724, 719247, 1026511, 737940, 837384, 1022970, 1201059, 877520, 727557, 1150186, 763655, 1163778, 1083905, 1275574, 926838, 930399, 887314, 1023521, 813741, 1220741, 1199829, 1033549, 1108511, 1057978, 1279872, 953050, 856450, 919288, 1578386, 1181372, 1771077, 982175, 1214032, 1458542, 1309122, 1337347, 1487920, 944770, 1253458, 1329773, 1479461, 1354210, 1311670, 1629783, 1512932, 1367477, 1462316, 1387841, 1115767, 1704933, 1488217, 1535151, 1242971, 1156560, 1476083, 1419719, 1259611, 1626476, 1437350, 1477654, 1305876, 1562745, 1383167]
14615A383167J69427Q8697o3960n5497J43371j08059J68455M5481m89950K74906
14605A556038N9280Q9323K10888k3943n48573L21811M3592J87455J06208k51124
14595A750955k4505J23912k44124K17897n048J8113k39053M4035L82122k47223
14585A777081J96570J01665m17527K09455M20548m67933J44676j22959L83035
14576B224611K5393k12314M40015l22595k05690N42192l54341K21266J33866o4952
14566B427451j9842K41427l56882O63936m09873K04556j10005J47307m4458Q2396
14556B826013J61560L73757J62319M87705L30547K74628Q69286J603715L714939
14547A0804469J1360154J6317035l598449j2442337A1163181n273112j849442
$$ y = [1383167, 1552594, 1641291, 1577331, 1521834, 1665205, 1557146, 1725601, 1771082, 1281132, 1556038, 1615318, 1704641, 1915529, 1891586, 1343013, 1664824, 1708416, 1895871, 2002079, 1750955, 1726450, 1850362, 1606238, 1824135, 1819087, 1837200, 1598147, 1642182, 2024304, 1777081, 1973651, 2075316, 1657789, 1867244, 2287792, 1819859, 1964535, 1841576, 2224611, 2250004, 2037690, 2477705, 2155110, 1949420, 2491612, 2137271, 2358537, 2492403, 2427451, 2407609, 2649036, 2292154, 2956090, 2546217, 2750773, 2640768, 2788075, 2743617, 2826013, 2987573, 3361330, 3523649, 4011354, 4341901, 4616529, 5485815, 7089530, 10804469, 22164623, 38481658, 34883209, 22440872, 11163181, 5890069, 4040627]
14540D040627j082499k31962K5454j70661l74959M26047l45482J60217l1783k39687
14530B175312j81587M7924N27015j77307j05624L17699J13327J2909j49554R0800
14520B670914q1549o8225N34874m90167O9638J04048K11979J25301l00512r1472
14510B684829Q8058L85699m96861k0146J85943N56241m08654K46289r2106r9498
14500C029794J24896J02985j38486K5778L97723q7477J08873k4590k12441L37797
14490C664852j15728K16175m4142n4366N90783n91318N00039o75247N19104k63889
14480C746263J37417R6236K5768K40543m8924j68172J67951K26619o0657K25160
14470D588204r8976J67831r4695N1777M7500p1435R0064J71562J59096m8154k3343
$$ y = [4040627, 2958128, 2726166, 2751620, 2580959, 2206000, 2632047, 2286565, 2446782, 2414999, 2175312, 1993725, 2041649, 2568664, 2391357, 2285733, 2603432, 2716759, 2729668, 2580114, 2670914, 2589365, 2521140, 3056014, 2565847, 2635485, 2739533, 2951512, 3076813, 2776301, 2684829, 2772887, 3158586, 2661725, 2641579, 2827522, 3383763, 2975109, 3221398, 3129292, 3029794, 3154690, 3257675, 3119189, 3144967, 3542690, 3455213, 3564086, 3539496, 3327055, 3664852, 3549124, 3765299, 3721157, 3666791, 4257574, 3666256, 4166295, 3491048, 4010152, 3746263, 3883680, 3979916, 4005684, 4246227, 4197303, 4029131, 4197082, 4423701, 4363044, 4588204, 4489228, 4657059, 4562364, 4614141, 4661641, 4590206, 4680270, 4851832, 5010928, 4962774, 4939431]
14459D939431N1794M49183n00974K10302K09750m16537O06108j24167K6514M16699
14449E868103k34422J38781Q2540Q7166j47558L51827m4763j12083J29563J6401
14439F135555K37858M30556l56410K99095p2673L15398L47J01809K0442m1477
14429G070500J14619J25153j0950N01312L9479k27294M2749J35936K2379M98636
14419H312519J78909L41316m12296J34L55513L6894K16035l682M34691J0935P9192
14408I550160K36476K62230N3638J40405l7162J71643K62106J33280J94591j93424
14398A0773943L88853K98145L98629L56771J74408o0013L9911K46135L86268j51023
14388A2852027R09989l05975J64300J75460M02566L28967J64834K96831J4329
$$ y = [4939431, 4991225, 5440408, 4939434, 5149736, 5359486, 4942949, 5549057, 5424890, 5451404, 5868103, 5633681, 5772462, 5855002, 5942168, 5794610, 6146437, 6101674, 5989591, 6119154, 6135555, 6373413, 6803969, 6447559, 6746654, 6673981, 6989379, 6989726, 7091535, 7111977, 7070500, 7185119, 7310272, 7299322, 7800634, 7840113, 7612819, 7655568, 7791504, 7813883, 8312519, 8491428, 8832744, 8420448, 8420582, 8776095, 8812989, 9029024, 9025342, 9460033, 9470968, 9550160, 9786636, 10048866, 10102504, 10242909, 10205747, 10377390, 10639496, 10772776, 10967367, 10773943, 11162796, 11460941, 11859570, 12216341, 12390749, 12330736, 12370647, 12616782, 13003050, 12852027, 13762016, 13456041, 13620341, 13795801, 14198367, 14527334, 14692168, 14988999, 15003328]
14379A5003328J85977N41785P5862J45895L46925P64922L64789K799K34988L16396
14369A7983666L16216N17042L58150M76611L64855M47129M64596K99786L03604
14360B1531655P01764M18567O67586M77406N38852N32796Q8075J016167N66297
14351B6539165L32621M56889J035091M57607R10578R21248N24084Q95504Q73748
14342C2946535Q17156R86425P17842Q38232J158864Q88699R33381J112019J178742
14333D1577895J264156J231189J610432R77583J514814J561607J519786J373685
14325E2631147K092441J720733J583319K310319J621977K491815K065185K469995
14317F8986931K499313K400570K654566K755648L019320L198094L332414L716523
$$ y = [15003328, 15189305, 15731090, 15806952, 15952847, 16299772, 17064694, 17429483, 17432282, 17667270, 17983666, 18299882, 18816924, 19175074, 19651685, 20016540, 20463669, 20928265, 21228051, 21531655, 22233419, 22651986, 23319572, 23796978, 24335830, 24868626, 24956701, 25972868, 26539165, 26871786, 27328675, 28363766, 28821373, 29731951, 30653199, 31177283, 32072787, 32946535, 33763691, 34750116, 35467958, 36306190, 37465054, 38353753, 39287134, 40399153, 41577895, 42842051, 44073240, 45683672, 46661255, 48176069, 49737676, 51257462, 52631147, 54723588, 56444321, 58027640, 60337959, 61959936, 64451751, 66516936, 68986931, 71486244, 73886814, 76541380, 79297028, 82316348, 85514442, 88846856, 92563379]
14309I2563379L808719L899261M173238M541412M458865N076638N224065N435040
14301A29180617O278180N733277O567718P384504P218527P912414Q135416Q502174
14293A86912827R202895R606499R973195J1047067J1036274J2140091J2192299
14286B62111147J3250333J3644873J3739668J4505892J4557594J4650033J4909965
14279C61369505J4493825J3712318J4107606J3103201J1967000J0013259P849726
14272D46616440M894734N21270m477256l684728n715387k283655m083406p473965
14264D24314047j0523573j1019743j2641223j2385575j2410579j3624709j3501363
14257C38207282j4220396j3964554j3636472j3935291j3678602j4007383j2967137
$$ y = [92563379, 96372098, 100271359, 104444597, 108986009, 113444874, 118521512, 123745577, 129180617, 135458797, 141192074, 147759792, 155144296, 162362823, 170275237, 178410653, 186912827, 196115722, 205722221, 215695416, 226742483, 237778757, 249918848, 262111147, 275361480, 289006353, 302746021, 317251913, 331809507, 346459540, 361369505, 375863330, 389575648, 403683254, 416786455, 428753455, 438766714, 446616440, 451511174, 452032444, 447555188, 443870460, 438155073, 435871418, 431788012, 424314047, 413790474, 402770731, 390129508, 377743933, 365333354, 351708645, 338207282, 323986886, 310022332, 296385860, 282450569, 268771967, 254764584, 241797447]
14250B41797447j2507629j1580991j1306985j0330010j0175825r091587q245746
14243A68558674q134961p695433p583205o504624o541419n340786o146197m910450
14235A15701599n209551m881320m603222l940591l683882l965656l411983l840115
14227H2165279k992080k994632k734345k451474l096599k240718k120379k497872
14219F1037180k238738j507723k165160j565760j876724j276758j688952j388600
14211D7328765j724929j704543q49571j406202q71992p44525j236068j216604
14203C7574331j367638r66463n23656j143498p88985r66341r11519p71575o98237
14194B9436419n11068j091969o84504n70346m75177o11511n54382p82362q49679
$$ y = [241797447, 229289818, 217708827, 206401842, 196071832, 185896007, 176804420, 168558674, 160423713, 152728280, 145145075, 138640451, 132099032, 126758246, 120612049, 115701599, 110492048, 105610728, 101007506, 97066915, 93383033, 89417377, 86005394, 82165279, 79173199, 76178567, 73444222, 70992748, 67896149, 65655431, 63535052, 61037180, 58798442, 57290719, 55125559, 53559799, 51683075, 50406317, 48717365, 47328765, 45603836, 43899293, 43049722, 41643520, 40771528, 40027003, 38790935, 37574331, 36206693, 35240230, 34716574, 33573076, 32784091, 31817750, 30906231, 30134656, 29436419, 28925351, 27833382, 27148878, 26578532, 26103355, 25491844, 24937462, 24155100, 23305421]
14185B3305421K62612o56672p50781q50199p1297n89902k47157n99627l14261
14176A9488137m25584n35529m08645q3021l66854j57337l74960o48207n79108
14167A5908892k37232k3921N6849o17891m56617k7717l65095j63125k35702k89409
14157A3549032l36008q0832l14309l67913l5752r75943M40830P6741m20237j1850
14147A1523759k60196r3258k95341N4906m10546k14076p3954l40355L19502n01252
14137I709189j38700J12379k55237j04237k64614J5882j26487l97688N5906k08422
14127H397971O3034k91975n5402n6679k80082J88958j52547j69966k90725K06533
14117G559120k58847p6268k09200J41126j28633j72689k65200n6406j17253J3813
$$ y = [23305421, 23568033, 22911361, 22160580, 21310381, 21239084, 20649182, 20402025, 19802398, 19488137, 19062553, 18527024, 18118379, 18035358, 17668504, 17511167, 17136207, 16488000, 15908892, 15671660, 15647739, 15704588, 15086697, 14630080, 14602363, 14237268, 14074143, 13838441, 13549032, 13213024, 13132192, 12817883, 12449970, 12414218, 11438275, 11879105, 11955846, 11535609, 11523759, 11263563, 11170305, 10874964, 10929870, 10519324, 10305248, 10231294, 9890939, 10210441, 9709189, 9570489, 9682868, 9427631, 9323394, 9058780, 9074662, 8948175, 8550487, 8606393, 8397971, 8461005, 8169030, 8113628, 8056949, 7776867, 7965825, 7813278, 7643312, 7352587, 7559120, 7300273, 7224005, 7014805, 7155931, 7027298, 6854609, 6589409, 6533003, 6415750, 6429563]
14107F429563K91059k60203l00216P0890p2080K43417l1116o63927k57954J40807
14097E590240M2706R5210l78309j53960K00569k90038L45941p1565l53734m319
14087E022741K89199j53601l26690K4059J60413k73269J79843j13285n2029P9343
14077D836724k11641j90316j48378O6332K01827l95212L05940l96374K87433k63437
14067D092898J70397l196m35891J92643J0485l96361M19025k83948J74952J20918
14057D061922k05771K92716l14530k55266J98610l70303L32712k14736j2010K1456
14047C534800J26453p8106l29430k41197J44326K09590n2909n0205j77978K9174
14037C114518P703j67787L05975k4357l43890M15407k84277r2641N5911j47042
$$ y = [6429563, 6720622, 6460419, 6160203, 6231093, 6159013, 6402430, 6371314, 5707387, 5449433, 5590240, 5632946, 5728156, 5349847, 5195887, 5396456, 5106418, 5452359, 5380794, 5027060, 5022741, 5311940, 5158339, 4831649, 4855708, 5016121, 4742852, 4922695, 4809410, 4757381, 4836724, 4625083, 4434767, 4286389, 4352721, 4554548, 4159336, 4465276, 4068902, 4356335, 4092898, 4263295, 4260099, 3824208, 4016851, 4027336, 3630975, 4050000, 3766052, 3941004, 4061922, 3856151, 4148867, 3834337, 3579071, 3777681, 3407378, 3740090, 3525354, 3513344, 3534800, 3661253, 3583147, 3253717, 3012520, 3156846, 3366436, 3313527, 3263322, 3085344, 3114518, 3122221, 2954434, 3260409, 3236052, 2892162, 3307569, 3023292, 2930651, 2986562, 2839520]
14027B839520l19567N81797k78837j27525q522q2545K79826j21079l07375K11095
14017B666788j52417j26195n8701J17828p8910J68854l38429M09123l83861o8189
14007B155891J26027j30902J87227j0516k25428k1572R2639m9630M1160J45323
13997B310219m24350P0791Q3726j49461j46245M00651R0873N95212N98253K003735
13987E433404Q450509J9150974K303117r495509j0971372n470119k839927j248611
13979E312466r33719n51090k50216m57k04650o36878N23828o27955J10851l52706
13969B389474O6464j87193K97893m40360k8112K52711l2409j59287j82343P4306
13959B051144q7782J95992j78118J11428l74714L11083J3488k64848M16426m3121
$$ y = [2839520, 2519953, 3101750, 2822913, 2695388, 2686866, 2604321, 2884147, 2763068, 2455693, 2666788, 2514371, 2388176, 2329475, 2447303, 2368393, 2537247, 2198818, 2607941, 2224080, 2155891, 2281918, 2151016, 2338243, 2327727, 2102299, 2080727, 2173366, 2123736, 2164896, 2310219, 1885869, 1956660, 2040386, 1890925, 1744680, 2145331, 2236204, 2831416, 3429669, 5433404, 13883913, 33034887, 35338004, 25842495, 14871123, 9401004, 6561077, 5312466, 4378747, 3827657, 3577441, 3576984, 3372334, 2735456, 3259284, 2631329, 2742180, 2389474, 2455938, 2268745, 2566638, 2126278, 2098166, 2350877, 2318468, 2159181, 1976838, 2051144, 1963362, 2159354, 1981236, 2092664, 1717950, 2029033, 2042521, 1777673, 2194099, 2150978]
13949B150978j36972j51233K63267m06448J10114p4649J04041K50610o25829L23864
13939A807743l7418K16560M1633n12074L7513N5439K37314j4818j19572q3567
13929A628753J9850J70881k86046k1223K12762O4853m41028J95912m28351K99775
13919A416138L6561j79441L39509j62368j95246L12678k5605J48769k53721L821
13909A441095j89447J51693j12963J22016j12188m3932N4657J32161n3932o37
13899A388523p6948k7925j20529L3180K46658l78601j6295M37219l88904K20677
13889A317055O3309l04246J05872p7932J19063J62214k38612P9466O6385M5028
13879A337602j54849j25512J05818N1711j09045J91462L5533m63884K88372j38135
$$ y = [2150978, 2014006, 1862773, 2126040, 1719592, 1829706, 1755057, 1859098, 2109708, 1483879, 1807743, 1770325, 1986885, 2028518, 1516444, 1553957, 1609396, 1846710, 1831892, 1712320, 1628753, 1648603, 1819484, 1533438, 1512215, 1724977, 1789830, 1348802, 1544714, 1116363, 1416138, 1452699, 1273258, 1612767, 1450399, 1255153, 1567831, 1542226, 1690995, 1437274, 1441095, 1251648, 1403341, 1290378, 1412394, 1300206, 1256274, 1310931, 1443092, 1389160, 1388523, 1311575, 1283650, 1163121, 1196301, 1442959, 1064358, 1048063, 1485282, 1096378, 1317055, 1380364, 1076118, 1181990, 1104058, 1223121, 1385335, 1146723, 1226189, 1292574, 1337602, 1182753, 1057241, 1163059, 1214770, 1105725, 1297187, 1332720, 868836, 1157208, 1019073]
13869A019073q5354P6651k83419L69567J04449k63675M31719K041m2030k01687
13859A127335k43281J30814K02537j70571j16673O643J83244o1671N8415k97558
13849H19234M89836l10631L27491l80950k4955r5543L43243l08756L05212l59884
13839H04297K83607j35795J99715n01379K82647j12006J24766j17677j01056J37124
13829H64243M6342l41755N59054m26352J3859M68008n43252M53541j83311m0598
13819H69779N8111j82751J67943j49880J40099k65894J87810j70320J80195M9209
13809H84301J72815j83770o6773J97292m46162K64329K34602j77482j10730k00737
13799E67685L22421k36211K27718P4710j49027l77731L53847j19733P7071J27775
$$ y = [1019073, 933719, 1010370, 726951, 1096518, 1200967, 937292, 1369011, 1371052, 1329022, 1127335, 884054, 1014868, 1217405, 1046834, 930161, 936804, 1120048, 1058377, 1116792, 819234, 1309070, 998439, 1325930, 944980, 920025, 824482, 1167725, 858969, 1164181, 804297, 1087904, 952109, 1151824, 650445, 933092, 821086, 945852, 828175, 727119, 864243, 910585, 568830, 1127884, 701532, 715391, 1183399, 640147, 1093688, 910377, 869779, 927890, 745139, 913082, 763202, 903301, 637407, 825217, 654897, 835092, 884301, 1057116, 873346, 806573, 1003865, 557703, 822032, 1056634, 879152, 768422, 567685, 890106, 653895, 881613, 956323, 807296, 429565, 783412, 663679, 740750, 868525]
13789H68525l15262M5269J09865J78836l47480J05302J70706j4194l94965L63265
13779G69867K7851k01346q6436m9240J76968j83043L1218O0540K6888M81593j78341
13768H76519l650k36071O7346M0516q7410j45369J65764m5411p2038k37897N03876
13757H26175j00215m9155K71874k71060j35359L99014B93843L40062k3923O5045
13747F75027J08365l00129k16708O50267l06859j38486Q4148K21593j91366J236
13737E87088J9091q0315k22331A26091K40777J68827K61268j71281J02306l34236
13727C93752L4812l4861L64200k81531J76519K10261l30458J93817k45286K97298
13717G78523k91500M6142k3594R7360j10334J19210B04584M09593o0268L70878
$$ y = [868525, 553263, 598532, 708397, 887233, 539753, 645055, 815761, 801567, 406602, 769867, 797718, 596372, 509936, 460696, 637664, 454621, 485839, 546379, 573267, 1054860, 876519, 872869, 636798, 704144, 744660, 657250, 511881, 677645, 632234, 560196, 322299, 826175, 725960, 676805, 948679, 677619, 542260, 941274, 293843, 633905, 609982, 675027, 783392, 483263, 266555, 916822, 609963, 471477, 555625, 777218, 585852, 587088, 606179, 525864, 303533, 126091, 366868, 535695, 796963, 625682, 727988, 393752, 428564, 393703, 757903, 476372, 652891, 863152, 532694, 726511, 481225, 778523, 487023, 533165, 509571, 606931, 496597, 615807, 204584, 614177, 553909, 924787]
13707I24787B99803L23188k36034n6823K79759K5873k73022J93137k1385J1168
13697E45664r8777j86769K67035J79828k68957Q4497K06972j88663k39056M11448
13687G13222l51511K71346k23179J56483Q5991C15444K18855p1989L73722k92678
13677E43354J14255B98461L32902M3197k53539O2028L2074k07133R5195j60474
13667B42711K25978B05014J46019N5104k0050L5254j19910N4753O2876m2362K1654
13656C98352K78456k83273J03425k35946k9699J89652m7557J7275n5058K19193
13646E54820A98758M24224k575k0876k28870K76816B71190m21M34175G3947M37311
13635E11258k52741N98637l95432J23188j48476j01269m6983L8359o7553J83474
$$ y = [924787, 299803, 622991, 386957, 330134, 609893, 635766, 362744, 555881, 534496, 545664, 446887, 260118, 527153, 706981, 438024, 522521, 729493, 540830, 301774, 713222, 361711, 633057, 409878, 566361, 652352, 315444, 534299, 462310, 836032, 543354, 657609, 298461, 631363, 674560, 421021, 483049, 515123, 307990, 403185, 242711, 468689, 205014, 351033, 406137, 386087, 421341, 301431, 356184, 419060, 376698, 398352, 676808, 393535, 496960, 261014, 231315, 420967, 373410, 390685, 335627, 554820, 198758, 622982, 620407, 599531, 370661, 647477, 271190, 270769, 704944, 73947, 511258, 258517, 857154, 461722, 584910, 436434, 335165, 288182, 326541, 258988, 442462]
13625D42462A79778J59262K53247j52392p0767m2352K63699A77904K14823O2086
13615D54813n3817K02236l2265l9068m2296L1285P3568j99471Q4760r0302J05748
13604D95191r0287A94781N9190K56407B26520D3054L07269H1805M98894B54162
13593A49706O4239N3787p9065K06926A63684M71893F2197J84808j1799M1238J51197
13582D27641J75239k59140J4090j17927J00576J33553B16819Q4152K7346n9460
13572B68857j4927J42223n3738k9960m6871J66205b9852F04602A1220L25440K0315
13561C56975k2113K49337B42784D8141L03693o3712J92590H9922J55781M6120
13551B91823j12569M24826j85081l6947j01076K64063k69071O0759A63248m8957
$$ y = [442462, 179778, 339040, 592287, 439895, 369128, 326776, 590475, 177904, 392727, 454813, 400996, 603232, 570967, 531899, 489603, 520888, 594456, 394985, 479745, 389443, 495191, 404904, 194781, 253971, 510378, 226520, 43054, 350323, 81805, 580699, 254162, 149706, 213945, 267732, 188667, 395593, 163684, 635577, 62197, 247005, 235206, 276444, 427641, 602880, 343740, 357830, 239903, 340479, 474032, 216819, 300971, 328317, 268857, 253930, 396153, 342415, 312455, 265584, 431789, -29852, 604602, 11220, 336660, 356975, 334862, 584199, 242784, 48141, 351834, 288122, 480712, 89922, 245703, 291823, 179254, 604080, 418999, 382052, 280976, 545039, 275968, 336727, 163248, 114291]
13541A14291M697J16683K41381k18131H8622l2243J36285N13679h090B43657D6410
13529a44208B09930K63561j98277C5237K50429j10996l5278Q7037L725J07784
13519C37938J09277j40552A44125m0816k6158R7306J46893n0267j20721O2461
13509B12823K36964N0135j8147j07267H1531M19D0924K65719m7587A289J96453
13498A97742j8023J619J04442a27096B38127o2803D2343L98908k01196M28639
13488F68694B19709l9465C0701K51841K0155A30782K1720K17051l23A53017J29047
13477B82064l8448J54210A55481K30834D4058M13853a01825E61711k20553q4729
13467B56429K37163a98411C91748n2474k8047a8103C50371b54074B12663K266
$$ y = [114291, 118988, 235671, 477052, 258921, 88622, 56379, 192664, 706343, -8090, 243657, 46410, -144208, 209930, 473491, 275214, 35237, 285666, 174670, 139392, 226429, 230154, 337938, 447215, 306663, 144125, 103309, 77151, 174457, 321350, 271083, 150362, 212823, 449787, 499922, 481775, 374508, 81531, 81950, 40924, 306643, 259056, 1289, 197742, 179719, 181338, 285780, -127096, 238127, 175324, 42343, 441251, 240055, 668694, 219709, 180244, 30701, 282542, 302697, 130782, 152502, 369553, 369230, 153017, 282064, 243616, 397826, 155481, 386315, 44058, 457911, -101825, 561711, 341158, 256429, 493592, -198411, 391748, 339274, 311227, -18103, 350371, -254074, 212663, 214929]
13457B14929C026K71532j4148I3008a7685C27858b0187A69470a09170E8522L80423
13446D38945A77868l0045O845G1712p367B4475P0696K58103J98540a43312D8640
13434B37469g4854B01961K95807j88405K16134j44722E8649K22618l291J57622
13424D35598G9064K76362r4487o8593J07955I8997K72188K4850j20047p3910Q7153
13413B89231A3642J61665J50967l4883q7457K60639B0573L3757J54882o6294L4804
13402A77722J07409c25859f9780A45819J30103g8163C02565a61413B57174e8157
13391B30761I9228K29990K9282d9552C94106F4408b329F7960J0628J31811K81188
13380D91587k11200F9563J76226J08360r8484b4667D87422P216B41690E0070J76666
$$ y = [214929, 3026, 274558, 260410, 93008, -17685, 327858, -20187, 169470, -109170, 58522, 438945, 177868, 147823, 154668, 71712, 64345, 24475, 95171, 353274, 551814, -143312, 48640, 237469, -74854, 201961, 497768, 309363, 525497, 380775, 58649, 281267, 277976, 435598, 79064, 355426, 260939, 192346, 300301, 98997, 371185, 396035, 275988, 202078, 289231, 13642, 175307, 326274, 291391, 203934, 464573, 20573, 54330, 209212, 142918, 177722, 285131, -325859, -69780, 145819, 275922, -78163, 302565, -161413, 257174, -58157, 230761, 99228, 329218, 358500, -49552, 394106, 64408, -2329, 67960, 78588, 210399, 491587, 280387, 69563, 245789, 354149, 255665, -24667, 487422, 494638, 241690, 50070, 226736]
13369B26736k9508Q9264r6140M0736I0876K55431a6597A82676K22401f4016B61755
13357D82660A62985J20934r0440K56647A96119N71323A47935i1769A42875K12491
13347C55366O0907A21923n8393L52307K19285a05975E11080B25442l0743K23034
13337D17733j17024M8526m2920A29904L24584E6365K26404J67846A21221O8181
13327A89402o2553a0832j85338G6636O5127m4347K31317d5805A08399J57718K42485
13316E08602K1926A50477o3924K14678j11383A2265J87452M603h281j11125C1515
13304E7587K28738c0386r1313E04186b06617D15310N9474B23417D3560J68622
13294B12182A0843m579J39318J22874a01346A24935D3776K76337A46008h4759
$$ y = [226736, 197228, 286492, 190352, 231088, 90876, 346307, -16597, 182676, 405077, -64016, 261755, 482660, 162985, 283919, 193479, 450126, 196119, 767442, 147935, -91769, 142875, 355366, 416273, 121923, 63530, 415837, 635122, -105975, 511080, 225442, 194699, 417733, 300709, 349235, 306315, 129904, 454488, 56365, 282769, 450615, 121221, 189402, 126849, -10832, -196170, 76636, 141763, 97416, 328733, -45805, 108399, 266117, 508602, 530528, 150477, 86553, 301231, 189848, 12265, 199717, 204320, -8281, -119406, 31515, 57587, 286325, -30386, -121699, 504186, -206617, 415310, 474784, 223417, 43560, 212182, 10843, 6264, 145582, 268456, -101346, 124935, 43776, 320113, 146008, -84759]
13283C53183F1037K74100Q4441F9066b01240A70163O4349n9610a15834A07264
13272C0177K04438J08981A42555m7118R830K87329j14081I8849b3337D47802j73200
13261B74602A16752c306E3526J49114D5795J33988J78041F2662L87105b4801B49360
13249B77050l1104a13667B1296J33779F2973Q7594L9138J078e3977C23945G7575
13237a53406A65555J44459J71022A09276l3078H306M5333K85755A0675L77263
13227C87938D6099R2867B9461J15286d283A06959N411J30991b04410A15647e5625
13215I7525a382H8565C3033J52588I0584g3801k13317H1308J40201K8028H2465
13203E6222L73370C3545K67062l9072c1653A86793P6677j15139e0669C40479A05532
$$ y = [353183, 61037, 335137, 419578, 69066, -201240, 170163, 234512, 174902, -115834, 107264, 30177, 234615, 343596, 142555, 95437, 105267, 392596, 278515, 98849, -23337, 447802, 274602, 116752, -3306, 53526, 202640, 45795, 179783, 357824, 62662, 449767, -24801, 249360, 277050, 245946, -113667, 21296, 155075, 62973, 150567, 189705, 190783, -53977, 323945, 77575, -153406, 165555, 310014, 481036, 109276, 76198, 8306, 53639, 339394, 10675, 387938, 46099, 138966, 29461, 144747, -4283, 106959, 112370, 243361, -204410, 115647, -55625, 97525, -1382, 88565, 33033, 185621, 90584, -73801, -287118, 81308, 221509, 249537, 82465, 56222, 429592, 33545, 300607, 261535, -31653, 186793, 263470, 148331, -50669, 340479, 105532]
13191D219L09936b35409A85460J79655c229F4600c9085b931A08062a19300C42113
13179B14905a25134G3629N1084K6108E0709c1416k02787D0289c49352g7371A6536
13167b8504H7230c6077C23190p5798C3433K96749A09018b99244i4492F9296a32542
13155a04178a5123A65100o5944K59532D9284a27999A52835L5575c88667A99407
13144E7598J46441F9351J88249f4728A80075b7453j08763b3953k9281C05671h4804
13132B47046P2720a8650E5485c8581A17380C6356O8191i5088A20888c969A0740
13120D1219a0566j70283c6287B24864i2060A52797d0853j60362e7030b5225m7638
13109g2863B78872A8138a81227C7270a7505H6615R2936H9174J3125o401i8882
$$ y = [4219, 314155, -235409, 185460, 365115, -3229, 64600, -39085, -2931, 108062, -119300, 342113, 214905, -125134, 73629, 124713, 150821, 50709, -31416, -234203, 40289, -349352, -77371, 16536, -28504, 87230, -36077, 323190, 247392, 33433, 330182, 109018, -299244, -94492, 69296, -132542, -104178, -15123, 165100, 99156, 358688, 49284, -127999, 152835, 188410, -388667, 199407, 57598, 204039, 69351, 257600, -64728, 180075, -27453, -136216, -23953, -53234, 305671, -84804, 247046, 319766, -18650, 55485, -38581, 117380, 36356, 104547, -95088, 120888, -3969, 10740, 41219, -10566, -180849, -36287, 224864, -92060, 152797, -40853, -201215, -57030, -25225, -72863, 278872, 18138, -181227, 37270, -17505, 86615, 179551, 89174, 102299, 95898, -98882]
13097A93153E7479K80571j41996j7219J97190B4691h2345b1521r3290L3133E9906
13085H0346J44430b37329g886C29813A55910B228J48124J02358a5754C48797F7992
13073F2902p751J49581D5405P7469f4760j30199h7789A02950O8902q2926a66285
13061A4059a0533C53K27086B1778L6943f2731C24609a79131H1041N30600I9464
13049d3859A42384J00101o0353K791J01346N9408i2354j85569A65983l5715M0418
13038A70686h827D47376A04950i2161A6173a49445b2703I3518D4348a6805j27794
13027a44599O3337A4271N6084e7981C69682q4887r4974l3429c5650F7095a87152
13015A15275b788H8869j9275K61221q4406d9407F2577J71167k1958D9797a9337
$$ y = [193153, 57479, 338050, 196054, 178835, 376025, 24691, -82345, -21521, -114811, -81678, 59906, 80346, 224776, -237329, -7886, 329813, 155910, 2228, 150352, 252710, -15754, 348797, 67992, 62902, 55151, 204732, 45405, 122874, -64760, -194959, -87789, 102950, 171852, 88926, -166285, 14059, -10533, 353, 227439, 21778, 58721, -62731, 324609, -179131, 81041, 611641, 99464, -43859, 142384, 242485, 182132, 184923, 286269, 345677, -92354, -277923, 165983, 130268, 170686, -8827, 447376, 104950, -92161, 16173, -149445, -22703, 93518, 44348, -16805, -144599, -81262, 14271, 70355, -57981, 369682, 284795, 189821, 156392, -35650, 67095, -187152, 115275, -2788, 88869, 69594, 330815, 246409, -49407, 62577, 233744, 211786, 49797, -19337]
13003e2953G1753c49588h009k8107B55264A7803J32641B6030K04302o8781N2350
12992B13901i9006A43311o557a1950B12594n9205b6663C3577E765a94896c6932
12980B4882K11745h0091A18628d709A08119d2759D06222j85689b6629H2716c2885
12968D8512i5836A56993J08557f3163A56633E4460K66766H6763j2822J6574a00248
12956A56151c1379A06481A5314K23051j6937C5735b6400l6951C5040J21097b2773
12944A45217C7059b02683h5771E4671d3778B54009b39149j9765a17357B78104
12933G5992M2595a07179A22077B5050K3651J02193a40121j36993B28577a6819
12922d2972H779e8589e678p9479M746L8233B04961F7025M4253c39094B49540b6031
$$ y = [-52953, 71753, -349588, -8009, -36116, 255264, 17803, 150444, 26030, 230332, 161551, 213901, -99006, 143311, 136754, -11950, 212594, 153389, -26663, 33577, 5765, -194896, -36932, 24882, 236627, -80091, 118628, -4709, 108119, -42759, 406222, 220533, -26629, 82716, -32885, 48512, -95836, 156993, 265550, -63163, 156633, 54460, 321226, 86763, 73941, 90515, -100248, 156151, -31379, 106481, 15314, 238365, 221428, 35735, -26400, -63351, 35040, 156137, -22773, 145217, 37059, -202683, -85771, 54671, -43778, 254009, -239149, -258914, -117357, 278104, 75992, 118587, -107179, 122077, 25050, 48701, 150894, -140121, -277114, 228577, -16819, -42972, 8779, -58589, -5678, -85157, -80411, -42178, 204961, 67025, 111278, -339094, 249540, -26031]
12909c4622m621I2497L35073c50993a5381b818C19240A36784J5536e5605B32103
12897a61092k20877a28411A11777b61755E04345A27910R7352M7315J6673A20906
12886b20974I4222J32286f9190A60017M4494b36818k2519p3782C41294a54115
12875i4317A17308K19529d2347C35985A62447k2513E5623a7264B0796J90027N718
12864B16541N2707a23524E2729b61928g787o0081B18480A2194M2304a2423C0654
12852B9723b52380A98497f2418l58j2343a4265C69760a81113N7069A39432o3930
12841G5502N5535a22398n8371L2698G5700J99653f8946n7146C6513b56728A75033
12829G8685a3028j55267H4547J89588F91J94399O6286a50993N4168A0387f2683
$$ y = [-34622, -39243, 92497, 427570, -350993, -15381, -2818, 319240, 136784, 152320, -55605, 232103, -161092, -381969, -128411, 111777, -261755, 504345, 127910, 225262, 272577, 289250, 120906, -220974, 94222, 226508, -69190, 160017, 204511, -236818, -259337, -333119, 341294, -154115, -94317, 117308, 336837, -42347, 335985, 162447, 139934, 55623, -17264, 20796, 210823, 216541, 269248, -123524, 52729, -261928, -7787, -67868, 218480, 12194, 54498, -12423, 30654, 29723, -252380, 198497, -62418, -62776, -75119, -14265, 369760, -181113, -124044, 139432, 75502, 131037, -122398, -180769, -148071, 75700, 275353, -68946, -126092, 36513, -256728, 175033, 78685, -13028, -168295, 84547, 274135, 691, 195090, 261376, -150993, -96825, 10387, -62683]
12817a49316b1308A57686d2939o2324n0183m1457j200C943M9718J80508f1872
12805c10219B9811g2998B24804i6843C253a38363h43B58183a69600A00902L2963
12794A33865N0881a96715B21913d0542A06637j6772J12273k7878j1807c76843
12783H8752a2310A83151Q9761d2992D3231J36616b76122a29267G7584O1934K1371
12772A60889d04360G1245j7088L4228J98218d8647E6704N4421m2234a10431j47081
12761b57512A58750N3327H9306L80449A82465c6808l85184g2861G4058a05118
12750a62650j8566B4962a82594A17237f4531B8189J03012E3652a29383A4112J51741
12739A65853A7904a08443C2904b70771B79514A9999a4393I0498b40765B03464
$$ y = [-149316, -21308, 157686, -42939, -105263, -155446, -196903, -198103, 3943, 53661, 234169, -61872, -310219, 29811, -72998, 224804, -96843, 3253, -138363, -843, 258183, -169600, 100902, 133865, 184746, -196715, 221913, -40542, 106637, 89865, 202138, 174260, 162453, -376843, 88752, -12310, 183151, 272912, -42992, 43231, 179847, -276122, -129267, 77584, 139518, 160889, -404360, 71245, 54157, 88385, 286603, -48647, 56704, 111125, 68891, -110431, -257512, 158750, 212077, 89306, 469755, 182465, -36808, -421992, -72861, 74058, -105118, -162650, -181216, 24962, -182594, 117237, -64531, 28189, 131201, 53652, -129383, 14112, 165853, 17904, -108443, 32904, -270771, 279514, 19999, -14393, 90498, -240765, 203464]
12728A02325g3704A26917P9000k7561d0758n9785o6797A56290J27718G9143c65533
12716c46573G2480b9181o3433r0889A52559a5843A41222k3988J82642K43642j40194
12705D03324j40359e9072H1212q793N9611b3939k8887A2780K05513I9379M4065
12694A43444K22437j00272E8484g2717C50502a58132D09539H2013C3914a15836
12683D7691c33329J3784b9047C35335F2182J59015a63528B43797h8500A96489
12672A67834K78713H3721r379a48688B2411Q0301i7337D38272A79209G2607b67756
12660I4030A3868L37667b52828G8760f9256K9467C4431O4664L2754L04377E4198
12648A85858q7354e2389A66772p604G010Q8990L39922A01991d2520A86954a15824
$$ y = [102325, -73704, 126917, 205917, 178356, -40758, -100543, -167340, 156290, 284008, 79143, -365533, -346573, 72480, -29181, -92614, -183503, 152559, -15843, 141222, 117234, 299876, 543518, 403324, 262965, -59072, 81212, 72419, 132030, -23939, -52826, 12780, 218293, 99379, 143444, 365881, 265609, 58484, -72717, 350502, -158132, 409539, 82013, 33914, -115836, 47691, -333329, -319545, -29047, 335335, 62182, 221197, -163528, 243797, -88500, 196489, 167834, 446547, 83721, 74342, -148688, 22411, 102712, -97337, 438272, 179209, 72607, -267756, 94030, 13868, 351535, -252828, 78760, -69256, -39789, 34431, 99095, 131849, 436226, 54198, 185858, 98504, -52389, 166772, 159168, 7010, 96000, 435922, 101991, -42520, 186954, -115824]
12636A24110L84170a45137A44809M25352e8104B80242i6455B28559K78988j84198
12626C23349A33827d4038A09977m469M02949A81693O4761b7811A01384a28851
12615b91826d2571C76256c3419E0946K52507a23864e9832l94758C76292A80581
12604F3852J40156H604K34529A5505J3863J70248l765G6911b03892a4294j8651
12593c2945i496A72403m5053C6108Q9990M9271b36167G097J08130n3988d94789
12581A30243b56102A41954E7733j9784d5837E5548h2310G3305L7005D2445K23506
12570B65951a13481J2620b4828B82828f4605j69474A23874C1661b88778C8473
12559G4686b69859a04915d2156A52685g8802j48602a1782F049J28132L7305E7598
$$ y = [124110, 508280, -145137, 144809, 570161, -58104, 280242, -96455, 228559, 507547, 323349, 133827, -44038, 109977, 105508, 508457, 181693, 246454, -27811, 101384, -128851, -291826, -42571, 376256, -33419, 50946, 303453, -123864, -59832, -454590, 376292, 180581, 63852, 204008, 8604, 243133, 15505, 29368, 199616, 195851, 76911, -203892, -14294, -32945, -9496, 172403, 127350, 36108, 126098, 175369, -236167, 7097, 115227, 61239, -494789, 130243, -256102, 141954, 57733, 37949, -45837, 55548, -82310, 73305, 110310, 42445, 265951, -113481, -100861, -24828, 282828, -64605, -234079, 123874, 31661, -288778, 38473, 74686, -269859, -104915, -42156, 152685, -78802, -227404, -11782, 6049, 134181, 171486, 57598]
12547D8788R8455a79555B14134p8515o2918a46137j15511B7744K24885h7671d1877
12535b0520B7215Q1068i0532A73188H4952J36372B4324K04953b3936G7450k9161
12524D8289J61607I8079a84331D6323A0053g0632A07004A9402R7510K1742J21815
12513B60469D1415a7581B7268b10795q6926i7574d5210E34522a50728B4982R205
12502C4187M14526a61603n9173B65934m5691d8894l9825A22399D3357M137g2258
12490B65803a5148D3014J19308J75788c02587C63872g531k9677m4178j72800G2910
12478A8673b39634A69723B953d2976A15040b95171f6883a9798l43328B38240M4728
12467B82968c0633n8586C5452J59786i2252l2153A23706M2804E7831e7833q7056
$$ y = [48788, 147243, -179555, 214134, 135619, 72701, -146137, -261648, 27744, 252629, -87671, -41877, -20520, 27215, 108283, -90532, 173188, 84952, 221324, 24324, 229277, -23936, 77450, 48289, 209896, 98079, -184331, 46323, 10053, -70632, 107004, 19402, 116912, 138654, 260469, 41415, -17581, 27268, -210795, -297721, -97574, -45210, 534522, -150728, 24982, 34187, 448713, -161603, -220776, 265934, 220243, -48894, -88719, 122399, 43357, 47494, -72258, 265803, -15148, 43014, 162322, 338110, -302587, 363872, -7531, -37208, -81386, -254186, 72910, 18673, -239634, 169723, 2953, -42976, 115040, -295171, -66883, -19798, -363126, 238240, 282968, -30633, -89219, 35452, 195238, -92252, -124405, 123706, 166510, 57831, -57833, -144889]
12456a44889B63242D9002O3550D8040f6188D4030N8827d4022a319C29925A26167
12444C05263c9497A38351F1418O69J11625e6074j10259B84293I2484f7877H1166
12432f7603b8256i816j70422b5945B01091r4629a03957p1072G9941d76455a77435
12420E7781c74579b8961D5265a58887d9094C1527J95215d26185G4140J16263i7626
12408a87505C44477A03855a11017A3467K34675b9031F4286a52213B90331o0283
12398B30048a36113D9937J88886M1040J82959a95414A13762L62271C7387J92719
12388B30106I7661d3177A62703n6840f6595a5090l65057F3291e2068j6725j18784
12377a87577c5315I6763C4288K92283D7369b12276c331j78713A8106h0427I846
$$ y = [-144889, 263242, 49002, 112552, 48040, -66188, 44030, 102857, -44022, -1319, 329925, 126167, 305263, -39497, 138351, 61418, 62087, 173712, -56074, -166333, 284293, 92484, -67877, 81166, -67603, -28256, -9816, -180238, -25945, 201091, 106462, -103957, -175029, 79941, -476455, -177435, 57781, -374579, -28961, 45265, -158887, -49094, 31527, 226742, -426185, 74140, 190403, -97626, -187505, 344477, 103855, -111017, 13467, 248142, -29031, 64286, -152213, 290331, 230048, -136113, 49937, 238823, 279863, 462822, -195414, 113762, 476033, 37387, 230106, 97661, -43177, 162703, 105863, -66595, -15090, -380147, 63291, -52068, -68793, -187577, -35315, 96763, 34288, 326571, 47369, -212276, -3331, -182044, 18106, -80427, 9846]
12365C8160c04038D8019a86718n6973A3800K75645b06173B36241C7728a08842
12354h2541E6650b83749Q6987D2579c0764j86958m7382q8322h7418I9167J67306
12343B66473F6668P9323c18616M6550b4387m8492A93878l7126J31277B7276b02353
12331F6075a42403C20869a20059p9951A26577b11225F6424K93528a05914A3031
12320h6555K0344k2695J9131k04330g2002B04369E3898K64141f5049I5173K09384
12309C04557h8288l5995K3689A20075m6644a39890j93243E3530F88a29023J846
12298a27177j4852e5682A94335j6851A6734a08961B7948J45380i5049E4793B2421
12286C71537A08436K3200a79043b3708B85662L5169B821K28175a12954A62468
$$ y = [38160, -304038, 48019, -186718, -243691, 13800, 289445, -206173, 236241, 37728, -108842, -82541, 56650, -283749, -196762, 42579, -30764, -217722, -265104, -353426, -87418, 99167, 266473, 66668, 145991, -318616, -272066, -24387, -72879, 193878, 156752, 288029, 27276, -202353, 66075, -142403, 320869, -120059, -200010, 126577, -211225, 66424, 359952, -105914, 13031, -86555, -66211, -88906, -69775, -274105, -72002, 204369, 53898, 318039, -65049, 95173, 304557, -88288, -124283, -100594, 120075, 73431, -139890, -333133, 53530, 688, -129023, -127177, -142029, -55682, 194335, 177484, 16734, -108961, 27948, 173328, -95049, 54793, 22421, 371537, 108436, 131636, -179043, -23708, 285662, 320831, 2821, 230996, -112954, 162468]
12275C7598J77641L1351C8430a96067B28764q9806P3135C6489Q5239H418b24031
12263C77800j28571l9117L7590a55206D45371g1877E6415a26104C58689A21603
12252B67085p7594r1575i762E909O2406h0847D9344M4133J8252a75224F2730a6820
12239A04678J34420C0173d0814j84541H6861f0585o9747F0191J76078J16709l666
12228C49312g6519j00258B90023A19523J63626J09045A37318J3238O6395K43227
12218D60178A65227K20896J40369D8540L32246i0854A56951g5611H0962C3866
12207a93712A36073m8071O8539a69471H6652K93522A4817J68130r0697O7205G0726
12195b23646G9074K9822R9688R8452A03026L66727B28797M4758G0414K41872A319
$$ y = [37598, 215239, 246590, 38430, -196067, 228764, 138958, 212093, 36489, 121728, 8418, -224031, 377800, 249229, 210112, 247702, -155206, 445371, -71877, 56415, -126104, 358689, 121603, 267085, 189491, 97916, -9762, 5909, 68315, -80847, 49344, 93477, 111729, -175224, 62730, -16820, 104678, 239098, 30173, -40814, -225355, 86861, -60585, -130332, 60191, 236269, 352978, 349312, -76519, -176777, 290023, 119523, 283149, 392194, 137318, 150556, 216951, 460178, 165227, 386123, 526492, 48540, 380786, -90854, 156951, -75611, 80962, 33866, -193712, 136073, 88002, 156541, -169471, 86652, 380174, 14817, 182947, 92250, 159455, 70726, -223646, 79074, 108896, 208584, 307036, 103026, 469753, 228797, 273555, 70414, 312286, 1319]
12183G6853a10864C01774A46045J3059R3094A14077e7444D30475k02898G0236
12172d791B75400e2470m3953j11552B19473a3115A57823M5451i1599c8141B30678
12160H4764J11817n5849M0415J30261f2722A00843L106j1099J67930b92664A03756
12148A85146n8043b8653j581k8617B17146c13059a23190d4j33067A81241a44816
12136a25082B8090L6558a37539j342j2898A06165a31155A22358f3215j1340A96027
12124c5977E52971k58365B8889A2678J42515a02669d9853A36368a778A8664K37515
12113B56179h5926G4038O7864m9214a19119C1561c9487E32331j70576b28990G5559
12101f3151A2982P3540C8616b2234o400j40154h049A66217J7567a01289G5628
$$ y = [76853, -110864, 301774, 146045, 159104, 252198, 114077, -57444, 430475, 227577, 70236, -4791, 275400, -52470, -96423, -207975, 219473, -13115, 157823, 203274, -91599, -38141, 230678, 84764, 196581, 140732, 181147, 311408, -62722, 100843, 103949, 92850, 260780, -292664, 103756, 185146, 127103, -28653, -30234, -58851, 217146, -313059, -123190, -44, -133111, 181241, -144816, -125082, 28090, 64648, -137539, -138881, -151779, 106165, -131155, 122358, -63215, -74555, 196027, -35977, 552971, 294606, 28889, 12678, 155193, -102669, -49853, 136368, -1778, 18664, 256179, -85926, 74038, 141902, 92688, -119119, 31561, -39487, 532331, 361755, -228990, 75559, -63151, 12982, 86522, 38616, -22234, -28634, -168788, -8049, 166217, 183784, -101289, 75628]
12089a78538k8851h972B83078A18296a38673k80409A42669h2674l66200g3953
12078a17493j61785A05740P1736o7584J9325a87312R609B04297M99576N78080
12068A281953P807C57344q2139P709k245H981K63219c6173A60050b31351f5172
12056c7899j61925B0095J1198O6890K06061j38417Q4934A9747K94932i2635B76049
12044a19071A66702a49257b2668k58207k9731A47813a2024n9197C602J69968p2218
12033A01352k8735b49731B7352d9879k3607D44522a95381A38409b46977A62965
12022G6660C5854K75280a8411B31332O576p8348J134C2168O8582c0099D8188J01510
12010A49698d40913A16941m5854K12067b60648i7652A42843f6389p7032A5414
$$ y = [-178538, -207389, -8972, 283078, 118296, -138673, -419082, 142669, -82674, -448874, -73953, -117493, -279278, 105740, 177476, 109892, 129217, -187312, -177703, 204297, 703873, 1281953, 1289760, 357344, 275205, 282914, 280669, 8981, 272200, -36173, 160050, -231351, -65172, -37899, -199824, 20095, 31293, 98183, 304244, 165827, 250761, 19747, 314679, -92635, 276049, -119071, 166702, -149257, -22668, -280875, -310606, 147813, -12024, -71221, 3602, 173570, 101352, 72617, -249731, 27352, -49879, -73486, 444522, -195381, 138409, -246977, 162965, 76660, 35854, 311134, -18411, 231332, 237908, 159560, 160694, 32168, 100750, -30099, 48188, 149698, -440913, 116941, 71087, 283154, -260648, -97652, 142843, -66389, -143421, 15414]
11999E3094R2791h5230k7391L9959n7281k3321l16526B8602b66923j0996A68946
11987A35369i1674k20648a26253c1476D5398a12318B43259J6199b0012j54126
11977a74138F9795a07770b9061n0044a3425F9592Q6224b5546E1169b098l1161
11966c3259A74542m9389a2304j21482d0033q9421K4094K5900j90973a14564B17498
11954D5328a09949J8403j6180p6043B00177H5456a44142L7003l03927A41130c2341
11942C23618a36084b4930A55359P7151A01800M4992a29865o9941l0442d1953A74314
11930C03710a15161B01585b9609A51103c12427a15115E43269a32562A05365f2136
11919A37097b79784C5303i5734f215q3575A81615a74357B91738i4813o9287D66514
$$ y = [53094, 145885, -85230, -112621, -72662, -129943, -153264, -469790, 28602, -266923, -277919, 168946, 135369, -91674, -312322, -126253, -31476, 45398, -112318, 243259, 259458, -20012, -174138, 69795, -107770, -29061, -79105, -13425, 69592, 155816, -25546, 51169, -2098, -33259, 174542, 125153, -12304, -133786, -40033, -129454, -105360, -79460, -270433, -114564, 217498, 45328, -109949, -91546, -107726, -183769, 200177, 85456, -144142, -107139, -411066, 141130, -32341, 323618, -136084, -24930, 155359, 232510, 101800, 146792, -129865, -199806, -230248, -41953, 174314, 303710, -115161, 201585, -29609, 151103, -312427, -115115, 543269, -132562, 105365, -62136, 137097, -279784, 35303, -95734, -6215, -89790, 181615, -174357, 291738, -94813, -164100, 466514]
11907h0789B32551a32755O4178A96678c18852H140f888C2420b63451H8295M1732
11896A30027J22392a04372o8906e7664a7847j12333F1741b18331N0471H1424L9685
11885A21109a49740j33137C7794c6271h894k3676B39093a02329M5067n4963B58310
11873F7255f3917c268j41344j45021G0130L7851O2566b6476p237k71122A16000
11861c83764d8573j25386A11546b80485J28179B04589a74129P3484j00617e6539
11850A17352b12425C0235b03021g1385k04921J21773f476o3076B56869a42888
11839A48006k7541E0515J65616i9466d3624r4546l849O5121q7110D40940E1518
11827a561q284k06542B06521a5656E515i7118j39165a00505A03444b88775B44844
$$ y = [-80789, 232551, -132755, -68577, 196678, -318852, 8140, -6888, 32420, -263451, 88295, 130027, 252419, -104372, -173278, -57664, -17847, -130180, 61741, -218331, -167860, 81424, 121109, -149740, -282877, 37794, -36271, -8894, -32570, 239093, -102329, -57262, -112225, 258310, 67255, -63917, -3268, -144612, -289633, 70130, 107981, 170547, -26476, -33713, -304835, 116000, -383764, -48573, -173959, 111546, -280485, -152306, 204589, -174129, -100645, -201262, -56539, 117352, -212425, 30235, -203021, -71385, -276306, -154533, -6476, -69552, 256869, -142888, 148006, 120465, 50515, 216131, -99466, -43624, -138170, -142019, -76898, -164008, 440940, 51518, -1561, -9845, -216387, 206521, -15656, 5515, -97118, -236283, -100505, 103444, -288775, 244844]
11815f9578g708D388L27483A00881A8364J25065i3023D5266J09021o1742l6311
11804E6234a048C38515j35339F8607P270J196a62162J872e4977j65133R4060j37205
11792b63255J1876a08442j69282D3358b82784E6077a55664A55289O5464b03110
11781A64604c21384B7107P38K12472b2261k07922a01316k19388P8654a04424r7098
11770b01522E8720K15811a4160B11540q0565d093D5796K35287e0622R867l9693
11759h0448J2180j3531B80314E7702A2882R0359f6760H2010r260a13665o7258
11748a80923p4367Q9180l7926g5611Q744C1503J53670a60838e6038n47A71407
11736G0327b66966E2252f2772B08040C8965K2095b63970A99482e8206D2436b024
$$ y = [-69578, -7708, 4388, 331871, 100881, 18364, 143429, -93023, 45266, 154287, 92545, 56234, -1048, 338515, 203176, 68607, 75877, 77073, -162162, -160290, -54977, -220110, -126050, -263255, -251379, -108442, -277724, 43358, -282784, 56077, -155664, 155289, 220753, -203110, 164604, -321384, 27107, 27845, 240317, -22261, -230183, -101316, -320704, -242050, -104424, -201522, 58720, 274531, -14160, 211540, 130975, -4093, 45796, 281083, -50622, -40755, -80448, -68268, -81799, 280314, 57702, 12882, 103241, -66760, 82010, 72750, -113665, -180923, -255290, -166110, -204036, -75611, -66867, 31503, 185173, -160838, -56038, -56585, 171407, 70327, -266966, 52252, -62772, 208040, 38965, 61060, -263970, 199482, -58206, 42436, -2024]
11724A16444J4013a48893N0104B64159A23607b53218e4509B3216G858h1913I875
11712c0600A66709f1589l2501k08338I2499L3197c5578n6156C40851a06752B90008
11700B20552h7175B72787A28636L6888A2107k696d02406H9772K19518p9865G0816
11688E0274K232K29407h1904C12179A6602J80427b55946J04157D09868A0335a29191
11676a07431E0335J20363j6633B4188L51025m8006a72239g3797q6950j54861B22891
11664f4963A07300a05259B3982O0369J46755E2642c88713G992J64567a62865C0921
11652H0055J375k1975i959r9391B4324a951A61083a48648n130b4565A77354Q3285
11640B60639a18757K496j7519h777B3901b63910B46536a19481R947D9808A787
$$ y = [116444, 130457, -148893, -98789, 264159, 123607, -253218, -54509, 23216, 7858, -81913, 9875, -30600, 166709, -61589, -94090, -302428, 92499, 125696, -35578, -91734, 340851, -106752, 290008, 220552, -87175, 272787, 128636, 165524, 12107, 9411, -402406, 89772, 309290, 229425, 70816, 50274, 52506, 281913, -81904, 312179, 16602, 197029, -255946, -151789, 409868, 10335, -129191, -107431, 50335, 170698, 154065, 24188, 375213, 327207, -172239, -73797, -160747, -315608, 222891, -64963, 107300, -105259, 23982, 84351, 231106, 52642, -388713, 7992, 172559, -162865, 30921, 80055, 81430, 59455, -9959, -109350, 24324, -1951, 161083, -148648, -153778, -24565, 177354, 260639, -118757, -116261, -133780, -8777, 23901, -263910, 246536, -119481, -109534, 49808, 1787]
11628b03353B24123I8619k8326R2995a09108C33861C4536F716O740M7187J72779
11617B33422I4341R2584b6669A08724a35662J3174B55584E5347P9095b92183a30331
11605B24883m1858q1552a15032I6775J68440c1178A47956C4394h0994H0937a49585
11593B06993A9349K20305C0237K62234j21034F5835b6709C52147j04199q8583
11583A59365o4070K7797g2194A15528e4729A37155N752J02490A11255E2270J63145
11572B15415e158F8800M24398G6411b2713l4436D7130f083B59957G9084J22624
11561B01708K50734a42958B68229C5675A4620a06860M3532A7266h6734D25313
11550D5655I729J83218J6222Q8796b38632D03315G7579K565O1487K9867i2678
$$ y = [-203353, 224123, 98619, 70293, 163288, -109108, 333861, 34536, 6716, 13456, 60643, 233422, 94341, 186925, -26669, 108724, -135662, -122488, 255584, 55347, 134442, -292183, -130331, 224883, 183025, 101473, -115032, 96775, 265215, -31178, 147956, 34394, -80994, 80937, -149585, 206993, 19349, 239654, 30237, 292471, 171437, 65835, -26709, 352147, 247948, 159365, 95295, 123092, -72194, 115528, -54729, 137155, 142907, 245397, 111255, 52270, 215415, -5158, 68800, 493198, 76411, -22713, -57149, 47130, -6083, 259957, 79084, 201708, 452442, -142958, 268229, 35675, 14620, -106860, -63328, 17266, -86734, 425313, 45655, 9729, 192947, 209169, 297965, -238632, 403315, 77579, 80144, 141631, 171498, -92678]
11538A62644e2796A11419E5353L12175A13377B7425O9337a85615B11297I3961
11527b66181C6892J41241M0837C869J03581C7108c6536A96371j1684R9191a15260
11515H3657a12262C16121f4722D34418a14556G3500K40180j1638C8063K90442
11505C28505a19574B22334a11822I5652j1028O1863l6585e126j16847A70784Q7103
11494B57887p551n908a01913A20445d8333o3993B84574A05025e6077B93214B2005
11482e8952B29020J75230A64119f36H4571L2614j2823O6382F6432G831L17516
11471C25347A9598K63474p9928e329G3960Q0894M8771L2966a14808E5619K6489
11460H2108B2861K37448H3291J38376m7450J25240c0548D9268J02835b41063A7563
$$ y = [162644, -52796, 111419, 55353, 367528, 113377, 27425, 96762, -185615, 211297, 93961, -266181, 36892, 178133, 218970, 3869, 107450, 37108, -36536, 196371, 184687, 283878, -115260, 83657, -112262, 316121, -64722, 434418, -114556, 73500, 313680, 302042, 38063, 328505, -119574, 222334, -111822, 95652, 84624, 146487, 109902, -5126, -121973, 170784, 257887, 250336, 244428, -101913, 120445, -48333, -112326, 284574, 105025, -56077, 293214, 22005, -58952, 229020, 404250, 164119, -636, 84571, 117185, 104362, 170744, 66432, 7831, 325347, 19598, 283072, 203144, -5329, 73960, 154854, 203625, 236591, -114808, 55619, 82108, 22861, 260309, 83291, 221667, 174217, 299457, -30548, 49268, 152103, -241063, 17563]
11448e7503N870Q957j01100H2666k4102a27016D73916G4271J60231e860H0145
11436B23859C5719a91307C73634A62955J85239j20160h4880c5526l59640i6990
11425F7475K14411A0673P1547A4164J00135J21631E923P2665C6581c802A73436
11413i7551A935O8038M6173C1024a6362A09864J4586a47203f2831j953A55584
11401b091B15642a253A10781J96057H7873c4921K688n6653L5290l8780D0848a6446
11388A9813b76873f3873A35520J64031j01381o5367J29901b11447C6475a98558
11377E87651g8361A01402J23610a56662d350j75412A69149B7718a78304b2891
11366h689A09721h8294b3811A78037M8457b0705F6359a51319H1564a44567m055
$$ y = [-57503, -51633, -42676, -143776, 82666, 58564, -127016, 473916, 74271, 234502, -5860, 80145, 223859, 35719, -191307, 373634, 162955, 348194, 228034, -84880, -35526, -395166, -96990, 67475, 281886, 10673, 82220, 14164, 114299, 235930, 5923, 78588, 36581, -3802, 173436, -97551, 1935, 69973, 116146, 31024, -16362, 109864, 124450, -147203, -62831, -64784, 155584, -2091, 215642, -1253, 110781, 306838, 87873, -34921, -32233, -88886, -53596, -92376, 40848, -16446, 19813, -276873, -63873, 135520, 299551, 198170, 132803, 262704, -211447, 36475, -198558, 587651, -78361, 101402, 225012, -156662, -4350, -179762, 169149, 27718, -178304, -22891, -8689, 109721, -88294, -23811, 178037, 226494, -20705, 66359, -151319, 81564, -144567, -148622]
11355a48622B4549a28132m2494o4525r8250C4947c7802B7918Q0492f2298k908
11344f5206C0491a65308k04465a66996C5255J1665b89228B53195F00L97436a19109
11332F85a29438b0209O865B00567c40514g9261J0381A81793J00086h9387l67144
11321d56531h7431H1174J68641i410l20098A84112E8577j5623J6607h944l31715
11310c40659N047R4501p3403p4333J37607a13714C09337H5175l2182a50466G1367
11298C40163g0390J1217A10682K41125j56937a06933B9466b7545A51047J11864
11288B62911C2806L0166M854a77297B7836J23669D3964a67465a9879D79227A97142
11276A99322f5309r1192B38791L71966b41512A84346J9526b09737i5309p3460
$$ y = [-148622, 24549, -128132, -170626, -235151, -333401, 34947, -37802, 27918, 108410, -62298, -65206, 30491, -165308, -369773, -166996, 35255, 46920, -289228, 253195, 600, 398036, -119109, 685, -129438, -20209, -13344, 200567, -340514, -79261, -68880, 181793, 281879, -89387, -456531, -87431, 81174, 249815, -9410, -329508, 184112, 58577, 42954, 59561, -8944, -340659, -335612, -241111, -314514, -388847, -251240, -113714, 309337, 85175, 52993, -150466, 71367, 340163, -70390, -59173, 110682, 351807, 194870, -106933, 29466, -27545, 151047, 262911, 32806, 62972, 67826, -177297, 27836, 151505, 43964, -167465, -19879, 479227, 197142, 199322, -65309, -156501, 238791, 610757, -241512, 184346, 203872, -209737, -95309, -168769]
11266a68769H3733b62160A87841b18578A48320a30698b716j16174k73222a49814
11255b17843a0905l32176C9635j2533a77621A09910a87105F8557C1443i4308B23057
11243f8542F8363B703e9185k04482r2871g2175l5411c5892A87311p3615b10934
11231b56774h740k53046B65955a2718j27798A01941c20352e2292l86342H8474
11220C0394O760J67275a47880B57057c07403A76589a15827b9466A89002n7642
11210A31360b38587a7573l63898j0529h0892j32491Q8397f083B4723f8845A01611
11198A2055O048c40939B51073f1942K504A2719L02118a55696P4189c2096F1150
11186a68955C4241K37249b00564I4889b12592j86835i6476j98704d3896j88783
$$ y = [-168769, 83733, -262160, 187841, -218578, 148320, -130698, -2716, -118890, -392112, -149814, -217843, -10905, -343081, 39635, 27102, -177621, 109910, -187105, 68557, 31443, -94308, 223057, -68542, 68363, 2703, -59185, -263667, -356538, -72175, -107586, -35892, 187311, 113696, -210934, -256774, -8740, -261786, 265955, -12718, -140516, 101941, -320352, -52292, -438634, 88474, 30394, 37154, 204429, -147880, 257057, -307403, 176589, -115827, -29466, 189002, 131360, -238587, -17573, -381471, -392000, -80892, -213383, -124986, -6083, 24723, -68845, 101611, 12055, 18103, -340939, 251073, -61942, -59438, 12719, 314837, -155696, -81507, -32096, 61150, -168955, 34241, 271490, -200564, 94889, -212592, -399427, -96476, -295180, -43896, -232679]
11176b32679A30054a62525A39439j9590B3739c90134D18243i5244K2378L948I4709
11164a08637k7848e371D1118J06907R1697A17457A596J91178F9266a47778A71587
11152f1211a0164B2737J62707A057R8530R6617h7305C90832a14986a569j54866
11141a56435B28994b48457I4884a91241c3092j83948G3929N8832a29168l3658
11131a62826D7268b82107J21230C99174e2195B36682m5548b46944A10477a06503
11120g2698A57884D2544a17350F2594J36963i6528r1972A33084a6536A45655J00244
11109B45899c0218A44173b0643j90235b967E7818K73782e6369E6964a65922A71001
11097A67861m9470c0360B16857N2021q0782m8136j4807M7230J26293a30335H8398
$$ y = [-232679, 130054, -162525, 139439, 119849, 23739, -390134, 418243, -95244, -72866, -68918, 94709, -108637, -136485, -5371, 41118, 148025, 239722, 117457, 1596, 192774, 69266, -147778, 171587, -61211, -10164, 22737, 185444, 1057, 99587, 196204, -87305, 390832, -114986, -1569, -156435, 228994, -248457, 94884, -191241, -33092, -217040, 73929, 132761, -129168, -162826, 47268, -282107, -160877, 399174, -52195, 236682, 191134, -246944, 110477, -106503, -72698, 157884, 42544, -117350, 62594, 199557, -96528, -188500, 133084, -16536, 145655, 245899, -30218, 144173, -20643, -210878, -2967, 57818, 331600, -56369, 56964, -165922, 171001, 167861, 118391, -30360, 216857, 268878, 188096, 139960, 125153, 172383, 298676, -130335, 88398]
11085B36649c3850B34227b18327B46638k0971K07536B15981p9561O87i5450A6257
11073D03558G7695L77481B14994G5266M87038J34440k81084J47960J74496J18694
11063H56810A99057M72812O0374l62628K48998J74648k83424O672n6291P9457
11053E39675J82400m8913j05824K53423J44273m8732k66452j00362R4237P7673
11043G21398J51435o8909O1276R2759k82441K03822m0136K1884j14694P7102j22925
11032G00571J3872j20964L1413K49210k43188J30594r8838l595J76725D00989
11021H31807R6184j84436J15234o1930N018J5629O8416l33449L72773l25854J67229
11010G66621P0108r5041p7325J16706o1704L8903J10983j03789q1682C00735O99820
$$ y = [236649, -33850, 234227, -218327, 246638, 225667, 433203, 215981, 136420, 137107, -95450, 16257, 403558, 77695, 455176, 214994, 75266, 562304, 696744, 415660, 563620, 738116, 856810, 199057, 671869, 732243, 369615, 618613, 793261, 509837, 516509, 460218, 539675, 722075, 673162, 567338, 820761, 965034, 916302, 649850, 549488, 643725, 721398, 872833, 803924, 865200, 957959, 675518, 879340, 839204, 861088, 746394, 823496, 700571, 714443, 593479, 624892, 874102, 630914, 761508, 662670, 659075, 835800, 400989, 831807, 927991, 743555, 858789, 796859, 801877, 817506, 885922, 552473, 925246, 599392, 766621, 836729, 741688, 664363, 781069, 719365, 758268, 869251, 765462, 683780, 300735, 1000555]
10999A000555k4048j70910n6732l3830j78512O89676m89029R0340j48160l7093
10989F42257J85238K61770l21553l5088J91994L01023j62950l5393K667N73530
10979A603495j78999K1005K91382L83000j35277J57059M23443J53239K34283M58089
10969C410719j82641J08781J17631j0968j006357k99545j74433k70314k9006M28646
10959B092513Q9576k78356J22660j31336j20831j56697p7206l50194K02633F36204
10948I05555p4000o2847q8207C37070L6306n2391p051H3440K17182c541E04503
10936a1918A24259K20828n7290c0724A21376h7836A89226p5689b22414A06996
10925H3003a26921H8845N7750a6568l49375C4653h5230F2274J75881b8299C9495
$$ y = [1000555, 976507, 805597, 748865, 715035, 536523, 1226199, 737170, 827510, 679350, 642257, 827495, 1089265, 767712, 732624, 924618, 1225641, 1062691, 1027298, 1029965, 1603495, 1424496, 1445501, 1736883, 2119883, 1984606, 2141665, 2565108, 2718347, 2952630, 3410719, 3228078, 3336859, 3454490, 3443522, 2437165, 2137620, 1963187, 1692873, 1663867, 2092513, 2182089, 1903733, 2026393, 1895057, 1774226, 1617529, 1540323, 1190129, 1392762, 636204, 905555, 831555, 768708, 680501, 337070, 373376, 320985, 313934, 83440, 300622, -3541, 504503, -11918, 124259, 345087, 287797, -30724, 121376, -87836, 189226, 113537, -222414, 106996, 83003, -126921, 88845, 146595, -16568, -365943, 34653, -85230, 62274, 238155, -28299, 39495]
10913A35265h1616E7400J80304a65511A48675a01736q255N1987j3863A78349B5016
10901a27132K2927F9188B0653i6183K4305a8034n735m4268j30494B5177a64007
10889A5946b3182j73696K6190G9469c4985F1036L3103e3311I1459b00414b3900
10877A5291f0931C9435a08798B7959g1439E6884g7584a3773B018O1657M3438C4129
10864a53643A80453b2868A65885C305f3457A83317A7940K58843c536D9549a09764
10852b12064M6639B66390D5410A1881L4756A6204b820k29224H7774K06140e731
10840a88346g3274L0044F8504B7329N0243J5007b14156N3275B6735a60989A49942
10828A49856e7654B74977j34554a01311I1641A5602J05189b59174B91480a73435
$$ y = [135265, -81616, 57400, 237704, -165511, 148675, -101736, -109991, -58004, -71867, 178349, 25016, -127132, -104205, 69188, 20653, -96183, -71878, -18034, -23769, -68037, -198531, 25177, -164007, 15946, -23182, -196878, -170688, 79469, -34985, 61036, 94139, -53311, 91459, -200414, -23900, 15291, -60931, 39435, -108798, 27959, -71439, 56884, -77584, -13773, 2018, 63675, 107113, 34129, -153643, 180453, -22868, 165885, 3305, -63457, 183317, 17940, 276783, -3536, 49549, -109764, -212064, -165425, 266390, 45410, 11881, 46637, 16204, -2820, -232044, 87774, 293914, -5731, -188346, -73274, -43230, 68504, 27329, 77572, 92579, -214156, -160881, 26735, -160989, 149942, 149856, -57654, 274977, 140423, -101311, 91641, 15602, 120791, -259174, 291480, -173435]
10817H5704l7684c7568E2152K9313f7675j17655j30805g7653A34638c7508q6626
10806a24134M6124A65637i6439F0893g5341A21218I247N2196J28226k0378a75170
10794d69248r9745a94008B28027h9486l21983K04846b4729I7698J55133Q3394
10784C36225A37223i0058C5062P031c7027k13721C44495a61637P9501b1290I4552
10772a22522I6798D5967b70502C2412e6204A22800a14912o8691c212q7130k74297
10761c64639b044F9991l3469d2776A54746N5088h3386b387G2446C4951f9494D2242
10748A00618a2254j30473k3378k6449e0134A63451a1275C8384J23813b1814G519
10736D3979b35566A60078a08583C0874c4720k6721H1045h217B79270b38826F9268
$$ y = [85704, 48020, -37568, 52152, 81465, -67675, -185330, -316135, -77653, 134638, -37508, -124134, -78010, 165637, -96439, 60893, -75341, 121218, 9247, 61443, 189669, 169291, -175170, -469248, -568993, -194008, 228027, -89486, -411469, -206623, -24729, 97698, 252831, 336225, 137223, -90058, 35062, 42093, -37027, -250748, 344495, -161637, -82136, -21290, 94552, -122522, 96798, 45967, -270502, 32412, -56204, 122800, -114912, -183603, -3212, -90342, -364639, -2044, 69991, 36522, -42776, 154746, 209834, -83386, -2387, 72446, 34951, -69494, 42242, 100618, -12254, -142727, -166105, -192554, -50134, 163451, -11275, 38384, 162197, -21814, 7519, 43979, -235566, 160078, -108583, 30874, -34720, -61441, 81045, -8217, 279270, -238826, 69268]
10724c04484N748J27651A14278h9091c6058Q900l3132j81113q1533a13446A2103
10712d2297n54701a16443B52827a98342J490j75629a53162G1691a01968j5565
10702a17533k51951c0594B5665K36878G9175k0645b11094M4233m7104M6639O941
10691a60385e0094A47475a50241j72863C28005b61555d9508G916J73050I880g7501
10679h4546k8373c7A7094b0027j07549N2302A2346b12147c3386l38613N8736j57369
10667d70632a75112f5392q8896b7575k23514D29534f7010A00615b60007B94633
10656c6429n92702e6689A71942e4135D800J66777n8040c7412B5749G984J89673
10645A97657b51k15542j9286M7479k16679e1181B14898b93311J04298R4055F3207
$$ y = [-304484, -298736, -171085, 114278, -89091, -36058, -27158, -60290, -241403, -322936, -113446, 12103, -42297, -596998, -116443, 252827, -198342, -196852, -372481, -153162, 71691, -101968, -117533, -369484, -30594, 25665, 262543, 79175, 58530, -211094, -166861, -213965, -167326, -160385, -50094, 147475, -150241, -323104, 328005, -261555, -49508, 7916, 180966, 9880, -77501, -84546, -112919, -37, 17094, -20027, -127576, -75274, 12346, -212147, -33386, -371999, -313263, -470632, -175112, -65392, -154288, -27575, -251089, 429534, -67010, 100615, -260007, 294633, -36429, -629131, -56689, 171942, -54135, 4800, 171577, 113537, -37412, 25749, 7984, 197657, -251, -215793, -235079, -187600, -404279, -51181, 214898, -293311, -189013, -94958, 63207]
10633G0053a04982l6801K3289k37096a20362e5067A5196a00966E4570a43700m134
10622a47834o1245N0629f564A28397A4035d68756c7551m1428k4077H1825a92577
10610A08984i0526F7816a01793j26319C6277b5898j06896A98355h8574q6310A06533
10598B44150K00369j00238a53353D2138a59634L4115G6357e4421D676d8654I7775
10586b16735k531d2256C03426E1636O435h2295J9083J521C9552K06265C0680a67408
10573b30688B19241c1500A39957F4880h8855a1981k05400A8874a73118N2478Q687
10562a11953n9226A29344a55735G6459J98065B7740f1980b8399P704A61650e3350
10550e5524F6934i9037L236B64374a28754j05944A95328D656L3332d6576B50344
$$ y = [70053, -104982, -141783, -118494, -355590, -120362, -55067, 15196, -100966, 54570, -143700, -147834, -209079, -158450, -6564, 128397, 14035, -468756, -37551, -78979, -103056, 81825, -192577, 108984, -90526, 67816, -101793, -228112, 36277, -25898, -132794, 198355, -88574, -174884, 106533, 244150, 444519, 344281, -153353, 42138, -159634, -125519, 76357, -54421, 4676, -48654, 97775, -216735, -219266, -42256, 303426, 51636, 58071, -82295, -63212, -61691, 39552, 245817, 30680, -167408, -230688, 219241, -31500, 139957, 64880, -88855, -11981, -217381, 18874, -173118, -120640, -111953, -171179, 129344, -155735, 76459, 274524, 27740, -61980, -28399, -20695, 161650, -53350, -55524, 66934, -99037, -95801, 264374, -128754, -234698, 195328, 4656, 37988, -46576, 250344]
10538b2092G2291a0801l5756e731r1518H2546b10624L4503C1941J09532B1198
10526a41664D1422L0728i6438k8098C23147F2024c39971h6479j06597m2783P9684
10515a56175k3838b4690A18859e3502n2246m5399G1612c26175a21A12141e4528
10503A05969r643J91326D2157J08365a78276b9987k96957h5620l95552A0289a71777
10491b85178B75888b0680o2913L763J838j64748B038a70454B61500G9312K49749
10480C29061J73839B50164M7159e643A78904J50491a27696A73648N7965n9256
10470A72357m5423P1387e0035j7215j41076B43770j20778B7985K15309G5495O1617
10459A37112B6712M2869a74154B3761J61303a36382B33949c3819l9737K5967b901
$$ y = [-22092, 72291, -10801, -46557, -5731, -97249, 82546, -210624, -176121, 31941, 141473, 21198, -141664, 41422, 72150, -96438, -124536, 323147, 62024, -339971, -86479, -193076, -235859, -156175, -180013, -24690, 118859, -53502, -105748, -151147, 71612, -326175, -121, 112141, -54528, 105969, 96326, 287652, 42157, 150522, -178276, -29987, -326944, -85620, -481172, 10289, -171777, -285178, 275888, -20680, -83593, -79830, -77992, -242740, 2038, -170454, 261500, 79312, 329061, 502900, 250164, 297323, -5643, 178904, 329395, -127696, 173648, 231613, 172357, 126934, 198321, -50035, -67250, -208326, 243770, 122992, 27985, 243294, 75495, 137112, 26712, 69581, -174154, 23761, 185064, -136382, 233949, -33819, -73556, -47589, -2901]
10447a60461c4915o4511o2883N7430E9561N3797Q4511O2299a68764j1250A14232
10435A20587p681j4159K618J99739A12966a9763k1930F8483R2608a86624o6960
10424b53584f7433B72965a08157o1405A42757a95221G2810e06333B36958i7697
10413a25779A32259b27567G7224K83259i8787l16843C00443b61012A25780b17500
10402a46666A08792j5543J39846A8002a8357q9686D4652e2251J0186B33600e0940
10390C30296H1943K14198h334A81185d9625G4164J84826j19310c6159A69571J88413
10379C57984H0247j9294J42094k6189M7162e4805a4581A04790D4074f8125D61280
10367D00708A12508K98212L4810P0706j84788P6076j15545j43011A1986L19694
$$ y = [-160461, -34915, -99426, -162309, -104879, 59561, 113358, 197869, 260168, -168764, -180014, 114232, 120587, 112906, 98747, 101365, 301104, 112966, -19763, -41693, 68483, 161091, -186624, -253584, -67433, 272965, -108157, -169562, 142757, -195221, 72810, -506333, 236958, -97697, -125779, 132259, -227567, 77224, 360483, -98787, -415630, 300443, -261012, 125780, -217500, -146666, 108792, 93249, 233095, 18002, -18357, -108043, 44652, -52251, -42065, 233600, -50940, 330296, 81943, 296141, -8334, 181185, -49625, 74164, 258990, 139680, -36159, 169571, 357984, 80247, 60953, 203047, 176858, 224020, -54805, -14581, 104790, 44074, -68125, 461280, 400708, 112508, 410720, 445530, 516236, 331448, 407524, 291979, 148968, 11986, 331680]
10357C31680K6188l0254E3556K83022r1834L27159j60370J21276J90850k23265
10347E00394B34173J4957J95250j32344m0381J64831j27590l25j01765J27939
10337C34745J0140J21600i2666C3512K17146r2787b24890A86038B8751q739J82429
10326B02441J4792e908E1071J21713l5224c9203B36930N6915a11766I7351J8682
10315A16033L48496i6003B01004g2670D9158a31495e4231o2145d672A1921L1231
10304D3152J87370A14828n4760J81471I0112a38859B46910a00835B0199J48028
10294A68227a42712D6631k0126b29477K6649i454j60675d9134N335C3044c12835
10282b07451a02708M151n1483B22830a55523j33820A31140F4779a69216P5999
$$ y = [331680, 357868, 327614, 53556, 336578, 244744, 571903, 411533, 532809, 723659, 500394, 234173, 249130, 444380, 312036, 271655, 436486, 308896, 308571, 206806, 334745, 344885, 466485, -92666, 33512, 250658, 157871, -224890, 186038, 28751, 20012, 202441, 217233, -5908, 51071, 172784, 137560, -39203, 236930, 293845, -111766, 97351, 116033, 464529, -96003, 201004, -72670, 49158, -131495, -54231, -116376, -4672, 11921, 43152, 230522, 114828, 60068, 241539, 90112, -138859, 246910, -100835, 20199, 168227, -142712, 46631, 26505, -229477, -202828, -9454, -170129, -49134, -43799, 33044, -312835, -207451, -102708, -98557, -150040, 222830, -155523, -289343, 131140, 64779, -169216, -93217]
10272i3217j03686O0752A42326Q3286d8950B68248i6544l89157J86030J40038
10262a59633N0906A05803J20215K67812A71539J14532B7951K49601K0848i285
10251C59479G5950K64599a36262j53608G5552k780i4471A75649O6316b66123J4817
10240b51306F0901F135a73830f8726B92016I5187C3167b61089G6886k9979a31052
10228A5025a65293A11617L113e5406r365g411j96088A20723C2276N8930K80572
10217C71778a43593g709r4513B02657J11680e9607j92592R2294j34107C6101a02243
10205g4777n5878A30045J77316f4539A0558a15354b1106q9720p0796k4407B59208
10193d5429k02001C7512d3964G1364a37795B346a35436r0824F3588h8688j23166
$$ y = [-93217, -196903, -136151, 142326, 225612, -48950, 268248, -96544, -485701, -299671, -159633, -108727, 105803, 226018, 493830, 171539, 286071, 27951, 277552, 298400, -9285, 359479, 75950, 340549, -136262, -289870, 75552, 72772, -94471, 175649, 241965, -266123, -251306, 60901, 6135, -173830, -68726, 292016, 95187, 33167, -261089, 76886, 46907, -131052, 15025, -165293, 111617, 114730, -55406, -64771, -7411, -203499, 120723, 32276, 91206, 371778, -143593, -7709, -102222, 202657, 314337, -59607, -252199, -159905, -294012, 36101, -102243, -74777, -130655, 130045, 307361, -64539, 10558, -115354, -21106, -110826, -181622, -206029, 259208, -45429, -247430, 37512, -43964, 71364, -137795, 2346, -135436, -226260, 63588, -88688, -211854]
10182b11854h9422b4911A19224a54597H8527n327J94491b69624a8224B7299a3735
10170f3285E2434Q6270b38400g827n8178A25448J24909I8031b07466L6818c5341
10158d7134j29207h4651A09230a69713F8572a67599j24234a29392M9308A03728
10147b22074M1580Q1137A58600c23700P8797j2890k49588a61274j48342a7205
10136b21505E769a63959c1801L288n3038A99066a24340E6298c02539n8744b9797
10124c86190b5932l12749J27505P5375d7564A1759J12932a04018j29321l0971
10114b64310J30096L4551q4986N0721j0814J3514A57146C7018a20004C29447C7046
10102B20251a05461A22834C1591b9648l61239P1907g2989I1377a79191C2770j1377
$$ y = [-211854, -89422, -24911, 119224, -154597, 88527, 83200, 277691, -269624, -18224, 27299, -13735, -63285, 52434, 138704, -238400, -7827, -66005, 125448, 250357, 98031, -207466, -170648, -35341, -47134, -176341, -84651, 109230, -169713, 68572, -167599, -291833, -129392, -80084, 103728, -222074, -180494, -99357, 158600, -323700, -244903, -257793, -507381, -161274, -309616, -17205, -221505, 5769, -163959, -31801, -28513, -81551, 199066, -124340, 56298, -302539, -361283, -29797, -386190, -25932, -338681, -211176, -135801, -47564, 11759, 124691, -104018, -233339, -264310, -134214, -99663, -184649, -133928, -144742, -131228, 157146, 37018, -120004, 329447, 37046, 220251, -105461, 122834, 31591, -29648, -390887, -318980, -72989, 91377, -179191, 32770, 21393]
10091B1393J53052A3110i4888A03291b13313b9347A9745d26511a41172c2824E8061
10079b75738A82240a72747N3401b3050o7395A40468N1727a49098C12835b66437
10068f2217k28036a33140I5059m6154i3558A43383K8092b68715K9091R1837k10360
10057c58147J25890N5440m5078a07242D4287b4037j15129j02049A37415h3111
10046f6359I4651a71014B06576n8721E188f280I7219b00565j44321J09934I773
10034e3446I3565h7304j50639A71029J50195b98642A22512k1881L8453b19455
10023a15568k36271J29340A2990N8559a03671e1777j04973j2924k5040h6353o0048
10012a46401E3913J70154c56039a45481A28790a28615d9761k26613N6694C1411
$$ y = [21393, 174445, 13110, -94888, 103291, -213313, -29347, 19745, -426511, -141172, -32824, 58061, -275738, 182240, -172747, -119346, -23050, -90445, 140468, 192195, -149098, 312835, -266437, -62217, -290253, -133140, 95059, 48905, -93558, 143383, 171475, -268715, -239624, -147787, -358147, -232257, -176817, -221895, -107242, 44287, -24037, -139166, -241215, 137415, -83111, -66359, 94651, -171014, 206576, 147855, 5188, -6280, 97219, -200565, -344886, -234952, 9773, -53446, 93565, -87304, -237943, 171029, 321224, -298642, 122512, 100631, 139084, -219455, -115568, -351839, -222499, 12990, 71549, -103671, -51777, -156750, -169674, -194714, -86353, -146401, 53913, 224067, -356039, -145481, 128790, -128615, -49761, -276374, -219680, 31411]
10001b22847B63087c03354a25311a9220l44800N0080d54A16936R2937a90102O3995
9990a26107j86533D15028b17588c5237m8259b7807q9809j51546Q1231A79680B1771
9978b13376A4803h0387H6171A5537N3531a9673I4587a75030j15967j72719A25992
9966F5703b37145l1309A03507K23389a80498l42513A38146a81750l33845J83357
9956c32238I6537h2893j9323G7376a20558K9989k13385a47875j10739A98071b35923
9944f6210m9090k82114D68673A12451J73964F0233B4014a30735A9505a17283j5764
9933a33047c4982B62402q1816c079k56230O573a07295k02290d5123k36896k2943
9922c04962f5696l1832l294j85705A04482b34854B51831b23773j40051J46564
$$ y = [-222847, 263087, -303354, -125311, -19220, -364020, -313940, -454, 116936, 209873, -190102, -126107, -312640, 415028, -217588, -35237, -83496, -27807, -117616, -269162, -187931, 179680, 21771, -213376, 14803, -80387, 86171, 15537, 69068, -19673, 94587, -175030, -290997, -463716, 125992, 65703, -237145, -268454, 103507, 326896, -180498, -523011, 138146, -181750, -515595, -332238, 96537, -82893, -102216, 77376, -120558, -90569, -303954, -147875, -258614, 198071, -235923, -66210, -115300, -397414, 468673, 112451, 286415, 60233, 24014, -130735, 19505, -117283, -133047, -34982, 262402, 180586, -3079, -259309, -252736, -107295, -309585, -45123, -282019, -304962, -65696, -97528, -100822, -286527, 104482, -234854, 251831, -223773, -363824, -217260]
9912b17260f4616k18102J37999A23652d3196Q945D11597d42353K01088k313A53077
9900A0948J30209l1974a1031q3087E7259f8120m4659L2348A44559F7527a42876
9888b6789m4097D7427a32022e2749l1757B40868C0558N7147a09868C142c20450
9876f3469m34331e1616h406H8144i5941j2550M0238k38926c2744j65651k220P5605
9864a25010j77349a39135A4203a07772C9784d0968o7499l083A61973b68595G0624
9852E6336a89377A18129b08859A16426j8472e4388n2313j11891F7317a52375a6093
9840b72987l7792A9859L5408J41726a77834j51531a24931k36023B26005l2487
9830A93518g9844m2208F4927B0391a97958b4434l8901l1360A43352a57608L6708
$$ y = [-217260, -64616, -282718, -144719, 123652, -43196, -34251, 411597, -442353, -241265, -243578, 153077, 10948, 141157, 109183, -11031, -94118, 57259, -68120, -112779, -80431, 144559, 67527, -142876, -26789, -70886, 47427, -132022, -52749, -84506, 240868, 30558, 87705, -109868, 3142, -320450, -63469, -497800, -51616, -8406, 88144, -95941, -108491, -68253, -307179, -32744, -198395, -200615, -125010, -302359, -139135, 14203, -107772, 39784, -40968, -108467, -111550, 161973, -268595, 70624, 56336, -189377, 118129, -208859, 116426, 97954, -54388, -106701, -218592, 67317, -152375, -16093, -272987, -310779, 19859, 55267, 196993, -177834, -329365, -124931, -360954, 226005, 193518, -79844, -122052, 64927, 20391, -197958, -24434, -63335, -94695, 143352, -157608, -120900]
9819a20900Q727K231q3666b0981D23674A43068a80369j13515a05120C7921h5885
9807a27117e6709k8815K0304A64709l4857a27139B41005d6216A15506a73164l0720
9796b03884a4008k85913H8724b18601B02596F5161a78084D6729a12253M8766E4423
9784b50468A59526h2514o7106m9892p375j86834a16199E1825b36323J1334e6592
9772a33000k0535g4186D6606b06490f8700m2284A59965b9051J3713j03778j02612
9761b21728a08656K7604b5693j6032q4816b6431j17091N6827m814a6724k69363
9750b86087c0350A53915b34336A5267d605A293a18158L9604g066j22130B1802
9738d0977p3563r6655P5334m735k56110J93276g8584b3151B10371m5207J15694
$$ y = [-120900, -112173, -109942, -193608, -20981, 423674, 143068, -180369, -293884, -105120, 37921, -85885, -127117, -56709, -85524, -65220, 164709, 129852, -127139, 241005, -46216, 115506, -173164, -203884, -14008, -299921, 88724, -218601, 202596, 65161, -178084, 46729, -112253, -63487, 54423, -250468, 159526, -82514, -149620, -199512, -206887, -393721, -116199, 51825, -236323, -224989, -56592, -133000, -153535, -74186, 46606, -206490, -68700, -110984, 159965, -29051, -15338, -119116, -221728, -108656, -81052, -25693, -41725, -126541, -26431, -143522, -86695, -91509, -16724, -286087, -30350, 153915, -234336, 15267, -4605, 1293, -118158, -78554, -7066, -129196, 21802, -40977, -114540, -211195, -135861, -140596, -396706, -203430, -78584, -23151, 210371, 165164, 280858]
9727B80858c0503l02931p8454i8952j61402A5346K20151a56758f6488k75532h4298
9715A04520i1751k18363c0801F431K42394c3892m0881I0380a50502L545k5496
9704a72453A93516m7432b10674K2076L9136k10594J16586A58185K5148a44857
9693F8377A6170c38134c0885q6393A71143G917a03111F1418c1070B34099c88794
9681A50914a51624m32599A22936J10484D1568K11689d8998J3433C77817g2386
9670i3186f431E9110a06872B9707a16322j6374H198a66847A20383K48700A40768
9658b36842a05101j40098N3275j11599a9919j21565j45690B81786c5211A86587
9647A73520a63951B4350a17278A43285N3398K5598b13170G9521P998J21808q7313
$$ y = [280858, -30503, -333434, -411888, -98952, -260354, 15346, 235497, -156758, -66488, -342020, -84298, 104520, -91751, -310114, -30801, 6431, 248825, -33892, -74773, 90380, -150502, -146957, -172453, 193516, 146084, -210674, -188598, -149462, -360056, -243470, 158185, 183333, -144857, 68377, 16170, -338134, -30885, -117278, 171143, 7917, -103111, 61418, -31070, 234099, -388794, 150914, -151624, -584223, 122936, 233420, 41568, 253257, -48998, -35565, 377817, -72386, -93186, -6431, 59110, -106872, 29707, -116322, -132696, 8198, -166847, 120383, 369083, 140768, -236842, -105101, -245199, -191924, -303523, -19919, -141484, -287174, 281786, -35211, 186587, 173520, -163951, 24350, -117278, 143285, 196683, 222281, -213170, 79521, 87519, 209327, 122014]
9636A22014b79844d1829E0156j6760b55146r0127d3495k38340P8476I8995h6077
9624D9619a07238D6467P0159b05635A23440a4187A29192e7827j87116Q3732l00450
9613d61661J83038a10973a3730C4312b11203j5586C31046a2770j21847q3877J04053
9602a14441L436J286N55n7098c8634l00465q7257L1933A771f6127k50292B7212
9589b97635g6354A37486a26334d1863j31788A3572J47879K5211i2888n6323K3594
9578a25617J254i906B25104G489f6144j57292Q8321B67423d58516a37093B90560
9566C03398g4204A26829C8641J09254j5499a65466j692A81519a31701q0608B08146
9554i8571b1386j25169A64152J12797a66837A64790P576i1485A29254e36259a13490
$$ y = [122014, -279844, -41829, 50156, 33396, -255146, -345273, -43495, -281835, -203359, 98995, -86077, 49619, -107238, 46467, 116626, -205635, 123440, -14187, 129192, -57827, -244943, -161211, -461661, -278623, -110973, -13730, 34312, -211203, -226789, 331046, -12770, -134617, -218494, -114441, -111005, -109719, -109164, -166262, -38634, -339099, -426356, -394423, 1771, -66127, -316419, 27212, -297635, -76354, 137486, -126334, -41863, -173651, 13572, 161451, 186662, -92888, -149211, -125617, -124363, -9906, 225104, 7489, -66144, -223436, -135115, 267423, -458516, -137093, 290560, 303398, -74204, 126829, 38641, 147895, 132396, -165466, -167158, 181519, -131701, -212309, 208146, -98571, -21386, -146555, 164152, 276949, -166837, 164790, 172366, -91485, 129254, -536259, -113490]
9542c0055q9300a0235j30148L518q1779H0439L7938h5900A9387i7517D7121R4820
9530A41941a75164j93562c1810A15452d20204J97186a7951B47978j3578j01462
9520A32938C2733a23077m4447f4770k13305o548a19551k02485A14999b8461j45065
9509a73526d0549l44382M7626a36879B96982h6236j31847A26046f4744B32944
9498I519b99995A39288c3380H7986A0916K9780i0578A26619P1406b21147M1582
9487a79565m9059M8799M2423A23319b05606F85b58526b0358j46653A79388a8604
9475c86889A14240C60a03799j63784b0734l1746B64123e4299k82774a05624b1110
9463c77284e0629K4820k9002k2561c2872k5337A71363l1990b52323A71725g0154
$$ y = [-30055, -119355, -10235, -140383, -136865, -218644, 80439, 118377, -85900, 19387, -97517, 47121, 141941, -175164, -368726, -31810, 115452, -420204, -223018, -17951, 247978, 234400, 132938, 32733, -123077, -167524, -64770, -278075, -284623, -119551, -322036, 114999, -28461, -173526, -40549, -384931, -337305, -136879, 296982, -86236, -218083, 126046, -64744, 232944, 9519, -299995, 139288, -33380, 87986, 10916, 40696, -90578, 126619, 198025, -221147, -179565, -228624, -179825, -137402, 123319, -205606, 685, -258526, -20358, -167011, 179388, -18604, -386889, 114240, 360, -103799, -267583, -20734, -52480, 264123, -54299, -337073, -105624, -21110, -377284, -50629, -25809, -54811, -77372, -32872, -58209, 171363, 139373, -252323, 171725, -70154]
9451b19784L3482j63580O1870A8037a27347m7112O3887D9187L02318i3576J1230
9440h2346B08032b36250f3697b5914k00637i2857E087R0115M2459d3396A16164
9428A29273a13161E032b67679I983e4060H6510c26829J51279c7781O698m9880
9417h0963o2241O9766j24419A82848a22731l7325g9698j31629R3462j46988Q0616
9406a84237D3906h9521j55195a6403k52098j17465A52673d3098o1062l6310A7934
9394d43603g3865A6383N8404a49881N8509A41308a58822e5394j50908j6323B9796
9382I6164a73934K7877A7823a43881D15268a0808H5357k2668a61033j39379A54409
9370a11300q5066g1408k52501J30438A433b1999p3422B6866K06951a37066L4418
$$ y = [-219784, -186302, -349882, -288012, 18037, -127347, -174459, -110572, 49187, 351505, -93576, -82346, 208032, -236250, -63697, -25914, -226551, -92857, 5087, 95202, 137661, -43396, 116164, 129273, -113161, 5032, -267679, 9983, -54060, 86510, -326829, -175550, -37781, -31083, -80963, -143204, -73438, -197857, 182848, -122731, -160056, -79698, -211327, -117865, -264853, -184237, 43906, -89521, -244716, -16403, -268501, -385966, 152673, -43098, -104160, -140470, 17934, -443603, -73865, 16383, 74787, -149881, -91372, 141308, -158822, -55394, -206302, -222625, 29796, 96164, -173934, -146057, 17823, -143881, 415268, -10808, 85357, 62689, -161033, -300412, 154409, -111300, -196366, -71408, -323909, -193471, 1433, -21999, -95421, 26866, 233817, -137066, -102648]
9359a02648D2977a2706k95681A74306a33200A48319N5489a63470b5767N30A75972
9347f527A7621a69766F5414c2190j18902J0336q3486a07336j16143A43256E0521
9335I2027a11223D9131h3765j23605q9097A05122g972j15288N8997r9547A19864
9323B0567K55754a6790k94264e6438r0383m3026A3432a0042j33379N1814c3204
9311c60607a32315A11357E3851J33101F4562L08323c7512k13260C454L8532b64667
9299c57416A48930J53053A10156D9446a65888j78110g9616B71963h7362k75643
9289c63005B13535c00847A12571c997j13621b8331A50219j648a3092o449A07618
9277B90401j01532b10200C0646H710c63076h9608p1275B89999B638a60879l8430
$$ y = [-102648, 42977, -12706, -308387, 174306, -133200, 148319, 203808, -163470, -25767, -25237, 175972, -6527, 17621, -169766, 65414, -32190, -151092, -140756, -224242, -107336, -223479, 143256, 50521, 92027, -111223, 49131, -83765, -207370, -296467, 105122, -7972, -123260, -64263, -163810, 119864, 20567, 276321, -16790, -311054, -56438, -146821, -189847, 13432, -10042, -143421, -91607, -33204, -360607, -132315, 111357, 53851, 186952, 64562, 372885, -37512, -250772, 3454, 41986, -264667, -357416, 148930, 301983, 110156, 49446, -165888, -343998, -79616, 271963, -87362, -363005, 213535, -300847, 112571, -3997, -117618, -28331, 150219, 148571, -13092, -19541, 107618, 290401, 188869, -210200, 30646, 8710, -363076, -89608, -160883, 289999, 2638, -160879, -199309]
9266a99309F9893h6778E5747a13513A25897f2067q2291j48139g5480A17627J61004
9255B78631f4953j49363d1184o1169j1731B53222D445a03065j04431j1968K2500
9244a96964e6649k58312e6682A4040d1719E8398b30339h4871L2012B24815f1279
9232i6966k92591a93642R3780p0137L3745O2375q3583f854j11091j24845C77120
9220c05647A32104C8981K5178a7281A06269a2938B6091a32382n60283b55215h8026
9208c1123l9317p9109H0840a84377f0034J0469A70756b45945A03872a37864A14850
9196a27778B00632i437j16122A6974a6782H2400a97837g1366p1316C1175J21798
9185A52973e9448B27760p7231k6767J5653d85823E1169i2404A06518a91478B11010
$$ y = [-199309, 69893, -86778, 55747, -113513, 125897, -62067, -144358, -292497, -75480, 117627, 278631, -64953, -214316, -41184, -102353, -114084, 253222, 4445, -103065, -207496, -219464, -196964, -56649, -314961, -56682, 14040, -41719, 58398, -230339, -84871, -52859, 224815, -61279, -96966, -389557, -193642, -99862, -169999, -136254, -73879, -157462, -6854, -117945, -242790, 377120, -305647, 132104, 38981, 64159, -17281, 106269, -12938, 26091, -132382, -692665, -255215, -88026, -31123, -70440, -149549, 80840, -184377, -60034, -49565, 170756, -245945, 103872, -137864, 114850, -127778, 200632, -9437, -125559, 16974, -16782, 82400, -197837, -71366, -142682, 31175, 152973, -59448, 227760, 150529, 123762, 139415, -485823, 51169, -92404, 106518, -191478, 211010]
9173e3505m3723d5884m8722p4409K1564k12633C31177b64490a21674B91008j33039
9162A57969a601j85178I9021C0890a3013A03278j8431J0830c28641A2659a5030
9150c01362a2627k01710R3209p9936A65301E2454b10129L0158k70145a75293M5556
9139a29737M5904B41234C492a52169m0749g2351m2724n8741M9102j2094j831A67041
9126c9740G0824K10462F210a28341j89884A75793c47955D711c34339A34828e4505
9114A54481a03725C62198E4287a73112A06399N0835E7357a9914l899B02967H141
9102A14957a46540A37374j3001K8228a90452j24212J53844E2263I332M6677c1350
9090a6447A36072p558a21914J629A44946a10258m665c6887F372J0283K6705e8989
$$ y = [-53505, -97228, -45884, -94606, -169015, -147451, -360084, 331177, -264490, -121674, 291008, 157969, -1601, -186779, 99021, 30890, -13013, 103278, 84847, 95677, -328641, 12659, -15030, -301362, -12627, -214337, -121128, -201064, 165301, 52454, -210129, -179971, -450116, -175293, -129737, -83833, 241234, 3492, -152169, -192918, -72351, -115075, -173816, -124714, -136808, -138639, 167041, -39740, 70824, 281286, 6210, -128341, -318225, 175793, -347955, 4711, -334339, 134828, -54505, 154481, -103725, 362198, 54287, -173112, 106399, 157234, 57357, -19914, -23813, 202967, 8141, 114957, -146540, 137374, 124373, 152601, -190452, -314664, -160820, 52263, 9332, 56009, -31350, -16447, 136072, 128514, -121914, -120285, 144946, -110258, -114923, -36887, 6372, 16655, 43360, -58989]
9077b90526J3644G4482c20485B2650J38467C5948F163c13565d3242o4722b0722
9065a75598f466k41788b4305j10704A54682a42929k08275J04914j76404i7945
9054A92791c1615l48366a06217l9614B68444d9430j63326d6002b0938k31015d5030
9042b30274C4367J6394b92036A77956J70981a10014q6410P0243B6051K29101b72994
9030f2370l04583a14619M1638k90568I2031B7522a96554A91647H7162C1165a79266
9018b82642A4392b8796G4429L37a66376A03884a41506A2644e2270k45726a28687
9006a46766e1659k939b2582A36184b07834E971J00689B6020a25447A6171a5827
8994B31422b97202F6489b91091E4081A5561b38594h8068L5900k06675G8660b06666
$$ y = [-290526, -276882, 74482, -320485, 22650, 161117, 35948, 6163, -313565, -43242, -107964, -20722, -175598, -6466, -248254, -24305, -135009, 154682, -142929, -351204, -246290, -422694, -97945, 192791, -31615, -379981, -106217, -145831, 268444, -49430, -212756, -46002, -20938, -251953, -45030, -230274, 34367, 50761, -292036, 177956, 348937, -110014, -196424, -126181, 26051, 255152, -272994, -62370, -366953, -114619, -72981, -363549, 92031, 27522, -196554, 191647, 87162, 31165, -179266, -282642, 14392, -28796, 74429, 74766, -166376, 103884, -141506, 12644, -52270, -297996, -128687, -146766, -51659, -54598, -22582, 136184, -207834, 5971, 106660, 26020, -125447, 16171, -15827, 231422, -297202, 66489, -291091, 54081, 15561, -238594, -88068, -52168, -258843, 78660, -206666]
8982a12483A20091b83592i4811j74876A45182o2897L0276d04170D1354b82230
8971a54669N4364A39589B4315a62767H3262b30446B92846c399k24870k1142j01974
8960c51385J53944C1345J0848O8965a67429j27098E2376j8056a02087B52346A6321
8948b75048A26240f60j92567c3770C37449D1327a43047A65915O1018b03528d9990
8936b55507Q4965c5160n5331G5270d5006j81096j7288Q8010j30958A31518a1974
8924h5044A32216J2431M31885M2198k58998B3259b12134A2745a03986K3734A04172
8912c96886f4517F8957J0030d6118A28446E0022j6911f1334k23837A37104b22606
8900I7014c50854M1719H4283J23244F119J26171d7714A9892c18216A45255b12304
$$ y = [-112483, 120091, -283592, -94811, -269687, 145182, 82285, 112561, -404170, 41354, -282230, -154669, -100305, 139589, 24315, -162767, 83262, -230446, 292846, -3399, -228269, -249411, -351385, -197441, 31345, 42193, 111158, -167429, -294527, 52376, 34320, -102087, 252346, 16321, -275048, 126240, -660, -193227, -33770, 337449, 41327, -143047, 165915, 226933, -203528, -49990, -255507, -170542, -35160, -90491, 75270, -45006, -226102, -243390, -155380, -286338, 131518, -11974, -85044, 132216, 144647, 576532, 618730, 359732, 23259, -212134, 12745, -103986, -80252, 104172, -396886, -64517, 68957, 78987, -46118, 128446, 50022, 33111, -61334, -285171, 137104, -222606, 97014, -350854, -309135, 84283, 207527, 6119, 132290, -47714, 19892, -318216, 145255, -212304]
8888D25132D2701a44224B44883k4203a63333A70399L8642M5218e5473q0987e2238
8876A10119c9699r3619n2994N6025B61785H0462c2890j42760l8507A30768J55086
8865B85854h0068A09040e1602Q922a6449f951m8354b1453j3801r9457e0496q9672
8853a40168K069B5859a47983J3056A43809h3875H7890K3837k8746a06362b0898
$$ y = [425132, 42701, -144224, 244883, 220680, -163333, 170399, 209041, 254259, -55473, -136460, -52238, 110119, -39699, -133318, -186312, -130287, 261785, 80462, -32890, -175650, -214157, 130768, 285854, -80068, 109040, -51602, -42680, -16449, -6951, -55305, -21453, -35254, -134711, -50496, -140168, -138099, 25859, -147983, -134927, 143809, -83875, 87890, 111727, 82981, -106362, -20898]
$$ [...]
##END NTUPLES=NMR SPECTRUM
##END=
