##TITLE=AC1388_PERAH12200_7519727_yzSkyq3V2s
##JCAMPDX= 6.0         $$ Bruker NMR JCAMP-DX V2.0
##DATA TYPE= NMR SPECTRUM
##DATA CLASS= NTUPLES
##ORIGIN= BRUKER
##OWNER= Administrator
$$ 1.72 TOPSPIN		Version 2.1
$$ 2015-07-10 22:10:17.472 -0700  Administrator@X
$$ Compression mode = diff/dup
##.OBSERVE FREQUENCY= 400.02188249412
##.OBSERVE NUCLEUS= ^1H
##.ACQUISITION MODE= SIMULTANEOUS (DQD)
##.ACQUISITION SCHEME= undefined
##.AVERAGES= 64
##.DIGITISER RES= 22
##SPECTROMETER/DATA SYSTEM= spect
##.PULSE SEQUENCE= noesygpps1d.comp
##.SOLVENT NAME= COFFEE_meoh
##.SHIFT REFERENCE= INTERNAL, COFFEE_meoh, 1, 14.96099
##AUDIT TRAIL= $$ (NUMBER, WHEN, WHO, WHERE, PROCESS, VERSION, WHAT)
$$ ##TITLE= Audit trail, TOPSPIN		Version 2.1
$$ ##JCAMPDX= 5.01
$$ ##ORIGIN= Bruker BioSpin GmbH
$$ ##OWNER= Administrator
$$ $$ E:\/data/COFFEE/nmr/AC1388_PERAH12200_7519727_yzSkyq3V2s/22/pdata/1/auditp.txt
$$ ##AUDIT TRAIL=  $$ (NUMBER, WHEN, WHO, WHERE, PROCESS, VERSION, WHAT)
(   1,<2015-07-10 22:10:11.941 -0700>,<Administrator>,<X>,<go>,<TOPSPIN 2.1>,
      <created by zg
	started at 2015-07-10 21:58:42.003 -0700,
	POWCHK enabled, PULCHK disabled,
       configuration hash MD5:
       21 0F 79 D6 B3 7B B4 F6 88 20 88 DB 03 48 BD 9F
       data hash MD5: 64K
       C4 C6 AA 11 87 C0 74 28 10 4C 1D 89 A8 82 58 30>)
(   2,<2015-07-10 22:10:15.378 -0700>,<Administrator>,<X>,<proc1d>,<TOPSPIN 2.1>,
      <Start of raw data processing
       efp LB = 0.3 FT_mod = 6 PKNL = 1 PHC0 = 0 PHC1 = 0 SI = 128K 
       data hash MD5: 128K
       C0 CB F4 04 D7 2A 59 2E C7 46 1A 88 8B 8B 04 CA>)
(   3,<2015-07-10 22:10:16.253 -0700>,<Administrator>,<X>,<proc1d>,<TOPSPIN 2.1>,
      <pk PHC0 = -84.84192 PHC1 = 0 
       data hash MD5: 128K
       8C 1D C2 65 31 D0 45 C8 C2 2E CD D4 62 F0 C9 CE>)
(   4,<2015-07-10 22:10:16.644 -0700>,<Administrator>,<X>,<proc1d>,<TOPSPIN 2.1>,
      <abs ABSG = 1 
       data hash MD5: 128K
       D8 C8 C7 32 52 BF 01 F0 C3 5B 1A 9B 43 AE 9F 33>)
(   5,<2015-07-10 22:10:16.753 -0700>,<Administrator>,<X>,<proc1d>,<TOPSPIN 2.1>,
      <abs ABSG = 2 
       data hash MD5: 128K
       E1 B2 0D 7B F4 D6 EB FA 29 EF C4 9E 88 2A 26 65>)
(   6,<2015-07-10 22:10:16.831 -0700>,<Administrator>,<X>,<proc1d>,<TOPSPIN 2.1>,
      <abs ABSG = 3 
       data hash MD5: 128K
       4E 04 1B 59 93 7C DE 4A CE 1F C0 8D 3D F6 15 C3>)
(   7,<2015-07-10 22:10:16.910 -0700>,<Administrator>,<X>,<proc1d>,<TOPSPIN 2.1>,
      <abs ABSG = 4 
       data hash MD5: 128K
       D8 FE B2 03 72 03 47 54 59 1A DC FD B8 01 F5 23>)
(   8,<2015-07-10 22:10:17.003 -0700>,<Administrator>,<X>,<proc1d>,<TOPSPIN 2.1>,
      <abs ABSG = 5 
       data hash MD5: 128K
       C9 37 19 4C 7B 14 15 75 44 4E 81 4A B8 38 12 A2>)
$$ ##END=
$$ 
$$ $$ hash MD5
$$ $$ F4 7E 9C C6 E7 09 9B F2 9D D0 71 F7 05 1C 70 33
##$RELAX= 
##$RELAX= 
##$RELAX= 
##$RELAX= 
##$RELAX= 
##$RELAX= 
##$RELAX= 
##$RELAX= 
$$ Bruker specific parameters
$$ --------------------------
##$DU= <E:\>
##$EXPNO= 22
$$ [...]
##$TP07= 0
##$TPNAME0= <>
##$TPNAME1= <>
##$TPNAME2= <>
##$TPNAME3= <>
##$TPNAME4= <>
##$TPNAME5= <>
##$TPNAME6= <>
##$TPNAME7= <>
##$TPOAL= (0..7)
0.5 0.5 0.5 0.5 0.5 0.5 0.5 0.5
##$TPOFFS= (0..7)
0 0 0 0 0 0 0 0
##$TUNHIN= 0
##$TUNHOUT= 0
##$TUNXOUT= 0
##$USERA1= <user>
##$USERA2= <user>
##$USERA3= <user>
##$USERA4= <user>
##$USERA5= <user>
##$V9= 5
##$VALIST= <valist>
##$VCLIST= <CCCCCCCCCCCCCCC>
##$VD= 0
##$VDLIST= <DDDDDDDDDDDDDDD>
##$VPLIST= <PPPPPPPPPPPPPPP>
##$VTLIST= <TTTTTTTTTTTTTTT>
##$WBST= 2048
##$WBSW= 25
##$XGAIN= (0..3)
0 0 0 0
##$XL= 0
##$YL= 0
##$YMAX_a= 7561596
##$YMIN_a= -13764749
##$ZGOPTNS= <>
##$ZL1= 120
##$ZL2= 120
##$ZL3= 120
##$ZL4= 120
##$ABSF1= 14.96099
##$ABSF2= -5.597192
##$ABSG= 5
##$ABSL= 3
##$ALPHA= 0
##$AQORDER= 0
##$ASSFAC= 0
##$ASSFACI= 0
##$ASSFACX= 0
##$ASSWID= 0
##$AUNMP= <proc_prof1d_extract.lims>
##$AXLEFT= 0
##$AXNAME= <>
##$AXNUC= <1H>
##$AXRIGHT= 0
##$AXTYPE= 0
##$AXUNIT= <>
##$AZFE= 0.1
##$AZFW= 0.1
##$BCFW= 0
##$BC_mod= 0
##$BYTORDP= 0
##$COROFFS= 0
##$CY= 15
##$DATMOD= 1
##$DC= 0
##$DFILT= <>
##$DTYPP= 0
##$F1P= 0
##$F2P= 0
##$FCOR= 0.5
##$FTSIZE= 131072
##$FT_mod= 6
##$GAMMA= 0
##$GB= 0
##$INTBC= 1
##$INTSCL= 1
##$ISEN= 128
##$LB= 0.3
##$LEV0= 0
##$LPBIN= 0
##$MAXI= 10000
##$MC2= 0
##$MEAN= 0
##$ME_mod= 0
##$MI= 0
##$NCOEF= 0
##$NC_proc= -2
##$NLEV= 6
##$NOISF1= 0
##$NOISF2= 0
##$NSP= 0
##$NTH_PI= 0
##$NZP= 0
##$OFFSET= 14.96099
##$PC= 1
##$PHC0= -84.84192
##$PHC1= 0
##$PH_mod= 1
##$PKNL= yes
##$PPARMOD= 0
##$PPDIAG= 0
##$PPIPTYP= 0
##$PPMPNUM= 2147483647
##$PPRESOL= 1
##$PSCAL= 4
##$PSIGN= 0
##$PYNMP= <proc.py>
##$REVERSE= no
##$SF= 400.020009641636
##$SI= 131072
##$SIGF1= 0
##$SIGF2= 0
##$SINO= 400
##$SIOLD= 131072
##$SPECTYP= <>
##$SREGLST= <1H.CDCl3>
##$SSB= 0
##$STSI= 131072
##$STSR= 0
##$SW_p= 8223.68421052631
##$SYMM= 0
##$S_DEV= 0
##$TDeff= 65536
##$TDoff= 0
##$TI= <>
##$TILT= no
##$TM1= 0
##$TM2= 0
##$TOPLEV= 0
##$USERP1= <user>
##$USERP2= <user>
##$USERP3= <user>
##$USERP4= <user>
##$USERP5= <user>
##$WDW= 1
##$XDIM= 131072
##$YMAX_p= 359175578
##$YMIN_p= -10975
##$CURPLOT= <Network HP LaserJet P1505>
##$CURPRIN= <$Network HP LaserJet P1505>
##$DFORMAT= <normdp>
##$LAYOUT= <+/1D_H.xwp>
##$LFORMAT= <normlp>
##$PFORMAT= <normpl>
##$SURQMSG= 1
$$ End of Bruker specific parameters
$$ ---------------------------------
##NTUPLES= NMR SPECTRUM
##VAR_NAME=  FREQUENCY,     SPECTRUM/REAL,   SPECTRUM/IMAG
##SYMBOL=    X,             R,               I
##VAR_TYPE=  INDEPENDENT,   DEPENDENT,       DEPENDENT
##VAR_FORM=  AFFN,          ASDF,            ASDF
##VAR_DIM=   131072,        131072,          131072
##UNITS=     HZ,            ARBITRARY UNITS, ARBITRARY UNITS
##FACTOR=    0.0627417313425164, 1,          1
##FIRST=     8223.62146879497, 259,          -64123
##LAST=      0,             2182,            -64650
##MIN=       0,             -10975,          0
##MAX=       8223.62146879497, 359175578,    0
$$ Real data points
##PAGE= N=1
##DATA TABLE= (X++(R..R)), XYDATA
$$ [...]
63907A549993j06081r6021q6050p6666o7860n9740n2666m6677m1338l6351l1866
$$ 1549993 1443912 1347891 1261841 1185175 1117315 1057575 1004909 958232 916894 880543 848677
63896H48677k8128k5143k2763k0734j8682j6381j4008j1833r817p899o343n272
$$ 848677 820549 795406 772643 751909 733227 716846 702838 691005 681188 673289 666946 661674
63884F61674l967j509J934N186P566R599J1922J4297J6199J7796J9687K2026K4478
$$ 661674 657707 656198 658132 663318 670884 680483 692405 706702 722901 740697 760384 782410 806888
63871H06888K6888K9475L2343L5207L7602L9286M0468M1762M3627M5687M6798
$$ 806888 833776 863251 895594 930801 968403 1007689 1048157 1089919 1133546 1179233 1226031
63860A226031M6176M4285M2217M0261L7582L3443K8241K3003J8023J2580O028
$$ 1226031 1272207 1316492 1358709 1398970 1436552 1469995 1498236 1521239 1539262 1551842 1557870
63849A557870j213q068j3960j9223k4454k9782l4828l9133m2512m5142m7331m9042
$$ 1557870 1556657 1548589 1534629 1515406 1490952 1461170 1426342 1387209 1344697 1299555 1252224 1203182
63837A203182m9783m9246m8019m7113m6755m6151m4685m2717m0845l8924l6401
$$ 1203182 1153399 1104153 1056134 1009021 962266 916115 871430 828713 787868 748944 712543
63826G12543l3291l0188k7521k5289k3405k1770k0155j8436j6881j5703j4580
$$ 712543 679252 649064 621543 596254 572849 551079 530924 512488 495607 479904 465324
63815D65324j3120j1718j1167j1383j1245r984q204p148p258p839p933p274o367
$$ 465324 452204 440486 429319 417936 406691 396707 388503 381355 374097 366258 358325 351051 344684
63802C44684n768n463n152m999n507o465o714n624m202l801m138l756k389j529
$$ 344684 338916 333453 328301 323302 317795 311330 304616 298992 294790 290989 286851 283095 280706 279177
63788B79177k238l546l808k783j593j064j063j158j227j350j608k001k276j995
$$ 279177 276939 273393 269585 266802 265209 264145 263082 261924 260697 259347 257739 255738 253462 251467
63774B51467j114k41k7m31r16j167j237j183r76p62p90j090j409j460j118m38
$$ 251467 250353 250112 250085 249654 248738 247571 246334 245151 244175 243413 242623 241533 240124 238664 237546 237108
63758B37108L16P81Q38P31O91O48M68L00M09P94J222J529J685J709J719J891K166
$$ 237108 237424 238205 239043 239774 240465 241113 241581 241881 242290 243084 244306 245835 247520 249229 250948 252839 255005
63741B55005K215J943J783K064K339J866P40k8L18J490K696L502L907L985L927
$$ 255005 257220 259163 260946 263010 265349 267215 267955 267927 268245 269735 272431 275933 279840 283825 287752
63726B87752M237N298O722P561P386O809O647O865O705N729M216K512N97j425
$$ 287752 291989 297287 304009 311570 318956 325765 332412 339277 345982 351711 355927 358439 359036 357611
63712C57611k951l523l580l934m613m859m330l581l177k915k344j543q94l73L27
$$ 357611 354660 351137 347557 343623 339010 334151 329821 326240 323063 320148 317804 316261 315367 314994 315321
63697C15321J163J701J769J689J832K185K467K407J941J313R69J104J402J422
$$ 315321 316484 318185 319954 321643 323475 325660 328127 330534 332475 333788 334757 335861 337263 338685
63683C38685J177J045J075Q74L34N1O60J849K547K165J347J243K177L405M136
$$ 338685 339862 340907 341982 342856 343190 343241 343901 345750 348297 350462 351809 353052 355229 358634 362770
63668C62770M413M702M947M549L307J852Q38J10r41k365l539m084m391m995n776
$$ 362770 367183 371885 376832 381381 384688 386540 387378 387488 386547 384182 380643 376559 372168 367173 361397
63653C61397o170n987n664n567n438m775l565k385j748j607j535j223o80j28J70
$$ 361397 355227 349240 343576 338009 332571 327796 324231 321846 320098 318491 316956 315733 315053 314925 315095
63638C15095P1k67m14mR63K140L092L598L826M286N342O631P289O964O399O646
$$ 315095 315166 314899 314485 314481 315444 317584 320676 324274 328100 332386 337728 344359 351648 358612 365011 371657
63622C71657P927R598J1070J2280J3335J4235J5076J6138J7621J9476K1468K3143
$$ 371657 379584 389182 400252 412532 425867 440102 455178 471316 488937 508413 529881 553024
63610E53024K3820K3142K1628K0231J9187J7761J5303J2111R050O672M981L675
$$ 553024 576844 599986 621614 641845 661032 678793 694096 706207 715257 721929 726910 730585
63598G30585K417J083j34j084k143l769n629o917p746r364j2375j5506j7033j6886
$$ 730585 733002 734085 733951 732867 730724 726955 721326 714409 706663 697299 684924 669418 652385 635499
63584F35499j6403j6332j6139j5269j4050j3053j2299j1454j0261q558o359m160
$$ 635499 619096 602764 586625 571356 557306 544253 531954 520500 510239 501681 495322 491162
63572D91162k638j800q56P42K541L681L909L717L686M098M907N799O403O788P611
$$ 491162 488524 486724 485868 486610 489151 492832 496741 500458 504144 508242 513149 518948 525351 532139 539750
63557E39750R477J2191J4943J7266J9545K2513K6337L0246L2937L3332L1143K6958
$$ 539750 549227 561418 576361 593627 613172 635685 662022 692268 725205 758537 789680 816638
63545H16638K1816J6671J1993P801L990O43k006l800m716m725l883k573j415p80
$$ 816638 838454 855125 867118 874919 878909 879552 877546 873746 869030 864305 860422 857849 856434 855654
63531H55654o75j243k928n813r103j1856j4047j6407j9266k2145k4455k5914k6214
$$ 855654 854979 853736 850808 844995 835892 824036 809989 793582 774316 752171 727716 701802 675588
63518F75588k4986k2546k0127j8807j8456j8158j7378j6199j4726j2937j1198
$$ 675588 650602 628056 607929 589122 570666 552508 535130 518931 504205 491268 480070
63507D80070j0244j0330j0697j0299q902p225o042n450n033m481l838l234k679
$$ 480070 469826 459496 448799 438500 429598 422373 416331 410881 405848 401367 397529 394295 391616
63494C91616k166j725j334q76l93q4P7M97J438K556L332L817M437N134N336M904
$$ 391616 389450 387725 386391 385515 385122 385038 385115 385612 387050 389606 392938 396755 401192 406326 411662 416566
63478D16566M522M742N137M878L864K749J994J367M28r03k350l643m679n467o030
$$ 416566 421088 425830 430967 435845 439709 442458 444452 445819 446247 445344 442994 439351 434672 429205 423175
63463D23175o380o582o720o695o196n105l858k936k149r50M57J097O74L55J378
$$ 423175 416795 410213 403493 396798 390602 385497 381639 378703 376554 375604 376061 377158 377832 378187 379565
63448C79565L413N150O168P329R321J1838J4434J7329K0854K4634K7711K9177
$$ 379565 382978 388128 394296 401625 410946 422784 437218 454547 475401 500035 527746 556923
63436E56923K8484K5611K1248J6524J2196Q391N191K938J724J112Q01J225L036
$$ 556923 585407 611018 632266 648790 660986 669377 674568 677506 679230 680342 681143 682368 685404
63423F85404O267J0426J4925J9034K1773K2578K1935K0798J9515J7800J5563J3115
$$ 685404 691671 702097 717022 736056 757829 780407 802342 823140 842655 860455 876018 889133
63411H89133J0639Q081N599L524J821J20j602k948l831m795o367q545j1102j3913
$$ 889133 899772 907853 913452 916976 918797 918917 917315 914367 910536 905741 899374 890829 879727 865814
63397H65814j6743j9202k1165k2858k4259k4948k4802k4304k3720k2540k0365
$$ 865814 849071 829869 808704 785846 761587 736639 711837 687533 663813 641273 620908
63386F20908j7953j6508j6074j5360j3354j0481p952o406n457m334k615n31J282
$$ 620908 602955 586447 570373 555013 541659 531178 523226 516820 511363 507029 504414 503883 505165
63373E05165K366K868L424M611O550Q885J1029J2584J3713J5041J7033J9536K2004
$$ 505165 507531 510399 513823 518434 524984 533869 544898 557482 571195 586236 603269 622805 644809
63360F44809K4036K5511K6391K6708K6577K5873K4057K0747J6482J2452R345O807
$$ 644809 668845 694356 720747 747455 774032 799905 823962 844709 861191 873643 882988 889795
63348H89795M273J925M65O8o7r63k845n055o947q671j0840j3533j6006j7581j8453
$$ 889795 894068 895993 896458 896526 896459 895496 892651 887596 880649 871978 861138 847605 831599 814018 795565
63333G95565j9303k0300k0933k0665j9349j7003j3676r758o129l737l089m061
$$ 795565 776262 755962 735029 714364 695015 678012 664336 654578 648449 644712 641623 637562
63321F37562o046q286j0308j2103j3749j5009j5607j5754j5865j5847j5183j3845
$$ 637562 631516 623230 612922 600819 587070 572061 556454 540700 524835 508988 493805 479960
63309D79960j2519j1611j0625r069p442o708o887o944o098m751l838l687l835
$$ 479960 467441 455830 445205 436136 428694 421986 415099 408155 402057 397306 393468 389781 385946
63296C85946l732l286k731k335k300k718l394l778l455k679k176k323k728k826
$$ 385946 382214 378928 376197 373862 371562 368844 365450 361672 358217 355538 353362 351039 348311 345485
63282C45485k514k004j390p42m13o38j011q62k18K16Q7j29J21P21J148J097O32
$$ 345485 342971 340967 339577 338835 338422 337784 336773 335911 335693 335909 335996 335867 335988 336709 337857 338954 339586
63265C39586Q1k5O81J859K662K676K310K122K219K547L152L767L756K971K235
$$ 339586 339667 339642 340323 342182 344844 347520 349830 351952 354171 356718 359870 363637 367393 370364 372599
63250C72599K316K893L157L039L077L420L810M392N592P115Q093Q399Q978J0475
$$ 372599 374915 377808 380965 384004 387081 390501 394311 398703 404295 411410 419503 427902 436880 447355
63236D47355J2292J3531J4231J5026J6043J6846J7274J7681J8285J8818J9002
$$ 447355 459647 473178 487409 502435 518478 535324 552598 570279 588564 607382 626384
63225F26384J8995J9147J9463J9610J9437J9343J9932K1268K2639K3189K2687
$$ 626384 645379 664526 683989 703599 723036 742379 762311 783579 806218 829407 852094
63214H52094K1470J9808J7616J4793J1534Q129M643R25l152p403j1288j4225j6198
$$ 852094 873564 893372 910988 925781 937315 945444 950087 951012 947860 940457 929169 914944 898746
63201H98746j7869j9726k1296k1683k0860j9757j8889j7589j5103j1863q984o700
$$ 898746 880877 861151 839855 818172 797312 777555 758666 741077 725974 714111 705127 698427
63189F98427m169q29K700N469P417R402J2067J5112J7656J9172K0004K0905K2096
$$ 698427 694258 693429 696129 701598 709015 718417 730484 745596 763252 782424 802428 823333 845429
63176H45429K2971K2970K2545K2797K4046K5214K5035K3473K1551J9962J8348
$$ 845429 868400 891370 913915 936712 960758 985972 1011007 1034480 1056031 1075993 1094341
63165A094341J5952J2429P896K679k719p793j2457j7038k1630k5678k8607l0549
$$ 1094341 1110293 1122722 1130618 1133297 1130578 1122785 1110328 1093290 1071660 1045982 1017375 986826
63153I86826l2074l3374l4124l4074l3254l1673k9319k6576k4143k2378k1003
$$ 986826 954752 921378 887254 853180 819926 788253 758934 732358 708215 685837 664834
63142F64834j9587j8009j6309j4498j2710j1232j0138r156q061o954n974n082
$$ 664834 645247 627238 610929 596431 583721 572489 562351 553195 545134 538180 532206 527124
63130E27124m294l749l364k770j869j041n63j92L03O60O23N50R38J665K220K413
$$ 527124 522830 519081 515717 512947 511078 510037 509474 509282 509585 510245 510868 511418 512356 514021 516241 518654
63114E18654K318J762N95o53j137p09j2L85L93K1o49j096p28J35M37k19r92j044
$$ 518654 520972 522734 523329 522676 521539 520830 520818 521203 521596 521617 520968 519872 519144 519279 519716 519497 518505 517461
63096E17461o18m38n58m78m2M22O84Q34J015J298J730K142K157J649J098J145
$$ 517461 516843 516405 515847 515369 515327 515749 516433 517267 518282 519580 521310 523452 525609 527258 528356 529501
63080E29501J941L103M130M583M275L695L895N250O681O821N870N414O277P501
$$ 529501 531442 534545 538675 543258 547533 551228 555123 560373 567054 573875 579745 585159 591436 598937
63066E98937P932P873Q393R590J0599J1213J2376J4814J7967K0768K2912K4739
$$ 598937 606869 614742 623135 632725 643324 654537 666913 681727 699694 720462 743374 768113
63054G68113K6430K7962K9698L2224L5469L8558M0727M1954M2584M2846M3013
$$ 768113 794543 822505 852203 884427 919896 958454 999181 1041135 1083719 1126565 1169578
63043A169578M3517M4469M5336M5592M5431M5448M5822M6273M6675M7134M7468
$$ 1169578 1213095 1257564 1302900 1348492 1393923 1439371 1485193 1531466 1578141 1625275 1672743
63032A672743M7164M5865M3458L9603L3797K6224J7978R994K088o489j5742k4684
$$ 1672743 1719907 1765772 1809230 1848833 1882630 1908854 1926832 1936826 1938914 1932425 1916683 1891999
63020A891999l2357l8661m3937m8138n0693n1208n0027m7918m5278m1799l7099
$$ 1891999 1859642 1820981 1777044 1728906 1678213 1627005 1576978 1529060 1483782 1441983 1404884
63009A404884l1505k5912k0833j5893j0455m478J499P108J2458J7664K2431K6421
$$ 1404884 1373379 1347467 1326634 1310741 1300286 1295808 1297307 1304415 1316873 1334537 1356968 1383389
62997A383389K9775L2909L5819L8032L9381M0511M2202M4375M6129M6746M6243
$$ 1383389 1413164 1446073 1481892 1519924 1559305 1599816 1642018 1686393 1732522 1779268 1825511
62986A825511M4945M2881L9827L5590L0045K3149J5146O574k221j1372k1115l1206
$$ 1825511 1870456 1913337 1953164 1988754 2018799 2041948 2057094 2063668 2061447 2050075 2028960 1997754
62974A997754m0874m9266n5881o0779o4444o7226o8846o8809o7262o4947o2266
$$ 1997754 1956880 1907614 1851733 1790954 1726510 1659284 1590438 1521629 1454367 1389420 1327154
62963A327154n9015n5289n1821m8906m5833m2094l8455l5836l3782l1236k8396
$$ 1327154 1268139 1212850 1161029 1112123 1066290 1024196 985741 949905 916123 884887 856491
62952H56491k6412k5414k4281k2547k1068k0361j9628j8116j6307j4902j3666
$$ 856491 830079 804665 780384 757837 736769 716408 696780 678664 662357 647455 633789
62941F33789j2192j0963j0613j0710j0416r816r504r214q102o337n242n497o201
$$ 633789 621597 610634 600021 589311 578895 569079 559575 550361 542259 535922 530680 525183 518982
62928E18982o171n401m668m193l464k313j501j856l067l824l408k679k937m057
$$ 518982 512811 507410 502742 498549 495085 492772 491271 489415 486348 482524 479116 476437 473500 469443
62914D69443m529l486j822q81q03r00j031j606k480k811k208j255p72r96j569
$$ 469443 464914 461428 459606 458725 457922 457022 455991 454385 451905 449094 446886 445631 444859 443863 442294
62899D42294j894j490m90K20j51j289k077j934j262n19L74J488K352K467J966
$$ 442294 440400 438910 438420 438640 438489 437200 435123 433189 431927 431408 431782 433270 435622 438089 440055
62884D40055J343Q61N75O14R84J327J308J103J065J045N56l94j103j040n24l05
$$ 440055 441398 442259 442834 443448 444432 445759 447067 448170 449235 450280 450836 450442 449339 448299 447775 447470
62868D47470o24j022j016o89n94j091j865k155j547m83K14L71O24J415K173K042
$$ 447470 446846 445824 444808 444119 443525 442434 440569 438414 436867 436384 436598 436969 437593 439008 441181 443223
62852D43223J119L14O7j8j25K46J211J767J039l03q60m20pj97m64m38n90j231
$$ 443223 444342 444656 444723 444705 444580 444826 446037 447804 448843 448540 447680 447260 447253 447056 446592 446154 445564 444333
62834D44333j744j480o96l4M27Q96J187R66M32J16K04M46N92N24K69J91Q03K045
$$ 444333 442589 441109 440413 440379 440806 441702 442889 443855 444287 444403 444607 445053 445645 446169 446438 446629 447432 449477
62816D49477L127L457L348L353L421L260L081L276L704L939M033M424N246O254
$$ 449477 452604 456061 459409 462762 466183 469443 472524 475800 479504 483443 487476 491900 497146 503400
62802E03400P185P714P445O577O215P216Q988J0258J0790J1429J2645J4098J5699
$$ 503400 510585 518299 525744 532321 538536 545752 554740 564998 575788 587217 599862 613960 629659
62789F29659J7966K0988K3947K6219K8306L1225L5373M0346M5446N0082N4036
$$ 629659 647625 668613 692560 718779 747085 778310 813683 854029 899475 949557 1003593
62778A003593N7589O1198O4888O8227P0761P2206P2256P0716O7724O3355N7107
$$ 1003593 1061182 1122380 1187268 1255495 1326256 1398462 1470718 1541434 1609158 1672513 1729620
62767A729620M8438L7753K6236J4771L573p213j7393k7135l6604m5150n1747n6338
$$ 1729620 1778058 1815811 1842047 1856818 1860391 1853178 1835785 1808650 1772046 1726896 1675149 1618811
62755A618811n9745o2198o3101o2576o1819o1345o0052n6979n2910m9155m5730
$$ 1618811 1559066 1496868 1433767 1371191 1309372 1248027 1187975 1130996 1078086 1028931 983201
62744I83201m1957l8116l5081l2678k9841k6320k3027k0600j8684j6823j5111
$$ 983201 941244 903128 868047 835369 805528 779208 756181 735581 716897 700074 684963
62733F84963j3686j2305j0790r272p848o475n303m533l866k721j111L07J226K114
$$ 684963 671277 658972 648182 638910 631062 624587 619284 614751 610885 608164 607053 607360 608586 610700
62719F10700L387M780N880O809P932R321J0811J2283J3633J4833J6338J8965K2868
$$ 610700 614087 618867 624747 631556 639488 648809 659620 671903 685536 700369 716707 735672 758540
62706G58540K7002L0207L2741L6061M1052M7024N2692N7599O2208O6908P1509
$$ 758540 785542 815749 848490 884551 925603 972627 1025319 1082918 1145126 1212034 1283543
62695A283543P5670P9258Q2070Q3566Q3250Q1050P6966P0542O1258M9463L6411
$$ 1283543 1359213 1438471 1520541 1604107 1687357 1768407 1845373 1915915 1977173 2026636 2063047
62684B063047K3141R726m082j7941l1028m2779n2999o1402o7701p2093p5134p6937
$$ 2063047 2086188 2095914 2091832 2073891 2042863 2000084 1947085 1885683 1817982 1745889 1670755 1593818
62672A593818p6922p4768p1230o7620o4514o1365n7486n3049m8828m5164m1615
$$ 1593818 1516896 1442128 1370898 1303278 1238764 1177399 1119913 1066864 1018036 972872 931257
62661I31257l7768l3933l0722k8156k5725k3232k1101j9711j8835j7946j6783
$$ 931257 893489 859556 828834 800678 774953 751721 730620 710909 692074 674128 657345
62650F57345j5398j3960j2675j1665j0715r458p956o770o214n947n570n210n081
$$ 657345 641947 627987 615312 603647 592932 583474 575518 568748 562534 556587 551017 545807 540726
62637E40726m925m424l857l703l770l398k492j726j598j848j954j742j360j012
$$ 540726 535801 531377 527520 523817 520047 516649 514157 512431 510833 508985 507031 505289 503929 502917
62623E02917q47q71q37n38j61n2r7J90R56J792K334K675L027L380L657L893M127
$$ 502917 502070 501199 500362 499824 499663 499611 499514 499704 500660 502452 504786 507461 510488 513868 517525 521418 525545
62606E25545M409M990O098P478Q640R656J1209J3597J6288J8738K1114K3760K6501
$$ 525545 529954 534944 541042 548520 557160 566816 578025 591622 607910 626648 647762 671522 698023
62593F98023K8995L1340L3701L5630L6421L5894L4313L1738K8097K3765J9314
$$ 698023 727018 758358 792059 827689 864110 900004 934317 966055 994152 1017917 1037231
62582A037231J4712R423L411k592q028j3055j7882k2077k5021k6726k7774k8628
$$ 1037231 1051943 1061366 1064777 1062185 1054157 1041102 1023220 1001143 976122 949396 921622 892994
62570H92994k9251k9331k8709k7614k6604k5988k5298k3641k0816j7783j5708
$$ 892994 863743 834412 805703 778089 751485 725497 700199 676558 655742 637959 622251
62559F22251j4702j3843j2362j0514r159q683q476p644o122m844m548m799m636
$$ 622251 607549 593706 581344 570830 561671 552988 544512 536868 530746 525902 521354 516555 511919
62546E11919l943l452l426l194k302j318q74o09J66J228J759J623J465J590J705
$$ 511919 507976 504524 501098 497904 495602 494284 493410 492801 492967 494195 495954 497577 499042 500632 502337
62531E02337J771K303L504M809N706O452P619R328J1324J3381J5336J7025J8507
$$ 502337 504108 506411 509915 514724 520430 526882 534501 543829 555153 568534 583870 600895 619402
62518F19402K0173K2421K5423K9190L3461L7461M0359M2172M3740M5458M6546
$$ 619402 639575 661996 687419 716609 750070 787531 827890 870062 913802 959260 1005806
62507A005806M5933M3419L9548L4758K9202K3039J6443R504K441m349j0770j7015
$$ 1005806 1051739 1095158 1134706 1169464 1198666 1221705 1238148 1247652 1250093 1245744 1234974 1217959
62495A217959k2785k7095k9475l0720l1629l1606k9577k5956k2473j9985j7708
$$ 1217959 1195174 1168079 1138604 1107884 1076255 1044649 1015072 989116 966643 946658 928950
62484I28950j4848j1937r956r049q665q419q193p966q054r087j1152j3352j4709
$$ 928950 914102 902165 892209 883160 874495 866076 857883 849917 841863 832776 821624 808272 793563
62471G93563j5269j5827j6832j8079j9174j9773j9572j8616j7606j7307j7587
$$ 793563 778294 762467 745635 727556 708382 688609 669037 650421 632815 615508 597921
62460E97921j7459j6265j4393j2633j1213r799q217o737n587m649l804l272l270
$$ 597921 580462 564197 549804 537171 525958 516159 507942 501205 495618 490969 487165 483893 480623
62447D80623l451l196k447j740j291o07O10J698J786J004L20K96N18L21n24j755
$$ 480623 477172 473976 471529 469789 468498 467891 468501 470199 471985 472989 473309 473605 474123 474444 473920 472165
62431D72165k815l116k630k147k452l319l876l912m016m375m329l431k256j701
$$ 472165 469350 466234 463604 461457 459005 455686 451810 447898 443882 439507 435178 431747 429491 427790
62417D27790j963k553k911k752k258k080k625l273k949j622m40j16j74j53m13
$$ 427790 425827 423274 420363 417611 415353 413273 410648 407375 404426 402804 402364 402248 402074 401921 401508
62402D01508j029r48N64K464L134K568K099K333K703K875L230L724L638K855K344
$$ 401508 400479 399531 400095 402559 405693 408261 410360 412693 415396 418271 421501 425225 428863 431718 434062
62387D34062K798L695M260M615N309O343P294P985Q406Q293P446O255N425N243
$$ 434062 436860 440555 444815 449430 454739 461082 468376 476361 484767 493060 500506 506761 512186 517429
62373E17429N548O203P077P724P734P533Q255J0464J3469J6245J8709K1438K4400
$$ 517429 522977 529180 536257 543981 551715 559248 567503 577967 591436 607681 626390 647828 672228
62360F72228K6823K8570L0756L4315L8473M1452M2471M2129M1025L9068L6276
$$ 672228 699051 727621 758377 792692 831165 872617 915088 957217 998242 1037310 1073586
62349A073586L3134K9619K4889J8690J2292P111K977j324o254j1283j6097k0805
$$ 1073586 1106720 1136339 1161228 1179918 1192210 1199321 1202298 1200974 1194720 1183437 1167340 1146535
62337A146535k5011k7783k8862k9118k9529l0197l0613l0248k8828k6615k4561
$$ 1146535 1121524 1093741 1064879 1035761 1006232 976035 945422 915174 886346 859731 835170
62326H35170k3602k3545k3195k1793j9843j8369j7817j7905j8040j7677j6635
$$ 835170 811568 788023 764828 743035 723192 704823 687006 669101 651061 633384 616749
62315F16749j5276j4052j2871j1390r895r159r243r188q226o660n191m012l051
$$ 616749 601473 587421 574550 563160 553265 544106 534863 525675 517449 510789 505598 501586 498535
62302D98535k455k173j541q4J530K072J294K87J55P96J245R16K79K60J129K126
$$ 498535 496080 493907 492366 492282 493812 495884 497178 497465 497620 498416 499661 500577 500856 501116 502245 504371
62286E04371K383J962J631J758J953J913J938K288K571K336J878J890K488L166
$$ 504371 506754 508716 510347 512105 514058 515971 517909 520197 522768 525104 526982 528872 531360 534526
62272E34526L632M167N156O606Q228R743J1101J2562J4535J7135K0037K2945K6001
$$ 534526 538158 542325 547481 554087 562315 572058 583159 595721 610256 627391 647428 670373 696374
62259F96374K9497L3357L7186M0676M3513M5070M4792M2972M0633L8332L5447
$$ 696374 725871 759228 796414 837090 880603 925673 970465 1013437 1054070 1092402 1127849
62248A127849L0975K4781J7832J1228N379p8n749j1931j8279k3963k8340l1537
$$ 1127849 1158824 1183605 1201437 1212665 1218044 1217966 1212217 1200286 1182007 1158044 1129704 1098167
62236A098167l4172l6500l8088l8492l7932l6943l5617l3689l1324k9118k7215
$$ 1098167 1063995 1027495 989407 950915 912983 876040 840423 806734 775410 746292 719077
62225G19077k5008k2130j9229j7130j5621j3782j1405r301q112p461o631n501
$$ 719077 694069 671939 652710 635580 619959 606177 594772 585471 577359 569898 563267 557766
62213E57766m467l709l001k097j014J01J182K288L520M845O025O872P491Q173
$$ 557766 553299 549590 546589 544492 543478 543579 544761 547049 550569 555414 561439 568311 575802 583975
62199E83975R086J0205J1403J2423J2870J2601J2032J1766J1828J1727J1217J0633
$$ 583975 593061 603266 614669 627092 639962 652563 664595 676361 688189 699916 711133 721766
62187G21766J0312J0059R358P956O089M247K805J678M28j162k697l605l809l557
$$ 721766 732078 742137 751495 759451 765540 769787 772592 774270 774698 773536 770839 767234 763425 759868
62173G59868k781j147J355M365P752J1636J5796J9595K2701K5280K7337K8430
$$ 759868 757087 755940 757295 761660 769412 781048 796844 816439 839140 864420 891757 920187
62161I20187K8288K7169K5317K2663J9282J5659J2084Q362M400M96l331p634j2548
$$ 920187 948475 975644 1000961 1023624 1042906 1058565 1070649 1079011 1083411 1083907 1080576 1072942 1060394
62148A060394j7103k0241k2152k3815k5599k6978k7455k6975k5556k3250k0536
$$ 1060394 1043291 1023050 1000898 977083 951484 924506 897051 870076 844520 821270 800734
62137H00734j8111j6193j4452j2739j1332j0354r340p691n364k957j162o0R73
$$ 800734 782623 766430 751978 739239 727907 717553 708213 700522 695158 692201 691039 690979 691952
62124F91952K589M682O623Q290J0322J2982J5333J6088J4987J2830J0518Q596
$$ 691952 694541 699223 705846 714136 724458 737440 752773 768861 783848 796678 807196 815792
62112H15792P372O775O123M706K576K95j879m040o041p572q687r520r573q173
$$ 815792 823164 829939 836062 840768 843344 843639 841760 837720 831679 824107 815420 805900 796327 788154
62098G88154n762l757k833k029j61K564M904O199O939P924R297J0570J1328J1751
$$ 788154 782392 778635 775802 773773 773612 776176 781080 787279 794218 802142 811439 822009 833337 845088
62084H45088J2417J3587J4925J6066J7147J8414J9606K0306K0720K1423K2323
$$ 845088 857505 871092 886017 902083 919230 937644 957250 977556 998276 1019699 1042022
62073A042022K2688K2315K1853K1711K1346K0202J8652J7471J6807J6281J5672
$$ 1042022 1064710 1087025 1108878 1130589 1151935 1172137 1190789 1208260 1225067 1241348 1257020
62062A257020J4907J3709J1901R879Q176O714N002K952R31r49k985n293p585r716
$$ 1257020 1271927 1285636 1297537 1307416 1315592 1322306 1327308 1330260 1331191 1330242 1327257 1321964 1314379 1304663
62048A304663j1938j4448j7033j9427k1729k4175k6666k8790l0197l0813l0724
$$ 1304663 1292725 1278277 1261244 1241817 1220088 1195913 1169247 1140457 1110260 1079447 1048723
62037A048723l0041k9003k7965k7144k6303k4886k2684k0271j8480j7460j6592
$$ 1048723 1018682 989679 961714 934570 908267 883381 860697 840426 821946 804486 787894
62026G87894j5440j4350j3781j3486j2867j1946j1394j1565j2018j2170j1945
$$ 787894 772454 758104 744323 730837 717970 706024 694630 683065 671047 658877 646932
62015F46932j1602j1160j0404r212p702o086m551l187j866l26J472L167M396N208
$$ 646932 635330 624170 613766 604554 596852 590766 586215 583028 581162 580836 582308 585475 589871 595079
62001E95079N939O603O718N867M305K851K032J495L62j715m084n818o768p575
$$ 595079 601018 607621 614339 620206 624511 627362 629394 630889 631251 629536 625452 619634 612866 605291
61987F05291q679r764j0333j0456j0546j0647j0449r899r324q886q320p370o141
$$ 605291 596612 586848 576515 566059 555513 544866 534417 524518 515194 506308 497988 490618 484477
61974D84477m828l477k234j477j384j562j484j107p10k94M12J485K733M024N266
$$ 484477 479649 476172 473938 472461 471077 469515 468031 466924 466214 465920 466332 467817 470550 474574 479840
61959D79840O076O091N718N994P332Q900R614R453R308R851J1012J2499J4227
$$ 479840 485916 492007 497725 503719 511051 519951 529565 539018 548326 558177 569189 581688 595915
61946E95915J6204J8381K0716K3138K5366K7135K8541K9899L1192L2101L2668
$$ 595915 612119 630500 651216 674354 699720 726855 755396 785295 816487 848588 881256
61935H81256L3403L4408L4858L3905L1824K9714K8007K5931K2649J8344J3844
$$ 881256 914659 949067 983925 1017830 1049654 1079368 1107375 1133306 1155955 1174299 1188143
61924A188143R498N033M30l619o351p718q336q721q705p530m498K75N743J0683
$$ 1188143 1197641 1202674 1203104 1199485 1193134 1185416 1177080 1168359 1159654 1152124 1147626 1147901 1153644 1164327
61910A164327J4611J7801K0482K2443K3447K3547K2671K0359J6405J1479O536
$$ 1164327 1178938 1196739 1217221 1239664 1263111 1286658 1309329 1329688 1346093 1357572 1364108
61899A364108J678l749r919j5995k1043k4978k8232l0866l2495l2933l2561l1946
$$ 1364108 1365786 1362037 1352118 1336123 1315080 1290102 1261870 1231004 1198509 1165576 1133015 1101069
61887A101069l1290l0379k8974k7296k5901k5091k4545k3750k2620k1420k0218
$$ 1101069 1069779 1039400 1010426 983130 957229 932138 907593 883843 861223 839803 819585
61876H19585j8858j7384j5990j4485j2382r706p257n724m928m140k805p01K188
$$ 819585 800727 783343 767353 752868 740486 730780 723523 717799 712871 708731 705926 705225 707413
61863G07413N502Q594J1174J3684J6696K0180K3764K7408L1343L5546L9734M3800
$$ 707413 712915 721509 732683 746367 763063 783243 807007 834415 865758 901304 941038 984838
61851I84838M7783N1509N4645N6984N8330N8277N6569N3484M9349M3833L6414
$$ 984838 1032621 1084130 1138775 1195759 1254089 1312366 1368935 1422419 1471768 1515601 1552015
61840A552015K7612J8954J1458M805j585p268j1156j2779j2497j0625p108k164
$$ 1552015 1579627 1598581 1610039 1614844 1613259 1605991 1594835 1582056 1569559 1558934 1551826 1549662
61828A549662L364Q639J3371J7439K0242K1010J9651J6793J2889P733J050o828
$$ 1549662 1553026 1561665 1575036 1592475 1612717 1633727 1653378 1670171 1683060 1690793 1691843 1685015
61816A685015j5211k3600l1612l8636m4082m7931n0587n2264n2962n2819n1928
$$ 1685015 1669804 1646204 1614592 1575956 1531874 1483943 1433356 1381092 1328130 1275311 1223383
61805A223383m9950m6665m2906m0019l8157l6039l2820k9285k6556k4453k2081
$$ 1223383 1173433 1126768 1083862 1043843 1005686 969647 936827 907542 880986 856533 834452
61794H34452j9458j7422j6209j5176j3914j2700j1709j0661r457q508q090p895
$$ 834452 814994 797572 781363 766187 752273 739573 727864 717203 707746 699238 691148 683253
61782F83253p491o836o149n588n268n239n301n048m293l269k480k321k758l197
$$ 683253 675762 668926 662777 657189 651921 646682 641381 636333 632040 628771 626291 623970 621212 618015
61768F18015k943k017j187q44l56Q77K186K359J387N19N19Q33P20L39K52M99O89
$$ 618015 615072 613055 611868 611024 610668 611545 613731 616090 617477 617996 618515 619348 620068 620407 620659 621158 621847
61751F21847N55K4q54j763k281k431k670l081l150k579j826j427j258r33m84j90
$$ 621847 622402 622426 621572 619809 617528 615097 612427 609346 606196 603617 601791 600364 599106 598173 597689 597499
61735E97499M1N54J416K303K845K849K459K201K552L219L342K716K277K887M125
$$ 597499 597540 598094 599510 601813 604658 607507 609966 612167 614719 617938 621280 623996 626273 629160 633285
61720F33285M903M929M760M704M475L938L324K578J258n57j950k254j955k020
$$ 633285 638188 643117 647877 652581 657056 660994 664318 666896 668154 667597 665647 663393 661438 659418
61706F59418k657l319l742m227m884n272n101m793m911n296n258m545l686l326
$$ 659418 656761 653442 649700 645473 640589 635317 630216 625423 620512 615216 609958 605413 601727 598401
61692E98401l572m016m135l629k632j664j206j260j559k080k845l362k924j699
$$ 598401 594829 590813 586678 583049 580417 578753 577547 576287 574728 572648 569803 566441 563517 561818
61678E61818q26j026j711j981j865j940k257k472k630k958l068k307r07N9n8r13
$$ 561818 560992 559966 558255 556274 554409 552469 550212 547740 545110 542152 539084 536777 535870 535929 535871 534958
61662E34958j878k638l010k823k227j581j024n57l76n33m80K73J249J695J922
$$ 534958 533080 530442 527432 524609 522382 520801 519777 519220 518844 518311 517831 518104 519353 521048 522970
61647E22970K847M213M735M246M119M960N397M183K206J049N74n00k258l486l692
$$ 522970 525817 530030 534765 539011 543130 548090 553487 557670 559876 560925 561499 560999 558741 555255 551563
61632E51563l772m418n134n228m840m484m235l771k878j635l58M83O02K36m7J0
$$ 551563 547791 543373 538239 533011 528171 523687 519452 515681 512803 511168 510810 511293 511895 512131 512084 512094
61616E12094J44o8q09j887k860l425l768m314n037n437n431n707o787q129q763
$$ 512094 512238 512170 511361 509474 506614 503189 499421 495107 490070 484633 479202 473495 466708 458579 449816
61601D49816q475p886p524p365p143o602n654m595l995l954l788k993k083j835
$$ 449816 441341 433455 425931 418566 411423 404821 399167 394572 390577 386623 382835 379842 377759 375924
61587C75924k073k036j713j913k879l730l602k713j969j878k181k281j897j334
$$ 375924 373851 371815 370102 368189 365310 361580 357978 355265 353296 351418 349237 346956 345059 343725
61573C43725j148j370j368p82j90l24r01r98m18Q1rl12l54k46l23n96q60r50o41
$$ 343725 342577 341207 339839 339057 338867 338543 337642 336644 336226 336307 336298 335986 335632 335386 335063 334467 333607 332657 332016
61554C32016J49R39J031M71J19M54R10Q67O16P77J201J267R58Q49J109J275J211
$$ 332016 332165 333104 334135 334606 334725 335179 336089 336956 337572 338349 339550 340817 341775 342624 343733 345008 346219
61537C46219J533K663M006M589M211L433K584J450J5j142j580j649j917k293k272
$$ 346219 347752 350415 354421 359010 363221 366654 369238 370688 370703 369561 367981 366332 364415 362122 359850
61522C59850j853j532j456j285j003j121j724k060j570p71n20q45j137j118r47
$$ 359850 357997 356465 355009 353724 352721 351600 349876 347816 346246 345475 344955 344110 342973 341855 340908
61507C40908o33p0M40L78k59r43j327j463j390j039n91l98m87n31l44l3L61Q47
$$ 340908 340275 340205 340645 341023 340764 339821 338494 337031 335641 334602 334011 333613 333126 332595 332251 332218 332579 333426
61489C33426J222J221R57P44N56J81j45N1O64J021Q84P99J180J644J670J380J194
$$ 333426 334648 335869 336826 337570 338126 338307 338162 338213 338877 339898 340782 341581 342761 344405 346075 347455 348649
61472C48649J093P16j1p11r48n71J87Q33R10M25j82m93m57k64j22j37j83O8P24
$$ 348649 349742 350458 350447 349736 348788 348217 348404 349237 350147 350572 350390 349897 349440 349176 349054 348917 348734 348802 349526
61453C49526J353J471J293J480K113K497K180J675J700K206K643K904L414M330
$$ 349526 350879 352350 353643 355123 357236 359733 361913 363588 365288 367494 370137 373041 376455 380785
61439C80785N149N354N075M881N002N094M851M537M547M666M249L261K545K676
$$ 380785 385934 391288 396363 401244 406246 411340 416191 420728 425275 429941 434190 437451 439996 442672
61425D42672L154L201K950L111L791M394M549M385L906K871J435J28q70j837k786
$$ 442672 445826 449027 451977 455088 458879 463273 467822 472207 476113 478984 480419 480547 479677 477840 475054
61410D75054l339l516l817m294m377l931l652l923m115l660l014k771k523j616
$$ 475054 471715 468199 464382 460088 455711 451780 448128 444205 440090 436430 433416 430645 428122 426506
61396D26506n11l08j062j659j407p94m62l43j93k09n93r72q00j19N63R84J284
$$ 426506 425995 425687 424625 422966 421559 420765 420303 419960 419767 419558 418965 417993 417193 417074 417637 418621 419905
61379D19905J529J533J261J084J386K019K432K344K049K021K379K914L415L760
$$ 419905 421434 422967 424228 425312 426698 428717 431149 433493 435542 437563 439942 442856 446271 450031
61365D50031L787L391K747K264K227K687L509M384M891M935N060N939P520R139
$$ 450031 453818 457209 459956 462220 464447 467134 470643 475027 479918 484853 489913 495852 503372 512511
61351E12511J0408J1533J2645J3366J3370J2894J2358J1800J0987R836Q456P020
$$ 512511 522919 534452 547097 560463 573833 586727 599085 610885 621872 631708 640164 647184
61339F47184N855N298N243N087M395L257J760l32k873m909n701n853o506p588
$$ 647184 653039 658337 663580 668667 673062 676319 678079 677747 674874 669965 664264 658411 651905 644317
61325F44317p792o506m765l826l557k937j770r37j076j727k083j974j749j497
$$ 644317 636525 630019 625254 621428 617871 614934 613164 612227 611151 609424 607341 605367 603618 602121
61311F02121r30P6J278K517L950N583O948P592P669P601P250N961L566R05j009
$$ 602121 601191 601267 602545 605062 609012 614595 621543 629135 636804 644405 651655 657616 661182 662087 661078
61296F61078j980k513l031l591m227m989n583n425m383l169k711l090l483l096
$$ 661078 659098 656585 653554 649963 645736 640747 635164 629739 625356 622187 619476 616386 612903 609807
61282F09807k018r51k91K37J056K093K859L062K938K987L552M609N846O837P211
$$ 609807 607789 606838 606547 606784 607840 609933 612792 615854 618792 621779 625331 629940 635786 642623 649834
61267F49834O898O319O274P376R449J1665J3448J5005J6664J7988J8070J6754
$$ 649834 656732 663051 669325 676701 686150 697815 711263 726268 742932 760920 778990 795744
61255G95744J4881J3168J1414R088O195L094l9l050n529p289q828j0684j2495
$$ 795744 810625 823793 835207 844295 850490 853584 853545 850495 844966 837677 828849 818165 805670
61242H05670j3359j2992j1977j0936j0078r502r295r215q788p882o769n608m314
$$ 805670 792311 779319 767342 756406 746328 736826 727531 718316 709528 701646 694877 689269 684955
61229F84955k967j878j186q00o43o36m57J62R37J352J388J421J532J491J415J660
$$ 684955 681988 680110 678924 678124 677481 676845 676388 676550 677487 678839 680227 681648 683180 684671 686086 687746
61213F87746K051J964J331Q18Q13R00O25J64j24j37K42J318L077N009O744Q451
$$ 687746 689797 691761 693092 693910 694723 695623 696248 696412 696288 696151 696393 697711 700788 705797 712541 720992
61197G20992J0326J2203J3851J5205J6044J5986J5027J3645J2186J0656R253Q408
$$ 720992 731318 743521 757372 772577 788621 804607 819634 833279 845465 856121 865374 873782
61185H73782Q016P320N862M005K238O72n70j250j716k838m757o454p169p441q089
$$ 873782 881798 889118 894980 898985 901223 901895 901325 900075 898359 895521 890764 884310 877141 869700 861611
61170H61611q939r404r645j0180j0888j1268j1413j1794j2381j2790j3021j3261
$$ 861611 852672 843268 833623 823443 812555 801287 789874 778080 765699 752909 739888 726627
61158G26627j3156j2116j0217q104o126m272k726j682o96Q20K387K578P39k061
$$ 726627 713471 701355 691138 683034 676908 672636 669910 668228 667532 668352 670739 673317 674056 671995
61144F71995m164n077n612o560p662q073p602p021o887o582n088k538j67J329
$$ 671995 667831 662754 657142 650582 642920 634847 627245 620224 613337 606755 601667 599129 598962 600291
61130F00291K481L911N426O697P880R012R599R578R885J1256J3133J4547J5443
$$ 600291 602772 606683 612109 618806 626686 635698 645297 654875 664760 676016 689149 703696 719139
61117G19139J6262J6855J6940J6998J7580J8109J7619J6354J5452J5097J4279
$$ 719139 735401 752256 769196 786194 803774 821883 839502 855856 871308 886405 900684
61106I00684J2417J0120Q120O387M575K494j9k990n930q246j0086j2101j4378
$$ 900684 913101 923221 931341 937728 942303 944797 944778 941788 935858 927612 917526 905425 891047
61093H91047j6318j7574j8324j8543j7889j6439j4847j3620j2840j2567j2781
$$ 891047 874729 857155 838831 820288 802399 785960 771113 757493 744653 732086 719305
61082G19305j2861j1992j0292q764p957p408o591n660m956m412l860l290k639
$$ 719305 706444 694452 684160 675396 667439 660031 653440 647780 642824 638412 634552 631262 628623
61069F28623j706n62M41J152J699K071K128K105K534L506M572N416O109O709P140
$$ 628623 626917 626355 626796 627948 629647 631718 633846 635951 638485 641991 646563 651979 658088 664797 671937
61054F71937P607Q567J0164J2054J3808J5075J5679J5956J6738J8326J9846K0374
$$ 671937 679544 688111 698275 710329 724137 739212 754891 770847 787585 805911 825757 846131
61042H46131K0366K1007K2423K3696K4456K5307K6601K7934K9052L0189L1380
$$ 846131 866497 887504 909927 933623 958079 983386 1009987 1037921 1066973 1097162 1128542
61031A128542L2423L3549L5090L6504L6961L6986L8086M0623M3497M6263M9840
$$ 1128542 1160965 1194514 1229604 1266108 1303069 1340055 1378141 1418764 1462261 1508524 1558364
61020A558364N4660N9827O4953P1071P8763Q7087R5741J06755J22435J42872J67207
$$ 1558364 1613024 1672851 1737804 1808875 1887638 1974725 2070466 2177221 2299656 2442528 2609735
61009B609735J96405K33183K80376L41442M22095N29882O72866Q58753J089082
$$ 2609735 2806140 3039323 3319699 3661141 4083236 4613118 5285984 6144737 7233819
61000G233819J344731J575105J711722J706504J564409J339494J098870Q89628
$$ 7233819 8578550 10153655 11865377 13571881 15136290 16475784 17574654 18464282
60992A8464282P33058O35587N91477N73897N34826M27184K34045k1974k96984
$$ 18464282 19197340 19832927 20424404 20998301 21533127 21960311 22194356 22172382 21875398
60983B1875398n53820p77468r71205j142015j287679j394305j445334j434146
$$ 21875398 21321578 20544110 19572905 18430890 17143211 15748906 14303572 12869426
60975A2869426j369011j267072j145087j015469q87402p67816o60685n67057m86353
$$ 12869426 11500415 10233343 9088256 8072787 7185385 6417569 5756884 5189827 4703474
60966D703474m17307l58308l08208k66743k33365k06096j82492j61573j43607
$$ 4703474 4286167 3927859 3619651 3352908 3119543 2913447 2730955 2569382 2425775
60957B425775j28339j14708j02202r1283q2247p4789o8800o4477o1294n8057n4417
$$ 2425775 2297436 2182728 2080526 1989243 1906996 1832207 1763407 1698930 1637636 1579579 1525162
60946A525162n1363m9645m8560m6937m4622m2194l9857l7426l5069l3253l1916
$$ 1525162 1473799 1424154 1375594 1328657 1284035 1241841 1201984 1164558 1129489 1096236 1064320
60935A064320l0410k8386k6315k4855k3989k3050k1629k0067j8867j7862j6452
$$ 1064320 1033910 1005524 979209 954354 930365 907315 885686 865619 846752 828890 812438
60924H12438j4660j3339j3002j2966j2185j0559q870p681o923o391n990n487m651
$$ 812438 797778 784439 771437 758471 746286 735727 726857 719176 712253 705862 699872 694385 689734
60911F89734l662k912k369j670q10k32p5P8N35J097J448J634J823K011K151K352
$$ 689734 686072 683160 680791 679121 678311 678079 678004 678082 678617 679714 681162 682796 684619 686630 688781 691133
60895F91133K755L367M103M833N338N565N864O752Q335J0168J1679J2476J2389
$$ 691133 693888 697255 701358 706191 711529 717094 722958 729710 738045 748213 759892 772368 784757
60882G84757J1639J1054J1581J3289J5126J6025J6015J6036J6691J7551J7816
$$ 784757 796396 807450 819031 832320 847446 863471 879486 895522 912213 929764 947580
60871I47580J7383J6965J7082J7286J6736J5351J3932J3084J2521J1610J0104
$$ 947580 964963 981928 999010 1016296 1033032 1048383 1062315 1075399 1087920 1099530 1109634
60860A109634Q044N412K344o99l367n785q100j0043j1430j2719j4425j6267j7525
$$ 1109634 1117678 1123090 1125434 1124735 1121368 1115583 1107483 1097440 1086010 1073291 1058866 1042599 1025074
60847A025074j8115j8632j9437k0342k1149k1853k2282k2212k1827k1459k0870
$$ 1025074 1006959 988327 968890 948548 927399 905546 883264 861052 839225 817766 796896
60836G96896j9506j7612j6299j6203j6684j6746j6122j5032j3502j1500r442p907
$$ 796896 777390 759778 743479 727276 710592 693846 677724 662692 649190 637690 628248 620341
60824F20341o999o405n969n730n551n118m384l645l141k795k426j985j485r21
$$ 620341 613342 606937 600968 595238 589687 584569 580185 576540 573399 570604 568178 566193 564708 563787
60810E63787l89j35l07o55o74j04P94J543J926J994J765J178L55l91q83j213j468
$$ 563787 563398 563263 562956 562301 561627 561523 562317 563860 565786 567780 569545 570723 571078 570687 569804 568591 567123
60793E67123j588j560j472j292r17n57o10j002j125q32r10k053l728m742m760
$$ 567123 565535 563975 562503 561211 560294 559737 559127 558125 557000 556168 555258 553205 549477 544735 539975
60778E39975m575m892n473n623n113m402m195m776n601n705m772l579l054l156
$$ 539975 535400 530508 525035 519412 514299 509897 505702 500926 495325 489620 484848 481269 478215 475059
60764D75059l141k720k315k258k335k258k069j881j656j348r37k60Q49K173L208
$$ 475059 471918 469198 466883 464625 462290 460032 457963 456082 454426 453078 452141 451881 452730 454903 458111
60749D58111L712L865L851L649L278K910K626K327J953J554J188R53R86J215J201
$$ 458111 461823 465688 469539 473188 476466 479376 482002 484329 486282 487836 489024 489977 490963 492178 493379
60734D93379N98l53j193j889k673l373l490k990k433k250k385k700l177l591l538
$$ 493379 493977 493624 492431 490542 487869 484496 481006 478016 475583 473333 470948 468248 465071 461480 457942
60719D57942l060k786l199m049m674m657m060l301k906l073l477l681l690l755
$$ 457942 454882 452096 448897 444848 440174 435517 431457 428156 425250 422177 418700 415019 411329 407574
60705D07574l815l595l165k873k744k458j971j549j204o73m5K71K70L85O98P94
$$ 407574 403759 400164 396999 394126 391382 388924 386953 385404 384200 383527 383482 383753 384023 384408 385106 385900
60689C85900O38P93J449J957J854J614J904K617L264L764M291M727M896M981N079
$$ 385900 386538 387331 388780 390737 392591 394205 396109 398726 401990 405754 410045 414772 419668 424649 429728
60674D29728M790L866K998L166M307N289N229M299L207K461K220K429K798K875
$$ 429728 434518 438384 441382 444548 448855 454144 459373 463672 466879 469340 471560 473989 476787 479662
60660D79662K370J367L56j0O00J690K267J942J471J746K477K441J038r21k217
$$ 479662 482032 483399 483755 483745 484345 486035 488302 490244 491715 493461 495938 498379 499417 498496 496279
60645D96279k588k786l432m300m756m718m772n353o119o405o042n382m655l792
$$ 496279 493691 490905 487473 483173 478417 473699 468927 463574 457455 451050 445008 439626 434971 431179
60631D31179k915k416k383k390k052j453p94r5M64M13l29j042j009m42r7j35n6
$$ 431179 428264 425848 423465 421075 419023 417570 416776 416681 417145 417558 417229 416187 415178 414736 414639 414504 414448
60614D14448L66P06N61J45j04p7N3J82K94K39j92r17j421j168k25O46P46K34p2
$$ 414448 414814 415520 416081 416226 416122 416045 416098 416280 416574 416813 416621 415704 414283 413115 412890 413536 414282 414516 414444
60595D14444L01R61J241J017O50M85O34J029J385J278O50P4J48O66Q60M50qL8
$$ 414444 414745 415706 416947 417964 418614 419099 419733 420762 422147 423425 424075 424149 424297 424963 425823 426273 426265 426303
60577D26303L61L54K2J59J420L375M759M727L875L691M990P062Q511Q697Q108
$$ 426303 426664 427018 427040 427199 428619 431994 436753 441480 445355 449046 454036 461098 469609 478306 486414
60562D86414P512P123O683N900M668L090J535M87Q9j13o53j448j824j352k74R25
$$ 486414 493926 501049 507732 513632 518300 521390 522925 523412 523501 523388 522735 521287 519463 518111 517837 518762
60546E18762K144L533N055O550Q109R943J1916J3641J5016J6194J6917J6477J4582
$$ 518762 520906 524439 529494 536044 544153 554096 566012 579653 594669 610863 627780 644257 658839
60533F58839J1773Q702N572K615M33q08j974l855n888o910o936p034p430o969
$$ 658839 670612 679314 684886 687501 687934 687126 685152 681297 675409 668499 661563 654529 647099 640130
60519F40130m929k376r89j100j616j497o73K67Q27J009J289K116L374M604N732
$$ 640130 635201 632825 631836 630736 629120 627623 626950 627217 628044 629053 630342 632458 635832 640436 646168
60504F46168P203R261J1619J4041J6808K0199K3956K7611L1055L4387L7453L9881
$$ 646168 653371 662632 674251 688292 705100 725299 749255 776866 807921 842308 879761 919642
60492I19642M1274M1114L8723L3816K6937J9018J0675K114o424j4492k1649k7659
$$ 919642 960916 1002030 1040753 1074569 1101506 1120524 1131199 1133313 1126889 1112397 1090748 1063089
60480A063089l2540l6431l9237m0471l9795l7724l5278l2893l0222k7196k4448
$$ 1063089 1030549 994118 954881 914410 874615 836891 801613 768720 738498 711302 686854
60469F86854k2349k0370j8048j5929j4721j4010j2745j0768q913p686o745n869
$$ 686854 664505 644135 626087 610158 595437 581427 568682 557914 549001 541315 534570 528701
60457E28701n496n901o495o458n739m977m530m042l002j578n94o12j126j110l44
$$ 528701 523205 517304 510809 504351 498612 493635 489105 485063 482061 480483 479889 479277 478151 477041 476697
60442D76697K29k09j225j783j676j578j826j926j477r28r68j551j958j640p51
$$ 476697 476926 476717 475492 473709 472033 470455 468629 466703 465226 464298 463330 461779 459821 458181 457430
60427D57430Q3L40Jm63n18j00K68j3r64j878j901q93L89J080J151J253J679J962
$$ 457430 457513 457853 457854 457391 456873 456773 457041 457028 456064 454186 452285 451392 451781 452861 454012 455265 456944 458906
60409D58906J727J411J573J893J500K83q33j070o77l10n7M30J138J626J752J895
$$ 458906 460633 462044 463617 465510 467010 467293 466460 465390 464713 464403 464346 464776 465914 467540 469292 471187
60393D71187K273K522K294J932K053K598K892K634K316K386K584K482K233K256
$$ 471187 473460 475982 478276 480208 482261 484859 487751 490385 492701 495087 497671 500153 502386 504642
60379E04642K499K572K432K326K218J879J474J370J431J153O03M75J058J761J935
$$ 504642 507141 509713 512145 514471 516689 518568 520042 521412 522843 523996 524599 525074 526132 527893 529828
60364E29828J599J075N30J56K42P50J272J673K293L232M084M674N420O557P594
$$ 529828 531427 532502 533032 533188 533430 534180 535452 537125 539418 542650 546734 551408 556828 563385 570979
60349E70979Q015Q002P933P716P132O335N412L975J777o39k566l949m997n470
$$ 570979 578994 586996 594929 602645 609777 616112 621524 625499 627276 626637 624071 620122 615125 609655
60335F09655n072m307m056m464m876m811m383l892l507l301l184k931k574k523
$$ 609655 604583 600276 596220 591756 586880 582069 577686 573794 570287 566986 563802 560871 558297 555774
60321E55774k906l202k977k491k112j595o63K31N04M23O68J254J790K520M175
$$ 555774 552868 549666 546689 544198 542086 540491 539828 540059 540563 540986 541654 542908 544698 547218 551393
60306E51393O800R653J2121J3994J4976J4794J3771J2495J0937Q694N949L209
$$ 551393 558193 567846 579967 593961 608937 623731 637502 649997 660934 669628 675577 678786
60294F78786K80l443p478j0259j1054j0921j1191j1820j1794j0637q935p692p475
$$ 678786 679066 675623 668145 657886 646832 635911 624720 612900 601106 590469 581534 573842 566367
60281E66367p946q092p247n873m837m145l173k056j815k743l650l225j593L9P36
$$ 566367 558421 550329 543082 537209 532372 528227 525054 522998 521183 518440 514790 511565 509972 510011 510747
60266E10747M28l42q29n72J46N59L22j83m82m75k18K24N73N01J27j85m81j010
$$ 510747 511175 510833 510004 509432 509578 510137 510459 510276 509794 509319 509101 509325 509898 510399 510526 510341 509860 508850
60248E08850j392r67p5N6r25j859j734j023o82p00n05o2L63R36J777K266J810
$$ 508850 507458 506491 506416 506472 505547 503688 501954 500931 500249 499549 499044 498982 499345 500281 502058 504324 506134
60231E06134J008J050K050K942L001K614K432K478K392K019J492J036Q71J048
$$ 506134 507142 508192 510242 513184 516185 518799 521231 523709 526101 528120 529612 530648 531519 532567
60217E32567J355J607J914K439L002L277L307L440L785M067M056L843L633L439
$$ 532567 533922 535529 537443 539882 542884 546161 549468 552908 556693 560760 564816 568659 572292 575731
60203E75731L104K478J626Q73O05R18J482J785J458M73p56j529j446q13k83j11
$$ 575731 578835 581313 582939 583812 584417 585335 586817 588602 590060 590533 589777 588248 586802 585989 585706 585595
60187E85595j15k70p02j123r17n3P36R44Q88R39Q17J64o65j013p55k49K00L24
$$ 585595 585480 585210 584508 583385 582468 582415 583151 584095 584983 585922 586739 586903 586238 585225 584470 584221 584421 584745
60169E84745j96j166j601p65O87J391R40J97n4M8J18K61P03J152J085N45K41P54
$$ 584745 584549 583383 581782 581017 581704 583095 584035 584232 584178 584226 584344 584605 585308 586460 587545 588090 588331 589085
60151E89085J818K557K444J884J639J809J783J296J023J738L207M404M675M273
$$ 589085 590903 593460 595904 597788 599427 601236 603019 604315 605338 607076 610283 614687 619362 623635
60137F23635L826L673L784M000M176M151L689K522O78j230k414k731k791l100
$$ 623635 627461 631134 634918 638918 643094 647245 650934 653456 654134 652904 650490 647759 644968 641868
60123F41868l436l389l077k904k862k595k013j445j210j335j639j818j621j167
$$ 641868 638432 635043 631966 629062 626200 623605 621592 620147 618937 617602 615963 614145 612524 611357
60109F11357r04j078j443j753k102k456k305j383l42j7j84J37J253K433L111L613
$$ 611357 610453 609375 607932 606179 604077 601621 599316 597933 597591 597574 597390 597527 598780 601213 604324 607937
60093F07937M399N300N928O365O865P223O971O109N224M833M853M758M110K929
$$ 607937 612336 617636 623564 629929 636794 644017 650988 657097 662321 667154 672007 676765 680875 683804
60079F83804J648O20k68j414k889m230m952n146n361o014p008p915q317q056p320
$$ 683804 685452 686072 685804 684390 681501 677271 672319 667173 661812 655798 648790 640875 632558 624502 617182
60064F17182o622o445o796p104o763n792m773m159l873l661l502l359k853j712
$$ 617182 610560 604115 597319 590215 583452 577660 572887 568728 564855 561194 557692 554333 551480 549768
60050E49768m31J23j45l18L10J231J413O73j07j10N11R42O76p9q70j576k309k880
$$ 549768 549337 549460 549315 548997 549307 550538 551951 552624 552517 552407 552918 553860 554536 554457 553587 552011 549702 546822
60032E46822k826k193j850k516l774m587m672m608m737m738m497m461m784m875
$$ 546822 543996 541803 539953 537437 533663 529076 524404 519796 515059 510321 505824 501363 496579 491704
60018D91704m295l479k956k532j864j299j274j360q12J73O38K07n09r13j054j116
$$ 491704 487409 483930 480974 478442 476578 475279 474005 472645 471833 472006 472644 472851 472342 471429 470375 469259
60002D69259j000o03p6L80O33N25J06n4O78K086L149L132K348J723J890K719L427
$$ 469259 468259 467656 467580 467960 468593 469118 469224 469170 469848 471934 475083 478215 480563 482286 484176 486895 490322
59985D90322L227K163J279J421K047J880O80l81l63K00K65k11m23o7K24k00j175
$$ 490322 493549 495712 496991 498412 500459 502339 503019 502638 502275 502475 502740 502529 502106 502039 502263 502063 500888
59968E00888j943j959j261k41P84J745K612L179L232K888K534K412K467K564K583
$$ 500888 498945 496986 495725 495484 496268 498013 500625 503804 507036 509924 512458 514870 517337 519901 522484
59953E22484K218J155l93j597j792j149l52J63L68K50k38q65j172r76n58k49r2
$$ 522484 524702 525857 525464 523867 522075 520926 520574 520737 521105 521355 521117 520252 519080 518104 517546 517297 517205
59936E17205%K7M9K41N44N22j16r61j336j137p91m43J84R63J155M75k06Q6J104
$$ 517205 517205 517232 517281 517522 518066 518588 518472 517511 516175 515038 514247 513804 513988 514951 516106 516581 516375 516461 517565
59917E17565J843K028K322L087L922M540N207N945O102N322M289L858L838L321
$$ 517565 519408 521436 523758 526845 530767 535307 540514 546459 552561 557883 562172 566030 569868 573189
59903E73189K039O97Pp4m2j81l40k37J97P41J182J575J996K176J803J170J010
$$ 573189 575228 575925 575932 575858 575816 575635 575295 575058 575255 575996 577178 578753 580749 582925 584728 585898 586908
59886E86908J495J921J700J214J220J883K721L223L059K131Q57R0K44O91N15l93
$$ 586908 588403 590324 592024 593238 594458 596341 599062 602285 605344 607475 608332 608422 608666 609357 609872 609479
59870F09479j420k129k509k552k219j747j485j419j341j319j554j876j893j553
$$ 609479 608059 605930 603421 600869 598650 596903 595418 593999 592658 591339 589785 587909 586016 584463
59856E84463j121o27J39J199K424L945N949P992R099Q786P627O610O168N889N140
$$ 584463 583342 582715 582854 584053 586477 590422 596371 604363 613462 622248 629875 636485 642653 648542 653682
59841F53682L868K809K656L040K769J348l58j381j908k672l616m174m460n110
$$ 653682 657550 660359 663015 666055 668824 670172 669814 668433 666525 663853 660237 656063 651603 646493
59827F46493o022o366n999n753o046o234n816n302n280n350m828l868l127k640
$$ 646493 640471 634105 628106 622353 616307 610073 604257 598955 593675 588325 583497 579629 576502 573862
59813E73862j920r71m26o23j124j331j127p82n27m05l29j73P0J35l20j211j892
$$ 573862 571942 570971 570545 569922 568798 567467 566340 565558 565031 564626 564297 564124 564194 564329 564009 562798 560906
59796E60906j794j117o59q32j214j258j081j092j142p13N3L39j70p93q90p36q46
$$ 560906 559112 557995 557336 556504 555290 554032 552951 551859 550717 550004 550057 550396 550226 549433 548543 547807 546961
59779E46961j104j165j125j116p61J54R13P44J20J78J080J890K084K063K122J975
$$ 546961 545857 544692 543567 542451 541690 541844 542757 543501 543621 543799 544879 546769 548853 550916 553038 555013
59763E55013J590J467J673J532P11q1j2Q48J855K572K815K527K124K414L604M764
$$ 555013 556603 558070 559743 561275 561986 561905 561893 562741 564596 567168 569983 572510 574634 577048 580652 585416
59747E85416M913M263L827L981M115L619K671J848J389J123J004J320K158K915
$$ 585416 590329 594592 598419 602400 606515 610134 612805 614653 616042 617165 618169 619489 621647 624562
59733F24562K777J808J055J214J694J526P77L46O32J175J423J216N01n72j290
$$ 624562 627339 629147 630202 631416 633110 634636 635413 635759 636391 637566 638989 640205 640706 640134 638844
59718F38844r51J19Q42P82N42P30J271J913K583L090L229L360L979M631M290L080
$$ 638844 637893 638012 638854 639636 640178 640908 642179 644092 646675 649765 652994 656354 660333 664964 669254 672334
59702F72334K447L119M006L874L039K527K394J965J083J37p26j566k193k475k738
$$ 672334 674781 677900 681906 685780 688819 691346 693740 695705 696788 696925 696199 694633 692440 689965 687227
59687F87227l111k999k022r45q09j505k152k521l073l840m359m651n232o071o481
$$ 687227 684116 681117 679095 678150 677341 675836 673684 671163 668090 664250 659891 655240 650008 643937 637456
59672F37456o245n989o114o134n469m317l338k841k612k317j776j066m92l73p06
$$ 637456 631211 625222 619108 612974 607505 603188 599850 597009 594397 592080 590304 589238 588746 588373 587667
59657E87667j131j169n62M86J397J717J649J701J791J223k36j819k757l174l478
$$ 587667 586536 585367 584805 585291 586688 588405 590054 591755 593546 594769 594533 592714 589957 586783 583305
59642E83305l474k787j762j124r87r42q66r16r54p64o38r19j200q69l11n60j727
$$ 583305 579831 577044 575282 574158 573171 572229 571363 570447 569493 568729 568091 567172 565972 565103 564792 564232 562505
59625E62505k833l217l134k776j924r44r40k158l220k884j777j416k046k522k087
$$ 562505 559672 556455 553321 550545 548621 547677 546737 544579 541359 538475 536698 535282 533236 530714 528627
59610E28627j198m66K51J332K548L159K716J588P24Q13J538J868J254L02p8J78
$$ 528627 527429 526963 527214 528546 531094 534253 536969 538557 539281 540094 541632 543500 544754 545056 544978 545156
59594E45156M68O37J177K266L297L639L390K989K512J795R73M13J44k41j055k170
$$ 545156 545624 546261 547438 549704 553001 556640 560030 563019 565531 567326 568299 568712 568856 568615 567560 565390
59578E65390l126l429k841j809j441k469m135m734l572j897j390k220l179l387
$$ 565390 562264 558835 555994 554185 552744 550275 546140 541406 537834 535937 534547 532327 529148 525761
59564E25761l059k669k191j511r08o81o78n04lO77J287J618J667J810K449L388
$$ 525761 522702 520033 517842 516331 515423 514742 514064 513560 513557 514234 515521 517139 518806 520616 523065 526453
59548E26453L996M172M678O130Q166J0032J1601J3239J4885J5895J5721J4278
$$ 526453 530449 534621 539299 545429 553595 563627 575228 588467 603352 619247 634968 649246
59536F49246J1794Q801O167M505L490K277P29l66l71M56J537K681L781M290L744
$$ 649246 661040 669841 676008 680513 684003 686280 687009 686643 686272 686728 688265 690946 694727 699017 702761
59521G02761K564J662J176K70j648l998n794o895p895q970r526r174q485q324
$$ 702761 705325 706987 708163 708433 706785 702787 696993 690098 682203 673233 663707 654533 646048 637724
59507F37724q763r119q896q193p264o204n159m446m140l877l253k335j505r98
$$ 637724 628961 619842 610946 602753 595489 589285 584126 579680 575540 571663 568410 566075 564570 563572
59493E63572p48o76q31j179j459j355q49k87k4n6j37j41j14O6O52J545K214K371
$$ 563572 562824 562148 561317 560138 558679 557324 556475 556188 556164 556108 555971 555830 555716 555782 556434 557979 560193 562564
59475E62564K378K622K868K638K017J493J246J141J227J642K110K232K223K632
$$ 562564 564942 567564 570432 573070 575087 576580 577826 578967 580194 581836 583946 586178 588401 591033
59461E91033L362L760L767M137N212O288O646O534O623P036P419P501P096N943
$$ 591033 594395 598155 601922 606059 611271 617559 624205 630739 637362 644398 651817 659318 666414 672357
59447F72357M074K034K79j238k653l806m655n552o543o951o264n115m589m760
$$ 672357 676431 678465 678744 677506 674853 671047 666392 660840 654297 647346 641082 635967 631378 626618
59433F26618m672l694k221r15J13J170K460L978N630P203Q364Q862Q855Q931R743
$$ 626618 621946 618252 616031 615116 615229 616399 618859 622837 628467 635670 644034 652896 661751 670682 680425
59418F80425J1456J3584J5425J6496J6415J4714J1289O979L035n9k759n333p194
$$ 680425 691881 705465 720890 737386 753801 768515 779804 786783 789818 789759 787000 781667 774473
59405G74473p594o501m501k304o34j17q75k460m415o554q638j0291j1428j2314
$$ 774473 766879 760378 755877 753573 752939 752822 751947 749487 745072 738518 729880 719589 708161 695847
59391F95847j2957j3006j2419j1639j0844r657p864n816l843j972n53k32p91q71
$$ 695847 682890 669884 657465 645826 634982 625325 617461 611645 607802 605830 605277 605045 604254 603383
59377F03383M14K242L204L029K490K206K291K756L469M103M680N668O957P492
$$ 603383 603797 606039 609243 612272 614762 616968 619259 622015 625484 629587 634267 639935 646892 654384
59363F54384O659N349M753M833N014N566P062Q891R805R709R654J0137J0673J1070
$$ 654384 661043 666392 671145 675978 680992 686558 693620 702511 712316 722025 731679 741816 752489 763559
59349G63559J1788J2830J3434J3166J2419J1503J0143Q164N953L842J686o71l026
$$ 763559 775347 788177 801611 814777 827196 838699 848842 857006 862959 866801 868487 867816 864790
59336H64790n118o826q016q682r221j0036j0910j1252j0899j0160r254q362p934
$$ 864790 859672 852846 844830 836148 826927 816891 805981 794729 783830 773670 764416 756054 748120
59323G48120q174q350p501n801m449m142m402m380l652k274q50l48r92j488l58
$$ 748120 739946 731596 724095 718294 713845 709703 705301 700921 697269 694995 694145 693797 692805 691317 690959
59308F90959K010L784M219M536O007Q382J0685J2469J3466J3007J0695P216L738
$$ 690959 692969 696753 700972 705508 711515 719897 730582 743051 756517 769524 780219 787435 791173
59295G91173P84j836m354o739q772j0126j0604j0486j0323j0267r960r183q081
$$ 791173 791957 790121 785767 779028 770256 760130 749526 739040 728717 718450 708490 699307 691226
59282F91226o733m986k910q89Q56K410L746M667N298O084P128P991Q233P779O809
$$ 691226 684493 679507 676597 675708 676564 678974 682720 687387 692685 698769 705897 713888 722121 729900 736709
59267G36709N693M930M615M098K786J034m14j574k935m268m893n066n875p518
$$ 736709 742402 747332 751947 756045 758831 759865 759451 757877 754942 750674 745781 740715 734840 727322
59253G27322q797q707p542o131m909m137m000m042l374j936o84p2O37K024L408
$$ 727322 718525 709818 702276 696145 691236 687099 683099 679057 675683 673747 673063 672991 673628 675652 679060
59238F79060L859L502L080K863K668K369J757M97j196k416k697k680l068l618
$$ 679060 682919 686421 689501 692364 695032 697401 699158 699655 698459 696043 693346 690666 687598 683980
59224F83980l823l893m242m588m402l810l295k826k083j217o56l39J45Q84J683
$$ 683980 680157 676264 672022 667434 663032 659222 655927 653101 651018 649801 649145 648806 648951 649835 651518
59209F51518K495L306L734L411K556J701J069O13L96M13L21j02n12m43K7N37J055
$$ 651518 654013 657319 661053 664464 667020 668721 669790 670403 670799 671212 671533 671431 670919 670476 670503 671040 672095
59192F72095J708K256K387K322K508K802K602J806J025P94R73J087Q59L37j78
$$ 672095 673803 676059 678446 680768 683276 686078 688680 690486 691511 692305 693278 694365 695224 695561 695383
59177F95383k08N60J849K869L098K862K983L811M824N334N343N476O036O579O541
$$ 695383 695175 695735 697584 700453 703551 706413 709396 713207 718031 723365 728708 734184 740220 746799 753340
59162G53340N920N091M324L745L394K971J953L79r68j588j940k506k975l140l767
$$ 753340 759260 764351 768675 772420 775814 778785 780738 781117 780149 778561 776621 774115 771140 768000 764233
59147G64233n351o675o194m532l919n072o385o527o123o135o163n395m074k993
$$ 764233 758882 752207 746013 741481 737562 732490 726105 719578 713455 707320 701157 695762 691688 688695
59133F88695k341j961j999k462k718k244j256j41J124K429L268L646M512O519
$$ 688695 686354 684393 682394 679932 677214 674970 673714 673573 674697 677126 680394 684040 688552 695071
59119F95071Q955J0614J1211J1336J1618J2514J4228J6270J7668J8154J8430J8789
$$ 695071 704026 714640 725851 737187 748805 761319 775547 791817 809485 827639 846069 864858
59107H64858J8435J6831J4786J3299J2180J0794R333Q241O981M723J900j13p48
$$ 864858 883293 900124 914910 928209 940389 951183 960516 968757 975738 980461 982361 982248 981500
59094I81500p68j039j679k310k555k309j957k144k947l669l883m144n150o661
$$ 981500 980732 979693 978014 975704 973149 970840 968883 966739 963792 960123 956240 952096 946946 940285
59080I40285p894q511q596q231p697p637q273q908q892q522q332q061p264o403
$$ 940285 932391 923880 915284 907053 899356 891719 883446 874538 865646 857124 848792 840731 833467 827064
59066H27064o362p103p737p748p392o993o597o233n868n252m270l296k738k464
$$ 827064 820702 813599 805862 798114 790722 783729 777132 770899 765031 759779 755509 752213 749475 747011
59052G47011k140j748j386r24l55n9k55n80p09q41j126j139n30L69J149J974L019
$$ 747011 744871 743123 741737 740813 740458 740399 740144 739564 738855 738014 736888 735749 735219 735588 736737 738711 741730
59035G41730L836L970L743L828M478N672P404R363J0961J2208J3796J5837J7383
$$ 741730 745566 749536 753279 757107 761585 767257 774661 784024 794985 807193 820989 836826 854209
59022H54209J7798J7570J7085J5754J3338J0983R630Q432O186L457J728J088M43
$$ 854209 872007 889577 906662 922416 935754 946737 956367 964799 970985 974442 976170 977258 977701
59009I77701m17o33K5Q05J397K319L758N134N990O369O276N579M436L075J342
$$ 977701 977284 976651 976676 977481 978878 981197 984955 990089 996079 1002448 1008724 1014303 1018739 1021814 1023156
58994A023156p98k741m014n180p024r207j0684j1140j1055j0730j0210r809r713
$$ 1023156 1022358 1019617 1015603 1010423 1003399 994192 983508 972368 961313 950583 940373 930564 920851
58981I20851r389q273o635m999l298j464j30L91J035K648M485N417N792O598P481
$$ 920851 911462 903189 896554 891555 888257 886793 886663 887054 888089 890737 895222 900639 906431 913029 920510
58966I20510P359O551O427P203P820P759P371O567M931L028J818Q42j235m327
$$ 920510 927869 934420 940847 948050 955870 963629 971000 977567 982498 985526 987344 988186 986951 982624
58952I82624o856q116q859r558r811r724r899r902q589o363n134n534n983n222
$$ 982624 975768 967652 958793 949235 939424 929700 919801 909899 901310 894947 889813 884279 878296 873074
58938H73074l941l169k738k287k237k716k918k495k397l333m508m826m376l870
$$ 873074 869133 865964 863226 860939 858702 855986 853068 850573 848176 844843 840335 835509 831133 827263
58924H27263l500l121k751k293j545q98j055j651j321M10K420L729M738O060P295
$$ 827263 823763 820642 817891 815598 814053 813155 812100 810449 809128 809538 811958 815687 820425 826485 833780
58909H33780P867Q077Q499R098R570R839R714Q914P884P614Q185Q482P831O960
$$ 833780 841647 849724 858223 867321 876891 886730 896444 905358 913242 920856 929041 937523 945354 952314
58895I52314O802P411Q575J0427J2723J4603J5707J6630J7563J7592J6103J3883
$$ 952314 959116 966527 975102 985529 998252 1012855 1028562 1045192 1062755 1080347 1096450 1110333
58883A110333J1923J0052P628M816K252Kk316m793p208r294j0657j0979j0644
$$ 1110333 1122256 1132308 1139936 1144752 1147004 1147006 1144690 1139897 1132689 1123395 1112738 1101759 1091115
58870A091115j0582j1156j1897j2421j2796j2856j2203j1230j1033j1897j2847
$$ 1091115 1080533 1069377 1057480 1045059 1032263 1019407 1007204 995974 984941 973044 960197
58859I60197j3114j3012j3000j2886j2546j2294j2137j1577j0607r836r303q368
$$ 960197 947083 934071 921071 908185 895639 883345 871208 859631 849024 839188 829885 821517
58847H21517p138o637p095p421p038o780p204p438o671n476m683m097l360k853
$$ 821517 814379 807742 800647 793226 786188 779408 772204 764766 758095 752619 747936 743839 740479 737626
58833G37626k752k238q27N64R48P14O73O99L25j80l88n54q06n06O11J504J148
$$ 737626 734874 732636 731809 732373 733321 734035 734708 735407 735732 735552 735164 734610 733804 733298 733909 735413 736561
58816G36561k1r87j565j943j786r35j62j32l81l75n96j447k089j735j161j491
$$ 736561 736540 735553 733988 732045 730259 729324 729162 729030 728649 728274 727678 726231 724142 722407 721246 719755
58800G19755k231k121j256q47j187j468j382j485j983k351k197j608p12L45J195
$$ 719755 717524 715403 714147 713300 712113 710645 709263 707778 705795 703444 701247 699639 698927 699272 700467
58785G00467J771K662M188N631O180O169O494P245P808P868P426O276M367K301
$$ 700467 702238 704900 709088 714719 720899 727068 733562 740807 748615 756483 763909 770185 774552 776853
58771G76853O32q33k307l217l140k913l699n285o359o246n380m355l388k612k117
$$ 776853 777485 776652 774345 771128 767988 765075 761376 756091 749732 743486 738106 733751 730363 727751 725634
58756G25634j800j620j690j845j632j103q45p95OJ866L682M548N053O010P014
$$ 725634 723834 722214 720524 718679 717047 715944 715099 714304 714310 716176 719858 724406 729459 735469 742483
58741G42483P414P706Q623R679J0047J0138J0903J2102J2721J2611J2323J1777
$$ 742483 749897 757603 766226 775905 785952 796090 806993 819095 831816 844427 856750 868527
58729H68527J0453Q639P138N970M586L134K297K098J962J784J814J805J335P80
$$ 868527 878980 887619 894757 900727 905313 908447 910744 912842 914804 916588 918402 920207 921542 922322
58715I22322Q27J247J187M83l11j029j991l208m439n796p469r086j0249j1352
$$ 922322 923149 924396 925583 926066 925755 924726 922735 919527 915088 909292 901823 892737 882488 871136
58701H71136j2925j4504j5189j5060j5005j5318j5350j4477j2744j0713r193q690
$$ 871136 858211 843707 828518 813458 798453 783135 767785 753308 740564 729851 720658 711968
58689G11968q637p761n839m215l864l923l148j983j783k670l413l017j384J091
$$ 711968 703331 695570 689731 685516 681652 677729 674581 672598 670815 668145 664732 661715 660331 661422
58675F61422L482M596M360M384O051Q735J1043J2884J4926J6790J7489J7112J6437
$$ 661422 664904 669500 673860 678244 684295 693030 704073 716957 731883 748673 766162 783274 799711
58662G99711J5275J2750R020N191J775j397m088n809o860p850q462q017o916o179
$$ 799711 814986 827736 836756 841947 843722 842325 838237 832428 825568 817718 809256 801239 794323 788144
58648G88144n892n477n089n253n478m797l528k936l222l325k675j764j044n06
$$ 788144 782252 776775 771686 766433 760955 756158 752630 749694 746472 743147 740472 738708 737664 737158
58634G37158l11n63o56j1P81P55J47r7O2R0L47J651L621N046N737O506P473P913
$$ 737158 736847 736284 735628 735617 736398 737153 737300 737203 737265 737355 737702 739353 742974 748020 753757 760263 767736 775649
58616G75649P688P384P100O470N667N064M214K606R73K96L7r10k057k068j300
$$ 775649 783337 790721 797821 804291 809958 815022 819236 821842 822815 823111 823148 822238 820181 818113 816813
58601H16813j430k737l838m132m330m553m005k828k099j665p8K796N215O203O825
$$ 816813 815383 812646 808808 804676 800346 795793 791788 788960 786861 785196 785118 787914 793129 799332 806157
58586H06157Q058R312R865J0079J0261R838Q583P333O708O293N653N038M588M092
$$ 806157 814215 823527 833392 843471 853732 863570 872153 879486 886194 892487 898140 903178 907766 911858
58572I11858L944M985P042Q952J0435J2446J5224J7613J8941K0054K1644K2925
$$ 911858 915802 920787 927829 936781 947216 959662 974886 992499 1011440 1031494 1053138 1076063
58560A076063K2891K1792K0491J9223J7754J5990J3903J1480R040O965M935K330
$$ 1076063 1098954 1120746 1141237 1160460 1178214 1194204 1208107 1219587 1228627 1235592 1240527 1242857
58548A242857o76l349n657q158j0728j2576j3587j4424j5236j5510j5236j5044
$$ 1242857 1242181 1238832 1233175 1225017 1214289 1201713 1188126 1173702 1158466 1142956 1127720 1112676
58536A112676j5085j4910j4387j3700j2588j0782q861p452o035l940j936j107
$$ 1112676 1097591 1082681 1068294 1054594 1042006 1031224 1022363 1014911 1008876 1004936 1003000 1001893
58524A001893p90M60K305L222L305M054N430N696M423L299L303L356K406Q80n98
$$ 1001893 1001103 1001563 1003868 1007090 1010395 1014449 1019879 1025575 1029998 1033297 1036600 1039956 1042362 1043242 1042644
58509A042644k046l189l490l556m613o319p000o430o183o814p060o412o140o826
$$ 1042644 1040598 1037409 1033919 1030363 1025750 1019431 1012431 1006001 999818 993004 985944 979532 973392 966566
58495I66566p086n824l856k310j132n1O83J343K823N031O796P905R367J1274J2428
$$ 966566 959480 953656 949800 947490 946358 946307 946990 948333 951156 956187 962983 970888 980255 991529 1003957
58480A003957J2609J3038J3894J3650J1666R337P655N825L229P33j044k770m708
$$ 1003957 1016566 1029604 1043498 1057148 1068814 1078151 1085806 1091631 1094860 1095593 1094549 1091779 1087071
58467A087071n903o097o413p178p047n349l292j819k86J673L021L233L384M097
$$ 1087071 1081168 1075071 1068658 1061480 1054433 1049084 1045792 1043973 1043687 1045360 1048381 1051614 1054998 1059095
58453A059095M320L254J688M44p35j759j733p95m61j122j387p00l46q28p09P38
$$ 1059095 1063415 1066669 1068357 1068801 1068066 1066307 1064574 1063779 1063318 1062196 1060809 1060109 1059763 1058935 1058226 1058964
58437A058964K144K606L206M604N593N519N822P523R453J0620J1998J4310J6243
$$ 1058964 1061108 1063714 1066920 1071524 1077117 1082636 1088458 1095981 1105434 1116054 1128052 1142362 1158605
58424A158605J6631J6280J5921J4515J1328P626M573J566j727l977m655n527p734
$$ 1158605 1175236 1191516 1207437 1221952 1233280 1240906 1245479 1247045 1245318 1241341 1236686 1231159 1223425
58411A223425r596r409q259p910p936p149n988n313m494k777q98N00K288M859
$$ 1223425 1213829 1204420 1196161 1188251 1180315 1173166 1167178 1161865 1157371 1154594 1153696 1154196 1156484 1161343
58397A161343O663O551N734N562N322M061K647K102J851J411J794L412M763N069
$$ 1161343 1168006 1174557 1180291 1185853 1191175 1195236 1197883 1199985 1201836 1203247 1205041 1208453 1213216 1218285
58383A218285O036Q924J2049J3344J3182J2700J1506R234P151O103N017L424L012
$$ 1218285 1224321 1233245 1245294 1258638 1271820 1284520 1296026 1305260 1312411 1318514 1323531 1326955 1329967
58370A329967M547N847N205M284N140O854P668Q026Q800Q943P624O365O426O449
$$ 1329967 1334514 1340361 1345566 1349850 1354990 1361844 1369512 1377538 1386338 1395281 1402905 1409270 1415696 1422145
58356A422145N299M656N939P270O518M899M518M805M476M515O055P739Q344R490
$$ 1422145 1427444 1432100 1438039 1445309 1451827 1456726 1461244 1466049 1470525 1475040 1481095 1488834 1497178 1506668
58342A506668J2486J5146J5258J4597J5828J7944J8504J8021J8156J7934J5725
$$ 1506668 1519154 1534300 1549558 1564155 1579983 1597927 1616431 1634452 1652608 1670542 1686267
58331A686267J2869J1464J0587Q558O719O982P790O666M640M125M434L679L016
$$ 1686267 1699136 1710600 1721187 1729745 1736464 1743446 1751236 1757902 1762542 1766667 1771101 1774780 1777796
58318A777796M652P460Q855R320J0919J3132J4232J4933J6623J7998J7513J7032
$$ 1777796 1782448 1789908 1798763 1808083 1819002 1832134 1846366 1861299 1877922 1895920 1913433 1930465
58306A930465J8798K1024K0823J9282J9093J9561J8600J7303J7725J8448J7297
$$ 1930465 1949263 1970287 1991110 2010392 2029485 2049046 2067646 2084949 2102674 2121122 2138419
58295B138419J6088J7603K0203K0685K0120K1405K3463K3482K2675K4007K6396
$$ 2138419 2154507 2172110 2192313 2212998 2233118 2254523 2277986 2301468 2324143 2348150 2374546
58284B374546K7035K7234K9962L3710L4988L4848L6663L9498M0170L9891M2144
$$ 2374546 2401581 2428815 2458777 2492487 2527475 2562323 2598986 2638484 2678654 2718545 2760689
58273B760689M5834M7226M6968M8495N1249N2346N3018N6406O0758O2009O1317
$$ 2760689 2806523 2853749 2900717 2949212 3000461 3052807 3105825 3162231 3222989 3284998 3346315
58262C346315O2757O5408O5281O3206O3099O4254O3251O1554O3104O6375O7217
$$ 3346315 3409072 3474480 3539761 3602967 3666066 3730320 3793571 3855125 3918229 3984604 4051821
58251D051821O7432P1631P7744Q0126Q0278Q4586R2900R9435J03750J10584J19747
$$ 4051821 4119253 4190884 4268628 4348754 4429032 4513618 4606518 4705953 4809703 4920287 5040034
58240E040034J26502J31240J38616J47961J54790J60612J70689J83524J93400
$$ 5040034 5166536 5297776 5436392 5584353 5739143 5899755 6070444 6253968 6447368
58231F447368K01703K14367K30183K43615K56887K76268K98950L17413L34462
$$ 6447368 6649071 6863438 7093621 7337236 7594123 7870391 8169341 8486754 8821216
58222H821216L59098L89962M18772M47710M86182N32456N76979O22238O79800
$$ 8821216 9180314 9570276 9989048 10436758 10922940 11455396 12032375 12654613 13334413
58213A3334413P49130Q20218Q96321R91647J107185J232537J371604J541082J744013
$$ 13334413 14083543 14903761 15800082 16791729 17898914 19131451 20503055 22044137 23788150
58204B3788150J973038K240510K575531K991404L491037M106966M900507N924014
$$ 23788150 25761188 28001698 30577229 33568633 37059670 41166636 46067143 51991157
58196E1991157P232941Q942560J1224922J4242277J8112952K2858095K8161275
$$ 51991157 59224098 68166658 79391580 93633857 111746809 134604904 162766179
58189A62766179L3067891L6103306L5999457L2472884K6310738J8740856J0762752
$$ 162766179 195834070 231937376 267936833 300409717 326720455 345461311 356224063
58182C56224063K951515m381649j1010008j6698805k1171799k4180053k5660983
$$ 356224063 359175578 354793929 343783921 327085116 305913317 281733264 256072281
58175B56072281k5810943k4962888k3418181k1415551j9186052j6941180j4807832
$$ 256072281 230261338 205298450 181880269 160464718 141278666 124337486 109529654
58168A09529654j2831034j1039654r467176q117132o959507n970591n144272m463001
$$ 109529654 96698620 85658966 76191790 68074658 61115151 55144560 50000288 45537287
58160D5537287l891524l405243k998190k659727k368801k114961j901857j725764
$$ 45537287 41645763 38240520 35242330 32582603 30213802 28098841 26196984 24471220
58152B4471220j571291j431433j312193j213825j125690j042673r69403r05133
$$ 24471220 22899929 21468496 20156303 18942478 17816788 16774115 15804712 14899579
58144A4899579q41016p75712p18187o71606o28819n86681n50597n21680m92954
$$ 14899579 14058563 13282851 12564664 11893058 11264239 10677558 10126961 9605281 9112327
58135I112327m62000m34726m13168l91365l66663l43841l24869l05419k84503
$$ 9112327 8650327 8215601 7802433 7411068 7044405 6700564 6375695 6070276 5785773
58126E785773k67100k54171k40139k23159k08158j96896j84807j70478j58738
$$ 5785773 5518673 5264502 5024363 4801204 4593046 4396150 4211343 4040865 3882127
58117C882127j51212j43039j32128j22825j17066j10530j01105r2955q8557q4385
$$ 3882127 3730915 3587876 3455748 3332923 3215857 3105327 3004222 2911267 2822710 2738325
58107B738325p8076p2590o9734o6509o1314n7140n5408n2981m8434m5007m4287
$$ 2738325 2660249 2587659 2517925 2451416 2390102 2332962 2277554 2224573 2176139 2131132 2086845
58096B086845m3058l9409l6024l4507l2267k7985k4462k3208k1679j8692j6987
$$ 2086845 2043787 2004378 1968354 1933847 1901580 1873595 1849133 1825925 1804246 1785554 1768567
58085A768567j7691j7758j5779j4898j6926j8907j8638j8486k0370k1913k0989
$$ 1768567 1750876 1733118 1717339 1702441 1685515 1666608 1647970 1629484 1609114 1587201 1566212
58074A566212j9519j9402j9005j6954j5285j5542j5723j4228j2949j3323j3146
$$ 1566212 1546693 1527291 1508286 1491332 1476047 1460505 1444782 1430554 1417605 1404282 1391136
58063A391136j0589p793p177p456o566n482n881o729o326n362n216n399n146n285
$$ 1391136 1380547 1372754 1365577 1358121 1351555 1346073 1340192 1333463 1327137 1321775 1316559 1311160 1306014 1300729
58049A300729o323o932o371o103p116p962p365o401o329o516o193n982o163n746
$$ 1300729 1294406 1287474 1281103 1275000 1267884 1259922 1252557 1246156 1239827 1233311 1227118 1221136 1214973 1209227
58035A209227m624m250m927m991l908l417m318n043m728m723n602n709m328l340
$$ 1209227 1204603 1200353 1195426 1190435 1186527 1183110 1178792 1173749 1169021 1164298 1158696 1152987 1148659 1145319
58021A145319l969m779m649m704n470n075k517J07O94O2k27l80p94m79R07J838
$$ 1145319 1141350 1136571 1131922 1127218 1121748 1116673 1114156 1114263 1114957 1115019 1114792 1114412 1113618 1113139 1114046 1115884
58005A115884J623J882L423M277K961J175R85J618J397O30L15Kp47o66J189L525
$$ 1115884 1117507 1119389 1122812 1127089 1130050 1131225 1132210 1133828 1135225 1135855 1136170 1136172 1135425 1134759 1135948 1139473
57989A139473M931O162Q272J0317J0925J0487R779Q183N203K179N14k61r79j170
$$ 1139473 1144404 1150566 1158838 1169155 1180080 1190567 1200346 1208529 1213732 1215911 1216425 1216164 1215185 1214015
57975A214015o25p36k359m032m202l552l268k818j453j51n0m08j77N0m22n41P31
$$ 1214015 1213390 1212654 1210295 1206263 1202061 1198509 1195241 1192423 1190970 1190819 1190769 1190361 1190184 1190234 1189812 1189271 1190002
57958A190002K279K609K313K671L219K837K109K348L365M144M752N706O511O631
$$ 1190002 1192281 1194890 1197203 1199874 1203093 1205930 1208039 1210387 1213752 1217896 1222648 1228354 1234865 1241496
57944A241496O854P913Q931R065R434J1407J4026J5225J4810J4231J4161J4162
$$ 1241496 1248350 1256263 1265194 1274259 1283693 1295100 1309126 1324351 1339161 1353392 1367553 1381715
57932A381715J4125J4245J4081J3111J1688J0224Q214N369K703J110j79k271m782
$$ 1381715 1395840 1410085 1424166 1437277 1448965 1459189 1467403 1472772 1475475 1476585 1476406 1474135 1469353
57919A469353o710q133r570j0672j0980j0941j0798r628p074m720m114m484m115
$$ 1469353 1462643 1454510 1444940 1434268 1423288 1412347 1401549 1391921 1384847 1380127 1376013 1371529 1367414
57906A367414k934j929j100P0J048J087R63J904L412L994L519L119L212L347L661
$$ 1367414 1364480 1362551 1361451 1361521 1362569 1363656 1364619 1366523 1369935 1373929 1377448 1380567 1383779 1387126 1390787
57891A390787M775O459P744Q214Q114P641P091P041P330O733M726K627J737J438
$$ 1390787 1395562 1402021 1409765 1417979 1426093 1433734 1440825 1447866 1455196 1461929 1466655 1469282 1471019 1472457
57877A472457N51n17p28n19j105k334l037l051l221l744m027l855l387k369o56
$$ 1472457 1473008 1472491 1471763 1471244 1470139 1467805 1464768 1461717 1458496 1454752 1450725 1446870 1443483 1441114 1440458
57862A440458R89J768K008K367K690K793L409M985O421O588O183O529P345P415
$$ 1440458 1441447 1443215 1445223 1447590 1450280 1453073 1456482 1461467 1467888 1474476 1480659 1487188 1494533 1501948
57848A501948O703O045N361M021K489J821J928J860J545J563J683J200M62N10
$$ 1501948 1508651 1514696 1520057 1524078 1526567 1528388 1530316 1532176 1533721 1535284 1536967 1538167 1538629 1539139
57834A539139J416K360K983L393L337K753K620L778N424O222O306O670P270P416
$$ 1539139 1540555 1542915 1545898 1549291 1552628 1555381 1558001 1561779 1567203 1573425 1579731 1586401 1593671 1601087
57820A601087P466Q314R582J0093R731R165Q211O287M152L240L459L398K593J765
$$ 1601087 1608553 1616867 1626449 1636542 1646273 1655438 1663649 1669936 1674088 1677328 1680787 1684185 1686778 1688543
57806A688543J112J98n61k23Q94J497J383J422J617J095P3j55N64R38N43N25J535
$$ 1688543 1689655 1689853 1689292 1689069 1689963 1691460 1692843 1694265 1695882 1696977 1697050 1696895 1697459 1698397 1698940 1699465 1701000
57789A701000K655L001K938L092L489M131N184O261O665O665P290Q684R914J0515
$$ 1701000 1703655 1706656 1709594 1712686 1716175 1720306 1725490 1731751 1738416 1745081 1752371 1761055 1770969 1781484
57775A781484J0893J1066J0500R365Q580Q300P774O893O381O248N540M025K664
$$ 1781484 1792377 1803443 1813943 1823308 1831888 1840188 1847962 1854855 1861236 1867484 1873024 1877049 1879713
57762A879713K001J556J158J354K000K049J327J045J873K905L229L136L092K858
$$ 1879713 1881714 1883270 1884428 1885782 1887782 1889831 1891158 1892203 1894076 1896981 1900210 1903346 1906438 1909296
57748A909296K483K803L964M682L972K583J773J651J698J973K704L392L439L123
$$ 1909296 1911779 1914582 1918546 1923228 1927200 1929783 1931556 1933207 1934905 1936878 1939582 1942974 1946413 1949536
57734A949536L086L324L430L401L468L557L545L677M133M619M847N079N629O222
$$ 1949536 1952622 1955946 1959376 1962777 1966245 1969802 1973347 1977024 1981157 1985776 1990623 1995702 2001331 2007553
57720B007553O281N647M721M106M193M790N130M648L758L372L751M429N098N748
$$ 2007553 2013834 2019481 2024202 2028308 2032501 2037291 2042421 2047069 2050827 2054199 2057950 2062379 2067477 2073225
57706B073225O005N341M069L215L196L499L805M507N725O815P270P376P531P623
$$ 2073225 2079230 2084571 2088640 2091855 2095051 2098550 2102355 2106862 2112587 2119402 2126672 2134048 2141579 2149202
57692B149202P481P262P039O621O153O252P188Q468R483J0043J0218J0299J0983
$$ 2149202 2156683 2163945 2170984 2177605 2183758 2190010 2197198 2205666 2215149 2225192 2235410 2245709 2256692
57679B256692J2779J5136J7003J8440K0748K4750L0034L6252M4061N3829O3983
$$ 2256692 2269471 2284607 2301610 2320050 2340798 2365548 2395582 2431834 2475895 2529724 2593707
57668B593707P1404P3278O8430N7692M3534K8781J4948J989j0291k1114k9362
$$ 2593707 2665111 2738389 2806819 2864511 2908045 2936826 2951774 2953763 2943472 2922358 2892996
57657B892996l4653l7349l7881l6525l3572k9421k4611j9820j5538j1729q188
$$ 2892996 2858343 2820994 2783113 2746588 2713016 2683595 2658984 2639164 2623626 2611897 2603709
57646B603709n111k843j183M57K194L592M433M969N428N842O330P032P749Q257
$$ 2603709 2598598 2595755 2594572 2595029 2597223 2600815 2605248 2610217 2615645 2621487 2627817 2634849 2642598 2650855
57632B650855Q818R745J0571J0390R046P361O266O210P111Q248Q581P964P553
$$ 2650855 2659673 2669418 2679989 2690379 2699425 2706786 2713052 2719262 2726373 2734621 2743202 2751166 2758719
57619B758719Q177Q927Q547P524P333P998Q208P661P437P953Q388Q492R092J0355
$$ 2758719 2766896 2775823 2784370 2791894 2799227 2807225 2815433 2823094 2830531 2838484 2846872 2855364 2864456 2874811
57605B874811J1150J0924J0579J0826J1175J1268J1704J2613J2919J1986J0749
$$ 2874811 2885961 2896885 2907464 2918290 2929465 2940733 2952437 2965050 2977969 2989955 3000704
57594C000704J0211J0026R556R099R003Q776Q219Q295R620J1085J1331J0735J0630
$$ 3000704 3010915 3020941 3030497 3039596 3048599 3057375 3065594 3073889 3083509 3094594 3105925 3116660 3127290
57581C127290J1173J1400J0874J0087R556R509J0093J1015J1437J0972J0331J0229
$$ 3127290 3138463 3149863 3160737 3170824 3180380 3189889 3199982 3210997 3222434 3233406 3243737 3253966
57569C253966J0419J0526J0952J1913J2441J1667J0434J0273J1174J1771J1483
$$ 3253966 3264385 3274911 3285863 3297776 3310217 3321884 3332318 3342591 3353765 3365536 3377019
57558C377019J1114J1321J1780J2092J2465J3112J3731J3916J3676J3335J3219
$$ 3377019 3388133 3399454 3411234 3423326 3435791 3448903 3462634 3476550 3490226 3503561 3516780
57547C516780J3488J3992J4389J4508J4424J4150J3687J3445J3949J4937J5445
$$ 3516780 3530268 3544260 3558649 3573157 3587581 3601731 3615418 3628863 3642812 3657749 3673194
57536C673194J5113J4652J4620J4607J4138J3498J3076J2721J2446J2841J3999
$$ 3673194 3688307 3702959 3717579 3732186 3746324 3759822 3772898 3785619 3798065 3810906 3824905
57525C824905J4916J4880J4515J4551J4470J3640J2877J3385J4784J5634J5615
$$ 3824905 3839821 3854701 3869216 3883767 3898237 3911877 3924754 3938139 3952923 3968557 3984172
57514C984172J5643J6113J6485J6562J6738J6849J6233J5139J4820J5724J6733
$$ 3984172 3999815 4015928 4032413 4048975 4065713 4082562 4098795 4113934 4128754 4144478 4161211
57503D161211J6678J5760J4900J4475J4335J4490J5088J5900J6293J5788J4610
$$ 4161211 4177889 4193649 4208549 4223024 4237359 4251849 4266937 4282837 4299130 4314918 4329528
57492D329528J3672J3814J4868J5694J5497J4729J4342J4539J4835J5041J5470
$$ 4329528 4343200 4357014 4371882 4387576 4403073 4417802 4432144 4446683 4461518 4476559 4492029
57481D492029J6251J7100J7730J8072J8163J8206J8511J8960J8868J7889J6701
$$ 4492029 4508280 4525380 4543110 4561182 4579345 4597551 4616062 4635022 4653890 4671779 4688480
57470D688480J6253J6574J6993J7236J7606J8196J8685J8857J8786J8522J8154
$$ 4688480 4704733 4721307 4738300 4755536 4773142 4791338 4810023 4828880 4847666 4866188 4884342
57459D884342J7984J8163J8269J7824J7082J6723J6957J7461J8053J8736J9284
$$ 4884342 4902326 4920489 4938758 4956582 4973664 4990387 5007344 5024805 5042858 5061594 5080878
57448E080878J9372J9140J9072J9370J9840K0269K0461K0152J9439J9040J9531
$$ 5080878 5100250 5119390 5138462 5157832 5177672 5197941 5218402 5238554 5257993 5277033 5296564
57437E296564K0501K1043K0958K0895K1346K2108K2693K2764K2286K1508K0791
$$ 5296564 5317065 5338108 5359066 5379961 5401307 5423415 5446108 5468872 5491158 5512666 5533457
57426E533457K0154J9350J8561J8450J9143J9821J9895J9939K0651K1540K1567
$$ 5533457 5553611 5572961 5591522 5609972 5629115 5648936 5668831 5688770 5709421 5730961 5752528
57415E752528K0628J9483J8635J8251J8738K0241K1884K2600K2510K2439K2411
$$ 5752528 5773156 5792639 5811274 5829525 5848263 5868504 5890388 5912988 5935498 5957937 5980348
57404E980348K1890K1169K1113K1480K1119K0024J9643K0604K1617K1366K0358
$$ 5980348 6002238 6023407 6044520 6066000 6087119 6107143 6126786 6147390 6169007 6190373 6210731
57393F210731J9932K0319K0740K0734K0478K0207K0074K0349K1091K1796K1900
$$ 6210731 6230663 6250982 6271722 6292456 6312934 6333141 6353215 6373564 6394655 6416451 6438351
57382F438351K1474K1017K0752K0524K0246K0058K0085K0273K0538K0856K1182
$$ 6438351 6459825 6480842 6501594 6522118 6542364 6562422 6582507 6602780 6623318 6644174 6665356
57371F665356K1354K1221K0917K0932K1579K2441K2701K2121K1221K0448J9801
$$ 6665356 6686710 6707931 6728848 6749780 6771359 6793800 6816501 6838622 6859843 6880291 6900092
57360F900092J9532K0284K1933K3138K2935K2082K1875K2285K2450K2414K2931
$$ 6900092 6919624 6939908 6961841 6984979 7007914 7029996 7051871 7074156 7096606 7119020 7141951
57349G141951K3672K3282K1460J9644J9208J9893K0523K0388J9539J8478J7800
$$ 7141951 7165623 7188905 7210365 7230009 7249217 7269110 7289633 7310021 7329560 7348038 7365838
57338G365838J7653J7418J6583J5738J5807J6472J6527J5790J5331J5571J5616
$$ 7365838 7383491 7400909 7417492 7433230 7449037 7465509 7482036 7497826 7513157 7528728 7544344
57327G544344J4954J4409J4655J4990J4636J4165J4581J5660J6297J6067J5511
$$ 7544344 7559298 7573707 7588362 7603352 7617988 7632153 7646734 7662394 7678691 7694758 7710269
57316G710269J5190J5208J5360J5188J4278J2960J2305J2866J3897J4410J4413
$$ 7710269 7725459 7740667 7756027 7771215 7785493 7798453 7810758 7823624 7837521 7851931 7866344
57305G866344J4489J4586J4078J2790J1272J0132R609R657J0017J0335J0530J0795
$$ 7866344 7880833 7895419 7909497 7922287 7933559 7943691 7953300 7962957 7972974 7983309 7993839 8004634
57293H004634J1047J0794R884Q945Q578Q536Q174P377O517N865N531N680O258
$$ 8004634 8015681 8026475 8036359 8045304 8053882 8062418 8070592 8077969 8084486 8090351 8095882 8101562 8107820
57280H107820O725O609O070N527M982M211L403K958K808K449J676Q31L06R8l9
$$ 8107820 8114545 8121154 8127224 8132751 8137733 8141944 8145347 8148305 8151113 8153562 8155238 8156069 8156375 8156473 8156434
57265H156434k60n03o25o85j003j779k732l442l952m571n130n140m737m669n070
$$ 8156434 8156174 8155671 8155046 8154361 8153358 8151579 8148847 8145405 8141453 8136882 8131752 8126612 8121875 8117206 8112136
57250H112136n104m318l591l974n180o039o088n883o011o522p210p770p765p032
$$ 8112136 8107032 8102714 8099123 8095149 8089969 8083930 8077842 8071959 8065948 8059426 8052216 8044446 8036681 8029649
57236H029649o097n630n573n366m879m581m788n326n960o603p053p072o825o839
$$ 8029649 8023552 8017922 8012349 8006983 8002104 7997523 7992735 7987409 7981449 7974846 7967793 7960721 7953896 7947057
57222G947057p323p981q607r499j0983j2747j4033j4396j4175j4066j4357j4741
$$ 7947057 7939734 7931753 7923146 7913647 7902664 7889917 7875884 7861488 7847313 7833247 7818890 7804149
57210G804149j4942j5265j6159j7329j7863j7340j6280j5279j4262j2929j1404
$$ 7804149 7789207 7773942 7757783 7740454 7722591 7705251 7688971 7673692 7659430 7646501 7635097
57199G635097r757p348l509J210N088O713N968L691Q59j789l952n870p926j0029
$$ 7635097 7625340 7617992 7614483 7615693 7620781 7627494 7633462 7637153 7638012 7636223 7632271 7626401 7618475 7608446
57185G608446j1592j2289j2507j2950j3959j5334j6624j7514j8091j8747j9776
$$ 7608446 7596854 7584565 7572058 7559108 7545149 7529815 7513191 7495677 7477586 7458839 7439063
57174G439063k1052k2212k3040k3491k3451k2855k2018k1529k1620k1923k2066
$$ 7439063 7418011 7395799 7372759 7349268 7325817 7302962 7280944 7259415 7237795 7215872 7193806
57163G193806k2330k3421k5579k8158l0259l1636l2788l4150l5540l6581l7314
$$ 7193806 7171476 7148055 7122476 7094318 7064059 7032423 6999635 6965485 6929945 6893364 6856050
57152F856050l7997l8380l7870l6477l5126l4772l5496l6752l8114l9443m0640
$$ 6856050 6818053 6779673 6741803 6705326 6670200 6635428 6599932 6563180 6525066 6485623 6444983
57141F444983m1655m2531m3269m3879m4754m6494m8985n1272n2869n4645n7493
$$ 6444983 6403328 6360797 6317528 6273649 6228895 6182401 6133416 6082144 6029275 5974630 5917137
57130E917137o0807o3424o5684o9039p3640p7901q0537q0865p6729o5157m7542
$$ 5917137 5856330 5792906 5727222 5658183 5584543 5506642 5426105 5345240 5268511 5203354 5155812
57119E155812l1830k5779k8258l0409k5762j6134o852K69O995J4541K2613L1433
$$ 5155812 5123982 5098203 5069945 5039536 5013774 4997640 4990788 4991057 4998052 5012593 5035206 5066639
57107E066639M2043N4890P0034Q8263J10475J36787J67986K06863K56216L16672
$$ 5066639 5108682 5163572 5233606 5321869 5432344 5569131 5737117 5943980 6200196 6516868
57097F516868L88671M75299N80373P04907Q48269J011063J192474J385702J580250
$$ 6516868 6905539 7380838 7961211 8666118 9514387 10525450 11717924 13103626 14683876
57088A4683876J767127J937003K079385K199535K339735K563965K899379L292138
$$ 14683876 16451003 18388006 20467391 22666926 25006661 27570626 30470005 33762143
57080C3762143L633853L834122L860198L711372L377873K841805K112801J248629
$$ 33762143 37395996 41230118 45090316 48801688 52179561 55021366 57134167 58382796
57072E8382796L37412n36763j315395j967331k480614k854668l097010l222650
$$ 58382796 58720208 58183445 56868050 54900719 52420105 49565437 46468427 43245777
57064D3245777l251427l202537l091111k929634k730312k504569k262278k013565
$$ 43245777 39994350 36791813 33700702 30771068 28040756 25536187 23273909 21260344
57056B1260344j769874j541125j332486j145316r80044q36541p13205o08005n20020
$$ 21260344 19490470 17949345 16616859 15471543 14491499 13654958 12941753 12333748 11813728
57047A1813728m48497l91385l46571l13642k92613k81501k76689k74839k72929
$$ 11813728 11365231 10973846 10627275 10313633 10021020 9739519 9462830 9187991 8915062
57038H915062k67812k58151k46341k36333k29668k25086k21106k16743k10300
$$ 8915062 8647250 8389099 8142758 7906425 7676757 7451671 7230565 7013822 6803522
57029F803522k00179j87522j76168j69674j69597j76240j88983k05543k22840
$$ 6803522 6603343 6415821 6239653 6069979 5900382 5724142 5535159 5329616 5106776
57020E106776k39184k54180k66383k72864k71845k64467k53334k40420k26756
$$ 5106776 4867592 4613412 4347029 4074165 3802320 3537853 3284519 3044099 2817343
57011B817343k12951j99249j85728j72718j60505j48758j37171j26378j17204
$$ 2817343 2604392 2405143 2219415 2046697 1886192 1737434 1600263 1473885 1356681
57002A356681j09151j00923r2347q4452p7642p1108o4240n7360n0851m4734l9213
$$ 1356681 1247530 1146607 1054260 969808 892166 821058 756818 699458 648607 603873 564660
56991E64660l4470k9854k4412j8370j2816q048l616n1J149k69k616m352n662p380
$$ 564660 530190 500336 475924 457554 444738 436690 433074 433023 434172 433903 431287 426935 421273 413893
56977D13893r640j2153j4718j6748j7359j6497j5101j3751j2104j0059q199o647
$$ 413893 404253 392100 377382 360634 343275 326778 311677 297926 285822 275763 267564 260917
56965B60917m565j469K056N519R327J3678J7616J9953K0291J8583J4651Q918K788
$$ 260917 256352 254883 256939 262458 271785 285463 303079 323032 343323 361906 376557 385475 388263
56952C88263k564p166j1387j4874j7092j8213j8736j8639j7536j5306j2160q490
$$ 388263 385699 378533 367146 352272 335180 316967 298231 279592 262056 246750 234590 226100
56940B26100m921j952P25L988Q233J3155J8482K3873K7933K8639K5390J9730J3559
$$ 226100 221179 219227 219952 223940 232173 245328 263810 287683 315616 344255 369645 389375 402934
56927D02934P455J264m792j0359j5481k0083k3499k5198k5444k4776k3401k1451
$$ 402934 410389 411653 406861 396502 381021 360938 337439 312241 286797 262021 238620 217169
56915B17169j9241j6889j4351j2052j0647r927q939p464o325n823n102l645k255
$$ 217169 197928 181039 166688 154636 143989 134062 125123 117659 111334 105511 100409 96764 94509
56902I4509j757j770j582j168o31M39K050L294L628L921N291P641J0220J2773
$$ 94509 92752 90982 89400 88232 87601 88040 90090 93384 97012 100933 106224 113865 124085 136858
56888A36858J5186J6771J6965J6107J4704J2516R307N789K830L03k327m813o409
$$ 136858 152044 168815 185780 201887 216591 229107 238414 244203 247033 247336 245009 240196 233787
56875B33787o846o312n004l365k031q47J330N018R238J3076J7210K2766K9433
$$ 233787 226941 220629 215625 212260 210229 209382 210712 215730 224968 238044 255254 278020 307453
56862C07453L5832M0794M3258M1835L6064K7602J8750J0252J686o579j3359j8192
$$ 307453 343285 384079 427337 469172 505236 532838 551588 561840 563526 556947 543588 525396
56850E25396k1475k3294k3455k2338k0430j7200j1853m998J752P864J4410K2616
$$ 525396 503921 480627 457172 434834 414404 397204 385351 380353 382105 389969 404379 426995
56838D26995L2931M5139N7890O8186P2746P0254O1541M7971L1030J3190k794j5917
$$ 426995 459926 505065 562955 631141 703887 774141 835682 883653 914683 927873 925079 909162
56826I09162k7060l6742m4024m7948m8838m7570m4583m0116l4527k7964k0449
$$ 909162 882102 845360 801336 753388 704550 656980 612397 572281 537754 509790 489341
56815D89341j2507m860K778J1602K2024L2783M1850M7414M7938M2641L2579K0401
$$ 489341 476834 471974 474752 486354 508378 541161 583011 630425 678363 721004 753583 773984
56803G73984Q306l200j4299k4487l2719l8270m0953m1062l9448l7095l4202l0272
$$ 773984 782290 779090 764791 740304 707585 669315 628362 587300 547852 510757 476555 446283
56791D46283k5341k0376j6057j1845o806p66N816J2493J8664K3127K4612K2735
$$ 446283 420942 400566 384509 372664 365858 365092 370908 383401 402065 425192 449804 472539
56779D72539J8152J1865M728k583r477j5476k0334k4106k6961k8773k9025k7437
$$ 472539 490691 502556 507284 504701 495224 479748 459414 435308 408347 379574 350549 323112
56767C23112k4559k1419j8611j6139j3933j2156j0936j0145r493q661p489o229
$$ 323112 298553 277134 258523 242384 228451 216295 205359 195214 185721 177060 169571 163342
56755A63342n331m832m328l797l813m501m952m391l370k909k981k842k488k585
$$ 163342 158011 153179 148851 145054 141241 136740 131788 127397 124027 121118 118137 115295 112807 110222
56741A10222l059k963j964r28p31j201j567j373p46j85j87p11j108r47o04n32
$$ 110222 107163 104200 102236 101308 100577 99376 97809 96436 95690 95505 95318 94607 93499 92552 91948 91416
56725I1416l69M20J441J753J209N44L02M63R28J502J598Q80N6J17R71J698J882
$$ 91416 91047 91467 92908 94661 95870 96414 96716 97179 98107 99609 101207 102087 102143 102260 103231 104929 106811
56708A06811J746J255K78o12o53j37N0r4J01M88K43n68j000p95n78m40J21P95
$$ 106811 108557 109812 110090 109478 108825 108688 108738 108644 108745 109233 109476 108908 107908 107113 106535 106095 106216 107011
56690A07011O28k42o50n27j035k255k673j707p61p84o91N25J790J676O73J27k5
$$ 107011 107639 107397 106747 106220 105185 102930 100257 98550 97789 97005 96314 96839 98629 100305 100978 101105 101080
56673A01080o87j654j876j234o10m71n66o43n39R8J171J751J285P00J317L010
$$ 101080 100393 98739 96863 95629 95019 94548 93982 93339 92800 92898 94069 95820 97105 97805 99122 102132
56657A02132M423M684M029L117K540K703L352L578K961K292K457L138L420L170
$$ 102132 106555 111239 115268 118385 120925 123628 126980 130558 133519 135811 138268 141406 144826 147996
56643A47996K903K709K325J954K031K314K051J020k12j041j290j184j216j800
$$ 147996 150899 153608 155933 157887 159918 162232 164283 165303 165091 164050 162760 161576 160360 158560
56629A58560k654k959k476j923j877k031k039k207k642k587j564m15j63n08n90
$$ 158560 155906 152947 150471 148548 146671 144640 142601 140394 137752 135165 133601 133186 133023 132515 131925
56614A31925n42j031j726j613o81P2K51M37Q53Q95K83m34q15j122j533j571q79
$$ 131925 131383 130352 128626 127013 126332 126404 126655 127092 127945 128840 129123 128689 127874 126752 125219 123648 122769
56597A22769L0L56K8k57R3R33J574J589J301J334J706J753J080J50l53k95L5M20
$$ 122769 122799 123155 123183 122926 123019 123952 125526 127115 128416 129750 131456 133209 134289 134439 134086 133791 133826 134246
56579A34246P12P92R14J577K697L423L179K401J801J457J174J109J442J900K292
$$ 134246 134958 135750 136664 138241 140938 144361 147540 149941 151742 153199 154373 155482 156924 158824 161116
56564A61116L025M467O185P451Q077Q211P858P248P125P888Q877R248R080Q908
$$ 161116 164141 168608 174793 182244 190321 198532 206390 213638 220763 228651 237528 246776 255856 264764
56550B64764Q662Q005P216O805O466N423L633J881P44J48k23o72j470k508l278
$$ 264764 273426 281431 288647 295452 301918 307341 310974 312855 313599 313747 313524 312852 311382 308874 305596
56535C05596l672m327n645o950p403p199p071p137p038o742o337n535m276l379
$$ 305596 301924 297597 291952 285002 277599 270400 263329 256192 249154 242412 236075 230540 226264 222885
56521B22885l559m245m312l638k897k315j757j572k099k647k270j363j137j654
$$ 222885 219326 215081 210769 207131 204234 201919 200162 198590 196491 193844 191574 190211 189074 187420
56507A87420j798j212p73r21r38l66R1k83j152j858k350k784k866k277j317o25
$$ 187420 185622 184410 183637 182716 181778 181412 181503 181220 180068 178210 175860 173076 170210 167933 166616 165991
56491A65991m67n70m58J43J039J646J570R68J84n96j062p29K92J021P58Q1o4L03
$$ 165991 165524 164954 164496 164639 165678 167324 168894 169862 170046 169450 168388 167659 167951 168972 169730 169811 169747 170050
56473A70050N15M34L53K07j35j48O24J480J308K12p33j108j330j413q50K46J018
$$ 170050 170565 170999 171352 171559 171424 171276 171900 173380 174688 174900 174167 173059 171729 170316 169466 169712 170730
56456A70730J049O23r0j050j628j091J46R54J093J261J580J439R30R05J370J290
$$ 170730 171779 172402 172312 171262 169634 168543 168689 169643 170736 171997 173577 175016 175946 176851 178221 179511
56440A79511M18j32K54O98M39J30O02J406J659J433J294J164O55N4K6N53J007
$$ 179511 179929 179797 180051 180749 181188 181318 181920 183326 184985 186418 187712 188876 189531 189585 189611 190164 191171
56423A91171J073R97R96R25N69Nm23l54K17R10J363J508J308O45j97m95n8K29
$$ 191171 192244 193241 194237 195162 195731 195736 195313 194959 195176 196086 197449 198957 200265 200910 200713 200218 200160 200389
56405B00389l72j184r65L01J514K049K221K231J871J293R94R43O68L00N15J289
$$ 200389 200017 198833 197868 198169 199683 201732 203953 206184 208055 209348 210342 211285 211953 212253 212768 214057
56389B14057J725J354P65O35R79J461J845J949J776J662J775J708J189P31P26
$$ 214057 215782 217136 217901 218536 219515 220976 222821 224770 226546 228208 229983 231691 232880 233611 234337
56374B34337N34l64r37J48K170K990J995P18L85N33M33K95M66P40J026J588K146
$$ 234337 234871 234507 233570 233718 235888 238878 240873 241591 241976 242509 242942 243237 243703 244443 245469 247057 249203
56357B49203J937R63J46p7k00m72m73j23R1J57N96J304J563J385J487J821J538
$$ 249203 251140 252103 252249 252172 251972 251500 251027 250904 250995 251152 251748 253052 254615 256000 257487 259308 260846
56340B60846O32R9K22K40m3O8N43M31l18n67rL34J86N77J638J899Q39J47J118
$$ 260846 261478 261577 261799 262039 261996 262064 262607 263038 262720 262153 262144 262478 262664 263241 264879 266778 267617 267764 268882
56321B68882K556K746J961J495J551J583J623J856J792J161P69J285K041K067
$$ 268882 271438 274184 276145 277640 279191 280774 282397 284253 286045 287206 287975 289260 291301 293368
56307B93368J493J038R74J374K352L338L254K172J521J938K363K043J862K523
$$ 293368 294861 295899 296873 298247 300599 303937 307191 309363 310884 312822 315185 317228 319090 321613
56293C21613L061K574J973K493L632M100L836L591L454L191L192L830M551M726
$$ 321613 324674 327248 329221 331714 335346 339446 343282 346873 350327 353518 356710 360540 365091 369817
56279C69817M585M497M276M033M478N524N936N359N098N830O257N496N007O325
$$ 369817 374402 378899 383175 387208 391686 397210 403146 408505 413603 419433 425690 431186 436193 442518
56265D42518Q434R432R551J0426J2320J4183J5679J7217J8678J9855K1519K4352
$$ 442518 450952 460384 469935 480361 492681 506864 522543 539760 558438 578293 599812 624164
56253F24164K7555L0178L2978L7175M2113M6070M8769N1257N3845N5957N7586
$$ 624164 651719 681897 714875 752050 794163 840233 889002 940259 994104 1050061 1107647
56242A107647N9078N9778N8578N5530N1456M6336L9572L1476K3038J4548N860
$$ 1107647 1166725 1226503 1285081 1340611 1392067 1438403 1477975 1509451 1532489 1547037 1552897
56231A552897k439r535j5624k1396k6739l1254l5292l9198m2188m3476m3736m4045
$$ 1552897 1550458 1540923 1525299 1503903 1477164 1445910 1410618 1371420 1329232 1285756 1242020 1197975
56219A197975m4081m2983m1275m0108l9249l7487l4650l1621k8858k6393k4764
$$ 1197975 1153894 1110911 1069636 1029528 990279 952792 918142 886521 857663 831270 806506
56208H06506k4284k3907k2342j9889j7671j5729j3431j1175r908r395q633p575
$$ 806506 782222 758315 735973 716084 698413 682684 669253 658078 648170 638775 630142 622567
56196F22567o888o454n617m519l709l001k056j439j664j890j182k32k40q73r79
$$ 622567 615679 609225 603608 599089 595380 592379 590323 588884 587220 585330 584148 583916 583676 582803 581824
56181E81824n90m48l52K94J056J366J920L379M647M461L695L921M659M434L705
$$ 581824 581234 580786 580434 580728 581784 583150 585070 588449 593096 597557 601252 605173 609832 614266 617971
56166F17971M125N440N758M762M111M754O013P288Q611R607R824R919J0759J1779
$$ 617971 622096 627536 633294 638056 642167 646921 652934 660222 668833 678440 688264 698183 708942 720721
56152G20721J2084J2475J4304J7037J9229K1329K5086L0730L7230M4940N5242
$$ 720721 732805 745280 759584 776621 795850 817179 842265 872995 910225 955165 1010407
56141A010407O7784Q0447R2040J02653J11516J16940J18472J16988J12878J06266
$$ 1010407 1078191 1158638 1250678 1353331 1464847 1581787 1700259 1817247 1930125 2036391
56131B036391R8610R1799Q5781P9225P2061O5016N7326M7561L6507K6653J8934
$$ 2036391 2135001 2226800 2312581 2391806 2463867 2528883 2586209 2633770 2670277 2696930 2715864
56120B715864J2348O201K37p061j7344k9764m1966n3401o5079p6544q5950r2839
$$ 2715864 2728212 2734413 2734650 2727589 2710245 2680481 2638515 2585114 2520035 2443491 2357541 2264702
56108B264702r7966j00707r9536r4930q9003q2518p4917o6768n9263n1794m3160
$$ 2264702 2166736 2066029 1966493 1871563 1782560 1700042 1625125 1558357 1499094 1447300 1404140
56097A404140l4588k8387k4165j9758j5289j2611j1270q887n380k907j785l52
$$ 1404140 1369552 1341165 1317000 1297242 1281953 1269342 1258072 1249185 1243805 1240898 1239113 1238761
56085A238761J266J327L97R19K753L388K795L691O499Q516Q754R266J0884J1909
$$ 1238761 1240027 1241354 1241751 1242670 1245423 1248811 1251606 1255297 1261796 1270312 1279066 1288332 1299216 1311125
56071A311125J1977J2987J5212J6567J6610J7200J8401J8048J6225J5676J6822
$$ 1311125 1323102 1336089 1351301 1367868 1384478 1401678 1420079 1438127 1454352 1470028 1486850
56060A486850J6880J5020J3890J4674J5213J4435J4226J5485J6587J7125J8727
$$ 1486850 1503730 1518750 1532640 1547314 1562527 1576962 1591188 1606673 1623260 1640385 1659112
56049A659112K1048K1459K0061K0240K2899K4991K5148K5760K7862K9158K8986
$$ 1659112 1680160 1701619 1721680 1741920 1764819 1789810 1814958 1840718 1868580 1897738 1926724
56038A926724L0065L3234L5489L5380L5462L7240L8643L8615L9272M1433M2896
$$ 1926724 1956789 1990023 2025512 2060892 2096354 2133594 2172237 2210852 2250124 2291557 2334453
56027B334453M3140M4648M7706M9206M8460M8734N1144N2856N3197N5410O0102
$$ 2334453 2377593 2422241 2469947 2519153 2567613 2616347 2667491 2720347 2773544 2828954 2889056
56016B889056O3357O3810O5114O8925P2083P3383P6211Q1582Q5673Q7336R0841
$$ 2889056 2952413 3016223 3081337 3150262 3222345 3295728 3371939 3453521 3539194 3626530 3717371
56005C717371R7800J03850J06807J10599J17428J23792J28118J34335J43821J51947
$$ 3717371 3815171 3919021 4025828 4136427 4253855 4377647 4505765 4640100 4783921 4935868
55995D935868J56801J63040J72930J82372J90065K01186K17290K32353K43937
$$ 4935868 5092669 5255709 5428639 5611011 5801076 6002262 6219552 6451905 6695842
55986F695842K58125K78015K98083L15683L36866L64561L92834M19574M52366
$$ 6695842 6953967 7231982 7530065 7845748 8182614 8547175 8940009 9359583 9811949
55977I811949M94429N37991N79635O28385O89852P57169Q27193R10090J012379
$$ 9811949 10306378 10844369 11424004 12052389 12742241 13499410 14326603 15236693 16249072
55968A6249072J127166J252821J403817J590741J809025K061359K370496K755434
$$ 16249072 17376238 18629059 20032876 21623617 23432642 25494001 27864497 30619931
55960C0619931L219852L783074M497876N420921O601005Q125468J0146180J2830218
$$ 30619931 33839783 37622857 42120733 47541654 54142659 62268127 72414307 85244525
55952H5244525J6309616K0651413K5695478L0737228L4435283L5330608L2714133
$$ 85244525 101554141 122205554 147901032 178638260 213073543 248404151 281118284
55945B81118284K7058512J9614437J1622944L849549l373111r896541j5567102
$$ 281118284 308176796 327791233 339414177 343263726 339890615 329994074 314426972
55938C14426972k0144379k3341730k4992778k5202880k4308974k2691557k0650830
$$ 314426972 294282593 270940863 245948085 220745205 196436231 173744674 153093844
55931A53093844j8421678j6203253j4126217j2234349j0533931r038960p755652
$$ 153093844 134672166 118468913 104342696 92108347 81574416 72535456 64779804
55924F4779804o660854n725102m937073m286662l745514l284264k892582k565832
$$ 64779804 58118950 52393848 47456775 43170113 39424599 36140335 33247753 30681921
55916C0681921k287889k043050j830752j653409j501738j365377j246363j149153
$$ 30681921 28394032 26350982 24520230 22866821 21365083 19999706 18753343 17604190
55908A7604190j067365r92010r23318q63641q07807p50883o97094o51421o10220
$$ 17604190 16536825 15544815 14621497 13757856 12950049 12199166 11502072 10850651 10240431
55899A0240431n68918n30922n00125m72276m42392m13523l89882l68212l44029
$$ 10240431 9671513 9140591 8640466 8168190 7725798 7312275 6922393 6554181 6210152
55890F210152l19983l00133k82022k61971k42536k27516k14923k01651j89673
$$ 6210152 5890169 5590036 5308014 5046043 4803507 4575991 4361068 4159417 3969744
55881C969744j81225j73233j62868j53330j47898j43475j36212j28308j23018
$$ 3969744 3788519 3615286 3452418 3299088 3151190 3007715 2871503 2743195 2620177
55872B620177j18116j10569j02780r7831r3214q5684p7867p3590p0808o5557n9173
$$ 2620177 2502061 2391492 2288712 2190881 2097667 2011983 1934116 1860526 1789718 1724161 1664988
55861A664988n5224n2786m8935m4708m2580m0968l7091l2581l0758l0779k9798
$$ 1664988 1609764 1556978 1508043 1463335 1420755 1379787 1342696 1310115 1279357 1248578 1218780
55850A218780k8328k8350k8612k6852k4440k3974k4537k3902k2988k3557k3975
$$ 1218780 1190452 1162102 1133490 1106638 1082198 1058224 1033687 1009785 986797 963240 939265
55839I39265k1962j9222j8669j9302j8389j6477j5704j5273j3326j1242j1407
$$ 939265 917303 898081 879412 860110 841721 825244 809540 794267 780941 769699 758292
55828G58292j2502j1596r329q582r446r843r746j0588j1726j1443j0338j0028
$$ 758292 745790 734194 724865 716283 706837 696994 687248 676660 664934 653491 643153 633125
55816F33125r888q552p126p207p439n771l502l140l763k549L30K337L013L872
$$ 633125 623237 614685 607559 600352 592913 587142 583640 580500 576737 574188 574518 576855 579868 583740
55802E83740M887M780L990L845L616J765q38k308l234n384q063r140q826q898
$$ 583740 588627 593407 597397 601242 604858 606623 605785 603477 600243 594859 586796 577656 568830 559932
55788E59932r151q135o589o636q159r290r862j1037j2249j1849j0301r535r633
$$ 559932 550781 542646 536057 529421 521262 511972 502110 491073 478824 466975 456674 447139 437506
55775D37506r114p959p258o615m951l228l219m241m302l779m574o205o347m979
$$ 437506 428392 420433 413175 406560 401609 398381 395162 390921 386619 382840 378266 372061 365714 360735
55761C60735m505n663o693o815p229q307q760q203p834p997p512n828l723j601
$$ 360735 356230 350567 343874 337059 329830 321523 312763 304560 296726 288729 281217 275389 271666 270065
55747B70065Q30L029L886L566L180K840J957J075J161J491N07j470k696k848l090
$$ 270065 270895 273924 277810 281376 284556 287396 289353 290428 291589 293080 293587 292117 289421 286573 283483
55732B83483l579l342k427j882j700j064l81q44k117k787k878l577m648m634l539
$$ 283483 279904 276562 274135 272253 270553 269489 269108 268264 266147 263360 260482 256905 252257 247623 244084
55717B44084k838k742j922k12Q33M21m99j063j364j327o33J01r3p79p00O2L64
$$ 244084 241246 238504 236582 236370 237203 237624 237125 236062 234698 233371 232738 232839 232746 231967 231267 231329 231693
55700B31693J34K20K93p51k465l118k377j616j460j198o30l95k84N97J878K233
$$ 231693 231827 232047 232340 231589 229124 226006 223629 222013 220553 219355 218725 218330 218046 218643 220521 222754
55684B22754J729J787K617K919K376K256L029L422K477Q79l47r09p59J5O39L38
$$ 222754 224483 226270 228887 231806 234182 236438 239467 242889 245366 246245 245898 244989 244230 244245 244884 245222
55668B45222m10n98l86n60p93k22P50J130J312K256L287L040K172K490L651L468
$$ 245222 244812 244214 243828 243268 242475 242253 243003 244133 245445 247701 250988 254028 256200 258690 262341 265809
55652B65809J584l1n19j245k889m249m756n629p461q892q791p832o950o064n135
$$ 265809 267393 267362 266843 265598 262709 258460 253704 248075 240614 231722 222931 215099 208149 202085 196950
55637A96950m703m604l860k510j821k130k246j571r21p72n31j80o14j714k052
$$ 196950 192247 187643 183783 181273 179452 177322 175076 173505 172584 171812 171281 171101 170487 168773 166721
55622A66721j303r38j734k479k105j272r41j016j259j904k626k490j667j464k009
$$ 166721 165418 164480 162746 160267 158162 156890 155949 154933 153674 151770 149144 146654 144987 143523 141514
55607A41514j821m27N69Lj080j298r05p43q07q27r58r88l22O14M83p65j542j162
$$ 141514 139693 139266 139835 139838 138758 137460 136555 135812 135005 134178 133220 132232 131910 132524 133007 132242 130700 129538
55589A29538q47j373j741j210p10r02p77M49J766K107K032K223J940O41m34K6
$$ 129538 128691 127318 125577 124367 123657 122755 121978 122427 124193 126300 128332 130555 132495 133136 132702 132728
55573A32728J250J699J383J257J267P35l5j02O26J462K012K172J703P21p8l96
$$ 132728 133978 135677 137060 138317 139584 140319 140284 140182 140808 142270 144282 146454 148157 148878 148800 148404
55557A48404q23j631k152k012j882k171k153j377p04r10j338j111n94m75m17J73
$$ 148404 147581 145950 143798 141786 139904 137733 135580 134203 133499 132589 131251 130140 129546 129071 128654 128827
55541A28827R21J238J430J928K209J675Q64O37Q62Q57N29J42m00j100j455j188
$$ 128827 129748 130986 132416 134344 136553 138228 139092 139729 140591 141448 141977 142119 141719 140619 139164 137976
55525A37976q21q09r10r82j382k009k070j508j409k184k723k289j778j982k093
$$ 137976 137155 136346 135436 134454 133072 131063 128993 127485 126076 123892 121169 118880 117102 115120 113027
55510A13027j307n46r41j770j670q83n36n39LQ28Q75K04j11K05M08K42K16M40
$$ 113027 111720 111174 110233 108463 106793 105910 105374 104835 104838 105666 106541 106745 106634 106839 107247 107489 107705 108145
55492A08145M36J11j60l43o91j048j004o21j93L27R38J105N49l0N7K42m44j756
$$ 108145 108581 108692 108532 108189 107498 106450 105446 104825 104632 104959 105897 107002 107551 107521 107578 107820 107376 105620
55474A05620k506k175j224p7J095J917K003J583J097M41o18j606j793j246o41
$$ 105620 103114 100939 99715 99638 100733 102650 104653 106236 107333 107774 107156 105550 103757 102511 101870
55459A01870k79k6P7p2j68Q6L71J93k61l84k3M73P67O38op91r72l40M57R28J302
$$ 101870 101591 101565 101642 101570 101402 101488 101859 102052 101791 101407 101384 101857 102624 103262 103256 102465 101493 101153 101610 102538 103840
55438A03840J685J509N40l82m34Q1M30N17M92Q3p13j027k30R17J240P18J60n3
$$ 103840 105525 107034 107574 107192 106758 106839 107269 107786 108278 108361 107648 106621 106391 107308 108548 109266 109426 109373
55420A09373q4N7L62N14M51O75J307J574J057N34O27N78m33j675j837j015l33
$$ 109373 109289 109346 109708 110222 110673 111348 112655 114229 115286 115820 116447 117025 116592 114917 113080 112065 111732
55403A11732j49JJ81Q2q5L5L9n09r77n45K19P0r79j796j919j781j394l40R43J349
$$ 111732 111583 111584 111765 111847 111762 111797 111836 111327 110350 109805 110024 110094 109115 107319 105400 103619 102225 101885 102828 104177
55383A04177P53K23L42N39K62k23n76r43j443j816j813j392n26O13J457J616J462
$$ 104177 104930 105153 105495 106034 106296 106073 105497 104554 103111 101295 99482 98090 97564 98177 99634 101250 102712
55366A02712J437J264N66j43j63J53q3p50q99k97L37N83O60N32j36j029j332r47
$$ 102712 104149 105413 105979 105836 105673 105826 105743 104993 104094 103797 104134 104717 105377 105909 105773 104744 103412 102465
55348A02465o89r40j094n56M56J308J560J082K04l10l5M42K71m35q35o69m35m17
$$ 102465 101776 100836 99742 99186 99642 100950 102510 103592 103796 103486 103451 103893 104164 103729 102894 102225 101790 101373
55330A01373l79k53k14j05M50J241J480P91l26j061r49j84M06K3j015j385n01
$$ 101373 100994 100741 100527 100422 100872 102113 103593 104384 104058 102997 102048 101864 102270 102293 101278 99893 99392
55313I9392N73O27qk40J5P5n2K19P36P72K75q7j04r9n7K18L28j38m89K56J572
$$ 99392 99965 100592 100584 100344 100359 100434 100382 100601 101337 102109 102384 102297 102193 102094 102037 102255 102583 102445 101956 102212 103784
55292A03784J902R47J02K85P30L98n47j288j514j480j437j437j274o55K57P10
$$ 103784 105686 106633 106735 107020 107750 108148 107601 106313 104799 103319 101882 100445 99171 98516 98773 99483
55276I9483L60n1K80R70J173R99J108J238N69o89j379j027k46M79J109J310O88
$$ 99483 99843 99792 100072 101042 102215 103214 104322 105560 106129 105440 104061 103034 102788 103267 104376 105686 106374
55259A06374j95l55J20L19J49L13O93L77n19o54M55J595J627P77k38j164j772
$$ 106374 106179 105824 105944 106263 106412 106725 107418 107795 107276 106622 107077 108672 110299 111076 110838 109674 107902
55242A07902j711j242j051j060n39L96P50M09L76R17J021L20p5N09J057N23n18
$$ 107902 106191 104949 103898 102838 102299 102695 103445 103854 104230 105147 106168 106488 106413 106922 107979 108502 107984
55225A07984r71p91m71pO30Q70M42N8L07O98O34M18M10L2j223k509k542j303Q0
$$ 107984 107013 106222 105751 105744 106374 107244 107686 107744 108051 108749 109383 109801 110211 110243 109020 106511 103969 102666 102746
55206A02746P76P63L23j87l04Q9N70P80P99P11L79L7K21P17N49m16r22j75P15
$$ 102746 103522 104285 104608 104421 104117 104206 104776 105556 106355 107066 107445 107482 107703 108420 108969 108553 107631 107456 108171
55187A08171K46j272k122j361L61J822K205J370l6r57r49n55l09J9O24R68O28
$$ 108171 108417 107145 105023 103662 104023 105845 108050 109420 109384 108427 107478 106923 106614 106633 107257 108225 108853
55170A08853K28M88R81Q21J81J3N11R01P84O18P23O77Q4o82r35n52j8K85M95Q47
$$ 108853 109081 109569 110550 111371 111552 111565 112076 112977 113761 114379 115102 115779 115863 115181 114246 113694 113676 113961 114456 115303
55150A15303J075O14m33j108q05k22l92j141j435j027o70o70m94KJ97j2J92J092
$$ 115303 116378 116992 116559 115451 114646 114424 114032 112891 111456 110429 109759 109089 108595 108597 108794 108782 108974 110066
55132A10066J739J463R38Q68O58m71j900k305j437j63Q14J283J089L49k07p6J81
$$ 110066 111805 113268 114206 115074 115732 115261 113361 111056 109619 109456 110270 111553 112642 112991 112784 112708 112889
55115A12889k24r77j093m12L02N97O79O53L36n8J07R38J693J661R84L77K64M68
$$ 112889 112665 111688 110595 110183 110485 111082 111761 112414 112750 112692 112799 113737 115430 117091 118075 118452 118716 119184
55097A19184N70M87N31Q00Q02J32p06q27k65K4l30n92j59M86O42L66L7l17o17
$$ 119184 119754 120241 120772 121572 122374 122506 121800 120973 120708 120732 120402 119810 119651 120137 120779 121145 121182 120865 120248
55078A20248m28K60O26J23o12p39m72n72j084j404j227o41L06J411K075J913J296
$$ 120248 119820 120080 120706 120829 120217 119478 119006 118434 117350 115946 114719 114078 114384 115795 117870 119783 121079
55061A21079O78m3r24j351q77j25N9j63j53m1l50p48m13N09Q99K27q33j426j418
$$ 121079 121757 121714 120790 119439 118562 118437 118496 118333 118180 118139 117789 117041 116628 117137 118036 118263 117430 116004 114586
55042A14586j154r71j044j201r30o8P90J029R24J108J491J472J005O09M47K20
$$ 114586 113432 112461 111417 110216 109286 109218 110008 111037 111961 113069 114560 116032 117037 117646 118093 118313
55026A18313n4J0L78N31K73mKJ34J73J81L24O66J127J373R68m4r27j064o48k11
$$ 118313 118259 118269 118647 119178 119451 119447 119449 119583 119756 119937 120261 120927 122054 123427 124395 124351 123424 122360 121712 121501
55006A21501J58O57J187J555J872K214K231J665Q54J34p09j726k150j414l21o8
$$ 121501 121659 122316 123503 125058 126930 129144 131375 133040 133894 134028 133319 131593 129443 128029 127708 127640
54990A27640n20n78n6J56k69o05m26k75n51q27o86m16l52k30K72R43J352J372
$$ 127640 127120 126542 126486 126642 126373 125768 125342 125067 124516 123689 123003 122587 122235 122005 122277 123220 124572 125944
54972A25944J085O62M46P01J096R82K81l81n18j78N42J626K599K575J347j44q56
$$ 125944 127029 127691 128137 128838 129934 130916 131197 130816 130298 130120 130662 132288 134887 137462 138809 138665 137809
54955A37809p41m23k33k2L36O90Q30O98L87J05j0m2j59l18l30k08k07m59p29o57
$$ 137809 137068 136645 136412 136390 136726 137416 138246 138944 139331 139436 139426 139384 139225 138907 138577 138369 138162 137703 136974 136317
54935A36317j04O90J309J565J792K491L620M537M838M934N474O499P396P565O791
$$ 136317 136213 136903 138212 139777 141569 144060 147680 152217 157055 161989 167463 173962 181358 188923 195714
54920A95714N259L478K003R63K2j070k222l315m263m697m317l714l973n036n465
$$ 195714 200973 204451 206454 207417 207439 206369 204147 200832 196569 191872 187555 183841 179868 174832 169367
54905A69367m453l082k662k826k364j218l37n5L6l7m98q46l42O26J003Q42J235
$$ 169367 164914 161832 159170 156344 153980 152762 152425 152370 152406 152369 151871 151025 150683 151309 152312 153154 154389
54888A54389K372L160L055K928L573M577N263N687O047O030N381M444L515K353
$$ 154389 156761 159921 162976 165904 169477 174054 179317 185004 191051 197081 202462 206906 210421 212774
54874B12774Q48n18j413k198l199m054m390m565n036n466n165m190l330l159l493
$$ 212774 213622 213104 211691 209493 206294 202240 197850 193285 188249 182783 177618 173428 170098 166939 163446
54859A63446l749l448k489j266m99o80j584k398k395j566o77n17j016j382j200
$$ 163446 159697 156249 153760 152494 151995 151315 149731 147333 144938 143372 142695 142178 141162 139780 138580
54844A38580r65j230j745j946j830j664j263m30K51P6n49n36K76R28Q55N54N58
$$ 138580 137615 136385 134640 132694 130864 129200 127937 127507 127758 127834 127285 126749 127025 127953 128808 129362 129920
54827A29920P35Q83J082J170P24p2m01m1K49k4l09o4K62k1o90r53o19k12k13o24
$$ 129920 130655 131538 132620 133790 134514 134442 134041 134000 134249 134225 133916 133852 134114 134093 133403 132450 131831 131619 131406 130782
54807A30782j122j235o11N50J522J778J508J237J202J212Q98P3r44j411r90k72
$$ 130782 129660 128425 127814 128364 129886 131664 133172 134409 135611 136823 137721 137794 136850 135439 134449 134177
54791A34177l9j63P7P56J274J485J868K414K409J720J264J625K072J706Q92P05
$$ 134177 134138 133975 134052 134808 136082 137567 139435 141849 144258 145978 147242 148867 150939 152645 153537 154242
54775A54242J455K591L709M898O136P038P276O910O253N596N002M284L225J900
$$ 154242 155697 158288 161997 166895 173031 180069 187345 194255 200508 206104 211106 215390 218615 220515
54761B20515N90n73j651k662l539m218m576m438m015l965m544n037m684l767l005
$$ 220515 221105 220532 218881 216219 212680 208462 203886 199448 195433 191468 186924 181887 177203 173436 170431
54746A70431k351j429p50j152k085k006o68L92J90l59n7Q07J291J314J385J638
$$ 170431 168080 166651 165901 164749 162664 160658 159990 160382 160572 160213 160156 160963 162254 163568 164953 166591
54730A66591K007K738L894M913N402N686O001N812M719L325K413J801Q47m84j799
$$ 166591 168598 171336 175230 180143 185545 191231 197232 203044 207763 211088 213501 215302 216149 215665 213866
54715B13866l015m094m541m087l410l353l722l630k818j918j598k052l052m001
$$ 213866 210851 206757 202216 198129 194719 191366 187644 184014 181196 179278 177680 175628 172576 168575
54701A68575m204l629l028k868k641j733m84L16M86L30m9n95q74n75j40j56m97
$$ 168575 164371 160742 157714 154846 152205 150472 149988 150304 150790 151120 151071 150476 149602 149027 148887 148731 148234
54684A48234p00p91j043j289j233j072j096j046o01j34j47l03J21J068J815J994
$$ 148234 147534 146743 145700 144411 143178 142106 141010 139964 139363 139229 139082 138779 138900 139968 141783 143777
54668A43777J697R06k77j119r64k77m6k93k04L71O47K22l41n46o16q01q02k97
$$ 143777 145474 146380 146103 144984 144020 143743 143697 143404 143200 143571 144218 144440 144099 143553 142937 142136 141334 141037
54650A41037N13J230J633J577J035L85J56K99K57j08k62J12N18L95k2q1K40J89
$$ 141037 141550 142780 144413 145990 147025 147410 147566 147865 148122 148014 147752 147864 148382 148777 148755 148674 148914 149103
54632A49103p23j875k058r27M30P23Rn25k69J79K20J52L65M64Rn78o48l36p2L47
$$ 149103 148380 146505 144447 143520 143950 144673 144682 144157 143888 144067 144287 144439 144804 145268 145277 144699 144051 143715 143643 143990
54612A43990J210J901J598O65J85K80R8o15j119j014p49n97k78P0k87j351j932
$$ 143990 145200 147101 148699 149364 149549 149829 149927 149312 148193 147179 146430 145833 145555 145625 145338 143987 142055
54595A42055j197J25Q72R78J117J396J328Q20L87M16P67J031Q71K13n13n43M27
$$ 142055 140858 140983 141855 142833 143950 145346 146674 147494 147881 148297 149064 150095 150966 151179 150666 150123 150550
54578A50550J746K434K195J501Q09J31o50j389j778j647j031p9R67J715J771J076
$$ 150550 152296 154730 156925 158426 159235 159366 158716 157327 155549 153902 152871 152792 153759 155474 157245 158321
54562A58321M1p92j251j462j415r25j17M67M73J55p4j53j97j19J98N70P45P59
$$ 158321 158362 157570 156319 154857 153442 152517 152400 152867 153340 153495 153421 153268 153071 152952 153150 153720 154465 155224
54544A55224P17N27J88J25O63J437J753J466J001O92N92P65J209J534J308O97
$$ 155224 155941 156468 156656 156781 157444 158881 160634 162100 163101 163793 164385 165150 166359 167893 169201 169898
54528A69898K66J37j06o24r71p61l00k42q60j810k471k404j637n38N07J267J546
$$ 169898 170164 170301 170195 169571 168600 167839 167539 167297 166437 164627 162156 159752 158115 157577 158084 159351 160897
54511A60897J219M87k16o97j063j248r80m08j36l14k86L92J176J335R17L57k99
$$ 160897 162116 162603 162387 161690 160627 159379 158399 157991 157855 157541 157255 157647 158823 160158 161075 161432 161133
54494A61133j051j391r40k19Rj31o0J69P9k27k31J02M92J055J899K359J798Q27
$$ 161133 160082 158691 157751 157532 157541 157410 157350 157519 157598 157371 157140 157242 157734 158789 160688 163047 164845 165672
54476A65672N45Q12O35L9M6P09Q53J31k93K68Q40M57k56j90N04Q71O50K89J6k77
$$ 165672 166217 167029 167664 167703 167749 168458 169311 169442 169149 169417 170257 170714 170458 170268 170772 171643 172293 172582 172598 172321
54456A72321n13m63r4N52J396J996J736P28j77n71r80j701k028j351k67J54k21
$$ 172321 171808 171345 171251 171803 173199 175195 176931 177659 177482 176911 175931 174230 172202 170851 170584 170738 170517
54439A70517o59o56k67K60O27N58K00J16M53O32K54k53l92l82n44n54m9N10M15
$$ 170517 169858 169202 168935 169195 169822 170380 170580 170696 171149 171781 172035 171782 171390 171008 170464 169910 169861 170371 170786
54420A70786j67m55j75K46M22L66K30K73P36J360J346M40m44l64L02M80Nl10l
$$ 170786 170619 170164 169989 170235 170657 171023 171253 171526 172262 173622 174968 175408 174964 174600 174902 175382 175387 175077 175074
54401A75074N90J125J476J228l5j678k296j435k43Q2k07j23N00R44Q28N50M48
$$ 175074 175664 176789 178265 179493 179458 177780 175484 174049 173806 173888 173681 173558 174058 175002 175830 176380 176828
54384A76828K22m14j002p53L61J391J480Q32L88O52J244J489J140M26k55n94n37
$$ 176828 177050 176636 175634 174881 175242 176633 178113 178945 179333 179985 181229 182718 183858 184284 184029 183435 182898
54367A82898l22j79rL95Q86J085R22O97N78N12O15J045J436J151L41n9L14O42
$$ 182898 182576 182397 182388 182783 183669 184754 185676 186373 186951 187463 188078 189123 190559 191710 192051 191992 192306 192948
54349A92948K02n07n79j09J09o2J0O19J272J411J021M34oo8K29N77O76M86%q58
$$ 192948 193150 192643 192064 191955 192064 192002 192012 192631 193903 195314 196335 196769 196763 196695 196924 197501 198177 198663 198663 197805
54329A97805j841k298j947j368j211j315j168q26o96o76l77j5j99q61j235j014
$$ 197805 195964 193666 191719 190351 189140 187825 186657 185831 185135 184459 184082 184067 183868 183007 181772 180758
54313A80758p06o52n07qM53M63K67L00N04M94K27npJ12J20j39o05r86j023p99
$$ 180758 180052 179400 178893 178885 179338 179801 180068 180368 180872 181366 181593 181588 181581 181693 181813 181674 181069 180083 179060 178261
54293A78261o02m80k53J7%l63o49m75K6M47O26O89Q10J018J103P51o6p71o87P3
$$ 178261 177659 177179 176926 176943 176943 176580 175931 175456 175482 175929 176555 177244 178054 179072 180175 180926 180860 180089 179402 179475
54273A79475O07L10m28q72q77q23q87q56n63j07L73Q07J041R29O16N11P89J122
$$ 179475 180082 180392 179964 179092 178215 177392 176505 175649 175086 174979 175352 176159 177200 178129 178745 179256 180045 181167
54255A81167J117Q40P46R80J024K63j106k060j829p99jJ74K55O13P63J78o47p42
$$ 181167 182284 183124 183870 184850 185874 186137 185031 182971 181142 180343 180342 180516 180771 181384 182147 182325 181678 180936
54237A80936j03K25k81p76k98P67J191N84k87p47r26j046q52j64N75Q97R20Q89
$$ 180936 180833 181058 180777 180001 179703 180470 181661 182245 181958 181211 180285 179239 178387 178223 178798 179695 180615 181504
54219A81504N00n60j735k063j472q60p85q15l93K99P43Q51Q88R48R02P10M57J65
$$ 181504 182004 181444 179709 177646 176174 175314 174529 173714 173321 173620 174363 175214 176102 177050 177952 178662 179119 179284
54201A79284j06j98j2K62L41J59m6PL24N16J12q56j658j602q70k50j47k35j32
$$ 179284 179178 178980 178968 179230 179571 179730 179684 179691 180015 180531 180643 179787 178129 176527 175657 175407 175260 175025 174893
54182A74893Q4J96J53j15p31j469j734j279n23M6M13O84O66K99L4K10L57k13j279
$$ 174893 174977 175173 175326 175211 174480 173011 171277 169998 169475 169521 169934 170618 171284 171583 171617 171827 172184 171971 170692
54163A70692j825j291j74P36J184J325J155N38l67j007r01j34O83J046J027J063
$$ 170692 168867 167576 167402 168138 169322 170647 171802 172340 171973 170966 170065 169931 170614 171660 172687 173750
54147A73750J334J613J688J667J677J568J101L64k31l18N0M11L09j29k34L35R84
$$ 173750 175084 176697 178385 180052 181729 183297 184398 184762 184531 184213 184263 184674 184983 184854 184620 184955 185939
54130A85939Q38l8p14o57k90q4J95Q41J420J234L90k38m4O67J186J196J000J047
$$ 185939 186777 186739 186025 185368 185078 184994 185189 186030 187450 188684 189074 188836 188792 189459 190645 191841 192841 193888
54112A93888J266J078J58j002j641j660j536j435j073m49M6L61Q41J314J009j92
$$ 193888 195154 196232 196390 195388 193747 192087 190551 189116 188043 187594 187640 188001 188842 190156 191165 190973
54096A90973j248j266o16j28O9K01M5n77j051o90R6L45pj34L45R29J107Q96M90
$$ 190973 189725 188459 187843 187715 187784 187985 188030 187453 186402 185712 185808 186153 186146 186012 186357 187286 188393 189289 189779
54077A89779J69M65J602K739K617J168k24l37O34J654K091K054K029K484L560
$$ 189779 189948 190413 192015 194754 197371 198539 198315 197978 198612 200266 202357 204411 206440 208924 212484
54062B12484M838N732O198O865Q346J0629J3115J4910J5167J3607J0888Q128N921
$$ 212484 217322 223054 229252 236117 244463 255092 268207 283117 298284 311891 322779 330907 336828
54049C36828L963J695r98l688n749o759o800o376n890n293m346l040j580j69R41
$$ 336828 340791 342486 341488 337800 332051 325292 318492 312116 306226 300933 296587 293547 291967 291798 292739
54034B92739J484J539J580J858K069J907J619J563J623J530J400J374J169N58
$$ 292739 294223 295762 297342 299200 301269 303176 304795 306358 307981 309511 310911 312285 313454 314012
54020C14012m8j54Mj12m42o33r50j958l457m573m870m596l973l166k800l505m868
$$ 314012 313964 313810 313814 313702 313260 312627 311677 309719 306262 301689 296819 292223 288250 285084 282284 278779 273911
54003B73911n739n652n079m346l365k494k421k859k583j309l97r18k037k255j551
$$ 273911 268172 262520 257441 253095 249730 247236 244815 241956 239373 238064 237667 236749 234712 232457 230906
53988B30906j224j949k940k988j761o9Q92O78J01K91J179J520O27o29j025n89
$$ 230906 229682 227733 224793 221805 220044 219975 220867 221545 221646 221937 223116 224636 225263 224634 223609 223020
53972B23020k94o21j036q16K09J640K885L615L999M407M876N145N257N466N533
$$ 223020 222726 222105 221069 220253 220462 222102 224987 228602 232601 237008 241884 247029 252286 257752 263285
53957B63285M738K980J248M84M88M46N9m23r14j548k134k157j389j60J016J833
$$ 263285 268023 271003 272251 272735 273223 273669 273728 273305 272391 270843 268709 266552 265163 265003 266019 267852
53941B67852K245K339K239K091K165K755L774M592M753M607M729M871M260K953
$$ 267852 270097 272436 274675 276766 278931 281686 285460 290052 294805 299412 304141 309012 313272 316225
53927C16225K019K166K933L597M041M373M406M085L757L577L283K999L453M862
$$ 316225 318244 320410 323343 326940 330981 335354 339760 343845 347602 351179 354462 357461 360914 365776
53913C65776O342P134P624Q377Q955Q684P956P646P769P917Q602J0714J3690J5574
$$ 365776 372118 379252 386876 395253 404208 412892 420848 428494 436263 444180 452782 463496 477186 492760
53899D92760J5148J2959J0018O617K837q39m084p227j0521j3462j5387j6324j6732
$$ 492760 507908 520867 530885 537502 540339 539500 535416 528189 517668 504206 488819 472495 455763
53886D55763j6753j6249j5310j4255j3197j1987j0564r163q114p606p529p510
$$ 455763 439010 422761 407451 393196 379999 368012 357448 348285 340171 332565 325036 317526
53874C17526p168o367n256m092l235l061l573m117l888k859j898j824k648l737
$$ 317526 310358 303991 298735 294643 291408 288347 284774 280657 276769 273910 272012 270188 267540 263803
53860B63803m506m686m274l444k517j789j391j323j474j570j329p77l28l74q41
$$ 263803 259297 254611 250337 246893 244376 242587 241196 239873 238399 236829 235500 234723 234395 234021 233180
53845B33180j218j014j98P70J289J023P9j119k054k306j800r32l17j86j65J83
$$ 233180 231962 230948 230750 231520 232809 233832 233911 232792 230738 228432 226632 225700 225383 225197 225032 225215
53829B25215P43J062J042J106J527J959J884J348Q43N61J50n51r92n52M90J169
$$ 225215 225958 227020 228062 229168 230695 232654 234538 235886 236729 237290 237440 236889 235897 235345 235835 237004
53813B37004J087Q42J040J394J334J061J349K453L815M836N381N492N169M583
$$ 237004 238091 238933 239973 241367 242701 243762 245111 247564 251379 256215 261596 267088 272257 276840
53799B76840M067L760L557L458L617L947M087L797L168K421J905K112L070L741
$$ 276840 280907 284667 288224 291682 295299 299246 303333 307130 310298 312719 314624 316736 319806 323547
53785C23547K838M89j592k006j192p42j605l357m769m833l633k482k698m027m823
$$ 323547 326385 326874 325282 323276 322084 321342 319737 316380 311611 306778 303145 300663 297965 293938 289115
53770B89115m142k861k332k628k885k786k724k826k696k126j420j011j112j681
$$ 289115 284973 282112 279780 277152 274267 271481 268757 265931 263235 261109 259689 258678 257566 255885
53756B55885k304k417j984j721k140k772k856k444k097j825j145j04N84N56K64
$$ 255885 253581 251164 249180 247459 245319 242547 239691 237247 235150 233325 232180 232076 232660 233216 233480
53741B33480K40M79P70J096J472J640J275L31q23j562j436n83L86J051J486J765
$$ 233480 233720 234199 234969 236065 237537 239177 240452 240783 239960 238398 236962 236379 236765 237816 239302 241067
53725B41067J661J194R97J531K269K324J662J068R81J106J135J190J510K163L081
$$ 241067 242728 243922 244919 246450 248719 251043 252705 253773 254754 255860 256995 258185 259695 261858 264939
53710B64939L944M073L081J618R11J410K367K848K717K509K684L203L554L243
$$ 264939 268883 272956 276037 277655 278566 279976 282343 285191 287908 290417 293101 296304 299858 303101
53696C03101K406J835K125K983L689L962L864L250J981N31k96k50K79Q96J346
$$ 303101 305507 307342 309467 312450 316139 320101 323965 327215 329196 329727 329431 329181 329460 330356 331702
53681C31702J231L99m77n38Q3M64L29L62R33J432J251O04k4o10j325k043k498
$$ 331702 332933 333332 332855 332317 332400 332864 333193 333555 334488 335920 337171 337775 337751 337141 335816 333773 331275
53664C31275k545k062j107l04m18j215j509o90M34P65K90k51m80n58o31p16q76
$$ 331275 328730 326668 325561 325257 324839 323624 322115 321425 321859 322624 322914 322663 322183 321625 320994 320278 319402
53647C19402j032q35j84M22M40j2l49j56N57J476K044J876J282J000J139R92K62
$$ 319402 318370 317535 317351 317773 318213 318201 317852 317696 318253 319729 321773 323649 324931 325931 327070 328062 328324
53630C28324k65J18Q43R37N81Q06J836K736K794K350K026J905J875K157L008M190
$$ 328324 328059 328177 329020 329957 330538 331344 333180 335916 338710 341060 343086 344991 346866 349023 352031 356221
53614C56221N038N041M227L216K800L226L893M049L672L363L406L553L683M092
$$ 356221 361259 366300 370527 373743 376543 379769 383662 387711 391383 394746 398152 401705 405388 409480
53600D09480M834N304M917L863K861K400K503K999L622M010L985L793L710L611
$$ 409480 414314 419618 424535 428398 431259 433659 436162 439161 442783 446793 450778 454571 458281 461892
53586D61892L253K934L245M083M437L580K088J163J096Q92m26k614m482n169m879
$$ 461892 465145 468079 471324 475407 479844 483424 485512 486675 487771 488663 488237 485623 481141 475972 471093
53571D71093m442m365m427m129l419k788k625k721k653k441k427k633k693k447
$$ 471093 466651 462286 457859 453730 450311 447523 444898 442177 439524 437083 434656 432023 429330 426883
53557D26883k138j887j463q07k49R7O41J536K074J494J63p84q64n96m45j12Q23
$$ 426883 424745 422858 421395 420588 420339 420436 421077 422613 424687 426181 426344 425560 424696 424100 423655 423543 424366
53540D24366K173L389M207M691M887M793M613M765N486O490P150P172P062P573
$$ 424366 426539 429928 434135 438826 443713 448506 453119 457884 463370 469860 477010 484182 491244 498817
53526D98817Q634R299R060Q709R373J0982J2476J3331J4113J5371J6780J7673
$$ 498817 507451 516750 525810 534519 543892 554874 567350 580681 594794 610165 626945 644618
53514F44618J7959J8110J8539J9313K0276K1262K2283K3535K4987K6144K6514
$$ 644618 662577 680687 699226 718539 738815 760077 782360 805895 830882 857026 883540
53503H83540K6241K5877K5610K5273K5008K5280K6085K6838K7169K7324K7489
$$ 883540 909781 935658 961268 986541 1011549 1036829 1062914 1089752 1116921 1144245 1171734
53492A171734K7349K6674K5802K5111K4453K3548K2582K1934K1596K1255K0796
$$ 1171734 1199083 1225757 1251559 1276670 1301123 1324671 1347253 1369187 1390783 1412038 1432834
53481A432834K0381K0213K0390K0873K1331K1364K1005K0665K0408J9733J8286
$$ 1432834 1453215 1473428 1493818 1514691 1536022 1557386 1578391 1599056 1619464 1639197 1657483
53470A657483J6362J4257J1654Q209M413J197j227l501o090q601j0353j1211j1677
$$ 1657483 1673845 1688102 1699756 1707965 1712378 1713575 1712348 1708847 1702757 1694156 1683803 1672592 1660915
53457A660915j2345j3427j4762j6147j7520j8880k0110k1109k1999k2962k3846
$$ 1660915 1648570 1635143 1620381 1604234 1586714 1567834 1547724 1526615 1504616 1481654 1457808
53446A457808k4304k4347k4399k4670k4799k4324k3239k1868k0468j9146j7922
$$ 1457808 1433504 1409157 1384758 1360088 1335289 1310965 1287726 1265858 1245390 1226244 1208322
53435A208322j6690j5303j3847j2587j1500j0185q352o142l842j630K23J405K111
$$ 1208322 1191632 1176329 1162482 1149895 1138395 1128210 1119858 1113716 1109874 1108244 1108467 1109872 1111983
53422A111983L184N263Q014J0514J2180J3085J3662J4455J5895J7913J9902K1340
$$ 1111983 1115167 1120430 1128444 1138958 1151138 1164223 1177885 1192340 1208235 1226148 1246050 1267390
53410A267390K2410K3621K5078K6409K7402K8375K9920L2377L5529L8689M1208
$$ 1267390 1289800 1313421 1338499 1364908 1392310 1420685 1450605 1482982 1518511 1557200 1598408
53399A598408M3005M4586M6512M8989N1857N4728N7119N8859O0327O1977O3637
$$ 1598408 1641413 1685999 1732511 1781500 1833357 1888085 1945204 2004063 2064390 2126367 2190004
53388B190004O4697O4955O4737O4243O3402O2440O1835O1401O0257N8041N5484
$$ 2190004 2254701 2319656 2384393 2448636 2512038 2574478 2636313 2697714 2757971 2816012 2871496
53377B871496N3323N1355M9091M6691M4504M2293L9559L6200L2169K6963K0223
$$ 2871496 2924819 2976174 3025265 3071956 3116460 3158753 3198312 3234512 3266681 3293644 3313867
53366C313867J2493M696k875j0417j7837k4852l1531l7993m3876m8785n2958n6683
$$ 3313867 3326360 3331056 3328181 3317764 3299927 3275075 3243544 3205551 3161675 3112890 3059932 3003249
53354C003249n9455o0590o0497o0293o0376o0251n9735n9260n9023n8792n8701
$$ 3003249 2943794 2883204 2822707 2762414 2702038 2641787 2582052 2522792 2463769 2404977 2346276
53343B346276n9174n9855n9587n7890n5623n3783n2403n0971m9233m7107m4471
$$ 2346276 2287102 2227247 2167660 2109770 2054147 2000364 1947961 1896990 1847757 1800650 1756179
53332A756179m1494l8653l6085l3425l0601k8099k6090k4056k1832k0217j9903
$$ 1756179 1714685 1676032 1639947 1606522 1575921 1547822 1521732 1497676 1475844 1455627 1435724
53321A435724k0310k0315j9622j8626j7344j5482j3419j2077j1662j1330j0377
$$ 1435724 1415414 1395099 1375477 1356851 1339507 1324025 1310606 1298529 1286867 1275537 1265160
53310A265160r059p867o639m947k917j081M12J864L359M637N731P240R534J2099
$$ 1265160 1256101 1248234 1241595 1236648 1233731 1232650 1233062 1234926 1238285 1242922 1248653 1255893 1265427 1277526
53296A277526J4121J5523J6945J8755K0676K2443K4225K6090K7629K8548K9219
$$ 1277526 1291647 1307170 1324115 1342870 1363546 1385989 1410214 1436304 1463933 1492481 1521700
53285A521700L0052L0711L0557K9762K9244K9434K9643K8839K6653K3479K0088
$$ 1521700 1551752 1582463 1613020 1642782 1672026 1701460 1731103 1759942 1786595 1810074 1830162
53274A830162J7260J5407J4183J2677J0183O786L048o18m178p763j1409j5041
$$ 1830162 1847422 1862829 1877012 1889689 1899872 1906658 1909706 1909088 1904910 1897147 1885738 1870697
53262A870697j8577k1958k5035k7566k9481l1086l2706l4100l4664l4359l3897
$$ 1870697 1852120 1830162 1805127 1777561 1748080 1716994 1684288 1650188 1615524 1581165 1547268
53251A547268l3805l3738l3229l2494l1994l1601l0989l0503l0749l1499l1895
$$ 1547268 1513463 1479725 1446496 1414002 1382008 1350407 1319418 1288915 1258166 1226667 1194772
53240A194772l1769l1827l2399l2848l2535l1620l0548k9333k7824k6118k4301
$$ 1194772 1163003 1131176 1098777 1065929 1033394 1001774 971226 941893 914069 887951 863650
53229H63650k2214j9871j7738j6215j5157j4249j3527j3285j3632j4375j5103
$$ 863650 841436 821565 803827 787612 772455 758206 744679 731394 717762 703387 688284
53218F88284j5296j4706j3814j3414j3644j3858j3695j3608j3922j4027j3125
$$ 688284 672988 658282 644468 631054 617410 603552 589857 576249 562327 548300 535175
53207E35175j1503j0250r870r813r416q766q392q475q610q268p352o342n870o197
$$ 535175 523672 513422 503552 493739 484323 475557 467165 458690 450080 441812 434460 428118 422248 416051
53193D16051p019p764p947p383o376n576n440n688n623m940l971l186k776k741
$$ 416051 409032 401268 393321 385938 379562 373986 368546 362858 357235 352295 348324 345138 342362 339621
53179C39621k947k992k529j826j578k003k510k512k100j701j469j401j578j985
$$ 339621 336674 333682 331153 329327 327749 325746 323236 320724 318624 316923 315454 314053 312475 310490
53165C10490k323k311j965j380o12J0k3p16j397j554j391j234r50m62k86q29j575
$$ 310490 308167 305856 303891 302511 301899 301909 301886 301170 299773 298219 296828 295594 294644 294182 293896 293067 291492
53148B91492j747j471j512j986k181j696r83o21o72q76r99p89j25O62J021Q86
$$ 291492 289745 288274 286762 284776 282595 280899 279916 279295 278623 277747 276748 275959 275834 276496 277517 278403
53132B78403O90O17M56K89O48J549K031J249k72j170q19J56Q59R83O68R4m43m35
$$ 278403 279093 279710 280166 280455 281103 282652 284683 285932 285660 284490 283671 283827 284686 285669 286337 286431 285988 285553
53114B85553L64J467J962J399J72r34j477j555j508j481j309p43K09J148J597
$$ 285553 285917 287384 289346 290745 290917 289983 288506 286951 285443 283962 282653 281910 282119 283267 284864
53099B84864J406Q11J28m04n53j64N23R18O75O8m41p53r95j098q98n30k12J60
$$ 284864 286270 287081 287209 286805 286252 286088 286611 287529 288204 288272 287831 287078 286083 284985 284087 283557 283345 283505
53081B83505P31J085O05n44j387j314p26k78n2J78M29O42Q76R24K41j219k486
$$ 283505 284236 285321 285926 285382 283995 282681 281955 281677 281625 281803 282232 282874 283750 284674 284915 283696 281210
53064B81210k518j449k67M40Q26J023Q50L11k75q17j517k246k390j590k67Q48
$$ 281210 278692 277243 276976 277416 278242 279265 280115 280426 280151 279334 277817 275571 273181 271591 271324 272172
53048B72172J339J117K99o59j116r31o64p38p47j21Q03J088N20p6n3J36k48j005
$$ 272172 273511 274628 274927 274268 273152 272221 271557 270819 270072 269951 270754 271842 272362 272286 272233 272369 272121 271116
53030B71116j225n82K54N93N10L95K76K9q1K88P75M85q26k158k218q61P38J350
$$ 271116 269891 269309 269563 270156 270666 271061 271337 271366 271285 271573 272348 272833 272007 269849 267631 266770 267508 268858
53012B68858Q69J72l1J35K02K21O56J513K096J875J157N75K74M1m7K54P82J028
$$ 268858 269727 269899 269868 270003 270205 270426 271082 272595 274691 276566 277723 278298 278572 278613 278566 278820 279602 280630
52994B80630Q78P11P23O55L21n2j82n1K04M14L32r6m12p4P52J324J309J059Q16
$$ 280630 281508 282219 282942 283597 283918 283866 283684 283633 283837 284251 284583 284487 284075 284001 284753 286077 287386 288445 289261
52975B89261L57l45p97p02l86r0N03J540K342K181J293N48L96O61J038J239J007
$$ 289261 289618 289273 288476 287774 287388 287298 287801 289341 291683 293864 295157 295705 296101 296762 297800 299039 300046
52958C00046N00L22O70Q50L10l85l64J44J14o72j403j541j455j592j869k107k326
$$ 300046 300546 300868 301538 302388 302698 302313 301949 302093 302207 301535 300132 298591 297136 295544 293675 291568 289242
52941B89242k346j776p49l2m1l25l47k09j90j33J97M73J96n86j362j868k153k123
$$ 289242 286896 285120 284371 284339 284298 283973 283626 283417 283227 283094 283291 283764 283960 283374 282012 280144 277991 275868
52923B75868j503m02N53Q30N57K40P6j94p50j248j163m66K99O63O73N90M71K66
$$ 275868 274365 273963 274516 275346 275903 276143 276219 276025 275275 274027 272864 272398 272697 273360 274033 274623 275094 275360
52905B75360P9Oq1k83l56j4N67R04Q16N57M12M93Q93J604K291K492K058J177M1
$$ 275360 275439 275445 275364 275081 274725 274711 275278 276182 276998 277555 277967 278460 279353 280957 283248 285740 287798 288975 289016
52886B89016j116j722j277j67M59j08j354k193k110j409o59j87J5J62M05O36O35
$$ 289016 287900 286178 284901 284734 285193 285085 283731 281538 279428 278019 277360 277173 277188 277350 277755 278391 279026
52869B79026M24K43J88J15N5M03J423K652L112K230N08q48j059n60m58j209k143
$$ 279026 279450 279693 279881 279996 280051 280454 281877 284529 287641 289871 290379 289531 288472 287912 287454 286245 284102
52852B84102k452k257k287k778l266l352l126k803k467k219k118j863j078k4M90
$$ 284102 281650 279393 277106 274328 271062 267710 264584 261781 259314 257095 254977 253114 252036 252012 252502
52837B52502J85k43k2P10J225J136O24Rm59n60k68Q9J84J21K48O02Q67R32J151
$$ 252502 252687 252444 252422 253132 254357 255493 256117 256126 255667 255107 254839 254928 255112 255233 255481 256083 256950 257882 259033
52818B59033J917L127M230M832N039N133N034M325K844J005o68k043l170l770
$$ 259033 260950 264077 268307 273139 278178 283311 288345 292670 295514 296519 295851 293808 290638 286868
52804B86868l422k334j446j589k660l756l986l191k052j417j488j647j281n15
$$ 286868 283446 281112 279666 278077 275417 271661 267675 264484 262432 261015 259527 257880 256599 256084
52790B56084R5L42L87K67p3l34j28L01L15p4j35M18Q74N94nj14L10O57O31M43
$$ 256084 256179 256521 256908 257175 257102 256768 256640 256941 257256 257182 257047 257465 258339 258933 258928 258814 259124 259781 260412 260855
52770B60855K67Q6M3M00J029J342Q79j68j162j565j341q31l67n7K6k74q58j143
$$ 260855 261122 261208 261251 261651 262680 264022 264901 264733 263571 262006 260665 259834 259467 259410 259436 259162 258304 257161
52752B57161o78J20M36K38K50O67P54J50k96K67J320J707J326J108J449J688J292
$$ 257161 256483 256603 257039 257277 257527 258194 258948 259098 258802 259069 260389 262096 263422 264530 265979 267667 268959
52735B68959P18P21J344K002K255K182K117K207K215J776Q87pn76j004j543j929
$$ 268959 269677 270398 271742 273744 275999 278181 280298 282505 284720 286496 287383 287376 286800 285796 284253 282324
52719B82324j718j064o79r84j654k015j642o25M69R59P25L86M26M40k02j141j283
$$ 282324 280606 279542 278863 277879 276225 274210 272568 271943 272412 273371 274096 274482 274908 275348 275146 274005 272722
52702B72722l22P79J105Q49O68O54M98K57K52M74O20O63Q35J128J301J358J593
$$ 272722 272400 273179 274284 275133 275801 276455 276953 277210 277462 277936 278556 279219 280054 281182 282483 283841 285434
52685B85434K007K097J479M41l16m42k26j75m24o83o78n40o06q80r65n73O1M63
$$ 285434 287441 289538 291017 291458 291142 290700 290474 290299 289875 289192 288514 287974 287368 286488 285523 284950 285011 285474
52667B85474M46J49l12q73j207q08M03J718K225J732R09N11O59R44R88P47L68
$$ 285474 285920 286069 285757 284884 283677 282869 283272 284990 287215 288947 289856 290367 291026 291970 292958 293705 294073
52650B94073l0m27q71j358j710j664j167n12J2L78N48K41o34j385j057L60J708
$$ 294073 294043 293616 292745 291387 289677 288013 286846 286334 286346 286724 287272 287513 286879 285494 284437 284797 286505
52633B86505J997J511J193J334J390Q72k9p50q97n43j79l22q78j220j091j046
$$ 286505 288502 290013 291206 292540 293930 294802 294773 294023 293126 292583 292404 292082 291204 289984 288893 287847
52617B87847j473j664p50P30J262M24n58o33k75l70o83l76N04J083R57N52K97
$$ 287847 286374 284710 283960 284690 285952 286376 285818 285185 284910 284540 283857 283481 283985 285068 286025 286577 286874
52600B86874K42M47R72J404J135K50m70n99m88n06m81j73L29R99K020L122L361
$$ 286874 287116 287563 288535 289939 291074 291324 290854 290255 289767 289261 288780 288607 288936 289935 291955 295077 298438
52583B98438K192L99o89o36l2M91P30N62p9q55j211j100j009j170j284j147j044
$$ 298438 300630 301029 300340 299704 299672 300163 300893 301455 301376 300521 299310 298210 297201 296031 294747 293600 292556
52566B92556j215j343r69j68N38P36M23j17n01m75j11K81M83M81K73j21m03j46
$$ 292556 291341 289998 289029 288861 289399 290135 290558 290441 289940 289465 289354 289635 290118 290599 290872 290751 290348 290202
52548B90202N75J059P72m0p63j181j448j579j400r27l79J43P18J262J474J133
$$ 290202 290777 291836 292608 292568 291805 290624 289176 287597 286197 285270 284891 285034 285752 287014 288488 289621
52532B89621L32n68j082q66m4P90J148J073Q60N45k2p24j173j115n95J43P38Q86
$$ 289621 289953 289385 288303 287437 287393 288183 289331 290404 291264 291809 291787 291063 289890 288775 288180 288323 289061 289947
52514B89947P43R29J759K642K714J947J064M84n3p64j376j601j541j350r82n01
$$ 289947 290690 291619 293378 296020 298734 300681 301745 302229 302176 301412 300036 298435 296894 295544 294562 294061
52498B94061k56m22p14p79o51n77o45p62p67m06M58J457J891J470O60P7o7J95
$$ 294061 293805 293383 292669 291890 291239 290662 290017 289255 288488 288082 288540 289997 291888 293358 294018 294095 294028 294223
52480B94223Q31J597J965J702J207R34P68L85j7M0M90P49N78M72R27J709K085
$$ 294223 295054 296651 298616 300318 301525 302459 303227 303612 303595 303635 304125 304874 305452 305924 306851 308560 310645
52463C10645J725J070P62Q45P08p1j073j455r67k25J9m07j153j775k015j923j766
$$ 310645 312370 313440 314202 315047 315755 315684 314611 313156 312189 311964 311983 311576 310423 308648 306633 304710 302944
52446C02944j633j274o49m05j136k234k362j276k34j81m42J6Q95J122N95J95L07
$$ 302944 301311 300037 299388 298983 297847 295613 293251 291975 291741 291560 291118 291134 292029 293151 293746 293941 294248
52429B94248L68J5l50l38j71j41j44k8Q6J22K81O82J150J502J778K009K110K239
$$ 294248 294616 294631 294281 293943 293772 293631 293487 293459 293545 293667 293948 294630 295780 297282 299060 301069 303179 305418
52411C05418K921M536O774Q788R858R867R254Q423P231N240K567J08j478k608
$$ 305418 308339 312875 319649 328437 338295 348162 357416 365839 373070 378310 380877 380985 379507 376899
52397C76899m083n829o934o858n975m948m203l981m249m418l814k610j650j200
$$ 376899 372816 366987 360053 353195 347220 342272 338069 334088 329839 325421 321607 318997 317347 316147
52383C16147o49L23J106J157R55J254J924K312K399K726L384L808L663L317L228
$$ 316147 315498 315821 316927 318084 319039 320293 322217 324529 326928 329654 333038 336846 340509 343826 347054
52368C47054L335L232K666J686O17j8J67R48J554J397P03K36M67J124J644J797
$$ 347054 350389 353621 356287 357973 358590 358572 358739 359687 361241 362638 363341 363577 364044 365168 366812 368609
52352C68609J739J551J113N99O20J543K834L541L418L052K926K867K612K400K647
$$ 368609 370348 371899 373012 373611 374231 375774 378608 382149 385567 388619 391545 394412 397024 399424 402071
52337D02071L342M080M565M844N175N778O609P338P766Q263R331J0711J1467J1201
$$ 402071 405413 409493 414058 418902 424077 429855 436464 443802 451568 459831 469162 479873 491340 502541
52323E02541J0700J0968J2065J3317J4247J4721J4625J4102J3935J4832J6317
$$ 502541 513241 524209 536274 549591 563838 578559 593184 607286 621221 636053 652370
52312F52370J7043J6461J5532J5510J6486J7571J8153J8423J8717J8894J8609
$$ 652370 669413 685874 701406 716916 733402 750973 769126 787549 806266 825160 843769
52301H43769J7979J7504J7308J6706J4966J2324R792P979O650N558M909M573L549
$$ 843769 861748 879252 896560 913266 928232 940556 950348 958327 964977 970535 975444 980017 983566
52288I83566J183j528k913k761k445k832l257k975k513k733l367l424k643j630
$$ 983566 984749 983221 980308 977547 975102 972270 969013 966038 963525 960792 957425 954001 951358 949728
52274I49728p98l6P31J441K318L601M870N463N634O431Q157R782J0397J0487J1106
$$ 949728 948930 948894 949625 951066 953384 956985 961855 967318 972952 979383 987540 997322 1007719 1018206 1029312
52259A029312J2404J3633J4370J4798J5061J4981J4527J3944J3380J2811J2287
$$ 1029312 1041716 1055349 1069719 1084517 1099578 1114559 1129086 1143030 1156410 1169221 1181508
52248A181508J1757J0699Q655O155M414L826L396K087J66j295j860k013k271k654
$$ 1181508 1193265 1203964 1212619 1218774 1223188 1227014 1230410 1232497 1232663 1231368 1229508 1227495 1225224 1222570
52234A222570l013l384l829m289m656m822m689m299l932l850m000m124m098l924
$$ 1222570 1219557 1216173 1212344 1208055 1203399 1198577 1193888 1189589 1185657 1181807 1177807 1173683 1169585 1165661
52220A165661l501k733j751q12O9J112K396L705M680N017M624L872L523M080N206
$$ 1165661 1162160 1159427 1157676 1156864 1156933 1158045 1160441 1164146 1168826 1173843 1178467 1182339 1185862 1189942 1195148
$$ [...]
##END NTUPLES=NMR SPECTRUM
##END=
