
##TITLE=AC1389_VIERS12201_7519815_cQI4wlELCh
##JCAMPDX= 6.0         $$ Bruker NMR JCAMP-DX V2.0
##DATA TYPE= NMR SPECTRUM
##DATA CLASS= NTUPLES
##ORIGIN= BRUKER
##OWNER= Administrator
$$ 1.72 TOPSPIN		Version 2.1
$$ 2013-02-20 02:31:35.588 -0500  Administrator@X
$$ Compression mode = diff/dup
##.OBSERVE FREQUENCY= 400.02188249412
##.OBSERVE NUCLEUS= ^1H
##.ACQUISITION MODE= SIMULTANEOUS (DQD)
##.ACQUISITION SCHEME= undefined
##.AVERAGES= 8
##.DIGITISER RES= 22
##SPECTROMETER/DATA SYSTEM= spect
##.PULSE SEQUENCE= zg30
##.SOLVENT NAME= COFFEE_meoh
##.SHIFT REFERENCE= INTERNAL, COFFEE_meoh, 1, 14.98509
##AUDIT TRAIL= $$ (NUMBER, WHEN, WHO, WHERE, PROCESS, VERSION, WHAT)
$$ ##TITLE= Audit trail, TOPSPIN		Version 2.1
$$ ##JCAMPDX= 5.01
$$ ##ORIGIN= Bruker BioSpin GmbH
$$ ##OWNER= Administrator
$$ $$ E:\/data/COFFEE/nmr/AC1389_VIERS12201_7519815_cQI4wlELCh/10/pdata/1/auditp.txt
$$ ##AUDIT TRAIL=  $$ (NUMBER, WHEN, WHO, WHERE, PROCESS, VERSION, WHAT)
(   1,<2013-02-20 02:31:26.796 -0500>,<Administrator>,<X>,<go>,<TOPSPIN 2.1>,
      <created by zg
	started at 2013-02-20 02:30:20.734 -0500,
	POWCHK enabled, PULCHK disabled,
       configuration hash MD5:
       86 BA 57 50 F2 9D 5C 9B 26 00 A9 28 5F 66 2E 89
       data hash MD5: 64K
       1B C1 34 9C 0A B2 90 1E 4F F4 27 94 17 6F 89 1C>)
(   2,<2013-02-20 02:31:30.030 -0500>,<Administrator>,<X>,<proc1d>,<TOPSPIN 2.1>,
      <Start of raw data processing
       efp LB = 0 FT_mod = 6 PKNL = 1 PHC0 = 0 PHC1 = 0 SI = 32K 
       data hash MD5: 32K
       0D EF 8F D2 DB F0 85 5D 83 70 D7 EC AF 78 5C E0>)
(   3,<2013-02-20 02:31:30.499 -0500>,<Administrator>,<X>,<proc1d>,<TOPSPIN 2.1>,
      <pk PHC0 = 74.39392 PHC1 = 0 
       data hash MD5: 32K
       63 A8 C6 63 68 85 03 31 61 D3 BA B2 61 ED 96 2E>)
(   4,<2013-02-20 02:31:30.718 -0500>,<Administrator>,<X>,<proc1d>,<TOPSPIN 2.1>,
      <abs ABSG = 1 
       data hash MD5: 32K
       96 69 28 E3 16 45 74 BF D1 8B 52 EE 11 A8 09 E3>)
(   5,<2013-02-20 02:31:30.859 -0500>,<Administrator>,<X>,<proc1d>,<TOPSPIN 2.1>,
      <abs ABSG = 2 
       data hash MD5: 32K
       56 E3 A8 04 2B 03 7B 91 37 03 05 EC 83 CA D3 5A>)
(   6,<2013-02-20 02:31:31.015 -0500>,<Administrator>,<X>,<proc1d>,<TOPSPIN 2.1>,
      <abs ABSG = 3 
       data hash MD5: 32K
       70 0C FB 6B 8E F1 D7 9D 64 80 87 62 35 17 21 13>)
(   7,<2013-02-20 02:31:31.155 -0500>,<Administrator>,<X>,<proc1d>,<TOPSPIN 2.1>,
      <abs ABSG = 4 
       data hash MD5: 32K
       CF 0B C6 30 30 19 9F E2 CE 09 9D 95 18 F1 39 5A>)
(   8,<2013-02-20 02:31:31.312 -0500>,<Administrator>,<X>,<proc1d>,<TOPSPIN 2.1>,
      <abs ABSG = 5 
       data hash MD5: 32K
       41 05 7F E1 A8 0A D9 5C 57 3D 61 EE 5B 94 1C 17>)
$$ ##END=
$$ 
$$ $$ hash MD5
$$ $$ 5C 92 18 A1 71 05 8C AA 01 F5 99 70 67 E0 EC 38
##$RELAX= 
##$RELAX= 
##$RELAX= 
##$RELAX= 
##$RELAX= 
##$RELAX= 
##$RELAX= 
$$ Bruker specific parameters
$$ --------------------------
##$DU= <E:\>
##$EXPNO= 10
##$NAME= <AC1389_VIERS12201_7519815_cQI4wlELCh>
$$ [...]
150 150 150 150 150 150 150 150
##$TP07= 0
##$TPNAME0= <>
##$TPNAME1= <>
##$TPNAME2= <>
##$TPNAME3= <>
##$TPNAME4= <>
##$TPNAME5= <>
##$TPNAME6= <>
##$TPNAME7= <>
##$TPOAL= (0..7)
0.5 0.5 0.5 0.5 0.5 0.5 0.5 0.5
##$TPOFFS= (0..7)
0 0 0 0 0 0 0 0
##$TUNHIN= 0
##$TUNHOUT= 0
##$TUNXOUT= 0
##$USERA1= <user>
##$USERA2= <user>
##$USERA3= <user>
##$USERA4= <user>
##$USERA5= <user>
##$V9= 5
##$VALIST= <valist>
##$VCLIST= <CCCCCCCCCCCCCCC>
##$VD= 0
##$VDLIST= <DDDDDDDDDDDDDDD>
##$VPLIST= <PPPPPPPPPPPPPPP>
##$VTLIST= <TTTTTTTTTTTTTTT>
##$WBST= 1024
##$WBSW= 4
##$XGAIN= (0..3)
0 0 0 0
##$XL= 0
##$YL= 0
##$YMAX_a= 524178
##$YMIN_a= -504134
##$ZGOPTNS= <>
##$ZL1= 120
##$ZL2= 120
##$ZL3= 120
##$ZL4= 120
##$ABSF1= 14.98509
##$ABSF2= -5.573092
##$ABSG= 5
##$ABSL= 3
##$ALPHA= 0
##$AQORDER= 0
##$ASSFAC= 0
##$ASSFACI= 0
##$ASSFACX= 0
##$ASSWID= 0
##$AUNMP= <proc_prof1d_extract_pilot.lims>
##$AXLEFT= 0
##$AXNAME= <>
##$AXNUC= <1H>
##$AXRIGHT= 0
##$AXTYPE= 0
##$AXUNIT= <>
##$AZFE= 0.1
##$AZFW= 0.1
##$BCFW= 0
##$BC_mod= 0
##$BYTORDP= 0
##$COROFFS= 0
##$CY= 15
##$DATMOD= 1
##$DC= 0
##$DFILT= <>
##$DTYPP= 0
##$F1P= 0
##$F2P= 0
##$FCOR= 0.5
##$FTSIZE= 32768
##$FT_mod= 6
##$GAMMA= 0
##$GB= 0
##$INTBC= 1
##$INTSCL= 1
##$ISEN= 128
##$LB= 0
##$LEV0= 0
##$LPBIN= 0
##$MAXI= 10000
##$MC2= 0
##$MEAN= 0
##$ME_mod= 0
##$MI= 0
##$NCOEF= 0
##$NC_proc= -8
##$NLEV= 6
##$NOISF1= 0
##$NOISF2= 0
##$NSP= 0
##$NTH_PI= 0
##$NZP= 0
##$OFFSET= 14.98509
##$PC= 1
##$PHC0= 74.39392
##$PHC1= 0
##$PH_mod= 1
##$PKNL= yes
##$PPARMOD= 0
##$PPDIAG= 0
##$PPIPTYP= 0
##$PPMPNUM= 2147483647
##$PPRESOL= 1
##$PSCAL= 4
##$PSIGN= 0
##$PYNMP= <proc.py>
##$REVERSE= no
##$SF= 400.02
##$SI= 32768
##$SIGF1= 0
##$SIGF2= 0
##$SINO= 400
##$SIOLD= 32768
##$SPECTYP= <>
##$SREGLST= <1H.CDCl3>
##$SSB= 0
##$STSI= 32768
##$STSR= 0
##$SW_p= 8223.68421052631
##$SYMM= 0
##$S_DEV= 0
##$TDeff= 65536
##$TDoff= 0
##$TI= <>
##$TILT= no
##$TM1= 0
##$TM2= 0
##$TOPLEV= 0
##$USERP1= <user>
##$USERP2= <user>
##$USERP3= <user>
##$USERP4= <user>
##$USERP5= <user>
##$WDW= 1
##$XDIM= 32768
##$YMAX_p= 415673577
##$YMIN_p= -688550
##$CURPLOT= <Network HP LaserJet P1505>
##$CURPRIN= <$Network HP LaserJet P1505>
##$DFORMAT= <normdp>
##$LAYOUT= <+/1D_H.xwp>
##$LFORMAT= <normlp>
##$PFORMAT= <normpl>
##$SURQMSG= 1
$$ End of Bruker specific parameters
$$ ---------------------------------
##NTUPLES= NMR SPECTRUM
##VAR_NAME=  FREQUENCY,     SPECTRUM/REAL,   SPECTRUM/IMAG
##SYMBOL=    X,             R,               I
##VAR_TYPE=  INDEPENDENT,   DEPENDENT,       DEPENDENT
##VAR_FORM=  AFFN,          ASDF,            ASDF
##VAR_DIM=   32768,         32768,           32768
##UNITS=     HZ,            ARBITRARY UNITS, ARBITRARY UNITS
##FACTOR=    0.250966925370066, 1,           1
##FIRST=     8223.43324360094, -84128,       -42460
##LAST=      0,             -165936,         -104529
##MIN=       0,             -688550,         0
##MAX=       8223.43324360094, 415673577,    0
$$ Real data points
##PAGE= N=1
##DATA TABLE= (X++(R..R)), XYDATA
$$ [...]
19565b6014j44939b0490A03682J30750a66397P280A43964B4386h9037p9896r2193
19554b61126M8240A64365K1683b10177R4064M763o0289I4727b00487M2483j32644
19543b90648A53242a54327A16379j604c35100H0982a58994B03832b10428F3054
19532h2449k82930a01028d0355j49846a9623A18319b26080B58146f2508j42846
19522b05354b7076A13413c5249B9730A0735a37257G1464b46163A22923l1325a96062
19510A6a31795j83371B01427F2981c8906B93828a39228N9849r788k27578J15016
19499b01729e3070J8813D7095a64364m3012R6194q2178f2523B10038L4864e3860
19487c07814a42598G0330b8075I8459l2261a94757n9641a6437D583J81442D761
$$ y = [-26014, -170953, -20490, 103682, 234432, -166397, -159117, 143964, 24386, -89037, -168933, -261126, -212886, 164365, 186048, -210177, -116113, -111350, -171639, 94727, -200487, -158004, -290648, 153242, -154327, 116379, 114775, -335100, 80982, -158994, 203832, -210428, 63054, -82449, -365379, -101028, -40355, -190201, -19623, 118319, -226080, 258146, -62508, -205354, -27076, 113413, -35249, 29730, 10735, -137257, 71464, -246163, 122923, 91598, -196062, 16, -131795, -315166, 201427, 62981, -38906, 293828, -139228, -79379, -89167, -316745, -201729, -53070, -34257, 47095, -164364, -207376, -111182, -193360, -62523, 210038, 244902, -53860, -307814, -142598, 70330, -28075, 98459, 66198, -194757, -254398, -16437, 4583, 186025, 4761]
19475I2199B5762J30588a04270M0358j55945A9432b22702j45515a10680j21608
19465b32288h3807A79933l6959b13801A02238j1197c69572B94007B883f0966j5773
19454g6739b287j27467O3906P167B1348K25431A9109K51560h0060b2308l9855
19443f2163A20479j3000K7468l1545C1048J01326i70j58674g5125C5778K6069
19432F1847b2965j73088b1851l1837l42820A03454B7849a79447B8712P1382c85084
19420B31211K15696a1755A53931l8472b8635l2522k8617A4774J19227g9720B4733
19408A96790a17648B05709a79939h4026C4555L1569b43049F9060d05672A82940
19397g0309d607C590a55453B20312q3853A7449c19130a11962N1686e311l46242
$$ y = [92199, 25762, 156350, -104270, -63912, -219857, 19432, -222702, -368217, -110680, -232288, -83807, 179933, 142974, -213801, 102238, 91041, -369572, 294007, 2883, -60966, -76739, -2287, -129754, -65848, -58681, 21348, 246779, 19109, 270669, -80060, -22308, -62163, 120479, 107479, 134947, 103402, 31048, 132374, -970, -159644, -75125, 35778, 61847, -22965, -196053, -21851, -53688, -396508, 103454, 27849, -179447, 28712, 100094, -385084, 231211, 446907, -11755, 153931, 115459, -28635, -61157, -89774, 14774, 134001, -79720, 24733, 196790, -117648, 205709, -179939, -84026, 34555, 66124, -243049, 69060, -405672, 182940, -70309, -4607, 3590, -155453, 220312, 136459, 17449, -319130, -111962, -60276, -5311, -351553]
19386c51553A33172f5642B3405d26040g1202A81296P206b44158K510Q9363m25095
19375e77380B29019J48549i9680r5789i6198H0752d5307q7501N1191A5933P0559
19364H6492b09801A38646a51281l12659A13412f60001f0382C24338a50795A22948
19353b28923D4124b62856e8192B1951b03616F054a66407q1699L5022a0465A77736
19341B6758a98827A42072J54235c46878J60345B36294c86935h7550m9746b8135
19330a18187d6656j14127A15862c04983L1296O7315a7271r2583B1964J03933C1464
19318a49652r4427j9759Q7803J6175j68428h341o9303C0086a40256B61510b96008
19306A52076K6008q0322B1360b32435m7767k85622H0720a52036A32979a69253
$$ y = [-351553, 133172, -65642, 23405, -426040, -71202, 181296, 188502, -244158, -241648, -152285, -577380, 229019, 377568, -99680, -195469, -96198, 80752, -45307, -132808, -81617, 15933, 86492, -209801, 138646, -151281, -463940, 113412, -660001, -60382, 324338, -150795, 122948, -228923, 44124, -262856, -58192, 21951, -203616, 6054, -166407, -248106, -213084, -10465, 177736, 26758, -198827, 142072, 296307, -346878, -186533, 236294, -386935, -87550, -137296, -28135, -118187, -46656, -160783, 115862, -304983, -273687, -206372, -17271, -109854, 21964, 125897, 31464, -149652, -244079, -263838, -176035, -159860, -328288, -8341, -77644, 30086, -140256, 261510, -296008, 152076, 178084, 97762, 21360, -232435, -280202, -565824, 80720, -152036, 132979, -169253]
19295A45158g3662H049a29668F6472b17059j07622O1994A01068a2144p4365A00139
19283g9243b2580e102l0155A9911h133F6746L63147j76861d13187e1077k95711
19272c46788H1951h6216K0423a044p7321p0909A03622a01170j10811P3358a8494
19260B67612b44015j6818j7784I8657b46480F5811i6170M4746A32284o4919J93191
19249B60556b27044L9339l7804I7153d9681I3704c22406I0788m1253b29704P7764
19238a51940B96159f0406b9506k36755l4503A21397b47058B67166a37616k2621
19228a60237G4606Q8015a14358j63041h9751B47316A2152f3124j55141a05903
19217f9081n5869B0242b3771r5194e3213B9700a90396P2197A31682j0825G795
$$ y = [145158, -73662, 8049, -129668, 66472, -217059, -324681, -262687, 101068, -12144, -86509, 100139, -79243, -22580, -5102, -35257, 19911, -8133, 66746, 429893, 253032, -413187, -51077, -346788, 81951, -86216, -65793, -1044, -78365, -149274, 103622, -101170, -211981, -138623, -18494, 267612, -244015, -260833, -278617, 98657, -246480, 65811, -96170, -51424, 132284, 67365, 260556, -227044, -187705, -225509, 97153, -49681, 93704, -322406, 90788, 49535, -229704, -151940, 296159, -60406, -29506, -266261, -300764, 121397, -247058, 267166, -137616, -160237, 74606, 162621, -114358, -277399, -89751, 247316, 12152, -63124, -218265, -105903, -69081, -124950, 20242, -23771, -118965, -53213, 29700, -190396, -118199, 131682, 120857, 7795]
19205b7096q6886G8750r690B3786b86430i7892b6186p4597j29127h5696j0528
19194i6224A47673E7935M067a74088G2178a00365k72089a17761B01a36145k908
19183a39053E0718J2910b28200E3713J0984c2500A78586q6999b34215e9342o8402
19172a27744B19752b17181E1598A5481M422i5522j21751n1940O880o2831A01356
19160D4695J72590B4895b22214B47159F1671c02353J31857A4701a59754g179l50890
19149c58069f6442l7941r0636q1201a30157o2167E3525J6698d2164q9318K2321
19138a09161q7890j8571R5152A21330h5043l9684j67672g7020A33665A945c94378
19126A10529d14657d5846f944I3374a05366j16302C0534a85174d560G943a71393
$$ y = [-27096, -113982, 78750, 69060, 23786, -286430, -97892, -26186, -100783, -229910, -85696, -96224, 147673, 57935, 62002, -174088, 72178, -100365, -372454, -117761, 201, -136145, -139053, 50718, 63628, -228200, 53713, 64697, -32500, 178586, 91587, -234215, -59342, -127744, 219752, -217181, 51598, 15481, 19903, -95522, -217273, -269213, -262333, -325164, 101356, 44695, 217285, 24895, -222214, 247159, 61671, -302353, -170496, 14701, -159754, -7179, -358069, -66442, -104383, -195019, -276220, -130157, -192324, 53525, 70223, -42164, -131482, -109161, -197051, -215622, -120470, 121330, -85043, -124727, -292399, -77020, 133665, 1945, -394378, 110529, -414657, -45846, -6944, 93374, -105366, -221668, 30534, -185174, -4560, 7943, -171393]
19114H7644a72671E4035b6843j07087B3876J22558d46076e0469A86611g7760A01151
19102b08698c6287j32059A54353g6799q8838H2988N7457e6624d132j26118E6674
19090B762a54019N5253j49550a19967I4415a77520M7388p9919k8494L8346j7074
19079b17273g7517D2201c79081N5632J17647n2391b1144F2955d49923b422n7943
19068f0365A5339a55740L2339B37147d6248J706p1381A49273a73846j82888E1151
19056d9841k36016N1243A36217a57672e0649G7654i474m1928k13021A75859B2168
19044A2166g9753A9311d10587A7990L2250L3840R6318f0488k1519A43273d7093
19032f9100j67602f1435e61j37776p1139g7152L4134A17308a7951k09218A32804
$$ y = [87644, -172671, 54035, -26843, -133930, 23876, 146434, -446076, -50469, 186611, -77760, 101151, -208698, -36287, -168346, 154353, -76799, -165637, 82988, 140445, -56624, -4132, -130250, 56674, 2762, -154019, -98766, -248316, -119967, 94415, -177520, -130132, -210051, -238545, -200199, -217273, -77517, 42201, -379081, -323449, -205802, -258193, -21144, 62955, -449923, -2422, -60365, 15339, -155740, -123401, 237147, -46248, -44542, -115923, 149273, -173846, -356734, 51151, -49841, -285857, -234614, 136217, -157672, -50649, 77654, -9474, -51402, -264423, 175859, 22168, 12166, -79753, 19311, -410587, 17990, 50240, 84080, 180398, -60488, -82007, 143273, -47093, -69100, -236702, -61435, -561, -138337, -209476, -77152, -43018, 117308, -17951, -227169, 132804]
19020C8051a31543l4807d8436k18142a09122q1512B9545R0262b12691E5243g1057
19008b52329A44349i6662B89612A17703b7197j46763h3968l65020K14239A97446
18997F6366f8905J8852a1284C2893h9502j9371a1097A25119h9592b3003k43905
18986b66908g1721G4918h3306J8682l5533c8219K384j90848l6412A4429a66870
18974a46859b8022D6870K11549b78962A46828a09132J3623A40302C6994K9300
18964F6294J30123E3992a20539j7223h561@c1720o1304a8513r4911q995A63436
18951b99220a694A14759a31151m2697M7133e2375o5924A05219J3880a4807l25059
18940c39866B55572c17528A70363a48803B0862d5813C2555c34941e4763A90829
$$ y = [38051, -131543, -166350, -48436, -266578, -109122, -190634, 29545, 119807, -212691, 55243, -71057, -252329, 144349, -96662, 289612, 117703, -27197, -173960, -83968, -448988, -234749, 197446, 66366, -68905, -50053, -11284, 32893, -89502, -108873, -11097, 125119, -89592, -23003, -266908, -71721, 74918, -83306, -64624, -100157, -38219, -35835, -226683, -263095, 14429, -166870, -146859, -28022, 46870, 258419, -278962, 146828, -109132, -95509, 140302, 36994, 66294, 196417, 53992, -120539, -137762, -8561, 0, -31720, -93024, -18513, -113424, -122419, 163436, -299220, -1694, 114759, -131151, -173848, -126715, -52375, -118299, 105219, 119099, -14807, -339866, 255572, -317528, 170363, -148803, 20862, -45813, 32555, -334941, -54763, 190829]
18929a98477N2105O828e1398A8494J40326b06108j01020A31693c35710A10395
18918A40668O5131b85754C43936e1333B0961O7885a69009D51739k20196b53053
18907a44348f7583j77114M6576B82197c46681H8850N134b33159d7123n9203b8719
18895h381H3892c48272a0664p3011H4887k9070g7085j48372E7213i2039p6884
18884a68923e3778E5743A3251a88904M3871j51732a7347m8620j49670E9582b40840
18872A74420B6855b7454A01863O9345a95404L5898e8611A6033a69718h3263b6994
18860a92008L0482C21285C4478O0797l5516J19325l4286a57596O4108j04996B8492
18848h6148k7642A3c41197f2371j09329L8892D8356d1495k2663K2997E5462b83343
$$ y = [-198477, -146372, -139544, -51398, 18494, 158820, -206108, -307128, 131693, -335710, 110395, 140668, 205799, -285754, 343936, -51333, 20961, 88846, -169009, 451739, 231543, -253053, -144348, -67583, -244697, -198121, 282197, -346681, 88850, 93984, -233159, -47123, -106326, -28719, -8381, 83892, -348272, -10664, -83675, 84887, 55817, -77085, -225457, 57213, -92039, -168923, -53778, 55743, 13251, -188904, -145033, -296765, -17347, -65967, -215637, 59582, -240840, 174420, 26855, -27454, 101863, 171208, -195404, -159506, -58611, 16033, -169718, -83263, -26994, -192008, -161526, 321285, 34478, 95275, 59759, 179084, 144798, -157596, -93488, -198484, 28492, -86148, -113790, 13, -341197, -62371, -171700, -132808, 48356, -41495, -64158, -41161, 55462, -283343]
18835c0560j1104j66916a03596C44277b93198G6850J08295c2163A80226A5088
18824C4460i5287l22177A77267a1046j61138A90275q5506e1767q1079k17587H9126
18812b82056B94204A34883A2226R3025H598b1465j92082j4745A29915d0629j24419
18801a65048J3123F2597a80534A12460l6725i9299B05573o6539b58147F6611a7039
18789b18818k09484B29069b02817a0456B3125b67992J33434m51142b88727B33738
18778D9785J01372c10098A37610a80946O3357A09537e2628H0883a38564A18030
18767a35031A38377b02795B64099r0993a82612L1205D1941H851a55173A3998J52668
18756A66666b47484R7281C8880a53376e3398k00477e2452A15575b07039l3848
$$ y = [-30560, -41664, -208580, -103596, 344277, -293198, 76850, 185145, -32163, 180226, 15088, 34460, -95287, -417464, 177267, -11046, -172184, 190275, 104769, -51767, -132846, -350433, 89126, -282056, 294204, 134883, 12226, 105251, 8598, -21465, -213547, -228292, 129915, -40629, -165048, -151925, 62597, -180534, 112460, 75735, -99299, 205573, 139034, -258147, 66611, -17039, -218818, -428302, 229069, -202817, -10456, 23125, -267992, -134558, -585700, -288727, 233738, 49785, 151157, -310098, 137610, -180946, -117589, 109537, -52628, 80883, -138564, 118030, -135031, 138377, -202795, 264099, 173106, -182612, -151407, 41941, 8851, -155173, 13998, 166666, -247484, -150203, 38880, -153376, -53398, -253875, -52452, 115575, -207039, -240887]
18746b40887b5212R362m3393G3161d27514H4909b13845A64328d75258C568b02451
18734E1171c33242E9217a33014j47323a10361G0855K05365i4405B01047L30126
18724E31173A54370a29890c4718A43274b27011i1510o4159k15420a56080B40637
18713F666L6835I352c47198a47942D7266j4581b1938o0202C83369A05684J12365
18702B18049o9624p0177f3620C37668D2377E225B059b24742J5288f3914N242k68816
18690c27488F9281O2732f6632c0906a1383A97412m3658M6965b55183E5096a35172
18678E0397a30491C18313A18873d1972J4563B2515c54291R1283d5140B78103b21898
18666a39838K4049K5230c9793k94460J53919A42576K2986a59948A17189a43577
$$ y = [-240887, -25212, -15850, -59243, 73161, -427514, 84909, -213845, 164328, -475258, 3568, -202451, 51171, -333242, 59217, -133014, -280337, -110361, 70855, 276220, -94405, 201047, 531173, 154370, -129890, -34718, 143274, -227011, -91510, -155669, -371089, -156080, 240637, 6666, 43501, 9352, -347198, -147942, 47266, 32685, -21938, -82140, 383369, 105684, 218049, 148425, 78248, -63620, 337668, 42377, 5225, 2059, -224742, -209454, -63914, -58672, -327488, 69281, 132013, -66632, -30906, -11383, 197412, 153754, 200719, -255183, 55096, -135172, 50397, -130491, 318313, 118873, -41972, -27409, 22515, -354291, -263008, -45140, 278103, -221898, -139838, -115789, -90559, -39793, -334253, -180334, 142576, 165562, -159948, 117189, -143577]
18655a12211D9999b32321P4503K6369l7519M8615j2336A5022J78174e7697a9757
18643g4904B0494H567J23541a76499P8803k33423b7635j42861j46253n553e8238
18631B3017b59465e2319A28158a55632j57679g261r7748k52801a17924P308q2803
18620a93419Q7680I912i9566k0381L5653A31447c33125j57161a45471M2337A31558
18608b41807g1085A02810a28277c275A27664e2163j9680p0172F0816a67481B9759
18596a48108j0353A0465b72165E1784k2070b25114j52595a75225P6292p2647A73196
18584d32518a48176f7994k39070j24445A31625a9640j47267G2502a77333k6155
18574b03488N8595d3582k42773a13983a7686j03074G4621K7718C2917a60364c392
$$ y = [-112211, 49999, -232321, -157818, -131449, -168968, -120353, -132689, 15022, 193196, -57697, -19757, -74904, 20494, 8567, 132108, -176499, -97696, -331119, -27635, -170496, -316749, -322302, -58238, 23017, -259465, -52319, 128158, -155632, -313311, -7261, -105009, -357810, -117924, -110616, -193419, -105739, 9912, -99566, -119947, -84294, 131447, -333125, -490286, -145471, -103134, 131558, -241807, -71085, 102810, -128277, -3275, 127664, -52163, -71843, -142015, 60816, -167481, 29759, -148108, -158461, 10465, -272165, 51784, 29714, -225114, -377709, -175225, -98933, -171580, 173196, -432518, -148176, -67994, -307064, -431509, 131625, -19640, -166907, 72502, -177333, -203488, -144893, -43582, -286355, -113983, -17686, -120760, 74621, 102339, 32917, -160364, -3392]
18562c9378j46113j72432p003C5795a30327L0278K893C3497K41001c7995k05448
18551b43443j1753f5748M590A96360b43094D8512a62940j03987N0136i2495B0899
18539B47024M8707m3867N6835i2102k5825C9061d0650p284k4932f491j44012C3290
18526f1208a601C40633m0274a99358g0771A19684f5883A94197a34099j10111a1650
18514A32836a51429f4874l5863q0466b2070g253C8358J46594J7246a97343N6457
18503a40886j2181l0962j89191J5515I4032a21996l30166e9634E0838L30602a55068
18491B252J58155e129B65735d3303l1293l68910J61374F9010B8339J04461a80865
18479D05093c3071B51605b92858A62625c8735C6342j0611d3557l31031a41139
$$ y = [-39378, -185491, -357923, -364926, 35795, -130327, -100049, -97156, 33497, 274498, -37995, -243443, -255196, -65748, -61158, 196360, -243094, 48512, -162940, -266927, -216791, -92495, 20899, 247024, 295731, 251864, 308699, -92102, -117927, 39061, -40650, -47934, -72866, -6491, -150503, 33290, -61208, -1601, 340633, 300359, -199358, -70771, 119684, -65883, 194197, -134099, -244210, -11650, 132836, -151429, -64874, -100737, -181203, -22070, -7253, 38358, 184952, 202198, -197343, -140886, -153067, -184029, -373220, -357705, 94032, -121996, -452162, -59634, 50838, 381440, -155068, 2252, 160407, -5129, 265735, -43303, -74596, -443506, -282132, 69010, 28339, 132800, -180865, 405093, -33071, 251605, -292858, 162625, -38735, 36342, 25731, -43557, -374588, -141139]
18468H2623J59894C6870e4712B2289a51664P0335N911j80829A94178J20321a00071
18456F9895a94769j55986b8321A19742e0672o0649m0008m5919A2565a55652B8104
18444B11649a91125d2647m2695A21352i0564i175r6828F807g8574j22449B15974
18432b2109A76204c9531R753l53150A93329i9236B20571E0928a2929A53985D5108
18420B63667G0242h4091F1986A3618h5332k9065F5482b45634L2842n1855b8562
18408A7696b8333j8805B50405h9319A43494n2659h2841a6249j07882a5735A28908
18396e0167j19638B11642i0602j60690N6844i2174c1591k18585a2959n20038b54334
18384a74202E7693b89998P1345O8649D5867a41873L3790M0804q9295I5823a36423
$$ y = [82623, 242517, 36870, -54712, 22289, -151664, -81329, -75418, -256247, 194178, 314499, -100071, 69895, -194769, -350755, -28321, 119742, -50672, -111321, -151329, -197248, 12565, -155652, 28104, 211649, -191125, -42647, -85342, 121352, -90564, -9175, -106003, 6807, -78574, -201023, 215974, -22109, 176204, -39531, -29778, -382928, 193329, -99236, 220571, 50928, -12929, 153985, 45108, 263667, 70242, -84091, 61986, 13618, -85332, -114397, 65482, -245634, -212792, -264647, -28562, 17696, -28333, -47138, 250405, -89319, 143494, 90835, -82841, -16249, -124131, -15735, 128908, -50167, -169805, 211642, -90602, -251292, -194448, -92174, -31591, -250176, -12959, -532997, -254334, -174202, 57693, -289998, -218653, -150004, 45867, -141873, -108083, -67279, -156574, 95823, -136423]
18372a0766A81652g4777j25350k6485I9187b30540c9712A59643c2943j50161B11200
18360a97897G329a49313M1288E0503K4674B3182j1101a52097j01374F063j734
18349D329i1640A56530b47977A91794e9199C82586a2962B65195H9483c61960c9770
18337A02576a68488P8144A68863m9888a11686j24346A9808h9712B11178O4292
18327B75470n9632d0919m0211n2668b6786k4697E6575a1783k9643Q402B0219a37407
18314A68317e3125B68861b16993D74184a04653j042A10758P0164F4029k8983f4733
18302a39269D27552A08830c42778I3719a69247A57769L4782a15486m0213q5535
18292b41234q588F6781b90557h62F8479j0432h1213B06499c54585c3144A1118
$$ y = [-10766, 181652, -74777, -200127, -226612, 99187, -230540, -39712, 159643, -32943, -183104, 211200, -197897, 7329, -149313, -108025, 50503, 75177, 23182, 12081, -152097, -253471, 6063, 4329, -91640, 156530, -247977, 191794, -59199, 382586, -12962, 265195, 89483, -361960, -39770, 102576, -168488, -90344, 168863, 118975, -111686, -236032, 19808, -89712, 211178, 275470, 215838, -40919, -81130, -133798, -26786, -51483, 56575, -11783, -41426, -33024, 20219, -137407, 168317, -53125, 268861, -216993, 474184, -104653, -105695, 110758, 180922, 64029, 35046, -64733, -139269, 427552, 108830, -342778, 93719, -169247, 157769, 192551, -115486, -155699, -241234, -249822, 66781, -290557, -862, 68479, 58047, -81213, 206499, -354585, -33144, 11118]
18280b34563l5457F287a55596c9821j56253A53510G1151Q0275c32343i2155j65363
18269b57518C9881a41491j29538j7040A61737a90917c5628E8131K12881a35315
18258b55843N3402H3946a11449l8553O4446L6557D8692d6142r016k7551j45994
18247b28703R5389f6215j11384g8495j33992K168A77068H1729L4429b38051B24067
18235a61355M3824l5517J6964m29060G8851L0520c86735J07529A8850e6437j24256
18224a80693l7613L8816l076O4301B78093i1176A59218b47558G9463h1058A09714
18212a38557J5319j1430r842r389A32035e0245A38225a78458b3638j58752b416
18200A82502f2250o6921d7869A0311d04736a08366l582n1519o7616A5777c04144
$$ y = [-234563, -270020, 6287, -155596, -39821, -196074, 153510, 71151, 151426, -332343, -92155, -257518, 39881, -141491, -271029, -288069, 161737, -190917, -35628, 58131, 271012, -135315, -255843, -202441, 83946, -111449, -150002, -85556, -48999, 48692, -46142, -55158, -82709, -228703, -133314, -66215, -177599, -78495, -212487, -210319, 177068, 81729, 116158, -238051, 224067, -161355, -117531, -153048, -136084, -565144, 78851, 109371, -386735, -279206, 18850, -56437, -180693, -218306, -179490, -182566, -118265, 278093, -91176, 159218, -247558, 79463, -81058, 109714, -138557, -123238, -134668, -144510, -153899, 132035, -50245, 138225, -178458, -23638, -182390, -2416, 182502, -62250, -129171, -47869, 10311, -404736, -108366, -111948, -163467, -231083, 15777, -304144]
18188H8423a45713A32460b45811M0031Q4764c3626k4038l1703H6066j9816J3327
18177G9577a84697A03165n299a02228k73092B99401g4079B05469e0163k5143A43899
18165a27988A45845F0061J37086R9826K4866a09726j626Q26A55465g3498j30321
18154b03819d2731a0938l67587a39438l07822K15775B2175J8669K97113i6818
18143h4672k42172C3100f8110q4778a7576C28288A18032L12923A53109c87308
18132D2125a6066C97076H4040L0557d9024C2748d09965a09332K2482B3866L9307
18121F3173a47136f7436A06567l4992a45660C3565b63881A69281P1066g733F4044
18109a19808B85129e65046C03599a23030K121r3829i7506a1710B86349b82907
$$ y = [88423, -145713, 132460, -245811, -205780, -121016, -33626, -57664, -89367, 86066, 66250, 79577, -184697, 103165, 97866, -102228, -375320, 299401, -74079, 205469, -50163, -75306, 143899, -127988, 145845, 60061, 197147, 296973, 321839, -109726, -111352, -110526, 155465, -73498, -203819, -42731, -10938, -378525, -139438, -447260, -231485, 22175, 40844, 337957, -96818, -84672, -326844, 33100, -68110, -152888, -17576, 328288, 118032, 430955, 153109, -387308, 42125, -16066, 397076, 84040, 114597, -49024, 32748, -409965, -109332, -86850, 23866, 63173, -147136, -67436, 106567, 71575, -145660, 33565, -263881, 169281, 240347, -7733, 64044, -119808, 285129, -565046, 303599, -123030, -120909, -214738, -97506, -11710, 286349, -282907]
18098A41654J0273M8375h4415L8638a3171q1904j01568A34717R1831a46603f5762
18086i8660d0305J9396N001F0396a04715L6510a5584A98118j5039b317A40542
18074a78193D3206J99135j06815a29602J7834N4652H8336d17751a73128K360P4383
18063i6385E4774d49990B7906M323K06771a37548A3438c2538k82804O9645f4924
18051A04795a54815j00733B47215a02579B8711K46029i1341L3658G8368a03704
18040A77073C9121c82765J65399B90822i6049l04432a60431k21393a85559g3775
18029c784b30B74325A7672J21710a80115e4807B51922j18442e7480B05939b84503
18017h1777G5054a15463n925G749d4559A5454P9167a22523r7068h9904l446b0520
$$ y = [141654, 151927, 200302, -84415, -45777, -13171, -95075, -196643, 134717, 226548, -146603, -65762, -98660, -40305, -20909, -15908, 60396, -104715, -68205, -15584, 198118, 183079, -2317, 140542, -178193, 43206, 242341, 135526, -129602, -111768, -57116, 88336, -417751, -173128, -170768, -96385, 54774, -449990, 27906, 32229, 239000, -137548, 13438, -32538, -315342, -245697, -64924, 104795, -154815, -255548, 247215, -102579, 28711, 274740, -91341, -57683, 78368, -103704, 177073, 39121, -382765, -217366, 290822, -96049, -400481, -160431, -381824, -185559, -73775, -3784, -230, 274325, 17672, 139382, -180115, -54807, 251922, 133480, -57480, 205939, -284503, -81777, 75054, -115463, -121388, 7749, -44559, 15454, 94621, -122523, -219591, -89904, -93350, -20520]
18004b28383E6140J42768a74817j2905b3992l30403a68398B67684A20434b75648
17993b26492C68248A39579k7765a91173A39461J9568b9848e133j34346j19784
17983b59263A40303b46529o566J24075D1326c7079k3841H4099g1966j36433B99806
17971c53332A7411a01187b5776A01593b13206i4709j07846J7646h5253j40911
17961b26164a02363m17155g5012n4785A76239a20424N3337k83802A9954J58682
17951A78636o9547b11007c8420M205m9120L4707j73075L2046B74465a56539O9535
17940h7004B15867f1051B3432L9186a84629F4010A3061h8277n3754N3194e008
17928F7483b0402H5247i2274E3654b51690e3971i09o21612a72265C3234P3608
$$ y = [-228383, 56140, 198908, -174817, -187722, -23992, -354395, -168398, 267684, 120434, -275648, -226492, 368248, 139579, 111814, -191173, 139461, 159029, -29848, -5133, -139479, -259263, 140303, -246529, -253095, -129020, 41326, -37079, -60920, 84099, -71966, -208399, 299806, -353332, 17411, -101187, -25776, 101593, -213206, -94709, -202555, -184909, -85253, -226164, -102363, -519518, -75012, -129797, 176239, -120424, -67087, -350889, 19954, 178636, 109089, -211007, -38420, -34215, -83335, -48628, -221703, -189657, 274465, -156539, -87004, 215867, -61051, 23432, 62618, -184629, 64010, 13061, -88277, -142031, -88837, -5008, 67483, -20402, 85247, -92274, 53654, -251690, -53971, -909, -622521, -172265, 33234, 106842]
17917A06842a93942B68185A07886B6833J68148b784m0944k61495B57627a07408
17906a96396A57861i431I3582J41568B5243K52787d5517A25672J02784A242b52280
17894b36486N21D4546J4184A658c40752B16228K4644E4284E238b04172A72855
17882F4316F424P920e04916B13007j05910E2685c8612m8067l2896L9603A18393
17870B54204a1862D8434P4718P0095G681K15270l4652b28738L1478B1985a45441
17858b35162G9796K14767c66029J42897b253p8913I9937c22310C3772K61155E0995
17846A24549b58257E7479a28686c5327E6175f9207a3622r4238I3789d78561g82
17834D1850K34210b71907B92593b10983L5323B68012H9302a50746B79064a25203
$$ y = [106842, -193942, 268185, 107886, 26833, 194981, -2784, -43728, -305223, 257627, -107408, -196396, 157861, -9431, 93582, 235150, 25243, 278030, -45517, 125672, 228456, 1242, -252280, -236486, -235965, 44546, 58730, 1658, -340752, 216228, 240872, 54284, 5238, -204172, 172855, 64316, 6424, 14344, -504916, 213007, 107097, 52685, -38612, -86679, -119575, -79972, 118393, 254204, -11862, 48434, 123152, 193247, 7681, 222951, 188299, -228738, -197260, 21985, -145441, -235162, 79796, 294563, -366029, -223132, -2253, -81166, 99937, -322310, 33772, 294927, 50995, 124549, -258257, 57479, -128686, -35327, 56175, -69207, -13622, -107860, 93789, -478561, -782, 41850, 276060, -271907, 292593, -210983, -175660, 268012, 89302, -150746, 279064, -125203]
17823A24721b44838O2169Q115B13271G7106d2223b0492A816L5437g2519K8268
17812d4251k79713i1634A01087C353c07833H3219a40498L3908g718k13100c8116
17800c35326e8617A6908a1126B02404F3744R6310J16211d3659b1801k05733f9110
17788b4537E8252P3707o1807b4943I3239D0351c476j51416N6912A9114P0769l6160
17776E3723L7572J31705d7746E0794b51693A74682b2875A28583c04424B12496
17765A21504K8127c5938A22525b55570A28190J36554E6150h8713k12842D2142
17754f1319j44885P1370A01755J62901m0107b84895C28527A59633b32745H1533
17743b5968A54470b76257A51899L2728p4871B0038M4258e2067I5369Q7289c01042
$$ y = [124721, -244838, -182669, -174554, 213271, 77106, -42223, -20492, 1816, 37253, -72519, -44251, -323964, -91634, 101087, 3353, -307833, 83219, -140498, -106590, -7718, -220818, -38116, -335326, -58617, 16908, -11126, 202404, 63744, 160054, 276265, -43659, -21801, -227534, -69110, -24537, 58252, 131959, 70152, -24943, 93239, 40351, -3476, -154892, -97980, 19114, 89883, 53723, 91295, 223000, -47746, 50794, -251693, 174682, -22875, 128583, -304424, 212496, 121504, 149631, -35938, 122525, -255570, 128190, 264744, 56150, -88713, -301555, 42142, -61319, -206204, -134834, 101755, 264656, 224549, -284895, 328527, 159633, -232745, 81533, -25968, 154470, -276257, 151899, 184627, 109756, 20038, 64296, -52067, 95369, 182658, -301042]
17731B03713K82216I382a6825H7030e1471D513O823J11367b08973c9557k9283
17720f8840b637A77161H4524J5944A9028b2156k05309b3396j52177r9321B20152
17708a95549L4030B16507a99811H381O1389L46391a96337e2229D26171d19146
17697b0390A74475a71077c2829D466L921b85136a8314j01560L7005A04786d0244
17685D459J54781a02178j31833A60825J59987A28267m4354a4500A06642R0309
17675A96951d20594c4692j45128h0699B0734a32869q9321i5457l1513d1735F8111
17663B92984a45906G9376b14317N9359a2423j5652j02105A11061J21813e1052
17652A6707a36562b4356A99978a48763A36397c9565j02235C7155M14311c40887
$$ y = [203713, 485929, 9382, -16825, 87030, -51471, 4513, 11336, 122703, -208973, -39557, -68840, -2637, 177161, 84524, 100468, 19028, -22156, -227465, -23396, -175573, -274894, 220152, -195549, -161519, 216507, -199811, 8381, 69770, 416161, -196337, -52229, 426171, -419146, -20390, 174475, -171077, -32829, 4466, 8387, -285136, -18314, -119874, -82869, 104786, -40244, 4459, 159240, -102178, -234011, 160825, 320812, 128267, 83913, -14500, 106642, 196951, -420594, -34692, -179820, -80699, 20734, -132869, -222190, -95457, -126970, -41735, 68111, 292984, -145906, 79376, -214317, -154958, -12423, -28075, -130180, 111061, 232874, -51052, 16707, -136562, -24356, 199978, -148763, 136397, -39565, -141800, 37155, 451466, -340887]
17641c18321A48166J24820a296C45493b40818A27763K9760K5012c49328h8103
17630b52833G5931b71921J02425p3965E6240J17709a08293I1574c353A80214L5909
17619B16123J222A00879b98075A60625F6952b811I2320a27219A14651l5311J9752
17608I9092m9417B1389a54672E005L47404h299A17495c8969B0124b61269G3017
17596g048B74173r1476C6360J29269a6458j01721A47367a362A45687C5728a25472
17584C11817A40709E5310b44637a18149L4608j4077p7394A99336h4725q9300B50373
17572A69856b16212G5315J1981b15234e6947j7119A3803J8608j2729M2968L82393
17561D45043f6261B3577I529N6068K78153G4771K829a31183A24009Q6472g7287
$$ y = [-318321, 148166, 272986, -1296, 345493, -240818, 127763, 157523, 182535, -349328, -88103, -252833, 75931, -271921, -169496, -243461, 56240, 173949, -108293, 91574, -3353, 180214, 216123, 217345, 100879, -298075, 160625, 66952, -2811, 92320, -127219, 114651, 79340, 99092, 49675, 21389, -154672, 5005, 352409, -8299, 117495, -38969, 20124, -261269, 73017, -7048, 274173, 182697, 36360, 165629, -16458, -118179, 147367, -1362, 145687, 35728, -125472, 311817, 140709, 55310, -244637, -118149, -83541, -97618, -175012, 199336, -84725, -174025, 250373, 169856, -216212, 75315, 87296, -215234, -56947, -74066, 13803, 32411, 19682, 62650, 445043, -66261, 23577, 9529, 65597, 343750, 74771, 77600, -131183, 124009, 210481, -77287]
17549a17464A05522P7181F9669A9656a57191c1452B81992R5051A16001J70986
17539B86987K0092I8734i7606B67340G9618C9606M8855J16906F3989k2018J30
17528D2101b21004C11624c2002l7206G2858J00507l3902A0334d1745B4561K30348
17517B54909A487M01223j81064A05678A3625L730a62484H70g5596A08474b09773
17505D3033L02915q7730C9484K9780b252G149a29712B5409P7801J9208J38648
17494B61066a7653B06938B0338K57010b0111A51084J55421b0155D2026f2233A69203
17482e9096K4039B9250J3015K72986A53216Q1237M120j18600J8094L50997j97519
17471B91545J44517j60708j17899a21501C8036J83164E4679L5449h1752k30046
$$ y = [-117464, 105522, 182703, 69669, 19656, -157191, -31452, 281992, 377043, 116001, 286987, 307079, 98734, -97606, 267340, 79618, 39606, 88461, 205367, 63989, 41971, 42101, -221004, 311624, -32002, -69208, 72858, 173365, 139463, 10334, -41745, 24561, 254909, 1487, 402710, 221646, 105678, 13625, 17355, -162484, 870, -75596, 108474, -209773, 43033, 345948, 258218, 39484, 69264, -2252, 7149, -129712, 25409, 103210, 122418, 261066, -17653, 206938, 20338, 277348, -20111, 151084, 306505, -20155, 42026, -62233, 169203, -59096, -35057, 29250, 42265, 315251, 153216, 234453, 238573, 119973, 138067, 489064, 291545, 436062, 275354, 157455, -121501, 38036, 221200, 54679, 90128, -81752, -311798]
17461c11798H1796K04267A33164K50507b8071r27q4000I4637h966C06317p1356
17450B34961F476M0330M2042J31566o546K10183J0521j20131A24559J44135b3938
17438A81128M5876O4364F2716j2114L7856K66553P8078G1848A8002J97672N3966
17427B69640d6669B17475K7810G119f9248A10808M0215r889J09792o5743K3096
17416B08279K35695B13093N4082l797Q7181A4478c0031B98572c23337a31870B01865
17404A31741M6369h1534a2047B76795k7616a40062A74429b157B0538L11976J91827
17393E24341E4889l440e4126I1181K08149j23538c5251B11013c04444C23797A37042
17381A94758A7246h4221F2153J31613r306o8684b34691A0631K76981K99028b31131
$$ y = [-311798, 81796, 286063, 133164, 383671, -28071, -28998, -112998, 94637, -8966, 306317, 234961, 6476, 46806, 88848, 220414, 213868, 424051, 434572, 314441, 124559, 268694, -23938, 181128, 227004, 291368, 62716, 50602, 88458, 355011, 433089, 71848, 18002, 215674, 269640, -46669, 217475, 245285, 7119, -69248, 110808, 151023, 141134, 250926, 185183, 208279, 443974, 213093, 267175, 263378, 350559, 14478, -30031, 298572, -323337, -131870, 201865, 131741, 178110, -81534, -12047, 276795, 249179, -140062, 174429, -2157, 20538, 332514, 524341, 54889, 51449, -54126, 91181, 299330, 175792, -35251, 211013, -304444, 323797, 137042, 194758, 17246, -84221, 62153, 193766, 184460, 115776, -234691, 10631, 287612, 586640, -231131]
17369I1314L38089d6073C0086Q2584e1678O606A77923a19965H8107D1662M64788
17358E06450b76378A63033R7989i0592A01858M030e3595B15088D4842J49297o8003
17347A26136h312I0533J66758a53980A80275c8227H1918P2418L34673m9508A01785
17335g3795B91628G0976J8621K58030j26249f2163m202E6625a2225j45324A00869
17323B31755a61295C6311e8529C48485A40546m9358b77877a523B66226F0706J95809
17312B56515p8084G4684K35846j48425G6069K42447A22806K7395Q1216a9839C52785
17300C60513i1945C35481e9340p3879D70471A21442J8694B652J45875N6246g3435
17288b95189B62571r0820A2909a25700a0663B64968Q5325r7939A14163C1401K06562
$$ y = [91314, 429403, -46073, 30086, 112670, -51678, -45072, 177923, -119965, 88107, 41662, 506450, -276378, 163033, 261022, -90592, 101858, 105888, -53595, 215088, 44842, 194139, 126136, -8312, 90533, 257291, -153980, 180275, -38227, 81918, 154336, 489009, 439501, 101785, -73795, 291628, 70976, 89597, 347627, 221378, -62163, -66365, 56625, -12225, -157549, 100869, 231755, -161295, 36311, -58529, 348485, 140546, 91188, -277877, -1523, 266226, 60706, 256515, 178431, 74684, 310530, 162105, 76069, 318516, 122806, 150201, 231417, -19839, 352785, 360513, -91945, 335481, -59340, -133219, 470471, 121442, 140136, 2652, 148527, 204773, -73435, -295189, 262571, 171751, 12909, -125700, -10663, 264968, 350293, 252354, 114163, 31401, 237963]
17277B37963L716E0390K21923j32706m2055i5831D13459A10821l4566J57986J62238
17266C96479A772Q4476L22033a3638B22268d0304a4702A8152K96342q5277N9683
17255B88900l5216k6971j11583h9421B40096j3799J37124m3273j20841a7525l0913
17244d8438A76040p7590Q2897J0922K85316k29008b45435a10894F44636B33287
17233F308K30231Q2838A09113m3033c1932D47398j12564A00809J78520a41850
17222D54796J6175j81471A06231g165A52046R174J28516a77703D89922k22159
17212B67763n1401m3587P1368B4169K4469K39922L90978G3982J08124J73784R342
17201C65232H6390K59981j45152q4912K94456B4049M92675j83286p9789p845D6013
$$ y = [237963, 241679, 50390, 272313, 139607, 97552, -95831, 413459, 110821, 76255, 234241, 396479, 1772, 86248, 408281, -13638, 222268, -40304, -14702, 18152, 314494, 229217, 288900, 253684, 226713, 115130, -89421, 240096, 226297, 363421, 320148, 199307, -17525, -48438, 176040, 98450, 181347, 192269, 477585, 248577, -245435, -110894, 644636, 233287, 6308, 236539, 319377, 109113, 66080, -31932, 447398, 334834, 100809, 279329, -141850, 454796, 470971, 289500, 106231, -7165, 152046, 161220, 289736, -177703, 489922, 267763, 216362, 172775, 244143, 24169, 48638, 288560, 679538, 73982, 182106, 355890, 365232, 86390, 346371, 201219, 116307, 410763, 24049, 516724, 333438, 253649, 245804, 46013]
17189B60307J37800j40241h2746C34514A16700a01596A63660L7172D2768J51488
17179A94256c809H2578M1643L85735B42625b6199C59924C8160J16729K92204H9662
17167B81444I8253K19860K2200A08981K77677J37207N7668j3692B77722M4851
17157C22573j29990H1226L02792A61172J0972K48224A14538K88682a80652C17160
17146D44556A23850N7192L36324h4420a9845G092K86791K0906H3762L1784L02133
17135D17679j85459B2270K89429J00690Q616B07587D6881J54399D1622K86100
17125C27722P4815q7989J63718j06191R7819j78203A07820L06760F8593M3963
17115A12556J15155K57250J4015k18588C7244K38598M09611D2735K44491P5048
$$ y = [260307, 398107, 257866, -82746, 334514, 116700, -101596, 163660, 200832, 42768, 194256, -3809, 82578, 124221, 509956, 242625, -26199, 359924, 38160, 154889, 447093, 89662, 281444, 98253, 318113, 340313, 108981, 386658, 523865, 581533, 567841, 277722, 322573, 192583, 81226, 384018, 161172, 172144, 420368, 114538, 403220, -180652, 317160, 444556, 123850, 181042, 517366, -84420, -19845, 7092, 293883, 314789, 83762, 115546, 417679, 232220, 22270, 311699, 412389, 421005, 207587, 46881, 201280, 41622, 327722, 402537, 314548, 478266, 372075, 469894, 291691, 107820, 414580, 68593, 112556, 227711, 484961, 498976, 280388, 37244, 275842, 685453, 42735, 287226, 362274]
17105C62274A67424L8008M8386P8258J14224E9296J19080J81135A35462J99718
17095C35180A43081M00476a04555B59300K88711j53317j23382K48535A14098J16422
17085B30520K24277p0959l8756A29788O2906k9916J02577j5846j8101A02742K39980
17074C42722a27732C87279M1880K45341k57216Q2856j41545M2474J01585l749
17064D98905Q7021K08419A35596J75843P9855K01550m3375k31756L5404j30096
17054B23021J97862J53557j09800A67306L70364Q4703j35231o2425j91461P794
17044B41050L31675B72949K03052A97900Q8274K07207M6698q1023J83395k07967
17034D34484j8978L9172K00031j18008P9715j77851M39955k52121r0773j7577
$$ y = [362274, 167424, 205432, 253818, 332076, 446300, 59296, 178376, 359511, 135462, 335180, 143081, 543557, -104555, 259300, 548011, 394694, 271312, 519847, 114098, 230520, 454797, 383838, 345082, 129788, 192694, 162778, 265355, 249509, 231408, 102742, 342722, -127732, 387279, 429159, 674500, 417284, 500140, 358595, 401069, 502654, 498905, 585926, 794345, 135596, 311439, 391294, 592844, 549469, 317713, 353117, 223021, 420883, 574440, 464640, 167306, 537670, 622373, 487142, 424717, 233256, 241050, 572725, 272949, 476001, 197900, 286174, 493381, 540079, 459056, 642451, 434484, 415506, 454678, 654709, 536701, 616416, 438565, 878520, 626399, 535626, 518049]
17024E18049R4218L07879k89055k11676K96570j32142k3480m5467P8371J22695
17014G15962j28415j47656Q1500N109m8510j4587J30464K27207j84009P9775k63293
17003D53547K30105r9426o3162J64372p3456J00196m9090k5984J24162k11084
16993E50180K36376J91026l85372J18298M7679j3319j03514j17749n4736L38898
16983H07767l76450J94905L38095j36942j9405K4868j12486n6247K81138j88027
16973G57216n1554R6177j5803j30334J22860k27907K23520j12475N7209J71702
16963H90611k14528J94525M6711J3305k22572K4810K7865n0539L36290j20757
16953I25721L39304F32475M25981j87332K70012m10436L51427l99510K30535K21753
$$ y = [518049, 612267, 920146, 631091, 419415, 715985, 583843, 560363, 514896, 593267, 715962, 587547, 439891, 521391, 526500, 477990, 463403, 593867, 821074, 637065, 716840, 453547, 683652, 584226, 521064, 685436, 611980, 712176, 663086, 637102, 761264, 550180, 786556, 977582, 592210, 710508, 758187, 744868, 641354, 523605, 468869, 807767, 431317, 626222, 964317, 827375, 807970, 832838, 720352, 664105, 945243, 757216, 705662, 801839, 786036, 655702, 778562, 550655, 774175, 661700, 718909, 890611, 676083, 870608, 917319, 930624, 708052, 732862, 760727, 710188, 1046478, 925721, 1265025, 632475, 1058456, 871124, 1141136, 730700, 1082127, 682617, 913152, 1134905]
16943A134905j24551J15810k43741q1766J37448k95990L71807j58885o5566M88260
16933A277731j82060n3035K70929l20541P9417r9120M98496j66503j89391J7520
16923A133443O2598K3720K72647k79517p8761j89233J77718R4472M50835m17751
16913A250171J30999k8540q1128J03405L1107J34845k82565K91500q6011J62058
16903A625841k7229J86686l46811L6207K23626k60039J99327j11003M03725k54574
16893A675756j60719K35189J857k79279R3168J43858L12397j94107N5624k9462
16883A854282j4700J3314J27208l20361J05685K73900J41380k95995R6980J41763
16873B123456r9193k79713M15338K4909k79288K15090K27524k12498J22296L88647
$$ y = [1134905, 1010354, 1126164, 882423, 800657, 938105, 642115, 1013922, 855037, 789471, 1277731, 1095671, 1042636, 1313565, 993024, 1072441, 973321, 1471817, 1305314, 1115923, 1133443, 1196041, 1219761, 1492408, 1212891, 1134130, 944897, 1122615, 1217087, 1667922, 1250171, 1381170, 1352630, 1271502, 1374907, 1406014, 1540859, 1258294, 1549794, 1463783, 1625841, 1598612, 1785298, 1438487, 1474694, 1698320, 1438281, 1637608, 1526605, 1930330, 1675756, 1515037, 1750226, 1752083, 1472804, 1565972, 1709830, 2022227, 1828120, 1883744, 1854282, 1839582, 1852896, 1980104, 1659743, 1765428, 2039328, 2180708, 1884713, 1981693, 2123456, 2024263, 1744550, 2159888, 2184797, 1905509, 2120599, 2348123, 2135625, 2257921, 2646568]
16863B646568j00406j99736M84793o45639K18217J43105L8199j37451M01327k84740
16853B564237L83663l37744J40408p3129N2661J87146K75721j55694J95590k89092
16843B943767j5176M54814j57897k23069N53042l76967M32703J20993r9228J46643
16833C779625L8183J62110J02696o0560L22301k08816m2298K10688P5785j30584
16823D249130L79629J3153R0702j52483L91032J0352L66319l42041R3310J85089
16813E284192O1832K57941k75445P45557l09700J00342O18967k58127J65404L03186
16803F694149P4488j72334K19056L86978M86605j64081K93787J05684L20337O6055
16793H310724K62941N98878r1705L74496L09072j22425M40204J10098N81358L34829
$$ y = [2646568, 2546162, 2346426, 2831219, 2185580, 2403797, 2546902, 2585101, 2447650, 2848977, 2564237, 2947900, 2610156, 2750564, 2677435, 2730096, 2917242, 3192963, 3037269, 3232859, 2943767, 2928591, 3383405, 3225508, 3002439, 3555481, 3178514, 3611217, 3732210, 3632982, 3779625, 3817808, 3979918, 4082614, 4022054, 4344355, 4135539, 4093241, 4303929, 4379714, 4249130, 4628759, 4641912, 4732614, 4580131, 4971163, 4981515, 5347834, 5005793, 5099103, 5284192, 5346024, 5603965, 5328520, 6074077, 5764377, 5864719, 6483686, 6225559, 6390963, 6694149, 6768637, 6596303, 6815359, 7202337, 7688942, 7524861, 7818648, 7924332, 8244669, 8310724, 8573665, 9172543, 9080838, 9455334, 9764406, 9641981, 10082185, 10192283, 10773641, 11108470]
16783A1108470M5751L65851K55771L75223N86838l121P97363J14637Q75256K23733
16773A4745772O38003L08229N19451Q30878O83832M72469P74586Q26872N11330
16764B0311422P25819P95506Q55611R23351J137088R40327J222255J081190J246672
16755B9239241J041012J042027K002388J585273J789215J607540J676842K109962
16747D2093500K073934K466085K617346K318578L069639L036289L143271L691947
16739F4510589L603694L904343M493905M526409M834997M998993N662867N563731
16731A02099528O238349O322356O672402O597494O958663O857205O631197O588779
16723A54965973N941899N436008M671216M050832K940147J871551L27624l61944
$$ y = [11108470, 11154221, 11520072, 11775843, 12151066, 12737904, 12734783, 13532146, 13646783, 14522039, 14745772, 15383775, 15692004, 16211455, 17042333, 17726165, 18198634, 18973220, 19800092, 20311422, 21037241, 21832747, 22688358, 23611709, 24748797, 25689124, 26911379, 27992569, 29239241, 30280253, 31322280, 33324668, 34909941, 36699156, 38306696, 39983538, 42093500, 44167434, 46633519, 49250865, 51569443, 54639082, 57675371, 60818642, 64510589, 68114283, 72018626, 76512531, 81038940, 85873937, 90872930, 96535797, 102099528, 108337877, 114660233, 121332635, 127930129, 134888792, 141745997, 148377194, 154965973, 160907872, 166343880, 171015096, 175065928, 178006075, 179877626, 180205250, 179843306]
16715A79843306j929842k757501m127987m924683n348852o489083o471516p192119
16707A40601723o846872o945976o926669o948200o343616o028947n918956n745590
16699H8896897n125105n020883m221326m433578l925600m081704l549457k853781
16691E5685463l016574l067696k395362k529117k230998k125038k231985j641430
16683C6447263j782335j715155j276872j417781j726800q04415j498642j000089
16675B5225174q79655r16044j146342j218978l67713q04013n17067r95295q45658
16666A7534409m85176p39961o37502n37144l61045m94918r46898R5366l82688
16657A3044443q46099P2772j90315k07263o33455k67749l33769k84116o37224
$$ y = [179843306, 177913464, 175155963, 171027976, 166103293, 160754441, 154265358, 147793842, 140601723, 133754851, 126808875, 119882206, 112934006, 106590390, 100561443, 94642487, 88896897, 83771792, 78750909, 74529583, 70096005, 66170405, 62088701, 58539244, 55685463, 52668889, 49601193, 47205831, 44676714, 42445716, 40320678, 38088693, 36447263, 34664928, 32949773, 31672901, 30255120, 28528320, 27723905, 26225263, 25225174, 24345519, 23429475, 22283133, 21064155, 20696442, 19892429, 19375362, 18380067, 17534409, 17049233, 16309272, 15671770, 15134626, 14773581, 14278663, 13331765, 13427131, 13044443, 12198344, 12271116, 12080801, 11873538, 11240083, 10972334, 10638565, 10354449, 9717225]
16648I717225p4557m50031l12974K31444n67762M2371l75932m31425P2773k25510
16638G625622k59037J12435k93166R894m79933j30105j51444k6256k67119j27534
16628F013357l33592J07963j27388k55340J51764k70036l49833p4559k16325K34322
16618D880333l74185L12936k30977j64833n2062n2390k78838l09546M45061m50110
16608C725389Q2824K27050l03931Q440l81392M21434k91671k39400K8421L33047
16598C610211k78891j79729P5060k01818j04205M1875r9562j38128J7188J59463
16588B901464j41114l2436j12030n9761K1403m57371O60543j07727l56961m8441
16578B267569q28J28962k41205J08038K07592N6988m70214j7322p5521K44046
$$ y = [9717225, 9642668, 9192637, 8879663, 9111107, 8543345, 8585716, 8209784, 7778359, 7851132, 7625622, 7366585, 7479020, 7185854, 7195748, 6715815, 6585710, 6434266, 6408010, 6140891, 6013357, 5679765, 5787728, 5660340, 5405000, 5556764, 5286728, 4936895, 4862336, 4646011, 4880333, 4506148, 4819084, 4588107, 4423274, 4371212, 4318822, 4039984, 3730438, 4175499, 3725389, 3808213, 4035263, 3731332, 3739772, 3358380, 3779814, 3488143, 3248743, 3277164, 3610211, 3331320, 3151591, 3226651, 3024833, 2920628, 2962503, 2862941, 2724813, 2742001, 2901464, 2760350, 2727914, 2615884, 2556123, 2577526, 2120155, 2780698, 2672971, 2316010, 2267569, 2266741, 2395703, 2154498, 2262536, 2470128, 2527116, 2056902, 2039580, 1964059, 2208105]
16568B208105j63055o281l2952k21006J58813j73463O8492j93183J69083j73506
16558A641047R2238K88079O5090m18786j21539p6783N20877l15621r5647k24864
16548A354091L68722k42551J7882N2689m8802N2667K6053j85563k2931P1140j23764
16537A319633L54804l46990L5253j67603J93068p9036J49601l5569m93829M52197
16527A381529q6889k10564j53738J06883R1188l46323K84187J80078p1638N8941
16517A233654l32486K60024k6089j24499J771j98893K88625j91862J61631l32154
16507G39722J37170M880k19145L29263k03986M9538L83300j68947k52338J49150
16497I48607k05414J08369L29393j67923l10611K44500m6922j36638J04700j56888
$$ y = [2208105, 2045050, 2038769, 2005817, 1784811, 1943624, 1770161, 1838653, 1645470, 1814553, 1641047, 1733285, 2021364, 2086454, 1667668, 1546129, 1469346, 1990223, 1674602, 1578955, 1354091, 1722813, 1480262, 1498144, 1550833, 1502031, 1554698, 1580751, 1395188, 1372257, 1443397, 1319633, 1674437, 1327447, 1362700, 1195097, 1388165, 1309129, 1458730, 1423161, 929332, 1381529, 1294640, 1084076, 930338, 1037221, 1128409, 782086, 1066273, 1246351, 1174713, 1233654, 901168, 1161192, 1135103, 1010604, 1012375, 813482, 1102107, 910245, 1071876, 739722, 876892, 881772, 662627, 991890, 787904, 837442, 1220742, 1051795, 799457, 948607, 743193, 851562, 1180955, 1013032, 702421, 946921, 899999, 763361, 868061, 711173]
16487G11173k84620O52707j58248m5131j25599K38408m34573L23783l82356K54668
16477G50212Q0049j35017Q9351j59574j82610L07186p3568C14621J32517K32744
16467F79882R3296J65315j94640J91135l06842J87364k97649j35371N81882k97131
16457F67241p7892J08860o3725r7784J53145k4179j57671K22251j86432Q8187
16447F32001j15104j6451P6912q2839l845N07751D44546n2382J38696o1196J16969
16436E86633j48831J43538J50850j34206J19070l50334K90163k19049K10342J16771
16426G64947C66119O4952J38185O8650l17080k3391L1599N9519L12152j19390
16416E81315J35607j02755B78875J87088k11719R9787J58581q7715K69364j89521
$$ y = [711173, 426553, 1079260, 921012, 875881, 750282, 988690, 554117, 877900, 495544, 750212, 830261, 695244, 784595, 625021, 442411, 749597, 676029, 314621, 447138, 679882, 773178, 938493, 743853, 934988, 628146, 815510, 517861, 382490, 964372, 667241, 589349, 698209, 634484, 536700, 689845, 665666, 507995, 730246, 543814, 632001, 516897, 500446, 577358, 494519, 490674, 998425, 444546, 392164, 530860, 469664, 586633, 437802, 581340, 732190, 597984, 717054, 366720, 656883, 437834, 648176, 764947, 366119, 431071, 569256, 637906, 320826, 297435, 329034, 388553, 700705, 581315, 716922, 614167, 278875, 465963, 254244, 354031, 512612, 424897, 694261, 504740]
16406E04740k28540L42141B49446j02866N06269n3025k18630K57260j97985N9113
16396D99582j37313N8340q9247E1606j7084M82337j65599K75750B21798K24335
16386D46133o4650j39736D0283K76628J37344o1976p2551J79510C1470b59384
16375G4635M80609j97050M25298l66534j87762K87479L4407j92502O281K29204
16365E94065j52103j2240A66003k2395K61782K3792P1953K420r0891m26I3907
16353A88891K11053D6196N13707B31779K55581m5545j10256Q9191r8938j53725
16343A68087M59022B11473J63638R0085k19453K23141N2193j98617K05002j82172
16333C45290p9955J66576O501K5541j51036K97313A83084K16064j25631A09970
$$ y = [504740, 276200, 618341, 249446, 146580, 652849, 599824, 381194, 638454, 440469, 499582, 362269, 420609, 331362, 51606, 34522, 516859, 351260, 627010, 221798, 446133, 381483, 241747, 40283, 316911, 454255, 392279, 319728, 499238, 31470, -259384, 74635, 555244, 358194, 783492, 416958, 229196, 516675, 551082, 358580, 364861, 594065, 441962, 429722, 166003, 143608, 405390, 429182, 501135, 503555, 412664, 412238, 93907, 188891, 399944, 46196, 559903, 231779, 487360, 441815, 331559, 420750, 321812, 168087, 627109, 211473, 375111, 465196, 245743, 468884, 521077, 322460, 527462, 345290, 265335, 431911, 438412, 463953, 312917, 610230, 183084, 399148, 273517, 109970]
16322D73697k0947j03054n7446j07973J51985A18540J86033A49630G4395K08562
16312B82957q6089K35012j97515J9760R6088o1276L0785a04170B50089J36143
16302C86232k8115M9698r6231I4062k7009R2332J64105E5199J84574Q150D7715
16290A93089a68380C0891K20038b05392B50003N6313m9820K90429A29809l2021
16280I7788C2794P45145F4910J83649A13599c768C39226j982f3330C50816o3607
16269B87209b02666g4474C11385R8675A76417K23865o5931A07828L95458a29745
16258a6194B15753C9830J31196J93538A59045p8544j0931j5783c9823j85080A09904
16246F6991e1795B41269A17375E710M8413D680J86287O0156J89938r2131J63346
$$ y = [473697, 452750, 349696, 292250, 184277, 336262, 118540, 304573, 149630, 74395, 282957, 196868, 431880, 234365, 254125, 350213, 288937, 319722, -104170, 250089, 386232, 358117, 407815, 311584, 94062, 67053, 159385, 323490, 55199, 239773, 247923, 47715, 193089, -168380, 30891, 250929, -205392, 250003, 306316, 256496, 546925, 129809, 97788, 32794, 777939, 64910, 248559, 113599, -3768, 339226, 337244, -63330, 350816, 287209, -202666, -74474, 311385, 410060, 176417, 400282, 334351, 107828, 503286, -129745, -16194, 215753, 39830, 171026, 364564, 159045, 80501, 69570, 53787, -39823, -224903, 109904, 66991, -51795, 241269, 117375, 5710, 54123, 4680, 190967, 251123, 441061, 348930, 512276]
16235E12276a40441A17602J65658j17643A6350K45517g2750A51693K8082N3289
16225B33064M9095A21749D0798a49556E235a90131l8747B36785E1975f3467C0135
16213B40906j07723e9782k8061m850C28626F1081j37K6191K02949A34994a85620
16201a01736o2456E64814a13209D72336b80608L4237F4334K38965J68354B578
16190C74038j0607h8394F9349b1797A72740K44560p9786a24505F6709J84028F2115
16178A01097J0154M3923J30763e6473C80954f2309j20193N462N1476J2208a4446
16166A36425J83347a5397o7298B10574R8251a36895I0758l8633O8113L73685A79278
16154a10864l6900B03604l4750P9881B9095L14740I965h122B36029g639q1964
$$ y = [512276, -140441, 117602, 283260, 165617, 16350, 261867, -72750, 151693, 179775, 233064, 282159, 121749, 40798, -149556, 5235, -190131, -228878, 236785, 51975, -63467, 30135, 240906, 133183, -59782, -87843, -92693, 328626, 61081, 60944, 87135, 290084, 134994, -185620, -101736, -164192, 564814, -113209, 472336, -280608, -246371, 64334, 303299, 471653, 2578, 374038, 363431, -88394, 69349, -21797, 172740, 417300, 337514, -124505, 66709, 250737, 62115, 101097, 111251, 155174, 285937, -56473, 380954, -62309, -182502, -177040, -125564, -113356, -14446, 136425, 319772, -15397, -82695, 210574, 308825, -136895, 90758, 52125, 120238, 493923, 179278, -110864, -147764, 203604, 168854, 248735, 29095, 343835, 9965, -8122, 236029, -7639, -89603]
16143h9603A46801F8171a12096B76578J29408a02149A5416K2038J9031L70457
16133D26942f0733l7354E9244i8930j47467G8394J13064F2783O336n455B7965
16121A16259M1108C9319c1756A56562a39190H1061a59080A2021i3677B38670m8602
16110A90068l5786a27752C20452G0391J41314K45476a17418C59628a7836C42218
16099b93734A58950p5064b11449A19646K85635B4323A1420J37706k6432B7087
16088C609a41629e2947j15129M3328L7239k55420f8837I2260K4975d709B9159
16076D32582B1505M842d5588B63616r1331B2479a23452A53899h0830l25212B3603
16064D0110c143I5654a09713B71930g5573k27164A21860M6703b30741B31303b65307
$$ y = [-89603, 146801, 68171, -112096, 276578, 405986, -102149, 15416, 37454, 56485, 426942, -60733, -98087, 59244, -98930, -246397, 78394, 191458, 62783, 69119, 63664, 27965, 116259, 157367, 39319, -31756, 156562, -139190, 81061, -159080, 12021, -93677, 238670, 190068, 154282, -127752, 320452, 70391, 211705, 457181, -117418, 359628, -17836, 342218, -293734, 158950, 83886, -211449, 119646, 405281, 24323, 11420, 149126, 122694, 27087, 3609, -141629, -52947, -168076, -124748, -87509, -342929, -68837, 92260, 117235, -4709, 29159, 432582, 21505, 26347, -45588, 263616, 172285, 22479, -123452, 153899, -80830, -406042, 23603, 40110, -3143, 95654, -109713, 271930, -75573, -302737, 121860, 168563, -230741, 231303, -265307]
16052b1875o8044j7303C12290F0338a43431j4210g2309P902B3719c57923e2309
16040I5440b62540B06085c5392a1469k06004D8882b60495n4306a23460A68145
16029A10246b3870f744K835j95958I7489j8871O4392r766N9302f2513k14257C7702
16016B6438a96324g3401o6720A37451A5084m123a37087C6855L9366J05754l8112
16005A43863J78907B9503K0382J60380d73l07873a31875E908h8599A42174m3036
15994I9138p536G768a25479E6271a40703j3053b4564B64398b65712f9388a7782
15982A97048M2143J86245k06666B3341J36042n4593a15315F1897J37129b4877
15971f9909j8165B9036h5894c440j9344B66630a71052F7224b08763B389a41799
$$ y = [-21875, -89919, -107222, 312290, 60338, -143431, -157641, -72309, -64407, 23719, -357923, -52309, 95440, -262540, 206085, -35392, -11469, -217473, 48882, -260495, -314801, -123460, 168145, 110246, -23870, -6744, -3909, -199867, 97489, 78618, 143010, 133244, 192546, -62513, -276770, 37702, 26438, -196324, -73401, -140121, 137451, 15084, 10961, -137087, 36855, 76221, 181975, 143863, 322770, 29503, 49885, 210265, -473, -308346, -131875, 5908, -88599, 142174, 99138, 91602, 7768, -125479, 56271, -140703, -153756, -24564, 264398, -265712, -69388, -17782, 197048, 239191, 425436, 218770, 23341, 159383, 104790, -115315, 61897, 199026, -24877, -69909, -88074, 29036, -85894, -3440, -22784, 266630, -171052, 67224, -208763, 2389, -141799]
15959B15559D5802i0529d5135l58315J05023P8573j06844B08554H348c05365C08159
15947F0493m712b61144o0430B1511Q0039e341B68974j18010g7541D0761a69262
15935H31a25257A89850b3267A2561a02873G7830g9935k79104A97243a30725N0847
15924g9878Q720A80189J168a37470M0921B23117b18866C057J77910b16831F2353
15912D4897c04278a9426j5708j4748q6536n5930D4468g7654B9950a02235F3419
15900A12530c0698H4058a08345B4261b01510A6942J11685a17861d0820H0998C3346
15888A5978c1567k98000J51036F4581a45815I6132b9709o8696a1487F857b87122
15876a30078N7416J7269A65483j2721d2506j81632A15751a26017d1114E9432a67363
$$ y = [215559, 45802, -90529, -45135, -403450, -298427, -219854, -326698, 208554, 8348, -305365, 308159, 60493, 55781, -261144, -321574, 21511, 101550, -5341, 268974, 150964, -77541, 40761, -169262, 831, -125257, 189850, -23267, 12561, -102873, 77830, -79935, -359039, 197243, -130725, -79878, -71158, 180189, 181357, -137470, -96549, 223117, -218866, 3057, 180967, -216831, 62353, 44897, -304278, -19426, -35134, -49882, -136418, -192348, 44468, -77654, 29950, -102235, 63419, 112530, -30698, 84058, -108345, 24261, -201510, 16942, 128627, -117861, -40820, 80998, 33346, 15978, -31567, -329567, -178531, 64581, -145815, 96132, -29709, -98405, -11487, 6857, -287122, -130078, -72662, -55393, 165483, 152762, -42506, -224138, 115751, -126017, -41114, 59432, -167363]
15864A59292B6520K21953i7639q0686P8617j51789C8550c45865a2833A16693J31309
15853B48002c24438E6107R9452M0879C8988J408M01816h4724C95a02059G803J14043
15841A21846i7815n5212D9487a35379A05703B8755P401P1950M6636a22652c9244
15829B45511r9631A1638b41250r5889G1411b152p2760j74835a14598p0396J5797
15818a69197E7824a05527G082d3121A35053g6193L2228j63907k93182a34843R814
15807a25029A18606a59576A28262J15433d70780A51003a1593j12121a5917A27897
15796A8612b70467D8359a23361k36271G2352B2957J0281N7792Q175b4516D4762
15784a01995E8205b0619k05141A29168J13689k6362A9010K09179b73055C3878
$$ y = [159292, 26520, 248473, -97639, -178325, -99708, -251497, 38550, -345865, -12833, 116693, 248002, -324438, 56107, 155559, 196438, 38988, 40396, 442212, -84724, 395, -102059, 7803, 121846, -97815, -153027, 49487, -135379, 105703, 28755, 36156, 108106, 154742, -122652, -39244, 245511, 145880, 11638, -241250, -337139, 71411, -2152, -74912, -249747, -114598, -184994, -169197, 57824, -105527, 7082, -43121, 135053, -76193, -43965, -207872, -501054, -134843, -125029, 118606, -159576, 128262, 243695, -470780, 151003, -11593, -123714, -15917, 127897, 18612, -270467, 48359, -123361, -359632, 72352, 22957, 33238, 91030, 99205, -24516, 44762, -101995, 58205, -20619, -225760, 129168, 242857, 216495, 19010, 228189, -273055, 33878]
15773a11930m8570L6817c0317A41808a38825I1372b04872A067c7848j82689b3360
15761a27225c5974I6055a40515b7406H0167b96713j62028a9980j03820N5860B8745
15749f4771j5827L976A17444d79010f3628d141k30738A0459a1861k06689A7585
15737i3618I7322c04688H0500a97545B95104I2586k0705a01638b6988k1775j22375
15726a71138m3043i8963L5422l2073G46b12751P9349l3332f1461A9030b72579
15714a87760B39012e5989B24559f0701n3043j05204j14355B08656a54130g0605
15703b7486B71121A32785a0147A71433f03479a99021D2298b00640j21973A8643
15692b74547A95873c0456L064k39390i6939j6226A12819b65754d7237B26898i0215
$$ y = [-111930, -160500, -123683, -30317, 141808, -138825, 91372, -204872, 1067, -37848, -220537, -23360, -127225, -35974, 96055, -140515, -27406, 80167, -296713, -458741, -19980, -123800, -67940, 28745, -64771, -80598, -76622, 117444, -479010, -63628, -4141, -234879, 10459, -11861, -218550, 17585, -93618, 97322, -304688, 80500, -197545, 295104, 92586, 71881, -101638, -26988, -48763, -171138, -214181, -98963, -63541, -95614, 746, -212751, -133402, -166734, -61461, 19030, -272579, -187760, 239012, -55989, 224559, -60701, -113744, -218948, -333303, 208656, -154130, -70605, -27486, 271121, 132785, -10147, 171433, -603479, -199021, 42298, -200640, -322613, 18643, -274547, 195873, -30456, -27392, -266782, -96939, -113165, 112819, -265754, -47237, 226898, -90215]
15680I6997i9509A41073d1697j98213C5473K8771m24a58100g1747j9777A63831
15668A07892a79286B6721d6057A47593a05205E830J4158a13091E4686j7831d5972
15656B23760l7256a02925j4977n371q1448g2270p1095j36748c0343B23358c42738
15644H9360b93138J46247A01984J35564b62793d9614E6936a92485J0044A68033
15633A79908k1059e1562N224A7581g4486A03332e123j8454r8702F3363e2315j74264
15621b26579A14647J14649A00373b80467A03924b15648A25693R60d36284g220
15610b04722c2297A02351a26418b344A96863c3558E2624d48256C5767a96401e6624
15598h5303H9542a73860d9298L652B51073D6454a1823I6862M3667O6442L3511
$$ y = [96997, -99509, 141073, -41697, -239910, 35473, 64244, 63820, -158100, -71747, -91524, 163831, 107892, -179286, 26721, -46057, 147593, -105205, 5830, 19988, -113091, 54686, 36855, -45972, 223760, 186504, -102925, -117902, -123273, -204721, -72270, -143365, -280113, -30343, 223358, -342738, 89360, -293138, -146891, 101984, 237548, -262793, -49614, 56936, -192485, -182441, 168033, 179908, 158849, -51562, -46338, 17581, -74486, 103332, -5123, -23577, -122279, 63363, -52315, -226579, 114647, 229296, 100373, -280467, 103924, -215648, 125693, 126653, -436284, -7220, -204722, -32297, 102351, -126418, -2344, 196863, -33558, 52624, -448256, 35767, -196401, -56624, -85303, 89542, -173860, -49298, -45646, 251073, 46454, -11823, 96862, 140529, 206971, 240482]
15587B40482p0025J2683D486c26311a30924A8684K6762a1136j614j56782F5453
15575c67699A14721b61333A50201l9145n4628a44754A76225g1931I1075b60381
15564i9956D9681J442a48526C33609c47037B4820h1480A3396b48195C3740a56963
15552A82935C3003M2750j6779K4576K1645K82013F5771A6812b9602o6583B41352
15540i9329C94896b5527k18307B10916c49819e7500j84532a2916A64567a21991
15529f2261k14053b8111F1929F864K88704a0038o3398a8148k52307B15383a49585
15517A28348d9958j57165D9061c39609H3402I542N114J36207A7199c02827i9909
15505A4806h2065A1570a01519K9619A33046a335E6516J48338B8261b624k0034
$$ y = [240482, 170457, 183140, 4486, -326311, -130924, 18684, 45446, -11136, -12750, -169532, 65453, -367699, 114721, -261333, 150201, 111056, 56428, -144754, 176225, -71931, 91075, -260381, -99956, 49681, 51123, -148526, 333609, -347037, 24820, -81480, 13396, -248195, 33740, -156963, 182935, 33003, 75753, 58974, 83550, 105195, 387208, 65771, 16812, -29602, -96185, 241352, -99329, 394896, -25527, -243834, 210916, -349819, -57500, -242032, -12916, 164567, -121991, -62261, -276314, -28111, 61929, 6864, 295568, -10038, -73436, -18148, -270455, 215383, -149585, 128348, -49958, -207123, 49061, -339609, 83402, 9542, 14656, 150863, 17199, -302827, -99909, 14806, -82065, 11570, -101519, -71900, 133046, -1335, 56516, 204854, 28261, -2624, -22658]
15494b2658B45572a51194m6961K9204r0872b3906j78500A74799b31750j11401
15484c43151I863J41080J32202A09890J54014M7883a51271F9996h3745j7593A79737
15472C7410j0594K3759A2635O0503M7795i3832C44780c49378D302K36035b30142
15460a80392A27220O8579b93185i3837A69801o9022a90499N4718A04574k7706
15450G6868a04252o9879A15947a5495L83A50240a32497C48094A25896K0848a10093
15438A03413k5133j6371c93539C8137a36784B27837E6419e8464D8814M7553J25107
15427B21474a834j41610J9134G9424j5678a46922q3554L0431G1250A1288h3971
15415b10648i5863j04926j40292A53536R7943a9823j5058a7238r1542A69940b41692
$$ y = [-22658, 245572, -151194, -198155, -168951, -259823, -23906, -202406, 174799, -231750, -343151, 9863, 150943, 283145, 109890, 263904, 311787, -151271, 69996, -83745, -101338, 179737, 37410, 26816, 50575, 12635, 73138, 120933, -93832, 344780, -349378, 4302, 240337, -230142, -180392, 127220, 195799, -293185, -93837, 169801, 100779, -190499, -135781, 104574, 76868, -104252, -174131, 115947, -15495, -15112, 150240, -132497, 348094, 125896, 146744, -110093, 103413, 78280, 61909, -393539, 38137, -136784, 227837, 56419, -58464, 48814, 96367, 221474, -1834, -143444, -124310, 79424, 63746, -146922, -230476, -200045, 71250, 11288, -83971, -210648, -95863, -200789, -341081, 153536, 251479, -19823, -34881, -17238, -108780, 169940, -241692]
15403a90493B2404b13207A15888a63896k2765Q3999C6706Q1687c35538I0844b20402
15391c6345f676j94309j7096P1386A48952b56659A4724K59886b2679B36256b06715
15379d145j46664M0408B20226j09416b12231A99178b28045j30043b4975E6204
15368a83583Q5591A94274a62660g2920b2750j56101B3312b7844A59412D3206A8718
15356b17120I5033K54587a6531H6553g7725k63668B07897E5418J14390p5441b85783
15344A97301b08857J02828j73953G6993N371B2462N3380f7839J4163d511J757
15333b754D6936a76311b3765A85825K8839G3319a912A24413d0929C314c35761
15321A15553L1166g797j39162B01388m1250E9631J41197a72846b5160k22289B26799
$$ y = [-190493, 22404, -213207, 115888, -163896, -186661, -102662, 36706, 118393, -335538, 90844, -220402, -36345, -6676, -200985, -218081, -146695, 148952, -256659, 14724, 274610, -22679, 236256, -206715, -4145, -150809, -110401, 220226, 110810, -212231, 199178, -228045, -358088, -24975, 56204, -183583, -97992, 194274, -162660, -72920, -22750, -178851, 23312, -27844, 159412, 43206, 18718, -217120, 95033, 349620, -16531, 86553, -77725, -341393, 207897, 55418, 169808, 94367, -285783, 197301, -208857, -106029, -279982, 76993, 82364, 22462, 75842, -67839, -53676, -4511, -2754, 46936, -176311, -23765, 185825, 214664, 73319, -1912, 124413, -40929, 3314, -335761, 115553, 146719, -7797, -146959, 201388, 160138, 59631, 200828, -172846, -25160, -247449, 226799]
15309A4722J26408B6828c62287B91956q8156e7628j95774F6082A7491i0176A21423
15297A59681b30312G4995a97507A69939F5950P8444a67855A11639a08784B53482
15286I2202a7498A11500O133k4625h242I2966g0129c126j13966b8577B91670h4665
15273c5637C82854D9402P7897a20959k86580C31434A32369J53858H9457l4363
15263E5094b7650j40742A0481a02911k03265A28199A1900L24234A58732J71952
15253C30684e4256H668J21693b570B11893J70833L93881P94737P09997m99155
15243A782186J33626l88357A31042K49888A02674B3529J16897M8869n669h5564
15232B06360J92544A06937k7369C6996a3518A36427a7127n0823E4707K9855L18000
$$ y = [14722, 141130, 26828, -362287, 291956, 203800, -57628, -253402, 66082, 17491, -90176, 121423, 159681, -230312, 74995, -197507, 169939, 65950, 144394, -167855, 111639, -108784, 253482, 92202, -17498, 111500, 117633, 93008, -8242, 92966, -70129, -3126, -117092, -28577, 291670, -84665, -35637, 382854, 49402, 127299, -120959, -407539, 331434, 132369, 286227, 89457, 55094, -27650, -168392, 10481, -102911, -306176, 128199, 11900, 336134, 158732, 330684, -54256, 8668, 130361, -2570, 211893, 382726, 776607, 1571344, 2281341, 1782186, 1915812, 1527455, 131042, 380930, 102674, 23529, 140426, 189295, 183626, -85564, 206360, 398904, 106937, 79568, 36996, -13518, 136427, -17127, -67950, 54707, 84562, 402562]
15221D02562j84299J42883b64988C402N5101b09851c7269A57600J8174h6676r0543
15210a77219A55584b54189c9768A33487J80828D1427J42073e9944C07338o3706
15200B43632D3634a65831p663B85525c36326A1563b86195d9301j31767E6054J29735
15189A85789a77015B58077a85438g0316j48388Q4630B92288H9831m779l6983R3010
15178A41079e2881B77259O6909J54134A67285k6363a190A06271K10238C1838M14712
15167D46550k15294J37581g7213I76N4580L64047A43228a39687c6047D32902E86
15155C01883r3029D1995g2732A30023k5390I175e0637j2040A08933J4560J71746
15144B95239q4693a56041A08240P371J7623K13669a57497B49585f7958B46767
$$ y = [402562, 218263, 361146, -264988, 3402, 58503, -209851, -37269, 157600, 175774, -86676, -177219, 155584, -254189, -39768, 133487, 314315, 41427, 183500, -59944, 307338, 243632, 43634, -165831, -173494, 285525, -336326, 11563, -286195, -49301, -181068, 56054, 185789, -177015, 258077, -185438, -70316, -218704, -134074, 292288, 89831, 85052, 48069, 141079, -52881, 277259, 344168, 498302, 167285, 140922, -1190, 106271, 316509, 31838, 446550, 231256, 368837, -77213, 976, 55556, 419603, 143228, -139687, -36047, 432902, 586, 301883, 208854, 41995, -72732, 130023, 104633, 9175, -50637, -62677, 108933, 123493, 295239, 210546, -156041, 108240, 115611, 133234, 346903, -157497, 249585, -67958, 246767]
15133A88784L47609A70158E3432P6381L06733l0900p5639F0384k2529G135L8488
15122D5623b336A44102g8605D22810G5527O5732F0483B6134J71699c8640A17766
15110i236J778o6344H3520C2165L7163R1194n3298C8645a6032E7950B4307d1012
15097a15735G069a081H718J47977a27496C49367A49661J0894m2852b63872A76288
15085c6204I9096f5636L0893C62443m4645a88867A94782n7609e0184B74304h5170
15073B41889F3700R944h1330A69186Q913J2383k5891n4675N6409J50178K11429
15062E27932A07273b6697B81689D1183K08439l924o9933N5748b3526I2852K42344
15051C35196D5575a02977C10731F3472a14028C026Q3353N8624L4342J36416B0242
$$ y = [188784, 536393, 170158, 53432, 129813, 436546, 405646, 330007, 60384, 37855, 7135, 45623, -2336, 144102, -78605, 422810, 75527, 141259, 60483, 26134, 197833, -38640, 117766, -9236, -7458, -73802, 83520, 32165, 69328, 160522, 107224, 38645, -16032, 57950, 24307, -41012, -115735, 7069, -1081, 8718, 156695, -127496, 349367, 149661, 160555, 117703, -263872, 176288, -36204, 99096, -65636, -34743, 362443, 317798, -188867, 194782, 137173, -50184, 274304, -85170, 241889, 63700, 73644, -81330, 169186, 178099, 190482, 164591, 109916, 166325, 316503, 527932, 107273, -26697, 281689, 41183, 249622, 245698, 175765, 231513, -23526, 92852, 335196, 45575, -102977, 310731, 63472, -114028, 3026, 86379, 145003, 179345, 315761, 20242]
15039e5039B27467b3123A41701J05113K28736r9543A52244J72061b16598A56438
15028C19672j56091C1318n345J21090J62585g4562E6317K13394B016K55611R7060
15017C54687j76743H1353J12224l3885o4495K05650R058Q384o4183i4593D16720
15005A16685M61002A38976b601m0156D01816j79773h9748B93800A36071D2010
14994E0766k1974R5608J86705K63778j39943j63073O9390A31600O6090J22022
14984C19712C3756K49216k5252A02697l3221K32252a03879C00508p3415N2384
14974B79477J7231A48285a93330A14402K33190C3113J13516M33m4578K81514c4969
14962C37251F3212a00004C11511L72216A28094K54772j73561K0985L59242B27067
$$ y = [-55039, 227467, -23123, 141701, 246814, 475550, 376007, 152244, 324305, -216598, 156438, 319672, 163581, 31318, 25973, 147063, 309648, -74562, 56317, 269711, 2016, 257627, 354687, 177944, 81353, 193577, 159692, 95197, 300847, 309905, 318289, 254106, -94593, 416720, 116685, 577687, 138976, -2601, -42757, 401816, 222043, -89748, 293800, 136071, 42010, 50766, 28792, 124400, 311105, 574883, 434940, 271867, 341257, 131600, 197690, 319712, 33756, 282972, 257720, 102697, 69476, 301728, -103879, 300508, 227093, 279477, 296708, 148285, -193330, 114402, 347592, 33113, 146629, 147062, 102484, 383998, -34969, 337251, 63212, -100004, 311511, 683727, 128094, 382866, 209305, 230290, 589532, 227067]
14951D47562k14219C1243k698a5862C55232j0700A10920J86408L476A17408h1439
14939B29032b1827A86943F1234L55836r4235h9597l883A49593M52287B15547n8258
14928A57289K44607A32988N4398K29763B3798K73392n3528K55989A37056L37426
14918D74482k8062J94724A52250Q2660J76796j54866n5233r6663K36305j45780
14908A95469K34731j06125N0222m8113k2573J53292q0908A01476k6821L74554
14898D49209A20583O9171J56352j662o5447M2915A08029m123K07722D4315K89331
14887C33646J95325F1247K17785R9750K7918j22000m2991J5693r934K43405K2204
14876E13077j28899K43271k91639K93788I0458J75K98861G8502J57897g9076A94071
$$ y = [447562, 233343, 31243, 28545, -15862, 355232, 344532, 110920, 297328, 300804, 117408, -81439, 229032, -21827, 186943, 61234, 417070, 322835, -89597, -93480, 149593, 601880, 215547, 157289, 401896, 132988, 187386, 417149, 23798, 297190, 243662, 499651, 137056, 474482, 446420, 641144, 152250, 234910, 411706, 256840, 201607, 104944, 341249, 195469, 430200, 324075, 374297, 326184, 303611, 456903, 375995, 101476, 74655, 449209, 120583, 189754, 346106, 344444, 278997, 321912, 108029, 103906, 311628, 44315, 333646, 528971, 61247, 279032, 378782, 406700, 284700, 241709, 257402, 247468, 490873, 513077, 384178, 627449, 335810, 629598, 90458, 90633, 389494, 78502, 236399, -79076, 194071]
14864i18A23193L61364k10669N00297B34399j06954J83950A49146K89640q0245
14854C58541K54954A34669M32395B27309B2211K81582L8028L93823C02344J90100
14844D92444L0954o5617A34337l6884K33131q3347K44109k33706J03789L05244
14834F66673A58785J5113M40399B75060J79018j11636j50104J97704j01686J1388
14824B99744J24531M5107K51248j56594J15667C37400j32479M40991j33151L5686
14814E48447M5348k88388M09337k58717K06142A91210J07696K67988j94954L12068
14804F84008k28677K49873k68834N8728L6221j7473j28522k3233K28811L13561
14794I04463m48285K59767C32630L4709K40285J91524l65518K40715j75027K244
$$ y = [-918, 123193, 484557, 273888, 774185, 234399, 127445, 311395, 149146, 438786, 358541, 613495, 134669, 567064, 227309, 22211, 303793, 341821, 735644, 302344, 492444, 523398, 457781, 134337, 97453, 330584, 247237, 491346, 257640, 361429, 666673, 158785, 173898, 614297, 275060, 454078, 342442, 192338, 390042, 288356, 299744, 424275, 469382, 720630, 564036, 679703, 337400, 204921, 645912, 512761, 548447, 593795, 305407, 714744, 456027, 662169, 191210, 298906, 566894, 371940, 684008, 455331, 705204, 436370, 495098, 531319, 513846, 385324, 362091, 590902, 904463, 456178, 715945, 332630, 367339, 607624, 799148, 433630, 674345, 499318, 501562]
14784E01562q2105j5633L24767j99005j31851M5690J0684J50704j31813l5528
14774D37472j53664J22446L0968K01193k5559j0709k09365m8965M425J80432J40468
14763F69142n4136q9232j97158K32490p0438M9171J03096q4533m8394M9278J67639
14752G26925k31198J32618B53803N7169M68829C81754r1441K78179L2326M9960
14742F50778m019J71882k40390q630q6980M13692l17370P1591J05399j72535p5778
14731E07640j251n4785M6408P4083l3720K56378l682k41800n9708p6951O00011
14720A012623k56305L9890L9147l24436J76440K19408k80507O35808n53381k8129
14710F80558K3724M86361C63436L94003J81582J195k29385p1374k29957N45410
$$ y = [501562, 419457, 403824, 728591, 529586, 397735, 443425, 454109, 604813, 473000, 437472, 283808, 406254, 437222, 638415, 612856, 602147, 392782, 343817, 348242, 528674, 669142, 615006, 525774, 328616, 561106, 490668, 539839, 642935, 558402, 510008, 559286, 726925, 495727, 628345, 253803, 310972, 779801, 381754, 290313, 568492, 600818, 650778, 646759, 818641, 578251, 569621, 482641, 896333, 578963, 650554, 755953, 583418, 507640, 506389, 451604, 498012, 572095, 538375, 794753, 791071, 549271, 489563, 412612, 1012623, 756318, 796208, 835355, 510919, 687359, 906767, 626260, 1262068, 708687, 680558, 704282, 1190643, 363436, 757439, 939021, 940216, 710831, 639457, 409500, 954910]
14700I54910m67108L91895L334l9387R1978O8373j14845K35189q5889l5410k13062
14689G89978q9338L64731k02295k10162J95766N5620n4173j51528O08502m48964
14679H58137K07606l07695J22474K05694j02818kR6415l32853K70012j53588J62226
14668A025608k3024P9060p8660j76087K68416j63706M23429n17892k723K8057
14658H62478j68088N94472j67148n2596k57400J68357P6081j5367k11232K59915
14648A089472o5705M046j26262K44807J0997j08096J37981p6041k11620L98367
14638A297946L75889o56772L17829m3974j94039M5442k7113L74365M9494k06987
14628A332080j40048J74557K09389l82978J98260j65623K46717l5321r8294k99839
$$ y = [954910, 487802, 879697, 883031, 843644, 935622, 1003995, 889150, 1124339, 1038450, 1003040, 789978, 700640, 1065371, 863076, 652914, 848680, 904300, 850127, 698599, 1307101, 858137, 1065743, 758048, 880522, 1086216, 983398, 983396, 1079811, 746958, 1016970, 863382, 1025608, 1002584, 1081644, 1002984, 826897, 1095313, 931607, 1355036, 837144, 834421, 862478, 694390, 1288862, 1121714, 1069118, 811718, 980075, 1056156, 1040789, 829557, 1089472, 1023767, 1027813, 901551, 1146358, 1157355, 1049259, 1187240, 1111199, 899579, 1297946, 1673835, 1017063, 1334892, 1290918, 1096879, 1142321, 1115208, 1489573, 1539067, 1332080, 1192032, 1366589, 1575978, 1193000, 1391260, 1225637, 1472354, 1437033, 1338739, 1038900]
14618A038900R7260j16216J83210n4031o3302J89927K92919j37160R7227R2377
14608A621111j00261k59234L14093k14339j54136L05698J16244k95574q1134K57899
14598A510367K38885j98288P2677l5323k47071J31735M24540m98358J26289J86185
14588A711638Q6191m75110J20043M03495l60413K20377r6829L11976k02332J0856
14578A729892J86985J54270j88790J68078k24431K17743q3576J13443j03257k79553
14568A690804P22614l58735J52934o312j89725M9695P90102j32632k63074J66521
14558B622192Q4987L9422L03275k91342O65233K76316M46607P04108P22392K205893
14548G779083L822002P971218J3423381L443401j6354446r617487l456705r4097
$$ y = [1038900, 1136160, 1019944, 1203154, 1149123, 1085821, 1275748, 1568667, 1431507, 1528734, 1621111, 1520850, 1261616, 1575709, 1361370, 1207234, 1512932, 1629176, 1333602, 1252468, 1510367, 1749252, 1550964, 1623641, 1588318, 1341247, 1472982, 1897522, 1399164, 1525453, 1711638, 1797829, 1322719, 1442762, 1846257, 1485844, 1706221, 1609392, 1921368, 1719036, 1729892, 1916877, 2071147, 1882357, 2050435, 1826004, 2043747, 1960171, 2073614, 1970357, 1690804, 2413418, 2054683, 2207617, 2201305, 2011580, 2061275, 2851377, 2718745, 2455671, 2622192, 2707179, 2746601, 3049876, 2758534, 3423767, 3700083, 4146690, 4850798, 5573190, 7779083, 11601085, 19572303, 32995684, 36439085, 20084639, 10467152, 7010447, 6916350]
14540F916350k325618j248480j247000k40089J24050J76547K11594l27171n45785
14531A494398K81432P95160o53211K69867P793O4893J24040R2132m88410M58771
14521B446865J3380j05496j02193K01950k3512J10943J78971q1612R843K93662
14511B942801j78650l40435K38954j34358M28929q9605J11822m65216J86579J96445
14501B897266r9535R6350j30013L55305k108k63416J2109K30622K35787K07421
14491C539788k48590k65787M00036J34889l31234l23799Q27134o70152Q02116
14482C864401m68483J90556L5043j08985K22201J95220k72769K74331Q7958j29688
14472C889785j77542K33071M94472m57143L11062N6315j02241m3994m1928L27595
$$ y = [6916350, 4590732, 3342252, 2095252, 1855163, 1979213, 2155760, 2367354, 2040183, 1494398, 1775830, 2570990, 1917779, 2187646, 2195439, 2260332, 2384372, 2476504, 1988094, 2446865, 2460245, 2354749, 2252556, 2454506, 2430994, 2541937, 2720908, 2639296, 2649139, 2942801, 2764151, 2423716, 2662670, 2528312, 2957241, 2867636, 2979458, 2514242, 2700821, 2897266, 2797731, 2894081, 2764068, 3119373, 3117265, 2853849, 2865958, 3096580, 3332367, 3539788, 3291198, 3025411, 3425447, 3560336, 3229102, 2905303, 3732437, 3062285, 3864401, 3395918, 3586474, 3621517, 3512532, 3734733, 3929953, 3657184, 3931515, 4019473, 3889785, 3712243, 3945314, 4439786, 3982643, 4293705, 4350020, 4247779, 4203785, 4161857, 4489452]
14462D489452j26129p275J735L90879j34412K37649L4973j19841J02007K1614
14452D890652L96045k78405M284J57010l08794L06227K28821r667j7580K12617
14442E581210m7008J18208j19359l3013O7641J98273L70101L4547k16924M99620
14432F453296n06430J23671K61250N30172n98582O85631N6130l36442K52517R2728
14422G013941K11992O9752K55090J99692m0511K23422n5526L72884r4054R8408
14412H255090L42113K1681k30774L53063J91631k7114M44161k25121K40237N0664
14402I415631K22035L94381q7286J31074J28394M17250m0536L24241J84868k8922
14392A1061130O00729j5826K87381l46967N17548K69137K74099K52227P6364K51595
$$ y = [4489452, 4363323, 4356048, 4357783, 4748662, 4614250, 4851899, 4886872, 4767031, 4869038, 4890652, 5286697, 5008292, 5012576, 5169586, 4860792, 5167019, 5395840, 5386173, 5368593, 5581210, 5534202, 5652410, 5533051, 5500038, 5567679, 5765952, 6136053, 6170600, 5953676, 6453296, 5946866, 6070537, 6331787, 6861959, 6263377, 6949008, 7005138, 6668696, 6921213, 7013941, 7225933, 7295685, 7550775, 7750467, 7709956, 7933378, 7877852, 8250736, 8156682, 8255090, 8597203, 8618884, 8388110, 8741173, 8932804, 8905690, 9349851, 9124730, 9364967, 9415631, 9637666, 10032047, 9944761, 10075835, 10204229, 10621479, 10580943, 10905184, 11090052, 11061130, 11661859, 11646033, 11933414, 11586447, 12103995, 12373132, 12647231, 12899458, 12975822, 13227417]
14382A3227417L84855K53332K57890K0983J50625N44853K38192K83135L71627
14373A5732909Q1245M28611N77562l823M74579K38819Q68803k70308O33810K43935
14363A9006142L86244M79203L80018N32805L42886R73891k96348R41870J71724
14354B2918435O58683R94615N69245M48360L98230O09750P42379M61527J182983
14345B8984207N07954Q12457O87904P80171R93525P06855R90469R60115J072197
14336C6495854J170036J027442Q41275J409860Q95016J984768R46780J290653
14328D6061684J257920J834980J773080J569017J543855K097321J486320K051174
14320E9675351K081059K337578K324905K530517K284021K720825K905984K881614
$$ y = [13227417, 13612272, 13865604, 14123494, 14144477, 14295102, 14839955, 15078147, 15361282, 15732909, 15814154, 16242765, 16820327, 16816504, 17291083, 17529902, 18398705, 18128397, 18762207, 19006142, 19392386, 19871589, 20251607, 20784412, 21127298, 22101189, 21804841, 22746711, 22918435, 23577118, 24571733, 25140978, 25589338, 25987568, 26597318, 27339697, 27801224, 28984207, 29492161, 30304618, 30992522, 31772693, 32766218, 33473073, 34463542, 35423657, 36495854, 37665890, 38693332, 39534607, 40944467, 41839483, 43824251, 44771031, 46061684, 47319604, 49154584, 50927664, 52496681, 54040536, 56137857, 57624177, 59675351, 61756410, 64093988, 66418893, 68949410, 71233431, 73954256, 76860240, 79741854]
14312G9741854L157745L165729L498358L673299L687740M128233M220661M489470
14304A09763089M928608N300184N175384N641942O033401O530623O621445P191386
14296A57186062P575045P796063Q493238Q638709R579569R485496J0182096J0700358
14288B29636636J1442218J1503009J2198591J2541638J2612060J3447072J2390422
14281C15771646J3498572J2994235J2699342J2268959J1833677J0823129R756494
14274C99646054P892441M299451K371661O68557P95413j95700j813485j785317
14266D11879075k843106n593028q176570r554963j0766170j2321246j2908502
14259C49715490j3638792j3718743j3779445j3379623j3894202j3221823j2756444
$$ y = [79741854, 82899599, 86065328, 89563686, 93236985, 96924725, 101052958, 105273619, 109763089, 114691697, 119991881, 125167265, 130809207, 136842608, 143373231, 149994676, 157186062, 164761107, 172557170, 181050408, 189689117, 199268686, 208754182, 218936278, 229636636, 241078854, 252581863, 264780454, 277322092, 289934152, 303381224, 315771646, 329270218, 342264453, 354963795, 367232754, 379066431, 389889560, 399646054, 407538495, 411837946, 414209607, 414878164, 415673577, 415477877, 413664392, 411879075, 409035969, 403442941, 395266371, 385711408, 374945238, 362623992, 349715490, 336076698, 322357955, 308578510, 295198887, 281304685, 268082862, 255326418]
14252B55326418j1564948j0411532j1489747j0461364j0503610r640996r218901
14245A82035320q373868q085325p717600p352542o923971o412400o403917n269136
14237A25496561n208788n443785m905320m814321m279179l828310l710419l489134
14229H9817305l915403l392153l075213k814069k998887k944607k534369k291906
14221F5850698k142903j959669k402043k193622j587934j884316j494964j616100
14213E0569147j244167j660969j720823q67483j552215j430908n02583j172807
14205D0417192j160021j636437q32743q59880j074888o84569j108100n32953r78670
14196C1548931j006553n58602p05029r34713k47822q00037p69743r58038p68238
$$ y = [255326418, 243761470, 233349938, 221860191, 211398827, 200895217, 191254221, 182035320, 173661452, 165576127, 157858527, 150505985, 143582014, 137169614, 130765697, 125496561, 120287773, 114843988, 109938668, 105124347, 100845168, 97016858, 93306439, 89817305, 85901902, 82509749, 79434536, 76620467, 73621580, 70676973, 68142604, 65850698, 63707795, 61748126, 59346083, 57152461, 55564527, 53680211, 52185247, 50569147, 49324980, 47664011, 45943188, 45075705, 43523490, 42092582, 41589999, 40417192, 39257171, 37620734, 36787991, 35928111, 34853223, 34168654, 33060554, 32527601, 31548931, 30542378, 29983776, 29278747, 28344034, 28096212, 27296175, 26526432, 25568394, 24800156]
14187B4800156p2464n08742p27124J9376r08162p09421m01961o99550k24309l91472
14177B0176327k13291o51884m31404o19330K12768p53820l17040m7905m91040
14168A6863381p8692o67440j25706m19857j25522l95336O1958n38910k10567o15051
14158A3748258Q6849k08040m86579J84301o03407k21067M4949o00984K54096j26583
14148A2071793l05552l68847k37958R3527m43545l75422o8651J88982j33205j08018
14138A0313104n33582m81209L96347j36640m73143K32003K3193l34839L6357k88459
14128H753132l8233p5683j86657j61254o1672n2306j24481N7588l21386N7822
14118G846870j19131j67328k48757J60802j32064m46871o3974J05991l04105K96686
$$ y = [24800156, 24727692, 24218950, 23491826, 23511202, 22603040, 21893619, 21491658, 20792108, 20567799, 20176327, 19963036, 19311152, 18879748, 18260418, 18473186, 17719366, 17402326, 17354421, 16863381, 16784689, 16117249, 15991543, 15571686, 15446164, 15050828, 15112786, 14573876, 14363309, 13748258, 13835107, 13627067, 13140488, 13324789, 12721382, 12500315, 12545264, 11944280, 12198376, 12071793, 11766241, 11397394, 11159436, 11252963, 10809418, 10433996, 10365345, 10554327, 10421122, 10313104, 9779522, 9298313, 9694660, 9558020, 9084877, 9316880, 9340073, 9005234, 9041591, 8753132, 8714899, 8639216, 8452559, 8291305, 8229633, 8177327, 8052846, 8110434, 7789048, 7846870, 7727739, 7560411, 7311654, 7472456, 7340392, 6893521, 6829547, 6935538, 6631433, 6928119]
14108F928119k87145j8296m54996L18427m0313r3677j60453J01845n40198K57329
14098F010642j76360j6721k34372J12010J75050k12545n80418K98141J99223k26319
14088E348331j10625J55620k75379O5296l409k49569q4762L0861l12496M0254
14078D604122K3246K4838k44078j45985N75604o64902J45148J50141k04451k5379
14068D238304K23168K20433l55321l21807J17410k79909K558K18427l15288J71929
14058C919904J28508n1085j03452R9635k41403j83998R5612o2772J20415n26813
14048C194551M13710k01371J1923k59456J58112L45418k85703j64710J60697k19045
14038C154126K61453l72852j8668K68073l81890K34059O2966n7112m884n7795
$$ y = [6928119, 6640974, 6622678, 6167682, 6486109, 6445796, 6352119, 6191666, 6293511, 5753313, 6010642, 5834282, 5817561, 5583189, 5695199, 5870249, 5657704, 5077286, 5375427, 5574650, 5348331, 5237706, 5393326, 5117947, 5183243, 5179834, 4930265, 4845503, 4876364, 4563868, 4604122, 4627368, 4652206, 4408128, 4262143, 4837747, 4172845, 4317993, 4468134, 4263683, 4238304, 4461472, 4681905, 4326584, 4004777, 4122187, 3842278, 3844836, 4063263, 3747975, 3919904, 4048412, 3997327, 3893875, 3993510, 3752107, 3568109, 3663721, 3600949, 3721364, 3194551, 3608261, 3406890, 3418813, 3159357, 3317469, 3662887, 3377184, 3212474, 3373171, 3154126, 3415579, 3042727, 3024059, 3292132, 2910242, 3144301, 3207267, 3150155, 3145271, 3087476]
14028C087476J15919m43222M52880l54799m28187K97931L7923m12887m8276J98614
14018B503372K4248L62890j91299m22864L7933K35380l8658j98365K9671J04926
14008B447234j8201o4878q8472L21618m58694M6145Q2625j55274N934K7450q4922
13997B060565o8142L96923j22356j32405M51J81123M80605R9070J187241L048216
13987G131291O443517J4573798J0044843j2966341j0707039n515254k940300j019044
13979E045471j042615j86770m03225j33137l55981n6084k0204j11701l28049R4843
13969B502548j08072J05572J33257O9104m14920J64357m51970Q0065K16848k60586
13959B036203J45817l51363N68896l75590k90254L25739J80036n66467M27640
$$ y = [3087476, 3203395, 2760173, 3213053, 2858254, 2430067, 2727998, 2765921, 2353034, 2304758, 2503372, 2527620, 2890510, 2699211, 2276347, 2314280, 2549660, 2511002, 2312637, 2342308, 2447234, 2429033, 2364155, 2275683, 2597301, 2138607, 2184752, 2267377, 2112103, 2118037, 2145487, 2060565, 1992423, 2389346, 2266990, 2134585, 2135036, 2316159, 2796764, 2895834, 4083075, 7131291, 13574808, 28148606, 38193449, 25227108, 14520069, 9004815, 6064515, 5045471, 4002856, 3816086, 3412861, 3279724, 2923743, 2867659, 2847455, 2735754, 2407705, 2502548, 2394476, 2500048, 2633305, 2702409, 2287489, 2451846, 1999876, 2079941, 2296789, 2036203, 2182020, 1830657, 2399553, 2023963, 1733709, 2059448, 2239484, 1673017, 2100657]
13950B100657M960l35151k0352J12383j553J31514m12906m6784L65853P5849j68251
13939A806219O61k52739L56423l48882P9461L22680k05610O868K6707k87246J49716
13928A654258j30302Q3894q8553m1013K89205k34094j69519J53519l8876o4694
13918A413825J69079l4357j33245k18871K97515L0191K45808n26114P9331K33600
13908A556762k53877q3389L95216n4277j11134k9029j9988k07879O0296o5092
13898A187609K58780k93460q3319K29048j78582j80413J42353K67090k52490K49705
13888A346321j13737p5481K65042k46667l4359R2340K60207l92959P7486m9246
13878A128947L03190l30798N0898K03103n28888L37346k28785L69340K855l05456
$$ y = [2100657, 2105617, 1770466, 1750114, 1862497, 1860944, 1992458, 1579552, 1532768, 1898621, 1974470, 1806219, 1806880, 1554141, 1910564, 1561682, 1641143, 1963823, 1758213, 1765081, 1791788, 1504542, 1654258, 1523956, 1607850, 1519297, 1478284, 1767489, 1533395, 1363876, 1517395, 1478519, 1413825, 1582904, 1548547, 1415302, 1196431, 1493946, 1524137, 1769945, 1243831, 1323162, 1556762, 1302885, 1219496, 1614712, 1560435, 1449301, 1420272, 1400284, 1192405, 1252701, 1187609, 1446389, 1152929, 1069610, 1298658, 1120076, 939663, 1082016, 1349106, 1096616, 1346321, 1232584, 1157103, 1422145, 1175478, 1141119, 1233459, 1493666, 1100707, 1178193, 1128947, 1432137, 1101339, 1152237, 1355340, 826452, 1163798, 935013, 1304353, 1307208, 1001752]
13868A001752J54540J85356l43878J4099L33593j86400j25013m8116R3338K61480
13858A340751j42736k5427j33042j97655K38019k18098K95202j19284k30119M34207
13848A241818j85965o7771j91513K78566Q9621l01422q897K30866J18785k76884
13838I27204R9659l67771L03073l06737L67013J62567l29440l5697j26735K46353
13828I39489j46528L27088l11845K23267K15430l99041J80721p0673k93912j60513
13818E03483L75651k95112L92864J6469p0181l51417L20989k05551J76725j27907
13808G36013L96488l73675K05876o489j95617O9787r5424k8872J31946l4981k7169
13797G77883j69747J87688J1607q6305K30774l45835n4595R0519j79225L06205
$$ y = [1001752, 1156292, 1341648, 997770, 1011869, 1345462, 1159062, 1034049, 985933, 1079271, 1340751, 1198015, 1172588, 1039546, 841891, 1079910, 861812, 1157014, 1037730, 807611, 1241818, 1055853, 988082, 796569, 1075135, 1164756, 863334, 854437, 1085303, 1204088, 927204, 1026863, 659092, 962165, 655428, 1022441, 1185008, 855568, 819871, 693136, 939489, 792961, 1120049, 808204, 1031471, 1246901, 847860, 1028581, 957908, 663996, 503483, 879134, 584022, 976886, 993355, 923174, 571757, 892746, 687195, 863920, 736013, 1132501, 758826, 964702, 958213, 762596, 832383, 736959, 708087, 840033, 805052, 777883, 608136, 795824, 807431, 721126, 951900, 606065, 551470, 641989, 462764, 768969]
13787G68969P5952k43364l3520K80501j50654J47319l07736K1122J8918P6356
13777F53863N2123L93781l19354O3045k70224M90676l43682J02198j14160l53670
13767C54596P32632m64182j42843M57657k10335o3080J6636K03597m25594Q7378
13757E46462K39814m6187j2046j0267M6119J04716j06679L7002C96068j0474K17509
13746F03103J06981m5873k86255K51130r4088K7825L46363l71949K58828j32181
13736F63884j71446M578j27838M29200k09795J57343j55336j71935K38777k59463
13726C97969J52392j66897L4194J68383k09758J33071J68743J5813k80689K16133
13716F29354Q3783l24332L87216l1962p0989j4744R1971H6437P28014C43916M26889
$$ y = [768969, 844921, 601557, 568037, 848538, 697884, 845203, 537467, 558589, 577507, 653863, 705986, 1099767, 780413, 843458, 573234, 1063910, 720228, 822426, 708266, 354596, 1087228, 623046, 480203, 937860, 727525, 664445, 681081, 884678, 459084, 546462, 786276, 740089, 728043, 717776, 763895, 868611, 761932, 798934, 396068, 385594, 603103, 710084, 664211, 377956, 629086, 534998, 562823, 909186, 537237, 796065, 663884, 492438, 497016, 369178, 798378, 588583, 745926, 590590, 418655, 657432, 397969, 550361, 383464, 417658, 586041, 376283, 509354, 678097, 693910, 413221, 629354, 713137, 388805, 776021, 744059, 673070, 658326, 750297, 86437, 814451, 343916, 770805]
13705G70805q5668J49277C06312K96780j38374j30505K53144J64198p8255m6654
13695F26646n9238K6904A51578K66994J33094K16953j63418j96542r678M54095
13685H53076m11216J67187L19830D47413J65163q6381O607j31263J72441B42426
13674D98433o8163J79399B89831L16285L8282N2925C15588J42114R6681m3620
13664E10763k26666J10063J02438o1286J55879k1580j90121N7128o3361K33278
13654F06535B73823K77654m5343J2207k24434L39175j68573q1248L92281C60748
13643C43889Q5084j75422K83661k14914p5202L08473j86135J2916l8720K02394
13633E46024j24548J01907j26839j56418K7192l8426A01395K25326L53527C09985
$$ y = [770805, 685137, 834414, 306312, 603092, 464718, 334213, 587357, 751555, 673300, 626646, 567408, 594312, 151578, 418572, 551666, 768619, 605201, 408659, 398981, 853076, 441860, 609047, 928877, 447413, 612576, 526195, 532802, 401539, 573980, 242426, 498433, 430270, 609669, 289831, 606116, 644398, 697323, 315588, 457702, 554383, 510763, 284097, 394160, 496598, 435312, 591191, 569611, 379490, 436618, 373257, 606535, 273823, 551477, 506134, 518341, 293907, 633082, 464509, 383261, 775542, 360748, 343889, 428973, 253551, 537212, 322298, 247096, 555569, 369434, 382350, 343630, 546024, 421476, 523383, 396544, 240126, 267318, 228892, 101395, 326721, 680248, 309985]
13622E58482j11834j086o2072J47236k50739o8392K43048o4930k2855j77363J33088
13611C22583K00507E6801J15712K97534n0625J66779k4377M8199B58716K16532
13601D75248B21234q0738M00937D0266L01759r7573L61997j51814A18227K78590
13591C96817r5561r4903o787J48673J2606J52309H0109J64521r5495j2412J63341
13580C00064P3685A79407L90447k07935j01602K7565O0969j17241L09938k39385
13570C02163K24617J6325i0451F00561A71093K62944J33766A57225J55241l096
13560C09370m9824J55608M5128b9762E12240j95531H3449M45611E2435J46235
13550A98670n2457J41185l6760J46633j26731J74377K69382A79826B7561M68146
$$ y = [558482, 446648, 445562, 383490, 530726, 279987, 211595, 454643, 389713, 366858, 189495, 322583, 523090, 56801, 172513, 470047, 419422, 586201, 561824, 610023, 258716, 475248, 221234, 140496, 541433, 40266, 342025, 244452, 606449, 454635, 118227, 396817, 301256, 206353, 199566, 348239, 360845, 513154, 80109, 244630, 149135, 136723, 300064, 373749, 179407, 569854, 361919, 260317, 287882, 348851, 231610, 541548, 302163, 526780, 543105, -90451, 600561, 171093, 434037, 567803, 157225, 312466, 309370, 259546, 415154, 460282, -29762, 512240, 316709, 83449, 529060, 52435, 198670, 146213, 287398, 250638, 397271, 270540, 444917, 714299, 179826, 27561, 495707]
13540D95707k6843A94244J54228l135R2624k09718L76474B74500I610J06107N7533
13529A73250K97524r1400I6850K01407K05783j99107q6439q4880N38612B57577
13518C0678K18795a85642B82947J87969A57081L00169A94396L21994F7184L07864
13508C75048o5999p158K25207k60282L51708B21239J6600O5188K64294k44731
13498C22590K85714a13377C83644K88447B10951M8616I0998K67823J58088B35969
13487D52976A67556q0696L46976j69251J08774N5251J31239n8767r2376A37265
13476f7981E72665A54320B6344L59307j60884Q1424K3671A60824K79583j98263
13466B42144J32843A80122F6169K36581Q2344A23456J44919j06795p5240L15647
$$ y = [495707, 468864, 194244, 348472, 345337, 437961, 228243, 604717, 274500, 9610, 115717, 173250, 470774, 379374, 96850, 298257, 504040, 304933, 218494, 133614, 672226, 257577, 30678, 249473, -185642, 282947, 470916, 157081, 457250, 194396, 516390, 67184, 375048, 309049, 301891, 527098, 266816, 618524, 221239, 237839, 303027, 567321, 322590, 608304, -113377, 383644, 672091, 210951, 259567, 90998, 358821, 516909, 235969, 452976, 167556, 86860, 433836, 264585, 373359, 428610, 559849, 501082, 408706, 137265, -67981, 572665, 154320, 26344, 385651, 224767, 306191, 329862, 160824, 440407, 242144, 374987, 180122, 66169, 302750, 385094, 123456, 268375, 161580, 86340, 401987]
13456D01987o0701M0768A85847O9690m645f9950A82135C8139J99575J30367m16
13445C67665j79534J75064l5408j05181J27420A68775J05352c9495E61446j03123
13435D58323j81950A25521J71432B6396K44849k263J31992j64079K66405k45757
13425B57543j4382P4293d0221A32611O03435A3482K41468j10872K87957k07646
13415B24389a50076C05375n8013K31662B01953n0746b3246C85621A71766J54152
13405C25918m1570a69041B9885K20722k588k7679K39849K70300B94027a7719B84201
13393A05863P8370K31523R1752g9006H6618j8467L51574A24914N6121M9378I1721
13381F6464c41732A94793D4564J41963H8063O4627Q5728e033E02212j68836I3912
$$ y = [401987, 341286, 382054, 185847, 255537, 250892, -69950, 182135, 38139, 237714, 368081, 367665, 188131, 363195, 327787, 222606, 350026, 168775, 274127, -39495, 561446, 458323, 276373, 125521, 296953, 26396, 271245, 268982, 400974, 236895, 503300, 257543, 243161, 317454, -40221, 132611, 736046, 13482, 254950, 144078, 432035, 224389, -150076, 305375, 247362, 479024, 201953, 151207, -23246, 385621, 171766, 325918, 284348, -169041, 29885, 250607, 248019, 220340, 460189, 730489, 294027, -17719, 284201, 105863, 184233, 415756, 507508, -79006, 86618, 68151, 419725, 124914, 181035, 230413, 91721, 66464, -341732, 194793, 44564, 186527, 88063, 152690, 238418, -5033, 502212, 333376, 93912]
13369b14218C11939L80023C23025A46011N5637P2701j21198E4897J35154a82094
13358A68174d571A01155L70646A40613o85J06481J13019A33747J09450j14174
13348A29023L58540A11511L6360L40592K6605k19885l662J33507n9465j53369
13338B12194D8606J91745j01448J70753P7381k2757m8061j06670M6595G0591g8123
13326E43707A04635J90907A12574B3341J93939j6834L3835J46176N0544p6394
13316C54607k0442p1042k2434a01493B55129B5350a65890B27582l83g461B13401
13304D25132A82556H7069K40958a59932A22015D9378k1452h911C19929j31115
13294A88814c06032B02548b852A95170K34804B14183p951J05921K42869A70405
$$ y = [-214218, 311939, 691962, 323025, 146011, 201648, 274349, 153151, 54897, 190051, -182094, 168174, -4571, 101155, 471801, 140613, 139928, 246409, 359428, 133747, 243197, 129023, 487563, 111511, 147871, 488463, 515068, 295183, 291521, 425028, 365563, 212194, 48606, 240351, 138903, 309656, 387037, 364280, 316219, 209549, 256144, 70591, -78123, 543707, 104635, 295542, 112574, 23341, 217280, 200446, 234281, 380457, 431001, 354607, 334165, 263123, 240689, -101493, 255129, 25350, -165890, 227582, 227199, -7461, 213401, 425132, 182556, 87069, 328027, -159932, 122015, 49378, 27926, -8911, 319929, 188814, -306032, 202548, -2852, 195170, 429974, 214183, 206232, 312153, 555022, 170405]
13283A02265o442O6650K42112A65311F7700K96001C7127L81311A09247e3434j86963
13272b40397C3820a68620E30415F0772K92910J04924b4673E5832L05062c5987
13261e0403G5152M22836A99695C6315K81085b32275A07718k0526h3576b6402G2501
13249A2568Q5221R2541A9955J72320r29O3411a41483C16332l7186n1447I0788
13237a81358A33170J06027E9362K51448A10199n0330L5780j8951c6461j5379A42200
13225I1070J99045a49716I0762J293J47911r3181d4135B69303j22055b2899A33537
13213A38888A7456d956C52573j14324D250K38904A05672a06658B76071M0777b41433
13201B42753K3299D0451O1919b55247d6290A063Q0192J10863m2642l1762K09972
$$ y = [102265, 95823, 162473, 404585, 165311, 67700, 363701, 37127, 418438, 109247, -53434, -240397, 33820, -168620, 530415, 60772, 353682, 458606, -24673, 55832, 360894, -35987, -50403, 75152, 497988, 199695, 36315, 317400, -232275, 107718, 87192, -83576, -26402, 72501, 12568, 97789, 190330, 19955, 192275, 191346, 254757, -141483, 316332, 279146, 227699, 90788, -181358, 133170, 239197, 59362, 310810, 110199, 59869, 95649, 76698, -36461, -51840, 142200, 91070, 290115, -149716, 90762, 92055, 239966, 146785, -44135, 269303, 147248, -22899, 133537, 138888, 17456, -4956, 352573, 238249, 4250, 243154, 105672, -106658, 276071, 316848, -241433, 242753, 266052, 40451, 102370, -255247, -46290, 1063, 81255, 192118, 149476, 117714, 327686]
13190C27686E2890p895N186a84474A72810K336M7645r2945O5431m2381c5910A44730
13177b570A22619M4706D8142a25063A34585g5087B40314j10599a82657B34127
13166f7189A06960M825Q2456b892j09377p3484D16520G3724d3347D4915L19334
13155C64249A27734J3445J34957b8888k33056D15089j26103f4287B14817e338
13144B3764J74267I1324D0350h3188C34918n4594j25198F4938K25903e3429C11435
13132E4548i5606A81268R824a81171A52482R6703p0235F0283O097e2958o3382
13121a16340C42735A18357D7946M7489J19785F5572a23540A55473F4166b64203
13110A02549d7689A99177M5946b41329d8009A11791B7213g1215C02903a02045
$$ y = [327686, 52890, 44995, 50181, -184474, 172810, 175146, 222791, 129846, 195277, 152896, -35910, 144730, -2570, 122619, 167325, 48142, -125063, 134585, -75087, 240314, 129715, -182657, 234127, -67189, 106960, 111785, 194241, -2892, -112269, -185753, 416520, 73724, -43347, 44915, 364249, 127734, 141179, 276136, -28888, -261944, 415089, 288986, -64287, 214817, -5338, 23764, 198031, 91324, 40350, -83188, 334918, 280324, 155126, 64938, 290841, -53429, 311435, 54548, -95606, 181268, 191092, -181171, 152482, 249185, 178950, 60283, 66380, -52958, -116340, 342735, 118357, 47946, 95435, 215220, 65572, -123540, 155473, 64166, -264203, 102549, -47689, 199177, 245123, -241329, -48009, 111791, 27213, -71215, 302903, -102045]
13099A58875K56611b25263O9726C89961A78091i5281h092F2926J32524K30652
13089D26102B05079H8294a54730a0911A9167f9364I1346L7830M220n5825J77383
13078B54954J66572A40992a49456B04391K3567c2354l620j61394B35955a2495
13067B67882A23315i4572K7824o357C4527L36646E6336a50807k60282a92855d6592
13055B824K23830m2355j3199P3050a00523C06133R5794b67777B00808G0624J93295
13044B63919b1225j27658A03104l9797R3522J39178a72253A928N4760J99826a15337
13032b45281A22932D9159K02593B0087a05179k11342B66437o1563J35003a74305
13021C69367l6111j07746E2250d2861j25435M3002E2176K44338a15971A71467
$$ y = [158875, 415486, -225263, -155537, 389961, 178091, -95281, -8092, 62926, 195450, 426102, 205079, 88294, -154730, -10911, 19167, -69364, 91346, 129176, 133396, 77571, 254954, 421526, 140992, -149456, 204391, 227958, -32354, -35974, -197368, 235955, -12495, 267882, 123315, -94572, -66748, -73105, 34527, 371173, 56336, -150807, -411089, -192855, -46592, 2824, 226654, 184299, 171100, 244150, -100523, 306133, 401927, -267777, 200808, 70624, 263919, -21225, -148883, 103104, 63307, 156829, 296007, -172253, 1928, 56688, 256514, -115337, -245281, 122932, 49159, 251752, 20087, -105179, -316521, 266437, 204874, 339877, -174305, 369367, 333256, 225510, 52250, -42861, -168296, -125294, 52176, 296514, -115971, 171467]
13010a8470r2696A39539o9337b3243A61589h8938C54723A21267Q2715k8263h0322
12998I1602l798P395j6496K7032G64M9720J92935D0043k040K26091b76137A82128
12985a4674A5054b09945E0326K10277P4159C2341c5924G099a72738I5345C0519
12973h1695H7442M6195h4979A06279J32636c6009C19051E8389B8534O7641c69691
12961A61297A8270J63478K20729a75826M8977b6717A9498c4334l156A13248a39409
12949A72704D37e212A48215a4059o1874A90066p8872K55502j58005p2414J71401
12938C07678G6850J74457G1280L3456e7933B89669f6010E5894b18838I8179r489
12927H8690C5936j1210a57012K5501A26843K16622F226J29143h3119I3062o640
$$ y = [-18470, -111166, 139539, 70202, -23243, 161589, -88938, 354723, 121267, 203982, 175719, -80322, 91602, 87804, 95199, 78703, 105735, 764, 50484, 243419, 40043, 38003, 264094, -276137, 182128, -14674, 15054, -209945, 50326, 260603, 334762, 32341, -35924, 7099, -172738, 95345, 30519, -81695, 87442, 133637, -84979, 106279, 238915, -36009, 319051, 58389, 28534, 96175, -369691, 161297, 18270, 181748, 402477, -175826, -126849, -26717, 19498, -34334, -37490, 113248, -139409, 172704, 437, -5212, 148215, -14059, -75933, 190066, 111194, 366696, 208691, 136277, 307678, 76850, 251307, 71280, 104736, -57933, 289669, -66010, 55894, -218838, 98179, 88690, 35936, 24726, -157012, -131511, 126843, 343465, 6226, 135369, -83119, 93062, 86422]
12916H6422O1843b736j5348j45615A4203c1518k75297J17237h2426L3317B10028
12904A25394c0762I7590N7732a77521B54221r9254b0179m1433A02191a55594E7031
12892a56499b9829A39326C0107J49405p2174a8594B48288C605a41891o6794A05413
12880e7820Q426j1065A26466j3849E0128J47118O6756d7801j25984M4045A39356
12868A12608a6792l5504n4275l2392k08010e9405A10424J20599k1754k9223b0276
12856d6093a5718A16116k3440i2385A81685G5992J45804A0107b89025A66946n2360
12845A14586L16720G9692P4643j2559E3791J8769J68320q7644a87206K4978a6666
12833A04957i5186k26906O8419A84805J40637E4803k6763J08102b50923A05765
$$ y = [86422, 148265, -2736, -18084, -163699, 14203, -31518, -306815, -189578, -82426, -49109, 210028, 125394, -30762, 97590, 155322, -177521, 254221, 154967, -20179, -61612, 102191, -155594, 57031, -156499, -29829, 139326, 30107, 179512, 107338, -18594, 248288, 3605, -141891, -208685, 105413, -57820, -49394, -60459, 126466, 112617, 50128, 197246, 264002, -47801, -173785, -129740, 139356, 112608, -16792, -52296, -106571, -138963, -346973, -59405, 110424, 231023, 209269, 180046, -20276, -46093, -15718, 116116, 92676, -92385, 181685, 75992, 221796, 10107, -289025, 166946, 114586, 431306, 79692, 154335, 141776, 53791, 72560, 240880, 153236, -187206, -162228, -16666, 104957, -95186, -322092, -253673, 184805, 325442, 54803, 28040, 136142, -250923, 105765]
12822b01705N7350B53141E5888a3951A72620K9507G0217K49853a7550G7775g3382
12810G2174G316a81688A84292b61458A9539c05693B08790E1977J21456O8528I5664
12798a91135C5127N6875j7142q28k2522a45497D65884B7879b62725O9156l3961
12787b27530C03149a17687A22709n3135b81138d5435B48178C6532a01091A9116
12776C3472a1111l4601A58011m0398K0131n9893L00426A19424b0854H9273J34400
12765B23673a49162c5370j08227C390K04885b13959i3676I3616R1364b90713M3475
12754b47238E5116i5213b922l7449A20010a51778C1328J2948J34649j6446m9165
12743A13314P0441a07645C3091R9047a8346l4066A78666a93430C90059j41611
$$ y = [-201705, -144355, 253141, 55888, -13951, 172620, 202127, 70217, 320070, -17550, 77775, -73382, 72174, 7316, -181688, 184292, -261458, 19539, -305693, 208790, 51977, 173433, 241961, 95664, -191135, 35127, 92002, 74860, 74032, 51510, -145497, 465884, 27879, -262725, -193569, -227530, 303149, -117687, 122709, 69574, -281138, -45435, 248178, 36532, -101091, 19116, 33472, -11111, -45712, 158011, 117613, 137744, 77851, 378277, 119424, -20854, 89273, 223673, -149162, -35370, -143597, 3390, 208275, -213959, -93676, 93616, 184980, -290713, -247238, 55116, -95213, -2922, -40371, 120010, -151778, 31328, 44276, 178925, 162479, 113314, 183755, -107645, 33091, 132138, -18346, -52412, 178666, -193430, 390059, 248448]
12733B48448b5907B6971J63730P6677J29131a55332f6140j15868C18989d33946
12722D7885a6169r388k43455B69644m690h6235B26808H7577H166j796a6548k14692
12710b31240J11370A04255K41117A41938r372k9401a26517C57646B3303b25216
12699H7209C7330J0743a27821B0740J7462J39406J04295a75885B26697F7691e1604
12687G2820J8060L8652a35607B4132J79754q0654a31388N2042A0984J36906b35156
12675a2802H3432K48612a80133f0097A31475k9828c9386A71915p8035K14471j39355
12664A68996r753e0079K4827h080C20544m879a8182A8543K42913a21064A03848
12652F2219M3124g8661H1008K40601e9315E3244g1042l49232B34227a42674C45438
$$ y = [248448, -25907, 26971, 190701, 267378, 396509, -155332, -66140, -182008, 318989, -433946, 47885, -16169, -25557, -269012, 269644, 264954, -86235, 226808, 87577, 8166, 6370, -16548, -231240, -119870, 104255, 345372, 141938, 132566, 103165, -126517, 357646, 23303, -225216, 87209, 37330, 48073, -127821, 20740, 38202, 177608, 281903, -175885, 226697, 67691, -51604, 72820, 90880, 129532, -135607, 24132, 203886, 123232, -131388, -79346, 10984, 147890, -235156, -12802, 83432, 332044, -180133, -60097, 131475, 101647, -39386, 171915, 93880, 308351, 168996, 159243, -50079, -25252, -8080, 320544, 315665, -18182, 18543, 261456, -121064, 103848, 62219, 105343, -78661, 81008, 321609, -59315, 53244, -71042, -420274, 234227, -142674, 345438]
12640e9354M402A65646M5506G580K74277C1458Q8991N1418J33479a28826B22653
12628A7772J33639J93503J14760A31059J89175n2462A20186N25250b0240I2215
12617A95221K36336b58A86326p4363b5280A85346A9375a02424G3745J33660c57
12605G988a30321C875i2290B34164J05475b53185C15229b40951A57940a5608A80294
12593f7778A17472g4930A45362K1476j547e5856C39665j49834a97354A6600M1942
12582E8542a45804j08097I0131D1192i2573B37347F1898g3702I016K88380j32744
12571A64652g900j5537E1303M7282K99875a29612A15949M4756l6102l1109D624
12559E4423i680j72684k28038e4298n9045I9016P9281m6240m9568K05798F0120
$$ y = [-59354, -54952, 165646, 211152, 7580, 281857, 31458, 120449, 171867, 305346, -128826, 222653, 17772, 151411, 344914, 459674, 131059, 320234, 267772, 120186, 645436, -20240, 92215, 195221, 431557, -258, 186326, 111963, -25280, 185346, 19375, -102424, 73745, 207405, -357, 7988, -130321, 3875, -92290, 234164, 339639, -253185, 315229, -240951, 157940, -15608, 180294, -67778, 117472, -74930, 145362, 166838, 165291, -55856, 339665, 189831, -197354, 16600, 58542, -145804, -253901, 90131, 41192, -92573, 237347, 61898, -73702, 9016, 297396, 164652, -7900, -23437, 51303, 98585, 398460, -129612, 115949, 160705, 124603, 93494, 4624, 54423, -9680, -182364, -410402, -54298, -113343, 99016, 178297, 132057, 82489, 288287, 60120]
12547c59277a09924D84i2497M0883G1905a08615A98687J37369a36915B8997J38921
12536A67918n435B7759K7860J4708J13345I0609D13f1459I6872c32295A09614
12524d7433K3360k3907I906a13574c5962j57672A54783a12443d5339J1696A44466
12512h2309a2455R2I9263P0305a14109D2691K5590a5508A18387j7219J1019b4271
12499d9370B37153j00265o958E2680R8801K01294b2746k07907a07680M4449H7301
12487G4438a20498a3727J553j09783C80207H2249m0514a8850o2754J0387A85652
12475A29436b27423r3908J55088D25779G3397M5452J1314a48344d8244E7586R636
12464F7222d6745K2129j50943F9614J01345a52916d6580C950K85576b5291j83895
$$ y = [-359277, -109924, 484, -92497, -51614, 71905, -108615, 198687, 336056, -136915, 28997, 167918, 162483, 27759, 55619, 70327, 183672, 90609, 413, -61459, 96872, -332295, 109614, -47433, -24073, -47980, 9906, -113574, -35962, -193634, 154783, -112443, -45339, -33643, 144466, -82309, -12455, -12363, 99263, 169568, -114109, 42691, 68281, -15508, 118387, 101168, 112187, -24271, -49370, 237153, 136888, 129930, 52680, 151481, 352775, -22746, -230653, -107680, -63231, 87301, 74438, -120498, -13727, -12174, -121957, 380207, 82249, 41735, -18850, -81604, -71217, 185652, 129436, -227423, -321331, -166243, 425779, 73397, 118849, 130163, -148344, -48244, 57586, 67222, -46745, -24616, -175559, 69614, 170959, -152916, -46580, 3950, 289526, -25291, -209186]
12453b09186B73036A11340a2969A08262b14380M75d1111D927c4807A22407a90754
12441e1245A65502c9731A18726a210B808J59186c7672A06804J16523j5734b05064
12429b41961D7345L31699a7562A68517a47511k16741I7219a54767A5838e05243
12418c2831j30826B87656c8849k81364i3693K4511j74305N1531J7036b7136j42549
12407a69685F8642O8677b58075C31158c34126B86365A37367F8534O1208n7017
12397G2725a43111A12361b3541j77226j11993f5523b4850m4705J9968o6059h056
12385e4067J9758j87278a4818l1099B29627a22560H1400a47265n4289D777c1895
12373b9441j69907i6851M4872A76866C4853K83846k1213A9192a67780k67853i1549
$$ y = [-209186, 273036, 111340, -12969, 108262, -214380, -213905, -41111, 4927, -34807, 122407, -190754, -51245, 165502, -39731, 118726, -1210, 2808, 161994, -37672, 106804, 223327, 207593, -205064, -241961, 47345, 379044, -17562, 168517, -147511, -364252, 97219, -154767, 15838, -505243, -32831, -163657, 287656, -38849, -320213, -93693, -69182, -243487, -191956, -174920, -27136, -169685, 68642, 137319, -258075, 331158, -334126, 286365, 137367, 68534, 129742, 72725, -143111, 112361, -23541, -200767, -312760, -65523, -24850, -69555, -49587, -115646, -8056, -54067, -34309, -221587, -14818, -45917, 229627, -122560, 81400, -147265, -201554, 4777, -31895, -29441, -199348, -96851, -51979, 176866, 34853, 318699, 297486, 19192, -167780, -435633, -91549]
12361g9606B20029a38379G1542R9416b65152Q5424N3976r1649A01368J17056a41702
12349b20383k6303A60598e5488O205C00258a46741j22466C33766a76592A15986
12338C47726G6821a10224B5995K50883A10468L2889c0275n4568I7040C9828o684
12327C3144i5181B03027n3580l1534a61413D0176a67138A96121i4137I6825a10629
12315E07494A18730D7728a27662B90984A01174K16034A50002N8249H2970n542
12305G7428J26091m2547b1407j02246o7162r0110f2023j63211O8742P423C2870
12293A63197J33515G8026MK76095A40378C2344a51169f860E2228a26591K8854
12282i7737g456j46343I8568O9727J36301a04321B17984a14678C26090g5244k0285
$$ y = [-79606, 220029, -138379, 71542, 170958, -265152, -179728, -125752, -217401, 101368, 218424, -141702, -220383, -246686, 160598, -55488, -49283, 300258, -146741, -269207, 333766, -176592, 115986, 347726, 76821, -110224, 25995, 276878, 110468, 143357, -30275, -84843, 97040, 39828, 33144, -95181, 203027, 149447, 117913, -161413, 40176, -167138, 196121, -94137, 96825, -110629, 507494, 118730, 47728, -127662, 290984, 101174, 317208, 150002, 208251, 82970, 77428, 203519, 160972, -21407, -123653, -190815, -280925, -62023, -225234, -156492, -149069, 32870, 163197, 296712, 78026, 78030, 354125, 140378, 32344, -151169, -6860, 52228, -126591, -97737, -7456, -153799, 98568, 168295, 304596, -104321, 217984, -114678, 326090, -75244, -95529]
12271i5529l0856B24644A09247a43720B33147E9090b35760a08770A49629l7705
12261A11924B5508J63945L688p9100e8910k49668a5834B63062p8807J30560a42773
12249B9027b97287B15936d8586A32142a04576J2878A20666K73871A3271c0950
12238a4900B03564b4815G7373c4086A32309E9756b70781i815j46982r6141B32435
12226a07279E28194d4310E29849B2969Q112a02595C46323A02430l58Q8273J71493
12215C61838A72169G0056J80208F6893J75948A08971O9279b50631P7508A33255
12204d8922I6990J85127I4362M1075C7209A6378M4247F186M76684A55588p0450
12193H5138o607K22796I4537P3223F6408b96C22807r2691J64506b7440A56150
$$ y = [-95529, -126385, 224644, 109247, -143720, 233147, 59090, -235760, -108770, 149629, 111924, 25508, 189453, 193141, 114041, -58910, -308578, -15834, 263062, 184255, 314815, -142773, 29027, -297287, 215936, -48586, 132142, -104576, -91698, 120666, 394537, 13271, -30950, -14900, 203564, -24815, 77373, -34086, 132309, 59756, -270781, -9815, -156797, -252938, 232435, -107279, 528194, -44310, 529849, 22969, 31081, -102595, 346323, 102430, 102072, 190345, 361838, 172169, 70056, 250264, 66893, 242841, 108971, 178250, -250631, -173123, 133255, -48922, 96990, 282117, 94362, 135437, 37209, 16378, 60625, 6186, 482870, 155588, 85138, 78531, 301327, 94537, 167760, 66408, -296, 322807, 230116, 394622, -27440, 156150]
12181G2006a00338H2593J77235b08347B45156b85605C22599b05722B78597I7599
12170C05929j6815H9217a68002E3173O960j4073K3199A531d4905a436A4652n154
12158I498Q4361d0545m25A30337L7843K83092J06880A93147m8811g3483A06533
12146h285q3507I7899g3212L4771C1868J19059k2278J2391c40934B07665Q936
12135B16601J36374b54694H573K76426G8532i8920A28248a14483p4562Q4045k2685
12124a27685A78718b67142C9191d0715a2424A41904A4848R8691J4659Q0178r9157
12113A09219b11708D21925A76311K28986c8501j73204a1283k34170g8624A02325
12102A86911J14551K7560a37758B92915C0793K55206a65469A56376a69614C44408
$$ y = [72006, -100338, 82593, 259828, -208347, 245156, -285605, 322599, -205722, 278597, 97599, 305929, 289114, 89217, -168002, 53173, 60133, 46060, 69259, 1531, -44905, -1436, 14652, 9498, 93859, -40545, -40970, 130337, 168180, 451272, 558152, 193147, 144336, -73483, 106533, -8285, -91792, 97899, -73212, -38441, 31868, 150927, 128649, 141040, -340934, 207665, 216601, 352975, -254694, 8573, 284999, 78532, -98920, 128248, -114483, -189045, -105000, -127685, 178718, -267142, 39191, -40715, -12424, 141904, 14848, 113539, 128198, 208376, 109219, -211708, 421925, 176311, 405297, -38501, -211705, -11283, -245453, -78624, 102325, 186911, 301462, 329022, -137758, 292915, 30793, 285999, -165469, 156376, -169614, 344408]
12091H2839a51689M6245L9458j17473A8178M86266a5691F2187J01783C3937o383
12080B7554a23278B4907a64120c5859B9799J32807j3447k1793e1602A24634b48929
12068A02534A8394b09882A5302e5760j94143a916C04223C4823a75649e8812B59691
12056B52770P8542K22258O66614C81980j73194H5347L0793b84720A07839b78138
12045b15423A905a46462D670b11115j54802J40935a02145j51015a25603j05057
12035b30660M7249l4587g2612L4988D1379g9404j41937A52988O3084g2063k8287
12024a00350B01849a71752B28741E1979Q837a4634j18251j15448A28569J42258
12014B70827G7220e0759g139H4442a64690c800j84425b6357k60221a29976p8974
$$ y = [82839, -151689, -105444, -65986, -183459, 18178, 504444, -15691, 62187, 163970, 33937, 27554, -123278, 24907, -164120, -35859, 29799, 162606, 149159, 127366, -51602, 124634, -248929, 102534, 18394, -209882, 15302, -55760, -249903, -1916, 304223, 34823, -175649, -58812, 259691, 252770, 331312, 553570, 1220184, 381980, 208786, 85347, 116140, -284720, 107839, -278138, -215423, 1905, -146462, 4670, -211115, -365917, -224982, -102145, -253160, -125603, -230660, -183411, -217998, -72612, -37624, 41379, -79404, -221341, 152988, 216072, -72063, -100350, 201849, -171752, 228741, 51979, 60816, -14634, -132885, -248333, 128569, 270827, 77220, -50759, -7139, 84442, -164690, -3800, -188225, -26357, -286578, -129976, -208950]
12003b08950A72356B4817Q2712b53873J8694d2306C951K41910c28607a15662a5713
11991c4867H9840l4010b7277E9654D687i2759m0656E0113O1981a5569B78093E8503
11978A16401e9048l7312c1825l1133p2550k17940e1254A07218a35336D9500B1668
11966c97537J62145A24507a34790C8285p146a23779A66831R8806a50650g0714
11955f4839n0665A6543J0508b3741m5710B96612F1049K7003e7763F0908d8184
11943B38101C483L9299J62a53655a7518r5279G4297b98751g5742A38188h2842
11931b13567L8502g8996A17592L8900B3539g314k11816L7773c908A5910a38487
11919B1206M0257Q3318C8621J7429J73216a46401A31007r130J3134E6907a13885
$$ y = [-208950, 172356, 24817, 107529, -253873, -235179, -42306, 3951, 245861, -328607, -115662, -15713, -34867, 89840, 55830, -27277, 59654, 4687, -92759, -133415, 50113, 112094, -15569, 278093, 58503, 116401, -59048, -96360, -31825, -62958, -135508, -353448, -51254, 107218, -135336, 49500, 21668, -397537, -235392, 124507, -134790, 38285, 31139, -123779, 166831, 265637, -150650, -70714, -64839, -115504, 16543, 27051, -23741, -69451, 296612, 61049, 88052, -57763, 60908, -48184, 238101, 3483, 42782, 42944, -153655, -17518, -112797, 74297, -298751, -75742, 138188, -82842, -213567, -175065, -78996, 117592, 156492, 23539, -7314, -219130, -181357, -3908, 15910, -138487, 21206, 61463, 144781, 38621, 56050, 229266, -146401, 131007, 121877, 135011, 56907, -113885]
11907A00117j8540f875p7294j869o9940H6119l3888a13004A56308c6624j45618
11896a82242g1185A5215J23990C37J9998a8402B6888R2397e3166A14282l3592
11885H0690d0126a2414A23909n6427M8094J72305j03977c34809C34336a13850
11874G2746b32175A38808A909J29399d22281B03673a2021m1169j6726D6436J8138
11863F4574c87223A36264D1186g2174g194E3632b14477j03875G3060K8973D6341
11851d9782A5567a86637q5063A721e9353A25055a11052D9481J50921j4064c6910
11839a90313A00710a52480A18721b06592f0589E0800j2272b62349N5533K3552
11829a83264J1834B27495a45582F0980C965Q6996a6880A10095l427A2276O280
$$ y = [100117, 81577, -6875, -84169, -86038, -155978, 86119, 52231, -113004, 156308, -36624, -182242, -71185, 15215, 139205, 337, 20335, -18402, 26888, 119285, -53166, 114282, 80690, -40126, -12414, 123909, 67482, 115576, 287881, 183904, -334809, 334336, -113850, 72746, -232175, 138808, 1909, 131308, -422281, 203673, -12021, -53190, -69916, 46436, 64574, -387223, 136264, 41186, -72174, -7194, 53632, -214477, -318352, 73060, 102033, 46341, -49782, 15567, -186637, -271700, 1721, -59353, 125055, -111052, 49481, 200402, 186338, -36910, -190313, 100710, -152480, 118721, -206592, -60589, 50800, 38528, -262349, -206816, -183264, -171430, 227495, -145582, 60980, 3965, 90961, -16880, 110095, 106668, 12276, 18556]
11818A8556b09566g1345A52473f8184o2055d2174l44724a29050q1933k63674a73760
11806A45703A1479a3146C9223h0017A48686c51658J48170A03810c43404J64936
11796a78468E2885a19373B49362G454K7840b3790R576A81368l6935a52647A78089
11784a01988n1751P5704k58848a53883A68440L6659h1212C11470c2917A75703
11773C0077N9148b81636a34647N9222a1734j45320B18154b9109r1401R599g242
11761c3696k2701r0084B18482G1374K12090b42462O4077F2483a94171B6955a43256
11749B11714b35416f1634B321c1916j41715g6896A70052a1787A62288g5959m5906
11738a21865l8624B14360m1124q0288f5537i637C2027J82842j01503A8071a90422
$$ y = [18556, -209566, -71345, 152473, -68184, -130239, -42174, -386898, -129050, -210983, -474657, -173760, 145703, 11479, -13146, 39223, -80017, 148686, -351658, -203488, 103810, -343404, -178468, 52885, -119373, 249362, 7454, 35294, -23790, -14214, 181368, 144433, -152647, 178089, -101988, -153739, -78035, -336883, -153883, 168440, 205099, -81212, 311470, -32917, 175703, 30077, 89225, -281636, -134647, -75425, -11734, -157054, 218154, -29109, -120510, -110911, -7242, -33696, -56397, -146481, 218482, 71374, 283464, -242462, -178385, 62483, -194171, 26955, -143256, 211714, -235416, -61634, 2321, -31916, -173631, -76896, 170052, -11787, 162288, -75959, -121865, -160489, 214360, 173236, 92948, -65537, -9637, 32027, 214869, 113366, 18071, -190422]
11726a94405B40280a50338A37101e9155k08364e309B06027E7111B2807a23687
11715c6797j48151g3620j40486m5956G3698a31985B4952J74358p8520c83724A33702
11703a26674j57361C6202K64303b24530C2267j0779d9162B84942b03408i793b432
11691a46851K7899q8366f3263A6896K19506a97133g4288I8487J12957b37503A53821
11679E9111B0701a27897A41174o5280K7881b76479e70k85560F8543d2659q128
11668e0787H2768E085b45697f2269B7911a09710e1147A37061d2921F2863a15488
11656D7099b08963C38498A4181a02742M6113r7231k47073K7165g2107K9335C3329
11644A28438m8841a36145E7066B5074N1595Q9197b00915c2427L935R808A0358
$$ y = [-194405, 240280, -150338, 137101, -59155, -267519, -5309, 206027, 57111, 22807, -123687, -36797, -184948, -73620, -214106, -260062, 73698, -131985, 24952, 199310, 120790, -383724, 133702, -126674, -284035, 36202, 300505, -224530, 32267, 21488, -49162, 284942, -203408, -9793, -2432, -146851, -118952, -207318, -63263, 16896, 236402, -197133, -74288, 98487, 211444, -237503, 153821, 59111, 20701, -127897, 141174, 75894, 103775, -276479, -570, -286130, 68543, -42659, -50787, 82768, 5085, -245697, -62269, 27911, -109710, -51147, 137061, -42921, 62863, -115488, 47099, -208963, 338498, 14181, -102742, -56629, -153860, -400933, -373768, -72107, -42772, 33329, 128438, 79597, -136145, 57066, 25074, 76669, 165866, -200915, -32427, -28492, -18684, 10358]
11632a87890d1270r7561F0317K8885b23733h1749F7277b28515F7887B5976c9726
11620A40277J6555e9559J8078k0546A02447A6447E873P4079a37037f5614A48047
11608A78313n7074m030a53113A4525K23774r1856n1453J38308C7692L0762B4162
11596H5416b08696L8747b1039j91424L0877P8444M3695R212I03R0724b14404A32837
11583a07466J1941A15320a44088A16829D5221i2110J1339M0254E5709m629b63967
11571h7088A92509n3170D4031J40958a29221G7450L1928Q37a10602A82525p6293
11560A06232h2733C5177c11569A17667Q3325m2025M7120J57815D7963j8525a41012
11548A23955h8049q7129j8741L0052A99057e2276j99527L430c8068n9239p6696
$$ y = [-187890, -41270, -138831, 60317, 89202, -223733, -81749, 67277, -228515, 67887, 25976, -39726, 140277, 156832, -59559, -41481, -62027, 102447, 16447, 5873, 79952, -137037, -65614, 148047, 178313, 121239, 117209, -153113, 14525, 238299, 146443, 94990, 233298, 37692, 68454, 24162, 85416, -208696, -169949, -21039, -212463, -181586, -103142, -59447, -50235, 903, 91627, -214404, 132837, -107466, -95525, 115320, -144088, 116829, 45221, -92110, -80771, -40517, 55709, 51080, -263967, -87088, 192509, 139339, 44031, 184989, -129221, 77450, 109378, 110215, -110602, 182525, 106232, -82733, 35177, -311569, 117667, 200992, 158967, 206087, 363902, 47963, 29438, -141012, 123955, -88049, -175178, -193919, -163867, 199057, -52276, -251803, -248373, -38068, -97307, -174003]
11537a74003M9189c7514l1686C05197p6550b17017O0975D6390i8106B73174G7730
11525g1470j38660A91791m5305d7377A15982g6362E5700q313a07675A91222b0811
11513b9097A09725a03397C31625F7043h89A00118a7684m1314A58788K04628A31127
11501B89051b48162D3297k0951M88K90908b20211F5248N1458n7164a09869A20478
11489g6032o2374q671B04966j9649n8915f2766B68727d7025B4259P0483O0264
11478A55006M0269n8158b78976A68413B2128K39244j19889e0022j06812e3601
11467B11869j0845d1498C1986J34014K94821a23432B87074A06271C5836a25836
11456H730K22976G4088a41413C49710A23340h0606G9712J48216r4332E8332J11926
$$ y = [-174003, -124814, -37514, -69200, 305197, 228647, -217017, -156042, 46390, -98106, 273174, 77730, -71470, -210130, 191791, 146486, -47377, 115982, -76362, 55700, 47387, -107675, 191222, -20811, -29097, 109725, -103397, 331625, 67043, -889, 100118, -17684, -58998, 158788, 363416, 131127, 289051, -248162, 43297, 22346, 22834, 313742, -220211, 65248, 116706, 59542, -109869, 120478, -76032, -138406, -147077, 204966, 185317, 126402, -62766, 268727, -47025, 24259, 94742, 155006, 195275, 137117, -278976, 168413, 22128, 261372, 141483, -50022, -156834, -53601, 211869, 201024, -41498, 31986, 166000, 460821, -123432, 287074, 106271, 35836, -125836, 8730, 231706, 74088, -141413, 349710, 123340, -80606, 79712, 227928, 133596, 58332, 170258]
11445A70258R0531J00715I5086h885B31771g6515K7190B72871K2238a83904B49528
11433A42537L3600b35547B2844J36163g0562n2897A94070H2921J66091a34556
11422b2643r4386C42763A56005c6019A9508J98112H4054a49894A36733d19186
11411I9900J16250A028g8939I2503N9410e2996k20298f7451p6620B67210a37867
11399f0775C99710A59870a02201A53766a05732G708b51243E0142L63476A04836
11388A11871a1826n69914D7241P1088P4289a3777p9297j35175k1615F6902R4132
11377A61034F5892B3336K072J2580j3923c18734A86916F5905J55604C8520O6870
11366A05390i2971m0506O0502C0246J23555o6931e5641a5768j07508M7531b2689
$$ y = [170258, 260789, 361504, 95086, -8885, 231771, -76515, -49325, 272871, 295109, -183904, 249528, 142537, 176137, -235547, 22844, 159007, -70562, -123459, 194070, 82921, 249012, -134556, -22643, -117029, 342763, 156005, -36019, 19508, 217620, 84054, -149894, 136733, -419186, 99900, 216150, 1028, -78939, 92503, 151913, -52996, -273294, -67451, -144071, 267210, -137867, -60775, 399710, 159870, -102201, 153766, -105732, 7708, -251243, 50142, 413618, 104836, 111871, -11826, -581740, 47241, 118329, 192618, -13777, -93074, -228249, -249864, 66902, 161034, 65892, 23336, 25408, 37988, 24065, -318734, 186916, 65905, 221509, 38520, 105390, -92971, -133477, -72975, 30246, 153801, 86870, -55641, -15768, -123276, -75745, -22689]
11354a06379D90096a26568L353M0164A69416b56253a1130c344B03989f1113B74924
11342B96969b56200I1641a38072a0231F3954M63298e0261k56731h4551A03853
11331c26269E5853L2563l0109a18875C01379a18693J5059j31977A3668J9457d86315
11319E0428c0323j47469j7486A04867a86547d3973k6091j53813b0357H1017a34356
11307c14415O2838a18863B01232a24642D43384c7214n4371k26873B88239A25629
11296A73257a28788d9328o3010a6797k39993J27656A48983n986B8139a87100b4385
11284B27745G2134a5674p7753A10631C2271b92099J1499c3820k15352n19A13163
11272A7394J0730e1272l23026F9937O5688b12243A12435h2617e27o5870I9953
$$ y = [-106379, 490096, -126568, -123215, -83051, 169416, -256253, -11130, -3344, 203989, -61113, 274924, 296969, -256200, 91641, -138072, -10231, 63954, 527252, -50261, -306992, -84551, 103853, -326269, 55853, 88416, 58307, -118875, 301379, -118693, -103634, -235611, 13668, 33125, -486315, 50428, -30323, -177792, -195278, 104867, -186547, -43973, -70064, -223877, -20357, 81017, -134356, -314415, -251577, -118863, 201232, -124642, 443384, -37214, -91585, -318458, 288239, 125629, 173257, -128788, -49328, -112338, -16797, -256790, -129134, 148983, 142997, 28139, -187100, -24385, 227745, 72134, -15674, -93427, 110631, 32271, -292099, -280600, -33820, -249172, -249691, 113163, 17394, 28124, -51272, -374298, 69937, 135625, -212243, 112435, -82617, -527, -66397, 99953]
11260H3782h0527A49769c33918A36853c254C25491G0290b35010d8338E1301R4755
11249A46056a90064B39495a1839G2459J34153a58606j85449i9363j13277b2210
11238a6107G6483a55954M6397j10215G2343O3447b72911H7250j8359A6071c3684
11226e1955j97759O0261F6929R9143p817c64053M8292b7664A99470r5766N5545
11215A59249a02518B77496G0580a14596K72B16132k6024K98976a10510A92230
11204c33757j0607a65973m19B3785J65157b73924d031k20785M8320e0562E1897
11192b17631B08M050L6457c3654A35866C6383K35351k460q2524p8902M6592E6728
11179F6018P6050o6831a8521l97653A2220a57671k93344a18185c7405B98831a7072
$$ y = [83782, -80527, 149769, -333918, 136853, -3254, 325491, 70290, -235010, -48338, 51301, 146056, -190064, 239495, -11839, 72459, 206612, -158606, -344055, -99363, -212640, -22210, -16107, 76483, -155954, -109557, -219772, 72343, 135790, -272911, 87250, 68891, 16071, -33684, -51955, -249714, -189453, 66929, 166072, 158255, -364053, -315761, -27664, 199470, 103704, 159249, -102518, 277496, 70580, -114596, -114324, 216132, 190108, 489084, -110510, 192230, -333757, -344364, -165973, -166392, 23785, 188942, -273924, -4031, -224816, -176496, -50562, 51897, -217631, 208, 4258, 40715, -33654, 135866, 36383, 271734, 269274, 186750, 107848, 154440, 56728, 66018, 142068, 75237, -18521, -416174, 12220, -157671, -451015, -118185, -37405, 298831, -17072]
11167A34467P6674F7455e442r7916n3939k22590J43290G0701h3291A46242f6101
11155B21178G5061c6345A20428K62530j07102a87932g3780A97866I3926c45258
11144A07695b36546j30244A13676C8321J03424K3765J25500C4555N6374q424j5750
11133F6755J14636b1072I7274N10335a94029P0525A74194B7399a21975C66215
11122A65338b7694B125K12539q8576e1615A05738l0657a69860H0381J24452k6813
11111A78020a77761A9060G740a20634E9819K20261F9830e4334C11531O4682d20415
11099B1866K46173j03634l2490i1527m43j1012C4492J97764F5411g6475C1179
11087A62644G6067h5348A72776J36459A6912D980K82742e5980B24949o5789J58364
$$ y = [134467, 211141, 67455, -5442, -103358, -157297, -379887, -236597, 70701, -83291, 146242, -66101, 221178, 75061, -36345, 120428, 382958, 275856, -187932, -73780, 197866, 93926, -345258, 107695, -236546, -366790, 113676, 38321, 141745, 165510, 291010, 34555, 90929, 82505, 66755, 181391, -21072, 97274, 607609, -194029, -123504, 174194, 27399, -121975, 366215, 165338, -27694, 2125, 214664, 126088, -51615, 105738, 75081, -169860, 80381, 204833, 178020, -177761, 19060, 7740, -120634, 59819, 280080, 69830, -54334, 311531, 376213, -420415, 21866, 268039, 164405, 131915, -91527, -91970, -102982, 34492, 232256, 65411, -76475, 31179, 162644, 76067, -85348, 172776, 309235, 16912, 4980, 287722, -55980, 224949, 159160, 317524]
11076C17524K46497B63013a02564F5253J19496D9969K90615o6979J02207K6857
11066D02669j78422K22777A94541E9617L7323L8295M11187j6138Q3593k17158
11056C96719j56161O40583C07723J60814R6751r7442j98980N14220J08184l51139
11046E40131j52650K94876J21985k45572l5331L31455k13867k45365N9516J71444
11036F26622j71575K6604L3931B13971N51624p9306O7348j10383j37262J34549
11026F40541l614o5297P2591J81732k57518o44A52958n2467M55138n5145J82560
11015F83044K90240C29202J12001p4448K47661j58027p5921j69235M66171r7279
11005E80125j72170L49008k67713K50238j58544K34164j7341j98203J8468B15559
$$ y = [317524, 564021, 263013, -102564, 65253, 184749, 49969, 340584, 273605, 375812, 402669, 224247, 447024, 194541, 59617, 96940, 135235, 546422, 530284, 613877, 396719, 240558, 881141, 307723, 468537, 565288, 467846, 268866, 783086, 891270, 540131, 387481, 682357, 804342, 558770, 523439, 854894, 641027, 395662, 455178, 626622, 455047, 481651, 515582, 213971, 765595, 686289, 753637, 643254, 505992, 640541, 636927, 571630, 644221, 825953, 568435, 567791, 152958, 100491, 555629, 500484, 683044, 973284, 329202, 441203, 366755, 614416, 456389, 380468, 211233, 677404, 580125, 407955, 756963, 489250, 739488, 580944, 815108, 797767, 599564, 618032, 215559]
10994E67509J82105C20820J88821K17308k50994K63018C51975L52604l01005N06558
10984I10132m06753K56186N1404l8536L92515j61901Q2171L30458L34699q9774
10974A660601O44875j57773K76559J56425N8720o09953j44255P7424l40241j83910
10964A438472N6263k15923k05446J45408j47998K29453o28390N13652k42387l39008
10954F04096J57657k02967m6165k35867J99187Q8090k41624n7961J90611j68281
10944B86776J04587r6949D203L080K48428J42305A84224n126j1765B0387J35418
10933A55805O4022b77303A2807P0011a16402A06820C340i3886j23733j25449c9170
10921c1171r171j2424j65812d4542l0729A38809h2136L6597n1456A27314e9839
$$ y = [567509, 749614, 320820, 509641, 726949, 475955, 738973, 351975, 704579, 403574, 910132, 503379, 759565, 810969, 772433, 1164948, 1003047, 1085218, 1415676, 1750375, 1660601, 2305476, 2147703, 2424262, 2580687, 2639407, 2029454, 1885199, 1962623, 1622382, 1438472, 1494735, 1278812, 1073366, 1218774, 1070776, 1300229, 671839, 1185491, 943104, 604096, 761753, 558786, 512621, 276754, 475941, 564031, 322407, 264446, 455057, 286776, 391363, 294414, 4203, 7283, 255711, 398016, 184224, 179098, 167333, 20387, 155805, 219827, -277303, 12807, 82818, -116402, 106820, 3340, -93886, -217619, -343068, -39170, -31171, -40342, -52766, -218578, -44542, -75271, 138809, -82136, -45539, -96995, 127314, -59839]
10909F5405J47863n9801p3305a4466C64901c8009f299A13039b96381e606A15666
10897e5958K1385k8295E2073e9472j27454g1682j14493B0946a09201p4413h8500
10885b044D5055J44629d19816e7340A13459a68585a8904D0202L9550a48698P1519
10874g7179n8222G5436d9869k9103l2815l5204E622N7285i3597p5421A84999J2599
10862A97598a7735r5154B22800d50313a67325j32393K9212A50435c08319B03578
10851d173j48647e6192B15861b5761B3159K26864b11883P750R5974H3749k5232
10840E8517J81188a18113k3942A46477a05211b4812B24505a66177A48751a80038
10829B9617c8464E7392J9420e681o3051j28343i6393m9100M2016F4448J6734e1517
$$ y = [65405, 213268, 153467, 80162, -14466, 364901, -38009, -6299, 113039, -296381, -5606, 115666, -55958, -34573, -62868, 52073, -59472, -186926, -71682, -186175, 20946, -109201, -183614, -88500, -2044, 45055, 189684, -419816, -57340, 113459, -168585, -18904, 40202, 79752, -148698, -77179, -135401, 75436, -49869, -78972, -111787, -146991, 5622, 62907, -93597, -169018, 184999, 197598, -17735, -112889, 222800, -450313, -167325, -299718, -270506, 150435, -308319, 203578, -4173, -152820, -56192, 215861, -25761, 23159, 250023, -211883, -204133, -108159, 83749, 58517, 239705, -118113, -142055, 146477, -105211, -24812, 224505, -166177, 148751, -180038, 29617, -38464, 57392, 76812, -5681, -68732, -197075, -96393, -145493, -103477, 64448, 81182, -51517]
10816D5962a41184C237i6130B6875b03186e9652m9526j67872O9873A03169i9701
10804a46467L3031e5404j86505B95589j7152j6992n7097f8427C85683A2138L07074
10793C19212f6526k69454C0284M0334i5600M3751j85384b8709o8574M826k6355
10782a18812b957B4068a59722q547J6904c382B05289B519b38239B07993b55434
10770b7410A4141P4495K7425d0161D8618c80947B15471I834K8005b29375G8823
10758A35649a64283c7658j2696p0224D6601O6382E3130b10506F9282a65703G429
10746c90544B68837A26649a77336j69207B48170b76553J05694e4894A83440b1282
10735a5039j56484P7843j8346j35241c0808k15888M5023A30287e2610k06829e4552
$$ y = [45962, -141184, 3237, -96130, 26875, -203186, -59652, -109178, -277050, -207177, 103169, -99701, -146467, -113436, -55404, -241909, 295589, 278437, 261445, 204348, -68427, 385683, 12138, 319212, -66526, -335980, 30284, 70618, -95600, -51849, -237233, -28709, -97283, -92457, -118812, -2957, 24068, -159722, -168269, -151365, -3382, 205289, 2519, -238239, 207993, -255434, -27410, 14141, 88636, 116061, -40161, 48618, -380947, 215471, 9834, 37839, -229375, 78823, 135649, -164283, -37658, -50354, -120578, 46601, 112983, 53130, -210506, 69282, -165703, 7429, -390544, 268837, 126649, -177336, -346543, 248170, -276553, -170859, -54894, 183440, -21282, -15039, -171523, -93680, -112026, -247267, -30808, -246696, -201673, 130287, -52610, -259439, -54552]
10723c1070m2868A7571J87822b91175O0474b8171p0314Q593A13140K4581e953
10711a76570E3403a1738B31908h4704J787H9376K4953c4835k4837j08550A57282
10699A57718a6616A64551P7220B4720J09559P3239b89318a6481A62907l5052N0034
10688A77889b12078A7784c71185a28752J7348D0703K2106J19428a04756j38699
10678b43455B55543c73700a0559k42820D55535c1717p25j12337d7177G5130O6949
10667A42079b20004j11697A40960i2793k529K3763n388A96471c0370j00801L0858
10656a00313J7472E6868M33594d85167A01446D5216b04372A45243p0191E820L8718
10645D4538e02338b25590c292A62655c15747J54623l4037D694c9256j55315R2109
$$ y = [-31070, -73938, 17571, 205393, -291175, -230701, -28171, -98485, -89892, 113140, 137721, -5953, -176570, 53403, -11738, 231908, -84704, -82917, 89376, 114329, -34835, -59672, -168222, 157282, 157718, -16616, 164551, 241771, 24720, 134279, 207518, -289318, -16481, 162907, 127855, 177889, -212078, 17784, -371185, -128752, -111404, 40703, 62809, 182237, -104756, -243455, 255543, -373700, -10559, -253379, 455535, -31717, -32442, -144779, -47177, 75130, 142079, -220004, -331701, 140960, -92793, -95322, -71559, -76947, 196471, -30370, -131171, -100313, -82841, 56868, 490462, -485167, 101446, 45216, -204372, 145243, 75052, 5820, 44538, -502338, -225590, -3292, 162655, -315747, -161124, -195161, 4694, -39256, -194571, -102462]
10634a02462l27616A9143L09528a59096A0272J16687b18369A21781H122J70808
10624A78930m4845P0582J01162a2089A6483L26533A2074a95161D2602K432J583
10613D6617g2917k11860A87420a37450B33910A9542i5k91575J05147a5599l7181
10602e2780k269A47651a65524D4959c5665j44115F7757J4301h3008B47177C3719
10590G7594J6023b96419c5722B3616K68721a50698A10972B5306L882c11460R5279
10579b16181d1622k57507c548k93594e5486A08085J56002e5675A32251C3430L5074
10568F8504A6520e21143a30843a3583k18537G8484b95192A39406a50222k910f5104
10556G0327c36395J27227I5980c7778D871a81556B3468a01914o5216k6321B7404
$$ y = [-102462, -430078, 19143, 328671, -159096, 10272, 126959, -218369, 121781, 8122, 178930, 134085, 204667, 305829, -12089, 16483, 343016, 12074, -195161, 42602, 45034, 46617, -72917, -284777, 187420, -137450, 233910, 19542, -95, -291670, -186523, -15599, -52780, -55049, 147651, -165524, 44959, -35665, -179780, 67757, 82058, -83008, 247177, 33719, 77594, 93617, -296419, -35722, 23616, 292337, -150698, 110972, 25306, 29188, -311460, -216181, -41622, -299129, -3548, -297142, -55486, 108085, 264087, -55675, 132251, 33430, 68504, 16520, -521143, -130843, -13583, -232120, 78484, -295192, 139406, -150222, -153132, -65104, 70327, -336395, -209168, 95980, -37778, 4871, -181556, 23468, -101914, -167130, -193451, 27404]
10544a21684A42525a09893j83129A93164N9026a09881A20982E8590b60385L8307
10534b22078M2122C1633A306a02991j25337d6449D78932i0470r8897A37805e2875
10522A0734b21374A58564L3323M1628d67349C4470c07252L5468J01082a2382q3799
10511i6181d5523A19327a69377B77981d38766b04396B63433a2519A24721c2192
10500b52516J11405N5647C7365J01026g0558k05666H002b42174f0533a3451l9742
10489e3193A17455b95647M850J35486d7559B77647b98897B07162b97295B23047
10478a366C33766b0653C40780A26298b71086A73281Q6603H7698a58558b253C15132
10466a05465j02288m4677B79282a81646A268N7642K82785a26745B72704r0796
$$ y = [-121684, 142525, -109893, -293022, 193164, 252190, -109881, 120982, 58590, -260385, -222078, -179956, 31633, 1306, -102991, -228328, -46449, 478932, -90470, -189367, 137805, -52875, 10734, -221374, 158564, 191887, 233515, -467349, 34470, -307252, -271784, -170702, -12382, -96181, -45523, 119327, -169377, 277981, -438766, -204396, 263433, -12519, 124721, -32192, -252516, -141111, -85464, 37365, 138391, -70558, -276224, 8002, -242174, -60533, -13451, -53193, 117455, -295647, -290797, -155311, -47559, 277647, -298897, 207162, -297295, 223047, -1366, 333766, -20653, 340780, 126298, -271086, 173281, 259884, 87698, -158558, -2253, 315132, -105465, -207753, -252430, 279282, -181646, 1268, 58910, 341695, -126745, 272704, 181908]
10456A81908n5589p28c50595c5854B95004q5379a11078b4234k28882A20987g0911
10444f7257l032c2367E7676K918d4839B81940d032j0941j07866I2676a90512g3658
10431i0377j81069A96274e8778p7478e5703J7061j56041k6972P7910A80949a6983
10419A68179C3814b3735k0211D9745C491b59780B18067C0180c12985h7760E1607
10407a50075q8468D0625M7599a27645A71886J9451a63776e8643j55880G7514a11353
10395F2305i4154C24167a3802j2685C6466K29681j02721Q139b20558a8505j9000
10384c7505A68627O4255I5933A5424L1583K74097j28060J9803r2834P6848K97600
10373D94461H8945M7910C1439J27791L28442A83437J66984M53838l61110r2222
$$ y = [181908, 126319, 125591, -350595, -35854, 295004, 209625, -111078, -24234, -253116, 120987, -70911, -67257, -70289, -32367, 57676, 60594, -44839, 281940, -4032, -14973, -122839, 92676, -190512, -73658, -90377, -271446, 196274, -58778, -136256, -55703, -38642, -194683, -221655, -143745, 180949, -16983, 168179, 33814, -23735, -43946, 49745, 3491, -259780, 218067, 30180, -312985, -87760, 51607, -150075, -238543, 40625, 88224, -127645, 171886, 191337, -163776, -58643, -214523, 77514, -111353, 62305, -94154, 324167, -13802, -26487, 36466, 266147, 163426, 171565, -220558, -18505, -37505, 168627, 232882, 95933, 15424, 47007, 321104, 193044, 212847, 120013, 196861, 494461, 88945, 136855, 31439, 159230, 487672, 183437, 350421, 804259, 443149, 350927]
10363C50927j62912C1877J940c16376B01324m0006k6521q340C8462J08732K34093
10352C81287N8243k05887M9671K46936J06749k75854m9214R8406E8463K54454
10342C12917a25248k6180A34540Q2973N8053o9007g880A15683P7173n577D9423
10330C08248j39043B1580a87827A4145J517J37538P4521A05781C6203M65008G0091
10318H3979B4682r455K40559i4863E5267i527l18343A38917N0894e8510A47184
10306h8327D3549Q3060k4961a34291j69383A52947c12610a29497M0086A56793
10295I159K34820m3468c89373d117j92525A96584h1017j13167N4677D9671b7749
10283b7175k0988A45469d22770e5693k7203A29361c46053d4474m1248A28302a01298
$$ y = [350927, 188015, 31877, 33817, -316376, 201324, 161318, 134797, 126457, 38462, 147194, 381287, 439530, 233643, 283314, 530250, 636999, 361145, 311931, 410337, 58463, 312917, -125248, -151428, 134540, 217513, 275566, 206559, -7880, 115683, 192856, 187279, 49423, 308248, 169205, 21580, -187827, 14145, 15662, 153200, 227721, 105781, 36203, 501211, 70091, 83979, 24682, 15227, 255786, -94863, 55267, -9527, -327870, 138917, 189811, -58510, 147184, -88327, 43549, 126609, 101648, -134291, -303674, 152947, -312610, -129497, -89411, 156793, 9159, 243979, 200511, -389373, -4117, -196642, 196584, -81017, -194184, -139507, 49671, -27749, -27175, -48163, 145469, -422770, -55693, -82896, 129361, -346053, -44474, -85722, 128302, -101298]
10271B34904a43042B57580a67770K0591k440J4518A82322n3433h5719K3800A52333
10259A44465B9472a37907A60815L68939l1218A24023d1008f062I1361J7768a74633
10247A68870A1202b34582B46223D4977j8816g3369A50958k2678a6870A69133a70604
10235A1506b58489F2820a69977A56260l6769b6601B4587a58793j19254a26059
10224e5019A04642E0148M4190a97079O8756B76666A7669O8252L6685a96634B28593
10212d7457k73008b8791A24362c22179E7393L4230a90226e3353k77019a61293
10201a0255H7214J3621K9314D7597K61638b78121C00714f8075B12207K6811c41984
10189A06890a28348A24018L6469p7923P5377j9067b38008B04360r1886l1627b92752
$$ y = [234904, -143042, 257580, -167770, -147179, -149619, -135101, 182322, 128889, -85719, -61919, 152333, 144465, 29472, -137907, 160815, 529754, 498536, 124023, -41008, -6062, 91361, 109129, -174633, 168870, 11202, -234582, 246223, 44977, 26161, -73369, 150958, 128280, -16870, 169133, -170604, 11506, -258489, 62820, -169977, 156260, 119491, -26601, 24587, -158793, -278047, -126059, -55019, 104642, 50148, 94338, -197079, -128323, 276666, 17669, 85921, 122606, -196634, 228593, -47457, -320465, -28791, 124362, -322179, 57393, 91623, -190226, -53353, -330372, -161293, -10255, 87214, 100835, 130149, 47597, 309235, -278121, 300714, -68075, 212207, 239018, -341984, 106890, -128348, 124018, 160487, 82564, 157941, 138874, -238008, 204360, 112474, 80847, -292752]
10177A3817h0147k80146g3752D6433a68982A3647K1635a22176k04347C2883b88837
10165a20146a9265C4412K41235a22507j52639j09836i9336a9576p6776B6507i7194
10153A37225a39517N4968G3517K13716a97632h8635g266C7245d2137B9169b06942
10141b28299e0289J8394n6690k6912B17085j2082f3401b523A67583j5982c4383
10129a65477f6446E1431K3337j3335M6347c67975J45321I5647J35930A3428J28374
10118A41802d01769A7798a68234b7344k8916q0226N1324A44174e1427P156j69197
10107b13468G3114c2606B70237b42507M864g175A37692b7255m9154C5873K53966
10096B89839b3402A73957a41524M1508D04132h4581q8046A9558a97864R8500E9033
$$ y = [13817, -80147, -360293, -73752, 46433, -168982, 13647, 35282, -122176, -326523, 32883, -288837, -120146, -19265, 34412, 275647, -122507, -275146, -384982, -99336, -19576, -96352, 26507, -97194, 137225, -139517, -84549, 73517, 287233, -197632, -88635, -7266, 37245, -42137, 29169, -206942, -228299, -50289, -31895, -88585, -115497, 217085, 205003, -63401, -2523, 167583, 151601, -34383, -165477, -66446, 51431, 74768, 61433, 107780, -367975, -222654, 95647, 231577, 13428, 141802, -401769, 17798, -168234, -27344, -56260, -136486, -85162, 144174, -51427, -44271, -213468, 73114, -32606, 270237, -242507, -237643, -7175, 137692, -27255, -76409, 35873, 289839, -23402, 173957, -141524, -100016, 404132, -84581, -172627, 19558, -197864, -99364, 59033]
10084B38275b96912B4156c0388B970a94804k472g2691a2011j23672a3940o1055
10073g4995j74392P9907j43591j543a36522D10479k03801E1627J3098i9282A34665
10061B5357P0683C7253O7020a9678j7221p7900J6173j70544a19567N2671j0407
10050g7303H1242P5724i2869n6178O3050B01251H5714J17515F4974a14782j08904
10039b23686N9963k10954J86759L0120O1385n2009j46243A31767A5815a45623
10028c85190a77909f9241B62235b25828E8620d30602a06488o8615H7056K8125
10018A15181e3513C2326a04702j0733H8839d11014D2231K00087f9898n5833B24808
10006d0921B4270c03750a36946m476B4063a36621M1532n77727a68551e9642F9821
$$ y = [238275, -296912, 24156, -30388, 2970, -194804, -197276, -72691, -12011, -135683, -13940, -74995, -249387, -169480, -313071, -314614, -136522, 410479, 206678, 51627, 64725, -99282, 134665, 25357, 96040, 37253, 104273, -19678, -36899, -114799, -98626, -269170, -119567, -66896, -77303, 81242, 156966, -92869, -149047, -85997, 201251, 85714, 203229, 64974, -114782, -223686, -163723, -374677, -187918, -157798, -96413, -148422, -294665, 131767, 15815, -145623, -385190, -177909, -69241, 262235, -225828, 58620, -430602, -106488, -175103, 87056, 115181, -53513, 32326, -104702, -115435, 88839, -411014, 42231, 242318, -69898, -125731, 224808, -40921, 24270, -303750, -136946, -141422, 24063, -136621, -95089, -672816, -168551, -59642, 69821]
9994F2195Q84c34064i5528k75365J23276A00957d16003M0167g5861a5361j84588
9983a99949A71554a0250j93293H0557a41557H6111c11580b4939C53204A67259
9972f4094k79115Q8783B7556c67670j391A7666a31152j00775G9370b14946o6507
9961b81453Q5529j23299g6981A65711b26169A08380D2123a05404B5936h9476n6402
9950a45878E0737a83251d4640r7305A71817q5714d165C3308i4669K8797F8951
9938F5203M7327a39651f5055k7618B32546j1968I7637b94908P1660r2168a04347
9926a71902M1365A5516c51169B0096f1967B82938n7330L20304a73490e7816K7310
9915c0506j00773A05304a43099l58966A72429a43328A31829J70799b53900f0328
$$ y = [62195, 63079, -334064, -95528, -370893, -247617, 100957, -416003, -375836, -75861, -15361, -199949, 171554, -10250, -203543, 80557, -141557, 86111, -311580, -24939, 353204, 167259, -64094, -343209, -254426, 27556, -367670, -369061, 17666, -131152, -231927, 79370, -214946, -281453, -195924, -319223, -76981, 165711, -226169, 108380, 42123, -105404, 25936, -89476, -145878, 50737, -183251, -44640, -141945, 171817, 86103, -4165, 33308, -94669, -65872, 68951, 65203, 112530, -139651, -65055, -92673, 232546, 220578, 97637, -294908, -223248, -315416, -104347, -171902, -130537, 15516, -351169, 20096, -61967, 282938, 225608, 545912, -173490, -57816, -30506, -131279, 105304, -143099, -502065, 172429, -143328, 131829, 302628, -253900, -60328]
9904B60634a6209A35187A6138n883K11431b66816A41558M718F6496l0462a75103
9892d64456a5845p4764A20943a04612A8616b32124F302K55885b04624b5214p1972
9881i7186k06363a42926j21966E2390a20805B64005E5973a18477k90780a63246
9870a44085l4057A56502c07737h5749m0638j33680i1658o0723a2668A85876g5987
9858a95484A96268i7518j39558A21599a63649m0643Q5829m2441A62994G4683A7413
9846C35238a64416j98599k52388a2427H0163M888d77750A33439n678e1425o0432
9835a11857d3495A5441J93449C0168c85292a3365j08956k17646C4184c1391A72902
9823A59652h5756m8854b3109j04901N0605J3571m2121C3738h8774K1156H4540
$$ y = [260634, -16209, 135187, 16138, 10255, 221686, -266816, 141558, 146276, 66496, 36034, -175103, -464456, -15845, -90609, 120943, -104612, 18616, -232124, 6302, 262187, -204624, -25214, -97186, -303549, -142926, -264892, 52390, -120805, 264005, 55973, -118477, -409257, -163246, -144085, -178142, 156502, -307737, -85749, -126387, -260067, -91658, -152381, -12668, 185876, -75987, -195484, 196268, -97518, -237076, 121599, -163649, -204292, -118463, -160904, 162994, 74683, 17413, 335238, -164416, -363015, -615403, -12427, 80163, 85051, -477750, 133439, 127761, -51425, -111857, -43495, 15441, 208890, 30168, -385292, -13365, -122321, -339967, 34184, -31391, 172902, 159652, -85756, -134610, -23109, -128010, -77405, -63834, -105955, 33738, -88774, -67618, 84540]
9811E2560B3250N5252j3811M5232B0920f0070k62130J44563Q0572b4855k0529
9800d5384h544k28831L8463n1448M2565K5430B63681g5793l8006A17197b50841
9788a70811d7051j06167k5907E0393a23087e3631j9015B13230a81287P1350j10028
9777b19965A46727C5567J43437G7815J79479a17718k29041B11955D2825a4600
9766C0154K1094h0212B2497f0717j38771D3687J97175A00415a45021B00722a47998
9754F701K21997G770K66K310O5963a74888A7005b33680a05268J0395G2334a84927
9741B34884e07654b3769A0496c63320a74156e4041C9014e5836F6358Q047j4276
9730F0129g7409A37796J5811a22987A79995E5095J3688a29078d6627p6464n8054
$$ y = [52560, 23250, 78502, 64691, 109923, 20920, -60070, -322200, -177637, -97065, -24855, -45384, -8544, -237375, -198912, -250360, -207795, -182365, 263681, -75793, -113799, 117197, -250841, -170811, -47051, -153218, -179125, 50393, -123087, -53631, -72646, 213230, -181287, -109937, -219965, 146727, 35567, 179004, 77815, 257294, -117718, -346759, 211955, 42825, -14600, 30154, 51248, -80212, 22497, -60717, -199488, 43687, 240862, 100415, -145021, 200722, -147998, 6701, 228698, 7770, 8036, 10346, 76309, -174888, 17005, -233680, -105268, -94873, 72334, -184927, 234884, -507654, -23769, 10496, -363320, -174156, -54041, 39014, -55836, 66358, 74405, 60129, -77409, 137796, 153607, -122987, 179995, 55095, 68783, -129078, -46627, -123091, -181145]
9719a81145k09423a31037A45630b66265P3258M5420j57544A86351a34770o4881
9709a99651j8463D853L0122b02446c3092F6287b59158A42224n9432i7846o3540
9698a61386B6934b98427F9241a92257G0173P8691b19140A63959e9135j35217A83682
9686c06410K7413o538A19680g1803C2649f3082l9863c0925j90128B8717J85315
9675B14032b78014k23003a19754G3982a83507R58A32467n2687R5227L6554H0864
9663A80676a43951j566I2003b97499J9778l6990B44528h0487H9214A8935b18725
9651F2056P4674O7295G9616a76187a0155p3453A19373d702G9039a78724A90953
9639a86892B34352g9950k18587c8566j52451j7457d5528B27046F7056C2595K9992
$$ y = [-181145, -390568, -131037, 145630, -266265, -193007, -147587, -305131, 186351, -134770, -199651, -218114, 4853, 34975, -202446, -33092, 66287, -259158, 142224, 82792, -97846, -161386, 26934, -298427, 69241, -192257, 70173, 148864, -219140, 163959, -59135, -194352, 183682, -306410, -278997, -285535, 119680, -71803, 32649, -63082, -102945, -30925, -221053, 28717, 214032, -278014, -501017, -119754, 73982, -183507, -182549, 132467, 79780, 175007, 211561, 80864, 180676, -143951, -145517, 92003, -297499, -277721, -314711, 244528, -80487, 89214, 18935, -218725, 62056, 136730, 204025, 79616, -176187, -10155, -83608, 119373, -4702, 79039, -178724, 190953, -186892, 234352, -79950, -298537, -38566, -191017, -208474, -45528, 227046, 67056, 32595, 62587]
9628F2587d6804I8285a66115q2552a06625B5067K6141a45952B1087q178c17672
9616b50574A32840K9149b27508d1350P297j27294A55285a06004k44823g942G7506
9604c01880D1543b0893m64320C6904b71194O7275R2696F099J27489j0114K84693
9593D08167A30681a4584l90364i214j2748k53192H3917D0459f5321r3665j40187
9582b99173g7485r000C90945A32426R6928b72493H4298b87559I3328b26672B02642
9570I6015b16004I9025l9021a53900n5342E5876b19306Q5179o9476e2920B0487
9558b29613a11283k2979k75383D369a42038e0760A80374B9399P6531a49764f5196
9546B0105b99195e6925j79055j11811n1163i8555A5707L88277a7183j5872C22688
$$ y = [62587, -46804, 98285, -166115, -248667, -106625, 25067, 51208, -145952, 21087, 12909, -317672, -250574, 132840, 161989, -227508, -41350, -34053, -161347, 155285, -106004, -350827, -7942, 77506, -301880, 41543, -20893, -485213, 36904, -271194, -203919, -111223, 6099, 133588, 123474, 408167, 130681, -14584, -404948, -9214, -21962, -275154, 83917, 40459, -65321, -158986, -299173, -77485, -86485, 390945, 132426, 229354, -272493, 84298, -287559, 93328, -226672, 202642, 96015, -216004, 99025, 60004, -153900, -209242, 55876, -219306, -134127, -203603, -52920, 20487, -229613, -111283, -134262, -409645, 4369, -142038, -50760, 180374, 29399, 105930, -149764, -65196, 20105, -299195, -56925, -235980, -347791, -398954, -98555, 15707, 403984, -17183, -33055, 322688]
9534G7274g9672B0868b8211B44601F8503i8321K8925k8786A71101a9268j42997
9523a62265a7945m3233A06317E1522d66362A29600a65987j42776A91012k9985
9513A61027a54682O2690L8760g390A03818O8490k3052F5784M5317a17766B21471
9501d5771m2685j13475B5322b55023j51963A3514c67806a69827N2859l84577A60890
9489a84791d8016P130A25681l2124j9862a7075j75758j71562d3363k27028A86085
9477a57311B2252a66168A36519A6660n707a13421k70600F5558b25599Q6966K6775
9466a11858l8839l6806j50109k05B89792a14643n7807g0828G6758j9978b21192
9454h1003L2902C29338G8288C7136b62053b5226k52509A37560C5375N7495a54469
$$ y = [77274, -79672, 20868, -28211, 244601, 68503, -98321, -69396, -98182, 171101, -19268, -162265, -17945, -61178, 106317, 51522, -466362, 129600, -165987, -308763, 191012, 161027, -154682, -91992, -53232, -7390, 103818, 172308, 149256, 65784, 111101, -117766, 221471, -45771, -88456, -201931, 25322, -255023, -406986, 13514, -367806, -169827, -116968, -501545, 160890, -184791, -48016, -40886, 125681, 93557, 73695, -17075, -192833, -364395, -43363, -270391, 186085, -157311, 22252, -166168, 136519, 16660, 10953, -113421, -384021, 65558, -225599, -138633, -111858, -150697, -187503, -337612, -337817, 289792, -114643, -172450, -70828, 76758, 56780, -221192, -81003, -48101, 329338, 78288, 37136, -262053, -25226, -277735, 137560, 35375, 92870, -154469]
9442D46017i7669D13697b32791R1320F9278c02745F619f0490e641r0267B98294
9430b93171b0128n0483C4010P8767c20731D3865b95009E7371a65226B62780e3790
9418H331P5124i8257M3472k09148A32657C2108d8903C9672m205K39361a20297
9406a1739j34187c6976o1878D6658j9073b57775m136O7313D2176b93579K0702
9395b72877k6505B83135b26464N3220C9323Q6620K4364G648P287l91J83554a7313
9382H0443P9118a0148E2856b53531B11242l1911a94501J0784j69950a1711l26728
9371c38439a18683b7126o7572k0114j0280A3451N5444b061A64344b02437A7762
9359i73j63441h0673j80172b1306G602K9823J80391M6922I9876a1143H453K06195
$$ y = [446017, -97669, 413697, -232791, -141471, 69278, -302745, 6619, -60490, -5641, -95908, 298294, -293171, -20128, -70611, 34010, 112777, -320731, 43865, -295009, 57371, -165226, 262780, -53790, 8331, 83455, -98257, -54785, -263933, 132657, 32108, -48903, 39672, 35467, 274828, -120297, -11739, -145926, -36976, -98854, 46658, 27585, -257775, -261911, -194598, 42176, -293579, -272877, -299382, 283135, -226464, -173244, 39323, 125943, 150307, 7648, 14935, 14544, 198098, -17313, 80443, 159561, -10148, 52856, -253531, 211242, 179331, -194501, -183717, -353667, -11711, -338439, -118683, -27126, -94698, -114812, -125092, 13451, 68895, -2061, 164344, -202437, 17762, -973, -164414, -80673, -260845, -21306, 7602, 37425, 217816, 264738, 99876, -11143, 8453, 214648]
9347B14648a00167j53949Q5831j7468g1769n8675k70527I9943m0449b129A49964
9335h4656D0125b32327C18662n3903k3300b60863A55969c4199j06177M2973j73241
9324b70644B82425p6759q6205L6971i4621C0686b5834A8092a39362c443B27208
9312C31054j43565a88651D3653b37349q3859g6460N365b115j16109j10576R3241
9301a35559A00455a37334C41528A16552a2584A56002M9539b19952F9250a65246
9290c97065a20399j4529k77609f3535n755o7392A26982b31217O9641P9218C27866
9278f9458l21708a65060O5357B16906d5287A60246c12988A26845e6247J2915j87577
9267b30909f5659j75554E2908B4820b23709J04603C5737b15137C6867a03965j33787
$$ y = [214648, -100167, -254116, -168285, -185753, -71769, -130444, -400971, 99943, 59494, -2129, 149964, -84656, 40125, -232327, 318662, 264759, 241459, -260863, 155969, -34199, -140376, -97403, -270644, 282425, 205666, 119461, 156432, -94621, 30686, -25834, 18092, -139362, -3443, 227208, 331054, 187489, -188651, 43653, -237349, -321208, -76460, -71095, -2115, -118224, -228800, -135559, 100455, -137334, 341528, 116552, -12584, 156002, 205541, -219952, 69250, -165246, -397065, -120399, -134928, -412537, -63535, -69290, -136682, 126982, -231217, -161576, -82358, 327866, -69458, -391166, -165060, -99703, 216906, -45287, 160246, -312988, 126845, -56247, -43332, -230909, -65659, -241213, 52908, 24820, -223709, -119106, 35737, -215137, 36867, -103965, -237752]
9256b37752I2359M4168a01353j15715j50147J65758A88386E2467d44856A30351
9245a35768B3520b19890f8943j24160i1448m0301l6315p7159J01003j29193C73217
9233a8060k27898f5017n4239H9754a04586F5936J02822a29804N8336b9202j66538
9222a95740A4693f0613J0832E7696c11003a18959H3258i5333A8957a6483k20144
9211b36627m3906N3558A64878J8733A2589a06458C19684a11469e2156B19563e4334
9199b5510C9664O1956a20358B61299h0370j98875h4095k17138J6495g5146A3846
9187c0317k63728a6773n18536b44386A11996j9497m5176K02751b39474B8913b4951
9175a07307l367d244j72417C40180b83525b9279B9214b80765g4213m3758d66B41833
$$ y = [-237752, 92359, 136527, -101353, -217068, -367215, -201457, 188386, 52467, -444856, 130351, -135768, 23520, -219890, -68943, -193103, -91448, -131749, -168064, -245223, -144220, -273413, 373217, -18060, -245958, -65017, -119256, 89754, -104586, 65936, 168758, -129804, -71468, -29202, -195740, 14693, -60613, -49781, 57696, -311003, -118959, 83258, -95333, 18957, -16483, -236627, -280533, -226975, 164878, 183611, 12589, -106458, 319684, -111469, -52156, 219563, -54334, -25510, 39664, 101620, -120358, 261299, -80370, -279245, -84095, -301233, -284738, -75146, 13846, -30317, -294045, -16773, -535309, -244386, 111996, 92499, 47323, 250074, -239474, 28913, -24951, -107307, -110674, -4244, -176661, 340180, -283525, -29279, 29214, -280765, -74213, -117971, -466, 241833]
9162B15567m1672a15229M1967a2626B3072c35844j3276F6356J8347c5998r030
9151d5028A06001a08541L9740j84859f0558D7170g0416j86588B19750c29275J43546
9140a85729F3097d3022G2959J5589G470b07342e2729A94217a67047l5148R0620
9129a11575A76533b41933b0686o5316m2281R593j1547F8475J0857e3656j3838
9118f7494A60061Q7d6290A17525b36592F1122k0731b10501N5472g6235C69398
9106a96761e8228B21030K10338a84246D37919b3072j22008M8885p6008a788F8405
9094A1483J9560i7430A78635k464F5080b97920A68017b31244b7672k66509C99301
9082H1535l5927a59912A96980J74748a31854L0416c9139j02811q3388N5163j15967
$$ y = [215567, 173895, -115229, -73262, -12626, 23072, -335844, -349120, 66356, 84703, -35998, -45028, 106001, -108541, -68801, -253660, -60558, 47170, -70416, -257004, 219750, -329275, -185729, 63097, -43022, 72959, 88548, 7470, -207342, -52729, 194217, -167047, -202195, -111575, 176533, -241933, -20686, -86002, -128283, -118690, -130237, 68475, 79332, -53656, -67494, 160061, 160148, -46290, 117525, -236592, 61122, 40391, -210501, -155029, -76235, 369398, -196761, -58228, 221030, 431368, -184246, 437919, -23072, -145080, -96195, -172203, -1788, 68405, 11483, 31043, -97430, 178635, 176171, 65080, -297920, 168017, -231244, -27672, -294181, 399301, 81535, 45608, -159912, 196980, 371728, -131854, -101438, -39139, -141950, -225338, -170175, -286142]
9071b86142f9595j97749r006A82117p6872J69002A0240d8042r8020d9760o11428
9060f61188b3763e489A14946a00329k11053J23414l74712A34284J37991b0780
9049c17721b7048B03356K6933a67772q4343a01591j92630G5394c56206E3607b5109
9037A40618a624j51606A03812a4712j77014P8237H9318C6324R5568E8787J1962
9026G0749c3234j07617e4592m24469a71932A18312n5017j1019b91834b3977j09964
9015a33941O878N4899B67066P8955a01867l4049r1561m3594I6819L2917b25942
9003B992a91942A92461G8497a15081B8174e9025I9435h5591l66727A38938d3081
8991c8763k19445H8389b85379H4238C4586c41594P7370L3301a05262I7244A7413
$$ y = [-286142, -69595, -267344, -276350, 182117, 105245, 274247, 10240, -48042, -146062, -49760, -661188, -23763, -5489, 114946, -100329, -311382, -187968, -562680, 134284, 272275, -20780, -317721, -27048, 203356, 230289, -167772, -252115, -101591, -294221, 75394, -356206, 53607, -25109, 140618, -1624, -153230, 103812, -14712, -191726, -113489, 89318, 36324, 131892, 58787, 70749, -33234, -140851, -54592, -479061, -171932, 118312, 63295, 52276, -291834, -23977, -133941, -127063, -72164, 267066, 346021, -101867, -135916, -227477, -271071, 96819, 129736, -225942, 2992, -191942, 192461, 78497, -115081, 28174, -59025, 99435, -85591, -452318, 138938, -43081, -38763, -258208, 88389, -285379, 84238, 34586, -341594, -264224, -230923, -105262, 97244, 17413]
8979a28168B6522a81110a9011k11917e0097l55450D4947a22507B20604C3958J73867
8968B07825l8778N7424c2506G5876R216a54063H6015J82030g296k34244J10820
8957a30720q837B48318J02931B9881a69019e4918J7779r2527j82215d3820J862
8946d1958l25416M5875A95805L2295G7098M3751c1909k06626A42104J19905f1514
8934D5764L70434A33519P7010A8254b96486A67966a62195B37812r9533K27166
8924C65445N54498J650310N223629M771039D574487A600690E37073o0589k07224
8915B69260A02183N0619c10999a45193l7384A026J47823a04650j54812A20756
8904F9139J19708E4038a45596K6421l6428k4762A80408a89391A40150b46768E7555
$$ y = [-128168, 26522, -181110, -19011, -230928, -50097, -405547, 44947, -122507, 220604, 33958, 207825, 169047, 226471, -32506, 75876, 85092, -154063, 86015, 268045, -7296, -241540, -130720, -139557, 248318, 351249, 29881, -169019, -54918, -37139, -129666, -311881, -43820, -41958, -367374, -321499, 195805, 228100, 77098, 120849, -31909, -238535, 142104, 262009, -61514, 45764, 416198, 133519, 210529, 18254, -296486, 167966, -162195, 237812, 138279, 365445, 919943, 2570253, 7793882, 12564921, 4574487, 1600690, 537073, 476484, 269260, 102183, 152802, -310999, -145193, -182577, 1026, 148849, -104650, -259462, 120756, 69139, 188847, 54038, -145596, -119175, -155603, -180365, 180408, -189391, 140150, -246768, 57555]
8892A91569a4328j13190k7776m4484h7436A79669j7334E163K00943F0645c7258
8880a50142E0127h7487D06258c02871Q1283c0252A65635K28886F7998b10881a00380
8868I8324b9377j70489G5341k5498J00105b71529g6339g856A96542A7534b33275
8856g970j57628A8670a60825B9380f6472k35524I6884i2924A97659h0632A60366
8844B95234b2907o3977j20019A77845B763a21632A55682f3708G1443a90136e3917
$$ y = [191569, -14328, -127518, -155294, -199778, -87436, 179669, 162335, 5163, 206106, 60645, -37258, -150142, 50127, -87487, 406258, -302871, -221588, -30252, 165635, 394521, 67998, -210881, -100380, 98324, -29377, -199866, 75341, 49843, 149948, -271529, -76339, -7856, 196542, 17534, -233275, -7970, -165598, 18670, -160825, 29380, -66472, -301996, 96884, -92924, 197659, -80632, 160366, 295234, -22907, -86884, -206903, 177845, 2763, -121632, 155682, -63708, 71443, -190136, -53917]
$$ [...]
##END NTUPLES=NMR SPECTRUM
##END=
