
##TITLE=AC1390_ETIA12202_7519331_cyJpfrcyVi
##JCAMPDX= 6.0         $$ Bruker NMR JCAMP-DX V2.0
##DATA TYPE= NMR SPECTRUM
##DATA CLASS= NTUPLES
##ORIGIN= BRUKER
##OWNER= Administrator
$$ 1.72 TOPSPIN		Version 2.1
$$ 2013-02-19 20:29:00.883 -0500  Administrator@X
$$ Compression mode = diff/dup
##.OBSERVE FREQUENCY= 400.02188249412
##.OBSERVE NUCLEUS= ^1H
##.ACQUISITION MODE= SIMULTANEOUS (DQD)
##.ACQUISITION SCHEME= undefined
##.AVERAGES= 8
##.DIGITISER RES= 22
##SPECTROMETER/DATA SYSTEM= spect
##.PULSE SEQUENCE= zg30
##.SOLVENT NAME= COFFEE_meoh
##.SHIFT REFERENCE= INTERNAL, COFFEE_meoh, 1, 14.98509
##AUDIT TRAIL= $$ (NUMBER, WHEN, WHO, WHERE, PROCESS, VERSION, WHAT)
$$ ##TITLE= Audit trail, TOPSPIN		Version 2.1
$$ ##JCAMPDX= 5.01
$$ ##ORIGIN= Bruker BioSpin GmbH
$$ ##OWNER= Administrator
$$ $$ E:\/data/COFFEE/nmr/AC1390_ETIA12202_7519331_cyJpfrcyVi/10/pdata/1/auditp.txt
$$ ##AUDIT TRAIL=  $$ (NUMBER, WHEN, WHO, WHERE, PROCESS, VERSION, WHAT)
(   1,<2013-02-19 20:28:52.617 -0500>,<Administrator>,<X>,<go>,<TOPSPIN 2.1>,
      <created by zg
	started at 2013-02-19 20:27:45.992 -0500,
	POWCHK enabled, PULCHK disabled,
       configuration hash MD5:
       86 BA 57 50 F2 9D 5C 9B 26 00 A9 28 5F 66 2E 89
       data hash MD5: 64K
       8B 4D C7 CA 80 A8 86 91 DA 07 23 8D EA 3D D7 76>)
(   2,<2013-02-19 20:28:55.758 -0500>,<Administrator>,<X>,<proc1d>,<TOPSPIN 2.1>,
      <Start of raw data processing
       efp LB = 0 FT_mod = 6 PKNL = 1 PHC0 = 0 PHC1 = 0 SI = 32K 
       data hash MD5: 32K
       80 74 EA 5B 91 70 2B 7F 06 12 40 E0 DE E2 3B 89>)
(   3,<2013-02-19 20:28:56.227 -0500>,<Administrator>,<X>,<proc1d>,<TOPSPIN 2.1>,
      <pk PHC0 = 71.46606 PHC1 = 0 
       data hash MD5: 32K
       58 B2 DA DE 40 F8 87 5B 1C 27 89 6B 9A EF 52 AE>)
(   4,<2013-02-19 20:28:56.477 -0500>,<Administrator>,<X>,<proc1d>,<TOPSPIN 2.1>,
      <abs ABSG = 1 
       data hash MD5: 32K
       F3 19 E8 D3 CC 3B C5 CB 99 F1 39 80 37 F3 86 58>)
(   5,<2013-02-19 20:28:56.633 -0500>,<Administrator>,<X>,<proc1d>,<TOPSPIN 2.1>,
      <abs ABSG = 2 
       data hash MD5: 32K
       10 51 B2 24 B7 FC 45 09 A0 7B 86 58 C3 E8 CE 6D>)
(   6,<2013-02-19 20:28:56.774 -0500>,<Administrator>,<X>,<proc1d>,<TOPSPIN 2.1>,
      <abs ABSG = 3 
       data hash MD5: 32K
       D4 B0 59 6D 91 F6 DA AD ED BB 71 E5 13 54 61 CB>)
(   7,<2013-02-19 20:28:56.930 -0500>,<Administrator>,<X>,<proc1d>,<TOPSPIN 2.1>,
      <abs ABSG = 4 
       data hash MD5: 32K
       04 39 3F 66 42 6F 57 20 A7 F8 49 66 22 44 5B 46>)
(   8,<2013-02-19 20:28:57.086 -0500>,<Administrator>,<X>,<proc1d>,<TOPSPIN 2.1>,
      <abs ABSG = 5 
       data hash MD5: 32K
       9B C2 48 2B C5 BF D7 A9 EA BD BC 3C CA 44 4C BF>)
$$ ##END=
$$ 
$$ $$ hash MD5
$$ $$ E2 B7 B1 8C 96 CC 5F E0 C7 69 66 DE B9 89 6C 2E
##$RELAX= 
##$RELAX= 
##$RELAX= 
##$RELAX= 
##$RELAX= 
##$RELAX= 
##$RELAX= 
$$ Bruker specific parameters
$$ --------------------------
##$DU= <E:\>
##$EXPNO= 10
##$NAME= <AC1390_ETIA12202_7519331_cyJpfrcyVi>
$$ [...]
##$TP= (0..7)
150 150 150 150 150 150 150 150
##$TP07= 0
##$TPNAME0= <>
##$TPNAME1= <>
##$TPNAME2= <>
##$TPNAME3= <>
##$TPNAME4= <>
##$TPNAME5= <>
##$TPNAME6= <>
##$TPNAME7= <>
##$TPOAL= (0..7)
0.5 0.5 0.5 0.5 0.5 0.5 0.5 0.5
##$TPOFFS= (0..7)
0 0 0 0 0 0 0 0
##$TUNHIN= 0
##$TUNHOUT= 0
##$TUNXOUT= 0
##$USERA1= <user>
##$USERA2= <user>
##$USERA3= <user>
##$USERA4= <user>
##$USERA5= <user>
##$V9= 5
##$VALIST= <valist>
##$VCLIST= <CCCCCCCCCCCCCCC>
##$VD= 0
##$VDLIST= <DDDDDDDDDDDDDDD>
##$VPLIST= <PPPPPPPPPPPPPPP>
##$VTLIST= <TTTTTTTTTTTTTTT>
##$WBST= 1024
##$WBSW= 4
##$XGAIN= (0..3)
0 0 0 0
##$XL= 0
##$YL= 0
##$YMAX_a= 551156
##$YMIN_a= -548828
##$ZGOPTNS= <>
##$ZL1= 120
##$ZL2= 120
##$ZL3= 120
##$ZL4= 120
##$ABSF1= 14.98509
##$ABSF2= -5.573092
##$ABSG= 5
##$ABSL= 3
##$ALPHA= 0
##$AQORDER= 0
##$ASSFAC= 0
##$ASSFACI= 0
##$ASSFACX= 0
##$ASSWID= 0
##$AUNMP= <proc_prof1d_extract_pilot.lims>
##$AXLEFT= 0
##$AXNAME= <>
##$AXNUC= <1H>
##$AXRIGHT= 0
##$AXTYPE= 0
##$AXUNIT= <>
##$AZFE= 0.1
##$AZFW= 0.1
##$BCFW= 0
##$BC_mod= 0
##$BYTORDP= 0
##$COROFFS= 0
##$CY= 15
##$DATMOD= 1
##$DC= 0
##$DFILT= <>
##$DTYPP= 0
##$F1P= 0
##$F2P= 0
##$FCOR= 0.5
##$FTSIZE= 32768
##$FT_mod= 6
##$GAMMA= 0
##$GB= 0
##$INTBC= 1
##$INTSCL= 1
##$ISEN= 128
##$LB= 0
##$LEV0= 0
##$LPBIN= 0
##$MAXI= 10000
##$MC2= 0
##$MEAN= 0
##$ME_mod= 0
##$MI= 0
##$NCOEF= 0
##$NC_proc= -8
##$NLEV= 6
##$NOISF1= 0
##$NOISF2= 0
##$NSP= 0
##$NTH_PI= 0
##$NZP= 0
##$OFFSET= 14.98509
##$PC= 1
##$PHC0= 71.46606
##$PHC1= 0
##$PH_mod= 1
##$PKNL= yes
##$PPARMOD= 0
##$PPDIAG= 0
##$PPIPTYP= 0
##$PPMPNUM= 2147483647
##$PPRESOL= 1
##$PSCAL= 4
##$PSIGN= 0
##$PYNMP= <proc.py>
##$REVERSE= no
##$SF= 400.02
##$SI= 32768
##$SIGF1= 0
##$SIGF2= 0
##$SINO= 400
##$SIOLD= 32768
##$SPECTYP= <>
##$SREGLST= <1H.CDCl3>
##$SSB= 0
##$STSI= 32768
##$STSR= 0
##$SW_p= 8223.68421052631
##$SYMM= 0
##$S_DEV= 0
##$TDeff= 65536
##$TDoff= 0
##$TI= <>
##$TILT= no
##$TM1= 0
##$TM2= 0
##$TOPLEV= 0
##$USERP1= <user>
##$USERP2= <user>
##$USERP3= <user>
##$USERP4= <user>
##$USERP5= <user>
##$WDW= 1
##$XDIM= 32768
##$YMAX_p= 453889823
##$YMIN_p= -711449
##$CURPLOT= <Network HP LaserJet P1505>
##$CURPRIN= <$Network HP LaserJet P1505>
##$DFORMAT= <normdp>
##$LAYOUT= <+/1D_H.xwp>
##$LFORMAT= <normlp>
##$PFORMAT= <normpl>
##$SURQMSG= 1
$$ End of Bruker specific parameters
$$ ---------------------------------
##NTUPLES= NMR SPECTRUM
##VAR_NAME=  FREQUENCY,     SPECTRUM/REAL,   SPECTRUM/IMAG
##SYMBOL=    X,             R,               I
##VAR_TYPE=  INDEPENDENT,   DEPENDENT,       DEPENDENT
##VAR_FORM=  AFFN,          ASDF,            ASDF
##VAR_DIM=   32768,         32768,           32768
##UNITS=     HZ,            ARBITRARY UNITS, ARBITRARY UNITS
##FACTOR=    0.250966925370066, 1,           1
##FIRST=     8223.43324360094, 116489,       15782
##LAST=      0,             33260,           74850
##MIN=       0,             -711449,         0
##MAX=       8223.43324360094, 453889823,    0
$$ Real data points
##PAGE= N=1
##DATA TABLE= (X++(R..R)), XYDATA
32767 116489 54316 253654 -14745 -238804 -108533 -67257 -124408 -158608 9010 88483 -206643
32755 122365 -108753 -35686 155299 130738 71603 -78868 -17000 -168321 -250606 -270673 -147453
32744 -147453 3667 -74733 -17753 -52886 -100404 -132201 -130390 64305 80415 82497 -155094 6797
32731 -54906 7744 -29066 12925 -63422 -76652 -18419 -46806 217327 -125567 187454 93036
32719 -9408 -8458 -176771 35574 -163482 52107 -58399 191251 157259 42131 -116804 164649
32707 -214459 -126119 -84961 -99321 92163 -191612 69627 129592 72004 23964 -153196 -261746
32696 -261746 -150726 -265343 86561 -26207 -124014 -97046 -115893 -18617 -62398 5619 -128942
32684 -97394 -205738 3595 -6018 -2667 84664 -99203 105467 -161263 -39456 59784 -214327
32672 -25951 33482 -240032 198088 37337 80704 -12053 -164054 -93285 -190406 194566 -33235
32660 -91331 -245752 -135354 211967 -72713 -68832 -165350 -6920 -127673 -151622 -177199 -82889
32648 -77973 121135 -81862 -144586 59996 -151003 91781 -247173 -71655 84775 246083 39523
32636 -231000 140844 61373 88325 76859 -255779 196 42411 -97074 148887 97239 175065
32625 175065 -17183 -164909 -127250 -184388 -158952 -102759 -33412 19225 185450 -99610 157926
32613 -2270 -115179 -194117 49542 120026 32541 -52718 -80916 45271 -150812 -125190 -207076
32602 -207076 309661 -103253 -71688 -83307 -211439 123014 -178211 -146501 -46284 -132540
32592 -132540 -285179 -179845 -38847 -5798 154009 -188564 -84524 29404 124584 -1500 806
32580 131986 125087 -152384 34277 42133 -99851 -73864 109369 -18256 -202233 -48284 69527
32568 -86299 -36544 -89463 168383 -141467 -38239 -101932 95306 -37004 -21703 31386 -193944
32556 -121912 119260 -31549 -17352 -302666 2130 -259870 -324710 -150084 228329 -216493
32545 -22879 65455 74070 -227808 96690 -53785 -16490 -153502 -3643 -255509 -323659 140884
32533 -151629 81176 243364 28756 55984 58910 -67647 -188823 185316 -82400 129026 -55938
32521 -47634 -185998 100759 3321 72354 -57918 -184736 -70183 -161115 18349 -144797 -244605
32510 -244605 -154722 14588 -12969 -120703 -90132 -325036 128834 39568 -97197 -409507 -33777
32498 3070 -54564 -95310 -161838 -14358 3984 8882 -258123 -59039 -151279 -79816 192891 -96734
32485 -308379 179181 -131392 40794 -471620 -137650 -95973 57842 -178469 -300580 -346688
32475 -346688 28372 -56765 90616 -430571 -261340 99714 -184569 -200276 28276 23748 118271
32464 118271 -245184 38108 -146354 84120 86064 -128454 52286 202392 127976 103547 39217
32452 25764 -74579 14512 -122325 -20571 -116346 -100975 -360938 -78150 83893 164805 102757
32441 102757 44800 260397 -116537 220222 37406 70065 -267668 176524 89004 103997
32431 103997 146563 -272238 44727 30409 -188203 147546 102709 251848 -114593 121564
32420 -61656 -227991 185643 60729 5769 -133975 391097 -342532 47529 -587441 -301152
32410 -301152 -90581 76637 224404 -43721 -72820 -358665 -65867 -82467 -114935 -67699 -25801
32398 -120735 -122418 228573 -133683 173976 -33010 1434 -170187 34179 -37804 -62085 16269
32386 -234728 -100255 76646 249984 46624 -14474 -104631 325310 96381 221500 -336316
32375 115795 -87473 112403 74566 -344065 280829 -301947 -8570 -60302 -3452 240671 -169567
32363 -64888 -78690 85242 73899 -294125 79308 24876 -287362 -125116 101067 -134177 256875
32351 -165885 285503 -61418 134533 -135886 29107 -269517 -122592 -198875 -302661 52505
32340 -14513 -141253 -34531 -130671 447037 -167193 3999 479145 28352 -156138 51360 -243220
32328 -121864 85153 -44726 -42101 -168388 131500 -200322 128612 -189598 -156683 21419 99801
32317 99801 45995 -214759 887 52012 290215 187028 -5297 57838 383143 171560 -184224
32305 -252855 -80053 27124 -244637 145398 -62679 -20693 -238037 -239270 -61030 -293813 -249913
32294 -249913 -808 -228028 -116495 271524 -70597 91095 48958 16645 -145109 258489 -273286
32282 -59671 -123757 30705 160816 -94706 8285 -83601 11280 -208294 -276670 45995 -158000
32270 -99545 23132 -121686 -252133 -39299 -136636 47605 -159000 -48081 91487 220757 208598
32259 208598 -274940 135106 -134940 -199711 -213131 -267533 -110904 77437 -7693 -189923 -189538
32248 -189538 142291 -138515 94591 -147647 74058 2552 -162694 8122 117937 29043 91003
32237 91003 -32400 114081 -84444 391862 -94046 -109777 328848 149038 -321090 -251882 -43764
32225 -247416 142192 45762 -103242 -97147 279936 -16649 -97521 99922 -21030 -142892 110898
32213 61287 296956 -81060 98575 64038 -70434 -67739 -236895 311453 74740 189460 -136226
32201 42388 -332067 74981 180171 -44168 158884 -200123 116590 85239 7859 109699 -218419
32189 -94987 -121092 133088 268435 -60742 -167152 37472 -131742 52042 238920 189047 51224
32177 -267023 119232 -224289 69921 -60048 -70653 139457 37294 50309 -51048 72376 -170488
32165 -2604 -168511 -99790 179220 -280728 74838 -46745 -276936 70068 -122655 -22154 -120181
32154 -120181 -79900 -155003 259615 227655 -154747 8747 -136137 38835 -276916 -38774 -107628
32143 -107628 -319720 112379 -208730 -84484 70185 -24555 -101615 -83474 -127600 -63079 -61569
32132 -61569 -202687 -49086 61253 -123837 103168 -190583 82083 -163349 -45655 -117321 37892
32120 145429 41791 -147307 -287190 126675 31134 -83606 -123896 -126708 -165273 -185802 -25925
32108 -207997 -24892 -32057 125854 97622 -348670 -331753 217168 -12015 -60460 19058 -76414
32096 -97440 -435580 -64925 -8582 118090 -171230 401423 98927 -62982 57048 -387357 -29252
32084 58795 12356 -215987 -94093 93806 -8254 -179010 -211368 105122 6670 153302 179346
32073 179346 75898 -327248 -66349 -36788 -203247 72607 -234771 34260 -253789 -116849
32062 152303 279172 -302134 -260519 139381 232040 53058 8814 -272213 188159 -218237
32051 49009 -203646 -48243 36237 60237 157583 9435 -32541 159495 -57344 -114547 -140402
32040 -140402 -50219 -103358 -101064 110622 86551 28475 -80012 -27109 -8690 41741 9828 -23382
32027 -441854 -51593 -62776 306679 32094 96237 -107967 -234432 212300 162537 152108 -98388
32015 191585 -229433 263507 51646 134962 134294 -31741 75560 -82099 -202652 126082 -114594
32003 119616 206001 82418 -341028 -132591 -13921 66646 201695 204678 16681 -140332 -129886
31992 -129886 268038 232030 -82293 48487 -180506 77793 18361 64755 -259589 112108 178138
31981 178138 -300314 -178342 -143048 -21275 -262387 48416 -181441 -87580 515429 158273
31970 40397 -247748 63312 230897 -72745 22621 -244080 -135698 -4316 -350252 256794 -95608
31958 -181584 -143970 -137409 -327301 -255293 -150885 -35876 -78010 -249000 -80342 71622 -39389
31946 105743 -1084 197428 79013 -164022 149848 290855 144211 78530 110842 90689 9594
31934 -79503 200486 -247630 -223204 -143030 28509 -72465 123017 219875 -61431 -30252 -174519
31923 -174519 -283062 -62133 -267248 26037 173618 338499 -391498 -190058 -64028 -136818
31913 -136818 -277213 -129310 46754 226523 16094 218331 -158682 -510039 -75284 -298450
31903 -298450 9484 130836 95573 108138 -97655 -129750 48007 5653 113772 70847 -95119
31891 131228 26363 -103282 -256315 -96109 -427557 -113247 89563 -40985 -104897 47008 193424
31880 193424 92515 202307 435516 5837 81637 22667 121135 -112895 80916 131924 -196731
31868 129067 -142910 82250 -257293 147119 -190591 -116949 53773 133070 -37757 9459 154076
31857 154076 -264144 64393 -111286 -238973 -119928 114457 -75832 -211650 105883 -39637
31846 -156345 -171341 -48028 -122554 -65858 -94769 -173355 -21565 -97293 -109830 -173653 190992
31834 -148431 63908 -220172 -45803 -78591 408242 -69485 126975 -125316 -127292 252385 -52536
31822 80283 -204371 125612 -46289 -300665 -81729 414467 -33676 1819 297428 -37934 -36037
31811 -36037 -9712 -34922 -106420 -127966 348477 -86865 -18677 134943 474045 -144662 -137751
31800 -137751 -140967 67799 82230 110449 296976 110899 10055 244704 -51979 46540 18760
31788 -19060 -117161 -301020 -220998 -79634 -112738 -200376 -69712 291243 -147398 352271 -27284
31776 -144804 -34869 328352 135096 279463 173800 202933 71503 -238488 -298914 55875
31765 -111788 67846 -171014 74095 162180 233497 211519 -49825 25704 -6048 -77393 -76267 -278371
31753 -278371 113748 -20621 -151567 -44252 98437 -22358 -40812 -54617 -118012 200992 -148531
31741 -221681 -11554 -87398 -83959 190841 -16325 35295 64599 40878 -52930 57315 -120473
31729 18446 127134 287010 108983 -341629 241564 -218000 79107 20898 -20596 -52241
31719 -52241 -241159 -100925 86470 -67870 -120192 121957 35573 -76734 49026 -52728 -376563
31708 -376563 -173805 -22393 232091 -148258 39866 115183 -30963 49051 269335 -25657 33686
31696 57871 -148390 199950 -27621 82299 100005 306000 -16017 127186 -121561 58134 191110
31685 191110 -63365 -37237 -55160 -303069 -156089 -144936 187158 -119916 -228977 -92633
31674 179240 117884 196456 18390 106195 172518 9551 263722 -164660 -113006 127197 91837
31663 91837 37803 -104171 40619 -51171 -266559 -95180 65416 6459 13031 171546 -136425
31651 -35551 -52085 -104127 -106636 -162722 -4426 -136454 23938 -468357 -316138 97934 94928 -102665
31638 -313355 110124 -60539 -9861 -246381 276096 -134700 -175526 -42545 -14276 325124 153435
31626 -249369 -18631 -76088 79034 -392341 -151947 367080 -634 -339895 77050 5787 193481
31615 193481 105262 -45006 -44379 50411 -140744 -62261 -89750 28158 -3731 -86825 -114123 580470
31602 -140288 -49027 -251378 235990 920 144228 30524 -109495 -85416 -46434 146625 11673
31590 160832 13892 -264006 -158970 -65599 115077 -20238 -36628 -141987 -178876 -162232 138264
31578 69113 460029 -316160 124258 -229468 -185832 96704 168588 48033 -382746 -81134 127963
31566 1045 287464 -219227 133837 -168767 -147453 -3555 134930 65951 195456 24057 -7846
31554 121499 205336 -59260 29707 -163387 25887 -161917 -97689 213902 118073 -1383 242281
31542 61912 183094 121406 361452 54903 -310563 194685 -11213 80628 55361 -270490 -84240
31530 -55280 168174 110838 83137 260817 -116507 -77670 -300583 -96637 60703 6041 -159884
31518 58361 -1779 116311 -61920 -234388 -53676 188781 119872 -173789 22307 20318 74568
31507 74568 -130903 -164533 -175971 17758 11167 207496 296329 -11666 -2878 242215 144215
31496 144215 -62232 17788 -61499 284733 -223175 -36510 315256 466448 -171864 -119519
31486 -119519 -167263 20681 47563 153942 -82980 46130 82228 8255 -100990 -34590 -209394
31475 -209394 25227 -153759 -9861 192100 -90108 -2501 119873 -143192 -151792 124285 69283
31464 69283 13911 -154518 -41237 -57003 -228752 -2695 125936 -118107 24900 15172 84620
31453 84620 -293779 -118898 24539 162161 -11995 92056 295624 -12014 -183883 -170528 14214
31441 121079 -234214 -98837 -200565 251127 -100115 -41946 -226227 -17438 159740 -32096
31430 -23729 -990 58662 -272489 -2910 -15060 301591 -32355 -93307 171759 223864 -194618
31418 -84228 -56497 99017 253796 168856 139196 185222 91670 233279 46130 -304003 -419282
31407 -419282 60780 -208889 -50692 -45959 5760 23437 124754 -135426 215800 -18708 142494
31395 -45178 -58051 119878 72739 -51121 -30175 134340 416676 12586 -76433 7236 35673
31384 35673 60066 -99327 -1719 148222 100531 -34655 99264 27239 184859 -190440 17176
31372 -34057 -76503 234648 184489 170551 -5432 -96349 93767 -215239 7807 -107006 -85919
31361 -85919 7682 317319 48788 -64996 -207460 276663 -147599 373986 -159080 79501 255109
31350 255109 200156 97002 -217 4276 -120133 84291 -33755 31211 231501 -132428 140959
31338 73738 -144851 193815 -139396 -135381 -41647 -24623 198713 249674 -35105 97041 -81055
31326 -213701 -168507 -51317 51188 23839 -242055 -83973 188320 263956 -25650 -255027 -297862
31315 -297862 -318593 57981 -146871 -113588 -302071 -135653 -254862 24888 -24932 -264092
31305 -264092 138951 -3027 -141121 -185205 142885 -392627 68332 54510 191916 -194665
31294 -180921 -209947 23413 392811 48744 -6829 -25753 83680 -22151 41786 123909 3514 176970
31282 176970 20506 69682 178064 -115135 -317389 57708 -48706 163712 -24615 26448 -85319
31270 14708 -81544 334687 -60611 97242 -314103 210090 -76369 -14621 239227 76010 -138562
31258 115690 -162059 6452 76901 38031 234886 60956 -254847 387195 168328 -2843 -3653
31247 -3653 -152426 -169012 -13213 34230 -208236 146305 25608 -346110 -157503 118309 160273
31236 160273 -183044 43158 -115865 -32824 85894 -64544 130241 398125 129752 -4682 -149712
31225 -149712 112097 -182485 -4565 -205085 72438 -1365 184887 -266009 -294772 -71236 -120271
31214 -120271 -163647 67775 154636 62603 -22696 337423 90854 -106783 -59197 -76663 -84130
31203 -84130 -135021 140538 -76479 -37253 -120466 182746 265668 179970 -75725 -42324 34073
31191 -22985 -155700 -152458 -158341 -25453 -203516 -123470 68803 103154 -85504 -191828 46970
31179 -249274 70114 -25687 28218 144136 214035 127472 81315 -326171 -276747 -109526 -231226
31168 -231226 267626 220557 -156585 -217042 14589 284251 -84864 185985 285679 67749 147009
31157 147009 -207307 -174123 122687 -55041 -216273 194145 26977 138323 384815 10232
31146 -132329 -54787 -164612 -72233 261133 -125154 -40453 56174 66312 48862 300643 162548
31135 162548 -137893 -196417 -1631 185204 63081 -12875 -175374 -394570 -99753 206204 -91481
31123 149051 3299 188968 -32329 -95300 158675 68641 -137868 -16163 140269 -65471 -381851
31112 -381851 121930 -177754 -66882 135869 -245267 -19912 130456 -52685 67597 181356
31102 181356 108798 98776 -106900 140893 -57061 -154610 34223 -36693 75093 193779 -337863
31090 -159410 -129621 136932 -135759 -16840 101694 1282 -209797 -258318 -253215 -203359 -179190
31079 -179190 63401 120376 180204 -108030 218518 116902 94968 76180 90962 -240496 -276717
31068 -276717 -79792 203079 59111 56493 183390 -271764 4818 39022 -100621 32202 151638
31057 151638 -143473 -245222 167136 -216638 22480 -96973 -77432 42996 115798 -154050
31046 235534 78751 222882 23880 -103966 317742 -308572 -162841 -184009 98543 -32670
31035 99169 -39219 26594 -192607 28879 -15512 -22466 -60100 -84513 152269 136773 -190298
31023 43216 -255045 -114775 46377 137033 24204 -49336 62672 -58807 209568 -26166 -46436
31012 -46436 -149019 -201215 -17049 370234 -38369 -26104 342311 -269532 -99891 196333 156907
31001 156907 -171377 162844 129476 -71511 214732 -11096 -208269 -144909 -175768 -94306 46803
30989 -73647 157747 192235 47918 196551 70081 57074 -135789 297630 153473 -70259 219218
30977 -61135 -30759 10070 -156664 5060 -51039 66963 -134232 -234634 -84521 -221391 -156082
30966 -156082 282802 167345 -144579 28738 87522 28453 -119307 154281 -223837 137289
30955 -36386 46937 -93512 -340600 86509 -20449 16965 -228017 -158111 35654 -73055 -16420
30943 17228 -45097 -73588 136766 22124 -218984 198524 -96639 -237401 25982 63731 -370406
30931 54557 377430 61075 -3355 -243232 385350 103370 146622 139333 43054 120748 58381
30919 -185529 44509 42040 141857 34693 -241731 270115 22789 -21185 162590 291334 -19687
30907 -354029 -177649 -291442 63307 177679 -256085 -100836 82434 -70056 -136525 -182389
30897 -182389 -241662 -49694 -75031 -250322 156154 -31768 7659 134368 -44349 233620 -173582
30885 -382587 -5918 -25568 -11807 171486 102597 -19952 -191685 119359 68394 102553 123518
30874 123518 -118769 -75377 156294 -148408 -158244 281482 -83028 -100666 -223534 -59627 -33592
30863 -33592 -39921 350598 205435 22483 67734 155376 -140582 -117889 -48783 -49949 -19583
30851 -305067 -100945 -4484 236187 10752 68719 -15233 -113337 -212185 -70560 283670 171454
30840 171454 33780 -55879 190560 56348 49911 -105762 -91115 -134626 37610 -78061 -206844
30829 -206844 76701 152459 386034 -45081 165313 290483 93590 143992 -34632 189250 -30395
30817 -253968 -137791 -126323 42120 116633 -31245 97363 -107683 -65479 -140884 -108796 -119569
30806 -119569 -41969 167232 122532 320001 121314 28826 27268 -3366 -49520 183759 -318735
30794 -59226 288648 261458 -130282 286306 -76586 -148884 -119366 99138 34429 -286206 -81263
30782 32276 -180953 -42378 -28158 -167096 257020 -50905 -102115 -873 207603 34623 -6209
30770 -77116 295756 -18411 -17852 75316 -216213 262165 -86485 79853 118380 206948 -204850
30758 -238665 210961 236100 -127507 -3074 -240350 51755 -151782 284680 -18392 243594
30747 65417 -90018 280234 170396 26526 152742 -150746 -14509 -67337 294526 -329025
30736 98862 -177704 118217 120149 67582 43992 130908 -6248 113387 220541 114019 43809
30724 -296174 124035 -239884 95388 263745 67455 -26744 -74107 127378 -5288 -191315 -127661
30713 -127661 4360 -59846 98370 75604 -21958 163330 -59875 -100537 -38108 255075 132603
30702 132603 -169586 81276 124951 -161756 -160989 -2292 -55559 -255241 12444 -75350 73909
30690 -122497 -17215 43488 -277233 31826 311069 29303 45708 -86093 124150 53605 273827
30679 273827 -256981 175204 41669 111968 32667 -250986 -32702 -127231 176902 200764 -350150
30667 -3592 179670 162306 -60584 18202 -69386 -277520 -284245 -102067 -6880 80692 -61807 240777
30654 -102339 -310973 -22233 -127322 120070 -13046 -13653 153324 -3984 -60111 306403 24381
30642 -153782 174864 -53104 -71891 157020 190310 53321 163897 269477 70086 55808 -66630
30630 -185772 -161193 48 246370 -290129 64533 -52865 -19450 81704 106574 124944 -135591
30618 86413 57440 -57324 -315435 111747 -177973 10417 11943 325422 -79915 -36283 42813
30606 713 78728 -24411 47975 241311 -62531 125021 213890 -153031 28545 -104531 156616
30594 -356 172657 -23435 73254 187856 35024 -161935 -52398 224113 76171 46549 -222033
30582 -263458 -88468 23528 -14152 -18563 -10345 183478 248545 110814 -62949 53289 -66472
30570 67191 275062 274005 -262310 -105715 98119 24039 -118442 -296953 -145244 -165055 31926
30558 -148310 333058 -71551 -377936 9196 -5633 3172 -40174 165099 -33143 -39747 213125
30546 -162349 -97626 -72815 1433 518304 314452 112270 -57185 17498 60444 -179434 -276322
30535 -276322 94727 92070 96116 194128 31637 250261 41361 -15025 -48691 89088 -308654
30523 52058 -299018 7415 -70279 241420 -220539 -312511 -185772 68548 -48235 9018 -9545
30511 -37595 -152265 97775 263820 30661 282514 46923 -143043 125846 -46803 359691
30500 72729 3325 -207427 109514 -22045 -101708 187256 558576 -140431 165122 240616 143615
30489 143615 236180 40837 -182710 36672 -5882 324 4685 290522 -290120 98154 7367 -57116
30476 214141 -103515 -89561 135069 -6601 130424 -108330 173091 6830 209068 46445 47704
30465 47704 239798 -119279 177631 -188545 360269 135363 -176314 -139647 13892 -162954
30454 153844 168830 142001 -164216 -80497 86381 -26809 114140 270797 -71800 260231 137693
30443 137693 88403 137268 55912 88073 -128735 -20950 -527187 -58469 120884 75547 -92792
30431 -170289 319976 -56705 197450 132497 79477 293803 -669 315670 47120 199376 234275
30420 234275 -137066 62922 322062 -9623 106709 251072 40030 78514 224918 -229527
30409 118414 34606 209866 78533 -138073 -4834 -140815 -32031 -253052 184797 -125271
30398 121733 -28885 25998 -510581 3522 -28913 34593 173201 96992 64180 20795 239398
30387 239398 49696 229318 102350 -73029 309634 13404 389578 -285085 -301356 -196455
30377 -196455 -24531 -256499 203554 175792 -71551 81018 220735 54809 201714 88679 208754
30366 208754 185352 -170116 -149043 -111466 115637 254465 -162045 178665 150786 26420
30355 -58742 -227764 -184732 -267357 232463 72520 166055 6770 -1611 -126938 -297025 -75262
30343 49655 -10384 6763 74827 137563 111085 107048 -70604 -141813 210210 7823 -364605 -143778
30330 218257 83191 -20763 -99910 76476 112551 -23422 319932 58945 -123350 23554 -268279
30318 -56652 -130359 188099 102613 -162698 -170061 -35344 269213 148510 -77703 30296 1388
30306 101067 324816 158045 149811 277296 209362 10263 64887 27542 249722 157522 -19061
30294 98502 80698 377736 11606 9775 -211144 139777 139478 -91029 126397 -89531 -193850
30283 -193850 -98003 -52597 -419495 -35 268703 11357 -36131 -250746 25632 78545 -281402
30271 100524 2541 -77875 -87747 220415 201061 -491622 43284 -195662 128568 86409 -142172
30259 -90668 -114363 97626 78757 13506 111683 -188354 79047 202195 37440 161561 379270
30248 379270 93871 238250 -160239 -6290 -195460 -109932 323751 -56855 335807 414626 228665
30237 228665 -25938 -185010 167268 -19567 -76871 -118537 158103 62019 251137 359661
30227 359661 -82378 61724 -277 61653 401410 52492 -123788 -37787 -2184 22601 -246083
30215 211867 -6239 88213 116443 -1665 -97741 36821 38960 -34959 -32436 -178812 -28205 189031
30202 -171468 -140697 -165901 110776 22208 135708 195771 -305724 141940 -62971 -7583 -242948
30191 -242948 215983 -86059 50016 285025 59046 235736 -186698 -254828 -71962 -55847 304491
30179 13491 -72864 133419 48275 239966 300580 417478 136851 -80669 201465 163656 -51929
30167 6039 -99736 -247224 90602 -44419 -117418 -96299 -34207 -383062 -190911 -120598 25602
30155 101993 35489 -162777 163472 -5765 -48344 -58429 -25422 39223 -158658 -128011 -162004
30144 -162004 158467 914 -36430 418781 98010 237198 152180 232757 56478 143050 32384
30132 99790 -26234 221270 -179316 200704 82127 256683 -97756 -335108 109318 178915
30122 178915 194175 -90776 -121263 -181003 670406 4485 29914 138606 -161206 -93790 -44413
30110 118481 -66380 -264274 58471 -90745 294586 127531 151953 -153517 27726 122435 194220
30099 194220 314460 -47341 98325 -221517 -95356 49914 277587 163728 -220400 481920
30088 119112 -127260 141548 23387 12634 -56775 57234 283735 126872 49063 64421 -119829
30076 -112863 108711 -65543 -36117 -214686 50497 -235494 -26330 114710 -15407 31521 123358
30065 123358 468 311803 36563 252983 -193317 -24219 135637 131833 360561 -175998 48277
30053 -87948 -69707 136949 -155897 269312 -10091 -349145 242173 -337333 -42657 -106606
30043 -106606 -131903 307479 -82603 48324 147169 140636 -160031 -102163 -321481 -73560 32587
30031 -6717 93776 228828 125590 -194067 112655 68692 248472 208223 -111576 -392064
30021 -392064 234805 69075 -111992 57601 182524 248266 214206 53098 -21325 -16965 90670
30009 -83205 29705 -61247 -39896 1274 27180 102816 -21777 198316 94833 -29444 72516 5518
29996 -9344 -1803 274932 169286 -276621 -520842 -94766 -140283 -273566 236094 -135436 -255811
29985 -255811 -37398 -110154 9382 -7778 -148956 168764 -147795 234401 136412 -53766 -239872
29974 -239872 32047 -82986 -253629 -55421 -22902 43546 -97353 -332039 -2910 40191 -244980
29962 -293692 230740 280941 -169929 -73963 -117917 48802 -114779 141245 -178058 64210
29951 -128344 -232327 -140028 -208376 58155 5411 48125 -173558 -29577 78803 -44260 68632
29939 -16914 138234 -192646 -106362 -272632 -38217 -170510 21824 -22575 -61528 23278 270494
29928 270494 -278474 -31426 -90809 -191720 -203683 -38127 379695 -47456 3366 -318846 -64739
29916 -210642 -86072 -134294 -231017 37863 80008 175116 -15738 -68138 279161 80180 -78581
29904 -110340 233737 -186031 115178 -95855 73826 -162670 -293175 74832 292320 48144
29893 106607 167219 -38846 120702 -135996 -83918 -119455 2970 -43784 179104 57291 402425
29882 402425 -220046 25565 36943 253129 27083 -154982 -108659 150902 262148 -63832
29871 -209037 9113 -185755 -71439 -105817 52859 -119757 17325 -308295 -115434 190528 229066
29860 229066 -101765 -35489 -277816 185990 -152797 189737 22011 165925 475310 -27819
29849 -125122 298602 76414 -44521 45810 160262 168398 18202 281712 274241 219510 21484
29837 -294621 -244003 -93631 -211639 -6974 85407 180048 -48337 45985 55459 -264147 278209
29825 127658 25161 -175772 229771 -60263 -247311 -110288 -7682 -81598 -108864 49442 203211
29814 203211 -28667 -316684 116412 -190132 -152956 38707 -252709 -2179 262993 165487 -78735
29802 121562 -38282 79055 101636 188401 -71520 2895 155361 193088 -56592 -168804 233034
29790 -151122 -226580 -215512 -294601 -134507 239448 -36376 -117812 218754 -144813 -131177 31813
29778 186798 -100836 325394 -62122 -133970 38020 45411 -43300 -169947 -14029 224410 -82641
29766 261718 31850 270570 -57529 133221 -71174 9446 -48687 136597 209435 159780 58631
29754 -199529 -136114 -21316 342368 38066 -68026 244878 10820 -151522 -103176 216082 -44952
29742 -250642 -227470 -217897 155264 283808 201349 -21092 73434 -193402 107142 23300 -18590
29730 -56358 -105504 -239587 72802 -97049 116533 -2715 68089 245277 111361 -318173 70504
29718 225454 220422 197673 -113350 -97223 9007 327494 73812 261779 -124167 -98543 66720
29706 85043 296301 -198742 171962 237157 -317683 96271 -121783 92295 14492 20513 -321377
29694 29190 -203206 -14632 -172757 6879 326653 73124 212087 -96103 -88798 243920 49918
29682 50726 -7107 80329 54955 -99044 -127872 330740 211513 82524 154953 226779 22479
29670 191794 -117694 33297 547943 -122203 -342580 139010 -270240 293168 140120 71766
29660 71766 261358 69182 -18780 -106072 303154 -45436 230407 9404 -147089 -36647 136265
29648 342100 45382 -20390 38664 74107 -29031 58621 -7947 -3409 -91929 -166469 162218 123331
29636 123331 -264963 -41878 -62190 185718 279895 235412 -8777 -158119 -75707 -87627 -45730
29625 -45730 78106 98946 30399 -83665 -245860 -198413 -46164 -71998 240435 -21466 -159034
29614 -159034 -166173 335063 152052 61186 44554 -157024 -164929 -186123 124689 -87422 -12401
29602 -15476 286030 79183 196345 468281 -6956 -354782 131712 72165 92424 -11639 -60737
29591 -60737 -84930 231786 -96315 -128289 67211 46100 -189193 -113210 222388 -124027 -17753
29579 -237479 154597 101157 -107104 -1030 149479 99127 309218 207167 56470 61393 -16056
29567 195739 53676 125389 225312 314623 195624 275631 153182 41794 72131 254560 -302600
29555 -3964 -43737 330533 86932 155525 181382 -20867 -86087 -142588 136641 -21782 -61828
29544 -61828 -113915 141241 183385 105276 -142622 -47605 -24937 56394 170882 -60396 -253049
29533 -253049 80650 125234 243651 37232 66943 -157311 -44431 93345 225551 167904 137606
29522 137606 -7868 45972 -28254 92751 -224278 74264 88659 -244308 29114 59838 38420
29511 38420 131587 37716 -182689 88328 1593 -2169 -2681 46174 25235 -359157 30869 135534
29499 135534 -236496 102426 196929 201161 144922 31058 -207696 181094 -10520 396418 182770
29487 5066 -21129 64055 235583 286359 231107 210981 -153766 -93966 189883 180564 -141307
29475 173383 -106175 123793 118463 318634 -119333 32758 75425 -53833 60261 -253635 -134924
29464 -134924 87616 -341808 -45007 278826 159890 -20915 -308478 28745 152785 194016
29454 194016 302123 184515 46131 147675 -13542 15487 -39043 57416 44933 340053 499475
29443 499475 196849 380410 -163495 -103982 3622 -134752 -22182 -70960 42425 -70566 30005
29431 40538 -28423 74774 222290 92861 322751 31936 106600 -81891 -27516 76685 -153891
29419 -217764 56583 13728 61012 -99815 180265 91901 80806 305629 228827 35789 159574
29408 159574 -152682 -130141 -29655 -37976 -24885 129504 -80589 61206 529581 -142267 130170
29396 69620 -57994 178572 -63068 -199923 -282129 54699 -86916 56967 -68101 43986 269825
29385 269825 -2537 141263 15977 73098 162179 32666 2648 -71384 6520 -68094 297130 49460
29372 392891 37388 -15037 -331553 -9092 -2233 240701 82135 2406 -259123 261035 -491657
29360 7634 13157 137599 186849 160208 -88408 128712 45978 -56718 35475 159319 9221 153299
29348 153299 132080 -220180 103396 -90623 -1795 -40991 131019 -91278 -134270 202557 -104451
29336 151884 47797 -1126 -212832 -228487 -167216 330817 -186855 -134140 281371 -11964 -189101
29325 -189101 368303 99609 272040 92488 268533 -113299 396601 158045 151207 -134047
29314 195138 -14651 63061 94352 -189119 90769 8873 -96236 -38701 115968 24403 165971
29303 165971 -591777 45867 269959 -157353 48700 20315 -89958 -115193 -136444 -129084 -189198
29292 -189198 -76097 349362 136780 186168 15595 -272559 149348 85175 231276 175018
29282 175018 5377 -212613 212447 -76837 -168078 -151230 -18704 -142553 -132365 138744 -82170
29270 -83330 -53694 -265283 -33855 -27708 359408 266003 96876 194666 336079 268439 -29041
29258 91601 -214435 -138944 -104915 64978 -246572 24486 -105535 -149724 -239049 -245402 -124262
29247 -124262 -10024 38964 74141 -212409 52565 -42288 80347 -230432 -174067 -346285 54724
29235 35737 -303310 190585 -152174 241788 122382 -137041 193426 107355 149658 6162
29224 -7421 -105453 168439 181233 -6095 -288148 207918 -91379 279525 -17624 17120 62560
29213 62560 99330 214033 -131121 -102903 163165 -65890 -35592 18900 187003 -160775 -89391
29202 -89391 92278 454825 -184595 -241768 154670 136536 318517 -7222 47156 -118054 20563
29190 36620 242295 365718 126140 50144 -134230 -145420 150908 75937 -15849 117383
29179 -288493 184785 46009 -123741 111568 -59473 139677 -205819 -136996 101569 119726
29169 119726 -292670 234127 -261804 -34829 189809 196785 110323 -4952 219367 -73626 99103
29157 36040 -22673 -401869 206898 -199569 -34790 -352964 -212255 82516 -65666 108853
29146 -12937 -185526 118692 -43195 -114152 74033 -116007 113797 -78285 444053 -82480 -91533
29135 -91533 -118416 -105187 -100577 106830 -83475 -104337 -123446 169304 88237 176314 253589
29124 253589 189185 -49385 -110939 -105857 -54471 59921 112748 347418 184296 63933 -23377
29112 90705 -33610 175341 167208 150128 182808 217837 444080 112036 -50415 159599 80674
29101 80674 70093 -28765 14476 183703 -188498 -17943 46084 -155232 -88607 -266543 401602
29089 -67029 63651 -129984 82326 -89515 42678 522503 186445 165662 -128421 227085 139378
29078 139378 186421 16249 307622 73278 -67132 -9299 120650 475346 20723 111865 -29374
29066 -29587 193815 -103033 20423 -911 -70324 82395 98092 -48042 224134 -96015 -202603
29055 -202603 -7444 405694 133741 123985 368541 491066 43350 36228 -44271 71522 -123940
29043 -78718 34435 194431 -56383 62855 110579 -36540 -61666 35643 120096 161919 -57157
29031 48835 428332 48094 -227553 -201063 -131662 38681 -158947 87094 144122 -217737 210036
29019 -236526 139954 -198489 112325 127260 -184144 39428 15898 -195614 -49516 -30533
29009 -30533 -211563 -59744 36642 8829 174920 -7168 52887 -146405 18619 80825 -395437
28997 157463 108709 207303 53721 -62750 -108486 -140019 -116875 82208 -102285 -51730 102012
28985 113794 -128517 -211342 166685 -288746 -39911 91394 -36634 12245 64228 150011 -244134
28973 288393 272603 -52263 -248557 -275304 -103892 10413 178196 138452 -79479 172424 -56854
28961 44199 202011 63994 140176 36158 52701 -216060 -5549 28779 392924 20718 -13896
28949 -38411 213911 -16780 -221533 134210 -21826 140337 131364 87298 51100 262748 193511
28938 193511 63521 64340 -127794 48637 25960 130480 -21750 320167 277218 -136645 257211
28926 60682 -57548 -265867 -175156 5620 189210 125283 -91480 -77668 -470013 -10796 173809
28914 109110 75145 172409 -11579 11462 108682 82394 54928 41778 7781 -152396 -135796
28903 -135796 388734 246811 -138320 -296776 143519 -20626 168818 81046 -172237 405575
28892 88823 -72345 -61111 53744 159214 36979 355170 276790 -377979 -152652 262791 -124
28880 147430 183366 -136084 -287080 -173031 286383 -57598 -65901 16104 162311 101109 -13386
28868 -233490 -73760 58584 119140 270433 121912 24370 104706 4531 4020 -86431 52707 85571
28856 85571 -71548 -164106 -103580 92413 -168938 -119607 25276 -48738 -399334 141701 259547
28845 259547 213804 70560 -146747 -43004 159088 -24977 119374 -166805 -104096 174383
28834 -155230 9149 -150972 132221 77149 240869 241330 34808 -153933 116368 -263908 104375
28822 456469 100146 -21193 19929 150923 176487 28376 76247 -44233 -223668 191578 -104509
28810 68004 -100833 -48699 132468 179383 120646 -15073 -194872 -13679 -159474 45317 340717
28799 340717 280327 385528 88033 -342201 -176039 100649 -71563 125584 272318 252140
28789 252140 115799 -65531 260470 225467 89042 2044 28879 -87117 20211 -30284 -173291
28778 -173291 223683 -293224 -242547 -204521 254567 -64934 8389 206907 -112966 115532
28767 160413 -30750 -110177 210296 126806 81180 471796 -134625 5183 -93036 289493 -126122
28755 -283134 -32037 -120493 136684 -274882 245709 -125706 116602 338764 206429 -33270
28744 62894 431162 -52904 50985 185061 -259322 176553 328979 195473 144690 124198
28734 124198 145410 95644 30746 98514 -47473 247566 68477 -84836 55820 -24076 29569
28722 77448 89626 -45953 51244 70219 -84436 65198 -169659 -147138 135716 8739 -74359
28710 60742 5705 -129303 235561 -143707 -200845 103259 -128729 -158369 40858 -5055 344139
28698 134855 338709 16890 29167 -84153 369136 -96781 -6578 -41218 64011 265807 -233842
28686 -292931 -404821 234417 73890 233507 248431 -86785 -67257 540 -67709 -130951 12263
28674 -9174 -164031 316788 -204007 -58911 22125 -287595 360880 131675 -201476 -105986
28664 -105986 -107526 -158177 10188 201909 16095 17256 269067 11229 344905 344062 199915
28653 199915 185132 254990 351327 -36866 -227224 -109942 -424338 16886 -192191 -280031 -6313
28641 70131 -27484 155759 -52654 146754 93686 -188159 111359 -107438 4416 -32282 -9829
28629 77879 131542 164587 190565 -114763 -46680 323324 229429 -290858 128674 246286 33724
28617 3353 -8933 -10980 -55252 -200541 -190722 -299190 51596 -93465 159391 214983 126684 -62726
28604 7534 -325049 53161 36303 -45080 -148477 -45220 184073 -136350 -103780 -69817 66165
28592 -140179 262214 67375 284514 117089 -175084 -101309 -242262 -115856 234237 -25862
28581 -98516 125005 167947 -77989 66859 133599 -208800 187454 283769 -205907 1216 225984
28570 225984 -211172 -15335 145922 38748 -85477 146224 104277 -154004 434062 252860
28560 252860 -120367 232638 111317 10665 -159117 3724 -56510 -65135 -411973 -79820 88344
28548 289773 -72127 283433 99738 69475 71523 88996 212298 253734 186216 140007 -166 120413
28535 -178873 162557 -312973 28723 -299548 -36551 48048 227348 271849 274124 -8281 609256
28523 -433291 -296297 -67576 -306105 -287644 -183617 -98282 3104 -106835 -6299 248766 -282983
28511 567029 89680 -3419 -19097 -246247 227018 110669 464751 -73711 168402 122643 147278
28500 147278 -101063 288364 -104193 -24852 72645 376174 98097 88672 -453702 -126988
28489 262175 240691 10255 353509 -235836 83434 356747 53216 -113948 -293291 401988
28478 175831 69176 81466 118482 -386691 -138883 46254 213185 -6225 209435 -40056 -250256
28467 -250256 54635 -234144 -28253 380897 -157833 36115 177604 75391 -22230 -5562 27812
28455 156458 -66555 248186 -42368 156805 -29516 100910 52467 360527 -36042 -145934
28445 -145934 -217012 -82885 63340 -171849 129405 162238 198828 -156969 -117506 238963 420942
28434 420942 -92951 192778 33518 -208110 68884 196357 -19063 18260 159153 7000 -84832
28422 -150989 -143972 -189096 216851 338014 188211 79327 135210 -90066 -4257 -245107 307374
28410 238298 -51361 11292 1703 -86135 -304248 318680 109091 108397 18644 38310 -240160
28398 75313 181540 221492 -85502 -77998 150232 67149 -71026 231792 -255082 -60310 -48554
28387 -48554 336282 -155087 -306988 -289882 -213395 -124370 -2469 91194 308855 -317632 -6797
28375 -84555 201886 11881 -51737 -151032 -67550 -122017 -374866 3412 28678 -8989 -43988 -307759
28363 -307759 87942 -2002 -178986 140481 -55584 105840 124687 -135158 304997 79543 150268
28352 150268 57420 326943 -22323 335001 272756 -152935 145420 -8843 -31681 -87540 76352
28340 102068 -190349 216516 21525 -30298 -71730 -172764 -213576 267151 -129747 -294708
28330 -294708 36159 -63023 41010 -109172 -259637 250194 -37668 182748 225606 -368356
28319 -66186 66555 292700 -895 73549 -103382 134145 299520 -303145 148998 19686 225683
28308 225683 -206949 133282 37636 176780 -319555 -131027 -219842 -58130 186162 32480
28297 -257211 26363 -197590 245522 24903 17167 186728 148312 -109128 373100 37672 -148658
28285 -267685 -56760 134404 97073 158502 -233413 -170866 200969 288807 283838 226309 160282
28274 160282 306487 -114890 -93328 88669 -81398 214203 -13780 -135866 52641 -188898
28263 -31057 310832 -186148 378079 -159719 238695 173759 56165 -302797 69226 -318197
28252 -119916 -69571 30308 152323 67848 -92035 -180512 52998 -70564 -97852 15759 174642
28241 174642 147915 31184 7400 140533 -173867 -171205 153611 -243204 135608 -135610 52003
28229 103015 -187228 27204 129026 110906 -74567 182203 -32131 4911 -75420 -152490 -221562
28218 -221562 299061 -86286 -112207 3723 262536 189426 -418949 -269806 -158976 -92384 -42540
28206 -120715 244665 148053 245807 -18723 95366 16880 -16846 137831 86604 -98099 42730
28194 263582 251262 -258338 162380 200082 175531 -205099 -5434 120306 20141 -45365 54954
28182 -14123 -196755 -266958 189038 112043 272829 -70289 -188812 -273241 332263 -1509 519359
28170 310251 -66640 -82836 20843 180894 -243839 -177421 -52871 -9896 -9238 365407 126409
28158 28207 50325 144176 145583 210643 -187983 -27105 162588 16718 -168092 239269 -83524
28146 210707 -203628 -286600 73684 -211570 142125 223530 79782 211572 61320 38348 47392
28135 47392 225586 -160995 112929 -101768 -69701 -118209 -227782 -21901 -213988 -149962
28125 -149962 21557 51364 -7918 83723 217068 7263 -210549 229432 1636 161612 69102
28113 134665 304564 -231557 286983 211251 -45650 73776 -79620 -46177 -66715 67471 -22884
28101 -3703 -1130 -179146 57912 -100875 -150746 -262834 -59253 -220736 117237 50041 -45265
28089 -103333 -34493 333791 173508 368981 65863 78797 343713 21540 -84417 206700
28078 194201 -48944 489275 36539 239954 123673 238339 93803 -121721 -73247 230721
28067 -49581 -308548 -206054 163539 -3602 13711 -145313 -6246 160480 -211637 -434991 87565
28055 -37465 -49410 97631 -54746 7517 348696 85439 -172920 -131758 219733 401371 437430
28044 437430 47958 -164630 115675 21522 -17740 207551 -118041 -35440 -151023 -14411
28033 69490 -81823 40769 -75946 -110855 136231 129256 170747 156145 -26452 246032 -63067
28021 238041 166936 -28859 -108731 114654 -276382 -158425 -220109 432663 198033 68556
28010 257696 -143438 258816 -88518 288424 64566 34006 -113407 -112245 132352 16806 -241048
27998 97744 32345 139327 148122 -79038 -202885 27877 -42494 -105896 111771 -262307 -143085
27987 -143085 238653 98724 209315 204505 -31515 -211423 -134440 11299 -38842 536752 -93881
27975 -115659 -94235 89837 83 -202714 -9284 175165 -27495 -209369 204962 60027 97613
27964 97613 167651 3906 305716 -29634 130218 -288331 252843 -97985 2037 133112 310286
27953 310286 8676 58548 -169611 -126450 -168337 -58320 172082 2256 223886 -154877 75038
27941 158376 144774 180974 132967 295188 -41556 270234 -120241 -151664 -235009 101743 14152
27929 165004 40351 -170874 296623 177421 -123873 85084 -126054 83670 134604 -261440
27918 -34267 -27063 -65405 -10796 31477 160348 -117817 195037 -139081 139873 -60575 -160839
27907 -160839 42266 40708 296759 248012 90323 -47056 -56731 -261148 -285427 26049 27661 -177444
27894 148085 -163930 -113921 117191 237711 -106479 324131 -14997 -197621 -46261 9938
27883 -123637 245512 97930 -53352 429214 -19993 469501 27949 -290802 -153147 203533
27872 -50080 -462391 -39533 26669 -99799 181033 55287 -74527 271921 60528 14467 -188666
27860 -25392 -123562 213141 84290 -39899 -59242 165602 150814 388327 -94634 165423 -74924
27848 330114 64045 24783 -278118 53443 131683 -232507 -21927 155308 -195114 188547
27837 258040 -150157 210290 -45361 72278 55401 167815 -103178 -21122 -55071 -111057 118309
27825 377933 -56818 495971 -116774 54573 171755 254732 -165910 140062 -85028 -64562
27815 -64562 157875 -22300 -83874 -1396 -116507 132477 -86684 118595 -211328 62893 43692
27804 43692 -338400 -100076 -101767 302738 100259 -12940 -15234 42699 -247855 -79549 -119602
27793 -119602 -11544 1251 159808 -55808 142159 57412 -27401 -55695 140352 -57453 -69370
27782 -69370 246887 168251 -108185 91619 198055 -5171 104616 55413 22558 -272431 215607
27770 -77984 -140999 393730 -133935 278341 9448 369940 17535 67816 145791 -111659 -147818
27759 -147818 -121328 -275718 -244896 -257973 89498 -121024 -53904 158378 543127 -283971
27748 -75362 -161032 40950 -15211 -45060 -189144 37614 104703 -72341 41020 70870 13217
27736 -96401 -154488 -42430 -162224 134739 -209766 108079 23930 -87143 -345632 118446
27725 30808 40206 -175056 -135702 -44946 195796 146897 109053 -28904 -5967 -150484 -78172
27714 -78172 130079 117290 -44815 15469 146465 202059 296822 157599 52180 -4601 -287511
27703 -287511 -234927 97790 88119 137302 413414 -71950 83861 -225626 7701 188222 160217
27692 160217 -107139 -9010 349706 10749 -258098 12823 243253 -97906 338135 137388
27681 -144441 232401 -184304 48623 121560 -102354 113844 365240 -166196 76627 -252165
27670 79591 77246 -199834 106339 110206 189827 -128964 261834 27168 143659 -39901 197308
27658 -203394 207548 -101800 -128751 -147679 -9523 237442 -139074 -124226 -168627 58530 250736
27647 250736 -77764 65872 -159813 445695 15277 281244 -156881 218544 242177 -10212
27636 -12101 190002 -76443 -10548 -9974 -8698 177654 58799 -421 60159 25224 -106990 101552
27623 -243290 -134043 -69683 71119 138114 61584 353402 123040 -55330 -376213 94521 288014
27612 288014 -247048 -108807 17693 48990 218864 434314 -187177 222791 -27885 79401
27601 52601 -239134 -101957 -14982 201523 24573 -51083 164835 -280468 -49451 -61459 312486
27589 168651 221737 -125350 -225714 -218889 -87185 122485 53989 -126172 120737 -298745
27578 240144 92560 242417 98924 -76669 117038 143507 -86435 382223 9899 139374 144334
27567 144334 -50262 195508 211727 -112987 111540 -17600 139576 67759 182684 -83 327470
27555 -126628 362575 187205 9355 -43694 179210 9470 -59512 -159487 -204903 34754 42546
27544 42546 171518 13372 121332 47094 106930 184403 128728 425464 -119 -103941 39533
27532 127528 -67828 -207281 8847 -270819 118125 -54524 15992 131061 -153157 79165 -147108
27520 221059 37424 46719 -261832 218305 15029 32167 -93984 -101218 -172684 -32632 -86855
27509 -86855 -91294 19212 -382943 35669 -276696 -162992 -37321 206652 43619 131881 257438
27498 257438 68750 -245553 131792 242507 276005 237474 -48753 -69997 18895 490291 -88427
27486 305046 261827 268553 37341 224847 26773 -17953 54906 -15680 -308780 307368 -69053
27474 40882 -221699 350665 34449 27472 166281 -231323 115659 120604 -171563 -108736 149042
27462 139656 -19765 -173016 -158076 -301277 42811 106556 12616 -171928 -228018 86662 202834
27451 202834 44794 47233 -344776 92643 73318 22371 53109 -94563 83263 232674 154015
27440 154015 -190447 94648 -42629 -171715 -137196 -64816 47235 162586 212171 71756 -50161
27428 -212830 -211943 228981 -79284 -27277 159226 216317 -161300 72849 -14083 300374 263874
27417 263874 -143339 -447784 273194 222007 237662 -57776 3750 24190 250303 -29447 161101
27405 20595 321304 99878 35937 48780 153016 124114 -257850 43600 68936 -261332 3097
27393 -101468 -188672 -10628 144947 58760 52756 -52091 24118 -35437 -217757 -39733 133777
27381 59769 -298932 -71307 167394 382288 -48915 128035 79718 210760 33518 -438089
27370 -7279 439663 132011 -170886 158044 174901 181029 241495 267109 182304 -245833 100028
27358 15997 -136117 -185093 71067 20870 -348109 42860 -70176 -165275 -122207 -128565 84333
27346 86059 139271 194486 2529 193617 135704 -174470 -465033 183019 263491 5231 95503
27335 95503 24375 301765 71759 -59223 -83188 57561 -51581 41843 -63909 -50157 146460
27323 -13351 -173006 73362 17984 79508 -49785 250071 283051 147327 165465 -193655 -962
27311 -57461 72748 -89611 169094 -273008 -100537 179469 14474 -44962 -193643 -21272 -121732
27300 -121732 242683 379901 -26903 -371546 -256622 28892 283300 404442 178679 -128188
27289 26203 301943 89608 12281 -77356 163462 204964 312500 13952 -22817 143034 -109690
27277 -24481 24504 77015 256161 -12358 -74028 195670 156788 75363 42216 358821 62283
27265 200401 114049 92805 267487 -201837 -157915 -178213 221765 299988 56101 237288 51530
27253 353296 89508 2038 -120109 -38251 440527 -252272 105567 -81350 -163911 182329 51771
27241 10110 237097 -129140 -196218 266086 -169125 7821 329085 -363569 37289 382769
27231 382769 202117 206377 205814 107549 157266 -33032 -181811 49940 49141 31804 10446 22959
27219 22959 -208965 26524 111730 9345 144148 -55994 -16422 -230753 147587 -146339 -103559
27208 -103559 -74221 35724 384591 -19326 -237023 -172922 -135 180090 92496 -3897 181071
27196 -168146 129533 -320694 -218162 -6242 247581 -30784 33955 51945 103753 37884 -73172
27184 -12510 -112540 1255 3728 -187264 -143413 -86011 182391 183577 -121529 290114 2482
27172 -57298 18581 106475 66133 -65101 -239389 105386 78351 -254495 162715 151280 -57040
27160 234140 -56687 -3825 18304 -18979 137133 140583 -280508 -114870 -55937 166791 258664
27149 258664 141910 -225606 -51744 119387 74536 62084 266788 -129643 150699 42448
27138 271759 -35742 24163 133219 167353 89448 -117282 262771 379210 68049 -32152 -9991
27126 102156 395930 115055 -8343 -164687 -12255 187927 232348 179175 106964 -109936 71359
27114 24110 -1060 256626 277985 -166755 -212769 -41921 -18288 4639 -59668 -293047 133190
27102 -247480 106377 87408 -125563 -133104 142900 291903 123805 -157600 25987 -27305
27091 -65849 -345943 -42288 -19765 119077 -140800 -44347 264578 67161 75268 -290668 -85097
27079 22087 180267 -114855 273614 115936 -164325 58918 -77833 334666 130647 -11749
27068 -30833 21791 -319538 40961 -103751 102782 223385 17545 -207421 -56109 -78841 -27917
27056 -101292 213480 -322400 98971 -117142 -30679 378080 15383 191642 -182663 181496
27045 -286791 -151035 23646 -101688 44931 -44830 213802 -103158 24490 290129 27485
27034 121933 139132 112321 -100634 154934 162832 -110647 117982 60951 49310 -68671 -1774
27022 196519 -44948 245959 -283167 59693 9950 256201 39686 111789 243015 160320 49055
27010 183575 79592 15882 192802 82385 87949 72267 -188623 -158324 169865 48467 18199
26998 107049 -143595 87500 114682 -44916 -29238 -44050 -67265 58049 -179934 -37973 45673
26986 -141336 -20490 132411 -59309 142172 -43564 160927 -145961 -169748 119488 -41295
26975 355553 -319258 130297 -76137 152093 101613 36082 146133 -49840 45804 133113 165716
26964 165716 -85205 -228433 -106394 94553 169571 141076 -30844 -174829 100609 77302 118987
26953 118987 213905 5570 178043 45210 56475 719 -59798 -92007 -224585 7597 -275487 265220
26940 -119105 238341 -74972 13502 95365 -90254 112039 96296 -311951 -185774 27142 167154
26929 167154 -127379 -50386 352196 26856 191069 -86398 -52287 -6344 -127203 5211 -11097
26917 206683 132991 -303366 12131 -90492 8410 102266 108629 -162214 -13955 28475 214658
26906 214658 -122463 -153019 12311 208231 308203 -230468 -52185 22675 223480 -407864
26895 103119 -375205 100616 -216167 -101819 -77237 158454 -24896 -265196 135561 -45521
26884 186134 -84984 82134 182474 -198392 -9721 -74250 11737 362806 -7005 -165988 123539
26872 70508 -154876 -91344 -295432 68232 127353 43822 -309996 278437 -82197 59962 18641
26860 -9992 -81741 346283 512 9216 187915 133532 14806 233296 390237 -292499 -61732
26848 101708 -46111 11547 87728 204107 78775 55012 127065 -37021 141055 247865 29187
26836 191895 -276882 337918 54666 -9106 89096 -62083 -28890 241768 168709 157020 113572
26825 113572 16778 279018 -252602 2143 181864 -60741 -234696 -102035 297552 -63304
26814 152215 135949 27669 -80135 -90015 28854 176141 169322 97922 298654 -38429 -172052
26803 -172052 105183 203669 -138812 190320 88503 -161528 -453586 -139518 224821 -62976
26792 -83714 125809 307154 269609 309714 358064 -150004 42293 -200835 -144836 -153380 40499
26780 46904 -202452 88360 -6449 49185 -91515 -143937 -238378 -48632 80660 -165958 -232713
26769 -232713 214084 4527 45682 106282 -69141 -109294 -200102 18279 6574 -11193 -82229 -12093
26756 17906 102330 180894 -169499 264943 -40467 -78662 -17488 -32017 43525 44798 39783 250420
26744 250420 -180580 50565 -129287 305251 -73920 1963 -109186 100745 -133200 145792
26733 -306658 66054 -52140 219657 -49044 -2016 137703 -73544 237238 -160741 138927 157630
26722 157630 233957 120580 6563 94413 -20188 149783 -65348 32656 -26518 180357 9894
26710 227840 13685 5330 -225000 -17843 -28612 -37311 102480 -348200 118112 -79230 98753
26698 84933 322421 -34083 77865 -217786 -138597 71383 -137696 -158546 -209239 -43243 60966
26686 -38150 -136925 86308 110768 32116 68117 -159335 35170 180504 -44305 23382 -108115
26674 -106956 127097 -127763 -90172 4099 -211203 206695 -97629 -87624 217983 181054 183926
26663 183926 242413 -217407 -128527 -199330 -93380 251036 -141275 64521 -19201 -210840 22953
26651 92826 -35549 -271887 -50329 -138926 -25493 149949 -259089 -152815 -326417 181599
26640 63085 99166 -250290 24834 37732 110404 194399 150857 -72352 -78281 125626 43675
26628 418951 -33161 -257858 178802 145077 136585 -182450 255939 -48739 140230 126420 24657
26616 126330 -97373 -143859 30596 -253275 -281437 -54589 115280 23871 200293 -96509 -270599
26605 -270599 148474 -53958 145697 254268 -188500 -18909 251655 -110662 -67012 121510
26594 105691 178184 153582 40954 372960 -154988 153212 -68399 100017 -16278 20010 -206579
26582 539592 363108 90621 97083 175013 270146 123731 166899 43488 11600 249512 -91601
26570 43537 451079 98530 -1238 147535 -100600 -191360 -4002 244179 -92315 -110448 77749
26558 -240147 -175873 179573 -249490 -364056 -84324 -72325 174486 71116 37990 45778 -115775
26546 125420 63717 204037 290639 -10289 359357 -143035 -86927 427343 -148547 -6319 -137407
26535 -137407 -209263 -92939 -67900 153322 39441 74419 3737 261259 -19392 79440 -72619
26523 79624 246745 103314 -309780 -152796 236190 63347 112347 91745 83324 -42316 53220
26511 141082 -157255 -211044 174995 67161 -120007 -356418 142566 -33126 -168559 65805
26500 193243 235165 -98918 -38282 125744 112471 -156657 316723 98801 -15457 303077 -121914
26488 86240 31093 -171793 -440758 114654 -30447 -110460 146609 5437 108550 -20255 -2393
26476 156347 258167 -360293 206244 -88829 85024 34126 32105 28725 247066 -127524 59163
26464 225769 10137 308871 227681 295920 170576 178705 -7797 94544 44165 -160733 -191855
26453 -191855 172801 286952 -118975 -282001 -49409 -285008 -203992 -128702 70517 -116380
26442 -167824 53069 -185126 -266109 33589 203207 -56875 82647 -124379 -50668 -74490 -72639
26431 -72639 53430 145937 296740 -210309 9538 260649 323799 196680 152052 183189 -34808
26419 -180584 4450 -27653 -8207 -47362 57280 400744 -56615 -192593 -170438 184264 -3157
26407 -46862 91371 345305 77315 -79066 -291323 51252 -42576 -49870 217553 -52090 -192213
26396 -192213 426819 57963 134207 -194746 -54337 92886 117397 32928 -440999 -50449 -88370
26385 -88370 79849 -294428 -104622 -199157 -92708 194114 426461 29800 217517 283591 -87515
26373 64274 -7487 -115253 -69978 -177867 -83523 -295661 -357617 -76018 352411 -165057 205166
26361 158119 -208190 243667 307156 58675 -46321 59982 -168271 -232464 171762 -86532 250244
26349 226489 87036 264975 -8912 -73033 102793 129081 -108103 -7536 -231394 -110632 65877
26337 296322 69140 -220027 123493 126414 -14733 -276915 -79945 -206776 -156009 -203621 -129154
26326 -129154 329546 -6088 15989 -178894 57305 47687 7471 -325236 -318346 93775 91358 -74174
26313 -198620 63287 85568 -99405 -301696 441426 17739 -54170 -139114 177290 -18245 178593
26301 132113 208037 370851 -141567 -72973 238166 -81731 -190892 -237952 -45082 -88569 60834
26289 -222913 -272425 17857 144759 103529 132847 -119458 -204808 -156720 38448 117920 177813
26278 177813 304940 -20410 130083 83082 -115984 -107109 116431 -34116 -10875 81757 -317150
26266 269943 75820 -46726 75270 27733 -102806 -474830 300822 150515 114117 256219
26256 256219 84332 38510 113955 116994 308430 -174960 85749 -125643 150213 133428 -9328
26244 -76294 136447 80378 -59984 5688 -284671 -154345 94563 10289 11184 -9023 404259 -1536
26231 185726 127106 -56387 -49353 -158184 107979 213146 228995 133259 -167263 -6880 262622
26219 175317 -24268 166283 220228 125282 71417 302891 -21154 -373738 223889 -115794
26208 -118800 -98402 186029 -158590 -295033 331519 192583 -7012 104527 76825 173106
26198 173106 65314 163436 51869 -8904 -74053 -183088 -129900 -53517 183952 84030 57046
26187 57046 -231847 -97019 56883 9463 -110452 56419 92248 -322137 38963 -79431 -204582
26176 -204582 121140 104862 180820 -209069 -202171 -76526 375821 155929 234413 6579 81106
26165 81106 -90081 -3779 -3829 -116230 -63500 65100 -93842 -231633 458690 115152 150022 87853
26153 87853 -170700 162739 424182 -81568 -151192 -167593 32233 -377425 194561 134063 138392
26142 138392 -34547 257880 21745 -396442 56036 418173 -146322 124020 100925 316264
26132 316264 -129852 20240 -125472 60401 152133 24252 434939 248284 168451 152616 -110703
26120 4802 -98271 191852 5984 -250373 14849 91505 -212315 26958 -199189 -18160 349417
26108 104167 38053 269568 -33455 -135893 -98712 -5467 -85552 -146356 182042 212500 176084
26097 176084 -90100 -123634 321620 67572 -190700 222257 -134561 53818 257057 199716
26087 199716 228418 -222772 194417 106513 -210174 97272 60818 -87374 -75100 138801 43888
26075 -24346 -195889 -48870 -125007 -97513 -373550 -248245 -3308 -85509 109557 -45114 -234369
26064 -234369 23177 251293 9979 27069 -71252 -52268 145915 29901 154702 -195946 175405
26052 -16928 -26089 110871 358104 -127331 90224 47799 19601 80205 133360 93823 -13260
26040 218661 101254 193650 124171 -100920 -138080 -95134 -100776 -305817 144091 64439 -336891
26028 -132148 50265 278688 169726 163271 78473 311702 134036 -129360 -174564 -302418
26018 -302418 164514 -40982 -81225 -174339 -50712 59976 70013 148086 -82114 237673 -86216
26006 149737 -22888 192190 382321 27747 161365 96181 162341 80229 39316 -149599 87137
25994 29572 71497 -13092 -154711 -42957 227981 -127720 133908 376785 -9856 113835 -81546
25982 -19212 298794 55388 -171919 -113706 207937 -197015 230024 -52729 165819 84752
25972 84752 195736 20335 163509 -15903 250566 -358126 -13952 99983 -114459 127537
25961 107028 225495 302640 63845 4865 -25182 -163859 -48516 25670 -13216 -137028 -303852
25950 -303852 25096 -221976 -163319 125745 220221 402125 -255267 163932 42792 168332
25940 168332 -100463 -95205 242784 -34537 269240 -72367 43682 -261672 141835 159065 -29639
25928 -71850 431474 160881 -56046 86972 -85160 82068 165455 230149 -92170 82245 90424
25917 90424 -76823 -106657 -132127 -19804 3864 113024 -83977 -241752 247602 259546 52366
25905 -108150 95851 -102760 -177684 126062 -172366 -185992 20554 172913 2394 241527 86828
25893 -149943 -136946 -283192 -175386 87144 -196321 -49646 -93462 -78069 -35560 -230904 186561
25881 -136567 -242940 -70264 97743 73849 73057 89431 121799 -242924 -101953 -96781 326920
25869 143486 94277 95978 175234 162131 -160588 26303 20175 -149096 -103277 121770 13775
25857 -35225 -202585 -74344 90534 -67152 -258494 50635 181882 499953 -179054 48948 101797
25846 101797 283318 -131724 -109031 -130015 -207087 -92294 42277 235244 344648 -19807 -59741
25835 -59741 -96851 32323 -135228 -60368 14925 -103368 64845 -199235 216446 78866 -3085
25823 -16951 163965 133377 58038 419182 -110081 32430 -156760 76812 77903 -153222 232434
25811 64156 250713 -43463 120338 -278709 -250088 108 29395 -318617 160678 9376 219408
25800 219408 104570 -327360 -73689 125516 13042 -101972 106647 -228734 418295 -354193
25789 157730 234095 76923 154148 -24955 24484 307875 170668 -40298 161285 -47413 159851
25777 65353 37237 91281 -11013 132385 -158861 -63520 -422731 -275019 -62742 73261 82767
25766 82767 116157 133030 179659 76326 109162 112388 188123 223645 -30115 60396 208534 20500
25753 223313 -52573 416794 -129391 -97304 129625 144402 188050 252201 -334941 48198 269073
25742 269073 145830 -1435 79577 -76894 -100353 -252613 -91907 -133984 -286793 -256403 111382
25730 -248950 65503 -110455 -120647 -289961 -175330 16018 235366 178268 -243592 47902
25719 -9751 30397 -164654 7273 174628 1353 11847 181413 -20831 198132 240706 -127838
25707 -21867 62868 101167 61300 -362204 -8200 -62804 52601 -232270 22927 49681 1134 -84368
25694 -49092 105950 4325 -306523 -49158 61388 -152680 -142325 108440 71391 -51343 -162651
25683 -162651 6432 -212983 -355152 75538 -48994 296740 213135 10888 233634 113287 47667
25671 116072 334847 39608 233087 -77305 124399 -238608 -170588 110485 77618 122441
25661 122441 124144 -20444 216185 -44563 254907 249632 61626 171323 252447 84864 -49437
25649 -83961 -168890 95416 -45380 2469 -271348 -9396 -86464 151539 306559 -120176 93078
25637 -185416 -80498 23102 25584 58816 -9037 129703 59958 162479 235585 39075 -126104
25625 258599 104052 -207889 22254 139518 2834 97860 -363861 -172183 63141 145678 -143945
25613 8910 96943 -360120 33462 45801 236777 40118 62072 246528 171648 -409858 98919
25601 204897 -4033 -49658 -251391 -121331 183276 -20334 175275 -234571 -128676 -164522
25591 -164522 -42260 40320 12297 221737 -92938 21675 -90887 148950 339798 54166 -38627
25579 9162 -290834 38285 -101793 -12873 -256443 -4313 168601 6525 54937 109946 -43623
25567 -207465 -233237 -246575 59163 145977 32931 -73391 54704 -105309 189595 157635 92896
25556 92896 323472 -201818 -100878 -45848 270080 35059 80741 37924 -148388 244064
25545 -70604 -109835 62608 -70983 -111277 -6935 -16009 -11626 -118407 -22076 165087 -76029 -167401
25533 -167401 78659 -65234 -5278 -45176 -133795 25540 -211695 158709 69949 -164346 -271173
25522 -271173 -54401 -142357 -52198 137235 137451 58419 249381 84487 29475 53509 -351883
25510 -561343 -222572 49265 180442 -36261 -16367 443391 217733 -74781 -125828 -15395 98449
25498 132915 24562 121296 166859 389931 150549 35755 -70948 -114370 359130 5402 -315612
25486 65408 -5626 165418 -143595 -24329 -149947 -60243 370886 4511 -2786 24818 273577
25475 273577 -64614 16187 93823 12922 190969 -178682 -37724 -318626 -30888 263963 -240352
25463 188431 -63873 -8344 171498 -117600 -138189 121028 -110119 67385 -292434 -11656 -188161
25452 -188161 -56605 -89979 25805 78267 89466 131082 360974 -195454 44038 52802 -42118
25440 68649 118845 -25055 281030 -102505 193057 -210097 45555 156087 -40824 -8870 75446
25428 -67163 107863 168042 -133974 -112242 -54600 -147106 29499 -199172 13359 -15301 -312149
25417 -312149 75030 202883 -130363 26505 -7778 105676 -292844 35902 -82171 -293741 225135
25405 11236 166369 -109309 103287 276994 262276 339699 -11900 -311029 -138288 -53959
25394 -282385 58007 11976 97089 62172 60329 -68408 -10229 -8791 -186328 198412 151268
25383 151268 193067 298467 427923 102851 29728 -174454 299469 10196 -226610 -338330
25373 -338330 142678 324345 -110763 -374944 249354 385840 -263604 287633 -198662 329938
25362 -579420 -57973 -226065 246753 40752 49946 39646 981 -1761 28848 -254884 -349278 -1193
25349 239243 -270013 216331 188486 -11778 -158658 -126932 -41123 31291 -74328 314665 -116464
25337 -87979 33627 -469300 64668 -46708 137920 110662 -141451 -198268 -25373 -193278 -88650
25325 -19892 356155 -370034 -10742 -45107 -111587 -205378 141492 60197 190934 90714 52629
25314 52629 -38885 -61586 285177 -277982 200141 212485 -96803 160841 -5478 -4248 -344052
25303 -344052 -100225 -337482 65258 169709 -147392 -140179 -134386 100970 169906 -33490 -252508
25292 -252508 154913 201205 57684 33222 63272 -66586 43323 -13729 167915 215554 -119993
25280 -237007 -320869 51515 -96869 32983 -196210 227375 -15443 321885 -101706 124198
25269 71476 251893 385914 -36176 -137716 445980 22205 167024 11297 -81282 48810 -169838
25257 156160 282681 -126069 -22818 61099 -153492 205711 -50050 84109 -42881 -108050 -328193
25246 -328193 -62299 93842 -38180 54910 244509 -83114 319445 -48130 -151485 -34448 -15492
25234 -7141 -163924 106298 -102878 48418 -70079 -51362 -151730 -5707 34579 -177543 28748
25222 292926 -175438 -272908 124516 2888 66229 26932 173624 65132 -34240 251441 -158823
25210 -213024 -38491 13615 -167823 134106 -6033 354358 -106867 9987 140031 249400 237180
25199 237180 -13166 171815 -176992 96299 65124 -87185 -22201 -375503 176523 63280 -33330
25187 76337 -108996 152478 120268 89982 133879 179617 -4962 164466 81733 -150215 -184053
25176 -184053 -219258 21632 -277258 -181274 -21187 171857 -43381 89257 151345 -125350 -66881
25165 -66881 416159 114186 186858 -7789 126540 -61720 -159090 -62391 155724 26759 230470
25154 230470 37757 -241685 123500 -140302 -50554 83913 127723 -157972 -455560 -43970
25143 -68044 37827 -92744 162903 101925 -105610 -208989 35527 -4518 -187651 -57117 3338
25131 -243700 145654 -57029 187935 -65032 -5021 100933 -43889 41563 84482 160959 17970
25119 64771 -44020 382605 113980 28041 -84327 -193249 25531 -56686 161228 95485 45804
25107 298785 -146571 -313980 173640 -183986 44660 29102 -47044 -31159 287160 -59809
25096 -38902 -300831 -361666 39650 -204043 -18540 -56205 -133052 230635 -270118 249080 -21193
25084 -160624 166296 -286546 -184526 -31158 27129 108400 2088 -143083 285485 131066
25073 139281 -33568 270765 142573 -69266 105008 9605 80439 74010 53525 -305133 -20566
25061 -40653 -64007 -162336 -80411 -418390 85039 -33523 16298 115138 -26078 -46047 188198
25049 -8407 -3027 276701 11869 -286383 192692 -142421 51266 -282298 89960 127455 -37101
25037 32564 95934 63216 31842 179815 -151451 14398 305855 103333 -319004 11911 -189217
25025 -279398 115336 -33380 -319511 -54295 12158 183458 181933 -418621 46285 150160 14407
25013 218248 -170507 377012 -82127 111357 -33876 -2140 58141 75013 56789 -38806 90814
25001 -279485 -33574 94956 -53970 -182009 -6888 78182 -46428 -285781 207248 103665 48545
24989 -157514 97558 -134561 202110 -244295 163993 54701 47455 -155637 79052 214200
24979 214200 95371 55162 -145501 17335 145214 209338 -53009 74204 84765 10285 63932
24968 63932 -136941 -288720 -75094 -3236 173738 -148473 260620 38866 -21692 177105 -3119
24956 337704 25796 27413 -120659 77119 -55461 -162041 84578 226296 -14482 199058 -245661
24944 -32377 197740 29941 334011 -152763 -99934 -195441 -167748 -91630 -75504 150988 -210682
24932 72818 -151013 224828 8212 -41880 -22077 196073 -117318 -213672 -25684 34729 522259
24921 522259 -41048 85365 223957 60973 66692 36583 1070 -193589 -360951 -9697 110537
24909 460197 -287639 114029 42540 202323 152301 343155 168670 -57227 -82700 -187964
24899 -187964 -100101 -173508 219840 -163346 -217071 98848 9381 -305662 -162497 -164499 328672
24887 -35096 -20783 -2351 -74299 129484 -360673 -203906 341686 183569 -23051 375465 -29864
24875 -58320 -218672 296655 208957 -104462 -145215 251803 40912 35719 30260 -181760 123752
24863 137715 275256 -53207 -54970 12343 -127605 86218 -297987 79804 98143 131604 -231748
24851 27980 -34279 70179 320642 -42070 -185787 28469 -194612 -176121 -111800 -57662 30824
24839 -98022 -266477 110073 243328 60077 -134998 -37608 127696 21766 -210258 111607
24828 -10177 218410 95150 -65892 72381 -141749 -91732 345155 186056 166757 352177 84248
24816 -62814 168832 -238362 -45997 -47522 -8350 -67443 -127200 -289145 -21419 -229002 93073
24804 54171 -71441 -93999 88919 -71824 228443 335618 -32765 -117842 -137593 98014 -115588
24792 107792 149596 -74310 255280 -141782 4657 -207975 106747 171806 99470 -350761 -248938
24781 -248938 17378 279568 148859 -121043 -106133 23726 109524 -104667 91664 -280602
24770 -14011 -63615 199718 -125138 -20088 73519 128706 91044 -109931 33870 83699 -319876
24758 -27892 28810 -77623 64195 -77834 -37886 114199 157339 92317 -218967 -32114 -179732
24747 -179732 -330569 -147372 311166 -174110 249476 140647 -151724 -314397 14842 146474
24737 146474 286457 59528 -47030 317161 133216 79312 5038 -189930 -125560 -124958 -140394
24726 -140394 -20814 66239 -59070 -160877 31099 -316437 -199093 30632 -26952 -170467 -100304
24715 -100304 22556 -110459 132023 -15525 293015 -31096 -111580 65265 131551 131647 126081 -227507
24702 71617 106329 167132 343851 -286047 46380 69001 -56598 -150629 -124598 162807 -229599
24690 51760 -35776 -94088 -171847 -290364 -19280 -255632 207796 -37372 110272 -224431 95550
24678 -158100 283547 162549 275326 14203 -238812 52663 211859 -63944 -93969 -398780
24668 -398780 894 41397 -158137 871 -71415 -28793 61848 32321 -78924 175395 -199350 192527
24655 -393424 -75728 173809 -42749 -155824 -35018 30859 66556 -110864 -145335 104377 -19590
24643 294108 29788 241813 -10324 71251 -61766 -86528 -9921 -257596 -4492 -27979 -552254
24632 -552254 -257331 157163 70640 136567 507525 -127878 -133867 347517 105799 -219789
24621 -44033 201777 -143625 -765 140851 13436 43859 -29572 24082 203008 -118315 -217422
24610 -217422 -67245 738 -6691 182436 -913 245498 -53103 3025 -141742 -259074 17831 226815
24598 226815 -104110 -168120 120619 70534 -359535 -225507 -64309 120833 230872 16590
24587 185112 15417 -120590 -337498 127512 -96998 -163261 66819 45770 198768 259790 -63354
24575 -348127 -64 -107185 155327 -161779 347745 -125121 237649 -75429 -184807 -84354 -85013
24564 -85013 117298 -38609 238651 -305790 -325048 39374 39327 176737 213312 -12881 107502
24552 158236 -336571 190321 -114867 20669 -122643 134060 -119513 -2018 218371 2303
24541 153688 80456 -396766 -90605 91267 416472 245485 -168374 -111161 260951 -158391
24530 34746 187381 41749 96331 -119515 155804 -84888 3443 -77774 123679 199951 27002
24518 32508 -114602 120922 -64823 -196584 -158380 385148 205386 276091 -104052 35745
24507 359852 187178 119702 -81586 -360549 -60485 -279439 -175617 -6240 -24665 -10248 -124725
24496 -124725 159366 -193702 -214741 -5559 -209328 420337 33589 -137029 318318 40581
24485 24537 -194765 73212 93651 172150 -191589 -14612 136674 161274 57405 -67658 -51355
24474 -51355 218706 -107553 179391 -204134 -57116 75904 -68259 -212577 -40617 118665
24463 40968 -214843 -195021 21258 -104735 138132 -78126 -119780 3973 -71857 17450 206773
24452 206773 106506 196459 -78881 36375 138171 112997 185569 -77433 288743 -279907 83354
24440 -480659 -136003 185722 -303468 10415 -93924 -192581 -282162 -77796 86461 -177111 -53295
24428 33632 -125631 49021 -59170 -461975 85259 209466 -38258 114667 -321837 53644 -160946
24416 -184481 -172405 -117661 241320 79572 -52722 52208 -231454 55413 141464 181325 53482
24404 133117 336588 -129823 -123678 -63025 -125066 237995 -124823 -379573 -401071 17704 -124055
24392 -119318 8958 259199 35750 -12380 151470 24094 -140697 -386501 -48479 147703 142006
24381 142006 49831 -49741 335428 161193 -105692 36534 35579 -51049 40448 162490 103023
24370 103023 -186920 -14929 126306 -83146 -377574 117468 -90223 104134 -185416 -57586
24359 -112669 254707 -209197 -37825 -1234 -8323 87166 186444 -373854 -101523 1503 -325538
24347 205041 -80565 1239 -113190 -48396 245230 -92937 248264 79901 301159 -339575 -147575
24335 -69918 412536 -292645 57203 -3955 -245725 -84783 158170 -187777 129982 -55751 -428494
24324 -428494 69667 -217664 28199 -126899 -206738 899 -38913 -60425 -116000 136169 263360
24313 263360 -273481 -156251 44444 -315110 -148172 -412813 238146 54539 -30615 84120
24302 49430 -231663 71482 -283771 -4215 -9524 199435 223825 -48702 -182549 23277 98957
24291 98957 76712 -201153 -297280 -97104 250012 53964 -72258 96009 -89313 26995 -137989
24279 92750 36030 115160 -232243 -177975 -50410 -283983 -33280 -59383 -82866 -178318 1448
24267 137339 74958 -16727 -21434 16845 -160273 168156 269151 384423 -102245 -264551
24257 -264551 26124 181356 -51350 110314 -12793 -31359 -98191 -32472 61006 155107 -420100
24245 23494 -212981 117881 157200 -104493 -71390 99422 -89555 -128651 -209167 171679 -446355
24233 156849 -168097 -107129 -10317 -87169 -14881 62020 -283096 -62254 -97169 66544 416107
24222 416107 2216 163306 81089 -3533 -151437 123331 13305 45360 -239306 -137548 -16105
24210 180710 194039 71804 -116600 -2460 337254 -120201 -12595 143427 -211756 239179
24199 29417 155108 -105821 92084 -113991 -177409 -103738 73397 -98386 -173255 -71217 290877
24187 429914 -246114 152168 66884 130693 -124133 164391 -158517 -197947 101283 41970
24176 -89262 352764 151088 82665 490487 -22295 -152584 -96992 34238 177785 -125955
24165 -247252 -113171 1925 143001 -128096 50173 265170 55864 329420 427910 110851
24154 -241828 -225971 94302 4048 -120311 -113483 31088 -269118 -31598 194621 148480 96653
24143 96653 -182118 -34455 -31114 65197 -125841 -172870 147545 -106450 -262985 -35892 -55150
24132 -55150 112900 -141876 244250 -11914 -252216 -66923 -234354 -26304 445268 -124759
24121 -276015 156550 -184883 -68166 171795 -144061 226981 -91902 41346 94149 240094
24111 240094 199867 106497 -326710 -178304 -97941 156949 -171460 176947 152355 50379
24100 -105409 -137151 80211 -417334 97881 125295 -244466 211358 34623 450098 -291181
24089 133053 202305 -16767 135153 318747 73879 197143 156186 -66676 -67860 56259 -337095
24077 9763 126283 20229 35813 54571 88118 28988 -128095 -68206 157918 -75379 58689
24065 300604 -31201 32029 276625 157253 20067 -290033 -118792 -303339 249894 -222482
24054 -86028 -31056 -74802 -128287 -67922 213702 89012 -158528 13810 23880 -24221 -4971
24042 28171 -172529 -135088 -300171 447498 -186545 -25794 237603 319611 125866 46612
24031 11221 89168 -73981 -315554 -225848 73381 206651 -17021 -403269 376882 -151649 25208
24019 113171 -57545 -285230 -55792 -163202 -31608 152337 -89655 159850 -243034 -131664
24009 -131664 -182963 46076 112012 -221035 112381 420897 25667 -27300 363736 133375
23998 -211581 203895 -40562 -147027 -246525 51586 243506 -179804 217310 -20492 64769
23987 -69432 -282249 133035 94621 -94629 -273282 57785 2282 20895 55689 238169 -83221
23975 -101543 -864 117000 -124121 46439 -41233 -44988 23513 -368516 181395 -34306 -184364
23964 -184364 20241 143802 23290 147126 107226 -108246 -137601 -80805 84383 171878 -184864
23952 170692 -334455 13179 11577 -270412 -144623 174301 -39134 -109741 -374370 -100961
23941 -199127 321520 101755 6593 -4044 150350 -149020 191841 142684 -50751 42266 -60439
23929 84289 45911 168060 191456 -186839 -44297 38469 -90473 7589 -60599 -210243 -49458
23917 66466 -327251 77221 -191095 -226083 -79474 -93165 -227903 172082 -163073 -143484 65393
23905 115397 -49925 8088 -165434 -29055 -106034 73761 -44431 -142903 39403 263846 -67216
23893 -161725 107768 149544 -169070 -98015 -18472 31727 190091 -299316 298649 -150646
23882 6126 -19488 37544 34075 86229 -68058 -87247 360924 42576 -95310 -65342 140185 37921
23869 151871 -276074 77866 219823 -38006 -216170 200710 73994 -147410 83818 -47557
23858 125476 -185468 -4824 -177985 -223402 -102511 -409221 2721 67480 207715 -20194 -87171
23847 -87171 -159495 -82594 181041 387779 94020 -323603 149883 128855 -207975 87225 31627
23835 124231 -120605 -5154 -234696 -314063 -85697 -310619 -199764 135358 -37114 262563
23824 -79087 255916 -143958 -11222 -231198 68876 -90219 75794 221036 -133478 -30379 -56630
23813 -56630 -40851 188676 104624 158365 -125741 138953 -233004 -3584 -159867 56350 100896
23802 100896 -95950 147187 -61011 25648 -57008 -134742 -184918 71726 -215018 37071 -46232
23790 -90036 29152 162789 -2874 36603 27540 22764 44199 240438 -13447 -170120 366657
23778 -175810 18280 -116761 38904 7893 -310085 -6550 -330213 135024 -50878 -172810 -74196
23766 1037 180296 126734 -80937 -3467 296592 289347 -289793 -308567 187071 24129 -237088
23754 1471 319003 -189357 -21753 140246 -119696 33226 -81675 -86724 110486 -283808 -399205
23743 -399205 80688 162502 391583 13237 38295 -38000 -44922 -287680 -37751 -159388 4455
23731 20282 -40259 26644 184512 -109178 -64144 117709 53243 86347 -166715 -90217 17471
23719 -150214 -50812 76396 -57668 231379 172931 -67797 -37230 84132 118709 142586 -59005
23707 16932 9936 99962 -146823 1064 -52487 -367100 -205987 123853 -31173 -44911 -16149
23695 420601 8824 69007 155337 -116053 208670 52929 9295 293043 -322855 -162761 -4642
23683 -277852 88146 -111200 253647 -131521 78854 184687 80195 4423 -310644 -104783
23672 -56304 -142544 134564 -326230 62197 36507 218300 47909 59057 293001 207235 118669
23661 118669 -113922 17534 -175309 -390546 63063 -38957 -117334 -113516 -271950 -269243 -206866
23650 -206866 -16068 -25682 136029 73463 -112054 -130613 105511 -12580 420237 192307 39901
23638 -221044 13550 -153743 -68895 -111369 -43995 -201196 -297615 146185 168237 -87328 -114307
23627 -114307 102078 -124200 172970 -251535 36765 54507 -93070 -30591 195177 -318873
23616 141203 240098 -245544 -6354 244 119155 42149 -325706 -45774 -117898 -66301 -73003 -6909
23603 98505 -34507 56618 -86245 -81125 3533 -96216 -286107 56086 -51123 103052 -105696
23591 52618 -188353 167127 235983 6921 117338 -44336 78721 -808 189527 337315 159349
23579 349323 -28543 187027 166159 124204 -26548 -82794 -260654 -137845 -75932 -140218 225031
23567 -36951 185324 146174 -16224 315409 -351237 185858 -171150 149844 60919 178372
23557 178372 35566 -185725 -178816 -82934 12972 -52754 -244284 14424 -146238 29660 -240048
23545 -103261 -271399 -200405 -359823 248599 136779 -215887 149029 -44200 -180660 -230373
23535 -230373 -77677 299892 324139 133516 -40495 -66719 -201773 -216275 -49853 186588 9124
23523 -90894 257958 -52933 -214472 8651 -266850 131054 -112285 244583 215324 -285702
23512 -64427 87893 153315 -53446 73690 -88812 -228337 -69105 -78786 -111034 -78351 -236226
23501 -236226 -125520 10411 -123575 -8260 -324483 -169317 61266 270614 329790 45670 -42483
23489 -45094 -97940 107546 -436329 -70066 -105986 158777 -132141 -102484 -225264 215052
23478 195537 -220243 -101320 -40828 248974 -154816 85220 -154003 -172506 -204229 -108378
23468 -108378 260360 -241152 -301668 -178441 -61160 -202839 105329 -68305 51928 107724
23458 107724 -282216 -74676 -137092 -65231 -220872 -139325 -232587 448 108248 -179881 3180
23446 177152 -109708 -260813 -6140 187780 -23510 -76149 -215164 -108493 16716 154713
23436 154713 -89881 143412 11302 17508 236474 87772 -303885 167569 -241539 -418652
23426 -418652 -132262 -203819 -235138 156531 -134345 -20320 -137138 -67847 -148329 -196969 -159865
23415 -159865 96961 26604 89761 46421 -94243 162663 -131420 -189973 -82574 -199325 51623
23403 210152 -342010 64626 -10447 -192727 -53121 -18035 169663 179360 9697 -317021 -219830
23392 -219830 -133672 -170441 -63411 261017 193110 -221624 -271543 -15799 48795 26868 -68370
23380 -242298 279528 -188666 -234811 -339164 -181469 -132884 -126354 -18665 -159218 48744 201073
23369 201073 25158 45313 -237621 -12816 219920 93630 -9044 -55992 -66584 276978 -34170
23357 -145879 300389 -39682 -15235 -265651 -128947 479822 69780 84074 42783 -182800
23346 -67648 105874 59135 11019 -225874 184719 -60900 150814 58804 -465534 206133
23335 44362 95665 148744 -162574 259183 -201473 60754 -329800 24395 -166651 23026 352674
23324 352674 173224 218606 -27914 -28104 -99829 202552 8779 182006 -331494 -139430 -127388
23313 -127388 -84129 271705 -43615 38752 -9001 -27243 180401 189939 -213289 -137341 -320205
23302 -320205 -100521 309549 19852 41441 -14199 52408 -249710 137780 -133336 -2262 100643
23290 101665 -97184 -17937 152635 -52922 -68013 223310 9541 36491 -17595 -285416 -202885
23279 -202885 211475 297872 -179516 14386 58596 17136 -108559 69686 -291738 -244657 144099
23267 43526 353263 -112275 47022 125536 -115997 -70937 52002 -75899 53590 74550 153400
23256 153400 109471 -54100 -4976 348033 -27615 43665 278632 -397796 -138334 164044 -19336
23244 -55586 -229012 98196 341316 -183476 -280317 -179144 -429424 -167476 -10637 -153854
23234 -153854 413850 -66740 -100079 -307850 -37408 148932 -68626 -281067 24333 -153040
23223 -102593 -59596 -118457 46534 2646 -16695 -261374 -103114 58443 184492 -692 -65808
23212 -65808 -20314 -380676 -76358 6579 15454 112045 174170 185785 82538 -8662 -87320 -259990
23200 -259990 285546 36535 -37098 -46576 -149302 134931 -341584 119946 57714 -391576
23189 -141596 -326708 -15805 -204146 -286568 105721 -249024 -248923 141331 291692 11196 -224373
23177 30199 213785 -174473 -78030 -187222 34618 29810 -164308 16488 -219804 185615 -517960
23165 -14568 -81962 291882 -35363 -307513 -118318 -66949 -121309 -270379 -50222 -102988 -3211
23153 83591 -130862 249615 206044 91152 22759 -39298 226029 79343 -98254 188561 134345
23142 134345 76724 -346294 -151178 -181528 -95690 -410575 -152274 -287020 -293604 341141
23131 86195 318682 396779 8673 171440 -322369 125538 -305603 -137401 120810 -118422
23120 167227 214988 218410 -51216 233168 -21508 -157355 -185905 75479 -289727 -138778 -225581
23109 -225581 -49297 -86485 -299820 127406 30334 111461 28312 -70406 -147666 8174 194922
23098 194922 58711 14621 123593 -80023 -232244 -122939 -112638 126793 -97358 168897
23087 -125743 309221 -203836 46516 101651 -289779 262448 110640 -10603 98359 224052
23077 224052 289774 115106 -108273 -136154 127575 122486 -216141 -34909 16739 21620 -331364
23065 267963 -211288 292057 -82582 -127618 -8570 231957 -166155 181356 -63316 239 72094
23054 72094 -129301 303157 -25581 137452 209903 -458928 129150 -319074 54301 -37151
23043 457771 229448 -9378 65141 -40737 -171597 406601 -12328 102361 -181704 72301 120382
23032 120382 261734 93675 -15549 -27840 112677 23194 93771 35483 -302984 -46127 -264202
23021 -264202 258774 168981 -200316 257542 -136164 -94866 188202 85900 144897 -103989
23010 8772 -37783 -82409 -224523 208930 -29152 -98096 -108865 41439 -102155 2021 -573160
22998 -43526 -27581 44100 -13598 -535928 -153675 -70046 34661 230781 26180 -65354 50777
22986 156422 22934 81921 -291064 320111 -147049 -19043 37584 -193993 -401688 -144425
22975 80040 -125776 91901 -27889 42807 -36375 3636 -188188 -274110 132185 -1215 -107684
22964 -107684 257017 -58299 -336335 -209822 -178639 287303 -151320 -58746 -117548 185190
22953 -3439 -79212 457261 -224563 -176651 -262861 231080 138654 -37232 1993 109608 -201418
22941 -73374 -20875 -73552 287779 -116541 31032 149584 -52063 2806 321765 257793 77909
22929 -190125 -258662 -73207 113124 202006 -166163 -26746 373285 153756 338556 95891
22918 -264154 192355 -183667 89287 -193269 -169488 -8533 61810 43272 -98907 -8091 -340352
22907 -340352 -73354 -162419 145446 -246287 194597 92432 -177715 178768 196661 -236484
22896 30984 102833 -10279 78263 22395 -39695 -237509 120022 -22635 -37024 -304840 -313191
22885 -313191 325998 -82396 284310 -79857 16152 -74985 -37245 -104498 -129178 -110830 -197154
22874 -197154 152194 -195160 69042 -185937 339263 -357989 -246546 5144 387626 266422
22864 266422 -203168 227484 137707 -304623 82355 -57387 155227 -111062 -6713 -207325
22854 -207325 49025 -103663 230369 76636 98480 -184765 -77471 -122781 51396 114415 -191731
22842 12588 -222964 -299268 81028 -167646 -141787 -77750 -33116 -339991 3650 281526 12695
22830 -157033 -175571 50871 -46292 -151616 -235672 -110674 -195134 71741 -201680 279360 -288562
22818 188193 89229 -277001 -308750 -64399 -162540 -206624 -205507 41784 133011 76619 250640
22807 250640 -106570 -177091 31876 -178277 70975 204867 147356 331105 -42890 -15906 -184736
22796 -184736 -179556 169611 -236416 33899 -383760 -13418 116343 -261472 249824 2216 -20879
22784 206944 36842 249476 -184035 -19502 74817 -111827 -114326 -322033 -80112 82444 -372846
22772 -234703 46143 14076 99664 -13611 -237070 -114275 36732 -83646 272143 69819 69679
22761 69679 -57174 -41163 -169300 205986 90543 -266107 277742 62128 -263273 135902
22750 -110073 -197052 128886 -85445 235911 -143880 -169548 133354 96374 -19127 -70134 -16531
22738 -133731 -118079 -265696 233200 96380 -93615 -84340 214540 207232 -31695 45060 -22756
22726 106073 -85326 50801 38280 56127 -98355 165551 175453 -46968 -2282 -49114 -119939 308875
22713 -405179 -475365 -322882 65546 -41007 -51369 -269987 9561 81376 -246262 -64777 76238
22701 -71907 -229639 199993 30049 -161398 -247749 -79027 274098 65339 -46598 173641 -146729
22689 -33436 301575 -159462 -132703 139985 19695 -220385 45138 -184426 62567 -173983
22678 -121664 205764 -192326 -95224 -130003 375477 -119404 -124661 291652 32941 -303669
22667 -321273 139838 -164824 19506 133253 -230689 200306 5128 127159 -150753 221641
22656 -50912 -255632 -20606 246595 -234776 -131043 -241295 52525 -365284 -38119 -295166
22646 -295166 76282 842 -36385 174122 154062 -45617 -296945 -186822 -132720 255007 -160914
22634 250158 153950 199685 29094 -6621 125521 -148352 -170301 88666 -264496 -236365 -56851
22622 146776 237953 129180 -393143 -12416 -64720 83123 -65912 35157 -248150 -224445 -81108
22610 651 -322099 21176 -369884 274733 20735 -21925 -103145 10263 198995 130644 -21315
22598 -87763 -203967 -152929 -317876 -63635 217402 -80211 -225030 77666 -107204 -235054
22588 -235054 37585 -144227 100125 145891 -85181 298570 84198 -35530 -122729 50383 11390
22576 -172041 167368 -44858 -2704 138448 -240127 237595 -64413 -164934 -107322 208205
22565 -61220 86189 143331 -119941 250296 135559 -175589 169776 -196757 -37903 41441
22554 30483 -307108 -269877 -304360 343827 -60442 -79817 -188799 -218724 213632 147128 -209888
22542 145879 -45039 -46360 -142549 191348 246582 -148888 203202 -88071 -36207 -177742 57633
22530 -105642 182771 -90556 -7001 -123613 27403 -240010 -268102 -274974 110848 -262015 -238704
22519 -238704 107409 -19393 -288268 -43998 105282 101275 170016 -98565 -168768 -137224 -262934
22508 -262934 137507 -166374 107531 -91230 245828 -171533 6751 -171236 -65997 -68562 -184577
22497 -184577 -87503 23563 -192643 -8410 46623 182808 27285 -49968 -396681 243582 -48633
22485 885 127220 -2184 -314748 -67651 -174593 19773 -125291 98384 -108848 133071 -304704
22473 176897 260308 -82858 -56187 331018 -99398 206398 145872 377259 31944 -230103 -232268
22462 -232268 60469 328379 -133700 117165 15447 -82609 -106859 102159 -77314 27688 -62989
22450 -149589 196323 33141 166460 -16858 102816 -166163 -52241 260564 -299737 -152579
22440 -152579 20418 -225322 -80574 -61744 -59143 -286185 79635 252770 370255 -32620 20770
22428 -2632 -338369 95974 -303330 -208376 10200 131949 -392604 50153 28163 -171057 79533
22416 -118669 -264226 -21865 11913 -37979 -153249 28592 -200916 -304868 85190 25398 -98907
22404 174815 48191 50682 -282022 -24271 264129 -118510 254633 -230866 369957 57358
22393 -51831 -179139 -227827 -334298 -277793 -123414 -40926 -16395 -11295 180768 171681 193990
22382 193990 91787 25030 -77759 67810 56590 155167 -40723 -180178 -258794 -76149 -9334
22370 58420 -163294 -133893 -43549 -137260 228559 263210 -113869 -35934 56460 154240 -219040
22358 17657 106683 -155757 -283195 -75105 -398669 -110959 176136 -116982 -283813 -191944
22348 -191944 -151420 -163135 -157706 -49714 -96459 8263 -16683 -140880 -297974 35685 85778
22337 85778 235263 -263179 30779 62537 -317771 -100805 -1059 106093 17555 -177293 188925
22325 24541 173347 -36060 -178350 7390 223367 25228 -41795 -178715 -107163 -28869 145202
22313 20456 -191559 -23339 -172734 -205239 148727 38460 354253 54819 -116169 34155 -52405
22301 -269759 96523 -120306 18949 -56614 18518 -144214 -22655 -13755 -149216 -73042 -133641
22290 -133641 -63290 204865 6943 115107 -25837 -46217 -70164 -449543 -208430 93053 -211124
22278 201598 -232596 -299321 43869 140169 91354 59267 1652 -132600 175526 -16257 -405519
22267 -405519 -201173 -32673 -264404 225260 -155331 19077 -89622 -117817 -4365 -69355 -5129
22255 214097 65310 -262460 -179593 181761 -46108 76439 -25644 256325 -201777 -65884 -249577
22244 -249577 -7544 -174672 -124549 131551 -219745 18552 -46154 -1916 -29018 -19848 114007
22232 -236763 -98704 -272255 -166962 -100605 -113061 -169112 195929 -7153 -93793 -143075 -13127
22220 -73417 -136345 -193646 253746 65368 -82313 137099 -244578 -95378 72383 -192218 70705
22208 175959 -5537 267381 -30631 119539 -234731 113534 186648 -28294 -83265 -64878 -118342
22197 -118342 -117831 12482 144540 -62978 6770 8981 20301 -50672 -94408 -32538 -15411 -166238
22185 -166238 -269188 -353489 270121 -101549 -23321 -95199 176122 72051 -89053 23237 -28327
22173 -49333 84404 -66742 319725 251659 -67215 -59601 -144480 10785 -163425 320117 10029
22161 381947 -85212 83182 80729 -220071 -187687 112208 -9313 -2867 -140170 62724 140034
22150 140034 80184 32537 70713 17182 -105655 43136 -47860 120354 -94106 132287 42928
22138 -181354 -153904 105436 -174611 4855 -182912 71464 -275269 -204129 -122192 -438722 70794
22126 -70279 -49899 -22420 -106364 -209961 -138094 195289 -113821 -151308 54455 -54266 485695
22114 -198528 -73942 -243392 327688 -220832 180017 -139768 -100259 -16842 -136872 -67486
22103 58368 -62 -191083 37453 21015 -106718 -372351 -228224 327807 102454 -281013 105585
22091 -13304 -273679 11228 -178788 124400 149306 -125220 168808 -384301 -27486 -306015
22081 -306015 107089 -199483 -47831 146801 -188127 -117674 -331 38626 41902 -89938 268135
22069 -89293 -283770 130933 -100950 -207806 -222647 140239 -252369 192263 69982 144133
22059 144133 -34350 -177575 -124387 -39317 -109 -99171 -65543 141451 15433 -2055 10436 -84658
22046 -171115 116148 74913 -358325 -70238 30339 221698 -246417 33406 15273 99883 19129
22034 33479 -8991 47397 135930 103135 -139195 -18260 25956 -162259 -165758 201094 -326098
22022 -55220 -66416 -359425 -159052 -392439 -352824 -115541 97434 33710 -22936 9300 263894
22011 263894 -243476 -19797 -198446 -155120 -3548 198190 124449 166561 133824 30192 -99721
21999 325398 -482983 -152780 86681 37025 -155114 -124505 -141741 210389 -195733 45939
21988 -349408 113122 -118946 -41228 42372 -115670 167974 313820 16120 -75564 120169
21977 -287644 141202 -120563 -179234 -207007 213221 176742 -29643 -150700 -107570 46799 -250653
21965 -138124 -41073 125404 -140284 7660 -7117 -332085 183576 -120048 64582 299690 -495572
21953 227917 -363673 -179614 -424003 230377 44762 224537 -59668 -436543 120130 -106014
21942 -244223 -44686 -85767 -51138 224835 54632 144488 -175462 -104545 -196685 8793 -315753
21930 60024 39867 232304 -53005 -33833 1359 -203042 67282 37062 -192695 -213684 157199
21918 -98864 -215442 -278330 81853 -19490 295367 -25287 87868 -12603 -267458 -494398 -69144
21906 87444 -512099 -2969 -9504 -207211 -353861 205413 149418 22910 -280926 373122 -390143
21894 190976 114169 -4207 -178871 198656 -46415 -65892 82737 -58944 -92558 -26094 298041
21882 -188906 -20127 132115 -271659 -31239 -192882 -79064 5683 22279 -106309 -153769 -387470
21871 -387470 170853 175307 -35955 90383 -20192 4310 218551 63626 -191832 -238413 55275
21859 -206197 28369 -610715 -36190 -153568 76489 55907 -234621 -208297 68694 -53941 362789
21847 -67427 -269448 -160688 205310 -172652 131568 205095 58556 6945 152543 849 -68755
21835 138599 -139539 -24959 -151300 -171054 39915 99324 53735 303900 -62045 -341287 -4647
21823 -124158 -86608 -247524 -86774 236559 114568 -123345 191575 -84363 28561 -95831
21812 -287044 -23811 76100 -272907 -143617 154620 178252 151778 -310892 -57633 -310573
21802 -310573 -159655 -179101 21458 156721 20283 -310434 215754 30748 69140 -44375 142840
21790 -76576 -52824 -303956 127892 209451 58289 -90021 109241 -186149 108857 10617 -109578
21778 -84480 -162953 -276881 -189380 -105720 -298481 -72205 104435 309525 129445 145736 -115559
21766 31499 149430 143437 -127886 -335983 199875 49357 -135042 -76504 -85547 6209 45645
21755 45645 -153599 -72040 6045 -94079 147965 -172724 23748 -68958 -135218 -96924 -91205
21744 -91205 -157379 -91107 51251 215935 -194242 -111446 320940 -135240 -104586 -83214 319476
21732 36629 -100060 -179474 98463 12312 -158805 58672 -88404 -119983 -82674 -6437 -204353
21721 -204353 -89106 -27731 -101805 -20564 73410 -99574 82449 -439967 -202320 -338869 -123773
21709 -95006 201489 -17740 -69602 12929 202175 36153 -212322 -37218 -51556 -232263 197948
21697 92438 40508 288127 -89371 -30823 178265 83615 271230 -83462 -87439 203866 -180989
21685 25264 149659 -2548 -15064 -323804 -68921 3409 113523 -79107 -18726 -270623 353550
21673 -57796 122399 -159450 5005 -40833 -234724 266215 -402282 176544 176159 -86636 -213102
21662 -213102 -177316 -5916 -75244 212417 -21079 -11038 31183 -199354 -260045 -62355 -139665
21651 -139665 -51696 218695 -108271 -110411 30403 111754 -125152 -271121 79077 204776 -26326
21639 -316584 -126962 30812 -145339 -110074 -387826 145078 -147932 81798 -7967 18528 8977
21627 -209609 -216713 14326 -257484 -170513 -138093 96192 207083 -59182 -307325 374971 -39628
21615 -21369 -19849 91380 -191437 5796 -4849 80162 -63445 241143 -168715 -81372 183713
21603 -120012 -61966 91987 -302123 -88564 162095 -48452 -305149 -197585 236835 -99549
21592 159614 122838 135112 -297715 -28961 -253688 1759 190608 -287574 -31824 -146405 -229787
21581 -229787 -205352 -55915 174012 -146916 -14858 99596 38589 -76924 75225 44900 -225978
21569 -229037 -336998 -97242 -97689 -334548 21351 -121021 -233562 -148398 153560 -632 -138788
21558 -138788 -29689 -119610 -105337 -342785 43378 23111 -7117 127603 -77556 -146322 -52980
21546 -12220 -92249 100505 -234390 122824 -91335 -55425 -150880 97443 -11082 68345 -184982
21534 27966 -266460 -112376 -264540 -234558 307354 -257683 -447380 -41010 -59109 -115187
21524 -115187 3029 -199837 -64525 156018 -127891 -262399 -168939 295256 -228738 -126171
21514 -126171 173869 -106520 -57393 179004 32471 98979 -35831 -288138 242656 -53675
21503 18090 -336704 -309827 117215 137082 17132 126704 -62546 -102159 293157 98233 37196
21491 137252 -124705 41485 -77165 108719 118182 26508 -39358 -52778 -163387 -180145 220166
21479 121358 -5587 -189560 169754 -134597 304105 -97972 159169 285706 70608 -20778
21468 -260274 -82146 79915 -390945 -141259 217473 -109730 -69995 9582 -17823 63962 -202234
21456 -163497 -60125 -64619 -198195 -284321 249738 99920 79990 153513 63888 -27221 146622
21444 -123959 47494 33829 146887 -59094 117253 428376 270103 78883 -94792 340790
21433 28789 -12396 209463 235811 -117610 221788 -195886 289542 -31407 -236177 -152608
21423 -152608 24453 -218471 85103 -98357 -86478 -309454 375555 -281209 -106009 -236938
21413 -236938 -26455 -214842 118610 175158 -187440 79363 -33689 14445 -104933 84204 37803
21401 118915 -63142 135804 -54177 47633 58005 -70290 76418 -160303 -150213 128146 -54023
21389 -244641 -11081 -25203 -231499 -240827 3440 -92996 -103414 209296 -169121 14457 -185189
21377 -11461 237700 -192526 111107 -213635 -60236 -113702 -244815 -370286 212645 -179576
21366 -65091 173897 -7890 19032 186856 -37825 -183182 197828 128898 -181968 -6590 -352932
21355 -352932 -98315 2884 -40091 -398413 -253915 -112734 -131040 -49358 -25270 -72397 3597
21343 209582 -84602 326455 196662 -146360 -244179 -38732 251844 -238329 52644 -190124
21332 -160423 -332662 -146553 -78747 -118418 -272970 391846 -260678 -50917 72788 -110349
21321 242050 5344 -125122 -311838 -182030 -119770 -274315 -147784 42888 -122819 137297
21310 423312 3312 -379851 -12503 182274 -30887 360183 -256561 62904 54777 -61151 129320
21298 72907 144339 -167435 -301363 -169875 187458 238112 -38697 -34962 14433 -78480 -110804
21287 -110804 -267086 59719 -188337 -121829 -89919 -107063 141787 -238287 -223570 79479 31586
21275 -111374 -184437 267838 -108298 47818 86543 142925 -169087 313931 90353 124126 -3028
21263 292193 -25118 -82066 52502 192540 11781 -123870 -238906 -7626 32115 1783 -303977
21251 -86232 -35260 58091 89645 -210662 155250 26258 121286 207898 -207356 -195356 -52553
21239 -392964 -94150 168037 62652 -21052 107358 -14577 -134328 -37728 76020 -4362 -58788
21228 -58788 -161797 -163181 -178556 -134181 94961 -230950 71784 -101035 39800 -35989 28819
21216 -21391 11469 52134 -160105 -420578 72239 -57202 -89674 31795 -31384 -202964 39492
21204 -293561 196470 -381680 -337515 -24972 67773 -159043 -78985 -165205 -67250 -151701 -75536
21192 104595 84384 -20611 -176315 219189 -365186 -436712 -190705 117731 -260322 20514
21181 -196658 73312 -247610 -185039 -203848 -148630 -17063 10148 269633 212291 -32217 9738
21169 -12399 88432 -212983 136349 -163272 -120035 -68230 -408748 -198307 -89369 -130050 -193846
21158 -193846 -4228 114714 47953 -110205 -151882 -6687 168239 -94970 215607 -36530 17621
21146 46476 -204287 -151810 187580 362421 -31218 -271757 218815 -45918 2406 39866 -69923
21134 -197649 86390 -90336 128021 297709 -319623 -8848 204248 -399835 219571 -5384 -151788
21123 -151788 -26634 -131653 -189651 -55033 21343 -266199 -135138 -5319 -156796 -147146 67762
21111 11789 196233 44507 -184182 -223188 55625 -120392 113329 204784 -48840 -66481 -48236
21100 -48236 -315327 9957 -203359 -91634 174276 -465144 14514 54834 -284271 -44560 -142878
21089 -142878 -12579 -94520 118654 -249385 316718 -307874 235711 14471 -34868 343838
21078 -62347 -48946 -333074 -8965 110493 -74833 37688 324909 -220667 -15584 167405 16282
21066 35347 58389 -89057 -5048 -156255 74414 -109771 -28987 -293989 45339 244936 150466
21055 150466 184428 264930 47289 -155204 -117266 38593 264886 -112339 -404189 299955
21044 -379672 51134 -127753 -197712 -98486 84 157229 -23485 -51626 -7898 141495 -69696 -155048
21032 -155048 2578 -168372 52706 -104126 -243034 -2618 142621 -67572 119425 118700 -213306
21020 -56580 157628 6557 -94437 -233419 -5190 -22807 49732 -88829 -55836 220759 -93420
21008 -16318 -141198 -157579 297481 -91898 237250 -299650 78561 -97406 -9225 -177399 126699
20996 -157162 106121 -158126 23977 -179608 -126870 -153742 -157246 -131066 122409 -155396 -123648
20985 -123648 198551 169184 62908 80400 -47905 -36586 -173539 140341 62164 9883 -110300
20973 -272898 -241187 -137029 19395 139074 -204308 -134279 194065 59894 107083 -188150
20962 -12523 -136167 87572 -209351 -137241 -50949 100051 -160537 -31223 -211260 -258080 -392741
20951 -392741 -39627 -78281 259905 150633 -345133 55130 81352 67150 -155884 110423
20940 -6097 -16750 116147 26251 90630 -278794 91356 46319 -57743 236899 47399 272239
20929 272239 19987 -165326 85371 -58998 240040 -222747 22727 -240958 -449204 -145006
20918 -133817 -34610 97815 -76206 186455 53329 -278971 227641 172382 -191593 -14750 99455
20906 -182245 303772 34301 -259202 -181729 -154208 -49300 -181684 -266894 80507 20032 -47215
20894 -192533 -247933 -158694 67686 125397 -44064 -37675 -17906 44702 9159 -155684 -184711 34437
20881 -184693 -140462 -401863 -177366 -20921 169585 -54961 60072 -121366 121173 -100290
20870 -113055 -30229 144669 153474 68985 160101 -201312 -148661 40960 248833 -252789 -16537
20858 -47384 -160628 -28132 -60060 -277998 155953 40762 -59370 -148324 115651 -174574 -148542
20847 -148542 54871 -91878 -45864 251193 -531532 -252213 -135000 -202820 -280545 -56673 57147
20835 37797 167861 117879 -21437 10578 -357830 18738 -37307 -377787 23814 -27340 -213500
20824 -213500 -139081 379396 -15736 -53709 24265 208128 -338782 -166760 -13524 -115422
20814 -115422 -304060 -177079 -300922 -190345 -333134 4724 -132669 201503 73587 68990
20804 68990 61190 -250528 -80074 -111575 -76978 -170769 61829 63327 352732 106938 144047
20793 144047 36156 -69961 -205962 139640 -40399 159761 -122885 -138784 -239587 -3816 -119567
20782 -119567 -158105 57053 45565 415300 -32502 21039 -52357 -276674 -20685 -200777 450529
20770 43900 -80467 127549 -18010 99492 -336420 135934 23508 22646 22480 -259211 187881
20758 -145301 7646 -122170 -87522 338854 -202147 -392414 -88521 -217114 65144 46691 -417139
20746 -189853 24730 -17387 329582 -31619 53437 266700 -11339 -85365 -216371 -186579 -111297
20735 -111297 -145204 33040 -84269 136056 -95939 -67277 -399005 120103 -332805 -156947
20724 -225190 -4543 -233123 -137372 159611 -51909 -53416 108653 -5348 -96673 73074 40819
20713 40819 -94553 -16687 -132811 219754 -104358 -132787 68407 69117 34398 -235415 31547
20701 -287258 -27277 -75533 -157683 -23787 241908 390265 -143795 -72254 -229980 -19400 -96643
20690 -96643 -306076 74723 -413470 295936 -122667 -156019 -54125 522716 -223192 123283
20679 143740 -441745 40501 -220799 -146727 82836 -308877 -208212 -77206 -377458 46464
20668 -89230 332459 -108607 81974 -33370 -36263 -79848 28879 15448 105345 -189067 -10264
20656 48312 364245 -369747 -107161 -142824 -305084 8732 -251958 -61704 -113313 -49458 -98388
20645 -98388 -270249 -34233 -206562 -57218 54207 145188 -101947 -28437 184555 125386 100227
20634 100227 106381 -92331 272988 180241 -143928 -58164 245645 -91620 -304356 84022 -18268
20622 70647 -199284 4621 200042 51422 -199481 -57476 -185985 -222853 -211122 -67153 243900
20610 -314837 -157904 -177438 198821 -187623 -191050 -160760 -65124 -272404 -7955 -136509 307045
20598 -38797 -78494 7281 -235480 -45063 98624 -25817 278376 43016 51815 245862 -52414
20586 60220 332774 77097 -381691 140311 134750 150018 -104565 -84526 414367 11826 283452
20575 283452 -216918 158701 -84823 185011 -336805 238719 -106608 64974 113946 71340
20565 71340 -63556 -283487 -26888 -14598 -164188 -89161 -130480 -227993 12765 -138235 107462
20553 -168857 -43560 -62556 32550 -31125 -90361 172697 -183982 160266 93280 -63351 -162729
20542 -162729 -53531 -86318 -186519 259328 40779 77506 -305090 -101772 -214502 -87349
20531 10608 103483 12939 -170448 -35598 -4803 -53756 -27769 35987 82466 -374028 -54114
20519 -118025 -83394 -55328 78947 -369472 -251454 -73541 182111 172917 -130812 -283256 10596
20507 -88453 -215797 -8902 109360 -281223 41372 110299 -96531 -76759 95007 -213182 108827
20495 -231017 -430500 12612 20483 -404458 -113143 -119408 812 125099 -126368 116353 -288029
20483 -178405 -186726 -150602 -252660 58849 -37417 213661 52778 -136151 -90335 -67106 -129707
20472 -129707 -84604 -155938 -460346 185748 -234030 159389 54859 -58062 -28973 144334
20461 -147748 -18056 192074 -53395 220470 157590 80026 80179 -68468 -41431 -234197 -273550
20450 -273550 -181954 -170725 -287268 -287570 -79429 -298650 -130384 261464 -67905 323570 -139920
20438 -34191 -4909 -189499 -265134 -151152 57649 32294 150116 -105576 170985 78320 -432785
20426 -148707 17472 -397661 45153 -134506 -357347 -104475 105293 -38868 149561 -199952
20415 201443 49370 -359114 24370 234281 -71937 -211947 -33663 43241 259564 53653 -426756
20403 -341628 -95393 124040 236365 -176036 109496 -85379 -145050 22610 -116321 53034
20392 -171940 196585 -49707 -11116 -82305 84666 203735 35967 -61320 -140713 -282091 39131
20380 -146862 92394 59105 -278221 241546 -5440 -129770 254109 166854 -13319 373984 157069
20368 -78882 148238 9742 -198968 -88434 99855 169829 -99026 56773 -358559 -299124 -88352
20356 300386 259693 208193 261854 191593 -40937 -112036 171093 7818 -241181 328811 109436
20344 -329715 -193572 -47306 -1077 127430 6247 155196 233598 -277432 367977 -445321 26466
20332 -240096 -505980 161337 121114 -122222 -93520 -285732 146424 18708 -337841 -10807
20321 -157924 39629 250250 41455 194731 -96620 -305055 -326296 -128255 -159008 -217377 -156781
20310 -156781 111380 -227332 -123214 85 30981 35189 65968 -72283 44877 128404 18150 -46262
20297 225573 -13857 -58008 107920 -69411 -129656 -129428 346030 -131047 -267363 -5649 -250787
20286 -250787 -333391 -1438 -145896 -22645 120567 1885 -88723 344346 -125472 244706 189625
20275 189625 72383 -278774 62329 -202683 72893 -261306 300363 14525 161285 273148
20265 273148 75453 -10212 79830 -99642 -97534 14671 -121852 -380916 -31136 -251804 -88186
20253 68557 -348008 -383099 -161320 -20790 -25840 -220725 -68045 -327379 -93515 313842 -411130
20241 -313125 80378 -253372 -32653 -354104 -62733 -119928 -145583 -58531 -169664 -161009 2173
20229 -24543 -160826 334951 266155 -122367 136389 -145808 -857 26951 -150022 272144 171684
20218 171684 -120283 100402 57342 -173586 -67914 -85334 104227 264111 65435 33858
20208 33858 -166427 -10536 -254364 -381810 276840 -399327 41690 45890 -158611 -9985 -369929
20197 -369929 449659 154111 -354285 60074 72126 -140637 89842 -146836 -192028 20165
20186 -48794 -84388 -92326 229009 220665 -194099 362321 247850 -57156 -11895 -171169 48164
20174 -122065 -227048 -155224 -118318 -414765 -330349 -23832 -127173 14468 184748 -146205
20163 -114705 -53895 115433 -118515 -200213 3603 138183 199229 -48441 -365765 -134846 -58033
20151 378085 209963 -13627 -118337 -155872 -82177 10286 131853 129478 -63901 43805 -178234
20139 -148958 -75703 -384974 -91767 34533 -191464 -94263 233615 47651 -331774 -224762
20129 -224762 -159667 -174132 -199436 89173 60102 -76529 17333 -25400 13106 99706 -149915
20117 -302853 -141027 -408250 66960 -130626 -24854 98444 205878 197928 49705 120852 -104677
20105 128150 145308 -58180 -207026 -152238 -207226 33823 -106109 253061 -76314 -75497 -223617
20094 -223617 49044 159698 14334 69367 -203740 -41768 -216480 17980 157368 -800 -49283
20083 -49283 71307 -4320 65379 -86812 -85438 172846 143024 37615 158529 -67671 14509 -220287
20070 -69235 88119 190401 139420 -105433 377617 52275 -228466 -36821 -144390 221070
20059 68655 -209025 -152067 201002 -120379 -311696 324028 191987 155422 121955 30862
20048 46096 48180 156310 -205459 -59122 -147411 173015 158266 -100400 -188733 214916 -10869
20036 -186708 34807 -166294 -90027 105872 -13373 -256357 -179494 -228 -82822 300105 -305418
20024 178927 -493673 183272 224949 -200114 156256 222731 -573965 97701 -114231 -283142
20014 -283142 -203098 112874 -173794 30082 234348 -331880 -177289 -13029 72601 -51248
20003 -236964 -219334 -47886 -30839 -227868 66036 -149407 -63773 410562 -69026 -101636 -84643
19992 -84643 95565 -256973 104574 -192853 85525 85940 199037 -133502 -76076 -179430 -161851
19981 -161851 76838 -331556 141692 -35815 -17728 -376819 30455 -262789 -82570 -98114 80971
19969 -54897 -45018 103689 -135106 43278 -66133 52023 45038 70937 -537732 141405 -254080
19957 298447 -57731 152585 -159958 102858 -275597 -324201 -112722 46063 -233018 178759
19946 -47320 -66988 -182712 -3607 204068 108007 -179330 362285 37619 81773 -101164 -62377
19935 -62377 177638 -15087 316386 -143508 -205742 185849 141101 20379 -221559 -111893
19925 -111893 21413 291529 142516 -95360 -73062 -322041 282423 -2412 -218932 -291485 -49517
19913 -332309 -112466 -67939 -404190 77698 -100400 -40937 -187091 -167079 -94602 143183
19902 82950 52448 -331698 -200360 -165301 -146770 63002 -83906 184776 -125788 -169404 309868
19890 -107699 -70687 -315126 104448 13761 -113763 -22190 -93972 -261973 33750 -101713
19879 65749 -185213 -1341 401131 -90911 211444 375732 -77712 -76101 15278 -380757 -232449
19868 -232449 -41023 69823 160233 306788 -91940 -175942 -232893 -28430 224589 -190649 255152
19856 188475 -29646 -222889 -99749 -266014 -151407 15679 323699 198334 99717 -167061
19845 247441 177254 -21199 -23686 -431825 -172591 273170 275771 -68468 -264494 -21022 -288631
19834 -288631 -15729 -1839 -118946 42735 79443 -288860 -79697 -99237 -19756 123342 -186368
19822 49149 -243561 -89147 195030 -291699 -300017 -25793 -9676 -134033 -355945 127987 -120304
19810 -419094 -227706 -280124 -56417 272039 -262909 -111613 -105253 -410852 -24380 -182539
19800 -182539 -232533 304920 -107269 344285 -50572 636 -186770 168434 -266929 -59395 -436645
19789 -436645 -130756 159389 -340548 48603 17471 -63712 242596 -151159 184408 -335689
19778 265 95953 2906 210554 -244837 -69472 36466 365055 -352622 -174944 119582 -213259
19766 297068 -153724 4995 -6686 -330531 -171157 106951 122215 -458807 -127198 3431 222196
19755 222196 8985 81677 244656 245993 -316688 33541 -28452 -167921 -171036 -171759 -48618 28238
19742 -36947 263093 -154298 -228859 -197628 -296329 -46180 -183779 2692 46689 -88202 -127063
19731 -127063 86788 102310 -7721 380228 -27114 -327917 -6065 -157485 101500 74823 235861
19720 235861 -81344 -82574