
##TITLE=AC1390_ETIA12202_7519331_cyJpfrcyVi
##JCAMPDX= 6.0         $$ Bruker NMR JCAMP-DX V2.0
##DATA TYPE= NMR SPECTRUM
##DATA CLASS= NTUPLES
##ORIGIN= BRUKER
##OWNER= Administrator
$$ 1.72 TOPSPIN		Version 2.1
$$ 2013-02-19 20:42:04.293 -0500  Administrator@X
$$ Compression mode = diff/dup
##.OBSERVE FREQUENCY= 400.02188249412
##.OBSERVE NUCLEUS= ^1H
##.ACQUISITION MODE= SIMULTANEOUS (DQD)
##.ACQUISITION SCHEME= undefined
##.AVERAGES= 64
##.DIGITISER RES= 22
##SPECTROMETER/DATA SYSTEM= spect
##.PULSE SEQUENCE= noesygpps1d.comp
##.SOLVENT NAME= COFFEE_meoh
##.SHIFT REFERENCE= INTERNAL, COFFEE_meoh, 1, 14.96095
##AUDIT TRAIL= $$ (NUMBER, WHEN, WHO, WHERE, PROCESS, VERSION, WHAT)
$$ ##TITLE= Audit trail, TOPSPIN		Version 2.1
$$ ##JCAMPDX= 5.01
$$ ##ORIGIN= Bruker BioSpin GmbH
$$ ##OWNER= Administrator
$$ $$ E:\/data/COFFEE/nmr/AC1390_ETIA12202_7519331_cyJpfrcyVi/12/pdata/1/auditp.txt
$$ ##AUDIT TRAIL=  $$ (NUMBER, WHEN, WHO, WHERE, PROCESS, VERSION, WHAT)
(   1,<2013-02-19 20:41:58.433 -0500>,<Administrator>,<X>,<go>,<TOPSPIN 2.1>,
      <created by zg
	started at 2013-02-19 20:30:28.289 -0500,
	POWCHK enabled, PULCHK disabled,
       configuration hash MD5:
       86 BA 57 50 F2 9D 5C 9B 26 00 A9 28 5F 66 2E 89
       data hash MD5: 64K
       64 16 05 63 01 95 D8 B3 69 ED 37 21 56 55 75 CA>)
(   2,<2013-02-19 20:42:01.543 -0500>,<Administrator>,<X>,<proc1d>,<TOPSPIN 2.1>,
      <Start of raw data processing
       efp LB = 0.3 FT_mod = 6 PKNL = 1 PHC0 = 0 PHC1 = 0 SI = 128K 
       data hash MD5: 128K
       A4 99 B8 5F 07 E2 71 60 ED 86 69 E2 B9 EE 90 8D>)
(   3,<2013-02-19 20:42:02.605 -0500>,<Administrator>,<X>,<proc1d>,<TOPSPIN 2.1>,
      <pk PHC0 = 253.5974 PHC1 = 0 
       data hash MD5: 128K
       53 D3 DE 44 C8 4C 2B 2F D5 9B 19 7B 6A 8C 6F 49>)
(   4,<2013-02-19 20:42:03.308 -0500>,<Administrator>,<X>,<proc1d>,<TOPSPIN 2.1>,
      <abs ABSG = 1 
       data hash MD5: 128K
       00 A5 52 89 B0 1F B8 B2 DA 01 09 AB BE 15 52 3F>)
(   5,<2013-02-19 20:42:03.465 -0500>,<Administrator>,<X>,<proc1d>,<TOPSPIN 2.1>,
      <abs ABSG = 2 
       data hash MD5: 128K
       B9 8F 4B D1 61 84 C4 2D CC DA C5 D7 19 96 F0 53>)
(   6,<2013-02-19 20:42:03.605 -0500>,<Administrator>,<X>,<proc1d>,<TOPSPIN 2.1>,
      <abs ABSG = 3 
       data hash MD5: 128K
       C1 99 33 85 ED 54 B9 B4 CE E6 9D 29 02 31 7F 97>)
(   7,<2013-02-19 20:42:03.777 -0500>,<Administrator>,<X>,<proc1d>,<TOPSPIN 2.1>,
      <abs ABSG = 4 
       data hash MD5: 128K
       30 5A 6F 1C ED ED 19 B9 9C 8B A5 D8 A4 DE 76 29>)
(   8,<2013-02-19 20:42:03.949 -0500>,<Administrator>,<X>,<proc1d>,<TOPSPIN 2.1>,
      <abs ABSG = 5 
       data hash MD5: 128K
       8D E7 D2 19 9F 66 CE 2F 46 09 5B DE 83 7F 00 0A>)
$$ ##END=
$$ 
$$ $$ hash MD5
$$ $$ 84 26 03 07 1A B8 F5 3A 3A 37 11 89 7D EA 59 1D
##$RELAX= 
##$RELAX= 
##$RELAX= 
##$RELAX= 
##$RELAX= 
##$RELAX= 
##$RELAX= 
##$RELAX= 
$$ Bruker specific parameters
$$ --------------------------
##$DU= <E:\>
##$EXPNO= 12
$$ [...]
150 150 150 150 150 150 150 150
##$TP07= 0
##$TPNAME0= <>
##$TPNAME1= <>
##$TPNAME2= <>
##$TPNAME3= <>
##$TPNAME4= <>
##$TPNAME5= <>
##$TPNAME6= <>
##$TPNAME7= <>
##$TPOAL= (0..7)
0.5 0.5 0.5 0.5 0.5 0.5 0.5 0.5
##$TPOFFS= (0..7)
0 0 0 0 0 0 0 0
##$TUNHIN= 0
##$TUNHOUT= 0
##$TUNXOUT= 0
##$USERA1= <user>
##$USERA2= <user>
##$USERA3= <user>
##$USERA4= <user>
##$USERA5= <user>
##$V9= 5
##$VALIST= <valist>
##$VCLIST= <CCCCCCCCCCCCCCC>
##$VD= 0
##$VDLIST= <DDDDDDDDDDDDDDD>
##$VPLIST= <PPPPPPPPPPPPPPP>
##$VTLIST= <TTTTTTTTTTTTTTT>
##$WBST= 1024
##$WBSW= 4
##$XGAIN= (0..3)
0 0 0 0
##$XL= 0
##$YL= 0
##$YMAX_a= 6239425
##$YMIN_a= -10668496
##$ZGOPTNS= <>
##$ZL1= 120
##$ZL2= 120
##$ZL3= 120
##$ZL4= 120
##$ABSF1= 14.96095
##$ABSF2= -5.597232
##$ABSG= 5
##$ABSL= 3
##$ALPHA= 0
##$AQORDER= 0
##$ASSFAC= 0
##$ASSFACI= 0
##$ASSFACX= 0
##$ASSWID= 0
##$AUNMP= <proc_prof1d_extract.lims>
##$AXLEFT= 0
##$AXNAME= <>
##$AXNUC= <1H>
##$AXRIGHT= 0
##$AXTYPE= 0
##$AXUNIT= <>
##$AZFE= 0.1
##$AZFW= 0.1
##$BCFW= 0
##$BC_mod= 0
##$BYTORDP= 0
##$COROFFS= 0
##$CY= 15
##$DATMOD= 1
##$DC= 0
##$DFILT= <>
##$DTYPP= 0
##$F1P= 0
##$F2P= 0
##$FCOR= 0.5
##$FTSIZE= 131072
##$FT_mod= 6
##$GAMMA= 0
##$GB= 0
##$INTBC= 1
##$INTSCL= 1
##$ISEN= 128
##$LB= 0.3
##$LEV0= 0
##$LPBIN= 0
##$MAXI= 10000
##$MC2= 0
##$MEAN= 0
##$ME_mod= 0
##$MI= 0
##$NCOEF= 0
##$NC_proc= -2
##$NLEV= 6
##$NOISF1= 0
##$NOISF2= 0
##$NSP= 0
##$NTH_PI= 0
##$NZP= 0
##$OFFSET= 14.96095
##$PC= 1
##$PHC0= 253.5974
##$PHC1= 0
##$PH_mod= 1
##$PKNL= yes
##$PPARMOD= 0
##$PPDIAG= 0
##$PPIPTYP= 0
##$PPMPNUM= 2147483647
##$PPRESOL= 1
##$PSCAL= 4
##$PSIGN= 0
##$PYNMP= <proc.py>
##$REVERSE= no
##$SF= 400.02000965536
##$SI= 131072
##$SIGF1= 0
##$SIGF2= 0
##$SINO= 400
##$SIOLD= 131072
##$SPECTYP= <>
##$SREGLST= <1H.CDCl3>
##$SSB= 0
##$STSI= 131072
##$STSR= 0
##$SW_p= 8223.68421052631
##$SYMM= 0
##$S_DEV= 0
##$TDeff= 65536
##$TDoff= 0
##$TI= <>
##$TILT= no
##$TM1= 0
##$TM2= 0
##$TOPLEV= 0
##$USERP1= <user>
##$USERP2= <user>
##$USERP3= <user>
##$USERP4= <user>
##$USERP5= <user>
##$WDW= 1
##$XDIM= 131072
##$YMAX_p= 391142034
##$YMIN_p= -13156
##$CURPLOT= <Network HP LaserJet P1505>
##$CURPRIN= <$Network HP LaserJet P1505>
##$DFORMAT= <normdp>
##$LAYOUT= <+/1D_H.xwp>
##$LFORMAT= <normlp>
##$PFORMAT= <normpl>
##$SURQMSG= 1
$$ End of Bruker specific parameters
$$ ---------------------------------
##NTUPLES= NMR SPECTRUM
##VAR_NAME=  FREQUENCY,     SPECTRUM/REAL,   SPECTRUM/IMAG
##SYMBOL=    X,             R,               I
##VAR_TYPE=  INDEPENDENT,   DEPENDENT,       DEPENDENT
##VAR_FORM=  AFFN,          ASDF,            ASDF
##VAR_DIM=   131072,        131072,          131072
##UNITS=     HZ,            ARBITRARY UNITS, ARBITRARY UNITS
##FACTOR=    0.0627417313425164, 1,          1
##FIRST=     8223.62146879497, 1109,         -61325
##LAST=      0,             3594,            -60939
##MIN=       0,             -13156,          0
##MAX=       8223.62146879497, 391142034,    0
$$ Real data points
##PAGE= N=1
##DATA TABLE= (X++(R..R)), XYDATA
$$ [...]
63913D176081l05493k98398k87675k73684k56737k37994k18922j99979j80585
63904A916614j60509j40707j22582j06847r3272q1185p0161o0374n2259m5766
63894I82952m0179l4917l0101k6086k2823k0214j8501j7721j7117j5883j4199
63883G25211j2759j1523r827p556n276l187q94J652L928N806P918J0704J3759
63870G17956J6471J8711K0563K2019K3228K4487K5589K5748K4623K2874K1297
63859I63566J9887J8232J6321J4327J1921Q486M048n92m657q029j1035j3907j6626
63846A001942j9115k1492k3960k6465k8566k9844l0380l0570l0645l0622l0558
63835F99725l0435k9833k8283k6025k3935k2613k1881k1299k0638j9649j7942
$$ y = [4176081, 3870588, 3572190, 3284515, 3010831, 2754094, 2516100, 2297178, 2097199, 1916614, 1756105, 1615398, 1492816, 1385969, 1292697, 1211512, 1141351, 1080977, 1028718, 982952, 942773, 907856, 877755, 851669, 828846, 808632, 790131, 772410, 755293, 739410, 725211, 712452, 700929, 691102, 683546, 678270, 675083, 674189, 675841, 679769, 685575, 693493, 704197, 717956, 734427, 753138, 773701, 795720, 818948, 843435, 869024, 894772, 919395, 942269, 963566, 983453, 1001685, 1018006, 1032333, 1044254, 1052740, 1056788, 1056196, 1051539, 1043510, 1032475, 1018568, 1001942, 982827, 961335, 937375, 910910, 882344, 852500, 822120, 791550, 760905, 730283, 699725, 669290, 639457, 611174, 585149, 561214, 538601, 516720, 495421, 474783, 455134, 437192]
63824D37192j5519j3088j1493j0977j1224j1767j2105j1713j0350q361o461n254
63812C08880m918n182n448n192m351l283k372j822j651j631j412j042j128j966
63798B67482k762k478j327o28j047j910k376k436k296j785r64n83j151k135k726
63783B40878k935l169l303k962k337j877j488q15j17M7k03k13R4J00l98p95o40
63766B19867k85k37m03k96K95J070J492J191L52l90o86r19j483j879j265J59J115
63749B17698Q80J95J27P23J271J469J603J824J920J819J774J943K135K157K102
63734B39640K149K315K563L008L685M215M026L065K081J946K745L778M350M347
63720B83913M101L989M253M847N344N268M622L831L080K137R50j05q85j824l111
$$ y = [437192, 421673, 408585, 397092, 386115, 374891, 363124, 351019, 339306, 328956, 320595, 314134, 308880, 303962, 298780, 293332, 288140, 283789, 280506, 278134, 276312, 274661, 273030, 271618, 270576, 269448, 267482, 264720, 262242, 260915, 260287, 259240, 257330, 254954, 252518, 250222, 248437, 247473, 246890, 245739, 243604, 240878, 237943, 234774, 231471, 228509, 226172, 224295, 222807, 221992, 221875, 221922, 221719, 221506, 221600, 221700, 221302, 220507, 219867, 219582, 219345, 218942, 218646, 218941, 220011, 221503, 222694, 223046, 222656, 221970, 221051, 219568, 217689, 216424, 216583, 217698, 218578, 218773, 218900, 219623, 220894, 222363, 223966, 225790, 227710, 229529, 231303, 233246, 235381, 237538, 239640, 241789, 244104, 246667, 249675, 253360, 257575, 261601, 264666, 266747, 268693, 271438, 275216, 279566, 283913, 288014, 292003, 296256, 301103, 306447, 311715, 316337, 320168, 323248, 325385, 326335, 326230, 325345, 323521, 320410]
63705C20410l990l612k304j277j147j470j668j671j486q89M9P12O65K89L43J109
63689C04063K228L209L818M146M422M659M495L646K445J583J226Q31N9p00r44
63674C39186q02p49r13j083j130r15r2J447K976L478K792J779J133O51j10r39
63658C46709j261j120j257k179l548m627n030m854m443m208m376m604m108k593
63644B98501r07j85m42o37j89L36L69L57R65J870K265K274K844M226N478N766
63628C22891N443N374N842O508P070P470P752Q064Q596R247R724J0215J1488J3948
63614D39632J6822J8889J9754K0075K0728K2182K4533K7536L0621L3307L5630
63603G09709L7729L9132L8938L6829L3369K9122K3969J7703J0831M380j003n342
$$ y = [320410, 316420, 312808, 310504, 309227, 308080, 306610, 304942, 303271, 301785, 300896, 300945, 301657, 302322, 302611, 302954, 304063, 306291, 309500, 313318, 317464, 321886, 326545, 331040, 334686, 337131, 338714, 339940, 340771, 340830, 340130, 339186, 338384, 337635, 336722, 335639, 334509, 333594, 333502, 334949, 337925, 341403, 344195, 345974, 347107, 347758, 347648, 346709, 345448, 344328, 343071, 340892, 337344, 332717, 327687, 322833, 318390, 314182, 309806, 305202, 301094, 298501, 297594, 297409, 296967, 296330, 296141, 296477, 296846, 297203, 298168, 300038, 302303, 304577, 307421, 311647, 317125, 322891, 328334, 333708, 339550, 346058, 353128, 360598, 368350, 376414, 385010, 394257, 403981, 414196, 425684, 439632, 456454, 475343, 495097, 515172, 535900, 558082, 582615, 610151, 640772, 674079, 709709, 747438, 786570, 825508, 862337, 895706, 924828, 948797, 966500, 977331, 981711, 980708, 975366]
63591I75366q854j1572j3518j4948j6161j7235j8178j9282k1058k3592k6122k7534
63579G57312k7436k6508k5620k4833k3601k1782j9940j8472j6936j4567j1292
63568E26325p808m760k261k09J389K609L786N167O547P582Q361R319J0541J1565
63554E78153J2036J2299J3024J4445J6263J8302K0836K4164K8121L2345L6732
63543H06720M1303M5522M8183M8303M5919M1704L5910K8172J8498Q018j634r459
63531A157159j5247j8882k0191j9551j8065j6801j6186j6392j7860k0908k5031
63520I52045k9141l2582l5532l8283m0464m1162l9829l6952l3732l0978k8431
63509E64959k5460k2277j9858j8505j7217j5033j2421j0529r480q387o931n847
$$ y = [975366, 966512, 954940, 941422, 926474, 910313, 893078, 874900, 855618, 834560, 810968, 784846, 757312, 729876, 703368, 677748, 652915, 629314, 607532, 587592, 569120, 552184, 537617, 526325, 518517, 513757, 511496, 511287, 512676, 515285, 519071, 524238, 530785, 538367, 546728, 556047, 566588, 578153, 590189, 602488, 615512, 629957, 646220, 664522, 685358, 709522, 737643, 769988, 806720, 848023, 893545, 941728, 990031, 1035950, 1077654, 1113564, 1141736, 1160234, 1168252, 1166618, 1157159, 1141912, 1123030, 1102839, 1083288, 1065223, 1048422, 1032236, 1015844, 997984, 977076, 952045, 922904, 890322, 854790, 816507, 776043, 734881, 695052, 658100, 624368, 593390, 564959, 539499, 517222, 497364, 478859, 461642, 446609, 434188, 423659, 414179, 405792, 398861, 393014]
63497C93014n642n737n343m439l423k428j513r45p56m49L10J073J254J005Q90
63482C66871R86R66Q68J161K054L225M214M700M506L791L045K535J889P63m11
63467D01163r00p94r05j639k642l568m392m919m766m108l628l445k894j760r14
63452C59889j037j380p27Q46K058K198J982K539M193O379Q295R511J0160J0692
63438D15598J1314J1832J2229J3076J5003J7888K1136K4417K7586L0109L1321
63427F31509L1239L0315K8365K4692J9619J4958J2278J1444J1551J2672J5684
63416H44326K0655K6428L1842L6583M0668M3790M5420M5011M1997L6133K8142
63405A240995J9526J1394L812l476j0118j5375j8874k0803k1596k1866k2441k4009
$$ y = [393014, 387372, 381635, 376292, 371853, 368430, 366002, 364489, 363544, 362788, 362339, 362649, 363722, 364976, 365981, 366871, 367857, 368823, 369691, 370852, 372906, 376131, 380345, 385045, 389551, 393342, 396387, 398922, 400811, 401574, 401163, 400263, 399469, 398564, 396925, 394283, 390715, 386323, 381404, 376638, 372530, 368902, 365457, 362563, 360803, 359889, 358852, 357472, 356745, 357591, 359649, 361847, 363829, 366368, 370561, 376940, 385235, 394746, 404906, 415598, 426912, 438744, 450973, 464049, 479052, 496940, 518076, 542493, 570079, 600188, 631509, 662748, 693063, 721428, 746120, 765739, 780697, 792975, 804419, 815970, 828642, 844326, 864981, 891409, 923251, 959834, 1000502, 1044292, 1089712, 1134723, 1176720, 1212853, 1240995, 1260521, 1271915, 1275727, 1272251, 1262133, 1246758, 1227884, 1207081, 1185485, 1163619, 1141178, 1117169]
63393A117169k6629k9807l2963l5664l7650l8918l9620l9668l8642l6412l3597
63382G27599l0938k8439k5619k2447j9465j6904j4336j1443q577o183m021j464
63370E37763J622M666P034Q650R959J1452J3275J5278J7391J9779K2485K5134
63358F94488K7317K9261L1637L4661L7826M0629M3015M4868M5561M4520M1889
63347A115672L8081L3034K6449J8632J0453K552m833j1250j5982j8832k0461k1664
63335A151851k2730k3693k4777k6188k7848k9705l1930l4405l6343l6994l6491
63324H20747l5433l3799l1080k7416k3721k0289j6254j1165o440m162m599o017
63312F00372p160q755j1963j6229j9624k0969k0652j9513j7884j5893j3879j2029
$$ y = [1117169, 1090540, 1060733, 1027770, 992106, 954456, 915538, 875918, 836250, 797608, 761196, 727599, 696661, 668222, 642603, 620156, 600691, 583787, 569451, 558008, 549431, 543248, 539227, 537763, 539385, 544051, 551085, 559735, 569694, 581146, 594421, 609699, 627090, 646869, 669354, 694488, 721805, 751066, 782703, 817364, 855190, 895819, 938834, 983702, 1029263, 1073783, 1115672, 1153753, 1186787, 1213236, 1231868, 1242321, 1244873, 1240040, 1228790, 1212808, 1193976, 1173515, 1151851, 1129121, 1105428, 1080651, 1054463, 1026615, 996910, 964980, 930575, 894232, 857238, 820747, 785314, 751515, 720435, 693019, 669298, 649009, 632755, 621590, 615150, 610988, 606389, 600372, 593212, 584457, 572494, 556265, 536641, 515672, 495020, 475507, 457623, 441730, 427851, 415822]
63300D15822j0104p971o031m708l889l285l080l638m627n022m168k567j426j486
63286C53820k411l288l616l725m119m689m811m200l234k382j734j236r55p75l04
63271C12341N08J033P43Q0j2O80J452J672J428J192J323J973K960L637L341K238
63255C36589J371J633K900M287N074N238N313N840O798P584P719P502P683Q583
63241D14114R896J1317J2866J4532J6117J7543J8916K0161K1051K1722K2694K4142
63229F25071K5617K6734K7591K8295K8571K8280K7802K7417K6787K5608K4443
63218I22216K4207K4987K5960K6405K6162K5304K3841K1871J9431J6149J1554
63207A168087N752n30o759j2936j9094k4805k9477l2833l4910l5806l5573l4254
$$ y = [415822, 405718, 397747, 391716, 387008, 383119, 379834, 376754, 373116, 368489, 363467, 359299, 356732, 355306, 353820, 351409, 348121, 344505, 340780, 336661, 331972, 327161, 322961, 319727, 317345, 315611, 314375, 313420, 312645, 312341, 312849, 313882, 314625, 314705, 314693, 315373, 316825, 318497, 319925, 321117, 322440, 324413, 327373, 331010, 334351, 336589, 337960, 339593, 342493, 346780, 351854, 357092, 362405, 368245, 375043, 382627, 390346, 397848, 405531, 414114, 424010, 435327, 448193, 462725, 478842, 496385, 515301, 535462, 556513, 578235, 600929, 625071, 650688, 677422, 705013, 733308, 761879, 790159, 817961, 845378, 872165, 897773, 922216, 946423, 971410, 997370, 1023775, 1049937, 1075241, 1099082, 1120953, 1140384, 1156533, 1168087, 1173839, 1173309, 1166550, 1153614, 1134520, 1109715, 1080238, 1047405, 1012495, 976689, 941116, 906862]
63195I06862l1959k8933k5619k2387j9220j5777j1863p676l679k98K336M495O667
63182G52949R024J1260J3102J4752J6467J7973J8720J8684J8388J8155J7838J7343
63170I44655J6914J6647J6145J4928J2894J0169O842L030r44m739q294j1791j5460
63157A000996j9412k3539k7469l0788l3174l4345l4005l2308l0113k8343k7028
63146F80472k5535k3605k1608j9703j7533j5039j2878j1529j0578r406q090p025
63134D97943o112n057m099l636l319k329o08R74J808K216K769L468M032M457M892
63119D97399N257N456N770O537P480P699O562M469K591J809J963K198J982J628
63105E58800J764K437L014K916K251J577J206R07L01o22j456j847j792j493j077
$$ y = [906862, 874903, 845970, 820351, 797964, 778744, 762967, 751104, 743428, 739749, 739451, 741787, 746282, 752949, 761973, 773233, 786335, 801087, 817554, 835527, 854247, 872931, 891319, 909474, 927312, 944655, 961569, 978216, 994361, 1009289, 1022183, 1032352, 1039194, 1042224, 1041280, 1036541, 1028247, 1016456, 1000996, 981584, 958045, 930576, 899788, 866614, 832269, 798264, 765956, 735843, 707500, 680472, 654937, 631332, 609724, 590021, 572488, 557449, 544571, 533042, 522464, 513058, 504968, 497943, 491831, 486774, 482675, 479039, 475720, 473391, 472783, 473757, 475565, 477781, 480550, 484018, 488050, 492507, 497399, 502656, 508112, 513882, 520419, 527899, 535598, 542160, 546629, 549220, 551029, 552992, 555190, 557172, 558800, 560564, 563001, 566015, 568931, 571182, 572759, 573965, 574872, 575173, 574551, 573095, 571248, 569456, 567963, 566886]
63090E66886o31k75o6P9J42o1l73j23R51J925J693O99N88J932L422L897M021N007
63072E89713O597P591P763P914Q374Q836R581J1399J4049J6149J7068J7788J9390
63059G42212K1679K3981K6305K8992L1950L5028L8503M2467M6321M9600N2715
63048A139753N6125N9331O1547O2944O4233O5398O5799O5432O5032O4919O4623
63037A835136O3789O2741O1943O1490O1220O0814N9672N7208N3317M8106M1262
63026B466698L2282K1349R314l242j6293k9663m2722n4983o6234p5911q3010q6955
63014B070630q7973q6402q2307p6179o9183o2116n4659m6319l7578k9362k1758
63003A416794j4095o220J121P251J2340J6998K1475K5411K8231K9757L0483L1124
$$ y = [566886, 566255, 565980, 565914, 565993, 566135, 566074, 565701, 565578, 566529, 568454, 570147, 570846, 571434, 573366, 576788, 580685, 584706, 589713, 596310, 603901, 611664, 619578, 627952, 636788, 646369, 657768, 671817, 687966, 705034, 722822, 742212, 763891, 787872, 814177, 843169, 875119, 910147, 948650, 991117, 1037438, 1087038, 1139753, 1195878, 1255209, 1316756, 1379700, 1443933, 1509331, 1575130, 1640562, 1705594, 1770513, 1835136, 1898925, 1961666, 2023609, 2085099, 2146319, 2207133, 2266805, 2324013, 2377330, 2425436, 2466698, 2498980, 2520329, 2529643, 2526401, 2510108, 2480445, 2437723, 2382740, 2316506, 2240595, 2157585, 2070630, 1982657, 1896255, 1813948, 1737769, 1668586, 1606470, 1551811, 1505492, 1467914, 1438552, 1416794, 1402699, 1396479, 1397600, 1404851, 1417191, 1434189, 1455664, 1481075, 1509306, 1539063, 1569546, 1600670]
62991A600670L1808L2042L1586L0892L0285K9257K7162K4206K1062J7748J3660
62980A890378Q569K692m214j2759k2628l2295m0520m7416n3488n8387o1403o2770
62968A505759o3475o3879o3292o0998n7104n2373m7631m3524m0270l7544l4874
62957I40795l2239k9922k7803k5373k2596k0203j8858j8440j8468j8738j9073
62946F89082j8888j7761j6211j5183j4754j4091j2838j1750j1495j1505j0729
62935E33877r126p653o804o096n097m285m318m901n029m244l129k465k279k018
62921D66433j357o31l84p85j462j866j760j409j272j515j881k071k180k514l023
62906D42323l269l114l055l477l831l223j810r04j320k255k375j594r64r55q68
$$ y = [1600670, 1632478, 1664520, 1696106, 1726998, 1757283, 1786540, 1813702, 1837908, 1858970, 1876718, 1890378, 1898947, 1901639, 1897425, 1884666, 1862038, 1829743, 1789223, 1741807, 1688319, 1629932, 1568529, 1505759, 1442284, 1378405, 1315113, 1254115, 1197011, 1144638, 1097007, 1053483, 1013213, 975669, 940795, 908556, 878634, 850831, 825458, 802862, 782659, 763801, 745361, 726893, 708155, 689082, 670194, 652433, 636222, 621039, 606285, 592194, 579356, 567606, 556111, 544606, 533877, 524751, 517098, 510294, 504198, 499101, 494816, 490498, 485597, 480568, 476324, 473195, 470730, 468451, 466433, 465076, 464445, 464061, 463276, 461814, 459948, 458188, 456779, 455507, 453992, 452111, 450040, 447860, 445346, 442323, 439054, 435940, 432885, 429408, 425577, 422354, 420544, 419640, 418320, 416065, 413690, 412096, 411132, 410177, 409309]
62891D09309r3Q64J134P80N80Q56J114Q75L41L5J63N06P85Q97Q78P79O23M10J28
62872D20964k51o82r44p91l21p2m71j265j767j683j334j057q21n57l96l34p5L74
62854D08517L90m16j329j159K99J982K716K203Q98m51j031m02R63J901J658N62
62838D17301n17j048j062q20o05n80n94l40J77N69N76M05L63M99P52J165J677
62821D17918K069K328K692L159L310L130L390M588N897N964M662L230K683K903
62807D67923L429M298N621O981P844Q296Q799R468J0019J0327J0642J1293J2395
62794E77335J3819J5295J6642J8013J9762K1930K4122K6073K8118L0868L4655
62783H26632L9506M5359N1856N8208O3783O8856P4340Q0683Q7411R3728R9138
$$ y = [409309, 409216, 410080, 411214, 411994, 412574, 413430, 414544, 415419, 415760, 415795, 415958, 416464, 417249, 418146, 419024, 419803, 420426, 420836, 420964, 420713, 420031, 419087, 418296, 417975, 417903, 417432, 416167, 414400, 412717, 411383, 410326, 409505, 408948, 408552, 408218, 408143, 408517, 408907, 408491, 407162, 406003, 406302, 408284, 411000, 413203, 414101, 413650, 412619, 412217, 413180, 415081, 416739, 417301, 416784, 415736, 414674, 413854, 413249, 412669, 412075, 411735, 411912, 412481, 413057, 413462, 413825, 414324, 415076, 416241, 417918, 419987, 422315, 425007, 428166, 431476, 434606, 437996, 442584, 448481, 454445, 459107, 462337, 465020, 467923, 471352, 475650, 481271, 488252, 496096, 504392, 513191, 522659, 532678, 543005, 553647, 564940, 577335, 591154, 606449, 623091, 641104, 660866, 682796, 706918, 732991, 761109, 791977, 826632, 866138, 911497, 963353, 1021561, 1085344, 1154200, 1228540, 1309223, 1396634, 1490362, 1589500]
62772A589500J03317J05748J05865J03418R8487R1257Q1855P0284N6447M0297
62762B446475K2175K963j6140l4009m9889o3492p4917q4364r1827r7078r9898
62751A859999j00326r8777r5961r2539q8695q4160p8801p3003o7270o1682n6124
62740I62661n0872m6388m2536l8603l4241k9935k6283k3306k0735j8531j6630
62729F14601j4589j2040r362p370o373n951n573n010m128k782j080N14J567K053
62715E44477K338K931M240O338Q888J1412J3648J5580J7320J9135K1470K4583
62703F92360K8187L1694L4879L8137M2086M7006N2508N7601O1383O3984O6603
62692A216428P0086P3681P5719P5428P3372P0139O5381N8479M9433L8602K6199
$$ y = [1589500, 1692817, 1798565, 1904430, 2007848, 2106335, 2197592, 2279447, 2349731, 2406178, 2446475, 2468650, 2471613, 2455473, 2421464, 2371575, 2308083, 2233166, 2148802, 2056975, 1959897, 1859999, 1759673, 1660896, 1564935, 1472396, 1383701, 1299541, 1220740, 1147737, 1080467, 1018785, 962661, 911789, 865401, 822865, 784262, 750021, 720086, 693803, 670497, 649762, 631231, 614601, 600012, 587972, 578610, 571240, 564867, 558916, 553343, 548333, 544205, 541423, 540343, 540857, 542424, 544477, 546815, 549746, 553986, 560324, 569212, 580624, 594272, 609852, 627172, 646307, 667777, 692360, 720547, 752241, 787120, 825257, 867343, 914349, 966857, 1024458, 1085841, 1149825, 1216428, 1286514, 1360195, 1435914, 1511342, 1584714, 1654853, 1720234, 1778713, 1828146, 1866748, 1892947]
62681A892947J2582j397j4959k7982m0456n1667o0594o7080p1850p5416p7564
62670A416564p7982p6801p4254p0393o5512o0377n5644n1301m7005m2740l8756
62659G55799l5070l1567k8447k6098k4370k2520k0116j7598j5597j4043j2432
62648E07941j0814r827r625r445q584p328o423n958n404m606m006l809l533k668
62634D15911j383k59L33M56M63P65J377J629P41j028k331k157r13K90R09J084
62618D15887R04M08L9L60J270K111K626L253M340N653O855P952Q993R743J0030
62603D80424J0181J0839J2396J4666J6991J8804K0336K2637K6448L1070L4997
62592F99789L7736M0336M3784M7541N0238N1292N1130N0022M7542M3238L7262
$$ y = [1892947, 1905529, 1904132, 1889173, 1861191, 1820735, 1769068, 1708474, 1641394, 1569544, 1494128, 1416564, 1338582, 1261781, 1187527, 1117134, 1051622, 991245, 935601, 884300, 837295, 794555, 755799, 720729, 689162, 660715, 634617, 610247, 587727, 567611, 550013, 534416, 520373, 507941, 497127, 487300, 477675, 468230, 459646, 452318, 445895, 439937, 434533, 429927, 425921, 422112, 418579, 415911, 414528, 414269, 414602, 415058, 415521, 416286, 417663, 419292, 420033, 419005, 416674, 414517, 413604, 413894, 414803, 415887, 416791, 417199, 417238, 417598, 418868, 420979, 423605, 426858, 431198, 436851, 443706, 451658, 460651, 470394, 480424, 490605, 501444, 513840, 528506, 545497, 564301, 584637, 607274, 633722, 664792, 699789, 737525, 777861, 821645, 869186, 919424, 970716, 1021846, 1071868, 1119410, 1162648, 1199910]
62581A199910L0120K2201J3763N059l764j2675k1464k9568l6352m1442m4780m6510
62569A034498m6970m6644m5911m4779m3010m0507l7538l4526l1676k8827k5714
62558F08396k2376j9251j6831j5178j3873j2456j0901r533q564p846p096o202
62546D58289n237m286l448k872k605k422k017j320n10K52Q74J214J254J293J590
62531D40049J874J702J363J715K873L866M085M370N834Q167J0133J1433J2955
62518E10419J5186J7560J9657K1952K4877K8015L0899L3828L7116M0110M1858
62507H21477M2449M2813M3313M3210M1640L8475L4151K9082K3469J7362J0780
62496A188221L917k779q865j4116j8344k1161k2233k1640j9708j6585j2283p051
$$ y = [1199910, 1230030, 1252231, 1265994, 1271053, 1267289, 1254614, 1233150, 1203582, 1167230, 1125788, 1081008, 1034498, 987528, 940884, 894973, 850194, 807184, 766677, 729139, 694613, 662937, 634110, 608396, 586020, 566769, 549938, 534760, 520887, 508431, 497530, 487997, 479433, 471587, 464491, 458289, 453052, 448766, 445318, 442446, 439841, 437419, 435402, 434082, 433572, 433824, 434698, 435912, 437166, 438459, 440049, 441923, 443625, 444988, 446703, 449576, 453442, 457527, 461897, 467731, 475898, 486031, 497464, 510419, 525605, 543165, 562822, 584774, 609651, 637666, 668565, 702393, 739509, 779619, 821477, 863926, 906739, 950052, 993262, 1034902, 1073377, 1107528, 1136610, 1160079, 1177441, 1188221, 1192138, 1189359, 1180494, 1166378, 1148034, 1126873, 1104640, 1083000, 1063292, 1046707, 1034424, 1027373]
62484A027373j296M739J0865J6624K1505K5590K9550L3888L8337M2089M4315M4462
62472A338041M2398L8484L3261K6884J9071R737m89j0588j9950k8630l6847m4472
62460A366900n1100n6445o0400o2732o3113o1648n9081n6113n2675m8351m3336
62449G51906l8398l3822k9141k4187j9688j6367j3944j1652r275p073n053l098
62437E40208j548q42o66k53M90Q86O73M05M65L56n12j919l137l854m412n317o732
62420E14291q229r026q767q052p759p858p543o639n955n954n886m944l614k960
62406D21105l106l316l272l317l525l463k989k403j721o00P36J403J137Q69J468
62391C99006K502L010K953L029L354L301K702K287K663L562M429N158N825O275
$$ y = [1027373, 1026077, 1030816, 1041681, 1058305, 1079810, 1105400, 1134950, 1168838, 1207175, 1249264, 1293579, 1338041, 1380439, 1418923, 1452184, 1479068, 1498139, 1507876, 1507387, 1496799, 1476849, 1448219, 1411372, 1366900, 1315800, 1259355, 1198955, 1136223, 1073110, 1011462, 952381, 896268, 843593, 795242, 751906, 713508, 679686, 650545, 626358, 606670, 590303, 576359, 564707, 555432, 548359, 543306, 540208, 538660, 537818, 537152, 536899, 537389, 538275, 538948, 539353, 539818, 540174, 539662, 537743, 534606, 530752, 526340, 521023, 514291, 506062, 497036, 488269, 480217, 472458, 464600, 457057, 450418, 444463, 438509, 432623, 427679, 424065, 421105, 417999, 414683, 411411, 408094, 404569, 401106, 398117, 395714, 393993, 393393, 394129, 395532, 396669, 397538, 399006, 401508, 404518, 407471, 410500, 413854, 417155, 419857, 422144, 424807, 428369, 432798, 437956, 443781, 450056]
62377D50056O497O949P883Q728Q843Q645R177J0568J1872J2506J3070J4238J5704
62364E84736J6815J7712J9077K1107K3505K6279K9791L4015L8491M3065M8080
62353I02673N3638N9199O4065O7724O9553O8793O5237N9551N2534M4298L4614
62342A541879K3792J2762K354p193j5983k4053l1239l7320m2123m5571m7687m8663
62330A280955m8890m8664m7774m5635m2102l7917l4018l0606k7378k4492k2534
62319H70945k1578k1006k0554k0717k1682k2519k2111k0546j8917j7958j7487
62308F45870j7009j6319j5425j4329j3074j1718j0230q538o705m934l480k604
62296E21505k355k343k023j411j125j443j741j237L0J420K536L337L696L489L022
$$ y = [450056, 456553, 463502, 471385, 480113, 488956, 497601, 506778, 517346, 529218, 541724, 554794, 569032, 584736, 601551, 619263, 638340, 659447, 682952, 709231, 739022, 773037, 811528, 854593, 902673, 956311, 1015510, 1079575, 1147299, 1216852, 1285645, 1350882, 1410433, 1462967, 1507265, 1541879, 1565671, 1578433, 1580787, 1573594, 1557611, 1533558, 1502319, 1464999, 1422876, 1377305, 1329618, 1280955, 1232065, 1183401, 1135627, 1089992, 1047890, 1009973, 975955, 945349, 917971, 893479, 870945, 849367, 828361, 807807, 787090, 765408, 742889, 720778, 700232, 681315, 663357, 645870, 628861, 612542, 597117, 582788, 569714, 557996, 547766, 539228, 532523, 527589, 524109, 521505, 519150, 516807, 514784, 513373, 512248, 510805, 509064, 507827, 507857, 509277, 511813, 515150, 518846, 522335, 525357]
62281E25357K794K879L028L278L899M742N242N117M676M347M400N042O281P622
62267E88704Q484Q984R822J1337J3216J5239J7716K0873K4425K8047L1892L6298
62255H15037M1293M6714N2405N8071O3219O7496P0762P2623P2268O9048O2949
62244A491885N4340M3667L1659J9383P658l246j3140k1600k8568l4771m0958m6905
62232A459404n1693n4778n6365n6869n6443n4982n2229m8073m3001l8015l3789
62221I13167l0136k6664k3541k1135j9316j7748j6562j6042j5795j5100j3982
62210F97146j3074j2479j1622j0453r764r910j0048r299p962o899o176n151l603
62197E80706k020p43M47J839L334M675N770O634P257P711Q176Q792R525J0261
$$ y = [525357, 528151, 531030, 534058, 537336, 541235, 545977, 551219, 556336, 561012, 565359, 569759, 574801, 581082, 588704, 597188, 606172, 615994, 627331, 640547, 655786, 673502, 694375, 718800, 746847, 778739, 815037, 856330, 903044, 955449, 1013520, 1076739, 1144235, 1214997, 1287620, 1359888, 1428936, 1491885, 1546225, 1589892, 1621551, 1640934, 1648592, 1645346, 1632206, 1610606, 1582038, 1547267, 1506309, 1459404, 1407711, 1352933, 1296568, 1239699, 1183256, 1128274, 1076045, 1027972, 984971, 946956, 913167, 883031, 856367, 832826, 811691, 792375, 774627, 758065, 742023, 726228, 711128, 697146, 684072, 671593, 659971, 649518, 639754, 629844, 619796, 610497, 602535, 595636, 589460, 584309, 580706, 578686, 577943, 578390, 580229, 583563, 588238, 594008, 600642, 607899, 615610, 623786, 632578, 642103, 652364]
62183F52364J0928J1560J2217J2825J3149J3011J2551J2018J1383J0397R130Q021
62171G89554P290O770O596P597J0462J4784J9542K4338K9505L5090M0431M4871
62159A036830M8282N0592N1311M9987M6746M2009L5875K8209J9220R683N47p555
62147A411736j4562k0817k6526l1361l4889l7382l9704m2128m3760m3578m1669
62136A035360l8900l5707l1912k7583k3278j9378j5848j2810j0590r001p247m967
62124G98139k765j192J56J900L725M862N391O105P156P749P402O642O060N379
62110H56709M012K066K11j142j952k185j907j680k197l489m852n721o209o674
62096H24990p072p021o296m993l295j332O60K285L266L800M379N118N487M998
$$ y = [652364, 663292, 674852, 687069, 699894, 713043, 726054, 738605, 750623, 762006, 772403, 781533, 789554, 796844, 803614, 810210, 817807, 828269, 843053, 862595, 886933, 916438, 951528, 991959, 1036830, 1085112, 1135704, 1187015, 1237002, 1283748, 1325757, 1361632, 1389841, 1409061, 1418744, 1419291, 1411736, 1397174, 1376357, 1349831, 1318470, 1283581, 1246199, 1206495, 1164367, 1120607, 1077029, 1035360, 996460, 960753, 928841, 901258, 877980, 858602, 842754, 829944, 819354, 810353, 803106, 798139, 795374, 794182, 794338, 796238, 799963, 804825, 810216, 816321, 823477, 831226, 838628, 845270, 851330, 856709, 860721, 862787, 862998, 861856, 859904, 857719, 855812, 854132, 851935, 848446, 843594, 837873, 831664, 824990, 817918, 810897, 804601, 799608, 796313, 794981, 795641, 797926, 801192, 804992, 809371, 814489, 819976, 824974]
62082H24974M037L639M380N915P721R753J2020J4010J5188J5791J6549J7702J8783
62069I70462J9470J9990K0621K1273K1803K2328K3084K4254K6124K8896L2103
62058A230408L4641L5693L5347L3982L1394K6985K0633J2997N021k567r413j5532
62046A439589k1162k6424l1207l5514l9603m3525m6740m8636m9277m9239m8836
62035I99426m7915m6363m4246m1420l7602l3026k8639k5269k2852k0733j8469
62024F32892j6128j3951j2030j0307q666p094n808n113n040n189n097m656m122
62011E29691l736l517l331l065k725k391k078j658r35J68J513K794L651L933L935
61996E22249M174M740N015M372L015J732Q89J51p41j564k200l129m748o614p950
$$ y = [824974, 829011, 832650, 837030, 842945, 850666, 860419, 872439, 886449, 901637, 917428, 933977, 951679, 970462, 989932, 1009922, 1030543, 1051816, 1073619, 1095947, 1119031, 1143285, 1169409, 1198305, 1230408, 1265049, 1300742, 1336089, 1370071, 1401465, 1428450, 1449083, 1462080, 1467101, 1464534, 1455121, 1439589, 1418427, 1392003, 1360796, 1325282, 1285679, 1242154, 1195414, 1146778, 1097501, 1048262, 999426, 951511, 905148, 860902, 819482, 781880, 748854, 720215, 694946, 672094, 651361, 632892, 616764, 602813, 590783, 580476, 571810, 564716, 558908, 553795, 548755, 543566, 538469, 533813, 529691, 525955, 522438, 519107, 516042, 513317, 510926, 508848, 507190, 506255, 506423, 507936, 510730, 514381, 518314, 522249, 526423, 531163, 536178, 540550, 543565, 545297, 546186, 546337, 545596, 544032, 541832, 538703, 533955, 527341, 519391]
61981E19391q706r482j0430j0886j0362r379q879r054r201q640p433o058m775
61968D06106l539k426j734j525j355p44J53P30P35O24R31J602K148K266K074J835
61952D07881J701J727J928K300K866L626M404M872M931M915N290O175P379Q767
61938D68762J0370J2126J3767J5041J5889J6414J6754J6968J6988J6644J5898
61927F35621J4955J4035J3069J1780J0030P959N776L530J153j344l663n329o094
61914G01478o299o550o862o470m729j932J077L909O736R541J1880J3489J4619
61901G29887J5443J5575J4521J2380R703O757L331o90m748p851r405r765r934
61888G65204j0628j1721j2565j2717j2209j1282j0127q865p616o550n986o302
$$ y = [519391, 510685, 501203, 490773, 479887, 469525, 460146, 451267, 442213, 433012, 424372, 416939, 410881, 406106, 402567, 400141, 398407, 396882, 395527, 394783, 394936, 395666, 396401, 397025, 397956, 399558, 401706, 403972, 406046, 407881, 409582, 411309, 413237, 415537, 418403, 422029, 426433, 431305, 436236, 441151, 446441, 452616, 459995, 468762, 479132, 491258, 505025, 520066, 535955, 552369, 569123, 586091, 603079, 619723, 635621, 650576, 664611, 677680, 689460, 699490, 707449, 713225, 716755, 717908, 716564, 712901, 707572, 701478, 695179, 688629, 681767, 675297, 670568, 668636, 669713, 673622, 680358, 689899, 701779, 715268, 729887, 745330, 760905, 775426, 787806, 797509, 804266, 807597, 806907, 802159, 794308, 784903, 775138, 765204, 754576, 742855, 730290, 717573, 705364, 694082, 683955, 675090, 667474, 660924, 654938, 648636]
61876F48636p540r183j0519j1176j1152j0593r786r168q828q208o798n001l654
61863E37030k741j383O75K461L137L320M318O456Q838J0599J1754J2875J4483
61850F11822J6737J9349K1678K3259K4289K5367K6795K8293K9234K8992K7179
61839H82994K3952J9995J5960J1915P507K596k440o918j0201j2058j2815j2922
61827I07565j2275j0269o799k762Q52L914O773R327J1124J2071J2303J1512R192
61814I52528N472J016l860r170j4422j8693k1761k4232k6363k7557k7483k6757
61802G58718k5958k4742k2630k0070j7885j6191j4585j3039j1837j0881r898r117
61790E61885q930r008q542p400o253n554n115m753m583m498m102l454l111l132
$$ y = [648636, 641096, 631913, 621394, 610218, 599066, 588473, 578687, 569519, 560691, 552483, 545685, 540684, 537030, 534289, 532906, 533581, 536042, 539179, 542499, 546817, 553273, 562111, 572710, 584464, 597339, 611822, 628559, 647908, 669586, 692845, 717134, 742501, 769296, 797589, 826823, 855815, 882994, 906946, 926941, 942901, 954816, 962323, 964919, 962479, 955561, 945360, 933302, 920487, 907565, 895290, 885021, 878222, 875460, 876312, 880226, 886999, 896326, 907450, 919521, 931824, 943336, 952528, 958000, 959016, 955156, 945986, 931564, 912871, 891110, 866878, 840515, 812958, 785475, 758718, 732760, 708018, 685388, 665318, 647433, 631242, 616657, 603618, 591781, 580900, 571002, 561885, 552955, 543947, 535405, 528005, 521752, 516198, 511083, 506330, 501747, 497249, 493147, 489693, 486582, 483450]
61776D83450k798j829j101j421k218k358j808j503j706j633q77j67j46k25N19
61761D64179J835K575K335J950K233K978L601M085M709N157M751L542K554K570
61747E09054L105K892J272j200l388m532m697m564m850n706o596o839o240n154
61733D62557l991k853j741q24l88n14q61q73k23Q88J927K545K789K801K547K089
61717D65875J835K211L052L743L971L971L946L606K589J067l97j464k218k854
61703D88933l476m141m839n330n261m589l770l408l666m121m204l826l450l539
61689D31313m043m564m879m960m636l759k810k685l470m023l328j867r27q64r29
61674C83569p05o64j110j548j584j642k110k488k095j210o68o00l84K78R71J283
$$ y = [483450, 480652, 478823, 477722, 476301, 474083, 471725, 469917, 468414, 466708, 465075, 464198, 464031, 463885, 463660, 464179, 466014, 468589, 470924, 472874, 475107, 478085, 481686, 485771, 490480, 495637, 500388, 503930, 506484, 509054, 512159, 515051, 516323, 515123, 511735, 507203, 502506, 497942, 493092, 487386, 480790, 473951, 467711, 462557, 458566, 455713, 453972, 453148, 452760, 452246, 451385, 450512, 450289, 451177, 453104, 455649, 458438, 461239, 463786, 465875, 467710, 469921, 472973, 476716, 480687, 484658, 488604, 492210, 494799, 495866, 495469, 494005, 491787, 488933, 485457, 481316, 476477, 471147, 465886, 461297, 457527, 454119, 450453, 446332, 442128, 438302, 434852, 431313, 427270, 422706, 417827, 412867, 408231, 404472, 401662, 398977, 395507, 391484, 388156, 386289, 385362, 384498, 383569, 382864, 382200, 381090, 379542, 377958, 376316, 374206, 371718, 369623, 368413, 367745, 367145, 366761, 367039, 368010, 369293]
61658C69293J240J044Q52R50J517K190K371K036J737J762J885K064K619L432L701
61643C98693K992K019J765K214K543K311J858J619J611J589J316O23m27j380j725
61628D17621j444j070j103j513j849j765j335r54q74r85j112j304j575j622j244
61613C97872r39j340k104k166j420j150k244l829m545m450m630n359n863n762
61599C52071n495n261m606l412k336j885j825j866k194k828l188k822k067j476
61585C10810j131r18r88j354j516j104n27m90j027j581j760j585j226r22r54j223
61569B92504j140l82M84O01q1q51j088o61L33J580K424K376J753J335J355J380
61553C01922J122Q09O35M82L64O66J553K515K842K362J474O56J27r6p6J39M70
$$ y = [369293, 370533, 371577, 372429, 373379, 374896, 377086, 379457, 381493, 383230, 384992, 386877, 388941, 391560, 394992, 398693, 401685, 403704, 405469, 407683, 410226, 412537, 414395, 416014, 417625, 419214, 420530, 421153, 420726, 419346, 417621, 416177, 415107, 414004, 412491, 410642, 408877, 407542, 406588, 405714, 404729, 403617, 402313, 400738, 399116, 397872, 396933, 395593, 393489, 391323, 389903, 388753, 386509, 382680, 378135, 373685, 369055, 363696, 357833, 352071, 346576, 341315, 336709, 333297, 330961, 329076, 327251, 325385, 323191, 320363, 317175, 314353, 312286, 310810, 309679, 308761, 307773, 306419, 304903, 303799, 303272, 302782, 301755, 300174, 298414, 296829, 295603, 294681, 293727, 292504, 291364, 290982, 291466, 292067, 291986, 291135, 290047, 289386, 289719, 291299, 293723, 296099, 297852, 299187, 300542, 301922, 303044, 303853, 304488, 304970, 305334, 306000, 307553, 310068, 312910, 315272, 316746, 317402, 317529, 317433, 317357, 317496, 317966]
61536C17966P79R08Q99R44J046R38N85M31P58J087P23j94q37p90m24j29J08K11
61518C25009j87j100j899k081j861j624j248m87L97Q84Q71N89J30m24o24n1R44
61501C17238J428R58M4n34m62M3N53O94M37K73P22J576K010J595Q89O38P45M95
61483C29342k69q04m67L03N11n0m62R3J191J684J188N35O92J635K614L100L088
61466C43924K627J643K66r86j643j711j560j458j324q93o6R11J573J618J157N92
61450C44670L07M82J054J708K033J909J643J565J566J300Q40P56J372K280K760
61435C66245K555J977J385R25P17R44J538K022K023J825K025K582K672J805P47
61420C91987O97J630K221J641O94O53J424J717Q74l33q92p82o27o69o52m91n25
$$ y = [317966, 318745, 319653, 320552, 321496, 322542, 323480, 324065, 324496, 325254, 326341, 327064, 326870, 326033, 325243, 324819, 324690, 324798, 325009, 324822, 323722, 321823, 319742, 317881, 316257, 315009, 314522, 314919, 315803, 316674, 317263, 317393, 316969, 316345, 316294, 317238, 318666, 319624, 319668, 319134, 318672, 318715, 319268, 319962, 320399, 320672, 321394, 322970, 324980, 326575, 327464, 328102, 328847, 329342, 329073, 328269, 327802, 328105, 328616, 328566, 328104, 328197, 329388, 331072, 332260, 332795, 333487, 335122, 337736, 340836, 343924, 346551, 348194, 348460, 347474, 345831, 344120, 342560, 341102, 339778, 338885, 338819, 339730, 341303, 342921, 344078, 344670, 344977, 345459, 346513, 348221, 350254, 352163, 353806, 355371, 356937, 358237, 359077, 359833, 361205, 363485, 366245, 368800, 370777, 372162, 373087, 373804, 374748, 376286, 378308, 380331, 382156, 384181, 386763, 389435, 391240, 391987, 392684, 394314, 396535, 398176, 398870, 399523, 400947, 402664, 403538, 403205, 402313, 401531, 400904, 400235, 399583, 399092, 398567]
61403C98567j033j833k459k629k529k577k903l124k823k171j732j640j396o25
61389C69093L43R13R17O25M04O53J589K733L017K012P22M38J128J671J574J495
61373C89327J952K537K717K655K642K478J969J500J371J105J68q78q95K22J314
61358D10184J442J016J142K342M155N699O335O126N769N904O443O795O693O398
61344D76443O061N464M491L405K465J705J321J717K746L455L144K384K271K929
61330E20001L382K989K200J726J552J181M56l24r32j445j978k393k376j789q93
61315E21357k34l8J51R68K285L242L452L729N098P306R021R487R321R426R763
61300E94334R665Q929P867O455M186R29k574n338p003p827q152q236q295q427
$$ y = [398567, 397534, 395701, 393242, 390613, 388084, 385507, 382604, 379480, 376657, 374486, 372754, 371114, 369718, 369093, 369436, 370349, 371266, 371891, 372295, 372948, 374537, 377270, 380287, 382299, 383021, 383459, 384587, 386258, 387832, 389327, 391279, 393816, 396533, 399188, 401830, 404308, 406277, 407777, 409148, 410253, 410421, 409543, 408648, 408870, 410184, 411626, 412642, 413784, 416126, 420281, 425980, 432315, 438441, 444210, 450114, 456557, 463352, 470045, 476443, 482504, 487968, 492459, 495864, 498329, 500034, 501355, 503072, 505818, 509273, 512417, 514801, 517072, 520001, 523383, 526372, 528572, 530298, 531850, 533031, 533487, 533163, 532231, 530786, 528808, 526415, 524039, 522250, 521357, 521123, 521085, 521236, 522204, 524489, 527731, 531183, 534912, 540010, 547316, 556337, 565824, 575145, 584571, 594334, 603999, 612928, 620795, 627250, 631436, 632365, 629791, 624453, 617450, 609623, 601471, 593235, 584940, 576513]
61286E76513q488q305p831o968n550l814k615k557l058k909j780n48R4N87J632
61271E24403K956L693L695L710M265N086N721O133O429O550O503O546O824P161
61257E99675P506Q129Q986R249Q116N915L836K608K002J578J282J167J127J190
61243F62366J527J930J742P27n06j368k108l225m472n147n094m713m152l324k587
61228F31596k552l086l264k570j434l76O19J577K194K426K745L272L416K916K561
61213F40040L066L927M197L848L375K652J332P3k4Q69J375Q93K62K08M39P46J840
61196F69118M163O812Q622R711J1021J2746J4105J4447J3777J2348J0364Q101
61184G95335N805L519J367j54o50m63m18j012k151l430m365m618m391m432n117
$$ y = [576513, 568025, 559720, 551889, 544921, 539371, 535557, 532942, 530385, 527327, 524418, 522638, 522090, 522184, 522771, 524403, 527359, 531052, 534747, 538457, 542722, 547808, 553529, 559662, 566091, 572641, 579144, 585690, 592514, 599675, 607181, 615310, 624296, 633545, 641661, 647576, 651412, 654020, 656022, 657600, 658882, 660049, 661176, 662366, 663893, 665823, 667565, 668292, 667786, 666418, 664310, 661085, 656613, 651466, 646372, 641659, 637507, 634183, 631596, 629044, 625958, 622694, 620124, 618690, 618314, 618933, 620510, 622704, 625130, 627875, 631147, 634563, 637479, 640040, 643106, 647033, 651230, 655078, 658453, 661105, 662437, 662510, 662486, 663355, 664730, 665623, 665885, 666093, 666532, 667278, 669118, 673281, 680093, 688715, 698426, 709447, 722193, 736298, 750745, 764522, 776870, 787234, 795335, 801140, 804659, 806026, 805872, 805222, 804759, 804341, 803329, 801178, 797748, 793383, 788765, 784374, 779942, 774825]
61169G74825n866n886n246m682m539m530m441m458m781n437o510p988r335r746
61155F91380q999p689o502n561m583l296j698j55P60Q28M82K09k12j433l623o271
61139F43637q799j0774j1660j1114r626q131o851n269l405k202k141k395j988
61126E59282j059j59R84K919N112O434O948P951R992J2006J3004J3615J5005J6996
61112F69030J8410J8951J9572K0858K2090K2392K2030K1883K2083K1930K0963
61101I00192J9405J7539J5152J1936Q086M238R09j927m774q069j1549j4333j5818
61088I20987j6372j6817j7336j7414j6853j6236j6142j6407j6464j6121j5625
61077G39200j5203j4846j4358j3423j1857r986q489p610o828n606m149l066k465
$$ y = [774825, 768959, 763073, 757827, 753145, 748606, 744076, 739635, 735177, 730396, 724959, 718449, 710461, 701126, 691380, 682381, 674692, 668190, 662629, 658046, 654750, 653052, 652897, 653657, 654485, 654967, 655176, 654964, 653531, 649908, 643637, 634838, 624064, 612404, 601290, 591664, 583533, 576682, 571413, 568008, 565806, 563665, 561270, 559282, 558223, 558064, 559048, 561967, 567079, 573513, 580461, 588412, 598404, 610410, 623414, 637029, 652034, 669030, 687440, 706391, 725963, 746821, 768911, 791303, 813333, 835216, 857299, 879229, 900192, 919597, 937136, 952288, 964224, 972310, 976548, 977457, 975530, 970756, 962687, 951138, 936805, 920987, 904615, 887798, 870462, 853048, 836195, 819959, 803817, 787410, 770946, 754825, 739200, 723997, 709151, 694793, 681370, 669513, 659527, 651038, 643428, 636600, 630994, 626845, 623779, 621314]
61064F21314j854q29M78J618K274K583L022L925N044N886O428P115Q070Q934R636
61049F83644J0724J2470J4254J5347J5822J6262J6991J8155J9945K2140K3885
61038H69639K4737K5523K7326L0014L2536L4425L6022L7513L8762M0060M2017
61027A238574M4498M6568M7713M8485M9719N1665N4017N6375N8646O1382O5625
61016A823267P1936P9802Q8433R7858J08738J21676J37444J57430J83122K15620
61006C085326K56197L06458L67337M39461N25588O31043P61000R20962J120751
60997H414123J367264J638852J868707J974598J921479J748137J517888J249249
60989B1700297R18203N34607J89180o824l0285K6236M2886k8603j65469l51431
$$ y = [621314, 619460, 618631, 619109, 620727, 623001, 625584, 628606, 632531, 637575, 643461, 649889, 657004, 665074, 674008, 683644, 694368, 706838, 721092, 736439, 752261, 768523, 785514, 803669, 823614, 845754, 869639, 894376, 919899, 947225, 977239, 1009775, 1044200, 1080222, 1117735, 1156497, 1196557, 1238574, 1283072, 1329640, 1377353, 1425838, 1475557, 1527222, 1581239, 1637614, 1696260, 1757642, 1823267, 1895203, 1975005, 2063438, 2161296, 2270034, 2391710, 2529154, 2686584, 2869706, 3085326, 3341523, 3647981, 4015318, 4454779, 4980367, 5611410, 6372410, 7293372, 8414123, 9781387, 11420239, 13288946, 15263544, 17185023, 18933160, 20451048, 21700297, 22618500, 23153107, 23342287, 23335463, 23305178, 23331414, 23374300, 23345697, 23180228, 22828797]
60979B2828797o16002r83490j404806j765917j967048j985083j864570j668126
60971A0573755j443458j220942j019129q45228o97548n72934m70581l88792l22628
60962C592515k67193k21083j84757j57316j36296j19433j05254r2823q1891p2753
60952B153716o5381n9226n4020n0016m7234m5327m4325m4634m6119m7994m9694
60941A599746n0993n1321n0105m7915m6081m5002m3888m2405m1219m0541l9475
60930A100801l7524l5670l4969l4964l4323l2491k9894k7081k4407k2195k0583
60919G66700j9355j8279j7341j6447j5276j3686j1841r887p916o337n585n423
60907F19327n113m394l592k713j426n6M77N4l23n9K47J00Q4O69J073L54j029j857
$$ y = [22828797, 22212795, 21229305, 19824499, 18058582, 16091534, 14106451, 12241881, 10573755, 9130297, 7909355, 6890226, 6044998, 5347450, 4774516, 4303935, 3915143, 3592515, 3325322, 3104239, 2919482, 2762166, 2625870, 2506437, 2401183, 2308360, 2226469, 2153716, 2088335, 2029109, 1975089, 1925073, 1877839, 1832512, 1788187, 1743553, 1697434, 1649440, 1599746, 1548753, 1497432, 1447327, 1399412, 1353331, 1308329, 1264441, 1222036, 1180817, 1140276, 1100801, 1063277, 1027607, 992638, 957674, 923351, 890860, 860966, 833885, 809478, 787283, 766700, 747345, 729066, 711725, 695278, 680002, 666316, 654475, 644588, 636672, 630335, 624750, 619327, 614214, 609820, 606228, 603515, 602089, 602033, 602510, 602564, 602241, 602182, 602429, 602529, 602613, 603282, 604355, 604709, 603680, 601823]
60889F01823j846j714j961k513l334m467n558o080o059o023o295o802p353p702
60875E34116p559o986o471o245n956n394n035n294n696n550m971m534m247l636
60861D56542k609j471l28Q14J592J691J565J857K296K027J061M02N95J033J055
60846D68122Q92J021J210Q15k55j467k404l156l987m835n253m844l796k861k621
60831D36581k877k992k650k020j278m01N31J226J458J230O54l0m14k38J74J84
60815D29138k99n78n4R31J399P60o66k090k952l168k950k525k051j665j486j565
60799D10179j858k258k625k883l104l412l739l769l335k696k286k258k473k786
60785C70697l070l138k991k926l046k870k056j228j345k176k351j171M36J181
$$ y = [601823, 599977, 598263, 596302, 593789, 590455, 585988, 580430, 574350, 568291, 562268, 555973, 549171, 541818, 534116, 526557, 519571, 513100, 506855, 500899, 495505, 490470, 485176, 479480, 473930, 468959, 464425, 460178, 456542, 453933, 452462, 452134, 452948, 454540, 456231, 457796, 459653, 461949, 463976, 465037, 465439, 466034, 467067, 468122, 469014, 470035, 471245, 472060, 471805, 470338, 467934, 464778, 460791, 455956, 450703, 445859, 442063, 439202, 436581, 433704, 430712, 428062, 426042, 424764, 424363, 424894, 426120, 427578, 428808, 429462, 429432, 429018, 428780, 428954, 429138, 428839, 428261, 428207, 429138, 430537, 431297, 430631, 428541, 425589, 422421, 419471, 416946, 414895, 413230, 411744, 410179, 408321, 406063, 403438, 400555, 397451, 394039, 390300, 386531, 383196, 380500, 378214, 375956, 373483, 370697, 367627, 364489, 361498, 358572, 355526, 352656, 350600, 349372, 348027, 345851, 343500, 342329, 342765, 343946]
60771C43946R18L88J40L47J089K152K862K858K764L448M755N662N475M475L402
60756C84681K793K738K847K530J639P31M26P31J147J271R48J97p02j356j749k260
60740C96612k946l299l150l158l885m913n533n736n763n297m107l058l246m308
60726C38213m718l868k711k203k106j772j163o28l01j91l70p14q72p90p59q53
60710C14194p46l16Q6J87J41J45J90L92J012J926K489K327J832J604J774K075
60694C29312K253K162J776J311J123J305J645K008K413K706K680K565K885L678
60680C59822M320M363M031L691L328K821K331K070K064K336K930L508L413K454
60666D03482J179J16q63k035l205m024m563n096n521n477m889m025l131k293j518
$$ y = [343946, 344864, 345252, 345392, 345739, 346828, 348980, 351842, 354700, 357464, 360912, 365667, 371329, 376804, 381279, 384681, 387474, 390212, 393059, 395589, 397228, 397959, 398385, 399116, 400263, 401534, 402482, 402679, 401977, 400621, 398872, 396612, 393666, 390367, 387217, 384059, 380174, 375261, 369728, 363992, 358229, 352932, 348825, 345767, 342521, 338213, 333495, 329627, 326916, 324713, 322607, 320835, 319672, 319044, 318743, 318552, 318182, 317468, 316596, 315806, 315047, 314194, 313448, 313132, 313218, 313405, 313546, 313691, 313881, 314273, 315285, 317211, 319700, 322027, 323859, 325463, 327237, 329312, 331565, 333727, 335503, 336814, 337937, 339242, 340887, 342895, 345308, 348014, 350694, 353259, 356144, 359822, 364142, 368505, 372536, 376227, 379555, 382376, 384707, 386777, 388841, 391177, 394107, 397615, 401028, 403482, 404661, 404777, 403914, 401879, 398674, 394650, 390087, 384991, 379470, 373993, 369104, 365079, 361948, 359655, 358137]
60651C58137p61K5P25J189J559K132K763K858K227J442J013P05O9p93j541k217
60635C69532k942l293k770j723j119j307j688j633j209p87m56j28J85M33O81Q85
60619C52661P71K22l64m12J75R05J281J283J194J132J012Q42P75P73O36M75P69
60602C64130J592K120J505O4j071j422j623k216k735k454j424k87O22J367J885
60587C60053J935J553J034N35L4l58m17j98J4J15L24P60J181J313J292J597K565
60570C73332L972N137N492N121M789N300O831Q788J0256J0654J0019Q741P097
60557D65529N151L095J290j72j677l418m832n180m531l613k795j832n98O56J928
60542D49001L532N256O238O195O075O873Q337R590J0518J1678J3092J4057J4144
$$ y = [358137, 357376, 357401, 358126, 359315, 360874, 363006, 365769, 368627, 370854, 372296, 373309, 374014, 374083, 373290, 371749, 369532, 366590, 363297, 360527, 358804, 357685, 356378, 354690, 353057, 351848, 351061, 350605, 350477, 350662, 351095, 351776, 352661, 353432, 353654, 353290, 352878, 353053, 353958, 355239, 356522, 357716, 358848, 359860, 360702, 361477, 362250, 362886, 363361, 364130, 365722, 367842, 369347, 369411, 368340, 366918, 365295, 363079, 360344, 357890, 356466, 356179, 356801, 358168, 360053, 361988, 363541, 364575, 365110, 365144, 364786, 364369, 364171, 364185, 364300, 364624, 365384, 366565, 367878, 369170, 370767, 373332, 377304, 382441, 387933, 393054, 397843, 403143, 409974, 418762, 429018, 439672, 449691, 458432, 465529, 470680, 473775, 475065, 474893, 473216, 469798, 464966, 459786, 455255, 451642, 448847, 447015, 446417, 447073, 449001, 452533, 457789, 464027, 470222, 476297, 483170, 491507, 501097, 511615, 523293, 536385, 550442, 564586]
60529E64586J3601J2618J0927Q317N112J816j321m145o331p560p841p528p091
60516E75160o796o532n966n005l958l099k282j283l68j5o4L63J880M063N899O887
60500E58884P464Q490J0516J3538J7207K1016K4336K6669K8055K9068L0051L0483
60488H05777K9550K7251K4463K1803J9038J5747J2096Q527N142J727j928o072
60476I63121j0903j6095k0803k4554k7736l0781l3287l4513l4317l2991l0665
60465F66476k7517k4313k1843k0044j8342j6636j5138j3530j1364r159q033q018
60453D72539p858o737n280m335l793l174k611k475k630k758k990l496l817l317
60439D17268k091q73k33k88r10j707k036j597q34l74k84l00m66r03j274j159p84
$$ y = [564586, 578187, 590805, 601732, 610049, 615161, 616977, 615656, 611511, 605180, 597620, 589779, 582251, 575160, 568364, 561832, 555866, 550861, 546903, 543804, 541522, 540239, 539871, 539856, 539792, 540155, 542035, 546098, 551997, 558884, 566348, 574838, 585354, 598892, 616099, 637115, 661451, 688120, 716175, 745243, 775294, 805777, 835327, 862578, 887041, 908844, 927882, 943629, 955725, 964252, 969394, 971121, 969193, 963121, 952218, 936123, 915320, 890766, 863030, 832249, 798962, 764449, 730132, 697141, 666476, 638959, 614646, 592803, 572759, 554417, 537781, 522643, 509113, 497749, 488590, 480557, 472539, 464681, 457944, 452664, 448329, 444536, 441362, 438751, 436276, 433646, 430888, 427898, 424402, 420585, 417268, 415177, 414304, 414071, 413783, 412873, 411166, 409130, 407533, 406699, 406325, 406041, 405741, 405275, 404372, 403098, 401939, 401155]
60422D01155o67n92J66J504K222J495j6r97r41l05L89R81J366J354J012P62R94
60405D09882J652K341K696K617K228J736J375J364J701K064K106J917J986K500
60391D38165L002L035K855L035L459L380K549J703J633K206K671K617K232J899
60377D74441J902K342K949L181K882K620K921L415L307K580K004J982K074J869
60363E10469J588J518J462J288J422K196L101L424L385L898N261O822P984Q867
60349E62685R784J0635J1163J1433J1615J1586J1014R698P605M773J415k006n013
60336F56387p449r405j0886j1676j1542j0540r116p829o972o472o165n952n629
60323E46754m884l803l030l081l619l871l597l058k247q39R59K291K709K793L353
$$ y = [401155, 400488, 399896, 400062, 401566, 403788, 405283, 405267, 404270, 403329, 403024, 403413, 404394, 405760, 407114, 408126, 408888, 409882, 411534, 413875, 416571, 419188, 421416, 423152, 424527, 425891, 427592, 429656, 431762, 433679, 435665, 438165, 441167, 444202, 447057, 450092, 453551, 456931, 459480, 461183, 462816, 465022, 467693, 470310, 472542, 474441, 476343, 478685, 481634, 484815, 487697, 490317, 493238, 496653, 499960, 502540, 504544, 506526, 508600, 510469, 512057, 513575, 515037, 516325, 517747, 519943, 523044, 526468, 529853, 533751, 539012, 545834, 553818, 562685, 572469, 583104, 594267, 605700, 617315, 628901, 639915, 649613, 657218, 661991, 663406, 661400, 656387, 648938, 639533, 628647, 616971, 605429, 594889, 585773, 577944, 570972, 564500, 558335, 552383, 546754, 541870, 538067, 535037, 531956, 528337, 524466, 520869, 517811, 515564, 514725, 515684, 517975, 520684, 523477, 526830]
60308E26830M580O263Q339J0714J3051J5202J7420J9584K0688J9809J7358J4574
60296F94412J1786P983K323m475j0646j4970j7575j9243k0247k0122j8533j6014
60284E74679j3518j1314r002o629n049m734m855m232k845j645j153j001q36q88
60270E06978j465k404l275l825m078m219m398m477m122l326k631k454k509k326
60256D61469k033k016k064j692j089r24j146r46j46L78Q4k67K74J375J917J594
60240D54768J200J360J720J601R36K91J09K82M45M46M22M58N08O72J206K037K611
60223D71072K573K310K338K479K274K036K584L952N162N511N321N115M846M472
60209E22045M540N532P000Q021Q219P817P018N968N110N000N702O724P473P484
$$ y = [526830, 531410, 537673, 546012, 556726, 569777, 584979, 602399, 621983, 642671, 662480, 679838, 694412, 706198, 714181, 716504, 712029, 701383, 686413, 668838, 649595, 629348, 609226, 590693, 574679, 561161, 549847, 540845, 534216, 529167, 524433, 519578, 515346, 512501, 510856, 509703, 508702, 507866, 506978, 505513, 503109, 499834, 496009, 491931, 487712, 483314, 478837, 474715, 471389, 468758, 466304, 463795, 461469, 459436, 457420, 455356, 453664, 452575, 451651, 450505, 449559, 449413, 449791, 449875, 449608, 449882, 451257, 453174, 454768, 455968, 457328, 459048, 460649, 461585, 461876, 461985, 462267, 462712, 463158, 463580, 464038, 464546, 465218, 466424, 468461, 471072, 473645, 475955, 478293, 480772, 483046, 485082, 487666, 491618, 496780, 502291, 507612, 512727, 517573, 522045, 526585, 532117, 539117, 547138, 555357, 563174, 570192, 576160, 581270, 586270, 591972, 598696, 606169, 613653]
60195F13653O541M936L435K528J911J163N77O63J028O03q59k315k755k448k351
60180F26310k826l489m134n022o189p022o948o242n689n566n400m830m137l644
60166E55172l041j961r26r45k101l234l342k688k133j910j691j432j444j714j798
60151E24812j452q79k28O46J724K524K606K169J841J962K337K618K699K630K462
60136E48471K426L038M613O591P856P989P776Q024Q323P628N871M108L035K257
60122F28006J327O31O97J217J468J244Q63N95O72J422K724L636L338K243J521
60107F51604J643K103K427K583K399J473oj124j383j443k227l676m822m906m057
60092F40588k980k338k350k730k962k656j702l05R92J554J265P64P08R46Q10J34
$$ y = [613653, 620194, 625130, 628565, 631093, 633004, 634167, 634744, 635407, 636435, 637038, 636179, 633864, 631109, 628661, 626310, 623484, 619995, 615861, 610839, 604650, 597628, 590680, 584438, 578749, 573183, 567783, 562953, 558816, 555172, 552131, 550170, 549244, 548299, 546198, 542964, 539622, 536934, 534801, 532891, 531200, 529768, 528324, 526610, 524812, 523360, 522481, 522253, 522899, 524623, 527147, 529753, 531922, 533763, 535725, 538062, 540680, 543379, 546009, 548471, 550897, 553935, 558548, 565139, 572995, 580984, 588760, 596784, 605107, 612735, 618606, 622714, 625749, 628006, 629333, 629964, 630661, 631878, 633346, 634590, 635453, 636048, 636720, 638142, 640866, 644502, 647840, 650083, 651604, 653247, 655350, 657777, 660360, 662759, 664232, 664226, 663102, 661719, 660276, 658049, 654373, 649551, 644645, 640588, 637608, 635270, 632920, 630190, 627228, 624572, 622870, 622565, 623557, 625111, 626376, 627140, 627848, 628794, 629604, 629738]
60076F29738o05j075j368j501j352j278j993l503m826n316n590o505p746q214
60062E78866p540o463n797n697n887n984n600m574l277k364k214k753l622m190
60048E12904l740k218n60K92N96J347K791M245N325O365P321P331N994M336L661
60033E55990L928M083L565K749K060J490R40L62m85j826l328m292m524m567m922
60018E51223n528o089o508o777o874o886p004p154p028o563o029n478m584l276
60004D65445k119j671j713j544q69q0K58m7p02j169j089n53J11Q13J617K235K167
59987D61090J551J358K274L781M790M915M574M175L792L484L288K917J981N83
59973E04553o94j467j796j875j876k101k670l130k811j713n62P2K57K48J10RL48
$$ y = [629738, 629133, 628058, 626690, 625189, 623837, 622559, 620566, 617063, 612237, 606921, 601331, 594826, 587080, 578866, 571326, 564863, 559066, 553369, 547482, 541498, 535898, 531324, 528047, 525683, 523469, 520716, 517094, 512904, 509164, 506946, 506386, 506678, 507274, 508621, 511412, 515657, 520982, 527347, 534668, 541999, 547993, 552329, 555990, 559918, 564001, 567566, 570315, 572375, 573865, 574805, 575167, 574682, 572856, 569528, 565236, 560712, 556145, 551223, 545695, 539606, 533098, 526321, 519447, 512561, 505557, 498403, 491375, 484812, 478783, 473305, 468721, 465445, 463326, 461655, 459942, 458398, 457529, 457449, 457707, 457660, 456958, 455789, 454700, 454147, 454258, 455071, 456688, 458923, 461090, 462641, 463999, 466273, 470054, 474844, 479759, 484333, 488508, 492300, 495784, 499072, 501989, 503970, 504553, 503859, 502392, 500596, 498721, 496845, 494744, 492074, 488944, 486133, 484420, 483858, 483930, 484187, 484435, 484545, 484554, 484902]
59956D84902J247K225K693K545K037J376O33r5o18p47m61j46m00j263j872j460
59940D90596n06j44m84m26N37J372R62l15j241j435j416j345p20O31K062K862
59924D90990L004K976L208L844M778N747O613P476Q413R153R332Q914Q147P163
59910E79758N916M465L064J993J499J708K359K709K116O74r27k125k824l157l272
59895E93956l298l276l071k571j891j182l63O63J650K204K258K111K085K439L381
59880E95095M710N608N421M609M387N197O189O419N940N266M310K652O09p89j057
59865F54566q58j064j718k291k630l037l578l861l620l105k624k100j359n68p1
59850F22082R0K45P89J997L769N380N875N192M463M517M448K692n79l267l829
$$ y = [484902, 486149, 488374, 491067, 493612, 495649, 497025, 497658, 497563, 496945, 496198, 495737, 495591, 495191, 493928, 492056, 490596, 490090, 489946, 489462, 489036, 489573, 490945, 491907, 491592, 490351, 488916, 487500, 486155, 485435, 486066, 488128, 490990, 493994, 496970, 500178, 504022, 508800, 514547, 521160, 528636, 537049, 546202, 555534, 564448, 572595, 579758, 585674, 590139, 593203, 595196, 596695, 598403, 600762, 603471, 605587, 606261, 605334, 603209, 600385, 597228, 593956, 590658, 587382, 584311, 581740, 579849, 578667, 578304, 578967, 580617, 582821, 585079, 587190, 589275, 591714, 595095, 599805, 605413, 610834, 615443, 619830, 625027, 631216, 637635, 643575, 648841, 653151, 655803, 656412, 655623, 654566, 653708, 652644, 650926, 648635, 646005, 642968, 639390, 635529, 631909, 628804, 626180, 624080, 622721, 622153, 622082, 622172, 622417, 623206, 625203, 628972, 634352, 640227, 645419, 649882, 654399, 658847, 661539, 660960, 657693, 653864]
59835F53864k924k104j824j555j184j260k130l613n363o952p794p682p161o856
59821E95462o560n605l968k314j134m21j60l66o65m81J70O29M08l52j233j844
59805E71566j838j172m19k58o36j036j380k021k803l069k820k869l457l615k623
59790E41550j333j103j966k795k984k939k968k688j877j052p49p94p83q31j201
59775E15487j494r46M64J767K156J862J608J603J551J417J548K075K644K984L283
59760E38009L821M509M925M685L759K686K434L514N224O238O122N713N818O267
59746F03724O634P083P772Q024P061N222L638K812K324J790J310Q98L28m10j090
59731F57120j764k646l466l668l313l049l101l055k808k884l437l766l277k375
$$ y = [653864, 650940, 648836, 647012, 645457, 644273, 643013, 640883, 637270, 631907, 624955, 617161, 609479, 602318, 595462, 588902, 583297, 579329, 577015, 575881, 575460, 575300, 574934, 574269, 573788, 573958, 574587, 574995, 574643, 573410, 571566, 569728, 568556, 568137, 567879, 567243, 566207, 564827, 562806, 560003, 556934, 554114, 551245, 547788, 544173, 541550, 540217, 539114, 537148, 534353, 531369, 528430, 525462, 522774, 520897, 519845, 519096, 518302, 517519, 516688, 515487, 513993, 513047, 513511, 515278, 517434, 519296, 520904, 522507, 524058, 525475, 527023, 529098, 531742, 534726, 538009, 541830, 546339, 551264, 555949, 559708, 562394, 564828, 568342, 573566, 579804, 585926, 591639, 597457, 603724, 610358, 617441, 625213, 633237, 640298, 645520, 649158, 651970, 654294, 656084, 657394, 658292, 658620, 658210, 657120, 655356, 652710, 649244, 645576, 642263, 639214, 636113, 633058, 630250, 627366, 623929, 620163, 616886, 614511]
59717F14511j782j613j602j758k173k477k168j353o47m07m12k54K44R54J545J780
59701F02388J793K023K760L841M845N370N231M651M243M451M979N194M979M717
59687F61465M421L596K151P87R8j42m27p76r74j143j545k141k731l247l599l598
59671F52195l368l520m385n445n906n591m886m072l243k555k099j646r76k56K76
59656F04523P88J564K460L107L531M026M578M912N027N154N156M531L094J313
59642F53764k32j400k414l497m680n811o696p302p763q084q019p398o393n245
59628E78830l918k403j139p23j238k194l064l580l600l136k586k496k955l567
59614E42231m040m521n131n494n065l834k407j387q37l93J52N96O34L13N6K23
$$ y = [614511, 612729, 611116, 609514, 607756, 605583, 603106, 600938, 599585, 598938, 598531, 598119, 597865, 598109, 599063, 600608, 602388, 604181, 606204, 608964, 612805, 617650, 623020, 628251, 632902, 637145, 641596, 646575, 651769, 656748, 661465, 665886, 669482, 671633, 672420, 672518, 672376, 671949, 671173, 670199, 669056, 667511, 665370, 662639, 659392, 655793, 652195, 648827, 645307, 640922, 635477, 629571, 623980, 619094, 615022, 611779, 609224, 607125, 605479, 604503, 604247, 604523, 605311, 606875, 609335, 612442, 615973, 619999, 624577, 629489, 634516, 639670, 644826, 649357, 652451, 653764, 653532, 652132, 649718, 646221, 641541, 635730, 629034, 621732, 613969, 605885, 597866, 590468, 584075, 578830, 574912, 572509, 571370, 570647, 569409, 567215, 564151, 560571, 556971, 553835, 551249, 548753, 545798, 542231, 538191, 533670, 528539, 523045, 517980, 514146, 511739, 510352, 509515, 509122, 509274, 509870, 510504, 510817, 510873, 511096]
59598E11096P21J090R17J93o17r44o39q8K89M90P51J074J308J476J635J518Q17
59581E21087j89q45j027j270j844k355k544k798l427l955l746k892j969j212n45
59566D90469j71m50j264k054k467k545k310j627n79M58J165J512J611J580J500
59551D84828J340J018O79P55J443K350K901K950K804K869L522M967O840Q289R063
59536E36618J0183J2718J6009J7972J7449J5424J3396J1195P315J320m965r019
59524F45615r964q868p055m877k268K51J832K315K229J858R74m34j890l119m392
59509F12207n829o952p391p515p821q146q018p458o872o394n899n436n128m783
59495E18565m080l053j985j012k45N7j99n34l75K41Q33J156J349J606K086K887
$$ y = [511096, 511817, 512907, 513824, 514017, 513400, 512456, 511817, 511729, 512018, 512508, 513259, 514333, 515641, 517117, 518752, 520270, 521087, 520898, 520053, 519026, 517756, 515912, 513557, 511013, 508215, 504788, 500833, 497087, 494195, 492226, 491014, 490469, 490298, 489848, 488584, 486530, 484063, 481518, 479208, 477581, 477002, 477460, 478625, 480137, 481748, 483328, 484828, 486168, 487186, 487865, 488620, 490063, 492413, 495314, 498264, 501068, 503937, 507459, 512426, 519266, 527555, 536618, 546801, 559519, 575528, 593500, 610949, 626373, 639769, 650964, 658279, 659599, 654634, 645615, 635651, 626783, 619728, 614851, 612583, 612834, 614666, 616981, 619210, 621068, 622042, 621608, 619718, 616599, 612207, 606378, 599426, 592035, 584520, 576699, 568553, 560535, 553077, 546205, 539811, 533912, 528476, 523348, 518565, 514485, 511432, 509447, 508435, 508190, 508247, 508048, 507514, 507139, 507380, 508213, 509369, 510718, 512324, 514410, 517297]
59479E17297L788M298M340M477M978N247M794M170M154M411M030L020K227J885
59465E73116J409O40K00L84P32Q89J006J039O55J16K95J337K306K702L343N007
59449E95176P018Q075P918P357O984O723O301N446L784J268j433l522m950o215
59435F39930p365p846p342o275n341m861m683m448l895l078k283j648r53Q7J472
59420E81471K994M485N890P301R075J1568J4476J6872J8358J9817K2345K5423
59408G40075K6958K5384K1207J6098J0900N148j586q515j3872j5970j3994q494
59396G83339j571L880O016N264L293Q17k940q496j4636j9212k0988k0231j7920
59383F96615j4958j1937r047o216l615j774q23jJ448L127L958L673L152L223L813
$$ y = [517297, 521085, 525383, 529723, 534200, 539178, 544425, 549219, 553389, 557543, 561954, 565984, 569004, 571231, 573116, 574525, 575165, 575365, 575749, 576481, 577370, 578376, 579415, 580070, 580186, 580481, 581818, 584124, 586826, 590169, 595176, 602194, 610269, 618187, 625544, 632528, 639251, 645552, 650998, 654782, 656050, 654617, 651095, 646145, 639930, 632565, 624719, 617377, 611102, 605761, 600900, 596217, 591769, 587874, 584796, 582513, 580865, 579912, 579999, 581471, 584465, 588950, 594840, 602141, 611216, 622784, 637260, 654132, 672490, 692307, 714652, 740075, 767033, 792417, 813624, 829722, 840622, 845770, 844184, 835669, 821797, 805827, 791833, 783339, 781768, 785648, 791664, 796928, 800221, 801038, 798098, 789602, 774966, 755754, 734766, 714535, 696615, 681657, 669720, 660673, 654457, 650842, 649068, 648245, 648244, 649692, 652819, 656777, 660450, 663602, 666825, 670638]
59368F70638M401M696M714M566M360L954K945J330Pm4R58J856K067K101K501L092
59352G14142L577M068M676N232N774O706Q065R250R904J0457J1339J2206J2510
59339H17906J2318J2020J1624J0926R987Q888P390N390L386J907P19q16k806m832
59325H94007o642q251r477j0040j0131j0277j0559j0443r557q237p120o458o060
59312G80755n729n561n766o248o518o229n709n577n761n414m003k038k66J372
59298G17308L432N835P701Q299P597N839L067o89n077r469j3202j5722j6768j6583
59284F81568j5723j4539j2936j0746q201n892m175k823j320N14K332L762M879
59271F16700O045P449R013J0596J2009J2927J3152J2983J2864J2646J1620R456
$$ y = [670638, 675039, 679735, 684449, 689015, 693375, 697329, 700274, 701604, 701611, 701567, 702525, 704381, 706448, 708549, 711050, 714142, 717719, 721787, 726463, 731695, 737469, 744175, 752240, 761490, 771394, 781851, 793190, 805396, 817906, 830224, 842244, 853868, 864794, 874781, 883669, 891059, 896449, 899835, 901742, 902461, 901645, 898839, 894007, 887365, 879114, 869637, 859597, 849466, 839189, 828630, 818187, 808630, 800393, 793273, 786815, 780755, 775026, 769465, 763699, 757451, 750933, 744704, 738995, 733418, 727657, 722243, 718240, 716202, 715936, 717308, 720740, 726575, 734276, 742575, 750172, 756011, 759078, 758389, 753312, 743843, 730641, 714919, 698151, 681568, 665845, 651306, 638370, 627624, 619423, 613531, 609356, 606533, 605213, 605727, 608059, 611821, 616700, 622745, 630194, 639207, 649803, 661812, 674739, 687891, 700874, 713738, 726384, 738004, 747460]
59259G47460O673L958J425j143l642n646o959p780q377q775q807q362p558o647
59245F85820n756m756l562k424j598q62K41J694K921L550L855M202M496M410L991
59230F96222L748M110M893N310M701L394K507K588K804K012L20j166j940k542
59216G26961l407m253m839n368n814n777n405n574o512p155o601n461m894m964
59202F50937m876m417m095m087m002l585k928k004p84K77N59J96K2N63J568K554
59186F25898L327L910M395M948N626O198O413O388O369O282N924N488N409N731
59172G02306O024N900N343M549L834L596M046M944N758O072N666M570L244K350
59158G68202J989J501L97q98j790k585m063o188q065r154r822j0461j0832j0538
$$ y = [747460, 754133, 758091, 759516, 758373, 754731, 749085, 742126, 734346, 725969, 717194, 708387, 700025, 692467, 685820, 680064, 675308, 671746, 669322, 667724, 666862, 667103, 668797, 671718, 675268, 679123, 683325, 687821, 692231, 696222, 699970, 704080, 708973, 714283, 718984, 722378, 724885, 727473, 730277, 732289, 732609, 731443, 729503, 726961, 723554, 719301, 714462, 709094, 703280, 697503, 692098, 686524, 680012, 672857, 666256, 660795, 655901, 650937, 646061, 641644, 637549, 633462, 629460, 625875, 622947, 620943, 620159, 620436, 620995, 621191, 621213, 621776, 623344, 625898, 629225, 633135, 637530, 642478, 648104, 654302, 660715, 667103, 673472, 679754, 685678, 691166, 696575, 702306, 708330, 714230, 719573, 724122, 727956, 731552, 735598, 740542, 746300, 752372, 758038, 762608, 765852, 768202, 770191, 771692, 772089, 771191, 769401, 766816, 762753, 756565, 748500, 739346, 729524, 719063, 708231, 697693]
59144F97693r755r105r014r452j0032j0255r763q586p149o042n640n759n731n070
59130E86340m058l311k792j828k47J202J947K419L245M242M963N693P070R008
59116F13893J0806J2091J2901J3126J2659J2016J1853J2000J1702J0811R863R022
59104G52743P894O486N420M928M468L657K805K169J439M04n54j117j667k587l453
59089G83035l501k733j926j677j889k170k384k656l064l585m282n415p014q475
59075G32264q953q378p668p650q105q337q219q100p938p355o426n713n438n256
59061F28728m874m344l728l086k762l014l427l390l107l290l810l685k678j798
59047E81735j733j828j310o57p19j184j032j80M30L04k2L2L90Q15J369J985K249
$$ y = [697693, 687938, 678833, 669819, 660367, 650335, 640080, 630317, 621731, 614582, 608540, 602900, 597141, 591410, 586340, 582282, 578971, 576179, 574351, 574104, 575306, 577253, 579672, 582917, 587159, 592122, 597815, 604885, 613893, 624699, 636790, 649691, 662817, 675476, 687492, 699345, 711345, 723047, 733858, 743721, 752743, 760637, 767123, 772543, 777471, 781939, 785596, 788401, 790570, 792009, 792413, 791859, 790742, 789075, 786488, 783035, 779534, 776801, 774875, 773198, 771309, 769139, 766755, 764099, 761035, 757450, 753168, 747753, 740739, 732264, 723311, 714933, 707265, 699615, 691510, 683173, 674954, 666854, 658916, 651561, 645135, 639422, 633984, 628728, 623854, 619510, 615782, 612696, 609934, 606920, 603493, 600103, 596996, 593706, 589896, 586211, 583533, 581735, 580002, 578174, 576864, 576207, 575488, 574304, 573272, 573092, 573522, 573826, 573804, 573836, 574226, 575041, 576410, 578395, 580644]
59030E80644K040J944K539L582M479N313O740Q848J0832J2043J2812J3758J4752
59017F80326J5228J5205J5196J5135J4225J2111R462P004M632J966q20l252n137
59004G81281o259o130m788l396l069l307k580l78K163L763M160L717K736J589
58990G69502P38K33l87j322k199k733l154l697m129m165l939l672l268k569j685
58975G33554p61L04J597K906M043N244O859Q744J0228J0807J0692J0620J1018
58962H15855J1476J1172R895Q324P126O107M624K484k7k735n634q445j0724j2395
58948H37103j3712j4699j5092j4846j4241j3480j2595j1680j0820r831q562p245
58936F90300o111m889l320j947j613k168k549k189j572j262j168j042j004j193
$$ y = [580644, 582684, 584628, 587167, 590749, 595228, 600541, 607281, 616129, 626961, 639004, 651816, 665574, 680326, 695554, 710759, 725955, 741090, 755315, 767426, 776888, 783892, 788524, 790490, 789670, 786418, 781281, 775022, 768892, 764104, 760708, 757639, 754332, 751752, 751374, 753537, 757300, 761460, 765177, 767913, 769502, 770240, 770473, 770086, 768764, 766565, 763832, 760678, 756981, 752852, 748687, 744748, 741076, 737808, 735239, 733554, 732793, 733097, 734694, 737600, 741643, 746887, 753746, 762490, 772718, 783525, 794217, 804837, 815855, 827331, 838503, 848398, 856722, 863848, 869955, 874579, 877063, 877036, 874301, 868667, 860222, 849498, 837103, 823391, 808692, 793600, 778754, 764513, 751033, 738438, 726758, 715938, 706107, 697545, 690300, 684189, 679300, 675980, 674033, 672420, 670252, 667703, 665514, 663942, 662680, 661512, 660470, 659466, 658273]
58922F58273j484j759k056k263k202k138k544l250l402k560j271k86K12M22N37
58907F34229Q21J523K487L260L816M670O122P916R744J1542J3116J4083J4380
58894G27709J4276J3801J2791J1591J1029J1394J2113J2685J3257J4083J4995
58883H69724J5764J6273J6184J5121J3366J1665J0003P550M141R17j148k518m244
58870I72798o386q130r039r475r915j0351j0329r450p964o835o765p300p482p228
58856H56149p307p971q719r423j0572j2017j2697j2117j1017j0080q999p533o368
58843G31329o123o415o727p250q100q574q173p583p654q116q201p939p804p689
58829F24981p226o513n740m614l065j871j585j496o80N39J247J457J809K266K345
$$ y = [658273, 656789, 655030, 652974, 650711, 648509, 646371, 643827, 640577, 637175, 634615, 633344, 633058, 633270, 633692, 634229, 635050, 636573, 639060, 642320, 646136, 650806, 656928, 664844, 674588, 686130, 699246, 713329, 727709, 741985, 755786, 768577, 780168, 791197, 802591, 814704, 827389, 840646, 854729, 869724, 885488, 901761, 917945, 933066, 946432, 958097, 968100, 975650, 979791, 980708, 979560, 977042, 972798, 966412, 958282, 949243, 939768, 929853, 919502, 909173, 899723, 891759, 884924, 878159, 870859, 863377, 856149, 848842, 840871, 832152, 822729, 812157, 800140, 787443, 775326, 764309, 754229, 745230, 737697, 731329, 725206, 718791, 712064, 704814, 696714, 688140, 679967, 672384, 664730, 656614, 648413, 640474, 632670, 624981, 617755, 611242, 605502, 600888, 597823, 595952, 594367, 592871, 592191, 592730, 593977, 595434, 597243, 599509, 601854]
58814F01854K285K738L505L797L534L285L114K573J738J153Q65N54M06O99P10
58799F32810o37k930m401m151l130k549k508k598k879l537m204m341l838k917
58785E88190j736m34P40J619K253K829L561M524N407N703N431N264N492N371M105
58770F38319K034J34j289k570l758m558m995n259n150m518l992m225m639m087
58756E91447k733k035k671l595l536k448j121j43L18M26P52J774L061L629L335
58741E86460L220M143N804P388Q540R250R472R373R441R798R822Q933P523O638
58727F95805O866P773Q315P732O148M393L096K142J212N85P79J610K317K663L149
58712G54585L985M596M581M416M713N126M690L055Q50j194l075n275p989j0852
$$ y = [601854, 604139, 606877, 610382, 614179, 617713, 620998, 624112, 626685, 628423, 629576, 630441, 630995, 631401, 632100, 632810, 632173, 629243, 624842, 620691, 617561, 615012, 612504, 609906, 607027, 603490, 599286, 594945, 591107, 588190, 586454, 586020, 586760, 588379, 590632, 593461, 597022, 601546, 606953, 612656, 618087, 623351, 628843, 634214, 638319, 640353, 640487, 639198, 636628, 632870, 628312, 623317, 618058, 612908, 608390, 604398, 600173, 595534, 591447, 588714, 586679, 584008, 580413, 576877, 574429, 573308, 573165, 573483, 573909, 574661, 576435, 579496, 583125, 586460, 589680, 593823, 599627, 607015, 615555, 624805, 634277, 643650, 653091, 662889, 672711, 681644, 689167, 695805, 702671, 710444, 718759, 726491, 732639, 737032, 740128, 742270, 743482, 744067, 744846, 746456, 748773, 751436, 754585, 758570, 763166, 767747, 772163, 776876, 782002, 786692, 789747, 790597, 789403, 786328, 781053, 773064, 762212]
58698G62212j3378j5346j6713j7387j7465j7455j7766j8047j7525j6071j4373
58687E80686j2940j1585j0049q544p298o240n399n012m893m389l389k605k358
58674D95985j958r29K2J14k13n5O00J324K371M181O202P479Q057Q670R316R242
58658E50408Q207O629M698K398K30j174k068l123m170m443m057l963m396m512
58644E40664l794k801k314k535l309m276m763m276l196k322j824j339r02q67j084
58629E01062j070q30o92n29q1K79J05j80pJ23n75j505j344j07R47J379J836K383
58611E01194K332J979K683M728O767P869Q499Q909Q321O540M818M076L598K541
58597E74854J492J394J896J908J114j6j016j474r21N84K281L594M581N280N478
$$ y = [762212, 748834, 733488, 716775, 699388, 681923, 664468, 646702, 628655, 611130, 595059, 580686, 567746, 556161, 546112, 537568, 530270, 524030, 518631, 513619, 508726, 504337, 500948, 498343, 495985, 494027, 493098, 493120, 493234, 493021, 492966, 493566, 494890, 497261, 501442, 507644, 515123, 523180, 531850, 541166, 550408, 558615, 565244, 569942, 572340, 572570, 571396, 569328, 566205, 562035, 557592, 553535, 549572, 545176, 540664, 536870, 534069, 531755, 529220, 525911, 521635, 516872, 512596, 509400, 507078, 505254, 503915, 503013, 502146, 501062, 499992, 499162, 498470, 497941, 497860, 498139, 498244, 498064, 498057, 498180, 497605, 496100, 494756, 494649, 495596, 496975, 498811, 501194, 503526, 505505, 508188, 512916, 519683, 527552, 536051, 544960, 553281, 559821, 564639, 568715, 572313, 574854, 576346, 577740, 579636, 581544, 582658, 582642, 581626, 580152, 579231, 579815, 582096, 585690, 590271, 595551, 601029]
58582F01029N569O486Q275R746J0183J0311J0833J1101J0192Q456O995O250N993
58569G11419O122O651P356Q167R464J1477J3851J6289J8969K1898K4448K6114
58557H82225K7090K7613K7362K6013K3778K0890J7147J2464P317K292k271n893
58545A066027p986q687r011r793j1053j2549j4176j5553j6215j6561j7739k0117
58533I06587k2678k4287k4758k4280k2797k0469j7979j5861j4097j2605j1315
58522F95461r684p145m272k430k057k277k451k794l287l327k942k997l689m110
58508F41999l799l333k901j818j12R54P49K33J52j74j232j950j208M32J672K095
58492F31759J882J070J13O3J132K214K739L720N881Q097R013R015R319J0221J1530
$$ y = [601029, 606598, 613084, 621359, 631105, 641288, 651599, 662432, 673533, 683725, 692181, 699176, 705426, 711419, 717541, 724192, 731548, 739715, 749179, 760656, 774507, 790796, 809765, 831663, 856111, 882225, 909315, 936928, 964290, 990303, 1014081, 1034971, 1052118, 1064582, 1071899, 1074191, 1071920, 1066027, 1058041, 1049354, 1040343, 1030550, 1019497, 1006948, 992772, 977219, 961004, 944443, 926704, 906587, 883909, 859622, 834864, 810584, 787787, 767318, 749339, 733478, 719381, 706776, 695461, 685777, 678632, 674360, 671930, 669873, 667596, 665145, 662351, 659064, 655737, 652795, 649798, 646109, 641999, 638200, 634867, 631966, 630148, 630036, 630990, 631739, 631972, 632124, 631950, 630718, 628768, 627560, 627992, 629664, 631759, 633641, 634711, 634824, 634887, 636019, 638233, 640972, 644692, 650573, 658670, 667683, 676698, 686017, 696238, 707768]
58477G07768J3553J6178J8046J8073J7042J6284J5653J4121J1499Q314M720P99
58465H62050k857n939q903j1610j2670j1400r229p698o242l634m65J749L101M925
58451G91178P336R073R538R370Q953P835N631K510j124m653p270q772r809j0720
58437H09076j0896r980q726p785o713n118l602k456p46K018M554N609N931O907
58423G78073Q358R263R621R971J0008R325Q528Q021O718L690J06k238l454m810
58409H51180o477p727q549r236r232q229p376p583p627o044l815k909l056k351
58395G60969m06J490K808M007M770M336L307K993L232K919K266K376K966K766
58381H00799J877J562J956K114K048K578L446L715L777M688N927O016N206N143
$$ y = [707768, 721321, 737499, 755545, 773618, 790660, 806944, 822597, 836718, 848217, 856531, 861251, 862050, 859193, 853254, 844351, 832741, 820071, 808671, 799442, 791744, 785502, 781868, 781403, 783152, 786253, 791178, 798514, 807587, 817125, 826495, 835448, 843283, 848914, 851424, 850300, 845647, 838377, 829605, 819796, 809076, 798180, 788200, 779474, 771689, 764976, 759858, 756256, 753800, 753054, 755072, 759626, 765235, 771166, 778073, 786431, 795694, 805315, 815286, 825294, 834619, 843147, 851168, 857886, 861576, 861682, 859444, 855990, 851180, 844703, 836976, 828427, 819191, 809959, 801730, 794354, 786771, 779144, 773100, 769285, 766376, 763320, 760969, 760563, 762053, 764861, 768868, 773638, 777974, 781281, 784274, 787506, 790425, 792691, 795067, 798033, 800799, 802676, 804238, 806194, 808308, 810356, 812934, 816380, 820095, 823872, 828560, 834487, 840503, 845709, 850852]
58367H50852O050O529O167O073O774P681Q677J0193J1756J2419J2547J3208J4111
58354I73037J4150J3486J2939J1926R438O509N069M766L728K162K094L602M511
58341A067417M120M207N778P664R019J0435J1908J2311J1733J1902J3476J5143
58329A185113J6056J6846J7660J7514J6285J5132J4253J2440R504O980N754M983
58317A338520L982L238K997K782K755L732N544P120Q286R687J1123J1918J2646
58304A424330J4250J5875J5995J5311J5830J7414J8068J7448J7130J7520J7510
58293A606681J7079J7272J7689J7166J6751J8598K1991K3907K3701K3646K4741
58282A829222K5609K5922K7072K8938K9643K9146K9530L1240L2578L3271L4835
$$ y = [850852, 856902, 863431, 869598, 875671, 882445, 890126, 898803, 908996, 920752, 933171, 945718, 958926, 973037, 987187, 1000673, 1013612, 1025538, 1034976, 1041485, 1046554, 1051320, 1055048, 1057210, 1059304, 1062906, 1067417, 1071537, 1075744, 1081522, 1089186, 1098205, 1108640, 1120548, 1132859, 1144592, 1156494, 1169970, 1185113, 1201169, 1218015, 1235675, 1253189, 1269474, 1284606, 1298859, 1311299, 1320803, 1327783, 1333537, 1338520, 1342502, 1345740, 1348737, 1351519, 1354274, 1358006, 1363550, 1370670, 1378956, 1388643, 1399766, 1411684, 1424330, 1438580, 1454455, 1470450, 1485761, 1501591, 1519005, 1537073, 1554521, 1571651, 1589171, 1606681, 1623760, 1641032, 1658721, 1675887, 1692638, 1711236, 1733227, 1757134, 1780835, 1804481, 1829222, 1854831, 1880753, 1907825, 1936763, 1966406, 1995552, 2025082, 2056322, 2088900, 2122171, 2157006]
58271B157006L7059L8091L8448M0791M5166M8631N0319N2607N6502O0170O2929
58260B687719O6348P0479P3352P5107P8236Q2754Q5664Q6069Q6316Q7260Q7238
58249C566542Q6598Q8113R1899R5052R7238J01419J08039J14208J19703J27762
58239D596573J38669J48637J56617J65890J77410J88039J97127K08128K21843
58230F198933K34890K46805K61582K80226K99178L18128L41547L70287L99841
58221H951417M29200M62876N01872N41947N83535O33551O94237P60510Q31634
58212A4390779R14578J012193J119791J237779J375828J540307J730540J952182
58204B5273977K220606K546585K934254L398996L970881M673933N518396O518630
$$ y = [2157006, 2194065, 2232156, 2270604, 2311395, 2356561, 2405192, 2455511, 2508118, 2564620, 2624790, 2687719, 2754067, 2824546, 2897898, 2973005, 3051241, 3133995, 3219659, 3305728, 3392044, 3479304, 3566542, 3653140, 3741253, 3833152, 3928204, 4025442, 4126861, 4234900, 4349108, 4468811, 4596573, 4735242, 4883879, 5040496, 5206386, 5383796, 5571835, 5768962, 5977090, 6198933, 6433823, 6680628, 6942210, 7222436, 7521614, 7839742, 8181289, 8551576, 8951417, 9380617, 9843493, 10345365, 10887312, 11470847, 12104398, 12798635, 13559145, 14390779, 15305357, 16317550, 17437341, 18675120, 20050948, 21591255, 23321795, 25273977, 27494583, 30041168, 32975422, 36374418, 40345299, 45019232, 50537628, 57056258]
58196E7056258P701063R094040J0736205J2699021J5074351J7940686K1360410
58189A51662034K5334531K9581802L3286231L5238121L4481968L0892558K5022029
58182C65499274J7407462Q235298k201109j2879940k2146692k8549474l1613625
58175B93751194l1907338l0497025k8324746k5901104k3364656k0727340j8065704
58168A14963281j5528590j3234448j1218753r474139p993153o759093n733089
58161D5022016m875430m163747l578915l092258k679797k333587k047416j805291
58153B0445575j594243j414924j268640j145381j034453r36237q53741p81937
58145A1416019p14565o52977n99621n50308n00923m54792m16034l82008l49134
$$ y = [57056258, 64757321, 73851361, 84587566, 97286587, 112360938, 130301624, 151662034, 176996565, 206578367, 239864598, 275102719, 309584687, 340477245, 365499274, 382906736, 391142034, 388940925, 376060985, 353914293, 325364819, 293751194, 261843856, 231346831, 203022085, 177120981, 153756325, 133028985, 114963281, 99434691, 86200243, 74981490, 65507351, 57514198, 50755105, 45022016, 40146586, 35982839, 32403924, 29311666, 26631869, 24298282, 22250866, 20445575, 18851332, 17436408, 16167768, 15022387, 13987934, 13051697, 12197956, 11416019, 10701454, 10048477, 9448856, 8898548, 8397625, 7942833, 7526799, 7144791, 6795657]
58136F795657l19920k97522k79142k61102k45102k33555k23691k11905j99286
58127D524432j87821j75911j62428j50507j42533j35804j27552j19694j14295
58118C207887j09023j01655r4629r0457q6812q0760p4029o9537o6355o2409n8749
58107B313472n6839n4933n1325m8057m7450m7925m7059m5774m5791m5882m4426
58096A778011m2790m2516m1938l9210l6028l4720l4207l2336k9761k8088k6600
58085A389817k4176k2122k1742k1471j9660j7899j8200j9282j9042j8469j9575
58074A168179k1416k1770k0957k0687k0726k0002j9331j9857k0301j8932j6732
58063I47468j5597j4950j3169j0935r939r678q658p570q125r814j0826j1221j2215
$$ y = [6795657, 6475737, 6178215, 5899073, 5637971, 5392869, 5159314, 4935623, 4723718, 4524432, 4336611, 4160700, 3998272, 3847765, 3705232, 3569428, 3441876, 3322182, 3207887, 3098864, 2997209, 2902580, 2812123, 2725311, 2644551, 2570522, 2500985, 2434630, 2372221, 2313472, 2256633, 2201700, 2150375, 2102318, 2054868, 2006943, 1959884, 1914110, 1868319, 1822437, 1778011, 1735221, 1692705, 1650767, 1611557, 1575529, 1540809, 1506602, 1474266, 1444505, 1416417, 1389817, 1365641, 1343519, 1321777, 1300306, 1280646, 1262747, 1244547, 1225265, 1206223, 1187754, 1168179, 1146763, 1124993, 1104036, 1083349, 1062623, 1042621, 1023290, 1003433, 983132, 964200, 947468, 931871, 916921, 903752, 892817, 882878, 873200, 864542, 856972, 848847, 839033, 828207, 816986, 804771]
58050H04771j3266j2845j1381j0572j0389r382p484n994n289m775m631n375o300
58037F97088o344n916o010o310o007n559n796o307o502p102q643r814r424q703
58023E98651r297j0339j0012q808q505q823p982n920m349l913l752l524l533l297
58009E06597k231j365k051l428l509k383j907k464k504j391k99mJ63P67J438J951
57993D87380K546L000K750K020J570J454J215J036J289J396N52q62j932k780l967
57978D96667m968m917m288m174m366l964l301l390l883l602k739k474k619j815
57964D46167p1R50M56m93q50p30m43j2R9p31j970k311j604j087j533k458l217
57947D30162l610l288j955k38P70R73J172J686K307L332N191P185Q051P824P753
$$ y = [804771, 791505, 778660, 767279, 756707, 746318, 736936, 729452, 723458, 718169, 713394, 708763, 703388, 697088, 690744, 684828, 678818, 672508, 666501, 660942, 655146, 648839, 642337, 635235, 626592, 616778, 607354, 598651, 589354, 579015, 569003, 560195, 551690, 542867, 534885, 528965, 524616, 520703, 516951, 513427, 509894, 506597, 504366, 503001, 500950, 497522, 494013, 491630, 489723, 487259, 484755, 483364, 483065, 483061, 483224, 483991, 485429, 487380, 489926, 492926, 495676, 497696, 499266, 500720, 501935, 502971, 504260, 505656, 506208, 505346, 503414, 500634, 496667, 491699, 486782, 482494, 478320, 473954, 469990, 466689, 463299, 459416, 455814, 453075, 450601, 447982, 446167, 446096, 447046, 447502, 447009, 446159, 445429, 444986, 444974, 445073, 444342, 442372, 440061, 438457, 437370, 435837, 433379, 430162, 426552, 423264, 421309, 421071, 421841, 422814, 423986, 425672, 427979, 431311, 436502, 443687, 451738, 459562, 467315]
57932D67315Q412R211R621R497Q371N985L452K213J882P52j533l579m682n712
57918E11205p199q286q361q116q217q157p281n888m584l445k367j408m25Q06J893
57903D40170K098J473Q05L08n27j697k451k571k704l140l295k799k025j264l99
57888D21982L15K00o66j290j104o02l11j25L5j94q72j467j670j790k024k087j832
57871D06498j562j514j662k018k452k295r96Q46K011K165K014K086K436L303M881
57856D13741O396O762O238O143O871P358O816N612M200K517Q81M8j14p91k498
57841D70180m311n348n878o360o554o273o011o090o084n696n318n166m762l839
57827C92490k868k122j194K1P97P83P09J205J809J924J875K131K327J993J589
$$ y = [467315, 475727, 484938, 494559, 504056, 512427, 518412, 521864, 524077, 525959, 526711, 525178, 521599, 516917, 511205, 504006, 495720, 487359, 479243, 471026, 462869, 455588, 449700, 445116, 441671, 439304, 437896, 437471, 438277, 440170, 442268, 443741, 444546, 444854, 444327, 442630, 440179, 437608, 434904, 431764, 428469, 425670, 423645, 422381, 421982, 422297, 422497, 421831, 420541, 419437, 418835, 418524, 418399, 418434, 418240, 417368, 415901, 414231, 412441, 410417, 408330, 406498, 404936, 403422, 401760, 399742, 397290, 394995, 393999, 394845, 396856, 399021, 401035, 403121, 405557, 408860, 413741, 420137, 426899, 433137, 439280, 446151, 453509, 460325, 465937, 470137, 472654, 473535, 473583, 473469, 472678, 470180, 465869, 460521, 454643, 448283, 441729, 435456, 429445, 423355, 417271, 411575, 406257, 401091, 396329, 392490, 389622, 387500, 386306, 386327, 387124, 387907, 388616, 389821, 391630, 393554, 395429, 397560, 399887, 401880, 403469]
57812D03469J778K212J911N47j434l608n696p276q058q306q438q427q032p306
57798C43336o368n023l128j085M44J191J392J428J556J768J852J843K386M045
57784C45637O305P870Q132P720P503P651P943Q215Q222P677O759O010N525M839
57770D46008L780K726J759L93j515l314m471n247o057o809p256p425p338o894
57756C98340o336o132o159n683m525l360k624j944j081m39q9P13K240L399L103
57741C69423J866J107J305J773J877J570R48J08o17q97q21o71m44J4O05J134J630
57724C79910K153K511K447J935J040j71j382k171k611l290m365n161n108m587
57710C61150m371m565m631m213l485k838k508k395k152j668j390j754k376k413
$$ y = [403469, 405247, 407459, 409370, 409917, 408483, 404875, 399179, 391903, 383845, 375539, 367101, 358674, 350642, 343336, 336968, 331945, 328817, 327732, 328176, 329367, 330759, 332187, 333743, 335511, 337363, 339206, 341592, 345637, 351942, 359812, 367944, 375664, 383167, 390818, 398761, 406976, 415198, 422875, 429634, 435644, 441169, 446008, 449788, 452514, 454273, 454666, 453151, 449837, 445366, 440119, 434062, 427253, 419997, 412572, 405234, 398340, 392004, 385872, 379713, 374030, 369505, 366145, 363521, 361577, 360496, 360057, 359968, 360681, 362921, 366320, 369423, 371289, 372396, 373701, 375474, 377351, 378921, 379869, 379977, 379360, 378463, 377642, 376971, 376527, 376541, 377146, 378280, 379910, 382063, 384574, 387021, 388956, 389996, 389825, 388443, 386272, 383661, 380371, 376006, 370845, 365737, 361150, 356779, 352214, 347583, 343370, 339885, 337047, 334539, 332144, 329992, 328324, 326934, 325180, 322804, 320391]
57696C20391j751j162j110j178r12m85j79R2L71L94J65J62N96J094J463K076L122
57679C23149M192N125O571R061J2117J5005J7857K1444K6124L1672L7987M5442
57667E55746N4401O4183P2328P5337P1055O0328M5490K7433N583j9102m2635o0419
57655I09728p0241p2462o8721o1429n3279m5786l8741l1830k5906k1794j8787
57644D00752j5670j2472r966q030n904l718k347j913j616j087p97j020j226p62
57630C34224M72J994L010K866J756O27K9n36j597k696l076k807k437k081j680
57615C28068j613k114k548k284j773j825k210k100j496j048p88k90J58j62j031
57600C06944j460j260j187j437j253l79K72j21j261k335k924k900k268j455j124
$$ y = [320391, 318640, 317478, 316368, 315190, 314278, 313793, 313614, 313706, 314077, 314471, 314636, 314798, 315394, 316488, 317951, 320027, 323149, 327341, 332466, 339037, 348098, 360215, 375220, 393077, 414521, 440645, 472317, 510304, 555746, 610147, 674330, 746658, 821995, 893050, 953378, 998868, 1026301, 1031884, 1012782, 970147, 909728, 839487, 767025, 698304, 636875, 583596, 537810, 499069, 467239, 441333, 419539, 400752, 385082, 372610, 362644, 354614, 348710, 344992, 342645, 340732, 339116, 338029, 337232, 336212, 334986, 334224, 334696, 336690, 339700, 342566, 344322, 344949, 344978, 344442, 342845, 340149, 337073, 334266, 331829, 329748, 328068, 326455, 324341, 321793, 319509, 317736, 315911, 313701, 311601, 310105, 309057, 308269, 307979, 308137, 307975, 306944, 305484, 304224, 303037, 301600, 300347, 299968, 300240, 300119, 298858, 296523, 293599, 290699, 288431, 286976, 285852]
57585B85852j328j429j065o34n69p91j083j360j374p51L13R70O34m18j564k457
57569B72946k935k837k257j662j454j541j501j045k94K31J46k27n6Q63J677J657
57553B61711J328J681K631L194L025K788K920L026K662J992J304N45l36j053j250
57538B86168q05J71J239J596P42q07j981k339k274k130j850j491j390j549j543
57523B71757j257j129j479k031k343k211j546l88Q17J427J334J096J235J768K462
57508B69512L034L069K256R09j58l68K49J345K451K959K533J533O25Ln24q95r34
57491B87599r80j554k371k491j613m54L13O96Q06M57k22n66k06M01O76O21N00
57474B81612L42J34P0K37M07L97K94J14l07q85j175r59m89n1L38O14N90L83M16
$$ y = [285852, 284524, 283095, 282030, 281396, 280827, 280036, 278953, 277593, 276219, 275468, 275781, 276751, 277385, 276967, 275403, 272946, 270011, 267174, 264917, 263255, 261801, 260260, 258759, 257714, 257420, 257651, 257797, 257570, 257514, 258377, 260054, 261711, 263039, 264720, 267351, 270545, 273570, 276358, 279278, 282304, 284966, 286958, 288262, 288807, 288471, 287418, 286168, 285363, 285534, 286773, 288369, 289111, 288304, 286323, 283984, 281710, 279580, 277730, 276239, 274849, 273300, 271757, 270500, 269371, 267892, 265861, 263518, 261307, 259761, 259373, 260190, 261617, 262951, 264047, 265282, 267050, 269512, 272546, 275615, 277871, 278780, 278622, 278254, 278503, 279848, 282299, 285258, 287791, 289324, 289949, 289952, 289428, 288533, 287599, 286619, 285065, 282694, 280203, 278590, 278136, 278449, 279145, 279951, 280408, 280186, 279620, 279414, 279815, 280491, 281112, 281612, 281954, 282088, 282158, 282395, 282802, 283199, 283493, 283607, 283300, 282415, 281240, 280281, 279792, 279741, 280079, 280693, 281283, 281666, 282082]
57455B82082P65R71P07J66l28o12m45L81J439J802J175L52J83O08J052J299J481
57438B93078J612J641J675J813J981K172K484K763K638K140J880K208K680K713
57424C23478K372K055J736J102K41l27k96J27O27J110J598J951J920J539J339
57409C40572J871K903L498L120K368K145K474K655K341J687P70l39r86m19J060
57394C65720K250K605K714L061L270L026K827L131L507L408L233L809N112O181
57380D13854O195N176L813K934K934L427L574L011K196J717J570J281M92o61j509
57365D50004j209L49K044K559J923J352J534J904J889J883K421L252L823M086
57351D77814M207M072L692L546L935M424M567M642N063N529N449M829M124L574
$$ y = [282082, 282847, 283818, 284525, 284691, 284363, 283751, 283306, 283687, 285126, 286928, 288103, 288455, 288638, 289246, 290298, 291597, 293078, 294690, 296331, 298006, 299819, 301800, 303972, 306456, 309219, 311857, 313997, 315877, 318085, 320765, 323478, 325850, 327905, 329641, 330743, 330984, 330657, 330361, 330488, 331115, 332225, 333823, 335774, 337694, 339233, 340572, 342443, 345346, 348844, 351964, 354332, 356477, 358951, 361606, 363947, 365634, 366404, 366065, 365079, 364660, 365720, 367970, 370575, 373289, 376350, 379620, 382646, 385473, 388604, 392111, 395519, 398752, 402561, 407673, 413854, 420049, 425225, 429038, 431972, 434906, 438333, 441907, 444918, 447114, 448831, 450401, 451682, 452174, 451513, 450004, 448795, 449144, 451188, 453747, 455670, 457022, 458556, 460460, 462349, 464232, 466653, 469905, 473728, 477814, 482021, 486093, 489785, 493331, 497266, 501690, 506257, 510899, 515962, 521491, 526940, 531769, 535893, 539467]
57337E39467L280L531M365N151N265M897M597M405M103L922M172M452M117L446
57323E99170L449M412N392N453M752M221M503N463O405O696O353O063O354O859
57309F75545O730N826N059N430O885Q337Q797Q353P928Q106Q547Q724Q850R501
57295G82618J0512J0996J0546R760R358R386R541R730R978J0330J1022J2245J3521
57282I19543J4026J3790J3775J4438J5019J4762J3996J3405J2952J2320J1696
57271A069722J1349J0984J0342R904J0161J0588J0345R579R187R540J0312J1237
57259A193250J2232J2952J3163J3327J4012J4839J4953J4397J4132J4680J5553
57248A347490J6196J6646J7077J7310J7091J6561J6189J6408J7243J8170J8612
$$ y = [539467, 542747, 546278, 550643, 555794, 561059, 565956, 570553, 574958, 579061, 582983, 587155, 591607, 595724, 599170, 602619, 607031, 612423, 617876, 622628, 626849, 631352, 636815, 643220, 649916, 656269, 662332, 668686, 675545, 682275, 688101, 693160, 698590, 705475, 713812, 722609, 730962, 738890, 746996, 755543, 764267, 773117, 782618, 793130, 804126, 814672, 824432, 833790, 843176, 852717, 862447, 872425, 882755, 893777, 906022, 919543, 933569, 947359, 961134, 975572, 990591, 1005353, 1019349, 1032754, 1045706, 1058026, 1069722, 1081071, 1092055, 1102397, 1112301, 1122462, 1133050, 1143395, 1152974, 1162161, 1171701, 1182013, 1193250, 1205482, 1218434, 1231597, 1244924, 1258936, 1273775, 1288728, 1303125, 1317257, 1331937, 1347490, 1363686, 1380332, 1397409, 1414719, 1431810, 1448371, 1464560, 1480968, 1498211, 1516381, 1534993]
57237A534993J8720J9187K0078K0513J9999J9386J9748K0948K2137K3021K3694
57226A762424K3832K3221K2673K3125K4061K4136K3265K2735K3198K3874K4005
57215B020549K3870K3996K4400K5059K6145K7390K8121K8231K8291K8445K8158
57204B312655K7455K7293K8143K9148K9437K9472L0252L1868L3639L5185L6547
57193B651094L7550L7880L7673L7469L7590L7887L8014L7620L6508L4826L3019
57182C057130L1413K9986K8625K7367K6324K5628K5474K5842K6239K6176K5831
57171C356035K5746K5930K5880K5514K5303K5345K5184K4815K5056K6348K7911
57160C639067K8713K8769K8862K9385L0038L0419L0435L0274L0439L1457L3207
$$ y = [1534993, 1553713, 1572900, 1592978, 1613491, 1633490, 1652876, 1672624, 1693572, 1715709, 1738730, 1762424, 1786256, 1809477, 1832150, 1855275, 1879336, 1903472, 1926737, 1949472, 1972670, 1996544, 2020549, 2044419, 2068415, 2092815, 2117874, 2144019, 2171409, 2199530, 2227761, 2256052, 2284497, 2312655, 2340110, 2367403, 2395546, 2424694, 2454131, 2483603, 2513855, 2545723, 2579362, 2614547, 2651094, 2688644, 2726524, 2764197, 2801666, 2839256, 2877143, 2915157, 2952777, 2989285, 3024111, 3057130, 3088543, 3118529, 3147154, 3174521, 3200845, 3226473, 3251947, 3277789, 3304028, 3330204, 3356035, 3381781, 3407711, 3433591, 3459105, 3484408, 3509753, 3534937, 3559752, 3584808, 3611156, 3639067, 3667780, 3696549, 3725411, 3754796, 3784834, 3815253, 3845688, 3875962, 3906401, 3937858, 3971065]
57149C971065L4779L5380L5160L4807L4660L4588L4456L4221L3740L2868L1695
57138D347419L0440K9207K8045K7129K6697K6943K8020K9854L1925L3593L4788
57127D674060L5992L7458L8983M0645M3034M6354M9853N2764N5394N8743O3431
57116E196711O9555P7286Q6812R7913J10320J24467J41146J60478J81903K05360
57106F451951K31766K62208K97413L38516L87828M48281N22477O12718P21619
57097A0274777Q52042J006411J186246J391767J621125J870104K133144K404314
57089B2739930K676307K938583L177800L380162L531422L613622L604132L481412
57081D9143370L233325K860581K374598J794866J146972M57892k50012r58860
$$ y = [3971065, 4005844, 4041224, 4076384, 4111191, 4145851, 4180439, 4214895, 4249116, 4282856, 4315724, 4347419, 4377859, 4407066, 4435111, 4462240, 4488937, 4515880, 4543900, 4573754, 4605679, 4639272, 4674060, 4710052, 4747510, 4786493, 4827138, 4870172, 4916526, 4966379, 5019143, 5074537, 5133280, 5196711, 5266266, 5343552, 5430364, 5528277, 5638597, 5763064, 5904210, 6064688, 6246591, 6451951, 6683717, 6945925, 7243338, 7581854, 7969682, 8417963, 8940440, 9553158, 10274777, 11126819, 12133230, 13319476, 14711243, 16332368, 18202472, 20335616, 22739930, 25416237, 28354820, 31532620, 34912782, 38444204, 42057826, 45661958, 49143370, 52376695, 55237276, 57611874, 59406740, 60553712, 61011604, 60761592, 59802732]
57073E9802732j647448k285604k839159l280731l595576l780350l840915l791678
57065C4741271l653202l447534l195351k916001k626836k340680k065168j805526
57057A2690973j566666j351953j161780r95093q51476p30506o29955n46202m76122
57048D381220m17513l68227l26155k89984k58979k32074k08039j86518j67957
57039A925774j52330j38554j25327j12134r9228q7028p5652o4794n3964m2985
57029I73778l2086k1175r095N719K3056L9356M9156M9234M1311K9684J5892k868
57017A161962k8826n8204q2571r5661r7553r2399q4075p4660o5238n6364m8174
57006C78237m0969l5314l1110k7338k3384j9904j7687j6314j4821j3009j1294
$$ y = [59802732, 58155284, 55869680, 53030521, 49749790, 46154214, 42373864, 38532949, 34741271, 31088069, 27640535, 24445184, 21529183, 18902347, 16561667, 14496499, 12690973, 11124307, 9772354, 8610574, 7615481, 6764005, 6033499, 5403544, 4857342, 4381220, 3963707, 3595480, 3269325, 2979341, 2720362, 2488288, 2280249, 2093731, 1925774, 1773444, 1634890, 1509563, 1397429, 1298201, 1211173, 1135521, 1070727, 1016763, 973778, 941692, 920517, 911422, 917141, 940197, 979553, 1028709, 1077943, 1119254, 1148938, 1164830, 1161962, 1133136, 1074932, 992361, 896700, 799147, 706748, 622673, 548013, 482775, 426411, 378237, 337268, 301954, 270844, 243506, 220122, 200218, 182531, 166217, 151396, 138387, 127093]
56995A27093r740q205p055o806p142p114o174m512k438o0K516N016O983P840P267
56980I7469N641L661J316k054o352j0189j2291j2834j2733j2232j1016r134o993
56967A2259m754k436k60J695L838O439R090J1431J3854J6707J9171J9919J8626
56954A25579J6040J2631Q114K357l935r579j3637j5844j6624j6561j5617j3313
56942E9611r869o527m217k413J3L374P147J0947J4717J8346K1686K4547K6176
56929A63538K5373K1853J6759J1120M557l449j1769j8439k2717k5093k5721k4370
56917A11642k1681j8962j6587j3957j1023q536o728n102l755A841b267m263l147
56904i677j686r88p61m4J306K687L702a175C134L794L229L255M177O022Q649J1580
$$ y = [127093, 117353, 109148, 102093, 95287, 88145, 81031, 74857, 70345, 67907, 67847, 70363, 75379, 82362, 90202, 97469, 103110, 106771, 108087, 106033, 99681, 89492, 77201, 64367, 51634, 39402, 28386, 19252, 12259, 7505, 5069, 4809, 6504, 10342, 16781, 25871, 37302, 51156, 67863, 87034, 106953, 125579, 141619, 154250, 162364, 164721, 160786, 151207, 137570, 121726, 105102, 88541, 72924, 59611, 49742, 43215, 38998, 36585, 36598, 39972, 47119, 58066, 72783, 91129, 112815, 137362, 163538, 188911, 210764, 227523, 238643, 243200, 239751, 227982, 209543, 186826, 161733, 136012, 111642, 89961, 70999, 54412, 40455, 29432, 20896, 14168, 9066, 5311, 1841, -2267, -6530, -9677, -11363, -12351, -13112, -13156, -11850, -9163, -5461, -1175, 3134, 6928, 10157, 13412, 17589, 23611, 32260, 43840]
56888D3840J4192J6327J8250J9832K0278J8991J6242J2653Q521L979o07m716p975
56875A79807j0119j0948j0410q574n557j761J967N035P818J1204J5475K0275K5529
56862B19741L1511L7796M2947M5557M5105M1665L5471K6981J6687M716q611k1531
56850E18035l1122l5466l5118l1982k7333k1468j4694p742j185N049J1537J8814
56838C47325K6932L5521M4372N3673O3055P0561P3404P0093O1188M7765K9935
56827I23824P745j6937m0158n7726o7362o9418o5968n9260n0804m1609l2679k4653
56815D04995j7218r555j437O660J4544K2686L1375L9964M7093N1171N0705M4970
56803F85953L4640K1211N673j1512k8974m3924n3782n7833n6967n2501m5811l8375
$$ y = [43840, 58032, 74359, 92609, 112441, 132719, 151710, 167952, 180605, 189126, 193105, 192498, 187782, 179807, 169688, 158740, 148330, 139756, 134199, 132438, 134405, 139440, 147258, 158462, 173937, 194212, 219741, 251252, 289048, 331995, 377552, 422657, 464322, 499793, 526774, 543461, 548177, 539566, 518035, 486913, 451447, 416329, 384347, 357014, 335546, 320852, 313110, 311925, 316974, 328511, 347325, 374257, 409778, 454150, 507823, 570878, 641439, 714843, 784936, 846124, 893889, 923824, 931569, 914632, 874474, 816748, 749386, 679968, 614000, 554740, 503936, 462327, 429648, 404995, 387777, 378222, 376785, 383445, 397989, 420675, 452050, 492014, 539107, 590278, 640983, 685953, 720593, 741804, 747477, 735965, 706991, 663067, 609285, 551452, 494485, 441984, 396173, 357798]
56791C57798l1215k4433j7788j1518o030j173L656Q719J3800J8615K2818K5604
56779C58853K5897K3122J7643J0284J647p918j7728k6373l2268l4768l4570l2854
56767B50967l0242k6817k2834j8942j5712j3336j1710j0495r303q159p579p658
56755F8180p515o202m054k360j875k302l066l721l744k862j681j155j309j305
56741B5029q04l70l99o38q77j253j574j388q97q42j166r21J24R79J037J011J515
56724A8566J932J582J064J230J656J348M10j46L3L88N62Q26J346J806J864J482
56708C5949Q35K62J09L67O52P90J032J458J686J516J313J347J373J274J454K036
56692E3453K316J746Q58N10O72P50O86R21J520K097K458K710K911L070L332L669
$$ y = [357798, 326583, 302150, 284362, 272844, 266814, 265641, 269297, 278016, 291816, 310431, 333249, 358853, 384750, 407872, 425515, 435799, 437446, 429528, 411800, 385427, 353159, 318391, 283821, 250967, 220725, 193908, 171074, 152132, 136420, 123084, 111374, 100879, 91576, 83417, 75838, 68180, 60665, 54463, 50409, 48049, 46174, 43872, 40806, 37085, 33341, 30479, 28798, 27643, 26334, 25029, 24225, 23855, 23456, 22818, 21941, 20688, 19114, 17726, 16829, 15987, 14821, 13900, 14024, 15003, 16040, 17051, 18566, 20498, 22080, 23144, 24374, 26030, 27378, 27788, 27642, 27675, 28063, 28625, 29451, 30797, 32603, 34467, 35949, 36784, 37046, 37155, 37522, 38174, 38964, 39996, 41454, 43140, 44656, 45969, 47316, 48689, 49963, 51417, 53453, 55769, 57515, 58373, 58883, 59555, 60305, 60991, 61912, 63432, 65529, 67987, 70697, 73608, 76678, 80010, 83679]
56676H3679L692L179K513K157K057J902J621J261P70L33L30O30M91l48j146j277
56660A01844j126j242j344j011p03j123k021k499k263j649q26J34P22M59k51n35
56644H6566j99K22L25J34k07l77N7Q79J036jj175j064J68J150J268J130J200J149
56626I2261P48L60K67K38K3l05o53j012j239j211j169j364j527j186m57N3J6m10
56608H3433j003j587j850j618j140p08k83J61L05J5k60k07j70l89l14M03R59M51
56590G6198n52o83K89J331J706J566J164O34M88J223K348K804K402J929J875K002
56574I6724K174K546K820K381J367P38R98J658K144K494K992L764M919O519Q294
56559A42532R937J1508J3021J3880J3478J2064J0243P977M969J734q17k593m103
$$ y = [83679, 87371, 90550, 93063, 95220, 97277, 99179, 100800, 102061, 102831, 103164, 103494, 104124, 104615, 104267, 103121, 101844, 100718, 99476, 98132, 97121, 96418, 95295, 93274, 90775, 88512, 86863, 86037, 86171, 86893, 87352, 87101, 86566, 86367, 86589, 86914, 87048, 86841, 86464, 86521, 87400, 88436, 88435, 87260, 86196, 86364, 87514, 88782, 89912, 91112, 92261, 93009, 93369, 93636, 93874, 93897, 93592, 92939, 91927, 90688, 89477, 88308, 86944, 85417, 84231, 83774, 83827, 83843, 83433, 82430, 80843, 78993, 77375, 76235, 75527, 75244, 75405, 75710, 75725, 75465, 75258, 75088, 74699, 74385, 74788, 75747, 76198, 75646, 74963, 75252, 76583, 78289, 79855, 81019, 81653, 82141, 83364, 85712, 88516, 90918, 92847, 94722, 96724, 98898, 101444, 104264, 106645, 108012, 108750, 109748, 111406, 113550, 116044, 119036, 122800, 127719, 134238, 142532, 152469, 163977, 176998, 190878, 204356, 216420, 226663, 234640, 239609, 241343, 240526, 237933, 233830]
56546B33830n196n222m300l305k613k027j756k264l179l632l637l854m129l695
56532A85021k829k691l323l466k740k241k474k401j412o09j033j899j862j022
56518A55019n42r65j925k936l644l754l354k800k054p61O32R37j47j343j413n23
56502A30427N20J475K306K587K097J330P18N6p76j275j163r81j178j404j338j339
56486A32062j580j428n23L60M19N3N6L12K70P9K37N41M10q9m00l55j70J35O23
56467A31012J070J256J329J392J197P32N42R00J262J074N69J55k71p68q14j40
56451A40497N55N78L67P74J658K144J890J283P22M58P81J593K121J761R00L21
56435A58403J49Q4J64M84N74o9j092j684j596j181o53n1M05N75P81J238J509J122
$$ y = [233830, 228634, 223412, 219112, 215807, 213194, 211167, 209411, 207147, 203968, 200336, 196699, 192845, 188716, 185021, 182192, 179501, 176178, 172712, 169972, 167731, 165257, 162856, 161444, 160835, 159802, 157903, 156041, 155019, 154477, 153512, 151587, 148651, 145007, 141253, 137899, 135099, 133045, 132284, 132916, 133853, 133706, 132363, 130950, 130427, 130947, 132422, 134728, 137315, 139412, 140742, 141460, 141516, 140740, 139465, 138302, 137321, 136143, 134739, 133401, 132062, 130482, 129054, 128531, 128891, 129310, 129363, 129419, 129731, 130001, 130080, 130317, 130858, 131268, 131179, 130779, 130424, 130254, 130389, 131012, 132082, 133338, 134667, 136059, 137256, 137988, 138530, 139430, 140692, 141766, 142335, 142490, 142219, 141451, 140637, 140497, 141052, 141630, 141997, 142771, 144429, 146573, 148463, 149746, 150468, 150926, 151707, 153300, 155421, 157182, 158082, 158403, 158552, 158636, 158800, 159284, 159858, 159789, 158697, 157013, 155417, 154236, 153583, 153532, 153937, 154512, 155293, 156531, 158040, 159162]
56417A59162M29R0J20J21J74O31J232J286O34k26q71j259j390j235r18n12J64
56400A57632J148J986K153J665R17K61K2M37J177J432Q97J93r0j37k13OP67J474
56382A71727J429P93K05j30k68j12K48K65j91m05N6M91K21j61K41J079J333R70
56364A77791P80R29R12P13P94J037Q13J73j62oQ3j09l3O80J677K416K684K521
56346A93693K161J986K077J951J250L93J0O6K21N68J284J948K165K452L517M903
56330B20645N429M763L613K509J505R70J463K618L237K823K133J970K139K000
56316B57817J336L91n02r88q23j59N40R20R18O72N18P76J305J583J558J875K810
56299B70547L646L736L563L937M662M935M617M129L512K560J691J571K027K344
$$ y = [159162, 159591, 159681, 159801, 159922, 160096, 160727, 161959, 163245, 163879, 163653, 162782, 161523, 160133, 158898, 157980, 157468, 157632, 158780, 160766, 162919, 164584, 165501, 165762, 165784, 166221, 167398, 168830, 169727, 169920, 169830, 169693, 169480, 169486, 170253, 171727, 173156, 173949, 174154, 174024, 173756, 173644, 173892, 174157, 173966, 173561, 173617, 174108, 174329, 174168, 174409, 175488, 176821, 177791, 178571, 179500, 180412, 181125, 181919, 182956, 183769, 183942, 183780, 183774, 183857, 183748, 183715, 184395, 186072, 188488, 191172, 193693, 195854, 197840, 199917, 201868, 203118, 203511, 203521, 203587, 203808, 204376, 205660, 207608, 209773, 212225, 215742, 220645, 226074, 230837, 234450, 236959, 238464, 239434, 240897, 243515, 246752, 249575, 251708, 253678, 255817, 257817, 259153, 259544, 259042, 258054, 257231, 257072, 257612, 258532, 259450, 260122, 260640, 261416, 262721, 264304, 265862, 267737, 270547, 274193, 277929, 281492, 285429, 290091, 295026, 299643, 303772, 307284, 309844, 311535, 313106, 315133, 317477]
56285C17477K507L210M597N896O414O153N498M968N140O139P237P702P766Q130
56271C98834Q815R317R664J0366J1489J2592J3529J4471J5300J5790J6278J7418
56259E53863J9342K1724K4483K7762L1474L5568M0353M5867N1372N6277O1129
56248I69214O6825P3304P9941Q6602R3240R8960J02796J05045J06522J06802J04498
56237A993749R9077R1137Q1066O8765N4593L9228K2735M995j2931k9213m3120
56226B370081n5252o5915p4571q1028q5847q9281r0933r0699q9127q6586q3114
56215A477728p9102p5130p1089o6499o1672n7456n3848n0063m6019m2503l9716
56204H34631l6894l3609l0325k7343k4346k1346j9011j7614j6444j4749j2594
$$ y = [317477, 319984, 323194, 327791, 333687, 340101, 346254, 351752, 356720, 361860, 367999, 375236, 382938, 390704, 398834, 407649, 416966, 426630, 436996, 448485, 461077, 474606, 489077, 504377, 520167, 536445, 553863, 573205, 594929, 619412, 647174, 678648, 714216, 754569, 800436, 851808, 908085, 969214, 1036039, 1109343, 1189284, 1275886, 1369126, 1468086, 1570882, 1675927, 1782449, 1889251, 1993749, 2092826, 2183963, 2265029, 2333794, 2388387, 2427615, 2450350, 2455345, 2442414, 2413201, 2370081, 2314829, 2248914, 2174343, 2093315, 2007468, 1918187, 1827254, 1736555, 1647428, 1560842, 1477728, 1398626, 1323496, 1252407, 1185908, 1124236, 1066780, 1012932, 962869, 916850, 874347, 834631, 797737, 764128, 733803, 706460, 682114, 660768, 641757, 624143, 607699, 592950, 580356]
56193E80356j0527q947p908p123o156n048m333m074l513k367j612j972k527k051
56179E12198r78n86q60p69r3N27J022J736K320K369K648M004N509N568M532M251
56163E43398N277O494P283Q053Q724Q757Q731R838J1795J3218J4001J5360J7544
56150F78473J9760K2317K6433L1748L6484M0524M5919N3843O3297P3377Q4448
56139A176623R6317J07384J16348J22766J25551J23149J15932J06254R5606Q3962
56129B269892P2191O2365N4803M7470L9338L1685K4967J7181P003l903j3476k2051
56117B587465l0904m0091m9489o0147p2683q5727r7405j07064j14285j17843j16934
56106A694893j12112j04068r3019q0147o7785n7054m7103l7609k9998k5074k1493
$$ y = [580356, 569829, 560882, 552974, 545851, 539695, 534647, 530314, 526240, 522727, 520360, 518748, 516776, 514249, 512198, 511220, 510634, 509774, 509005, 508912, 509439, 510461, 512197, 514517, 516886, 519534, 523538, 529047, 534615, 539147, 543398, 548675, 555169, 562452, 570505, 579229, 587986, 596717, 606555, 618350, 631568, 645569, 660929, 678473, 698233, 720550, 746983, 778731, 815215, 855739, 901658, 955501, 1018798, 1092175, 1176623, 1272940, 1380324, 1496672, 1619438, 1744989, 1868138, 1984070, 2090324, 2185930, 2269892, 2342083, 2404448, 2459251, 2506721, 2546059, 2577744, 2602711, 2619892, 2626895, 2622992, 2609516, 2587465, 2556561, 2516470, 2466981, 2406834, 2334151, 2248424, 2151019, 2043955, 1929670, 1811827, 1694893, 1582781, 1478713, 1385694, 1305547, 1237762, 1180708, 1133605, 1095996, 1065998, 1040924, 1019431]
56095A019431j7826j4250j1047p558l847j424q79p34J82J165J638K497M080N038
56081I76466M682M413N307O386O729P182Q431R531R879J0568J2213J3615J3983
56068A089385J4317J5117J5157J4139J4007J5839J7799J8150J7956J8793K0125
56057A270784K0854K1277K1606K0860J9016J7925J8331J8557J7803J7841J9448
56046A484302K0352J9108J7921J8941K0607K0749K0467K1790K3874K4833K5228
56035A718172K6674K8788L0269L1362L2820L4316L5863L8652M2553M5362M6414
56024B111245M7950N0947N3025N2812N2772N5021N7973O0016O2697O7200P1471
56013B743129P4121P7332Q2500Q7018Q9003R1019R5290R9557J01800J04685J10802
$$ y = [1019431, 1001605, 987355, 976308, 968750, 964903, 963479, 962600, 961866, 962048, 963213, 964851, 967348, 971428, 976466, 981148, 985561, 990868, 997254, 1003983, 1011165, 1019596, 1029127, 1039006, 1049574, 1061787, 1075402, 1089385, 1103702, 1118819, 1133976, 1148115, 1162122, 1177961, 1195760, 1213910, 1231866, 1250659, 1270784, 1291638, 1312915, 1334521, 1355381, 1374397, 1392322, 1410653, 1429210, 1447013, 1464854, 1484302, 1504654, 1523762, 1541683, 1560624, 1581231, 1601980, 1622447, 1644237, 1668111, 1692944, 1718172, 1744846, 1773634, 1803903, 1835265, 1868085, 1902401, 1938264, 1976916, 2019469, 2064831, 2111245, 2159195, 2210142, 2263167, 2315979, 2368751, 2423772, 2481745, 2541761, 2604458, 2671658, 2743129, 2817250, 2894582, 2977082, 3064100, 3153103, 3244122, 3339412, 3438969, 3540769, 3645454, 3756256]
56002C756256J17854J23251J29126J37832J46953J53897J61084J71188J81782
55993E079223J90248J99379K12267K26295K38343K51270K68785K88609L07339
55984G261758L27403L52393L80328M08334M39058M75464N14757N54588N99424
55975A1313507O53480P13923P78861Q54550R46060J048923J159738J286684J439361
55966B0195087J617655J822363K067261K368604K733575L173054L714210M384814
55958D2076623N196169O156733P290249Q627706J0201405J2065233J4300969J6990244
55950A22905331K0199429K3952054K8053042L1812697L4061421L3710900L0424036
55943C25118910K4642905J6945648P600239l063493j3996632k3484709l0020680
$$ y = [3756256, 3874110, 3997361, 4126487, 4264319, 4411272, 4565169, 4726253, 4897441, 5079223, 5269471, 5468850, 5681117, 5907412, 6145755, 6397025, 6665810, 6954419, 7261758, 7589161, 7941554, 8321882, 8730216, 9169274, 9644738, 10159495, 10714083, 11313507, 11966987, 12680910, 13459771, 14314321, 15260381, 16309304, 17469042, 18755726, 20195087, 21812742, 23635105, 25702366, 28070970, 30804545, 33977599, 37691809, 42076623, 47272792, 53429525, 60719774, 69347480, 79548885, 91614118, 105915087, 122905331, 143104760, 167056814, 195109856, 226922553, 260983974, 294694874, 325118910, 349761815, 366707463, 374307702, 371244209, 357247577, 333762868, 303742188]
55936C03742188l3101879l3231294l1348523k8339860k4880197k1430755j8248616
55929A13161064j5433570j3009986j0969745r269709p846418o652125n659731
55922D4319780m838067m148811l567283l083657k683146k343750k052835j808283
55914A9793948j603189j424751j267485j133164j018236r14352q20313p40919
55906A0871539o74747o14639n59333n13369m76123m41536m08188l79684l55468
55897F448452l30799l05497k83790k65714k47068k27544k10863j97122j82824
55888D197231j68164j56741j48161j38171j26125j15566j07501r9666r2212q7630
55878B957294q5182q1746p7992p7507p9777q0247p7586p4960p3720p1561o7619
$$ y = [303742188, 270640309, 237409015, 206060492, 177720632, 152840435, 131409680, 113161064, 97727494, 84717508, 73747763, 64478054, 56631636, 49979511, 44319780, 39481713, 35332902, 31765619, 28681962, 25998816, 23655066, 21602231, 19793948, 18190759, 16766008, 15498523, 14365359, 13347123, 12432771, 11612458, 10871539, 10196792, 9582153, 9022820, 8509451, 8033328, 7591792, 7183604, 6803920, 6448452, 6117653, 5812156, 5528366, 5262652, 5015584, 4788040, 4577177, 4380055, 4197231, 4029067, 3872326, 3724165, 3585994, 3459869, 3344303, 3236802, 3137136, 3044924, 2957294, 2872112, 2790366, 2712374, 2634867, 2555090, 2474843, 2397257, 2322297, 2248577, 2177016, 2109397]
55867B109397o4041o1668n8969n5816n3822n2572m9874m6002m3435m2365m0706
55856A540127l8443l7610l7992l7225l5160l3968l3839l2779l0655k9320k8765
55845A164371k7277k5372k5322k6695k6690k5002k4082k4301k3241k0389j8278
55834H97722j8077j7995j6969j6188j6090j5358j3826j3015j3001j2018r917q752
55822G26516r201r619r318r632j0904j1571j1135j1005j1611j1544j0342r309
55810F01325q860p881o333n613n715m956l166k137k215j540M68J980K121K495
55796E59973M063N427N432M868M297K899P18n17l08o08k591m577m837m296m663
55781E65280n760o495o920p775r174j0933j3032j4723j4602j2393r377o378k913
$$ y = [2109397, 2045356, 1983688, 1924719, 1868903, 1815081, 1762509, 1712635, 1666633, 1623198, 1580833, 1540127, 1501684, 1464074, 1426082, 1388857, 1353697, 1319729, 1285890, 1253111, 1222456, 1193136, 1164371, 1137094, 1111722, 1086400, 1059705, 1033015, 1008013, 983931, 959630, 936389, 916000, 897722, 879645, 861650, 844681, 828493, 812403, 797045, 783219, 770204, 757203, 745185, 735268, 726516, 717315, 707696, 698378, 688746, 677842, 666271, 655136, 644131, 632520, 620976, 610634, 601325, 592465, 584584, 578251, 572638, 566923, 561967, 558801, 556664, 554449, 552909, 553377, 555357, 557478, 559973, 564036, 569463, 574895, 579763, 584060, 586959, 587677, 587160, 586852, 586244, 583653, 579076, 574239, 569943, 565280, 559520, 553025, 546105, 538330, 529156, 518223, 505191, 490468, 475866, 463473, 454096, 447718, 444805]
55768D44805R21L592M177L643L092K157J54k508n039p155q459q214o508m531l146
55753D16981k238j841k460l912n284o372p706q942q955p959p605q368q699p551
55739C29089n934n078m657l890k938k250j771j592k138l068l303k752k622l444
55725B83652m256m434m707n600o320o120n437m862m181l212k353j703q37N7K35
55710B29922O3R87L167M814M718L883L642L639K825J197n86k225l518m064m064
55695B44400m396n233n716n485n262n240m458k605j009p83j234j156n63r6K00
55680B01364N41P88R94J626K515K641J624L83l53r58j677j842j196p00j082j737
55664B02931j927j899j926j507m15O22J183J838K689K702J492L68L33M65k82j029
$$ y = [444805, 445726, 449318, 453495, 457138, 460230, 462387, 462541, 460033, 454994, 447839, 439380, 431166, 424658, 420127, 416981, 414743, 412902, 410442, 406530, 401246, 394874, 387168, 378226, 369271, 361312, 353707, 345339, 336640, 329089, 323155, 318077, 313420, 309530, 306592, 304342, 302571, 300979, 298841, 295773, 292470, 289718, 287096, 283652, 279396, 274962, 270255, 264655, 258335, 252215, 246778, 241916, 237735, 234523, 232170, 230467, 229630, 229687, 229922, 229985, 230972, 234139, 238953, 243671, 247554, 251196, 254835, 257660, 258857, 258271, 256046, 252528, 248464, 244400, 240004, 234771, 229055, 223570, 218308, 213068, 208610, 206005, 204996, 204213, 202979, 201823, 201260, 201164, 201364, 201905, 202693, 203687, 205313, 207828, 210469, 212093, 212476, 212123, 211165, 209488, 207646, 206450, 205750, 204668, 202931, 201004, 199105, 197179, 195672, 195257, 195879, 197062, 198900, 201589, 204291, 205783, 206151, 206484, 206949, 206667, 205638]
55648B05638l67J226K121J912J495J303J016O18L35j80j422l013m074m388m358
55633A97862m207l999l990m206m172l626l078k935k851k421j850j343o99j13l03
55618A58069j167j470p84m36j421k535k089n42J83n99j848k637k977k993k567
55603A34187j904j462j325j279j353j640j912j890j636j262p66m50p90j389j068
55588A14061L78J507J096k13j047j105r15o63l93n17j058j100n4J247J799J945
55572A14968K446K844K196Q94L21R38J914K413K274J624P80K24m7p36k060l084
55556A27909l080k748k997l365k892j891j405j451j228o76m15m31j62K71K78O3
55540A05780L71J091J353R83O64O85O78N78O89P98L14n88r99n96J1L23M66N67
$$ y = [205638, 205271, 206497, 208618, 210530, 212025, 213328, 214344, 214962, 215297, 215117, 213695, 210682, 206608, 202220, 197862, 193655, 189656, 185666, 181460, 177288, 173662, 170584, 167649, 164798, 162377, 160527, 159184, 158485, 158372, 158069, 156902, 155432, 154648, 154212, 152791, 150256, 148167, 147625, 147808, 147209, 145361, 142724, 139747, 136754, 134187, 132283, 130821, 129496, 128217, 126864, 125224, 123312, 121422, 119786, 118524, 117758, 117308, 116518, 115129, 114061, 114439, 115946, 117042, 116829, 115782, 114677, 113762, 113099, 112706, 112189, 111131, 110031, 109977, 111224, 113023, 114968, 117414, 120258, 122454, 123348, 123669, 124607, 126521, 128934, 131208, 132832, 133612, 133836, 133789, 133053, 130993, 127909, 124829, 122081, 119084, 115719, 112827, 110936, 109531, 108080, 106852, 106176, 105761, 105330, 105168, 105439, 105717, 105780, 106151, 107242, 108595, 109578, 110242, 110927, 111605, 112183, 112872, 113670, 113984, 113396, 112397, 111801, 111812, 112135, 112601, 113168]
55522A13168M61K05J32K96L88K21j90q38j558j860j538j112j074j130p61p6N81
55505A05315J269J924J847O29q96j689j900k299k870l096l073l103k729j521l31
55490H7477l93j421k017j734j332j159p73j47J57Q1J06J56k34p02l93M80P14l8
55472G8828q09q54m02K35R96J333N76o66q83J41Q79L47m87l26O47J362J327P02
55454H2946k95j258j565j091n10l38k65J71Q00J118R14K59o72j468j657j194m30
55437G5465M40J396K100K104J515Q51K76l31p17n14r6k15p48q09k32J27j99o29
55419G9784n74k79j83k29k25k06j30J77N32N17J38k13m79q28r51m40K01k0r45
55400G5647j258m00O71R82P65O33N50K61j15m05o56o87j36P43J122P74L70K99
$$ y = [113168, 113629, 113834, 113966, 114262, 114650, 114871, 114681, 113843, 112285, 110425, 108887, 107775, 106701, 105571, 104810, 104734, 105315, 106584, 108508, 110355, 110984, 110088, 108399, 106499, 104200, 101330, 98234, 95161, 92058, 89329, 87808, 87477, 87084, 85663, 83646, 81912, 80580, 79421, 78648, 78501, 78658, 78739, 78845, 79001, 78767, 78065, 77672, 78152, 78866, 78828, 78019, 77165, 76763, 76998, 77994, 79327, 79903, 79237, 78354, 78495, 79374, 79721, 79234, 78908, 79555, 80917, 82244, 82946, 82651, 81393, 79828, 78737, 78227, 77889, 77624, 77795, 78595, 79713, 80627, 80886, 80214, 78746, 77089, 75895, 75465, 75905, 77301, 79401, 81505, 83020, 83871, 84147, 83816, 83099, 82585, 82489, 82274, 81526, 80717, 80485, 80612, 80413, 79784, 79210, 78931, 78748, 78519, 78294, 78088, 77958, 78135, 78667, 79184, 79322, 79109, 78630, 77802, 76851, 76411, 76612, 76592, 75647, 74389, 73989, 74660, 75642, 76407, 77040, 77590, 77851, 77736, 77331, 76675, 75988, 75852, 76595, 77717, 78491, 78861, 79160]
55382G9160J83j36j31L91P54N27K29K82J71o61j782k323k072j437r30r39j475
55365F9811j792j107J22N68j3l50L26J096R65M98P44J444J468N39n41j006o81
55348G2091J99J014J024K00n51n64j93M8L31Q25R05N4j007j074n7J018J371J053
55330G6687L90m05j083j387j278q83l48J14L78O97J302J721J174j52j090j017
55314G4820m82j1N79J204J086J10n35p4N12J9j071j443r73n61n08m10j85%M63
55295G2540J383J860R99m34p85J11Q15N15l2n6J46J32J70N23P58M54j15m48n32
55276G8004o00o06l55J32O04Q21P15N38O77J065J060L03n64o76j79Om65r51p68
55257G8761P3J060J621J363N06m5L57J173J305N34l78q93j210j462j293n54K59
$$ y = [79160, 79343, 79207, 79076, 79467, 80221, 80748, 80977, 81259, 81430, 80769, 78987, 76664, 74592, 73155, 72225, 71286, 69811, 68019, 66912, 67034, 67602, 67589, 67239, 67565, 68661, 69626, 70124, 70868, 72312, 73780, 74319, 73778, 72772, 72091, 72290, 73304, 74328, 74528, 73977, 73413, 73220, 73268, 73599, 74424, 75329, 75383, 74376, 73302, 73245, 74263, 75634, 76687, 77077, 76672, 75589, 74202, 72924, 72041, 71693, 71807, 72185, 72882, 74184, 75905, 77079, 76927, 75837, 74820, 74338, 74327, 74906, 76110, 77196, 77306, 76771, 76697, 77209, 77228, 76157, 74714, 73741, 73180, 72672, 72262, 72077, 72077, 72540, 73923, 75783, 76782, 76348, 75563, 75674, 76489, 77004, 76972, 76916, 77062, 77194, 77364, 77887, 78645, 79099, 78984, 78536, 78004, 77404, 76798, 76443, 76575, 77179, 78000, 78715, 79253, 79930, 80995, 82055, 82358, 81794, 81118, 80939, 80945, 80480, 79529, 78761, 78834, 79894, 81515, 82878, 83384, 83339, 83696, 84869, 86174, 86708, 86330, 85437, 84227, 82765, 81472, 80918, 81177]
55240H1177O29O06M64K27j90o56q98p08q9O31R00N04j10m37n60p48o96P1J194
55221H1311J675J185L74j98o35j044j080n58M3J92j29o69j256j542j075K6Q49
55204G7469P35J56M8O47J398J803J781J332M26o34j181p89K13R49P75j98j202
55187H3728j516j015j55N53R11R91R00O34J57m46q98r37o09k26M4K90M91L88n9
55168H3226l56o1N60Q38N20p0o26j133j544j579j040p7Q81J378J171N18J04L68
55150H3078R63J178Q34L78J51k7m17q89j158j214j279j385j240n92L63J063J107
55133H0914O18nn55r77j030m39M98R84O25j27o60q93r31n86K37J030J188Q86Q52
55114H1629J317J745J626J097O33M85N10L99L2l19k82N7J66j80n14l25K71Q31
$$ y = [81177, 81806, 82412, 82876, 83103, 82913, 82257, 81359, 80651, 80562, 81193, 82093, 82597, 82487, 82050, 81490, 80742, 80046, 80117, 81311, 82986, 84171, 84545, 84347, 83712, 82668, 81588, 81030, 81073, 81265, 81136, 80467, 79211, 77669, 76594, 76620, 77469, 78204, 78360, 78408, 79055, 80453, 82256, 84037, 85369, 85795, 85161, 83980, 83191, 83404, 84353, 85128, 84930, 83728, 82212, 81197, 81042, 81595, 82506, 83497, 84397, 85031, 85188, 84742, 83844, 82907, 82298, 82072, 82116, 82406, 82897, 83285, 83226, 82870, 82809, 83369, 84207, 84727, 84657, 84031, 82898, 81354, 79775, 78735, 78658, 79539, 80917, 82088, 82606, 82710, 83078, 84041, 85219, 86053, 86431, 86582, 86555, 86138, 85249, 84091, 82877, 81598, 80213, 78973, 78381, 78744, 79807, 80914, 81532, 81527, 80972, 79995, 78965, 78526, 79024, 80008, 80633, 80506, 79846, 78953, 78022, 77436, 77673, 78703, 79891, 80777, 81629, 82946, 84691, 86317, 87414, 88047, 88532, 89042, 89441, 89473, 89154, 88872, 88929, 89095, 88915, 88401, 88076, 88347, 89178]
55096H9178J180J301J030M30Q8M24R48Q53J54l85l48j6K90N58P13N37N9m27p77
55077I5790r89r07l64L53P67Q13P11L49n12j476j706j052k80J8J09M30P75O59
55059I3488R8l98m53j93Mq6k82k68o9k6j64k0N84J008O70Nj52J74L02J58K92O25
55037I5297K90r12j887j650o07J74L91N01P34P93M42j36o39r35r92p39o0R41J716
55018I2722J588N56m37m81K15P02N83L67M87O93N64J23k50k43J78O10M36l94r72
54999I7047m61O32J014L73k91k34J12J51R2M03R29J206J169J005P92O56Q66J316
54981A06777J364O52l24q38p50l43J91O17M71m18j455j849j459p56j79J45K71
54964A02117L97P31J160J283R57M52k8n85j109j095l69M13N20J01r2L14R63J283
$$ y = [89178, 90358, 91659, 92689, 93119, 93207, 93631, 94579, 95432, 95586, 95201, 94853, 94837, 95127, 95685, 96398, 96935, 96994, 96567, 95790, 94801, 93894, 93530, 93883, 94650, 95463, 96174, 96523, 96011, 94535, 92829, 91777, 91497, 91515, 91624, 92054, 92829, 93488, 93586, 93188, 92735, 92542, 92546, 92460, 92178, 91910, 91841, 91815, 91651, 91631, 92215, 93223, 93893, 93898, 93746, 93920, 94222, 94380, 94672, 95297, 95587, 94675, 92788, 91138, 90531, 90705, 91096, 91597, 92331, 93124, 93566, 93430, 92791, 91856, 90864, 90125, 90065, 91006, 92722, 94310, 94866, 94429, 93948, 94163, 94865, 95448, 95815, 96302, 96995, 97559, 97682, 97432, 97189, 97367, 97977, 98413, 98019, 97047, 96586, 97218, 98232, 98605, 98314, 98080, 98192, 98343, 98435, 98838, 99767, 100973, 102142, 103147, 103939, 104595, 105461, 106777, 108141, 108793, 108469, 107631, 106881, 106538, 106729, 107346, 107817, 107399, 105944, 104095, 102636, 101880, 101701, 101846, 102117, 102514, 103245, 104405, 105688, 106645, 107097, 107069, 106484, 105375, 104280, 103911, 104324, 104844, 104945, 104853, 105167, 106130, 107413]
54946A07413J035M57Rk01o22j491k014j141P35J825J123l03q54l82K15N69R25
54929A07298J081M99n18q40Q8J598K698L090L119L267L853M828N765O343O806
54914A48975P540Q320Q467P795O790N771M391K259k97k473l873m809n719o539
54900A76598o861o632o349o336o202n412m171l177k576j922j195r86j376j540
54886A21863r52k11L4J69P83J398J210O30R05K242L483L839L872M400N314O102
54870A55081O775P587Q138P574N675L255J326J44p38j733k851m081n530o931p446
54855A66245o663n534n430o273o541n458m107l777m190m250l763l256k718j747
54841A02538o37j34j86o0L01K28k67k58N32J074M98o41j208r25l31J79N27N62
$$ y = [107413, 108448, 108905, 108914, 108713, 108091, 106600, 104586, 103445, 104180, 106005, 107128, 106825, 105971, 105589, 105804, 106373, 107298, 108379, 108878, 108360, 107520, 107608, 109206, 111904, 114994, 118113, 121380, 125233, 130061, 135826, 142169, 148975, 156515, 164835, 173302, 181097, 187887, 193658, 198049, 200308, 200011, 197538, 193665, 188856, 183137, 176598, 169737, 163105, 156756, 150420, 144218, 138806, 134635, 131458, 128882, 126960, 125765, 124779, 123403, 121863, 120911, 120700, 120734, 120903, 121686, 123084, 124294, 124924, 125829, 128071, 131554, 135393, 139265, 143665, 148979, 155081, 161856, 169443, 177581, 185155, 190830, 194085, 195411, 195555, 194817, 193084, 190233, 186152, 180622, 173691, 166245, 159582, 154048, 148618, 142345, 135804, 130346, 126239, 122462, 118272, 114022, 110259, 107003, 104285, 102538, 101901, 101767, 101581, 101521, 101822, 102050, 101783, 101525, 102057, 103131, 103629, 102988, 101780, 100855, 100524, 100703, 101230, 101792]
54823A01792J44m63p78o36k44J83N61P94P24K38n46j184j130l74L24K59l06m90
54805I8868mO20R60J188J411J275N92j51m03k22M3L64Q18J143J010N78K98K71
54787A08659K41J45K16N35Q55R79J053J294J595J579J100N40M37Q40J189J010
54771A22267N40M21R40J841K768L508L908L975M128M852O009O903P152P043O836
54756A83091O258N022L459K100R20n12k265l873m938n536n948o251o314o014n386
54741A53813m649m102l913l931l811l333k559j755j193r92j041j008n39M52J611
54726A23050K380K502K334K468L075L803M307M589M721M595M268M223M887N948
54712A77150O546O105M720K768N19j826m004n744o897p490p724p773p454o351
$$ y = [101792, 101936, 101473, 100695, 100059, 99815, 99998, 100559, 101353, 102077, 102315, 101769, 100585, 99455, 99081, 99405, 99664, 99358, 98868, 98864, 99484, 100444, 101632, 103043, 104318, 104910, 104759, 104356, 104134, 104177, 104541, 105359, 106502, 107512, 108090, 108388, 108659, 108900, 109045, 109261, 109796, 110651, 111630, 112683, 113977, 115572, 117151, 118251, 118791, 119228, 120068, 121257, 122267, 122807, 123228, 124168, 126009, 128777, 132285, 136193, 140168, 144296, 149148, 155157, 162060, 169212, 176255, 183091, 189349, 194371, 197830, 199930, 200850, 200338, 198073, 194200, 189262, 183726, 177778, 171527, 165213, 159199, 153813, 149164, 145062, 141149, 137218, 133407, 130074, 127515, 125760, 124567, 123575, 122534, 121526, 120987, 121439, 123050, 125430, 127932, 130266, 132734, 135809, 139612, 143919, 148508, 153229, 157824, 162092, 166315, 171202, 177150, 183696, 189801, 194521, 197289, 197808, 195982, 191978, 186234, 179337, 171847, 164123, 156350, 148896, 142545]
54698A42545m510k747j890j883j960j570q54l00l09r09j591j619r23l53n94j137
54682A19396j036l88j90p78j335j172o41m48p17j110j294j038l91J8m89j503j707
54665A05177n91P08Q83J58k48J34O59O77K51k02l55o5N63J095J101N79j29p55
54647A09640j222j471j442j089l50P28J730K061J580P17j31r19j476j321m03N15
54631A07147P58O13P53J172J285Q83K95k05n24m57J36Q26R28L38l98q65j131j297
54613A10257j230q75l82J53P22J130J097P57O13Q59J091Q32R9p27j311j516j347
54596A10222q92k56M80J125J347R56K34k68k30J94N73M95o9n53k26Q43J616J283
54578A16874L10k59k40l29q24j173r72n43k66K0M79P24L26m76j006r30l83L60
$$ y = [142545, 138035, 135288, 133398, 131515, 129555, 127985, 127131, 126831, 126522, 125613, 124022, 122403, 121480, 121127, 120533, 119396, 118360, 117972, 117782, 117004, 115669, 114497, 113856, 113408, 112691, 111581, 110287, 109249, 108858, 108876, 108387, 106884, 105177, 104586, 105294, 106177, 106335, 106087, 106221, 106880, 107557, 107808, 107606, 107251, 107186, 107749, 108844, 109945, 110524, 110395, 109640, 108418, 106947, 105505, 104416, 104066, 104794, 106524, 108585, 110165, 110882, 110751, 109832, 108356, 107035, 106632, 107147, 107905, 108518, 109271, 110443, 111728, 112611, 112906, 112701, 112177, 111720, 111856, 112682, 113610, 113948, 113550, 112685, 111554, 110257, 109027, 108152, 107770, 107923, 108645, 109775, 110872, 111629, 112242, 113101, 114192, 115024, 115123, 114396, 113085, 111569, 110222, 109330, 109074, 109554, 110679, 112026, 112982, 113216, 112948, 112718, 112912, 113485, 113980, 113911, 113358, 113132, 113975, 115591, 116874, 117184, 116925, 116685, 116356, 115532, 114359, 113387, 112844, 112578, 112598, 113077, 113801, 114127, 113651, 112645, 111715, 111332, 111692]
54560A11692R69J072N55j56m87k76K24P56J132J139O97J48j0K64M82K56k03l69
54542A17885p5L39N19N77R25J643K257K254J683J061P72P77Q32P46M01k23r51
54525A31422j517j793j772j383n67M00J008J034P32M24J58j51m93p87r33o96P4
54508A25160R51J094J75j113j845j861j588j171m12N21J028Q23L06r6m34q49j077
54491A19612q10k44J57L52O79J176J403J125O70M77N33N85N92O37N45M6o56q74
54473A26005k49P03J075N64k24m67L7P49J071R74R26J197J557J657J507J306J066
54456A39454O36O5m70r29j267j166m08M86O44l8p56r94j115j430j429o52K88M69
54438A31388Q8J32Q21J324J169R17J083J202N85n92j452j497r55l17R9J88L2j40
$$ y = [111692, 112661, 113733, 114288, 114132, 113645, 113369, 113593, 114349, 115481, 116620, 117317, 117465, 117455, 117719, 118201, 118457, 118254, 117885, 117810, 118149, 118668, 119245, 120170, 121813, 124070, 126324, 128007, 129068, 129840, 130617, 131449, 132195, 132596, 132373, 131422, 129905, 128112, 126340, 124957, 124390, 124790, 125798, 126832, 127564, 127988, 128146, 127995, 127502, 126715, 125782, 125086, 125160, 126111, 127205, 127380, 126267, 124422, 122561, 120973, 119802, 119390, 119911, 120939, 121762, 122068, 121972, 121538, 120689, 119612, 118802, 118558, 118715, 119067, 119746, 120922, 122325, 123450, 124120, 124597, 125130, 125715, 126307, 126944, 127489, 127535, 126879, 126005, 125756, 126459, 127534, 128098, 127874, 127407, 127444, 128193, 129264, 130238, 131164, 132361, 133918, 135575, 137082, 138388, 139454, 140090, 140155, 139685, 138756, 137489, 136323, 135915, 136401, 137045, 137007, 136251, 135257, 134142, 132712, 131283, 130631, 130919, 131388, 131476, 131608, 132429, 133753, 134922, 135839, 136922, 138124, 138709, 138117, 136665, 135168, 134213, 133896, 133995, 134183, 134215, 134075]
54420A34075j16J38N22Q60R39P07M34M69P42P46J23q83j584j414l78Q64J495J314
54402A39053R21Q43Q51N43K56O39J459J696R81J18n9L80R90J567J831J246j55
54385A53160j354j431o15K09N63M19j83q80r19j23N34J58p09r24m60k68n79o29
54367A45969NQ04J271J481J493J178Q18J047J877K635L056L544M032L655K156
54352A75021N79p1j13l38o91p55q41j495k258k114j128n79j274k571l334l239
54336A54799k764k406k277k246k102j647q49O6P20Q78P07O36P72O12k55j288j446
54319A41910n98K47L08l9k03l62q22j023k62J008J619J256O26J67l45q41p14O8
54301A42000N64R8q16j314j303j139p78K3R19J160N88j07k24J48L31q5o97p76
$$ y = [134075, 133959, 134097, 134619, 135479, 136418, 137125, 137559, 138028, 138770, 139516, 139639, 138756, 137172, 135758, 135380, 136244, 137739, 139053, 139974, 140817, 141668, 142211, 142467, 143106, 144565, 146261, 147242, 147360, 147301, 147681, 148671, 150238, 152069, 153315, 153160, 151806, 150375, 149760, 149969, 150532, 150951, 150768, 149888, 148969, 148846, 149380, 149538, 148829, 147905, 147445, 147177, 146598, 145969, 145974, 146778, 148049, 149530, 151023, 152201, 153019, 154066, 155943, 158578, 161634, 165178, 169210, 172865, 175021, 175600, 175529, 175416, 175078, 174387, 173632, 172791, 171296, 169038, 166924, 165796, 165217, 163943, 161372, 158038, 154799, 152035, 149629, 147352, 145106, 143004, 141357, 140508, 140574, 141294, 142172, 142879, 143515, 144287, 144899, 144644, 143356, 141910, 141312, 141559, 141867, 141828, 141625, 141263, 140441, 139418, 139156, 140164, 141783, 143039, 143665, 143832, 143487, 142646, 141932, 142000, 142564, 142662, 141846, 140532, 139229, 138090, 137312, 137335, 138254, 139414, 140002, 139895, 139671, 139819, 140150, 140065, 139368, 138592]
54283A38592k53J09j98n54n0J032J465Q50K06L53O45P2j068j549r25O4O91R98
54265A40480J247J388J373J374J385J056K34o19r09n80q4K30L83M97N53M39J69
54248A48616q2j21Q8M17P10Q98R39P16J24p03j340j379q74l52k61m87n70m19m12
54229A45508p38j021r21o97p08o56n3P60Q80K38j09N73J704K262K050J549J033
54212A51654M72J0j90l44p69j317j581j500j279r45n16m18j010j730j524k42R78
54195A39749J092L37k95l31p1J62M56Q98J203J025N44L23N26N56j10r43q50L39
54177A44610J466J511Q75O30R76J133O25r8l34J17Q93J381J005k81j787k710k884
54160A47128k586j872p00M08O57N1n02l78P3K65J88J39J41O9KQ3K29K76J85n0
$$ y = [138592, 138339, 138448, 138250, 137696, 137646, 138678, 140143, 140993, 141199, 141552, 142197, 142269, 141201, 139652, 138727, 138791, 139482, 140480, 141727, 143115, 144488, 145862, 147247, 148303, 148537, 147918, 147009, 146429, 146345, 146575, 146958, 147455, 148008, 148447, 148616, 148534, 148413, 148501, 148918, 149628, 150526, 151465, 152181, 152305, 151602, 150262, 148883, 148009, 147657, 147396, 146909, 146339, 145920, 145508, 144770, 143749, 142828, 142131, 141423, 140767, 140714, 141474, 142354, 142592, 142483, 143056, 144760, 147022, 149072, 150621, 151654, 152126, 152136, 151946, 151602, 150833, 149516, 147935, 146435, 145156, 144211, 143695, 143277, 142267, 140537, 139013, 138771, 139749, 140841, 141178, 140883, 140552, 140481, 140643, 141099, 141997, 143200, 144225, 144769, 145092, 145618, 146174, 146064, 145121, 144271, 144610, 146076, 147587, 148462, 149092, 150068, 151201, 151826, 151728, 151394, 151511, 152404, 153785, 154790, 154509, 152722, 150012, 147128, 144542, 142670, 141970, 142378, 143035, 143086, 142584, 142206, 142279, 142544, 142732, 142871, 143012, 143081, 143083, 143166, 143395, 143671, 143856, 143806]
54140A43806m37p79p64l95k6J73M10P10P08K07l76n74m61l43k03J52N81P40O30
54121A43759N67O47N87K13j32R3R40J741J771J149Q14J334K099K091J256M58K09
54104A59596J63k3j23K7Q2j94l54K5N32L99m22j184j268p47j50O9j18l19j57K29
54084A56063M37N56J122K197L103L452L826M845O027O323N490M299L473L026K559
54069B06798J756N78o79j633k293l007l712l698k622j270o43p40r03j054j605
54054A85273k349k421j573n73j00J6J70K99L00N54J488K843L898M250M135M007
54038B00217M126M512N079N723O296O568O322N596M738M186M226M911N877O327
54024B74704N616M067K709K064J738J474J756K788L583L075J680P13M88R7r51
$$ y = [143806, 143369, 142590, 141826, 141431, 141405, 141578, 141988, 142698, 143406, 143613, 143237, 142663, 142202, 141859, 141656, 141808, 142389, 143129, 143759, 144326, 144973, 145560, 145773, 145641, 145734, 146674, 148415, 150186, 151335, 152149, 153483, 155582, 157673, 158929, 159387, 159596, 159759, 159736, 159613, 159640, 159722, 159528, 159174, 159199, 159731, 160130, 159708, 158524, 157256, 156509, 156359, 156428, 156310, 155991, 155834, 156063, 156500, 157056, 158178, 160375, 163478, 166930, 170756, 175601, 181628, 187951, 193441, 197740, 201213, 204239, 206798, 208554, 209132, 208453, 206820, 204527, 201520, 197808, 194110, 191488, 190218, 189575, 188835, 187932, 186878, 185273, 182924, 180503, 178930, 178357, 178257, 178273, 178443, 178742, 179042, 179596, 181084, 183927, 187825, 192075, 196210, 200217, 204343, 208855, 213934, 219657, 225953, 232521, 238843, 244439, 249177, 253363, 257589, 262500, 268377, 274704, 280320, 284387, 287096, 289160, 290898, 292372, 294128, 296916, 300499, 303574, 305254, 305967, 306455, 306552, 305601]
54009C05601j989k342k310k589l382m446n437n999o007n875o036o142n489m308
53995B43250l687l948m119l428k478k209k532k733k602k385k078j586j259j510
53981B06696k055k255j956j498j047n79l00m49p45o40r3M26O07N01J54l91p59
53964A95617m89K56P88P82N78N12M76M12O82J533K493K764K149J251Q37J168J940
53947B13749K636K960L025L173L571M040M332M497M852N622O801Q301J0091J2014
53933B89664J3565J4104J3320J1433Q960O422M184K324N19j588l727m975m713
53920C49492l379j959q58K16J440K502L175L772M731O011P132P598P211O228N307
53905C98619M936M831M165K616P90n86j530k545l763m717m918m423l837l834m548
$$ y = [305601, 303612, 301270, 298960, 296371, 292989, 288543, 283106, 277107, 271100, 265225, 259189, 253047, 247558, 243250, 239563, 235615, 231496, 228068, 225590, 223381, 220849, 218116, 215514, 213129, 211051, 209465, 208206, 206696, 204641, 202386, 200430, 198932, 197885, 197306, 197006, 196557, 195812, 195172, 195079, 195505, 196112, 196613, 196767, 196376, 195617, 195128, 195384, 196172, 196954, 197532, 198044, 198520, 198932, 199614, 201147, 203640, 206404, 208553, 209804, 210641, 211809, 213749, 216385, 219345, 222370, 225543, 229114, 233154, 237486, 241983, 246835, 252457, 259258, 267559, 277650, 289664, 303229, 317333, 330653, 342086, 351046, 357468, 361652, 363976, 364495, 362907, 359180, 354205, 349492, 346113, 344154, 343296, 343512, 344952, 347454, 350629, 354401, 359132, 365143, 372275, 379873, 387084, 393312, 398619, 403555, 408386, 412551, 415167, 415957, 415371, 413841, 411296, 407533, 402816, 397898, 393475, 389638, 385804, 381256]
53890C81256n410n768n712n898o563p105o977o495o397o811p206p183o828o312
53876B90591n585m623l708l241l331l676l915l982m105m313m240l614k793k362
53862B37103k345k242j942j938k444k955k997k819k781k576j757o76j64l56n76
53847B08535m86n80j235j892j646m52P77J231R92O58M06j47j153j983j836q09
53831B00380J16K14k27m59k13J62K42q3n74q11n48k7L00M03P40J527K395K976
53813B06513L347L611L493K836K137K006K366K666K678K620K711L103L980N139
53799B49206N780N343M397L960M124M103L642L371L667L988L759L152K590K116
53785C03198J740J749K091K029J084j22p33j059k100l821m956m785m213m483n452
$$ y = [381256, 375846, 370078, 364366, 358468, 351905, 344800, 337823, 331328, 324931, 318120, 310914, 303731, 296903, 290591, 285006, 280383, 276675, 273434, 270103, 266427, 262512, 258530, 254425, 250112, 245872, 242258, 239465, 237103, 234758, 232516, 230574, 228636, 226192, 223237, 220240, 217421, 214640, 212064, 210307, 209631, 209467, 209111, 208535, 208049, 207469, 206234, 204342, 202696, 202244, 203021, 204252, 205244, 205902, 206308, 206161, 205008, 203025, 201189, 200380, 200496, 200710, 200483, 200024, 199811, 199973, 200215, 200132, 199558, 198747, 198199, 198172, 198472, 198875, 199615, 201142, 203537, 206513, 209860, 213471, 216964, 219800, 221937, 223943, 226309, 228975, 231653, 234273, 236984, 240087, 244067, 249206, 254986, 260329, 264726, 268686, 272810, 276913, 280555, 283926, 287593, 291581, 295340, 298492, 301082, 303198, 304938, 306687, 308778, 310807, 311891, 311769, 311036, 309977, 307877, 304056, 299100, 294315, 290102, 285619, 280167]
53770B80167n992n631n025m800m810m715m554m398l957l087k259j962j964j750
53756B25263j441j612k293k879l026k898k511j595l54M25L73k3k86n30q23p71
53740B05019l06p2l35l05N77J430J108Kn65l29j20p6O62K223L378L187K174J306
53722B18958P19J64j71l1K85L81M24P31J094J121R25R93J535K361L125L441L099
53705B39154K436K148K422K726K756K940L506L752K988J750J187J497J922K117
53691B73301K582L511M175L874K923K154J880J695J156J76j038k103k551k149
53677B89586j224m79l75p20r16o11n1K46M5m26q60j171j368j327r30l35R8J81
53659B79363Pl05p41j178j259p18J91Q57R60P48O13N91N51N73P73R11O64L63P41
$$ y = [280167, 274175, 268544, 263519, 258719, 253909, 249194, 244640, 240242, 236285, 233198, 230939, 228977, 227013, 225263, 223822, 222210, 219917, 217038, 214012, 211114, 208603, 207008, 206654, 207079, 207452, 207429, 207143, 206613, 205790, 205019, 204713, 204641, 204306, 204001, 204578, 206008, 207116, 207118, 206553, 206224, 206104, 206028, 206690, 208913, 212291, 215478, 217652, 218958, 219677, 219841, 219670, 219639, 219924, 220305, 220729, 221460, 222554, 223675, 224600, 225593, 227128, 229489, 232614, 236055, 239154, 241590, 243738, 246160, 248886, 251642, 254582, 258088, 261840, 264828, 266578, 267765, 269262, 271184, 273301, 275883, 279394, 283569, 287443, 290366, 292520, 294400, 296095, 297251, 297427, 296389, 294286, 291735, 289586, 288362, 287883, 287508, 286788, 285872, 285261, 285210, 285456, 285501, 285075, 284215, 283044, 281676, 280349, 279419, 279084, 279182, 279363, 279370, 279065, 278324, 277146, 275887, 275169, 275360, 276217, 277177, 277925, 278538, 279129, 279680, 280253, 281026, 281937, 282601, 282964, 283705]
53640B83705J802K559K341J722J564J713J453Q52O70J017J230J141J396K185K606
53625C07956J971R96R56K109L591M502M614M280M167M773N844O492O283N765N539
53610C69838N335M634L721L296L314L107K541K152K111J891J233O86P80J230J390
53595D07259J116P09L11k09q98j515j739j460r43o56q19j080r42m70k57o08j144
53578C96655j441j654k131k685k700j973j009m12k83l68n30p84j000q85l58K63
53562C78705O05O61O96Q50J013J103J165J215J201J206J432J807J937J636J338
53547C96570J612K385K967K891K420K158K373K822L168L396L780M509N417O213
53533D42681O852P457P910P925P686P961R171J0650J1323J0995J0520J0710J1642
$$ y = [283705, 285507, 288066, 290407, 292129, 293693, 295406, 296859, 297711, 298381, 299398, 300628, 301769, 303165, 305350, 307956, 309927, 310923, 311879, 313988, 317579, 322081, 326695, 330975, 335142, 339915, 345759, 352251, 358534, 364299, 369838, 375173, 379807, 383528, 386824, 390138, 393245, 395786, 397938, 400049, 401940, 403173, 403859, 404639, 405869, 407259, 408375, 409084, 409395, 409186, 408288, 406773, 405034, 403574, 402631, 401975, 401156, 400076, 399134, 398664, 398407, 397799, 396655, 395214, 393560, 391429, 388744, 386044, 384071, 383062, 382650, 382367, 381999, 381469, 380685, 379685, 378800, 378442, 378705, 379310, 379971, 380667, 381517, 382530, 383633, 384798, 386013, 387214, 388420, 389852, 391659, 393596, 395232, 396570, 398182, 400567, 403534, 406425, 408845, 411003, 413376, 416198, 419366, 422762, 426542, 431051, 436468, 442681, 449533, 456990, 464900, 472825, 480511, 488472, 497643, 508293, 519616, 530611, 541131, 551841, 563483]
53520E63483J3059J4743J6331J7219J7263J7211J7948J9485K1104K2407K3596
53509G63849K4777K5561K5701K5665K6063K6689K6729K5933K5081K4958K5222
53498A046228K4772K3146K1188K0139K0328K0958K1093K0676K0373K0568K0679
53487A280148J9834J8123J6767J6757J7630J8075J7556J6729J6299J6068J5407
53476A469393J4161J2585J0728Q408N660K857L18j859l695n331p119r337j1776
53463A484993j3824j5100j5769j6215j6623j7045j7634j8551j9663k0576k1084
53452A292909k1408k1888k2443k2594k2084k1214k0397j9631j8606j7245j5709
53441A069690j4031j2125j0154q477p101n646l960k342j012J76J307K134K651
$$ y = [563483, 576542, 591285, 607616, 624835, 642098, 659309, 677257, 696742, 717846, 740253, 763849, 788626, 814187, 839888, 865553, 891616, 918305, 945034, 970967, 996048, 1021006, 1046228, 1071000, 1094146, 1115334, 1135473, 1155801, 1176759, 1197852, 1218528, 1238901, 1259469, 1280148, 1299982, 1318105, 1334872, 1351629, 1369259, 1387334, 1404890, 1421619, 1437918, 1453986, 1469393, 1483554, 1496139, 1506867, 1515275, 1520935, 1523792, 1524110, 1522251, 1518556, 1513225, 1506106, 1496769, 1484993, 1471169, 1456069, 1440300, 1424085, 1407462, 1390417, 1372783, 1354232, 1334569, 1313993, 1292909, 1271501, 1249613, 1227170, 1204576, 1182492, 1161278, 1140881, 1121250, 1102644, 1085399, 1069690, 1055659, 1043534, 1033380, 1024903, 1017802, 1012156, 1008196, 1005854, 1004842, 1005018, 1006325, 1008459, 1011110]
53428A011110L393M721O206P261Q091R353J1139J2925J4468J6086J7911J9477
53416A142141K0344K0776K1510K3030K5209K7466K9298L0729L2250L4194L6306
53405A443253L8195L9910M1784M3813M5673M7268M8860N0654N2595N4521N6169
53394A962695N7115N7169N6749N6454N6382N6321N6427N6900N7094N5865N3055
53383B582226M9824M7074M4399M1104L7498L4255L1066K6937K1694J6293J1517
53372B943887P195K786j911o972j2678j9187k6146l2992l9452m5446n0693n4736
53360B663655n7393n8931n9748o0009n9660n8734n7433n5917n4051n1577m8586
53349B041616m5675m3549m2443m2029m1789m1421m0908m0294l9444l8041l5921
$$ y = [1011110, 1014503, 1019224, 1025430, 1032691, 1040782, 1050135, 1061274, 1074199, 1088667, 1104753, 1122664, 1142141, 1162485, 1183261, 1204771, 1227801, 1253010, 1280476, 1309774, 1340503, 1372753, 1406947, 1443253, 1481448, 1521358, 1563142, 1606955, 1652628, 1699896, 1748756, 1799410, 1852005, 1906526, 1962695, 2019810, 2076979, 2133728, 2190182, 2246564, 2302885, 2359312, 2416212, 2473306, 2529171, 2582226, 2632050, 2679124, 2723523, 2764627, 2802125, 2836380, 2867446, 2894383, 2916077, 2932370, 2943887, 2951082, 2953868, 2951957, 2944985, 2932307, 2913120, 2886974, 2853982, 2814530, 2769084, 2718391, 2663655, 2606262, 2547331, 2487583, 2427574, 2367914, 2309180, 2251747, 2195830, 2141779, 2090202, 2041616, 1995941, 1952392, 1909949, 1867920, 1826131, 1784710, 1743802, 1703508, 1664064, 1626023, 1590102]
53338A590102l3364l0980k9160k7712k6064k3793k0984j8159j5895j4374j3274
53327A336343j2182j1155j0731j1249j2314j3092j3067j2395j1633j1198j1053
53316A206274j0747r725p831n558l681k497j513m1J928L724M885N762O931Q305
53302A196216R378J0267J1787J4232J6775J8649K0295K2516K4921K6262K6319
53291A397617K6342K7273K8505K8999K8712K8130K7067K4964K2115J9501J7418
53280A676643J5133J2090Q635N314K128j058m024o567r003j1753j4623j6989j8674
53267A637252k0244k2334k4883k7131k8409k8891k9494l0845l2395l2964l2172
53256A327490l0957l0441l0715l1061l0976l0481k9688k8644k7591k6800k6148
$$ y = [1590102, 1556738, 1525758, 1496598, 1468886, 1442822, 1419029, 1398045, 1379886, 1363991, 1349617, 1336343, 1324161, 1313006, 1302275, 1291026, 1278712, 1265620, 1252553, 1240158, 1228525, 1217327, 1206274, 1195527, 1185802, 1177971, 1172413, 1168732, 1166235, 1164722, 1164681, 1166609, 1170333, 1175218, 1180980, 1187911, 1196216, 1205594, 1215861, 1227648, 1241880, 1258655, 1277304, 1297599, 1320115, 1345036, 1371298, 1397617, 1423959, 1451232, 1479737, 1508736, 1537448, 1565578, 1592645, 1617609, 1639724, 1659225, 1676643, 1691776, 1703866, 1712501, 1717815, 1719943, 1718885, 1714861, 1708294, 1699291, 1687538, 1672915, 1655926, 1637252, 1617008, 1594674, 1569791, 1542660, 1514251, 1485360, 1455866, 1425021, 1392626, 1359662, 1327490, 1296533, 1266092, 1235377, 1204316, 1173340, 1142859, 1113171, 1084527, 1056936, 1030136, 1003988]
53245A003988k5315k4432k4002k4054k3968k3317k2391k1490k0352j8737j7123
53234G58807j6113j5448j4419j3022j1940j1354j0656r535q540q126p961p726
53222F23967p929r084j0583j1321j1307j1679j3012j4499j5144j4953j4466j3765
53210D76225j2595j1115r772q615p378o259n975o819q074q711q344p384o497o184
53196C62503o587p370p818p491o696o142o039n885n230m284l569l209k916k570
53182B86697k428k655k982k977k567k083j881k007k202k160j823j447j315j355
53168B56815j227p97l53k26m15p27j141j710k195k170j550p99l65j42K84Q99J123
53151B45304N14n80j355j426j142r89j022j040j019j050j005o28M2O77J107J417
$$ y = [1003988, 978673, 954241, 930239, 906185, 882217, 858900, 836509, 815019, 794667, 775930, 758807, 742694, 727246, 712827, 699805, 687865, 676511, 665855, 656320, 647780, 639654, 631693, 623967, 616038, 606954, 596371, 585050, 573743, 562064, 549052, 534553, 519409, 504456, 489990, 476225, 463630, 452515, 442743, 434128, 426750, 420491, 414516, 407697, 399623, 390912, 382568, 375184, 368687, 362503, 355916, 348546, 340728, 333237, 326541, 320399, 314360, 308475, 303245, 298961, 295392, 292183, 289267, 286697, 284269, 281614, 278632, 275655, 273088, 271005, 269124, 267117, 264915, 262755, 260932, 259485, 258170, 256815, 255588, 254791, 254438, 254212, 253797, 253070, 251929, 250219, 248024, 245854, 244304, 243505, 243140, 242998, 243282, 244181, 245304, 245818, 245238, 243883, 242457, 241315, 240326, 239304, 238264, 237245, 236195, 235190, 234562, 234604, 235281, 236388, 237805]
53135B37805J631J585J226O91P2n78r30n88K37P57O22L68M81N80J06o48r59q32
53117B41626q47r71n04O57J559J485R15O87P90O56K41O3K33K07m27j390k119k362
53099B40499k208j878j672j827k150k015j088L8L87k26r50r91n53m22q55j368
53083B22721j477j144n30K18Q23R68P38O03P83R99J019J020J103R12J83p17j246
53066B26976j359j265q78j15N15L11o47j525j744j431q65j60M61O34L19j00l27
53049B18800l82k23L32J138J639J492R47L88j43p49j261j336q89k49Om91j417
53032B17602j892j439o93o31j201j340m79N77O68k93j287j328l87P38J285J284
53016B11184J390J877K175J789J273J513K244K226J025l15p52n59o33j150j540
$$ y = [237805, 239436, 241021, 242247, 242938, 243010, 242432, 241502, 240914, 241151, 241908, 242530, 242898, 243379, 243959, 244065, 243417, 242458, 241626, 240779, 239808, 239304, 239961, 241520, 243005, 243920, 244607, 245397, 246053, 246294, 246357, 246590, 246797, 246370, 244980, 242861, 240499, 238291, 236413, 234741, 232914, 230764, 228749, 227661, 227699, 228086, 227860, 226910, 225919, 225366, 224944, 224089, 222721, 221244, 220100, 219570, 219788, 220611, 221579, 222317, 222920, 223703, 224702, 225721, 226741, 227844, 228756, 228939, 228222, 226976, 225617, 224352, 223474, 223359, 223874, 224185, 223538, 222013, 220269, 218838, 217973, 217813, 218274, 218908, 219227, 219127, 218800, 218418, 218195, 218527, 219665, 221304, 222796, 223743, 224131, 223988, 223239, 221978, 220642, 219753, 219504, 219510, 219019, 217602, 215710, 214271, 213578, 212947, 211746, 210406, 209927, 210504, 211172, 210879, 209592, 208264, 207877, 208615, 209900, 211184, 212574, 214451, 216626, 218415, 219688, 221201, 223445, 225671, 226696, 226381, 225629, 225070, 224437, 223287, 221747]
53001B21747j361o79J23N20J27p90j367j016RJ026J491J173K85l56jR56J285O22
52983B23794nK60Q71R28O18P04J197J456J281J047J004J195J752K549K899K364
52967B43914J508J167J222R63K86k76n24p00p65m54P4L53L50L15M9q09j901k407
52949B42365k154j740j545j457j486j787k066j808j172q27q77p83l93j70k29j50
52933B23721J55K76J94L44N93K39o65j098o41k14n73j099q54m4N24P07R65J441
52915B23971J912K204K039R58q95k398k607j861j141p36l51l3o4k18nM08L46l10
52897B21219r12r29m85OK26J3m31m98K03J200J679J462R81M67j81p39o75M3P54
52878B23403R01N71P8m24o92l65N08J307J551J514J794K473L019K878K012Q72
$$ y = [221747, 220386, 219707, 219830, 220350, 220477, 219687, 218320, 217304, 217313, 218339, 219830, 221003, 221288, 220932, 220931, 221887, 223172, 223794, 223789, 224049, 224920, 225848, 226466, 227170, 228367, 229823, 231104, 232151, 233155, 234350, 236102, 238651, 241550, 243914, 245422, 246589, 247811, 248774, 249060, 248784, 248260, 247560, 246795, 246341, 246415, 246768, 247118, 247433, 247482, 246673, 244772, 242365, 240211, 238471, 236926, 235469, 233983, 232196, 230130, 228322, 227150, 226323, 225446, 224663, 224270, 224100, 223871, 223721, 223876, 224152, 224346, 224690, 225283, 225522, 224857, 223759, 223118, 222904, 222331, 221232, 220378, 220334, 220858, 221565, 222530, 223971, 225883, 228087, 230126, 231084, 230189, 227791, 225184, 223323, 222182, 221446, 221095, 221062, 220998, 220780, 220775, 221183, 221529, 221219, 220307, 219378, 218893, 218899, 219125, 219138, 218707, 218209, 218412, 219612, 221291, 222753, 223734, 224201, 224020, 223281, 222606, 222649, 223403, 224304, 224875, 224953, 224529, 223837, 223472, 223980, 225287, 226838, 228352, 230146, 232619, 235638, 238516, 240528, 241400]
52862B41400M8j38J77O18R88J330J648J787J625J189N65j47p92j262j727k490
52846B44819l542m415m639m233l561k918k402k116k176k466k570k155j382p49
52832B05495n42n46m30j81K9K46O69J155J221O59j02m71l45o3O1K5k3O9L13M95
52812B07734L58k7k07J11O74J022J127J312J657J791J368M99l89r73j240j316
52796B13501j259j008o18l72n22r14j086q27m10j43O0M00P10N56j56r82j396j287
52778B04247r47o56l97M9P34J323J354P73O3k13M4M34M81L2o68j216j398j282
52760B02757j021o80l79l16m25k38M85J165J025K21k66O3O77J018J275J734K040
52743B09135J722J097Q44J057J270J282J299J320J044M45o4j30J93O30R05Q62
$$ y = [241400, 241448, 241310, 241487, 242105, 243093, 244423, 246071, 247858, 249483, 250672, 251237, 251090, 250298, 249036, 247309, 244819, 241277, 236862, 232223, 227990, 224429, 221511, 219109, 216993, 214817, 212351, 209781, 207626, 206244, 205495, 204953, 204407, 203977, 203796, 203825, 204071, 204740, 205895, 207116, 207775, 207673, 207202, 206857, 206794, 206855, 206880, 206857, 206926, 207239, 207734, 208092, 208065, 207858, 207969, 208643, 209665, 210792, 212104, 213761, 215552, 216920, 217419, 217030, 216057, 214817, 213501, 212242, 211234, 210616, 210244, 209722, 208808, 207722, 206895, 206485, 206342, 206402, 206802, 207512, 208068, 207912, 206930, 205534, 204247, 203300, 202644, 202247, 202296, 203030, 204353, 205707, 206480, 206543, 206330, 206374, 206808, 207289, 207321, 206653, 205437, 204039, 202757, 201736, 201056, 200677, 200361, 199936, 199698, 200183, 201348, 202373, 202594, 202328, 202391, 203068, 204086, 205361, 207095, 209135, 210857, 211954, 212798, 213855, 215125, 216407, 217706, 219026, 220070, 220515, 220451, 220321, 220514, 221144, 222049, 222911]
52727B22911O57P64J429K203K389J818Q92Ro87j066j099j100j413j868j963j608
52711B22268j219j087j151j347j654j731j098R2R37Q11J08k05L88J527K379K293
52695B21311J381M11m9k77p89j364j264m74J63K08K33P87J478J675J511J423J192
52678B27556K93r76j600j194m82k10j88J66P92R88L66o46j313j378j120p84k55
52661B20015N50J296J559J450J488J845K105J970J746J884K299K489K143J348
52647B44187M11k27k31J80J97o57j729j944j227n92o79q88l84N23O89l05j528
52630B35796j785r36J39O36M90R4k18k53J98J139K042K098J001n92j627j593q67
52613B35762k06m7k45k89K16J125J733J436M37l16j57N33Q23L93j62k62r1r6j73
$$ y = [222911, 223568, 224332, 225761, 227964, 230353, 232171, 233063, 233072, 232385, 231319, 230220, 229120, 227707, 225839, 223876, 222268, 221049, 219962, 218811, 217464, 215810, 214079, 212981, 213073, 214010, 214821, 214929, 214724, 215112, 216639, 219018, 221311, 222692, 223103, 223054, 222777, 221988, 220624, 219360, 218886, 219049, 219257, 219490, 220277, 221755, 223430, 224941, 226364, 227556, 227849, 226873, 225273, 224079, 223597, 223387, 223199, 223365, 224157, 225145, 225511, 224865, 223552, 222174, 221054, 220270, 220015, 220565, 221861, 223420, 224870, 226358, 228203, 230308, 232278, 234024, 235908, 238207, 240696, 242839, 244187, 244598, 244371, 244140, 244320, 244517, 243860, 242131, 240187, 238960, 238368, 237689, 236801, 236417, 236940, 237629, 237324, 235796, 234011, 233075, 233214, 233850, 234340, 234434, 234216, 233963, 234161, 235300, 237342, 239440, 240441, 239849, 238222, 236629, 235762, 235556, 235509, 235264, 234975, 235191, 236316, 238049, 239485, 239922, 239606, 239449, 239982, 240805, 241198, 241036, 240774, 240683, 240587, 240414]
52594B40414J39P34R11L96j95k08J46K25q3l18j30M39J229J974K225J779J144
52577B50821J026J348J380Q93N04N97O54R4p53j122q67m46j42P0N2m38j151j424
52559B51096r82k65K04L58L57J41m10j082j447j368j161j192j386j314p83k04
52543B40562j48o08r84q70m98k08R0N80R78R29P52J103J877K126J350K51j74J24
52525B47232L92J91j89l22j05L59R90J576J739J259L71l24k93N18J619K395K668
52508B60076K751K913K979K699K247J949J680J031P0n82o34o03j055j838k499
52493B71184l058l785m369m060k731j202k84M8K36L55J46m00r23j073p43m8P33
52476B50026J255J403J347J191Q13K15k37k52p0m0K8N69J445K109K542L305M400
$$ y = [240414, 240553, 241287, 242198, 242594, 242399, 242191, 242337, 242562, 242479, 242161, 242031, 242470, 243699, 245673, 247898, 249677, 250821, 251847, 253195, 254575, 255468, 255972, 256569, 257223, 257317, 256564, 255442, 254575, 254129, 253987, 254057, 254109, 253671, 252520, 251096, 250114, 249849, 250053, 250411, 250768, 250909, 250499, 249417, 247970, 246602, 245441, 244249, 242863, 241549, 240766, 240562, 240414, 239806, 238822, 237952, 237454, 237246, 237336, 237916, 238894, 239823, 240575, 241678, 243555, 245681, 247031, 247282, 247108, 247232, 247624, 247815, 247626, 247304, 247199, 247558, 248548, 250124, 251863, 253122, 253493, 253169, 252876, 253394, 255013, 257408, 260076, 262827, 265740, 268719, 271418, 273665, 275614, 277294, 278325, 278395, 277813, 277179, 276576, 275521, 273683, 271184, 268126, 264341, 259972, 255912, 253181, 251979, 251695, 251743, 251979, 252334, 252480, 252080, 251157, 250084, 249341, 249293, 250026, 251281, 252684, 254031, 255222, 256035, 256250, 256013, 255761, 255691, 255651, 255679, 256248, 257693, 259802, 262344, 265649, 270049]
52459B70049M860M019K587J761J590J077j96j470k028k278l008m087m604m121
52445B64151l122k270j727j467j580j918j875j104j71Q0k66k91L98J058Q85Q0
52429B50861n79p64o54l58J02M44M21K91M46O81N25K25N36J437J935J486Q08P41
52411B58584J084J255J497K457L875M731M757M942O218Q219R693R761Q443O363
52397C31879M219K395P58j120l387n590o994p211o461n284m037k740j401m08k07
52382B94411o13q02l06L47M79M18J090K552L666L558K698K108K051K104K159K604
52366C18524L531M393M664M400L992L604L072K190R29m37j421j686j408j118j067
52351C42162j010p30m52l99k09P14K230L457L818L701L765M014M029L864M066
$$ y = [270049, 274909, 278928, 281515, 283276, 284866, 285943, 285747, 284277, 282249, 279971, 276963, 272876, 268272, 264151, 261029, 258759, 257032, 255565, 253985, 252067, 250192, 249088, 248917, 248997, 248731, 248440, 248838, 249896, 250781, 250861, 250282, 249518, 248864, 248506, 248608, 249052, 249473, 249764, 250210, 250891, 251416, 251641, 252177, 253614, 255549, 257035, 257843, 258584, 259668, 260923, 262420, 264877, 268752, 273483, 278240, 283182, 289400, 297619, 307312, 317073, 325516, 331879, 336098, 338493, 339251, 338131, 334744, 329154, 322160, 314949, 308488, 303204, 299167, 296427, 295026, 294618, 294411, 293798, 292996, 292690, 293037, 293516, 293934, 295024, 297576, 301242, 304800, 307498, 309606, 311657, 313761, 315920, 318524, 322055, 326448, 331112, 335512, 339504, 343108, 346180, 348370, 349299, 348862, 347441, 345755, 344347, 343229, 342162, 341152, 340422, 339970, 339571, 339362, 340076, 342306, 345763, 349581, 353282, 357047, 361061, 365090, 368954, 373020]
52336C73020M876N936O885P737Q465Q838Q979R580J1034J2748J3925J4771J6135
52323E02929J8087J9697K0452K1024K2139K3351K3716K3288K3030K3305K3351
52312G44369K2509K1246K0436K0108J9636J8825J8183J8002J7853J7270J6404
52301I54841J5566J4570J3010J1104R620Q913Q463P493N740L477J058j298l514
52288A049043n594p447q759r361r672j0314j1119j1115r839q047o580n069k655
52275I43472L73K700L750M382N625P591R939J2437J4540J5365J4854J4353J5046
52262A064427J6323J6633J5624J4391J3746J3411J2988J2652J2422J1745J0448
52251A214810R319R021Q953P996O017L843J863m43l459o592q880j0074j0815j1892
$$ y = [373020, 377896, 383832, 390717, 398454, 406919, 415757, 424736, 434316, 445350, 458098, 472023, 486794, 502929, 521016, 540713, 561165, 582189, 604328, 627679, 651395, 674683, 697713, 721018, 744369, 766878, 788124, 808560, 828668, 848304, 867129, 885312, 903314, 921167, 938437, 954841, 970407, 984977, 997987, 1009091, 1018711, 1027624, 1036087, 1043580, 1049320, 1052797, 1053855, 1052557, 1049043, 1043449, 1036002, 1027243, 1017882, 1008210, 997896, 986777, 975662, 965823, 957776, 951196, 946127, 943472, 943845, 946545, 950295, 954677, 960302, 967893, 977832, 990269, 1004809, 1020174, 1035028, 1049381, 1064427, 1080750, 1097383, 1113007, 1127398, 1141144, 1154555, 1167543, 1180195, 1192617, 1204362, 1214810, 1224129, 1233150, 1242103, 1250099, 1256116, 1259959, 1261822, 1261379, 1257920, 1251328, 1242448, 1232374, 1221559, 1209667]
52237A209667j3529j5318j6678j7290j7173j6508j5548j4673j4126j3637j2612
52226A042575j0976r416q509p980p259o392n778n232m170k689j602j212q40N0
52212I70570J018J524J956L041M637N911O548O897P059O601N443M288L844M030
52198A033367M269M195L807L248K743K528K589K646K601K783L471M374M890M745
52184A082256M162L447K717J918R45l34j940l701n396o928q213r074r391r333
52170A041135r147q797p976o556m835l315k354j949j676r55L67J704K315K200
52156A000161K051K327K751K944K991L048K795J932Q95M59O38O91L00J22Q38K168
52140A027111L245L537L058K072J161J201K568M407N425N475N776P303R663J1881
$$ y = [1209667, 1196138, 1180820, 1164142, 1146852, 1129679, 1113171, 1097623, 1082950, 1068824, 1055187, 1042575, 1031599, 1022183, 1013674, 1005694, 998435, 992043, 986265, 981033, 976863, 974174, 972572, 971360, 970520, 970570, 971588, 973112, 975068, 978109, 982746, 988657, 995205, 1002102, 1009161, 1015762, 1021205, 1025493, 1029337, 1033367, 1037636, 1041831, 1045638, 1048886, 1051629, 1054157, 1056746, 1059392, 1061993, 1064776, 1068247, 1072621, 1077511, 1082256, 1086418, 1089865, 1092582, 1094500, 1095445, 1095111, 1093171, 1089470, 1084074, 1077146, 1068933, 1059859, 1050468, 1041135, 1031988, 1023191, 1015215, 1008659, 1003824, 1000509, 998155, 996206, 994530, 993575, 993942, 995646, 997961, 1000161, 1002212, 1004539, 1007290, 1010234, 1013225, 1016273, 1019068, 1021000, 1021895, 1022354, 1022992, 1023683, 1023983, 1024105, 1024943, 1027111, 1030356, 1033893, 1036951, 1039023, 1040184, 1041385, 1043953, 1048360, 1053785, 1059260, 1065036, 1072339, 1082002, 1093883]
52126A093883J3778J5948J8714K1702K4464K6955K9260L1303L2972L4310L5303
52115A378592L5691L5193L3902L2213L0364K8166K5306K1804J8053J4479J1288
52104A665051Q504O025L615J109j226k879l809m655n877p013p382p318p937r615
52090A626593j1449j2536j3107j3926j5130j6264j7102j7776j8232j8100j7134
52079A455837j5357j2928j0104p260m556j745J377M464O947Q774J0377J2032J3655
52066A461513J5146J6536J7706J8360J8273J7467J6162J4827J3927J3387J2516
$$ y = [1093883, 1107661, 1123609, 1142323, 1164025, 1188489, 1215444, 1244704, 1276007, 1308979, 1343289, 1378592, 1414283, 1449476, 1483378, 1515591, 1545955, 1574121, 1599427, 1621231, 1639284, 1653763, 1665051, 1673555, 1679580, 1683195, 1684304, 1683078, 1680199, 1676390, 1671735, 1665858, 1658845, 1651463, 1644145, 1636208, 1626593, 1615144, 1602608, 1589501, 1575575, 1560445, 1544181, 1527079, 1509303, 1491071, 1472971, 1455837, 1440480, 1427552, 1417448, 1410188, 1405632, 1403887, 1405264, 1409728, 1416675, 1425449, 1435826, 1447858, 1461513, 1476659, 1493195, 1510901, 1529261, 1547534, 1565001, 1581163, 1595990, 1609917, 1623304, 1635820]
$$ [...]
##END NTUPLES=NMR SPECTRUM
##END=
