
##TITLE=AC1391_HONAH12203_7519507_Tmd1RbEgxY
##JCAMPDX= 6.0         $$ Bruker NMR JCAMP-DX V2.0
##DATA TYPE= NMR SPECTRUM
##DATA CLASS= NTUPLES
##ORIGIN= BRUKER
##OWNER= Administrator
$$ 1.72 TOPSPIN		Version 2.1
$$ 2013-02-19 22:17:04.688 -0500  Administrator@X
$$ Compression mode = diff/dup
##.OBSERVE FREQUENCY= 400.02188249412
##.OBSERVE NUCLEUS= ^1H
##.ACQUISITION MODE= SIMULTANEOUS (DQD)
##.ACQUISITION SCHEME= undefined
##.AVERAGES= 8
##.DIGITISER RES= 22
##SPECTROMETER/DATA SYSTEM= spect
##.PULSE SEQUENCE= zg30
##.SOLVENT NAME= COFFEE_meoh
##.SHIFT REFERENCE= INTERNAL, COFFEE_meoh, 1, 14.98509
##AUDIT TRAIL= $$ (NUMBER, WHEN, WHO, WHERE, PROCESS, VERSION, WHAT)
$$ ##TITLE= Audit trail, TOPSPIN		Version 2.1
$$ ##JCAMPDX= 5.01
$$ ##ORIGIN= Bruker BioSpin GmbH
$$ ##OWNER= Administrator
$$ $$ E:\/data/COFFEE/nmr/AC1391_HONAH12203_7519507_Tmd1RbEgxY/10/pdata/1/auditp.txt
$$ ##AUDIT TRAIL=  $$ (NUMBER, WHEN, WHO, WHERE, PROCESS, VERSION, WHAT)
(   1,<2013-02-19 22:16:56.266 -0500>,<Administrator>,<X>,<go>,<TOPSPIN 2.1>,
      <created by zg
	started at 2013-02-19 22:15:50.173 -0500,
	POWCHK enabled, PULCHK disabled,
       configuration hash MD5:
       86 BA 57 50 F2 9D 5C 9B 26 00 A9 28 5F 66 2E 89
       data hash MD5: 64K
       3A F3 35 71 BF CC FC 54 4A 7C 2E D5 CA D5 91 17>)
(   2,<2013-02-19 22:16:59.438 -0500>,<Administrator>,<X>,<proc1d>,<TOPSPIN 2.1>,
      <Start of raw data processing
       efp LB = 0 FT_mod = 6 PKNL = 1 PHC0 = 0 PHC1 = 0 SI = 32K 
       data hash MD5: 32K
       30 D0 F8 D6 B7 BC 8A E8 57 46 F7 E2 90 67 59 11>)
(   3,<2013-02-19 22:16:59.907 -0500>,<Administrator>,<X>,<proc1d>,<TOPSPIN 2.1>,
      <pk PHC0 = 72.22961 PHC1 = 0 
       data hash MD5: 32K
       4A 43 91 03 42 76 C1 6B 65 13 07 2A ED DD 51 BA>)
(   4,<2013-02-19 22:17:00.141 -0500>,<Administrator>,<X>,<proc1d>,<TOPSPIN 2.1>,
      <abs ABSG = 1 
       data hash MD5: 32K
       50 A0 C4 02 3E 74 7A 91 69 96 81 CD 24 15 43 4A>)
(   5,<2013-02-19 22:17:00.282 -0500>,<Administrator>,<X>,<proc1d>,<TOPSPIN 2.1>,
      <abs ABSG = 2 
       data hash MD5: 32K
       01 5C 27 50 D1 66 6F 50 6E AC 68 F9 F0 3B E9 DE>)
(   6,<2013-02-19 22:17:00.423 -0500>,<Administrator>,<X>,<proc1d>,<TOPSPIN 2.1>,
      <abs ABSG = 3 
       data hash MD5: 32K
       EF 28 3F BD A9 6F BB 8E C4 64 23 34 89 47 B6 69>)
(   7,<2013-02-19 22:17:00.579 -0500>,<Administrator>,<X>,<proc1d>,<TOPSPIN 2.1>,
      <abs ABSG = 4 
       data hash MD5: 32K
       C3 9E 2F 77 3A 81 6E 67 B1 AF 82 8F 6E D9 03 2B>)
(   8,<2013-02-19 22:17:00.720 -0500>,<Administrator>,<X>,<proc1d>,<TOPSPIN 2.1>,
      <abs ABSG = 5 
       data hash MD5: 32K
       DC F6 50 B7 84 D8 7F 4B 1F F7 DA 4B 50 FC 28 0D>)
$$ ##END=
$$ 
$$ $$ hash MD5
$$ $$ 64 42 55 42 32 00 EA 6D DE 0F 53 92 82 BB 75 43
##$RELAX= 
##$RELAX= 
##$RELAX= 
##$RELAX= 
##$RELAX= 
##$RELAX= 
##$RELAX= 
$$ Bruker specific parameters
$$ --------------------------
##$DU= <E:\>
##$EXPNO= 10
##$NAME= <AC1391_HONAH12203_7519507_Tmd1RbEgxY>
$$ [...]
##$TP= (0..7)
150 150 150 150 150 150 150 150
##$TP07= 0
##$TPNAME0= <>
##$TPNAME1= <>
##$TPNAME2= <>
##$TPNAME3= <>
##$TPNAME4= <>
##$TPNAME5= <>
##$TPNAME6= <>
##$TPNAME7= <>
##$TPOAL= (0..7)
0.5 0.5 0.5 0.5 0.5 0.5 0.5 0.5
##$TPOFFS= (0..7)
0 0 0 0 0 0 0 0
##$TUNHIN= 0
##$TUNHOUT= 0
##$TUNXOUT= 0
##$USERA1= <user>
##$USERA2= <user>
##$USERA3= <user>
##$USERA4= <user>
##$USERA5= <user>
##$V9= 5
##$VALIST= <valist>
##$VCLIST= <CCCCCCCCCCCCCCC>
##$VD= 0
##$VDLIST= <DDDDDDDDDDDDDDD>
##$VPLIST= <PPPPPPPPPPPPPPP>
##$VTLIST= <TTTTTTTTTTTTTTT>
##$WBST= 1024
##$WBSW= 4
##$XGAIN= (0..3)
0 0 0 0
##$XL= 0
##$YL= 0
##$YMAX_a= 563528
##$YMIN_a= -556130
##$ZGOPTNS= <>
##$ZL1= 120
##$ZL2= 120
##$ZL3= 120
##$ZL4= 120
##$ABSF1= 14.98509
##$ABSF2= -5.573092
##$ABSG= 5
##$ABSL= 3
##$ALPHA= 0
##$AQORDER= 0
##$ASSFAC= 0
##$ASSFACI= 0
##$ASSFACX= 0
##$ASSWID= 0
##$AUNMP= <proc_prof1d_extract_pilot.lims>
##$AXLEFT= 0
##$AXNAME= <>
##$AXNUC= <1H>
##$AXRIGHT= 0
##$AXTYPE= 0
##$AXUNIT= <>
##$AZFE= 0.1
##$AZFW= 0.1
##$BCFW= 0
##$BC_mod= 0
##$BYTORDP= 0
##$COROFFS= 0
##$CY= 15
##$DATMOD= 1
##$DC= 0
##$DFILT= <>
##$DTYPP= 0
##$F1P= 0
##$F2P= 0
##$FCOR= 0.5
##$FTSIZE= 32768
##$FT_mod= 6
##$GAMMA= 0
##$GB= 0
##$INTBC= 1
##$INTSCL= 1
##$ISEN= 128
##$LB= 0
##$LEV0= 0
##$LPBIN= 0
##$MAXI= 10000
##$MC2= 0
##$MEAN= 0
##$ME_mod= 0
##$MI= 0
##$NCOEF= 0
##$NC_proc= -8
##$NLEV= 6
##$NOISF1= 0
##$NOISF2= 0
##$NSP= 0
##$NTH_PI= 0
##$NZP= 0
##$OFFSET= 14.98509
##$PC= 1
##$PHC0= 72.22961
##$PHC1= 0
##$PH_mod= 1
##$PKNL= yes
##$PPARMOD= 0
##$PPDIAG= 0
##$PPIPTYP= 0
##$PPMPNUM= 2147483647
##$PPRESOL= 1
##$PSCAL= 4
##$PSIGN= 0
##$PYNMP= <proc.py>
##$REVERSE= no
##$SF= 400.02
##$SI= 32768
##$SIGF1= 0
##$SIGF2= 0
##$SINO= 400
##$SIOLD= 32768
##$SPECTYP= <>
##$SREGLST= <1H.CDCl3>
##$SSB= 0
##$STSI= 32768
##$STSR= 0
##$SW_p= 8223.68421052631
##$SYMM= 0
##$S_DEV= 0
##$TDeff= 65536
##$TDoff= 0
##$TI= <>
##$TILT= no
##$TM1= 0
##$TM2= 0
##$TOPLEV= 0
##$USERP1= <user>
##$USERP2= <user>
##$USERP3= <user>
##$USERP4= <user>
##$USERP5= <user>
##$WDW= 1
##$XDIM= 32768
##$YMAX_p= 459478151
##$YMIN_p= -726726
##$CURPLOT= <Network HP LaserJet P1505>
##$CURPRIN= <$Network HP LaserJet P1505>
##$DFORMAT= <normdp>
##$LAYOUT= <+/1D_H.xwp>
##$LFORMAT= <normlp>
##$PFORMAT= <normpl>
##$SURQMSG= 1
$$ End of Bruker specific parameters
$$ ---------------------------------
##NTUPLES= NMR SPECTRUM
##VAR_NAME=  FREQUENCY,     SPECTRUM/REAL,   SPECTRUM/IMAG
##SYMBOL=    X,             R,               I
##VAR_TYPE=  INDEPENDENT,   DEPENDENT,       DEPENDENT
##VAR_FORM=  AFFN,          ASDF,            ASDF
##VAR_DIM=   32768,         32768,           32768
##UNITS=     HZ,            ARBITRARY UNITS, ARBITRARY UNITS
##FACTOR=    0.250966925370066, 1,           1
##FIRST=     8223.43324360094, -11749,       -27541
##LAST=      0,             191566,          -79833
##MIN=       0,             -726726,         0
##MAX=       8223.43324360094, 459478151,    0
$$ Real data points
##PAGE= N=1
##DATA TABLE= (X++(R..R)), XYDATA
$$ [...]
$$ plain form
19541 35611 -126046 -512135 -190176 -183521 -475732 -242007 -250305 115512 -174243 -32231 130576
19529 -31871 98568 99487 85882 -53412 -69475 99213 -58557 23426 139675 -155346 -80214 138618
19516 126729 23637 -25716 143 -99740 -183313 20161 364380 -138003 65174 -247250 -209711
19505 -209711 -264337 43340 120619 -236904 -59911 -272157 304227 -377899 -361445 36762 27341
19494 27341 -14326 50098 -320870 161916 298589 123170 15034 -203038 -141898 -31403 -151112
19483 -151112 -265125 -145312 -188398 40554 -191923 180663 -151833 91449 -235443 178733
19472 -308051 -176866 -94677 -48816 -27466 -189 -320930 -51982 -155795 -113699 252573 -4545
19460 -136429 -155864 44298 -130698 -69457 -170199 -245516 -173126 53227 -78777 -298693 -301993
$$ packed form
19541C5611a26046l86089a90176O655k92211K33725q298A15512a74243c2231A30576
19529c1871I8568R19j3605e3412j6063I9213e8557B3426J16249a55346P5132A38618
19516A26729B3637b5716A43i9740q3573B0161L44219a38003F5174b47250L7539
19505b09711n4626D3340P7279b36904e9911k12246C04227c77899J6454C6762r421
19494B7341a4326E0098c20870A61916J36673A23170A5034b03038O1140c1403j19709
19483a51112j14013J19813m3086D0554a91923A80663a51833I1449b35443A78733
19472c08051J31185Q2189M5861K1350a89l20741e1982j03813M2096B52573d545
19460a36429j9435D4298a30698O1241j00742p5317P2390E3227g8777k19916l300
$$ plain form
19449 -301993 -60682 -274345 182460 -139415 -163419 158104 -187094 29601 -37459 -65433
19439 -65433 -99759 -363256 238570 -194514 68316 41493 84276 -52468 -293889 -9118 -81215
19428 -81215 117451 14056 -87616 143734 72080 86579 -404654 16821 -15264 -9721 107227
19416 -317666 161022 -266746 226127 -124371 -225803 -210704 187903 15898 -390095 129585
19405 -126808 -191566 -194973 9743 -307608 -107819 -24125 52560 -256201 89595 -349740 187495
19393 -43939 -36288 -104125 151304 -106116 -424474 52644 -35474 -110685 -36867 -288406 13191
19381 -332820 -182185 119686 -163871 -109232 -417966 132363 -55283 -183477 303745 -65245
19370 -234634 -216791 266563 -72503 106630 -17066 313582 -52030 -111232 45597 -1801 -99098
$$ packed form
19449c01993f0682k13663A82460a39415k4004A58104a87094B9601c7459k7974
19439f5433l4326k63497B38570a94514F8316k6823M2783e2468k41421i118p2097
19428h1215A17451A4056h7616A43734p1654J4499d04654A6821a5264N543A07227
19416c17666A61022b66746B26127a24371j01432J5099A87903A5898c90095A29585
19405a26808o4758l407I743c07608a07819b4125E2560b56201H9595c49740A87495
19393d3939P651o7837A51304a06116l18358E2644c5474p5211c6867k51539A3191
19381c32820J50635A19686a63871N4639l08734A32363e5283j28194C03745f5245
19370b34634J7843B66563g2503A06630a7066C13582e2030n9202D5597a801r7297
$$ plain form
19359 -99098 -327653 -195368 12880 28442 -302982 -22038 -253194 290004 -261215 -131023
19349 -131023 -83852 -93813 -96281 108411 -73446 -73684 142825 -67559 270201 -126014 -3092 122210
19336 -407820 2878 -259665 -371651 117991 -200236 -211092 130405 44987 -60517 -260646
19326 -260646 -182892 162744 83694 -351050 48018 -172543 25445 -16269 -373695 19404 1654
19314 -63424 -73378 -47798 146342 -308055 -305087 -93419 -81739 79497 -225552 -271769 27415
19302 -124708 -62134 -21931 -17420 266605 15350 -126971 -250768 -225933 -374282 102271 -178363
19290 -86834 -189556 -224261 129502 11565 64820 143776 15215 -176386 -160129 9939 -284158
19278 108395 -151339 -598318 -16651 165744 -229539 -62515 26189 -20100 -172471 1871 86622
$$ packed form
19359i9098k28555J32285A2880J5562c02982b2038k31156B90004b61215J30192
19349a31023M7171r961k468A08411g3446k38A42825f7559B70201a26014c092A22210
19336d07820B878b59665j11986A17991b00236j0856A30405D4987f0517k00129
19326b60646P7754A62744p9050c51050D8018a72543B5445a6269l57426A9404A654
19314f3424r954K5580A46342c08055K968i3419J1680G9497b25552m6217B7415
19302a24708f2134b1931M511B66605A5350a26971j23797K4835j48349A02271a78363
19290h6834j02722l4705A29502A1565N3255P8956A5215a76386J6257I939b84158
19278A08395a51339m46979a6651A65744b29539f2515B6189b0100j52371A871Q4751
$$ plain form
19267 86622 36501 179658 42653 -100135 -73353 143879 184387 -174093 223620 -255162
19256 76301 -32900 -373371 -101935 -32188 -278524 288867 101172 -403270 -205269 69212
19245 -149857 250527 296804 -162973 -194320 -150511 314226 34663 -368740 -82500 -47185 171988
19233 204044 -389172 -62837 -428078 -45838 335376 -213198 -320981 295111 -97575 -116402
19223 -116402 156897 -91036 50394 -202639 -292118 339380 145096 -300771 92357 -8277 -79114
19212 -79114 -62300 -23914 -183671 -404452 38734 -132237 -107615 -200348 -140738 178075 184890
19201 184890 98245 12812 -11309 23167 88551 14608 13800 -100215 78959 113354 -303848
19189 -241399 71611 -171531 189973 -80626 -275158 -11254 -290467 29432 -110807 165262
$$ packed form
19267H6622C6501J43157D2653a00135K6782A43879M0508a74093B23620b55162
19256G6301c2900l40471a01935c2188k46336B88867A01172d03270J98001F9212
19245a49857B50527M6277a62973l1347M3809C14226C4663c68740h2500L5315A71988
19233B04044c89172f2837l65241d5838C35376b13198j07783B95111i7575j8827
19223a16402A56897i1036E0394b02639q9479C39380A45096c00771I2357h277p0837
19212g9114J6814b3914j59757k20781C8734a32237K4622r2733N9610A78075O815
19201A84890q6645A2812a1309B3167O5384A4608q08a00215G8959L4395c03848
19189b41399G1611a71531A89973h0626j94532a1254k79213B9432a10807A65262
$$ plain form
19178 39560 -158457 24940 -22614 -151366 85780 162562 127359 -16446 492985 64588 -97116
19166 9233 -306021 56656 -97433 -132875 -154845 -172278 -51003 -108122 -90045 -2329 -82711 -67910
19154 -67910 26845 38946 -113804 -361696 21457 -259625 -154029 191497 -219831 -312279
19144 -312279 -125280 258352 224649 66038 41534 180860 230289 -174124 -72989 100220
19133 63034 -429236 -134566 149092 44027 -45171 -80656 -388556 -78624 -73236 -98252 -348559
19122 -348559 236907 31029 -146358 -403706 -297490 -372043 -63429 42879 -200298 112922
19111 -165043 37479 -130697 -157305 151645 136082 4623 109128 -170549 -373087 127246
19100 286318 -21671 44953 -243814 -47756 -39868 391013 -117366 1127 -201674 -87811 131412
$$ packed form
19178C9560a58457B4940b2614j28752H5780P6782l5203a6446D92985F4588i7116
19166I233c06021E6656i7433l5442k1970j7433e1003n7119J8077b329q0382J4801
19154f7910B6845J2101a13804k47892B1457b59625J05596A91497b19831r2448
19144c12279a25280B58352l3703F6038k4504J39326M9429a74124g2989A00220
19133F3034d29236a34566A49092D4027d5171l5485l07900g8624N388k5016k50307
19122c48559B36907C1029a46358k57348J06216p4553f3429D2879b00298A12922
19111a65043C7479a30697k6608A51645j5563D623J04505a70549k02538A27246
19100B86318b1671D4953b43814d7756P888C91013a17366A127b01674h7811A31412
$$ plain form
19088 -55388 13442 -58830 -420551 -365808 -17834 -181962 360382 337928 76498 -208182 22445
19076 66085 -112288 37663 413891 -129465 42104 -113189 -66016 -5134 -60350 -5483 -56578
19065 -56578 208755 90232 333480 22096 -140093 38510 -272719 -170151 37643 60025 94390
19054 94390 -114826 -81018 2318 -127345 -25366 244927 105280 -201515 -52600 132695 139091
19043 139091 8767 405406 -180190 83109 -141140 123092 -198852 -48193 -238086 -143184
19033 -143184 17104 220120 -373913 99055 160848 160530 -272124 -5895 363142 280765 -181482
19021 -27221 102526 -20307 -121173 229404 167630 -117659 -23947 194383 317712 49140
19010 -82818 -350694 -39479 -78795 -332899 67932 -248206 66519 -43355 300592 19060 -192889
$$ packed form
19088e5388A3442e8830l61721N4743a7834j64128C60382k2454G6498b08182B2445
19076F6085a12288C7663L76228a29465D2104a13189M7173e134n5216e483n1095
19065e6578B08755I0232K43248B2096a40093C8510b72719J02568C7643K2382L4365
19054I4390a14826L3808B318a27345b5366B44927A05280b01515e2600A32695O396
19043A39091H767L96639a80190H3109a41140A23092a98852d8193j89893R4902
19033a43184A7104K03016c73913I9055O1793l18b72124e895C63142q2377a81482
19021b7221A02526b0307j00866B29404o1774a17659b3947A94383J23329D9140
19010h2818k67876c9479l9316k54104F7932b48206F6519d3355C00592A9060a92889
$$ plain form
18998 28575 64703 -156404 -175020 -242130 -519964 -82934 64130 -10473 282991 -156479 -96194
18987 -96194 -417083 -236053 -142068 172938 -247649 -230407 3508 -186324 30426 -114599 23142
18975 -7000 -10457 -278367 -258066 -217684 102517 -94735 -205343 280254 -368013 -167007 101476
18963 -196681 -105477 233279 -28307 112214 -19986 33016 -136652 -132991 30262 -63916 -97849
18952 -97849 -259758 62039 85657 -276567 120789 158037 -14303 195083 -23554 -265869 -122734
18940 -193397 -267143 26254 -103299 59829 -159426 -312792 -104357 305508 -74870 163402
18929 -342136 87489 49474 -35970 -82927 -168542 -67253 112473 -234806 5137 -223206 -162612
18918 -162612 -20191 65923 174217 -97054 1349 -190862 -13803 -156932 251162 -120180 205229
$$ packed form
18998B8575L6128a56404j8616o7110k77834h2934F4130a0473B82991a56479O0285
18987i6194l20889J81030R3985A72938b47649J7242C508a86324C0426a14599B3142
18975g000l457k67910K0301M0382A02517i4735j10608B80254c68013a67007A01476
18963a96681R1204B33279b8307A12214a9986C3016a36652L661C0262f3916l3933
18952i7849j61909F2039K3618b76567A20789L7248a4303A95083b3554k42315a22734
18940a93397p3746B6254a03299E9829a59426j53366a04357C05508g4870A63402
18929c42136H7489l8015c5970m6957q5615f7253A12473b34806E137b23206O0594
18918a62612b0191F5923J08294i7054A349a90862a3803j43129B51162a20180B05229
$$ plain form
18906 79584 -9901 -107623 315723 164702 -32821 -1176 38399 -140948 -99826 -44441 52697
18894 82991 39475 106117 312052 -210865 217619 -305618 10274 -189337 -316424 -129960
18883 -134762 -445473 49328 -82366 -363042 53527 -147563 -440834 -250026 141981 -199619
18872 -218792 -59669 362866 -40180 -270798 162145 -190525 -86832 -235793 10371 -50935
18861 173731 61319 -38133 373314 -274803 -124464 -350807 -156758 -161304 -111711 -62362 253826
18849 -119514 -137648 -97051 138999 -14590 -23540 199469 -89069 -266095 -250684 -458 77193
18837 74485 156135 353361 -110185 82618 -136996 -97578 -88427 58513 -102773 -124565 -573
18825 -196912 100537 -54281 69460 -148189 75125 -149306 -69685 418862 30563 248427
$$ packed form
18906G9584i901r7722C15723j51021c2821a176C8399a40948M1122d4441E2697
18894H2991C9475O6642K05935b10865B17619c05618A0274a89337j27087a29960
18883a34762l10711D9328h2366k80676E3527a47563k93271J90808A41981a99619
18872b18792e9669C62866d0180k30618A62145a90525h6832j48961A0371e0935
18861A73731F1319c8133C73314b74803a24464k26343a56758m546M9593M9349B53826
18849a19514j8134M0597A38999a4590q950A99469h9069j77026J5411d58G7193
18837G4485Q1650J97226a10185H2618a36996L9418R151E8513a02773k1792e73
18825a96912A00537e4281F9460a48189G5125a49306f9685D18862C0563K17864
$$ plain form
18815 248427 273252 67446 -91097 86080 -184130 139469 -153586 -212422 194904 32569 200385
18804 200385 297375 173619 7047 -184095 -71112 -78941 2500 81987 -239635 422544 -103031
18792 -219402 -110643 184079 138012 102412 -5384 -319116 -179984 -420084 -165965 28144
18781 306575 -272432 -79458 5908 -88838 -292795 9864 -136237 40616 -232805 -46216 91452
18769 -85026 168663 -49155 178117 7509 150301 -368696 -424185 204527 532138 -97196 -246214
18758 -246214 90893 -199750 174468 -86178 57117 -140618 -110691 443411 -137146 356161
18747 4321 -323020 -198743 16150 -160477 177802 430874 -260361 -154359 -223160 -169845
18737 -169845 -306973 104586 -68734 -11866 -233817 167663 -131411 -91415 -244476 -141221
$$ packed form
18815B48427K4825F7446i1097H6080a84130A39469a53586n8836A94904C2569J67816
18804B00385R6990j23756G047a84095g1112p829B500P9487b39635D22544a03031
18792b19402J08759A84079m6067l5600e384l13732J39132k40100a65965B8144
18781C06575b72432g9458E908h8838k03957I864a36237D0616b32805d6216I1452
18769h5026A68663d9155A78117G509J42792c68696n5489B04527L27611i7196j49018
18758b46214I0893a99750A74468h6178E7117a40618K9927D43411a37146C56161
18747D321c23020J24277A6150a60477A77802K53072b60361J06002o8801N3315
18737a69845j37128A04586f8734a1866k21951A67663a31411L9996j53061J03255
$$ plain form
18727 -141221 84683 103004 162171 -310052 -262344 56604 -22549 -56364 151933 -47242 -124610
18716 -124610 -239778 289549 -137666 161140 -34364 138152 -125842 -265839 -190959 52435
18705 -24247 298073 -322596 -15706 -398566 221463 -108263 -166089 -218458 -7779 -58584 -128781
18694 -128781 -241559 246323 352841 -41890 -25908 -235865 -7980 216085 -75857 -164164 13852
18682 -197635 1314 184264 -184214 8326 -66260 -167340 267534 -101345 -2983 -51310 101820
18670 282068 -285382 -56285 -146199 -106834 -405499 166336 -198607 -172660 -208580 -65444 -145987
18659 -145987 -299774 -251265 -4761 -3291 -181275 -16972 -82914 -150212 -138039 -530669 -38978
18647 74885 32034 -11131 71032 285701 -146822 -726726 -338616 -46278 -39467 -194944 -204786
$$ packed form
18727a41221H4683J8321N9167c10052M7708E6604b2549l3815A51933d7242p7368
18716a24610j15168B89549a37666A61140c4364A38152a25842j39997P4880E2435
18705b4247B98073c22596a5706l82860B21463a08263n7826n2369g779n0805p0197
18694a28781j12778B46323J06518d1890J5982k09957g980B16085g5857q8307A3852
18682a97635A314J82950a84214H326f6260j01080B67534a01345b983m8327A01820
18670B82068b85382e6285q9914L9365k98665A66336a98607K5947l5920f5444q0543
18659a45987j53787M8509d761J470j77984a6972o5942o7298J2173l92630c8978
18647G4885C2034a1131G1032K14669a46822n79904c38616d6278O811j55477r842
$$ plain form
18636 -204786 92809 -236986 -128054 -157407 146406 -244217 -255926 183677 -118934 285590
18625 -27205 -86262 106148 -28130 -263435 133532 16085 -376211 -195251 63720 80159 219158
18614 219158 -311893 -78904 238303 -358154 -144446 94323 -150868 29443 -134773 -269029
18604 -269029 -107285 -117494 -132267 -171521 -390001 -137159 -29835 36305 -47197 65494 -297856
18592 247379 158378 -3516 -265292 -217831 238824 -199771 -19748 13643 -63371 -81916 60082
18580 -382450 59953 211593 -243856 -89506 -139959 -8344 109017 -46255 -173919 -119407 -187633
18569 -187633 -231183 -43440 -260371 -95174 -213905 41518 -182722 -202322 -97488 362015 203809
18558 203809 150088 -149649 -173037 -252821 170537 106281 124895 -6091 169524 196786 -7998
$$ packed form
18636b04786I2809b36986J08932k9353A46406b44217j1709A83677a18934B85590
18625b7205n9057A06148b8130k35305A33532A6085c76211J80960F3720J6439J38999
18614B19158c11893g8904B38303c58154a44446I4323a50868B9443a34773j34256
18604b69029a07285j0209j4773l9254k18480a37159b9835C6305d7197F5494b97856
18592B47379q9001c516k61776M7461B38824a99771a9748A3643f3371j8545F0082
18580c82450E9953J51640b43856h9506n0453h344A09017d6255j27664N4512o8226
18569a87633m3550d3440k16931i5174j18731D1518a82722j9600i7488C62015j58206
18558B03809n3721a49649k3388p9784A70537o4256J8614f091A69524K7262g998
$$ plain form
18546 -25549 211147 213610 124542 -143567 -208651 -74971 -73396 -195285 -79488 -158573 -133433
18535 -133433 95273 28827 -108418 -144931 -141307 -85752 12007 102751 122332 -69933 -155954
18524 -155954 174958 -54775 -54844 59891 120419 -389072 75994 34699 -328668 169202 -77248
18512 -219274 -71092 -55437 2006 -200000 -126449 -85994 -45585 -307745 -123669 -25058 -243526
18501 -243526 289709 221455 77217 39992 144061 -76792 248810 -8576 132687 -285606 57592
18489 -238012 -441845 -6653 -109781 4123 -69602 -308396 46604 173570 72030 185659 -523034
18477 -178800 -116044 -76732 -164456 -68742 108521 -20677 -4654 -27513 2060 244099 271760
18466 271760 -93276 -323396 -63822 -138722 83661 83748 199201 66671 -219220 251956 -355120
$$ packed form
18546b5549B11147K463q9068a43567o5084g4971J575j21889g9488p9085K5140
18535a33433I5273B8827a08418l6513L624N5555A2007R0744J9581f9933q6021
18524a55954A74958e4775o9E9891O0528c89072G5994C4699c28668A69202g7248
18512b19274g1092J5655B006b00000P3551M0455M0409k62160a23669b5058k18468
18501b43526B89709o8254G7217l7225J04069g6792B48810h576A32687b85606E7592
18489b38012k03833f653j03128D123f9602k38794D6604J26966G2030J13629e23034
18477a78800O2756L9312q7724f8742A08521b0677d654k2859B060K42039K7661
18466B71760i3276k30120f3822p4900H3661Q7J15453F6671b19220B51956c55120
$$ plain form
18454 -73416 180782 8785 393416 81208 -10653 120894 73413 15313 -61621 -318866 263359
18442 37523 -149263 -29184 -11379 202037 -182389 12411 -229376 456193 -100789 -65900
18432 -65900 -65947 62467 71950 -52453 93106 27493 -87334 -345075 -141822 -163986 -127391 80027
18419 -75920 -195267 -150132 -211005 98434 95915 -25517 -37949 114788 -454066 -98149 -200929
18408 -200929 -21690 -46748 45360 463192 73879 -8697 70433 -173562 33948 -190664 -251513
18397 -251513 28032 -72592 -174721 66221 -374392 -266735 -164063 111429 51625 -193469
18386 151172 295896 -200560 9352 455 -413490 -265130 135354 27083 295624 -45752 256029
18374 292220 135610 -107857 5237 104655 -159003 -92423 -8284 -105444 -56431 -91024 -144690
$$ packed form
18454g3416A80782H785L84631H1208a0653A20894m7481A5313f1621k57245B63359
18442C7523a49263b9184a1379B02037a82389A2411b29376D56193a00789L4889
18432f5900m7F2467R483e2453I3106B7493h7334k57741a41822k2164L6595H0027
18419g5920j19347M5135o0873I8434k519b5517j2432A14788d54066i8149j02780
18408b00929b1690k5058D5360M17832G3879h697G0433a73562C3948a90664o0849
18397b51513B8032g2592j02129F6221c74392J07657J02672A11429E1625a93469
18386A51172J44724b00560I352D55d13490J48360A35354B7083K68541d5752B56029
18374B92220A35610a07857E237R9418a59003O6580h284r7160M9013l4593n3666
$$ plain form
18363 -144690 -65150 -4900 35174 -180909 132769 -297149 -70736 123653 -190600 -175552 -288320
18352 -288320 122924 -164638 -77457 163136 245962 -321459 -156751 -4039 132211 -149691
18341 297365 152569 -130630 -149703 -150210 -47484 -3489 64031 97567 138044 54235 50703 63905
18329 63905 46431 -203657 -194962 159888 15315 -87294 -266274 85054 100208 -157029 -330235
18318 -330235 51631 48096 -44011 -211468 26895 -80530 49291 76416 -217698 -27703 -58145
18307 -58145 -123269 -31204 -262796 -48135 -238606 -213150 -53802 72922 -276677 -81588 -32849
18295 60181 -102046 -94937 -166836 -171897 -135652 171211 -96688 8149 -14767 2100 -323464 -385946
18283 -385946 -225701 -268355 -36795 237861 -84499 -87308 -229677 -292289 21390 9266 156998
$$ packed form
18363a44690f5150d900C5174a80909A32769b97149g0736A23653a90600J5048j12768
18352b88320A22924a64638g7457A63136Q2826c21459a56751d039A32211a49691
18341B97365j44796a30630j9073n07d7484c489F4031L3536M0477E4235l532J3202
18329F3905j7474b03657Q695A59888A5315h7294j78980H5054J5154a57029j73206
18318c30235E1631l535d4011j67457B6895h0530D9291K7125b17698b7703l0442
18307e8145o5124c1204k31592d8135j90471K5456e3802G2922b76677h1588c2849
18295F0181a02046P109p1899n061L6245A71211i6688H149a4767B100c23464o2482
18283c85946J60245m2654c6795B37861h4499k809j42369o2612B1390I266J47732
$$ plain form
18272 156998 -124180 -41382 -17203 32139 -44238 92805 118715 234052 -339879 -85646 162705
18260 -211984 -160588 442148 -141091 -70315 -337451 -121983 77204 -188112 121120 -342391
18249 46812 23694 -28231 -163309 196217 -4133 -17007 -111864 60832 219797 117323 263591
18238 263591 220949 -84659 -158336 57771 13355 -456406 136201 158825 -166638 21145 6264
18226 -7574 -218779 -372024 -7694 -194621 229283 -1866 -41850 249841 -57948 3092 -833 190164
18213 -45298 338458 -71721 -103349 -112065 -36805 -301483 -279796 -18645 26592 -35769 193356
18201 -267800 -253779 -127366 -181237 390107 -164485 -523516 -52420 -137398 -145391 -35347 32429
18189 -207242 -205759 -251393 42259 -277970 137308 139548 74579 -426564 76470 -127015 108798
$$ packed form
18272A56998a24180d1382a7203C2139d4238I2805K5910J15337c39879h5646A62705
18260b11984N1396D42148a41091g0315k67136a21983G7204a88112A21120c42391
18249D6812k3118b8231j35078A96217d133j2874r4857F0832J58965j02474J46268
18238B63591m2642h4659p3677E7771A3355d56406A36201K2624a66638B1145F264
18226g574k11205j53245g694j86927B29283a866l9984B49841e7948C092h33A90164
18213d5298C38458g1721l1628q716c6805k64678K1687a8645B6592c5769A93356
18201b67800J4021J26413n3871C90107a64485l59031e2420q4978p993c5347C2429
18189b07242J483m5634D2259b77970A37308K240o4969d26564G6470a27015A08798
$$ plain form
18177 -223590 -156549 -205429 -56920 278636 148914 131679 22082 73852 -302391 -351936 -78343
18165 235658 -108678 -115976 -171803 -501193 -2787 44400 -181125 -300771 18980 268460 49189
18153 -110680 -140932 7662 49393 -106188 107722 132881 -263298 74365 -45542 -360543 286938
18141 -307519 189534 -179713 232249 -97744 -233063 -70977 5294 -205725 53007 -41959 152253
18129 -235472 241056 -176548 -164327 262410 -75819 -188948 -142575 131546 119001 206461
18119 206461 -172620 171845 -107250 -157676 -235098 170647 34754 -251524 -146183 135103
18108 241196 -109043 68364 -263425 228628 -173465 -432452 47038 -14349 -102941 101012
18097 202529 -227906 -40955 -16121 -44877 143068 -360455 -240223 309158 -280545 -154672
$$ packed form
18177b23590O7041m8880e6920B78636j29722j7235B2082N1770c02391m9545g8343
18165B35658a08678p298n5827l29390b787D4400a81125j19646A8980K49480D9189
18153a10680l0252G662M1731a06188A07722K5159b63298G4365d5542l15001B86938
18141c07519A89534a79713B32249i7744j35319g0977E294b05725E3007d1959A52253
18129b35472B41056a76548J2221B62410g5819j13129M6373A31546j2545Q7460
18119B06461a72620A71845a07250n0426p7422A70647C4754b51524J05341A35103
18108B41196a09043F8364b63425B28628a73465k58987D7038a4349q8592A01012
18097B02529b27906d0955a6121k8756A43068c60455J20232C09158b80545J25873
$$ plain form
18087 -154672 -260046 -113962 -115306 -138688 100977 -5830 -37103 196097 -37035 264922 -467286
18075 57512 -39305 158722 -4436 22240 -245637 -77436 25737 -164244 -120010 191225 -209317
18063 129483 71850 -119471 -355311 281444 -7870 141332 180083 -248140 -213786 109362
18052 -69897 150968 -368870 261110 30871 89418 -19452 23179 216199 27913 -3550 233824
18040 -129864 -185418 -12962 8950 -99146 -59439 267006 -292247 163354 109853 -56176 -87399
18029 -87399 253891 -262452 -47864 -22615 -74647 -63734 41520 -3783 28488 8828 -47705 -195160
18017 -195160 288266 59804 303253 12762 -321347 -28904 341174 -194122 -296482 -216091
18007 -216091 -109686 99023 -59535 -201323 -140345 -77550 252440 -28657 256318 15286 -131615
$$ packed form
18087a54672j05374a13962j344k3382A00977e830l1273A96097c7035B64922d67286
18075E7512c9305A58722d436B2240b45637g7436B5737a64244M4234A91225b09317
18063A29483n7633a19471k35840B81444g870A41332L8751b48140L4354A09362
18052f9897A50968c68870B61110C0871N8547a9452B3179J93020B7913c550B33824
18040a29864n5554a2962H950i9146L9707B67006b92247A63354n3501e6176l1223
18029h7399B53891b62452d7864b2615n2032J0913D1520c783B8488H828d7705j47455
18017a95160B88266E9804K43449A2762c21347b8904C41174a94122j02360Q0391
18007b16091J06405I9023e9535j41788O0978O2795B52440b8657B56318A5286a31615
$$ plain form
17995 79602 -31858 22970 -271151 -40174 67574 -50689 -117686 197309 -102132 106389 14857
17983 -10607 119490 50283 39334 -296624 -183735 -200838 -154430 -123898 224889 55363 211752
17972 211752 17628 -175588 -166494 -88462 -74259 374250 6409 -63489 65722 58655 -84592 159321
17959 275626 -75996 293499 -169720 -122813 74200 -69429 -24270 -180416 127082 -121380
17948 82750 -50806 -66920 55617 68143 1465 113820 -74285 -8322 266210 -102462 59627
17936 13488 -148034 -36238 67734 -85281 -262480 211187 -267183 45536 -290799 40436 3845
17924 -10788 7194 214242 -51341 -105617 57116 87469 91264 31020 200907 24712 201061
17913 201061 -59098 220391 16495 8989 -255209 312887 23162 -132274 -126264 186555 -208538
$$ packed form
17995G9602c1858B2970b71151d0174F7574e0689o6997A97309a02132A06389A4857
17983a0607A19490E0283j0949b96624J12889j7103M6408L0532B24889E5363J56389
17972B11752A7628a75588R094P8032J4203C74250F409f3489F5722p067h4592A59321
17959B75626g5996B93499a69720M6907G4200f9429b4270j56146A27082a21380
17948H2750e0806j6114E5617J2526A465J12355g4285h322B66210a02462E9627
17936A3488a48034c6238F7734h5281j77199B11187b67183D5536b90799D0436C845
17924a0788G194K07048e1341n4276E7116L0353L795C1020J69887B4712J76349
17913B01061e9098B20391A6495p506b55209C12887B3162a32274O010A86555b08538
$$ plain form
17901 -31674 129785 -99098 -63295 -213291 -108376 -283689 -12620 -28759 108496 16235 25383
17890 25383 141270 47384 -198342 -123068 -78404 166854 7143 18788 -142910 -412521 -47909
17878 -245316 92556 -12876 179050 262778 92377 -299649 289230 -84966 72723 292049 -163963
17866 115522 -58426 -45957 -93482 269501 149402 -201615 34304 -36758 -187041 -280828 -14885
17854 -74711 -298620 206585 -296583 -97742 17994 6048 11354 -162361 122287 79231 4633
17842 108309 -290113 184710 -71302 -489063 -314488 -194197 86910 -13508 -141014 125064
17831 -270329 27465 70682 -163317 -222365 215480 -179248 95953 308143 -183458 -110631
17821 -110631 230323 301517 36289 -465278 -130363 -216441 -115832 106014 -5887 273433
$$ packed form
17901c1674A29785i9098L5803j49996J04915j75313a2620j6139A08496A6235R148
17890B5383J15887D7384a98342P5274M4664A66854G143J1645a42910k69611d7909
17878b45316I2556a2876A79050Q3728I2377b99649B89230h4966G2723K19326a63963
17866A15522e8426J2469m7525B69501j20099b01615C4304c6758j50283r3787a4885
17854g4711k23909B06585b96583i7742A7994F048N306a62361A22287m3056D633
17842A08309b90113A84710g1302m17761J74575J20291H6910a3508j27506A25064
17831b70329B7465M3217a63317n9048B15480a79248I5953K12190a83458P2827
17821a10631B30323P1194C6289d65278a30363q6078J00609A06014e887B73433
$$ plain form
17810 2467 -99452 87340 284911 207351 -101192 225699 -64433 139167 196004 -31051 -228215
17799 -228215 91551 16320 264914 -61271 -61048 157405 -16070 189595 -9026 -394374 157493
17787 6567 89905 -149226 9662 50966 -28364 -75051 -46983 97402 190134 157381 -41431 -214102
17775 -214102 75550 -76905 165295 60472 -5677 -123851 -102991 136573 144435 -84235 -145107
17764 -145107 204114 -226131 136457 29286 25690 186309 140753 -375363 32822 174133
17754 174133 127922 -137929 50480 288691 106399 -96823 89925 50733 222380 78151 171087
17743 171087 -31449 -116464 -361423 113950 -454812 64675 150938 -168597 49646 -58394 -186171
17732 -186171 -13755 -174237 -167995 -11746 -206854 -91744 -133958 4892 175183 276827 180110
$$ packed form
17810B467i9452H7340J97571p7560a01192B25699f4433A39167N6837c1051j97164
17799b28215I1551A6320K48594f1271K23A57405a6070A89595i026l85348A57493
17787F567Q3338a49226I662M1304b8364m6687K8068I7402R2732l2753d1431j72671
17775b14102G5550g6905A65295F0472e677j18174K0860A36573P862h4235o0872
17764a45107B04114b26131A36457B9286l596J60619m5556c75363C2822J41311
17754A74133m6211a37929E0480K38211A06399i6823H9925l9192J71647G8151R2936
17743A71087c1449q5015k44959A13950d54812F4675Q6263a68597D9646e8394j27777
17732a86171a3755j60482O242a1746j95108i1744m2214D892J70291J01644r6717
$$ plain form
17721 180110 -129872 172818 23740 186678 41208 78795 -37255 88415 -298789 -97071 260927
17709 226141 -6681 54882 -14391 -133730 212334 186006 -222477 79818 -207447 -455318 -172290
17697 -154721 13268 44446 175106 180095 36462 -118151 485988 51656 184472 329702 -37637
17685 -67804 111754 206533 -174689 23903 -211319 4554 161438 -117926 43237 166437 -114695
17673 40512 211004 46228 76843 259691 46335 118301 109683 -277387 -22866 -65693 -327055
17662 -327055 -11425 -11056 -99424 17698 87028 -178690 -106400 156566 66655 -86283 -49331
17651 -49331 204658 18826 -281828 -265196 -260579 -116690 -111014 -339747 -209311 79322 183453
17640 183453 6686 -64496 63851 253446 275038 -70728 -102511 -233466 -163369 -154432 92760
$$ packed form
17721A80110a29872A72818B3740J62938D1208L7587c7255H8415b98789i7071B60927
17709B26141f681E4882a4391j19339B12334k6328b22477G9818b07447k47871a72290
17697a54721A3268L1178J30660M989C6462a18151D85988E1656J32816J45230c7637
17685f7804A11754R4779a74689B3903b11319D554J56884a17926D3237J23200a14695
17673D0512J70492D6228L0615J82848D6335P1966q618b77387b2866m2827k61362
17662c27055a1425L69q8368A7698O9330a78690P2290A56566F6655h6283L6952
17651d9331B04658A8826b81828J6632M617a16690N676k28733J30436G9322J04131
17640A83453F686f4496F3851J89595K1592g0728l1783j30955P0097Q937I2760
$$ plain form
17628 -25593 -94304 -58132 -201905 237578 -27518 400876 73054 94875 193485 237486 -128872
17616 -222957 -14267 91278 -12087 21532 164464 245907 -16859 71845 51156 -69765 161678
17604 68890 376066 89687 142582 -118953 101489 304091 247349 -321795 -194660 -126904
17594 -126904 -390544 74531 134242 -345300 86106 246385 -49893 -490766 -130723 3478 -36982
17582 142492 -51177 -76257 76136 58858 193956 21650 97094 -30977 19197 -118498 -154109
17571 -154109 206794 485736 121745 457264 33134 -180095 271929 129723 25826 57524
17561 57524 78550 9782 -185929 167366 80579 -157748 137359 507039 186992 104621 -72295
17549 -133407 -103329 255581 43574 399076 171319 -151603 226488 77814 172708 101848
$$ packed form
17628b5593o8711L6172j43773B37578b7518D00876G3054K1821R8610M4001a28872
17616b22957a4267I1278a2087B1532J42932Q1443a6859G1845k0689f9765A61678
17604F8890L07176H9687N2895a18953A01489K02602n6742c21795J27135O7756
17594a26904k63640G4531N9711c45300H6106J60279d9893m40873a30723C478c6982
17582A42492e1177k5080G6136j7278J35098B1650P5444c0977A9197a18498l5611
17571a54109B06794K78942A21745L35519C3134a80095B71929A29723B5826L1698
17561E7524K1026I782a85929A67366H0579a57748A37359L69680A86992q2371g2295
17549a33407L0078B55581D3574L55502A71319a51603B26488G7814R4894p0860
$$ plain form
17539 101848 116231 38091 -239577 8869 -7575 6938 -10114 -110445 262329 -171812 92351
17527 266566 166898 -134113 18594 51598 231861 -22208 263089 72521 47613 -188604 534729
17515 200697 216637 214732 76385 170444 95166 110317 233433 107624 174015 -69688 -54375
17504 -54375 -113730 373729 304241 -65478 279350 77949 64775 47124 380228 307986 158044
17493 158044 -158882 188332 -117838 213193 96805 76215 138474 -334493 -162169 27154
17482 300647 26999 -120529 230546 -88442 497233 -169275 70936 -79614 8380 100016 120697
17471 120697 11500 -140173 269347 -44963 133755 129217 299682 -147574 281241 404090
17461 404090 -55647 149368 115152 78196 324878 136125 498959 168688 184491 220213
$$ packed form
17539A01848J4383C8091b39577H869g575F938a0114j00331B62329a71812I2351
17527B66566r9668a34113A8594L3004J80263b2208B63089G2521k4908a88604E34729
17515B00697J5940j905G6385R4059p5278J5151J23116A07624O6391f9688J5313
17504e4375n9355C73729o9488f5478B79350G7949j3174j7651L33104p2242j49942
17493A58044a58882A88332a17838B13193I6805k0590O2259c34493a62169B7154
17482C00647B6999a20529B30546h8442D97233a69275G0936g9614H380R1636K0681
17471A20697A1500a40173B69347d4963A33755m538J70465a47574B81241J22849
17461D04090e5647A49368l4216l6956K46682A36125L62834A68688J5803L5722
$$ plain form
17451 220213 203462 110673 324514 145271 364122 157254 405182 250230 -23766 20760
17440 294353 405095 92993 98170 94265 -169018 176631 182461 -57056 -150791 277563 122240
17428 201699 422328 196825 11713 246033 444042 420602 403313 443737 57014 588295
17418 588295 148465 309490 321265 514918 56263 193206 94676 285280 397242 -534 148853
17406 249563 78558 271529 -28386 79137 42109 -106886 143781 93537 -4304 126101 69616
17395 69616 74796 203327 203516 351345 251795 429464 28368 292739 -454686 255923 21399
17383 128978 88489 284278 -173871 356199 51887 211173 -3896 408216 75836 10012 -103780
17371 239290 75290 214933 147987 364548 19408 -376961 151009 -111447 -52251 -26926
$$ packed form
17451B20213j6751r2789K13841A45271K18851A57254K47928j54952b3766B0760
17440B94353J10742I2993N177l905a69018A76631N830e7056r3735B77563A22240
17428B01699K20629A96825A1713K34320J98009k3440j7289M0424E7014N31281
17418E88295A48465J61025J1775J93653E6263J36943I4676J90604J11962e34A48853
17406B49563G8558J92971b8386G9137l7028a06886A43781n0244d304A26101n6485
17395F9616N180J28531J89J47829r9550J77669B8368K64371d54686B55923B1399
17383A28978m0489J95789a73871C56199E1887J59286c896D08216G5836A0012a03780
17371B39290G5290J39643o6946K16561A9408c76961A51009a11447e2251K5325
$$ plain form
17361 -26926 -187053 -42186 122051 -241753 -109273 123942 81452 205413 159293 16821
17350 291500 -95751 42751 -161828 136925 193427 113862 255407 201439 208787 95026 182054
17339 182054 180915 247715 22175 109030 98291 -4443 491403 437197 67947 78146 273450
17328 273450 319244 151783 591773 187798 -105910 440009 96862 -33348 48586 -101530
17317 -75507 158250 341537 142631 100879 22661 -126933 216267 -25308 -17991 262807 133068
17306 133068 -88303 69992 75170 461029 229539 -104426 198255 178394 -31804 -93425 158834
17294 415178 -42025 104217 86421 251625 303818 145751 276965 114074 61093 309717
17284 309717 235059 54395 -71660 438753 235329 496834 189589 376537 94002 216415
$$ packed form
17361b6926j60127d2186A22051b41753a09273A23942m2490J23961m6120A6821
17350B91500i5751D2751a61828A36925N6502p9565J41545n3968P348I5026Q7028
17339A82054j139O6800B2175Q6855j0739d443D91403n4206F7947J0199J95304
17328B73450M5794A51783M39990A87798a05910D40009I6862c3348D8586a01530
17317g5507A58250J83287A42631m1752B2661a26933B16267b5308P317B62807j29739
17306A33068h8303F9992N178L85859B29539a04426A98255j9861c1804o1621A58834
17294D15178d2025A04217j7796J65204N2193A45751J31214A14074n2981K48624
17284C09717p4658E4395g1660D38753k03424K61505A89589J86948I4002J22413
$$ plain form
17274 216415 304373 67434 -37407 -65581 102791 257656 137486 59806 140488 413880 201065
17262 -84925 451561 272613 208181 -71500 304980 160834 223353 -93627 88108 111638 146299
17251 146299 454451 332201 5806 159695 233211 414136 86693 297345 171282 306491
17241 306491 314618 252350 97174 211571 167728 224236 383279 19416 134120 370006 415362
17230 415362 93832 197822 107424 -71930 235755 465698 199177 357750 220676 179516
17220 179516 220121 64450 486682 27865 94877 179658 139739 211097 259305 138872 380533
17209 380533 216797 -32242 363301 318858 407648 47134 92836 470487 403426 7087 154362
17198 154362 444942 41990 70723 380643 9740 201259 194164 135092 209205 393382 267096
$$ packed form
17274B16415Q7958F7434c7407k8174A02791J54865j20170E9806Q0682K73392B01065
17262h4925D51561j78948o4432g1500C04980j44146O2519i3627H8108K3530L4661
17251A46299L08152j22250E806J53889P3516J80925H6693K10652j26063J35209
17241C06491Q127o2268I7174J14397m3843N6508J59043A9416J14704K35886M5356
17230D15362I3832J03990r0398g1930B35755K29943A99177J58573j37074m1160
17220A79516M0605F4450M22232B7865O7012Q4781l9919P1358M8208j20433K41661
17209C80533j63736c2242C63301m4443Q8790D7134M5702L77651o7061G087J47275
17198A54362K90580D1990K8733L09920I740J91519p095n9072P4113J84177j26286
$$ plain form
17187 267096 178554 43863 129742 462673 241792 192794 65404 287017 -59386 226966 139333
17176 139333 124425 239122 -43019 63884 297128 206355 133796 459440 -1081 146700 -20753
17164 414398 80803 168274 80138 210435 339768 506303 321403 248925 324552 133286
17153 184907 75472 301794 246115 300749 331955 310658 142766 434263 -39122 181996 349973
17142 349973 567942 496650 95442 -5464 232251 621605 261351 347680 159283 472753
17132 472753 452796 19920 -46500 367121 286410 356033 431944 385155 360770 400154 508864
17121 508864 326698 378550 232657 406763 155332 217375 435455 266411 464908 424766
17111 424766 518677 544246 328282 294115 402025 322786 141662 535532 567223 252203
$$ packed form
17187B67096q8542D3863Q5879L32931k20881m8998F5404K21613e9386B26966q7633
17176A39333j4908J14697d3019F3884K33244r0773p2559L25644a081A46700b0753
17164D14398H0803Q7471H0138J30297J29333J66535j84900p2478P5627A33286
17153A84907G5472K26322n5679N4634L1206k1297A42766K91497c9122A81996J67977
17142C49973K17969p1292I5442e464B32251L89354B61351Q6329A59283L13470
17132D72753j9957A9920d6500C67121q0711O9623P5911m6789k4385L9384J08710
17121E08864j82166N1852j45893J74106A55332O2043K18080j69044J98497m0142
17111D24766R3911K5569k15964l4167J07910p9239A41662L93870L1691B52203
$$ plain form
17100 150605 366705 256140 541963 490726 188447 376037 584140 422557 311607 243606
17090 243606 207146 361418 142663 392247 654370 393748 306876 732775 507386 548870
17080 548870 708209 82757 380103 317596 409161 353195 536051 433734 125901 717373
17070 717373 266313 583803 527795 369740 707143 480882 515416 398630 404446 479040
17060 479040 638856 199133 351658 524922 325491 768758 633990 339317 427953 397360
17050 397360 779937 529378 461288 923741 652702 646600 626770 579580 562569 391139 427577
17039 427577 892405 541505 320177 439257 653559 848778 456330 211074 627793 276277
17028 515359 848973 741386 649995 624735 558450 510693 659074 616123 625813 558828 738734
$$ packed form
17100A50605K16100j10565K85823n1237A88447J87590K08103j61583j10950o8001
17090B43606l6460J54272A42663K49584K62123k60622q6872M25899k25389M1484
17080E48870J59339H2757K97346o2507R1565n5966J82856j02317A25901N91472
17070G17373B66313L17490n6008j58055L37403k26261L4534j16786N816P4594
17060D79040J59816A99133J52525J73264j99431M43267j34768k94673Q8636l0593
17050C97360L82577k50559o8090M62453k71039o102j9830m7190j7011j71430L6438
17039D27577M64828l50900k21328J19080K14302J95219l92448B11074M16719B76277
17028E15359L33614j07587r1391k5260o6285m7757J48381m2951R690o6985J79906
$$ plain form
17017 738734 442835 1003385 463643 602911 666496 671225 304666 739185 855473 783416
17007 783416 891093 553967 446103 579248 812238 678064 969039 676848 1056366 792463
16997 792463 703253 886830 987751 566800 818968 855729 690779 791722 961361 782848
16987 782848 851497 854235 1046834 974671 840974 1003437 749881 846240 920994 546219 1017798
16976 1017798 1157121 1335260 655774 713791 943932 943429 935720 926716 845490 1094297 817243
16965 817243 798809 588793 747351 1022289 665792 1111509 1201787 1263598 1038784 995901
16955 995901 1210156 1100706 1190689 841474 884993 1042997 1002135 871506 898195 1266285
16945 1266285 1006680 994400 1102361 831816 1264835 983199 896162 1165424 1292332 849416
$$ packed form
17017G38734k95899N60550D63643J39268O3585M729C04666M34519J16288p2057
17007G83416J07677l37126j07864J33145K32990j34174K90975k92191L79518k63903
16997G92463q9210J83577J00921m20951K52168L6761j64950J00943J69639j78513
16987G82848O8649K738J92599p2163j33697J62463k53556R6359P4754l74775M71579
16976A017798J39323J78139F55774N8017K30141n03p709r004q1226K48807k77054
16965H17243j8434k10016J58558K74938l56497M45717R0278O1811k24814m2883
16955I95901K14255j09450Q9983l49215M3519J58004m0862j30629K6689L68090
16945A266285k59605j2280J07961k70545M33019k81636q7037K69262J26908m42916
$$ plain form
16935 849416 1425611 1099939 937220 1149704 1571407 1101074 1033831 1492898 1514360 1380832
16925 1380832 1539793 1360413 1085079 1098035 1618905 1260107 1468363 1499744 1500463 1226763
16915 1226763 1245033 1231350 1392916 1619471 1686842 1700643 1553508 1589642 1654391 1490982
16905 1490982 1669539 1731486 1678960 1668706 1782108 1315053 1731515 1634769 1734047 1965248
16895 1965248 1694388 1809485 2098160 2072925 1700498 2167656 1804686 1562599 1814586 1979304
16885 1979304 2222722 2080511 2234424 2333359 2282978 2219133 2290356 2137265 2424765 2323589
16875 2323589 2471155 2376782 2489320 2391710 2379574 2532743 2437139 2484144 2633352 2684579
16865 2684579 2403219 2564778 2721007 2784798 3019700 2799258 3023220 3007057 2922628 2950093
$$ packed form
16935H49416N76195l25672j62719K12484M21703m70333o7243M59067K1462j33528
16925A380832J58961j79380k75334J2956N20870l58798K08256L1381P19k73700
16915A226763J8270j3683J61566K26555O7371J3801j47135L6134O4749j63409
16905A490982J78557O1947n2526j0254J13402m67055M16462r6746R9278K31201
16895A965248k70860J15097K88675k5235l72427M67158l62970k42087K51987J64718
16885A979304K43418j42211J53913R8935n0381o3845P1223j53091K87500j01176
16875B323589J47566r4373J12538r7610j2136J53169r5604M7005J49208N1227
16865B684579k81360J61559J56229O3791K34902k20442K23962j6163q4429K7465
$$ plain form
16855 2950093 3076327 3113549 3162315 3124759 3417851 3336026 3375623 3597425 3114590 3448873
16845 3448873 3693163 3703351 3965539 3889587 3865852 3852332 4044298 4201381 4333017 4140432
16835 4140432 4303957 4077678 4396396 4638242 4569046 4425276 4775849 4588113 4536782 4749230
16825 4749230 5165650 5048271 5456417 5253969 5381650 5315786 5676287 5307895 6057943 6221187
16815 6221187 6236563 6345658 6146181 6563835 6331540 6519141 6443115 6981355 7062194 7219069
16805 7219069 7187372 7750985 7931491 8120063 8140758 8362667 8726284 8872326 9026194 9141602
16795 9141602 9372295 9652297 9748367 10498443 10775327 10654295 11435054 11134602 11776130 12085132
16785 12085132 11979984 12560280 13199689 13318925 13728302 14181152 14842469 15223022 15628505
$$ packed form
16855B950093J26234L7222M8766l7556K93092q1825L9597K21802m82835L34283
16845C448873K44290J0188K62188p5952k3735j3520J91966J57083J31636j92585
16835D140432J63525k26279L18718K41846o9196j43770L50573j87736n1331K12448
16825D749230M16420j17379M08146k02448J27681o5864L60501l68392P50048J63244
16815F221187J5376J09095j99477M17654k32295J87601p6026N38240Q0839J56875
16805G219069l1697N63613J80506J88572K0695K21909L63617J46042J53868J15408
16795I141602K30693K80002R6070P50076K76884j21032P80759l00452O41528L09002
16785A2085132j05148N80296O39409J19236M09377M52850O61317L80553M05483
$$ plain form
16776 15628505 16342345 16714118 17206106 18130451 18901515 19077408 19867181 20622681 21120193
16767 21120193 22229473 22876712 23758269 24942862 25731733 27112518 27940525 29150758 30303264
16758 30303264 31765100 33311198 34655579 36454492 38306805 40049226 42208777 43965671
16750 43965671 46430903 48824700 51637619 54371158 56781887 60760280 63868047 67454561
16742 67454561 71355353 75904864 80393002 85017956 90573396 96191319 102124958 108729481
16734 108729481 115217089 122031994 129768122 137244493 144992344 152904134 161026788 168721846
16726 168721846 175976505 182966205 189025137 194297868 198731233 201292419 202965980 202712574
16718 202712574 201695710 198912262 195336042 189765139 183584571 176744097 169241750 161501297
$$ packed form
16776A5628505P13840L71773M91988R24345P71064J75893P89773P55500M97512
16767B1120193J109280O47239Q81557J184593P88871J380785Q28007J210233J152506
16758C0303264J461836J546098J344381J798913J852313J742421K159551J756894
16750D3965671K465232K393797K812919K733539K410729L978393L107767L586514
16742F7454561L900792M549511M488138M624954N555440N617923N933639O604523
16734A08729481O487608O814905P736128P476371P747851P911790Q122654P695058
16726A68721846P254659O989700O058932N272731M433365K561186J673561k53406
16718B02712574j016864k783448l576220n570903o180568o840474p502347p740453
$$ plain form
16710 161501297 153340412 145620539 137459367 129737389 121897517 114825411 107919920 101474744
16702 101474744 95548261 89471670 83968429 79381762 74787866 70272700 66487781 62467439
16694 62467439 58950808 55802446 52742184 49809698 47337301 44900839 42711848 40788791
16686 40788791 38495379 36793231 34866693 33361319 32090835 30227313 29266811 27761579
16678 27761579 26489113 25433788 24569228 23716941 22752171 22041640 20847676 20284917 19096164
16669 19096164 18542120 18200160 17479067 16850097 16100458 15510160 15150190 14569945 14066001
16660 14066001 13463119 13180047 12669465 12572591 12119690 11907866 11191687 11094752 10666960 10532962
16650 10532962 10234494 10046163 9574732 9518495 9046379 9052612 8593299 8293500 8350807 8138667
$$ packed form
16710A61501297q160885p719873q161172p721978p839872p072106o905491o445176
16702A01474744n926483o076591n503241m586667m593896m515166l784919m020342
16694F2467439l516631l148362l060262k932486k472397k436462k188991j923057
16686D0788791k293412j702148j926538j505374j270484j863522r60502j505232
16678B7761579j272466j055325q64560q52287r64770p10531j193964n62759j188753
16669A9096164n54044l41960p21093o28970p49639n90298l59970n80245n03944
16660A4066001o02882k83072n10582r6874m52901k11824p16179r6935m27792j33998
16650A0532962k98468j88331m71431n6237m72116O233m59313k99799N7307k12140
$$ plain form
16640 8138667 8019873 7680298 7356580 6988824 7140210 6792856 6979222 6315439 6446932
16631 6446932 5979662 5882639 6151179 5695907 5873280 5553092 5525719 5001948 5514253 5143165
16621 5143165 5160183 4712660 5017321 4527531 4695290 4677503 4516386 4253805 4292989 4247976
16611 4247976 4162280 4141201 3803785 4024442 3910180 3663033 3572130 3631271 3178802 3526603
16601 3526603 3255650 3125315 3266342 3594424 3339477 2893717 3165141 3160009 2909345 2911555
16591 2911555 2773965 2705243 2642951 2833682 2916109 2465858 2455795 2808738 2363832 2461648
16581 2461648 2566981 2465857 2348846 2211312 2250579 2327314 2580928 2181790 2224492 2362513
16571 2362513 1707958 1904816 2044982 2195527 1984516 1878983 2130141 1882336 1829365 2045347
$$ packed form
16640H138667j18794l39575l23718l67756J51386l47354J86366o63783J31493
16631F446932m67270r7023K68540m55272J77373l20188k7373n23771N12305l71088
16621E143165J7018m47523L04661m89790J67759j7787j61117k62581L9184m5013
16611D247976q5696k1079l37416K20657j14262k47147r0903N9141m52469L47801
16601C526603k70953j30335J41027L28082k54947m45760K71424n132k50664K210
16591B911555j37590o8722o2292J90731Q2427m50251j0063L52943m44906R7816
16581B461648J05333j01124j17011j37534L9267P6735K53614l99138M2702J38021
16571B362513o54555J96858J40166J50545k11011j05533K51158k47805n2971K15982
$$ plain form
16561 2045347 1469781 1954498 1734393 1767647 2289396 2047002 1530573 1581802 1592232 1600398
16551 1600398 1819070 1856966 1794641 1641518 1515021 1439196 1672824 1403756 1489346 1499802
16541 1499802 1383865 1606566 1492824 1481189 1308486 1181164 1486838 1272830 1508571 1240951
16531 1240951 1438294 1439731 1311363 1238005 1207596 1092309 1233841 1089933 969888 1246150
16521 1246150 1377956 1584394 1049365 876176 897120 1014315 1252110 1022122 1334522 1052362
16511 1052362 1121209 1257877 1151431 1245763 1212224 883692 1021485 1003169 958307 1081462
16501 1081462 1168822 1045414 874278 1277423 1102511 657277 975050 709697 863956 686317
16491 686317 1169745 869084 721131 583169 1069699 862360 721893 504536 756483 819522
$$ packed form
16561B045347n75566M84717k20105L3254N21749k42394n16429N1229J0430Q166
16551A600398K18672L7896o2325j53123j26497p5825K33628k69068Q5590J0456
16541A499802j15937K22701j13742j1635j72703j27322L05674k14008K35741k67620
16531A240951J97343J437j28368p3358l0409j15287J41532j43908j20045K76262
16521A246150J31806K06438n35029j73189K0944J17195K37795k29988L12400k82160
16511A052362O8847J36668j06446R4332l3539l28532J37793j8316m4862J23155
16501A081462Q7360j23408j71136M03145j74912m45234L17773k65353J54259j77639
16491F86317M83428l00661j47953j37962M86530k07339j40467k17357K51947O3039
$$ plain form
16481 819522 350488 1056686 770757 728557 481988 760406 750722 797735 1004014 404382
16470 559493 884722 382745 731944 892368 660939 555909 612138 737482 234878 524590
16460 524590 830507 554284 646294 755425 521516 400974 686348 415733 372596 852559
16450 852559 513168 769122 463797 472495 731432 299232 485584 511558 151688 449584
16440 449584 495920 309716 898213 202150 422476 676351 466876 269391 456289 584030
16430 584030 668130 645040 523534 768263 421101 192888 299395 366832 372244 559957
16420 559957 235257 436572 248122 455933 370778 651313 532362 493847 190688 261588
16410 261588 483734 287980 709168 644323 364292 405942 704859 389708 347227 178115
$$ packed form
16481H19522C50488P06198k85929m2200k46569K78418r684M7013K06279D04382
16470E59493L25229C82745L49199J60424k31429j05030N6229J25344B34878K89712
16460E24590L05917k76223R2010J09131k33909j20542K85374k70615m3137M79963
16450H52559l39391K55954l05325Q698K58937B99232J86352K5974A51688K97896
16440D49584M6336j86204N88497B02150K20326K53875k09475j97485J86898J27741
16430E84030Q4100k3090j21506K44729l47162A92888J06507O7437N412J87713
16420E59957B35257K01315j88450K07811q5155K80535j18951l8515A90688P0900
16410B61588K22146j95754M21188o4845k80031M1650K98917l15151m2481j69112
$$ plain form
16400 178115 122678 608482 316644 270095 418033 396451 345290 458650 210662 321211
16390 321211 178334 614926 498730 282844 456937 445944 260217 102212 504368 570556
16380 570556 -69831 65535 254007 451196 363886 244418 564785 173705 357614 428486
16370 428486 399542 478733 157943 272731 200439 139943 559577 487085 251091 84869 306143
16359 306143 4015 164087 345163 203031 274904 474597 226622 292340 255931 324716 168959
16348 168959 396471 447099 262139 126167 309712 189564 161162 381885 414829 395817
16338 395817 254527 216184 -50930 267743 346561 181321 345099 71515 263480 501944
16328 501944 188025 270228 97592 266178 22065 38247 192981 -21179 -102681 359603 88619
$$ packed form
16400A78115n5437M85804k91838m6549J47938k1582n1161J13360B10662J10549
16390C21211j42877M36592j16196k15886J74093j0993j85727A02212M02156O6188
16380E70556f9831F5535J88472J97189q7310j19468L20367A73705J83909P0872
16370D28486k8944P9191A57943J14788p2292o0496M19634p2492k35994H4869K21274
16359C06143D015J60072J81076j42132P1873J99693B26622O5718l6409O8785j55757
16348A68959K27512N0628j84960A26167J83545j20148k8402K20723L2944j9012
16338C95817j41290l8343e0930B67743P8818j65240J63778G1515J91965K38464
16328E01944A88025Q2203I7592J68586B2065J6182J54734b1179q1502C59603H8619
$$ plain form
16316 125690 144244 71127 478142 90477 178131 -63197 34897 234625 318814 -153182 471039
16304 -246364 -91762 151476 -30039 -107826 401901 376996 271885 92862 -47196 217813 107822
16292 291612 178334 -145937 431129 43263 143671 37903 386464 16240 115828 224206
16282 224206 266858 -274249 314855 84566 136096 95031 -133739 377015 121875 253535
16272 253535 29549 22349 55896 255189 209339 199472 202943 478663 6245 380506 203968
16261 203968 140309 147771 324500 11767 -10592 327700 46741 289397 61836 44099 179688
16250 179688 -79071 52391 403141 -105160 238613 20509 124879 -18303 755118 16050
16239 109913 128682 -139284 -3576 219183 308852 242054 377237 86888 216009 176676 304258
$$ packed form
16316A25690J8554G1127M07015I0477Q7654f3197C4897J99728Q4189a53182D71039
16304b46364i1762A51476c0039p7787D01901k4905j05111I2862d7196B17813A07822
16292B91612j13278a45937D31129D3263J00408C7903L48561A6240R9588J08378
16282B24206M2652b74249C14855H4566N1530m1065a33739C77015A21875J31660
16272B53535B9549p200L3547J99293m5850r867L471K75720F245L74261j76538
16261B03968o3659P462J76729A1767a0592C27700D6741K42656F1836j7737J35589
16250A79688g9071E2391L50750a05160B38613B0509J04370a8303G55118A6050
16239A09913J8769a39284c576B19183Q9669o6798J35183H6888J29121l9333J27582
$$ plain form
16228 304258 -168290 72221 -218126 147674 8787 8066 274630 -102745 66493 54173 162010
16217 162010 -54070 145451 24487 23748 91261 -104209 -14356 283274 -62154 206063 6555
16205 59960 -196727 208638 301436 -89774 98893 -63325 658423 -51752 148235 -64258 154955
16193 311707 107111 157256 -16203 481450 210 272692 116458 227818 236953 -37057 210952
16181 257488 -188394 63133 187376 -106827 301967 -323137 145059 -206441 361598 63992
16170 92400 -116256 34740 -35723 30774 -328535 127683 526694 62203 -234448 -34874 15860
16158 -84901 592 143802 -18355 -250126 90920 -120047 -250333 27809 55322 -281756 70407
16146 18397 -11081 -22938 247895 -178898 279922 118668 -154087 47240 -32043 90469 270455
$$ packed form
16228C04258a68290G2221b18126A47674H787p21K66564a02745F6493j2320J07837
16217A62010e4070A45451B4487p39O7513a04209a4356B83274f2154B06063F555
16205E9960a96727B08638R2798h9774I8893f3325F58423e1752A48235f4258A54955
16193C11707A07111N0145a6203D81450B10K72482A16458J11360R135c7057B10952
16181B57488a88394F3133J24243a06827C01967c23137A45059b06441C61598F3992
16170I2400a16256C4740c5723C0774c28535A27683L99011F2203b34448c4874A5860
16158h4901E92J43210a8355k31771I0920a20047j30286B7809K7513b81756G0407
16146A8397a1081j1857B47895a78898B79922A18668a54087D7240c2043I0469J79986
$$ plain form
16135 270455 -104061 -131379 -54537 -63038 -59188 -116811 90017 -45047 -52662 -108910 18556 -266732
16122 253746 -33030 -95471 86743 153966 37787 2295 37878 -90943 -260340 43795 -85111
16110 415013 11553 -79652 -240033 415913 108874 -334594 82126 228330 67724 -155596
16099 315312 189404 349662 8295 76194 200496 106760 -135316 -3198 -97323 33599 129063
16088 129063 -22456 -137725 21451 306173 148580 -110228 -53307 -6462 -252680 160967
16077 -43669 -273853 211812 33646 -183580 -121542 -34873 -159657 62668 6618 -97879 358944
16065 116012 -44198 -171942 -12228 97502 -243532 -195397 -171702 110139 182522 -59232 34486
16053 -38804 -174710 -31158 -245139 -249498 86170 -3185 -150543 -131908 -143526 72423 -40134
$$ packed form
16135B70455a04061k7318e4537q501L850n7623I0017d5047p615n6248A8556b66732
16122B53746c3030o2441H6743O7223C7787B295L5583i0943j69397D3795h5111
16110D15013A1553g9652j60381D15913A08874c34594H2126J46204F7724a55596
16099C15312j25908J60258H295O7899J24302r3736a35316c198r4125C3599R5464
16088A29063b2456j15269B1451K84722A48580a10228e3307f462k46218A60967
16077d3669k30184B11812C3646a83580O2038c4873j24784F2668F618i7879C58944
16065A16012d4198j27744a2228I7502b43532M8135K3695A10139P2383e9232C4486
16053c8804j35906c1158k13981m359H6170c185j47358J8635j1618G2423d0134
$$ plain form
16041 -54625 100122 -222764 -146458 -204351 151626 -177556 4421 131381 -313053 -351684 -381328
16030 -381328 62715 115750 17433 67731 20037 201369 95634 -485098 129495 249003 -234184
16018 -33039 187466 118117 -81671 175306 -88987 325599 -219575 75535 -34176 -328189 -282869
16007 -282869 52336 -171054 8603 -106371 247483 -104482 102802 -502450 114670 -497834
15996 -39340 -239010 -258997 -328785 -71154 -192331 -114046 91038 -108078 127477 -31706 282907
15984 -27315 298491 46137 54512 166636 425785 130528 267086 157412 39564 -347844
15973 301950 192396 54843 215389 -129946 -61200 185649 -44789 20083 95009 -162227
15962 -97246 65015 -197254 27537 -124324 5871 59800 -316209 30134 123399 238655 67637
$$ packed form
16041e4625A00122b22764P6306n7893A51626a77556D421J26960c13053l8631k9644
16030c81328F2715N3035A7433N0298B0037J81332I5634d85098A29495J19508b34184
16018c3039A87466o9349h1671A75306h8987C25599b19575G5535c4176k94013M5320
16007b82869E2336a71054H603a06371B47483a04482A02802e02450A14670d97834
15996c9340j99670j9987o9788g1154j21177P8285I1038a08078A27477c1706B82907
15984b7315B98491D6137Q375J12124K59149A30528J36558j09674C9564c47844
15973C01950j09554E4843J60546a29946f1200A85649d4789B0083P4926a62227
15962i7246F5015a97254B7537a24324E871N3929c16209C0134R3265J15256F7637
$$ plain form
15950 14337 -213038 -9074 -207460 127449 -233766 6886 -220409 80354 27844 -105451 -45155
15938 -262749 37194 -67305 -210934 -223411 -472548 -172974 -163441 -65113 -348691 -97391 151770
15926 -209603 -17944 -118059 -173492 82977 -60398 -105595 -201191 378985 -274047 -165186 -38995
15914 -271669 145762 169384 -85701 -298205 104897 -125194 163051 77936 -353794 216304
15903 228793 -149500 128359 463819 -134648 -45462 46469 -200118 241473 66593 -143358
15892 -34983 -205541 -54721 -120456 -199473 -121420 65531 -68668 -127531 32633 -243341 -20722
15880 -57942 95808 91579 334068 175899 -10372 -90016 -169585 -61390 234119 -40179 -309704
15869 -309704 -416247 74882 -34815 -62323 -429934 -208089 79946 -269437 121165 -104878
$$ packed form
15950A4337b13038i074j98386A27449b33766F886b20409H0354B7844a05451d5155
15938b62749C7194f7305j43629j2477k49137a72974R533f5113k83578i7391A51770
15926b09603a7944j00115n5433H2977f0398m5197r5596C78985b74047J08861c8995
15914b71669A45762K3622h5701k12504A04897a25194A63051G7936c53794B16304
15903B28793a49500A28359L35460a34648d5462D6469b00118B41473F6593a43358
15892c4983j70558e4721o5735p9017P8053F5531f8668n8863C2633b43341b0722
15880e7942I5808m229K42489j58169a0372p9644p9569f1390B34119d0179k69525
15869c09704j06543G4882c4815k7508l67611b08089G9946b69437A21165a04878
$$ plain form
15858 -122596 -92627 -145827 -133134 178153 274374 -35802 229234 43612 -180070 -134676 53961
15846 81243 -92722 166805 326122 -320983 -162325 118191 93760 172307 -455986 -61842
15835 -20942 -74691 4863 155731 -126586 130954 -124654 -111937 355519 -217639 36520 107153
15824 107153 110198 46259 33247 84389 146238 -254044 -289530 -30433 -5215 -114678 -190732
15813 -190732 136194 75695 -245843 -147896 -320150 -155631 8499 -233529 48041 53202 -386560
15801 14880 120726 319286 236494 -87060 -147694 -469579 -175492 56689 -123311 -304738
15791 -304738 36279 103555 54804 -178100 8758 -161904 -65535 -170917 124290 -198471 113450
15779 30685 1275 137462 -36599 -62885 135460 337098 -152076 -62652 1697 -191648 -65282
$$ packed form
15858a22596K9969n3200J2693A78153R6221c5802B29234D3612a80070M5394E3961
15846H1243i2722A66805J59317c20983J58658A18191k4431P8547d55986f1842
15835b0942n3749D863J50868a26586A30954a24654J2717C55519b17639C6520P0633
15824A07153L045D6259j3012N1142O1849b54044l5486c0433e215j09463p6054
15813a90732A36194o0499b45843R7947j72254a55631H499b33529D8041N161c86560
15801A4880J05846J98560q2792h7060o0634l21885a75492E6689a23311j81427
15791c04738C6279O7276m8751a78100H758a61904f5535j05382A24290a98471A13450
15779C0685A275J36187c6599k6286A35460K01638a52076f2652A697a91648f5282
$$ plain form
15767 -123657 60193 -15639 -70856 74478 122549 182012 -602156 -9440 320672 121965 3827
15755 271131 -124376 163441 433399 196223 -268923 14138 154032 -59447 106270 50791
15744 8066 37728 335642 -18377 -234072 166737 18161 -190561 -251256 -166983 -52417 -198565
15733 -198565 -155688 -93752 302899 -118604 223986 -238876 93624 -57324 96913 -135176
15722 -157623 -64650 -16857 -250603 34759 239221 333750 15943 -192131 -132577 -75225 180961
15710 17659 26704 5126 8414 -265311 -167135 -70813 -339707 -101495 117282 -25300 -19771 -204070
15698 -204070 57680 -83526 139113 -127924 89061 252654 230392 -92266 138067 -342633
15687 -66561 -565554 -40190 -92087 -49687 -246806 -73651 -87517 -289994 -70038 -109049 -191874
$$ packed form
15767a23657F0193a5639n5217G4478M8071N9463f02156i440C20672A21965C827
15755B71131a24376A63441K69958A96223b68923A4138J39894e9447A06270E0791
15744H066K9662K97914a8377k15695A66737A8161a90561o0695Q4273e2417j46148
15733a98565M2877O1936C02899a18604B23986b38876I3624e7324I6913a35176
15722a57623f4650a6857k33746C4759K04462R4529A5943a92131N9554N7352A80961
15710A7659R045E126L288b65311R8176g0813k68894a01495A17282b5300N529j84299
15698b04070E7680h3526A39113a27924H9061J63593k2262i2266A38067c42633
15687f6561m98993d0190n1897M2400j97119g3651j3866k02477g0038l9011q2825
$$ plain form
15676 -191874 9353 -313843 -29211 -22891 164303 78185 323115 197546 -815 -47276 280285
15664 -96944 -562668 16687 27697 287820 -308053 -211190 187089 35335 119640 217242 -150705
15652 14183 -87936 115250 -119256 198777 -141853 157282 -61183 -155826 83983 -154894
15641 -128565 180956 -21214 -341456 50055 -140322 183119 -4952 -233412 -60883 -76798 -136063
15630 -136063 -31279 -193200 11661 80016 220816 205791 -73604 118217 186087 59701 -35308
15618 -111275 63991 -330175 -133939 248703 -192396 248268 -6325 -123448 132399 248873
15608 248873 -15920 61909 -29948 -21714 -29049 70191 -152555 239517 43060 -66951 153949
15596 187140 13025 -134268 256978 72275 284443 110626 -283926 330401 -234172 -193297
$$ packed form
15676a91874I353c13843b9211O320A64303G8185K44930j25569h15m6461B80285
15664i6944m65724A6687J1010K60123c08053R6863A87089C5335Q4305R7602a50705
15652A4183h7936A15250a19256A98777a41853A57282f1183r4643H3983a54894
15641a28565A80956b1214l20242E0055a40322A83119d952k28460f0883j5915n9265
15630a36063c1279j61921A1661O8355J40800j5025g3604A18217O7870E9701c5308
15618a11275F3991c30175a33939B48703a92396B48268f325j17123A32399J16474
15608B48873a5920F1909b9948Q234p335G0191a52555B39517D3060f6951A53949
15596A87140A3025a34268B56978G2275K12168A10626b83926C30401b34172M0875
$$ plain form
15586 -193297 111109 -135657 140852 69918 -306571 34177 98952 373303 97957 55426
15576 55426 21588 -134320 -93341 161924 26470 199475 -158439 48347 -63459 -45349 36617
15564 29760 -77504 -196769 116146 7586 117113 17771 63229 86049 98887 -91446 146416
15552 -97991 -93540 159433 -157780 -175002 -149935 -243471 215327 10479 -132652 151430 51413
15540 -124725 168677 -114904 -271318 -168998 194866 5308 73236 -206734 35849 155394
15530 155394 97420 -209189 -49257 12400 -327114 153271 -8947 85733 78958 -63813 -214004
15519 -214004 -462388 -12210 -162232 67768 72795 -59211 209049 283865 51176 362102 182787
15508 182787 -198688 -246805 -341512 157627 -245497 -226605 122702 -304672 227116 197376
$$ packed form
15586a93297A11109a35657A40852F9918c06571C4177O4775K74351I7957m2531
15576E5426B1588a34320M0979A61924B6470J73005a58439D8347f3459J8110C6617
15564B9760g7504j19265A16146G586J09527A7771M5458K2820J2838i1446A46416
15552i7991M451A59433a57780j7222K5067r3536B15327A0479a32652A51430E1413
15540a24725A68677a14904j56414J02320A94866E308O7928b06734C5849J19545
15530A55394n7974b09189d9257A2400c27114A53271h947H5733o775f3813j50191
15519b14004k48384a2210j50022F7768N027e9211B09049P4816E1176L10926j79315
15508A82787a98688m8117r4707A57627b45497J8892A22702c04672B27116k9740
$$ plain form
15498 197376 180385 92237 -104299 -10150 -2240 97570 -72429 -105606 41059 175855 -41453
15486 -105069 -245368 180097 18454 -408949 -32644 -440147 176555 -93345 135686 48661
15475 237081 -58384 -54598 55546 -171603 69771 -417552 -87187 -56129 21333 -10568 305502
15463 -57347 57845 67833 259957 130672 -51122 -21402 65402 -121066 36680 455961 27892
15451 100739 -14221 -294578 201450 -111625 35728 185078 -414779 117933 -37744 8097
15440 34566 -188097 -19240 -252385 61052 -148471 52233 207786 -85718 -51443 -53269 -51553
15429 -51553 163607 2527 60130 324525 206629 73740 -108450 -35056 -6966 -147209 -84345
15418 -84345 -139238 -11804 56290 -126431 -123172 55106 -222462 -86738 91216 -4772 68211 132618
$$ packed form
15498A97376j6991q8148a04299a0150b240I7570g2429l3177D1059J34796d1453
15486a05069j40299A80097A8454d08949c2644m07503A76555i3345A35686D8661
15475B37081e8384L786E5546a71603F9771d17552h7187L1058B1333a0568C05502
15463e7347E7845R988J92124j29285e1122b1402F5402a21066C6680M19281B7892
15451A00739a4221k80357B01450a11625C5728J49350d14779A17933c7744H097
15440C4566a88097a9240k33145F1052a48471E2233J55553h5718L4275j826J716
15429e1553A63607B527N7603K64395j17896G3740a08450c5056f966j40243O2864
15418h4345n4893a1804E6290a26431L259E5106b22462h6738I1216d772F8211O4407
$$ plain form
15406 132618 111308 102036 172829 -207764 -175206 24327 209568 133724 152177 168890 -33045
15394 42947 -164390 28055 -22195 64258 69503 324178 -180132 126168 202140 119457 -215576
15382 -235553 -13997 186072 261929 22046 -221637 33865 109831 132842 -112935 159855 110631
15371 110631 53140 35326 83037 -189393 208519 19801 20505 -75893 -88318 72170 78679 173543
15359 173543 155633 -24043 -4187 -22826 -60576 19869 264130 -37498 92488 105600 -7547 -9874
15347 -9874 15138 361698 143549 -125502 64260 237534 62459 -119249 173890 74365 -137058
15335 25051 64760 -183942 136403 218509 30099 175877 -151764 388808 30638 -135847
15324 -26551 101829 -59101 -164 -85412 231255 85483 125107 187687 151981 153280 -299107 -120737
$$ packed form
15406A32618k1310r272P0793b07764L2558B4327J85241p5844J8453J6713c3045
15394D2947a64390B8055b2195F4258N245K54675a80132A26168P5972q2683b15576
15382b35553a3997A86072P5857B2046b21637C3865P5966K3011a12935A59855m9224
15371A10631E3140j7814M7711a89393B08519A9801P04g5893j2425G2170O509R4864
15359A73543j7910b4043d187j8639l7750A9869K44261c7498I2488J3112g547k327
15347i874A5138L46560A43549a25502F4260J73274F2459a19249A73890G4365a37058
15335B5051L9709a83942A36403Q2106C0099J45778a51764C88808C0638a35847
15324b6551A01829e9101a64q5248B31255H5483L9624O2580l5706J299b99107a20737
$$ plain form
15311 -50116 -69242 140109 -22152 447990 217800 286016 -200177 77031 -91511 101520 -91082
15299 326285 187603 -368838 -130816 -122691 -138976 60644 75113 154934 -241188 123966 60870
15287 -90161 114690 104485 5716 67437 -93692 -30090 -68615 -21535 -114023 213616 -114274
15275 228572 238062 -104844 -54065 26878 36809 107647 18809 -30832 117698 219880 -299807
15263 -192989 188471 107256 226015 -147749 -166629 133601 -55544 106069 128801 120470 14531
15251 43322 7946 -53820 192114 445903 1630803 1118529 1151394 1264326 609621 176475
15240 282592 56669 -189607 185456 104338 39484 17135 80967 -240290 -174168 102138 15020
15228 84654 -110472 183858 245925 129183 316119 81998 -129425 23715 64553 171750
$$ packed form
15311e0116j9126A40109b2152D47990B17800O8216b00177G7031i1511A01520i1082
15299C26285j38682c68838a30816Q125j6285F0644J4469P9821b41188A23966F0870
15287i0161A14690j0205E716O1721i3692c0090l8525b1535r2488B13616a14274
15275B28572R490a04844N0779B6878R931P0838A8809c0832A17698J02182b99807
15263a92989A88471q1215J18759a47749j8880A33601e5544A06069K2732q331A4531
15251D3322G946e3820A92114K53789J184900n12274L2865J12932F09621A76475
15240B82592E6669a89607A85456q1118C9484A7135O3832b40290O6122A02138A5020
15228H4654a10472A83858O2067j16742J86936H1998a29425B3715M0838J07197
$$ plain form
15218 171750 119615 347959 168597 -195912 28855 33004 -111634 34280 199091 242028 -361256
15206 -296661 122570 -244092 201490 466910 104745 142991 225094 -45514 283193 177929
15196 177929 108246 260728 346559 32567 169257 25478 21546 208244 190850 259519 268018
15185 268018 234363 377847 -107075 21330 -161084 242633 -196238 291163 38964 -28778
15174 -194011 318236 114702 32058 116222 175314 139264 441301 -5066 -345546 -104528 51476
15162 -96068 285249 80601 -29042 139693 119892 236963 -116855 407273 320042 274047 402786
15151 402786 255711 -13456 322247 239860 63831 -8577 111658 61592 217093 141422 -360284
15139 56809 281164 -19076 -240038 173234 280876 79374 -78549 394566 -159812 71999
$$ packed form
15218A71750n2135K28344A68597a95912B8855M149a11634C4280J64811M2937c61256
15206b96661A22570b44092B01490K65420A04745L8246Q2103d5514B83193j05264
15196A77929o9683J52482Q5831C2567J36690B5478l932J86698j7394O8669Q499
15185B68018l3655J43484a07075B1330a61084B42633a96238B91163C8964b8778
15174a94011C18236A14702C2058Q4164N9092l6050L02037e066l40480a04528E1476
15162i6068B85249H0601b9042A39693j9801J17071a16855D07273q7231m5995J28739
15151D02786j47075a3456C22247q2387F3831h577A11658n0066J55501p5671c60284
15139E6809K24355a9076k20962A73234J07642G9374g8549C94566a59812G1999
$$ plain form
15128 244878 163380 15641 471620 321052 51417 15891 315157 97339 195524 377602 368730
15117 368730 340451 36039 139927 1554 380874 -11140 148368 488630 6025 215927 157737
15106 157737 66388 -50178 -6964 -25618 78376 167052 409679 114514 126657 124087 -51469
15094 344342 63644 123735 52670 177018 294355 269313 84358 213002 155460 141669 322751
15083 322751 -54352 -135391 328717 266631 -80261 158733 143689 417497 216352 265841 66932
15071 -34133 174670 142014 309604 -48944 121917 187036 103174 -37242 291028 230969 -14622
15059 228115 -42517 181182 -208407 294002 214329 169524 276580 113227 206902 320923
15049 320923 25679 306247 300620 -23154 73443 213418 -13715 240277 194628 -86471 226502
$$ packed form
15128B44878q1498A5641M55979j50568E1417A5891K99266I7339R8185J82078q872
15117C68730k8279C6039J03888A554L79320a1140A48368L40262F025K09902n8190
15106A57737F6388e0178f964j8654G8376Q8676K42627A14514J2143k570e1469
15094C44342F3644O0091E2670J24348J17337k5042H4358J28644n7542j3791J81082
15083C22751e4352q1039C28717o2086h0261A58733j5044K73808k01145M9489F6932
15071c4133A74670l2656J67590d8944A21917O5119q3862c7242B91028o0059a4622
15059B28115d2517A81182b08407B94002p9673m4805J07056A13227R3675J14021
15049C20923B5679K80568n627b3154G3443J39975a3715B40277m5649h6471B26502
$$ plain form
15037 108643 341245 382942 202815 -126938 285480 208136 272125 668443 34173 -57321
15026 28260 298220 77810 123780 357028 201268 27553 422551 323765 210244 351432
15016 351432 154583 70065 118646 -42107 -89875 242552 125353 -26220 337840 240626 -64656
15004 104819 243612 -113479 26569 -102299 411788 379536 362984 -59386 125416 162419
14994 162419 -22676 243173 64913 228908 247747 136400 225943 359177 335643 263255 327418
14983 327418 -135499 72341 222016 456832 496169 69395 368700 122308 253533 94363
14972 251467 401108 263851 156210 319200 405233 161611 529449 329097 421889 159678
14961 342661 248902 102356 287633 373824 452887 546754 207108 578570 594491 164887
$$ packed form
15037A08643K32602M1697j80127a26938B85480p7344O3989L96318C4173e7321
15026B8260K69960G7810M5970K33248j55760B7553L94998r8786j13521J41188
15016C51432A54583G0065M8581d2107m7768B42552j17199b6220C37840r7214f4656
15004A04819J38793a13479B6569a02299D11788l2252j6552e9386A25416L7003
14994A62419b2676B43173F4913J63995J8839j11347Q9543J33234k3534p2388O4163
14983C27418a35499G2341J49675K34816L9337F9395K99305A22308J31225I4363
14972B51467J49641j37257j07641J62990Q6033A61611L67838k00352R2792A59678
14961C42661r3759A02356J85277Q6191P9063R3867B07108L71462J5921A64887
$$ plain form
14950 119369 -29178 142961 131686 189884 463406 478187 222516 -99196 423478 274888
14940 274888 306596 267077 421115 114262 325402 401503 299882 364208 344472 472589
14930 472589 455563 496299 428199 441953 114492 -39079 267890 460829 470717 505489 226236
14918 240916 204191 -21420 470412 406775 192920 299696 282343 221619 253975 338274 430102
14907 430102 439321 636879 -227076 537693 -27498 587182 229232 248720 320702 25033 363988
14896 363988 46622 237219 397346 517114 449541 95687 313147 300289 438957 180740
14885 617130 440959 791792 283031 232096 520014 300033 344315 280387 509240 258097
14875 258097 342635 399404 449546 127632 528874 337996 689216 446559 418128 217872
$$ packed form
14950A19369b9178A42961j1275N8198K73522J4781B22516i9196D23478j48590
14940B74888L1708l9519J54038A14262K11140P6101j01621O4326j9736J28117
14930D72589j7026M0736o8100J3754A14492c9079B67890J92939R888L4772B26236
14918B40916l6725b1420D70412o3637A92920J06776j7353o0724L2356Q4299R1828
14907D30102R219J97558b27076E37693b7498E87182B29232J9488P1982B5033L38955
14896C63988D6622J90597J60127J19768o7573I5687K17460j2858J38668A80740
14885F17130j76171L50833B83031n0935K87918k19981M4282o3928K28853k51143
14875B58097Q4538N6769N0142A27632M01242j90878L51220k42657k8431k00256
$$ plain form
14865 217872 474603 299755 437388 386080 252516 371662 371886 194379 399554 534293
14855 534293 279362 368108 482254 419511 830906 445447 560175 363879 159800 90796
14845 90796 344266 358037 568145 302831 317218 457988 454474 425549 484254 478792 554292
14834 554292 320933 440886 731593 459923 354230 482997 382728 575591 573298 252580
14823 239733 515546 606270 61528 518896 633199 484227 331949 575930 485777 348103
14813 348103 475904 962765 433326 604665 553394 456366 757475 642160 508896 587063
14803 587063 422084 558813 740532 473494 326437 503494 391463 719044 568242 514219
14793 514219 437746 627261 244378 367048 497728 498314 493904 874301 875149 437743 589423
$$ packed form
14865B17872K56731j74848J37633n1308j33564J19146K24j77507K05175J34739
14855E34293k54931Q8746J14146o2743M11395l85459J14728j96296A59800o9004
14845I0796K53470J3771K10108k65314J4387J40770l514k8925N8705n462P5500
14834E54292k33359J19953K90707k71670j05693J28767j00269J92863k293B52580
14823B39733K75813R0724F1528M57368J14303j48972j52278K43981r0153j37674
14813C48103J27801M86861D33326J71339n1271r7028L01109j15315j33264P8167
14803E87063j64979J36729J81719k67038j47057J77057j12031L27581j50802n4023
14793E14219p6473J89515B44378J22670J30680N86m410L80397Q48m37406J51680
$$ plain form
14782 589423 419840 352499 535908 582197 412729 891225 515379 488071 551397 721222
14772 721222 734149 723034 813213 852948 839039 550635 675280 596468 477588 586356 651031
14761 651031 407716 736498 746211 572117 775242 714615 534097 1043627 528897 805586
14751 805586 856422 716915 552598 604236 497147 177134 996202 876004 1047378 768387
14741 768387 593659 1021122 613004 713041 1111643 1166557 780818 1057233 550097 845232
14731 845232 571585 860596 1135756 638942 512928 768629 612170 748887 1000632 854085
14721 854085 980782 625480 1082422 858272 762013 972633 580469 716444 604359 709009
14711 709009 862147 1068191 934737 431381 782560 1006827 699520 959284 872701 794608
$$ packed form
14782E89423j69583o7341J83409M6289j69468M78496l75846k7308O3326J69825
14772G21222J2927j1115R0179L9735j3909k88404J24645p8812j18880J08768O4675
14761F51031k43315L28782R713j74094K03125o0627j80518N09530n14730K76689
14751H05586N0836j39507j64317N1638j07089A77134Q19068j20198J71374k78991
14741G68387j74728M27463m08118J00037L98602N4914l85739K76415n07136K95135
14731H45232k73647K89011K75160m96814j26014K55701j56459J36717K51745j46547
14721H54085J26697l55302M56942k24150r6259K10620l92164J35975j12085J04650
14711G09009J53138K06044j33454D31381L51179K24267l07307K59764q6583p8093
$$ plain form
14701 794608 603071 1005605 990382 817936 898187 1378546 796741 730362 579377 917902
14691 917902 1056219 1057729 912076 666739 678451 1039058 718861 1008222 899949 1050157
14681 1050157 849236 882208 1311984 974231 1056158 1060203 973588 761591 1370528 855522
14671 855522 1182109 1390314 1076643 1182610 1329542 1064960 916877 1339810 1010020 1002486
14661 1002486 1185406 1134278 1289388 1022906 1123993 1017768 1206614 1165556 1448695 972961
14651 972961 1170444 1348706 1489027 1060148 836706 1148046 1057765 1190298 978813 1285760
14641 1285760 1232006 1364916 1111249 1281819 1402029 1137639 1674203 1329939 1631207 1579722
14631 1579722 1455062 1631250 1460761 1240921 1227281 1400800 1258513 1584122 1417709 1552798
$$ packed form
14701G94608j91537M02534j5223j72446Q0251M80359n81805o6379j50985L38525
14691I17902J38317J510j45653k45337J1712L60607l20197K89361j08273J50208
14681A050157k00921L2972M29776l37753Q1927M045q6615k11997O08937n15006
14671H55522L26587K08205l13671J05967J46932k64582j48083M22933l29790p534
14661A002486J82920n1128J55110k66482J01087j06225J88846m1058K83139m75734
14651I72961J97483J78262J40321m28879k23442L11340r0281J32533k11485L06947
14641A285760n3754J32910k53667J70570J20210k64390N36564l44264L01268n1485
14631A579722j24660J76188j70489k19840j3640J73519j42287L25609j66413J35089
$$ plain form
14621 1552798 1479212 1258935 1739120 1723587 1470469 1604021 1557479 1388482 1237504 1617391
14611 1617391 1695559 1462465 1432509 1769262 1300856 1658060 1847585 1634221 1477669 1816801
14601 1816801 1686039 1564170 1717756 2050630 1827222 1975766 1817997 1754003 1988556 1970381
14591 1970381 1716226 1879794 1662823 1805651 1652632 1840659 2081602 1878915 2002018
14582 2002018 1854483 1931504 2225180 2164547 2021000 1945594 2053041 2157869 2097232 2419824
14572 2419824 2029839 2267807 2216788 2323682 2033188 2577029 2418411 2415029 2248418 2988383
14562 2988383 2668569 2644756 2544519 2761496 3047628 2708534 3292575 3314450 3730862 3905888
14552 3905888 4156446 4783854 5801918 7467567 11373572 19679395 39416910 47539521
$$ packed form
14621A552798p3586k20277M80185j5533k53118J33552m6542j68997j50978L79887
14611A617391P8168k33094k9956L36753m68406L57204J89525k13364j56552L39132
14601A816801j30762j21869J53586L32874k23408J48544j57769o3994K34553j8175
14591A970381k54155J63568k16971J42828j53019J88027K40943k02687J23103
14582B002018j47535P7021K93676o0633j43547p5406J07447J04828o0637L22592
14572B419824l89985K37968n1019J06894k90494N43841j58618l382j66611P39965
14562B988383l19814k3813j00237K16977K86132l39094N84041K1875M16412J75026
14552C905888K50558O27408J018064J665649L906005Q305823J9737515Q122611
$$ plain form
14544 47539521 22235603 12587143 6200834 3573830 2777558 2252053 2308151 2253177 2415402
14535 2415402 1820368 2190192 1846573 2183373 2180604 2085887 2315351 2404500 2444236 2518010
14525 2518010 2447878 2380003 2307980 2615338 2518195 2816793 2530644 2722742 2776058 2796246
14515 2796246 2641907 2837551 2691284 2504952 2929999 2777721 2800182 2791641 2829973 3128211
14505 3128211 3139987 3451400 3123572 2929390 3086739 2937528 3190495 3215968 3345173 3356707
14495 3356707 3179922 3322082 3500096 3454376 3539203 3531969 3734563 3888471 3830254 3718693
14485 3718693 4109492 3761968 4200071 3822146 4022217 3916292 4143207 3948273 4253420
14476 4253420 4260123 4113752 4335639 4512055 4382831 4495329 4239536 4596799 4830184 4348301
$$ packed form
14544D7539521B2235603r648460F200834k627004p96272n25505N6098n4974J62225
14535B415402n95034L69824l43619L36800k769r4717K29464Q9149L9736P3774
14525B518010p0132o7875p2023L07358r7143K98598k86149J92098N3316K0188
14515B796246j54339J95644j46267j86332M25047j52278K2461q541L8332K98238
14505C128211J1776L11413l27828j94182J57349j49211K52967K5473J29205J1534
14495C356707j76785J42160J78014m5720Q4827p234K02594J53908n8217j11561
14485C718693L90799l47524M38103l77925K00071j05925K26915j94934L05147
14476D253420O703j46371K21887J76416j29224J12498k55793L57263K33385m81883
$$ plain form
14466 4348301 4495077 4430463 4768879 5174333 5026004 4870831 5055489 4816481 4998818 5036678
14456 5036678 5419692 5369315 5965892 5315607 5320062 5585252 5492477 5744012 5819196 5902823
14446 5902823 5862694 5729726 5948092 5958928 5979681 6350364 6320233 6216513 6731854 6408572
14436 6408572 6698279 6456677 7012908 6974900 6823649 6856104 6849250 6773658 7076780 7260635
14426 7260635 7333617 7675154 7917560 7971068 7669848 7981102 8681548 8147670 8398382 8451442
14416 8451442 8717616 8740179 8980123 9242166 8920169 9456145 9990268 9550274 9901486 10062337
14406 10062337 10275263 10264765 10092024 10410973 10749284 10935691 11027005 11024743 11567644 11379456
14396 11379456 11723340 12026347 12474501 12574253 12279049 12875585 12885835 13088094 13378276 13573461
$$ packed form
14466D348301J46776o4614L38416M05454j48329j55173J84658k39008J82337L7860
14456E036678L83014n0377N96577o50285M455K65190r2775K51535P5184Q3627
14446E902823m0129j32968K18366J0836K0753L70683l0131j03720N15341l23282
14436F408572K89707k41602N56231l8008j51251L2455o854p5592L03122J83855
14426G260635P2982L41537K42406N3508l01220L11254P00446n33878K50712N3060
14416H451442K66174K2563K39944K62043l21997N35976N34123m39994L51212J60851
14406A0062337K12926j0498j72741L18949L38311J86407R1314k262N42901j88188
14396A1379456L43884L03007M48154R9752k95204N96536J0250K02259K90182J95185
$$ plain form
14386 13573461 14010205 14375407 13969941 14827436 14803339 14974192 15498063 15567758 16080366 16180953
14376 16180953 16619766 17170177 17138434 17838707 17832046 18136980 18632693 19002239 19409236 19793450
14366 19793450 19916525 20447719 20807566 21507888 21498181 22429602 23158652 23320778 23700102 23808406
14356 23808406 24994938 25353697 25964107 26593162 27384341 27904017 28690000 29269086 30036622
14347 30036622 30507362 31349261 32165279 32940790 34104484 34969337 35589926 37008771 37777999
14338 37777999 38770651 39707746 40923669 42106921 43478022 44839544 45924804 46907740
14330 46907740 48635223 50336237 51840953 53667635 55192870 56860017 58824482 60985391
14322 60985391 63007711 65007050 67015048 69768763 72158244 74768311 77438407 80598417
$$ packed form
14386A3573461M36744L65202m05466Q57495k4097J70853N23871O9695N12608J00587
14376A6180953M38813N50411l1743P00273o661L04934M95713L69546M06997L84214
14366A9793450J23075N31194L59847P00322r707R31421P29050J62126L79324J08304
14356B3808406J186532L58759O10410O29055P91179N19676P85983N79086P67536
14347C0036622M70740Q41899Q16018P75511J163694Q64853O20589J418845P69228
14338C7777999R92652R37095J215923J183252J371101J361522J085260R82936
14330D6907740J727483J701014J504716J826682J525235J667147J964465K160909
14322F0985391K022320J999339K007998K753715K389481K610067K670096L160010
$$ plain form
14314 80598417 83759367 86723696 90265972 94115179 97600075 101748494 105841603 110109609
14306 110109609 115067818 119989074 125064609 130546522 136813699 142887989 149460850 156207334
14298 156207334 163783303 171675606 180011755 188902036 198212012 207983522 218432050 228997136
14290 228997136 240420567 252407014 264887954 277838530 291281099 305138214 319110214
14283 319110214 333755760 348427228 363093501 377242274 391425744 404821397 417787356
14276 417787356 429177597 439547945 448398207 454582868 456971364 458028497 459478151 459395976
14268 459395976 454976637 451562741 447293001 440469581 431389504 421101019 409536913 396445893
14260 396445893 382375127 367863403 352682155 337620350 322815423 307902404 294567434
$$ packed form
14314H0598417L160950K964329L542276L849207L484896M148419M093109M268006
14306A10109609M958209M921256N075535N481913O267177O074290O572861O746484
14298A56207334P575969P892303Q336149Q890281R309976R771510J0448528J0565086
14290B28997136J1423431J1986447J2480940J2950576J3442569J3857115J3972000
14283C19110214J4645546J4671468J4666273J4148773J4183470J3395653J2965959
14276D17787356J1390241J0370348Q850262O184661K388496J057133J449654q2175
14268D59395976m419339l413896m269740o823420r080077j0288485j1564106j3091020
14260C96445893j4070766j4511724j5181248j5061805j4804927j4913019j3334970
$$ plain form
14253 294567434 281165807 267842753 255025548 242683077 231278091 220048877 209648462
14246 209648462 199615500 190235267 181757284 173140275 165282075 157390907 150055060 143588312
14238 143588312 137577461 131857096 125746648 120816121 115531829 110802261 106544256 102771988
14230 102771988 98542213 94581454 90984946 87241109 84190711 80848413 78122871 75265227
14222 75265227 72433217 69939450 67978502 65608151 62960228 60950244 59055722 57505835
14214 57505835 55461571 54085002 52507086 50894999 49254967 47630420 46513211 45838119
14206 45838119 44346031 42732126 41542341 40575610 39550298 38647901 37775635 36733842
14198 36733842 35575513 34418017 33395703 32802212 32282922 31392891 30867976 29901877 29114240
$$ packed form
14253B94567434j3401627j3323054j2817205j2342471j1404986j1229214j0400415
14246B09648462j0032962r380233q477983q617009p858200p891168p335847o466748
14238A43588312o010851n720365o110448m930527n284292m729568m258005l772268
14230A02771988m229775l960759l596508l743837l050398l342298k725542k857644
14222G5265227k832010k493767j960948k370351k647923k009984j894522j549887
14214E7505835k044264j376569j577916j612087j640032j624547j117209o75092
14206D5838119j492088j613905j189785r66731j025312r02397q72266j041793
14198C6733842j158329j157496j022314n93491n19290q90031n24915r66099p87637
$$ plain form
14189 29114240 28330540 27435833 27220664 26395493 25957635 25207967 24483319 24177977 23778318
14180 23778318 22888726 22372062 22141079 21908765 21684247 20837513 20007232 20239367 19567001
14171 19567001 19422674 19171378 18189585 18168718 17782294 17532820 17199308 16867787 16504696
14162 16504696 16466262 15825797 15584071 15175348 15219432 14914943 14642858 14300618 14047347 13544980
14152 13544980 13447712 13410423 13289238 12917401 12919839 12666529 12344575 12457586 11762356 11903616
14142 11903616 11509489 11411977 10881829 11205063 11225261 10622470 10498425 10419882 10035676 10099056
14132 10099056 10068570 9725739 9786881 9655240 9404457 9304922 9312380 9002340 8988094 8939353
14122 8939353 8615730 8763906 8646539 8429869 8339344 8287297 7912512 7982033 7595664 7601686
$$ packed form
14189B9114240p83700q94707k15169q25171m37858p49668p24648l05342l99659
14180B3778318q89592n16664k30983k32314k24518q46734q30281K32135o72366
14171A9567001j44327k51296r81793k0867l86424k49474l33512l31521l63091
14162A6504696l8434o40465k41726m08723M4084l04489k72085l42240k53271n02367
14152A3544980r7268l7289j21185l71837K438k53310l21954J13011o95230J41260
14142A1903616l94127r7512n30148L23234K0198o02791j24045p8543l84206O3380
14132A0099056l0486l42831O1142j31641k50783r9535P458l10040j4246m8741
14122H939353l23623J48176j17367k16670r0525n2047l74785O9521l86369O022
$$ plain form
14112 7601686 8018786 7676119 7706914 7451199 7352773 7235790 7404782 7340624 7089890 6964220
14102 6964220 6654365 6519504 6716705 6349963 6609415 6438771 6129398 6423575 6292706
14093 6292706 5980258 6148213 6080917 6020341 5882266 5728460 5798698 5487638 5789507 5654349
14083 5654349 5437850 5342579 5369134 5436029 5049485 5010422 4894045 5136696 4835634 5013761
14073 5013761 4805280 4688165 4919459 4543655 4823984 4883649 4553892 4647823 4476622 4570647
14063 4570647 4495094 4155597 4570198 4359652 4646638 4538337 4021544 4162741 4351867 4208400
14053 4208400 4198920 4197788 4113052 3889590 3745894 3969844 3712723 3881363 3743678 3559940
14043 3559940 3589117 3905787 3597797 3681302 3417309 3533746 3437950 3216958 3655798 3511000
$$ packed form
14112G601686M17100l42667L0795k55715r8426j16983J68992o4158k50734j25670
14102F964220l09855j34861J97201l66742K59452j70644l09373K94177j30869
14093F292706l12448J67955o7296o0576j38075j53806P0238l11060L01869j35158
14083E654349k16499r5271K6555O6895l86544l9063j16377K42651l01062J78127
14073E013761k08481j17115K31294l75804K80329N9665l29757R3931j71201R4025
14063D570647p5553l39497M14601k10546K86986j08301n16793J41197J89126j43467
14053D208400r480j132q4736k23462j43696K23950k57121J68640j37685j83738
14043C559940K9177L16670l07990Q3505k63993J16437r5796k20992M38840j44798
$$ plain form
14033 3511000 3546322 3622280 3444920 3481631 3372026 3262683 3126271 2987577 2759850 3066849
14023 3066849 2865241 2929308 2858452 2861322 2773163 2722080 2675779 2529677 2833176 2557986 2711121
14012 2711121 2666826 2839083 2723330 2850449 2133968 2614577 2362108 2734297 2160012 2569128
14002 2569128 2552280 2241486 2251773 2310276 2180947 2205345 2487177 2212620 2361924 2145500
13992 2145500 2375403 2568755 2704102 3549572 6149319 12524798 31407681 50383705
13984 50383705 28058085 15036141 9149459 6312460 5267927 4336167 4287367 3515917
13976 3515917 3344284 3260986 2992489 3208641 3144509 2837303 2463431 2387247 2861620 2668012
13966 2668012 2577432 2223262 2363849 2672225 2317890 2412727 2194825 2195845 2453020 2084839
$$ packed form
14033C511000L5322P5958j77360L6711j09605j09343j36412j38694k27727L06999
14023C066849k01608O4067p0856K870q8159n1083m6301j46102L03499k75190J53135
14012B711121m4295J72257j15753J27119p16481M80609k52469L72189n74285M09116
14002B569128j6848l10794J0287N8503j29329K4398K81832k74557J49304k16424
13992B145500K29903J93352J35347Q45470K599747O375479J8882883J8976024
13984E0383705k2325620j3021944n886682k836999j044533r31760m8800p71450
13976C515917j71633q3298k68497K16152o4132l07206l73872p6184M74373j93608
13966B668012r0580l54170J40587L08376l54335R4837k17902J020K57175l68181
$$ plain form
13956 2084839 2067174 2072986 2187084 1941711 2250077 2311962 1918554 2225796 2167424 1996517
13946 1996517 1781256 2176586 2076731 2213326 1986116 1849383 1635555 1779160 1918562 2344484
13936 2344484 1985159 1866568 1872562 2050968 1931011 1675087 2092304 1604199 1604112 1589544 1655990
13925 1655990 1609194 1809187 1755027 1766370 1681536 1613321 1779626 1741190 1390834 1691526
13915 1691526 1296663 1880893 1536920 1792623 1574859 1357360 1384773 1744620 1517516 1286844
13905 1286844 1707107 1466553 1325031 1528206 1223981 1537812 1277137 1378137 1547741
13896 1547741 1423516 1457240 1205355 1567091 1602607 1631782 1385895 1434911 1115706 1588095
13886 1588095 1359017 1543024 1404019 1307618 1378708 1454500 1215447 1370203 1391177 1229178
$$ packed form
13956B084839j7665N812J14098k45373L08366O1885l93408L07242n8372j70907
13946A996517k15261L95330r9855J36595k27210j36733k13828J43605J39402M25922
13936B344484l59325j18591N994J78406j19957k55924M17217m88105q7j4568O6446
13925A655990m6796J99993n4160J1343q4834o8215J66305l8436l50356L00692
13915A691526l94863N84230l43973K55703k17764k17499K7413L59847k27104k30672
13905A286844M20263k40554j41522K03175l04225L13831k60675J01000J69604
13896A547741j24225L3724k51885L61736L5516K9175k45887M9016l19205M72389
13886A588095k29078J84007j39005r6401P1090P5792k39053J54756K0974j61999
$$ plain form
13876 1229178 1397142 1321051 1243031 1151987 1170340 1170201 1317965 1268755 1388815 1052005 976244
13865 976244 1252081 1284068 1231531 890485 1066706 1130285 1316193 1050006 1128794 944662
13855 944662 1387908 964901 1121558 1165445 1054472 1016543 1073457 921662 1531041 1093822
13845 1093822 803220 1145539 1388000 1066119 1126597 1383017 1021504 1012049 1065295 1236620
13835 1236620 1092112 1287234 811828 991776 1062956 711921 1204028 576245 785968 1157047
13825 1157047 1031505 1000943 954438 563788 786376 805799 1016857 779121 1049317 984931
13815 984931 1066938 828088 593767 789996 892911 1083504 955793 807960 813925 1092435
13805 1092435 1016962 634545 740025 973516 1052567 1098801 542121 1072647 672111 775471
$$ packed form
13876A229178J67964p6091p8020r1044J8353j39J47764m9210J20060l36810p5761
13865I76244K75837L1987n2537l41046J76221O3579J85908k66187P8788j84132
13855I44662M43246m23007J56657M3887j10973l7929N6914j51795O09379m37219
13845A093822k90602L42319K42461l21881O0478K56420l61513r455N3246J71325
13835A236620j44508J95122m75406J79948P1180l51035M92107E76245K09723L71079
13825A157047j25542l0562m6505l90650K22588J9423K11058k37736K70196o4386
13815I84931Q2007k38850k34321J96229J02915J90593j27711j47833N965K78510
13805A092435p5473l82417J05480K33491P9051M6234E42121N30526m00536J03360
$$ plain form
13795 775471 785813 617558 745415 654064 873556 1011655 916245 651409 874457 892563
13785 892563 765687 875119 691633 636150 760142 683431 729601 988716 999740 907919
13775 907919 631291 701782 671424 679595 881013 707311 572455 694424 824859 827059 708176
13764 708176 863265 1064815 573654 1088816 587794 793416 951769 825618 851966 822504
13754 822504 708832 849658 876894 694300 566327 696147 692602 546979 945154 434781
13743 505775 685996 700907 694882 844454 588335 484312 680853 652816 481601 505569
13733 505569 337415 1081500 372102 567715 534137 669627 605021 535701 335496 889518
13723 889518 579150 715648 395167 352740 926207 539944 589321 443984 517170 608816
$$ packed form
13795G75471J0342j68255J27857r1351K19492J38099r5410k64836K23048J8106
13785H92563j26876J09432j83486n5483J23992p6711M6170K59115J1024r1821
13775I07919k76628P0491l0358Q171K01418j73702j34856J21969J30435K200j18883
13764G08176J55089K01550m91161N15162n01022K05622J58353j26151K6348k9462
13754H22504j13672J40826K7236j82594j27973J29820l545j45623L98175D34781
13743E05775J80221J4911o025J49572k56119j04023J96541k8037j71215K3968
13733E05569j68154P44085C72102J95613l3578J35490o4606o9320k00205N54022
13723H89518l10368J36498l20481m2427N73467l86263M9377j45337P3186R1646
$$ plain form
13713 608816 387231 589937 599314 280686 647257 986734 304054 631019 734058 470223
13703 470223 529978 709544 657986 536672 691831 618801 514616 632794 682800 366714
13693 366714 539282 762397 953499 389212 500479 495376 748183 846748 703409 570038
13683 570038 -65737 578720 623405 509913 501128 345566 286397 456654 393330 243593 575129
13672 575129 406410 499500 300147 542609 516941 373405 780253 945247 795695 240635
13661 453134 438782 747638 788993 522086 348387 552529 312935 330544 651711 359156
13651 359156 514004 586078 302678 520447 438936 413105 776376 135605 516133 467367
13641 467367 658860 339236 210301 440304 275335 338628 419400 439969 438641 699364
$$ packed form
13713F08816k21585K02706R377B80686L66571L39477C04054L26965J03039k63835
13703D70223N9755J79566n1558j21314J55159p3030j04185J18178N0006l16086
13693C66714J72568K23115J91102C89212J11267n103K52807R8565j43339j33371
13683E70038f5737E78720M4685j13492q785j55562n9169J70257o3324j49737L31536
13672E75129j68719R3090j99353K42462k5668j43536M06848J64994j49552B40635
13661D53134j4352L08856M1355k66907j73699K04142k39594J7609L21167k92555
13651C59156J54848P2074k83400K17769q1511k5831L63271A35605L80528m8766
13641D67367J91493l19624j28935K30003j64969O3293Q0772K0569j328K60723
$$ plain form
13631 699364 522439 136125 438327 508675 505203 282500 562225 311893 326829 485392
13621 485392 265391 -9842 315543 320910 280732 580529 605066 497815 307191 452448 117290
13609 436563 615659 588315 714855 575027 452574 523519 336067 362576 363962 462620 294157
13598 294157 810872 221866 268763 246586 652602 397310 298251 473376 214261 -10660
13587 135051 382267 269786 202822 473799 437470 340413 150004 462084 126377 513115
13577 513115 382240 657170 -7980 483713 456593 508289 368923 323432 441248 424534 199826
13565 166402 293506 229031 238284 326923 368319 410370 112013 209725 424789 110392 301625
13554 301625 448697 447485 456246 299013 401780 414769 401765 454111 423329 105869 443456
$$ packed form
13631F99364j76925A36125L02202P0348l472k22703K79725k50332J4936J58563
13621D85392k20001i842C15543N367m0178K99797K4537j07251j90624J45257A17290
13609D36563J79096k7344J26540j39828j22453P0945j87452K6509J386R8658j68463
13598B94157N16715B21866M6897k2177M06016k55292r9059J75125B14261a0660
13587A35051K47216j12481o6964K70977l6329r7057A50004L12080A26377L86738
13577E13115j30875K74930g980D83713k7120N1696j39366m5491J17816j6714A99826
13565A66402J27104o4475R253Q8639M1396M2051A12013R7712K15064A10392J91233
13554C01625J47072j212Q761j57233J02767J2989j3004N2346l0782A05869L37587
$$ plain form
13543 443456 174108 179359 419565 16978 63953 516228 394578 269864 387638 185597
13532 -68019 153791 486762 58291 36383 535740 393560 369944 767278 380293 299833
13522 299833 348935 149132 60547 301878 464426 105425 420406 232636 206082 369891
13512 369891 359233 343921 -17051 351679 381337 264215 105967 535776 573887 391746
13502 391746 264317 443850 282202 496864 317627 255878 146315 465610 356550 359214
13492 359214 299824 302207 192584 149481 360941 271672 443737 176483 -159074 245863
13481 27673 132354 405912 326182 461737 142271 375944 174045 169566 133683 289762
13471 289762 75445 32980 301135 364976 340364 87984 661474 347413 140913 282159
$$ packed form
13543D43456A74108N251K40206A6978M6975M52275j21650j24714J17774A85597
13532f8019A53791L32971E8291k1908M99357j42180k3616L97334C80293q0460
13522B99833M9102A49132F0547K41331J62548A05425L14981j87770k6554J63809
13512C69891j0658j5312a7051C51679K9658j17122A05967M29809L8111j82141
13502C91746j27429J79533j61648K14662j79237o1749j09563L19295j09060K664
13492C59214n9390K383j09623m3103K11460q9269J72065A76483a59074B45863
13481B7673J04681K73558p9730J35555A42271K33673A74045m479l5883J56079
13471B89762G5445C2980K68155O3841k4612H7984N73490l14061A40913J41246
$$ plain form
13461 282159 241529 364528 611352 112717 -65589 142990 101622 807022 -224522 237819
13450 434038 45672 284664 322622 317957 465341 114326 327240 70003 205870 203335 371970
13439 371970 203923 247908 482170 164343 39534 266074 239339 225316 470449 126229
13428 758154 181412 452015 513117 344989 296131 412234 239721 167849 452287 100498
13417 148000 -41579 287363 261845 255824 214775 261636 260161 398696 211669 411832 99202
13405 82696 48263 281519 189115 232745 218219 313957 387473 225954 279874 349601 180678
13394 180678 349073 296270 355070 36389 298556 288333 300172 -210846 102155 264084
13384 264084 508808 36659 222386 -28360 241113 81259 130444 190022 123050 3627 259746
$$ packed form
13461B82159m0630J22999K46824A12717f5589A42990m1368P05400b24522B37819
13450D34038D5672K38992L7958m665J47384A14326K12914G0003J35867k535J68635
13439C71970j68047M3985K34262A64343C9534K26540k6735j4023K45133A26229
13428G58154A81412K70603O1102j68128m8858J16103j72513p1872K84438A00498
13417A48000d1579B87363k5518o021m1049M6861j475J38535j87027K00163I9202
13405H2696l4433K33256r2404M3630j4526R5738P3516j61519N3920O9727j68923
13394A80678J68395n2803N8800C6389K62167j0223J1839b10846A02155J61929
13384B64084K44724C6659J85727b8360B41113H1259M9185N9578o6972C627K56119
$$ plain form
13373 259746 384103 217597 260854 465991 98418 277551 469253 171798 457574 53057
13362 79083 303893 321831 235632 204824 173958 65252 351916 162541 262047 77730 269430
13351 269430 194406 358666 406984 -14903 241243 305756 448844 283594 520318 454646
13341 454646 617685 453232 386650 265501 278861 -80579 388450 203736 235854 479599
13331 479599 253956 123858 -203022 156883 290088 55211 62998 435825 -3329 230323
13320 369963 294553 299186 628509 6443 119747 -126811 139075 74387 270617 -184802 167701
13308 232877 553612 302879 185792 182579 198946 35305 320494 130064 631228 158898
13297 578 338701 -80964 245984 -2868 209895 128930 -65317 228287 -52271 54339 92741
$$ packed form
13373B59746J24357j66506M3257K05137I8418J79133J91702A71798K85776E3057
13362G9083K24810J7938q6199l0808l0866F5252K86664A62541R9506G7730J91700
13351B69430p5024J64260M8318a4903B41243O4513J43088j65250K36724o5672
13341D54646J63039j64453o6582j21149J3360h0579C88450j84714L2118K43745
13331D79599k25643A23858b03022A56883J33205E5211P787L72827c329B30323
13320C69963p5410M633L29323F443J13304a26811A39075o4688J96230a84802A67701
13308B32877L20735k50733j17087l213J6367C5305K85189A30064N01164A58898
13297E78L38123h0964B45984b868B09895q0965f5317B28287e2271E4339L8402
$$ plain form
13286 92741 119111 450769 297511 -16734 303176 -57591 327541 128129 252425 -316965
13275 240593 90598 103882 183265 157628 190853 -31291 -47029 165892 38112 229853 343946
13264 343946 21047 266009 223106 -158040 -46549 213852 132046 1741 -10862 -27751 255452
13252 59766 64339 -13554 -124948 -15559 389783 -16357 5508 352020 348967 84816 213470
13241 213470 293797 5213 338162 219228 17959 68926 -15848 -142848 111895 2076 49820
13230 49820 -81358 -5495 412578 -148300 -30150 203208 90737 51165 7267 -40138 112415
13218 -304300 57772 363907 163287 -111758 -2990 159922 -29557 179692 134569 6907 -13476
13206 30034 169672 141194 138589 140245 53238 110528 33096 203972 98729 176144 -274937
$$ packed form
13286I2741K6370L31658j53258a6734C03176e7591C27541A28129J24296c16965
13275B40593I0598J3284P9383k5637L3225c1291j5738A65892C8112J91741J14093
13264C43946B1047K44962m2903a58040d6549B13852q1806A741a0862j6889B55452
13252E9766M573a3554j11394a5559C89783a6357E508L46512l053H4816J28654
13241B13470Q0327E213L32949j18934A7959N0967a5848j27000A11895B076M7744
13230D9820h1358e495D12578a48300c0150B03208I0737l9572G267d0138A12415
13218c04300E7772L06135A63287a11758b990A59922b9557A79692m5123F907a3476
13206C0034J39638k8478k605J656E3238N7290C3096J70876I8729P7415b74937
$$ plain form
13194 312687 157625 246519 338972 122954 277877 -205180 29646 15785 112710 65675 216227
13183 216227 -85659 399774 299394 352383 661653 207885 182393 283587 494822 128641
13172 -40543 -277788 -347392 107621 226173 66057 -144379 105077 -52561 108170 323278
13162 323278 52493 177779 -132872 391362 118496 23534 100854 90791 4225 1995 142724
13151 142724 185248 -115095 38199 218002 108705 16616 145385 71753 359478 426927
13141 426927 37838 179330 108332 407652 52166 41506 123261 33645 198870 233474 45607
13129 -18963 -81027 182785 47410 99063 -46452 121584 136712 560211 116720 86530 -269127
13117 72199 -222385 55115 -15813 66820 -12205 287932 120928 94227 94237 232550 136615
$$ packed form
13194C12687j55062Q8894R2453A22954J54923b05180B9646j3861R6925m7035J50552
13183B16227h5659C99774j00380N2989L09270B07885k5492J01194K11235A28641
13172d0543k37245o9604A07621J18552F6057a44379A05077e2561A08170K15108
13162C23278E2493J25286a32872C91362A18496B3534P7320j0063D225A995J40729
13151A42724M2524a15095C8199J79803A08705A6616J28769G1753K87725O7449
13141D26927C7838J41492p0998K99320E2166j0660Q1755C3645J65225L4604D5607
13129a8963o2064A82785D7410N1653d6452A21584J5128M23499A16720l0190b69127
13117G2199b22385E5115a5813F6820a2205B87932A20928k6701J0J38313r5935
$$ plain form
13106 136615 212147 39271 198894 67629 46042 261731 63379 317744 -148621 141965
13095 93638 151998 137729 43805 22516 80703 -33601 219578 120897 246489 -10377 348582
13083 -319666 82332 171483 97394 283589 -130723 561734 103299 -32454 134038 122569
13073 122569 49891 271521 160485 130245 297224 41017 58632 -298232 358002 306750
13063 306750 -67025 81545 185621 63599 287985 575104 198081 -72762 181697 -160896
13052 310094 -184272 -265332 107494 122093 -29495 62633 236212 -56935 194937 193867 332345
13041 332345 -48998 172596 158419 -71926 133379 -154909 67185 339441 34079 297871
13031 297871 15965 25675 267366 204012 34468 216151 406714 102593 163233 238090 -117125
$$ packed form
13106A36615P5532C9271J59623F7629k1587K15689F3379K54365a48621A41965
13095I3638N8360j4269D3805k1289N8187c3601B19578r8681J25592a0377C48582
13083c19666H2332Q9151p4089J86195a30723E61734A03299c2454A34038j1469
13073A22569D9891K21630j11036l0240J66979D1017J7615b98232C58002n1252
13063C06750f7025H1545J04076F3599K24386K87119A98081g2762A81697a60896
13052C10094a84272q1060A07494J4599b9495F2633J73579e6935A94937j070J38478
13041C32345d8998A72596j4177g1926A33379a54909F7185K72256C4079K63792
13031B97871A5965R710K41691o3354C4468J81683J90563A02593O0640P4857a17125
$$ plain form
13019 249824 225510 28964 340550 93015 -4061 24595 81659 -290879 80370 82961 98959
13008 98959 240831 84264 193135 -67065 191092 336865 101603 305922 -96529 -54156
12998 -54156 -34616 95251 42930 -138531 193159 -18394 22246 82863 -109805 160462 -171846
12986 158927 163964 4309 80804 177055 122953 248241 -83681 35839 28645 -2285 111778 122935
12974 122935 61454 50532 -124751 -169742 -66154 151559 -248965 -74643 186012 5915 -229569
12962 -221155 -158154 214182 -61432 5852 70389 60572 388224 -95701 151752 2796 279882
12951 279882 271797 362023 159484 -20787 185158 -64547 85082 -99146 -593414 137200 157846
12940 157846 -100987 72852 173767 333188 452792 74668 -86654 368163 -85691 149066
$$ packed form
13019B49824k4314B8964L11586I3015d061B4595N7064b90879H0370K591J5998
13008I8959J41872H4264J08871f7065A91092J45773A01603K04319i6529M2373
12998e4156J9540I5251D2930a38531A93159a8394B2246O0617a09805A60462a71846
12986A58927N037D309P6495R6251n4102J25288h3681C5839p194b285A11778J1157
12974A22935F1454j0922a24751m4991f6154A51559b48965g4643A86012E915b29569
12962b21155O3001B14182f1432E852O4537r817L27652i5701A51752B796K77086
12951B79882q085R0226A59484b0787A85158f4547H5082i9146m94268A37200K0646
12940A57846a00987G2852J00915J59421J19604G4668h6654C68163h5691A49066
$$ plain form
12929 91737 305943 16677 -133516 140167 111933 363069 -15674 -108613 219218 121922 -32251
12917 210058 55536 -347669 -184946 164764 -124910 -2464 229769 -18849 -4570 -105010 178110
12905 -284645 149300 243468 54339 -299605 83870 -142838 104462 -222913 -162849 137998
12894 22301 109127 54559 46108 26044 173528 210365 137003 34382 61789 270540 -67956
12882 -91973 -203305 79759 29100 260723 206420 -65605 164226 -2978 -303093 102243 167920
12871 167920 380806 129403 147373 -274775 84958 -38264 -162312 377485 176808 225413
12861 225413 126974 80475 -15924 -31866 102304 246598 272979 -42355 185592 -230266 109868
12849 245148 -166316 323759 11203 -135342 138325 96750 372317 28527 -4955 -1372 408495
$$ packed form
12929I1737K14206A6677a33516A40167k8234K51136a5674r2939B19218r7296c2251
12917B10058E5536c47669J62723A64764a24910b464B29769a8849d570j00440A78110
12905b84645A49300R4168E4339b99605H3870a42838A04462b22913O0064A37998
12894B2301Q6826E4559q451k0064J47484L6837p3362C4382K7407K08751f7956
12882i1973j11332G9759B9100K31623n4303f5605A64226b978l00115A02243O5677
12871A67920K12886A29403J7970b74775H4958c8264j24048C77485A76808M8605
12861B25413r8439m6499a5924j5942A02304J44294K6381d2355A85592b30266A09868
12849B45148a66316C23759A1203a35342A38325m1575K75567B8527d955a372D08495
$$ plain form
12837 -267636 198328 6718 140821 183469 -86586 120210 177019 -208367 -262345 131351 -187659
12825 52738 27591 64220 -295837 261165 109053 -52973 122055 221770 -94724 259870 117933
12813 -47331 -10684 134559 46615 -209816 -37646 195711 120682 -21243 -55791 300439 36682
12801 43883 71057 330024 -38041 85033 434763 89226 93760 121457 30774 86813 -87448
12789 184841 43803 -65434 105244 11744 -324677 223722 -92783 38410 136178 17509 -46765
12777 -28602 200673 -220482 179117 -11796 32199 -238184 -61431 -34165 59061 182964 326183
12766 326183 113082 -26975 253065 -224932 215375 364210 -15661 57640 72989 -98876
12755 305247 23704 -43979 139851 46757 -146167 123522 186379 -99550 -56055 153983 51912
$$ packed form
12837b67636A98328F718J34103M2648h6586A20210N6809b08367n3978A31351a87659
12825E2738k5147L6629b95837B61165A09053e2973A22055R9715i4724B59870A17933
12813d7331a0684A34559D6615b09816c7646A95711p5029b1243l4548C00439C6682
12801D3883K7174K58967c8041H5033L49730H9226M534K7697C0774N6039h7448
12789A84841D3803f5434A05244A1744c24677B23722i2783C8410R7768A7509d6765
12777b8602B00673b20482A79117a1796C2199b38184f1431K7266E9061J23903J43219
12766C26183A13082b6975B53065b24932B15375J48835a5661E7640J5349i8876
12755C05247B3704d3979A39851D6757a46167A23522O2857i9550M3495A53983E1912
$$ plain form
12743 166004 246949 -92671 -30562 286207 -8890 -2123 452529 172487 49478 32796 -136485
12731 128755 81191 -2267 51053 43974 -116579 -59850 236965 163023 140472 53914 -140453
12719 -31287 -36875 81651 -7819 -9207 203389 -130798 -219853 -4962 -195276 38389 524159 258241
12706 195338 203488 179977 358549 155430 283935 416791 168712 -56677 239641 -140124
12695 290554 -13863 111139 197280 -37646 263357 -41904 -88127 129592 55402 225086 -238710
12683 -192653 -198119 191391 92782 130233 186426 262228 341142 -25428 -104632 355830 355701 -76932
12670 -28859 162881 -110161 -20140 -69038 279981 411685 -10265 395780 256627 -144604
12659 117025 393567 41535 256848 180805 223134 257979 117525 488629 40332 10669 -27381
$$ packed form
12743A66004Q0945i2671c0562B86207h890b123D52529A72487D9478j6682a36485
12731A28755m7564b267E1053p079a16579N6729B36965p3942k2551E3914a40453
12719c1287n588H1651g819j388B03389a30798q9055d962j90314C8389M85770B58241
12706A95338Q150k3511J78572A55430J28505J32856A68712e6677B39641a40124
12695B90554a3863A11139Q6141c7646B63357d1904m6223A29592E5402J69684b38710
12683a92653n466A91391I2782L7451N6193P5802P8914b5428p9204C55830j29g6932
12670b8859A62881a10161b0140m8898B79981J31704a0265C95780j39153a44604
12659A17025K76542D1535K15313p6043M2329L4845A17525L71104D0332A0669b7381
$$ plain form
12647 183169 323572 53308 -97894 477476 344381 -95517 -349517 -35750 273754 -47276
12636 6914 121756 264213 -95369 44950 106006 204876 -49191 263626 -38637 111983 466766
12625 466766 251657 66605 -18902 -15392 327663 344173 246352 79663 255334 92990 181347
12614 181347 91034 -22049 286682 -227504 290747 174219 -69521 150871 90162 218998
12604 218998 100232 -206094 112990 -34236 68171 412731 -5797 -209670 -25348 18829 -178864
12592 144849 -252179 104065 -2002 -357819 88276 84143 197230 -195550 -20816 82931 -207716
12580 42421 -106266 75028 -177244 -13047 72378 -14782 244600 435041 207073 422341
12570 422341 148805 69069 -234304 279044 121919 191101 51685 108452 196516 -62465 -206876
$$ packed form
12647A83169J40403E3308i7894D77476j33095i5517k54000c5750B73754d7276
12636F914J14842J42457i5369D4950O1056R8870d9191B63626c8637A11983L54783
12625D66766k15109F6605a8902L510C27663J6510r7821G9663J75671I2990Q8357
12614A81347r0313b2049B86682b27504B90747j16528f9521A50871o0709J28836
12604B18998A00232b06094A12990c4236F8171L44560e797k03873b5348A8829a78864
12592A44849b52179A04065b002l55817H8276m133J13087a95550b0816H2931b07716
12580D2421a06266G5028a77244a3047G2378a4782B44600J90441B07073K15268
12570D22341A48805F9069b34304B79044A21919O9182E1685N6767Q8064f2465j44411
$$ plain form
12559 -206876 36044 1543 -188383 -21535 -233881 75273 246274 -98713 266282 46364 40690
12548 40690 95609 9141 132114 -103422 254866 139449 -18789 226015 57546 153242 -193283
12536 -20529 41884 -125385 -29278 182836 -15043 -197033 36522 -65345 94494 45356 22411
12524 -357704 63473 85109 -46581 -82510 -195372 -121257 398680 178236 301531 152691
12514 152691 319128 -80142 75434 -71655 64300 115368 -146659 -29376 382929 113656 11347
12502 -277482 71877 -104173 -232947 2217 -39363 32029 -91585 384890 86064 361247 203760
12491 203760 352491 48206 -26290 -51144 172155 -11325 7197 -53745 -110527 -118200 151118
12479 39200 185472 80344 172068 249433 312048 140670 224844 89879 20855 219828 -153883
$$ packed form
12559b06876C6044A543a88383b1535k12346G5273J71001i8713B66282D6364n674
12548D0690N4919I141J22973a03422B54866j15417a8789B26015E7546R5696a93283
12536b0529D1884a25385b9278A82836a5043j81990C6522f5345I4494D5356B2411
12524c57704F3473K1636d6581l5929j12862P4115C98680A78236J23295j48840
12514A52691J66437h0142G5434g1655F4300N1068a46659b9376C82929A13656A1347
12502b77482G1877a04173j28774B217c9363C2029i1585C84890H6064K75183j57487
12491B03760J48731D8206b6290k4854A72155a1325G197e3745n6782p673A51118
12479C9200J46272H0344R1724P7365O2615A40670Q4174H9879B0855J98973a53883
$$ plain form
12467 -75350 103134 175767 102637 -237710 -178505 423766 170957 112020 16625 -93311 91398
12455 -103802 -394138 305669 -56302 -64916 113184 35352 80157 111149 20882 -113598 -48494
12443 59443 115656 -34200 145855 -124071 104906 -107838 280522 -369672 -55346 12381
12432 -254681 59592 99964 -178739 2356 206897 174905 -117214 13790 75806 365460 -162328
12420 -227202 9677 67534 101179 129772 -226718 -86336 128027 21973 -37493 -84577 -314098
12409 -314098 -269356 -155323 -152278 8475 109289 -51758 -208070 -94677 -385709 -89527 -173655
12398 -173655 166053 115110 32845 120632 180026 28119 219051 39612 114702 255600 -157157
12386 -52915 9504 94364 -23625 -134774 102773 -206048 -165066 -91347 -4430 -74759 67608
$$ packed form
12467g5350A03134P2633p3130b37710N9205D23766A70957n8937A6625i3311I1398
12455a03802k90336C05669e6302q614A13184C5352M4805L0992B0882a13598d8494
12443E9443N6213c4200A45855a24071A04906a07838B80522c69672e5346A2381
12432b54681E9592M0372a78739B356K04541l1992a17214A3790O2016K89654a62328
12420b27202I677N7857L3645K8593b26718h6336A28027B1973c7493m7084k29521
12409c14098M4742J14033L045H475J00814e1758j56312i4677k91032h9527q4128
12398a73655A66053n0943C2845Q7787N9394B8119J90932C9612P5090J40898a57157
12386e2915I504Q4860b3625j11149A02773b06048M0982P3719d430p0329F7608
$$ plain form
12374 90585 30022 90172 118039 50384 -151595 -19784 -87948 98662 -364094 273431 -99015
12362 -7346 -108195 143334 241631 -230219 -7474 -66105 -2326 -405 159829 -55485 -332440 90552
12349 -180200 47269 347587 -190261 -279164 -31408 -311118 31178 -202238 -54462 -104518 250557
12337 105852 147632 89467 -17683 -14669 12328 -109803 165983 92397 88831 -121078 291924
12325 -116136 201315 -204091 -219952 -26930 -60261 -672 -137423 -192449 86749 -38683 -66201
12314 -66201 -164199 -57117 105363 46568 1728 119742 90430 -90396 -58347 -57386 43561 338308
12302 338308 -199747 92908 136889 149887 25442 -182542 89802 -7562 255718 331951 222476
12291 222476 -78297 -49518 -139879 -16135 230951 41217 205856 94856 228660 286527 270289
$$ packed form
12374I0585C0022O0150K7867E0384a51595a9784o8164I8662c64094B73431i9015
12362g346j00849A43334R8297b30219g474n8631b326d05A59829e5485k76955I0552
12349a80200D7269L00318a90261q8903c1408k79710C1178b02238e4462n0056B50557
12337A05852M1780n8165a7683L014A2328a09803A65983p3586l566a21078B91924
12325a16136B01315b04091j5861b6930l3331f72j36751n5026H6749c8683k7518
12314f6201r7998e7117A05363D6568A728J18014k9312i0396L2049R61D3561K94747
12302C38308a99747I2908M3981J2998B5442a82542H9802g562B55718P6233j09475
12291B22476g8297K8779r0361a6135B30951D1217J64639I4856J33804N7867j6238
$$ plain form
12280 270289 -92906 5565 195673 -90274 34365 -283896 595577 223133 46710 237244 41188
12268 11242 165223 73992 181982 -43141 495760 -180478 -248381 175834 238806 324079 1926
12256 125609 -186775 170928 229509 -204376 226622 75149 -69233 -407018 230370 79620
12245 -18462 130897 213820 253663 41325 -25644 29948 173472 202494 63187 -18146 162421
12233 44642 102173 200114 -41225 -102096 -37654 109297 310344 45605 164136 437375 439854
12222 439854 22186 126981 -129642 211274 463780 342471 48433 5741 -58689 139853
12211 376828 -38946 223016 194165 42419 101330 53894 88842 246437 439414 329782 43638
12199 130328 81202 26039 -239295 160004 332198 -64611 123482 -188771 494380 74427
$$ packed form
12280B70289i2906E565J90108i0274C4365b83896E95577B23133D6710J90534D1188
12268A1242J53981G3992J07990d3141D95760a80478o7903A75834O2972Q5273A926
12256A25609a86775A70928N8581b04376B26622G5149f9233l37785B30370G9620
12245a8462A30897Q2923L9843D1325b5644B9948J43524K9022F3187a8146A62421
12233D4642N7531R7941d1225o0871c7654A09297K01047D5605J18531K73239K479
12222D39854B2186J04795a29642B11274K52506j21309D8433E741e8689A39853
12211C76828c8946B23016k8851D2419N8911m7436L4948J57595J92977j09632D3638
12199A30328m9126B6039b39295A60004J72194f4611A23482a88771D94380G4427
$$ plain form
12188 106024 153198 58416 57447 190211 -173831 -77933 450275 -2270 -42189 -51989 306496
12176 87494 278658 186839 19951 89179 263186 50215 154410 103296 -215721 9986 382491
12165 382491 154612 -85421 145086 463017 266928 -53329 -54155 37098 -60450 -219200 -17797
12153 181084 126355 90709 -175620 335460 333573 70143 52402 167431 11523 68977 -48365
12141 -73202 -293586 237718 -1013 94006 91978 145332 -124041 183104 227006 181885 141239
12130 141239 -146490 78504 18969 28862 63594 75261 3614 383382 -147146 30223 14109
12118 -34236 -282779 -132305 -56941 127917 -136347 -19073 -207272 77736 96372 -220272
12107 -246115 112248 -303410 -65939 94258 446035 226855 -154142 -100024 73305 -327535
$$ packed form
12188A06024M7174E8416r69J32764a73831g7933D50275b270l9919r800C06496
12176H7494J91164r1819A9951O9228J74007E0215J04195n1114b15721I986L72505
12165C82491A54612h5421A45086L17931j96089e3329q26C7098f0450j58750a7797
12153A81084n4729l5646a75620C35460j887G0143j7741J15029A1523N7454d8365
12141g3202k20384B37718a013I4006k028N3354a24041A83104M3902m5121m0646
12130A41239a46490G8504A8969R893L4732J1667C614L79768a47146C0223A4109
12118c4236k48543a32305e6941A27917a36347a9073j88199G7736J8636b20272
12107b46115A12248c03410f5939I4258L51777k19180a54142N4118G3305c27535
$$ plain form
12096 -78784 -288570 93978 108980 112749 -318828 32919 -114105 66715 -65020 3810 -110645
12084 94741 -100974 -14677 -101603 51175 -275437 4123 -287691 -127081 -115608 -47796 -133290
12073 -133290 222286 -122425 -232310 -5341 -289681 -10048 241437 90144 7029 197627 138116
12062 138116 229554 -37700 521494 1135252 1883993 857190 -30474 -82342 197893 84240
12051 92209 -124909 -233413 -20920 -48680 32370 -228508 19742 -26006 -173213 -8866 122718
12039 -128367 -162833 74793 -76830 -56473 372533 50608 -16456 79535 -50084 223725 47081
12027 -98565 -3822 103497 -429674 -5562 43341 27525 171068 -53189 276769 -237623 255805
12015 29613 -50738 128271 -9586 216 -14040 126581 -101882 -243692 -106606 -86622 -191071
$$ packed form
12096g8784k09786I3978J5002L769c18828C2919a14105F6715f5020C810a10645
12084I4741a00974a4677q6926E1175b75437D123b87691a27081J1473d7796q5494
12073a33290B22286a22425j09885e341k84340a0048B41437I0144G029J90598n9511
12062A38116R1438c7700E21494O13758P48741H57190c0474n1868A97893H4240
12051I2209a24909j08504b0920k7760C2370b28508A9742b6006j47207h866A22718
12039a28367l4466G4793g6830K0357C72533E0608a6456G9535e0084B23725D7081
12027i8565c822A03497d29674e562D3341j5816J43543e3189B76769b37623B55805
12015B9613e0738A28271i586B16a4040A26581a01882j41810a06606J9984j04449
$$ plain form
12004 -191071 -88128 -220306 255402 120495 -32055 -71772 201298 -40956 411644 29412
11993 -53374 -111162 -249218 -22949 21128 56546 -87414 13734 64207 -27867 89921 -294183
11981 -27230 -65908 156393 -248101 168909 -104137 77941 224070 -283358 -41675 117043
11970 -226981 236910 278669 -76379 -82817 75653 -294682 -195627 -44382 88890 107745 -11606
11958 392070 -14083 187457 -23178 -29664 159822 -80853 -332999 115307 -131453 -225086 -335810
11947 -335810 -277007 104651 -359971 339610 -86190 -251336 -308024 -34368 -238398 88948
11936 -221873 58309 -409199 100772 -398499 -85020 132583 -101298 -158255 -320245 19934
11925 117484 434078 -437899 1324 -228997 133016 63079 -198653 -179428 96515 31228 200
$$ packed form
12004a91071h8128j32178B55402A20495c2055l9717B01298d0956D11644B9412
11993e3374n7788j38056b2949B1128L5418h7414A3734N0473b7867H9921b94183
11981b7230l8678A56393b48101A68909a04137G7941J46129b83358d1675A17043
11970b26981B36910M1759g6379o438G5653b94682R9055d4382H8890J8855a1606
11958C92070a4083A87457b3178o486A59822h0853k52146A15307a31453r3633j10724
11947c35810N8803A04651c59971C39610h6190j65146n6688c4368k04030H8948
11936b21873E8309d09199A00772c98499h5020A32583a01298n6957j61990A9934
11925A17484L16594d37899A324b28997A33016F3079a98653J9225I6515C1228B00
$$ plain form
11913 2200 168572 101223 196617 64994 -367938 139315 217668 -254627 210237 -292282 504625
11901 77263 -76155 -84960 214175 -374247 -63805 -11130 157833 65146 -98127 33959 -277765
11889 -254224 171870 -260795 255739 -156145 95951 314495 -291153 319654 -5269 -294473
11879 -294473 -83231 -142932 -2895 -235191 -73513 38802 -236823 -16188 -56695 -156613 -4626
11867 -63274 72378 -131655 38013 1212 -260654 74298 -97033 -197412 -357390 55520 73281
11856 73281 -6067 213643 165611 -75458 78253 21127 -312245 -399193 -51342 -228250 -25869
11844 -321141 -47217 -40064 30412 -227408 -3631 -94271 -246302 128595 427041 -51621 -413534
11833 -413534 40814 30782 -168907 198414 -283306 132589 -9382 -70875 -169855 100175 142076
$$ packed form
11913B200J66372o7349R5394F4994c67938A39315P8353b54627B10237b92282E04625
11901G7263g6155q805B14175c74247f3805a1130A57833F5146i8127C3959b77765
11889b54224A71870b60795B55739a56145I5951K18544b91153C19654e269k89204
11879b94473h3231n9701b895k32296g3513C8802b36823a6188m0507r9918d626
11867f3274G2378a31655C8013A212b60654G4298i7033j00379j59978E5520J7761
11856G3281f067B13643m8032g5458G8253B1127c12245q6948e1342j76908b5869
11844c21141d7217P153C0412b27408c631r0640j52031A28595K98446e1621l61913
11833d13534D0814j0032a68907A98414b83306A32589i382o1493r8980A00175M1901
$$ plain form
11822 142076 173235 182572 -123852 -64740 11757 -300554 -225622 224216 64124 -191042 -480850
11811 -480850 -353701 46841 9418 63806 -63350 -149862 -113843 -12513 316451 -189388 189412
11799 -74240 -153667 143836 -42973 176565 235470 -55837 -113045 -128223 -63681 -161168 86256
11787 -146654 165261 -115488 444669 68657 -183673 -67492 95070 328973 65418 -52957
11776 -35374 157987 -241571 59465 100464 -237161 -2332 277729 -15192 225391 45953 39194
11765 39194 -101841 177821 -156796 -245201 186700 40646 140810 100455 -66537 -155705 210560
11753 1936 36078 -29796 91756 155388 45333 -343427 112809 70902 -134921 262206 -104952
11741 237530 60893 80901 8730 136356 -225870 -54576 343850 371909 -100059 -142314 -59937
$$ packed form
11822A42076L1159R337a23852N9112A1757c00554P4932B24216F4124a91042k89808
11811d80850J27149D6841I418N4388f3350q6512L6019a2513C16451a89388A89412
11799g4240p9427A43836d2973A76565N8905e5837n7208j5178f3681r7487H6256
11787a46654A65261a15488D44669F8657a83673f7492I5070K33903F5418e2957
11776c5374A57987b41571E9465M0999b37161b332B77729a5192B25391D5953o759
11765C9194a01841A77821a56796q8405A86700D0646J00164m0355f6537q9168B10560
11753A936L4142b9796I1756O3632D5333c43427A12809m1907a34921B62206a04952
11741B37530F0893K0008H730J27626b25870e4576C43850K8059a00059m2255e9937
$$ plain form
11729 121305 -146003 -53621 25798 93830 -134881 133425 -71980 -81007 187746 124516 -101382
11717 -109042 71226 168274 -14752 22244 27046 -193982 30780 -193041 -30689 60669 102729
11706 102729 20900 119962 237866 12775 -27896 -65142 -134870 -175680 -39706 -141019 101621
11694 100530 2584 -167105 147472 -187409 255835 293815 -45437 59314 363621 206256
11684 206256 -44534 15992 -174933 -210169 215973 -65492 255082 159431 -42740 233871 69032
11672 -4789 289708 -43383 70180 169606 32220 30119 117297 90734 75716 181458 57044 -30029
11659 115438 -78114 46147 -23520 -41434 362643 180086 -146545 221104 165254 352694
11649 352694 89039 -154456 -5933 -13547 165456 -12888 -57143 157474 -29091 -54065 -129731
$$ packed form
11729A21305a46003e3621B5798O8032a34881A33425g1980r027A87746o3230a01382
11717a09042G1226R7048a4752B2244M802a93982C0780a93041c0689F0669M2060
11706A02729B0900R9062J17904A2775b7896l7246o9728m0810c9706j01313A01621
11694A00530B584a67105A47472a87409B55835L7980d5437E9314L04307j57365
11684B06256d4534A5992a74933l5236B15973f5492B55082r5651d2740B33871F9032
11672d789B89708d3383G0180R9426C2220k101Q7178k6563j5018J05742E7044c0029
11659A15438g8114D6147b3520j7914C62643A80086a46545B21104n5850J87440
11649C52694H9039a54456e933p614A65456a2888m4255A57474b9091k4974p5666
$$ plain form
11638 -129731 170047 -184196 -100275 14577 -128292 96586 -153161 546061 467748 230279
11627 375704 1616 306699 212526 25454 59932 97697 -263305 -152291 -54593 92053 185613
11616 185613 41146 144975 -84114 -85399 -212320 -103310 242218 -213797 19019 -234914
11605 -184037 -74496 -171082 82837 47743 26374 -212227 12642 375892 252788 164966 192281
11594 192281 -92260 286851 -129619 427766 98099 11514 74006 221262 118385 9921 295055
11583 295055 269770 304894 -37441 80162 189686 -349553 177227 274850 -41340 201218 276642
11572 276642 143388 78427 -21983 336668 -345237 261609 13301 28760 70755 348502
11562 348502 175374 -25756 -65608 223658 -138183 7739 -24695 221870 45713 -56765 146161
$$ packed form
11638a29731A70047a84196Q3921A4577a28292I6586a53161E46061p8313B30279
11627C75704A616L05083r4173B5454L4478L7765b63305J11014e4593I2053R3560
11616A85613D1146J03829h4114j285j26921a03310B42218b13797A9019b34914
11605a84037g4496r6586H2837l5094k1369b12227A2642L63250j23104q7822K7315
11594A92281i2260B86851a29619D27766I8099A1514O2492J47256j02877I921K85134
11583B95055k5285L5124c7441H0162J09524c49553A77227R7623d1340B01218P5424
11572B76642j33254o4961b1983C36668c45237B61609A3301J5459M1995K77747
11562C48502j73128b5756l9852B23658a38183G739b4695B21870D5713e6765A46161
$$ plain form
11550 56650 55657 50217 38584 283428 122005 53863 -35424 165441 49243 346936 160695
11538 98565 -74726 108896 -8126 -118198 268354 178683 88745 229942 302746 58977 -158957
11526 -39548 207392 8130 231108 -25648 99195 427225 332555 126900 265800 39886 31289
11515 31289 360359 115789 258378 271402 298728 -324515 102023 284633 187796 282437
11505 282437 10882 12332 116982 464525 53308 493751 156590 455204 57180 451423
11495 451423 -383563 -136788 168288 140387 -350078 296111 211340 309487 199459 -91965
11484 135612 297280 392146 394083 24407 477144 119468 198312 65400 -83810 219706 512737
11473 512737 391816 95330 253150 145239 390047 -99662 351963 -12649 320180 -36004
$$ packed form
11550E6650r93n440j1633K44844A22005E3863c5424A65441D9243K97693A60695
11538I8565g4726A08896h126j10072B68354q9671H8745J41197P2804E8977a58957
11526c9548B07392H130K22978b5648I9195L28030r4670A26900J38900C9886q597
11515C1289L29070A15789J42589J3024K7326c24515A02023J82610r6837R4641
11505B82437A0882J450J04650L47543E3308M40443A56590K98614E7180L94243
11495D51423c83563a36788A68288k7901c50078B96111q4771R8147j10028i1965
11484A35612J61668R4866J937B4407M52737A19468P8844F5400h3810B19706K93031
11473E12737j20921I5330J57820j07911K44808i9662C51963a2649C20180c6004
$$ plain form
11462 198009 377940 -4541 116688 4656 -6051 260226 10450 27095 -146230 126014 -80969
11450 -48385 -23111 112733 396579 36954 65150 -100569 -181689 -95437 -106583 -436385 45487
11438 62741 28847 197455 63982 2389 402045 -17447 -157706 21915 284453 -71695 -23807
11426 77672 -366164 220239 382225 -204225 241149 269995 159700 65766 300876 383853
11416 383853 111851 -253382 -82158 -242520 -15914 -11504 -81078 -231441 344913 168174
11405 91627 -63273 212038 190391 -177313 167187 57525 -56228 35158 153105 144402 -329246
11393 -287974 -299452 -16488 198288 100225 -329722 142601 15125 96200 -40110 -80265 -23520
11381 265312 -138683 249133 226055 -97749 163952 -104412 -21846 -15893 -16471 65215 235787
$$ packed form
11462A98009J79931d541A16688D656f051B60226A0450J6645a46230A26014h0969
11450d8385b3111A12733K83846C6954K8196a00569q1120Q6252j1146l29802D5487
11438F2741B8847J68608F3982B389L99656a7447j40259B1915K62538g1695b3807
11426G7672c66164B20239J61986b04225B41149K8846j10295F5766K35110Q2977
11416C83853A11851b53382h2158j60362a5914M410o9574j50363C44913A68174
11405I1627f3273B12038k1647a77313A67187E7525e6228C5158J17947q703c29246
11393b87974j1478a6488A98288r8063c29722A42601A5125Q1075d0110m0155b3520
11381B65312a38683B49133k3078i7749A63952a04412b1846N953n78F5215J70572
$$ plain form
11370 235787 -138741 199640 -12321 -5780 76370 165887 -196156 319719 96556 -157545 -101536
11359 -101536 -16711 156916 36907 -290385 -185085 41814 -6322 18556 -329895 194338 -115459
11347 304513 117491 63112 151042 -228631 -466375 127959 -217449 28205 -85066 38783
11336 -119999 -114627 -295576 -15113 -138308 26936 95072 541653 118471 -152839 -20057 -225389
11325 -225389 128983 -353452 -354578 107357 429263 -73482 -119857 36204 154246 159004 -147249
11313 -125178 62145 160493 -216613 39553 -126843 -10670 176031 79868 -76029 414247 -299223
11301 -168544 -41477 221657 -135869 76020 -102557 116433 -48403 -215924 -348901 84827
11290 -184559 -38065 -168261 330489 -166279 -230958 282484 62177 -288338 118972 -80141
$$ packed form
11370B35787a38741A99640a2321e780G6370Q9517a96156C19719I6556a57545N6009
11359a01536a6711A56916C6907b90385J05300D1814f322A8556c29895A94338a15459
11347C04513A17491n4379Q7930b28631k37744A27959b17449B8205h5066C8783
11336a19999N372j80949a5113j23195B6936O8136M46581A18471a52839b0057k05332
11325b25389A28983c53452j126A07357L21906g3482m6375C6204J18042M758a47249
11313a25178F2145R8348b16613C9553a26843a0670A76031G9868g6029D14247b99223
11301a68544d1477B21657a35869G6020a02557A16433d8403j67521j32977H4827
11290a84559c8065j30196C30489a66279o4679B82484F2177b88338A18972h0141
$$ plain form
11279 -371447 69642 -305568 5513 -193109 -45386 -39146 -159941 -26046 275566 -244316 86494
11267 -92318 117148 32081 -31780 -154499 -75271 -530967 42989 -125104 -4791 112134 -206111
11255 -59683 47550 116117 134564 267345 135072 -93696 -175399 -196858 56148 58254 96840
11244 96840 -21683 -80860 -92024 -12742 119051 -78123 138251 -153309 125363 -105678 -440318
11233 -440318 -27450 -129101 -46429 -181428 195475 -26668 315690 -79954 -391731 -136535
11222 193389 68428 -263606 -136110 24834 130715 66173 -98589 18139 -45678 -22340 -74428
11211 -74428 291401 -480003 -65386 -127723 -216876 21652 10062 -103377 41151 -341698 125840
11199 -191512 177956 95533 -315908 -175958 169548 88146 180805 -338040 -236934 -136504
$$ packed form
11279c71447F9642c05568E513a93109d5386O240j20795b6046B75566b44316H6494
11267i2318A17148C2081c1780j22719g5271m55696D2989a25104d791A12134b06111
11255e9683D7550O8567J8447J32781j32273i3696q1703k1459E6148K106L8586
11244I6840b1683n9177j1164a2742A19051g8123A38251a53309A25363a05678l34640
11233d40318b7450j01651d6429j34999A95475b6668C15690g9954l11777a36535
11222A93389F8428b63606J27496B4834J05881o4542i8589A8139d5678b2340n2088
11211g4428B91401d80003f5386o2337q9153B1652A0062a03377D1151c41698A25840
11199a91512A77956q2423c15908J39950A69548q1402R2659c38040J01106J00430
$$ plain form
11189 -136504 -320010 62996 -4623 93160 -242886 -250207 -102808 -116347 117614 -112764 141558
11177 -142302 117693 5930 -16571 -71008 -48137 -20496 -76081 117770 79497 -60566 32026
11165 192644 -188678 -17608 -250414 -115581 224949 -70031 140025 102107 -369949 -124030
11154 -17391 -366134 -222443 -3311 -146579 172567 -325386 152171 314235 333858 -408003
11143 -77558 165197 197467 71919 -195541 -149936 -284381 -83638 60226 -288330 124284 152713
11132 152713 117983 -103215 157357 163948 181063 299108 37434 -7711 202334 -247268 339967
11120 376986 3201 173769 -133973 -40163 8477 109000 -123193 -58699 -133099 -33335 168642
11108 249891 75390 457390 238882 162059 378918 11700 -21355 -9946 255219 183355 -95172
$$ packed form
11189a36504j83506F2996d623I3160b42886p321a02808j3539A17614a12764A41558
11177a42302A17693E930a6571n4437K2871b0496n5585A17770l8273f0566C2026
11165A92644a88678a7608k32806a15581B24949g0031A40025l7918c69949a24030
11154a7391l48743J43691c311j43268A72567c25386A52171J62064J9623d08003
11143g7558A65197L2270G1919a95541M5605j34445h3638F0226b88330A24284K8429
11132A52713l4730a03215A57357O591J7115J18045C7434g711B02334b47268C39967
11120C76986C201J70568a33973d0163H477J00523a23193e8699p4400c3335A68642
11108B49891G5390L82000k18508p6823K16859A1700b1355i946B55219p1864i5172
$$ plain form
11096 452817 -63162 194039 107960 143820 257308 77875 209737 341437 -6122 58454 456435
11085 456435 57759 -127922 35648 377318 267736 236066 358711 390029 341074 46063 79438
11074 79438 211781 305216 320264 269750 -22366 247902 600297 314566 613397 503897
11064 503897 307800 83693 480808 394500 541639 506971 878220 592062 132202 425847
11054 425847 653571 730670 594181 1074280 388665 984158 815147 931842 774688 770570
11044 770570 970302 704728 626343 1001344 688010 796412 779956 1033105 907376 1035367
11034 1035367 877205 864533 1047491 810619 879229 738938 837859 781097 770342 1003712
11024 1003712 567728 843281 644295 673190 553538 797584 836202 704396 516467 1050160
$$ packed form
11096D52817f3162A94039q6079L5860J13488G7875J31862J31700f122E8454L97981
11085D56435E7759a27922C5648L41670j09582l1670J22645L1318m8955D6063L3375
11074G9438J32343R3435J5048n0514b2366B47902L52395k85731K98831j09500
11064E03897j96097H3693L97115q6308J47139l4668L71249k86158A32202K93645
11054D25847K27724P7099j36489M80099C88665N95493j69011J16695j57154m118
11044G70570J99732k65574p8385L75001l13334J08402j6456K53149j25729J27991
11034A035367j58162j2672J82958k36872O8610j40291R8921n6762j0755K33370
11024A003712m35984K75553j98986K8895j19652K44046L8618j31806j87929N33693
$$ plain form
11014 1050160 522492 413852 785058 588025 530344 408775 945961 680856 576677 546242
11004 546242 578921 771972 845212 1129678 834154 730117 788335 732684 845669 608576
10994 608576 861709 738653 887861 769540 413233 655085 921375 954411 906627 893593
10984 893593 1060720 1376659 1172324 1054888 1165295 1501298 1747359 1629035 1865183 2036145
10974 2036145 2408109 2705570 3159483 3329595 3098997 3532604 3294754 2833646 2647872
10965 2647872 2334232 1896310 2236132 1870727 1900871 2258015 2373086 1893899 2451619 2151870
10955 2151870 2131962 1798755 1535687 1422823 1230614 592809 445784 536019 318144 388747
10945 388747 531260 344927 242876 423080 498304 -258075 137554 -88911 -76274 370576
$$ packed form
11014A050160E22492j08640L71206j97033n7681j21569N37186k65105j04179l0435
11004E46242L2679J93051P3240K84466k95524j04037N8218n5651J12985k37093
10994F08576K53133j23056J49208j18321l56307K41852K66290L3036m7784j3034
10984H93593J67127L15939k04335j17436J10407L36003K46061j18324K36148J70962
10974B036145L71964K97461M53913J70112k30598M33607k37850m61108j85774
10965B647872l13640m37922L39822l65405L0144L57144J15071m79187N57720k99749
10955B151870j9908l33207k63068j12864j92209E92809j47025R0235k17875P0603
10945C88747J42513j86333j02051J80204P5224b58075A37554h8911J2637C70576
$$ plain form
10934 17052 298059 90646 -86759 270962 396981 197076 -24563 -30918 134484 167477 -152397
10922 311098 20775 299005 157842 361708 -169581 115039 107257 -262850 118366 54991
10911 -64275 144904 337170 250775 246711 109478 133758 6493 -362209 245905 105302 -67529
10899 -107215 80869 -293124 -84927 -24186 116643 -165490 -2504 477345 -22347 -79773 -290481
10888 -290481 231800 139520 396079 215447 207522 -119905 -308617 -307309 -120140 -170825 -172635
10877 -172635 39585 -309025 -272872 74920 -34381 79541 125653 -165192 -159676 95640 73880
10866 73880 72626 -75956 -60376 -102219 143477 158186 -117882 -241661 9587 107726 -156861
10854 172471 -48181 -292527 290057 146007 -220543 -36801 -37402 -234769 -189167 -159485 -69785
$$ packed form
10934A7052K81007I0646h6759B70962J26019A97076b4563o355A34484L2993a52397
10922C11098B0775K78230j41163K03866a69581A15039p782b62850A18366E4991
10911f4275A44904J92266q6395m064A09478K4280F493c62209B45905A05302f7529
10899a07215H0869b93124h4927b4186A16643a65490b504D77345b2347n7426k10708
10888b90481B31800r2280K56559j80632p925a19905j88712J308a20140n0685j810
10877a72635C9585c09025L6153G4920c4381G9541M6112a65192N516I5640k1760
10866G3880j254g5956J5580m1843A43477J4709a17882j23779I587R8139a56861
10854A72471d8181k44346B90057j44050b20543c6801o01j97367M5602K9682f9785
$$ plain form
10842 7508 516345 -144165 258602 237263 126967 6494 84327 79843 54726 -109260 157156
10830 -103733 -159701 12557 212067 -213246 -426890 -154886 89058 -153707 -120501 -520990
10820 -520990 251671 -39068 64790 -26717 195499 170528 74596 -3786 354924 -116005 -60979
10809 -60979 128363 -6134 -117285 -110069 99501 -11726 91786 115601 -211590 45953 246308
10798 246308 -174455 -220574 -9506 -69926 -92463 -98381 71591 26237 -70202 -135333 -222242 -177097
10786 -177097 380963 -163783 229044 148497 -224387 -132487 9794 -129545 -132932 -270293 79229
10774 170745 80790 -8086 111715 -313837 -162324 -305197 59376 218507 208566 3863 -236560
10762 225550 -8524 -160180 -439995 91029 2841 -181650 -143358 -12386 119277 12897 -99480
$$ packed form
10842G508N08837a44165B58602k1339j10296F494P7833m484k5117a09260A57156
10830a03733n5968A2557J99510b13246k13644a54886H9058a53707L3206m00489
10820e20990B51671c9068F4790b6717A95499k4971G4596c786C54924a16005N5026
10809f0979A28363f134j11151P216I9501a1726I1786K3815b11590D5953K00355
10798B46308a74455m6119i506o0420k2537n918G1591B6237g0202o5131q6909M5145
10786a77097C80963a63783B29044q0547b24387R1900I794a29545l387j37361G9229
10774A70745H0790h086A11715c13837J51513j42873E9376J59131r941C863b36560
10762B25550h524j51656k79815I1029B841a81650L8292a2386A19277A2897i9480
$$ plain form
10750 -73021 -108856 -214793 -5812 -80305 -348653 33876 -189371 -153018 -120517 -245017 -16019
10738 -405390 -95061 -212920 -183562 56821 19506 -9417 -280177 -44408 33189 3083 -19357
10726 -256075 55175 89228 127029 53241 17814 -43796 -51649 338423 -390852 -169542 -387566
10715 -387566 -172902 105072 -102041 -322515 -367122 -92970 -84810 -15537 47010 -165443 -87258
10704 -87258 -16167 -144902 77907 144851 -160488 3055 254518 -206521 106666 -79626 153122
10692 131216 -273303 -174092 -61628 -82445 -203636 77256 -3226 -13878 -33794 71896 -171707
10680 -187142 28590 -78422 -124996 8012 72513 -115252 -220538 -82902 -212912 382819 -5142
10668 -211148 -19725 -120729 -62094 -186648 -213839 -351200 -116811 -306463 -58992 321397
$$ packed form
10750g3021l5835j05937e812p4493k68348C3876a89371L6353L2501j24500a6019
10738d05390i5061j17859K9358E6821A9506i417k70760d4408C3189C083a9357
10726b56075E5175L4053L7801E3241A7814d3796p853C38423c90852a69542k18024
10715c87566a72902A05072a02041k20474m4607i2970Q160a5537D7010a65443P8185
10704h7258a6167j28735G7907O6944a60488C055K51463b06521A06666g9626A53122
10692A31216b73303R9211f1628k0817j21191G7256c226j0652j9916G1896a71707
10680a87142B8590g8422m6574H012O4501a15252j05286h2902j30010C82819e142
10668b11148a9725j01004N8635j24554k7191j37361a16811j89652e8992C21397
$$ plain form
10657 -101971 77020 407420 -265558 -168233 97955 106436 -5698 -325641 70645 228383 -283534
10645 206483 33650 11502 60393 99561 100789 55969 49665 193640 -111828 -186243 -223324
10634 -223324 -233341 -93671 40706 -185301 -262756 -69373 -253240 -73192 -155442 146476 -278567
10622 25611 -8808 174172 -217040 234575 -239509 -368316 -49636 -405484 -315667 -256097 -393549
10611 -393549 593425 -104148 -44559 -189483 -229669 99852 -2551 -145033 -176029 -22698 -286514
10600 -286514 67579 -174227 -84843 -3685 251736 13369 -105270 -155333 -26483 -190814 -91477
10588 -167152 379245 -81637 87500 -100482 56463 371457 -9311 -91424 61515 -14029 -5719
10576 -88823 100614 42270 -51922 -193508 -23817 -227380 -109494 -137118 205540 177936 330603
$$ packed form
10657a01971G7020L30400b65558R7325I7955Q481e698l19943G0645J57738b83534
10645B06483C3650A1502M8891L9168J228m4820o304J43975a11828p4415l7081
10634b23324j0017i3671D0706a85301p7455f9373j83867g3192q2250A46476b78567
10622B5611h808A74172b17040B34575b39509j28807d9636l55848Q9817N9570j37452
10611c93549E93425a04148d4559j44924m0186I9852b551j42482l0996b2698k63816
10600b86514F7579a74227h4843c685B51736A3369a05270n0063b6483j64331i1477
10588a67152C79245h1637H7500a00482E6463L14994i311q2113F1515a4029e719
10576h8823A00614D2270e1922j41586b3817k03563a09494k7624B05540k7604J52667
$$ plain form
10565 330603 -9014 73321 66907 108691 -313553 35056 -96871 49078 152459 -122402 -259621
10554 -259621 -149137 -105575 -112975 65605 -358014 -116677 159548 -95515 49383 -15504 -50739
10543 -50739 -45499 -156446 32478 -18618 64458 -37479 87236 56833 -268414 39236 18855
10531 13456 -192362 -72930 63677 -29261 -307208 -59830 75143 -23480 53384 187908 -91920
10519 71465 54164 105966 -241063 133085 83530 -23376 -31529 193177 -290257 139972 -398474
10507 -141648 -379225 251415 -88961 -17927 -26220 -315987 -47832 -114872 134661 -44682 -59750
10496 -59750 -23388 124083 -5883 -315759 172630 175477 -96898 -115039 351964 191331 152245
10485 152245 149257 -7185 23914 -116466 328407 427560 337734 419567 253113 -37603 65658
$$ packed form
10565C30603i014G3321o414M1784c13553C5056i6871D9078J03381a22402j37219
10554b59621J10484M3562p400F5605c58014a16677A59548i5515D9383a5504l5235
10543e0739N240j10947C2478a8618F4458c7479H7236l0403b68414C9236A8855
10531A3456a92362g2930F3677b9261k77947e9830G5143b3480E3384J34524i1920
10519G1465j7301N1802b41063A33085m9555b3376q153A93177b90257A39972c98474
10507a41648k37577B51415h8961a7927q293k89767d7832o7040A34661d4682j5068
10496e9750b3388A24083e883l09876A72630K847i6898j8141C51964j60633l9086
10485A52245k988g185B3914a16466C28407R9153q9826Q1833j66454c7603F5658
$$ plain form
10473 -54330 209577 -63122 -176858 94636 -58748 133911 -101198 -156453 316877 -22478 -293974
10462 -293974 -145137 -92025 -491083 -289443 -51661 -140958 -75320 12278 12361 -75190 -7056 208213
10449 174640 -106902 21495 -165457 -130876 221042 -9396 71689 64662 -52634 252958 -301603
10437 -179021 11752 -35468 -303116 4282 9665 77113 216229 -62918 39476 -216724 -230732
10426 -230732 -161175 -536244 248243 -90027 -160681 35786 -36715 -150269 445851 -246734
10415 76702 17928 192111 -40278 -182190 63482 -372744 -172659 76733 -131659 88436 -166178
10403 -57271 -19376 217129 -114292 -140430 75557 -143182 294759 242232 390549 -8301 384219
10391 490109 264472 120145 238664 93684 93888 249593 -26823 -246999 212750 149787 295939
$$ packed form
10473e4330B09577f3122j13736I4636e8748A33911a01198n5255C16877b2478k71496
10462b93974a45137N3112l99058K01640e1661q9297O5638A2278Q3g5190g056B08213
10449A74640a06902B1495a65457L4581B21042i396G1689p027e2634B52958c01603
10437a79021A1752c5468k67648D282N383O7448J39116f2918C9476b16724j4008
10426b30732O9557l75069B48243i0027p0654C5786c6715j13554D45851b46734
10415G6702A7928J74183d0278j41912F3482c72744a72659G6733a31659H8436a66178
10403e7271a9376B17129a14292k6138G5557a43182B94759n2527J48317h301C84219
10391D90109k25637A20145J18519I3684K04J55705b6823k20176B12750o2963J46152
$$ plain form
10380 295939 118657 78615 83390 234605 335975 -77601 28848 532692 209636 387284
10370 387284 360864 441303 405582 281419 613930 718538 447109 765674 191362 -72190
10359 307924 32119 245529 -52615 307545 -14357 120733 287684 255689 792393 519911
10349 519911 589553 508462 690754 218943 507288 611442 321295 540132 389447 247935
10339 247935 -15385 335523 -96257 52206 295292 -210068 -93355 -99883 302424 -176924 -190916
10328 -190916 156083 221354 341622 161644 91067 138603 228227 241022 98013 234032 -5707
10316 103270 62826 336024 137266 -31040 304237 -66655 -81812 -211614 -139313 323762
10305 24577 185592 -194295 -130103 -29480 66964 148277 294785 109509 240424 -131720
$$ packed form
10380B95939A18657m0042M775J51215J01370g7601B8848N03844B09636J77648
10370C87284k6420Q0439l5721j24163L32511J04608k71429L18565A91362g2190
10359C07924C2119K13410e2615C07545a4357A20733J66951l1995N36704k72482
10349E19911O9642q1091J82292B18943K88345J04154k90147K18837j50685j41512
10339B47935a5385C35523i6257E2206K43086b10068i3355o528C02424a76924j3992
10328a90916A56083O5271J20268A61644p0577M7536Q9624J2795I8013J36019e707
10316A03270m0444K73198A37266c1040C04237f6655j5157j29802P2301C23762
10305B4577J61015a94295O4192b9480F6964Q1313J46508A09509J30915a31720
$$ plain form
10294 -141321 -182675 115119 62107 162696 -105977 35626 -107391 -389028 277972 -52690
10283 36209 -118350 -93512 -241570 -161214 86567 -153351 141256 -136796 23020 -71262 -432725
10272 -432725 44800 31604 173619 343310 97119 282539 8208 63027 -27782 74554 332759
10261 332759 344835 186763 300785 423660 444836 415456 285436 227586 223391 -69208 -72089
10250 -72089 231375 -85053 -35031 -177378 154019 -120304 -20720 20607 -24178 -150322 -82370
10239 -82370 -256751 68168 35137 -279818 25571 90244 -338872 101 -27924 -64280 -183512
10228 -183512 44922 -118987 228981 -378479 71756 -195640 90840 345475 -167233 23208
10217 265361 230803 -104535 -169749 48083 -331255 -447786 2434 -110262 -191809 -11320 49782
$$ packed form
10294a41321m1354A15119n3012J00589a05977C5626a07391k81637B77972e2690
10283C6209a18350K4838j48058Q0356H6567a53351A41256a36796B3020g1262l61463
10272d32725D4800j3196J42015J69691I7119J85420H208N4819b7782G4554K58205
10261C32759J2076j58072J14022J22875K1176k9380j30020n7850m195f9208k881
10250g2089B31375h5053c5031j42347A54019a20304b0720B0607b4178j26144O7952
10239h2370j74381F8168l3031b79818B5571O4673c38872A01b7924l6356j19232
10228a83512D4922a18987B28981c78479G1756a95640I0840K54635a67233B3208
10217B65361l4558a04535o5214D8083c31255j16531B434a10262q1547a1320D9782
$$ plain form
10205 290594 -202863 -249368 74002 -64539 154361 -35516 -421980 64399 97053 -159250 -230775
10194 -230775 -199221 -352823 -277062 -133495 31259 149727 157345 183544 -186476 38114 -94546
10182 -25221 -346408 440538 -98984 -57645 -259164 -155591 -280660 -131793 40925 234908
10172 234908 23981 223898 -186459 55704 -67420 161109 144905 -152007 255308 239567
10162 239567 -8454 -173166 -28397 -58563 -461013 -140381 208040 -145556 -48721 -141284 -62801
10150 37558 122634 -171492 81254 -120263 -75184 -129563 -374980 -109684 126580 264612
10140 264612 -77755 -76390 -115383 -70867 288198 120133 -91835 -132261 -310196 -73047 52932
10128 62444 -441100 259633 -346101 -166191 54319 247563 62745 -51152 103338 -344858
$$ packed form
10205B90594b02863m6505G4002f4539A54361c5516l86464F4399L2654a59250p1525
10194b30775L1554j53602P5761a33495C1259J18468P618K6199a86476C8114i4546
10182b5221l21187D40538i8984M1339k01519J03573j25069a31793D0925J93983
10172B34908B3981J99917a86459E5704f7420A61109j6204a52007B55308j5741
10162B39567h454j64712b8397l0166m02450a40381B08040a45556d8721r2563f2801
10150C7558Q5076a71492H1254a20263M5079n4379k45417a09684A26580J38032
10140B64612g7755J365l8993M4516B88198A20133i1835m0426j77935g3047E2932
10128F2444d41100B59633c46101a66191E4319J93244F2745e1152A03338c44858
$$ plain form
10117 -279716 -38064 -6156 -203211 132598 48733 96985 -158086 -303946 -3733 -49768 -90773
10106 -90773 10840 11197 158677 -262536 -128625 -199799 -181154 15826 13697 18705 -49583 251446
10093 251706 -59199 -277316 -60359 -142919 54341 23662 -269317 63047 135726 -127234 -112197
10082 -112197 24125 -111986 72602 179422 -406129 60520 -125591 34532 -84490 -11446 4560
10070 -126505 -234209 -99461 -185985 95409 -97911 8256 -192256 -126012 -71018 -231672 -78179
10058 -145332 -133176 -4515 -66616 -22379 33507 53572 -314025 -154421 78638 -225167 356761
10046 -126751 -151481 249029 46058 -145872 -189499 150472 -122467 54993 -106214 -220431
10036 -220431 -84798 166700 -175256 -259806 22195 -92764 -486758 -18225 -304551 -54910 -259529
$$ packed form
10117b79716c8064f156j97055A32598D8733M8252a58086j45860c733m6035m1005
10106i0773A0840L57J47480b62536a28625p1174J8645A5826k129N008d9583B51446
10093B51706e9199k18117f0359q2560E4341B3662b69317F3047P2679a27234J5037
10082a12197B4125a11986G2602J06820d06129F0520a25591C4532h4490a1446D560
10070a26505j07704i9461q6524I5409i7911H256a92256O6244N4994j60654g8179
10058a45332J2156d515o2101b2379C3507K0065c14025a54421G8638b25167C56761
10046a26751k4730B49029D6058a45872m3627A50472a22467E4993a06214j14217
10036b20431h4798A66700a75256q4550B2195i2764l93994a8225k86326e4910k04619
$$ plain form
10025 -259529 -298909 46291 -42773 3721 -5529 408346 -123681 110197 -334523 -81002 -21447
10013 217860 -158208 -249351 -347121 121957 -204156 -204337 341668 -506372 324115 -283378
10002 -30346 61987 -220076 405044 -239334 135806 -17835 -43579 -71557 -83732 67179 -18424
9990 15526 -261217 -234988 41999 1868 34889 186638 -42126 -315262 -175010 -47403 -87517
9979 -87517 22797 38279 181519 28174 -22548 167461 -45235 -59739 164987 209806 -150338
9967 -73571 -44108 25978 -380817 -135009 -67674 -125138 -93792 -72902 44935 -343107 -367406
9956 -367406 -89078 -23341 -83194 -32922 19808 -168441 192523 -4915 185680 -92520 -156619
9945 -156619 45958 114650 210686 348396 149182 -193003 18390 -19277 48280 23842 -45312
$$ packed form
10025b59529l9380D6291d2773C721e529D08346a23681A10197c34523h1002b1447
10013B17860a58208r1143r7770A21957b04156j81C41668e06372C24115b83378
10002c0346F1987b20076D05044b39334A35806a7835k5744k7978j2175F7179a8424
9990A5526b61217K6229D1999A868L3021J51749d2126k73136J40252d7403m0114
9979h7517B2797J5482J43240B8174b2548A67461d5235j4504A64987M4819a50338
9967g3571K9463B5978c80817a35009O7335n7464L1346K0890D4935c43107k4299
9956c67406h9078b3341n9853c2922A9808a68441A92523d915A85680i2520o4099
9945a56619D5958O8692R6036J37710A49182a93003A8390a9277D8280B3842d5312
$$ plain form
9933 -56000 -218619 -134775 -41270 261675 -259044 24574 -17463 -99680 -88817 -302259 -62220
9921 364083 -301210 -32886 -123152 5247 -223672 -101386 183515 -56964 -165935 -58652 -193487
9910 -193487 -222809 -104942 -176301 -180005 -221305 -54190 -112845 -290104 134148 -136600 -265144
9899 -265144 38612 -283401 -19766 -212542 -82119 70586 -289941 266560 -194345 91207 -20847
9887 205872 -33329 -174571 51039 -49020 103950 63526 -108979 83738 -108564 -185749 38379
9875 -4338 55252 -202889 118280 -381921 -345863 -37305 237350 219696 73788 138270 39232
9863 77589 -128981 -394807 -65421 86028 -64208 86953 16284 73558 13837 -207935 -14585
9851 21811 -193643 -142844 152845 173096 -173401 -90386 -186819 517106 -76703 61674 17384
$$ packed form
9933e6000j62619Q3844d1270B61675b59044B4574a7463q2217J0863k13442f2220
9921C64083c01210c2886r0266E247b23672a01386A83515e6964j08971e8652j34835
9910a93487k9322a04942p1359l704m1300e4190n8655j77259A34148a36600j28544
9899b65144C8612b83401a9766j92776h2119G0586b89941B66560a94345I1207b0847
9887B05872c3329j41242E1039d9020A03950m0424a08979H3738a08564p7185C8379
9875d338E5252b02889A18280c81921L6058c7305B37350j7654G3788O4482C9232
9863G7589a28981k65826f5421H6028f4208H6953A6284N7274A3837b07935a4585
9851B1811a93643N0799A52845K0251a73401Q3015r6433E17106g6703F1674A7384
$$ plain form
9839 -209348 -260366 -352377 -392432 -83901 -110690 131009 2150 -97296 -316596 31283 -53780
9827 -339148 68058 -26 -223230 6144 -250529 -29038 168098 -51501 -266599 168116 -113086
9815 -174809 -50451 64927 -235675 -42097 14908 153986 -257082 7408 64434 91289 145532
9804 145532 67 -109931 29380 -146314 -67830 69711 -216451 -93076 -320813 63728 400230
9793 400230 -113170 20459 -23102 -184237 -208983 -223343 109495 116996 82252 -122781 -420209
9782 -420209 -48998 17669 -216132 -220509 -50819 -28344 -188630 19345 -111362 -76728 -221895
9771 -221895 -115686 121044 -30619 -131359 -136927 10528 -231666 -371268 -184190 387676
9760 18284 193893 56747 -160117 -167427 104968 85894 -69309 -127176 -18896 -167416 -122501
$$ packed form
9839b09348n1018r2011m0055h3901k6789A31009B150i7296k19300C1283e3780
9827c39148F8058b6k23204F144b50529b9038A68098e1501k15098A68116a13086
9815a74809e0451F4927b35675d2097A4908J39078b57082G408N7026K6855N4243
9804A45532F7a09931B9380a46314f7830F9711b16451i3076k27737F3728L36502
9793D00230a13170B0459b3102j61135k4746j4360A09495P501l4744a22781k97428
9782d20209d8998A7669b16132m377e0819K2475j60286A9345a11362L4634j45167
9771b21895J06209A21044c0619j00740n568A0528b31666j39602a84190C87676
9760A8284J75609E6747a60117p310A04968j9074f9309n7867a8896j48520M4915
$$ plain form
9749 -122501 -144898 -53444 -214283 -176682 -334472 -64427 202018 -10144 -310453 274648 -140243
9737 63834 -83306 343456 -168038 1150 373794 28220 -71752 259528 -67800 143111 -154820
9725 -277141 155090 -164060 -266280 -3891 213809 -180126 -74075 -39791 -131539 -226225 -89689
9713 62422 -73930 306942 -64041 -190810 151467 -479632 -180591 -179461 184158 -361463 -398292
9702 -398292 -159874 -129552 -104082 91262 -59957 -337466 -79902 284406 -129766 -242617 119044
9690 87868 149742 311091 -46931 321554 -148581 -207751 51973 -536269 -363385 -180307 -164873
9679 -164873 -13361 68456 84563 -187190 55557 99749 -266503 -29998 -31881 -337304 -134248
9667 -278457 58668 6502 -19894 89434 -7909 -153133 143382 -379011 -202546 -252980 -284072
$$ packed form
9749a22501k2397e3444j60839L7601j57790f4427B02018a0144l00309B74648a40243
9737F3834h3306C43456a68038A150L72644B8220g1752B59528f7800A43111a54820
9725b77141A55090a64060j02220c891B13809a80126g4075L4284r1748r4686h9689
9713F2422g3930C06942f4041j26769A51467d79632a80591J130A84158c61463l6829
9702c98292a59874L0322K5470I1262e9957k77509g9902B84406a29766j12851A19044
9690H7868O1874J61349d6931C21554a48581n9170E1973e36269J72884a80307J5434
9679a64873a3361F8456J6107a87190E5557M4192b66503b9998j883l05423a34248
9667b78457E8668F502a9894H9434g909j45224A43382c79011J76465n0434l1092
$$ plain form
9656 -284072 -117852 106384 -351811 -220667 -160370 -229966 -330774 214098 -236556 94371
9645 283464 -209741 -132293 -131846 -73434 -417620 -175669 325200 -172513 -223913 -39012 52510
9633 -262581 -17470 -273594 -19263 -127597 30472 -53307 118595 -256245 -60863 343879 -214444
9621 -163799 -50975 -477606 11849 69054 137578 2435 236051 55312 83906 -165730 -223255
9610 -223255 134531 129218 127245 -112050 160162 -300303 -25896 -26246 -328445 -99575 219736
9598 -220760 -379866 -123109 -164903 -408057 283247 169015 -71943 -30512 -102610 -65834 100357
9586 3281 -127822 -222206 61293 24937 84163 -252259 127234 567289 -52711 -116736 -38433
9574 -85537 -356670 182620 231328 -209021 -263864 153882 80813 -16733 -329397 89998 -96320
$$ packed form
9656b84072a17852A06384c51811J31144O0297o9596j00808B14098b36556I4371
9645B83464b09741P7448M47N8412l44186a75669C25200a72513n1400c9012E2510
9633b62581a7470k56124a9263j08334C0472e3307A18595b56245f0863C43879b14444
9621a63799e0975m26631A1849N7205O8524B435K33616E5312K8594a65730n7525
9610b23255A34531n313j973a12050A60162c00303b5896l50l02199i9575B19736
9598b20760j59106a23109m1794k43154B83247j14232g1943c0512p2098L6776A00357
9586C281a27822r4384F1293B4937N9226b52259A27234M40055e2711o4025c8433
9574h5537k71133A82620M8708b09021n4843A53882p3069a6733l12664H9998i6320
$$ plain form
9562 -32701 -314706 -51268 68312 253821 -90153 7436 -90258 202236 -77116 -140399 -199076
9551 -199076 -396029 -130768 -207178 -165934 43334 -56549 -174034 -36974 -81972 -282070 -101217
9539 -30821 -393867 101490 334763 79894 -40 -254458 178511 29002 73885 26362 233033
9528 233033 54294 -486531 66881 208910 156120 -35490 31430 -99755 -177462 -176277 -309324
9517 -309324 97408 -88281 -74205 416406 -113494 -160260 215240 -191954 -174830 -227466 136056
9505 -207689 -40636 53657 205040 65890 -66366 67473 -76817 -9102 50216 -30356 -249134
9494 -249134 59029 123902 -205648 112124 -79939 -197090 -257396 -163925 -84012 228380 -248913
9482 273951 -45427 -461706 -175039 16693 -143554 51057 -200411 30040 -101979 -65987 -147725
$$ packed form
9562c2701k82005e1268F8312J85509i0153G436i0258B02236g7116o3283n8677
9551a99076j96953a30768p6410M1244D3334e6549j17485c6974m4998k00098a01217
9539c0821l63046A01490K33273G9894d0k54418A78511B9002M4883B6362K06671
9528B33033E4294d86531F6881J42029n2790c5490C1430i9755p7707J185j33047
9517c09324I7408h8281J4076D16406a13494m6766B15240a91954J7124n2636A36056
9505b07689d0636E3657J51383F5890f6366F7473g6817i102E0216c0356k18778
9494b49134E9029O4873b05648A12124g9939j17151o0306R3471P9913B28380b48913
9482B73951d5427m16279a75039A6693a43554E1057b00411C0040a01979L5992q1738
$$ plain form
9471 -147725 -110508 -185514 -224820 141440 -44875 81794 -379463 -249633 62368 114478 -321893
9459 -173254 -78815 -211026 -60193 158880 -437733 -203394 265416 155077 -432819 -21274
9448 -16917 73305 -119000 -227904 -132195 -252341 -194637 -12295 -90532 274544 -288354 20155
9436 -27204 -77005 46021 49424 20746 -86963 81272 68185 -46051 -185658 -85611 -319463 104365
9423 -128170 -127853 -54932 -41264 -33111 139481 -235250 -92480 33746 46969 -134269 -22390 8021
9410 -351517 -169569 156348 -26721 -264848 -396281 248145 -269304 141703 -258337 -25968
9399 -53675 -212722 186871 -177545 8930 18203 -146238 -128660 -224856 -138562 -199590 -137113
9388 -137113 2473 -55901 -56717 -70784 -151449 2529 171156 -240172 -269156 150246 -130246 90830
$$ packed form
9471a47725L7217p5006l9306A41440d4875H1794c79463J29830F2368N2110c21893
9459a73254g8815j32211f0193A58880d37733b03394B65416j10339d32819b1274
9448a6917G3305a19000j08904R5709j20146N7704a2295p8237B74544b88354B0155
9436b7204m9801D6021L403B0746h6963H1272j3087d6051j39607h5611k33852A04365
9423a28170L17e4932J3668Q153A39481b35250i2480C3746J3223a34269b2390H021
9410c51517a69569A56348b6721k38127j31433B48145b69304A41703b58337b5968
9399e3675j59047A86871a77545H930R273a46238J7578r6196Q6294o1028O2477
9388a37113B473e5901q16j4067q0665B529J68627b40172k8984A50246a30246I0830
$$ plain form
9375 -118152 254825 220364 204157 151674 -249206 -319290 22358 -394808 79147 -157980 -109850
9364 -109850 -119436 -119555 48553 133774 27748 200962 428582 288413 -4921 99478 269744 176221
9352 176221 -274202 -99259 143929 -187294 -66984 -129758 -67531 6320 -131878 -227728 -89036
9340 150843 -102901 8796 -187827 111398 48316 -82180 23041 -328388 -315334 120270 -119431
9328 86797 144297 -240882 -108134 -70962 -192454 -284077 -278637 1492 -281616 79487 14106
9316 54844 -117368 133230 -19706 28157 -63321 -16757 13202 59332 108938 11367 36227
9305 36227 27182 -33903 103143 79281 -253489 -139736 -306231 83359 -105643 48746 52963
9294 52963 -65375 -606901 106953 -400657 198206 -63585 -313521 95971 -34720 -174567 -119371
$$ packed form
9375a18152B54825l4461j6207n2483b49206p0084B2358c94808G9147a57980M8130
9364a09850r586j19D8553Q5221B7748J73214K27620j40169d921I9478J70266r3523
9352A76221b74202i9259A43929a87294f6984o2774O2227F320a31878r5850h9036
9340A50843a02901H796a87827A11398D8316h2180B3041c28388J3054A20270a19431
9328H6797N7500b40882a08134L7172j21492r1623N440A492b81616G9487A4106
9316E4844a17368A33230a9706B8157f3321a6757A3202M6130M9606A1367K4860
9305C6227r045c3903A03143k3862b53489J13753j66495H3359a05643D8746M217
9294E2963f5375n41526A06953d00657A98206f3585k49936I5971c4720j39847N5196
$$ plain form
9283 -119371 -203599 -114974 29716 87437 41277 -276259 -406195 -131239 157928 -28068 -50444
9272 -50444 103107 -83199 -162630 -41611 -111376 -90453 -27233 54135 -79801 -118815 -229994
9261 -229994 -85129 -123450 -178482 -116948 -404900 -199569 122707 81466 -84197 -184922 -153732
9250 -153732 144303 -219034 -248940 -251640 158886 -155544 100854 125819 -272170 -13498 -125853
9239 -125853 101043 142219 -175423 -94456 -251269 55130 34941 -124086 35150 167702 55279
9227 112084 -209068 -84998 -354111 -72169 133950 -380115 103482 -412094 -100990 -144323
9217 -144323 135516 -49219 -79444 -251100 -12361 66391 -140661 21768 -130322 187368 -58075
9205 6226 -282713 137164 -406355 -132035 -201001 -87543 -395047 152356 51304 12612 -242921
$$ packed form
9283a19371q4228Q8625B9716N7721D1277b76259j29936a31239A57928b8068k2376
9272e0444A03107h3199p9431d1611o9765K0923b7233E4135g9801l9014j11179
9261b29994h5129l8321n5032O1534k87952a99569A22707m1241h4197j00725L1190
9250a53732A44303b19034k9906k700A58886a55544A00854K4965b72170a3498j12355
9239a25853A01043M1176a75423Q0967j56813E5130k0189a24086C5150J32552E5279
9227A12084b09068h4998k69113g2169A33950c80115A03482d12094a00990m3333
9217a44323A35516d9219l0225j71656a2361F6391a40661B1768a30322A87368e8075
9205F226b82713A37164d06355a32035o8966h7543l07504A52356E1304A2612b42921
$$ plain form
9193 -120953 61157 -131244 -109230 31528 -47449 57353 -143969 129980 149143 -188941 16089
9181 34416 -213376 -163490 -202336 -127019 -456147 266042 46863 220619 220295 -253462 75970
9169 -103865 -190868 -232434 -127360 -86473 33133 -137752 167926 24695 -285562 -42938 82760
9157 -105470 94162 -106694 -196258 -86297 -171751 -45583 -112060 -25365 -60678 -11506 29674
9145 -84817 -3653 -186716 -12298 -53856 136554 -315583 -4311 99592 -194141 -117560 63513
9133 -373631 -16107 43770 -54862 62296 -99615 -348322 -264618 738 43413 3358 -194437 127112
9120 -26703 -262372 93119 -101181 -138399 -53640 -302638 245375 -9743 8157 -353625 -112386
9108 -97388 88426 355431 256814 270310 -139744 197181 115544 -424397 -390672 -9206 -100683
$$ packed form
9193a20953F1157a31244K2014C1528d7449E7353a43969A29980J9163a88941A6089
9181C4416b13376M9886l8846P5317l29128B66042D6863J73756l24b53462G5970
9169a03865q7003m1566J05074M0887C3133a37752A67926B4695b85562d2938H2760
9157a05470I4162a06694q9564h6297q5454d5583o6477b5365l5313a1506B9674
9145h4817c653j83063a2298m1558A36554c15583d311I9592a94141P6581F3513
9133c73631a6107D3770e4862F2296i9615k48707Q3704G38M2675C358a94437A27112
9120b6703k35669I3119a01181l7218e3640k48998B45375i743H157c53625a12386
9108i7388H8426K67005r8617J3496a39744A97181q1637d24397L3725i206r1477
$$ plain form
9097 -100683 55752 -192898 -146705 -262276 -40394 -218534 -97749 -46262 30418 -243163 -219258
9086 -219258 -323589 -66544 -194304 224995 -17531 -226648 -39378 427925 -187963 -91198
9075 -193866 40979 -83026 132904 207941 -230420 56913 -109043 -208790 -228240 -198516 20259
9063 34426 277528 -304175 -55057 -137882 -142712 -364272 4967 -132861 -46829 381967 132195
9051 170956 -237331 83443 -123752 -238046 -281695 25522 258950 -168883 -191946 -823 -40785
9040 -40785 -77509 -26989 -4438 68685 -97261 305224 -13863 -80102 -243175 -159485 -396726
9029 -396726 -110536 -59637 -24531 -101431 -54961 235741 -76412 106144 -22417 521 -295287
9017 193657 125107 -147207 -186366 7667 74599 -134979 -116377 157802 -140715 -97717 -24174
$$ packed form
9097a00683E5752a92898M6193j15571d0394j78140i7749d6262C0418b43163K3905
9086b19258j04331f6544j27760B24995a7531k09117c9378D27925a87963i1198
9075a93866D0979h3026A32904P5037b30420E6913a09043r9747j9450K9724B0259
9063C4426K43102c04175e5057q2825m830k21560D967a32861d6829C81967A32195
9051A70956b37331H3443a23752j14294m3649B5522K33428a68883k3063h23l9962
9040d0785l6724b6989d438F8685i7261C05224a3863o6239j63073Q3690k37241
9029c96726a10536N0899b4531p6900M6470B35741g6412A06144b2417E21b95287
9017A93657o8550a47207l9159G667O6932a34979J8602A57802a40715M2998b4174
$$ plain form
9005 -153519 65993 -160905 76325 210851 409527 -230807 -53389 -9560 -24120 -115249 -59677
8994 -59677 149888 -97876 133326 120735 -179620 -384849 -460699 -187205 208870 6881 -57118
8982 -306410 -97080 132904 14287 -275714 26389 -26960 -60430 -143848 121906 -12571 -125637
8971 -125637 -39286 151164 -28460 101954 -203436 -472603 -43998 -161616 47204 -106126
8960 -42554 -27705 185122 165346 159879 -1376 -172229 -3379 -295703 18236 187043 -189266
8948 -226513 -33245 -238816 -207331 392080 -131866 -35390 72241 -191599 347564 -62988 165229
8936 267318 22577 372488 40998 -93703 48129 12751 -278284 8817 118126 270389 242216
8925 242216 612678 893014 2590374 10840780 11954488 3574270 993624 512179 337001
$$ packed form
9005a53519F5993a60905G6325J34526J98676b30807e3389i560j4560r1129N5572
8994e9677A49888i7876A33326j2591a79620k05229p5850a87205B08870F881e7118
8982c06410i7080A32904A4287b75714B6389b6960l3470q3418A21906a2571j13066
8971a25637c9286A51164b8460A01954b03436k69167d3998j17618D7204a06126
8960d2554J4849A85122j9776n467a376j70853c379k92324A8236J68807a89266
8948b26513c3245k05571L1485C92080a31866c5390G2241a91599C47564f2988A65229
8936B67318B2577L49911D0998i3703D8129A2751b78284H817J09309J52263k8173
8925B42216L70462K80336J697360Q250406J113708C574270I93624m81445j75178
$$ plain form
8916 337001 426060 66620 220826 -123835 -46989 -162173 -180276 107197 321740 309560 4175
8904 112500 -84890 -35535 25356 148113 -278485 -172479 -346013 -267430 156927 72946 225932
8893 225932 38478 -94775 -10285 -161935 -45046 178395 520801 41831 153466 -130933 140571
8881 -456729 -116843 -45332 78056 -74512 126069 107406 47431 -79769 55878 130545 2393
8869 -282272 -95849 -309317 -155961 -262291 -259198 -448599 120844 -249984 -98576 34671 -232896
$$ packed form
8916C37001Q9059F6620J54206a23835d6989j15184j8103A07197K14543j2180D175
8904A12500h4890c5535B5356J22757b78485J06006j73534P8583A56927G2946J52986
8893B25932C8478i4775a0285j51650d5046A78395L42406D1831J11635a30933A40571
8881d56729a16843d5332G8056g4512A26069j8663D7431g9769E5878P4667B393
8869b82272i5849k13468J53356j06330L093j89401A20844b49984i8576C4671b32896
$$ [...]
##END NTUPLES=NMR SPECTRUM
##END=
