
##TITLE=AC1392_ETIA12204_7519551_AAaSXA3IKH
##JCAMPDX= 6.0         $$ Bruker NMR JCAMP-DX V2.0
##DATA TYPE= NMR SPECTRUM
##DATA CLASS= NTUPLES
##ORIGIN= BRUKER
##OWNER= Administrator
$$ 1.72 TOPSPIN		Version 2.1
$$ 2013-02-19 18:40:19.366 -0500  Administrator@X
$$ Compression mode = diff/dup
##.OBSERVE FREQUENCY= 400.02188249412
##.OBSERVE NUCLEUS= ^1H
##.ACQUISITION MODE= SIMULTANEOUS (DQD)
##.ACQUISITION SCHEME= undefined
##.AVERAGES= 8
##.DIGITISER RES= 22
##SPECTROMETER/DATA SYSTEM= spect
##.PULSE SEQUENCE= zg30
##.SOLVENT NAME= COFFEE_meoh
##.SHIFT REFERENCE= INTERNAL, COFFEE_meoh, 1, 14.98509
##AUDIT TRAIL= $$ (NUMBER, WHEN, WHO, WHERE, PROCESS, VERSION, WHAT)
$$ ##TITLE= Audit trail, TOPSPIN		Version 2.1
$$ ##JCAMPDX= 5.01
$$ ##ORIGIN= Bruker BioSpin GmbH
$$ ##OWNER= Administrator
$$ $$ E:\/data/COFFEE/nmr/AC1392_ETIA12204_7519551_AAaSXA3IKH/10/pdata/1/auditp.txt
$$ ##AUDIT TRAIL=  $$ (NUMBER, WHEN, WHO, WHERE, PROCESS, VERSION, WHAT)
(   1,<2013-02-19 18:40:10.602 -0500>,<Administrator>,<X>,<go>,<TOPSPIN 2.1>,
      <created by zg
	started at 2013-02-19 18:39:04.522 -0500,
	POWCHK enabled, PULCHK disabled,
       configuration hash MD5:
       86 BA 57 50 F2 9D 5C 9B 26 00 A9 28 5F 66 2E 89
       data hash MD5: 64K
       8A 36 E2 78 5B FB A6 B2 50 4E BE 93 7E 6C 75 2C>)
(   2,<2013-02-19 18:40:13.988 -0500>,<Administrator>,<X>,<proc1d>,<TOPSPIN 2.1>,
      <Start of raw data processing
       efp LB = 0 FT_mod = 6 PKNL = 1 PHC0 = 0 PHC1 = 0 SI = 32K 
       data hash MD5: 32K
       0A 42 70 73 7A 3D 17 48 CC 69 CC C0 D3 8F 17 FB>)
(   3,<2013-02-19 18:40:14.493 -0500>,<Administrator>,<X>,<proc1d>,<TOPSPIN 2.1>,
      <pk PHC0 = 73.45459 PHC1 = 0 
       data hash MD5: 32K
       E8 47 0E DF 7B F4 D5 CE A1 6A DB 7E 4F 08 37 55>)
(   4,<2013-02-19 18:40:14.746 -0500>,<Administrator>,<X>,<proc1d>,<TOPSPIN 2.1>,
      <abs ABSG = 1 
       data hash MD5: 32K
       E7 D4 FD 30 A6 A1 61 32 E4 CE 32 ED 6A 96 9A 24>)
(   5,<2013-02-19 18:40:14.914 -0500>,<Administrator>,<X>,<proc1d>,<TOPSPIN 2.1>,
      <abs ABSG = 2 
       data hash MD5: 32K
       A5 DC FB C8 52 93 5C D4 31 7C 8F 89 02 38 EC 9E>)
(   6,<2013-02-19 18:40:15.083 -0500>,<Administrator>,<X>,<proc1d>,<TOPSPIN 2.1>,
      <abs ABSG = 3 
       data hash MD5: 32K
       41 E9 AF 78 56 AD E4 E1 9C E6 FF EC 92 6F 4D 52>)
(   7,<2013-02-19 18:40:15.268 -0500>,<Administrator>,<X>,<proc1d>,<TOPSPIN 2.1>,
      <abs ABSG = 4 
       data hash MD5: 32K
       76 AC E0 3A E4 F9 B1 42 1D 8E C6 E0 E6 BB 73 85>)
(   8,<2013-02-19 18:40:15.419 -0500>,<Administrator>,<X>,<proc1d>,<TOPSPIN 2.1>,
      <abs ABSG = 5 
       data hash MD5: 32K
       0B 5A D9 2E 08 02 2A E6 17 EF 27 D3 9F C3 C0 C0>)
$$ ##END=
$$ 
$$ $$ hash MD5
$$ $$ 0C 04 58 31 08 87 1E F6 A8 FA 2E E7 C7 E5 01 00
##$RELAX= 
##$RELAX= 
##$RELAX= 
##$RELAX= 
##$RELAX= 
##$RELAX= 
##$RELAX= 
$$ Bruker specific parameters
$$ --------------------------
##$DU= <E:\>
##$EXPNO= 10
##$NAME= <AC1392_ETIA12204_7519551_AAaSXA3IKH>
$$ [...]
150 150 150 150 150 150 150 150
##$TP07= 0
##$TPNAME0= <>
##$TPNAME1= <>
##$TPNAME2= <>
##$TPNAME3= <>
##$TPNAME4= <>
##$TPNAME5= <>
##$TPNAME6= <>
##$TPNAME7= <>
##$TPOAL= (0..7)
0.5 0.5 0.5 0.5 0.5 0.5 0.5 0.5
##$TPOFFS= (0..7)
0 0 0 0 0 0 0 0
##$TUNHIN= 0
##$TUNHOUT= 0
##$TUNXOUT= 0
##$USERA1= <user>
##$USERA2= <user>
##$USERA3= <user>
##$USERA4= <user>
##$USERA5= <user>
##$V9= 5
##$VALIST= <valist>
##$VCLIST= <CCCCCCCCCCCCCCC>
##$VD= 0
##$VDLIST= <DDDDDDDDDDDDDDD>
##$VPLIST= <PPPPPPPPPPPPPPP>
##$VTLIST= <TTTTTTTTTTTTTTT>
##$WBST= 1024
##$WBSW= 4
##$XGAIN= (0..3)
0 0 0 0
##$XL= 0
##$YL= 0
##$YMAX_a= 526148
##$YMIN_a= -514306
##$ZGOPTNS= <>
##$ZL1= 120
##$ZL2= 120
##$ZL3= 120
##$ZL4= 120
##$ABSF1= 14.98509
##$ABSF2= -5.573092
##$ABSG= 5
##$ABSL= 3
##$ALPHA= 0
##$AQORDER= 0
##$ASSFAC= 0
##$ASSFACI= 0
##$ASSFACX= 0
##$ASSWID= 0
##$AUNMP= <proc_prof1d_extract_pilot.lims>
##$AXLEFT= 0
##$AXNAME= <>
##$AXNUC= <1H>
##$AXRIGHT= 0
##$AXTYPE= 0
##$AXUNIT= <>
##$AZFE= 0.1
##$AZFW= 0.1
##$BCFW= 0
##$BC_mod= 0
##$BYTORDP= 0
##$COROFFS= 0
##$CY= 15
##$DATMOD= 1
##$DC= 0
##$DFILT= <>
##$DTYPP= 0
##$F1P= 0
##$F2P= 0
##$FCOR= 0.5
##$FTSIZE= 32768
##$FT_mod= 6
##$GAMMA= 0
##$GB= 0
##$INTBC= 1
##$INTSCL= 1
##$ISEN= 128
##$LB= 0
##$LEV0= 0
##$LPBIN= 0
##$MAXI= 10000
##$MC2= 0
##$MEAN= 0
##$ME_mod= 0
##$MI= 0
##$NCOEF= 0
##$NC_proc= -8
##$NLEV= 6
##$NOISF1= 0
##$NOISF2= 0
##$NSP= 0
##$NTH_PI= 0
##$NZP= 0
##$OFFSET= 14.98509
##$PC= 1
##$PHC0= 73.45459
##$PHC1= 0
##$PH_mod= 1
##$PKNL= yes
##$PPARMOD= 0
##$PPDIAG= 0
##$PPIPTYP= 0
##$PPMPNUM= 2147483647
##$PPRESOL= 1
##$PSCAL= 4
##$PSIGN= 0
##$PYNMP= <proc.py>
##$REVERSE= no
##$SF= 400.02
##$SI= 32768
##$SIGF1= 0
##$SIGF2= 0
##$SINO= 400
##$SIOLD= 32768
##$SPECTYP= <>
##$SREGLST= <1H.CDCl3>
##$SSB= 0
##$STSI= 32768
##$STSR= 0
##$SW_p= 8223.68421052631
##$SYMM= 0
##$S_DEV= 0
##$TDeff= 65536
##$TDoff= 0
##$TI= <>
##$TILT= no
##$TM1= 0
##$TM2= 0
##$TOPLEV= 0
##$USERP1= <user>
##$USERP2= <user>
##$USERP3= <user>
##$USERP4= <user>
##$USERP5= <user>
##$WDW= 1
##$XDIM= 32768
##$YMAX_p= 455409452
##$YMIN_p= -746636
##$CURPLOT= <Network HP LaserJet P1505>
##$CURPRIN= <$Network HP LaserJet P1505>
##$DFORMAT= <normdp>
##$LAYOUT= <+/1D_H.xwp>
##$LFORMAT= <normlp>
##$PFORMAT= <normpl>
##$SURQMSG= 1
$$ End of Bruker specific parameters
$$ ---------------------------------
##NTUPLES= NMR SPECTRUM
##VAR_NAME=  FREQUENCY,     SPECTRUM/REAL,   SPECTRUM/IMAG
##SYMBOL=    X,             R,               I
##VAR_TYPE=  INDEPENDENT,   DEPENDENT,       DEPENDENT
##VAR_FORM=  AFFN,          ASDF,            ASDF
##VAR_DIM=   32768,         32768,           32768
##UNITS=     HZ,            ARBITRARY UNITS, ARBITRARY UNITS
##FACTOR=    0.250966925370066, 1,           1
##FIRST=     8223.43324360094, 21823,        -104321
##LAST=      0,             -14434,          -15927
##MIN=       0,             -746636,         0
##MAX=       8223.43324360094, 455409452,    0
$$ Real data points
##PAGE= N=1
##DATA TABLE= (X++(R..R)), XYDATA
$$ [...]
$$ plain form
19550 -36452 -84807 -247738 -360629 -113023 -138826 -161836 192650 49547 49609 199499 -12247
19538 -212790 -140253 255326 70871 19651 -227780 -179416 -265723 145768 256389 123403
19527 -22987 -9458 -260712 -479981 -121202 160424 97057 -158378 -116210 -63792 -25685 -109845
19516 -109845 -102509 -17225 171781 95390 24164 -272204 -260169 -119986 -114092 25588 98797
19505 98797 235367 -157053 16207 65053 190180 -162508 -345078 -148116 -126185 -203534
19495 -203534 -230966 214002 -41890 -392445 -364867 -105257 -150294 50046 312764 -57347 -157254
19484 -157254 -332478 -58788 -79791 -196173 39588 161115 26521 -37301 75820 -51620 414631
19472 -337123 -176341 208573 -89040 -91730 -544463 -249479 353962 -167948 -53420 -117175
$$ packed form
19550c6452m8355j62931j12891a13023k5803k3010A92650D9547O2J49890a2247
19538b12790P2537B55326G0871A9651b27780M8364q6307A45768J10621A23403
19527b2987i458k51254k19269a21202A60424o3367a58378M2168N2418b5685q4160
19516a09845P336a7225A71781p6391B4164b72204J2035a19986N894B5588P3209
19505I8797J36570a57053A6207M8846J25127a62508j82570a48116K1931p7349
19495b03534k7432B14002d1890l50555K7578a05257m5037E0046K62718e7347r9907
19484a57254j75224e8788k1003j16382C9588J21527B6521c7301G5820e1620D14631
19472c37123J60782B08573h9040k690m52733b49479C53962a67948e3420o3755
$$ plain form
19462 -117175 -204092 165901 278727 146329 -56411 91219 -166070 -91388 150696 7989 184828
19451 184828 -195010 -19150 -47972 105963 -61889 78586 -64380 94681 32808 -48734 -191487
19440 -191487 -160525 -108070 342686 -168957 7780 -984 25533 -100742 93069 167128 -151918
19428 -52307 -129432 353880 205701 -186289 -429806 -141908 21370 -143886 159781 -103409
19417 -129539 219669 -105816 136061 -261677 -234413 59775 -68116 -124263 -18369 -138334
19407 -138334 14164 -316 -15897 85798 72477 -189967 90288 -291505 101768 -138570 -6600
19395 12085 -297230 120308 97251 100556 -276668 -224169 -143892 170058 -241250 -41760 -207508
19384 -207508 -50148 -89974 130713 44051 187378 -190592 -304485 -42349 -193981 -486761
$$ packed form
19462a17175q6917A65901J12826j32398e6411I1219a66070P4682A50696G989J76839
19451A84828a95010a9150k8822A05963f1889G8586f4380I4681C2808d8734j42753
19440a91487L0962N2455C42686a68957G780i84B5533a00742I3069P4059a51918
19428e2307p7125C53880j48179a86289k43517a41908B1370a43886A59781a03409
19417a29539B19669a05816A36061b61677K7264E9775f8116n6147a8369j19965
19407a38334A4164c16j5581H5798j3321a89967I0288b91505A01768a38570f600
19395A2085b97230A20308k3057L305b76668N2499Q0277A70058b41250d1760j65748
19384b07508e0148l9826A30713D4051J43327a90592j13893d2349j51632k92780
$$ plain form
19374 -486761 -114005 19154 -180002 -111881 -447856 81553 -93634 -188770 -209392 -16972 -252284
19363 -252284 -210337 -22771 -29576 -27536 143063 177008 96366 -416819 -188512 -85786 -85788 15027
19350 -24012 -134231 57857 220996 -133242 32352 -78680 -42686 -113002 12262 -341566 9355
19338 -188814 6852 92845 -47142 -89973 231416 105936 40554 -176904 -189387 -121455 -45038
19326 -26060 134743 -180332 -59136 101338 -117774 -183521 -405577 -377977 -75673 110809
19315 80183 399696 -362206 -286426 -54356 -351509 -59492 226591 -125387 -181507 -205504 45823
19303 -556987 -11704 133339 -73076 -108317 -95803 93935 -124338 -300764 -216267 -305672 44086
19291 -122697 -74143 -204272 47639 -428715 84856 -204483 -91946 -273775 230807 -220247
$$ packed form
19374d86761a14005A9154a80002O8121l35975H1553i3634r5136k0622a6972k35312
19363b52284M1947b2771o805K040A43063L3945q0642d16819a88512h5786kA5027
19350b4012j10219E7857J63139a33242C2352g8680L5994p0316A2262c41566I355
19338a88814F852Q5993d7142m2831B31416A05936D0554a76904j2483O7932d5038
19326b6060A34743a80332e9136A01338a17774o5747k22056K7600g5673A10809
19315H0183L19513c62206P5780e4356k97153e9492B26591a25387n6120k3997D5823
19303e56987a1704A33339g3076l5241J2514I3935a24338j76426Q4497q9405D4086
19291a22697M8554j30129D7639d28715H4856b04483i1946j81829B30807b20247
$$ plain form
19280 -241701 -51126 110740 -142664 -133287 229129 -512016 52107 -157051 133077 90538
19270 90538 -290574 -34865 -177826 -34684 -173860 -184808 -89725 128355 -95169 43347 -61011
19258 135497 134750 -80315 -29670 -239396 -98573 -139136 -64428 167957 -104001 -135672 362814
19246 -80267 -84606 -96258 -139731 -8542 -123359 -153088 -33838 -253320 -46050 -201045 -14534
19234 51781 -95094 18030 100510 -234330 4907 -89582 -194514 -65605 8658 100666 163077 2113
19221 -50285 -65150 -92828 -82335 -94564 -18661 -56161 80482 185079 54420 -350013 -256200
19210 -256200 -101943 -234232 19430 -519793 -153056 -73619 36399 -99735 -189085 -82300 77207
19198 44129 -23806 -316027 -24563 -40746 -90833 -209772 116469 -331281 7481 -256444 -106321
$$ packed form
19280b41701e1126A10740a42664R377B29129e12016E2107a57051A33077m2539
19270I0538b90574c4865j42961c4684j39176j0948h9725A28355i5169D3347f1011
19258A35497p47h0315b9670k09726i8573m0563f4428A67957a04001l1671C62814
19246h0267m339j1652m3473h542j14817k9729c3838k19482d6050j54995a4534
19234E1781i5094A8030Q2480b34330D907h9582j04932f5605H658R2008O2411B113
19221e0285j4865k7678J0493j2229a8661l7500H0482J04597E4420c50013R3813
19210b56200a01943j32289A9430e19793a53056g3619C6399i9735q9350h2300G7207
19198D4129b3806k92221b4563j6183n0087j18939A16469c31281G481b56444a06321
$$ plain form
19186 75743 18519 223690 -69514 -199598 190330 -174429 23727 33337 -75610 10367 147444
19175 147444 159885 -62126 -83021 -368148 67476 -226540 -14670 7093 -119092 233670 309342
19164 309342 -348379 -281872 -214001 -93588 -162747 -70905 -71674 -146663 -139799 -69967 -412584 -66026
19151 23505 -4857 27675 -333 98205 224544 -170249 -54862 -46525 -28254 -373270 12979 57014
19139 57014 -163038 -40969 -10986 -248159 -165502 -139746 -35506 -54736 -18855 151600 -161889
19127 17681 -270152 -223759 -28627 125976 37580 -241155 103945 -180557 -186489 -320330 -128836
19115 116909 -98467 -151269 -73655 -357734 -109566 -22723 338197 213188 126118 -91861 92599
19103 -104721 -4238 -96908 -175374 87726 -224935 -257636 -83419 -112621 -101361 205159 -126014
$$ packed form
19186G5743A8519K05171f9514j30084A90330a74429B3727R610g5610A0367J37077
19175A47444J2441f2126k0895k85127F7476b26540a4670G093a19092B33670P5672
19164C09342c48379O6507O7871i3588o9159g0905p69p4989O864O9832l42617f6026
19151B3505d857B7675c33I8205J26339a70249e4862Q337J8271l45016A2979M4035
19139E7014a63038d0969a0986k37173Q2657K5756c5506j9230a8855A51600a61889
19127A7681b70152M6393b8627A25976C7580b41155A03945a80557n932j33841a28836
19115A16909i8467n2802g3655k84079a09566b2723C38197j25009q7070i1861I2599
19103a04721d238r2670p8466H7726b24935l2701h3419k9202J1260B05159a26014
$$ plain form
19091 -231298 -67022 -5701 255049 -338790 16854 90166 -95258 81203 -136132 -268839 61164
19079 -108249 -188438 -67645 32338 -181969 -207382 -97414 147742 381235 -130643 85886 189652
19068 189652 145379 -32748 -137599 359216 11029 259982 -250296 121829 -193155 -279020
19058 -279020 118849 -42468 -96733 35808 86947 -115951 -145123 -125928 -51055 88948 -102018
19046 -456688 109043 141624 178012 -113256 42856 -398851 1781 -94349 250183 39272 -131209
19034 71988 50148 -88190 61526 20465 51297 220765 -211774 126456 -62983 -115281 -162482
19023 -162482 9593 86162 97667 103550 19490 82891 -191179 -64221 187976 55984 -85120
19011 190439 -20560 -301964 101019 -160296 -12497 -361765 269854 63234 -41863 88130
$$ packed form
19091b31298f7022e701B55049c38790A6854P3312i5258H1203a36132j32707F1164
19079a08249q0189f7645C2338a81969k5413i7414A47742K33493a30643H5886J03766
19068A89652m4273c2748j04851C59216A1029K48953b50296A21829a93155q5865
19058b79020A18849d2468n4265C5808N1139a15951k9172J9195e1055H8948a02018
19046d56688A09043L2581L6388a13256D2856c98851A781i4349B50183C9272a31209
19034G1988k1840h8190F1526B0465L0832J69468b11774A26456f2983n2298m7201
19023a62482I593P6569J1505N883A9490O3401a91179f4221A87976E5984h5120
19011A90439b0560k81404A01019a60296a2497l49268B69854F3234d1863H8130
$$ plain form
19000 99340 160409 -6515 112589 126600 53409 -27807 -174904 -282612 -216582 -54672 17122
18988 23910 -145339 -55706 97141 -225395 -72703 5376 224336 -222906 16019 81394 41173
18977 41173 -361977 18250 -147519 14987 -126231 -99997 -200328 -3921 -262948 95630 -113954
18965 -70984 -128018 171066 69957 18156 52727 -269607 -184958 180126 -19553 -200557 -190881
18954 -190881 -86821 -182215 122296 20355 -179406 -60564 -53575 -210501 -1720 -280151 61348
18942 -86789 262457 134829 221462 -173050 242044 102921 -258795 -156707 673 -161517
18931 -39797 -62910 -361429 -33324 -319142 85372 68707 -253482 33021 24018 -173608 354675
18919 -59456 108069 -3626 84823 270051 57600 -250972 -136185 -102573 -138331 -166552 -6945
$$ packed form
19000I9340O1069f515A12589J4011E3409b7807j47097j07708O6030e4672A7122
18988B3910a45339e5706I7141b25395g2703E376K18960b22906A6019O5375m0221
18977D1173c61977A8250a47519A4987a26231K6234j00331c921k59027I5630a13954
18965g0984n7034A71066F9957A8156L4571b69607Q4649A80126a9553j81004R676
18954a90881h6821r5394A22296B0355a79406f0564O989j56926a720k78431F1348
18942h6789B62457j27628Q6633a73050B42044A02921b58795J02088F73a61517
18931c9797k3113k98519c3324k85818H5372j6665b53482C3021r003a73608C54675
18919e9456A08069c626H4823J85228E7600b50972J14787L3612l5758k8221f945
$$ plain form
18907 128936 -78594 -61150 -96236 212440 -293863 -109040 -10414 39706 32394 262434 96210
18895 -234810 108640 -2352 10837 17010 -115923 29413 -108333 -268255 150615 31057 -296279
18883 -238208 -160413 -99830 163804 21321 40213 -1776 103122 -160994 10845 -38655 -126350
18872 -126350 -239547 -66517 -50331 -143108 -310724 235813 61812 -14468 -247061 -111463
18861 -39854 231168 158258 32842 -8975 -276195 -98703 320803 6707 -175023 11152 206330
18850 206330 123349 351762 201093 -148582 32396 108052 -130702 275992 91600 -43808
18839 86063 129092 -37645 -9816 -110517 80233 -146484 -28324 -22742 -326760 -159922 -31372
18827 -59131 -138000 113414 -149295 -131332 155641 -48644 147529 21679 -32857 -28341 -86079
$$ packed form
18907A28936g8594J7444l5086B12440b93863a09040a0414C9706p312K30040I6210
18895b34810A08640b352A0837O173a15923B9413a08333j59922A50615C1057b96279
18883b38208P7795O0583A63804B1321J8892a776A03122a60994A0845c8655q7695
18872a26350j13197f6517J6186r2777j67616B35813F1812a4468k32593a11463
18861c9854B31168p2910C2842h975k67220i8703C20803F707a75023A1152J95178
18850B06330q2981K28413j50669a48582C2396P5656a30702B75992I1600d3808
18839H6063M3029c7645i816j00701H0233a46484b8324N582l04018a59922c1372
18827e9131p8869A13414a49295J7963A55641d8644A47529B1679c2857M516n7738
$$ plain form
18816 -86079 234958 -62930 -216027 15258 217494 161360 8584 346026 41589 64515 -201498
18804 -71023 -98561 -109788 -61455 -55292 85760 63073 58485 199959 -382168 -277315 -221920
18793 -221920 205978 -19018 117116 -190709 -134257 65871 204846 7663 191887 -141419
18782 225966 -485364 -59776 -340087 -59512 36855 27722 -183639 -7107 -195265 -65121 -196503
18771 -196503 102539 -70437 81462 5373 260070 -6434 -432823 -267076 -351750 -98278 106684
18759 -429926 -95115 -215842 -8164 -164760 -275399 -55154 251105 -108943 -196306 -35503 -105307
18748 -105307 -111966 83419 -114659 -37059 -154125 63435 -40646 -319663 10748 -192077 221462
18736 128292 -53965 -351973 -55739 -318104 -113203 11179 -272966 -239149 195301 -253787
$$ packed form
18816h6079B34958f2930j53097A5258K02236n6134H584L37442D1589K2926b01498
18804g1023k7538j1227M8333O163H5760k2687m588J41474c82168J04853N5395
18793b21920B05978a9018A17116a90709N6452F5871J38975G663J84224a41419
18782B25966d85364e9776k80311e9512C6855r133a83639g107j88158f5121j31382
18771a96503A02539g0437H1462E373K54697f434m26389J65747q4674i8278A06684
18759d29926i5115j20727h164j56596j10639e5154B51105a08943q7363c5503o9804
18748a05307o659H3419a14659c7059j17066F3435d0646k79017A0748a92077B21462
18736A28292e3965k98008e5739k62365a13203A1179b72966L3817A95301b53787
$$ plain form
18725 -110386 -125422 286333 -81989 -97976 -82997 44045 120048 107392 -171360 148283 -185278
18713 15700 -316022 -259335 88104 -176961 6266 236984 202815 -388173 44485 14510 101758
18702 101758 -474340 94661 -166384 209860 -58227 -53022 202766 -6425 114207 -182179 -88293
18690 -120524 55035 -83015 -307894 66737 84360 67175 17743 34393 -107845 -150015 29601
18678 258136 -64073 -297875 101830 -121700 -164871 -246366 211029 59601 -39747 -282529
18668 -282529 -21281 -191633 99721 84949 76141 -248343 120700 -16347 42558 43425 58024
18657 58024 -49264 -237004 -245550 323948 176277 -558062 -121482 -73082 93381 -52781 -170552
18646 -170552 180700 -224391 34521 -208298 -48578 -16182 133788 -226345 -216339 194173
$$ packed form
18725a10386j5036B86333h1989j5987J4979D4045P6003j2656a71360A48283a85278
18713A5700c16022N6687H8104a76961F266K30718l4169c88173D4485A4510Q7248
18702A01758d74340I4661a66384B09860e8227N205B02766f425A14207a82179h8293
18690a20524E5035h3015k24879F6737J7623j7185A7743J6650a07845m2170B9601
18678B58136f4073k33802A01830a21700m3171q1495B11029E9601c9747k42782
18668b82529b1281j70352I9721j4772q808b48343A20700a6347D2558Q67J4599
18657E8024d9264j87740q546C23948j47671e58062a21482M8400I3381e2781j17771
18646a70552A80700b24391C4521b08298d8578a6182A33788b26345J0006A94173
$$ plain form
18635 -284696 -199760 149778 -251800 -10171 -193607 -7989 -39166 213511 -351695 -293747 -162200
18624 -162200 -135476 166343 60393 -467400 122119 -59775 103537 278901 -71037 15302
18613 -87477 156366 -166896 -38711 -151039 -319567 -219379 157359 -211376 -159246 -99344
18603 -99344 136830 -29291 137341 -226736 -147407 -110347 256173 -306752 312112 -88760
18592 -73972 -138966 125005 -123377 260584 -87268 -39594 67331 -55598 -156060 6523 74610
18581 74610 -72396 -47186 -121729 8354 -86134 -113999 -130101 117415 94769 -194338 -10416
18569 151860 -156057 91221 343598 219035 146772 -182664 -175707 -258763 -161292 -7003 -108517
18558 -108517 276625 145854 116459 -275467 -98617 110741 -275541 134547 -18187 -183409
$$ packed form
18635b84696Q4936A49778b51800a0171j83436g989l1177B13511c51695N7948J31547
18624a62200K6724A66343F0393d67400A22119e9775A03537J75364g1037A5302
18613h7477A56366a66896c8711j12328j68528J00188A57359b11376N2130N9902
18603i9344A36830b9291A37341b26736P9329L7060B56173c06752C12112h8760
18592g3972o4994A25005a23377B60584h7268c9594F7331e5598j00462F523O8087
18581G4610g2396K5210p4543H354h6134k7865j6102A17415k2646a94338a0416
18569A51860a56057I1221K52377j24563p2263a82664O957q3056R7471g003j01514
18558a08517B76625j30771k9395b75467i8617A10741b75541A34547a8187j65222
$$ plain form
18548 -183409 -10056 -57737 80296 -94148 83676 -293704 -184411 -227116 186568 -192320 267993
18536 -27051 -47590 -179689 118512 10676 41872 -169340 22997 -25455 -129323 -195674 -80475
18524 -114457 -114544 -82496 79176 144931 -36023 -173763 204581 -363494 -128919 -282040 -145027
18513 -145027 -260471 88552 -344150 38737 80092 -300946 -338737 -153337 -200963 -196012 -139212
18502 -139212 246097 -11738 -70899 -252066 49159 154302 82649 -259969 -21193 -209307
18492 -209307 -50866 -55916 -195208 -69191 -218735 -193430 233565 -192727 -161359 86852 -152822
18480 -143304 -200158 85456 232702 83322 18698 -84005 53341 -92116 -148501 98274 -30273
18468 286756 401452 -117313 -210942 381043 -137997 -49856 -409577 -48075 -45319 -274909
$$ packed form
18548a83409a0056m7681H0296i4148H3676b93704J09293m2705A86568a92320B67993
18536b7051k0539j32099A18512A0676L1196a69340B2997b5455j03868o6351h0475
18524a14457q7L2048G9176O5755c6023j37740B04581c63494a28919j53121J37013
18513a45027j15444H8552c44150C8737M1355c00946l7791a53337m7626M951N6800
18502a39212B46097a1738n9161j81167D9159J05143p1653b59969b1193j88114
18492b09307e0866n050j39292f9191j49544K5305B33565a92727L1368H6852a52822
18480a43304n6854H5456J47246H3322A8698h4005E3341i2116n6385I8274c0273
18468B86756J14696a17313r3629C81043a37997d9856l59721d8075K756k29590
$$ plain form
18458 -274909 50388 -203244 32095 -219748 -164928 88278 97833 -111423 126217 -70937 -10165
18446 -60658 155377 59710 3057 59818 181225 -80881 -267396 -146788 102794 79844 143620
18435 143620 19690 -195243 -141443 44768 146932 40513 -56033 -55363 341853 144420 -89514
18423 38174 -237798 132228 16825 -80623 -369161 -107757 -330128 -27571 191893 55533
18412 21159 -100246 -150517 389074 56629 34223 -163020 335912 -79597 -182141 68041 -17180
18400 -223361 193722 -40052 15084 -116924 153423 -46319 110068 -69336 -138911 250954
18389 -106390 -29128 -251578 138960 181109 112938 -37017 -303685 305467 63960 145021 39230
18377 -101806 -195568 -62869 -246605 -14690 354746 -44440 -62781 205500 -140336 270461
$$ packed form
18458b74909E0388b03244C2095b19748N4820H8278R555a11423A26217g0937a0165
18446f0658A55377E9710C057N6761J21407h0881j86515J20608A02794k2950O3776
18435A43620A9690a95243N3800D4768J02164D0513e6033O70C41853A44420h9514
18423C8174b37798A32228A6825h0623k88538a07757k22371b7571A91893E5533
18412B1159a00246n0271C89074E6629k2406a63020C35912g9597j02544F8041a7180
18400b23361A93722d0052A5084a16924A53423d6319A10068f9336o9575B50954
18389a06390b9128k22450A38960M2149o8171c7017k66668C05467F3960Q1061C9230
18377a01806r3762f2869j83736a4690C54746d4440j8341B05500a40336B70461
$$ plain form
18366 -123953 287017 133497 55830 152178 392244 201765 -53366 -179361 -270710 -296358
18356 -296358 169814 -264158 -74951 -198948 -153312 -247075 159220 -245959 -78597 -124156
18346 -124156 94784 443926 -199696 -275540 -201784 53248 -225868 307685 -22794 -154762
18336 -154762 3479 265729 -46799 -33248 -9513 -416325 -66152 198426 -176875 -68694 -169248
18325 -169248 -174417 -96061 -17680 -456951 -3121 -201830 98790 -334487 -111810 -302329 44808
18313 -263487 32419 -315817 -331057 -122951 80345 154387 -70701 4407 -36345 -265934 208078
18301 -62472 144788 90946 140179 186382 205306 243710 279754 -174871 4410 154649 134450
18290 134450 -57909 -179044 -37523 144960 -150228 -228904 -182552 -92532 -143716 48846 -170546
$$ packed form
18366a23953B87017A33497E5830R6348K40066j90479e3366j25995r1349k5648
18356b96358A69814b64158g4951j23997M5636r3763A59220b45959g8597m5559
18346a24156I4784L49142a99696p5844P3756E3248b25868C07685b2794j31968
18336a54762C479K62250d6799J3551i513m06812f6152A98426a76875f8694j00554
18325a69248n169P8356a7680m39271c121j98709I8790c34487a11810j90519D4808
18313b63487C2419c15817j5240a22951H0345P4042g0701D407c6345k29589B08078
18301f2472A44788n3842M9233M6203J8924L8404L6044a74871D410J50239k0199
18290A34450e7909j21135c7523A44960a50228p8676M6352R0020n1184D8846a70546
$$ plain form
18278 -120891 187222 -65391 -21133 -398878 -54365 -123750 -44337 -346428 -254897 -56219 -67372
18267 -67372 189149 98096 35729 -29833 371575 -10025 31152 18533 -28589 356597 -151015
18255 56733 -17025 46379 -122717 -85020 372016 54694 77591 53786 -56720 10124 -147288
18243 154036 -12631 -255707 83015 -128637 -11995 -329422 -223652 -337587 12043 58410
18233 58410 -49594 23992 -18618 -277141 243678 -22802 -99959 -90892 158195 -67107 146521
18221 -246570 70575 -108937 -336239 -175256 -45940 205392 -169325 -72612 -460640 208710
18210 -59904 -34829 -12860 9708 -94897 -212259 -153110 102590 59239 -20688 -93789 133875
18198 139641 -55086 171073 50812 -165049 300706 179626 188869 -261145 174623 -208101
$$ packed form
18278a20891A87222f5391b1133l77745e4365o9385d4337l02091R1531e6219j1153
18267f7372A89149r1053C5729b9833C71575a0025C1152j2619b8589C56597a51015
18255E6733a7025D6379a22717L7697C72016E4694K2897k3805e6720A0124a47288
18243A54036a2631k43076H3015a28637a1995l17427J05770j13935A2043M6367
18233E8410d9594B3992a8618k58523B43678b2802p7157R067A58195f7107A46521
18221b46570G0575a08937k27302J60983d5940B05392a69325g2612l88028B08710
18210e9904K5075a2860I708i4897j17362N9149A02590m3351b0688p3101A33875
18198A39641e5086A71073E0812a65049C00706j21080R243b61145A74623b08101
$$ plain form
18187 248822 64209 -35070 267779 -61780 -205128 -10122 -151907 264797 -57512 -128707 112437
18175 -31513 114828 -22994 106929 -126441 -250761 -92117 -160220 -209636 -98448 -121080 -10435
18163 -111578 -145171 -259683 134201 402648 106512 -153256 -51266 217163 -88360 -15558
18152 -132737 -263213 112842 -218354 -19915 77144 -108669 -348029 -392932 -73298 143482
18141 190303 -116106 61601 -126831 176354 135187 329307 -172889 -232876 86390 40490
18130 22442 61960 211121 -238797 159159 -120368 245221 10136 -118453 206124 134718
18120 134718 -333337 133756 -103451 -9967 -24727 -98079 -2477 -76598 -218107 -238933 -102055
18108 98098 75172 26201 286556 -307144 -120166 -64942 206992 -86806 -253341 92480 147840
$$ packed form
18187B48822F4209c5070B67779f1780j43348a0122j41785B64797e7512p1195A12437
18175c1513A14828b2994A06929a26441j24320i2117o8103m9416i8448k2632a0435
18163a11578l3593j14512A34201K68447A06512a53256e1266B17163h8360a5558
18152a32737j30476A12842b18354a9915G7144a08669k39360m4903g3298A43482
18141A90303a16106F1601a26831A76354m1167J94120a72889n9987H6390D0490
18130B2442L9518J49161b38797A59159a20368B45221A0136a18453B06124p1406
18120A34718c33337A33756a03451i967j4760p3352b477p4121j41509k0826a02055
18108I8098k2926B6201K60355c07144a20166N5224B06992h6806j66535I2480N5360
$$ plain form
18097 147840 -196826 -486682 1118 -126982 -18017 -91606 -32425 -177968 -197872 -356213 -164725
18085 -180769 -141006 20854 -33187 -259918 -155768 126997 187286 -178284 52531 258831
18075 258831 -48294 -125068 -265892 -71333 -76466 -230120 -232547 -172797 -111874 -114501 -203853 240304
18062 -230625 -311652 -107464 -45498 61284 -38015 324431 -171727 107373 -3888 15484 95686
18051 95686 -199953 9953 13680 -146045 7172 21054 -202599 -257724 61966 -108178 -70340
18040 -70340 54043 -191993 164191 -259112 158071 -8455 47926 411669 -121736 163894
18029 -113474 -94191 5648 337573 -10930 -52538 -51835 46563 122336 92372 -63936 -12129 -26810
18017 -26810 -142807 -380145 -49453 16099 163301 103875 134627 -96691 -87836 -135929 -155181
$$ packed form
18097A47840a96826k89856A118a26982a8017p3589c2425j45543j9904j58341a64725
18085a80769L9763B0854c3187k26731J04150A26997O0289a78284E2531K06300
18075B58831d8294p6774j40824g1333n133j53654k427N9750O0923k627q9352B40304
18062b30625q1027a07464d5498F1284c8015C24431a71727A07373c888A5484Q0202
18051I5686a99953I953L727a46045G172J3882b02599n5125F1966a08178L7838
18040g0340E4043a91993A64191b59112A58071h455D7926L63743a21736A63894
18029a13474J9283E648L31925a0930m1608P03D6563P5773k9964f3936a2129j4681
18017b6810j15997k37338d9453A6099J47202n9426L0752i6691Q855m8093j9252
$$ plain form
18006 -155181 -258686 44467 193286 309157 -33589 60314 115847 180191 42796 -145508 186982
17994 -204994 -66551 -66092 1334 -95025 -74349 186165 -105397 -342566 -502003 205469 -23923
17982 -98783 -282229 -188934 183018 152198 -154370 -53005 -256184 -200359 263577 -1924 -13725
17971 -13725 -26654 -182217 59743 -81066 208154 -298933 174664 -151052 27295 104898 -100495
17959 138732 -36047 -51440 192393 -325926 97628 -62825 47384 -185655 -206910 14452 23638
17948 23638 70951 -75503 -400740 14147 230001 -43706 13699 166552 98782 -192995 -204781
17937 -204781 509744 -11774 -339397 287505 -137898 -141272 -257584 -110055 -47489 -106667
17927 -106667 -26837 -240481 -22691 38126 -165948 71936 -175129 153330 -40928 -30353 13161
$$ packed form
18006a55181j03505D4467J48819J15871c3589F0314N5533O4344D2796a45508A86982
17994b04994f6551M59A334i5025K0676A86165a05397k37169j59437B05469b3923
17982i8783j83446R3295A83018l0820a54370e3005k03179N5825B63577a924j1801
17971a3725j2929j55563E9743h1066B08154b98933A74664a51052B7295P7603a00495
17959A38732c6047j5393A92393c25926I7628f2825D7384a85655k1255A4452R186
17948B3638M7313g5503l25237A4147K15854d3706A3699J52853o7770a92995j1786
17937b04781E09744a1774l27623B87505a37898l374j16312a10055d7489n9178
17927a06667b6837k13644b2691C8126a65948G1936a75129A53330d0928J0575A3161
$$ plain form
17915 209792 -145841 -81115 -91399 -226835 -348711 235049 21960 -91735 209494 -352530
17904 -1633 127165 -396 434783 88693 -72593 73939 -21978 61229 -19427 -15366 -35527 -165929
17892 -165929 37378 55288 -446453 -6582 -108371 163574 -33946 -34706 -76815 23354 -99837
17880 -148438 -64353 -201964 213810 215969 -99396 -6884 -56903 -17443 -387806 -167530 -27545
17868 -93993 -70785 69531 -14817 -206486 -208047 -48587 115297 -165521 -151378 184979 -48401
17856 -119953 89526 -162697 -232045 -175558 165039 -269828 135268 -104560 -302332 -38535
17845 -219078 160473 -250683 251543 -399458 89042 292110 -69740 122352 142157 97624
17835 97624 220110 -299100 -3635 -62391 148675 9613 52797 -164742 -1224 130240 165619
$$ packed form
17915B09792a45841O4726j0284j35436j21876B35049B1960i1735B09494c52530
17904a633A27165c96D34783H8693g2593G3939b1978F1229a9427M061k0161j30402
17892a65929C7378J7910d46453f582j01789A63574c3946p60m2109B3354i9837
17880a48438f4353j37611B13810K159i9396f884n0019a7443l70363a67530b7545
17868i3993K3208F9531a4817j91669j561d8587A15297a65521J4143A84979d8401
17856a19953H9526a62697o9348N6487A65039b69828A35268a04560j97772c8535
17845b19078A60473b50683B51543c99458H9042K03068f9740A22352J9805m4533
17835I7624J22486b99100c635n8756A48675I613M3184a64742a224A30240L5379
$$ plain form
17824 165619 169480 76110 13870 44783 318488 110272 134916 21628 -272994 180197 89819
17812 392523 193663 -145620 174735 -96919 16293 -211943 199973 -159959 -172275 -156836
17802 -156836 -119327 195398 -220087 -136759 -122008 101773 -159627 46914 -55220 -19202 -43803
17791 -43803 -155600 -159859 -350700 -59754 -50270 -112697 -200240 149044 126831 -63460 -252990
17780 -252990 -6886 211169 159574 36168 360330 -28814 -247089 2913 184802 -69423 -215360
17769 -215360 37165 -26010 -80199 -13494 167667 334753 191271 -517716 174206 410041
17759 410041 21122 -250186 45886 174774 -237601 134388 98690 376175 -307225 -120142
17748 54319 178839 -483939 -140262 -350000 18297 -146814 -6846 -281561 -30581 -238175
$$ packed form
17824A65619L861G6110A3870L0913K73705A10272K4644B1628b72994A80197H9819
17812C92523A93663a45620A74735i6919A6293b11943A99973a59959j2316J5439
17802a56836L7509A95398b20087Q3328J4751A01773a59627D6914e5220a9202k4601
17791d3803j11797m259j90841e9754R484o2427q7543A49044k2213f3460j89530
17780b52990f886B11169n1595C6168L24162b8814k18275B913J81889f9423j45937
17769b15360C7165b6010n4189a3494A67667J67086j43482e17716A74206K35835
17759D10041B1122b50186D5886J28888b37601A34388l5698K77485c07225a20142
17748E4319J24520d83939a40262k09738A8297a46814f846k74715c0581k07594
$$ plain form
17738 -238175 -133665 161143 43898 136578 55271 77003 89174 192640 -57096 313468 319745
17727 319745 157406 27536 -34763 95823 26209 252542 -271367 106686 -179580 -38863
17716 21707 -185252 106105 304389 59494 -172291 145828 499589 214945 -146950 -29259
17705 -449357 -306850 171377 97369 280538 -133692 71713 -44683 205672 66569 -142321
17694 4569 127253 224872 79460 -25135 -231967 86998 92201 -240252 -208561 -70044 -159049
17683 -159049 151604 -45103 217502 129193 -57937 -211610 78185 217932 167961 35509 87998
17672 87998 143446 222599 -153175 -127444 -291294 -31234 -258993 60438 152736 -197768 -236073
17661 -236073 97057 312128 -128739 234168 -167160 -121199 92663 179673 386858 -105591
$$ packed form
17738b38175J04510A61143D3898R2680E5271K1732J2171J03466e7096C13468O277
17727C19745A57406B7536c4763I5823B6209K26333b71367A06686a79580c8863
17716B1707a85252A06105J98284E9494a72291A45828L53761B14945a46950b9259
17705d49357J42507A71377p4008J83169a33692G1713d4683B05672F6569a42321
17694D569J22684R7619G9460b5135k06832H6998N203b40252L1691g0044q9005
17683a59049A51604d5103B17502q8309e7937j53673G8185J39747m9971C5509N2489
17672H7998N5448P9153a53175K5731j63850c1234k27759F0438R2298a97768l8305
17661b36073I7057K15071a28739B34168a67160M5961I2663Q7010K07185a05591
$$ plain form
17650 -59526 -257882 190158 -437473 391758 121838 112296 48280 447659 74884 -109717
17639 24486 -157642 294283 -124147 -16149 -24743 32862 166332 -164191 344641 -299110
17628 -218867 -26781 -269775 104868 156404 -49906 89917 46007 287685 -235851 -135568
17618 -135568 -32698 -108298 -4073 296417 -291889 165950 -4095 -25604 -195981 177406 -64482
17606 327507 -35392 22935 297704 180239 202828 -102104 -209037 -86868 125113 -345387
17595 133162 193405 68782 -370831 -42696 178466 8293 -125051 -235453 -176845 141743 310052
17584 310052 -126919 426072 260842 26546 -9477 -59505 203325 31624 193299 46674 -46056
17572 81408 -21504 -36522 15254 -24319 48001 -358224 -74928 41331 228616 221879 -22931
$$ packed form
17650e9526j98356A90158d37473C91758A21838r542D8280L99379G4884a09717
17639B4486a57642B94283a24147a6149q594C2862J33470a64191C44641b99110
17628b18867b6781k42994A04868N1536d9906H9917m3910K41678b35851J00283
17618a35568c2698p5600d073B96417b91889A65950d095k1509j70377A77406f4482
17606C27507c5392B2935K74769j17465K2589a02104j06933h6868A25113c45387
17595A33162O0243F8782c70831d2696A78466H293a25051j10402N8608A41743J68309
17584C10052a26919D26072j65230B6546i477n0028B03325C1624J61675D6674d6056
17572H1408b1504j5018A5254b4319D8001c58224g4928D1331J87285o737b2931
$$ plain form
17560 49751 83085 -93368 234101 77976 -127397 22054 266993 -93781 -38304 70273 -142414
17548 108856 124880 41282 167598 105875 370761 113233 23218 -22744 48899 256519 19535
17536 222046 -63142 138388 -298879 -11993 293227 120085 89618 54708 -71108 -113596 230989
17524 131783 -128522 -27705 98233 -20853 -21177 192309 -38984 250402 54807 106131 143373
17513 143373 -55325 266382 117529 173269 167267 191966 -32567 61512 170141 8239 191962
17502 191962 -56265 12402 -118936 -92679 181721 60838 11519 -173819 161856 8367 -33793
17490 12649 187541 59011 125639 115484 72208 67453 27744 182321 -128365 215421 116221
17479 116221 111452 205403 486351 164862 -49112 -11876 -2497 64007 -116389 196733 138533
$$ packed form
17560D9751L3334i3368B34101G7976a27397B2054K44939i3781c8304G0273a42414
17548A08856J6024D1282J26316o1723K64886A13233B3218b2744D8899K07620A9535
17536B22046f3142A38388b98879a1993B93227A20085l0467l4910g1108m2488B30989
17524A31783a28522b7705I8233b0853l24A92309c8984B50402E4807N1324L7242
17513A43373e5325B66382A17529N5740o002K4699c2567F1512J08629H239J83723
17502A91962e6265A2402a18936K6257A81721F0838A1519a73819A61856H367c3793
17490A2649J74892E9011O6628j0155m3276m755B7744J54577a28365B15421r9200
17479A16221m769R3951K80948A64862d9112a1876b497F4007a16389A96733n8200
$$ plain form
17468 138533 67714 -11836 220074 -48171 66121 185023 73924 6418 90596 305569 127150
17456 170682 -67374 -89475 335997 386658 257220 75502 152282 160877 246397 142460 378123
17445 378123 141076 126671 277183 215186 52735 222465 132504 402532 285463 439006
17435 439006 452794 308835 216251 383710 218027 204840 226687 -99 289010 414416 106267
17423 -7563 -50938 182266 351164 -65498 327495 257169 101975 108060 309974 303578 226983
17412 226983 115786 -104307 178241 273106 46887 29307 -25565 142592 223561 98518 99474
17401 99474 194099 226193 -193929 156776 89803 328605 266505 -154813 -27489 154263 106230
17390 106230 30862 252737 188195 211690 145880 111344 51119 201513 -29834 57475 162835
$$ packed form
17468A38533F7714a1836B20074d8171F6121J18902G3924F418Q4178K14973A27150
17456A70682f7374k2101C35997N0661j29438G5502P6780Q595Q5520j03937K35663
17445C78123A41076j4405J50512o1997E2735J69730q9961K70028j17069J53543
17435D39006J3788j43959r2584J67459j65683j3187K1847i9B89010J25406A06267
17423g563m3375A82266J68898f5498C27495p0326A01975O085K01914o396p6595
17412B26983j11197a04307A78241R4865D6887j7580b5565A42592Q0969I8518R56
17401I9474R4625L2094a93929A56776o6973K38802o2100a54813b7489A54263m8033
17390A06230C0862K21875o4542K3495o5810l4536E1119J50394b9834E7475J05360
$$ plain form
17379 162835 152900 151702 356202 -162 354395 155969 297362 174846 -47848 138980 -8415
17367 -89928 95752 -9830 55993 -150994 364842 358941 61624 -73876 538905 195682 28584
17355 424347 48832 682899 132461 206852 -156794 210984 -284045 -34153 -39666 -169193
17345 -169193 -10155 302595 233125 87529 324522 243968 136980 411424 -195131 205483
17334 81932 340989 71253 322537 38326 13402 -155288 64852 120020 112405 62224 52148
17323 52148 148059 -188156 86627 39651 57993 127399 288693 101794 352232 214976 221494
17312 221494 297970 -259965 -17592 356358 142193 -185975 230522 131719 161128 -1393 124776
17300 15477 114610 165878 19262 134408 192933 97211 231137 -34745 14729 299828 117807
$$ packed form
17379A62835r935j198K04500a62C54395A55969J41393j22516d7848A38980h415
17367h9928I5752i830E5993a50994C64842n901F1624g3876E38905A95682B8584
17355D24347D8832O34067A32461P4391a56794B10984b84045c4153n513j29527
17345a69193a0155C02595o9470H7529K36993q0554j06988K74444a95131B05483
17334H1932K59057G1253K51284C8326A3402a55288F4852N5168p615n0181j0076
17323E2148R5911a88156H6627C9651J8342O9406J61294A01794K50438j37256O518
17312B21494P6476b59965a7592C56358A42193a85975B30522r8803K9409a393A24776
17300A5477R9133N1268A9262J15146N8525r5722J33926c4745A4729K85099A17807
$$ plain form
17288 -47207 232817 14970 102072 63966 151546 196127 186724 205733 158199 289301 -32662
17276 -242008 284002 224972 58076 137159 -4206 135475 51666 44269 -13857 262756 171487
17265 171487 448497 430411 -30780 175835 34700 88350 382663 277740 20598 38267 461124
17254 461124 219568 176291 391306 -233806 63901 22759 213939 -40627 49777 160864
17244 160864 77006 256349 234194 92860 200708 109899 213328 42802 242350 356724
17234 356724 94544 -20773 67759 665587 224985 344360 -36109 220790 179733 356146
17224 356146 511720 -174315 198108 203504 302404 -63741 82784 124376 50253 6426 280985
17213 280985 442954 201717 229486 240996 -36008 -194039 156726 269412 189195 221423
$$ packed form
17288d7207B32817A4970Q7102l8106Q7580M4581r403J9009m7534J31102c2662
17276b42008B84002n9030E8076P9083d206A35475E1666p397a3857B62756r1269
17265A71487K77010j8086c0780A75835C4700N3650K94313j04923B0598J7669M22857
17254D61124B19568m3277K15015b33806F3901B2759J91180d0627D9777J11087
17244A60864G7006J79343k2155I2860J07848r0809J03429D2802J99548J14374
17234C56724I4544b0773F7759N97828B24985J19375c6109B20790m1057J76413
17224C56146J55574a74315A98108N396R8900f3741H2784M1592E0253F426K74559
17213B80985J61969B01717K7769J1510c6008j58031A56726J12686q0217L2228
$$ plain form
17203 221423 39431 277671 272982 398069 353196 85262 280781 288650 -173448 213151 182226
17192 182226 149994 325630 312406 322419 302018 285930 221728 -107254 112202 -68985 278267
17180 221910 220399 260767 376436 82565 85776 -107974 299113 229575 294731 458091 72820
17168 256060 542098 229314 692264 216974 235409 712096 276738 12503 423541 410321
17158 410321 657538 361640 379188 95801 -35928 176490 466332 350596 305487 -141345
17147 347404 492278 553912 160842 216736 364545 368671 181919 60485 -27168 298930 322704
17136 322704 411918 401323 425069 353046 466580 497537 204561 265028 214686 615319 174445
17124 277248 516420 254566 253078 285262 76080 607824 378721 477254 493615 403420 677387
$$ packed form
17203B21423C9431K38240m689J25087m4873H5262J95519P869a73448B13151l0925
17192A82226l2232J75636j3224J0013k0401j6088o4202a07254A12202f8985B78267
17180B21910j511M0368J15669H2565L211a07974B99113o9538O5156J63360G2820
17168B56060K86038B29314M62950B16974J8435M76687B76738A2503M11038j3220
17158D10321K47217k95898J7548I5801c5928A76490K89842j15736m5109a41345
17147C47404J44874O1634A60842N5894J47809M126A81919F0485b7168B98930K3774
17136C22704Q9214j0595K3746p2023J13534L0957B04561O0467n0342M00633A74445
17124B77248K39172B54566j488L2184G6080N31744k29103R8533J6361r0195K73967
$$ plain form
17113 677387 439955 452829 254837 545170 362540 400492 179256 528299 -58388 189603
17102 558559 11741 724224 413399 283816 290106 415294 31935 379208 306098 512645
17092 512645 507949 197867 -18284 117783 230980 464479 415200 46163 326355 385457 156735
17080 238307 489973 -85853 113848 537263 500490 644706 376855 318934 513544 507477
17070 507477 259268 40203 299190 313695 50711 303570 329902 675537 645807 532437
17060 532437 489504 465648 372431 523989 542217 334870 468556 524666 376740 386740 932655
17049 932655 401422 106138 202176 562056 596533 445929 120514 443784 465167 540061
17039 540061 787613 389907 349462 457065 221270 1008867 306474 422172 454278 500424
$$ packed form
17113F77387k37432J2874j97992K90333j82630L7952A79256L49043e8388A89603
17102E58559A1741P12483l10825j29583O290J25188C1935L47273p3110K06547
17092E12645m696A97867a8284A17783J13197K33499m9279D6163K80192N9102A56735
17080B38307K51666h5853A13848M23415l6773J44216k67851n7921J94610o067
17070E07477k48209D0203K58987J4505E0711K52859K6332L45635k9730j13370
17060E32437m2933k3856r3217J51558J8228k07347J33686N6110j47926J0000N45915
17049I32655D01422A06138R6038L59880L4477j50604A20514L23270K1383P4894
17039E40061K47552C89907m0445J07603B21270P87597C06474J15698L2106M6146
$$ plain form
17029 500424 190597 365169 570671 274971 524365 375246 642581 803152 538746 566195
17019 566195 507896 536611 625993 685536 671682 666723 698912 622935 811667 372753 620963
17008 620963 598169 775030 439590 605431 926113 566337 852670 757402 755250 781223
16998 781223 596556 604531 653529 582601 811979 709289 585265 940757 531242 771689
16988 771689 570338 703480 675242 1048163 744423 631434 895355 925596 897928 604578
16978 604578 589326 840972 920849 825579 740568 594268 652978 1107315 719757 718104 1004040
16967 1004040 804621 756103 859875 880009 1010156 1249452 718998 1077168 918870 831270
16957 831270 715176 677948 552976 1091506 1115974 977814 1095717 690697 751598 643037
$$ packed form
17029E00424A90597J74572K05502B74971K49394j49119K67335J60571k64406K7449
17019E66195n8299K8715Q9382N9543j3854m959L2189p5977J88732C72753K48210
17008F20963k2794J76861l35440J65841L20682l59776K86333r5268k152K5973
16998G81223j84667P975M8998p0928K29378j02690j24024L55492m09515K40447
16988G71689k01351J33142k8238L72921l03740j12989K63921L0241k7668k93350
16978F04578j5252K51646P9877r5270q5011j46300N8710M54337l87558j653K85936
16967A004040j99419m8518J03772K0134J30147K39296n30454L58170j58298q7600
16957H31270j16094l7228j24972N38530K4468j38160J17903m05020O0901j08561
$$ plain form
16947 643037 969997 1254457 1002313 1169831 865134 784299 1022196 983410 1068234 1223712
16937 1223712 1052552 947151 1132500 1125717 1178969 1018175 1129819 1145045 1156406 1293615
16927 1293615 987988 1175540 1250615 1051666 853416 1507055 1269682 1328292 1599163 1141798
16917 1141798 957749 1545650 1318461 1403147 1360838 1490843 811950 1516050 1270434 1334014
16907 1334014 1620947 1382639 1520674 1728323 1414326 1599101 1734339 1222299 1382865
16898 1382865 1440582 1461563 1525217 1658800 1633768 1613379 1540861 1602473 1696559 1591174 1618380
16887 1618380 1727949 1678284 1848702 1791126 1812190 1829802 1923763 1914093 2197226 1730053 1972859
16876 1972859 1862786 1815328 2084731 2181837 1903844 2052880 2079321 2307040 2414770 2666723
$$ packed form
16947F43037L26960K84460k52144J67518l04697q0835K37897l8786Q4824J55478
16937A223712j71160j05401J85349o783N3252j60794J11644J5226J1361J37209
16927A293615l05627J87552P5075j98949j98250O53639k37373N8610K70871m57365
16917A141798j84049N87901k27189Q4686m2309J30005o78893P04100k45616O3580
16907A334014K86933k38308J38035K07649l13997J84775J35238n12040J60566
16898A382865N7717K0981O3654J33583k5032k0389p2518O1612R4086j05385K7206
16887A618380J09569m9665J70418n7576K1064J7612R3961r670K83133m67173K42806
16876A972859j10073m7458K69403R7106k77993J49036K6441K27719J07730K51953
$$ plain form
16866 2666723 2258224 2471435 2222629 2413935 2300913 2504912 2589122 2637470 2842909 2435320
16856 2435320 2801355 2790480 2227377 2810239 2748091 2784707 2975853 3136391 2961537 3195522
16846 3195522 3148416 2934522 2959062 3023732 3375114 3203435 3593999 3243008 3237438 3554840
16836 3554840 3256497 3228699 3570395 3633297 4028962 4053019 3786769 4222305 4090692 3822263
16826 3822263 4182715 4229808 4136064 4243309 4696692 5065777 4446656 5057960 4576480 4905367
16816 4905367 5087620 5237917 5147508 5511774 5724495 5706791 5443174 5992436 5955768 6110237
16806 6110237 6213312 6202938 6308367 6895082 6712587 7041821 6753563 7170967 7506568 7592845
16796 7592845 8136014 8172043 8140691 8460928 8774376 9195652 8942078 9428660 9522555 9646983
$$ packed form
16866B666723m08499K13211k48806J91306j13022K03999Q4210M8348K05439m07589
16856B435320L66035j0875n63103N82862o2148L6616J91146J60538j74854K33985
16846C195522m7106k13894K4540O4670L51382j71679L90564l50991n570L17402
16836C554840k98343k7798L41696O2902L95665K4057k66250M35536j31613k68429
16826C822263L60452M7093r3744J07245M53383L69085o19121O11304m81480L28887
16816D905367J82253J50297r0409L64266K12721j7704k63617N49262l6668J54469
16806F110237J03075j0374J05429N86715j82495L29234k88258M17404L35601Q6277
16796G592845N43169L6029l1352L20237L13448M21276k53574M86582R3895J24428
$$ plain form
16786 9646983 10084896 10151206 10571132 10921677 11594537 11732297 11768159 12608438 12992245 13327774
16776 13327774 13700420 14074355 14618459 15159493 15508797 16080089 16372754 17045767 17998291
16767 17998291 18388908 18913281 19667504 20565859 21545561 22286174 23331114 23974713 25124741
16758 25124741 26111999 27496540 28380782 29705724 31011367 32356357 34095161 35707925
16750 35707925 37346320 39514529 41228630 43615255 45957380 48077986 50827203 53766025
16742 53766025 56920411 60047442 63461003 67467445 71706584 76293239 80823147 86158094
16734 86158094 91473928 97331157 103133077 109815618 116946581 124061380 131307519 139174755
16726 139174755 146961447 154311856 161955898 168889088 174956682 180607217 185602559 188955224
$$ packed form
16786I646983M37913O6310M19926L50545O72860J37760L5862Q40279L83807L35529
16776A3327774L72646L73935N44104N41034L49304N71292K92665O73013R52524
16767A7998291L90617N24373P54223Q98355R79702P40613J044940O43599J150028
16758B5124741R87258J384541Q84242J324942J305643J344990J738804J612764
16750C5707925J638395K168209J714101K386625K342125K120606K749217K938822
16742E3766025L154386L127031L413561M006442M239139M586655M529908N334947
16734H6158094N315834N857229N801920O682541P130963P114799P246139P867236
16726A39174755P786692P350409P644042O933190O067594N650535M995342L352665
$$ plain form
16718 188955224 190974443 191853185 191099801 189068929 186038854 181508704 175454107 169322628
16710 169322628 162409028 154726211 147095433 139264458 131301025 123562135 116523789 109569336
16702 109569336 102758547 96194490 90268271 84732853 79620981 75147626 70292033 66177324
16694 66177324 62316955 58781318 55404833 52091592 49644411 46551756 44354656 42059959
16686 42059959 39971776 37669946 35747579 34189612 32172867 31121021 29567042 28020240
16678 28020240 26544492 25538060 24443564 23544893 22847869 21857998 21062143 20245096 19165250
16669 19165250 18757334 17912761 17139602 16734710 15943491 15584387 14857861 14374727 13974709
16660 13974709 13211715 12780580 12655117 12351673 11864878 11488115 10953765 11028056 10231960
$$ packed form
16718A88955224K019219Q78742p53384k030872l030075m530150o054597o131479
16710A69322628o913600p682817p630778p830975p963433p738890p038346o954453
16702A09569336o810789o564057n926219n535418n111872m473355m855593m114709
16694F6177324l860369l535637l376485l313241k447181l092655k197100k294697
16686D2059959k088183k301830j922367j557967k016745j051846j553979j546802
16678B8020240j475748j006432j094496q98671o97024r89871p95855q17047j079846
16669A9165250m07916q44573p73159m04892p91219l59104p26526m83134m00018
16660A3974709p62994m31135j25463l03444m86795l76763n34350P4291p96096
$$ plain form
16651 10231960 10244237 9752208 9600702 9255038 8992106 8857476 8539793 8279845 8074179
16642 8074179 7879502 7916603 7268270 7298859 7159340 6912665 6698647 6322444 6196065 6286284
16632 6286284 6131678 5982623 6178161 5762930 5567830 5578920 5239605 4994001 5196022 5322983
16622 5322983 4913360 4996728 4721772 4355431 4722912 4417835 4692198 4498277 4115411 3984753
16612 3984753 4167864 4154796 3943868 3586295 3564047 3968970 3399535 3613796 3489314 3702535
16602 3702535 3215155 3020279 3083845 2829469 3322782 2885746 2837525 3154844 2748879 2350133
16592 2350133 3065639 2992999 2559007 2995937 2699927 2653359 2016626 2381500 2302594 2192381
16582 2192381 2284607 2349243 2284748 2381620 2130941 2187539 1829678 2056403 2086994 2049884 2025091
$$ packed form
16651A0231960J2277m92029j51506l45664k62932j34630l17683k59948k05666
16642H074179j94677L7101o48333L0589j39519k46675k14018l76203j26379R0219
16632F286284j54606j49055J95538m15231j95100J1090l39315k45604K02021J26961
16622E322983m09623Q3368k74956l66341L67481l05077K74363j93921l82866j30658
16612C984753J83111j3068k10928l57573k2248M04923n69435K14261j24482K13221
16602C702535m87380j94876O3566k54376M93313m37036m8221L17319m05965l98746
16592B350133P15506p2640m33992M36930k96010m6568o36733L64874p8906j10213
16582B192381R2226O4636o4495R6872k50679N6598l57861K26725L0591l7110k4793
$$ plain form
16571 2025091 2036642 1882338 1679396 1858153 2154537 2036902 1883724 1772051 1734053 1803073
16561 1803073 1743397 1997357 1810762 1850057 1646597 1652051 1610792 1770732 1525835 1294578
16551 1294578 1620834 1255083 1523070 1688074 1329618 1378908 1474696 1244484 956451 1134077
16541 1134077 1107554 1366379 1328647 1394282 1085522 1158658 1539947 1132638 952818 1253194
16531 1253194 991411 1173178 917375 614889 1529560 1316879 1112510 1094163 887530 1021957
16521 1021957 803286 840041 984756 1199023 969607 894381 1115461 901932 1110101 1083203
16511 1083203 882702 1022892 845621 1039431 679242 1041697 1200119 895433 692491
16502 692491 803303 1033423 669579 903337 798191 588952 866184 893789 534046 630681
$$ packed form
16571B025091J1551j54304k02942J78757K96384j17635j53178j11673l7998O9020
16561A803073n9676K53960j86595L9295k03460N454m1259J59940k44897k31257
16551A294578L26256l65751K67987J65004l58456M9290R5788k30212k88033J77626
16541A134077k6523K58825l7732O5635l08760P3136L81289m07309j79820L00376
16531A253194k61783J81767k55803l02486R14671k12681k04369j8347k06633J34427
16521A021957k18671L6755J44715K14267k29416p5226K21080k13529K08169k6898
16511A083203k00501J40190j77271J93810l60189L62455J58422l04686k02942
16502F92491J10812K30120l63844K33758j05146k09239K77232K7605l59743R6635
$$ plain form
16492 630681 927009 870902 883863 413971 674872 788979 840833 482672 453116 648294
16482 648294 626002 655222 609202 543571 1073413 814621 560444 632554 668238 699925 617287
16471 617287 294507 807508 497574 404406 99544 187881 461251 577278 417762 634290
16461 634290 560315 570734 795462 458451 583912 574083 575393 671681 569468 522308 504957
16450 504957 528495 422834 737241 425318 431804 460179 -8990 474903 450525 845750 588179
16439 588179 500251 451148 245709 553711 273421 472606 452967 239145 426935 957792
16429 957792 518843 365860 352445 369835 216529 350240 449122 469102 428822 254675
16419 254675 314541 554394 145857 791094 327651 170562 513580 487817 476133 373075
$$ packed form
16492F30681K96328n6107J2961D13971K60901J14107N1854l58161k9556J95178
16482F48294k2292K9220m6020o5631N29842k58792k54177P2110L5684L1687q2638
16471F17287B94507N13001l09934r3168I9544Q8337K73370J16027j59516K16528
16461F34290p3975J0419K24728l37011J25461r829J310R6288j02213m7160j7351
16450E04957K3538j05661L14407l11923O486K8375h990D74903k4378L95225k57571
16439E88179q7928m9103k05439L08002B73421J99185j9639k13822J87790N30857
16429I57792m38949j52983j3415J7390j53306J33711R8882J9980m0280j74147
16419B54675N9866K39853A45857O45237C27651j57089L43018k5763j1684j03058
$$ plain form
16409 373075 283208 357404 151169 387206 569978 208029 226780 458004 167731 91411
16399 91411 428992 46015 561537 647847 543131 27460 316976 214464 277597 501242
16389 501242 105095 289024 187459 653475 454692 273792 487692 167771 89471 187772
16379 187772 452344 404013 283852 117330 211972 302939 219936 380398 126718 284007
16369 284007 -8057 236987 390421 427719 276892 291680 122772 281619 57834 300268
16359 300268 170055 327493 41149 210631 146610 365120 246463 100019 293723 76060
16348 -54243 98199 214023 182985 203013 307632 -127519 289863 277202 257571 432490 116316
16336 219799 167033 418013 48880 238218 134598 243437 237005 33256 298528 139444
$$ packed form
16409C73075q9867P4196A51169K36037J82772B08029J8751K31224A67731p6320
16399I1411L37581D6015N15522Q6310j04716B7460K89516j02512O3133K23645
16389E01242A05095J83929j01565M66016j98783j80900K13900A67771p8300R8301
16379A87772K64572m8331j20161A17330R4642R0967q3003J60462A26718J57289
16369B84007h057B36987J53434L7298j50827J4788A22772J58847E7834K42434
16359C00268j30213J57438D1149J69482o4021K18510j18657A00019J93704G6060
16348e4243I8199J15824l1038K0028J04619a27519B89863j2661j9631J74919A16316
16336B19799n2766K50980D8880J89338j03620J08839o432C3256K65272A39444
$$ plain form
16325 262870 42278 157670 179126 248027 282662 -169289 -33567 -75051 88753 174824 367088
16314 367088 20487 82526 526045 176490 61290 141881 177564 164824 178444 382435 30867
16302 247416 -87025 228218 -45920 468737 507507 156426 -39983 -41845 -20269 -124831 -176167
16291 -176167 -79128 177386 -37404 25760 301407 290233 -4195 217370 84335 102072 -66816
16279 76992 164976 28778 211767 46416 169962 61339 -8421 77972 37706 95066 332448
16268 332448 -119120 -75920 190287 203270 152798 -35094 133633 -283766 381714 237014
16258 237014 103594 61640 -80264 539601 192691 -144305 172160 409742 -103155 -63200
16248 -63200 69730 100861 64 170532 -318673 51024 221442 24472 -93944 89266 303256
$$ packed form
16325B62870D2278J15392K1456O8901L4635a69289c3567m1484H8753Q6071J92264
16314C67088B0487O2039M43519A76490F1290Q0591L5683j2740J3620K03991C0867
16302B47416h7025B28218d5920D68737L8770A56426c9983j862b0269j04562n1336
16291a76167g9128A77386c7404B5760K75647j1174d195B17370H4335J7737f6816
16279G6992Q7984B8778J82989D6416J23546F1339h421G7972C7706N7360K37382
16268C32448a19120M3200A90287J2983n0472c5094A33633b83766C81714j44700
16258B37014A03594m1954h0264E39601A92691a44305A72160K37582a03155L9955
16248f3200F9730L1131F4J70468c18673E1024J70418B4472i3944H9266K13990
$$ plain form
16237 303256 247016 106301 281879 -292096 -38280 364295 71176 271158 -183702 -25646
16226 278506 123601 124736 1375 -53054 -157263 -75041 -64583 -333422 -166080 168772 -29769
16214 -151005 -6559 -26650 209913 -67548 -76780 261566 -203415 -203786 151625 370092 146463
16202 51676 206251 56948 -105795 316191 -22040 -332446 -27751 141614 356010 146678
16191 174987 -240831 41814 111064 -128815 36812 96266 133835 -119790 177652 -105142
16180 219154 201153 281230 88643 -250584 -125193 -118323 252300 140571 114510 185932 36605
16168 83724 74042 293390 -12079 19627 -37525 106323 87443 -137228 320891 281606 -2734
16156 223637 190197 -32584 182181 -250347 -279450 42458 114160 139612 -175910 224281 -310113
$$ packed form
16237C03256n6240A06301J75578b92096c8280C64295G1176J99982a83702b5646
16226B78506A23601J135A375e3054j04209g5041J0458k68839a66080A68772b9769
16214a51005f559k0091B09913f7548r232B61566b03415l71A51625K18467A46463
16202E1676J54575E6948a05795C16191b2040l10406b7751A41614K14396A46678
16191A74987b40831D1814O9250a28815C6812N9454L7569a19790A77652a05142
16180B19154j8001Q0077H8643b50584a25193O870B52300j11729k6061P1422C6605
16168H3724r682K19348a2079A9627c7525A06323j8880a37228C20891l9285b734
16156B23637l3440c2584A82181b50347k9103D2458P1702K5452a75910B24281c10113
$$ plain form
16144 -109306 25353 179853 37111 299038 -146243 -10613 162599 91926 104164 317440
16134 317440 -94056 -232493 44952 190997 63170 -171817 -11934 110921 -321265 59475
16123 38493 -68938 -36006 122461 97706 -1324 296709 -16477 127271 -347472 260003 30958
16111 -44036 20123 81595 -19205 138365 -78363 44618 69350 144483 170958 219762 -37923
16099 -200763 73318 -24034 68169 -249625 83752 125 -226137 -272465 211987 11502 91099
16088 91099 -62904 -156254 -302140 255107 -38940 -320690 119010 -85894 -140575 33040 -236848
16076 -117625 238629 41007 114807 -15500 151605 -136464 -28194 -32561 -295192 144295 -211652
16064 -31200 -239392 64357 -88583 94526 -107805 -281398 -198232 -360304 -161117 73344 157082
$$ packed form
16144a09306B5353J54500C7111K61927a46243a0613A62599p0673J2238K13276
16134C17440i4056j38437D4952J46045F3170a71817a1934A10921c21265E9475
16123C8493f8938L2932A22461k4755a324B96709a6477A27271c47472B60003C0958
16111d4036B0123O1472a9205A38365g8363D4618K4732P5133K6475M8804c7923
16099b00763G3318b4034F8169b49625H3752A25b26137m6328B11987A1502P9597
16088I1099f2904r3350j45886B55107c8940k81750A19010h5894n4681C3040b36848
16076a17625B38629D1007P3800a5500A51605a36464b8194m367k62631A44295b11652
16064c1200k08192F4357h8583I4526a07805j73593Q3166j62072a61117G3344Q3738
$$ plain form
16053 157082 89420 -38984 -39511 -202097 121008 -234658 -202804 -228910 -40708 28859 -241592
16041 97943 -222727 -132995 -25002 -1216 210941 -120606 -175756 391795 108371 -62334 -223211
16030 -223211 -8621 14492 -235244 -63861 134215 -16748 -168751 239755 -30400 -67268 -13617
16018 11391 -64745 -199790 43040 -58073 -105923 247339 225614 -655122 -94577 -371231 49934
16006 163688 147288 -151804 84694 144918 -114269 -364307 19611 69103 -103381 -86307 174759
15994 -191305 772 128614 -171232 206227 -25670 -218470 -81410 410483 24279 130390 -25758
15982 192002 152189 181794 510908 307544 106620 131922 -171711 -107505 -240834 -195958
15972 -195958 268616 124766 -69644 -34045 127612 18856 147058 74324 231251 88384
$$ packed form
16053A57082o7662c8984n27j62586A21008b34658L1854k6106d0708B8859b41592
16041I7943b22727Q9732b5002a216B10941a20606n5150C91795A08371f2334j60877
16030b23211h621A4492b35244f3861A34215a6748j52003B39755c0400l6868a3617
16018A1391f4745j35045D3040e8073m7850B47339k1725f55122i4577k76654D9934
16006A63688j6400a51804H4694O0224a14269k50038A9611M9492a03381J7074A74759
15994a91305G72J27842a71232B06227b5670j92800h1410D10483B4279J06111b5758
15982A92002l9813K9605L29114k03364A06620K5302a71711O4206j33329M4876
15972a95958B68616A24766f9644c4045A27612A8856J28202p2734J56927H8384
$$ plain form
15961 -246919 -123264 95198 -289 -335951 -119264 206614 109233 -106234 -372589 286024
15950 10910 128610 -22165 -414931 90850 189858 -1047 113916 -276713 -84666 6688 -163245
15938 -275137 -66106 -85181 -46078 -206181 -108082 -95871 -337395 52048 -280027 39474 -128694
15926 -468178 74434 -42135 -59621 -7668 -24991 164758 -149504 -70892 -6141 146069 132714
15915 132714 213983 -201421 -32611 -297665 -84677 -59618 -417075 -175059 236358 116050
15904 170925 147781 78656 -167413 -191722 -61419 74138 -121255 -150 -125149 -58415 128416
15892 -294745 -4037 231452 -25096 44909 -106038 -458295 -223240 97362 -237981 70659 87050
15881 87050 337410 48972 65195 482922 126136 34377 16936 -231864 -23903 35367 -190581
$$ packed form
15961b46919a23264I5198b89l35662a19264B06614r7381a06234k66355B86024
15950A0910J17700b2165l92766I0850R9008a047A13916b76713h4666F688a63245
15938b75137f6106j9075L9103j60103R8099J2211k41524E2048b80027C9474a28694
15926d68178G4434d2135j7486g668j7323A64758a49504g0892f141A46069j3355
15915A32714Q1269b01421c2611k65054h4677K5059l57457a75059B36358A16050
15904A70925k3144o9125a67413k4309f1419G4138a21255a50j24999e8415A28416
15892b94745d037B31452b5096D4909a06038l52257b23240I7362b37981G0659J6391
15881H7050K50360D8972J6223M17727A26136C4377A6936b31864b3903C5367a90581
$$ plain form
15869 -648700 -15635 -278299 -193136 -183386 -82581 213158 -2928 -63074 -135850 202153 -55257
15857 140219 -118437 -42823 161468 153610 -147098 -60828 190497 -69631 63084 61603 85451
15846 85451 -150097 195532 -49307 364762 -81433 -50119 -9540 -323288 11447 44204 454547
15835 454547 -30286 -255281 -259367 -63104 -169791 83947 -188540 153245 -174251 -120949 26410
15823 10910 -229064 -62388 82773 98096 -165280 -116730 -39845 343954 9214 46179 -250913
15811 -38089 82965 -305101 -139515 -141219 -52927 106662 141923 -47245 -171267 -99891 175415
15799 -59834 -124104 78192 -161183 -78377 -108652 -50261 -134658 4528 -110483 92222 103063
15788 103063 -70021 9284 -99373 -96151 60258 -241037 65386 -138662 -109937 -65928 -269537
$$ packed form
15869f48700a5635k62664Q5163R750h2581B13158b928o0146p2776B02153e5257
15857A40219a18437d2823A61468p858a47098f0828A90497f9631F3084j481K3848
15846H5451a50097A95532d9307C64762h1433L1314i540l13748A1447L2757M10343
15835D54547c0286k24995m086f3104j06687H3947a88540A53245a74251N3302B6410
15823A0910b29064f2388H2773J5323a65280M8550c9845C43954I214L6965b50913
15811c8089H2965c05101a39515j704e2927A06662L5261d7245j24022P1376A75415
15799e9834o4270G8192a61183g8377l0275e0261q4397D528a10483I2222J0841
15788A03063g0021I284i9373L222F0258b41037F5386a38662K8725M4009k03609
$$ plain form
15777 -269537 3178 2320 -234082 12770 170113 71234 -533495 61980 295433 -96713 -131211
15766 -131211 -274931 -120633 -6233 16662 48932 -15514 -112984 231084 199189 180887 -80913
15754 -225622 343468 -333653 15430 -28343 71812 152854 -106912 -400 -272139 57733 -214585
15742 70173 -271331 -141293 -184856 -210674 -63288 256878 -151097 -301203 -167758 152241
15731 320598 -270996 -76666 -188756 287131 -192945 173123 -127218 146666 118488 -23613
15720 94001 39351 134374 -197557 109911 -49258 -142428 -74674 -40365 86199 -154092 -100782
15709 -100782 231659 -274016 -40776 -172018 -160160 -329851 -28253 136200 -259341 -79168
15698 174335 -241541 -281495 33555 -216474 -249674 383458 -197638 -6066 -196211 90836 -334691
$$ packed form
15777b69537C178q58b34082A2770J57343G1234e33495F1980K33453i6713l4498
15766a31211j43720a20633f233A6662L2270a5514r7470B31084l1895j8302h0913
15754b25622C43468c33653A5430b8343G1812Q1042a06912d00k71739E7733b14585
15742G0173b71331J30038m3563k5818f3288B56878a51097j50106J33445A52241
15731C20598b70996g6666j12090B87131a92945A73123a27218A46666k8178b3613
15720I4001C9351R5023a97557A09911d9258r3170O7754L4309H6199a54092N3310
15709a00782B31659b74016d0776j31242J1858j69691b8253A36200b59341g9168
15698A74335b41541l9954C3555b16474l3200C83458a97638f066j90145I0836c34691
$$ plain form
15686 -73666 -289179 -212729 -140668 154719 -239000 40923 -432188 -201248 24511 -90025 212581
15674 28125 98019 132526 20184 -56132 157442 -242931 3452 281517 -68050 -45765 38901
15662 -19122 -70250 -37699 -217748 -177419 -254789 88249 200287 -156915 196365 -401434 -159284
15650 40135 -180456 -60036 -69485 192912 26388 98603 41401 335403 206 138759 -37166
15638 64604 364324 -47723 248999 94752 118753 -171954 -4309 167743 -14009 -107874 385006
15626 -90168 116147 6672 150366 -73203 -135476 -7554 40088 -32956 21070 26394 33443 -66700
15613 -55851 6169 -163169 -74112 215838 -66298 -108181 -170508 -35493 -367871 82026 -142499
15601 -246469 -201014 26837 -168474 8900 23232 -206101 210549 2893 28835 -1194 62295
$$ packed form
15686g3666k15513P6450P2061A54719b39000D0923d32188b01248B4511i0025B12581
15674B8125O9894L4507B0184e6132A57442b42931C452K78065f8050K2285C8901
15662a9122n1128L2551j80049M0329p7370H8249J12038a56915A96365d01434a59284
15650D0135a80456f0036r449A92912B6388P2215D1401K94002B06J38553c7166
15638F4604K99720d7723B48999I4752K4001a71954d309A67743a4009r3865C85006
15626i0168A16147F672J43694g3203o2273g554D0088c2956B1070N324P049f6700
15613e5851F169a63169g4112B15838f6298m1883o2327c5493l32378H2026a42499
15601b46469M5455B6837a68474H900J4332b06101B10549B893K5942a194F2295
$$ plain form
15589 276923 72471 198216 -215881 217049 -51901 126001 -319854 -115305 161034 -22528
15578 -25547 254574 22277 213190 16560 -48626 96277 139276 -118468 38308 -213495 -111488
15567 -111488 373579 -96005 -133488 329709 2771 109104 -40621 112007 150256 -39119 -18021
15555 80032 3926 -151629 239820 -61352 -196165 82865 -65216 -97575 -38455 61947 -267323
15543 129722 186642 209752 78676 -125180 -60655 211106 -14860 -91677 8103 -102367 377784
15531 10114 -262645 -312508 -221941 119828 -223521 304775 70482 49753 -182759 -134774 -19207
15519 -73092 126668 113060 162537 -97675 5321 140664 -144671 -121235 -145375 174161 338781
15508 338781 72855 350004 -147379 105391 -150897 131320 98469 -75649 178562 -259968
$$ packed form
15589B76923G2471J25745b15881B17049e1901A26001c19854a15305A61034b2528
15578b5547B54574B2277J90913A6560d8626I6277M2999a18468C8308b13495J02007
15567a11488C73579i6005l7483C29709B771J06333d0621A12007L8249c9119a8021
15555H0032C926a51629B39820f1352j34813H2865f5216l2359c8455F1947b67323
15543A29722N6920K3110G8676a25180f0655B11106a4860p6817H103a02367C77784
15531A0114b62645m9863R0567A19828b23521C04775G0482k0729a82759M7985a9207
15519g3092A26668j3608M9477i7675E321J35343a44671K3436k4140A74161J64620
15508C38781G2855K77149a47379A05391a50897A31320l2851g5649A78562b59968
$$ plain form
15497 213159 -62805 53061 -10368 104477 -92820 175439 -165668 100910 208065 69239
15486 48559 -377645 199767 107113 154854 48719 -77061 113238 51147 11331 187924 -282401
15474 160644 334468 56933 -141846 1849 167046 -225452 -247306 -190677 242736 -110107
15463 -220176 15822 -151112 192611 59037 -20083 201615 202076 -78999 -5676 382273 -35805
15451 241513 38091 -25145 -245101 -335320 164246 -186451 146826 86999 260783 79471
15440 187974 -70001 12826 -127437 -308621 128465 -98181 -143301 -133476 -157236 15103 -295815
15428 11873 -33652 -124010 71 -71936 6575 -393656 96979 357719 79027 -23149 -2785 -103189
15416 -103189 -165404 -2403 22065 -124953 -191048 202243 124577 24940 217122 179288 -129584
$$ packed form
15497B13159f2805E3061a0368A04477i2820A75439a65668A00910J07155F9239
15486D8559c77645A99767r2654M7741D8719g7061A13238E1147A1331J76593b82401
15474A60644J73824E6933a41846A849J65197b25452k1854N6629B42736a10107
15463b20176A5822a51112A92611E9037b0083B01615M61g8999e676C82273c5805
15451B41513C8091b5145k19956r0219A64246a86451A46826n9827J73784G9471
15440A87974g0001A2826a27437j81184A28465i8181m5120R825k3760A5103b95815
15428A1873c3652r0358G1g1936F575c93656I6979K60740G9027b3149b785j00404
15416a03189o2215b403B2065a24953o6095B02243p7666B4940J92182l7834a29584
$$ plain form
15404 -173896 -71189 -80661 159202 89322 366425 26925 111921 -36629 -187090 6011 241796
15393 241796 -198135 31045 -232660 93540 89426 107926 -311722 -180773 -155138 76254 177134
15382 177134 62166 109878 99258 78013 -70564 -176344 -186031 -60956 -185334 113855 36869
15370 111995 316476 -108335 -82345 202504 -317466 39837 -168240 -374492 35272 -374193
15359 142739 20002 -14594 16057 -327093 424 -117851 63105 -103570 186735 105805 109834
15348 109834 305713 155372 -37554 19032 218267 -343282 -3109 101063 -380302 -287975
15338 -287975 108500 -72119 -4307 207958 -161528 74496 -52442 -420130 230499 -180641
15327 -10131 -32668 -31849 267792 -131566 64444 -131737 -48184 -24460 -113390 107140 180486
$$ packed form
15404a73896g1189r472A59202o9880K77103B6925Q4996c6629j50461F011K35785
15393B41796a98135C1045b32660I3540m114J8500c11722J30949K5635G6254J00880
15382A77134F2166M7712j0620k1245g0564j05780r687f0956j24378A13855C6869
15370A11995K04481a08335K5990B02504c17466C9837a68240k06252C5272c74193
15359A42739B0002a4594A6057c27093D24a17851F3105a03570A86735q0930M029
15348A09834J95879j50341c7554A9032J99235c43282c109A01063c80302R2327
15338b87975A08500g2119d307B07958a61528G4496e2442l67688B30499a80641
15327a0131k2537Q19B67792a31566F4444a31737d8184K3724q8930A07140P3346
$$ plain form
15316 180486 268372 -143914 -61564 -108754 -186982 19888 108081 -119917 -178551 124807 -125297
15304 3806 3061 -23578 -36325 41461 153089 -132486 3460 -197375 -130922 1927 -99126 70516
15291 225981 195752 188933 35716 -159476 -148786 18518 141742 322531 -319337 -262156 16827
15279 314440 63300 -116704 150335 153816 -45979 152809 -76053 273933 35858 -70776 -411274
15268 -411274 382362 104323 395965 -59098 39805 -74595 230222 -254435 -207283 -17566
15257 -91222 132312 286824 230639 442216 121835 84722 -435743 279910 388073 883234
15247 883234 1435041 1200740 1293852 887820 200504 472361 175753 -68534 -90257 47121
15236 98052 84936 97382 108472 -212842 99784 -59934 -363230 -117798 -107639 5622 28552
$$ packed form
15316A80486Q7886a43914f1564m7190p8228A9888Q8193a19917n8634A24807a25297
15304C806p45b3578j2747D1461J11628a32486C460a97375O6453A927i9126G0516
15291B25981l0229o819C5716a59476J0690A8518J23224J80789c19337N7181A6827
15279C14440F3300a16704A50335L481d5979A52809g6053B73933C5858g0776l40498
15268d11274C82362A04323K91642e9098C9805g4595B30222b54435M7152a7566
15257i1222A32312J54512n6185K11577A21835l7113d35743B79910J08163M95161
15247H83234N51807k34301R3112m06032B00504K71857A75753f8534k1723D7121
15236I8052j3116J2446J1090b12842I9784e9934l03296a17798J0159E622K2930
$$ plain form
15225 28552 -11822 -116419 -183376 46794 161455 -43174 -170763 146254 228417 43865 -45710
15213 280344 186294 45662 89692 281074 -237423 -106623 223533 109790 80795 189489
15203 189489 -62696 130214 -258383 202753 161891 371418 -237351 -83146 38938 22357
15193 22357 -19289 279224 178848 -126546 -177441 -51950 131779 319825 52715 104224 -24981
15181 2143 102170 113210 49366 -86303 -55074 15338 -75216 84325 74984 35051 -85436 38138
15168 191855 -146863 65635 432697 34172 74876 120767 -107280 53681 -151541 133161
15157 173503 -49518 -7976 -114759 346443 89034 -212662 83397 -26834 -1676 148349 36157
15145 14432 85702 220225 -44175 -65228 132092 63539 -86501 24332 152733 -11352 67062
$$ packed form
15225B8552a1822j04597o6957D6794J14661d3174j27589A46254Q2163D3865d5710
15213B80344r4050D5662M4030J91382b37423a06623B23533A09790k8995J08694
15203A89489f2696A30214b58383B02753m0862K09527b37351h3146C8938j6581
15193B2357a9289B79224j00376a26546n0895e1950A31779J88046E2715N1509b4981
15181B143J00027J1040D9366h6303L1229A5338g5216H4325r341C5051h5436C8138
15168A91855a46863F5635L67062C4172M0704M5891a07280E3681a51541A33161
15157A73503d9518g976j06783C46443H9034b12662H3397b6834a676A48349C6157
15145A4432P1270J34523d4175k1053A32092F3539h6501B4332J28401a1352F7062
$$ plain form
15133 140166 -124692 165874 303546 -68089 -3758 13846 307248 -41555 10437 -68103 146415
15121 -63035 -363661 -85202 67993 -382922 257419 70752 -165288 275193 -81768 44086 366410
15110 366410 -159724 76677 96626 37661 -151380 179300 238181 85281 3853 155714 355407
15099 355407 -90203 237649 -138714 30478 122362 233944 -100832 186174 217744 -60043
15088 20111 -5678 114816 -116387 485606 382824 -80423 446340 272489 248054 -34202 96335
15076 50749 255051 -9613 361668 269624 11138 238532 232292 248309 255855 187411 207110 -148470
15063 180311 132486 127667 -55275 200767 100196 28167 231407 395536 -52306 359747 306727
15052 306727 140661 -26732 215583 218501 -144048 146096 67807 119383 -322350 -22030 -11247
$$ packed form
15133A40166a24692A65874J37672f8089c758A3846K93402d1555A0437f8103A46415
15121f3035l00626h5202F7993c82922B57419G0752a65288B75193h1768D4086L22324
15110C66410a59724G6677J9949C7661a51380A79300N8881H5281C853J51861J99693
15099C55407i0203B37649a38714C0478R1884J11582a00832A86174L1570f0043
15088B0111e678A14816a16387D85606j02782h0423D46340j73851k4435c4202I6335
15076E0749K04302i613C61668r2044A1138K27394o240J6017P546o8444J9699a48470
15063A80311m7825m819e5275B00767A00196B8167K03240J64129e2306C59747n3020
15052C06727A40661b6732B15583K918a44048A46096F7807N1576c22350b2030J0783
$$ plain form
15041 -11247 -114471 -307410 234029 167050 -107871 82926 259137 70039 -46702 138081
15030 131533 180397 -103614 264252 207931 -338901 228864 226608 379274 -216358 -76173
15019 -115716 126898 64380 414929 122063 159536 60430 -125350 260299 -9857 147761
15008 -24419 280319 43660 229041 206746 52559 222451 298486 124368 219786 -35983 168206
14996 627678 -51841 -22141 108456 178213 -166284 95439 361815 48182 256744 268130 -85081
14984 236571 283421 251091 243547 51377 296190 310936 269172 231653 169089 98806 278724
14973 278724 234609 144083 -135436 92466 110940 -206913 141672 237180 357569 350204 564846
14962 564846 134023 343331 -4289 391646 229041 603512 491875 263236 216628 721012
$$ packed form
15041a1247j03224j92939B34029o6979a07871H2926J76211G0039d6702A38081
15030A31533M8864a03614B64252n6321c38901B28864k256J52666b16358g6173
15019a15716A26898o2518L50549A22063L7473F0430a25350B60299i857A47761
15008b4419B80319D3660J85381k2295E2559J69892P6035A24368R5418c5983A68206
14996F27678e1841b2141A08456O9757a66284I5439K66376D8182K08562J1386h5081
14984B36571M6850l2330p544E1377K44813J4746m1764l7519o2564p0283J79918
14973B78724m4115r0526a35436I2466J8474b06913A41672R5508J20389p365K14642
14962E64846A34023K09308d289C91646j62605L74471j11637k28639m6608N04384
$$ plain form
14952 721012 481762 -28907 394764 105780 280102 192129 -191722 143739 171565 324205
14942 324205 595424 87113 247047 340373 96332 -60703 83817 319080 139262 138093 121154
14931 121154 465108 184355 358069 50912 37172 86737 251273 241237 105839 156000
14921 156000 326310 200862 223344 727994 172402 -17806 430406 206616 173657 105906
14911 105906 -22723 227570 313908 110228 292122 282236 79202 163912 346713 612 124637
14900 124637 -85419 42394 226121 139024 251978 355663 180384 271019 166204 176089 388782
14889 388782 384463 487918 328408 349234 305848 318644 420097 401446 183117 292005 98052
14877 64738 501917 510320 242156 92637 288464 502534 -80565 381154 9642 548838 699737
$$ packed form
14952G21012k39250b8907C94764A05780J74322q7973a91722A43739K7826J52640
14942C24205K71219H7113J59934R3326I6332f0703H3817K35263A39262j169j6939
14931A21154L43954A84355J73714E0912j3740M9565J64536j0036A05839N0161
14921A56000J70310j25448K2482N04650A72402a7806D30406B06616l2959o7751
14911A05906b2723B27570Q6338A10228J81894r886G9202Q4710J82801F12J24025
14900A24637h5419D2394J83727q7097J12954J03685j75279R0635j04815R885K12693
14889C88782m319J03455j59510K0826m3386J2796J01453j8651A83117J08888I8052
14877F4738M37179Q403B42156I2637J95827K14070h0565C81154I642N39196J50899
$$ plain form
14866 699737 300555 386372 238491 419844 127471 117035 561014 243719 455764 121640
14855 215697 334934 302997 504476 159619 176956 438590 519314 313597 297969 494693
14845 494693 361733 593720 397286 673528 340951 248131 705886 510207 464377 399125
14835 399125 519763 260117 370206 232879 362299 -31792 353427 158607 295013 551601
14825 551601 614531 483299 342378 113051 396523 332295 587489 550845 418746 553002
14815 553002 538580 273220 509875 767544 713806 458501 130059 618339 370125 424203
14805 424203 228311 543220 339484 541940 489379 512541 517122 570983 480685 772595 519178
14794 519178 559597 441222 472941 565028 643500 567976 282815 492782 440733 383234 495099
$$ packed form
14866F99737C00555Q5817j47881J81353A27471j0436M43979B43719K12045A21640
14855B15697J19237l1937K01479A59619J7337K61634Q0724k05717j5628J96724
14845D94693j32960K31987j96434K76242l32577r2820M57755j95679m5830o5252
14835C99125J20638k59646J10089j37327J29420c1792C53427A58607J36406K56588
14825E51601O2930j31232j40921A13051K83472o4228K55194l6644j32099J34256
14815E53002j4422k65360K36655K57669n3738k55305A30059M88280k48214N4078
14805D24203j95892L14909k03736K02456n2561K3162M581N3861r0298K91910k53417
14794E19178M0419j18375L1719R2087P8472p5524B82815K09967n2049n7499J11865
$$ plain form
14783 495099 370760 276728 383589 266746 521841 561139 468713 245887 905576 588996
14773 588996 400023 548159 119204 447596 790817 371179 629640 416406 283308 877651
14763 877651 410102 388779 791621 505544 431588 703428 512252 674684 484538 551250
14753 551250 396666 577051 498487 267985 515464 704020 563650 605780 673619 380435
14743 380435 699537 441317 743800 749932 708273 581692 352820 662569 415257 630844
14733 630844 746013 300737 527709 787490 365462 800706 505991 680667 766813 611389
14723 611389 1013197 675630 968367 697102 701953 727895 794739 975283 950436 902009 716252
14712 716252 483096 1016926 1094102 875502 624582 514853 952865 834944 693082 677047
$$ packed form
14783D95099j24339r4032J06861j16843K55095L9298r2426k22826O59689l16580
14773E88996j88973J48136A19204L28392L43221C71179K58461k13234j33098N94343
14763H77651D10102k1323M02842k86077p3956K71840j91176J62432j90146O6712
14753E51250j54584J80385p8564k30502K47479J88556j40370M2130O7839k93184
14743C80435L19102k58220L02483O132m1659j26581k28872L09749k47312K15587
14733F30844J15169C00737K26972K59781C65462M35244k94715J74676Q6146j55424
14723F11389M01808l37567K92737k71265M851K5942O6844J80544k4847m8427j85757
14712G16252k33156N33830P7176k18600k50920j09729M38012j17921j41862j6035
$$ plain form
14702 677047 805545 973935 839272 969297 715252 590426 822282 810665 832859 825714
14692 825714 577439 859244 1001836 585965 345418 648814 925268 749010 789791 738432
14682 738432 662969 789620 848563 981012 1170688 637878 677454 907755 815598 451695
14672 451695 640816 871562 818246 739482 1015494 1086044 1080460 958502 1067626 1072567 1316641
14661 1316641 1030166 854312 1113557 1179240 910095 896204 1013130 831360 1194002 1084045
14651 1084045 856382 931481 862405 927413 1236031 970592 1128279 1140576 1114012 1264889
14641 1264889 1213270 1052692 1136916 1107539 1330812 1214560 1226602 1391745 1381175 1072023
14631 1072023 1310750 1203241 939781 1064854 1476449 1218438 1112917 1136317 1397429 1498447
$$ packed form
14702F77047J28498J68390j34663J30025k54045j24826K31856j1617K2194p145
14692H25714k48275K81805J42592m15871k40547L03396K76454j76258M0781n1359
14682G38432p5463J26651N8943J32449J89676n32810L9576K30301r2157l63903
14672D51695J89121K30746n3316p8764K76012P0550n584j21958J09124M941K44074
14661A316641k86475j75854K59245O5683k69145j3891J16926j81770L62642j09957
14651A084045k27663P5099o9076O5008L08618k65439J57687J2297k6564J50877
14641A264889n1619j60578Q4224k9377K23273j16252J2042J65143j0570l09152
14631A072023K38727j07509k63460J25073M11595k58011j05521K3400K61112J01018
$$ plain form
14621 1498447 1465764 1036718 1240248 902613 1363033 1234257 1107969 1146890 1001922 1263399
14611 1263399 905984 1275702 1303129 1450127 1625233 1350174 1425826 1763494 1223322 1262280
14601 1262280 1381293 1498747 1488039 1507442 1350846 1383622 1444112 1655705 1487420 1625388
14591 1625388 1694582 1384748 1350772 1450163 1244770 1697450 1753127 1490651 1661322 1688546
14581 1688546 1677373 1340888 1712849 1902193 1693152 2012119 1911263 1861899 2100770 1925030
14571 1925030 2022866 2098524 2103628 1850452 2038585 2346468 2249430 2167605 2117113 2260558 2317949
14560 2317949 2304332 2216896 2670028 2543936 2833700 3129156 3141384 3464483 3828394 3853416
14550 3853416 5018517 7112087 11378107 20652437 36576510 41627444 22653381 9689257
$$ packed form
14621A498447l2683m29046K03530l37635M60420j28776j26288L8921j44968K61477
14611A263399l57415L69718K7427J46998J75106k75059P5652L37668n40172L8958
14601A262280J19013J17454j0708J9403j56596L2776O0490K11593j68285J37968
14591A625388O9194l09834l3976R9391k05393M52680N5677k62476J70671K7224
14581A688546j1173l36485L71961J89344k09041L18967j00856m9364K38871j75740
14571A925030R7836P5658N104k53176J88133L07883r7038q1825n0492J43445N7391
14560B317949j3617q7436M53132j26092K89764K95456J2228L23099L63911K5022
14550C853416J165101K093570M266020R274330J5924073N050934j8974063I689257
$$ plain form
14541 4250598 2422237 2358077 1920239 1892638 1490207 1504934 1571391 1582893 1696734 1708331
14531 1708331 1971027 1980047 1595016 2113448 1770380 1736773 2026757 2047548 2095153 2300022
14521 2300022 2158651 1930597 2133469 2036682 2515936 2374840 2073554 2222104 2394865 2573938
14511 2573938 2556434 2224133 2786077 2749696 2688685 2682256 2626552 2675391 2676161 2665381 3322116
14500 3322116 2499074 2709578 2811299 2704953 2884941 2874811 2889293 2760125 2921420 3135954
14490 3135954 3220508 3548467 3087898 3061493 3208857 3003320 3399258 3326514 3271394 3415177
14480 3415177 3494397 3589370 3429098 3785976 4047798 3668361 3852700 3534878 3820536 3629056
14470 3629056 3932827 3928667 3842008 4186865 4116545 3969792 4094876 4016391 4139781 4337336
$$ packed form
14541D250598j828361o4160m37838k7601m02431J4727O6457J1502J13841J1597
14531A708331K62696R020l85031N18432l43068l3607K89984K0791M7605K04869
14521B300022j41371k28054K02872r6787M79254j41096l01286J48550J72761J79073
14511B573938j7504l32301N61944l6381o1011o429n5704M8839P70j0780O56735
14500C322116q23042K10504J01721j06346J79988j0130J4482j29168J61295K14534
14490C135954Q4554L27959m60569k6405J47364k05537L95938p2744n5120J43783
14480C415177P9220R4973j60272L56878K61822l79437J84339l17822K85658j91480
14470C629056L03771m160q6659L44857p0320j46753J25084p8485J23390J97555
$$ plain form
14460 4337336 4161673 4435574 4226657 4555233 4502471 4611634 4692649 4844401 4834689 4935794
14450 4935794 4805255 4974508 4846640 5058153 4786362 4963881 4995886 5016427 5171828 5355130
14440 5355130 5400770 5749578 5690498 5526455 5657905 5381887 5835148 5821334 5913910 5977320
14430 5977320 6094901 5957167 6320208 6634903 6260598 6302351 6611177 6655055 6958865 6960192
14420 6960192 6841484 7015222 7308477 7206568 7401341 7275552 7533106 7689692 7996544
14411 7996544 8141915 8020556 8097754 8330637 8418968 8580102 8823156 8637093 9054736 8990115
14401 8990115 9436028 8993017 9390066 9378742 9765793 9900458 9937249 10233778 10300586 10931675
14391 10931675 10733534 11140078 11023372 11233074 11159974 11950045 11448783 12250812 12384538
$$ packed form
14460D337336j75663K73901k08917L28576n2762J09163Q1015J51752r712J01105
14450D935794j30539J69253j27868K11513k71791J77519L2005K0541J55401J83302
14440E355130M5640L48808n9080j64043J31450k76018M53261j3814R2576O3410
14430E977320J17581j37734L63041L14695l74305M1753L08826M3878L03810J327
14420F960192j18708J73738K93255j01909J94773j25789K57554J56586L06852
14411G996544J45371j21359P7198K32883Q8331J61134K43054j86063M17643o4621
14401H990115M45913m43011L97049j1324L87051J34665L6791K96529O6808O31089
14391A0931675j98141M06544j16706K09702p3100P90071n01262Q02029J33726
$$ plain form
14382 12384538 12559646 12632484 12795876 13256277 13278609 13791643 14067934 14370700 14640474 15033598
14372 15033598 15112307 15371210 15472799 15927203 16145872 16315820 17348549 17024926 17609227
14363 17609227 18286924 18542085 18985121 19191123 19877269 20140272 20439120 21283295 21529603
14354 21529603 22145936 22644929 23063850 23875972 23956624 24935021 25495503 25874148 26863223
14345 26863223 27484852 28329066 28794531 29361630 30478409 31323120 31982312 32887908 33812488
14336 33812488 34936598 35835694 37080434 37959537 39264029 40425372 41761131 43259392
14328 43259392 43985879 46012065 47379739 48744627 50504878 52180651 54129929 55920330
14320 55920330 58169534 59841895 62665955 64535397 67219538 69402231 72460100 75357948
$$ packed form
14382A2384538J75108P2838J63392M60401K2332N13034K76291L02766K69774L93124
14372A5033598P8709K58903J01589M54404K18669J69948J032729l23623N84301
14363A7609227O77697K55161M43036K06002O86146K63003K98848Q44175K46308
14354B1529603O16333M98993M18921Q12122Q0652R78397N60482L78645R89075
14345B6863223O21629Q44214M65465N67099J116779Q44711O59192R05596R24580
14336C3812488J124110Q99096J244740Q79103J304492J161343J335759J498261
14328D3259392P26487K026186J367674J364888J760251J675773J949278J790401
14320E5920330K249204J672361K824060J869442K684141K182693L057869K897848
$$ plain form
14312 75357948 77864178 81169511 84634867 88313065 91933096 95689991 100076871 104550651
14304 104550651 109370690 114183948 119837258 125665689 131366700 137992561 144632363 152405612
14296 152405612 159894475 168653263 176953663 186470326 196644108 207278582 218178597
14289 218178597 229820143 242344160 255569549 269239643 283558701 298470992 313780149
14282 313780149 329447226 345477758 361390838 377300407 392818430 407269569 420769404
14275 420769404 433069458 443617278 450095463 452504751 452964838 453521005 455409452 454179777
14267 454179777 453063742 449471676 441136625 430268765 418030980 404108009 388833377
14260 388833377 373143697 356916373 340857064 324728760 308647182 293471747 279744905
$$ packed form
14312G5357948K506230L305333L465356L678198L620031L756895M386880M473780
14304A04550651M820039M813258N653310N828431N701011O625861O639802P773249
14296A52405612P488863Q758788Q300400R516663J0173782J0634474J0900015
14289B18178597J1641546J2524017J3225389J3670094J4319058J4912291J5309157
14282C13780149J5667077J6030532J5913080J5909569J5518023J4451139J3499835
14275D20769404J2300054J0547820O478185K409288M60087N56167J888447j229675
14267D54179777j116035l592066q335051j0867860j2237785j3922971j5274632
14260C88833377j5689680j6227324j6059309j6128304j6081578j5175435j3726842
$$ plain form
14253 279744905 265242840 251450757 238472781 225958901 214247853 203308042 192716548
14246 192716548 182839823 173881778 165590948 156814295 149373116 142138012 135455536 129072404
14238 129072404 123342840 118018985 112569558 107673955 102666535 98578803 94465812 90825698
14230 90825698 86954376 83377195 80331656 76961597 73844868 71038526 68663135 65743795
14222 65743795 63368613 61520771 59313616 57284511 55179264 53305765 51808305 50218820
14214 50218820 48755595 47226668 45779913 44321965 42714832 41441560 40512369 39659632
14206 39659632 38871944 37346416 35999177 35196582 33939131 33446997 32878310 31929687 31055319
14197 31055319 30062208 29169854 28413956 27889764 27443238 26568069 25548676 25368342 24501884
$$ packed form
14253B79744905j4502065j3792083j2977976j2513880j1711048j0939811j0591494
14246A92716548r876725q958045q290830q776653p441179p235104o682476o383132
14238A29072404n729564n323855n449427m895603n007420m087732m112991l640114
14230I0825698l871322l577181l045539l370059l116729k806342k375391k919340
14222F5743795k375182j847842k207155k029105k105247j873499j497460j589485
14214E0218820j463225j528927j446755j457948j607133j273272r29191q52737
14206C9659632p87688j525528j347239q02595j257451m92134n68687r48623q74368
14197C1055319r93111q92354p55898n24192m46526q75169j019393j80334q66458
$$ plain form
14188 24501884 23895749 23417621 22950936 22394669 21656342 21398605 21139209 20420682 20118413
14179 20118413 19639583 19277536 18768932 18423255 18141165 17513199 17152821 17073193 16471576
14170 16471576 16364459 16041164 15410934 15597657 15439981 14700762 14644856 14076926 13877085
14161 13877085 13846970 13843729 13238397 13189045 12579539 12822761 12527295 11714401 11739843 11656170
14151 11656170 11587179 11182069 11177422 11307999 10907876 10830142 10294235 10327175 10428559 9828456
14141 9828456 9840062 9763024 9206932 9490078 9209439 8891986 9031690 8896873 8440540 8829669
14131 8829669 8469008 8485848 8303661 8110501 8300726 7780854 7609415 7648484 7454234 7237967
14121 7237967 7352557 7267136 7557158 7178920 7231534 6787651 6655304 6515543 6456954 6629309
$$ packed form
14188B4501884o06135m78128m66685n56267p38327k57737k59396p18527l02269
14179B0118413m78830l62047n08604l45677k82090o27966l60378p9628o01617
14170A6471576j07117l23295o30230J86723j57676p39219n5906n67930j99841
14161A3877085l0115l241o05332m9352o09506K43222k95466q12894K5442q3673
14151A1656170o8991m05110m647J30577m00123p7734n35907L2940J01384o00103
14141I828456J1606p7038n56092K83146k80639l17453J39704j34817m56333L89129
14131H829669l60661J6840j82187j93160J90225n19872j71439L9069j94250k16267
14121G237967J14590q5421K90022l78238N2614m43883j32347j39761n8589J72355
$$ plain form
14111 6629309 6381997 6151769 6542078 6214909 6267647 5988943 6192696 5681490 5861338 5754846
14101 5754846 5589305 5711622 5319678 5537391 5521833 5370145 5262927 5086624 5386935 4922596
14091 4922596 4886811 5019175 4968289 4759533 4576857 5155198 4899875 4883019 4744507 4493000
14081 4493000 4508401 4560244 4162813 4188947 4324698 4392298 4229770 4324857 4224608 4113537
14071 4113537 3889567 4198154 3839009 3910220 3610590 3931640 3707116 3645623 3817060 3877518
14061 3877518 3817640 3904815 3750327 3450026 3720098 3679339 3383471 3470584 3512318 3389334
14051 3389334 3394032 3322692 2836074 3070270 2970198 3144033 2964379 2803903 3074198 2731539
14041 2731539 2970686 3017872 3022721 3025114 2730033 2891429 3180343 2597125 3211351 2931748
$$ packed form
14111F629309k47312k30228L90309l27169N2738k78704K03753n11206J79848j06492
14101E754846j65541J22317l91944K17713j5558j51688j07218j76303L00311m64339
14091D922596l5785J32364n0886k08756j82676N78341k55323j6856j38512k51507
14081D493000J5401N1843l97431K6134J35751O7600j62528R5087j00249j11071
14071D113537k23970L08587l59145P1211k99630L21050k24524o1493J71437O0458
14061C877518n9878Q7175j54488l00301K70072m0759k95868Q7113M1734j22984
14051C389334M698p1340m86618K34196j00072J73835j79654j60476K70295l42659
14041B731539K39147M7186M849K393k95081J61396K88914n83218O14226k79603
$$ plain form
14031 2931748 2823093 2822236 3126886 2967218 3005645 2791292 2509045 2511472 2409262 2663560
14021 2663560 2454557 2656979 2411245 2514045 2336103 2519957 2127984 2162353 2176279 2387358
14011 2387358 2308414 1988101 2412190 2113667 2168995 2263166 2209302 2065409 1960327 2028864
14001 2028864 2260874 1916744 1780637 1968318 2077695 1994774 1789473 2049378 1921015 2058501
13991 2058501 1953939 2363672 3186591 6238134 13948526 31323139 42636917 27162725
13983 27162725 13093125 7286642 5287432 4459904 4000582 3153906 2850719 2971255 2551395
13974 2551395 2530760 2615488 2162178 2131394 2414173 2334555 2182365 2202071 2003878 2042785
13964 2042785 1936559 1992413 2249167 1841531 2062028 1788425 1570715 1992131 1858232 1719541
$$ packed form
14031B931748j08655q57L04650j59668L8427k14353k82247K427j02210K54298
14021B663560k09003K02422k45734J02800j77942J83854l91973L4369J3926K11079
14011B387358p8944l20313M24089k98523N5328R4171n3864j43893j05082O8537
14001B028864K32010l44130j36107J87681J09377q2921k05301K59905j28363J37486
13991B058501j04562M09733Q22919L051543P710392J7374613J1313778j5474192
13983B7162725A3093125n806483j999210q27528m59322q46676l03187J20536m19860
13974B551395k0635Q4728m53310l0784K82779p9618j52190J9706j98193L8907
13964B042785j06226N5854K56754m07636K20497k73603k17710M21416j33899j38691
$$ plain form
13954 1719541 1815424 1734991 1562087 1644135 1965853 1690403 1579208 1581264 1690754 1948403
13944 1948403 1471895 1639752 1904643 1353824 1675136 1163746 1384747 1696372 1678415 1706389
13934 1706389 1499262 1472558 1435473 1519656 1501526 1472562 1335364 1665816 1496348 1711598
13924 1711598 1789754 1247416 1464248 1405924 1590212 1257919 1459482 1259508 1426967 1583195
13914 1583195 1581470 1207926 1160349 1104427 1388092 1145409 1383563 1212732 1405282 1175211
13904 1175211 1436601 1535706 1413459 1179408 1185160 1385616 1246036 1158086 1482562 1084775
13894 1084775 1362310 773999 1152596 1154668 1180110 1300540 1021698 1397401 1369839 1441128
13884 1441128 1218074 1152741 1295134 826992 1186657 949961 1391130 878391 1185614 1130689
$$ packed form
13954A719541R5883q0433j72904Q2048L21718k75450j11195K056J09490K57649
13944A948403m76508J67857K64891n50819L21312n11390K21001L11625j7957K7974
13934A706389k07127k6704l7085Q4183j8130k8964j37198L30452j69468K15250
13924A711598P8156n42338K16832n8324J84288l32293K01563j99974J67459J56228
13914A583195j725l73544m7577n5922K83665k42683K38154j70831J92550k30071
13904A175211K61390R9105j22247k34051N752K00456j39580q7950L24476l97787
13894A084775K77535n88311L78597K072K5442J20430k78842L75703k7562P1289
13884A441128k23054o5333J42393m68142L59665k36696M41169n12739L07223n4925
$$ plain form
13874 1130689 1060883 1067707 1191676 1164189 1130360 973608 1050075 1218956 708272 1098991
13864 1098991 1133063 921836 865640 698341 1450432 737922 1033696 788531 1165443 726484
13854 726484 1081863 918480 812052 759505 1204076 816890 1052720 1109309 828989 896836
13844 896836 776779 835362 970674 707792 950893 758725 1004315 869890 1092008 936302
13834 936302 617132 674612 754814 888072 1196150 1007883 850899 1086737 597951 1113990
13824 1113990 1059577 786440 602910 936511 972746 1148942 1009398 684923 820384 769990
13814 769990 788790 867525 447852 797041 931775 1056304 901967 733977 697038 797232
13804 797232 745648 731161 732871 839095 797711 1033091 794165 920077 647720 749288
$$ packed form
13874A130689o9806O824J23969k7487l3829j56752P6467J68881n10684L90719
13864A098991L4072k11227n6196j67299P52091p12510K95774k45165L76912m38959
13854G26484L55379j63383j06428n2547M44571l87186K35830N6589k80320O7847
13844H96836j20057N8583J35312k62882K43101j92168K45590j34425K22118j55706
13834I36302l19170N7480Q0202J33258L08078j88267j56984K35838m88786N16039
13824A113990n4413k73137j83530L33601L6235J76196j39544l24475J35461n0394
13814G69990J8800P8735m19673L49189J34734J24529j54337j67990l6939J00194
13804G97232n1584j4487J710J06224m1384K35380k38926J25912k72357J01568
$$ plain form
13794 749288 890665 1110835 920613 579750 746754 588601 718588 941386 785094 581609
13784 581609 492331 551358 378826 517613 434351 641900 944578 490780 509411 656646
13774 656646 666966 638731 553473 803293 598881 851291 524695 748032 986792 337361
13763 400658 669044 639539 885707 451398 766645 925819 827911 658861 777875 629081
13753 629081 369565 537608 503329 521251 573392 903673 715706 705085 361639 478644
13743 478644 583658 902006 406043 476177 649563 494202 594707 332241 448271 885340
13733 885340 318063 628358 403873 644055 673447 886392 302406 651488 466820 547366
13723 547366 396125 385578 707048 213557 589998 413164 397654 306915 381009 509407
$$ packed form
13794G49288J41377K20170j90222l40863J67004j58153J29987K22798j56292k03485
13784E81609q9278N9027j72532J38787q3262K07549L02678m53798J8631J47235
13774F56646J0320k8235q5258K49820k04412K52410l26596K23337K38760C37361
13763D00658K68386k9505K46168m34309L15247J59174r7908j69050J19014j48794
13753F29081k59516J68043l4279J7922N2141L30281j87967j0621l43446J17005
13743D78644J05014L18348D06043P0134J73386j55361J00505k62466J16030M37069
13733H85340C18063L10295k24485K40182K9392K12945C02406L49082j84668Q0546
13723E47366j51241j0547L21470B13557L76441j76834j5510r0739P4094J28398
$$ plain form
13713 509407 131271 826670 676894 449397 302271 659261 238666 303495 607921 646935
13703 646935 205095 572449 350861 323830 550174 367810 565385 545149 128818 635872
13693 635872 362447 485529 441081 419401 456517 102957 567183 486198 702513 359086
13683 359086 410733 725564 353811 611684 590264 461130 512743 352378 129608 659464
13673 659464 250689 407710 331344 245023 295015 372098 594760 205713 723077 702042
13663 702042 419264 514389 484738 292452 435237 321348 448728 425410 380368 98933
13652 787890 188599 362883 582433 544889 531069 155076 349509 447101 369639 462032
13642 462032 423827 621732 199621 312371 357387 431282 270164 79022 259979 607383
$$ packed form
13713E09407A31271O95399j49776k27497j47126L56990B38666O4829L04426L9014
13703F46935B05095L67354k21588k7031K26344j82364J97575k0236A28818N07054
13693F35872k73425J23082m4448k1680L7116A02957M64226q0985K16315l43427
13683C59086N1647L14831C53811K57873k1420j29134N1613j60365A29608N29856
13673F59464B50689J57021p6366q6321M9992P7083K22662B05713N17364k1035
13663G02042k82778R5125k9651j92286J42785j13889J27380k3318m5042I8933
13652G87890A88599J74284K19550l7544j3820A55076J94433R7592p7462R2393
13642D62032l8205J97905A99621J12750M5016P3895j61118G9022J80957L47404
$$ plain form
13632 607383 249813 490542 395029 60030 -130553 327442 421035 417390 536715 513729 322685
13621 322685 581861 476179 38540 473838 288294 421478 376766 149429 530981 457298
13611 457298 370083 499469 470916 289947 185649 504970 421071 412358 346712 663925 510411
13600 510411 195215 107211 303349 385642 290078 565578 486888 396479 323674 272352 259399
13589 259399 224476 516953 432711 -56011 274686 509345 478020 485163 482854 56576 220471
13578 220471 438812 266519 449561 515689 354895 315698 468036 379731 527376 231469
13567 49260 482594 319129 237076 197009 63145 389809 298217 -27303 542229 178418 371226
13556 371226 220682 229384 165327 228197 297200 466401 220690 256319 398814 297189 134336
$$ packed form
13632F07383B49813K40729r5513F0030a30553C27442R3593l645J19325k2986j91044
13621C22685K59176j05682C8540M35298j85544J33184m4712A49429L81552p3683
13611D57298q7215J29386k8553j80969j04298L19321q3899q713o5646L17213j53514
13600E10411A95215q8004J96138Q2293r5564K75500p8690r0409p2805n1322j2953
13589B59399l4923K92477q4242e6011B74686K34659l1325P143k309E6576J63895
13578B20471K18341j72293J83042O6128j60794l9197J52338q8305J47645B31469
13567D9260M33334j63465q2053m0067F3145L26664r1592b7303E42229A78418J92808
13556C71226j50544Q702o4057O2870O9003J69201B20690L5629J42495j01625A34336
$$ plain form
13544 321888 -112918 382087 124703 357424 338002 33641 388315 443371 413306 -56587
13533 -146143 71593 179605 259682 114116 91607 -3754 147656 379629 353156 163223 146930
13522 146930 187581 392855 334873 182505 262865 539197 246870 384690 146663 27235
13511 521045 334744 176051 130016 456988 310151 184069 385222 216312 282374 443415
13501 443415 181942 61303 201509 70219 313466 183701 234580 137076 188488 414665
13491 414665 279594 373862 85125 184226 -46048 -215152 57493 102224 85891 195318 579520
13480 579520 -181222 164576 -145379 455478 62654 230505 -34128 204459 32506 350749
13470 350749 46024 448575 281483 164223 105858 349851 241129 266840 368833 363186
$$ packed form
13544C21888a12918C82087A24703K32721j9422C3641L54674N5056l0065e6587
13533a46143G1593J08012Q0077A14116k2509c754A47656K31973k6473A63223j6293
13522A46930M0651K05274n7982j52368Q0360K76332B46870J37820A46663B7235
13511E21045j86301j58693m6035L26972j46837j26082K01153j68910O6062J61041
13501D43415A81942F1303J40206G0219K43247j29765N0879r7504N1412K26177
13491D14665j35071R4268H5125R9101d6048j69104E7493M4731j6333J09427L84202
13480E79520a81222A64576a45379D55478F2654J67851c4128B04459C2506L18243
13470C50749D6024M02551j67092j17260n8365K43993j08722K5711J01993n647
$$ plain form
13460 363186 152352 461845 208006 143165 -2827 686266 72616 70989 343899 168797 330942
13449 330942 172050 287866 30343 -127268 125 186003 234897 80079 27101 297415 337409
13438 337409 266281 257353 247671 434251 445591 39401 204678 -23223 -104688 216297 193165
13427 193165 404155 190951 51985 546867 121616 8601 430664 -137687 142935 170766
13417 170766 136321 -54640 432333 300399 394900 239415 115280 80833 336587 81629
13406 95752 218778 -57373 185993 237104 -10095 151626 114857 89387 112490 306455 62099
13394 153462 320317 120023 19753 193086 507740 18521 105690 273460 183193 173391 296080
13383 296080 357066 224165 540040 -44839 29766 -31097 278858 121641 121025 180630 356674
$$ packed form
13460C63186A52352L09493B08006o4841b827F86266G2616j627K72910A68797J62145
13449C30942j58892J15816C0343a27268A25J85878M8894H0079B7101K70314L9994
13438C37409p1128q928r682J86580J1340C9401J65277b3223q1465B16297k3132
13427A93165K10990A90951E1985M94882A21616H601M22063a37687A42935K7831
13417A70766l4445e4640D32333j31934R4501j55485A15280l4447K55754H1629
13406I5752J23026e7373A85993N1111a0095A51626l6769k5470K3103J93965F2099
13394A53462J66855A20023A9753J73333L14654A8521Q7169J67770r0267r802J22689
13383B96080O0986j32901L15875d4839B9766c1097B78858A21641o16N9605J76044
$$ plain form
13372 356674 328022 275632 -122823 358970 99348 216890 255332 268936 227486 372065 521723
13361 521723 398635 146894 97481 710891 432551 173570 118414 153661 126358 253834
13351 253834 616590 38229 242930 637935 316447 335426 477723 414634 341297 425808
13341 425808 25780 104169 147092 21720 390768 54567 245190 246750 387126 123928 203975
13330 203975 -98435 -40785 74006 133285 112448 -79328 -79778 -21371 -114663 260362 258945 100573
13317 350503 196692 188850 342342 54190 307969 179926 9526 -45981 101800 -147038 -30892
13305 235321 90427 235326 74133 170651 157669 274511 -24976 153857 161607 345073 38961
13293 16004 -115782 27808 350641 82146 63328 312782 -68556 117128 199493 168837 435929
$$ packed form
13372C56674k8652n2390a22823C58970I9348J17542L8442J3604m1450J44579J49658
13361E21723j23088A46894m9413O13410k78340A73570n5156L5247k7303J27476
13351B53834L62756C8229K04701L95005C16447J8979J42297o3089p3337Q4511
13341D25808B5780P8389M2923B1720L69048E4567J90623J560J40376A23928Q0047
13330B03975i8435d0785G4006N9279k0837g9328m50b1371r3292B60362j417A00573
13317C50503j53811p842J53492E4190K53779j28043I526d5981A01800a47038c0892
13305B35321I0427J44899G4133R6518j2982J16842b4976A53857P750J83466C8961
13293A6004a15782B7808L22833H2146j8818K49454f8556A17128Q2365l0656K67092
$$ plain form
13282 435929 162977 324240 -42312 169300 -221903 25598 -180972 177489 -96253 297414
13271 445992 236287 -47040 347392 98750 227691 182371 -45266 -199845 152556 -85445
13260 78367 57541 18510 -39978 -45810 95157 245988 168046 36326 214037 167425 100592
13249 100592 230672 -64537 141314 287252 86249 -84728 3445 -128866 6445 -7191 36706
13237 -124018 -10916 283951 445681 387901 -68403 214629 8286 8931 101243 76567 244138
13226 244138 339963 311159 270964 440905 209587 131100 -48195 257988 97731 143841 144950
13215 144950 319446 129877 196214 359115 155536 -61910 264044 66107 239039 201527
13205 201527 169755 270216 42897 208137 -109930 -91898 271544 328856 429214 89457
$$ packed form
13282D35929A62977J61263d2312A69300b21903B5598a80972A77489i6253B97414
13271D45992k09705d7040C47392I8750J28941m5320d5266j54579A52556h5445
13260G8367k0826A8510c9978n832I5157J50831p7942C6326J77711m6612o6833
13249A00592J30080f4537A41314J45938H6249h4728C445a28866F445g191C6706
13237a24018a0916B83951J61730n7780f8403B14629H286O45R2312k4676J67571
13226B44138R5825k8804m0195J69941B09587p8487d8195B57988I7731M6110J109
13215A44950J74496A29877O6337J62901A55536f1910B64044F6107J72932l7512
13205B01527l1772J00461D2897J65240a09930J8032B71544N7312J00358H9457
$$ plain form
13194 -55608 121536 267674 36485 43148 -217090 78863 -246633 259179 117861 -21964 -184733
13183 -184733 -19392 -64616 -23167 -41569 315353 218928 -45061 123425 -149721 -279400 48342
13171 229746 -167536 145881 364548 -68801 223442 221301 254599 220225 254709 409122 -246512
13159 382385 256881 666393 -126220 -131948 36386 15711 -42242 -83559 165635 197011 56620
13147 -199935 177008 -12670 26486 13477 26566 -193941 23856 158897 145656 47039 38407
13136 38407 -122487 -173652 -21878 40266 386756 164536 -170068 89889 -61014 -30257 -247727
13125 -247727 132411 154883 105583 192566 151832 62587 -30235 88826 68628 4683 73895
13114 73895 -122087 539754 -19245 -129462 175890 3566 -231697 95257 -61522 -115513 354091
$$ packed form
13194e5608A21536J46138C6485O663b17090G8863b46633B59179A17861b1964j62769
13183a84733a9392m5224b3167j8402C15353r6425d5061A23425a49721j29679D8342
13171B29746a67536A45881K18667f8801B23442k141L3298l4374L4484J54413b46512
13159C82385j25504M09512a26220n728C6386A5711d2242m1317A65635L1376E6620
13147a99935A77008a2670B6486j3009J3089a93941B3856J35041j3241D7039q632
13136C8407a22487n1165b1878D0266L46490A64536a70068H9889f1014c0257k17470
13125b47727A32411K2472m9300Q6983m0734F2587c0235H8826k0198D683O9212
13114G3895a22087E39754a9245j10217A75890C566b31697I5257f1522n3991C54091
$$ plain form
13102 282862 -53907 -2637 55143 -28750 47185 182712 36556 139008 -14169 220368 -32287
13090 -132516 -228150 -82800 209302 125317 -299742 216296 155716 -244490 -93726 -40454 88088
13078 1693 -69696 115885 109138 -11329 249537 -114207 333845 95919 23227 267864 -104578
13066 133421 401563 -6502 454100 -192527 56418 154701 220554 48106 -238126 291662 -60495
13054 225343 285786 28810 69714 306977 95016 75062 288040 -141001 56724 -49520 300802
13042 78488 45972 10873 -11961 211658 16708 194948 245197 71426 -18227 216455 -8636
13030 108387 128764 201570 18832 394886 -113015 366271 304096 186980 -325873 263528
13019 239689 44600 59982 324537 165663 158007 311613 300485 -84584 47697 84558 19917
$$ packed form
13102B82862e3907b637E5143b8750D7185J35527C6556J02452a4169B20368c2287
13090a32516r5634h2800B09302q3985b99742B16296o0580b44490i3726d0454H8088
13078A693f9696A15885o747a1329B49537a14207C33845I5919B3227K44637a04578
13066A33421K68142f502D54100a92527E6418R8283O5853D8106b38126B91662f0495
13054B25343O0443B8810M0904K37263I5016j9954K12978a41001E6724d9520C00802
13042G8488l2516A0873a1961B11658A6708J78240N0249G1426a8227B16455h636
13030A08387K0377P2806A8832L76054a13015C66271o2175j17116c25873B63528
13019B39689D4600J5382K64555j58874p656J53606j1128h4584D7697L6861A9917
$$ plain form
13007 44074 -203945 -403434 -91265 144950 273985 227900 -23138 239933 -48336 -113718 82145
12995 40586 177433 12286 97430 571449 137726 275138 80071 315741 162048 77346
12984 105187 289018 25037 136482 -15584 -32855 -61704 22708 -1284 -39213 -39120 -30688 -22181
12972 -22181 119247 -138164 185463 -184753 16361 50327 -51365 293820 66691 69857 -168312
12960 -95517 165612 -23487 178652 43144 296118 -206408 -283815 57629 38305 446039 117506
12948 -147147 -94906 332717 -140608 -13099 81405 349995 184012 178721 -107838 47193 -82019
12936 -312154 -181865 -100837 -232581 -17339 430263 133322 24591 119832 247445 33574
12925 212350 114768 1286 -41295 247594 -35439 348519 -166584 -231765 -30517 -29427 -23220
$$ packed form
13007D4074b03945j99489i1265A44950J29035m6085b3138B39933d8336o5382H2145
12995D0586J36847A2286Q5144M74019A37726J37412H0071K35670j53693G7346
12984A05187J83831B5037J11445a5584j7271k8849B2708a284l7929R3Q432Q507
12972b2181A19247a38164A85463a84753A6361L3966e1365B93820F6691L166a68312
12960i5517A65612b3487A78652D3144K52974b06408p7407E7629j9324M07734A17506
12948a47147N2241C32717a40608a3099H1405K68590j65983n291a07838D7193h2019
12936c12154J30289Q1028j31744a7339D30263A33322B4591R5241J27613C3574
12925B12350r7582A286d1295B47594c5439C48519a66584o5181c0517J090O207
$$ plain form
12914 -23220 -132785 246977 20425 -304033 -4376 -248360 -70325 -97800 -157588 10352 119204
12903 119204 327912 198003 4955 -24611 165320 39547 233783 -42251 77596 9863 70664
12892 70664 143136 81899 262380 42775 52883 258506 206149 -65871 250871 339544 -108942
12880 -199691 195460 -139037 -9727 -58251 -119139 -112260 -53662 144788 -16294 -105395 299198
12868 159785 55134 149766 62035 58827 2649 -267967 -59416 -103676 199357 20153 34400
12857 34400 105926 60082 -8136 25749 54791 101876 229759 321556 -294540 -22508 122454
12845 -579 38962 14846 2892 398625 270105 88433 -60485 -12607 -94637 79597 291784 -14463
12832 347 198922 -30777 -110441 94262 235197 46845 105780 39766 536970 170730 -254850
$$ packed form
12914b3220j09565B46977B0425c04033d376k43984g0325k7475n9788A0352J08852
12903A19204K08708j29909D955b4611A65320C9547J94236d2251G7596I863O0801
12892G0664P2472o1237J80481D2775J0108K05623n2357f5871B50871Q8673a08942
12880a99691A95460a39037i727m8524o0888O879e3662A44788a6294q9101B99198
12868A59785E5134R4632F2035l208B649b67967e9416m4260A99357B0153J4247
12857C4400P1526m5844h136B5749K9042M7085J27883R1797b94540b2508A22454
12845e79C8962A4846B892L95733j28520H8433f0485a2607q2030G9597K12187a4463
12832C47J98575c0777p9664I4262J40935D6845N8935C9766M97204A70730b54850
$$ plain form
12820 189142 110176 -19277 -155167 111574 221447 -356371 -113250 -266318 97276 167779
12810 167779 -176832 348504 255785 88036 191208 104823 -137776 230531 -127580 313323
12799 103775 -263824 -33958 -194070 18365 -256643 27176 154941 -14249 135309 -191275
12788 305606 240637 182623 -321718 -24631 -81311 367000 -57174 -225931 164126 -112848
12777 -200408 -69162 3193 -24927 -183357 -192509 161310 -124023 289233 174508 291475 40592
12765 118160 -60067 -31774 176626 118819 -238391 63647 149909 -242387 -266792 -93169 42247
12753 142388 -57785 -213741 15177 45160 267036 -136704 -377320 -22217 -312138 236585
12742 108067 175527 92389 -91041 40360 155200 -14514 102107 -77136 275382 -210900 -45374
$$ packed form
12820A89142p8966a9277j35890A11574J09873c56371a13250j53068I7276P0503
12810A67779a76832C48504r2719H8036J03172q6385a37776B30531a27580C13323
12799A03775b63824c3958j60112A8365b56643B7176J27765a4249A35309a91275
12788C05606o4969n8014c21718b4631n6680C67000e7174j68757A64126a12848
12777b00408f9162C193b4927j58430r152A61310a24023B89233j14725J16967D0592
12765A18160f0067K8293A76626n7807b38391F3647Q6262b42387k4405i3169D2247
12753A42388e7785j55956A5177K9983K21876a36704k40616b2217k89921B36585
12742A08067O7460q3138i1041D0360J14840a4514A02107g7136B75382b10900d5374
$$ plain form
12730 428573 -61371 213178 104068 -172716 2599 188099 147943 -48660 149099 -7310 -156171
12719 -156171 275412 -288364 197076 206158 106484 -77397 349223 431749 64266 261730 148610
12708 148610 283199 113063 98902 -202704 34320 -29978 176811 19854 -22293 -122283 -30691
12696 409236 117202 -26702 96625 -299672 -14998 -16646 -153777 -203626 187683 -182665 -333265
12685 -333265 31932 145642 35379 126193 371358 177100 286470 107683 103360 63834 41677
12674 41677 215469 354411 49281 66302 -4490 -156395 79979 -261814 -42565 260228 191061
12663 191061 -125234 289073 246738 128974 111263 236877 -44567 388308 124950 97262
12653 97262 142833 115852 279665 311070 265366 -17732 17866 -206995 -40419 -155409 -180421
$$ packed form
12730D28573f1371B13178A04068a72716B599J85500m0156d8660A49099g310j48861
12719a56171B75412b88364A97076R082r9674g7397C49223Q2526F4266J97464j13120
12708A48610J34589A13063j4161b02704C4320b9978A76811A9854b2293r9990c0691
12696D09236A17202b6702I6625b99672a4998j648j37131m9849A87683a82665j50600
12685c33265C1932J13710C5379R0814K45165A77100J09370A07683m323l9526k2157
12674D1677J73792J38942D9281J7021d490j51905G9979b61814d2565B60228o9167
12663A91061a25234B89073m2335j17764j7711J25614d4567C88308A24950k7688
12653I7262M5571k6981J63813L1405m5704a7732A7866b06995d0419j14990k5012
$$ plain form
12642 -180421 30981 -182235 -173491 -405657 112877 136782 277691 194967 -113962 95777 -32583
12630 -118212 193336 15232 197710 159053 388295 106057 410863 113421 211157 236938
12620 236938 -832 132235 -62589 215998 151588 -15465 141189 205505 268125 183847 198489
12609 198489 -93481 -99833 -175729 338261 210837 309806 -70762 -310525 -67035 319882 -64129
12597 179601 346622 -236270 65762 260817 -215500 45169 215925 207936 115659 -147300
12586 34478 36316 -28996 94342 142942 28995 246929 -109376 872 -20710 -171140 169423
12574 92995 69623 153461 288930 -258015 299075 121000 -166671 -46482 -12103 -439125
12564 -439125 107249 288974 -40735 303413 135476 179119 -34976 55567 89967 181050 -182206
$$ packed form
12642a80421C0981a82235Q744k32166A12877K3905J40909q2724a13962I5777c2583
12630a18212A93336A5232J82478l8657K29242A06057L04806A13421R7736K5781
12620B36938h32A32235f2589B15998o4410a5465A41189O4316O2620q4278J4642
12609A98489i3481o352p5896C38261j27424R8969g0762k39763f7035C19882f4129
12597A79601J67021b36270F5762J95055b15500D5169J70756p989r2277a47300
12586C4478J838b8996I4342M8600B8995K17934a09376H72b0710j50430A69423
12574I2995k3372Q3838J35469b58015B99075A21000a66671d6482a2103m27022
12564d39125A07249J81725d0735C03413A35476M3643c4976E5567L4400R1083a82206
$$ plain form
12552 158992 187351 153564 105345 -101836 -237561 -109074 -127680 179866 139125 157987 197653
12541 197653 207726 107164 -114379 -307246 -26322 -311798 185052 -187074 -68939 44817
12530 -123368 47097 -168669 -198880 53150 288712 130855 -118463 -34279 -170225 101455
12519 -136751 -161210 -102762 -107193 163521 2184 -47704 -14897 -291328 367902 51532 -84120
12507 47996 -129553 -77777 245810 96104 311699 174463 99889 -46915 31253 345088 -4059
12495 241860 67499 -114485 -207722 186468 -74439 253435 303598 -19267 78674 -96338 192244
12483 -200112 332837 -298026 128375 -30958 29057 -45959 40331 69183 -16167 -44435 -275805
12472 -275805 15501 -121171 -137840 -124038 -2614 -269351 12301 120259 103708 113745 379282
$$ packed form
12552A58992K8359l3787m8219a01836j35725a09074j8606A79866m0741J8862L9666
12541A97653J0073j00562a14379j92867b6322k85476A85052a87074f8939D4817
12530a23368D7097a68669l0211E3150K35562A30855a18463c4279j35946A01455
12519a36751k4459N8448m431A63521B184d7704a4897k76431C67902E1532h4120
12507D7996a29553N1776B45810I6104K15595j37236p4574d6915C1253L13835d059
12495B41860F7499a14485r3237A86468g4439B53435N0163a9267G8674i6338A92244
12483b00112C32837b98026A28375c0958B9057d5959D0331K8852a6167k8268k31370
12472b75805A5501a21171j6669J3802b614k66737A2301J07958j6551J0037K65537
$$ plain form
12461 379282 -165622 221285 -255091 -145099 153457 172140 -372872 54000 -128214 -38878
12450 -213606 112482 299182 214304 -129816 -150780 -140101 274114 -148667 -51902 224656
12439 53440 178682 14663 109432 -52932 -14526 -322043 132482 -76639 92934 -106021 60979
12427 104906 79651 -74560 28465 41801 -137537 148839 156910 136975 61425 -8574 235431
12415 111343 383432 231074 -37280 -51194 36993 -93922 -3005 142209 365535 246085 -95082
12403 -98710 249090 226577 -8387 -205006 -81615 -36055 -195298 -41268 -184796 120536 17154
12391 -208469 302807 -388295 -36019 -326651 109171 -36601 75747 78310 94133 -127211 -159151
12380 -159151 -73271 356520 214811 316864 114627 -161308 130829 13504 -51167 -216713
$$ packed form
12461C79282a65622B21285b55091J09992A53457J8683c72872E4000a28214c8878
12450b13606A12482J86700q4878a29816k0964J0679B74114a48667e1902B24656
12439E3440J25242A4663R4769e2932a4526l07517A32482g6639I2934a06021F0979
12427A04906k5255g4560B8465J3336a37537A48839Q071j9935F1425h574B35431
12415A11343K72089j52358c7280j3914C6993i3922c005A42209K23326j19450i5082
12403i8710B49090k2513h387j96619h1615c6055j59243d1268j43528A20536A7154
12391b08469C02807c88295c6019k90632A09171c6601G5747K563J5823a27211l1940
12380a59151g3271C56520j41709J02053A14627a61308A30829A3504e1167j65546
$$ plain form
12370 -216713 -87612 -31549 -304272 -106051 -167619 61835 388739 -58378 265568 -23168 -314461
12359 -314461 -93803 -104109 -26512 -117831 -163073 -120535 23791 -72624 212163 -155984 23368
12347 -76758 312950 186103 20823 218893 283188 122583 113088 -254182 -151762 28722 75458
12336 75458 93168 -50573 54490 41419 -106592 17875 253614 5638 -152013 -111298 -77089
12325 -77089 201083 114696 -129866 235752 71281 -22851 259010 -196471 -248482 198956
12314 -306288 92217 134920 5870 315580 46221 285392 228264 -159641 -14593 -83 -81338 147406
12301 68100 213965 -142410 313279 -44303 202218 19089 -115981 54887 -33621 152208
12290 25558 -90072 -104387 443542 -50634 -79212 35952 -205678 162283 107667 104408 162286
$$ packed form
12370b16713h7612c1549k72723a06051o1568F1835L26904e8378B65568b3168k91293
12359c14461i3803j0306b6512r1319m5242M2538B3791g2624B12163a55984B3368
12347g6758C12950j26847B0823J98070O4295A22583r495b54182J02420B8722M6736
12336G5458J7710e0573E4490j3071a06592A7875K35739E638a52013M0715L4209
12325g7089B01083q6387a29866B35752G1281b2851B59010a96471n2011A98956
12314c06288I2217M2703E870L09710D6221K39171n7128a59641a4593h3q1255A47406
12301F8100J45865a42410C13279d4303B02218A9089a15981E4887c3621A52208
12290B5558i0072j4315D43542e0634k8578C5952b05678A62283n4616l259N7878
$$ plain form
12279 162286 -166786 107352 -3381 267721 50915 99984 28358 234557 -192657 118892
12268 236013 -521 22198 293115 -22994 165176 92597 152884 82532 -110486 14495 -40121
12256 77574 32574 -159010 68521 37154 293303 212504 -3517 246944 -213324 -17760 92845
12244 282857 21597 -37440 154633 -65231 65901 305662 47979 -287093 -1027 292646 195657
12233 195657 222707 -165057 264495 59672 218635 388293 232399 337892 120291 -149021
12222 103458 61134 163556 278108 284952 63454 358343 76998 13116 471999 -165148 116175
12210 252144 110175 158067 214225 285257 -35774 35079 86975 306344 243786 8296 196780
12199 196780 422333 -10381 330138 221594 268377 248834 136090 94080 194154 219199
$$ packed form
12279A62286a66786A07352c381B67721E0915M9069B8358K06199a92657A18892
12268B36013e21B2198K70917b2994A65176p2579O0287p0352a10486A4495d0121
12256G7574C2574a59010F8521l1367K56149q0799c517B46944b13324a7760I2845
12244B82857B1597c7440A54633f5231F5901K39761D7979b87093a027B92646r6989
12233A95657K7050a65057B64495E9672J58963J69658j55894J05493A20291a49021
12222A03458m2324J02422J14552O844F3454K94889G6998A3116M58883a65148A16175
12210B52144A10175M7892N6158P1032c5774C5079N1896K19369o2558H296J88484
12199A96780K25553a0381C30138j08544M6783j9543j12744m2010J00074K5045
$$ plain form
12189 219199 225670 88495 443467 188767 288878 176214 206384 209357 39128 -208861 67853
12177 -56177 144844 -64812 457288 52384 141781 89160 170810 113951 -88880 217603 -61253
12165 92751 11183 159641 258734 152627 -147277 312319 -177034 197405 -114136 -36110
12154 360746 -17296 143370 15356 97702 -160928 56225 135289 -66483 -28058 142947 101383
12143 101383 -143768 -73476 -2309 20825 271566 204633 11514 73818 -59543 26066 -518159
12131 -107590 -364110 104713 -1937 215114 102141 -124438 127804 200508 516468 109301
12120 182065 194111 153178 -44167 13067 4938 35450 206724 77244 27135 -35251 -2513 235295
12107 -369603 -75927 189489 -84446 279310 37449 -313722 79255 151582 -199561 139801
$$ packed form
12189B19199O471H8495L54972A88767J00111j12664L0170K973C9128b08861F7853
12177e6177A44844f4812D57288E2384Q9397n2621Q1650n6859h8880B17603f1253
12165I2751A1183J48458R9093j06107a47277C12319a77034A97405a14136c6110
12154C60746a7296A43370A5356Q2346a60928E6225P9064f6483b8058A42947m1564
12143A01383a43768P0292b309B0825K50741o6933A1514O2304e9543B6066e18159
12131a07590k56520A04713a937B15114A02141a24438A27804P2704L15960A09301
12120A82065J2046m0933d4167A3067D938L0512J71274G7244B7135c5251b513B35295
12107c69603g5927A89489h4446B79310C7449c13722G9255P2327a99561A39801
$$ plain form
12096 151921 -121977 219491 60454 143723 188094 283692 -231783 -63430 165419 -116975
12085 -189001 -444482 -214081 -115845 -363464 75422 -193093 148202 139419 -32194 -219027
12075 -219027 226678 -165793 212084 658112 1332762 2249732 726765 28968 301558 326966
12065 326966 371020 -10525 -352666 -40371 132010 114907 7760 99364 112625 170923 -304206
12053 -52433 -42514 -111868 116237 49315 2751 -224182 277828 261235 123777 84418 -89093
12041 -212564 49059 -171181 72788 27289 -332365 -98965 -42943 91636 -201585 -6528 47517
12029 50100 -124971 -257881 -171657 82899 14140 47265 20179 119192 79578 71533 110628
12018 110628 -55990 117490 -53144 262205 164609 -143777 -80849 -202624 220468 -165509
$$ packed form
12096A51921a21977B19491F0454Q3269M4371R5598b31783f3430A65419a16975
12085a89001k55481b14081R8236k47619G5422a93093A48202q783c2194j86833
12075b19027B26678a65793B12084M46028O74650R16970G26765B8968K72590K5408
12065C26966M4054a0525l42141d0371A32010j7103G760R1604J3261N8298c04206
12053e2433R919o9354A16237D9315B751b24182B77828j6593A23777l9359h9093
12041b12564D9059a71181G2788B7289c32365i8965d2943I1636b01585f528D7517
12029E0100a24971j32910Q6224H2899A4140L3125B0179R9013l9614q045L9095
12018A10628e5990A17490e3144B62205r7596a43777O2928j21775B20468a65509
$$ plain form
12007 14310 215625 85173 -160637 -139146 178832 -464634 -165987 -13110 -4596 154730 -4356
11995 146585 152718 56948 42805 -264003 68001 86519 111978 176466 -50694 143609 305488
11984 305488 -332069 -55639 40047 361083 -31681 168838 -124574 -228987 47116 47123 46699 -202245
11971 130313 -100889 -106873 -229705 -35534 -79269 41421 -76498 -13742 -97302 -222075 -120518
11960 -120518 290806 335418 182160 26025 -40438 69233 -109705 5484 -311562 -48171 -73357
11949 -73357 -51188 22106 -63975 147006 -268427 -20475 -136602 96540 49291 -81157 -246295
11938 -246295 13856 272345 254347 82314 -161959 204143 172034 102401 168226 -219620 23160
11926 164310 -137250 -25453 106859 -32358 216517 49956 -15307 39653 72157 224768 -91461
$$ packed form
12007A4310K01315H5173a60637K1491A78832d64634a65987a3110d596A54730d356
11995A46585O133E6948j4143b64003F8001J8518K5459O4488e0694A43609J61879
11984C05488c32069e5639D0047L21036c1681A68838a24574j04413D7116Pm24b02245
11971A30313a00889n984j22832c5534m3735D1421g6498a3742q3560j24773J01557
11960a20518B90806M4612j53258B6025d0438F9233a09705E484c11562d8171k5186
11949g3357K2169B2106f3975A47006b68427b0475j16127I6540m7249h1157j65138
11938b46295A3856K58489j7998H2314a61959B04143l2109o9633O5825b19620B3160
11926A64310a37250b5453A06859c2358B16517D9956a5307C9653L2504J52611i1461
$$ plain form
11914 386484 6265 2670 142065 -133406 85206 -144939 -140084 86569 150204 -273170 177811
11902 34821 33964 328994 -82352 30131 -70740 39388 45679 -171387 -81915 -166101 50226 127186
11890 127186 -327758 144710 -141629 -64949 34681 -44168 -161329 -137223 -181646 13746 -199104
11878 124236 -188437 -77543 -72843 -130804 12212 -98894 139182 -125615 -227062 -375041 -118847
11866 -277193 54622 60312 -85015 -115131 274247 -236753 -154508 168839 -24379 174811 -237642
11854 114795 -106164 216318 119250 -305792 146560 -171492 -119363 -167164 -320105 -143836
11843 -203029 -14954 98462 11006 -6285 -342234 -197219 -112419 -10808 -276804 -219918 141488
11831 117760 372703 108845 -3547 5900 49063 -205876 128696 14220 -260595 -838 95368
$$ packed form
11914C86484F265B670J39395a33406H5206a44939M855H6569O3635b73170A77811
11902C4821q57K95030h2352C0131g0740C9388O291a71387h1915q4186E0226P6960
11890A27186c27758A44710a41629f4949C4681d4168j17161K4106m4423A3746a99104
11878A24236a88437g7543M700n7961A2212i8894A39182a25615j01447j47979a18847
11866b77193E4622N690h5015l0116B74247b36753Q2245A68839b4379A74811b37642
11854A14795a06164B16318r7068c05792A46560a71492N2129m7801j52941a43836
11843b03029a4954I8462A1006f285l35949J45015Q4800a0808k65996N6886A41488
11831A17760K54943A08845c547E900M3163b05876A28696A4220b60595h38I5368
$$ plain form
11819 -113338 -108003 -378547 -165732 -267721 184694 -30480 105375 353712 116107 61039
11809 61039 -194047 -142109 -297934 -32079 -36353 7967 55738 -53582 -280582 28379 28691 -84508
11796 17513 -6666 -48791 72070 -19214 223204 -46462 6271 136592 55550 105992 23038 264895
11784 264895 52831 138875 -13850 45868 -363911 278399 226170 -141516 41064 -270687 -131137
11772 258797 87132 -145334 -270140 146827 314718 -314838 154887 -181533 112324 -63742
11761 -258732 -9356 -248542 -49416 -135583 137912 199915 -109075 207239 -99208 -20890 -51718
11750 -51718 -85033 5962 -190357 45141 178905 -235914 -91959 -179134 -37243 197868 364292
11739 364292 -149037 -109891 -211362 107681 100159 -53988 32124 -151696 482770 -481 103605
$$ packed form
11819a13338N335k70544a65732j01989A84694c0480A05375K48337A16107n5068
11809F1039a94047N1938j55825c2079m274G967M7771e3582k27000B8379L12h4508
11796A7513f666m2125G2070a9214B23204d6462F271J30321E5550N0442B3038K41857
11784B64895E2831Q6044a3850D5868c63911B78399n2229a41516D1064b70687a31137
11772B58797H7132a45334j24806A46827J67891c14838A54887a81533A12324f3742
11761b58732i356k39186d9416q6167A37912O2003a09075B07239i9208b0890l0828
11750e1718l3315E962a90357D5141J33764b35914i1959q7175c7243A97868J66424
11739C64292a49037L9146j01471A07681p522e3988C2124a51696D82770d81A03605
$$ plain form
11727 141134 -36841 6890 163723 -145358 -15056 40886 179275 -66690 60303 -285458 -39403
11715 164869 907 92655 -152749 117372 6126 179561 107773 225453 -11306 -78855 94412
11703 -7457 -13682 134728 59003 105564 249388 -92896 -241792 141238 -101290 13160 -21613
11691 217490 -2990 244244 2475 227715 158706 165513 -14231 -114670 376925 13724 44443
11680 44443 -51012 -220244 86915 -35748 -15967 135929 47602 198712 -112256 60484 236678
11669 236678 65584 222653 75318 -22538 239759 38602 -8934 145101 -74088 213715 60229
11657 -95826 390647 57840 39841 -131022 -4713 335072 -238999 85436 21214 -172372 -69057
11645 -89858 -48585 -41446 -264721 10926 233301 167654 -20197 28902 88155 -320613 -138714
$$ packed form
11727A41134c6841F890J56833a45358a5056D0886J38389f6690F0303b85458c9403
11715A64869I07R1748a52749A17372F126J73435p1788J17680a1306o7549I4412
11703g457o225A34728E9003M6561J43824i2896j48896A41238a01290A3160b1613
11691B17490b990B44244B475K25240o9009O807a4231j00439C76925A3724L0719
11680D4443e1012j69232H6915c5748a5967A35929D7602J51110a12256F0484J76194
11669B36678F5584J57069G5318b2538B39759C8602h934A45101g4088B13715F0229
11657i5826C90647E7840j7999a31022d713C35072b38999H5436B1214a72372f9057
11645h9858M1273P139k23275A0926K22375o5647b0197B8902N9253c20613a38714
$$ plain form
11633 38493 151749 170589 -68210 125315 -173601 144379 235664 -108120 -113926 -141587 162702
11621 -192595 -287100 108202 69972 162307 -111016 -237874 -113603 41874 293811 -195630
11610 74845 -157867 -129014 146911 243080 -38446 429395 304225 68179 119117 -82915 -83069
11599 -83069 -83495 125501 191681 -130661 -46477 135289 358314 -104441 -130012 146892 137003
11588 137003 6069 -138091 190058 468432 11897 -99966 403688 -82526 -268832 288861
11577 -234091 221273 -6674 -67786 -197488 188359 128558 87771 255217 -91436 -211707 104035
11565 246089 176578 305944 -38939 179891 227361 63634 -50407 -56024 -136203 -53965 1641
11553 54883 324972 161277 126765 -264252 176231 -113894 -20 18954 145342 -158839 -166566
$$ packed form
11633C8493J13256J8840f8210A25315a73601A44379R1285a08120n806k7661A62702
11621a92595r4505A08202l8230R2335a11016j26858a13603D1874K51937a95630
11610G4845a57867K8853A46911R6169c8446D29395j25170F8179N0938h2915j54
11599h3069m26A25501O6180a30661d6477A35289K23025a04441k5571A46892r889
11588A37003F069a38091A90058K78374A1897i9966D03688h2526j86306B88861
11577b34091B21273f674o1112j29702A88359n9801m0787J67446i1436j20271A04035
11565B46089o9511J29366c8939A79891M7470F3634e0407n617q0179e3965A641
11553E4883K70089A61277l4512b64252A76231a13894b0A8954J26388a58839p727
$$ plain form
11542 -166566 17828 443571 112152 147021 32755 341071 -54322 160842 -33968 -29746 69630
11530 165377 168347 -45327 149959 368966 201226 -309095 213747 -5464 -102942 145450 65793
11518 -364537 171981 248526 291700 123630 -103880 147892 290285 41746 -40943 3423 322084
11507 322084 121496 230729 79888 -137112 129438 341027 301095 -39998 -96748 105734
11496 -178323 -20630 127838 418717 25329 377694 68293 361248 223706 266214 24067
11485 43617 40677 329052 288715 285000 -56618 236009 34819 -64604 72555 69082 48596 -64729
11472 -126855 189838 298420 145131 138459 262306 -93331 -66524 320462 95051 213898
11462 213898 40821 -103543 146166 -1896 13716 -50549 466903 235667 -135475 155917
$$ packed form
11542a66566A7828M25743A12152L4869C2755L08316e4322A60842c3968M222F9630
11530A65377K970d5327A49959K19007j67740c09095B13747e464r7478A45450F5793
11518c64537A71981P6545M3174A23630a03880A47892J42393D1746d0943C423L18661
11507C22084A21496J09233G9888a37112A29438K11589l9932c9998n6750A05734
11496a78323b0630A27838K90879B5329L52365F8293K92955j37542M2508B4067
11485D3617k940K88375m0337l715e6618B36009C4819f4604G2555l473k0486f4729
11472a26855A89838J08582A45131o672J23847i3331K6807C20462I5051J18847
11462B13898D0821a03543A46166a896A3716e0549D66903k31236a35475A55917
$$ plain form
11451 -57481 -150187 -224588 85297 181129 154785 -24439 143114 12388 37130 76493 152921
11440 152921 37031 42391 28667 323464 -33036 119069 165129 28872 321455 -52353 3841
11428 -35329 26669 2824 -88347 -17057 207129 -118096 221701 -224882 76165 74018 194018
11417 194018 89044 4268 -138819 -17398 144461 169928 -20900 -266993 -42153 -61788 -305569
11406 -305569 48678 -166828 -40797 155322 64992 160893 57991 58984 -18196 -96038 224954
11394 165394 -498887 111711 -1001 -65267 59253 -151102 -162027 267481 120987 58982 152002
11383 152002 -227950 -72651 -149733 -70414 15147 -163115 -163307 -89995 -45266 -116939 220046
11371 -185035 159945 -628205 -2609 -7966 82940 145751 91717 -99814 107617 -314718 24201
$$ packed form
11451e7481r2706p4401H5297R5832k6344b4439A43114A2388K4742L9363P6428
11440A52921C7031N360j3724K94797c3036A19069M6060B8872K92583e2353C841
11428c5329B6669B824h8347a7057B07129a18096B21701b24882G6165k147J20000
11417A94018H9044D268a38819a7398A44461K5467b0900k46093d2153j9635k43781
11406c05569D8678a66828d0797A55322F4992R5901E7991R93a8196p7842B24954
11394A65394d98887A11711a001o4266E9253a51102j0925B67481A20987E8982R3020
11383A52002b27950g2651p7082g0414A5147a63115j92P3312M4729p1673B20046
11371a85035A59945f28205b609n357H2940O2811n4034i9814A07617c14718B4201
$$ plain form
11359 -70175 65834 77901 -69387 42317 -274538 -52693 -12308 -159932 319320 -5091 -226433
11348 -226433 -96414 -107118 -188588 -223253 -3156 219946 -143485 460750 125659 298800 18101
11336 -170399 76220 129787 277431 104615 310963 68506 -122312 91013 71901 -102866
11325 -129558 -247612 121957 -71097 -26740 169364 107746 -154934 -142153 -290078 13596
11314 120135 -84735 -174618 -153099 10712 -345059 -264711 220280 51949 -217298 -118911 313475
11302 -4998 -428112 183075 78934 118903 -61668 -89214 -269991 272938 -99048 -15504 149089
11290 -186008 -221018 -267959 261925 283896 -177578 -279866 59548 192063 65206 -23034 67867
11278 139186 -171550 49960 -288264 -181570 -247234 53801 -126698 23720 68319 -105179
$$ packed form
11359g0175F5834J2067f9387D2317b74538e2693a2308j47624C19320e091k21342
11348b26433i6414j0704q1470l4665c156B19946a43485D60750A25659J73141A8101
11336a70399G6220N3567J47644A04615K06348F8506a22312I1013j9112a02866
11325a29558j18054A21957g1097b6740A69364o1618a54934J2781j47925A3596
11314A20135h4735q9883K1519A0712c45059Q0348B20280E1949b17298R8387C13475
11302d998m23114A83075G8934L9969f1668k7546j80777B72938i9048a5504A49089
11290a86008l5010m6941B61925K1971a77578j02288E9548J32515F5206b3034F7867
11278A39186a71550D9960b88264J06694o5664E3801a26698B3720M4599a05179
$$ plain form
11267 91718 24098 -156480 -164569 -19247 22258 68893 -71912 -4271 68620 127904 50474 -238817
11254 -156860 -46549 -140635 232847 -67213 12033 -60279 21483 -96978 -40863 207571 -114461
11242 95092 -90765 28980 243498 -281270 -43067 240524 58128 30412 7422 -111752 -6053
11230 30711 -163615 -327617 -93239 378715 -88164 -210532 -134172 128793 69307 -280698
11219 -140691 -60176 -152560 311836 103067 -13077 4835 -310362 164526 -176941 -391492
11209 -391492 -59422 -75696 145214 -188294 10273 152672 -182933 121097 -336950 388542
11198 149852 188761 298443 -330682 -53306 -197694 -68136 -155279 -316672 10337 -34882 151959
11186 -118255 -38212 -117251 -279224 -333879 -215782 76103 59244 -99263 393034 -214689 -222335
$$ packed form
11267I1718B4098a56480q089a9247B2258M6635g1912d271F8620N9284E0474b38817
11254a56860d6549r4086B32847f7213A2033f0279B1483i6978d0863B07571a14461
11242I5092i0765B8980K14518b81270d3067B40524E8128k7716G422a11752f053
11230C0711a63615j64002i3239C78715h8164j22368P6360A28793n9486b80698
11219a40691f0176r2384C11836A03067a3077D835c10362A64526a76941k14551
11209c91492e9422j6274A45214a88294A0273J42399a82933A21097c36950C88542
11198A49852L8909J09682c30682e3306j44388f8136q7143j61393A0337c4882A51959
11186a18255c8212p9039j61973n4655J18097G6103j6859i9263C93034b14689p646
$$ plain form
11175 -222335 -158563 -171221 -115119 -73407 -163033 -49540 -97072 -32019 -237383 230666 -107896
11163 -28963 106188 252308 -113436 -82402 -140043 62872 -155061 8298 -242320 84990 274654
11152 274654 -506890 177882 -128540 235479 108757 -45750 -78800 -205636 164387 286062
11142 286062 134523 -69141 -90236 -159685 -126232 27997 108590 -86816 14387 -346357 173844
11130 37836 -16023 51515 -263356 213561 216344 -109667 -187685 177697 207357 2205 19426
11119 19426 133287 57402 116716 -119775 62362 -247848 68542 -194780 -216117 -149431 303562
11107 179495 390688 -22803 300627 258635 -197269 83085 84519 146195 382538 246391 95651
11095 79146 -150249 270563 429307 306423 400275 278891 257497 145213 228703 184536
$$ packed form
11175b22335O3772j2658N6102M1712q9626d9540m7532c2019k05364B30666a07896
11163b8963A06188J46120a13436L1034n7641F2872a55061H298b42320H4990J89664
11152B74654e06890A77882a28540B35479A08757d5750l3050j26836A64387J21675
11142B86062A34523f9141k1095o9449L3453B7997Q0593h6816A4387c46357A73844
11130C7836a6023E1515b63356B13561K783a09667p8018A77697K9660B205J7221
11119A9426J13861E7402N9314a19775F2362b47848F8542a94780k1337O6686C03562
11107A79495K11193b2803C00627m1992a97269H3085J434O1676K36343j36147I5651
11095G9146a50249B70563J58744j22884R3852j21384k1394j12284Q3490m4167
$$ plain form
11085 184536 69495 259240 274548 10059 96261 456283 472168 216015 554430 357901
11075 357901 221317 356991 140746 437427 330520 17688 304300 633320 257092 246998
11065 246998 233412 356947 355687 306108 559282 705526 670774 950246 423208 666794
11055 666794 606924 720371 483357 614185 597566 752566 693908 694986 528411 693600
11045 693600 620282 513078 976870 672023 506200 632926 445021 679603 716098 759748
11035 759748 584979 561375 326065 778657 685032 519719 838393 699226 664965 559723
11025 559723 263690 730014 606797 418533 425227 373598 599538 757552 705211 362384
11015 362384 586522 644793 599892 494482 470428 520706 665586 471279 468744 574202 516066
$$ packed form
11085A84536F9495J89745J5308A0059Q6202L60022J5885B16015L38415j96529
11075C57901j36584J35674A40746K96681j06907A7688K86612L29020B57092j0094
11065B46998j3586J23535j260m9579K53174J46244l4752K79472D23208K43586
11055F66794n9870J13447k37014J30828j6619J55000n8658J078j66575J65189
11045F93600p3318j07204M63792l04847j65823J26726j87905K34582L6495M3650
11035G59748j74769k3604k35310M52592r3625j65313L18674j39167l4261j05242
11025E59723B63690M66324j23217j88264O694n1629K25940J58014n2341l42827
11015C62384K24138N8271m4901j05410k4054N0278J44880j94307k535J05458n8136
$$ plain form
11004 516066 977083 488315 523739 599631 828086 459090 823783 784076 986535 684677
10994 684677 476515 588059 865473 697197 627650 634062 898254 790955 657876 943229
10984 943229 1112885 1018472 901419 906438 1514164 1040598 1525040 1547596 1901642 1949958
10974 1949958 2107052 2711367 2705983 2908364 2937259 2656914 2617584 2232171 2037717 1503434
10964 1503434 1779194 1653070 1308267 1481722 1423729 1707182 1098871 1374404 1766004 1707106
10954 1707106 1146443 1079550 1100295 849981 367002 709743 923126 381579 645980 269724
10943 37835 22054 213734 -643 203376 16847 -128678 130416 -16000 -17135 73788 179237
10932 179237 354578 129370 -86059 -342140 -29025 -7627 210395 181403 292058 -157399
$$ packed form
11004E16066M61017D88315L5424P5892K28455l68996L64693l9707K02459l01858
10994F84677k08162J11544K77414j68276o9547O412K64192j07299j33079K85353
10984I43229J69656r4413j17053N019O07726m73566M84442K2556L54046M8316
10974A949958J57094O04315n384K02381K8895k80345l9330l85413j94454n34283
10964A503434K75760j26124l44803J73455n7993K83453o08311K75533L91600n8898
10954A707106n60663o6893K0745k50314C67002L42741K13383C81579K64401B69724
10943C7835j5781J91680f43B03376A6847a28678A30416a6000j135G3788J05449
10932A79237J75341A29370h6059k56081b9025g627B10395k8992J10655a57399
$$ plain form
10921 -63591 231026 -84057 -85928 99060 166254 -268601 75738 -390670 164392 -225910 -8249
10909 334274 59538 -69887 267765 18101 -104938 77791 185226 -193161 142041 -117 373845
10897 -111937 -148616 -149597 -159135 -211281 15421 143107 182776 -101084 -13447 -297180 225175
10885 -30232 -318774 85793 208747 188869 -342267 -68440 -713 -76297 128926 -86249 -137210
10874 -137210 -249927 -407775 46274 261285 272786 39757 -26353 -53014 -40626 11189 323414
10863 323414 -230369 305438 152040 68780 -286978 67554 -180065 -330562 137667 -82740
10852 -221369 -143196 -117338 -292974 139105 -4706 5622 96312 -50518 -67073 -248431 38103
10840 -88254 -119970 175856 -60850 76881 -51892 161696 -1405 -195350 126909 233603 -34309
$$ packed form
10921f3591B31026h4057j871I9060O7194b68601G5738c90670A64392b25910h249
10909C34274E9538f9887B67765A8101a04938G7791J07435a93161A42041a17C73845
10897a11937l6679r81r538n2146A5421J27686L9669a01084a3447k83733B25175
10885c0232k88542H5793J22954j9878c42267f8440g13p5584A28926h6249n0961
10874a37210j12717j57848D6274K15011J1501C9757b6353k6661J2388A1189L12225
10863C23414b30369C05438A52040F8780b86978F7554a80065j50497A37667h2740
10852b21369P8173K5858j75636A39105d706E622R0690e0518j6555j81358C8103
10840h8254l1716A75856f0850G6881e1892A61696a405j93945A26909J06694c4309
$$ plain form
10828 -50313 -70518 102294 187351 -301347 23006 6279 -415756 70798 -185142 53163 -53851
10816 -173926 83102 -183166 -108444 -44640 -205642 145642 -22701 -70607 149709 89169 41701
10804 -143349 43684 35343 -104780 104481 -175390 135172 281076 -16048 -181004 993 29350
10793 29350 -108778 241585 63943 347 -382210 89958 304746 -27027 -100636 -98161 14858
10781 -207341 20743 -209946 86303 35216 -403395 64320 -109398 -10873 -25917 -332519 75220
10769 -264325 -69475 -2230 -36705 -100679 49807 78585 -23206 -75109 -109857 -78953 -85268 -24781
10756 39416 -99002 12043 147185 -264598 -99449 -114415 16778 36111 -11343 -157892 -122219
10745 -122219 -162010 83160 -386172 -216448 -201438 162587 -140713 185204 -89019 252188
$$ packed form
10828e0313k0205A02294Q5057c01347B3006F279d15756G0798a85142E3163e3851
10816a73926H3102a83166P4722d4640j61002A45642b2701m7906A49709o0540D1701
10804a43349D3684q341a04780A04481a75390A35172J45904a6048j64956I93K8357
10793B9350a08778B41585F3943C47c82210H9958K14788b7027p3609K475A4858
10781b07341B0743b09946H6303C5216d03395F4320a09398a0873j5044l06602G5220
10769b64325f9475b230l4475o3974D9807K8778b3206n1903l4748L0904o315b4781
10756C9416i9002A2043J35142b64598i9449j4966A6778J9333a1343j46549L5673
10745a22219l9791H3160c86172J69724J5010A62587a40713A85204h9019B52188
$$ plain form
10734 9674 449 -90777 26794 -151746 172167 143872 -235822 -94629 275113 -252368 -148271
10723 -148271 113447 -84542 44364 184598 -15047 -147800 -300586 -139687 -56562 -46840 55836
10711 -210177 162471 -38562 33454 -33465 35196 34015 269301 16838 59500 -45785 -12625
10699 -203974 57684 96063 -41026 -480690 -134503 -49935 -321719 -301406 -5567 -132687 65257
10687 261192 -326142 230088 -17130 -19498 100972 -225937 -98067 -135035 8783 -164226 -241733
10676 -241733 -175274 -64566 -749 44557 -213913 -305064 71468 -156056 -338324 160749 -267189
10664 -182637 341666 77866 192322 -44759 222207 72627 41716 46461 85651 -128349 -351711
10653 -351711 -119908 91896 -133936 -312551 -54884 153773 216388 -288862 -216838 51457
$$ packed form
10734I674D49i0777B6794a51746A72167k8295b35822i4629B75113b52368J04097
10723a48271A13447h4542D4364J40234a5047j32753j52786a39687e6562R722E5836
10711b10177A62471c8562C3454c3465C5196j181K35286A6838M2662d5785a2625
10699b03974E7684L8379d1026m39664a34503d9935k71784K0313e567j27120F5257
10687B61192c26142B30088a7130k368A00972b25937i8067l6968H783a64226p7507
10676b41733O6459f4566g49D4557b13913r1151G1468a56056j82268A60749b67189
10664a82637C41666G7866J14456d4759B22207G2627l0911M745L9190a28349k23362
10653c51711a19908I1896a33936j78615e4884A53773O2615b88862P2024E1457
$$ plain form
10642 -108812 56924 -32177 171876 -134430 149815 -47510 -166954 65585 134256 78223 -24313
10630 -123073 -251454 110865 -193734 -154613 99657 116433 113574 25699 -474507 -45702 -132134
10619 -132134 -77691 -156816 54946 12426 27104 6207 -183134 -78710 91452 5521 299844
10608 299844 -14700 43867 -29081 -185013 -310128 -212875 -144429 39112 -55350 -121799 -56474
10596 -168127 -114981 -38534 142405 -31460 103232 1202 125630 313135 23754 -128579 101146
10584 159625 301818 41865 -130131 -19229 -15766 -57338 -415889 -82448 8204 66740 -9798
10572 -42706 -296595 -92058 124748 -145338 38970 -8286 -159681 138092 -186548 -392388
10562 -392388 -117824 98691 114319 189748 -90526 -221241 230449 -134013 -496599 -106569
$$ packed form
10642a08812E6924c2177A71876a34430A49815d7510j19444F5585O8671n6033b4313
10630a23073j28381A10865a93734L9121I9657J6776k859B5699d74507d5702q6432
10619a32134N4443p9125E4946A2426J4678F207a83134g8710I1452E521K94323
10608B99844a4700D3867b9081j55932j25115R7253O8446C9112e5350o6449e6474
10596a68127N3146c8534A42405c1460A03232A202J24428J87505B3754a28579A01146
10584A59625J42193D1865a30131a9229L463m1572l58551h2448H204N8536i798
10572d2706k53889i2058A24748a45338C8970h286j51395A38092a86548k05840
10562c92388a17824I8691J5628P5429i0526j30715B30449a34013l62586a06569
$$ plain form
10551 157054 -21359 -196720 153595 -242117 152500 30276 -38908 -192017 14002 -150874
10540 179609 -358870 -161101 47494 4205 -114008 -70521 46721 -61253 14145 76808 -122315
10528 -56508 -120994 -161661 -4040 -270540 -258328 -152968 -139214 32165 147980 103131 -185256
10516 -119894 113211 -479472 -162422 211480 -255728 40203 -124348 -278080 26681 229392
10506 229392 115062 233226 -75502 262964 -48218 451267 275482 -195577 12067 3429
10495 9893 -331552 -111076 164043 437827 142746 -53706 146436 -144683 6562 250263
10485 250263 -161795 -22447 271585 550655 193967 171922 159463 239376 103133 -55146
10474 195543 28597 -22990 481775 -11566 116379 195957 267496 124954 104100 60045 138668
$$ packed form
10551A57054b1359j75361A53595b42117A52500C0276c8908j53109A4002a50874
10540A79609c58870a61101D7494D205a14008M3487D6721f1253A4145O2663a22315
10528e6508o4486m0667d040k66500J2212J05360J3754C2165J15815m4849a85256
10516a19894A13211d79472a62422B11480b55728D0203a24348j53732B6681K02711
10506B29392j14330J18164g5502B62964d8218D51267j75785a95577A2067C429
10495I893c31552a11076A64043K73784A42746e3706A46436a44683F562K43701
10485B50263a61795b2447B71585K79070A93967k2045j2459P9913A03133e5146
10474A95543B8597b2990D81775a1566A16379P9578P1539A24954k0854m4055P8623
$$ plain form
10463 138668 -390033 -61113 -247939 75172 -126401 -496502 247192 -153702 -293459 -221769
10453 -221769 -191231 94479 7349 -315342 142903 -132851 -26573 -11229 86185 19163 263497
10442 263497 -112939 -199204 -118540 -231863 217400 -92921 39887 -112480 -41349 132127
10431 47813 156722 -7589 70133 307461 -167618 133098 -117135 -115536 -233056 343291 21866
10419 134203 163899 302089 51162 81762 -203521 -42756 -270018 155955 1941 -23257 141309
10407 -61494 740 -41424 171784 -132222 205953 242571 -29318 170351 122404 -251328 182254
10395 370941 241424 -86363 62298 180912 146090 22447 -65535 212635 -29039 20605 191306
10384 191306 101765 -64670 -36731 31697 268661 68193 327768 303110 89228 316830 158422
$$ packed form
10463A38668c90033f1113j86826G5172a26401l70101B47192a53702j39757P1690
10453b21769L0538I4479G349c15342A42903a32851b6573a1229H6185A9163K44334
10442B63497a12939q6265Q0664j13323B17400i2921C9887a12480d1349A32127
10431D7813J08909g589G0133K37328a67618A33098a17135J599j17520C43291B1866
10419A34203K9696J38190E1162L0600b03521d2756k27262A55955A941b3257A41309
10407f1494G40d1424A71784a32222B05953L6618b9318A70351m7947b51328A82254
10395C70941j29517h6363F2298J18614l4822B2447f5535B12635b9039B0605J70701
10384A91306q9541f4670K7939C1697K36964F8193K59575k4658H9228K27602j58408
$$ plain form
10373 158422 84304 247485 73045 436196 489582 499423 572791 279889 406385 280766 300930
10362 300930 418100 186972 516607 236487 66782 -66888 234615 143819 146323 362715
10352 362715 306278 471248 -11085 223872 605661 201350 275012 306489 63711 580347
10342 580347 327937 -47785 401462 -75279 157194 173425 -8875 254998 279226 84439 25561
10330 79521 -242030 46762 -139661 100849 -85202 104070 51515 425251 246959 17238
10319 260219 -223098 126080 246117 151221 59493 313384 485127 47606 78958 122387
10309 122387 -80926 -403761 43388 -147038 50824 -23081 32144 -328823 -60969 247538 524823
10298 524823 -128165 206908 93 48545 36791 131960 -69508 93158 -58075 -124946 361648
$$ packed form
10373A58422p4118J63181G3045L63151N3386R841P3368B79889J26496j25619K0164
10362C00930J17170A86972L29635B36487F6782f6888B34615r0796K504K16392
10352C62715n6437J64970a1085B23872L81789B01350P3662L1477F3711N16636
10342E80347k52410d7785D01462g5279A57194J6231h875B54998K4228H4439B5561
10330G9521b42030D6762a39661A00849h5202A04070E1515L73736j78292A7238
10319B60219b23098A26080J20037r4896E9493K53891J71743D7606L1352M3429
10309A22387h0926l22835D3388a47038E0824b3081C2144c28823f0969B47538K77285
10298E24823a28165B06908I3M8452j1754R5169f9508I3158e8075o6871C61648
$$ plain form
10286 305742 -145669 22064 -273196 -362078 -52242 -305264 162194 -153603 58797 -223582
10275 60672 -23823 -9917 -51063 -203709 284566 -239358 -18106 -172366 143777 -97782 -30313
10263 235699 79308 307053 201957 177142 57968 252010 212141 242334 363557 -53854 -315639
10252 -315639 -46356 -34372 -32331 332489 -455533 -207638 -254947 -289146 56227 -49650 217651
10240 188109 -150275 -25373 105241 9963 167919 26640 81665 -122710 -83522 -42217 -162660
10229 -162660 77893 -4239 270054 -143379 -108831 -58883 -105850 -190412 -115059 177651 -109472
10217 -23003 261840 -48323 -193592 15715 22382 136996 -54318 44069 -258990 64236 -100735
10205 -302555 -158183 40999 -24834 -381161 196368 -51334 118902 -78452 -54779 -535032
$$ packed form
10286C05742a45669B2064b73196q8882e2242k53022A62194a53603E8797b23582
10275F0672b3823i917m1146j52646B84566b39358a8106j54260A43777i7782c0313
10263B35699G9308K27745j05096k4815E7968J94042l9869L0193J21223e3854k61785
10252c15639d6356J1984K041C32489d55533b07638m7309l4199E6227d9650B17651
10240A88109a50275b5373A05241I963J57956B6640N5025a22710L9188M1305j20443
10229a62660G7893d239B70054a43379L4548M9948m6967q4562P5353A77651a09472
10217b3003B61840d8323j45269A5715O667J14614e4318D4069b58990F4236a00735
10205c02555J44372D0999b4834l56327A96368e1334A18902g8452K3673m80253
$$ plain form
10195 -535032 -70111 191483 -227723 -65854 -77686 65349 54099 234014 21602 -87935 -116403
10184 -116403 -84522 75565 -152585 -28982 151295 -99930 -337674 18717 -115432 -146068 -140356
10173 -140356 -227764 -321766 -263135 212167 -227535 253263 94699 163020 -89950 -245530 335815
10161 164618 -31854 216269 -100336 -246824 -118346 -164673 59768 140643 -139395 -182827
10151 -182827 -161817 -15585 -64495 -107121 -32287 -175947 240925 -63188 -68005 27398 -139275
10139 -257645 -101202 -121922 -8985 -66920 -320257 -91188 -37664 -184309 -35893 35649 -120956
10127 -138406 -141985 19613 -211447 -109292 10723 -193520 -528247 163799 -117204 63441
10116 -361414 85377 -156465 -253370 -179602 -178052 27293 176393 -141062 199719 -370823 -17178
$$ packed form
10195e35032g0111A91483b27723f5854j1832F5349j1250J79915B1602h7935k8468
10184a16403L1881G5565a52585b8982A51295i9930k37744A8717a15432l0636N712
10173a40356q7408r4002N8631B12167b27535B53263I4699O8321h9950j55580C35815
10161A64618c1854B16269a00336j46488a18346m6327E9768Q0875a39395m3432
10151a82827K1010a5585m8910m2626c2287j43660B40925f3188m817B7398a39275
10139b57645a01202k0720h985n7935k53337i1188c7664j46645c5893C5649a20956
10127a38406l579A9613b11447J02155A0723a93520l34727A63799a17204F3441
10116c61414H5377a56465r6905P3768J550B7293J49100a41062A99719c70823a7178
$$ plain form
10104 -161270 39740 -168703 -349268 63743 329492 -206341 145014 -174680 -138169 41614
10093 137894 -4734 317490 6149 39331 -221247 23362 40723 -80628 223521 -502310 -123955
10081 251682 -274462 210703 -96817 192733 84866 -192408 -99110 -24053 39423 -161044
10070 -225780 243067 -84844 247665 18914 13311 -253736 -473032 334169 9306 -169851 -197521
10059 -197521 65719 -256546 24861 -168827 -35904 -1456 -130977 300199 -250685 -29189 -220243
10048 -220243 56955 113895 -379828 -13475 42142 -162130 -167950 -253536 115602 107528 -383981
10036 103552 416121 -231987 -45211 -388720 -97118 -74269 -20272 -180144 -123782 -284466
10026 -284466 -31603 -205472 -306499 60680 -140000 168919 -45593 72805 118353 21817 -170211
$$ packed form
10104a61270C9740a68703j80565F3743K65749b06341A45014a74680L6511D1614
10093A37894d734C17490F149L3182b21247B3362J7361h0628B23521e02310a23955
10081B51682b74462B10703i6817A92733H4866a92408R3298b4053C9423a61044
10070b25780B43067h4844B47665A8914n603b53736k19296C34169I306a69851k7670
10059a97521F5719b56546B4861a68827c5904a456j29521C00199b50685b9189j91054
10048b20243E6955N6940c79828a3475D2142a62130n820q5586A15602q074c83981
10036A03552L12569b31987d5211l43509i7118K2849b0272j59872N6362j60684
10026b84466c1603j73869j01027F0680a40000A68919d5593G2805M5548B1817a70211
$$ plain form
10014 -366563 -139280 20542 -31792 -127245 -53153 -460253 244084 -201416 -41853 -120854 29651
10002 -20798 -242632 -80205 -19126 -316023 -125869 -19105 -11297 202060 -367807 -8207 -131173
9991 -131173 113477 -121484 -104256 -189976 175290 126379 -90186 76901 -133915 -101812 261651
9979 171653 31321 26174 -434421 212132 141011 237838 47351 112008 -48100 -233636 168918
9967 -207471 -273152 -283050 -52 -255027 -13496 -160058 -58574 -138199 -43908 -148471 -123359 135594
9954 -59403 -312557 151513 -334371 -140707 -155343 -207063 53301 -207103 65159 -275734 -225350
9943 -225350 -155051 -499621 272125 -283876 263069 -117730 -296728 -77316 4982 -62036 -139977
9932 -139977 -288522 9856 132326 -257101 -152748 68725 -51328 200935 10769 75067 -207076
$$ packed form
10014c66563a39280B0542c1792r5453e3153m07100B44084b01416d1853p9001B9651
10002b0798k21834h0205a9126k96897a25869a9105P808B02060c67807h207j22966
9991a31173A13477a21484J7228q5720A75290m8911i0186G6901a33915L2103B61651
9979A71653C1321n147d34421B12132p1121R6827D7351O4657d8100j85536A68918
9967b07471o5681r898e2k54975a3496j46562e8574p9625d3908j04563K5112A35594
9954e9403k53154A51513c34371a40707j4636n1720E3301b07103F5159b75734N0384
9943b25350P0299l44570B72125b83876B63069a17730j78998g7316D982f2036p7941
9932a39977j48545I856J22470b57101J04353F8725e1328B00935A0769O4298b07076
$$ plain form
9920 43615 -90647 -244663 -176561 -51262 9364 289399 -107359 -189225 -3043 42283 -76020 65199
9907 -47222 208037 244346 181294 174688 3586 -175143 -149490 -1601 -92936 -487282 76972 -16572
9894 145563 -255440 52060 -71984 -368502 -169591 -306774 15511 -89304 2713 104414 152212
9883 152212 -103842 131507 -41010 -315108 -129367 -304861 -124321 -223075 -55821 30376
9872 -50937 7701 70492 52396 -63921 -95487 -158350 10683 -93260 9299 -375640 25579 -216773
9859 -62505 12667 -137442 47566 -260415 -357544 -162898 -174521 -215655 -19645 146633 -200973
9847 180608 -242046 129600 322262 -50104 -25374 -72358 28180 -320524 189116 28948 -112930
9835 99397 -71706 -202960 98862 8354 -100998 -17200 -97490 399418 28967 -411227 28843
$$ packed form
9920D3615i0647j54016O8102e1262I364K80035a07359q1866c043D2283g6020F5199
9907d7222B08037L6309o3052o606C586a75143K5653a601r1335l94346G6972a6572
9894A45563b55440E2060g1984k96518a69591j37183A5511h9304B713J01701M7798
9883A52212a03842A31507d1010k74098a29367j75494a24321r8754e5821C0376
9872e0937G701O2791j8096f3921l1566o2863A0683i3260I299c75640B5579b16773
9859f2505A2667a37442D7566b60415r7129a62898j1623m1134a9645A46633b00973
9847A80608b42046A29600J92662e0104K4730m6984B8180c20524A89116B8948a12930
9835I9397g1706j31254I8862H354a00998a7200q0290C99418B8967d11227B8843
$$ plain form
9823 -124737 129938 -118813 -497542 82256 -89451 38114 84720 29375 -137364 80343 -30313
9811 -179184 -45602 22337 -60689 80452 -38018 136895 -293612 4101 -27349 -124746 -15051
9799 619 42017 -289286 378105 260669 -328092 -281110 -109139 -127866 -61050 -18845 -42631
9788 -42631 -69994 -296514 -45168 961 -144320 -240409 -75558 7109 -36143 -176625 -191575 -149292
9776 -149292 53804 176182 26461 78861 -26047 -108609 -135740 -114180 78076 55739 -323855
9764 -31176 180155 -235395 -69910 -372950 -121432 -92065 -234263 -53662 27694 -259145 -206608
9753 -206608 72078 233324 -34582 -210119 -94129 151075 68538 -20265 -184058 -59905 -372221
9742 -372221 -37287 323141 -30168 -209637 40897 -158800 161221 243676 -15687 -254041 -58609
$$ packed form
9823a24737A29938a18813l78729H2256h9451C8114M6606B9375a37364H0343c0313
9811a79184d5602B2337f0689H0452c8018A36895b93612D101b7349r7397a5051
9799F19M1398b89286C78105j17436c28092M6982a09139j8727f1050a8845k3786
9788d2631k7363k26520d5168I61a44320r6089g5558G109c6143j40482j4950M2283
9776a49292E3804J22378B6461N2400b6047q2562k7131K1560G8076k2337c23855
9764c1176A80155b35395f9910l03040a21432K9367j42198e3662B7694b59145N2537
9753b06608G2078J61246c4582j75537i4129A51075F8538b0265j63793e9905l12316
9742c72221c7287C23141c0168j79469D0897a58800A61221Q2455a5687k38354e8609
$$ plain form
9730 77638 -285916 -551665 -119952 45265 -264673 -184961 149581 -294727 -103682 -183650
9720 -183650 -143950 -92721 43693 36017 -53514 -86583 -433725 -201080 -105159 291869 -126512
9708 -272374 -213236 -59620 -5204 77651 -150615 -35127 -183366 -177223 130866 190516 -177759
9696 -383325 76634 91755 102514 32080 16924 46056 -348955 75349 -194905 174416 -141115
9684 16367 15551 -229830 -131044 62722 -40024 -237415 44491 76263 253146 -93057 -195833
9673 -195833 90754 69630 -17333 -43197 -86357 -169506 -112410 145139 -231975 152544 -161098
9661 20435 -78485 79851 71980 -135842 27449 35903 27606 -54998 -454505 -195333 -84462 -137142
9649 -137142 44490 10241 14281 23629 -362425 -350925 49243 -2161 70545 72350 -245455 4065
$$ packed form
9730G7638b85916k65749a19952D5265b64673P9712A49581b94727a03682p9968
9720a83650L9700N1229D3693p676e3514l3069l47142b01080R5921B91869a26512
9708b72374N9138e9620e204G7651a50615c5127j48239O143A30866N9650a77759
9696c83325G6634J5121J0759C2080j5156K9132c48955G5349a94905A74416a41115
9684A6367q16b29830R8786F2722d0024j97391D4491L1772J76883i3057j02776
9673a95833I0754k1124a7333k5864m3160q3149N7096A45139b31975A52544a61098
9661B0435g8485G9851p871a35842B7449Q454q297e4998l99507a95333h4462n2680
9649a37142D4490A0241M040R348c62425J1500D9243b161G0545J805b45455D065
$$ plain form
9636 212377 -70170 -257556 80700 97929 -204978 -88594 -67114 36307 -174408 -116463 -67990
9625 -67990 -38671 -313424 -13747 -47930 -177729 145391 -208069 -4044 -153811 -182274 278113
9613 6356 -141240 162972 25102 -407481 -275043 8589 181856 -103926 -77918 43627 -200537
9601 -186780 -264802 -134600 153073 312739 37608 -9428 -185644 -169666 -153727 -156968 52224
9589 -140030 -135908 -139532 -18625 -194053 -35940 160221 -57936 -42655 24985 -104756 50387
9577 -70430 146368 -433082 145367 116846 107141 -252902 -134356 -135 403734 150323 -98688
9565 171362 -74985 -58024 -323786 -17136 -335310 -31092 -107283 -253659 151274 -56938 -69827
9554 -69827 -81154 -187621 -36830 -95879 -438902 29997 -4217 -123926 146874 278390 -55821
$$ packed form
9636B12377g0170j87386H0700J7229b04978h8594K1480C6307a74408N7945M8473
9625f7990K9319k74753a3747l4183j29799A45391b08069d044j49767k8463B78113
9613F356a41240A62972B5102d07481J32438H589J73267a03926K6008D3627b00537
9601a86780p8022J30202A53073J59666C7608i428j76216J5978J5939l241E2224
9589a40030M122l624a8625j75428c5940A60221e7936J5281B4985a04756E0387
9577g0430A46368d33082A45367k8521r705b52902J18546a35D03734A50323i8688
9565A71362g4985J6961k65762a7136l18174c1092p6191j46376A51274e6938j2889
9554f9827j1327j06467c6830n9049l43023B9997d217j19709A46874J31516e5821
$$ plain form
9542 -353378 73747 45922 -272932 -167348 78363 10175 319394 -88238 -414902 -129594 -204139
9531 -204139 -206990 54095 108793 -484956 66809 -31967 14020 82395 37197 101935 98322 -144944
9518 27180 145524 265010 -463173 -236526 -344508 -390949 -98708 42682 -58369 206236 -268612
9506 -19605 -45268 75024 95355 -200556 30450 23829 -142957 -140950 434521 17392 215950
9495 215950 -341224 -135723 -9885 -189879 -110359 -378370 -24437 -96953 -11967 -15716 -141815
9484 -141815 -34700 -74112 140532 253012 -370550 -107875 189372 110074 51012 -68324 -354552
9473 -354552 -288102 -89958 221523 47545 -100155 -137118 -371620 55865 -162302 44352 303003
9462 303003 -93781 -411786 12158 -261966 -50860 85383 60377 -123680 13346 27046 -130455
$$ packed form
9542c53378G3747k7825b72932J05584G8363A0175L09219h8238l26664a29594p4545
9531b04139k851E4095N4698d84956F6809c1967A4020O8375C7197O4738l613a44944
9518B7180J18344J19486d63173K26647j07982m6441i8708D2682e8369B06236b68612
9506a9605k5663G5024K0331b00556C0450o621a42957K007D34521A7392J98558
9495B15950c41224a35723i885j79994P9520k68011b4437p2516a1967l749j26099
9484a41815c4700l9412A40532J12480c70550a07875A89372p9298E1012f8324k86228
9473c54552O6450h9958B21523D7545a00155l6963k34502E5865a62302D4352K58651
9462C03003i3781l18005A2158b61966e0860H5383k5006a23680A3346J3700a30455
$$ plain form
9450 -201226 -373814 -145613 103555 -180647 -274931 40090 11353 174770 148460 -152757
9439 -357545 91501 49681 -178907 -508918 375235 127534 -41918 -4057 -295645 43137 -152158
9427 -275952 56449 -214030 -338922 -324595 134910 -415659 55919 -196855 -244026 20894 -104728
9415 147585 -395155 199487 -106035 162335 -265781 -296169 -59420 -137177 62284 -133781
9404 -277715 35958 -335313 -390239 -143866 -48008 -55580 -89284 -414353 171949 -33207 -314483
9393 -314483 -297433 151273 -38771 -159418 -47659 -156200 -147321 -17805 -105346 -131775 106012
9381 121507 -175390 -505619 -218274 106010 -79175 -146189 -96260 -469967 271318 -6430 -555659
9370 -555659 65074 -34319 226599 -213160 45777 -40808 -402998 45851 25978 445986 -177420
$$ packed form
9450b01226j72588a45613A03555a80647r4284D0090A1353J63417k6310a52757
9439c57545I1501m1820a78907l30011C75235A27534d1918d057k91588D3137a52158
9427b75952E6449b14030j24892J4327A34910d15659E5919a96855m7171B0894a04728
9415A47585c95155A99487a06035A62335b65781l0388e9420p7757F2284a33781
9404b77715C5958c35313n4926a43866d8008p572l3704l25069A71949c3207k81276
9393c14483J7050A51273c8771j20647d7659j08541Q879a7805q7541k6429A06012
9381A21507a75390l30229b18274A06010g9175o7014M9929l73707B71318f430n49229
9370e55659F5074c4319B26599b13160D5777d0808l62190D5851j9873M20008a77420
$$ plain form
9358 -8720 -173526 -840 24377 -17068 -52357 -169246 -133504 -191468 -249293 186805 145141 -255992
9345 -154400 -112100 -259469 264653 -177727 -178033 143924 220398 -244981 -64027 181264 -215678
9333 -339880 -7256 -336372 88763 -359235 187159 -368108 -182870 -194885 -111378 -6386 -336995
9322 -336995 324353 324591 228735 36648 -151949 165377 -41310 -137977 -46747 -171968 97395
9310 -180923 -77118 -364458 103754 -261216 -302530 70664 112591 -109853 -7062 -115517 -746636
9299 -746636 28846 52438 -41146 68780 -161037 -60753 -346249 88750 72922 -165079 -180204
9288 -180204 22112 -187870 75242 -86102 -32869 177905 -69425 -310120 -64412 165053 175852
9277 175852 465267 51205 -153404 -92446 -112836 154340 45284 -157647 -178559 -223321 -124105
$$ packed form
9358h720j64806h40B4377a7068l5289j16889L5742n7964n7825A86805m1664b55992
9345a54400M2300j47369B64653a77727l06A43924P6474b44981f4027A81264b15678
9333c39880g256l29116H8763c59235A87159c68108a82870j2015Q3507f386l30609
9322c36995C24353K38r5856C6648a51949A65377d1310r6667d6747j25221I7395
9310a80923g7118k87340A03754b61216m1314G0664M1927a09853g062j08455o31119
9299g46636B8846K3592d1146F8780a61037f0753k85496H8750j5828a65079j5125
9288a80204B2112a87870G5242h6102c2869A77905f9425k40695f4412A65053J0799
9277A75852K89415E1205a53404O0958k0390A54340D5284a57647k0912m4762R9216
$$ plain form
9266 -124105 -19361 -222019 -2395 106847 317524 -319242 -173403 166353 -279504 -157554
9256 -157554 -337634 -72650 41501 244908 -187344 -356932 -61372 201782 21488 43902 57382
9245 57382 82571 -187401 -115556 -380576 -20443 -228946 176334 -187446 44095 -280745 163352
9233 -63102 255235 102384 126418 79174 -368497 216747 -86811 -101089 -19930 206214 -203341
9221 -74267 -124313 8484 -59051 -46935 -114159 -37087 -202839 -112369 -17364 -218317 -86311 -45697
9209 -45697 -390214 -403540 8350 150548 -364086 78966 67786 -212617 -2944 -338831 -205156
9198 -205156 71343 -2683 -396450 81705 -88603 -243201 65298 -45834 -122204 -10450 96477
9186 115947 40580 -15012 8537 146821 122440 -201059 22349 42665 163314 -151805 -204146
$$ packed form
9266a24105a9361k02658b395A06847K10677c19242J45839A66353b79504J21950
9256a57554j80080g2650D1501K03407a87344j69588f1372B01782B1488K2414J3480
9245E7382K5189a87401P1845k65020b0443k08503A76334a87446D4095b80745A63352
9233f3102B55235A02384K4034m7244c68497B16747h6811j4278a9930B06214b03341
9221g4267n0046H484e9051J2116o7224c7087j65752R0470a7364k00953h6311M0614
9209d5697l44517j3326H350J42198c64086G8966j1180b12617b944l35887J33675
9198b05156G1343b683l93767H1705h8603j54598F5298d5834p6370a0450I6477
9186A15947D0580a5012H537J38284k4381b01059B2349K0316J20649a51805n2341
$$ plain form
9175 -204146 -136796 112549 -293494 110392 -45880 54545 101044 -46697 -31560 -284688 -264652
9164 -264652 105214 -259460 25751 -357758 -148999 349509 -32791 216283 -184983 9144
9153 46782 203625 -34522 -312614 41241 -51777 9778 -35992 -140067 173871 -133654 126939
9141 -53313 -153213 467 317829 -330 -177085 -175091 -76445 -239481 -278477 -182629 205048 -76685
9128 -283311 -99299 39997 199362 -184796 -440272 -125844 129286 290211 -9123 -132813
9118 -132813 -57453 -154824 -103207 -155489 -89683 -113998 -154625 198760 278788 -80307 -175566
9107 -175566 331440 301010 165385 268734 55116 -195930 -255609 -1673 -268369 -57984 211133
9095 -41231 19066 -42057 162591 -63783 -354577 274430 -240603 142528 -62247 27782 89624
$$ packed form
9175b04146O7350A12549b93494A10392d5880E4545M6499d6697J5137k53128K0036
9164b64652A05214b59460B5751c57758a48999C49509c2791B16283a84983I144
9153D6782J56843c4522k78092D1241e1777I778c5992j04075A73871a33654A26939
9141e3313r9900D67L17362c30j76755J994g6445j63036l8996R5848B05048g6685
9128b83311i9299C9997J59365a84796k55476a25844A29286J60925i123j23690
9118a32813e7453r7371N1617n2282O5806k4315m0627A98760Q0028h0307r5259
9107a75566C31440l0430j35625J03349E5116a95930n9679a673k66696e7984B11133
9095d1231A9066d2057A62591f3783k90794B74430b40603A42528f2247B7782O1842
$$ plain form
9084 89624 145812 18539 140430 -165152 77120 221312 -133675 87253 264847 -191554 -56953
9072 -18489 -243680 -22798 -102522 242335 -5921 -183456 -55202 -71536 193036 -98876 111796
9060 -212978 -5500 -5994 95245 -98008 -245225 -255528 282717 91323 -108610 198048 -141889
9048 -137871 -157123 92169 -63781 -2849 -323577 -166094 -214848 -291768 -170229 22818 -52877
9036 -141203 103567 -242419 -235701 151487 9523 173163 -113652 -98504 33325 -170905 -137129
9025 -137129 -2668 -166119 18454 -213267 242058 150492 60640 55945 -266364 113144 -42832
9013 40977 62392 179822 -72079 -72748 -27892 -245091 -79054 52477 49331 -52021 -102247 -199139
9001 -199139 187159 50486 -158847 37493 -97638 -75572 142563 -119903 -277176 -259233 -14302
$$ packed form
9084H9624N6188A8539J21891a65152G7120J44192a33675H7253J77594a91554e6953
9072a8489k25191b2798p9724B42335e921j77535e5202j6334A93036i8876A11796
9060b12978e500m94I5245i8008j47217j0303B82717I1323a08610A98048a41889
9048a37871j9252I2169f3781b849l20728J57483m8754p6920J21539B2818e2877
9036a41203A03567b42419O718A51487I523J63640a13652J5148C3325a70905L3776
9025a37129b668j63451A8454b13267B42058r1566F0640m695b66364A13144d2832
9013D0977K1415J17430g2079o69b7892k17199g9054E2477l146e2021n0226r6892
9001a99139A87159E0486a58847C7493i7638K2066A42563a19903j57273J7943a4302
$$ plain form
8989 -134972 -303944 -118216 -94159 156186 54744 -197797 384082 233615 157304 236278
8979 236278 148810 -119643 -259032 -253372 26515 -361871 286111 -128040 -282017 -10445 -339279
8968 -339279 -280697 -126715 -149709 103512 1146 44336 20941 -321863 175866 109567 35198
8956 65966 -56045 -28240 -173934 -147801 -116408 426579 40748 -197720 -20073 -227662 25255
8944 -239589 24766 252911 145334 -67615 -192992 -218306 -41387 -84131 120329 333797 270023
8933 270023 178589 -407627 -367319 -23994 -44072 127153 283250 135976 517313 1358885
8923 1358885 3326180 10409975 12260342 3290423 982970 533585 628105 577909 -4125 109051
8912 -143427 140862 -71099 14158 83424 199217 168139 -32647 51453 -73495 -124 145297
$$ packed form
8989a34972j68972a18216K4057A56186E4744a97797C84082j50467p6311P8974
8979B36278q7468a19643j39389N660B6515c61871B86111a28040j53977a0445l28834
8968c39279N8582a26715k2994A03512A146M3190B0941c21863A75866o6299C5198
8956F5966e6045K7805j45694K6133L1393D26579D0748a97720b0073k07589B5255
8944b39589B4766K28145j07577f7615j25377k5314d1387m2744A20329K13468o3774
8933B70023r1434d07627M0308b3994k0078A27153J56097A35976L81337Q41572
8923A358885J967295P083795J850367C290423I82970m49385R4520n0196d125A09051
8912a43427A40862g1099A4158O9266J15793l1078c2647E1453g3495a24A45297
$$ plain form
8900 -48183 -431501 -282724 12371 -155646 -36369 -238530 -14212 -105264 -415330 -31738 93295
8888 -71958 -7727 -109975 77121 -32954 -198274 -187089 -285957 -195240 159316 -235381 185777
8876 -260893 -205900 72731 -68310 186967 -95439 -72730 -65272 -198808 -203352 215142 -51973
8864 -193347 -143914 -61446 110117 34011 -93409 -146096 54914 166652 263647 13265 -200412
8852 -357875 98689 -240044 329317 -114869 -288336 46015 -213770 -213204 -143071 -119846 3490
$$ packed form
8900d8183l83318J48777A2371a55646c6369k02161a4212r1052l10066c1738I3295
8888g1958g727j02248G7121c2954j65320J1185r8868R0717A59316b35381A85777
8876b60893N4993G2731f8310A86967i5439K2709P458j33536m544B15142e1973
8864a93347M9433f1446A10117C4011i3409n2687E4914J11738R6995A3265b00412
8852c57875I8689b40044C29317a14869j73467D6015b13770N66P0133K3225C490
$$ [...]
##END NTUPLES=NMR SPECTRUM
##END=
