
##TITLE=AC1393_COLAH12205_7519463_G75SKz31VO
##JCAMPDX= 6.0         $$ Bruker NMR JCAMP-DX V2.0
##DATA TYPE= NMR SPECTRUM
##DATA CLASS= NTUPLES
##ORIGIN= BRUKER
##OWNER= Administrator
$$ 1.72 TOPSPIN		Version 2.1
$$ 2013-02-19 18:04:28.640 -0500  Administrator@X
$$ Compression mode = diff/dup
##.OBSERVE FREQUENCY= 400.02188249412
##.OBSERVE NUCLEUS= ^1H
##.ACQUISITION MODE= SIMULTANEOUS (DQD)
##.ACQUISITION SCHEME= undefined
##.AVERAGES= 8
##.DIGITISER RES= 22
##SPECTROMETER/DATA SYSTEM= spect
##.PULSE SEQUENCE= zg30
##.SOLVENT NAME= COFFEE_meoh
##.SHIFT REFERENCE= INTERNAL, COFFEE_meoh, 1, 14.98509
##AUDIT TRAIL= $$ (NUMBER, WHEN, WHO, WHERE, PROCESS, VERSION, WHAT)
$$ ##TITLE= Audit trail, TOPSPIN		Version 2.1
$$ ##JCAMPDX= 5.01
$$ ##ORIGIN= Bruker BioSpin GmbH
$$ ##OWNER= Administrator
$$ $$ E:\/data/COFFEE/nmr/AC1393_COLAH12205_7519463_G75SKz31VO/10/pdata/1/auditp.txt
$$ ##AUDIT TRAIL=  $$ (NUMBER, WHEN, WHO, WHERE, PROCESS, VERSION, WHAT)
(   1,<2013-02-19 18:04:20.546 -0500>,<Administrator>,<X>,<go>,<TOPSPIN 2.1>,
      <created by zg
	started at 2013-02-19 18:03:14.033 -0500,
	POWCHK enabled, PULCHK disabled,
       configuration hash MD5:
       86 BA 57 50 F2 9D 5C 9B 26 00 A9 28 5F 66 2E 89
       data hash MD5: 64K
       93 00 05 F6 84 15 E2 11 02 0D 35 A6 D6 2D ED CE>)
(   2,<2013-02-19 18:04:23.624 -0500>,<Administrator>,<X>,<proc1d>,<TOPSPIN 2.1>,
      <Start of raw data processing
       efp LB = 0 FT_mod = 6 PKNL = 1 PHC0 = 0 PHC1 = 0 SI = 32K 
       data hash MD5: 32K
       E3 99 79 2A A2 29 80 11 52 52 CF 8B 29 5A FF FF>)
(   3,<2013-02-19 18:04:24.124 -0500>,<Administrator>,<X>,<proc1d>,<TOPSPIN 2.1>,
      <pk PHC0 = 72.55371 PHC1 = 0 
       data hash MD5: 32K
       08 98 47 8E 4C 8B 6D A6 3C 7D F3 BE 2C 0B F9 CD>)
(   4,<2013-02-19 18:04:24.343 -0500>,<Administrator>,<X>,<proc1d>,<TOPSPIN 2.1>,
      <abs ABSG = 1 
       data hash MD5: 32K
       4F C9 38 68 5F 9A 04 7A B2 1E DB AC 35 C6 F8 C3>)
(   5,<2013-02-19 18:04:24.484 -0500>,<Administrator>,<X>,<proc1d>,<TOPSPIN 2.1>,
      <abs ABSG = 2 
       data hash MD5: 32K
       00 2F 2D D2 B8 32 F3 50 56 79 44 5B 5E 32 A6 86>)
(   6,<2013-02-19 18:04:24.624 -0500>,<Administrator>,<X>,<proc1d>,<TOPSPIN 2.1>,
      <abs ABSG = 3 
       data hash MD5: 32K
       3A F4 F2 F7 31 B4 06 61 93 05 B7 B4 BA C3 E6 86>)
(   7,<2013-02-19 18:04:24.781 -0500>,<Administrator>,<X>,<proc1d>,<TOPSPIN 2.1>,
      <abs ABSG = 4 
       data hash MD5: 32K
       18 2A AE 69 F5 72 20 99 4F 29 F2 CC BC 9E 55 24>)
(   8,<2013-02-19 18:04:24.921 -0500>,<Administrator>,<X>,<proc1d>,<TOPSPIN 2.1>,
      <abs ABSG = 5 
       data hash MD5: 32K
       07 AE 81 50 F4 0B 4C 9F 29 AF 01 30 6F 3C DF D7>)
$$ ##END=
$$ 
$$ $$ hash MD5
$$ $$ A6 D8 AA A0 E5 92 63 05 3A F1 0D 9D 8D 0D 7E FD
##$RELAX= 
##$RELAX= 
##$RELAX= 
##$RELAX= 
##$RELAX= 
##$RELAX= 
##$RELAX= 
$$ Bruker specific parameters
$$ --------------------------
##$DU= <E:\>
##$EXPNO= 10
##$NAME= <AC1393_COLAH12205_7519463_G75SKz31VO>
$$ [...]
##$TP= (0..7)
150 150 150 150 150 150 150 150
##$TP07= 0
##$TPNAME0= <>
##$TPNAME1= <>
##$TPNAME2= <>
##$TPNAME3= <>
##$TPNAME4= <>
##$TPNAME5= <>
##$TPNAME6= <>
##$TPNAME7= <>
##$TPOAL= (0..7)
0.5 0.5 0.5 0.5 0.5 0.5 0.5 0.5
##$TPOFFS= (0..7)
0 0 0 0 0 0 0 0
##$TUNHIN= 0
##$TUNHOUT= 0
##$TUNXOUT= 0
##$USERA1= <user>
##$USERA2= <user>
##$USERA3= <user>
##$USERA4= <user>
##$USERA5= <user>
##$V9= 5
##$VALIST= <valist>
##$VCLIST= <CCCCCCCCCCCCCCC>
##$VD= 0
##$VDLIST= <DDDDDDDDDDDDDDD>
##$VPLIST= <PPPPPPPPPPPPPPP>
##$VTLIST= <TTTTTTTTTTTTTTT>
##$WBST= 1024
##$WBSW= 4
##$XGAIN= (0..3)
0 0 0 0
##$XL= 0
##$YL= 0
##$YMAX_a= 526237
##$YMIN_a= -516650
##$ZGOPTNS= <>
##$ZL1= 120
##$ZL2= 120
##$ZL3= 120
##$ZL4= 120
##$ABSF1= 14.98509
##$ABSF2= -5.573092
##$ABSG= 5
##$ABSL= 3
##$ALPHA= 0
##$AQORDER= 0
##$ASSFAC= 0
##$ASSFACI= 0
##$ASSFACX= 0
##$ASSWID= 0
##$AUNMP= <proc_prof1d_extract_pilot.lims>
##$AXLEFT= 0
##$AXNAME= <>
##$AXNUC= <1H>
##$AXRIGHT= 0
##$AXTYPE= 0
##$AXUNIT= <>
##$AZFE= 0.1
##$AZFW= 0.1
##$BCFW= 0
##$BC_mod= 0
##$BYTORDP= 0
##$COROFFS= 0
##$CY= 15
##$DATMOD= 1
##$DC= 0
##$DFILT= <>
##$DTYPP= 0
##$F1P= 0
##$F2P= 0
##$FCOR= 0.5
##$FTSIZE= 32768
##$FT_mod= 6
##$GAMMA= 0
##$GB= 0
##$INTBC= 1
##$INTSCL= 1
##$ISEN= 128
##$LB= 0
##$LEV0= 0
##$LPBIN= 0
##$MAXI= 10000
##$MC2= 0
##$MEAN= 0
##$ME_mod= 0
##$MI= 0
##$NCOEF= 0
##$NC_proc= -8
##$NLEV= 6
##$NOISF1= 0
##$NOISF2= 0
##$NSP= 0
##$NTH_PI= 0
##$NZP= 0
##$OFFSET= 14.98509
##$PC= 1
##$PHC0= 72.55371
##$PHC1= 0
##$PH_mod= 1
##$PKNL= yes
##$PPARMOD= 0
##$PPDIAG= 0
##$PPIPTYP= 0
##$PPMPNUM= 2147483647
##$PPRESOL= 1
##$PSCAL= 4
##$PSIGN= 0
##$PYNMP= <proc.py>
##$REVERSE= no
##$SF= 400.02
##$SI= 32768
##$SIGF1= 0
##$SIGF2= 0
##$SINO= 400
##$SIOLD= 32768
##$SPECTYP= <>
##$SREGLST= <1H.CDCl3>
##$SSB= 0
##$STSI= 32768
##$STSR= 0
##$SW_p= 8223.68421052631
##$SYMM= 0
##$S_DEV= 0
##$TDeff= 65536
##$TDoff= 0
##$TI= <>
##$TILT= no
##$TM1= 0
##$TM2= 0
##$TOPLEV= 0
##$USERP1= <user>
##$USERP2= <user>
##$USERP3= <user>
##$USERP4= <user>
##$USERP5= <user>
##$WDW= 1
##$XDIM= 32768
##$YMAX_p= 428728157
##$YMIN_p= -719397
##$CURPLOT= <Network HP LaserJet P1505>
##$CURPRIN= <$Network HP LaserJet P1505>
##$DFORMAT= <normdp>
##$LAYOUT= <+/1D_H.xwp>
##$LFORMAT= <normlp>
##$PFORMAT= <normpl>
##$SURQMSG= 1
$$ End of Bruker specific parameters
$$ ---------------------------------
##NTUPLES= NMR SPECTRUM
##VAR_NAME=  FREQUENCY,     SPECTRUM/REAL,   SPECTRUM/IMAG
##SYMBOL=    X,             R,               I
##VAR_TYPE=  INDEPENDENT,   DEPENDENT,       DEPENDENT
##VAR_FORM=  AFFN,          ASDF,            ASDF
##VAR_DIM=   32768,         32768,           32768
##UNITS=     HZ,            ARBITRARY UNITS, ARBITRARY UNITS
##FACTOR=    0.250966925370066, 1,           1
##FIRST=     8223.43324360094, -155822,      117952
##LAST=      0,             236515,          -21778
##MIN=       0,             -719397,         0
##MAX=       8223.43324360094, 428728157,    0
$$ Real data points
##PAGE= N=1
##DATA TABLE= (X++(R..R)), XYDATA
$$ [...]
19546a31185c4260l8214m5968j84667A54321a91274j54082a32212L6990q4572
19536a79794M0377B84657j09304c65536a54800j63546R0085j13798f5538j61137
19526b26675A11024M8208p8193b64761M0743j7288C33750a31602A56197L5855
19516A92052h6778h618H911L4735h0509p583D9827L2196b60478j15186e7916B26430
19503g8610j24741h6889B51689b90425a6293l6168J1764n04644a51822D9624M9679
19492I9303d5096A65525p3436J1842a79054l6023d873k39484d8542k0795l9871
19481a09208a0376j81259A86587N3153b15497e6911b2029n2156H0733a68840m8614
19470b17454A69752c12225E1165b20440P6407F4037M3174b67164A5760b54903
$$ plain form
19546 -131185 -34260 -72474 -118442 -303109 154321 -191274 -345356 -132212 -95222 -179794
19536 -179794 -139417 284657 175353 -365536 -154800 -318346 -228261 -342059 -65538 -226675
19526 -226675 111024 159232 81039 -264761 -224018 -241306 333750 -131602 156197 192052
19516 192052 -86778 -8618 8911 43646 -80509 -88092 49827 82023 -260478 -375664 -57916 226430
19503 -78610 -203351 -86889 251689 -290425 -16293 -52461 -40697 -545341 -151822 49624 99303
19492 99303 -45096 165525 92089 103931 -179054 -215077 -4873 -244357 -48542 -69337 -109208
19481 -109208 -10376 -191635 186587 239740 -215497 -56911 -22029 -74185 80733 -168840 -217454
19470 -217454 169752 -312225 51165 -220440 -144033 64037 107211 -267164 15760 -254903
19459e1599A03845A1268a03630A38480J7160g0875H4028N4266E6591a25139A6994
19447A03849L42649A0903a09121F6225b81634E9814a39416a1185j42706n0619
19437b04510C49214a63346g3996j58319h7128p5158A73277b25574B07660B1217
19426d9539J2907D29754b04026R3736B8300R5819e4834j71593R7351b9492q2242
19415a11734B1395K76544o6533D8673a16437J0310A94656a15232M5797I7074K14164
19404C11238a47151A25146k6372B8488Q0697C3554b21101c1278C04927A2742J3603
19393B6345d47809b12660f43l32848E0942b03627A59275a88612J8092Q057A74870
19381c26155D8910b87014G7591J43811f3546o4525G9539L7151a04770q2479F343
$$ plain form
19459 -51599 103845 11268 -103630 138480 155640 -70875 84028 138294 56591 -125139 16994
19447 103849 446498 10903 -109121 66225 -281634 59814 -139416 -11185 -153891 -204510
19437 -204510 349214 -163346 -73996 -232315 -87128 -162286 173277 -225574 207660 21217
19426 -49539 -36632 429754 -204026 -110290 28300 124119 -54834 -226427 -129076 -29492 -111734
19415 -111734 21395 297939 231406 48673 -116437 -106127 194656 -115232 -69435 97074 311238
19404 311238 -147151 125146 98774 28488 109185 33554 -221101 -31278 304927 12742 26345
19393 26345 -447809 -212660 -643 -333491 50942 -203627 159275 -188612 -170520 -162463 174870
19381 -326155 48910 -287014 77591 221402 -63546 -128071 79539 116690 -104770 -187249 6343
19369C11198E5668a68560F4309h1737E2656c19644A03678e9875j62185g8445E262
19357B0511b05839O1523i837A29308b17059C4161b17742A75510a77550p2765R1145
19346a59170I9951c39444a00475A6452a37207B64473j27185b27300i8401g076
19335B9863J75310b39603b7508D22033c31747i1705A10102i1909j49289C9578
19324b00178B31809b02254A10596n1372c5071l9610j06053j4454E1627a96j02952
19313a03148I4743J52537j12463D9707N0042m0011c3401k50946A40074E1240a12748
19301B06952H7286a51274A37921K7879G0538e6002k33705i596A47992b40054A30343
19289a50780M9355J3316A79677d41620C2051J89868G678a46401r3263M9946m86
$$ plain form
19369 311198 55668 -168560 64309 -81737 52656 -319644 103678 -59875 -222060 -78445 5262
19357 20511 -205839 -144316 -9837 129308 -217059 34161 -217742 175510 -177550 -250315 -159170
19346 -159170 99951 -339444 -100475 16452 -137207 264473 137288 -227300 -98401 -7076
19335 29863 205173 -239603 -27508 422033 -331747 -91705 110102 -91909 -241198 39578
19324 -200178 231809 -202254 110596 59224 -35071 -74681 -180734 -195188 51627 -196 -103148
19313 -103148 94743 247280 134817 49707 99749 59738 -33401 -284347 140074 51240 -112748
19301 206952 87286 -151274 137921 165800 70538 -56002 -289707 -9596 147992 -240054 130343
19289 -150780 -101425 -88109 179677 -441620 32051 221919 7678 -146401 -239664 -189718 -190204
19278a90204B93989A31277h3142A71a13696M185D3415A6821a43740A06412J9370
19267A25782a41407m7831G6799a36334d5376A15556d2603A41501b29043B40606
19256I3049b17420e2897l87898A48290c72338D6520E628k70a58196F6464a61242
19244a39022k1838j22928j3367a19419A40446K3168c49860d544r6671B52993b35772
19232h2120B59296a41499C180P2673B1653c29865C7038e2498a1626H610a12379
19220a23668H4260J19992a35340n0584d2232A4787Q8515b67308B61515j15955
19210A45560a30901H5666c141l99844c9547E761b87839E3719a03945k2401D9877
19198I3343B5280a47984d0322l8621n50n1368c5053F7208G837b06595g2528B630
$$ plain form
19278 -190204 293989 131277 -83142 171 -113696 -109511 43415 16821 -143740 106412 125782
19267 125782 -141407 -189238 76799 -136334 -45376 115556 -42603 141501 -229043 240606
19256 93049 -217420 -52897 -440795 148290 -372338 46520 5628 5358 -158196 66464 -161242
19244 -139022 -160860 -283788 -297155 -119419 140446 163614 -349860 -4544 -101215 252993 -235772
19232 -82120 259296 -141499 3180 75853 21653 -329865 37038 -52498 -11626 8610 -112379
19220 -123668 84260 204252 -135340 -185924 -42232 14787 103302 -267308 261515 145560
19210 145560 -130901 85666 -3141 -402985 -39547 5761 -287839 53719 -103945 -126346 49877
19198 93343 25280 -147984 -40322 -78943 -79493 -130861 -35053 67208 7837 -206595 -72528 2630
19185D29506e833l80627J72185e4058j14467k35265G6965h3966l5755A76165a95011
19173A84316h2160A10218c01470a01454j89003J27010J2128j82492D0713b04769
19162a75203a8652n762A53303a24468j3078B52677F3564j7110N3198a80791j52056
19151c32847h5071M1577A2383b2344B5300h0236j01880m8954A8616e9445j86389
19140b45834a20571o780k57686J70515l7155h990j92522g833k3583k6223N869
19129e1770A08416c56455e664k39308j54036A52834a3992k63785o1483J25003
19119b14257O9693j8993e6694j77717F3295a6296I5883a48733A78671f4766C1877
19107a42572P385B9307b41961B3656b57275C79720c2270E1252a88653M1266B23613
$$ plain form
19185 429506 -5833 -386460 -214275 -54058 -168525 -403790 76965 -83966 -119721 176165 -195011
19173 184316 -82160 110218 -301470 -101454 -290457 -163447 -151319 -333811 40713 -204769
19162 -175203 -18652 -24414 153303 -124468 -137546 252677 63564 46454 99652 -180791 -332847
19151 -332847 -85071 -43494 12383 -22344 25300 -80236 -182116 -231070 18616 -59445 -245834
19140 -245834 -120571 -127351 -385037 -214522 -251677 -8990 -201512 -7833 -31416 -57639 -51770
19129 -51770 108416 -356455 -5664 -244972 -399008 152834 -13992 -277777 -339260 -214257
19119 -214257 -144564 -163557 -56694 -234411 63295 -16296 95883 -148733 178671 -64766 31877
19107 -142572 -135187 29307 -241961 23656 -257275 379720 -32270 51252 -188653 -147387 223613
19095A18660h0530A1306b72161A08832a27930A3109a799B68061c9865B7226Q3800
19084A11026K31302b35097A20161F977i203j01137J893j3704b5908B72579a64716
19072A50215f872C67026A11479a24885E9508k6751J11299d34266a52146m5177
19062a97323j01060D2666A5962b4344B60757a41180G7636A3475a18418E1832c61778
19050B51094g0284A13631j2932b30840C4170a70489A76729b77614h2774B025b8963
19038a58700M229j47501G1784a76086n9784B2096c639B01217G8487L151P3525
19027A55163b18270E3296e2650A38292a27336I6480a90533A55017D0960a53366
19016B26561a63065n3881M093A39890L8073p6307N0790g0199C0252a62794f9348
$$ plain form
19095 118660 -80530 11306 -272161 108832 -127930 13109 -1799 268061 -39865 27226 111026
19084 111026 342328 -235097 120161 6977 -9203 -110340 -108447 -122151 -25908 272579 -164716
19072 150215 -6872 367026 111479 -124885 59508 32757 144056 -434266 -152146 -197323
19062 -197323 -298383 42666 15962 -24344 260757 -141180 77636 13475 -118418 51832 -361778
19050 251094 -70284 113631 100699 -230840 34170 -170489 176729 -277614 -82774 2025 -28963
19038 -158700 -154471 -301972 71784 -176086 -235870 22096 -3639 201217 78487 81638 155163
19027 155163 -218270 53296 -52650 138292 -127336 96480 -190533 155017 40960 -153366
19016 226561 -163065 -216946 -212853 139890 177963 101656 152446 -70199 30252 -162794 -69348
19004b83168a03344E3903f4164A51137F4017a57607A19306J12120K218A07029
18993B66766b676j60701g6908j32128D7018a42802A62363a35781m7368f4689k1918
18982h6607A84134c29603a37086A85260a7432j1823G0836k7922d1706k64491A39238
18970A95088g6149A36807G387i4603b552I027a84463E0446c4505j55108c2227
18958B32968J9132a94089l7295L4443e9094n3768B81393H7296J4298D8543f7077
18946H8811K32881a74974H0824c9482A78691E8982J07433p3979h3809o6657J0424
18935a40042A12142b79844a01618h207K535F3423f1677k7175C0584b18312N4300
18924a64012A11517D9417a30130C12607a19932A31132c2640A74412b01653A39513
$$ plain form
19004 -283168 -103344 53903 -64164 151137 64017 -157607 119306 231426 233644 107029
18993 266766 -2676 -163377 -76908 -209036 47018 -142802 162363 -135781 -183149 -64689 -86607
18982 -86607 184134 -329603 -137086 185260 -17432 -29255 70836 42914 -41706 -306197 139238
18970 195088 -76149 136807 7387 -94603 -2552 9027 -184463 50446 -34505 -189613 -32227
18958 232968 252100 -194089 -231384 -196941 -59094 -112862 281393 87296 101594 48543 -67077
18946 88811 321692 -174974 80824 -39482 178691 58982 166415 92436 -83809 -150466 -140042
18935 -140042 112142 -279844 -101618 -8207 -5672 63423 -61677 -88852 30584 -218312 -164012
18924 -164012 111517 49417 -130130 312607 -119932 131132 -32640 174412 -201653 139513
18913g683j80626j62169J53921c0197k27777f2194B68647b21162a01387J7175
18903h4212p1674c6643l71614g6782l54840A48637c54725G8008c12406A1864m244
18892G620L05433f1318B9081J19078a4992A95703c3522k32398c182k54614E6606
18880A0797b86034j10133J87681C03049e5650j2807k51143O5631Q7254a62l0011
18869c0173k9645C00213H5533b27516p6417C0433a87421o7806C5058a34503F2041
18857C3387d6361B9717b6097j83556A02475b8291B190J01718m8879a4758O810
18846g948q6403D9972J09456b88537j7071i7194j802l77200A28660K49697F0977
18834a45967B0316b35650G2894i5875k53784B74270b86397e6945j01493M2773
$$ plain form
18913 -7683 -188309 -350478 -196557 -30197 -257974 -62194 268647 -221162 -101387 -84212
18903 -84212 -155886 -36643 -408257 -76782 -431622 148637 -354725 78008 -312406 11864 7620
18892 7620 313053 -61318 29081 148159 -14992 195703 -33522 -265920 -3182 -257796 56606
18880 10797 -286034 -396167 -208486 303049 -55650 -68457 -319600 -253969 -166715 -162 -30173
18869 -30173 -59818 300213 85533 -227516 -303933 30433 -187421 -255227 35058 -134503 62041
18857 33387 -46361 29717 -26097 -209653 102475 -28291 2190 103908 55029 -14758 -7948
18846 -7948 -94351 49972 159428 -288537 -305608 -97194 -98996 -476196 128660 378357 60977
18834 -145967 20316 -235650 72894 -95875 -349659 274270 -286397 -56945 -158438 -115665
18824a15665k4712I0146a07947M0922j13261Q6037A40841a6079A52611j2928g9279
18812A67272a19428A16799m8614N7004J77518J34120g9882A78357a78394E6810
18801d11272b0051k42140e8573a9422o2738r9266H7247J58278A9581A053a52239
18789C3331a30171j06725A78465d4359G3522K4135i1913j80414J32866b8038D3429
18777A16728N4804a71945P9607k24904A51468b4761k62114E9950K03410C8627
18766d01675a59378a7659j07873C4715b36686A03063d87038A38406c8990A56788
18755A67186E8019d77529a59947O8279A57400A9196b3617j04306r0820e2678b2906
18743b98213E180K14396a25029c147A08887a47728p1770M6267j34822A26485i4007
$$ plain form
18824 -115665 -140377 90146 -107947 -67025 -180286 -94249 140841 -16079 152611 139683 -79279
18812 167272 -119428 116799 68185 125189 302707 436827 -79882 178357 -178394 56810
18801 -411272 -20051 -262191 -58573 -19422 -82160 -181426 87247 245525 19581 1053 -152239
18789 33331 -130171 -236896 178465 -44359 73522 97657 -91913 -272327 -139461 -28038 43429
18777 116728 171532 -171945 -92338 -317242 151468 -24761 -286875 59950 263360 38627
18766 -401675 -159378 -17659 -125532 34715 -236686 103063 -487038 138406 -38990 156788
18755 167186 58019 -477529 -159947 -91668 157400 19196 -23617 -127923 -218743 -52678 -22906
18743 -298213 5180 219576 -125029 -3147 108887 -147728 -219498 -173231 -308053 126485 -94007
18731a05370G2330a10752j9204h090F4617F093J75692a61836j64434G8095h5416
18719c72074D9486e2421k4969r2210O3876D0373M2548a1337k27833A37610I835
18707C43588r1901j22660M4118G0459P2771c829j01446k05184a19168K2707j3509
18696a09970c0813A55301d3381m8473b5096I4220D1672c8500k48008a18584o4029
18685a82613A69909e03570G7032A1053d5390j6706B26431a7302k96739j8908C3425
18673a63259B76b22327A69728E5214e6720H1797a01163j08475L4213b954k71248
18662b74202c3642A07482a17748C2669a05352M713A65412A0621b26668k9053C9296
18650a09998p8305E0522e5339E2739i3019o1740B51624d0317l682j73615g7022
$$ plain form
18731 -105370 72330 -110752 -129956 -8090 64617 6093 181785 -161836 -326270 78095 -85416
18719 -372074 49486 -52421 -77390 -169600 -105724 40373 82921 -11337 -239170 137610 9835
18707 343588 251687 129027 173145 70459 143230 -3829 -105275 -310459 -119168 -96461 -109970
18696 -109970 -30813 155301 -43381 -91854 -25096 94220 41672 -38500 -286508 -118584 -182613
18685 -182613 169909 -503570 77032 11053 -45390 -62096 226431 -17302 -314041 -332949 33425
18673 -163259 276 -222327 169728 55214 -56720 81797 -101163 -209638 -175425 -2954 -274202
18662 -274202 -33642 107482 -117748 32669 -105352 -100639 165412 10621 -226668 -255721 39296
18650 -109998 -188303 50522 -55339 52739 -93019 -154759 251624 -40317 -43999 -217614 -77022
18638A19723c63684J21902J3620o8937a29863j00581p1197l2606F8683R3094C0246
18626i3797A6842K0923J0404b79510c697o5328A62911b5467B366L4010P954L18410
18614C62740e7704n2930j04433p9370A59037o9616i0420a5760k72576L3667i4903
18602c04831C0931b2594o3856j56720a11739c0685A50377a10762M9381E8999c6484
18590a98019j62478e947A88195K7578n1743a35782k17038e8594d974k9118k10777
18579b44869I8512a34045k88668h8723B6994J55813L2528f2959m8072n9658N1143
18568a19546N5935B28823H7337c94584G0309a76587j82032B4272K4844A2661c43392
18556g3251A21812c31793A4680d6634d976j46374b886C15223E4287J9030C5900
$$ plain form
18638 119723 -363684 -241782 -228162 -297099 -129863 -230444 -301641 -334247 68683 161777 30246
18626 -93797 16842 37765 48169 -279510 -3697 -69025 162911 -25467 2366 36376 44330 362740
18614 362740 -57704 -110634 -215067 -294437 159037 89421 -90420 -15760 -288336 -254669 -94903
18602 -304831 30931 -22594 -86450 -243170 -111739 -30685 150377 -110762 -61381 58999 -36484
18590 -198019 -360497 -5947 188195 215773 164030 -135782 -352820 -58594 -4974 -34092 -244869
18579 -244869 98512 -134045 -422713 -88723 26994 182807 215335 -62959 -111031 -170689 -119546
18568 -119546 -63611 228823 87337 -394584 70309 -176587 -358619 24272 49116 12661 -343392
18556 -73251 121812 -331793 14680 -46634 -4976 -151350 -2886 315223 54287 73317 35900
18544i8801B84440a80014f9816k66302A02685f9069A96715b1517A16920Q9209
18534B06129e9411b2444j3999C8629o452L88392C3458b52712h5903m1500e667
18522b3811k12475o9253d3330B58250b03323A92714a21897j52237a3638j62170
18512a75808C25331d3813q0971o1173B28625c531q4505f405o8149I4497k8930
18501F5567b18844A32130b11579A51207b25144j9710h1974A27522F1787J23652
18491A85439a67864j92746J69725n0645P8268r007B61455a20727k99754a59714
18480A81381R8081L2723h630A26966a35082i507A4680b33077F5931i4111B7429
18468d87855D0944b51891c6082A07200a03053l7039C0100K6986a14512p3962Q7981
$$ plain form
18544 -98801 284440 -180014 -69816 -336118 102685 -69069 196715 -21517 116920 206129
18534 206129 -59411 -22444 -36443 38629 32177 420569 33458 -252712 -85903 -127403 -5667
18522 -23811 -236286 -305539 -43330 258250 -203323 192714 -121897 -274134 -13638 -175808
18512 -175808 325331 -43813 -124784 -185957 228625 -3531 -88036 -6405 -74554 94497 65567
18501 65567 -218844 132130 -211579 151207 -225144 -244854 -81974 127522 61787 185439
18491 185439 -167864 -360610 -190885 -241530 -163262 -172269 261455 -120727 -420481 -159714
18480 181381 279462 312185 -8630 126966 -135082 -9507 14680 -233077 65931 -94111 27429
18468 -487855 40944 -251891 -36082 107200 -103053 -140092 30100 57086 -114512 -188474 -100493
18457a00493A38879J80932A09358E3752P1024g1354A21349b7924k45133K6726
18447b46331P6706B09534p7685D5457a83605C27385p2974a82846B97469a16961
18436f4301j08986p8561i030C44087a00483A24111g4231j33833A7434J51021q363
18425A60092a71135E3655d05815a10258B4874b81728J1908j09898a704A08926
18414c72066A05452b96902A05831K44800A58770a86729H2276j8410J39446g9123
18403G3460L3315J66988a59015b7556B0856a56159f049j95810M9801j53208h5373
18391a36313J2363A48383i2518J4177k8446M0732p0162B34592a54464d0291k6280
18380f6571j3399j13278H1343k9663a27506j30247n4233f2253M389A34002B8015
$$ plain form
18457 -100493 138879 319811 109358 53752 124776 -71354 121349 -27924 -273057 -246331
18447 -246331 -169625 209534 131849 45457 -183605 327385 254411 -182846 297469 -116961
18436 -64301 -173287 -251848 -9030 344087 -100483 124111 -74231 -208064 17434 168455 160092
18425 160092 -171135 53655 -405815 -110258 24874 -281728 -269820 -379718 -1704 108926
18414 -372066 105452 -296902 105831 350631 158770 -186729 82276 63866 203312 -79123
18403 73460 106775 273763 -159015 -27556 20856 -156159 -6049 -201859 -152058 -305266 -85373
18391 -136313 -123950 148383 -92518 -78341 -106787 -66055 -136217 234592 -154464 -40291 -66571
18380 -66571 -79970 -193248 81343 51680 -127506 -257753 -311986 -62253 -57864 134002 28015
18368B09638J79452A12028a46861A18798e9429l39146g0060E7380K67277c48048
18357a82206j15078Q5411A65033N4102a06465p1372B39329c8701E5044c0622l9408
18346g0030A42811o2325h0107E4132h7954K9824l3384b0977j27556E9070e3947
18334d1685A07669a4226C9840c6627j34158I2534D1602P4543N6335h2541p9249
18323a61790I3061a65263A43325b8062l07448d4286C0449h0704l3063B4797a79365
18311E3261L3108J55023a03326H6713a49988m4298B21659a49066B5314b9752k38307
18300b68059a29906J3605a1248k04909g7302C56716G7697J66124a74533A26664
18289e7974k76420A36735b44192h2916A60659L07792g4014m7069l8653P1883j90348
$$ plain form
18368 209638 389090 112028 -146861 118798 -59429 -398575 -70060 57380 324657 -348048
18357 -182206 -297284 -211873 165033 219135 -106465 -177837 239329 -38701 55044 -30622 -70030
18346 -70030 142811 80486 -80107 54132 -87954 -58130 -91514 -20977 -148533 59070 -53947
18334 -41685 107669 -14226 39840 -36627 -170785 92534 41602 116145 172480 -82541 -161790
18323 -161790 93061 -165263 143325 -28062 -335510 -44286 30449 -80704 -113767 24797 -179365
18311 53261 86369 241392 -103326 86713 -149988 -194286 221659 -149066 25314 -29752 -268059
18300 -268059 -129906 -116301 -11248 -216157 -77302 356716 77697 243821 -174533 126664
18289 -57974 -334394 136735 -244192 -82916 160659 468451 -74014 -121083 -159736 -87853 -278201
18278b78201A01749a99362d8211l22199E9164k757N5560a33964G3799a18523G7106
18266A79413O3774b1329n8928H4470a13019j6314N3569A08336b29402H2230a19661
18254b21339C4397A4802a15217I3195B7947a27088A61444i3855m2984I2789K60367
18243C53156a92304G9672b88278P3613e2444I3001d5404m3325C80993A7027H493
18231g014l22535C0345b70045C51784B2006K09182b70447A27528I395C076P1059
18220G4135K0857J14153r1649a16714A04274b00983l9031b9751p9460A28303d780
18208B64885j18884J62449m5058a23332E3049c50691D0763b00646B04369h4428
18197A57362f6183H1852a40972B48017b3528p3300j73086D26143B9608j0097a64521
$$ plain form
18278 -278201 101749 -199362 -48211 -370410 59164 56407 111967 -133964 73799 -118523 77106
18266 179413 243187 -21329 -80257 84470 -113019 -129333 -75764 108336 -229402 82230 -119661
18254 -221339 34397 14802 -115217 93195 27947 -127088 161444 -93855 -136839 92789 353156
18243 353156 -192304 79672 -288278 -214665 -52444 93001 -45404 -88729 380993 17027 8493
18231 -7014 -329549 30345 -270045 351784 22006 231188 -270447 127528 9395 3076 74135
18220 74135 94992 209145 117496 -116714 104274 -200983 -240014 -29751 -109211 128303 -4780
18208 264885 146001 308450 263392 -123332 53049 -350691 40763 -200646 204369 -84428
18197 157362 -66183 81852 -140972 248017 -23528 -96828 -269914 426143 29608 19511 -164521
18185c9234j75845A20975B2848K22767c66532g7879B32620F8861a95860e0034
18174i7070F1122J39330c29641K8040i1153F2083N9616c2386N059C68897A11281
18162c4130j81343d0902n2346C2533I544b93430H4851A843h0676A2079a83467
18150a75027h0051q7074k02651A81077L308a38497A25915m4265K94939a31149
18139C44008r1139h8569E7201a25098c275B9234c2568k11412G3765C6457f3626
18127a3212k7517C5845P8153l3870j1518a48069B5383a86930F6064n645J32508
18116A92927a09817o0715c3865A75477a84917G4277h0372m2161H3945b28514A89145
18104A30122c8353E9176c43194d7197k4947j36300A91331b25474J04638H8654
$$ plain form
18185 -39234 -215079 120975 22848 245615 -366532 -77879 232620 68861 -195860 -50034
18174 -97070 61122 200452 -329641 -301601 -91153 62083 121699 -32386 -27327 368897 111281
18162 -34130 -215473 -40902 -93248 32533 9544 -293430 84851 1843 -80676 12079 -183467
18150 -175027 -80051 -167125 -369776 181077 184385 -138497 125915 81650 376589 -131149
18139 344008 252869 -88569 57201 -125098 -3275 29234 -32568 -243980 73765 36457 -63626
18127 -13212 -40729 35845 113998 80128 68610 -148069 25383 -186930 66064 60419 192927
18116 192927 -109817 -170532 -33865 175477 -184917 74277 -80372 -122533 83945 -228514 189145
18104 130122 -38353 59176 -343194 -47197 -72144 -208444 191331 -225474 -120836 88654
18093D4209b11379a5248j6171k03134r9252C9036L0065i051m00841J29983e6821
18081A5403h9421c6108j24536b0482B34148i222B24552g183k34536O9991A25554
18069B92531i2677H7979c7057o0861j01527A79177c484A12018A1100a04206j74632
18058b78838a01332D0914a22816K1818d8637m0139r1418F3417d33508A04064j2600
18047I1464J73690A22050K71705f7660p7362o3520h3452j85762a13918E2416d5214
18035G9173b50544A70807b13312M9340I4448q514a60855E4717b03165J5029G0001
18023a04719F4855a62884m7158a3786m17152A29739a84933h3915B56945c3800
18012c1804B2198i2184j77620B8649a24633O0990I5244O6937f1693A15177A8256
$$ plain form
18093 44209 -211379 -15248 -31419 -234553 -333805 39036 69101 -9051 -409892 -279909 -56821
18081 15403 -89421 -36108 -160644 -20482 234148 -9222 224552 -7183 -241719 -171728 125554
18069 292531 -92677 87979 -37057 -97918 -199445 179177 -3484 112018 11100 -104206 -278838
18058 -278838 -101332 40914 -122816 -100998 -48637 -88776 -180194 63417 -433508 104064 91464
18047 91464 265154 122050 393755 -67660 -145022 -208542 -83452 -269214 -113918 52416 -45214
18035 79173 -250544 170807 -213312 -163972 94448 85934 -160855 54717 -203165 -188136 70001
18023 -104719 64855 -162884 -210042 -13786 -430938 129739 -184933 -83915 256945 -33800
18012 -31804 22198 -92184 -269804 28649 -124633 -63643 95244 162181 -61693 115177 18256
18000B89822a60669A28484i8461C53447F4937L6192J04607c5527j1364K1244B3348
17988h156B56064H8338e03791G885l076b00194d9361j04606L4768E09456A4690
17976A50693J92870A66824d52865a18183q7559I3819J14869a40796q5159F3415
17965G007h1837l35589A58921J911F2991J8619m634L9019B262P534K93975j02526
17953B01245H717b18570G1000b90188a31540A14380b5858B64574c3029I8573b74255
17941a94694C1299a11853K0609A18408b13840e0577P487o1374j03734B02912b37143
17929E84941A77612B6049b71946C9687c8928k13387G3305g7723j57432B8483a45815
17917A11256i6716A48951d5901I1846b1176A9809J36044A7127M6003a03577K5679
$$ plain form
18000 289822 -160669 128484 -98461 353447 64937 101129 205736 -35527 -46891 -25647 23348
17988 -8156 256064 88338 -503791 7885 4809 -200194 -49361 -153967 -119199 509456 14690
17976 150693 343563 166824 -452865 -118183 -205742 93819 208688 -140796 -225955 63415
17965 7007 -81837 -417426 158921 160832 62991 81610 76976 115995 2262 9796 303771 201245
17953 201245 8717 -218570 71000 -290188 -131540 114380 -25858 264574 -33029 98573 -274255
17941 -194694 31299 -111853 -91244 118408 -213840 -50577 -43090 -104464 -208198 202912 -237143
17929 584941 177612 26049 -271946 39687 -38928 -252315 73305 -77723 -235155 28483 -145815
17917 111256 -96716 148951 -45901 91846 -21176 19809 155853 17127 63130 -103577 -77898
17906g7898q7469d8581B57848H9315a86238d9249j23269B2178K15460G0736J33921
17895B04657D1697b24753e139j56626I6170h476B58532m4089i5183B1939K01140
17884B23079c672j64846H3318b06621d2585G4204R4685i0061j61683G3963b39644
17872b12214q0662A61937a03493G4256e8899a754p4148g802G1724a82926h7520
17860a87259A50510a35674A25602h5185B57124j2439F522g6850j16816B14158
17849a6744G6580i5457j2193j48739d6306C01065B6629J57068D909d1452j8230
17838e9682A17139b22077l3065A32447C9693J40138n7105f9240A96196h4717p7141
17827a61858c937j8010k09740e7510A73694q3941A6644a47341G3593B292L50191
$$ plain form
17906 -77898 -165367 -48581 257848 89315 -186238 -49249 -172518 22178 237638 70736 204657
17895 204657 41697 -224753 -5139 -161765 96170 -8476 258532 214443 -95183 21939 223079
17884 223079 -3672 -168518 83318 -206621 -42585 74204 168889 -90061 -251744 73963 -239644
17872 -212214 -292876 161937 -103493 74256 -58899 -1754 -75902 -7802 71724 -182926 -87520
17860 -187259 150510 -135674 125602 -85185 257124 244685 6522 -76850 -193666 214158
17849 -16744 76580 -95457 -107650 -256389 -46306 301065 26629 183697 4909 -41452 -59682
17838 -59682 117139 -222077 -255142 132447 39693 179831 122726 -69240 196196 -84717 -161858
17827 -161858 -3937 -21947 -231687 -57510 173694 89753 16644 -147341 73593 2292 352483
17816C52483F7628e0496q9471G2855a54086j04412J17998A20710a47107A52492
17805A90516B7781b6128p7623p7554A58795F5822c84703e3687j10733F4662f5113
17793E8659a86444B2388K19140e1765A12977c6687C82212A32197g2485A92499
17782B5429b16070F0199e8518n8747A8584L2469A2098K21434i6774B7429b94615
17770a00378K7078r3174b6628A07830J12253b9834A34584B8327a87811b7630A56148
17758H6163J979c0790A01285l0538L9444J52441A7304b73493H3965a67985n9354
17747b27339c1058B56126J84055C8415L17992j06456a80894o7539B9111a21102
17736C0693c03987e8273l5600B41828d099F0722h4835n6364e4008j21421j68213
$$ plain form
17816 352483 67628 -50496 -139967 72855 -154086 -258498 -140500 120710 -147107 152492
17805 190516 27781 -26128 -103751 -181305 158795 65822 -384703 -53687 -164420 64662 -65113
17793 58659 -186444 22388 241528 -51765 112977 -36687 382212 132197 -72485 192499
17782 25429 -216070 60199 -58518 -117265 18584 51053 12098 233532 -96774 27429 -294615
17770 -100378 -73300 -166474 -26628 107830 220083 -29834 134584 28327 -187811 -27630 156148
17758 86163 88142 -30790 101285 70747 110191 262632 17304 -273493 83965 -167985 -227339
17747 -227339 -31058 256126 440181 38415 356407 249951 -180894 -248433 29111 -121102
17736 30693 -303987 -58273 -93873 241828 -4099 60722 -84835 -141199 -54008 -175429 -343642
17725c43642C22978E2406b08238A46675g5152C46076i5473j25869h9406E8959
17714A2354J85649J30794I0990a15969c8974j60228C48175F941b32653c2023B7577
17702B43361a89428j50992D8907j9704a62150B20543b35436F5799J46408H5094
17691B85056a74913f6781b2291a0302A71329Q5402g910A03960a33889D715M0923
17680D5638N0520h1144n5752A6292L62617h7190L2797l92876A1870K01898F4345
17668f1411j57843g3438A41185a38259N4359j59523a02750A9981M9963N3411N338
17657A28693o3849J12726G2264C4237P0809c6423E4825m773f4475B6145J21796
17646A47941E1480q889f1332C03206D1766a25120C61770e5339A56115i1101j60815
$$ plain form
17725 -343642 322978 52406 -208238 146675 -75152 346076 -95473 -221342 -89406 58959
17714 12354 198003 328797 90990 -115969 -38974 -199202 348175 6941 -232653 -32023 27577
17702 243361 -189428 -340420 48907 29203 -162150 220543 -235436 65799 212207 85094
17691 285056 -174913 -66781 -22291 -10302 171329 256731 -7910 103960 -133889 4715 45638
17680 45638 96158 -81144 -136896 16292 378909 -87190 -54393 -447269 11870 213768 64345
17668 -61411 -219254 -73438 141185 -138259 -83900 -243423 -102750 19981 69944 123355 128693
17657 128693 64844 177570 72264 34237 105046 -36423 54825 50052 -64475 26145 147941
17646 147941 51480 42591 -61332 303206 41766 -125120 361770 -55339 156115 -91101 -251916
17635b51916B99610b9962O658H8020j9247e0657m8597d0750C8048a10201j69074
17624b79275E3602N8781e5110o9810K3943G2117C2404g6854A40625a45017m3010
17613a88027P3343D589K03848F7291N9598O9285c6929B67732G8849L77380A13257
17601A8738Q5858N224b61022i7380d1655A23762b70844R7555C91251i7195j22643
17590b19838J03135d5642A77526D6947F704g9846B26839a83901c9279B41103a60414
17578E2531L715e5060n1192E32679g6221C41230i1827C943L17154r2601H5696
17566A02350h033B41193D9791J90431b8756B77372G3073a70916f9696C12242A23609
17554a76684I5310D3138h3572A42255M5503b46591p7565J36906j6137b4266n4078
$$ plain form
17635 -251916 299610 -29962 -23304 88020 68773 -50657 -99254 -40750 38048 -110201 -279275
17624 -279275 53602 112383 -55110 -124920 -100977 72117 32404 -76854 140625 -145017 -188027
17613 -188027 -114684 4589 208437 67291 126889 196174 -36929 267732 78849 456229 113257
17601 18738 104596 109820 -261022 -97380 -41655 123762 -270844 -173289 391251 -97195 -219838
17590 -219838 -116703 -45642 177526 46947 6704 -79846 226839 -183901 -39279 241103 -160414
17578 52531 56246 -55060 -106252 532679 -76221 341230 -91827 3943 321097 228496 85696
17566 102350 -8033 241193 49791 240222 -28756 277372 73073 -170916 -69696 312242 123609
17554 -176684 95310 43138 -83572 142255 187758 -246591 -324156 -187250 -203387 -24266 -78344
17543g8344o6647c0756A19037m838f032A42219F3085g3834G3152b4542A68899
17531F4504L5502b32777A78854A1789a27789C7121r769L18175A15388M1212R7612
17520B54212a59257B74522J37980j91338b52698A52462H322d7036B54645r8851
17510A55794P2650b00263O2340A5150i7407L9524C13428C4581L1042A8013a67176
17498C33251K5045A19253A9004P3114h0368c480B83654H0721l7380K74877j03152
17487B15066g7016A91602Q6886b3157A25612g9892C4491K66241j19084C3307d6302
17475B0791a15231B3206e029B31529J2541C0893K83235l9614M2940b32497A85525
17463a28438a4284p1719B67624b53932F5412L65975B9849M0896N45851k50860
$$ plain form
17543 -78344 -144991 -30756 119037 114199 -6032 142219 63085 -73834 73152 -24542 168899
17531 64504 100006 -232777 178854 11789 -127789 37121 27352 345527 115388 156600 254212
17520 254212 -159257 274522 412502 221164 -252698 152462 8322 -47036 254645 155794
17510 155794 228444 -200263 -137923 15150 -97407 -57883 313428 34581 65623 18013 -167176
17498 333251 358296 119253 19004 92118 -80368 -3480 283654 80721 43341 318218 215066
17487 215066 -77016 191602 278488 -23157 125612 -79892 34491 300732 181648 33307 -46302
17475 20791 -115231 23206 -5029 231529 244070 30893 314128 274514 317454 -232497 185525
17463 -128438 -14284 -86003 267624 -253932 65412 431387 29849 70745 616596 365736
17453C65736A34277Q4916C3093K07186O6018j16031K37895H394J87150p0606J96237
17442C21175O3506I5015P3043K54516r8507K4263K7435j78598J39149o7972J49527
17431D17871j8478j3334b68050B45524I1005g7593C06780j18136J17382M811m4063
17420B66774M8013K44018k07074H3981N7318k2175J64642j04504K56560A63168
17409b32345A090K98303K53923A80163a96825B10806o7427d1565A78359o6191
17399A12168c5186F2004J74218B5405a14403A18182L8606j349F1355K70090a98902
17387A82692P5014j22460o2640j6865J9826C2221J62337J9445M12C270J40685
17376A43955J89998b91617d7242k31745B52886L9632J82166A49066E5170J61517
$$ plain form
17453 365736 134277 219193 33093 240279 306297 190266 428161 8394 195544 124938 321175
17442 321175 384681 95015 168058 422574 324067 348330 375765 197167 336316 268344 417871
17431 417871 399393 386059 -268050 245524 91005 -77593 306780 188644 306026 310837 266774
17420 266774 314787 558805 351731 83981 141299 119124 283766 179262 435822 163168
17409 -232345 1090 299393 553316 180163 -196825 210806 143379 -41565 178359 112168
17399 112168 -35186 62004 236222 25405 -114403 118182 156788 155439 61355 331445 -198902
17387 182692 257706 135246 72606 55741 75567 32221 194558 214003 214415 3270 143955
17376 143955 333953 -291617 -47242 -278987 252886 292518 474684 149066 55170 216687
17366B16687Q2436j1119o6385q0104A6700J04728c2120j05090A20131E9522a5476
17354b8835j1641C8407E273b52998B39051M8089b0826B34336H1951J26271D2305
17342A80228K08901j12475q1580a19098A64252f7836B42877I6207R5910k5518
17332A66599f9554A25551J0389g8285D6516K58680c6659A88149a19603A99486
17321B14964K61766j43890J72236J40790B98214i5880C36806i8980C3981K91787
17311C25768f2688A31097a02764E1438N02802A07937d7267m8593G1740K68558
17301C40298e1478A57546d2398A96500P2977A7612L4583K32568a59137A93913
17290A46486L72543A04638J90895a8533A21976m4734J5693J11563p1070b67772
$$ plain form
17366 216687 299123 288004 221619 141515 16700 121428 -32120 -137210 120131 59522 -15476
17354 -28835 -40476 38407 5273 -252998 239051 287140 -20826 234336 81951 208222 42305
17342 180228 389129 276654 195074 -119098 164252 -67836 242877 96207 192117 166599
17332 166599 -69554 125551 135940 -78285 46516 305196 -36659 188149 -119603 199486
17321 214964 476730 332840 505076 645866 298214 -95880 336806 -98980 33981 325768
17311 325768 -62688 131097 -102764 51438 554240 107937 -47267 -95860 71740 340298
17301 340298 -51478 157546 -42398 196500 269477 17612 52195 284763 -159137 193913
17290 146486 519029 104638 295533 -18533 121976 77242 92935 204498 133428 -267772
17279H4221B1392J67141P6132j28311J88022g607A01691J23100P7235J28768j85642
17268B45152P7389m4640o6770o9561a57710M9287A24210g5841B97910F3737r029
17257E4708J56632G4608K0238C3301K35250G7588Q0851J76913C7495K64530K0881
17246C22906A41211J2259R4684R9958D3944J40067G0927a6103A70541n6134L7454
17235A51861n6781K24134A28822K42627i9530b2584B16420C5131K03535J37400
17225C76066D1419K18934j05075b9252B72555J26003A34415b36448B05405J57619
17215C63024E697M39240p0188H2304l3065L10362j0347o3653j41509P1213E3173
17203C59004j53803R7K02406B1582K84882n6114E1944Q3511J39064J12198a39852
$$ plain form
17279 84221 21392 188533 264665 136354 324376 -7607 101691 224791 302026 430794 245152
17268 245152 322541 277901 211131 141570 -157710 -108423 124210 -75841 297910 63737 54708
17257 54708 211340 74608 94846 33301 268551 77588 158439 335352 37495 302025 322906
17246 322906 141211 153470 248154 348112 43944 184011 70927 -16103 170541 114407 151861
17235 151861 95080 319214 128822 371449 -99530 -22584 216420 35131 238666 376066
17225 376066 41419 260353 155278 -29252 272555 398558 134415 -236448 205405 363024
17215 363024 5697 444937 374749 82304 49239 359601 349254 285601 144092 215305 53173
17203 359004 205201 205298 407704 21582 306464 250350 51944 135455 274519 386717 -139852
17191C51172J12064A91448J47418m4966J66342A26746a38187C29918j03727a20404
17180B40087r5332m7813K12374J63119A72089n4945K69000j12650J40960j31937
17170B82517q7390C3093e1566C47683g4203F32696A95197J12520K65431B14891
17159C36787c0057A95408q5150K90105K3400L7424L6418A88998J5052L3683P2521
17148C10254m0914J54046A82334K566K79290L8083G8750J33099K02537A90067
17137B83823c9428B12657k5492J83791K06681j45643N7186Q2429Q3649I1116K15006
17126C06122D9242L31839m386K5555J58429B09835j04055M46106A30723P6483
17116B07206L56089j30254O991A35112J49233N6485A17576L38564j25552Q8623
$$ plain form
17191 351172 463236 191448 338866 293900 460242 126746 -138187 329918 226191 -120404
17180 240087 144755 96942 309316 472435 172089 117144 386144 273494 414454 282517
17170 282517 195127 33093 -51566 347683 -74203 632696 195197 307717 573148 214891
17159 336787 -30057 195408 110258 400363 423763 461187 497605 188998 204050 237733 310254
17148 310254 269340 423386 182334 184900 464190 502273 78750 211849 414386 190067
17137 283823 -39428 212657 187165 370956 577637 431994 489180 571609 655258 91116 306122
17126 306122 49242 381081 376695 402250 560679 209835 105780 551886 130723 207206
17116 207206 563295 433041 440032 135112 284345 340830 117576 456140 330588 419211
17106D19211G8563K38788p5622K72741A02052J7096M44037L508n4836k33995n8877
17095B18985A5212L47638j67391K33766j45679n5788L80326A28204K25172j40987
17085B12389K61851A23755K3333J97254L3432M0128l3289j15451K34464A52697
17074F22806B04654O0878N132L93531n9003r2149q6758A39000K62616Q2527p0373
17063D13770R7734n1283J39469j53794R2910A21293K27050R02J72572k15440J33676
17052D40053K35137q3362N203j01382J0901o1807j26525k6059M37542j60534L2850
17041F02017J7723j08629J61777k85176N15534D32231K30602k00682N8080J38253
17031F58484n6774R0517p8145j21349n3144L17046j43768k51789M62236o9319
$$ plain form
17106 419211 78563 317351 241729 514470 102052 119148 563185 566693 511857 277862 218985
17095 218985 15212 362850 195459 429225 283546 227758 608084 128204 353376 212389
17085 212389 474240 123755 147088 344342 377774 417902 384613 269162 503626 152697
17074 622806 204654 265532 270664 664195 605192 513043 426285 139000 401616 484143 413770
17063 413770 511504 460221 599690 445896 538806 121293 348343 349245 521817 306377 440053
17052 440053 675190 591828 597031 495649 506550 444743 318218 292159 729701 569167 602017
17041 602017 619740 511111 672888 387712 903246 432231 662833 462151 520231 658484
17031 658484 601710 692227 614082 492733 439589 756635 612867 361078 823314 753995
17021G53995j71720J70683k42033K4106L38624k26980n1981L0425O0039K5226
17011G10384K65191j85080l74152K47812k05522K17084P5731O661J160n3684k58078
17000D47507L55345k83285K26827K76852m50322B62794O61286l14313J21765j38375
16990E93157P258K1994L47671k10596k52197K89533k9599k20496L57395K26219
16980A130339m80640K9993q1542K92479k98188l6693K68908L3831m9009J75637
16970I85115p3338l5032j00583K60623l18389M25720R783m48143J90507o4814
16960H31449j45618M84461m37422P6451K07453k13622Q1192j81374L13413O7481
16950A083864k71230N9896J4503k15404L59802R5082J05572k53259k30671R4233
$$ plain form
17021 753995 582275 752958 510925 535031 873655 646675 594694 625119 685158 710384
17011 710384 975575 790495 416343 664155 458633 675717 751448 758109 759269 705585 447507
17000 447507 802852 519567 746394 1023246 572924 262794 924080 609767 731532 593157
16990 593157 600415 622409 970080 759484 507287 796820 767221 546725 904120 1130339
16980 1130339 649699 679692 598150 890629 592441 555748 824656 858487 809478 985115
16970 985115 911777 876745 776162 1036785 718396 1144116 1153899 705756 896263 831449
16960 831449 685831 1170292 732870 809321 1016774 803152 884344 702970 1016383 1083864
16950 1083864 812634 872530 887033 671629 1031431 1126513 1232085 978826 748155 842388
16940H42388N67240j81128q713j04504k0853P1977Q5161r0050J43194j69970O3767
16929A198509J04967p8794l7259O4066L16312l86853J64521k90763J33934j4102
16919A174538L0293k96554N46568n6284J07919q9447j94387N48903m03729r0781
16909A277039j7393K29995l53038K53759J00239j4371O5323N2055m12735K76792
16899A457665Q3314j4526J5083L10401j89736j27706L15051k5119k96285J79568
16889A707710j53451J15787l00050J38422Q08476p59345K0978M07309k5352L93407
16879B353891n31484J63521J53465k89643L63962j25525J15522n5122K03573k19635
16869B132525O5744J5962M60533k11206j38327j81295J08419M808L47488m38880
$$ plain form
16940 842388 1409628 1228500 1219787 1115283 1094430 1166407 1251568 1161518 1304712 1134742 1198509
16929 1198509 1303476 1224682 1187423 1251489 1567801 1180948 1345469 1054706 1188640 1174538
16919 1174538 1204831 908277 1454845 1398561 1506480 1417033 1222646 1771549 1367820 1277039
16909 1277039 1259646 1489641 1136603 1390362 1490601 1476230 1541553 1593608 1180873 1457665
16899 1457665 1540979 1526453 1541536 1851937 1662201 1534495 1849546 1824427 1528142 1707710
16889 1707710 1554259 1670046 1369996 1508418 2316894 1557549 1578527 1985836 1960484 2353891
16879 2353891 1822407 1985928 2139393 1849750 2213712 2088187 2203709 2148587 2352160 2132525
16869 2132525 2198269 2214231 2674764 2463558 2325231 2143936 2252355 2257163 2604651 2165771
16859B165771L78801J20117q5642L29996J8257k51946J07944R397n4965R1789
16849B829519J66648j7558K01001K62161l29502j4852K52878k29247N58132m15516
16839C263664M04524k1918j61003M37627m21567M88313j90831L80951n75044M12356
16829D017072J82453j8795K94347K45299n2989Q4330l54714N41387l510l8023
16819D896857p0815K49460K46084J09714R982K79499l67470M84549o2164j60469
16809E615227N17958K06365J80415J52901k80061L81553q9703P10202l58497J90477
16799G226837O4184M45037l4131K10013L17797K47408J92907L82456J09782l8590
16789I123700O03400O8706J21056K17232Q30308l54319P00075K71902N15904J09030
$$ plain form
16859 2165771 2544572 2664689 2579047 2909043 2927300 2675354 2783298 2792695 2737730 2829519
16849 2829519 2996167 2978609 3179610 3441771 3112269 3097417 3350295 3121048 3679180 3263664
16839 3263664 3668188 3646270 3485267 3922894 3501327 3989640 3798809 4179760 3604716 4017072
16829 4017072 4199525 4180730 4475077 4720376 4667387 4751717 4397003 4938390 4934880 4896857
16819 4896857 4826042 5075502 5321586 5431300 5441282 5720781 5353311 5837860 5775696 5615227
16809 5615227 6133185 6339550 6519965 6672866 6392805 6774358 6684655 7394857 7036360 7226837
16799 7226837 7291021 7736058 7701927 7911940 8229737 8477145 8670052 9052508 9162290 9123700
16789 9123700 9727100 9795806 9916862 10134094 10964402 10610083 11310158 11582060 12097964 12206994
16779A2206994K58898L60593P32743J03279L32659P26991M25164j14264J242258
16770A6275315O24079N01772N43111O09032N44189N89978J194799R99306L30217
16761B2211798J079708R53046Q17606J009145J489480P50108J529161J218465
16753C1058517J391487J421069J386868J973194J775237J959373K522134J786010
16745D5273889K386289K572455K619393K814310L309272L321233L738926L674653
16737F9710420M201467M283453M983341M845796N498007N885551O024080O148905
16729A11581020P092217O750622P539087P617392P410625P413977P038785O657723
16721A69101448O505951N317086M419138L189579K273619O28050p65481k277806
$$ plain form
16779 12206994 12465892 12826485 13559228 13662507 13995166 14722157 15147321 15033057 16275315
16770 16275315 16899394 17401166 17944277 18553309 19097498 19687476 20882275 21881581 22211798
16761 22211798 23291506 24244552 25062158 26071303 27560783 28310891 29840052 31058517
16753 31058517 32450004 33871073 35257941 37231135 39006372 40965745 43487879 45273889
16745 45273889 47660178 50232633 52852026 55666336 58975608 62296841 66035767 69710420
16737 69710420 73911887 78195340 83178681 88024477 93522484 99408035 105432115 111581020
16729 111581020 118673237 125423859 132962946 140580338 147990963 155404940 162443725 169101448
16721 169101448 175607399 180924485 185343623 188533202 190806821 191434871 190669390 188391584
16713A88391584k892026m934592n542966o554379o794310p702372p909447p461990
16705A38599502p617132q081762p119605o830478o706807o476228n549348n521110
16697H4697032n340395n045292m183178m210382m061448l464613l175433l295410
16689E1920881k724754k930598k315937k035660k348480k084975j646343k196976
16681C3637158j296790j781640j142584j375762j248624j238509q87298j160253
16673B3505698r22475q11724j093879n85571j145798l18382j004143n02850q36799
16664A6284077l96372o23064m71249o41119j95898o35735l13059k92018m25752
16655A2289811o37210m48612k64898k65831m07489j08619k84676k66145l06365
$$ plain form
16713 188391584 185499558 180564966 175022000 168467621 161673311 153970939 146061492 138599502
16705 138599502 130982370 122900608 115781003 108950525 102243718 95767490 90218142 84697032
16697 84697032 79356637 74311345 70128167 65917785 61856337 58391724 55216291 51920881
16689 51920881 49196127 46265529 43949592 41913932 39565452 37480477 35834134 33637158
16681 33637158 32340368 30558728 29416144 28040382 26791758 25553249 24665951 23505698
16673 23505698 22583223 21771499 20677620 20092049 18946251 18627869 17623726 17120876 16284077
16664 16284077 15887705 15264641 14793392 14152273 13956375 13320640 13007581 12715563 12289811
16655 12289811 11652601 11203989 10939091 10673260 10265771 10157152 9872476 9606331 9299966
16646I299966l85858j69009j64192k82253k74149l91988k79565N3430m47773Q1013
16636G039622j84802j21895n61511j03411r6484L1288q3196k10950l22347J32123
16626E518437m13489j93114M16245m04464R3254n67685J93685j68389K2389M2429
16616D539298l39987K63061n59457O940K0288K9966j61714j348q6039m2719j2539
16605C655750r3684o2009k8764M731j79336K58894m05442P2256k03027K4029Q802
16594C052200k10973K74177j03639m28821J85977j10358j13873r7055j1121p2054
16584B364460K70115m89114J94493o1713o7333K7471J94822J57448m06127j13860
16574B070662L78265l88422j55156l49441K37333L09963j88213J6140r303M7902
$$ plain form
16646 9299966 8914108 8745099 8580907 8298654 8024505 7632517 7352952 7406382 6958609 7039622
16636 7039622 6854820 6732925 6171414 6068003 5971519 6002807 5919611 5708661 5386314 5518437
16626 5518437 5104948 4911834 5328079 4923615 5016869 4449184 4642869 4474480 4496869 4539298
16616 4539298 4199311 4462372 3902915 3909855 3930143 3960109 3798395 3797047 3711008 3668289 3655750
16605 3655750 3562066 3500057 3471293 3476024 3296688 3555582 3150140 3222396 3019369 3043398 3052200
16594 3052200 2841227 3115404 3011765 2582944 2768921 2658563 2544690 2447635 2436514 2364460
16584 2364460 2634575 2145461 2339954 2278241 2210908 2238379 2433201 2590649 2184522 2070662
16574 2070662 2448927 2060505 1905349 1555908 1793241 2103204 1914991 1931131 1921828 1969730
16564A969730j50634j16600m8974J48707k08181J15959p6536k0404J19666j39642
16554A593091N4076k6836p0816n2600K72697j85486k74634L23819l2003J1272
16544A612580k15040J19356l07956L27668o05036L08253l7802j03697L20039j77250
16534A241115l61983L84764l52143M32810j15405L0242O3137j63153J47247l27229
16524I79402L61150l93590p9422K12143L58833l87270n3303k648K61179l60382
16514H96092K8731J83762J96301l36966j79629J44704k56702L86100n872l05148
16504G51373j1127k18146J79242M1263k50134M19155k32915j719N10482l66199
16494H21275k35942O8738O5851k22537L52909k09230j33799O3173K6850j82159
$$ plain form
16564 1969730 1819096 1702496 1653522 1802229 1594048 1710007 1633471 1613067 1732733 1593091
16554 1593091 1647167 1620331 1549515 1496915 1769612 1584126 1309492 1633311 1601308 1612580
16544 1612580 1397540 1516896 1208940 1536608 931572 1239825 1202023 1098326 1418365 1241115
16534 1241115 879132 1263896 911753 1344563 1229158 1259400 1322537 1159384 1306631 979402
16524 979402 1340552 946962 867540 1079683 1438516 1051246 997943 995295 1256474 896092
16514 896092 924823 1108585 1304886 967920 788291 932995 676293 1062393 1056521 751373
16504 751373 740246 522100 701342 742605 492471 911626 678711 676992 1187474 821275
16494 821275 585333 654071 719922 497385 850294 641064 507265 570438 597288 415129
16484D15129K22281k06337K41861L32036C90190J35304J5549j16871M9126P5655
16474E48953J75165q30N3217A78754J84203O03872m33011j05920R8719K11064
16464G37681J44345C35416M04079n1956j37733R1213J56693l17825j4482j44499
16454C20906J6271N3461L15700R355k46188R897j06762P4467q0973J45386K04357
16443G15877k18349j61852K50527j65643k01771J80288r9753P5948J25852J6422
16433E17546l7661J27205n0169m5048j11333k3878M6506L54573q5881r2252k68832
16422C30776L42278l16407j75371L91779B69353r4006K32167j88994L59225B36357
16411B76300J2936C7589P9329J06792K02426K55353C37919N1059j48908L36202
$$ plain form
16484 415129 637410 431073 672934 1004970 390190 525494 541043 424172 473298 548953
16474 548953 724118 723288 776505 178754 362957 966829 533818 427898 526617 737681
16464 737681 882026 335416 739495 687539 549806 641019 797712 479887 465405 320906
16454 320906 337177 390638 706338 715693 469505 479402 372640 447107 366134 511520 715877
16443 715877 497528 335676 586203 420560 218789 399077 299324 375272 501124 517546
16433 517546 479885 607090 556921 511873 400540 376662 423168 777741 691860 599608 330776
16422 330776 673054 356647 181276 573055 269353 175347 407514 218520 577745 236357
16411 276300 289236 37589 116918 223710 426136 681489 337919 388978 240070 576272
16401E76272A88653f6432D15624F4016N09513k20420K0205A66755J94117P077
16391C67949F1229b2754C4087N44964j27955k17531J72186E3484J48070R7255
16381B98809J16202j58787M1122J07100j18821P1584q012j13123J192J55607A54601
16369B15809k3390J14355j40707L68265J1467B0788L03588A42839R1608j5626
16359B18821j6882K37G5515J36746I1469h1053D18001A517a44321E35771a28527
16347B34266g6452B70468j26085l9395M84363B90425d8380B34435c2472B43958
16336B39211O8600r9395J48999A41648o3245a36063C10876M759I3086K13116A00683
16324A47368A7832J3434M20727E9682J16097h4736B19837C8263K05195K26662
$$ plain form
16401 576272 188653 -66432 415624 64016 573529 353109 373314 166755 360872 367949
16391 367949 61229 -22754 34087 579051 451096 233565 405751 53484 201554 298809
16381 298809 415011 256224 297346 404446 285625 357209 349197 236074 237266 392873 154601
16369 215809 192419 306774 166067 534332 545799 20788 324376 142839 234447 218821
16359 218821 201939 202176 75515 212261 91469 -81053 418001 1517 -144321 535771 -128527
16347 234266 -76452 270468 144383 104988 589351 290425 -48380 234435 -32472 243958
16336 239211 307811 208416 357415 141648 78403 -136063 310876 315635 93086 306202 100683
16324 147368 17832 31266 451993 59682 175779 -84736 219837 38263 243458 470120
16314D70120a22967A28585f5396A18890E1514n519K13956b08244C97L49602A21741
16302a25570C95834a34196C42350j54822g9466C26564A08330L4358J56604j3701
16292B85591a8278j35598G5937J39744o6007J50637A33103J54980G1182J63340
16282B34522p9392O1964p7700o2571L15895A24287Q0306j7344n8639K44953A36976
16270D7838P2488k9161C8320K02129D772O2372M89357A10457K04144A28014g0008
16258a17405B41788K1561E38R4873P3321n7957K84742f9821m2672r0111m0743
16247b43347I095a80392D79352a14446H1537J53889L29768e4013E8048e8039I0849
16235b729m540q1465B75364e9205j02896K2235N7688c7930q0758p7247B09204
$$ plain form
16314 470120 -122967 128585 -65396 118890 51514 45995 259951 -208244 397 349999 121741
16302 -125570 395834 -134196 342350 187528 -79466 326564 108330 142688 299292 285591
16292 285591 -18278 -153876 75937 215681 149674 300311 133103 288083 71182 234522
16282 234522 155130 217094 139394 76823 392718 124287 204593 187249 128610 373563 136976
16270 47838 120326 91165 38320 240449 4772 67144 556501 110457 314601 128014 -70008
16258 -117405 241788 263349 538 95411 168732 110775 395517 -69821 -112493 -202604 -243347
16247 -243347 9095 -180392 479352 -114446 81537 235426 565194 -54013 58048 -58039 90849
16235 -2729 -7269 -88734 275364 -59205 -162101 -139866 -82178 -37930 -118688 -195935 209204
16223C08730G7612b75064C39302J81773g5631B86072o9577b53477B48579h9899
16212c8374B07548g3356q3010e6052B49471A435g4390A90614j9613m5545a93674
16200A84627b65140G5158N6330l6499k1622J46885d1697D0170d10568B8985c17
16188B63428a68680f5043b1035M358p0893A43092J41847b51940f2773B82399m4127
16177B38272l4408D9894d6541n9776A50222B8230D380d0868B18695a6780m4033
16166f0813o8826M9801B21819E1625B1807c9648j0498q7139n816F5632P1555M9740
16154A86927a51678A65642l7069K04039F8699b82279A37339c6047l37073c7070
16143H5897e9443a1898A8304J21885P2002i5604A32596c606l19280C9835b0333
$$ plain form
16223 308730 77612 -275064 339302 521075 -75631 286072 216495 -253477 248579 -89899
16212 -38374 207548 -73356 -156366 -56052 249471 1435 -74390 190614 171001 125456 -193674
16200 184627 -265140 75158 131488 94989 73367 220252 -41697 40170 -410568 28985 -317
16188 263428 -168680 -65043 -21035 -16677 -87570 143092 284939 -251940 -62773 282399 238272
16177 238272 203864 49894 -46541 -106317 150222 28230 4380 -40868 218695 -16780 -60813
16166 -60813 -129639 -79838 221819 51625 21807 -39648 -50146 -137285 -143101 65632 137187 186927
16154 186927 -151678 165642 128573 332612 68699 -282279 137339 -36047 -373120 -37070
16143 85897 -59443 -11898 18304 140189 212191 -95604 132596 -3606 -322886 39835 -20333
16131A87178g2293R948A0931b06912c8314j82355G0037i4068j0069B55892a09308
16119C14286f2873A2906a15763e3237A53459p4889J3635l9447h6246j20149A28607
16107D9692e2935j02825G7754a7343C38422n1277j10347B8784J5744N8157e341
16095a03370B9935P0445O6051P208a42421b0391l71087h7896q474m3163m4748
16084a84281A15366a36246A06912a03153H1760K9305b2021A61979J34313d918
16073b71600C5035i0904l7775A27879a12555A43954a95935d5743j50275f2142
16062f1809B202b16319A04897j2290J77493j14842B1976J82945c4805l50260F3377
16050a87727j42606d6388F1583f7962A83682a14308e3420F9339n006b86907q7959
$$ plain form
16131 187178 -72293 -62345 10931 -206912 -38314 -220669 70037 -94068 -104137 255892 -109308
16119 314286 -62873 12906 -115763 -53237 153459 78570 92205 52758 -86246 -206395 128607
16107 49692 -52935 -155760 77754 -17343 338422 287145 176798 28784 44528 102685 -5341
16095 -103370 29935 100380 166431 173639 -142421 -20391 -391478 -87896 -96370 -139533 -184281
16084 -184281 115366 -136246 106912 -103153 81760 111065 -22021 161979 296292 -4918
16073 -271600 35035 -90904 -128679 127879 -112555 143954 -195935 -45743 -196018 -62142
16062 -61809 2202 -216319 104897 92607 270100 155258 21976 204921 -34805 -385065 63377
16050 -187727 -330333 -46388 61583 -67962 183682 -114308 -53420 69339 64333 -286907 -374866
16039c74866A1343J46607p0590a85866N4320A12369e77333a26866C4133g6079
16028C5018a63605f8142l0620j01901A65Q8988a83731b5506B0476c96084D1116
16016d9966l1263H8628l1473b15054A8990L12818g5549B38119a4782n0632A629
16004D5442K33465D6369f1619J2472j2204A24743C2644P9635E5433A5160b42764
15992a73761j69048e5659j14791j8860A61194j0099a63415A24281J12057g7931
15981C29499L1658D7743a60131A89689L59758A68911e35r114G3701c60985E6058
15969B12752d8701A33259n6684a59544A22311a12890q0802j03088A18182C2732
15958a62184I784Q1705a32910l9963N3350r6636J8444K8336r137J888C2255A5853
$$ plain form
16039 -374866 11343 157950 87360 -185866 -131546 112369 -577333 -126866 34133 -76079
16028 35018 -163605 -68142 -98762 -200663 165 89153 -183731 -25506 20476 -396084 41116
16016 -49966 -81229 88628 57155 -215054 18990 331808 -75549 238119 -14782 -65414 1629
16004 45442 278907 46369 -61619 -49147 -61351 124743 32644 112279 55433 15160 -242764
15992 -173761 -342809 -55659 -170450 -189310 161194 151095 -163415 124281 236338 -77931
15981 329499 361157 47743 -160131 189689 549447 168911 -535 -9649 73701 -360985 56058
15969 212752 -48701 133259 76575 -159544 122311 -112890 -193692 -296780 118182 32732
15958 -162184 9784 91489 -132910 -172873 -119523 -216159 -197715 -169379 -178516 -176628 32255 15853
15945A75656c28863E3674K6998a56116f5482C692J9583g1341F2339b07993I4399
15933A47115J27009c4538k2345j51501q9564a43477G4042K75719a26891e7284
15922B17792O2943j35408g7833A63102b5660A6172a54179O6192B22578C3826b46284
15910B10799H3177a14743p6482d4934E5826b75894e7351H9385b09242k78197G0578
15898B52737E4107e9021A45942A3933J95498q3663c01864d0646j82648g6090k54100
15887c30190F3268h4062k91493B4724c03444b2211q8966L4633c3967B57967j08725
15876A49242E0799B3708a08037m8361n5589a5549l0573I2931g8022A55181a12554
15864I1098D2950O4142b26545P5127e7524B61036g4545r9919D3386b78759P6608
$$ plain form
15945 175656 -328863 53674 80672 -156116 -65482 3692 23275 -71341 62339 -207993 94399
15933 147115 274124 -34538 -56883 -208384 -297948 -143477 74042 349761 -126891 -57284
15922 217792 280735 145327 -77833 163102 -25660 16172 -154179 -87987 222578 33826 -246284
15910 210799 83177 -114743 -191225 -44934 55826 -275894 -57351 89385 -209242 -487439 70578
15898 252737 54107 -59021 145942 13933 209431 125768 -301864 -40646 -223294 -76090 -330190
15887 -330190 63268 -84062 -375555 24724 -303444 -22211 -111177 -76544 -33967 257967 149242
15876 149242 50799 23708 -108037 -156398 -211987 -15549 -46122 92931 -78022 155181 -112554
15864 91098 42950 107092 -226545 -151418 -57524 261036 -74545 -174464 43386 -278759 -202151
15853b02151A18312c2703J5561B53149N0399O0066c61131F6178L3837m7448B2314
15841C90701G8806d08145a15388I9399L07200a50277H0296A6192P4357a50571
15830a01992M3879q4227j24326F3172M1164C1762j3135d4452p7724r0891H720
15818b4713B40185D5598e77351C9995a75239f3147A00340b87512A55423B5601
15807A21656b02942B3416e76164e1565B7932c87529d0993l08838C3649b1025j15622
15796a36647j2016o1838A00797B4220b28021J12559K5254a0850E9660J92893f075
15784B51343h0067l31972a49951D4225g186F8616c32505a03626b5692j45079L3357
15773a37414d8767k12051h3397A84898d6101B9623c6726j71918G7785a56343j45299
$$ plain form
15853 -202151 118312 -32703 -17142 253149 303548 363614 -361131 66178 100015 52567 22314
15841 390701 78806 -408145 -115388 99399 406599 -150277 80296 16192 90549 -150571
15830 -101992 -58113 -142340 -266666 63172 104336 31762 18627 -44452 -122176 -213067 8720
15818 -24713 240185 45598 -577351 39995 -175239 -63147 100340 -287512 155423 25601
15807 121656 -202942 23416 -576164 -51565 27932 -387529 -40993 -349831 33649 -21025 -136647
15796 -136647 -148663 -210501 100797 24220 -228021 -115462 -90208 -10850 59660 252553 -6075
15784 251343 -80067 -412039 -149951 44225 -7186 68616 -332505 -103626 -25692 -170771 -137414
15773 -137414 -48767 -260818 -83397 184898 -46101 29623 -36726 -208644 77785 -156343 -301642
15762c01642a14909e6152C8903J37709k128h6703L7533K3534A6533J70498g6158
15750b20479j0896q7834F2617c7521j66135h8709j09043f560k35343l3302d4573
15738a28977A19117h3716m5631R839j576A46966h6205b0519A34670j7458c78305
15726a99273c5552A46447b1173j4831A07833R1771N3139b36464c7730j25999P1455
15715i2274M0364k02334e3335o3034B2259a65988J1905d939l24690B38768a00466
15703A14941d90508A60997J32042c40383C7825d45540g9958E3387h1541b7715
15692C2669c4696F8353J00974J39560A30490b54310B50520M5265j45788d1814
15681F5736a74254m5895H8631b67004N5565c0605A49501a72454L8977b8392j44016
$$ plain form
15762 -301642 -114909 -56152 38903 176612 174484 -86703 -49170 -25636 16533 187031 -76158
15750 -220479 -231375 -319209 62617 -37521 -203656 -88709 -197752 -6560 -241903 -275205 -44573
15738 -128977 119117 -83716 -129347 -119508 -121084 146966 -86205 -20519 134670 117212 -378305
15726 -199273 -35552 146447 -21173 -36004 107833 199604 252743 -236464 -37730 -163729 -92274
15715 -92274 -51910 -254244 -53335 -116369 22259 -165988 -154083 -4939 -329629 238768 -100466
15703 114941 -490508 160997 293039 -340383 37825 -445540 -79958 53387 -81541 -27715
15692 32669 -34696 68353 169327 308887 130490 -254310 250520 295785 149997 -41814
15681 65736 -174254 -220149 88631 -267004 -211439 -30605 149501 -172454 -133477 -28392 -172408
15670a72408C70603e9231B33422A11800a3931N144D2463L8930C5375L7307O3166
15659A35848D2522M143R4135o4954A2445K31734J0559i1078A47356K76543A53727
15647F0365a00812K4947k92431I2715a72773j01941B14459b28684h517k39762
15637b48279e2264K2813e71j14021I5388m2217a95078H4960b17112D993d0242
15625A51942B1970J79224D2077A9779J8969b5490b816A18475a24349B22169g3354
15613b20724n1096I4585b92035b9586J3466A41236D3287N250a38932G0015J7720
15602H7735b62086j56799B4886J78600b03967g6306A86613b0281k18958L0468
15592b08771A81012a91437c9539F669c14098a6786k9424j31701A4629a1494A04971
$$ plain form
15670 -172408 370603 -59231 233422 111800 -13931 -8787 42463 81393 35375 72682 135848
15659 135848 42522 46665 140800 75846 12445 244179 254738 -91078 147356 423899 153727
15647 60365 -100812 -75865 -368296 92715 -172773 -274714 214459 -228684 -8517 -248279
15637 -248279 -52264 -29451 -571 -114592 95388 53171 -195078 84960 -217112 4993 -40242
15625 151942 21970 201194 42077 19779 38748 -25490 -2816 118475 -124349 222169 -73354
15613 -220724 -271820 94585 -292035 -29586 -16120 141236 43287 48537 -138932 70015 87735
15602 87735 -262086 -418885 24886 203486 -203967 -76306 186613 -20281 -239239 -208771
15592 -208771 181012 -191437 -39539 6669 -314098 -16786 -46210 -177911 14629 -11494 104971
15580b06480L6217f1791A22415K027K81302a13413m7337j8206A87253F8420J4451
15569H2871a62944I2511R802e6298A2866N7199A0212L01272L742j34787d31523
15557c0843f324j22372K6836F8188h6192G5623a6171B56242p3851b31188i2418
15545E56c4795N756B77521f8056m2625B48372a04823C88156C1337J07565J41287
15534B80189E4017c00663J06657C6077a19760A30340J81357e2154C5959r238K8569
15523E5290a50028B10225f6730k2828d2754A4753J83692D3610J44932j8459J0359
15512A80442d4981I9119P6907L0637a83632i002D02635i9114k13262J50257K3488
15501a38631A14912f1447r3813D337N3061j5614b74582n7354a03532A26833d3009
$$ plain form
15580 -206480 -170263 -61791 122415 124442 405744 -113413 -160750 -178956 187253 68420 82871
15569 82871 -162944 92511 102313 -56298 12866 70065 10212 311484 315226 180439 -431523
15557 -30843 -6324 -128696 -101860 68188 -86192 75623 -16171 256242 182391 -231188 -92418
15545 556 -34795 -29039 277521 -68056 -110681 248372 -104823 388156 31337 138902 280189
15534 280189 54017 -300663 -194006 36077 -119760 130340 311697 -52154 35959 26721 55290
15523 55290 -150028 210225 -66730 -89558 -42754 14753 198445 43610 188542 170083 180442
15512 180442 -44981 99119 176026 206663 -183632 -9002 402635 -99114 -312376 -162119 -138631
15501 -138631 114912 -61447 -155260 4337 57398 41784 -274582 -331936 -103532 126833 -43009
15489F9465b85061J07466C2052J04283J60444K65936d9089j71494C1335h2939
15478a49285C2892e1350J2411n3691j9562j80718J09465r993D5389C164L01383
15467C04547b24522E8422C369O7394a0610H2795f5551j08786C244j09K89926m1415
15455B51646d02773B1124M8233J10555j3920K6318n0595K31194a85924P6883B81241
15443a04594L0427A42322E4658L4744k6298a12695b7069I5842a2061A05164n754
15432I9410b06128C96944G4988l5739b21201A02719f4202r7531b8295p6406p8067
15421a82768R403A74715a5074A72903p3165m7204a83258B02055b2835m44313a3328
15409D3109L1890f9394A44935n7597d6853I9278d5864A1061g0800k37607f8310
$$ plain form
15489 69465 -285061 -177595 32052 136335 296779 562715 -49089 -220583 31335 -82939
15478 -149285 32892 -51350 -38939 -92630 -112192 -292910 -183445 -193438 45389 3164 304547
15467 304547 -224522 58422 3369 70763 -10610 82795 -65551 -174337 3244 3135 293061 251646
15455 251646 -402773 21124 69357 179912 165992 192310 141715 372909 -185924 -109041 281241
15443 -104594 -74167 142322 54658 89402 63104 -112695 -27069 95842 -12061 105164 99410
15432 99410 -206128 396944 74988 39249 -221201 102719 -64202 -161733 -28295 -104701 -182768
15421 -182768 -173365 174715 -15074 172903 99738 52534 -183258 202055 -22835 -467148 -13328
15409 43109 74999 -69394 144935 87338 -46853 99278 -45864 11061 -70800 -308407 -68310
15397a41780O2053A09524K05638d2713D73708k36381c87566a56800j36636J35457
15387a57979e4495A78535a86083c7871n627I4306b63087Q1906B96384b10176H7616
15375A68762i0540k12586H5342k8410J94681a36962C88819A83518a8624n958q5911
15364a10493m8984f6947C23110D8464L969a01990L4716m5252J5316j75855c916
15352c1986D4465a99195B77499a95461e5592j11379k61527A94046d33493J51657
15342b81836H9015K82700a59802A66744p1192K3680n3845L07555H821K28470B3979
15330b0709I9420e5848j53730Q6116m0928A30648o3240A5057J5409N874a34384
15318A36265K3900c05696A35306J50230A09096J03791A8140K22866a59768a1260
$$ plain form
15397 -141780 -79727 109524 315162 -42713 473708 237327 -387566 -156800 -293436 -157979
15387 -157979 -54495 178535 -186083 -37871 -43498 94306 -263087 -181181 296384 -210176 87616
15375 168762 -90540 -303126 85342 56932 251613 -136962 388819 183518 -18624 -24582 -110493
15364 -110493 -159477 -66947 323110 48464 52433 -101990 -67274 -112526 -97210 -273065 -3916
15352 -31986 44465 -199195 277499 -195461 -55592 -166971 -428498 194046 -433493 -281836
15342 -281836 89015 371715 -159802 166744 95552 119232 65387 372942 8821 237291 23979
15330 -20709 99420 -55848 -209578 -123462 -164390 130648 67408 15057 30466 36340 -134384
15318 136265 160165 -305696 135306 285536 109096 212887 18140 241006 -159768 -11260
15307C32112j59440O8813a00502A32758J19400O0791A47936k8526a16612A93587
15296e8446C04906C0929K25520b23769C48416B5981K68043j34494m5264e2672
15285a87283f1984B6462b3212C94480a94074c5724C7131a00030i759p2759d1215
15273B71024h7092B451P9561O2823J19968b0865B41434a7743A89538G5496a06673
15261a6164j59110D6715K40608a44637A4071M17038G6762a57427M7094A69131
15250e4357C93980M40492L72686k46086k20046K45807j94495j92895B04993O9629
15240B74622j10631f1777F6499K92167i3830L2843A23473n9564O7331b66895o054
15229b72949E02701k05161i0920B52637F9888L7316d8602G9992i7494B55665a8490
$$ plain form
15307 332112 172672 241485 -100502 132758 252158 312949 147936 119410 -116612 193587
15296 -58446 304906 30929 256449 -223769 348416 25981 294024 159530 114266 -52672
15285 -187283 -61984 26462 -23212 394480 -194074 -35724 37131 -100030 -9759 -82518 -41215
15273 271024 -87092 2451 82012 144835 264803 -20865 241434 -17743 189538 75496 -106673
15261 -16164 -175274 46715 287323 -144637 14071 431109 76762 -157427 -110333 169131
15250 -54357 393980 834472 1207158 961072 741026 986833 792338 599443 204993 274622
15240 274622 163991 -61777 66499 358666 -93830 -60987 123473 63909 131240 -266895 -272949
15229 -272949 502701 297540 -90920 252637 69888 107204 -48602 79992 -97494 255665 -18490
15217a61906A72883K4255k9381G8474P7436o6346e9312E1258p156J69626f9850
15205a98761I4533M169b5978A44970j6231a09486B37307i8969A94865q7992C1223
15193G5682a18876n4248A04031B6601a26669c407B4627N5235M0780c2097A21271
15181B26591J05472A57636B3362J40008B0556a4096B27569a0048A91742i1730
15170a06015J7766C37715b28664a3271C34771H9342M3080a36817F3613p618F528
15158B421a26364F3684J66442k6789m799E5353b4799C5006M5304B4731K76708
15147C01439A17698K24297g3210G5621J15791N9369l6397A3790a00248C78419
15136B35232j06495R6076a92290D440f5352p1536B35364q9792f8651C06137A13346
$$ plain form
15217 -161906 172883 197138 167757 78474 155910 89564 -59312 51258 44102 213728 -69850
15205 -198761 94533 98702 -25978 144970 128739 -109486 237307 -98969 194865 106873 31223
15193 75682 -118876 -173124 104031 26601 -126669 -3407 24627 79862 120642 -32097 121271
15181 226591 332063 157636 23362 163370 20556 -14096 227569 -10048 191742 -91730
15170 -106015 -88249 337715 -228664 -13271 334771 89342 132422 -136817 63613 55995 6528
15158 2421 -126364 63684 230126 203337 198538 55353 -24799 35006 80310 24731 301439
15147 301439 117698 341995 -73210 75621 191412 250781 214384 13790 -100248 378419
15136 235232 128737 224813 -192290 4440 -65352 -136888 235364 145572 -68651 306137 113346
15124C51825C7482A1298a74208F6460j7752L22586j18516a10252j4140B03659
15113A44548i2161C17583E4571O9277L71121c29632e6329H8849L95090B0280J73970
15102A94250a75940B711J29967k8400g166B4271Q4668j6143J41958N0763b8696
15090A74066a33416A38287J36318a30931B89449r8316i8547H8772J42878M8614
15080B80264A1788Q2305J5358f2455m5275h337q19j97344j68960F4163K10248
15069B74411C5224a45628B79538l4984M7061G7433j7429P4878J03823r5411M0406
15058A83700q6224L11269j64664j13684G00L23571l161J54729B25969r6855K56476
15047C85590K3089q1801K4518J1990b2310n27C3403K65973l3136J51098b0220
$$ plain form
15124 351825 37482 11298 -174208 66460 48708 371294 252778 -110252 -124392 203659
15113 144548 -92161 317583 54571 123848 494969 -329632 -56329 88849 483939 20280 194250
15102 194250 -175940 2711 132678 104278 -7166 24271 108939 92796 234754 285517 -28696
15090 174066 -133416 138287 274605 -130931 289449 191133 -98547 88772 231650 280264
15080 280264 11788 94093 109451 -62455 -107730 -8337 -9156 -206500 -375460 64163 274411
15069 274411 35224 -145628 279538 244554 291615 77433 60004 134882 238705 143294 183700
15058 183700 97476 408745 244081 130397 700 324271 321110 475839 225969 129114 385590
15047 385590 408679 326878 351396 363386 -22310 -22837 33403 299376 266240 417338 -20220
15035D97737d4763G8423a4848C85972A21094K45751n9725o3868D7990R1336J99627
15024C38953A21708K17560j15135d2160D56478d0589B5737K63619a56654B74546
15013D1998J62212o5218F3543L16936j40015G6951b07770A99822J36576G6024
15002i4704A60322E1680K6310k1720L58230j81591a96834C61548M3158j47834
14992B56872J56746E8072L72978A36818L60722k23355N1715h4593C42249L09107
14982F51356a05106A30467K2527F841N61149B32349f425A69690n531J75364a13069
14970B90827R2383d025B01209C68K65910P0042m2843G8799K07510M6213n4648
14959B77874p611H0618N57921B41522I9411N85651j18178A25991L19254A25632
$$ plain form
15035 497737 -44763 78423 -14848 385972 121094 366845 307120 243252 47990 139326 338953
15024 338953 121708 339268 224133 -42160 456478 -40589 25737 289356 -156654 274546
15013 41998 204210 138992 63543 380479 240464 76951 -207770 199822 336398 76024
15002 -94704 160322 51680 77990 56270 414500 232909 -196834 361548 404706 256872
14992 256872 413618 58072 431050 136818 497540 274185 325900 -84593 342249 651356
14982 651356 -105106 130467 152994 6841 567990 232349 -6425 169690 164159 339523 -113069
14970 290827 383210 -4025 201209 368 266278 336320 293477 78799 286309 332522 277874
14959 277874 270263 80618 638539 241522 99411 685062 566884 125991 445245 125632
14948A52103K55963A46166J68168A42101J65028K252K90451B05227J12531A39401
14937B47164J58351A46883L81304A76027O0274l8197k6674N5587o9262P3647P2502
14926C03904o6636J8971l3304A03693G681M00301F7203M7808K81030A15214l6488
14915G8726J26070K15892j91621J93580j45862P4668j25596K60246A51289N7202
14905B08491J70216j52426J60441K779A87168m3826M75564C07025m0716D3868
14894C32731o2458M9662j56642L19626j15971j59424R2156M1427O1192A82377
14883C03922P4817m7346j18339L02461A76905q726K78051j29987J24337j31347
14873C09233O9305D7883J59510K22284p5428N2421j74526I5675P4872l742L5949
$$ plain form
14948 152103 408066 146166 314334 142101 307129 309381 599832 205227 317758 139401
14937 247164 405515 146883 528187 176027 236301 198104 171430 227017 157755 231402 303904
14926 303904 237268 256239 222935 103693 7681 407982 67203 115011 396041 115214 78726
14915 78726 204796 420688 229067 422647 276785 351453 225857 486103 151289 208491
14905 208491 378707 226281 386722 389501 187168 143342 618906 307025 266309 43868
14894 332731 270273 319935 163293 482919 366948 207524 299680 341107 402299 182377
14883 303922 378739 331393 213054 515515 176905 168179 446230 316243 440580 309233
14873 309233 378538 47883 207393 429677 354249 406670 232144 95675 170547 166805 202754
14862B02754K28820O1953A02290R2721O4918K2630N1805J08559k9189j99315J98662
14851D13081q1756K16056J42544j10906j87301R3217K22042K7852j44244k50523
14841C40062l7617N86933l72696A65470L45288l3729j57186J6820J57813m4979
14831D49497n515j38985j32807M69202l01699J82283K09813k76566O028k2400
14821D38851J9551l7363K4698L0010J03229k65616K49470K03718k21543j5590
14811E29415j50604K83370A86181L13403j40235L4452o4317j17514L36048K94450
14801H42468k61197j47532N2701j35683L5185N2640R4736j54001J27795j91232
14791C15880n5648J48972j16097J02682L75248l70539K83123k32285o4056L16290
$$ plain form
14862 202754 431574 493527 102290 195011 259929 282559 334364 442923 413734 214419 413081
14851 413081 331325 547381 689925 579019 391718 484935 706977 734829 590585 340062
14841 340062 302445 889378 516682 165470 510758 477029 319843 336663 494476 449497
14831 449497 443982 304997 172190 641392 339693 521976 731789 455223 461251 438851
14821 438851 458402 421039 445737 475747 578976 313360 562830 766548 545005 529415
14811 529415 378811 662181 186181 499584 359349 393801 329484 211970 548018 842468
14801 842468 581271 433739 486440 350757 385942 438582 533318 379317 507112 315880
14791 315880 260232 409204 293107 395789 771037 400498 683621 451336 387280 703570
14781G03570P7404k39156j5101J98167j46610M093l7805K849J21157k16230K66656
14770G18994B84115M09482r3155r2700J46908l09401K90267J73328k22811K973
14760E89006K589k0571k65453L29137q8807J14101C07891M55822k90282L43824
14750H17255O7034r5116j61686m1190L00635j81326P0820C52553L7163M01461
14740G91177l1604j63310J80585J08619m15174J54302j32081L50943k77572J05965
14730F71850J83959j05520l17304m4614M51135r324l73127r188K23680L35171
14720A006718j80694j40553p7074P9780N8022K26446j03822m25410L81600K4576
14710H49589n2248j33639j04396J49868p7474K05806J03654j57562J30361j57642
$$ plain form
14781 703570 780974 541818 526717 724884 578274 582367 544562 547411 668568 452338 718994
14770 718994 284115 693597 600442 507742 654650 345249 635516 808844 586033 589006
14760 589006 591595 571024 305571 634708 545901 660002 307891 763713 473431 817255
14750 817255 884289 789173 627487 586297 886932 705606 776426 352553 389716 791177
14740 791177 759573 596263 776848 885467 470293 624595 492514 843457 565885 671850
14730 671850 855809 750289 432985 388371 839506 830182 457055 447867 671547 1006718
14720 1006718 826024 685471 608397 688177 746199 972645 868823 443413 825013 849589
14710 849589 797341 663702 559306 709174 631700 837506 941160 783598 913959 756317
14700G56317J35188k58702J36353O8387j28432M50835m01551j84640R0863L18758
14690I83376k59694O78861l79684J32546j33319k7170k36610j95142K13420J55592
14680I32176N8095P7879L607j45180j00949K24036j15190K18404K919o7775O9440
14669A157462l35565M56347m06956J80890r61L9320J45175j53752m67996M93220
14659A107184p7772k508N6612N4874M5282k36399L15530k09354J37750j10756
14649A080443M1260L25798l90026J39672n17156M51050o1972P8162K94946k2097
14639A420080o0259j39526k26197k1035K49095M46788H10128M38020j71058J24988
14629A202078j42275r9783M53345J11234k08648N6066J04076j29899J54828k03220
$$ plain form
14700 756317 891505 632803 769156 837543 709111 1159946 758395 573755 664618 983376
14690 983376 723682 1402543 1022859 1155405 1022086 994916 758306 563164 776584 932176
14680 932176 990271 1068150 1071757 926577 825628 1049664 934474 1152878 1155797 1088022 1157462
14669 1157462 821897 1278244 871288 1052178 1051217 1090537 1235712 1081960 613964 1107184
14659 1107184 1029412 1026904 1083516 1138390 1183672 947273 1262803 1053449 1191199 1080443
14649 1080443 1121703 1447501 1057475 1197147 679991 1131041 1069069 1147231 1442177 1420080
14639 1420080 1359821 1220295 994098 973063 1222158 1668946 810128 1248148 1077090 1202078
14629 1202078 1059803 960020 1413365 1524599 1315951 1372017 1476093 1346194 1501022 1297802
14619A297802Q0132j48819J7819J50139J19490Q1720k13245j14369K31631j901
14609A500399J43629o7722k18379k09726L65843K23664j91103L73470l35275J0710
14599A595510k46278L49370O794J46511k89272N6307L851K7042M5526L4871l2157
14588A698075J79847j86335L13330l35502R6912j07391J92266k5733K34080l53987
14578A705562O54944k76941j89929Q9531K28325q1072p6248O7471R2198k8867
14568B184974j90131M71859m5779k67062M08197l66667L55487n1536K36486M7104
14558B782932L19141p2137J36652r5620M86117J1334K64270P47839R29402J418974
14548F928904L662505O847867J4636981J5021839k3160816A0314458D884843j958161
$$ plain form
14619 1297802 1377934 1229115 1246934 1397073 1516563 1598283 1385038 1270669 1502300 1500399
14609 1500399 1644028 1576306 1357927 1148201 1514044 1737708 1546605 1920075 1584800 1595510
14599 1595510 1349232 1698602 1705396 1851907 1562635 1618942 1622793 1649835 1695361 1730232 1698075
14588 1698075 1877922 1691587 2004917 1669415 1766327 1658936 1851202 1825469 2059549 1705562
14578 1705562 2360506 2083565 1893636 1983167 2211492 2130420 2054172 2121643 2213841 2184974
14568 2184974 1994843 2466702 2420923 2153861 2562058 2195391 2550878 2499342 2735828 2782932
14558 2782932 3102073 3029936 3166588 3070968 3557085 3568419 3832689 4580528 5509930 6928904
14548 6928904 10591409 17439276 32076257 47098096 23937280 10314458 4884843 2926682
14540B926682m51001j42669m76133K67325o6650m84896M12580j20799M88828j61977
14530B191290j48173j73413M97158o2491j93858K24308J93850k78798K62099m36714
14520B075258N13740m8278k88621R5110M3535J32528P0244M17087n73901K89320
14510B726022j36902O3488M4564L68027l11997J50247l40997r1089L99269K40765
14500C111397K74273k48076K00894l09502J89452R2546k99421M37029L36347m09530
14490C375409J06557k14297J00400r83L21243L839m21557L13671L99274l87953
14480C595603k91523N30812K9563N7716P1033j61266J81607r265K07289K01686
14470D413255k02267L8770k09142M41446l02487K06693L23086j86283P8369k20795
$$ plain form
14540 2926682 2475681 2333012 1856879 2124204 2057554 1572658 1985238 1864439 2353267 2191290
14530 2191290 2043117 1869704 2366862 2304371 2110513 2334821 2528671 2249873 2511972 2075258
14520 2075258 2588998 2540720 2252099 2347209 2390744 2523272 2593516 3010603 2436702 2726022
14510 2726022 2589120 2652608 2697172 3065199 2753202 2903449 2562452 2471363 2870632 3111397
14500 3111397 3385670 3137594 3338488 3028986 3218438 3310984 3011563 3448592 3784939 3375409
14490 3375409 3481966 3267669 3368069 3367086 3688329 3692168 3270611 3584282 3983556 3595603
14480 3595603 3304080 3834892 3864455 3922171 3993204 3831938 4013545 4004280 4211569 4413255
14470 4413255 4210988 4249758 4040616 4482062 4179575 4386268 4709354 4523071 4601440 4380645
14460D380645q3131M88268k58746J87814M67802j12965P9892K87900k89466K34809
14450E382822j6874k1946Q2019J24339K26570J8996k85620J99048q0691J95739
14440E824402J83146k5253q0728K55114r8259M39396j76305K63879j37704N02354
14430F950042k38525j02642M74901j54112K12776r0980K43911K52466l52930K73980
14420G468887Q3727L50806M48957j06011K15801J88313l92809o7210K77596O7162
14410H535219L33831N540M00568k51857J28751K10349M73633k3244L46272k22725
14400I936337M88591l5919J82963K0915M71063L8806K50067O5305M68029L08178
14390A2194335j70233L31731K66156K42359L29176J19527L07628N25109k85876
$$ plain form
14460 4380645 4297514 4785782 4527036 4714850 5182652 5069687 5149579 5437479 5148013 5382822
14450 5382822 5365948 5344002 5426021 5550360 5776930 5795926 5510306 5709354 5628663 5824402
14440 5824402 6007548 5982295 5901567 6156681 6058422 6497818 6321513 6585392 6447688 6950042
14430 6950042 6711517 6608875 7083776 6929664 7142440 7051460 7295371 7547837 7194907 7468887
14420 7468887 7552614 7903420 8352377 8246366 8462167 8650480 8257671 8190461 8468057 8535219
14410 8535219 8869050 8874590 9275158 9023301 9152052 9362401 9836034 9812790 10159062 9936337
14400 9936337 10424928 10389009 10571972 10592887 11063950 11102756 11352823 11418128 11886157 12194335
14390 12194335 12024102 12355833 12621989 12864348 13193524 13313051 13620679 14145788 13859912
14381A3859912M08595N80786N1402L31879Q4601L29614K91218N68447M33054L54943
14371A7294451k9859N33625N66170J99561j5248N73586K06896O07056L80529K83044
14361B0599811L21149P52741L36258P51323L83903N44393M51286O90630O32269
14352B5463763P21740Q21805L27516M86352M26974Q58037O80609R87789Q00186
14343C1574771R75703P27205N03472J181385Q76913J237371J094890Q49095J019128
14334D0039933J139049J166563J088194J534531J132432J690511J648646J076459
14326E0516318J866711J638505J751780K169512J589424K421039K079747K351093
14318F6384129K261558K583024K552242K904587K817816K993711L279789L236465
$$ plain form
14381 13859912 14268507 14849293 14900695 15232574 15317175 15646789 15938007 16506454 16939508 17294451
14371 17294451 17264592 17798217 18364387 18563948 18548700 19122286 19329182 19936238 20316767 20599811
14361 20599811 20920960 21673701 22009959 22761282 23145185 23689578 24140864 24831494 25463763
14352 25463763 26185503 27007308 27334824 27821176 28248150 29106187 29786796 30774585 31574771
14343 31574771 32550474 33277679 33781151 34962536 35839449 37076820 38171710 39020805 40039933
14334 40039933 41178982 42345545 43433739 44968270 46100702 47791213 49439859 50516318
14326 50516318 52383029 54021534 55773314 57942826 59532250 61953289 64033036 66384129
14318 66384129 68645687 71228711 73780953 76685540 79503356 82497067 85776856 89013321
14310H9013321L809342L588357M270108M013261M688593M860536M686127N330245
14302A24259890N322885N558362O141095O700270O890581P123088P784996Q266116
14294A78047283Q517518Q918715R573981R587013J0593374J0803458J1282249
14287B47323591J1891805J2263911J2544253J3021885J2950496J3322804J3183084
14280C36501829J3330542J3030561J2562366J1935219J1424845R804147Q841406
14273D17430915N642487K324893N40488P87355K002019k946973k629558m291069
14265D18860557o823175q640381j0789648j1591510j2762962j3535305j3844212
14258C40873364j4274321j4078262j4220178j3338049j3088862j2593540j2693038
$$ plain form
14310 89013321 92822663 96411020 100681128 104694389 109382982 114243518 118929645 124259890
14302 124259890 129582775 135141137 141282232 147982502 154873083 161996171 169781167 178047283
14294 178047283 186564801 195483516 205057497 214644510 225237884 236041342 247323591
14287 247323591 259215396 271479307 284023560 297045445 309995941 323318745 336501829
14280 336501829 349832371 362862932 375425298 387360517 398785362 408589509 417430915
14273 417430915 423073402 425398295 425938783 426726138 428728157 425781184 423151626 418860557
14265 418860557 412037382 403397001 392607353 381015843 368252881 354717576 340873364
14258 340873364 326599043 312520781 298300603 284962554 271873692 259280152 246587114
14251B46587114j1893075j1237398j1101641j0085263r863969r131219q917080
14244A74357469q013093p716887p216762p266006o455848n985780n631571n609552
14236A20461970n087714n020660m792116m010649m361144l367452l942550l392369
14228H6487316l394489l410092l008375k409272k958874k522695j887903l045483
14220F3850133j551165k438653j846432j931395j855661j633480j583159j336192
14212D9673996j556928j804532j280987j540381j178381l38078j135016j615623
14204C9224070r46730j563372p90444o98149p26855r19201j174187n99991q84307
14195C0920834q19581q34240m22677r37659p84832n35159q00435n63380m68854
$$ plain form
14251 246587114 234694039 223456641 212355000 202269737 192405768 183274549 174357469
14244 174357469 166344376 158627489 151410727 144144721 137688873 131703093 126071522 120461970
14236 120461970 115374256 110353596 105561480 101550831 97189687 93822235 89879685 86487316
14228 86487316 83092827 79682735 76674360 74265088 71306214 68783519 66895616 63850133
14220 63850133 62298968 59860315 58013883 56082488 54226827 52593347 51010188 49673996
14212 49673996 48117068 46312536 45031549 43491168 42312787 41974709 40839693 39224070
14204 39224070 38277340 36713968 35923524 35225375 34498520 33579319 32405132 31805141 30920834
14195 30920834 30101253 29267013 28844336 27906677 27121845 26586686 25786251 25222871 24754017
14186B4754017l77156r82413o73956l61729m51876j73412p33535m78832m36218
14177B0084890m62592j97538l02697o65216l63509k30508l98213j09847l75463
14168A6979307p17598j56987l00101J9987m63275p278n53886j28185m40285N3255
14158A4284954n99485k69077r6990l5766k68242p6737o41380J19860n31628J27196
14148A2012705m85386r5954J25506k93956r0952k79842k61463l4092p705k71531
14138A0317330m87392M43779k82595k59079J64116l82101k82795N400l28875o3770
14128H844018l4190J12382l40969j6100k28822j92485m3303k7505j22773l72870
14118G577383J01083k57975M1624K4742m18009N4326J32781j00450m2832k53408
$$ plain form
14186 24754017 24376861 23394448 22720492 22358763 21906887 21733475 20999940 20521108 20084890
14177 20084890 19622298 19424760 19122063 18456847 18093338 17862830 17464617 17354770 16979307
14168 16979307 16261709 16104722 15804621 15824608 15361333 15354055 14800169 14671984 14231699 14284954
14158 14284954 13685469 13416392 13319402 13283636 13015394 12938657 12297277 12417137 11885509 12012705
14148 12012705 11527319 11431365 11556871 11262915 11171963 10892121 10630658 10596566 10588861 10317330
14138 10317330 9829938 10273717 9991122 9732043 9896159 9514058 9231263 9236663 8907788 8844018
14128 8844018 8809828 8922210 8581241 8565141 8336319 8143834 8100531 8073026 7950253 7577383
14118 7577383 7678466 7420491 7462115 7486857 7068848 7123174 7255955 7155505 7112673 6859265
14108F859265j32652j77245j17131n0430L06900l41491J46790k30449j63633N4523
14098F154447j30127k02908n26J23029K3043j11848l09601n1020O4793j15044
14088E444238k7077k02898M45665m21762l10567K45177j81384n4032k4868l1537
14078D880955j53261q4915R0184p3878J81410m63005m2042R7617r3717K0028j84546
14067D174830P6592p3862J1434j20120k8232k13996L83130j63555M8398k33761
14057C860858j24612j39480J07462R2172o6229p9745q1206M5035N4200l77951
14047C290504q457K39512k23648J61229K4585m34503L04647k95628j25150J32996
14037C066087o6348J47606N00582n84197j54169J76936o3190J25120j65321Q0030
$$ plain form
14108 6859265 6726613 6549368 6432237 6381807 6688707 6347216 6494006 6263557 6099924 6154447
14098 6154447 6024320 5821412 5820886 5943915 5966958 5855110 5545509 5494489 5559282 5444238
14088 5444238 5417161 5214263 5659928 5238166 4927599 5172776 4991392 4937360 4912492 4880955
14078 4880955 4727694 4642779 4732963 4659085 4840495 4377490 4335448 4433065 4339348 4359376 4174830
14067 4174830 4251422 4177560 4188994 4068874 4040642 3826646 4209776 4046221 4094619 3860858
14057 3860858 3736246 3596766 3704228 3796400 3730171 3650426 3569220 3614255 3668455 3290504
14047 3290504 3282047 3521559 3297911 3459140 3483725 3049222 3353869 3058241 2933091 3066087
14037 3066087 2999739 3147345 3647927 3063730 2909561 3086497 3023307 3148427 2983106 3063136
14027C063136j5055l5234j64293l15684M73406Q1899n59877p8446L00738o4558
14017B686032J15472l64910J70829k8583J69667j80751q3850m1992j86183K1753
14007B277484K89015R648l42381M129o4766q5276K39047l28951L42810m90403
13997A850356M56695j93625j36918p0551K49381j86708P1070M47463J052500K229937
13987E769600N483887J3763288K1792838j8649317j3675698n798835k549232j055905
13979E080626r67021n61709Q3239o47836j7745P0932k89441m3262l17741J37870
13969B527912k35709O8845j96939o6132L57847k59830q3341J15293o9672k86554
13959A871720K63520k57249J59622M3502L7383r0029p5345l95692K98031n9245
$$ plain form
14027 3063136 3048081 3012847 2848554 2532870 3006276 3088175 2528298 2449852 2750590 2686032
14017 2686032 2801504 2436594 2607423 2578840 2748507 2567756 2483906 2441914 2255731 2277484
14007 2277484 2566499 2576147 2233766 2237895 2173129 2087853 2326900 1997949 2340759 1850356
13997 1850356 2307051 2113426 1976508 1905957 2155338 1968630 2039700 2487163 3539663 5769600
13987 5769600 11253487 25016775 46809613 28160296 14484598 8685763 6136531 5080626
13979 5080626 4113605 3551896 3635135 2987299 2969554 3040486 2751045 2707783 2390042 2527912
13969 2527912 2292203 2361048 2164109 2097977 2455824 2195994 2112653 2227946 2158274 1871720
13959 1871720 2135240 1877991 2037613 2081115 2118498 2028469 1953124 1557432 1855463 1796218
13949A796218k00276L93347n2892k23080J68521j14786L310j0591k4360l21015
13939A414396J42838M96191j71064l58876L75745j23501n7289Q5448M0606p8331
13929A766163K7977k68007j01200J03068K64993j18395j53808r7698J12913N8329
13919A594335J050k36388R0615p1428K17554m0808J45588l11901m0060J82479
13909A531036K84728l71693K1194K69049j03872l93566j92514J28222k25520O65158
13899A612222k25506j80086J64186j32400j65374L452m1234L95125l57892L00393
13889A372886l0876k35008j82254M13137Q7243k87778j06720J62092k47186J8468
13879I64004P7884M9494L30574m31396R1964N11404n21800J14686j60847K57022
$$ plain form
13949 1796218 1595942 1989289 1936397 1713317 1881838 1767052 1770362 1759771 1735411 1414396
13939 1414396 1557234 2053425 1882361 1523485 1899230 1775729 1718440 1803888 1844494 1766163
13929 1766163 1794140 1526133 1424933 1528001 1792994 1674599 1520791 1423093 1536006 1594335
13919 1594335 1595385 1358997 1449612 1378184 1595738 1554930 1700518 1388617 1348557 1531036
13909 1531036 1815764 1444071 1465265 1734314 1630442 1236876 1044362 1172584 947064 1612222
13899 1612222 1386716 1206630 1370816 1238416 1073042 1076494 1035260 1430385 1072493 1372886
13889 1372886 1342010 1107002 924748 1337885 1425128 1137350 1030630 1192722 945536 964004
13879 964004 1041888 1091382 1421956 990560 1082524 1593928 1072128 1186814 1025967 1282989
13869A282989j38910j68603M7587k9699r2902K86556k29767L00123J80576m83689
13859I54261J59440j48938L12192N4298m81871J81192p3672K05629l33726N74025
13849A402830n11255L65209j78636j03347J5924o3653J06560q8410M8832K11601
13839A205655J10263k26684j97549p7476L98309k07813R3941k31129R0620l3453
13829I24684l6724J12636R5704m71376L66360p6507l23142N8804K07369K47507
13819A105315k94958o8365N9415k23046L84937O9405J55642l65092l8291m3125
13809G41837M6958J30252K70329j31619k30145k1376l0205J81400R0771m03292
13799F44910o6515l8675K13895R6785r4167o3073R501j20385J15581L12745j28301
$$ plain form
13869 1282989 1144079 975476 1023063 993364 900462 1187018 957251 1257374 1437950 954261
13859 954261 1113701 964763 1276955 1331253 849382 1030574 956902 1162531 828805 1402830
13849 1402830 891575 1256784 1078148 974801 990725 927072 1033632 945222 994054 1205655
13839 1205655 1315918 1089234 891685 814209 1212518 1004705 1098646 867517 958137 924684
13829 924684 887960 1000596 1096300 624924 991284 914777 591635 650439 857808 1105315
13819 1105315 810357 741992 801407 578361 963298 1032703 1188345 823253 784962 741837
13809 741837 788795 919047 1189376 1057757 827612 806236 776031 957431 1048202 644910
13799 644910 578395 539720 753615 850400 756233 693160 702661 582276 697857 1010602 882301
13788H82301k65765Q1719J41786r9621R4109J04545l9283l56379K66677K11389
13778A021478k88065j42762J45318J02825L7667k26332O6918r7400k5631J70637
13768G64653N286O8520l94214M52824k52208P5554K22253D24371L14768M4105
13758G83244p5712N9358j83894k5057J78125J4283Q7415j76917o4570j00514Q9299
13747E85060n0315N7193K03907j45333j07686L29937l41856N4837M0806Q803n3222
13736E82131M1137k1904j55423K85114o4641q1741K5863k16201m0693J99637l6783
13725E16496p3040K13638l925q2873L83161k96968L0951p3980M1117o8662J02684
13714F88599L1116r6031K1993k14539J88483j12865j2106J14379Q2057j46875
$$ plain form
13788 882301 616536 698255 840041 740420 834529 939074 899791 543412 810089 1021478
13778 1021478 733413 590651 735969 838794 876461 650129 717047 619647 594016 764653
13768 764653 769939 838459 444245 897069 644861 720415 942668 424371 739139 783244
13758 783244 707532 766890 582996 557939 736064 750347 837762 660845 596275 495761 585060
13747 585060 534745 591938 795845 650512 542826 872763 530907 585744 626550 635353 582131
13736 582131 623268 601364 445941 731055 666414 584673 610536 394335 353642 553279 516496
13725 516496 443456 657094 653169 570296 953457 656489 687440 613460 654577 585915 688599
13714 688599 719715 623684 645677 431138 619621 506756 494650 609029 691086 544211
13704E44211q8142K33430C36000N00348l51264J11659B59684J33750J14749n6149
13694D52034J248j4822j22599Q3425j08961K85116J21099j68675A06919N23384
13684F30303A72441K38376O5050J60557A55704J20627K85640j90214r4243J11417
13674C88931J97455j31621j20578j00029M969r4562N70842J25550l86981n7052
13664C96924Q5844J87148k85782o430L9565R993K24370j5086j10992B35389L58406
13653E93795j68530q7390a15253C75449J00764N3869p7731J60679A12379N82677
13643F95056k47504J13661O0775o9912B74160J7181M59486C03016A12580j1485
13633A01095J03774K74652P7876j7831G6565M15383A8562K10926J38269K02715
$$ plain form
13704 544211 456069 689499 336000 836348 485084 596743 259684 393434 508183 452034
13694 452034 453282 438460 315861 399286 290325 575441 696540 527865 106919 630303
13684 630303 172441 410817 475867 636424 155704 276331 561971 371757 277514 388931
13674 388931 586386 454765 334187 234158 239127 144565 715407 840957 453976 396924
13664 396924 482768 669916 384134 377704 417269 427262 651632 636546 525554 235389 593795
13653 593795 425265 337875 -115253 375449 476213 530082 452351 613030 112379 695056
13643 695056 447552 561213 621988 552076 274160 291341 750827 303016 112580 101095
13633 101095 204869 479521 557397 539566 76565 491948 18562 229488 367757 570472
13623E70472Q5972A51128J37886K56478d2289F79984j35333j76350D5827L75388
13613D21215J06317B26962K71566A98300L21268o7248k4630j01811k0763j05038
13603B00078K36447j49808L48322j71312j18869j2076Q1955A2540J05955K41581
13593C60076A48818j4033K66684q607J00058k22392N10065k94819p709q1976J40899
13582E36988K3092B00291R4422O3379A5560K00464n1524L86571A90362K1555J20876
13571C32793j42773L43912k47359M12634k19479A71680N61253l02417K9582A09400
13560B27001n0093K14406r0631j08069K5847J30506m2864K28827R6145k11340
13550D19735J25024A86465g1565I4456M04096M8295k23611n7162M55559C21208
$$ plain form
13623 570472 656444 151128 289014 545492 -42289 679984 544651 368301 45827 421215
13613 421215 527532 226962 498528 198300 519568 452320 427690 325879 305116 200078
13603 200078 436525 286717 635039 463727 344858 332782 414737 12540 118495 360076
13593 360076 148818 134785 401469 392862 492920 270528 780593 485774 478065 396089 536988
13582 536988 560080 200291 294713 358092 15560 216024 164500 551071 190362 211917 332793
13571 332793 190020 533932 286573 699207 479728 171680 732933 430516 460098 109400
13560 227001 176908 391314 300683 192614 218461 348967 306103 534930 631075 419735
13550 419735 544759 186465 -71565 94456 498552 546847 323236 266074 721633 321208
13539B38777o7540J56785H6733J46574J13567J86254B43611b9629C29357K7024
13529C56381M3674j58187J79381J03204k59746K51853A48791J86847j43976p7662
13519A14000R4477A01051a8549A03617Q8171J51251J30486K8601A04084K73578
13509C77662Q6335H0516Q3235O9664D0863L52907j47603j1108P2150J05608j54103
13498B58714N6220a82872D16611E1770L90453B09535q2949J85696o9625O3489
13488C06146Q7454j64258O6676j19232M11351H4589J3021a567C35326n9852j06253
13477A69221n5888K97868j30882D8123R5455r698R8985J27839j62150K24324j74044
13466B48834J8563J06071A10670L01524j67655L18262D6547K82331O9710j52796
$$ plain form
13539 238777 171237 328022 86733 233307 346874 533128 243611 -29629 329357 356381
13529 356381 400055 241868 421249 524453 264707 516560 148791 335638 191662 114000
13519 114000 208477 101051 -18549 103617 191788 343039 473525 502126 104084 377662
13509 377662 463997 80516 163751 233415 40863 393770 246167 235059 307209 412817 258714
13498 258714 314934 -182872 416611 51770 442223 209535 126586 312282 242657 306146
13488 306146 393600 229342 296018 176786 588137 84589 97610 -1567 335326 275474 169221
13477 169221 113333 411201 280319 48123 143578 133880 232865 360704 198554 422878 248834
13466 248834 267397 373468 110670 412194 244539 562801 46547 328878 398588 245792
13456B45792m1341J0856K03939q0058A07063J76554l3151J94649j91265b6281
13445C12591j03510J8004r5460J09814K21698A28745K91406B09319q7442N2615
13435A74492J34089m9316i0975A82997J8073J12171A44997K60436A05673R3446
13425A99119r4650K41014A4657K38903a8188B65014F672L2996L1915L11116n0271
13414C32428A19943J02145O6061J6638O7416A47823a29071D95018e5229D86024
13403D265M43266h0845c8055n3836n71A57147M0236K06277j94144I3543J41723
13392B35266D7786b28768A52882b09155B63457Q1579L44015h3090j39569B46395
13381C46042j58548r2537L51348o9432I893L51982b87993D30609A10056O477K05078
$$ plain form
13456 245792 204451 215307 419246 339188 107063 283617 250466 445115 253850 -26281
13445 312591 209081 227085 131625 241439 463137 128745 420151 209319 121877 174492
13435 174492 308581 259265 -90975 182997 201070 313241 144997 405433 105673 199119
13425 199119 104469 345483 14657 253560 -18188 265014 6672 39668 71583 382699 332428
13414 332428 119943 222088 288149 304787 372203 147823 -129071 495018 -55229 486024
13403 4265 447531 -80845 -38055 -91891 -92462 157147 197383 403660 209516 93543 235266
13392 235266 47786 -228768 152882 -209155 263457 345036 689051 -83090 -222659 246395
13381 346042 187494 94957 446305 376873 9893 361875 -287993 430609 110056 116533 321611
13370C21611J76682k38931J77643A09195k3656J56363r2786c9474B98862r5703
13360B03159L916I8100J42841F1152K94411A59986K33562k5982P7632A09979K086
13349A12065K38702K64667k95725G6788K68076D5600K01620m3475M9692M42797
13339F96234C35990m0136N1257N7588C5108K11377J31568D0868L07484b7768G7717
13327G778L50655B7173L81574K17259d470C39049j32643o8419L21664a06210o1262
13316a67472A43549K0019K04738j82440f0192D62546j8461A25351L8326K23256
13306C86933b3140l1647q484G1911P0013l6342J39926L26018B40186F9171J63823
13295B32994E7923J4633a75495q2540A08036h1035B43982F0860J29216a07940
$$ plain form
13370 321611 498293 259362 437005 109195 85539 241902 149116 -39474 298862 203159
13360 203159 207075 98100 240941 61152 355563 159986 393548 367566 445198 109979 112065
13349 112065 350767 615434 319709 76788 344864 45600 247220 203745 253437 696234
13339 696234 335990 295854 347111 404699 35108 246485 378053 40868 348352 -27768 77717
13327 7778 358433 27173 408747 626006 -4470 339049 206406 137987 459651 -106210 -167472
13316 -167472 143549 163568 368306 185866 -60192 462546 444085 125351 163677 386933
13306 386933 -23140 -54787 -63271 71911 141924 105582 245508 571526 240186 69171 232994
13295 232994 57923 72556 -175495 -258035 108036 -81035 243982 60860 190076 -107940
13284G63510E9793M4114L82172B3994N18601A56204n1751K169B0337P0394J19093
13273B09824c26905d7783A50436a53347B48389h8953h305B04398a27725j5212
13263a42937G1101k2941J70709A3509a32201b3106q3725O214d474B615N8921e9812
13250b9445C36601d8419D91289A85717K3673f7447B26047r4601a59997D71054
13239B07316J52075K3634E1648h3037D69992j14915h2834A31621j8434J48069
13229B61256g7509I100J41654O7144q0631m8729J93237j0307F8712J01033D0369
13217H606J77838q1826O0005f2379J1893A17655P6998J6447C581a58594N1506
13206a07088K2525c1467B95117A42459q184n5904K07883a3036F5815f4478C4925
$$ plain form
13284 763510 59793 103907 486079 23994 542595 156204 104453 106622 20337 90731 209824
13273 209824 -326905 -47783 150436 -153347 248389 -88953 -8305 204398 -127725 -142937
13263 -142937 71101 48160 218869 13509 -132201 -23106 -106831 -100617 -4474 2615 61536 -59812
13250 -29445 336601 -48419 491289 185717 209390 -67447 226047 131446 -159997 471054
13239 207316 359391 383025 51648 -83037 469992 355077 -82834 131621 113187 261256
13229 261256 -77509 9100 150754 217898 137267 88538 281775 271468 68712 169745 40369
13217 8606 186444 104618 164623 -62379 -50486 117655 194653 211100 3581 -158594 -107088
13206 -107088 -84563 -31467 295117 142459 134275 78371 286254 -13036 65815 -64478 34925
13194h7685A88496K02551a56436C44035j33009E3408K45789R0309A58116G6625
13183B73920B8570r043L22373A17929J36279m6440p4463O0440b55203F1804B4669
13171B50983l1705C7531L70374G2044J02710a17440H6884N0273a24473F9406K42970
13160C12376A40885J93012B084L8181h1478A85821Q4642C6181P6336e6294B63828
13148B99307G6589j0926O1218J02760K25840A95533h6523C20949b0998j60755
13138a81753C01462c4404F9795J28739b35043A86549c27162e2609A34768E2095
13127D9564N41502B05529H4118p407b29103C49313n1458j20688P1418a66221A35302
13115C3188K02382c4336C925a69623A48738n3693m4292j0833P3226C72K09425
$$ plain form
13194 -87685 188496 391047 -156436 344035 211026 53408 299197 389506 158116 76625
13183 273920 28570 19527 341900 117929 254208 207768 133305 193745 -255203 61804 24669
13171 250983 219278 37531 407905 72044 174754 -117440 86884 137157 -124473 69406 312376
13160 312376 140885 333897 2084 40265 -81478 185821 270463 36181 112517 -56294 263828
13148 299307 76589 65663 126881 229641 455481 195533 -86523 320949 -20998 -181753
13138 -181753 301462 -34404 69795 198534 -235043 186549 -327162 -52609 134768 52095
13127 49564 591066 205529 84118 76711 -229103 349313 297855 177167 248585 -166221 135302
13115 33188 235570 -34336 3925 -169623 148738 95045 50753 39920 113146 372 209797
13104B09797F1863A5210a92913e1964j47840h1822k0699E2863a65244B3590k556
13093B1034N409Q3978i5221A15985K9189b64497B72508A35070m2680K06539A1545
13081A47249K03928A42328K55361a94489f1282D25829b49212o3324l8715A85018
13070B68264l7863C2697R3013J57824O2613a53683G2134M3010b9106m861A29194
13058E30784k54843q7463k5550b39748A29903H204a51349M2672A57277L0858E5646
13046C91863m1436c8743o2127B27743N17139A33328b92674G1145b6622I3364P0070
13035A63434p2767J52841C9317P398N8926g2071B8257K0242J36591p5349O3122
13024A72863i4218A50649p0447l8334J38745F1340M4963Q7366l674f8242A12359
$$ plain form
13104 209797 61863 15210 -192913 -51964 -199804 -81822 -102521 52863 -165244 23590 21034
13093 21034 26443 110421 -95221 115985 145174 -264497 272508 135070 92390 298929 11545
13081 147249 351177 142328 397689 -194489 -61282 425829 -249212 -312536 -351251 185018
13070 268264 230401 32697 125710 283534 346147 -153683 72134 115144 -29106 -33967 129194
13058 530784 275941 188478 162928 -239748 129903 8204 -151349 -108677 157277 188135 55646
13046 391863 350427 -38743 -100870 227743 744882 133328 -292674 71145 -26622 93364 163434
13035 163434 90667 243508 39317 46715 105641 -72071 28257 48499 185090 109741 172863
13024 172863 -94218 150649 80202 41868 180613 61340 106303 193669 189995 -68242 112359
13012D6404K34318F5029d942j21810e6550r1877A15878J87426r7055A01999Q3394
13001A85393K06410d2610A13823D2931J63729n0041a00150j3581A97006b87895
12990A42032a4058A4426c38645A26429J62037b43945f1257A06808e3243C505M6998
12979E0503L61411A32084a87736B7449j0046a9986m0379F7586a02379C27202A49499
12967A05005b5878B00188R034I0475K22181b26159F3183O3130j6159J89837A1712
12955a70078B70396b35565H0603i1247k94196a42485a8083B43800A7532l177J62447
12944A76802C3259M1133L6890k6492c00118a18596B60533A5305J82536G7301a34708
12932a07276A02878k5149J56883G0685i8746m7906q9056f261p742k72021C00963
$$ plain form
13012 46404 280722 65029 -4942 -126752 -56550 -148427 115878 303304 206249 101999 185393
13001 185393 391803 -42610 113823 42931 206660 156619 -100150 -113731 197006 -287895
12990 142032 -14058 14426 -338645 126429 288466 -243945 -61257 106808 -53243 3505 50503
12979 50503 411914 132084 -187736 27449 17403 -19986 -60365 67586 -102379 327202 149499
12967 105005 -25878 200188 209222 90475 312656 -226159 63183 126313 110154 299991 11712
12955 -170078 270396 -235565 80603 -91247 -385443 -142485 -18083 243800 17532 14355 176802
12944 176802 33259 74392 111282 84790 -300118 -118596 260533 15305 197841 77301 -134708
12932 -107276 102878 77729 234612 70685 -98746 -146652 -235708 -6261 -14003 -286024 300963
12920f9929B53942P6344C4760M34978i4398l969A2976g0467C2130O118a58932
12908B17377c0894C51791l6809f729m37686A09332b3818E4569J91945C0301a50399
12896b2492E1709d3448C4472h3921k51158E6313J13857a45076A77579C2278a23679
12884B90558f7366B47989A0592d5895k91873A30022a28692H8917a16611c2449
12873A63020G6191a81309B07899e2738a1166C41201A65157l8733a66326C51160
12862B50613R0857a98259A66692J35988j25428e2820B48065c69797M4550B36885
12851e9197k20049A51262J8133e6911q6006F0559J56776e0686B75717j30021J20175
12840B65871A1906b35237a4753A21712J01549e6017F11043a2774k95471A80201
$$ plain form
12920 -69929 253942 330286 34760 469738 -94398 -98367 12976 -70467 32130 38248 -158932
12908 217377 -30894 351791 314982 -6729 -444415 109332 -23818 54569 246514 30301 -150399
12896 -22492 51709 -43448 34472 -83921 -335079 56313 170170 -145076 177579 32278 -123679
12884 290558 -67366 247989 10592 -45895 -337768 130022 -128692 88917 -116611 -32449
12873 163020 76191 -181309 207899 -52738 -11166 341201 165157 126424 -166326 351160
12862 250613 341470 -198259 166692 302680 177252 -52820 248065 -369797 -325247 236885
12851 -59197 -279246 151262 169395 -56911 -142917 60559 217335 -50686 275717 145696 265871
12840 265871 11906 -235237 -14753 121712 223261 -56017 611043 -12774 -308245 180201
12829i66j0190p9020j7889B92331A6158J49921f7958b6499A80936J38990C1019
12817a0092l097k45319D9671r968a07772k1631B4892J72220A233Q379L20596j50097
12805A80111f6705A05129Q2141O1444d1084p4550l39468a10549J6639j14425a3988
12793C9959a1642q9666I8733d5955A97306a90491A33988J97113A43998b29645
12782B09275f6838j21145R2382L0778A34572K7446c62215a47489D5188N5013c43093
12770a6485A98836H9006K5153g4472Q925E3455J75074I4326a19806B66028G856
12758e9610q4110A99910K03882H0669R0869a8105L323K3k66971A30352b5859k88949
12746c14808A25831D6777a35570A73239B113K43368G1059J92995I21J26340K69590
$$ plain form
12829 -966 -11156 -90176 -108065 292331 16158 166079 -67958 -26499 180936 319926 31019
12817 -10092 -13189 -258508 49671 39703 -107772 -129403 24892 197112 1233 9612 330208 180111
12805 180111 -66705 105129 187270 248714 -41084 -115634 -455102 -110549 -93910 -208335 -13988
12793 39959 -11642 -101308 98733 -45955 197306 -190491 133988 331101 143998 -229645
12782 209275 -66838 -187983 -95601 -64823 134572 162018 -362215 -147489 45188 100201 -343093
12770 -16485 198836 89006 114159 -74472 -65547 53455 228529 94326 -119806 266028 7856
12758 -59610 -143720 199910 403792 80669 171538 -18105 -14782 -14759 -281730 130352 -25859 -314808
12746 -314808 125831 46777 -135570 173239 2113 245481 71059 264054 921 127261 396851
12735C96851D8878K12413M8626r9938l2075o0635J15366a13022j74745A53065
12724H0941a45536k5100C3351J02457f1641p0743m9914d2044a911j42073A7655
12712B5214i2081B2426L33013q0274N2302M8888K04676f2785A37145J53489A29232
12700B57810d6585B77939F9996b0882A76497p235h8215D3889P3796K9803D9886
12688A77833A5731a7838j5487k82858C1556L44982o0144H1357g5486F2764a66507
12676F83301F226L55167J28212B9020J26350J69566m844D9234K03828j25408J0207
12665A37861J44600q6486N0363F7471J14153E8835K25392l1656B5702J1437K52990
12654B90129d2731H9801c5859J2142A37419O3100L7411B2438L7601J20354k4996
$$ plain form
12735 396851 48878 261291 309917 209979 177904 117269 232635 -113022 -287767 153065
12724 80941 -145536 -170636 33351 135808 -61641 -132384 -182298 -42044 -1911 -143984 17655
12712 25214 -92081 22426 355439 275165 327467 376355 581031 -62785 137145 290634 129232
12700 257810 -46585 277939 69996 -20882 176497 169262 -88215 43889 117685 147488 49886
12688 177833 15731 -17838 -33325 -316183 31556 376538 316394 81357 -75486 62764 -166507
12676 683301 6226 361393 489605 29020 155370 324936 320092 49234 253062 127654 137861
12665 137861 282461 195975 246338 67471 181624 58835 284227 252571 25702 37139 290129
12654 290129 -42731 89801 -35859 -23717 137419 200519 237930 22438 60039 180393 155397
12643A55397i2199A55328a19816L0925m5129H07a45412a6858A62084j7203c21027
12631A22670h226q932B56822J47639A78114K16780A8092N35073G1801L28856j52439
12620B48218C9240a37747A93922a25389c803m10455J98053I2227J05815H3380
12609C00680F1688J33986d462H8701J29924h2013a254A25122m8887J50615j6886
12598B09964K66063j76946r1846K22309F3341j9786L8633h5365I9434J05935a65886
12586d0872A37740k4559K62791I4786J94969D1679i7404A18881e625l50758a46641
12574I0873l7224j9690j5604J68232j5678c7680A05789J16020C2654a21669N3452
12563f8217a497C14143b73757C53629E4489f0661A28799O3689O0756b9442B19584
$$ plain form
12643 155397 -92199 155328 -119816 -88891 -134020 807 -145412 -16858 162084 144881 -321027
12631 122670 -8226 -17158 256822 404461 178114 394894 18092 553165 71801 400657 248218
12620 248218 39240 -137747 193922 -125389 -3803 -414258 -216205 92227 198042 83380
12609 300680 61688 195674 -4462 88701 218625 -82013 -1254 125122 76235 226850 209964
12598 209964 476027 299081 207235 429544 63341 43555 82188 -85365 99434 205369 -165886
12586 -40872 137740 113181 375972 94786 289755 41679 -97404 118881 -5625 -356383 -146641
12574 90873 53649 33959 18355 186587 170909 -37680 105789 221809 32654 -121669 -68217
12563 -68217 -1497 314143 -273757 353629 54489 -60661 128799 192488 253244 -29442 219584
12551a23664N6999D8152K311h7314A32361a57408B9649a85004A51788o1012b20808
12539C01449g0730b5536l21220i3846C42265p8209j5472B6629b28561B245J05062
12528A07307K2043J00142E7246i8241K2514l52872c8745A85416B5400M0143a05438
12516c8539C1434i7984j04869o1615f669C7298f562L193C3124a80915E7727o882
12504E0845M9684l7674G265a34282H0912C6995a87326C7896J68076b9795D1598
12492A46322N7848p0225J48434B4620d02353A39670d2645j22323Q0590k2732H2872
12480I3845K4312P7340g9561B06534g1401a507j3800D4657a00040A41053J4796
12469A55849a35999R01A68019b67042J30632B57752f0667k75640B06563b70561
$$ plain form
12551 -123664 -66665 48152 50463 -87314 132361 -157408 29649 -185004 151788 90776 -220808
12539 301449 -70730 -25536 -346756 -93846 342265 264056 248584 26629 -228561 2245 107307
12528 107307 129350 229492 57246 -98241 -75727 -428599 -38745 185416 25400 65543 -105438
12516 -38539 31434 -97984 -202853 -264468 -6669 37298 -6562 -3369 33124 -180915 57727 50845
12504 50845 100529 62855 7265 -134282 80912 36995 -187326 37896 205972 -29795 41598
12492 146322 204170 133945 282379 24620 -402353 139670 -42645 -164968 -84378 -107110 82872
12480 93845 118157 195497 -79561 206534 -71401 -1507 -15307 44657 -100040 141053 155849
12469 155849 -135999 -135098 168019 -267042 -136410 257752 -60667 -336307 206563 -270561
12458f7216A00620f3365J2859l22624e5955A92087a8589B1384J21300G676l749
12447C927J18129c1784C726c8220k9025l93262i155F8728J11464C0419A043J74044
12435A75087a62443h0184C10490o3319a19873c5745F5567G5M05659j86197b361
12423a75086B7288L47400d02023a95359A25146n7067p812J5873B6771a88161A14530
12411a27759B8262P9721K0272C4477a85429A29074i2200E5511b78470B24693h1710
12399A03800k7312B8786A0828C997K3284J41009a19891A9789f8176L425A83877
12387D42702k07543H4547L3611J96457E1675M69307c1055A70575m5534k0088a26874
12375B01798f1900l5228j29223B54791j25938B4947e1105C7174H288Q8450J5113
$$ plain form
12458 -67216 100620 -63365 -50506 -373130 -55955 192087 -18589 21384 142684 7676 3927
12447 3927 122056 -31784 3726 -38220 -67245 -460507 -9155 68728 180192 30419 1043 175087
12435 175087 -162443 -80184 310490 247171 -119873 -35745 65567 75 405734 219537 -2361
12423 -175086 27288 374688 -402023 -195359 125146 68079 60267 76140 26771 -188161 114530
12411 -127759 28262 107983 128255 34477 -185429 129074 -92200 55511 -278470 224693 -81710
12399 103800 76488 28786 10828 3997 27281 168290 -119891 19789 -68176 -64751 183877
12387 442702 235159 84547 118158 314615 51675 520982 -31055 170575 125041 104953 -126874
12375 201798 -61900 -97128 -226351 254791 128853 24947 -51105 37174 8288 96738 111851
12364A11851K28959c7005A45197a5371m17182I3944J24488c9686o342j65391b9240
12352a7509k20739B3570a55346J7105F7976a29773C23759g9762D05758G2983b84869
12340A66949b47872i0700k6923c1023C6627h2065A00010c9587k16220B01471A5365
12328g1498A03882e7754j00366p8577B94673a41625j9741a7441k20804g759k81971
12317b89730A27698E6652J56136d1027k19133B61369G939F17J31616l5271b45533
12305C29063i4122q6354j64086c3016F7129b07030c9022G0153b0326C24802l2845
12294B91957j33242a24072m8586c8042C51179A68505K4474a62944C65416I5304
12283a09564i892D2109d8950B98741b353j1100A80603g9992g426A97657j3110
$$ plain form
12364 111851 340810 -37005 145197 -15371 -432553 93944 218432 -39686 -46028 -211419 -29240
12352 -17509 -238248 23570 -155346 -138241 67976 -129773 323759 -79762 405758 72983 -284869
12340 166949 -247872 -90700 -117623 -31023 36627 -82065 100010 -39587 -255807 201471 15365
12328 -71498 103882 -57754 -158120 -236697 294673 -141625 -161366 -17441 -238245 -7759 -289730
12317 -289730 127698 56652 212788 -41027 -260160 261369 7939 617 132233 96962 -245533
12305 329063 -94122 -180476 -344562 -33016 67129 -207030 -39022 70153 -20326 324802 291957
12294 291957 158715 -124072 -172658 -38042 351179 168505 192979 -162944 365416 95304
12283 -109564 -9892 42109 -48950 298741 -2353 -13453 180603 -79992 -7426 197657 184547
12272A84547J03829E3437K75755A27850B4902K46121h5824E7362J96499L006O3185
12261C20052i3996C43693c8862E4429a3708C53518j8604C3174O16653l16117E7448
12249a9129C69607F1481J96113d0205f874C66498A24972P5954c4139j09496c7674
12237A70261F4733J85712D8738L02638e6713B01816B436J38735Q9856n4320m130
12226A72577M9500A03801O74069A77559M925J1656o2419f0565C47867M1475a59783
12214B13329b16397C57923o4834A28383B0623J90670I068J95522r6592P5584h4594
12202A42369M28960A01247O5237D9089L45102A9982B285c3844A62035J47332a10487
12190A96464R1927n9661b44581M7908B1526Q8608l1674K47596a90783A95337D0116
$$ plain form
12272 184547 288376 53437 329192 127850 24902 271023 -85824 57362 253861 256867 320052
12261 320052 -93996 343693 -38862 54429 -13708 353518 334914 33174 649827 333710 57448
12249 -19129 369607 61481 257594 -40205 -6874 366498 124972 200926 -34139 -143635 -37674
12237 170261 64733 250445 48738 351376 -56713 201816 2436 141171 231027 176707 172577
12226 172577 222077 103801 777870 177559 182484 194140 131721 -60565 347867 389342 -159783
12214 213329 -216397 357923 293089 128383 20623 211293 9068 204590 107998 183582 -84594
12202 142369 571329 101247 166484 49089 394191 19982 2285 -33844 162035 309367 -110487
12190 196464 288391 228730 -244581 -196673 21526 110134 78460 326056 -190783 195337 40116
12178D37042P8737j80523B6196C17J28583J30664A08507R8753r6999K6363J09738
12167B46362r6429b643j61143B35639c54833A24374L3925J49213F3696i7852a2923
12155a90097g0506A7283P0062l7500K60939H5043a02480A23195J9025R4005C6592
12143a44745M2998D38112A61694a75721K9881C26151G5560A628J57412J58970
12133C18010A28587g3454b3169B5808K53274r3049o3890b50258M2170E8967d9173
12121a23835a7427r8164H9994c18824G822a32677o2334i2511l7329j4797j5910
12110a60547E0323J41214a33783A29746a7654r557A93957n1029b42779A45047
12099B5178J76924h3226H9659g4316B42616a8239D5661c2315D850J17532J44723
$$ plain form
12178 437042 515779 335256 26196 317 128900 259564 108507 207260 110261 136624 246362
12167 246362 149933 -2643 -163786 235639 -354833 124374 158299 307512 63696 -97852 -12923
12155 -190097 -70506 17283 87345 49845 310784 85043 -102480 123195 142220 236225 36592
12143 -144745 -101747 438112 161694 -175721 -145840 326151 75560 1628 159040 318010
12133 318010 128587 -73454 -23169 25808 279082 186033 122143 -250258 -208088 58967 -49173
12121 -123835 -17427 -115591 89994 -318824 7822 -132677 -195011 -92511 -129840 -144637 -160547
12110 -160547 50323 191537 -133783 129746 -17654 -27211 193957 142928 -242779 145047
12099 25178 202102 -83226 89659 -74316 242616 -18239 45661 -32315 4850 122382 267105
12088B67105d04766i9598G3581B9287b35515A07390i3590C6859P8213h9724M1755
12077d7969k37688A22815M01277j24224A18024P13401Q85317k94772I4416L16036
12067D10452C8888e9839I0395e5977A73238H001g253m35446B8691J37921n9411
12056A07201J06127b44266g0899F3636B1942h8271r9141A14485e5273A34627n2348
12045H2279K042j6981a10454b8186j38688P3393F3751L6002j0277O8656B9143
12033B09210J47134d6839A50191c33973J10978C6364b49535h5796L3638b4207
12022c9436F3665b38451C48282f9390j29293n6490c3902L871F1524J78563q8289
12011A51798n2358l3706b36159A621a90302I1622c53050C2670a92454j27234a5145
$$ plain form
12088 267105 -404766 -99598 73581 29287 -235515 107390 -93590 36859 115072 -89724 -47969
12077 -47969 -285657 122815 524092 399868 118024 831425 1716742 1421970 94416 410452
12067 410452 38888 -59839 90395 -55977 173238 8001 -7253 -442699 28691 166612 107201
12056 107201 213328 -244266 -70899 63636 21942 -88271 -187412 114485 -55273 134627 82279
12045 82279 84321 67340 -110454 -28186 -166874 -93481 63751 99753 89476 158132 29143
12033 209210 356344 -46839 150191 -333973 -222995 36364 -249535 -85796 -52158 -24207
12022 -39436 63665 -238451 348282 -69390 -198683 -255173 -33902 -30031 61524 240087 151798
12011 151798 99440 65734 -236159 1621 -190302 91622 -353050 32670 -192454 -319688 -15145
11999b61396M8054j08058a14532r9035D4691N6198M2077H315A39K58658c439B2314
11986D5203M2196K04469E2947O1403m6560J06392F0298K33301B8347d2984r9821
11975a42805c3699C4395o389N6858J02501b0681C83776A12012a3875j28130C3173
11963a10593A87006n3927e456C5850a02034p547A9232L0550J03911l9815k8523
11952H5355L6044d6300m349D1304b71099C40375a73048Q2850D7999p702N4331
11941I4628i7763A5731a78215a7505k84160A37388L6704O6232B574O3703b43571
11929i7864j17796A78755b41138R2545D7407B0758g2086G6707B7978J66181a15913
11917a34654j1782A97195e9223j70225B3901J22749M944i9116A28520a6835k65586
$$ plain form
11999 -261396 -213342 -321400 -114532 -213567 44691 100889 142966 8315 139 258797 -3439 22314
11986 45203 87399 291868 52947 114350 67790 174182 60298 293599 28347 -42984 -142805
11975 -142805 -33699 34395 28006 84864 187365 -20681 383776 112012 -13875 -142005 33173
11963 -110593 187006 133079 -5456 35850 -102034 -109581 19232 49782 153693 113878 85355
11952 85355 121399 -46300 -50649 41304 -271099 340375 -173048 -90198 47999 40297 94628
11941 94628 -97763 15731 -178215 -17505 -301665 137388 174092 240324 2574 66277 -243571
11929 -97864 -215660 178755 -241138 -148593 47407 20758 -72086 76707 27978 194159 -115913
11917 -134654 -146436 197195 -59223 -229448 23901 146650 151594 -99116 128520 -16835 -282421
11906b82421O8288B68157G8833c8801j2159k88634D8722f0250j09417d1067G7210
11894I0708a24825I4211K35384A57411F300M9360b40383A51723c36009E6134h6065
11882d5465A79799a65554L5177A15327m0527J90701a58106A43691c8821B091b9545
11870a68454I0544b1258A73726M9418f3315j15442g1205A08815a57493k50389
11860d07882b8884A87546d8589k67975B3557O9075c17104A4179h2285A39029Q453
11849A47482c7859D019c32419A00309k0055Q0320a49888f365D32509a42065j08998
11838b51063k24736B32877o9731d2035h66A0298c65626A40310i6468M7461o3836
11827a12843k2335C49363D1011d7553a8850r6672G7169N5162c45048i3816C59665
$$ plain form
11906 -282421 -214133 268157 78833 -38801 -50960 -339594 48722 -60250 -169667 -41067 77210
11894 90708 -124825 94211 329595 157411 6300 55660 -240383 151723 -336009 56134 -86065
11882 -45465 179799 -165554 -130377 115327 74800 265501 -158106 143691 -38821 2091 -29545
11870 -168454 90544 -21258 173726 223144 -63315 -178757 -71205 108815 -157493 -407882
11860 -407882 -28884 187546 -48589 -316564 23557 92632 -317104 14179 -82285 139029 147482
11849 147482 -37859 4019 -332419 100309 80254 160574 -149888 -6365 432509 -142065 -251063
11838 -251063 -475799 232877 163146 -42035 -866 10298 -365626 140310 -96468 -49007 -112843
11827 -112843 -135178 349363 41011 -47553 -18850 -115522 77169 132331 -345048 -93816 359665
11815b2488c986j27142B80051a39807j50914a0688B4736Q3940R7847o2209A2260
11803a3207j49675A27627d6530R538A3126E495K6088k040b71921m8159J45450
11792a74630B3440Q1756J17025J21105c5358m4273A97340d7563k5548j49073O7231
11781a54953L7012D3220b08214j41173H0340c6055j86464k16445a61949l11575
11771d73524b10486o259A93956a69255K5072j54698A9965d794A67121d3035a4315
11759B86408i6437D1135N4801c9266k72891i7210o9020H7681a34858B01048d863
11747C4883b56978D48176a48128B6355K15412A6452HK08790M1742F9349l0158
11736C9191i0388P074l1806p8429B63452r2730l3235e24167a36035B27345c75411
$$ plain form
11815 -22488 -3986 -131128 280051 -139807 -290721 -10688 24736 108676 206523 144314 12260
11803 -13207 -162882 127627 -46530 -36992 13126 5495 31583 29543 -271921 -320080 -174630
11792 -174630 23440 105196 222221 343326 -35358 -79631 197340 -47563 -73111 -222184 -154953
11781 -154953 -117941 43220 -208214 -349387 80340 -36055 -222519 -438964 -161949 -473524
11771 -473524 -210486 -216745 193956 -169255 -144183 -298881 19965 -4794 167121 -43035 -14315
11759 286408 -96437 41135 95936 -39266 -312157 -97210 -166230 87681 -134858 201048 -4863
11747 34883 -256978 448176 -148128 26355 241767 16452 8 208798 250540 69349 39191
11736 39191 -90388 -83314 -115120 -193549 263452 170722 137487 -524167 -136035 227345 -375411
11724B9788L0679g9047A5435f4971G5093R1017D9214o159a12336A36822l8767
11713I8055f4002B54783g1692A5596Q1862d4558A37449M1680G6558J52518a83819
11701A26162a83256C48195j40411A1367J9872K42513A10328C5110b6085B06203
11690A33450M8385M5640f9237o3640K9226B10783L4237a20186j54341B96218J52554
11679D48772E1727a00940B42353M9337A40396i6390r2309B3792c00887A35506
11668A34564P1097a63723F5666a2504B28210h4498j43845D7067L40726A59438
11657I8050g3975B06803a32402K4373A17694c51367G4695K78506C6133b55235
11646c32483C13315b86961A04893Q4413d6742j60626B39801c01458A349a65867
$$ plain form
11724 29788 60467 -79047 15435 -64971 75093 166110 49214 43055 -112336 136822 98055
11713 98055 -64002 254783 -71692 15596 97458 -44558 137449 179129 76558 229076 -183819
11701 126162 -183256 348195 207784 11367 31239 273752 110328 35110 -26085 206203
11690 133450 181835 227475 -69237 -132877 -103651 210783 245020 -120186 -274527 296218 448772
11679 448772 51727 -100940 242353 291690 140396 -96390 -188699 23792 -300887 135506
11668 134564 205661 -163723 65666 -12504 228210 -84498 -228343 47067 387793 159438
11657 98050 -73975 206803 -132402 -108029 117694 -351367 74695 353201 36133 -255235
11646 -332483 313315 -286961 104893 189306 -46742 -207368 239801 -301458 1349 -165867
11635B24585j9635D1540J25175L0364F5228L6941a80643F3450a18757A39403Q8457
11624B27860a59365B39909L60280G6132A7424b76894D1933e0931C53560D4128
11613a9295l5049B86517f3849J3292A46217r372b46202h5154B22931F0888J12305
11602A73193m5357n0279J04020J86006A26792o0765l1079O9596A6706N0633B3512
11590f1460k3549B49893a7535H3285J48961l908Q4791m2548A06913R1174p2614
11579A25473E2748f0956k8833C22267A1365e1319D6905b43771A6297K2918D727
11567A97360i26C13240i4905H3510P7314R4958G0343L07559E2608b6368B49049
11555f9631b6614m03687K09322A46128n4205a96389A82829e7680C77368j57892
$$ plain form
11635 224585 204950 41540 166715 197079 65228 102169 -180643 63450 -118757 139403 227860
11624 227860 -159365 239909 600189 76132 17424 -276894 41933 -50931 353560 44128
11613 -19295 -54344 286517 -63849 -50557 146217 136845 -246202 -85154 222931 60888 173193
11602 173193 127836 77557 181577 367583 126792 66027 34948 104544 16706 67339 23512
11590 -61460 -85009 249893 -17535 83285 232246 228338 313129 270581 106913 198087 125473
11579 125473 52748 -60956 -89789 322267 11365 -51319 46905 -243771 16297 39215 4727
11567 197360 -926 313240 -94905 83510 160824 255782 70343 377902 52608 -26368 249049
11555 -69631 -26614 -430301 -220979 146128 91923 -196389 182829 -57680 377368 219476
11545B19476K6088a63616B17859E985i7894E0628a9812A037K4797M3741J9326
11534H8901a91039a3020A75785J69423j35682C107a0516A82239b6148j77877e4868
11522A91594d9309A4000L4267J77093a2639E7829N9597b10217C5736L62532A65563
11510i7434E7608a23955B77564C3323O9234j5228K02760p2208b4047B34634a45942
11498H5236k8946a00618a4450j39647D13633j62349A03562K5572L99589g9402
11487A1190c5405j40430H298M6280J5736R9246a08530A01593b9179l3510H3722
11475a61931A72232L64635B35971G0748L19435j86220a4959k5361A56679J15015
11465B71694q2121l5421a9822l4691A68741K97797a53767J7910C74515G2200L1130
$$ plain form
11545 219476 245564 -163616 217859 5985 -97894 50628 -19812 1037 25834 69575 88901
11534 88901 -191039 -13020 175785 345208 209526 3107 -10516 182239 -26148 -204025 -54868
11522 191594 -49309 14000 48267 225360 -12639 57829 117426 -210217 35736 398268 165563
11510 -97434 57608 -123955 277564 33323 102557 87329 290089 217881 -24047 234634 -145942
11498 85236 56290 -100618 -14450 -154097 413633 251284 103562 129134 528723 -79402
11487 11190 -35405 -175835 8298 54578 70314 169560 -108530 101593 -29179 -62689 83722
11475 -161931 172232 536867 235971 70748 390183 203963 -14959 -40320 156679 271694
11465 271694 189573 154152 -19822 -54513 168741 466538 -153767 -135857 374515 72200 103330
11454A03330J73741A0361M4481K31265c06446H2705a0197o8260j45785D48286
11443F7287c8611A11979K16527E7782A9583O5851A9251h3680C88092a41360A78967
11431C00054A14569N1872a12949f937k95441a34857r0337f4508I2422L7633J27101
11420B57156b91139H3070a74283E0028c00916C61180A459R4615b21657D4388K41904
11409B86292n4172F2595a05803A84875J44562j57391G1459f1086k749i973G2222
11397a89116E283b11849o7604d4012B40309a22728B73741a52224A78091o3002
11387A15089R1057k0386J59353b26622G8539M3664c41376C2882J91960b39217
11376c9753l08128A25180e9273P232j37229B45682D3186P0265b40670Q1180D0809
$$ plain form
11454 103330 277071 10361 54842 286107 -306446 82705 -10197 -78457 -224242 448286
11443 67287 -38611 111979 328506 57782 19583 85434 19251 -83680 388092 -141360 178967
11431 300054 114569 166441 -112949 -6937 -302378 -134857 -225194 -64508 92422 130055 257156
11420 257156 -291139 83070 -174283 50028 -300916 361180 1459 96074 -221657 44388 286292
11409 286292 232120 62595 -105803 184875 329437 172046 71459 -61086 -63835 -9973 72222
11397 -189116 5283 -211849 -279453 -44012 240309 -122728 273741 -152224 178091 115089
11387 115089 206146 185760 345113 -226622 78539 122203 -341376 32882 224842 -239217
11376 -39753 -347881 125180 -59273 -52041 -189270 245682 43186 113451 -240670 -159490 40809
11364A98757d76480d1930B0951O8006i7629M1916B76992A25057f1819j94114R026
11353b46907h6416C2499b89291d4584H8427a75293A04133b721G1242M7424f9636
11341a55911j56498I563K04813d6977B0483h793o8733A54663a14507c7738B06821
11329d8913m7949p8669j16697h5990B29215G330f3676B7920a66270N0079n7152
11318a73343A09815K26815F1493h698A52272m2408j4187B3316J8978b80001b813
11306B0239J09026q976a16174R200o1421L5830J4024q1563e921l08123I7372J18996
11294B16368g4056c2743j1659m6359J4250G6295a29018a1087m633H3335a83479
11282a34491b9116A08595g6481o2391e5643a1836k01200A047i2496A85d17770
$$ plain form
11364 198757 -476480 -41930 20951 88957 -97629 -55713 276992 125057 -61819 -255933 -246907
11353 -246907 -86416 32499 -289291 -44584 88427 -175293 104133 -2721 71242 118666 -69636
11341 -155911 -312409 9563 214376 -46977 20483 -8793 -77526 154663 -114507 -37738 206821
11329 -48913 -96862 -175531 -292228 -85990 229215 7330 -63676 27920 -166270 -116191 -173343
11318 -173343 109815 336630 61493 -8698 152272 109864 95677 23316 42294 -280001 -2813
11306 20239 129265 120289 -116174 -106974 -168395 -132565 -118541 -200104 -5921 -314044 97372 216368
11294 216368 -74056 -32743 -44402 -90761 -76511 76295 -129018 -11087 -15720 83335 -183479
11282 -134491 -29116 108595 -76481 -138872 -55643 -11836 -213036 1047 -92496 185 -417770
11270a58509a3879A72550d9963j00406A47028f5647k7093A26964g9074f476j0880
11259a7356D2440O6610O7332b1572r7123E286f6523l92A47735H627b60209E6976
11246D38765a51027E5237b23793B42268h7243j74285a28897E4554A0107J13355
11236A23462g9153f480j74174I157a50853j06523a23720c1385B20807b82950H9684
11224a19284C5454g443r3208A97148b33254g5898j2485A18859P6524h3216D9203
11212F6481J23390q3582a13330b4943j53019M0696G02J10861b73382J10882M3294
11201a19206l5619d3170a1365r9123B04578f4783E927b34748d4852B60472a31292
11189B1428c05918O6239K6819j540j40828P3264g4050B14835a38712G9947e0388
$$ plain form
11270 -158509 -13879 172550 -49963 -150369 147028 -65647 -92740 126964 -79074 -6476 -17356
11259 -17356 42440 109050 176382 -21572 -118695 5286 -66523 -66915 147735 8627 -260209 56976
11246 438765 -151027 55237 -223793 242268 -87243 -261528 -128897 54554 10107 123462
11236 123462 -79153 -6480 -180654 9157 -150853 -257376 -123720 -31385 220807 -282950 89684
11224 -119284 35454 -7443 -100651 197148 -233254 -75898 -88383 118859 195383 -83216 49203
11212 66481 189871 106289 -113330 -24943 -177962 -137266 702 111563 -273382 -162500 -119206
11201 -119206 -154825 -43170 -11365 -110488 204578 -64783 5927 -234748 -44852 260472 -131292
11189 21428 -305918 -239679 -212860 -214400 -355228 -281964 -74050 214835 -138712 79947 -50388
11177a61072e3665q8036e4842k1643A3300c42345H2945e2664n1149r9012C3966
11165C64311a69372p357N1098l10219a48833f5114p1044M6875F8242Q8640k182
11154A54700i8415H6588L7385b78557A34144k9850l0121k2812a48945D2241J91770
11143B34011a49935f6115A93734e61789c7032A83585a14723B22057q0265a88758
11132A03289L3040f5172A89332o708b66F906M3386B0196J120b88915D12718d68859
11119b00641A51952A8190c3359j46414d6598A45563J18883j30263a10653p3134
11109a83787B24873a35846C02125J70149j44194J69353A61953D5384K7240L28563
11099D01187A62946b1550A57822A4282b09112A22618A7444M03973j02699j21204
$$ plain form
11177 -161072 -53665 -141701 -54842 -76485 13300 -342345 82945 -52664 -103813 -202825 33966
11165 364311 -169372 -176729 -125631 -435850 -148833 -65114 -136158 -89283 68242 156882 154700
11154 154700 -98415 86588 123973 -278557 134144 104294 74173 51361 -148945 42241 234011
11143 234011 -149935 -66115 193734 -561789 -37032 183585 -114723 222057 141792 -188758
11132 103289 136329 -65172 189332 182624 -266 6906 50292 20196 21316 -288915 412718 -468859
11119 -200641 151952 18190 -33359 -179773 -46598 145563 264446 134183 -110653 -183787
11109 -183787 224873 -135846 302125 472274 328080 497433 161953 45384 72624 401187
11099 401187 162946 -21550 157822 14282 -209112 122618 17444 421417 318718 197514
11089A97514a77023A68768q3141N7791i946A10277D7269K41997A00846K61058
11079C61904b8488B19175I9546L4757B4538K24431K2406A8955L72344J70048j76810
11068C84537m4447J23438P6403j28701J54599B81272J74353J22096k45554J31313
11058D63480J40213J7321P1952l09743L4292K90122k36073L07124k24498j43587
11048D10603L57153O0651P399l06128K45463P7474m2728j09922l7088J33364J00777
11037H97018j34724j54889L81873j50453k62957j5915L25152j88182m5958m4562
11027F06403O1939L2845N6737l28555N79904k68161q539C64032K06679K60687
11017H31398k10019J9140k31621N82051m79246L01406l56997L26969j66599n994
$$ plain form
11089 197514 -177023 168768 85627 143418 -9946 110277 47269 289266 100846 361904
11079 361904 -28488 219175 99546 134303 24538 248969 271375 18955 391299 561347 384537
11068 384537 340090 463528 539931 411230 565829 281272 455625 577721 332167 463480
11058 463480 603693 621014 692966 383223 417515 707637 471564 778688 554190 410603
11048 410603 767756 828407 835806 529678 775141 852615 809887 699965 662877 796241 897018
11037 897018 762294 607405 989278 838825 575868 559953 885105 696923 650965 606403
11027 606403 668342 701187 757924 429369 1009273 741112 732573 364032 570711 831398
11017 831398 621379 640519 408898 990949 511703 813109 456112 783081 616482 610488
11007F10488K53525j41123j26011J41067R8390l16325k1672J5332R2412N13186
10997A119269j88161l71916J60720j61383K76529k3319j5531K30355j63279J7080
10987H80364L70591k88536M13486l01582n0597L65202l4486m17757N47831j40464
10977A344052M25542K10892J25485N31032R9830K62403J74089k87554K19002n41326
10967B563447R7181n09995k15093k24031J87766J48119m55922K56218j1279k41619
10957A594792O9954Q4031m1190m36086K53404l66083N8758E57756K06706C19179
10946B79269K05985B17358M78461k66706j53749j34060J78849j51177L65337e4936
10935b966C0903b0732F1015K74304j18199K17975j50370A13434K22798H0632g7639
$$ plain form
11007 610488 864013 722890 596879 737946 836336 520011 498339 513671 606083 1119269
10997 1119269 931108 559192 719912 558529 835058 811739 796208 1026563 863284 880364
10987 880364 1250955 962419 1375905 1074323 1023726 1388928 1354442 936685 1484516 1344052
10977 1344052 1769594 1980486 2105971 2637003 2736833 2999236 3173325 2885771 3104773 2563447
10967 2563447 2660628 2150633 1935540 1711509 1899275 2047394 1591472 1847690 1836411 1594792
10957 1594792 1664746 1748777 1707587 1271501 1524905 1158822 1217580 557756 764462 319179
10946 279269 485254 217358 695819 429113 275364 141304 320153 168976 534313 -54936
10935 -2966 30903 -20732 61015 335319 217120 435095 284725 113434 336232 80632 -77639
10923A18604O7577e108j29328F3396o659b21694F68K08469d33187A84413d7542
10911A79453a38005k2573B88316e119j91411B62725g3444j25084A90033O5534
10901B55567b19376n6771Q3098k5919G3415Q9797E2512K00679g1156A85026f9340
10889c79610J45574j34425D5553a54751A42065C9089a83008A03747K00734m6854
10879B57627a51664B4569a45219c7786A49292c8114A65082p4269J21572b28241
10868a20148j60097C85742d8694E807e5778n7593m6541A898f907A31276k5756
10857A05520l7208a52105A89234k999B914K5302a98705A3599J51092B9365h0026
10845C2798L8914a27537A52663c4233l10934B78013b9196F6547a39307f5404B26918
$$ plain form
10923 118604 186181 -5108 -134436 63396 56737 -221694 668 209137 -433187 184413 -47542
10911 179453 -138005 -160578 288316 -5119 -196530 262725 -73444 -198528 190033 255567
10901 255567 -219376 -276147 -193049 -218968 73415 163212 52512 253191 -71156 185026 -69340
10889 -379610 -234036 -368461 45553 -154751 142065 39089 -183008 103747 304481 257627
10879 257627 -151664 24569 -145219 -37786 149292 -38114 165082 90813 212385 -228241
10868 -120148 -280245 385742 -48694 5807 -55778 -113371 -159912 1898 -6907 131276 105520
10857 105520 68312 -152105 189234 186235 2914 28216 -198705 13599 164691 29365 -80026
10845 32798 71712 -127537 152663 -34233 -345167 278013 -29196 66547 -139307 -65404 226918
10833a65946F6035P1719l1978K10194E1890j6657K15555A19002c0361A45503J94398
10822C39901a42371o0728m8359M4627e6739a6170b535G6557h5982j46835P7430
10811a55387j52742a8365p7062G2619h8378C82166A83713a9707F4842a09484J4399
10800i5085k2740L0078l41238A60679n0384c03598P6902D903e504j12476m5832
10789a63812j58429A58597a6390j09976j86985a06675A2508b60612A9428O1601
10779H1029a25310A35061b24876f6873r8773A51533a6398G7342J28590b52795
10768a36649j61578c7522m1150j00214C9109a32473J6505d8664A92890c08116
10757A11533L7658E0192a01342j9742j42184M1012A2966a23097k8510Q204d8825
$$ plain form
10833 -165946 66035 137754 105776 315970 51890 35233 250788 119002 -30361 145503 339901
10822 339901 -142371 -203099 -251458 -206831 -56739 -16170 -2535 76557 -85982 -232817 -155387
10811 -155387 -308129 -18365 -95427 72619 -88378 382166 183713 -19707 64842 -109484 -95085
10800 -95085 -117825 -87747 -428985 160679 110295 -303598 -226696 4903 -5504 -117980 -163812
10789 -163812 -322241 158597 -16390 -126366 -313351 -106675 12508 -260612 19428 81029
10779 81029 -125310 135061 -224876 -66873 -165646 151533 -16398 77342 205932 -252795
10768 -136649 -298227 -37522 -78672 -178886 39109 -132473 -115968 -48664 192890 -308116
10757 111533 149191 50192 -101342 -121084 -263268 -222256 12966 -123097 -151607 -143403 -48825
10745A44454a46002d5955F4356c27662I0769j9414a28988H6512a65063N6415n0079
10734a58727j1863A85891b45621H320J04184D2000K188d06053C8077J5752b48316
10722A70505i7752j64072n374D7548N514a48618A73536E380P4493c24688c2351
10710A15328M0279n9517N3768n2994a93250F0020b15873n3996d5759j91825F184
10698e55709a55504A14063a557G3188O0483P687c41007c2344a2887B8656a95970
10686G0517L979L78240a07125I9111a98816Q448i3877c6154B53513a57174A23789
10674B53574b84888c6504c101H4345N2951C2873e7356G7982a59893m1003a9748
10662b71094a4661A65893a50737E3796K14257I5944a11674B42811d8999k01361
$$ plain form
10745 144454 -146002 -45955 64356 -327662 90769 71355 -128988 86512 -165063 -108648 -158727
10734 -158727 -170590 185891 -245621 8320 112504 42000 44188 -406053 38077 53829 -248316
10722 170505 -97752 -261824 -267198 47548 53062 -148618 173536 5380 79873 -324688 -32351
10710 115328 155607 96090 149858 96864 -193250 60020 -215873 -269869 -45759 -237584 6184
10698 -555709 -155504 114063 -1557 73188 133671 141358 -341007 -32344 -12887 28656 -195970
10686 70517 74496 452736 -107125 99111 -198816 -190368 -93877 -36154 253513 -157174 123789
10674 253574 -284888 -36504 -3101 84345 137296 32873 -57356 77982 -159893 -200896 -19748
10662 -271094 -14661 165893 -150737 53796 268053 95944 -111674 242811 -48999 -250360
10652b50360j36635a35983A09717b52772D5603c3482D3417a73711j77705A19956
10641B15261c39022b7779B6858a28697c2337r7300K1982q1341i0282j12495M0945
10630a61832B29085E6759a1033E2070k0920J26597n2835J95333j44183J50836
10620C06898c41889a24277j50656D20832G5846J33249I0732a23559J3455k94540
10610d04644a30122B13166c7208G277a78728D2496b94352A51377a96688E6272
10599a74067c3755n7089C5741N6666J45479j02237a29838j02878a01346H7801
10588d0983E7998d69122a95430A98063e9441j069A86518A0643a14852o2542n5008
10577b32402J3640b6811k52770f3219B08724F1055b96891o4752C7057R3532M003
$$ plain form
10652 -250360 -386995 -135983 109717 -252772 45603 -33482 43417 -173711 -351416 119956
10641 215261 -339022 -27779 26858 -128697 -32337 -129637 -107655 -188996 -90282 -202777 -161832
10630 -161832 229085 56759 -11033 52070 31150 157747 104912 300245 156062 306898
10620 306898 -341889 -124277 -274933 420832 75846 209095 90732 -123559 -110104 -404644
10610 -404644 -130122 213166 -37208 7277 -178728 42496 -294352 151377 -196688 56272
10599 -174067 -33755 -90844 35741 92407 237886 135649 -129838 -232716 -101346 87801
10588 -40983 57998 -469122 -195430 198063 -59441 -60510 186518 10643 -114852 -177394 -232402
10577 -232402 -218762 -26811 -279581 -63219 208724 61055 -296891 -361643 37057 130589 134592
10566A34592a13923H7816L7865a47763O6177a3754A67699c4773k99627C034K02902
10555B05936a75652C16185E706J42885A6884a90147g5750l9525p8796P3418A70847
10543D6166b33585A0873O2435a1709C367c6457B15618b5504k37212A81783d0529
10531C30390H8070h3524B10260d5908E5217a06249B04161e8949l81146B09522
10520h1764A04119b2922D2780b45307q9875B3358p797a98061j32942a45679A24036
10508e21110F0733a1442B73592a63049c8011r7474J6523A44465a77263E889f2365
10496b16290A9268O5700N1470D7266M318a68458Q013h678j26635A90082a42924
10484f3473B56348F7253J39716J53262M1209j54918J69039n9816a02314A21466
$$ plain form
10566 134592 -113923 87816 125681 -147763 -81586 -13754 167699 -34773 -334400 3034 205936
10555 205936 -175652 316185 5706 148591 16884 -190147 -75750 -115275 -194071 -120653 170847
10543 46166 -233585 10873 73308 -11709 3367 -36457 215618 -25504 -262716 181783 -40529
10531 330390 88070 -83524 210260 -45908 55217 -106249 204161 -58949 -440095 209522
10520 -81764 104119 -22922 42780 -245307 -335182 23358 15561 -198061 -331003 -145679 124036
10508 -521110 60733 -11442 273592 -163049 -38011 -135485 -118962 144465 -177263 5889 -62365
10496 -216290 19268 84968 136438 47266 51584 -168458 -160445 -8678 -135313 190082 -142924
10484 -63473 256348 67253 206969 360231 401440 246522 415561 355745 -102314 121466
10473a33113G4434a07093N3153j37824m714m7938N4006q8526E7519c17187E3172
10461A60629n0730a91001J4309K9373G7860C6674f0252n3908M3417j52404n8031
10450b81178a5634m1564A63574B2766b94268A41680D1685c2839H8096b61573O2273
10439a99300j90018e3693A27789B0534e0914A91135a95569B06847d5889m7135
10429i3024A59090G3499N2278n356b16684A79974J17505F4034i7956c8584A57831
10417a89826A84160b75226F6275M7285J21104J16970f7160A24792d9986K194A49247
10405b30251A0352N1901A6751d5731q5576B5094K70534g1580E2427L03427j70913
10394A84941b1323E4134R6380K14716c7904j48452c4425C4828J49527d409G3303
$$ plain form
10473 -133113 74434 -107093 -53940 -191764 -196478 -244416 -190410 -278936 57519 -317187 53172
10461 160629 109899 -191001 -176692 -147319 77860 36674 -60252 -114160 -70743 -223147 -281178
10450 -281178 -15634 -57198 163574 22766 -294268 141680 41685 -32839 88096 -261573 -199300
10439 -199300 -389318 -53693 127789 20534 -50914 191135 -195569 206847 -45889 -93024
10429 -93024 159090 73499 125777 120421 -216684 179974 297479 64034 -97956 -38584 157831
10417 -189826 184160 -275226 66275 113560 234664 351634 -67160 124792 -49986 -47792 149247
10405 -230251 10352 62253 16751 -45731 -131307 25094 295628 -71580 52427 355854 184941
10394 184941 -21323 54134 150514 365230 -37904 -186356 -34425 34828 184355 -4409 73303
10382B38840F2371K3949A5192L44285C0585O22393C24831a5228D8512M03523j70200
10371B81835M23122A194L04396R9600q3070M17966j70449L6529B45030n0442n3136
10360A41452K45568J41789A99541E6584M22788G9344J20838c5341C60262J17545
10350D77807q6357J71958A55110J57827j1905q8281K35674K39635C00699r0475
10340B10224r2900K84656A30657Q2417k4708J81733E3455e2182K4958a553o4432
10329f5985o7889A50086J08063B794a4501G492N4587e1323A70983J03250A15208
10317B05923f3042I5989O6057B4360L02918F171a35808o6812l07B6418e9182A9293
10304A20941F817d8670J3112j93250O1827D3605J7420a62839o4501O9574A0898
$$ plain form
10382 238840 62371 86320 15192 359477 30585 652978 324831 -15228 48512 452035 281835
10371 281835 704957 1194 305590 405190 322120 740086 569637 606166 245030 194588 141452
10360 141452 387020 528809 199541 56584 479372 79344 200182 -35341 360262 477807
10350 477807 391450 563408 155110 312937 301032 212751 448425 688060 300699 210224
10340 210224 117324 401980 130657 213074 188366 370099 53455 -52182 -27224 -1553 -65985
10329 -65985 -133874 150086 258149 2794 -14501 7492 62079 -51323 170983 274233 115208
10317 205923 -63042 95989 162046 24360 327278 6171 -135808 -202620 -202927 26418 -59182 19293
10304 120941 6817 -48670 -35558 -228808 -166981 43605 61025 -162839 -227340 -157766 10898
10292D4855b9372F7534b48965a00018j61863j23407b1770B47018l7202a99769
10281c6206F9887b77671O697h3872K4969a2802j34274A8221R7209m8899C1277
10269B38503F3542i9404A03707c08939A48647E2536J67101F1253J69321m1605
10259A88969J7570L28658o6912A47449J62379a8589F4204J09874p7743C8317a33386
10247c6389o8897B59797G5340e2580j00665O9498j73949f6966F142b29833C8836
10235g1273r0370j95470a45028D325L5814a92606A00465j005a62578P2320m6361
10224a36619B6902H338N48288A52935L558J69091b17533b93j78526D265a30394
10212A1310a56293E689d1618j69666N499e7342A78894d18172a14634C004K24961
$$ plain form
10292 44855 -29372 67534 -248965 -100018 -261881 -385288 -21770 247018 209816 -199769
10281 -36206 69887 -277671 -270974 -83872 -58903 -12802 -147076 18221 115430 66531 31277
10269 238503 63542 -99404 103707 -308939 148647 52536 219637 61253 230574 188969
10259 188969 206539 535197 468285 147449 309828 -18589 64204 174078 96335 38317 -133386
10247 -36389 -105286 259797 75340 -52580 -153245 -83747 -257696 -66966 6142 -229833 38836
10235 -71273 -161643 -357113 -145028 4325 40139 -192606 100465 99460 -162578 -90258 -136619
10224 -136619 26902 8338 556626 152935 156493 325584 -217533 -293 -178819 4265 -130394
10212 11310 -156293 5689 -41618 -211284 -205785 -57342 178894 -418172 -114634 3004 227965
10201B27965B7979g4377b2799r3761L0920g272j05931A45679h0878b3835A12884
10189a84233g9032F8156K18462j11728e4936C992f3402L1190j38227k3618j11127
10178c05184I3436f9811A9170f31434a5744l16424h8844k3709H5296D0551a73834
10166A35437f0278B0033c59942f9163n1500r3697a00952E8506H047i8907j70622
10155b69529A0270K02453b96009a24627k02665A9573J7709J66475r9781J39368
10145B43344c55317J08379r763f03q0413j22603K6504h8123j587k09294q1114
10134c80118j368J84223D13122a25428d5673m3517k5606G7321l6862N9416f7650
10122g1261j51976A57019E0207a43218L4858j01599A50608d08768b04236n0393
$$ plain form
10201 227965 27979 -74377 -22799 -116560 -85640 -7272 -113203 145679 -80878 -23835 112884
10189 -184233 -79032 68156 286618 174890 -54936 3992 -63402 -32212 -170439 -194057 -305184
10178 -305184 93436 -69811 19170 -631434 -15744 -332168 -88844 -112553 85296 40551 -173834
10166 135437 -60278 20033 -359942 -69163 -120663 -214360 -100952 58506 8047 -98907 -269529
10155 -269529 10270 212723 -296009 -124627 -327292 19573 37282 203757 103976 243344
10145 243344 -355317 -246938 -256701 -603 -81016 -203619 -177115 -88123 -89710 -299004 -380118
10134 -380118 -381486 -197263 413122 -125428 -45673 -89190 -114796 77321 40459 99875 -67650
10122 -71261 -223237 157019 50207 -143218 -108360 -209959 150608 -408768 -204236 -254629
10112b54629O4546H3136L3705R1502b28228j13339i8322n5962o8485n319O3991
10101a64097M3013M5597j36688a01424C51106I4709L1369F0457b04929R4330M478
10090a06121n5299F7893J50693e0178B56634N334A24988l5489a24238M2012c3998
10078H9026b27109J13314o0032A40173a56397b0051B35240C0763J55107D9903
10067c5492j12582I4814L8432a77845k44110a59165d662k6388D55060D9035J00421
10056A49456a83979B02085a65701p6508a03419H5468a25495r999C4154d647I3353
10044b67406B8902J00403J74173b20778d8260l40411B98737a13209e3224m63741
10034e16965a63139g9303j29793c996j36504E736b46991f5311a8917A53527d494
$$ plain form
10112 -254629 -190083 83136 116841 208343 -228228 -341567 -98322 -154284 -222769 -228088 -164097
10101 -164097 -121084 -75487 -212175 -101424 351106 94709 126078 60457 -204929 -110599 -106121
10090 -106121 -161420 67893 218586 -50178 256634 261968 124988 89499 -124238 -82226 -33998
10078 89026 -227109 -113795 -173827 140173 -156397 -20051 235240 30763 185870 49903
10067 -35492 -148074 94814 133246 -177845 -421955 -159165 -4662 -31050 455060 49035 149456
10056 149456 -183979 202085 -165701 -242209 -103419 85468 -125495 -135494 34154 -4647 93353
10044 -267406 28902 129305 303478 -220778 -48260 -388671 298737 -113209 -53224 -516965
10034 -516965 -163139 -79303 -209096 -3996 -140500 5736 -246991 -65311 -18917 153527 -4494
10022H166a2538A19974J02873c70302a71388A67233c70823C64581e1602m2751
10012i4353k08090A36449e7093J6863j08448j07900a04331M5410q8297A25448
10001c34702F7438d439j59089b5168q4604j95904R1779k6477l7028j13918f6924
9989c67845A06614J38141h8168N30j11565e8230r3416l1959N6622A77909k4805
9978A53104b26149a8447l6055A20113c1112C04264a66135I6984b43438D1848J3725
9967E5573B2068P6887l6783L6261k4148b81568A00854k9967g5027j11886f4394
9955A33763J20019a86381Q6480q494A07156e352j42667l03378J04448e4283o9047
9944a23330q2052A09206b52699A13902a79487j53755A01076M5410b92274L0958
$$ plain form
10022 8166 -12538 119974 222847 -370302 -171388 167233 -370823 364581 -51602 -94353
10012 -94353 -302443 136449 -57093 -40230 -148678 -256578 -104331 -58921 -147218 125448
10001 -334702 67438 -4439 -163528 -25168 -109772 -305676 -213897 -240374 -277402 -391320 -66924
9989 -367845 106614 244755 -88168 -87638 -199203 -58230 -151646 -183605 -126983 177909 153104
9978 153104 -226149 -18447 -54502 120113 -31112 304264 -166135 96984 -243438 41848 55573
9967 55573 22068 98955 62172 98433 74285 -281568 100854 70887 -75027 -186913 -64394
9955 133763 253782 -186381 -99901 -108395 107156 -5352 -148019 -451397 -346949 -54283 -123330
9944 -123330 -205382 109206 -252699 113902 -179487 -333242 101076 146486 -292274 -261316
9934b61316B49499A22322a87960F9993J6619c1198D9283c4202l091k08444d1403
9922a65724L4082j80649b3622n67988b20241c0768m72621K36196a04067r2551
9912a96618M7624C6699a06831k60072F1388j1542c3251r3576F3278h1358K7767
9901e3591k16738a22420N2678A5466b74205J27826C655J32754C4042A4199R0524
9890A04723J45842a75824I5415a16387N3508j09743f571E6609a13486d8147q8386
9879a36533M6268A45862d4924A16997L5505E387J42018J71051p4823b54936A21497
9867a68130o061j06027e4582B34158l4080b21493Q7423Q699L1528n5181J4248
9856a34776j04941M3921P0435k49968B41127c55742d5671j8624j97147O1846e9676
$$ plain form
9934 -261316 249499 122322 -187960 69993 86612 -31198 49283 -34202 -37293 -245737 -41403
9922 -165724 -131642 -312291 -23622 -591610 -220241 -30768 -503389 -267193 -104067 -196618
9912 -196618 -148994 36699 -106831 -366903 61388 49846 -33251 -126827 63278 -81358 -53591
9901 -53591 -270329 -122420 -69742 15466 -274205 -146379 3655 136409 34042 14199 104723
9890 104723 250565 -175824 95415 -116387 -62879 -172622 -6571 56609 -113486 -48147 -136533
9879 -136533 -90265 145862 -44924 116997 152502 5387 147405 318456 243633 -254936 121497
9867 -168130 -174191 -280218 -54582 234158 200078 -221493 -134070 -125371 -93843 -149024 -134776
9856 -134776 -239717 -195796 -125361 -375329 241127 -355742 -45671 -64295 -261442 -199596 -59676
9844i4432L6216j74287e2224n5459k46993J19407a13321n1827G8267c56840c0722
9832b31264Q4213l37293B42451q5831K1386a37587f2342K5272J4213A58471e8720
9820c8259I0823d0434j36574g15l20230E3400b67042a23475k9954a4943F1267
9808b1726k19223R0657A09042J1545b74604H9673b7344C4680b2364A60366l091
9797A57275d0776l00698k02313e2143r4464A2647J26697M6471H1318J26929b85524
9785D5284c3612j44323c7884A04654a67874f9441a5803r7743a1016j56856B42042
9773A2358f4887e36j70319C11359B7623a1101n252j56838H0898i8834A66779a8863
9760a8637C6373L6366k9703b97516A30990a20164g068o5461l7026K9490I8761
$$ plain form
9844 -94432 -58216 -232503 -52224 -107683 -354676 -235269 -113321 -165148 78267 -356840 -30722
9832 -231264 -147051 -484344 242451 156620 178006 -137587 -62342 -37070 -22857 158471 -58720
9820 -38259 90823 -40434 -177008 -715 -320945 53400 -267042 -123475 -153429 -14943 61267
9808 -21726 -240949 -150292 109042 120587 -274604 89673 -27344 34680 -22364 160366 157275
9797 157275 -40776 -341474 -543787 -52143 -146607 12647 139344 185815 81318 208247 -285524
9785 45284 -33612 -177935 -37884 104654 -167874 -69441 -15803 -113546 -11016 -167872 242042
9773 12358 -64887 -536 -170855 311359 27623 -11101 -16353 -173191 80898 -98834 166779 -18863
9760 -18637 36373 72739 43036 -297516 130990 -120164 -7068 -72529 -109555 -80065 98761
9748f8451b4814A16156J88766G2459A4930a48196E167J70168L3762f0178j2924
9737g3102B7104c7691j41662N0112e7697j31404B09507a80482k13000c3769O744
9726b7025j02173B13914c49566L2516B07578i5469o0658A70769f7212j49837B639
9714a34062k34805c606l47598B55585B4059b1011k4872k73311D1869a60556C0022
9702A9185M11397b41756B6607b49508A1427f771B2693a4282D5539a60570A38863
9690a58526j4258M4638A33600a26296E9123c73407D8522e3553B12538G8401b40014
9678a33161B24336c91345F0315b24144F0281e8638F7260a80904b9571l34466A81342
9666d5217j25661A09849a12106K0297c7482k4640o2356j38405N5749J3050B17827
$$ plain form
9748 -68451 -24814 116156 304922 72459 14930 -148196 5167 175335 209097 -60178 -73102
9737 -73102 27104 -37691 -179353 -129241 -57697 -189101 209507 -180482 -393482 -33769 -27025
9726 -27025 -129198 213914 -349566 -317050 207578 -95469 -156127 170769 -67212 -217049 2639
9714 -134062 -368867 -3606 -351204 255585 24059 -21011 -45883 -319194 41869 -160556 30022
9702 19185 430582 -241756 26607 -249508 11427 -6771 22693 -14282 45539 -160570 138863
9690 -158526 -172784 -128146 133600 -126296 59123 -373407 48522 -53553 212538 78401 -240014
9678 -133161 224336 -391345 60315 -224144 60281 -58638 67260 -180904 -29571 -364037 181342
9666 -45217 -170878 109849 -112106 -91809 -37482 -62122 -124478 -262883 -207134 -194084 217827
9654b46073B49051f5004K1351q3137H5605c6647p597B4984R0495a65747D4532
9642b5551j4262k4501a6307B95128o478B546J91038f8543b3592k6815C8457L4929
9630G3386h401C4562K91663G1613N4769K8801i3308B23749a07906A51844c3562
9618c67362A704f7779C46502H0703g170C3174a87543c8337j51476A41121b02758
9606b38057A62482b08086J1765m3784M4137F6347a02876c4452j4487j75025A64543
9594C42361a61666L1846A36299M836F0086b9017j07306K3215p9457c2704j53643
9583a86347A68748c43078D2186J39122b05000i6373l8730M5345k99415a02718
9572a17206A34536a64782j10142b54j11274n9672j10099k17455b26566f7034k3836
$$ plain form
9654 -246073 249051 -65004 -43653 -126790 85605 -36647 -44244 24984 115479 -165747 44532
9642 -25551 -39813 -64314 -16307 295128 288650 2546 193584 -68543 -23592 -50407 38457 73386
9630 73386 -8401 34562 326225 71613 126382 155183 -93308 223749 -107906 151844 -33562
9618 -367362 1704 -67779 346502 80703 -7170 33174 -187543 -38337 -189813 141121 -202758
9606 -238057 162482 -208086 -196321 -240105 -195968 66347 -102876 -34452 -48939 -223964 164543
9594 342361 -161666 -129820 136299 141135 60086 -29017 -136323 -113108 -192565 -32704 -186347
9583 -186347 168748 -343078 42186 181308 -205000 -96373 -135103 -89758 -389173 -102718
9572 -117206 134536 -164782 -274924 -254 -111528 -171200 -281299 -498754 -226566 -67034 -90870
9561i0870q7892B9435a80783j54214D6950k1518b08437B7548a92257d3614C652
9549e0725j70235i3936J5085A79018K5394g1218i399j1514n57134h4534j43788
9538b28322H1053g2237j21991A9720M2778Q8125c9107A48846a76514G742Q5096
9527I2838c35296J22664g3539q0663B20636j3758p8412l4642a06l59328p158a15234
9514F6951i2952a0757k62375B9882n764a29196A14644a83992A77965a33555L869
9503a29686A67344G6481g6745b0480o0050j98369F2526F328a07224B0972J46780
9492A67752d7696a5394A71369a25021j92903a14597I7820J62804b08385A21245
9481a75447a6221j03076q8866J03154C4740g0861o9235k2934c8274p515l10499
$$ plain form
9561 -90870 -178762 29435 -180783 -334997 46950 25432 -208437 27548 -192257 -43614 3652
9549 -50725 -220960 -93936 -78851 179018 204412 -71218 -9399 -20913 -578047 -84534 -228322
9538 -228322 81053 -72237 -194228 19720 62498 150623 -39107 148846 -176514 7742 92838
9527 92838 -335296 -212632 -73539 -154202 220636 206878 128466 93824 -106 -359434 -366592 -115234
9514 66951 -92952 -10757 -273132 29882 24118 -129196 114644 -183992 177965 -133555 -129686
9503 -129686 167344 76481 -76745 -20480 -80530 -278899 62526 6328 -107224 20972 167752
9492 167752 -47696 -15394 171369 -125021 -317924 -114597 97820 260624 -208385 121245
9481 -175447 -16221 -119297 -208163 -105009 34740 -70861 -140096 -163030 -38274 -45789 -356288
9470c56288A7636c78401R6471B96955e4421q0595L8414A24760b0042n0688j11253
9459a81983M8668c0164I4761J42659a20836A92526p9477K1564B8841d69390K00843
9448b68547L1305J11827c1106I2103b15774P6814F2984j297c03523G6649a9876
9436c9562A95656p8545m8292b97248A7506M0515P0198J29453b47049A60045B7179
9424d5885J1731B73693b02835C7953c95669B08104m8850a62448l4047j0144e8793
9412D7981b89890j01035g0693K8484j82227b7013k51082J13473A01599J41031
9402B42630G3430a03823A27719b38723L6590K978A29675e0946B2954b28334A06269
9390d08512J36097a06407A6024g0874l29842i8892J5028l5385p928A27013h1396
$$ plain form
9470 -356288 17636 -378401 -281930 296955 -54421 -135016 -96602 124760 -20042 -70730 -181983
9459 -181983 -133315 -30164 94761 237420 -120836 192526 113049 134613 28841 -469390 -268547
9448 -268547 -237242 -125415 -31106 92103 -215774 -138960 62984 61687 -303523 76649 -19876
9436 -39562 195656 117111 68819 -297248 17506 58021 128219 257672 -247049 160045 27179
9424 -45885 -34154 273693 -202835 37953 -395669 208104 159254 -162448 -196495 -206639 -58793
9412 47981 -289890 -390925 -70693 -42209 -224436 -27013 -278095 -164622 101599 242630
9402 242630 73430 -103823 127719 -238723 -202133 -199155 129675 -50946 22954 -228334 106269
9390 -408512 -272415 -106407 16024 -70874 -400716 -98892 -83864 -119249 -127177 127013 -81396
9378a36152j94487h8510m0952N1776A08639b86859i704B0269e8895m6675A48460
9366C64542j22969b39674a07627A08968a2220o5938j1835F8585R7680F9308a95986
9354F0932g8990J444J7866a8372j89770O1566O2128A51805a35050K2789j10739
9343b23000N5618q4735B75670a44092a0092j11183A03395M9506a41637H5966a26956
9331c0124A01287k2229a95282d3002l3140k04521f4221A1070a60164A3017b23251
9319b34405p699k3747g5500A84054a57581J3206H6436d4797G5802b24574h4583
9307a37840A94654a93244Q3938j44589d590G3050h6711B16188C8896c06140C30990
9295b05553A54208f1565H105a21633j90465B42541c36418D8433h5578k7746l695
$$ plain form
9378 -136152 -330639 -88510 -129462 -77686 108639 -286859 -9704 20269 -58895 -105570 148460
9366 364542 241573 -239674 -107627 108968 -12220 -78158 -89993 68585 166265 69308 -195986
9354 60932 -78990 -77546 -59680 -18372 -208142 -146576 -84448 151805 -135050 -112261 -223000
9343 -223000 -167382 -252117 275670 -144092 -10092 -121275 103395 152901 -141637 85966 -126956
9331 -30124 101287 79058 -195282 -43002 -76142 -280663 -64221 11070 -160164 13017 -223251
9319 -234405 -242104 -265851 -75500 184054 -157581 -144375 86436 -44797 75802 -224574 -84583
9307 -137840 194654 -193244 -109306 -253895 -4590 73050 -86711 216188 38896 -306140 330990
9295 -205553 154208 -61565 8105 -121633 -312098 242541 -336418 48433 -85578 -113324 -117019
9284a17019o9512k72725A37876a6181k18098J10588L3463n9652I24O3105j247
9273F2782N2744b10654N4124C1518P490c1187j14738G1392a81213B65724n1230
9262B14494A7474R2793a34372K2647D5897c717p736j29759c3330n2424r0714D1321
9249G9920l6218a12265k7639k04021J57319f4951B45594f947k43592A05473a26588
9237b49640J21792c2707D4983a26940G066N7086b26686H5066b4765j65995I92
9225b51427A6549L55553A36329n8106a24388D8481a7728F6562k4615a42797k94617
9214d37414K13825g0786o0173A0284P496J0529c21077e1165j89224O9443A01279
9202d5941B44262a22513l00389B52653a36098D1990b62740f5445H2963b42502
$$ plain form
9284 -117019 -186531 -459256 137876 -16181 -234279 -123691 -90228 -149880 924 64029 62782
9273 62782 115526 -210654 -156530 31518 39008 -31187 -145925 71392 -181213 265724 214494
9262 214494 17474 110267 -134372 -111725 45897 -3717 -11453 -141212 -33330 -85754 -176468 41321
9249 79920 43702 -112265 -139904 -343925 -186606 -64951 245594 -6947 -250539 105473 -126588
9237 -249640 -127848 -32707 44983 -126940 7066 64152 -226686 85066 -24765 -190760 992
9225 -251427 16549 372102 136329 78223 -124388 48481 -17728 66562 41947 -142797 -437414
9214 -437414 -223589 -70786 -130959 10284 17780 28309 -321077 -51165 -240389 -170946 101279
9202 -45941 244262 -122513 -422902 252653 -136098 41990 -262740 -65445 82963 -242502
9191a83621A62541l0415e580j41222F4548p588M6417A0146c87591f6467r3099
9180a59566A26197c83517a43788G8040i7905b4067l33556A98722a01984r761L2806
9169g8939r2654A34448a82133c1256B1800b05539A13071M9903g2798l00579P4341
9158b99036G4371j6774d714B97725a80453h4313I8515b20248H3027j4568a01459
9146b49989B931a36173G3003c0216A75797a79249D6187r288j424J80165B7544
9134I4265b9700A2946J3823h9506l62594F0057a29253k68603a76945D2874a03243
9122C2411a56589j55125J02042A26318f2925b832q5386L4980E8561b80519e7502
9110A07254l837a11178A61195B6669c4845a2867j69921D1574c28172a02568j09115
$$ plain form
9191 -183621 162541 132126 -5580 -146802 64548 56960 103377 10146 -387591 -66467 -159566
9180 -159566 126197 -383517 -143788 78040 -97905 -24067 -357623 198722 -101984 -111745 -78939
9169 -78939 -171593 134448 -182133 -31256 21800 -205539 113071 162974 -72798 -373377 -299036
9158 -299036 74371 57597 -4714 297725 -180453 -84313 98515 -220248 83027 68459 -101459
9146 -249989 2931 -136173 73003 -30216 175797 -179249 46187 36899 35475 215640 27544
9134 94265 -29700 12946 26769 -89506 -452100 60057 -129253 -397856 -176945 42874 -103243
9122 32411 -156589 -311714 -209672 126318 -62925 -2832 -88218 -53238 58561 -280519 -57502
9110 107254 103417 -111178 161195 26669 -34845 -12867 -182788 41574 -328172 -102568 -211683
9099b11683K2134B1591M0490a23678m1698K9483N5741A4058g9836r6194A22050
9087a03564n1068A0827b59921F966d5802m1884F1115J1175a41961A34880c7073
9075b34855D2987j1633K80309d0950l82188J02263A971d24792a34265J0008k6831
9064a51088A83878n4415g3783E3699E049a3809E150J2387d04474J8207E0240P9947
9052A30187M9348p9860c99257A29916k6275a6631B86310N9224d59428F5342J02098
9041A67440a5823m4653k34615i1545b0837L2B44351b09367B60445L9672r4289
9030B05828c74982b4985A14598a51397l7746A10871c2314A05236a84931c823q455
9019a2278E7162Q7328d1533k34025a33466E490a32540F2316k4346a74814C5632
$$ plain form
9099 -211683 -189549 21591 62081 -123678 -165376 -135893 -80152 14058 -79836 -176030 122050
9087 -103564 -154632 10827 -259921 6966 -45802 -87686 61115 72290 -141961 134880 -37073
9075 -234855 42987 31354 311663 -40950 -423138 -320875 1971 -424792 -134265 -124257 -151088
9064 -151088 183878 129463 -73783 53699 5049 -13809 5150 17537 -404474 -386267 50240 130187
9052 130187 179535 99675 -399257 129916 103641 -16631 286310 345534 -459428 65342 167440
9041 167440 -15823 -60476 -295091 -91545 -20837 -20805 244351 -209367 260445 300117 205828
9030 205828 -374982 -24985 114598 -151397 -189143 110871 -32314 105236 -184931 -3823 -12278
9019 -12278 57162 144490 -41533 -275558 -133466 5490 -132540 62316 37970 -174814 35632
9007b4864j96206L2162G0959f8557p9312K1940L0486A04027c3305R319l50045
8996c74031a04865m2322A73627b41240N9218n6351b2935A02464b13573R1160k48830
8985c71243e4729j34411B5920K70750h3167F9327l1484b1349D3033L1521p891
8974F6663N1093I084a25205A37579K6138J18315C6518a14217B09194D2273M3637
8963H5910C8168c94477b8708j35965F7522a26048d0719k6849C79337h8913J7027
8952g1886B2694b34812B4073b95824I039b50724A19334a83752H3465a7133B14299
8940h975B6030a26541d7835D3652J26684L86068B26289h4734B69087a50842A03803
8928A29238J52766j40016K15679A60485N31434J499260M554533O894191C777067
$$ plain form
9007 -24864 -221070 -188908 70959 -68557 -147869 -125929 -95443 104027 -33305 -23986 -374031
8996 -374031 -104865 -147187 173627 -241240 -182022 -238373 -22935 102464 -213573 -122413 -371243
8985 -371243 -54729 -189140 25920 296670 -83167 69327 37843 -21349 43033 74554 66663
8974 66663 117756 9084 -125205 137579 163717 282032 36518 -114217 209194 42273 85910
8963 85910 38168 -394477 -28708 -164673 67522 -126048 -40719 -67568 379337 -88913 -71886
8952 -71886 22694 -234812 24073 -295824 9039 -250724 119334 -183752 83465 -17133 214299
8940 -8975 26030 -126541 -47835 43652 170336 556404 226289 -84734 269087 -150842 103803
8928 129238 282004 141988 357667 160485 691919 2191179 6745712 13639903 3777067
8918A333990F42444k58773e6858C43545e5558I3443a55668E5351d47911D23496
8907C79940A11097k2743b30770q0873C9828L23214b8015A97560b21679O0038g8962
8895F5632a08246j94914P7832h3804j4090m738A57012h8383p7109a0923l3456
8884d4379p5400M3078j52507f2047c0077j0545p6112f777k23343B8205d57544
8872a6234o7709k68305J68865G1271a78408B74120j23455a262k9245o5762A03340
8860f8146G1442c17693E7149b91211i5482o3566f6584B3883J51333a60721M1370
$$ plain form
8918 1333990 642444 383671 -56858 343545 -55558 93443 -155668 55351 -447911 423496
8907 379940 111097 88354 -230770 -311643 39828 363042 -28015 197560 -221679 -161641 -78962
8895 65632 -108246 -303160 -225328 -83804 -97894 -102632 157012 -88383 -165492 -10923 -44379
8884 -44379 -119779 -76701 -229208 -62047 -30077 -40622 -116734 -6777 -230120 28205 -457544
8872 -16234 -83943 -352248 -183383 71271 -178408 274120 150665 -1262 -30507 -96269 103340
8860 -68146 71442 -317693 57149 -291211 -95482 -159048 -66584 23883 175216 -160721 -119351
$$ [...]
##END NTUPLES=NMR SPECTRUM
##END=
