
##TITLE=AC1393_COLAH12205_7519463_G75SKz31VO
##JCAMPDX= 6.0         $$ Bruker NMR JCAMP-DX V2.0
##DATA TYPE= NMR SPECTRUM
##DATA CLASS= NTUPLES
##ORIGIN= BRUKER
##OWNER= Administrator
$$ 1.72 TOPSPIN		Version 2.1
$$ 2013-02-19 18:17:33.831 -0500  Administrator@X
$$ Compression mode = diff/dup
##.OBSERVE FREQUENCY= 400.02188249412
##.OBSERVE NUCLEUS= ^1H
##.ACQUISITION MODE= SIMULTANEOUS (DQD)
##.ACQUISITION SCHEME= undefined
##.AVERAGES= 64
##.DIGITISER RES= 22
##SPECTROMETER/DATA SYSTEM= spect
##.PULSE SEQUENCE= noesygpps1d.comp
##.SOLVENT NAME= COFFEE_meoh
##.SHIFT REFERENCE= INTERNAL, COFFEE_meoh, 1, 14.96097
##AUDIT TRAIL= $$ (NUMBER, WHEN, WHO, WHERE, PROCESS, VERSION, WHAT)
$$ ##TITLE= Audit trail, TOPSPIN		Version 2.1
$$ ##JCAMPDX= 5.01
$$ ##ORIGIN= Bruker BioSpin GmbH
$$ ##OWNER= Administrator
$$ $$ E:\/data/COFFEE/nmr/AC1393_COLAH12205_7519463_G75SKz31VO/12/pdata/1/auditp.txt
$$ ##AUDIT TRAIL=  $$ (NUMBER, WHEN, WHO, WHERE, PROCESS, VERSION, WHAT)
(   1,<2013-02-19 18:17:27.737 -0500>,<Administrator>,<X>,<go>,<TOPSPIN 2.1>,
      <created by zg
	started at 2013-02-19 18:05:57.218 -0500,
	POWCHK enabled, PULCHK disabled,
       configuration hash MD5:
       86 BA 57 50 F2 9D 5C 9B 26 00 A9 28 5F 66 2E 89
       data hash MD5: 64K
       47 35 9A E8 FF 09 28 0B 26 D6 01 C8 CF C7 86 58>)
(   2,<2013-02-19 18:17:30.800 -0500>,<Administrator>,<X>,<proc1d>,<TOPSPIN 2.1>,
      <Start of raw data processing
       efp LB = 0.3 FT_mod = 6 PKNL = 1 PHC0 = 0 PHC1 = 0 SI = 128K 
       data hash MD5: 128K
       A9 5A 85 A6 A6 74 FB 5E C6 DD B7 4B C1 55 0B BD>)
(   3,<2013-02-19 18:17:31.940 -0500>,<Administrator>,<X>,<proc1d>,<TOPSPIN 2.1>,
      <pk PHC0 = 253.5535 PHC1 = 0 
       data hash MD5: 128K
       7A 3D 94 F7 24 F0 C0 A4 A4 D1 FB 88 4B 78 02 9F>)
(   4,<2013-02-19 18:17:32.690 -0500>,<Administrator>,<X>,<proc1d>,<TOPSPIN 2.1>,
      <abs ABSG = 1 
       data hash MD5: 128K
       3A D8 66 1F DB 23 C2 6A C4 0C B2 FF C9 EE 0B 5C>)
(   5,<2013-02-19 18:17:32.878 -0500>,<Administrator>,<X>,<proc1d>,<TOPSPIN 2.1>,
      <abs ABSG = 2 
       data hash MD5: 128K
       31 64 2A 29 59 99 0D 89 B6 B1 67 7D 53 B7 B8 D5>)
(   6,<2013-02-19 18:17:33.190 -0500>,<Administrator>,<X>,<proc1d>,<TOPSPIN 2.1>,
      <abs ABSG = 3 
       data hash MD5: 128K
       53 86 CB 43 28 C0 38 DB 9F 90 57 EF AB FB AC BA>)
(   7,<2013-02-19 18:17:33.331 -0500>,<Administrator>,<X>,<proc1d>,<TOPSPIN 2.1>,
      <abs ABSG = 4 
       data hash MD5: 128K
       A5 E9 38 12 1A C5 5B 77 F6 AE 8D E1 99 C3 92 EC>)
(   8,<2013-02-19 18:17:33.518 -0500>,<Administrator>,<X>,<proc1d>,<TOPSPIN 2.1>,
      <abs ABSG = 5 
       data hash MD5: 128K
       CA 56 5F 07 91 0B 04 10 34 83 34 AB 7D C5 4F 1D>)
$$ ##END=
$$ 
$$ $$ hash MD5
$$ $$ 02 66 4A A3 F5 7F D2 53 32 EC FD 76 0E F1 A9 65
##$RELAX= 
##$RELAX= 
##$RELAX= 
##$RELAX= 
##$RELAX= 
##$RELAX= 
##$RELAX= 
##$RELAX= 
$$ Bruker specific parameters
$$ --------------------------
##$DU= <E:\>
##$EXPNO= 12
$$ [...]
150 150 150 150 150 150 150 150
##$TP07= 0
##$TPNAME0= <>
##$TPNAME1= <>
##$TPNAME2= <>
##$TPNAME3= <>
##$TPNAME4= <>
##$TPNAME5= <>
##$TPNAME6= <>
##$TPNAME7= <>
##$TPOAL= (0..7)
0.5 0.5 0.5 0.5 0.5 0.5 0.5 0.5
##$TPOFFS= (0..7)
0 0 0 0 0 0 0 0
##$TUNHIN= 0
##$TUNHOUT= 0
##$TUNXOUT= 0
##$USERA1= <user>
##$USERA2= <user>
##$USERA3= <user>
##$USERA4= <user>
##$USERA5= <user>
##$V9= 5
##$VALIST= <valist>
##$VCLIST= <CCCCCCCCCCCCCCC>
##$VD= 0
##$VDLIST= <DDDDDDDDDDDDDDD>
##$VPLIST= <PPPPPPPPPPPPPPP>
##$VTLIST= <TTTTTTTTTTTTTTT>
##$WBST= 1024
##$WBSW= 4
##$XGAIN= (0..3)
0 0 0 0
##$XL= 0
##$YL= 0
##$YMAX_a= 6421758
##$YMIN_a= -11010696
##$ZGOPTNS= <>
##$ZL1= 120
##$ZL2= 120
##$ZL3= 120
##$ZL4= 120
##$ABSF1= 14.96097
##$ABSF2= -5.597212
##$ABSG= 5
##$ABSL= 3
##$ALPHA= 0
##$AQORDER= 0
##$ASSFAC= 0
##$ASSFACI= 0
##$ASSFACX= 0
##$ASSWID= 0
##$AUNMP= <proc_prof1d_extract.lims>
##$AXLEFT= 0
##$AXNAME= <>
##$AXNUC= <1H>
##$AXRIGHT= 0
##$AXTYPE= 0
##$AXUNIT= <>
##$AZFE= 0.1
##$AZFW= 0.1
##$BCFW= 0
##$BC_mod= 0
##$BYTORDP= 0
##$COROFFS= 0
##$CY= 15
##$DATMOD= 1
##$DC= 0
##$DFILT= <>
##$DTYPP= 0
##$F1P= 0
##$F2P= 0
##$FCOR= 0.5
##$FTSIZE= 131072
##$FT_mod= 6
##$GAMMA= 0
##$GB= 0
##$INTBC= 1
##$INTSCL= 1
##$ISEN= 128
##$LB= 0.3
##$LEV0= 0
##$LPBIN= 0
##$MAXI= 10000
##$MC2= 0
##$MEAN= 0
##$ME_mod= 0
##$MI= 0
##$NCOEF= 0
##$NC_proc= -2
##$NLEV= 6
##$NOISF1= 0
##$NOISF2= 0
##$NSP= 0
##$NTH_PI= 0
##$NZP= 0
##$OFFSET= 14.96097
##$PC= 1
##$PHC0= 253.5535
##$PHC1= 0
##$PH_mod= 1
##$PKNL= yes
##$PPARMOD= 0
##$PPDIAG= 0
##$PPIPTYP= 0
##$PPMPNUM= 2147483647
##$PPRESOL= 1
##$PSCAL= 4
##$PSIGN= 0
##$PYNMP= <proc.py>
##$REVERSE= no
##$SF= 400.020009648008
##$SI= 131072
##$SIGF1= 0
##$SIGF2= 0
##$SINO= 400
##$SIOLD= 131072
##$SPECTYP= <>
##$SREGLST= <1H.CDCl3>
##$SSB= 0
##$STSI= 131072
##$STSR= 0
##$SW_p= 8223.68421052631
##$SYMM= 0
##$S_DEV= 0
##$TDeff= 65536
##$TDoff= 0
##$TI= <>
##$TILT= no
##$TM1= 0
##$TM2= 0
##$TOPLEV= 0
##$USERP1= <user>
##$USERP2= <user>
##$USERP3= <user>
##$USERP4= <user>
##$USERP5= <user>
##$WDW= 1
##$XDIM= 131072
##$YMAX_p= 454270171
##$YMIN_p= -15009
##$CURPLOT= <Network HP LaserJet P1505>
##$CURPRIN= <$Network HP LaserJet P1505>
##$DFORMAT= <normdp>
##$LAYOUT= <+/1D_H.xwp>
##$LFORMAT= <normlp>
##$PFORMAT= <normpl>
##$SURQMSG= 1
$$ End of Bruker specific parameters
$$ ---------------------------------
##NTUPLES= NMR SPECTRUM
##VAR_NAME=  FREQUENCY,     SPECTRUM/REAL,   SPECTRUM/IMAG
##SYMBOL=    X,             R,               I
##VAR_TYPE=  INDEPENDENT,   DEPENDENT,       DEPENDENT
##VAR_FORM=  AFFN,          ASDF,            ASDF
##VAR_DIM=   131072,        131072,          131072
##UNITS=     HZ,            ARBITRARY UNITS, ARBITRARY UNITS
##FACTOR=    0.0627417313425164, 1,          1
##FIRST=     8223.62146879497, -2317,        -64029
##LAST=      0,             -814,            -65075
##MIN=       0,             -15009,          0
##MAX=       8223.62146879497, 454270171,    0
$$ Real data points
##PAGE= N=1
##DATA TABLE= (X++(R..R)), XYDATA
$$ [...]
67868 78747 79601 80387 80900 80994 80597 79824 78958 78231 77725 77470 77532 77922 78455 78835 78866 78606 78290 78095 77911 77452
67848 77452 76737 76340 76841 77924 78420 77577 75997 74894 74662 74672 74347 73748 72994 71885 70510 69680 70119 71520
67830 71520 72987 74157 75366 76855 78515 80452 83149 86794 90821 94398 97118 99108 100720 102356
67816 102356 104285 106395 108211 109316 109659 109375 108461 106788 104347 101393 98351 95565 93021 90400 87520
67801 87520 84643 82152 80048 78085 76289 74907 73838 72648 71304 70339 69975 69560 68368 66588 65000
67786 65000 63901 62963 62079 61667 61940 62438 62601 62517 62710 63389 64228 64813 65004 64924 64830 65062 65853 67091 68399
67767 68399 69525 70561 71651 72686 73450 73996 74667 75748 77230 78858 80213 80752 80167 78839 77694 77353
67751 77353 77613 77914 78036 78048 77863 77345 76784 76739 77344 78204 79085 80256 81858 83384 84150 84089 83670 83173 82416
67732 82416 81198 79675 78117 76506 74545 72094 69483 67318 65992 65450 65473 65976 66843 67630 67811 67377
67716 67377 66851 66614 66464 65963 64973 63688 62457 61771 62078 63266 64522 65103 65118 65207 65580 65823 65675 65471
67698 65471 65629 66038 66261 66099 65666 65034 64140 63047 62094 61693 62067 63175 64701 66039 66510 65872 64683
67681 64683 63980 64443 65878 67513 68708 69373 69797 70272 70822 71230 71304 71157 71130 71402 71801 72115 72414 72884 73499
67662 73499 74120 74797 75634 76445 76923 77139 77421 77655 77179 75685 73899 72982 73366 74376 74889 74228 72608 70932
67644 70932 70050 70026 70224 70092 69665 69227 68867 68576 68487 68722 69214 69856 70642 71501 72318 73233 74510 75845 76361
67625 76361 75779 75134 75704 77531 79645 81406 82841 83884 84263 84218 84423 84958 85090 84426 83571 83234 83317 83343
67607 83343 83256 83303 83562 84047 84862 85818 86290 85968 85372 85070 84776 83810 82173 80470 79029 77798 76962 76833
67589 76833 77115 77088 76679 76595 77114 77459 76799 75324 73796 72500 71192 69813 68650 67868 67342 66949 66716 66669
67571 66669 66801 67150 67707 68301 68805 69367 70207 71238 72094 72476 72314 71744 71192 71279 72249 73541 74314 74394 74267
67552 74267 74145 73626 72555 71686 71968 73374 74905 75686 75672 75297 74805 74171 73430 72842 72668 72842 72937 72581 71909
67533 71909 71535 71983 73237 74820 76147 76769 76607 76109 75944 76233 76267 75341 73736 72493 72276 72866 73715 74513
67515 74513 75049 75052 74518 73936 73810 74073 74207 73818 72892 71644 70402 69491 68965 68476 67669 66705 66156 66355 67042
67496 67042 67678 67918 67744 67331 66923 66734 66837 67170 67653 68195 68574 68490 67905 67263 67172 67803 68684 69175 69069 68646
67476 68646 68246 68009 68043 68523 69413 70241 70443 69923 69077 68353 67982 68107 68780 69768 70658 71305 71957 72827 73825
67457 73825 74818 75805 76669 77072 76959 76834 77150 77662 77873 77921 78397 79242 79508 78532 76922 75944 76133 76875 77260
67438 77260 77030 76641 76664 77271 78250 79363 80548 81723 82591 82866 82659 82399 82285 82012 81199 79938 78788 78257
67420 78257 78373 78708 78754 78381 77916 77664 77375 76414 74637 72864 72244 73176 75024 76812 77983 78519 78579 78248
67402 78248 77535 76506 75449 74889 75345 76917 79077 80937 81782 81422 80169 78600 77317 76738 76914 77542
67386 77542 78263 78958 79638 80112 80006 79259 78407 78112 78422 78763 78701 78444 78486 78922 79376 79488 79328 79285 79714 80655
67366 80655 81767 82545 82752 82693 82898 83489 84040 84194 84172 84385 84675 84368 83166 81641 80653 80550 81149 82174
67348 82174 83359 84320 84767 84849 84963 85261 85711 86520 87932 89504 90199 89561 88407 87941 88498 89569 90720
67331 90720 91915 93022 93672 93822 94087 95167 97130 99373 101267 102657 103729 104455 104415 103365 101882 101010
67315 101010 101110 101500 101488 101306 101487 101716 101048 99260 97319 96349 96604 97557 98493 98824 98369 97721 97983 99735
67297 99735 102439 105070 107060 108396 109124 109235 108938 108662 108741 109258 110085 110850 110981 110109 108419 106469 104665
67280 104665 103105 101810 100834 100144 99609 99242 99287 99984 101303 102981 104762 106486 107993 109098 109798 110463
67264 110463 111531 112906 113859 113800 113014 112360 112370 112983 114081 115698 117540 118798 118837 117870 116669 115809 115397
67247 115397 115274 115211 115077 115127 115867 117351 118858 119627 119704 119649 119615 119319 118788 118446 118340 117898 116793 115509 114662
67228 114662 114173 113627 113133 113233 114007 114876 115393 115715 116076 116262 116075 115990 116744 118231 119426 119641 119421 119746
67210 119746 120700 121515 121799 122029 122623 123200 123241 123027 123322 124272 125251 125824 126333 127309 128667 129752 130007 129387
67192 129387 128312 127407 127173 127703 128667 129641 130412 131027 131703 132731 134221 135862 137085 137608 137659 137600 137596 137822
67174 137822 138672 140323 142165 143175 143009 142422 142408 143153 144052 144565 144784 145190 146092 147397 148798 150089 151234
67157 151234 152131 152421 151791 150553 149696 150071 151598 153439 154838 155542 155568 155048 154431 154352 154985 155753 155991 155716
67139 155716 155499 155735 156371 157250 158320 159459 160441 161249 162230 163762 165828 167964 169575 170302 170213 169679 169074
67122 169074 168621 168535 169102 170430 172250 174198 176177 178185 179900 180801 180760 180257 179962 180317 181437 183077 184646
67105 184646 185607 186033 186510 187413 188534 189475 190081 190386 190530 190863 191800 193363 195139 196856 198614 200393 201731
67088 201731 202209 201884 201062 200056 199484 200180 202248 204659 206468 208040 210264 212884 214664 215224 215606 216700
67072 216700 218052 218867 219452 220804 223137 225642 227636 229270 230980 232827 234634 236416 238317 240201 241600
67057 241600 242194 242278 242649 243925 246024 248327 250306 251820 252880 253417 253439 253293 253583 254841 257214 260317
67041 260317 263335 265508 266724 267571 268721 270358 272313 274503 276955 279462 281527 282821 283571 284401 285873
67026 285873 288136 290863 293366 294965 295531 295815 296995 299678 303347 306914 309822 312436 315394 318835 322389
67011 322389 325701 328698 331419 333851 335991 337962 339959 342103 344358 346666 349232 352607 357151 362376
66997 362376 367165 370945 374393 378648 383951 389448 394214 398041 401252 404234 407357 410894 414761 418588
66983 418588 422269 426244 430990 436401 441846 446695 450681 454030 457490 461970 467744 474084 480032 485521
66969 485521 491364 498089 505243 512086 518633 525504 532846 539967 546313 552430 559456 567729 576378 584468
66955 584468 592167 600462 609918 620091 630136 639702 649160 659147 669961 681303 692643 703869 715461
66942 715461 727853 740828 753821 766732 780093 794478 810000 826327 842860 858996 874643
66931 874643 890515 907459 925427 943628 961802 980699 1000990 1022261 1043693 1065300 1087839
66920 1087839 1111699 1136549 1161998 1187950 1214203 1240358 1266432 1293155 1321273 1350816 1381341
66909 1381341 1412648 1444828 1477684 1510599 1543177 1575798 1609257 1644011 1680027 1717225 1755595
66898 1755595 1794644 1833302 1870938 1908328 1946964 1987306 2028276 2068621 2108177 2147435 2186461
66887 2186461 2224885 2262583 2299690 2335997 2370982 2404386 2436188 2465951 2492885 2516798 2538423
66876 2538423 2558381 2576203 2590851 2601969 2610162 2616072 2619619 2620231 2617574 2611856 2603555 2593011 2580293
66863 2580293 2565303 2547921 2528015 2505458 2480232 2452493 2422461 2390274 2356012 2319870 2282263
66852 2282263 2243761 2204894 2165842 2126322 2085920 2044645 2002935 1961136 1919331 1877857 1837460
66841 1837460 1798398 1759732 1720175 1679612 1639171 1599787 1561365 1523502 1486355 1450356 1415528
66830 1415528 1381547 1348237 1315641 1283809 1252832 1222871 1193923 1165748 1138262 1111723 1086243
66819 1086243 1061412 1036744 1012265 988349 965204 942853 921377 900769 880771 861274 842622
66808 842622 825067 808099 790976 773720 756983 741009 725451 710249 695839 682223 668572
66797 668572 654268 639775 625979 613119 600882 589168 578080 567348 556424 545225 534392
66786 534392 524693 516390 509069 501803 493601 484160 474211 464807 456217 447848 439252 430859 423487 417359
66772 417359 411804 405837 398913 391250 383516 376199 369247 362343 355449 348939 343191 338197 333623 329132
66758 329132 324596 320046 315480 310787 305933 301185 297030 293756 291261 289232 287264 284735 280990 276055
66744 276055 270984 267021 264383 262197 259606 256636 253925 251936 250562 249212 247148 244009 240140 236294
66730 236294 233004 230314 228023 225874 223548 220841 217964 215327 213004 210783 208791 207518 206970 206322 204845
66715 204845 202811 200917 199136 196785 193686 190541 187962 185688 183120 180247 177594 175410 173382 171233
66701 171233 169215 167775 166953 166354 165608 164573 163120 161182 159105 157562 156812 156333 155517 154437 153456 152377
66685 152377 150645 148285 145953 143976 142098 140361 139453 139680 140193 139864 138538 136893 135386 133946 132453
66670 132453 130948 129472 128164 127373 127208 127112 126369 124923 123310 121949 120980 120565 120752 121060 120838 120093 119429
66653 119429 119126 118857 118379 117921 117653 117252 116281 114681 112732 110819 109353 108605 108496 108738 109193 109741 109909
66636 109909 109168 107644 106008 104568 103064 101510 100552 100552 100877 100557 99368 97844 96574 95836 95615 95574 95208
66619 95208 94372 93464 92883 92633 92708 93391 94738 96111 96785 96796 96671 96571 96190 95382 94322 93116 91764 90475
66601 90475 89545 88905 88270 87785 88031 89207 90648 91325 90633 88709 86377 84848 85020 86746 88927 90507
66585 90507 91233 91412 91251 90685 89741 88742 88152 88270 89090 90317 91491 92150 91963 90863 89100 87140 85390
66568 85390 83995 82881 81868 80721 79305 77893 77185 77752 79352 80965 81583 80925 79427 77721 76213
66553 76213 75056 74306 73948 73789 73534 73155 73082 73766 75041 76153 76489 76004 74913 73357 71666 70628 70962
66536 70962 72453 73961 74426 73727 72485 71245 70086 69001 68304 68346 68866 69083 68683 68342 68806 69700 69904
66519 69904 69072 68058 67653 67573 67122 66271 65512 65065 64792 64678 64785 64930 64934 65066 65704 66642 67230 67197 66842 66461
66499 66461 66031 65545 65193 65119 65359 66009 67070 68064 68312 67717 66893 66350 65955 65404 64848 64687 64979 65397 65716
66480 65716 66056 66592 67174 67371 66936 66183 65732 65841 66185 66363 66347 66209 65758 64854 63910 63574 63925 64427 64688
66461 64688 64831 65037 65172 65044 64738 64479 64387 64456 64607 64660 64456 64021 63459 62758 61941 61319 61233 61629 62190 62844
66441 62844 63770 64937 66117 67348 68872 70512 71611 71769 71252 70536 69922 69717 70202 71104 71603 71258 70583
66424 70583 70306 70413 70324 69783 69119 68801 69043 69720 70397 70567 70087 69190 67983 66325 64462 63246 63207 63737
66406 63737 63801 63228 62665 62388 61940 61097 60495 60963 62555 64573 66195 66843 66280 64832 63385 62741 62843 62866
66388 62866 62186 61098 60442 60638 61272 61575 61171 60280 59416 59024 59350 60421 62058 63951 65746 67111 67857
66371 67857 68089 68121 68140 68078 67882 67703 67616 67386 66843 66296 66192 66488 66739 66724 66519 66041 65101 63977 63323 63325 63444
66350 63444 63269 63103 63355 63849 64117 64011 63567 62612 61031 59241 57947 57443 57485 57751 58125 58619 59261 59989
66332 59989 60505 60422 59754 59044 58781 58969 59475 60396 61669 62700 62958 62800 63106 64131 65232 65768 65763 65534 65111
66313 65111 64304 63149 62029 61417 61558 62355 63511 64743 65839 66604 67003 67357 68038 68874 69236 68930 68530
66296 68530 68493 68441 67896 67319 67636 68825 69771 69713 69178 69205 70081 71192 71816 71717 71102 70299 69549 68973 68558 68047
66276 68047 66937 64938 62568 60924 60595 61131 61844 62706 63920 65054 65356 64864 64424 64542 64911 65175 65526
66259 65526 66247 67224 68211 69150 69905 70129 69729 69166 68941 69014 69000 68710 68263 67888 67851 68293 68924 69037 68176 66711
66239 66711 65585 65530 66570 68108 69368 69933 69961 69836 69647 69223 68602 68063 67699 67358 67144 67435 68169 68568
66221 68568 67978 66754 65899 66007 66863 67896 68691 69194 69678 70455 71387 71855 71470 70687 70410 71069 72321 73528
66203 73528 74247 74347 74001 73603 73479 73589 73661 73577 73435 73302 73084 72707 72286 72021 71988 72017 71781 71157 70524 70468 71033
66182 71033 71469 71047 70060 69657 70614 72507 74212 75085 75466 76106 77239 78338 78773 78595 78516 79073 79980 80404
66164 80404 79785 78276 76512 75137 74543 74786 75567 76305 76439 75857 75105 74979 75786 77014 77890 78163 78174 78199
66146 78199 78058 77482 76608 75874 75482 75145 74439 73427 72878 73679 75858 78332 79881 80296 80334 80673 81347 82116
66128 82116 82822 83166 82740 81656 80763 80751 81292 81508 81105 80566 80339 80311 80119 79625 78999 78605 78845 79864 81311
66109 81311 82566 83240 83347 83046 82410 81458 80233 78905 77902 77838 79052 81278 83914 86525 88838 90470
66093 90470 91127 91073 90937 90979 90903 90567 90378 90707 91296 91628 91670 91759 91901 91725 91154 90637 90493 90421 90043 89618 89764
66072 89764 90518 91188 91256 91012 91003 91228 91273 91087 91070 91384 91654 91563 91356 91455 91816 92032 91967 91945 92306 93039 93894 94629
66050 94629 95084 95217 95230 95563 96549 98025 99337 99848 99461 98577 97572 96495 95355 94485 94328 94934 95941
66033 95941 97034 98161 99294 100288 101076 101672 101925 101658 101226 101477 102795 104509 105633 105940 105927 106009 106298 107025
66015 107025 108512 110613 112665 114158 115143 115933 116731 117641 118653 119520 119947 120004 120013 119989 119679 119351 119968 122095
65997 122095 125055 127734 130007 132769 136627 141189 145732 149990 154058 157983 161804 165655 169457 172794
65983 172794 175485 177976 180609 182647 182757 180687 177820 175619 174001 171758 168239 163943 159632 155604
65969 155604 151961 148847 146035 142791 138631 133995 129832 126708 124585 123169 122062 120780 119127 117513
65955 117513 116563 116379 116505 116571 116663 117009 117631 118412 119316 120457 122066 124365 127292 130361 132941 134712 135788
65938 135788 136554 137527 139177 141529 144058 146260 148212 150243 152225 153661 154514 155418 156875 158634 160136
65923 160136 161239 162280 163596 165214 166908 168430 169840 171638 174371 178030 182089 186164 190355 194863
65909 194863 199641 204594 209810 215330 220939 226324 231191 235118 237707 239168 240307 241562 242406 242155 241041
65894 241041 239915 239087 238169 236994 235953 235173 233975 231533 227748 223152 218295 213570 209322 205620 201949
65879 201949 197565 192259 186579 181212 176388 171956 167804 163948 160324 156721 153068 149687 147160 145856
65865 145856 145556 145516 144942 143578 141865 140511 139816 139496 139125 138582 137972 137339 136747 136464 136685 137080 137050 136557
65847 136557 136277 136627 137012 136514 135153 133979 133920 134964 136599 138574 140908 143412 145658 147457 149078 150829
65831 150829 152556 153790 154379 154735 155316 156040 156568 157160 158808 162217 166941 171922 176763 181980 188003 194453
65815 194453 200671 206590 212626 218810 224399 228408 230299 230178 228556 226090 223406 220913 218667 216381
65801 216381 213600 209996 205622 200943 196592 192992 190110 187543 184879 182137 179886 178754 178672 178707 177909
65786 177909 176364 175142 175141 176246 177841 179875 183000 187659 193508 199877 206441 213240 220430 228371 237639
65771 237639 248400 259846 270761 280663 289798 297872 303442 305074 302739 297559 290431 281453 270628
65758 270628 258478 245801 233218 221249 210536 201721 195181 190995 188972 188612 189263 190627 193110
65745 193110 197520 204391 213578 224396 236050 248057 260441 273530 287475 301856 315680 327762
65733 327762 337246 344014 348586 351333 351635 348086 339821 327676 313777 299988 286843 273840 260447
65720 260447 246624 232630 218729 205257 192788 181930 172849 165126 158275 152307 147565 144034 141128
65707 141128 138257 135412 133026 131462 130767 130731 130968 131087 131047 131222 131873 132668 133030 132913 132873 133325 134097 134764
65689 134764 135119 135183 135070 135056 135512 136517 137726 138830 140004 141681 143991 146622 149157 151366 153274 155104
65673 155104 157138 159561 162611 166890 173154 181482 190970 200682 210773 222255 235782 251126 267743
65660 267743 285193 302835 319759 335420 349977 363642 375995 386361 394555 400791 405044 407097
65648 407097 407295 406684 406180 405933 405732 405767 406643 408758 411912 415431 418364 419596 418195 413983 407597 399680
65632 399680 390062 378017 363348 346829 329413 311366 292611 273662 255632 239182 224037 209818
65620 209818 196934 186210 177815 171054 165150 159817 155011 150542 146265 142401 139369 137293 135829 134477
65606 134477 132915 131051 128966 126968 125559 125093 125340 125620 125538 125491 126154 127489 128552 128492 127566 126950 127540
65589 127540 129060 130385 130701 130353 130543 132107 134624 136881 138169 138964 140314 142814 146302 150315 154647
65574 154647 159549 165511 172784 181103 190087 199918 211305 224595 239235 254373 269651 285044 300223
65561 300223 314575 327700 339335 348831 355259 358180 357905 354879 349162 340692 329739 316919 302935
65548 302935 288462 274014 259774 245701 231902 218749 206625 195830 186721 179564 174116 169722
65536 169722 166048 163383 161906 161014 159835 158304 157282 157538 158966 160909 162948 165022 166819 167455 166110
65521 166110 162957 159088 155357 151662 147646 143672 140481 138058 135623 132877 130525 129255 128848 128763 128991
65506 128991 129651 130199 129848 128703 127754 127750 128563 129662 130623 131111 130967 130545 130454 130750 130846 130498 130448 131674 134330
65487 134330 137868 141970 146803 152386 158215 163727 168843 173803 178610 182892 186239 188439 189390 189040 187602
65472 187602 185737 184203 183157 181919 179538 175615 170584 165344 160664 156801 153499 150338 147172 144213
65458 144213 141697 139611 137816 136233 134796 133408 132194 131608 131931 132681 132918 132239 131155 130354 129904 129437
65442 129437 128870 128556 128732 129149 129419 129539 129935 131071 133139 136049 139479 142933 145981 148691 151710 155668
65426 155668 160450 165168 168780 170641 170611 169069 166892 164995 163600 162127 160004 157331 154549 151809 149043
65411 149043 146444 144420 143174 142666 142860 143571 144240 144376 144216 144404 144970 145278 145140 145346 146659 148835 151182
65394 151182 153765 157348 162255 167804 172999 177341 180820 183450 185094 185669 185297 184200 182481 180153 177465
65379 177465 175054 173523 172839 172377 171668 170805 170060 169546 169475 170288 172001 173700 174395 174400 175206 177695 180954 183318
65361 183318 184323 185131 187063 190236 193889 197649 201933 207120 212951 219154 226247 235007 245180 255384
65347 255384 264544 272750 280258 286284 289570 289923 288401 285955 282619 278219 273177 268164 263376 258557
65333 258557 253516 248212 242509 236154 229032 221317 213426 205891 199129 193275 188370 184681 182507 181554
65319 181554 180871 179623 177710 175549 173600 172276 171875 172160 172300 171649 170388 169053 167708 166091 164339
65304 164339 162935 161973 161079 160126 159443 159179 158986 158624 158443 158950 160230 162092 164506 167583 171314 175595
65288 175595 180331 185336 190301 195051 199586 203624 206386 207247 206529 205333 204555 204268 203963 203093 201379 198869
65272 198869 195871 192771 189861 187310 185174 183373 181736 180148 178566 176862 174848 172561 170396 168774
65258 168774 167803 167305 167020 166706 166277 165987 166198 166796 167156 166958 166700 166969 167390 166800 164510 161082 157870 155962
65240 155962 155435 155354 154588 152868 150893 149294 147900 146382 145099 144590 144561 144271 143855 144307 146009 148085 149507
65223 149507 150089 150092 149624 148932 148577 148746 148888 148577 148236 148402 148783 148727 148250 147847 147544 146953 146141 145695 145914 146574
65203 146574 147494 148637 149552 149397 147888 145809 144303 143895 144328 145017 145520 145783 146105 146695 147305 147546 147483 147565
65185 147565 147998 148582 149203 150092 151460 153257 155336 157536 159543 161089 162384 163918 165770 167565 169231
65170 169231 171186 173515 175550 176729 177367 178044 178657 178846 179085 180527 183588 187333 190621 193447 196864
65155 196864 201727 207797 213980 219322 223802 228245 233501 239776 246851 254720 263720 274042 285508 297955
65141 297955 311636 326984 344122 362770 382512 402892 423213 442501 459918 475291 489229
65130 489229 502659 516183 529619 541991 551933 558266 560390 558265 552202 542921 531766 520461 510183
65117 510183 500679 490475 478059 462930 445636 427029 407652 387787 367911 348902 331607 316212
65105 316212 302267 289389 277653 267098 257245 247620 238599 231074 225129 219665 213675 207425 201890
65092 201890 197399 193447 189667 186288 183540 181225 179176 177717 177214 177421 177635 177466 177084 176758 176512 176330
65076 176330 176392 176823 177332 177343 176502 174949 173104 171288 169592 168051 166871 166377 166627 167145 167273 166900 166578
65059 166578 166710 166933 166668 166036 165690 165815 165974 166053 166635 168014 169456 170050 169872 169661 169653 169466 168987 168579 168353
65040 168353 167915 167016 165849 164507 162767 160709 159050 158452 158792 159383 159621 159148 157776 155594 152982 150350
65024 150350 148066 146642 146445 146993 147088 146136 144919 144542 144964 145200 144739 144102 144061 144914 146541 148632 150695
65007 150695 152246 153216 153947 154757 155745 156999 158657 160711 163025 165556 168292 171009 173419 175539 177610
64992 177610 179607 181223 182361 183220 183829 183913 183463 183015 183088 183616 184257 185028 186320 188418 191243 194482 197746
64975 197746 200685 203157 205205 206761 207497 207123 205703 203484 200546 196851 192552 188022 183699 180037 177457
64960 177457 175916 174664 172888 170686 168932 168052 167420 166315 164999 164231 163990 163430 162156 160811 160086 159685
64944 159685 158780 157098 155045 153057 151428 150615 151005 152260 153476 154209 154863 155848 156841 157273 157167 157082 157398
64927 157398 158052 158831 159551 160018 160114 159951 159795 159879 160356 161180 161892 161838 160944 160056 160165 161430 163214 164810 165760
64908 165760 165778 165066 164615 165558 168057 171276 174474 177608 180750 183596 185917 188047 190526 193595 197374
64893 197374 202229 208485 215871 223584 230869 237400 243253 248697 253875 258517 262196 265007 267662 270646
64879 270646 273551 275619 276675 277028 276623 274915 271662 267358 262642 257702 252475 247095 241823 236809 232333
64864 232333 229074 227626 227670 228031 227804 227144 226691 226464 225712 223791 220742 216912 212445 207459 202416 197823
64848 197823 193645 189391 184866 180483 176750 173741 171213 169021 167189 165759 164734 164135 163957 164137 164614
64833 164614 165321 166120 166871 167588 168280 168634 168244 167376 167092 168209 170300 172174 173241 173959 174940 176202 177530
64816 177530 179109 181319 184094 186917 189512 192228 195586 199740 204525 209910 216063 222998 230415 238071
64802 238071 246119 254887 264342 273889 282627 289636 294109 295582 294179 290426 284665 276858 267218 256840
64788 256840 247344 239753 233860 228755 223822 219150 215143 211965 209445 207434 206151 206003 207019 208542
64774 208542 209683 210201 210792 212362 215059 218220 221336 224775 229308 235044 241278 247455 253881 261189 269411
64759 269411 277994 286582 295239 303778 311341 317054 320934 323851 326594 329216 331340 332986 334782 337202
64745 337202 339745 341286 341374 340780 340401 339879 337885 333651 327669 320833 313477 305453 296636 287053 276999
64730 276999 267328 259226 253254 248951 245657 243308 241994 241258 240488 239733 239383 239253 238738 237826 237204 237284 237812
64713 237812 238641 240180 242795 246300 250380 255010 260080 265030 269267 272605 274958 275931 275141 272704 269040
64698 269040 264457 259252 253906 248688 243286 237316 231117 225532 220929 216876 212823 208762 205098 202226
64684 202226 200356 199524 199584 200294 201464 202948 204595 206384 208597 211651 215737 220744 226431 232527 238793
64669 238793 245254 252277 260157 268690 277459 286405 295669 304817 312667 318008 320261 319446 316030 310993
64655 310993 305499 300056 294186 287263 279473 271664 264516 258242 252912 248571 245027 241950 239317 237512
64641 237512 236908 237588 239569 243008 247948 253969 260381 266865 273922 282548 293365 306078 319820 333961
64627 333961 348315 362627 376153 387949 397287 403645 406595 406064 402498 396382 387763 376662 363835
64614 363835 350577 337718 325240 313006 301373 290844 281538 273344 266257 260227 254875 249804 245149
64601 245149 241511 239290 238266 237828 237517 237382 237918 239563 242182 245132 247901 250529 253341 256500 260024
64586 260024 263952 268225 272550 276695 280755 284846 288659 291741 294136 296391 298930 301789 305003 308705
64572 308705 312672 316221 318932 321149 323431 325695 327335 328011 327782 326443 323290 317871 310614 302344 293372
64557 293372 283540 273133 263148 254380 246576 238976 231550 225233 220834 218128 216247 214651 213442 212885
64543 212885 212947 213292 213494 213273 212690 212198 212389 213690 216209 219603 222986 225224 225718 224853 223418 221704 219456
64526 219456 216620 213645 210952 208528 206265 204412 203332 202976 202917 202919 203254 204408 206525 209142 211429 212846
64510 212846 213682 214896 217245 220498 223559 225418 226054 226494 228026 231268 235950 241497 247676 254578 262145
64495 262145 270032 277999 286219 294999 304261 313388 321593 328344 333440 336729 337820 336270 332163 326339
64481 326339 319926 313694 307956 302830 298315 294268 290713 288057 286511 285350 283343 280113 276567 273675
64467 273675 271322 268731 265565 262086 258608 255476 253390 253051 254365 256528 258950 261584 264301 266589
64453 266589 268218 269707 271655 273889 275690 276642 276856 276498 275664 274759 274545 275560 277753 280859 284906 290070
64437 290070 296229 302988 310126 317723 325802 334166 342847 352568 364482 379444 397670 419055 443609
64424 443609 471563 503354 539688 581539 629928 685699 749565 822268 904578 997042 1099463
64413 1099463 1210119 1325216 1439516 1548280 1649093 1741869 1827035 1903637 1968875 2018961
64403 2018961 2050343 2060800 2050278 2021122 1977219 1922274 1858278 1785125 1701532 1606696 1501765
64392 1501765 1390302 1277387 1167843 1064797 969445 881835 801758 729198 664366 607535
64382 607535 558697 517286 482311 452829 428142 407517 390040 375038 362495 352687 345362 339498
64370 339498 333935 328091 322084 316369 311303 306832 302432 297439 291541 284989 278374 272261 266917 262224
64356 262224 257914 253999 250837 248563 246664 244523 242354 241125 241490 243247 245952 249556 254164 259640
64342 259640 265891 273129 281263 289202 295386 299065 300647 300762 299481 296663 292673 288329 284279 280686
64328 280686 277548 275010 273274 272378 272262 272991 274620 276753 278518 279277 279205 278853 278303 277154 275288 273102
64312 273102 270841 268284 265368 262652 260740 259584 258743 257986 257149 255764 253402 250293 247026 243762 240208
64297 240208 236280 232190 227935 223355 218813 215166 212775 211073 209396 207838 206895 206705 207064 207987 209727
64282 209727 212260 215104 217730 220025 222373 225397 229489 234411 239423 243941 248121 252710 258401 265363
64268 265363 273313 281846 290600 299127 306712 312542 316143 317574 317160 315230 312321 309366 307271 306323 306285
64253 306285 306978 308330 309883 310778 310401 308647 305411 300352 293475 285513 277263 268840 260070 251406 243878
64238 243878 238114 233878 230642 228198 226551 225508 224656 223665 222504 221429 220784 220669 220819 220923 221052 221547
64222 221547 222464 223434 224170 224827 225604 226238 226259 225666 224970 224499 224067 223474 222932 222585 221944 220361 218074 216195
64204 216195 215426 215289 214940 214363 214264 215007 216218 217418 218552 219751 220975 222139 223356 224919 227199 230631
64188 230631 235521 241714 248662 256030 264142 273679 285075 298234 312599 327321 341473 354308 365266
64175 365266 373653 378488 378906 374691 366389 354980 341591 327377 313389 300392 288779 278655 270012
64162 270012 262827 256947 251820 246544 240504 233995 227964 223044 219092 215777 213282 212143 212561 214177
64148 214177 216406 218750 220888 222815 224981 227976 231962 236518 241117 245597 250043 254352 258095 260854
64134 260854 262541 263382 263664 263554 263062 262013 260048 256901 252834 248702 245374 243146 241820 241239 241506 242689
64118 242689 244602 247023 249943 253524 257922 263259 269605 276889 284895 293385 302231 311449 321209 331666
64104 331666 342545 352927 361726 368362 372806 375077 375140 373409 370947 368916 368074 368856 371474 375564 380053
64089 380053 383822 386406 387842 388134 387236 385265 382149 377131 369216 358328 345682 332857 320794 309777
64075 309777 299966 291545 284472 278426 273090 268390 264447 261416 259405 258446 258441 259125 260141 261180 262038 262569
64059 262569 262737 262806 263315 264608 266462 268331 269900 271110 271805 271848 271681 272211 273818 275937 277967 280212
64043 280212 283393 287498 291737 295548 299100 302840 307129 312387 318958 326502 333890 340096 345006 349173
64029 349173 352975 356274 358686 359948 360109 359543 358744 358079 357786 358193 359673 362355 366139 371032 377048 383543
64013 383543 389053 392272 393040 392016 389535 385328 379357 372323 365124 358203 351787 346398 342572 340135
63999 340135 338182 335975 333573 331453 329766 328288 327040 326559 327401 329493 332234 335209 338545 342511 346996
63984 346996 351664 356466 361648 367187 372632 377735 382927 388869 395719 403274 411642 421265 432222 444012
63970 444012 456134 468353 480303 491507 502256 513879 527485 542733 558533 574691 592114
63959 592114 611585 633249 657370 684635 715323 748957 785410 825846 872060 925360 986652
63948 986652 1057205 1138635 1232370 1339794 1462741 1603041 1761409 1937201 2129291 2336638
63938 2336638 2557851 2790861 3033351 3283028 3536914 3790388 4037245 4270672 4484100
63929 4484100 4671578 4828160 4950518 5037196 5088000 5102857 5081081 5021557 4923639 4788142
63919 4788142 4618033 4418513 4196349 3958677 3711960 3461700 3212612 2968691 2733155
63910 2733155 2508645 2297593 2102158 1923816 1763272 1620730 1495759 1386729 1290857 1205358
63900 1205358 1128560 1059705 998039 942586 892747 848565 810136 776945 747995 722510 700239
63889 700239 680995 664002 648057 632545 618075 605817 596283 589050 583548 579546 576918 575556 575816
63876 575816 578493 584021 592082 602310 614875 629967 647175 665973 686392 708673 732539 757420
63864 757420 783072 809241 835030 859406 882266 904143 924840 943176 958192 969804 978011 982344
63852 982344 982582 979340 973284 964160 951224 934387 914395 892009 867526 841110 813168 784216
63840 784216 754569 724325 693685 663324 634326 607552 582950 559667 536894 514516 492958
63829 492958 472657 453765 436149 419511 403638 388662 374959 362743 351830 341895 332810 324701
63817 324701 317733 311865 306797 302181 297882 293929 290159 286148 281690 277154 273154 270039 267853 266490
63803 266490 265562 264423 262795 261203 260335 260072 259601 258294 256036 252939 249430 246468 244828 244085 243004
63788 243004 241091 239059 237626 236619 235571 234450 233353 232106 230646 229275 228134 226914 225507 224386
63774 224386 223859 223534 223076 222897 223390 223945 223621 222553 221836 221996 222324 221854 220458 218850 217895 217977 218721 219280
63756 219280 219195 218883 218999 219489 219714 219433 219208 219744 221178 223065 224784 225958 226720 227604 229019 230952 233273
63739 233273 236036 239116 241919 243959 245578 247585 250316 253506 256907 260384 263514 265848 267699 270003
63725 270003 273165 276672 280167 284199 289459 295776 302500 309473 316886 324363 330911 335980 340023 343761
63711 343761 347203 349624 350296 349000 345988 341724 336701 331292 325696 320095 314897 310659 307622 305374
63697 305374 303186 300798 298769 297964 298743 300711 303116 305363 307204 308708 310163 311898 314019 316308 318453
63682 318453 320374 322224 324024 325483 326408 327199 328586 330744 332961 334402 334989 335199 335349 335577 336356 338343
63666 338343 341626 345654 350027 354803 359777 364086 367014 368690 369441 368849 366071 360945 354252 346942 339626
63651 339626 332748 326657 321303 316256 311215 306328 301984 298514 296094 294660 293882 293456 293462 294233 295903 298260
63635 298260 301080 304346 308158 312595 317684 323272 328974 334471 339905 345751 352289 359380 366800 374609
63621 374609 383128 392644 403158 414377 425993 438074 451063 465313 480794 497430 515551 535819
63609 535819 558820 584831 613699 644754 677196 710994 747157 786594 828671 871125 911214
63598 911214 946554 975188 995692 1007557 1011198 1007674 998701 986761 974349 962791 952023 941526
63586 941526 930935 919680 906678 890731 870907 846522 817529 785321 752506 721217 691902
63575 691902 664158 638290 615295 595562 578395 563005 549484 538628 531129 526991 525485 525640
63563 525640 527065 530304 536033 543953 552819 561679 570630 580223 590572 601478 613106 626009 640538
63550 640538 656670 674545 694847 718481 746116 778063 814378 855002 900122 950342 1005656
63539 1005656 1063466 1117896 1162084 1191753 1206632 1208876 1201022 1185692 1166182 1146150 1128423 1114306
63527 1114306 1103773 1095906 1089175 1081658 1071178 1055474 1032922 1003497 968724 930224 888661 844561
63515 844561 799595 756154 715646 678025 642998 610900 582136 556585 534006 514448 497741
63504 497741 483024 469393 456790 445753 436429 428310 420889 414141 408269 403259 398839 394754 390979
63491 390979 387637 384763 382239 380055 378474 377753 377766 378215 379163 380986 383733 386897 390010 393138 396604
63476 396604 400524 404896 409933 415921 422770 429865 436284 441150 443979 444899 444435 442928 440251 436149 430707
63461 430707 424398 417844 411597 405890 400514 395204 390337 386915 385562 385745 386325 386746 387368 388784 391204
63446 391204 394555 398827 404145 410671 418558 427897 438608 450325 462410 474202 485525 497133 510539
63433 510539 527203 547877 572807 602320 636734 675338 715472 752903 783541 805307 818815
63422 818815 826527 831305 835487 840789 848593 860123 876436 898293 926088 959982 1000032 1045849
63410 1045849 1095843 1146977 1195603 1238519 1273213 1297676 1310852 1313369 1307325 1295131 1278883 1260667
63398 1260667 1242585 1225912 1210511 1195243 1178571 1158656 1133732 1103165 1067892 1029309 988057
63387 988057 944463 899791 856150 815166 777399 743042 712389 685340 661198 639551 620957
63376 620957 606217 595186 586790 580137 575195 572395 572024 574139 578735 585715 594825 605834 618704
63363 618704 633457 649955 668053 687961 710251 735415 763502 794214 827272 862771 901381
63352 901381 944075 991151 1041279 1091859 1140540 1185988 1226811 1260400 1283785 1295749 1297433 1290903
63340 1290903 1277941 1260460 1241087 1222373 1205525 1190289 1175702 1160394 1142460 1119920 1091697
63329 1091697 1058007 1019885 978751 936413 894902 855797 819713 786584 756423 729719 707207
63318 707207 689524 677213 670742 669854 672460 674405 671080 659834 641072 617289 591322 565318 540598
63305 540598 517867 497551 480033 465484 453465 443078 433719 425480 418620 412851 407409 401700 395715
63292 395715 389955 385091 381454 378673 375882 372461 368416 364049 359555 355102 350995 347414 344196 341151
63278 341151 338429 336358 335023 334227 333714 333235 332551 331555 330341 329103 328108 327748 328213 328999 329191 328531 327890
63261 327890 328356 330178 332904 336123 339600 343025 346222 349498 353267 357377 361296 364928 368787 373326
63247 373326 378488 383998 389815 396204 403562 412180 421952 432392 443137 454436 466968 481287 497578
63234 497578 515804 535815 557475 580872 606179 633059 660448 687315 713466 739325 765145
63223 765145 790859 816465 841972 867068 891389 915216 939494 965005 991744 1019024 1045914
63212 1045914 1071553 1095323 1116686 1134750 1148240 1156155 1158139 1153866 1142559 1123836 1098801 1069536
63200 1069536 1037547 1003380 967635 931479 895970 861688 829384 800313 775461 754869 738049
63189 738049 724717 714810 708188 704677 704178 706527 711539 719275 729876 742957 757651 773484 790749
63176 790749 809668 829591 849452 868729 887544 906044 924083 941425 957881 973298 987549
63165 987549 1000400 1011271 1019263 1023558 1023537 1018491 1007655 990888 969010 943184 914163 882409 848587
63152 848587 813566 778170 743371 710493 680665 654012 629769 607251 586430 567558 550675
63141 550675 535757 523047 512886 505167 499148 493949 489198 485129 482052 479810 477842 475692 473336
63128 473336 471081 469310 468303 468121 468620 469745 471730 474835 478877 483268 487574 491770 495924 499841 503199
63113 503199 505876 508053 510066 512218 514603 517107 519695 522605 525994 529439 532189 534058 535772 538162
63099 538162 541194 544009 545833 546611 546722 546297 545092 543188 541562 541429 542907 544810 546075 546947 548239
63084 548239 549916 551177 551758 552262 553162 554318 555687 557699 560607 564103 567922 572204 576927 581698 586562
63069 586562 592354 599678 608127 617200 627411 639639 653754 668809 684477 701470 720508 741681
63057 741681 764963 790697 819308 851031 886210 925441 969169 1017322 1069450 1124978 1183306
63046 1183306 1243980 1306835 1371615 1437389 1502786 1567053 1630616 1694255 1757939 1820820 1882423
63035 1882423 1943468 2005264 2068316 2131800 2194473 2255749 2315379 2372045 2422762 2463979 2493036
63024 2493036 2508389 2508969 2494015 2463512 2418311 2359745 2289483 2209829 2123692 2034024 1943302 1853611
63012 1853611 1766928 1685197 1610171 1543201 1484997 1435591 1394705 1362221 1338179 1322331 1313975
63001 1313975 1312352 1317072 1328031 1344960 1367088 1393129 1421561 1451101 1481130 1511683 1542963 1574787
62989 1574787 1606530 1637605 1667908 1697739 1727308 1756364 1784152 1809430 1830399 1845011 1851828
62978 1851828 1850558 1841438 1824107 1797460 1760739 1714499 1660464 1600773 1537433 1471987 1405407 1338518
62966 1338518 1272780 1210267 1152513 1099601 1050755 1005553 964140 926441 891822 859671 829899
62955 829899 802625 777649 754505 732909 712888 694397 676958 659848 642712 625841 609713
62944 609713 594380 579566 565264 551789 539119 526652 513920 501300 489731 479866 471716 464881
62932 464881 458833 453103 447540 442381 437905 434140 431040 428713 427201 426190 425213 424011 422462 420351
62918 420351 417543 414298 411054 407950 404869 401897 399414 397605 396148 394525 392603 390755 389361 388185
62904 388185 386469 383863 381088 379189 378210 377176 375545 373924 372960 372266 371165 369942 369441 369664 369739 369345
62888 369345 369260 370194 371784 373130 373892 374390 374886 375172 374871 374054 373485 374077 375894 377868 378849 378798 378579 378762
62870 378762 379146 379486 380032 381092 382406 383205 382735 380762 377846 375134 373459 372625 371883 371039 370571 370644 370679
62853 370679 370210 369592 369481 370040 371098 372763 375271 378356 381245 383359 384712 385594 386106 386200 386077 386336 387523
62836 387523 389423 390956 391027 389541 387490 386118 386128 387477 389566 391641 393369 395060 397102 399256 400922
62821 400922 402059 403372 405436 408104 410939 413815 416771 419628 422167 424556 427283 430764 435131 440233
62807 440233 445709 451247 456922 463152 470275 478350 487375 497350 508033 519032 530405 542783 556691
62794 556691 572035 588485 605956 624367 643338 662656 682910 705212 730427 759080 791852
62783 791852 829598 872792 921369 975283 1034923 1100901 1173671 1253403 1339972 1432931 1531592
62772 1531592 1635141 1742412 1851484 1959690 2064049 2161581 2249276 2324148 2383611 2425784
62762 2425784 2449411 2453765 2438858 2405677 2356015 2292065 2216217 2131001 2038867 1941860 1841672
62751 1841672 1740078 1639193 1541093 1447227 1358292 1274652 1196701 1124795 1058992 998969 944202
62740 944202 894250 848959 808356 772223 739837 710357 683510 659624 638973 621385 606568
62729 606568 594379 584397 575614 567088 558805 551525 545818 541630 538698 536849 535869 535551 536062 537880 541214
62714 541214 545774 551258 557725 565362 574226 584503 596712 611374 628627 648435 671074 697152
62702 697152 727233 761544 800029 842603 889371 940617 996477 1056674 1120742 1188411 1259459
62691 1259459 1333183 1408380 1483959 1559115 1632593 1702042 1764394 1816854 1857424 1884820 1898272
62680 1898272 1897464 1882500 1853915 1812672 1760050 1697559 1627154 1551412 1473051 1394103 1315868 1239690
62668 1239690 1167247 1099757 1037322 979482 926060 877049 831991 790162 751340 715879 683975
62657 683975 655323 629575 606717 586783 569518 554526 541486 530022 519570 509657 500247 491590
62645 491590 483721 476243 468675 460918 453383 446692 441287 437192 433994 431092 428158 425506 423889 423814 425086
62630 425086 427082 429299 431380 432774 432806 431247 428657 426048 424271 423645 423941 424652 425458 426450 427827 429524
62614 429524 431441 433866 437185 441182 445192 449189 454161 461079 469863 479697 489971 500511 511308
62601 511308 522656 535379 550304 567528 586709 608110 632805 661671 694613 731021 770595
62590 770595 813411 859434 908314 959558 1012444 1065652 1117153 1164627 1205973 1239567 1264361
62579 1264361 1279971 1286500 1283988 1272126 1250791 1220819 1183877 1141496 1094728 1044959 994446 945345
62567 945345 898381 853117 809462 768279 730488 696268 665397 637719 612874 590002 568314
62556 568314 547868 529463 513870 501312 491408 483353 476286 469726 463567 457672 451780 446021 441188
62543 441188 438090 436700 436137 435443 434364 433523 433883 435860 438876 441979 444778 447437 449882 451658 452761
62528 452761 453954 455965 458843 462438 466985 472815 479942 488425 498750 511366 526178 542934 561739
62515 561739 582754 605825 631010 659191 691498 728197 768565 811601 856383 901997 947714
62504 947714 993009 1036923 1077686 1113563 1143916 1168848 1188091 1200924 1206992 1206459 1199537 1186662
62492 1186662 1169126 1148752 1126963 1104910 1084511 1068387 1058442 1055081 1057976 1066891 1081568 1101681
62480 1101681 1127319 1158931 1196405 1238777 1285211 1335649 1389824 1445815 1499909 1547685 1585376
62469 1585376 1611024 1625015 1629184 1624837 1611535 1587657 1551732 1503285 1443335 1374621 1300855 1225099
62457 1225099 1148988 1073631 1000598 931515 867264 808255 755105 708372 667874 632867 602727
62446 602727 576936 554697 535311 518758 505250 494290 484860 476521 469574 464100 459592 455747 452905
62433 452905 451314 450559 450123 450022 450413 450952 451007 450246 448596 445921 442288 438376 434991 432139 429052 425218
62417 425218 420976 417045 413890 411644 410159 408865 406987 404254 401170 398303 395655 393014 390510 388272
62403 388272 385784 382386 378435 375308 373997 374231 375178 376427 377920 379428 380670 381760 383076 384844 387187
62388 387187 390366 394485 399034 403136 406295 408622 410478 412258 414452 417524 421624 426631 432447 439038
62374 439038 446298 454137 462626 471804 481534 491850 503237 516049 529789 543587 557496 572790
62362 572790 590783 611740 635163 660789 689100 721161 758170 800902 849376 903173 962111
62351 962111 1026319 1095540 1168606 1243575 1317966 1388683 1452220 1505538 1546909 1575943 1593036
62340 1593036 1598977 1594842 1581844 1561001 1532794 1497077 1453662 1403323 1348189 1290775 1232636 1174419
62328 1174419 1117120 1062614 1012556 967198 925679 887205 851613 819055 789610 763157 739256
62317 739256 717116 695900 675186 655074 635880 617717 600319 583328 566863 551720 538719
62306 538719 527835 518231 509158 500540 492698 485916 480409 476310 473415 471182 469220 467602 466573 466167
62292 466167 466247 466663 467220 467773 468506 469840 471910 474417 477098 480010 483161 486300 489373 492826 497091 502030
62276 502030 507178 512217 516919 521063 524938 529593 535905 543535 551392 559101 567410 577101 588137 600208
62262 600208 613625 629259 647840 669670 694946 724045 757423 795397 838146 885973 939553
62251 939553 999781 1067051 1140451 1217595 1295288 1370391 1440113 1501706 1552279 1589363 1611914
62240 1611914 1620701 1617586 1604396 1582425 1552543 1515247 1470618 1418773 1360669 1298267 1233727 1168651
62228 1168651 1104300 1042254 984391 932145 885942 845405 810050 779775 754767 734934 719510
62217 719510 707256 697032 688130 680210 673180 667026 661501 655982 649834 642891 635318 627080 617952 608068
62203 608068 598102 588787 580534 573546 567856 563101 558664 554304 550421 547555 545907 545510 546496 548964 552800
62188 552800 557828 563995 571320 579869 589763 600860 612500 624032 635645 648142 661711 675485
62176 675485 688457 700166 710223 717969 723304 727359 731675 737065 743850 752799 765108 781572 802408
62163 802408 827799 858160 893964 935668 983562 1037148 1094709 1153726 1211452 1264823 1310482
62152 1310482 1345845 1370155 1384100 1388630 1384622 1373234 1355640 1332378 1303546 1269490 1230680 1187146
62140 1187146 1139032 1087840 1036366 987184 941701 900601 864304 832685 805130 781341 761566
62129 761566 745763 733164 723098 715731 711445 709857 710014 711395 714245 718989 725662 733982 743754 755102
62115 755102 768160 782333 795924 806854 813894 817112 817239 815066 811531 807882 805277 804100 803628 802252
62101 802252 798313 791241 782083 772712 764577 758433 754930 754594 757083 761204 766130 772129 779798 789076
62087 789076 799447 810620 822461 834613 846770 859127 871975 885026 897760 910470 924415
62076 924415 940739 959618 980601 1003341 1027653 1053119 1079076 1105022 1130786 1156235 1180997
62065 1180997 1204656 1227190 1249139 1271355 1294694 1319930 1347814 1378943 1413400 1450360 1487950
62054 1487950 1523600 1554810 1579777 1597384 1606937 1608344 1602547 1591161 1575233 1554485 1527925 1494849
62042 1494849 1455061 1408710 1356631 1300622 1242757 1184387 1126251 1069360 1015045 964085 916422
62031 916422 871931 830927 793738 760305 730524 704534 682373 663683 648028 635125 624471
62020 624471 615137 606337 597964 590248 583050 575793 567960 559359 550090 540607 531721 524234 518471 514242
62006 514242 511131 508783 507110 506519 507859 511880 518609 527309 537026 547121 557323 567414 577008 585667
61992 585667 593146 599296 603753 606072 606341 605309 603571 600898 596773 591288 584873 577322 567831 556155
61978 556155 543104 529730 516607 504120 492834 483126 474861 467783 461940 457373 453784 450840 448519
61965 448519 446835 445537 444396 443475 442753 441844 440526 439214 438427 438019 437502 437011 437369 439142 442067 445503
61949 445503 449048 452659 456524 461062 466878 474504 484137 495549 508190 521518 535439 550397 566961
61936 566961 585385 605591 627341 650261 673866 697795 721836 745499 767796 787746 805064
61925 805064 820105 833198 844299 853205 859813 864031 865595 863999 858639 849204 836162 820846 804931
61912 804931 789870 776755 766423 759389 755811 755759 759502 767367 779408 795321 814428 835495 856727
61899 856727 876335 893185 906723 916383 921329 920852 914912 904359 890725 875625 859961 843572
61887 843572 825811 806526 786449 766763 748461 732056 717592 704775 693142 682201 671425
61876 671425 660244 648154 634920 620773 606492 593189 581727 572205 564185 557463 552342 549092
61864 549092 547519 547380 548966 552805 558859 566385 574692 583831 594478 607367 622862 640884 661095
61851 661095 683234 707344 733767 762945 795189 830423 868001 906840 945874 984414 1022031
61840 1022031 1058163 1091808 1121494 1145553 1162648 1172205 1174333 1169401 1157952 1141067 1120487 1098191
61828 1098191 1076024 1055749 1039031 1026996 1020001 1018146 1021802 1031275 1046011 1064542 1085234 1106694
61816 1106694 1127298 1144629 1155852 1158815 1152802 1138197 1115607 1085569 1049119 1008195 965048 921338
61804 921338 878156 836665 797997 762398 729195 698013 669449 644069 621299 600036 580006
61793 580006 561728 545264 529933 515430 502411 491471 482186 473737 466168 460281 456297 453269 450049
61780 450049 446402 442805 439483 436250 433185 430808 429232 427679 425385 422727 420941 420758 421828 423437
61766 423437 425257 427258 429386 431540 433590 435335 436817 438711 441855 446246 450969 455358 459685 464461
61752 464461 469553 474442 478883 482845 486077 488225 489160 488882 487360 484779 481612 478150 474311 470212 466451
61737 466451 463371 460527 457421 454339 451850 449890 448039 446417 445474 445118 444814 444476 444537 445170 446153 447468
61721 447468 449364 451804 454562 457879 462296 467675 473095 477894 482177 486139 489511 492009 493770 495016
61707 495016 495666 495463 494103 491128 486304 480309 474459 469428 464750 459875 455158 451302 448258 445265 441803
61692 441803 438118 434837 432286 430061 427163 422869 417665 413057 410240 409172 409005 408999 408782 408180 407278 406435
61676 406435 405857 405261 404254 402900 401632 400783 400442 400689 401611 403086 404668 405737 405786 404754 403172 401825
61660 401825 401158 401116 401476 402060 402635 403032 403477 404398 405748 406930 407767 409092 411865 415838 419525 421531 421671
61643 421671 420871 420324 420787 422433 425127 428686 432806 436953 440676 444018 447198 449846 451065 450534 449053
61628 449053 447474 445516 442318 437979 433806 430873 428943 427124 425096 423246 421877 420803 419748 418728
61614 418728 417895 417288 416954 417091 417738 418352 418001 416082 412692 408299 403338 398204 393202 388179 382470 375665
61598 375665 368301 361470 355824 351310 347685 344739 342030 339023 335680 332435 329342 325772 321283 316436
61584 316436 312333 309501 307562 305806 303741 301215 298396 295695 293467 291720 290194 288711 287332 286237
61570 286237 285536 285179 284990 284799 284601 284571 284937 285846 287210 288560 289180 288627 287115 285309 283842 283171 283593
61553 283593 284907 286240 286732 286472 286343 286919 288028 289398 291059 292835 294082 294458 294531 295104 296217 297330
61537 297330 298294 299640 301872 304814 307684 309647 310428 310618 311299 313118 315766 318430 320496 321652 321665 320531
61521 320531 318744 316983 315518 314155 312721 311289 309944 308597 307128 305514 303775 301956 300228 298880
61507 298880 298114 297936 298223 298831 299653 300559 301293 301491 300975 300049 299281 298902 298611 298115 297684 297950 299228 301163
61489 301163 302963 303857 303511 302272 301035 300683 301448 302766 303787 304107 304121 304600 305862 307446 308719 309675
61473 309675 310916 312952 315735 318765 321337 322795 322991 322536 322267 322433 322788 323325 324342 325627 326268 325670
61457 325670 324281 322901 321703 320406 319094 318260 318084 318201 318233 318307 318944 320538 322894 325219 326752 327507
61441 327507 328213 329428 330975 332404 333733 335471 338126 341809 346121 350284 353693 356521 359494 362920
61427 362920 366339 369307 372021 374788 377384 379459 381261 383316 385629 387790 389773 392004 394605 397106
61413 397106 399055 400522 401834 403047 403861 403932 403215 402058 400848 399510 397527 394592 391026 387366 383767
61398 383767 380036 376042 371864 367767 364260 361879 360566 359479 357818 355674 353780 352619 352109 351902 351646
61383 351646 351154 350735 351039 352180 353303 353594 353424 353847 355189 356936 358945 361799 365673 369672 372819 375124
61367 375124 377156 378953 379988 380146 380175 381050 383081 385747 388278 390354 392330 394837 398230 402383 406925
61352 406925 411637 416743 422898 430744 440354 451170 462495 473848 484729 494390 502188 508058 512469
61339 512469 516028 519331 522934 527086 531500 535602 539043 541891 544494 547189 549912 551939 552309 550718
61325 550718 547714 543885 539270 533773 527678 521400 515238 509822 506209 504816 504646 504343 503711 503475 503929
61310 503929 504800 506327 509363 514194 520159 526712 534063 542464 551600 561079 570810 580351 588343 593152
61296 593152 593841 590274 582748 572052 559643 547210 535952 526312 518124 510899 504270 498365 493560
61283 493560 489755 486255 482585 479106 476602 475533 475958 477816 480895 484674 488660 492924 498115 504857
61269 504857 513214 522637 532320 541662 550454 558671 566130 572552 577985 583123 589136 597116 607507 619858
61255 619858 633153 646421 658919 669762 677845 682657 685058 686799 689106 691880 694205 695336 695141
61242 695141 693852 691604 688329 684142 679598 675202 670733 665599 659862 654187 648517 641718 633194 624123
61228 624123 616213 609846 604428 600071 597588 596930 596927 596777 596711 596877 596615 595324 593279 591113 589148 587677
61212 587677 587292 588433 590947 594294 597723 600128 600415 598389 594890 590902 587003 583682 581418 580228 579888
61197 579888 580904 584462 591081 600073 610779 623629 639393 658030 678732 700369 721288 739349
61185 739349 753145 762969 770108 775595 780075 784265 788668 793059 796934 800250 803151 805199 805558 803925
61171 803925 800821 797031 793109 789242 785178 780401 774730 768605 762498 756241 749207 740960 731474 720976
61157 720976 709880 698683 687684 677012 667040 658436 651630 646592 643337 642207 643431 646762 651657
61144 651657 657227 661770 663098 659893 652468 642020 629736 616777 604249 592504 581061 569784
61132 569784 559571 551360 545113 540423 537421 536306 536528 537341 538743 541141 544546 548902 554769 562767
61118 562767 572675 583917 596594 611175 627512 645092 663995 684655 706879 730000 753830 778476
61106 778476 803391 827665 851177 874465 897453 919340 939745 958779 975730 988797 996627 999297
61094 999297 997451 991341 981194 967794 952121 934963 917117 899256 881095 861441 839795 817493
61082 817493 796600 777926 760653 743642 726514 709523 692993 677143 662228 648609 636636
61071 636636 626440 617781 610121 602927 596025 589786 584878 581673 579884 578992 578931 579950 581879 584114 586526
61056 586526 589763 594381 600224 607013 614873 623737 632843 641585 650529 660943 673598 688453 705109
61043 705109 723016 741648 761043 781856 804461 828557 854049 881492 911052 941947 973789
61032 973789 1007520 1043894 1081925 1120236 1159285 1200769 1245303 1292057 1340149 1388817 1436754
61021 1436754 1483098 1529116 1577488 1630275 1688964 1755759 1832630 1919265 2014031 2116916 2229820
61010 2229820 2354949 2496072 2661352 2861813 3106665 3403164 3760934 4192416 4709174
61001 4709174 5323703 6057033 6939545 8004096 9287887 10839748 12692435 14780446 16869872
60992 16869872 18606171 19690304 20049920 19858566 19405317 18954897 18701790 18775228 19198682
60983 19198682 19813755 20285590 20252177 19520607 18150182 16372552 14445596 12559984 10826082
60974 10826082 9295317 7978653 6861677 5921221 5135584 4484196 3945572 3500166 3133100
60965 3133100 2831928 2583774 2376459 2200851 2050479 1920000 1805299 1703914 1614230 1534810
60955 1534810 1464885 1404322 1352591 1308755 1272657 1244592 1223290 1205666 1189311 1173941 1159877
60944 1159877 1146686 1134243 1123674 1115948 1110572 1106743 1104739 1105012 1106746 1108561 1110083 1111864 1114298
60931 1114298 1117511 1121812 1127379 1134029 1141936 1151861 1163870 1176554 1188455 1199594 1210611 1220998
60919 1220998 1229335 1234853 1237667 1237739 1234615 1228081 1218157 1204589 1187119 1166167 1142576 1116936 1089833
60906 1089833 1062391 1035674 1009764 984208 959168 935286 912698 891073 870558 851743 834765
60895 834765 819306 805405 793265 782209 770868 758684 746390 734673 723190 711327 699209
60884 699209 687402 676089 665003 653835 642373 630573 618804 607727 597623 588065 578462 568734
60872 568734 559354 550965 543988 538317 533295 528312 523435 519205 515845 513078 510697 508799 507345 505988
60858 505988 504561 503250 502040 500442 498046 494989 491570 487726 483348 478912 475338 473112 471720 470036
60844 470036 467244 463399 459060 454475 449450 444130 439360 435704 432435 428261 422927 417297 411908 406456
60830 406456 401009 396644 394154 392849 391487 389944 389155 389661 391051 392720 394503 396501 398814 401431 403991
60815 403991 405806 406593 407079 408322 410547 413112 415454 417392 418615 418753 418142 417752 417994 418223 417767 416826
60799 416826 415873 414830 413462 412204 411746 411944 411767 410355 407623 403943 399827 395949 392810 390071 386750
60784 386750 382433 377911 374250 371520 368888 365750 362326 359162 356480 354085 351541 348348 344319 339995
60770 339995 336458 334516 334134 334742 335857 337267 338883 340753 343063 345808 348538 350764 352538 354275 356068
60755 356068 357646 359100 361082 363952 367149 369865 372114 374632 377864 381527 385213 388979 393135 397689
60741 397689 402182 405928 408311 408948 407625 404112 398262 390541 382307 375099 369522 365033 360827 356570
60727 356570 352225 347656 342768 337835 333376 329788 327270 325815 324984 323888 321854 319140 316655 314960
60713 314960 313818 312734 311548 310307 308922 307288 305621 304319 303517 303036 302806 303035 303813 304823 305702 306539
60697 306539 307669 309022 310088 310656 311239 312433 314112 315654 316812 317957 319467 321360 323603 326361 329616
60682 329616 332853 335483 337486 339448 342066 345743 350475 355870 361397 366829 372348 378043 383527 388350
60668 388350 392672 397083 401701 405802 408436 409146 407947 404985 400560 395351 390236 385755 381886 378385
60654 378385 375219 372588 370641 369289 368320 367597 367145 367113 367687 368933 370637 372352 373660 374282 373873 371987
60638 371987 368560 364346 360451 357312 354454 351342 348175 345581 343802 342451 340973 339140 337286 336252
60624 336252 336816 338784 340723 341083 339684 337870 337115 337734 338996 340144 341041 342001 343267 344758 346153 347118
60608 347118 347516 347467 347268 347198 347374 347830 348692 350065 351621 352618 352690 352459 352880 354010 354981 355313 355674 356973
60590 356973 359168 361414 363044 363940 364214 364029 363647 363280 362983 362945 363500 364497 365077 364665 363880 363798 364570 365543
60572 365543 366603 368428 371346 374891 378800 383645 390021 397784 406623 416800 428600 441344 453594
60559 453594 464236 472954 479722 484281 486183 485174 481545 476230 470375 464738 459611 455327 452481 451487
60545 451487 452230 454374 457739 462182 467409 473272 480051 488168 497772 508776 521117 534647 548895
60532 548895 563088 576287 587363 595157 599082 599503 597309 593162 587349 580248 572658 565573 559711 555226
60518 555226 551770 548808 545857 542541 538757 535071 532620 532113 532962 533888 534372 534997 536439 538850 542444
60503 542444 547890 555673 565619 577550 591904 609266 629789 653604 681248 712957 747926 785048
60491 785048 824126 865493 908478 950985 990584 1025264 1053052 1071729 1079406 1075180 1059159 1032367
60479 1032367 996742 954753 908678 860460 812206 766205 724089 686254 652370 622229 595833
60468 595833 572948 552971 535279 519521 505626 493637 483458 474640 466484 458480 450622 443194
60456 443194 436313 429843 423801 418606 414657 411646 408602 404886 400952 397785 395690 394016 392046 389672
60442 389672 387134 384622 382455 381098 380598 380325 379717 378974 378575 378397 377847 376753 375569 374761 374441 374625 375369
60425 375369 376488 377494 378036 378258 378616 379389 380339 380850 380526 379669 378999 378881 379174 379905 381593 384559 388285
60408 388285 391761 394201 395187 394731 393653 393374 394650 396783 398656 400146 401842 403842 405707 407350 409004
60393 409004 410409 411071 411343 412245 413993 415653 416541 417115 418151 419910 422547 426449 431488 436578 440662
60378 440662 443736 446351 448596 450205 451316 452450 453937 455861 458352 461365 464332 466532 467840 468753
60364 468753 469799 471261 473323 475996 478906 481515 483672 485746 488171 491073 494422 498421 503605 510495
60350 510495 519103 528910 539491 551050 564010 578066 591984 604399 614482 621705 625380 624873 620213
60337 620213 612329 602717 592832 583498 574734 566261 558159 550843 544499 538989 534325 530763 528185 525845
60323 525845 523028 519688 516219 512874 509637 506467 503415 500754 499081 498984 500359 502351 504266 506323 509346
60308 509346 514027 520669 529286 539610 551306 564587 580429 599801 622566 647123 670875 691054
60296 691054 705655 714033 716483 713129 703604 688040 667920 645468 622466 600060 579403 561819
60284 561819 548232 538631 532038 526965 522287 518020 514959 513261 511765 509114 505147 500632 495998 491136
60270 491136 486226 481876 478271 474928 471532 468393 465760 463237 460313 457129 454302 452236 450906 450091
60256 450091 449454 448565 447227 445712 444396 443235 441888 440331 438970 438094 437573 437264 437415 438318 439767 441251
60240 441251 442596 444012 445437 446275 446044 444993 443812 442992 442713 443067 443999 445155 446213 447288 448712 450523
60224 450523 452505 454564 456687 458678 460437 462369 464963 467983 470693 472945 475468 478921 483235 488112
60210 488112 493658 500224 507981 516791 526129 535087 543031 550342 557962 566094 574020 581351 588545 595776
60196 595776 602214 607139 611057 614946 618865 622053 623972 624500 623551 621393 619051 617499 616463 614689 611300
60181 611300 606273 599840 592264 584212 576566 569684 563330 557300 551540 545739 539583 533490 528420 524747
60167 524747 521879 519181 516667 514562 512748 511044 509617 508652 507877 506753 505121 503451 502514 502832 504299
60152 504299 506249 507978 509271 510418 511848 513835 516302 518744 520508 521426 522027 522955 524431 526513 529507
60137 529507 533705 538960 544956 551643 558958 566426 573646 580964 588997 597561 605634 612398 617713 621682
60123 621682 624411 626308 627939 629367 630100 629885 629187 628822 629485 631580 634934 638650 641813 644477 647440
60108 647440 650964 654287 656533 657486 657216 655605 652712 649133 645555 642115 638536 634596 630289 625735 621179
60093 621179 616870 612837 608970 605334 602110 599273 596739 594761 593663 593149 592507 591618 591154 591526 592275 592867
60077 592867 593498 594648 596335 598201 599866 600696 599748 596613 592068 587257 582432 577061 571014 564927 559275
60062 559275 553690 547510 540661 533733 527341 521665 516633 512317 508932 506366 503960 501106 498048 495787
60048 495787 495103 495896 497510 499414 501416 503536 505928 508844 512527 517208 523064 529880 536790 542820 547812
60033 547812 552438 557155 561614 565274 568111 570298 571548 571245 569069 565152 559772 553321 546406 539594
60019 539594 532957 526153 519033 512018 505780 500578 495914 490877 484927 478337 471798 465690 459913 454332
60005 454332 449060 444322 440285 437078 434717 433000 431689 430742 430105 429468 428673 428292 429184 431417 434102 436387
59989 436387 438125 439547 440938 442905 446293 451417 457645 463992 469799 474790 478998 482770 486222 488559
59975 488559 488624 486406 483202 479985 476466 472303 468272 465357 463427 461778 460465 460001 460119 459914 459137 458408
59959 458408 458211 458530 459423 461051 463029 464528 465153 465143 464743 464151 464022 465040 466744 467697 467245 466401 466524
59942 466524 467735 469145 470098 470515 470356 469393 467546 465013 462088 459080 456376 454367 453224 452772 452544 452109
59926 452109 451588 451759 453307 455978 458813 461324 464081 467978 473236 479411 486144 493624 502304 512237 522689
59911 522689 532451 540654 547205 552312 555824 557435 557414 556664 555946 555403 554833 553996 552534 550076 546688 542962
59895 542962 539460 536340 533667 531660 530373 529513 528912 528912 529876 531520 533185 534735 536783 539973 544332 549413
59879 549413 554844 560583 566766 573452 580454 587328 593518 598604 602578 605843 608754 611005 611644 609945
59865 609945 606253 601702 597203 592982 589060 585624 582681 579743 576312 572539 569053 566246 564078 562571
59851 562571 562120 563199 565962 570270 575968 582926 590860 599175 606969 613182 616909 617759 616053 612668 608727
59836 608727 605330 603291 602771 603020 602692 600695 596828 591558 585370 578554 571545 565100 559895 556056 553205
59821 553205 550834 548565 546204 543763 541457 539582 538417 538093 538375 538610 538252 537493 536991 536838 536248 534558
59805 534558 532037 529250 526120 522405 518765 516379 515340 514302 512094 509001 506070 503720 501652 499658
59791 499658 497821 496070 494168 492165 490402 488991 487684 486262 484757 483295 482079 481549 482055 483185 483837
59776 483837 483288 482005 481098 481159 482022 483511 485855 489129 492686 495638 497834 500001 502834 506192 509344
59761 509344 511792 513638 515270 517018 519102 521597 524271 526641 528417 529865 531587 534007 537227 541267
59747 541267 546149 551603 557013 561917 566491 571234 576165 580568 583683 585468 586483 587154 587408 587037 586190
59732 586190 585299 584551 583628 582105 580094 578337 577496 577416 577282 576549 575497 574723 574257 573484 571920 569822 567957
59715 567957 566885 566574 566661 566965 567603 568615 569678 570506 571437 573139 575552 577645 578667 579299 581009 584404
59699 584404 588800 593337 597885 602683 607648 612346 616329 619322 621441 623390 626039 629505 632949 635484
59685 635484 636992 637789 637907 637180 635831 634516 633739 633387 632869 631619 629540 626991 624205 620796 616204 610593
59669 610593 604823 599393 593960 588229 582739 578298 574943 572039 569119 566187 563379 560965 559535 559645
59655 559645 561182 563520 566283 569565 573434 577670 582080 586720 591656 596738 601680 606119 609537 611367
59641 611367 611308 609513 606478 602744 598553 593659 587676 580813 574030 568256 563646 559853 556705 554223 552204
59626 552204 550290 548362 546464 544415 541960 539232 536601 534079 531316 528194 525004 521893 518570 514690
59612 514690 510200 505258 500153 495505 492155 490556 490378 490866 491512 492295 493384 494673 495673 495953 495724 495696
59596 495696 496199 496737 496699 496220 495892 495929 496155 496688 497944 499856 501676 502784 503324 503848 504695 505886 507210
59579 507210 508165 508041 506397 503404 499701 495978 492634 489540 486098 481767 476629 471321 466531 462747 460292
59564 460292 459153 458796 458549 458201 457932 457731 457374 456982 457053 457770 458717 459498 460281 461491 463316 465708 468620
59547 468620 471936 475346 478522 481398 484249 487527 491507 496032 500844 506376 513840 524114 537027 552464
59533 552464 571669 595927 623377 648255 664358 669268 665060 655778 645011 635301 628318 624763 624291
59520 624291 625933 628751 632224 636124 640060 643184 644547 643755 641053 636743 630837 623322 614467 604713
59506 604713 594543 584512 575026 565938 556802 547743 539647 533146 527792 522664 517548 513046 509708 507495
59492 507495 506089 505308 505110 505376 505841 506187 506232 506072 505965 506109 506613 507632 509301 511546 514263 517663 522086
59475 522086 527372 532799 537803 542410 546787 550762 554107 557007 559860 562737 565321 567257 568408 568866
59461 568866 568868 568560 567797 566393 564656 563369 563170 564258 566799 571150 577341 584718 592451 600153 607725 614939
59445 614939 621586 627768 633649 638985 643180 645556 645324 641667 634423 624596 613743 602860 592155 581753
59431 581753 572145 563905 557330 552437 549078 546985 545835 545295 545076 545261 546746 550892 558300 568211 579538
59416 579538 592167 606655 622919 640150 657979 676820 696943 718327 741848 769063 799089
59405 799089 826051 841585 840943 826297 804111 780309 758279 739895 726596 719582 720070 728936 744442
59392 744442 760106 766853 759043 738274 710875 682492 655779 631855 611679 595606 582988 573003
59380 573003 565307 559663 555657 553063 551898 551863 552352 553210 554830 557280 559974 562549 565429 569043 573046
59365 573046 576821 580316 583906 587799 592056 596932 602712 609360 616615 624277 632234 640480 649301 659086
59351 659086 669807 681084 692974 706148 720957 736830 752978 769259 785853 802529 818839
59340 818839 834725 850349 865472 879482 891892 902331 910209 914902 916213 914276 909092 900653 889534
59327 889534 876859 863429 849134 833432 816346 798829 782138 766899 752926 739934 728166
59316 728166 718078 709648 702414 696076 690642 686017 681974 678541 675958 674178 672949 672502 673566 676599
59302 676599 681496 688225 697187 708791 723112 739859 757739 773675 783665 785255 778876 766659 750774
59289 750774 733221 716068 700765 687482 675742 665320 656161 648063 641056 635562 631582 628264 624872
59276 624872 621698 619441 618320 618382 619983 623223 627572 632878 640036 649682 660854 672010 682766 693450
59262 693450 703436 711356 716743 720177 721820 721080 717747 712280 704807 695051 683522 671696 660598 650094
59248 650094 639921 630553 622659 616447 611894 608952 607204 605991 605191 605225 606113 607260 608506 610563 613937
59233 613937 618093 622282 626572 631387 636410 640653 643498 645072 645642 645113 643265 640236 636514 632454 627914
59218 627914 622519 616291 609813 603765 598628 594803 592511 591258 589980 588156 586314 584983 583787 582259
59204 582259 580914 580579 581092 581777 582930 585555 589639 593892 597484 600929 604902 609176 613214 616960 620464
59189 620464 623416 625638 627483 629259 630756 631853 633070 635000 637504 639966 642119 644187 646375 648529
59175 648529 650238 651128 651173 650822 650646 650856 651389 652416 654404 657650 662085 667545 673939 681153 689047 697458
59159 697458 705936 713721 720333 725926 730556 733433 733601 731174 727140 722077 715890 708808 701741 695431
59145 695431 689905 684939 680364 675786 670712 665228 659936 654986 649777 643823 637354 630825 624374 617964
59131 617964 611583 605175 598852 593291 589370 587265 586420 586374 587051 588227 589477 590801 592720 595640 599722
59116 599722 605318 612760 621659 631262 641527 652976 665355 677475 688619 699191 709657 719805
59104 719805 729500 739168 748972 758279 766471 773609 779901 785271 789822 793909 797287 799091 799154 798437 797560
59089 797560 795905 792948 789582 787167 785972 785479 785515 785964 785768 783387 778217 770832 762002 752151 741575
59074 741575 730496 718970 707228 695940 685690 676380 667555 659050 650975 643364 636245 629753 623846
59061 623846 618277 613131 608837 605296 601613 597249 592892 589540 587120 584660 581484 577707 573896 570747
59047 570747 568740 567562 566213 564113 561759 559893 558570 557576 557167 557642 558588 559326 559868 560783 562316 564293
59031 564293 566655 569550 573001 576998 581729 587328 593644 600624 608616 617921 628422 640066 653293
59018 653293 668423 684970 701984 718751 734762 749452 762434 773522 782132 787294 788808 787760
59006 787760 785201 781030 775045 768497 763442 760780 759901 760126 761571 764525 768768 773706 778732 783406 787541
58991 787541 790891 792600 791549 787739 782655 777531 771906 764702 756113 747288 738593 729475 719945 710951
58977 710951 703140 696312 690285 685419 681999 679954 679450 681016 684739 689913 695805 702220 709135 716316
58963 716316 723615 731200 739191 747331 755171 762319 768416 773146 776394 778226 778674 777653 774910 769879
58949 769879 761902 750961 738008 724235 710280 696445 683286 671397 660838 651447 643608 638139
58937 638139 635369 634735 635271 636097 636469 635778 633621 629833 624704 619184 614388 610503 606633 602042 597097
58922 597097 592556 588526 584696 581054 577649 574102 570202 566601 564098 562490 561008 559670 559277 560124 561644
58907 561644 563375 565522 568430 572184 576917 582936 590349 598993 608827 620011 632590 646362 660922
58894 660922 675537 689265 701671 713198 724410 735220 745478 755975 768062 782385 798637
58883 798637 816384 835356 854907 873912 891374 906710 919411 928907 934829 937105 935896 931683
58871 931683 925129 916439 905228 891498 876447 861737 848206 835782 824328 813917 804545 796182
58859 796182 788848 782085 774643 765423 754552 743006 731440 719920 708441 696983 685353 673665
58847 673665 662685 653111 644822 637432 631070 625836 620988 615624 609867 604418 599272 593765 587654 581255
58833 581255 574792 568536 563287 559617 556775 553373 549014 544326 539655 534910 530618 527881 527038 527371 528279
58818 528279 529840 532038 534334 536257 537710 538571 538725 538559 538782 539675 540979 542401 543659 544371 544613 545277
58802 545277 547024 549159 550360 550216 549272 548034 546943 546847 548212 550063 550809 549916 547801 544695 540969 538043
58786 538043 537308 538281 539431 540661 543301 547689 552616 557338 562306 567604 572496 577044 582382 588621 594133
58771 594133 597679 599716 600734 599874 596389 591199 585815 580648 575394 570166 565190 560202 555133 550730
58757 550730 547624 545358 543139 541030 539720 539600 540688 542950 546163 549875 553837 557997 561928 565041
58743 565041 567553 570357 573643 576619 579059 582143 587132 593965 601736 609842 618079 626203 633966 641256
58729 641256 648026 654508 661434 669295 677427 684698 690959 696798 701981 705529 707493 709235 711629 714367
58715 714367 717354 721324 726532 732277 738350 745521 753939 762379 769892 776752 782955 787225 788601 787636
58701 787636 784814 778984 768831 754969 739178 722254 703855 683914 663012 641760 620852 601386
58689 601386 584238 569363 556307 544953 535221 526675 519018 512376 506573 500815 494685 488696 483319
58676 483319 478285 473412 469238 466147 463699 461489 459831 458928 458293 457786 458412 461269 466436 473548 482605
58661 482605 493517 505672 518570 531944 544604 554284 559637 561509 561461 560043 557400 554445 552152
58648 552152 550403 548574 546605 544597 542130 538935 535501 532114 528087 522886 517195 511932 507053 502329
58634 502329 498410 495942 494407 493057 492376 493396 496035 499190 502043 504327 505890 507086 509149 513172
58620 513172 518896 525203 531301 536800 541271 544575 547148 549242 550430 550492 550166 550428 551637 553815 556866
58605 556866 559947 561607 561323 560094 558963 557978 557093 556757 556766 555845 553430 550753 549231 548925 549529 551465 554787
58588 554787 558323 561283 564681 569831 576481 583664 591238 599267 607027 614110 621515 630264 639966 650031
58574 650031 661010 673188 685112 695327 704548 714373 724851 735198 746051 759058 774841 793065
58562 793065 813849 837408 863014 889997 919041 950833 984150 1016927 1048228 1077339 1101961
58551 1101961 1119675 1130630 1136681 1138401 1135138 1127543 1117680 1106713 1094633 1082164 1070714 1060245
58539 1060245 1049126 1036288 1021703 1004665 983552 957891 929183 899378 869760 841440 815525
58528 815525 792482 772280 755107 740971 728988 718304 709405 703285 699667 697337 695787 695115 694657
58515 694657 693257 690740 687894 685233 682877 681087 679755 677992 675469 673433 673034 673455 673190 672226 671324
58500 671324 670114 667841 665234 663658 663037 662500 662372 663498 665227 666204 666654 667775 669359 670232 670709 672484
58484 672484 676330 681853 689062 698158 708248 718400 729627 743757 760860 779803 800541 823325
58472 823325 846220 866188 882369 895738 905822 910614 909692 904618 896157 883901 869002 854509
58460 854509 842352 832260 824060 818667 816346 816272 818276 822989 830026 838201 847737 859944 874348 888288
58446 888288 899588 907561 911356 909851 903552 894324 882948 869139 854018 840026 828083 817265
58434 817265 807613 800782 797480 796634 797424 799848 803115 806067 809512 815599 824545 834464 844724 856718
58420 856718 870911 885814 900380 914638 927377 935952 939238 938392 934277 926769 916981 907195 897831
58407 897831 887188 874855 862642 851555 840784 830449 822320 816837 812232 807624 804334 803229 803501
58394 803501 804846 808064 812659 816752 820233 825010 831180 836053 838074 838761 839586 839977 839575 839384 839311 837582
58378 837582 834021 831062 830148 830006 829832 831250 835528 841647 848561 856680 865829 874556 882843 892714 904885
58363 904885 917610 930007 943531 958865 974480 989590 1005484 1022645 1039654 1056158 1073551
58352 1073551 1091340 1106351 1117089 1125484 1132836 1137747 1139725 1141094 1143431 1145756 1148124 1153145 1161734
58339 1161734 1171114 1179365 1188285 1199341 1210599 1220430 1230742 1243702 1258420 1273562 1290083 1308721
58327 1308721 1327847 1346208 1364775 1383594 1400128 1412990 1423961 1434078 1441407 1445134 1448064 1452458
58315 1452458 1457071 1460920 1466102 1474035 1482798 1491103 1501089 1514250 1528471 1542184 1557499 1576079 1595862
58302 1595862 1615053 1635344 1657837 1679899 1699576 1719068 1740331 1761278 1779946 1798205 1817631
58291 1817631 1835968 1851671 1867699 1886774 1907089 1926820 1948486 1974406 2002103 2028791 2056365
58280 2056365 2087374 2120171 2152652 2186765 2224614 2264050 2302724 2342434 2385127 2428891 2472493
58269 2472493 2519198 2571269 2625265 2677767 2731100 2788397 2847950 2907702 2970368 3038569 3109792
58258 3109792 3181560 3256438 3336421 3417842 3497606 3578799 3664146 3749995 3833252 3918106 4009054
58247 4009054 4103558 4198821 4299304 4409682 4526738 4646341 4772155 4909013 5054114 5203549
58237 5203549 5361105 5531561 5711782 5897819 6094183 6306492 6531873 6766724 7016765
58228 7016765 7288705 7579274 7883714 8207725 8559282 8936220 9334388 9760475 10223928
58219 10223928 10723947 11257886 11834591 12465557 13151286 13891071 14697798 15588289 16568589
58210 16568589 17644817 18838525 20174788 21666827 23331430 25208506 27346774 29784505
58202 29784505 32567501 35774552 39506264 43870504 49009840 55127751 62458487 71230886
58194 71230886 81697501 94182741 109072058 126784566 147802148 172701626 202112607
58187 202112607 236619181 276502859 321004303 367166864 409292308 440232260 454270171
58180 454270171 449595496 428538545 395784057 356322317 314386801 273214937 234994757
58173 234994757 200868826 171165874 145762556 124317297 106355674 91357015 78853761
58166 78853761 68449083 59776902 52506353 46380843 41209294 36822232 33067624 29836704
58158 29836704 27054487 24645189 22532491 20665567 19015526 17549053 16228625 15033217
58150 15033217 13955196 12979862 12087974 11273615 10539349 9877051 9271268 8717202 8217824
58141 8217824 7767119 7352984 6972657 6628628 6312727 6010595 5719376 5445940 5190215
58132 5190215 4945193 4711197 4495371 4297987 4112408 3937420 3777081 3629615 3488595
58123 3488595 3354160 3231661 3120326 3014228 2913098 2821272 2737138 2654325 2572402 2496040
58113 2496040 2424596 2352764 2280772 2213937 2152507 2091602 2030722 1973979 1921263 1868320 1815345
58102 1815345 1766522 1721193 1674289 1625551 1579788 1537936 1496322 1455039 1418696 1388129 1359228
58091 1359228 1330631 1305047 1282263 1258334 1232638 1208750 1187502 1165891 1143537 1123464 1105668
58080 1105668 1086460 1065068 1044621 1025717 1005227 982429 960339 940035 919363 898069 878579
58069 878579 860847 841972 821752 803288 787416 771846 756422 743793 734190 724885 715580 709018
58057 709018 705468 701848 697135 693270 689733 682720 671207 658874 648423 638632 628405 619198 611817
58044 611817 604938 598289 593479 590506 587214 583094 579845 577487 573851 568594 563691 559243 552918 544325
58030 544325 535798 528050 519136 508600 498507 489444 479612 468929 459929 453431 447319 440735 435479
58017 435479 432041 428246 423273 419105 416537 413479 408834 404467 401734 399472 396945 395355 394917 393804
58003 393804 391613 390636 391990 393597 393663 393150 393111 392506 390431 387860 385510 382427 378180 374117 371165 368703
57987 368703 366614 365924 366412 366230 364975 364466 365424 366142 365557 364762 364175 362054 357431 351980 347449 343586
57971 343586 339977 337474 336302 335034 332968 331435 331394 331731 331317 330828 331293 332554 334135 335933 337324 337487
57955 337487 337123 337744 338792 337827 334106 329435 324951 319904 314509 311026 310624 311767 313117 315542 319828
57940 319828 324841 329568 334899 341825 349822 358384 368315 380216 393386 407280 422192 437612 451754
57927 451754 463628 473610 481298 485068 484668 481971 478149 472302 463811 453753 442958 431074 418606
57914 418606 407470 398315 389636 380762 373325 368475 365009 361690 359036 357408 355694 353430 351897 351476
57900 351476 350211 346714 342314 338596 334986 330634 326549 323885 321990 320148 319478 321148 324273 327410
57886 327410 330555 333942 336483 337294 337310 337631 337692 336701 335409 334731 333992 332180 329667 327121 324083 320176
57870 320176 316415 313829 312039 310513 309797 310165 310618 310643 311429 313942 317340 320761 324945 330493 336278 341377
57854 341377 346986 354464 362834 370108 375865 380748 384689 387410 389503 391214 391281 388611 384029 378830 372847
57839 372847 365497 357461 349588 341320 331901 322035 312762 303911 295289 288108 283448 280483 277996 276490
57825 276490 277013 279029 281335 284042 287853 292308 296513 300648 304994 308542 310365 311420 313169 315222
57811 315222 316015 314815 311428 305133 295905 285738 276713 268576 260074 251701 245016 240074 235722 231876
57797 231876 229422 228303 227788 228167 230226 233347 236067 238261 240965 244324 247549 250686 254654 259566 264586
57782 264586 269359 274209 279133 283987 289393 296092 303769 311833 320854 331702 343631 354653 363477
57769 363477 369688 372559 371335 366485 359175 349712 337851 324265 310277 296354 282172 267824 253655
57756 253655 239305 224445 210259 198908 191659 188584 189545 194245 201767 211295 222814 235889 248551
57743 248551 258866 266990 274180 280455 284951 288031 291110 294617 297778 300265 302393 303810 303631 301915
57729 301915 299631 297194 294334 291223 288375 285607 282379 278967 276080 273621 271105 268883 267581 266715
57715 266715 265347 263653 262369 261087 258762 255609 252807 250538 248046 245387 243343 241642 239108 235665
57701 235665 232517 230176 227955 225637 224024 223497 223470 223571 223971 224281 223537 221640 219568 217847 216016 213820
57685 213820 211756 210189 209084 208824 210117 212806 215856 218789 222178 226659 232453 240026 250174 263306
57671 263306 279568 299708 324845 355366 391124 432967 483089 543253 612295 684277 748182
57660 748182 790821 802847 783450 739445 680508 615572 551753 493660 442927 399475 363267
57649 363267 334074 310332 290059 272756 258948 248171 239159 231814 227166 225225 224599 224358 224649
57636 224649 225273 225407 225175 225855 227954 230403 232141 233216 233859 233725 232647 231173 229911 229082 228787 228840 228416
57619 228416 226883 224853 223293 221901 219692 216927 214826 213453 211550 208703 206044 204499 203809 203653 204253
57604 204253 205498 206748 207841 209084 210160 210411 210313 211135 212885 214172 214362 214267 214333 213792 212163 210080 208052
57587 208052 205845 203618 202227 201785 201345 200594 200403 201090 201612 201307 201009 201560 202436 202801 202838 203098 203405 203162
57569 203162 202051 199909 196818 193718 191949 191710 191912 191876 192113 193044 194138 194857 195407 196133 197126 198743 201415
57552 201415 204697 207653 210435 214204 219260 224652 229878 235358 240704 244229 245035 244224 243312 242800 242974
57537 242974 244550 247502 250455 252327 253614 255232 257067 258415 258931 258570 257536 256725 257100 258238 258729
57522 258729 258377 258502 259651 260718 261014 261446 262702 263912 264176 263877 263363 261820 258710 254887 251028 246319
57506 246319 240095 233504 228091 223803 219791 216127 213303 210940 208392 205848 203638 201321 198659 196592
57492 196592 196016 196453 197132 198411 200874 203932 206695 209398 212665 216098 218958 221517 224454 227627 230744
57477 230744 234474 239541 245273 250376 254534 258030 260486 261376 261303 261447 262173 263279 265051 267785 270794
57462 270794 273152 275082 277511 280694 284256 288106 292295 296569 300972 306143 311992 317020 320161 322350
57448 322350 324937 327522 328971 329686 331024 333029 334657 335831 337420 339371 340718 341454 342669 344678 346604
57433 346604 348010 349474 351384 353529 356108 359766 364285 368500 371884 375166 379059 383373 387704 392108
57419 392108 396776 401761 407135 412754 417936 422110 425658 429328 433080 436450 439845 444318 450135 456609
57405 456609 463365 470673 478419 485697 491608 495776 498226 499577 501186 504070 507775 511268 514761 519470
57391 519470 525608 531963 537654 543162 549247 555925 562969 570537 578813 587636 596803 606172 615370 623974
57377 623974 632063 639926 647276 653503 658733 663792 669065 674219 679124 684136 689262 693934 697963 701927
57363 701927 706273 710731 715044 719706 725416 732160 739200 745845 752046 758360 765345 772919 780519 788077
57349 788077 796419 806285 817307 828499 839409 850215 861011 871636 881991 891942 901205 909921
57337 909921 918989 929113 939899 950612 961473 973275 986034 998993 1011748 1024423 1036808 1048378
57325 1048378 1059208 1070014 1081211 1092673 1104416 1116716 1129518 1142455 1155465 1168734 1182122
57314 1182122 1195373 1208764 1222724 1236975 1250873 1264532 1278670 1293325 1307690 1321359 1334937
57303 1334937 1349233 1364575 1380957 1398103 1415253 1431649 1447409 1463339 1479833 1496610 1513506
57292 1513506 1530777 1548487 1566245 1583772 1601206 1618823 1636893 1655661 1674958 1694008 1712208
57281 1712208 1729916 1747872 1766164 1784499 1803138 1822590 1842577 1862301 1881758 1901858 1923164
57270 1923164 1945266 1967416 1989086 2009989 2030352 2051117 2073147 2096342 2120216 2144974 2171042
57259 2171042 2197842 2224236 2250179 2276819 2304812 2333541 2362119 2390197 2417697 2444779 2472174
57248 2472174 2500549 2529364 2557281 2583901 2610125 2636692 2663393 2690001 2716944 2744626 2772941
57237 2772941 2801848 2831674 2862480 2893777 2925177 2956758 2988656 3020894 3053655 3087035 3120540
57226 3120540 3153540 3186175 3219077 3252381 3285904 3320124 3355824 3392704 3429463 3465412 3500993
57215 3500993 3536609 3572032 3607120 3641952 3675987 3708282 3738921 3769151 3799711 3830037 3859433
57204 3859433 3888016 3916074 3943544 3970602 3997826 4025259 4052170 4078172 4103851 4130013 4157119
57193 4157119 4185559 4215369 4245398 4273954 4300714 4326948 4353408 4379235 4403438 4426262 4448368
57182 4448368 4469807 4490613 4511389 4532363 4552762 4571933 4590349 4608760 4627157 4645312 4663523
57171 4663523 4681928 4699776 4716229 4731269 4745037 4756893 4765988 4772308 4776371 4778342 4778048 4775461 4770553
57158 4770553 4763126 4753394 4742284 4730648 4718590 4706006 4693160 4680264 4667135 4653968 4641950 4632470
57146 4632470 4626081 4622700 4622275 4624688 4629382 4635602 4642761 4650304 4657616 4664263 4669678 4672462 4670706 4663366
57132 4663366 4650658 4632951 4610246 4583091 4552905 4520843 4487328 4453420 4421627 4394403 4372558
57121 4372558 4355842 4344163 4337184 4333507 4331505 4330684 4331372 4333603 4337333 4343498 4353961 4370667 4395650
57108 4395650 4431588 4481526 4548212 4634599 4744942 4884933 5061161 5281567 5556849 5901179
57098 5901179 6331794 6868545 7534095 8354275 9357933 10575819 12038172 13771530 15796196
57089 15796196 18124909 20761521 23698747 26916121 30379871 34044117 37849819 41717872
57081 41717872 45538113 49163875 52423428 55148330 57203166 58499376 58991933 58672537
57073 58672537 57569640 55751553 53323564 50416648 47171947 43725515 40196744 36683431
57065 36683431 33263156 29996507 26928796 24091285 21503326 19173727 17100425 15271214
57057 15271214 13667581 12268898 11053759 9999897 9085463 8290744 7598163 6991604 6457171
57048 6457171 5984201 5564385 5190103 4854361 4551689 4277903 4029262 3802593 3595704
57039 3595704 3406683 3233190 3073243 2926240 2792313 2671134 2562069 2464986 2380103 2307435
57029 2307435 2247058 2199654 2166754 2151086 2155549 2178221 2206361 2218206 2195149 2133527 2044065
57018 2044065 1941396 1836033 1734215 1640192 1556142 1481722 1415526 1356559 1304016 1257001 1215158
57007 1215158 1178726 1147429 1120211 1096341 1075827 1058392 1042971 1028665 1015409 1003329 992145
56996 992145 981590 971797 963022 955469 949522 945582 943486 942520 942008 941606 941240 941349 942884 946414 951299
56981 951299 956154 959541 959562 953511 939281 917128 889303 858259 826049 794804 766290 740922 718326
56968 718326 698789 683088 671077 661790 654964 651187 650417 651733 654904 661061 671348 685911 704440
56955 704440 726300 749227 768787 780267 781197 772052 755199 733582 709848 685967 663431 643498
56943 643498 626875 613424 602708 594727 589664 587282 587290 590058 596244 605930 618923 635668 656993
56930 656993 682987 712668 744023 773218 794289 801574 793274 772120 742782 709535 675913 644554
56918 644554 616431 591168 568640 549486 533828 520564 508515 497521 488001 480156 473930 469022
56906 469022 464643 459970 455152 451187 448584 446837 445391 444243 443333 442167 440500 438768 437477 436724 436515
56891 436515 437011 438302 440541 444442 451012 460726 473488 489141 506942 524346 537385 542865 539924
56878 539924 529697 514435 497046 480291 465720 453674 444302 437934 434568 433973 436493 442983 453887
56865 453887 469176 489141 514299 544528 579422 619659 666755 720761 778536 833998 879235
56854 879235 906195 909895 891440 857245 814777 769575 725754 686953 655380 631082 613401 602513
56842 602513 598860 602122 611768 628100 651977 684126 725322 776640 838935 912480 996880 1089366
56830 1089366 1181687 1259671 1308146 1317899 1289146 1230014 1152489 1068277 985934 910244 843588
56819 843588 787256 741541 705741 678913 660460 649847 646554 650716 663092 683971 712855 749723
56807 749723 795752 851812 916062 982750 1042446 1083792 1097355 1080115 1036784 976509 908428
56796 908428 839625 775020 717246 666813 623469 587384 558793 537203 521739 511857 507172 507161
56784 507161 511685 521318 536576 557320 583310 614340 648558 680920 704364 712993 704418 680094
56772 680094 644384 602902 560496 520059 482858 449477 420212 395119 374147 357040 343058
56761 343058 331270 321216 312776 305454 298628 292550 288103 285283 282924 280281 277841 276082 274550 272837
56747 272837 271418 270662 269909 268454 266704 265485 264838 264310 263807 263338 262511 261066 259449 258158 257028 255767
56731 255767 254560 253543 252398 251128 250460 250679 250811 249954 248833 249042 251127 254260 257466 260380 263123
56716 263123 266077 269478 272724 274555 274338 272696 270562 268393 266675 266109 266606 267038 266807 266752 267733 269351
56700 269351 270992 273030 275751 278023 278506 277585 276780 276695 276837 277020 277629 278646 279521 279875 279527 278166 275842
56683 275842 273456 271915 271173 270793 270799 271151 271123 270251 269290 269150 269447 269117 267877 266003 263411 260119 256913
56666 256913 254231 251063 246375 241010 236621 233171 229129 223851 218110 212438 206572 200584 195036 189826
56652 189826 184179 177999 172165 167430 164074 162429 162580 163673 164788 166434 169915 175325 181464 187688
56638 187688 194395 201592 208401 214255 219449 224303 228890 233661 239144 244909 249977 254303 258703 263230
56624 263230 266890 269085 270182 270500 269978 268910 267795 266334 263888 260984 258962 257900 256389 253703 250725
56609 250725 248264 245909 243200 240590 238498 236572 234625 233234 232681 232293 231513 230725 230377 230257 230276 231008
56593 231008 232649 234213 234594 233857 232907 232403 232516 233174 234011 234557 234858 235459 236607 238046 239684 241654 243630
56576 243630 245018 246066 247801 250509 253276 255418 257345 259478 261355 262544 263664 265706 268915 272936
56562 272936 277507 282585 288248 294956 303370 313628 325299 338064 351565 364255 373434 377098 375290
56549 375290 369471 361437 353133 346340 341528 337509 332887 327513 322148 317300 312879 308528 303959 299324
56535 299324 295406 292899 291355 289592 287293 285387 284623 284629 284669 284447 283830 282763 281944 282624 285125 288293 290850
56518 290850 292487 293174 292502 290525 288392 287154 286412 284937 282204 278650 274855 271165 267859 265151 263138
56503 263138 261992 261842 262362 262920 263251 263421 263116 261821 259831 258183 257334 256859 256760 257904 260537 263375 264992
56486 264992 265361 265312 265192 264847 264293 263710 263203 263100 263945 265654 267246 267899 267750 267295 266755 266492 267215 269101
56468 269101 271366 273333 275234 277411 279468 280886 281769 282271 281993 280749 279273 278351 277776 276951 276024 275627
56452 275627 275872 276327 276632 276550 275838 274698 273934 274066 274639 275033 275425 276383 277909 279538 280953 281851 281559 279586
56434 279586 276422 273263 270985 269652 268742 267561 265734 263611 261939 261041 260703 260844 261609 262712 263462 263722
56418 263722 264113 265014 266139 267317 268825 270587 271983 272922 274247 276559 279408 282080 284376 286191 287281
56403 287281 287882 288609 289216 288517 286146 283322 281208 279609 278031 276905 276792 277425 278522 280637 284134 288187
56387 288187 291795 295010 298155 300778 302555 304478 307841 312595 317818 323207 328959 334600 339174 342268
56373 342268 343960 344125 342734 340431 337856 334716 330312 324630 318332 312249 307478 305074 304695 304335 302491
56358 302491 299963 298512 298481 298952 299614 301142 304062 308315 313622 319265 323950 326914 328796 330602 332354
56343 332354 333674 334888 336357 337385 337158 336292 336123 336820 337559 338241 339699 342334 345832 350137 355423 361047
56327 361047 365710 368873 371217 373659 376653 380313 384418 388278 391233 393208 394381 394704 394268 393567 392808
56312 392808 391557 389695 388003 387043 386300 385307 384734 385334 386641 387924 389593 392404 395952 399266 402270
56297 402270 405365 408222 410383 412461 415300 418434 420817 422559 424479 426380 427331 427331 427254 427406 427558 428103
56281 428103 429751 432263 434766 437039 439294 441196 442481 444026 446838 450520 454259 458721 465108 472800
56267 472800 479967 486353 493465 501998 510979 519697 528637 538250 548414 559433 572020 586008 600529
56254 600529 615597 632081 649987 668420 687557 709075 734186 762632 793983 828593 866777
56243 866777 908155 952218 998553 1046340 1094606 1143002 1191301 1238205 1281690 1320391 1353570
56232 1353570 1380152 1399117 1410592 1415174 1412544 1402230 1385346 1363845 1338391 1308706 1275773 1241687
56220 1241687 1207385 1172486 1137362 1103325 1070609 1038210 1006040 975320 946510 918791 891976
56209 891976 867000 844016 821921 800335 780276 762269 745503 729441 714586 701105 688413
56198 688413 676777 667653 661675 657648 654136 650685 647187 643550 640471 638989 638846 638718 638302 638595 639893
56183 639893 641334 642695 644799 647673 650196 651994 653894 655990 657240 657573 658528 661096 664674 668702 673519
56168 673519 679019 684277 689155 694506 700365 705889 711601 719518 730342 742529 754786 767439 780695
56155 780695 793867 807258 822552 840414 859873 881042 906069 936176 970094 1006906 1048276
56144 1048276 1096399 1151848 1215227 1289171 1376926 1480176 1599426 1734713 1884212 2043183
56134 2043183 2205167 2362918 2507920 2631931 2731395 2809524 2873265 2929535 2984225 3041130
56124 3041130 3098896 3150286 3186619 3202877 3198888 3178262 3147599 3114224 3081877 3048544 3008489
56113 3008489 2954798 2880221 2779364 2652744 2507573 2353425 2198448 2049603 1912911 1791222
56103 1791222 1683836 1589993 1510750 1446170 1393337 1349040 1312294 1282556 1257902 1236873 1219985
56092 1219985 1207509 1197887 1190083 1185180 1183765 1183995 1184226 1185279 1188135 1191689 1194839 1198503 1203531 1208977
56078 1208977 1214526 1222157 1233064 1245229 1256459 1267568 1280212 1293876 1307473 1321724 1337461 1353645
56066 1353645 1369394 1385796 1403534 1421126 1437824 1455616 1475842 1496489 1515599 1534703 1555972
56055 1555972 1578536 1600576 1622507 1644969 1666185 1684577 1701774 1719953 1738497 1756265 1774585
56044 1774585 1794874 1815846 1836345 1858234 1883170 1909260 1934487 1960735 1990761 2023852 2058234
56033 2058234 2094963 2135464 2177885 2219967 2262996 2308955 2356482 2403719 2452360 2504537 2558448
56022 2558448 2611384 2664338 2719260 2774829 2829643 2886559 2948918 3015380 3083351 3154331 3230696
56011 3230696 3310560 3391537 3476467 3569569 3669828 3774000 3882909 3998620 4118683 4239836
56001 4239836 4364540 4497220 4637048 4781087 4931352 5091595 5260276 5434246 5616323
55992 5616323 5811593 6019333 6236549 6466310 6714197 6979635 7259318 7556174 7876065
55983 7876065 8218922 8582398 8971129 9392793 9848382 10336294 10862478 11436234 12059959
55974 12059959 12734229 13469056 14278550 15168984 16144815 17222114 18423010 19762314 21254822
55965 21254822 22931513 24834173 27001191 29477442 32334571 35666707 39577356 44194758
55957 44194758 49694476 56284156 64174403 73591974 84816983 98185598 114073423 132911351
55949 132911351 155208026 181527638 212430543 248279765 288607181 331005914 370392337
55942 370392337 399885563 413451914 408674567 387601008 355239321 317154623 277829496
55935 277829496 240227379 206005409 175851951 149824816 127662766 108978644 93327650
55928 93327650 80251278 69335291 60229543 52623788 46240366 40855478 36299169 32426689
55920 32426689 29107941 26243044 23762714 21606287 19714428 18043031 16565011 15254246
55912 15254246 14081690 13027926 12084109 11238039 10472088 9775882 9147830 8582207 8066396
55903 8066396 7592217 7158706 6762229 6394492 6051705 5735645 5444248 5170583 4912252
55894 4912252 4672654 4451814 4244742 4049815 3870174 3705713 3551975 3408045 3277408
55885 3277408 3159847 3050410 2947691 2855263 2773180 2695271 2616622 2537246 2457187 2374953 2292423
55874 2292423 2214697 2143182 2074459 2007075 1943268 1882797 1821508 1757940 1695508 1636325 1578473
55863 1578473 1521217 1467382 1418378 1371950 1326980 1285842 1249936 1217289 1186448 1158584 1133954
55852 1133954 1110312 1086446 1063516 1041530 1018388 993687 969577 946592 922578 897035 872582
55841 872582 850711 829878 809188 790207 773607 757585 741038 724945 709393 692755 675183
55830 675183 659415 646708 635228 623758 613621 605550 598032 590246 583470 578034 571962 564150 556049
55817 556049 548796 541528 533820 526900 521093 514864 507725 501350 496590 492165 487507 484072 482534 481494
55803 481494 480287 480268 482038 484222 486350 490075 496024 502214 507117 511628 516408 520027 521447 521804 521958
55788 521958 520820 517891 514951 513219 511045 506567 500737 495692 491594 486761 479496 468548 453461 435810
55774 435810 418594 403363 389564 377309 368401 363467 360529 357926 356509 357372 359486 361226 362324
55761 362324 362792 361821 359399 357254 356520 356073 354538 352209 349580 345799 340166 333479 326351 317826 307181
55746 307181 295560 284474 274258 265243 258521 254009 249606 244009 238718 235629 234249 232961 231372
55733 231372 229720 227512 224660 222524 222057 222150 221372 219914 218280 215676 211548 207220 203994 200921 196468
55718 196468 191279 187298 185136 184128 184016 184742 185444 185439 185432 186179 186985 187145 187851 190784 195616 200603 204796
55701 204796 207980 209345 208159 205202 201784 197891 192850 187212 182348 178713 175943 173973 172614 170802
55687 170802 167950 165407 164869 165893 166568 166144 165394 164921 164804 165541 167673 170642 173411 175886 178405 180296
55671 180296 180483 179174 177537 175958 174028 171901 170248 169075 167917 166948 166631 166639 166430 166560 167974 170303
55655 170303 172278 173728 175738 178857 182436 185744 188539 190589 191735 192473 193477 194654 195539 196331 197456
55640 197456 198360 197871 195624 192135 187708 182355 176594 171164 166019 160628 155189 150572 147092 144319 141981
55625 141981 140147 138570 136782 134892 133544 133071 133246 133686 133971 133639 132601 131165 129271 126379 122705
55610 122705 119649 118139 117363 116146 114771 114251 114551 114783 114551 113869 112391 110062 107960 107091 106784 105705
55594 105705 103993 102912 102699 102345 101356 100226 99198 97973 96744 96197 96328 96387 96026 95531 94984 94190 93331
55577 93331 92711 92113 91461 91643 93481 96253 98579 100460 102965 106241 109481 112738 116962 122044 126418
55562 126418 128988 130022 129901 128553 126508 125045 124581 124087 122706 120874 119417 118546 118197 118272 118108 116776
55546 116776 114399 112260 111125 110406 109390 108269 107411 106575 105580 104991 105515 107263 110143 114320 119741 125574
55530 125574 130562 133724 134631 133472 130956 127723 123849 119320 114707 110611 106626 101702 95538 88832
55516 88832 82290 76279 71415 68457 67416 67613 68725 70986 74462 79041 85054 92805 101397 109166 115398
55501 115398 120542 124607 126673 126426 124992 123610 122373 120774 118633 115930 112540 108681 105016 101869
55487 101869 98893 95851 93105 91093 89933 89675 90354 91675 93335 95656 99050 102885 105843 107547 108756
55472 108756 109862 110396 110389 110953 112822 115176 116594 116467 115135 113353 112043 111757 111959 111592 110617 110101 110488
55455 110488 110831 110209 108955 107871 107109 106454 105915 105437 104684 103627 102658 101743 100262 98121 96165 94970
55439 94970 94100 93066 92140 91636 91329 91239 92044 93949 96009 97375 98415 99691 100657 100415 99165 97879 96958
55422 96958 96128 95273 94479 93568 92448 91693 92004 93218 94478 95263 95692 96030 96381 96684 96641 95914 94762 94083
55404 94083 94459 95536 96628 97425 97756 97337 96312 95471 95294 95272 94754 93960 93505 93389 93193 92942 93022 93469 93955
55385 93955 94296 94494 94490 94367 94504 95052 95513 95261 94189 92499 90288 87896 86194 85826 86323 86553 85992 85128
55367 85128 84733 85115 86040 87057 87914 88715 89575 90272 90637 91142 92445 94337 95880 96728 97494 98619 99703
55350 99703 100295 100442 100099 98974 97493 96885 97521 98128 97539 96430 96254 97161 98090 98463 98624 98826 98848 98620
55332 98620 98402 98313 98247 98212 98292 98468 98843 99646 100607 100870 100097 99119 98844 99022 98859 98322 97992 98031 98188 98482 98998
55311 98998 99225 98530 97188 96188 96108 96817 98050 99508 100526 100436 99330 97921 96761 96002 95649 95507 95129
55294 95129 94381 93726 93482 93255 92739 92531 93342 94840 96173 97198 98209 98834 98331 96865 95481 94884 95138
55277 95138 96349 98509 100718 101768 101721 101887 102961 104126 104344 103694 102988 102726 102878 103208 103457 103485 103351 103016
55259 103016 102179 100875 99912 99954 100367 99902 98489 97368 97330 97812 98040 98132 98606 99532 100692 102036 103469 104597
55241 104597 105078 104982 104592 104168 103973 104153 104492 104655 104663 104696 104541 103886 103109 103021 103699 104308 104235 103615 102614 101073
55221 101073 99324 98450 99014 100104 100368 99613 98772 98546 98711 98645 98035 97098 96377 96321 96814 97215 97046 96514 96214
55202 96214 96486 97187 97930 98398 98551 98675 99133 100030 101226 102573 103877 104749 104887 104573 104498 104930 105386 105271
55184 105271 104570 103724 103132 103022 103610 104976 106711 107917 107869 106782 105742 105604 106046 106061 105363 104745 104898 105500
55166 105500 105886 106016 106163 106133 105567 104762 104375 104438 104439 104310 104544 105260 105919 106126 106080 106024 105895 105756 105967 106546 106836
55145 106836 106240 104997 103955 103749 104389 105388 106135 106315 106121 105969 106089 106515 107249 108122 108683 108696 108637 109246 110643
55126 110643 112300 113751 114855 115419 115115 113873 111977 109770 107638 106193 105951 106818 108289 110018 111753
55111 111753 112918 112985 112223 111480 111190 111176 111347 111865 112583 113016 113055 113098 113319 113384 113005 112239 111174 109877 108726
55092 108726 108171 108099 108065 108158 108850 109950 110565 110331 109898 109895 110242 110797 111796 113131 113960 113681 112802 112235 112188 112217
55072 112217 111936 111271 110429 109977 110501 111821 112981 113335 113146 112819 112234 111290 110490 110355 110693 111007 111252 111615
55054 111615 111973 112116 112224 112537 112829 112713 112279 111997 112139 112560 112838 112426 111059 109302 108237 108275 108742 108958
55036 108958 109145 109755 110550 111034 111316 111782 112284 112515 112890 114158 116130 117623 117802 116956 115845 114927 114406
55019 114406 114466 115080 115865 116395 116510 116252 115749 115256 115050 115213 115622 116210 117014 117936 118680 119103 119538 120509 122093
55000 122093 123699 124703 125189 125733 126444 126727 126282 125786 126032 126772 127207 127323 127823 128786 129437 129453 129461 129866 130171
54981 130171 130021 130000 130600 131174 130852 129945 129495 129816 130400 131015 131864 132756 133062 132657 132100 131721 131184 130239 129290
54962 129290 128918 129262 130126 131270 132320 132757 132428 131879 131877 132694 134054 135669 137407 138912 139443 138569 136935
54945 136935 135862 135933 136322 135851 134419 132961 132176 131914 131764 131632 131512 131252 130851 130709 131275 132571 134110
54928 134110 135056 134699 133217 131915 132140 133931 136288 138643 141325 144514 147729 150728 154058 158215 162949
54913 162949 167923 173324 179217 184888 189533 193095 195785 197238 196813 194394 190347 185053 179003 172936
54899 172936 167293 161921 156782 152381 148914 145626 141828 138085 135477 134063 133020 132019 131522 131823 132694
54884 132694 133903 135285 136351 136686 136760 137569 139422 141765 144180 146789 149647 152529 155548 159269 163964
54869 163964 169260 174720 180231 185648 190518 194309 196550 196787 194917 191572 187616 183218 177989 172045
54855 172045 166224 161067 156268 151507 147230 144162 142383 141289 140243 138998 137617 136255 134929 133465
54841 133465 131728 129883 128263 127083 126473 126576 127251 127810 127599 126818 126310 126410 126519 125933 124773 123812 123661
54824 123661 124302 125273 126104 126607 126837 126892 126891 127047 127402 127455 126546 124847 123458 123147 123486 123739 124068 125074 126565
54805 126565 127675 128135 128516 129143 129606 129569 129397 129601 130143 130597 130660 130337 129914 129823 130201 130573 130355 129736 129644 130717
54785 130717 132601 134344 135178 134929 134015 133219 133249 134415 136625 139384 141722 142722 142609 142791 144208 146036
54769 146036 146860 146758 147259 149382 152759 156759 161375 166609 171941 176967 181959 187321 192900 198209 202845
54754 202845 206418 208561 209333 209148 207980 205121 200191 193961 187681 181812 175925 169738 163865 159398 156829
54739 156829 155437 153856 151416 148786 147095 146581 146486 146110 145508 145124 145286 146074 147320 148564 149412 149975 150732
54722 150732 152022 153952 156614 159908 163362 166696 170458 175427 181471 187571 192902 197187 200060 200955
54708 200955 199850 197410 194159 190108 185344 180313 175302 170247 165292 160930 157417 154619 152554 151413
54694 151413 150943 150510 149915 149389 148685 147172 145088 143657 143471 143712 143517 143146 143076 142898 142074 141008 140392 139993
54676 139993 139109 137778 136542 135365 133821 132191 131366 131700 132760 134201 136026 137884 138942 138780 137862
54661 137862 136883 136049 135203 134289 133494 133174 133713 135155 136937 138234 138682 138529 138091 137383 136392 135474 135189 135740
54643 135740 136721 137506 137857 138043 138305 138434 138114 137490 137112 137376 138316 139805 141525 142795 142996 142236 141148
54626 141148 139994 138537 136932 136059 136637 138404 140456 142011 142640 142275 141295 140287 139490 138871 138753 139717
54610 139717 141606 143281 143790 143295 142541 141966 141750 142071 142807 143473 143917 144557 145445 145770 144928 143496 142392
54593 142392 141635 140784 140174 140659 142275 144050 145223 145864 146272 146445 146351 146170 146098 146252 146710 147305 147485 146828
54575 146828 145616 144468 143557 142689 142040 142117 142922 143710 143851 143573 143644 144547 146082 147559 148345 148341 147991 147753 147674
54556 147674 147529 147191 146720 146336 146420 147161 148041 148130 147264 146539 147171 149149 151466 153374 154836 156025 156993 157825
54538 157825 158608 159277 159841 160678 162181 164176 166032 167265 167739 167458 166606 165688 165211 165208 165311 165176 164617 163623
54520 163623 162555 162077 162476 163260 163776 163928 163880 163463 162461 161231 160347 159748 158854 157482 156053 154919 154037
54503 154037 153346 152938 152751 152502 152022 151354 150589 149975 150068 151265 153131 154598 154954 154409 153729 153575 154080 154739
54485 154739 154767 153900 152793 152363 152883 153978 155282 156728 158318 160029 161805 163387 164388 164848 165433 166638
54469 166638 168098 169176 169914 170862 172201 173674 175226 177040 179004 180695 181838 182360 182181 181476 180951 181225
54453 181225 182012 182409 181903 180626 178964 177486 176953 177553 178299 177996 176706 175461 174657 173717 172324 171000
54437 171000 170196 169707 169274 169057 169191 169546 170138 171070 171923 171945 171178 170596 170804 171273 171275 170878 170510 170216 169913 169922
54417 169922 170657 172062 173793 175617 177330 178624 179386 179778 179740 178860 177078 175086 173598 172524 171338 169993
54401 169993 169077 169173 170351 172143 173839 174990 175786 176725 177849 178679 179064 179596 180885 182722 184336 185281
54385 185281 185778 186362 187379 188651 189479 189190 187833 186129 184721 183755 183203 183111 183310 183346 183025 182690 182716 182991
54367 182991 183214 183388 183700 184123 184477 184786 185277 186109 187244 188507 189660 190549 191284 192221 193681 195683 197821
54350 197821 199336 199491 198223 196349 194860 194073 193684 193378 192980 192203 190819 189077 187469 186091 184664 183120
54334 183120 181638 180165 178516 176988 176238 176399 176883 177155 177201 177096 176720 176112 175535 175019 174329 173538 173093 173158
54316 173158 173457 173943 174934 176316 177259 177138 176247 175267 174499 173897 173391 172864 172183 171482 170979 170457 169557 168622
54298 168622 168465 169096 169574 169493 169657 170658 171696 171652 170686 169866 169662 169691 169642 169639 169822 170270 171189 172605 174065
54279 174065 175152 176020 176900 177373 176809 175329 173705 172441 171572 171266 171836 173050 174004 173976 173151 172364 172308 173010
54261 173010 173893 174369 174438 174561 174953 175296 175290 175142 175244 175671 176245 176858 177472 178114 179034 180499 182227 183409 183580
54242 183580 183056 182296 181336 180173 179122 178314 177359 176072 175081 175080 175796 176270 175951 174976 173678 172401 171605 171586
54224 171586 172140 172859 173583 174244 174616 174655 174742 175133 175487 175458 175364 175713 176344 176650 176443 176029 175627 175249 174937 174612
54204 174612 173932 172800 171732 171156 170658 169534 167838 166226 165021 164145 163736 164056 164885 165683 166299 166911 167391
54187 167391 167417 167148 167063 167176 167073 166701 166449 166471 166631 167125 168398 170304 171999 172894 173184 173368 173713 174246 174749
54168 174749 174739 174009 173171 173058 173547 173604 172576 170805 168872 166963 165222 164092 163906 164513 165503 166503 167173
54151 167173 167386 167482 167866 168319 168221 167580 167203 167692 168765 169761 170291 170242 169692 169083 169022 169651 170609 171756 173357
54132 173357 175341 176997 177802 178083 178486 179104 179537 179509 179092 178578 178401 178927 180008 180923 180971 179984 178274 176384
54114 176384 174983 174590 175150 176217 177666 179792 182508 184887 185947 185618 184635 183718 183163 182957 182842 182392
54098 182392 181422 180338 179794 179925 180129 179787 179077 178896 179893 181736 183520 184783 185756 186623 187107 187119 187300 188306
54080 188306 189846 191076 191828 192868 194912 197946 201494 205067 208308 211214 214322 218346 223628 230221
54066 230221 238162 246930 254765 259399 259795 256718 251594 245482 239174 233410 228472 224088 220040 216447
54052 216447 213298 210317 207574 205595 204555 203911 203226 202829 203261 204588 206649 209465 212905 216379 219421
54037 219421 222252 225354 228839 232642 236892 241536 245928 249442 252340 255477 259220 263117 266616 269657
54023 269657 272495 275228 277635 279420 280651 281832 283278 284421 284158 282065 278872 275584 272566 269638
54009 269638 266556 263050 258930 254584 251003 248779 247400 245912 243915 241579 239159 237065 235972 236127
53995 236127 236836 237339 237960 239580 242071 244080 244461 243200 240775 237392 233305 229383 226652 225345 224691
53980 224691 223650 221740 219269 216901 215009 213447 211979 210748 210072 209876 209657 209134 208626 208615 209077 209455
53964 209455 209313 208875 208823 209572 210825 211936 212645 213274 214207 215420 216644 217766 218875 220004 221081 222131
53948 222131 223384 225121 227408 229966 232381 234521 236661 239064 241660 244386 247627 251808 256623 261279
53934 261279 265615 270316 275767 281327 286233 290647 295207 300009 304817 310074 316866 325800 336566 348670
53920 348670 361824 375216 386934 394786 397774 396662 393260 389320 385864 383100 380798 378746 376948
53907 376948 375449 374134 372781 371281 369683 367983 365956 363352 360254 357064 354046 351058 347916 344830
53893 344830 342114 339591 336683 333144 329238 325054 320088 313835 306549 299120 292384 286749 282236 278553
53879 278553 275202 271849 268552 265581 263168 261513 260709 260355 259466 257194 253589 249473 245649 242480 239961
53864 239961 237826 235597 233007 230401 228410 227117 225899 224291 222709 221980 222235 222658 222485 221987 222137 223320
53848 223320 224757 225333 224670 223121 220995 218333 215408 212903 211383 210915 211354 212623 214490 216361 217624
53833 217624 218125 218186 218248 218551 218904 218702 217463 215523 213911 213417 213946 214916 215890 216689 217253 217788 218767 220453
53815 220453 222537 224509 226205 227770 229342 231039 233040 235333 237603 239733 242233 245756 250245 254913
53801 254913 259061 262634 265984 269410 272999 276635 280048 282997 285497 287787 290084 292431 294780 297113
53787 297113 299371 301309 302517 302743 302258 301772 301801 302137 302054 300915 298508 295027 291015 287137 283658 280272
53771 280272 276728 273331 270354 267273 263352 258895 255049 252265 249799 247003 244284 242350 241229 240512
53757 240512 239909 239038 237280 234495 231473 229114 227567 226518 225813 225268 224493 223499 222936 223065 223137 222614 222384
53740 222384 223691 226191 228195 228781 228595 228548 228789 229180 229895 231056 232372 233514 234449 235239 235941 236814 238186
53723 238186 239964 241729 243365 245201 247413 249726 251775 253415 254634 255589 256698 258276 260025 261386
53709 261386 262410 263811 266039 268802 271559 274060 276303 278422 280737 283464 286273 288560 290287 292107
53695 292107 294511 297346 300330 303594 307373 311530 315660 319406 322485 324695 326158 327310 328442 329381
53681 329381 329736 329308 328180 326623 324991 323545 322302 321194 320303 319682 319000 317768 315974 314241 313242 313142
53665 313142 313608 314084 314096 313574 312923 312596 312593 312607 312488 312267 311875 311260 310693 310498 310470 310018 308913 307509 306226
53646 306226 305231 304700 304912 305903 307339 308824 310111 311102 312028 313566 316236 319615 322606 324621 326094 327764
53630 327764 329866 332133 334158 335635 336666 337948 340218 343352 346371 348487 349774 350808 352144 354261
53616 354261 357472 361594 366112 370854 376119 381994 388030 393929 400033 406801 414141 421587 428821 435709
53602 435709 442064 447714 452632 456734 459758 461541 462207 461916 460700 458730 456441 454120 451576 448485 444988
53587 444988 441739 439409 438114 437244 435948 433986 431974 430495 429162 427066 424018 420746 417880 415427
53573 415427 413422 412336 412441 413233 413931 414191 414075 413727 413435 413621 414416 415452 416324 417021 417714 418474 419364 420432
53555 420432 421454 422117 422609 423527 424975 426356 427337 428428 430144 432207 434153 436159 438622 441287 443597
53540 443597 445673 448290 451964 456614 462043 468142 474649 481296 488262 496067 504911 514453 524329 534612
53526 534612 545686 557837 570970 584596 598235 611951 626364 641962 658607 675915 693849
53515 693849 712645 732427 753273 775525 799611 825573 853061 881682 911132 941127 971535
53504 971535 1002498 1034064 1065679 1096288 1125097 1152146 1178195 1204106 1230198 1256027 1280861
53493 1280861 1304373 1326788 1348405 1369369 1390039 1411122 1433019 1455229 1476800 1497304 1517096
53482 1517096 1536698 1556235 1575539 1594607 1613766 1633235 1652461 1670059 1684686 1695936 1704165
53471 1704165 1709639 1712309 1712293 1709914 1705101 1697321 1686336 1672532 1656384 1638179 1618552 1598610 1579051
53458 1579051 1559652 1539973 1520020 1499763 1478546 1455595 1430787 1404527 1377371 1350214 1324194
53447 1324194 1299681 1275837 1251860 1228236 1206011 1185370 1165911 1147971 1132609 1120299 1110566
53436 1110566 1102894 1097092 1092752 1089320 1086950 1086434 1087965 1090694 1093862 1097780 1103376 1111263 1121528 1133879
53422 1133879 1147701 1162439 1178203 1195677 1215178 1236245 1258356 1281606 1306404 1332909 1361042
53411 1361042 1390737 1421943 1454736 1489607 1527177 1567354 1609196 1651997 1696179 1742733 1792161
53400 1792161 1844352 1899211 1956792 2016885 2078913 2142326 2206722 2271612 2336505 2401391 2466840
53389 2466840 2533302 2600367 2666918 2731959 2795076 2856067 2914435 2969536 3021180 3069690 3115261
53378 3115261 3157516 3195820 3229817 3259458 3284728 3305603 3322061 3333804 3340051 3339904 3332782 3318225
53366 3318225 3295415 3263355 3221683 3171121 3113203 3049835 2982932 2913997 2843844 2772963 2702126
53355 2702126 2632286 2563855 2496577 2430406 2366212 2305222 2247856 2193387 2140695 2089061 2038125
53344 2038125 1987401 1936312 1884878 1834172 1785700 1740339 1698069 1658681 1622291 1589043 1558742
53333 1558742 1531150 1506356 1484520 1465474 1448908 1434689 1422513 1411370 1399876 1387296 1373917
53322 1373917 1360387 1346955 1333448 1319797 1306508 1294614 1284998 1277580 1271384 1265616 1260474 1256677
53310 1256677 1254585 1254251 1256033 1260394 1266975 1274535 1282091 1289900 1299115 1310729 1324977 1341513 1359942
53297 1359942 1380241 1402689 1427380 1453980 1482103 1511694 1542767 1574931 1607571 1640364 1673270
53286 1673270 1706035 1737998 1768349 1796360 1821545 1843940 1864057 1882142 1897531 1909106 1916276
53275 1916276 1919172 1918106 1913341 1905258 1894138 1879860 1862301 1841948 1819526 1795084 1768146 1738725
53263 1738725 1707434 1674542 1639795 1603441 1566583 1529985 1493232 1455615 1417324 1379182 1341708
53252 1341708 1305096 1269741 1236056 1203892 1172771 1142567 1113382 1084769 1055744 1025797 995534
53241 995534 966063 937935 910849 884251 858049 832764 809114 787515 768027 750675 735605
53230 735605 722815 711918 702348 693751 685969 678580 670609 660963 649344 636617 624040 612056 600050
53217 600050 587289 573711 559630 545172 530486 516196 503045 491150 480135 469891 460670 452440
53205 452440 444713 437115 429673 422399 415101 407723 400423 393054 385040 376050 366538 357429 349525 343224
53191 343224 338361 334137 329606 324541 319540 315129 311176 307393 303951 301190 299016 296941 294575 291883
53177 291883 289186 287069 285996 285740 285479 284699 283710 283018 282516 281741 280709 280024 280117 280679 280907 280147 278316
53160 278316 275868 273409 271308 269673 268511 267748 267120 266371 265589 265132 265215 265747 266472 266971 266699 265496 264047
53143 264047 263245 263058 262566 261282 259850 259229 259741 261147 263054 264852 265868 266085 266314 267197 268473 269613
53127 269613 270611 271558 271945 271240 269912 269100 269355 270295 271373 272320 272884 272871 272560 272506 272841 273297 273968 275364
53109 275364 277454 279267 279859 279320 278431 277679 276942 275940 274508 272547 270114 267659 265853 265022 264903 264982
53093 264982 264923 264589 263850 262638 261178 259923 259113 258553 257910 257087 256165 255209 254370 254045 254524 255476 256140 256163
53075 256163 255956 256092 256613 257077 257034 256277 254820 252911 251002 249515 248646 248362 248476 248681 248612 247974 246603 244593
53057 244593 242573 241610 242369 244318 246143 247089 247539 248195 249144 249987 250536 251017 251729 252693 253548 253762 253144 252198
53039 252198 251625 251437 250947 249727 248087 246419 244605 242483 240454 239139 238647 238642 238945 239676 240869 242285
53023 242285 243577 244487 244950 245165 245376 245478 245140 244451 244085 244530 245463 246207 246529 246657 246747 246766 246750 246902 247460
53004 247460 248632 250417 252308 253477 253556 252997 252442 251999 251445 250818 250418 250429 250829 251495 252160 252538 252728 253176
52986 253176 253977 254628 254807 254891 255297 255776 255973 256237 257132 258460 259520 260190 261018 262303 263807 265386 267231
52969 267231 269421 271851 274631 277945 281436 284341 286391 287953 289168 289579 288951 287862 287084 286767 286594
52954 286594 286387 286153 285780 285038 283788 282000 279692 277062 274504 272287 270340 268487 266712 265077 263574
52939 263574 262334 261787 262270 263399 264146 263743 262462 261289 260775 260438 259467 257808 256185 255110 254392 253773
52923 253773 253543 254111 255241 256192 256504 256326 256053 255935 255991 256038 255879 255663 255894 256831 257981 258527 258230 257645 257424
52904 257424 257616 257670 257001 255597 254163 253506 253709 254092 254025 253529 253002 252709 252690 252839 252831 252457 252225 253129 255422
52885 255422 258088 259969 260902 261236 260818 259331 257303 255862 255494 255728 255987 256162 256366 256763 257636 259141 261035
52868 261035 263131 265819 269534 273800 277476 279880 281101 281431 281231 281316 282491 284531 286338 287307 287879 288652
52852 288652 289679 290860 292206 293302 293149 291040 287201 282370 277202 272279 268079 264578 261341 258305
52838 258305 255978 254522 253201 251204 248722 246702 245768 245635 245442 244445 242615 240697 239552 239416 239981 241010
52822 241010 242364 243511 243698 242783 241393 240149 239217 238629 238429 238330 237955 237584 238009 239423 241199 243009 245306
52805 245306 248265 251096 253086 254553 256029 257114 256971 255518 253304 250567 247301 244015 241530 239980
52791 239980 238671 237026 235145 233410 232010 230922 229967 228882 227628 226603 226209 226282 226271 225980 225836 226437
52775 226437 227975 229989 231563 231999 231536 231147 231449 232093 232450 232458 232404 232279 231945 231654 231833 232413 232926 233162 233284
52756 233284 233370 233349 233347 233606 234033 234316 234494 234955 235793 236589 236945 236863 236511 236034 235769 236252 237704 239692 241518
52737 241518 242785 243522 243975 244516 245565 247308 249424 251233 252145 252023 251246 250516 250510 251457 252916 254053 254299
52720 254299 253781 253027 252303 251415 250183 248751 247253 245429 242991 240247 238005 236917 237137 238427 240164
52705 240164 241408 241608 241288 241529 242619 243724 243998 243479 242750 242272 242280 242758 243188 242895 242032 241705 242665 244321
52687 244321 245525 245904 245922 246063 246598 247774 249565 251363 252496 252964 253215 253435 253573 253773 254135 254240 253588
52670 253588 252477 251787 251899 252386 252788 253043 253123 252920 252670 252902 253716 254622 255329 256177 257488 258953 260082 260913
52652 260913 261912 263404 265522 268451 272233 276314 279627 281266 280968 278996 275860 272286 269152 267093 265964
52637 265964 264865 262976 260447 258337 257605 258251 259514 260735 261822 262964 264221 265523 267022 269228 272592
52622 272592 276854 280853 283234 283421 281873 279440 276765 274320 272652 272207 272902 274078 274924 274991 274387 273568
52606 273568 272946 272677 272801 273334 274096 274702 275084 275786 277307 279251 280685 281279 281530 281826 282044 282176 282561 283141
52588 283141 283270 282765 282421 282789 283121 282412 281078 280591 281596 283290 284745 285952 287296 288652 289529 289809
52572 289809 289990 290688 291965 293129 293285 292157 290294 288438 286945 285910 285415 285367 285450 285547 285883 286425 286615
52555 286615 286093 285236 284472 283549 282138 280696 279900 279497 278667 277377 276425 276097 275716 274794 273824 273573 274156 275162
52537 275162 276190 276974 277387 277620 278003 278527 278853 278879 278846 278791 278424 277742 277284 277507 278243 279012 279569 279935 280183
52518 280183 280406 280679 280957 281246 281851 283138 285034 287175 289509 292299 295478 298585 301489 304633 308235
52503 308235 311763 314572 316646 318295 319410 319411 317844 314762 310645 306165 301938 298362 295688 294104 293470
52488 293470 293069 292041 290173 287950 285854 284026 282633 281964 281963 282152 282349 282996 284444 286263 287697 288521
52472 288521 289123 289939 291158 292780 294625 296305 297458 298012 298188 298394 299184 301036 303939 307359 310750 313969
52456 313969 317055 319769 321518 321671 319999 316990 313642 310638 307743 304328 300398 296632 293451 290641
52442 290641 288017 285825 284194 282764 281305 280164 279640 279312 278573 277531 276814 276610 276508 276236 276088 276500
52426 276500 277514 278767 279813 280418 280698 280958 281327 281679 281979 282467 283320 284314 285104 285739 286704 288502 291326
52409 291326 294946 298792 302363 305829 310097 316128 324300 334555 346717 360156 373221 383538 389174
52396 389174 389543 385396 378198 369502 360520 351976 344266 337686 332442 328502 325565 323231 321245 319652
52382 319652 318726 318681 319425 320638 322007 323327 324497 325609 327003 328998 331620 334786 338629 343351 348865
52367 348865 354929 361557 368797 376094 382371 386932 389873 391506 391852 390917 389046 386760 384596 383222 383100
52352 383100 383726 383825 382813 381710 382048 384161 386992 389358 390906 392108 393845 396846 401038 405530 409646
52337 409646 413851 419273 426450 434931 443959 453083 462269 471975 483065 496131 510871 526595 543316
52324 543316 561792 582378 604437 627163 650477 674754 699946 725400 750400 774603 797986
52313 797986 820570 842207 862560 881350 898663 914935 930531 945519 959908 973954 988009
52302 988009 1002042 1015481 1027618 1038136 1047156 1054824 1061027 1065626 1068814 1070985 1072203 1072006 1069749
52289 1069749 1064988 1057617 1047980 1036972 1025712 1014848 1004330 993967 984044 975229 968131 963078 960092
52276 960092 958923 959366 961745 966772 974637 984516 995359 1006912 1019601 1033714 1049173 1065906 1083756
52263 1083756 1101975 1119397 1135359 1150119 1164236 1177886 1190886 1203034 1214203 1224376 1233781
52252 1233781 1242761 1251299 1258872 1264926 1269336 1272259 1273708 1273448 1271132 1266395 1259005 1249121 1237216 1223593
52238 1223593 1208188 1191157 1173445 1156264 1139952 1123826 1107409 1091361 1076767 1063788 1051629
52227 1051629 1039888 1029269 1020680 1014012 1008339 1003103 998570 995170 992831 991168 990014 989523 989939 991340
52213 991340 993525 996127 999050 1002795 1008063 1014901 1022461 1029750 1036469 1042979 1049678 1056548 1063214 1069215
52199 1069215 1074303 1078526 1082039 1084874 1087078 1089047 1091475 1094871 1099200 1103955 1108452 1112215 1115427 1118930
52185 1118930 1123337 1128173 1132308 1135239 1137299 1138533 1138113 1135317 1130459 1124264 1116795 1107702 1097281 1086554
52171 1086554 1076400 1067152 1058975 1052055 1046322 1041511 1037591 1034764 1032990 1031962 1031642 1032416 1034549 1037860
52157 1037860 1042158 1047627 1054375 1061728 1068342 1073100 1075811 1077030 1077391 1077188 1076496 1075384 1073965 1072499 1071685
52142 1071685 1072568 1075676 1080205 1084552 1087821 1090497 1093513 1097178 1101323 1106030 1111650 1118315 1125925 1134570
52128 1134570 1144613 1156458 1170540 1187392 1207312 1229997 1254870 1281805 1311208 1343363 1377929
52117 1377929 1414054 1450708 1486941 1522061 1555686 1587440 1616685 1642761 1665467 1685059 1701701
52106 1701701 1715086 1724666 1730166 1731864 1730389 1726250 1719678 1711050 1701384 1692013 1683670 1676195 1669187 1662457
52092 1662457 1655600 1647659 1637757 1625823 1612279 1597286 1580709 1562684 1543747 1524601 1506142 1489510
52080 1489510 1475536 1464188 1455038 1448283 1444814 1445180 1448909 1454996 1462768 1472174 1483439 1496606 1511361
52067 1511361 1527349 1544639 1563600 1584148 1605349 1626040 1645543 1663540 1679590 1693267 1704533
52056 1704533 1713506 1720068 1724182 1726392 1727481 1727675 1726611 1723976 1719729 1713806 1706066 1696395 1684395 1669192
52042 1669192 1650158 1627755 1603164 1577239 1550367 1523066 1495938 1469048 1442215 1415984 1391513
52031 1391513 1369327 1349036 1330496 1314414 1301340 1290733 1281582 1273421 1266307 1260206 1254879 1249979
52019 1249979 1244854 1238649 1231002 1222415 1213567 1204580 1195279 1185844 1176780 1168420 1160717 1153282 1145362 1136023
52005 1136023 1124717 1111498 1096591 1080059 1062135 1043484 1024718 1005892 986797 967458 947990
51994 947990 928163 907638 886695 866514 848645 834185 823164 814506 806740 798952 791024 783027
51982 783027 774814 766298 757627 748696 738790 727173 713939 699925 685900 672147 658710 645708
51970 645708 633335 621718 610857 600680 591245 582949 576412 572069 570032 570341 573123 578374 585796
51957 585796 594829 604590 613832 621438 627247 631988 636084 638806 638955 636106 630866 624175 616784 609336
51943 609336 602520 597037 593552 592571 594264 598522 605374 615077 627529 641801 656644 671462 686443
51930 686443 701744 716776 730316 741010 747732 749751 746843 739309 727863 713431 697047 679825
51918 679825 662932 647359 633589 621561 611170 602767 597045 594543 595528 600200 608464 619225 630180
51905 630180 638554 642084 639620 631444 619413 606384 594890 586168 580298 576870 575298 574869 574914 574901 574088
51890 574088 571325 565575 556680 545371 532567 518914 504957 491467 479450 469917 463599 460602 460205
51877 460205 461200 462742 464958 468602 474063 480882 488373 496396 505092 513945 521725 527612 531912 535316
51863 535316 537867 539082 538591 536105 531161 523740 515022 506729 499724 493958 489712 487932 489010 492097
51849 492097 496041 500386 505008 509421 512951 515193 515790 514238 510437 505144 499423 493775 488090 482105
51835 482105 475619 468654 461842 456322 452861 451238 450760 450991 451626 452131 452132 451979 452415 453705 455391 456665
51819 456665 456699 454921 451468 447267 443324 440024 437339 435372 434296 433972 434074 434560 435680 437651 440506
51804 440506 444105 447991 451452 453916 455100 454707 452493 448970 445493 443094 441516 439894 438032 436464
51790 436464 435454 434562 433085 430527 426834 422636 419024 416534 414546 412145 409405 407292 406477 406859 408055
51775 408055 409690 411227 412180 412622 413025 413580 414192 415094 416873 419872 424119 429871 437597 447200 457842
51760 457842 468789 479930 491150 501646 510290 516447 520106 521334 519915 515555 508312 498852 488292
51747 488292 477715 467773 458677 450444 443104 436852 431991 428481 425630 422794 420600 420818 424478 430715
51733 430715 438155 446936 458334 472448 487178 499724 508481 513423 515536 516327 517439 520134 524998
51720 524998 531827 539262 544696 545467 540712 531912 521543 511548 503078 496836 492955 490703 488756 485843
51706 485843 481160 474496 466279 457515 449590 444024 442045 443872 448333 453448 457534 459771 460154 459400 458690
51691 458690 458781 459228 458998 457934 457097 457499 458977 460504 461105 460218 457615 453504 448599 443850 440102 437904
51675 437904 437298 437797 438902 440723 443776 448199 453608 459698 466461 473781 481512 490245 501343 515601
51661 515601 532107 548710 563262 574074 579646 578795 571321 558451 542614 526641 512775 502059
51649 502059 494759 491301 492380 497864 505976 513921 519307 520937 518665 512936 504392 493639 481367 468633
51635 468633 456664 446120 436769 428059 419880 412624 406759 402580 400100 398915 398356 398048 398248 399452
51621 399452 401788 404878 408135 411013 413155 414466 415004 414782 413883 412802 412318 412818 413912 414849 415105 414445
51605 414445 412801 410333 407462 404601 402033 400184 399712 401009 403769 407362 411522 416428 422270 429060
51591 429060 436834 445671 455250 464404 471252 474029 472091 466298 458413 450158 442754 436984 433166 431051
51577 431051 430158 430438 432426 436642 443128 451661 462130 474547 488790 504385 520529 536585 552917
51564 552917 570940 591642 613995 635477 654428 671429 688375 706971 728497 754183 784955
51553 784955 820917 861309 904341 946573 983192 1010039 1025509 1030107 1024588 1009386 985613 955421
51541 955421 920879 883070 842703 801167 760506 722499 687994 657036 629392 604996 583908
51530 583908 565885 550217 536174 523538 512484 503058 495026 488114 482067 476607 471687 467700 464955
51517 464955 462923 460553 457518 454747 453410 453708 454934 456449 458178 460320 462908 465659 467958 468957 467997
51502 467997 465016 460518 455208 449850 445351 442479 441248 440843 440402 439728 438977 438018 436609 435103 434257 434122
51486 434122 433710 432223 430184 428796 428424 428305 427582 425993 423542 420186 416141 411991 408136 404410 400511
51471 400511 396529 392802 389487 386527 383825 381261 378708 376232 374122 372553 371414 370590 370170 370160 370254 370207
51455 370207 370259 370887 372134 373486 374452 375125 376183 378390 382054 386885 392435 398648 405817 414026 422909
51440 422909 432155 442053 453252 465966 479388 491728 500805 504957 503918 499082 492942 488017 485795
51427 485795 486048 486987 486364 482808 476317 467802 458515 449835 442959 438348 435519 433471 431316 428695 426009
51412 426009 424301 424519 426682 430029 434021 438741 444163 449491 453594 455889 456622 456564 456644 457465 458790 459680
51396 459680 459429 458206 456653 455264 454408 454572 456123 459037 463271 469172 477093 486788 497604 509292
51382 509292 522328 537565 555900 578284 605659 638645 677229 720694 768000 818635 873111
51371 873111 931918 993351 1052524 1103150 1140558 1163235 1172105 1168957 1155394 1132529 1101225 1062560
51359 1062560 1018021 969246 917826 865466 813961 764628 717991 674364 634567 599649 570049
51348 570049 545364 524849 507807 493657 481993 472572 464974 458380 451993 445587 439343 433344 427599
51335 427599 422358 417848 413650 408909 403396 398026 393994 391536 389793 387865 385783 384292 383773 383687 383261
51320 383261 382446 381796 381563 381484 381485 381938 382982 384205 385359 386792 388716 390612 392001 393351 395489 398419
51304 398419 401435 404167 406752 409012 410308 410345 409608 408801 408189 407469 405900 402661 397619 391769 386507 382479
51288 382479 379493 377353 376116 375583 375231 374922 375176 376533 379043 382479 386663 391442 396684 402342 408166
51273 408166 413343 416888 418532 418817 418337 417384 416421 416242 417283 419168 421282 423549 426372 430013 434197
51258 434197 438122 440760 441410 440136 437574 434342 430835 427423 424401 421690 419006 416327 413834 411411
51244 411411 408792 406260 404590 404043 403935 403524 402813 402086 401123 399407 396898 394139 391700 389873 388727 388107
51228 388107 387615 386860 385760 384481 383249 382334 382040 382488 383501 384801 386167 387327 388020 388414 389116 390459
51212 390459 391947 392819 393076 393579 395126 397817 401363 405622 410531 415729 420628 424878 428517 431536 433587
51197 433587 434341 434043 433440 433071 432871 432485 431721 430542 428880 426703 424146 421407 418651 416126 414126 412612
51181 412612 411166 409611 408512 408586 409697 410875 411389 411502 412016 413332 415146 416981 418833 421114 423805
51166 423805 425938 426359 425131 423697 423473 424670 426761 429437 432574 435701 438261 440235 441946 443483 444865
51151 444865 446399 448176 449404 449147 447667 446241 445655 445629 445694 445695 445226 443580 440721 437579 434873 432252 429083
51134 429083 425473 421940 418615 415410 412675 410982 410377 410372 410646 411368 412780 414782 417059 419519 422520 426515
51118 426515 431353 436085 439743 442232 444213 446224 448350 450641 453316 456444 459820 463237 466505 469241
51104 469241 471162 472603 474260 476349 478508 480545 482647 484711 486128 486475 485944 484931 483740 482809 482583
51089 482583 482902 483115 483016 483056 483418 483634 483398 483006 482581 481622 479910 478163 477163 476779 476434 475993 475613 475297
51071 475297 475242 476081 478094 480617 482952 485375 488547 492396 496484 501148 507303 515329 525066 536934 552193
51056 552193 571760 595019 619548 641665 657922 667353 672576 678046 687031 700393 717560 737309
51044 737309 757541 775689 790253 801464 809844 814528 813600 805969 792638 776331 760167 746479
51032 746479 736180 728573 721439 711694 696926 677063 654532 632376 612307 594625 579455 567261
51020 567261 558307 552378 549163 548436 549794 552736 557148 563226 570851 579482 588774 598768 609280 619587
51006 619587 629068 637784 646116 654222 662221 670630 680058 690482 701201 711636 721934 732620 743802
50993 743802 754911 765247 774573 783066 790867 797910 804113 809368 813304 815499 816207 816605 818023 821158
50979 821158 826296 833979 844869 858857 874687 890680 905775 919963 933992 948788 965198 984209
50967 984209 1007139 1035221 1068884 1107773 1151563 1200452 1254709 1314113 1378085 1445974 1516947
50956 1516947 1589971 1664260 1739424 1814745 1888534 1958524 2022704 2079642 2128566 2169626 2203641
50945 2203641 2230972 2250892 2262608 2266612 2264532 2258171 2249416 2240473 2232809 2225598 2216148 2202303 2183982
50932 2183982 2162478 2139199 2115364 2091916 2068946 2045495 2020348 1992752 1962200 1928076 1889933
50921 1889933 1847762 1801646 1751569 1697952 1642030 1585204 1528217 1471392 1415480 1361815 1311617
50910 1311617 1265524 1223811 1186623 1153761 1124471 1097786 1073220 1051028 1031660 1015001 1000276
50899 1000276 986673 973785 961363 949029 936541 924238 912852 902912 894492 887415 881426 876298
50887 876298 872044 868966 867266 866740 867129 868517 870982 874037 876913 879394 881933 885028 888925 893921 900403
50872 900403 908435 917732 928137 939726 952389 965797 979979 995550 1013133 1032934 1055012 1079558
50860 1079558 1106645 1136097 1167956 1202813 1241350 1283772 1330064 1380680 1436700 1499258 1569112
50849 1569112 1646856 1733371 1829809 1936939 2054527 2181553 2317144 2461058 2613140 2772543
50839 2772543 2937792 3107375 3279745 3452590 3622308 3784264 3933431 4065052 4175248
50830 4175248 4261336 4321808 4356374 4366303 4354389 4324039 4278427 4220737 4154876 4085281 4016048
50819 4016048 3950698 3892601 3844763 3808745 3784014 3768301 3758056 3748567 3734515 3711275 3675916
50808 3675916 3627085 3564287 3487351 3396236 3291204 3173436 3045406 2910299 2771017 2630102
50798 2630102 2490492 2355632 2228515 2110935 2003790 1907683 1823027 1749991 1688573 1638487
50788 1638487 1598868 1568467 1546219 1531276 1522485 1518359 1517741 1519963 1524167 1528938 1532928 1535433 1536107
50775 1536107 1534572 1530648 1524614 1516870 1507617 1497035 1485379 1472601 1458151 1441445 1422282 1400686
50763 1400686 1376773 1351011 1324226 1297046 1269636 1242247 1215616 1190476 1167029 1145185 1125056
50752 1125056 1106987 1091416 1078921 1069952 1064249 1060959 1059589 1060405 1063640 1068969 1076320 1086586 1100822
50739 1100822 1119102 1140928 1166529 1196996 1233236 1275423 1323385 1376913 1435715 1499646 1569023
50728 1569023 1644151 1724493 1808816 1896133 1985901 2077213 2168483 2258291 2346117 2431880 2515018
50717 2515018 2594254 2667833 2733412 2787783 2827241 2848716 2850834 2834171 2800854 2754132 2698214
50706 2698214 2637933 2577881 2521471 2470858 2427656 2393332 2368650 2353038 2344841 2342119 2342979 2345344
50694 2345344 2346739 2344360 2335241 2316600 2286540 2244614 2191670 2129272 2059498 1985066 1909092 1834385
50682 1834385 1763048 1696681 1636619 1583797 1538620 1501326 1472437 1452626 1442076 1440190 1446168 1459825
50670 1459825 1481651 1511929 1549976 1594274 1643100 1694709 1747080 1797980 1845559 1888735 1926984
50659 1926984 1960043 1987996 2011425 2031235 2048405 2064017 2079241 2094846 2110631 2125644 2139210
50648 2139210 2151641 2163794 2176063 2188186 2200235 2213487 2229955 2251137 2277510 2309113 2346077
50637 2346077 2388489 2436180 2488752 2545252 2603628 2661105 2715555 2766081 2812103 2852717 2887593
50626 2887593 2917764 2944763 2969598 2993057 3015387 3033423 3038560 3020436 2974354 2904732 2821362
50615 2821362 2733715 2648915 2572509 2508542 2458908 2423795 2402713 2394507 2396914 2407185 2423037 2442390
50603 2442390 2462431 2479620 2490549 2492454 2483297 2461979 2428267 2382208 2324053 2255205 2178649 2097729
50591 2097729 2014828 1931694 1850392 1772988 1700578 1633448 1571972 1516629 1467274 1423191 1383764
50580 1383764 1348457 1316278 1286059 1257348 1230486 1205833 1183490 1163728 1147104 1134019 1124463
50569 1124463 1118147 1114561 1113055 1113309 1115558 1120104 1126847 1135631 1146628 1159916 1175099 1192006 1211381
50556 1211381 1234260 1261007 1291593 1326321 1365440 1408284 1453713 1501181 1550541 1601038 1651461
50545 1651461 1701210 1750222 1797911 1843271 1886185 1927704 1968934 2010588 2053845 2100555 2152115
50534 2152115 2208895 2271191 2340030 2416590 2501332 2594019 2694050 2800600 2913184 3032419
50524 3032419 3159610 3295273 3438636 3588671 3744621 3904940 4066476 4225504 4379088
50515 4379088 4524853 4659846 4780289 4882304 4962461 5017947 5046747 5047644 5020013 4963952 4880859
50504 4880859 4773475 4645264 4500283 4343836 4182450 4022528 3869327 3727562 3602185
50495 3602185 3497721 3417013 3361201 3330598 3324956 3343008 3382289 3439258 3509057 3585153 3659568
50484 3659568 3723432 3767475 3783140 3764752 3711181 3625268 3511863 3376665 3226136 3066891
50474 3066891 2904369 2742378 2584024 2432368 2289785 2157241 2034819 1922756 1821510
50465 1821510 1730966 1650146 1577837 1513281 1456183 1406313 1363211 1326117 1294089 1266324 1242513
50454 1242513 1222792 1207163 1194993 1185124 1176383 1167877 1159030 1149725 1140497 1132338 1126167 1122623 1122214
50441 1122214 1125241 1131517 1140525 1151949 1165446 1179700 1192411 1201909 1208474 1213598 1218437 1223708 1230586
50428 1230586 1240539 1254131 1270892 1290554 1313638 1340482 1370374 1402069 1434710 1467911 1501511
50417 1501511 1535788 1571605 1609944 1651385 1696228 1744831 1797613 1854963 1917300 1984924 2057646
50406 2057646 2134843 2215858 2299874 2385214 2469399 2550365 2627343 2700223 2768405 2830572 2885271
50395 2885271 2931210 2967065 2991195 3001406 2995068 2970078 2926222 2865422 2790478 2703946 2608571
50384 2608571 2508188 2407472 2310693 2221025 2140755 2071615 2014860 1971361 1941679 1925910 1923538
50373 1923538 1933542 1954413 1983839 2018569 2054859 2088867 2116556 2133786 2137217 2125232 2097887
50362 2097887 2056262 2002243 1938589 1868432 1794438 1718635 1642961 1569455 1499702 1434257 1372768
50351 1372768 1314597 1259353 1207122 1158377 1113668 1073348 1037552 1006363 979954 958558 942109
50340 942109 929876 920767 914439 911931 914589 922358 933784 947725 964019 981737 997494 1006661 1006439
50327 1006439 997392 982305 964301 945913 928954 914466 902794 893828 887155 882230 878813 877211
50315 877211 877765 880195 883861 888556 894484 901418 908494 915170 921933 929700 938783 948838 959482 970513
50301 970513 981623 992415 1002819 1013170 1023674 1034075 1044120 1054234 1065422 1078463 1093382
50290 1093382 1109810 1127616 1146869 1167274 1188078 1208871 1230342 1254033 1281613 1314968 1356923
50279 1356923 1410315 1474095 1539284 1590068 1611588 1598743 1558315 1503080 1444165 1388021 1337870
50268 1337870 1295478 1261295 1234436 1213496 1197200 1184256 1173330 1163589 1154950 1147549 1141306 1136203
50256 1136203 1132676 1131510 1133570 1139595 1149778 1163410 1179430 1197599 1218909 1244738 1276010 1313152
50244 1313152 1356207 1404640 1457450 1513730 1572646 1632571 1690821 1744738 1792816 1834599 1870158
50233 1870158 1900274 1926705 1951475 1975722 1999183 2020220 2035807 2042005 2035361 2014090 1977907 1927318
50221 1927318 1863846 1790756 1712695 1634283 1559109 1489684 1427645 1373835 1328608 1292033 1263259
50210 1263259 1239587 1216750 1190780 1160036 1125770 1090955 1058364 1029195 1003163 979612 958384
50199 958384 939691 923586 909823 897942 887270 877137 867347 858230 850013 842420 835052 827783 820535
50186 820535 813135 805726 798793 792330 785473 777550 769087 761150 754055 747481 741443 736249 731653 727023
50172 727023 722474 718969 717049 716144 715385 714531 713856 713702 714451 716468 719696 723614 727797 732337 737624 743993
50156 743993 751613 760378 769889 779926 790948 803753 818525 834622 851310 868225 885029 901128
50144 901128 916045 929777 942613 954849 966746 978455 989999 1001696 1014610 1030145 1049212
50133 1049212 1072361 1100785 1136493 1181153 1235369 1299406 1373899 1459136 1553944 1655865 1762154
50122 1762154 1870059 1976360 2077632 2171514 2257702 2337649 2413489 2487181 2560139 2632895 2704383
50111 2704383 2771169 2827510 2866815 2883706 2875309 2841319 2783573 2705667 2612217 2507664 2395515
50100 2395515 2278729 2160608 2044939 1935205 1833689 1741212 1657484 1581744 1513406 1452383
50090 1452383 1398900 1352888 1313500 1279225 1248688 1221408 1197668 1177689 1161191 1147842 1137683
50079 1137683 1130612 1125655 1121331 1116804 1112247 1107941 1103438 1097844 1090653 1082045 1072502 1062398 1051877
50066 1051877 1040972 1029830 1018810 1008266 998187 988159 977743 966906 956124 946192 937761 930860
50054 930860 924915 919440 914660 911212 909289 908377 907922 908067 909560 913023 918354 924821 931737 939109 947475
50039 947475 957094 967513 978073 988540 998955 1009107 1018584 1027286 1035558 1043828 1052325 1061011 1069517
50026 1069517 1077341 1084416 1091307 1098469 1105567 1111973 1117659 1123052 1128211 1132997 1138023 1144675 1154031 1166438
50012 1166438 1182213 1201835 1225006 1250356 1276957 1305893 1339758 1380613 1428504 1481448 1536330
50001 1536330 1590088 1640688 1687259 1729485 1767376 1801916 1835432 1870646 1909057 1950048 1990904
49990 1990904 2027187 2053450 2064526 2056831 2028893 1981230 1916141 1837486 1750108 1658950 1568162
49979 1568162 1480430 1396853 1317748 1243836 1176503 1116742 1064186 1017540 975826 938894 906880
49968 906880 879552 856321 836621 820053 806160 794148 783096 772646 763331 755856 750063 744994
49956 744994 739976 735161 730853 726948 723457 721126 720942 723200 727522 733618 741542 751214 762136 773640
49942 773640 785064 795666 804696 811721 816776 820205 822465 824032 825203 825852 825410 822961 817322 807353
49928 807353 792667 774193 753855 733529 714299 696575 680609 666702 655023 645460 637792 631985
49916 631985 628260 626776 627266 629023 631247 633351 635041 636266 637190 638122 639438 641604 645157 650440 657211
49901 657211 664713 672204 679510 687126 695911 706632 719522 734115 749448 764375 777661 788041
49889 788041 794627 797490 797745 796832 795586 793786 790513 785000 777208 767554 756301 743580 730010 716672
49875 716672 704073 691581 678401 664797 651799 640041 629605 620761 614019 609344 606040 603644
49863 603644 602336 602324 603433 605495 608586 612662 617515 623296 630557 639517 649736 660684 672081 683561
49849 683561 694737 705924 718099 731578 745240 757469 767399 774878 779949 782982 784811 785937 785847
49836 785847 783613 778762 771103 760349 746829 732294 719015 708005 698747 690575 683553 677976 673810
49823 673810 670962 669605 669815 671180 673053 675140 677751 681530 686938 693939 702249 711810 722710 734572
49809 734572 746439 757547 767844 777528 786448 794287 800999 806611 810938 813821 815339 815397 813607 810101
49795 810101 805987 802256 798522 793503 786420 777148 765338 750549 733465 716084 700274 686589 674626
49782 674626 663953 654492 646515 640515 636674 634355 632522 630729 629162 627754 626020 624022 622760 623166
49768 623166 625274 628811 633975 640957 649112 657401 665587 674303 683845 693465 702066 709250 715421 721087
49754 721087 726363 731076 735029 737981 739382 738331 733941 725897 714760 701789 688470 676090 665579
49741 665579 657511 651975 648368 645614 642958 640504 638735 637612 636552 635248 634091 633680 634433 636803 641230
49726 641230 647402 653918 659176 662478 664180 665233 666921 670546 676768 685388 696037 708675 723099
49713 723099 738613 754745 771603 788549 802961 811529 813013 808983 801920 793504 784722 776454 769180
49700 769180 762703 756755 751739 748638 748409 751316 756213 760323 760473 755174 745455 733574 721344 709745
49686 709745 699502 691398 686067 683649 683588 684841 686692 689540 694616 702848 714202 728079 743950 761745
49672 761745 782134 806329 834666 864782 891658 910128 917734 915576 907072 896026 885227 876235
49660 876235 870139 868062 870565 877077 886745 899479 914763 929163 936505 931773 914638 888825 858919
49647 858919 828386 799560 773805 751453 732391 716833 704969 696053 688664 682027 676596 673249
49635 673249 672375 673741 676711 680383 683912 686794 688656 688891 686947 683081 678322 673470 668313 662038 654289
49620 654289 645724 637659 631136 626265 622406 618935 615681 612688 609944 607588 606051 605657 606318 607899 610537
49605 610537 614191 618149 621617 624669 628005 631789 635345 638118 640294 642226 643781 644734 645373 646212 647260
49590 647260 648060 648424 648730 649429 650547 651821 653161 654764 656802 659135 661430 663549 665705 668139 670720
49575 670720 673033 674857 676376 677834 679234 680614 682509 685805 690996 697797 705651 714402 724202 734851
49561 734851 745604 755747 765022 773319 780203 785069 787627 787964 786243 782677 777701 771832 765333 758387
49547 758387 751580 745751 741232 737685 734943 733599 734272 736529 739048 740836 741921 742917 744379 746730 750324
49532 750324 755168 760711 766272 771683 777337 783679 791013 799838 810980 825045 841976 861483 883578
49519 883578 907933 932532 953744 968469 976204 978720 978090 975562 971977 968303 965468 964250 965669
49506 965669 970966 980622 993496 1007161 1018988 1026821 1029054 1024616 1013106 994962 971670 945736
49494 945736 920001 896491 875835 857747 841796 827657 815070 803967 794488 786691 780474 775964
49482 775964 773571 773242 773954 774476 774531 774701 775346 776235 777295 779015 781771 785149 788356 791038 793361 795493
49466 795493 797405 799145 801018 803415 806554 810325 814286 817939 821214 824570 828372 832266 835493 837748
49452 837748 839349 840387 840110 837559 832723 826725 820789 815212 809467 803127 796507 790301 784812 779774
49438 779774 775033 771160 769052 768998 770447 772717 775645 779462 784504 791231 800154 811443 824971 840956
49424 840956 860098 882707 908265 936325 967150 1000867 1037091 1076646 1122285 1174491 1225820
49413 1225820 1262198 1272584 1257367 1226677 1191759 1159184 1131468 1109637 1093810 1082923 1075404
49402 1075404 1070177 1066844 1065425 1066061 1068527 1071998 1075759 1079993 1085261 1091387 1097616 1103738 1110170 1116899
49388 1116899 1123191 1128402 1132146 1133639 1131884 1126842 1119502 1110522 1099725 1087353 1074742 1062998 1051834
49375 1051834 1040557 1029613 1020251 1013001 1007369 1002974 1000292 1000171 1002944 1008113 1014777 1022347 1030775 1039844
49361 1039844 1048466 1055306 1060107 1063722 1066625 1068077 1067099 1063633 1058383 1052137 1045675 1039721 1034389 1029127
49347 1029127 1023699 1018820 1015376 1013464 1012692 1012967 1014367 1016516 1018725 1020616 1022156 1023238 1023528 1022571 1019902
49332 1019902 1015443 1010054 1005137 1001330 997996 994441 991173 989419 989771 991754 994449 997120 999574 1002377
49318 1002377 1006515 1012459 1019775 1027736 1035868 1043806 1051458 1059683 1069988 1082889 1097247 1111850 1126971
49305 1126971 1143603 1161908 1181369 1201895 1223708 1246530 1269755 1292817 1314104 1329820 1335489
49294 1335489 1329183 1312801 1290329 1265624 1241557 1219878 1201201 1185492 1172698 1162594 1154359 1147139
49282 1147139 1140937 1136165 1132418 1128474 1123506 1117491 1110536 1102699 1094609 1087317 1081245 1075888 1070692 1065598
49268 1065598 1060751 1056429 1053381 1052398 1053320 1055073 1056791 1058337 1059795 1061198 1062778 1064693 1066575 1068145
49254 1068145 1070222 1074267 1081105 1091239 1106130 1127402 1154380 1184073 1214182 1244399 1273574 1297333
49242 1297333 1310436 1310936 1300563 1281787 1256279 1226073 1194305 1164006 1136911 1113668 1094339 1078409
49230 1078409 1065211 1054895 1048538 1046936 1049519 1054630 1060574 1066445 1072410 1079396 1088118 1098171 1108256
49217 1108256 1117381 1125538 1133216 1140667 1147969 1155507 1163994 1173893 1184917 1196140 1206530 1215440 1222797
49204 1222797 1229052 1235049 1241757 1249860 1259606 1271105 1284608 1300119 1316821 1333333 1348737 1363094
49192 1363094 1376822 1389949 1402256 1413859 1425220 1436564 1447520 1457410 1465807 1472888 1479311 1485799
49180 1485799 1492829 1500738 1510015 1521357 1535489 1553043 1574440 1599668 1628365 1660505 1696963 1739204
49168 1739204 1788582 1846159 1912391 1985481 2059405 2124465 2171103 2194143 2194315 2176939 2149506 2119315
49156 2119315 2091678 2069362 2053300 2043486 2039222 2039142 2041625 2045158 2048337 2050158 2050714 2051176 2052560 2054896
49142 2054896 2058036 2062748 2070159 2080292 2092003 2104429 2117818 2132792 2149405 2167245 2185930 2205188
49130 2205188 2224738 2244397 2264161 2284046 2304081 2324503 2345532 2366816 2387444 2406846 2425413
49119 2425413 2443999 2463104 2482860 2503528 2525530 2549146 2574662 2602825 2634768 2671562 2714347
49108 2714347 2764965 2825905 2899578 2988613 3097523 3232755 3398075 3587293 3781682 3958092
49098 3958092 4104856 4232740 4367845 4527079 4695316 4827371 4877823 4834353 4724927 4593637
49088 4593637 4468849 4350565 4222017 4069600 3893940 3707800 3527209 3364060 3223899
49079 3223899 3107556 3013209 2937430 2876215 2826484 2786582 2755173 2730428 2710767 2695459 2683502
49068 2683502 2672553 2660229 2646242 2632134 2619086 2606988 2595523 2584935 2575466 2566998 2559470 2552808
49056 2552808 2546271 2538864 2530792 2523618 2518540 2515161 2512380 2509755 2507446 2505425 2503456 2501598 2500239 2499744
49042 2499744 2500333 2502161 2505425 2510533 2518099 2528420 2541028 2555154 2570428 2586506 2602161 2615612
49030 2615612 2625964 2633697 2639672 2644385 2648297 2652033 2655819 2659346 2662420 2665089 2666963 2667337 2666385 2665421
49016 2665421 2665421 2666051 2666758 2668018 2670693 2674729 2679396 2684488 2690496 2697721 2705905 2714673 2723799 2733047 2742229
49001 2742229 2751449 2760992 2770909 2780749 2789603 2796467 2800880 2803264 2804324 2804127 2802217 2798615 2794058 2789153
48987 2789153 2783960 2778636 2773683 2769201 2764585 2759424 2754118 2749148 2744301 2739260 2734479 2730872 2728929 2728537
48973 2728537 2729281 2730476 2731322 2731569 2731700 2732153 2732671 2732804 2732560 2732106 2731268 2729861 2728210 2726972 2726668 2727672 2730251
48956 2730251 2734202 2738804 2743455 2748158 2753286 2759386 2767306 2777905 2791364 2807362 2826086 2848280 2874077
48943 2874077 2902634 2933272 2965956 3000191 3034545 3068147 3101847 3137135 3174647 3214450 3256779
48932 3256779 3301476 3347598 3394790 3444410 3498071 3555548 3615263 3676330 3738874 3802761 3867443
48921 3867443 3933009 4000092 4068649 4137822 4207155 4276999 4347541 4418143 4487707 4555164 4619696
48910 4619696 4681105 4739821 4796065 4849435 4899899 4948543 4996321 5042457 5085219 5124021 5159729
48899 5159729 5193093 5224041 5252397 5278186 5301193 5321284 5339203 5355972 5371377 5383989 5392837
48888 5392837 5398126 5400163 5398539 5392588 5381888 5366154 5345406 5320371 5292025 5260671 5226147 5188784
48876 5188784 5149337 5108073 5064800 5019658 4972800 4923372 4870044 4812659 4752208 4689070 4622633
48865 4622633 4553038 4482011 4411327 4341573 4273036 4206766 4143880 4084632 4028962 3977285 3929916
48854 3929916 3886262 3845406 3807263 3772511 3741561 3714093 3689485 3667372 3647837 3631162 3617252
48843 3617252 3605476 3595479 3588008 3584373 3585127 3589830 3597922 3609021 3622431 3637404 3654092 3673379 3695436
48830 3695436 3719280 3744024 3769746 3796691 3824365 3851930 3878951 3905438 3931696 3958386 3986077
$$ [...]
##END NTUPLES=NMR SPECTRUM
##END=
