
##TITLE=AC1396_KENAH12208_7519595_p3BysR0INB
##JCAMPDX= 6.0         $$ Bruker NMR JCAMP-DX V2.0
##DATA TYPE= NMR SPECTRUM
##DATA CLASS= NTUPLES
##ORIGIN= BRUKER
##OWNER= Administrator
$$ 1.72 TOPSPIN		Version 2.1
$$ 2013-02-20 01:55:31.293 -0500  Administrator@X
$$ Compression mode = diff/dup
##.OBSERVE FREQUENCY= 400.02188249412
##.OBSERVE NUCLEUS= ^1H
##.ACQUISITION MODE= SIMULTANEOUS (DQD)
##.ACQUISITION SCHEME= undefined
##.AVERAGES= 8
##.DIGITISER RES= 22
##SPECTROMETER/DATA SYSTEM= spect
##.PULSE SEQUENCE= zg30
##.SOLVENT NAME= COFFEE_meoh
##.SHIFT REFERENCE= INTERNAL, COFFEE_meoh, 1, 14.98509
##AUDIT TRAIL= $$ (NUMBER, WHEN, WHO, WHERE, PROCESS, VERSION, WHAT)
$$ ##TITLE= Audit trail, TOPSPIN		Version 2.1
$$ ##JCAMPDX= 5.01
$$ ##ORIGIN= Bruker BioSpin GmbH
$$ ##OWNER= Administrator
$$ $$ E:\/data/COFFEE/nmr/AC1396_KENAH12208_7519595_p3BysR0INB/10/pdata/1/auditp.txt
$$ ##AUDIT TRAIL=  $$ (NUMBER, WHEN, WHO, WHERE, PROCESS, VERSION, WHAT)
(   1,<2013-02-20 01:55:23.074 -0500>,<Administrator>,<X>,<go>,<TOPSPIN 2.1>,
      <created by zg
	started at 2013-02-20 01:54:16.574 -0500,
	POWCHK enabled, PULCHK disabled,
       configuration hash MD5:
       86 BA 57 50 F2 9D 5C 9B 26 00 A9 28 5F 66 2E 89
       data hash MD5: 64K
       73 04 FD 4D E8 9D 6B AD D2 02 6F 1F 44 64 80 6F>)
(   2,<2013-02-20 01:55:26.152 -0500>,<Administrator>,<X>,<proc1d>,<TOPSPIN 2.1>,
      <Start of raw data processing
       efp LB = 0 FT_mod = 6 PKNL = 1 PHC0 = 0 PHC1 = 0 SI = 32K 
       data hash MD5: 32K
       93 60 BE 27 C6 1A AF 01 0C A8 AF 49 B7 96 CA 7B>)
(   3,<2013-02-20 01:55:26.636 -0500>,<Administrator>,<X>,<proc1d>,<TOPSPIN 2.1>,
      <pk PHC0 = 69.55994 PHC1 = 0 
       data hash MD5: 32K
       A3 9F 3A CD 82 7A F4 E4 F8 76 24 82 C4 26 DC 27>)
(   4,<2013-02-20 01:55:26.855 -0500>,<Administrator>,<X>,<proc1d>,<TOPSPIN 2.1>,
      <abs ABSG = 1 
       data hash MD5: 32K
       38 9E 35 6F 8E FF 16 C1 6E F7 AF 14 85 74 CF A5>)
(   5,<2013-02-20 01:55:27.027 -0500>,<Administrator>,<X>,<proc1d>,<TOPSPIN 2.1>,
      <abs ABSG = 2 
       data hash MD5: 32K
       7B D4 78 42 1C 63 12 E4 61 1D 68 FB B0 65 16 B2>)
(   6,<2013-02-20 01:55:27.168 -0500>,<Administrator>,<X>,<proc1d>,<TOPSPIN 2.1>,
      <abs ABSG = 3 
       data hash MD5: 32K
       04 85 23 E9 62 05 C4 F6 F9 B0 29 E0 04 72 42 52>)
(   7,<2013-02-20 01:55:27.308 -0500>,<Administrator>,<X>,<proc1d>,<TOPSPIN 2.1>,
      <abs ABSG = 4 
       data hash MD5: 32K
       7B F2 1F 38 3E A4 FC C5 D8 D4 B0 90 2A F5 05 1F>)
(   8,<2013-02-20 01:55:27.464 -0500>,<Administrator>,<X>,<proc1d>,<TOPSPIN 2.1>,
      <abs ABSG = 5 
       data hash MD5: 32K
       02 2F 8E 27 3D 84 1E 35 1A A3 E1 CA D0 23 EB F4>)
$$ ##END=
$$ 
$$ $$ hash MD5
$$ $$ D2 2A 2F 0D 81 60 C4 74 9F 0E EE 30 3A F6 1E DD
##$RELAX= 
##$RELAX= 
##$RELAX= 
##$RELAX= 
##$RELAX= 
##$RELAX= 
##$RELAX= 
$$ Bruker specific parameters
$$ --------------------------
##$DU= <E:\>
##$EXPNO= 10
##$NAME= <AC1396_KENAH12208_7519595_p3BysR0INB>
$$ [...]
150 150 150 150 150 150 150 150
##$TP07= 0
##$TPNAME0= <>
##$TPNAME1= <>
##$TPNAME2= <>
##$TPNAME3= <>
##$TPNAME4= <>
##$TPNAME5= <>
##$TPNAME6= <>
##$TPNAME7= <>
##$TPOAL= (0..7)
0.5 0.5 0.5 0.5 0.5 0.5 0.5 0.5
##$TPOFFS= (0..7)
0 0 0 0 0 0 0 0
##$TUNHIN= 0
##$TUNHOUT= 0
##$TUNXOUT= 0
##$USERA1= <user>
##$USERA2= <user>
##$USERA3= <user>
##$USERA4= <user>
##$USERA5= <user>
##$V9= 5
##$VALIST= <valist>
##$VCLIST= <CCCCCCCCCCCCCCC>
##$VD= 0
##$VDLIST= <DDDDDDDDDDDDDDD>
##$VPLIST= <PPPPPPPPPPPPPPP>
##$VTLIST= <TTTTTTTTTTTTTTT>
##$WBST= 1024
##$WBSW= 4
##$XGAIN= (0..3)
0 0 0 0
##$XL= 0
##$YL= 0
##$YMAX_a= 542479
##$YMIN_a= -540584
##$ZGOPTNS= <>
##$ZL1= 120
##$ZL2= 120
##$ZL3= 120
##$ZL4= 120
##$ABSF1= 14.98509
##$ABSF2= -5.573092
##$ABSG= 5
##$ABSL= 3
##$ALPHA= 0
##$AQORDER= 0
##$ASSFAC= 0
##$ASSFACI= 0
##$ASSFACX= 0
##$ASSWID= 0
##$AUNMP= <proc_prof1d_extract_pilot.lims>
##$AXLEFT= 0
##$AXNAME= <>
##$AXNUC= <1H>
##$AXRIGHT= 0
##$AXTYPE= 0
##$AXUNIT= <>
##$AZFE= 0.1
##$AZFW= 0.1
##$BCFW= 0
##$BC_mod= 0
##$BYTORDP= 0
##$COROFFS= 0
##$CY= 15
##$DATMOD= 1
##$DC= 0
##$DFILT= <>
##$DTYPP= 0
##$F1P= 0
##$F2P= 0
##$FCOR= 0.5
##$FTSIZE= 32768
##$FT_mod= 6
##$GAMMA= 0
##$GB= 0
##$INTBC= 1
##$INTSCL= 1
##$ISEN= 128
##$LB= 0
##$LEV0= 0
##$LPBIN= 0
##$MAXI= 10000
##$MC2= 0
##$MEAN= 0
##$ME_mod= 0
##$MI= 0
##$NCOEF= 0
##$NC_proc= -8
##$NLEV= 6
##$NOISF1= 0
##$NOISF2= 0
##$NSP= 0
##$NTH_PI= 0
##$NZP= 0
##$OFFSET= 14.98509
##$PC= 1
##$PHC0= 69.55994
##$PHC1= 0
##$PH_mod= 1
##$PKNL= yes
##$PPARMOD= 0
##$PPDIAG= 0
##$PPIPTYP= 0
##$PPMPNUM= 2147483647
##$PPRESOL= 1
##$PSCAL= 4
##$PSIGN= 0
##$PYNMP= <proc.py>
##$REVERSE= no
##$SF= 400.02
##$SI= 32768
##$SIGF1= 0
##$SIGF2= 0
##$SINO= 400
##$SIOLD= 32768
##$SPECTYP= <>
##$SREGLST= <1H.CDCl3>
##$SSB= 0
##$STSI= 32768
##$STSR= 0
##$SW_p= 8223.68421052631
##$SYMM= 0
##$S_DEV= 0
##$TDeff= 65536
##$TDoff= 0
##$TI= <>
##$TILT= no
##$TM1= 0
##$TM2= 0
##$TOPLEV= 0
##$USERP1= <user>
##$USERP2= <user>
##$USERP3= <user>
##$USERP4= <user>
##$USERP5= <user>
##$WDW= 1
##$XDIM= 32768
##$YMAX_p= 458081943
##$YMIN_p= -747444
##$CURPLOT= <Network HP LaserJet P1505>
##$CURPRIN= <$Network HP LaserJet P1505>
##$DFORMAT= <normdp>
##$LAYOUT= <+/1D_H.xwp>
##$LFORMAT= <normlp>
##$PFORMAT= <normpl>
##$SURQMSG= 1
$$ End of Bruker specific parameters
$$ ---------------------------------
##NTUPLES= NMR SPECTRUM
##VAR_NAME=  FREQUENCY,     SPECTRUM/REAL,   SPECTRUM/IMAG
##SYMBOL=    X,             R,               I
##VAR_TYPE=  INDEPENDENT,   DEPENDENT,       DEPENDENT
##VAR_FORM=  AFFN,          ASDF,            ASDF
##VAR_DIM=   32768,         32768,           32768
##UNITS=     HZ,            ARBITRARY UNITS, ARBITRARY UNITS
##FACTOR=    0.250966925370066, 1,           1
##FIRST=     8223.43324360094, -12873,       -225746
##LAST=      0,             -52085,          -33600
##MIN=       0,             -747444,         0
##MAX=       8223.43324360094, 458081943,    0
$$ Real data points
##PAGE= N=1
##DATA TABLE= (X++(R..R)), XYDATA
$$ [...]
19566B8399h6942c859C406c11188g1059o9064M4457B41386P124b45992K7874e148
19553H7185a36426H198N0766J4540g2693j0815D7789a35138e7931G3550a40483
19541A27590c23085P0309P7643A78548b47435f5144j64591A14111b85972A98965
19530A99331d570r7939k05005I511a03847l4454c7044j34954L2594A32305f7518
19518b05043j15061A0425c24919J52770H730N1963b2272k92380B7735a16878b6337
19506a34137n3331G9500O4185a23438I0439b41778C71278E2860i3105D079i3589
19494a8969j69299a6004k75834J20474f2396r647B18035a27018C14714K7896c25258
19482H6006C1741c70635a40973j68417A52827E1271J71403A049b07842H33a73630
$$ y = [28399, -86942, -3859, 3406, -311188, -71059, -140123, -95666, 241386, 248510, -245992, -218118, -5148, 87185, -136426, 8198, 58964, 73504, -72693, -83508, 47789, -135138, -57931, 73550, -140483, 127590, -323085, -252776, -175133, 178548, -247435, -65144, -229735, 114111, -285972, 198965, 199331, -4570, -102509, -307514, 9511, -103847, -138301, -37044, -171998, -139404, 132305, -67518, -205043, -320104, 10425, -324919, -172149, 8730, 60693, -22272, -314652, 27735, -116878, -26337, -134137, -187468, 79500, 143685, -123438, 90439, -241778, 371278, 52860, -93105, 4079, -93589, -18969, -188268, -16004, -291838, -171364, -62396, -72043, 218035, -127018, 314714, 342610, -325258, 86006, 31741, -370635, -140973, -309390, 152827, 51271, 222674, 1049, -207842, 833, -173630]
19470c3663E1812c63021c1897A9060b90128c4875j72105R9153D6082A1381R3056
19459A04437c44363h9741A35834J05879d5694K1782r0469j36919A21414Q5197
19449B06611a49667N0870B696i4906j63919C12075a64548c7746I3078a94949B410
19437a92191J4138a4418k65569j9934A62052L04872k12729A02870a87562j35397
19427c22959g5832l1201A3431a2837l4415j21373A11629L1799B589O0136g1795
19415a49086D53871b63384E0152O2932P0708a36312B74537a63873O1757a2314
19404a8332E6028a54394A32134a15160j47488C2832d0598B4473a06017I9498b97678
19392d368l72476A29560d79746b09000j90936g5236F8522c90603A3907a16325
$$ y = [-33663, 51812, -363021, -31897, 19060, -290128, -34875, -206980, -107827, 46082, 11381, 104437, -344363, -89741, 135834, 241713, -45694, -23912, -114381, -251300, 121414, 206611, -149667, -98797, 2696, -94906, -258825, 312075, -164548, -37746, 93078, -194949, 2410, -192191, -178053, -14418, -279987, -299921, 162052, 466924, 254195, 102870, -187562, -322959, -75832, -107033, 13431, -12837, -47252, -168625, 111629, 143428, 2589, 62725, -71795, -149086, 453871, -263384, 50152, 113084, 183792, -136312, 274537, -163873, -102116, -12314, -18332, 56028, -154394, 132134, -115160, -262648, 32832, -40598, 24473, -106017, 99498, -297678, -4368, -376844, 129560, -479746, -209000, -399936, -75236, 68522, -390603, 13907, -116325]
19381d7513G8256k8864n157K129f2577a3264k21153A59525a17528a9176n5355
19370g4531j80301D6088J35439a01927m6590a7243g302l37130M2691P6715d5976
19358I8140C5242a90870o3735f4601k19583A59107h1509G691N9619b89759D1914
19346a12102m3647A29556D0414b24561j5165I3342b31704R3492L5420c5666j7661
19335e3327B11740g1279D2211b5327k02269G5219J72646a39019C2311K29517F7517
19323h2971A50146b17786F6279j2144b51237R9795F7998b02817M2373C27R6633
19312I6960f895p9278B49237d77400I0327K3499b5891c026m45431d0825k12353
19301b53178P0792C8935J35117f8633l9088j18143Q1182I4105c36597R8199k9381
$$ y = [-47513, 78256, 49392, 44235, 46364, -62577, -13264, -234417, 159525, -117528, -19176, -74531, -254832, 46088, 181527, -101927, -148517, -17243, -7302, -344432, -301741, -225026, -45976, 98140, 35242, -190870, -254605, -64601, -284184, 159107, -81509, 7691, 67310, -289759, 41914, -112102, -155749, 129556, 40414, -224561, -239726, 93342, -231704, -138212, -102792, -35666, -53327, 211740, -71279, 42211, -25327, -227596, 75219, 247865, -139019, 32311, 261828, 67517, -82971, 150146, -217786, 66279, 54135, -251237, -151442, 67998, -202817, -160444, 327, 96960, -6895, -86173, 249237, -477400, 90327, 113826, -25891, -3026, -448457, -40825, -253178, -182386, 38935, 174052, -68633, -107721, -225864, -144682, 94105, -336597, -238398, -267779]
19290b67779f9613C5204J78836R8610b35028R4226O968A8169B893i2287A44928
19278G1491F857f7406K9514j17217q7304G4394a44323m6615B16454r1523D7840
19266a20216H0305a43955F6239L8801c74592d4168B5795a82149g4526r0808J072
19255a64262A12590j9501a82890d8649C5073d9650j61811Q0067j06002A52177
19244b81672B15289N0253I6816n072C3326a14311a3051A96270M2854f8377J8870
19233d9507B25927a70857L4514G33J55304f7919a3879j24914N7581D7392d3677
19221b2054D71167c0515a889p4924k9580A38095b5405D04818A73228b25996A63291
19209A45713h7533n1533H842a76731L3849G2112g305l5774l9195B96806b75369
$$ y = [-267779, -69613, 35204, 214040, 312650, -235028, -140802, -133834, 18169, 2893, -92287, 144928, 71491, 6857, -67406, -37892, -155109, -242413, 74394, -144323, -190938, 216454, 124931, 47840, -120216, 80305, -143955, 66239, 105040, -374592, -44168, 25795, -182149, -74526, -165334, -164262, 112590, 93089, -182890, -48649, 35073, -49650, -211461, -131394, -237396, 152177, -281672, 215289, 265542, 96816, 91744, 33326, -114311, -13051, 196270, 239124, -68377, -49507, 225927, -170857, -136343, 733, 156037, -67919, -13879, -138793, -81212, 47392, -43677, -22054, 471167, -30515, -1889, -76813, -106393, 138095, -25405, 404818, 173228, -225996, 163291, 145713, -87533, -139066, 8842, -176731, -142882, 72112, -7305, -43079, -82274, 296806, -275369]
19197d8706j8234j4007j56955k47000G3780a51930j00692A03654a96399h51m5424
19186d6275B64597j09172f5796n6157G9359l4954m396q36g143j35460j42376e5091
19173h3852n6606A68281e3245B9731a00925k7220j31771J01415C0351b49518J7488
19162b32030i8428h768r0536P284n5159k2508A64399a74369A28150e419A80148
19150a30460j79074J02036l0123O9054F5215c455A97618a46061l1592A03602h0056
19138H2620j8364i0116b1514A36745b8944B4323q139M1600b03032E4566b98754
19126A82957c41091L5508e2620r9180j24648M2209F7272g3084K9057A77149a29537
19114f0801j85983A24499a74273A64274l8649a59742b8546k67002A87351a88579
$$ y = [-48706, -66940, -80947, -237902, -484902, 73780, -151930, -252622, 103654, -196399, -851, -46275, 264597, 155425, -65796, -121953, 79359, 44405, 40009, 39173, -7143, -142603, -284979, -55091, -83852, -140458, 168281, -53245, 29731, -100925, -128145, -259916, -158501, 30351, -249518, -232030, -98428, -8768, -99304, -92020, -147179, -169687, 164399, -174369, 128150, -5419, 180148, -130460, -309534, -207498, -237621, -168567, 65215, -3455, 197618, -146061, -177653, 103602, -80056, 82620, 64256, -90116, -21514, 136745, -28944, 24323, 16184, 57784, -203032, 54566, -298754, 182957, -341091, -305583, -52620, -151800, -276448, -234239, 67272, -73084, -44027, 177149, -129537, -60801, -246784, 124499, -174273, 164274, 125625, -159742, -28546, -295548, 187351, -188579]
19103F4163a9737F9174i1791F0755J5598M140N9262b10929f4661j72853E907K2446
19091B8353d99518e0498l3680A90959g9572A5258a92325A23047b70031f5247A93529
19079A08705a36444c4888k91009A73102f3477p2165b4814o4404E9903a13142j04699
19068b17841Q9368o9495A83102D6737r067a93822D9904a79730A31269a02685q1737
19057a84422h6301A92118K3198c6257l3266k18630G0536a18221j44222c8653j08796
19046a47449l3220K5035G9320J75825I9953a07084j45201E1842B789g1465F7740
19034e0207j33635j81560P8061a05823L0542A48308d284B15699L1191j03802d9121
19022a00813Q768B32526i225k58393A32022j6577c48091a19683j537J0391K9072
$$ y = [64163, -19737, 69174, -91791, 60755, 76353, 80493, 139755, -210929, -64661, -237514, 5907, 28353, -499518, -50498, -84178, 190959, -79572, 15258, -192325, 123047, -270031, -65247, 193529, 108705, -136444, -34888, -325897, 173102, -63477, -135642, -24814, -89218, 59903, -113142, -217841, -128473, -197968, 183102, 46737, 37670, -193822, 49904, -179730, 131269, -102685, -184422, -86301, 192118, 215316, -36257, -69523, -288153, 70536, -118221, -262443, -38653, -147449, -180669, -155634, 79320, 255145, 99953, -107084, -252285, 51842, 2789, -71465, 67740, -50207, -183842, -365402, -287341, -105823, -75281, 148308, -4284, 215699, 246890, 143088, -49121, -100813, -92045, 232526, -9225, -267618, 132022, 115445, -348091, -119683, -121220, -110829, -81757]
19011h1757k18458h9763G11c74844l5196a43186A71308A7608J21237a18300j88545
19000c06845i5733M042G7555K0063b1265j03077A77344E7592K33798a94707L0208
18989a64499g836G0261L01120e9529q602A46855A8527a70772e364A60374a09143
18977a80825A17404c44451g3931B10446l7136a15244A28946J32732I3395c18238
18966E3682b29683c6104r9365F444b26081i4228L6782n0242a4006A54616b71265
18954b41912a12353A53837L0353b5962j36156j49391J19273d8465k95843B41471
18943g3852j79988f2067j4665k2633d8186m325n7874C55456i135l38636a38796
18931A01432m8800b18112a05012A63244c3059o9324a8155q4676j4833E3112h0499
$$ y = [-81757, -300215, -89763, 711, -374844, -410040, -143186, 171308, 17608, 138845, -118300, -306845, -95733, -91691, 77555, 97618, -21265, -124342, 177344, 57592, 291390, -194707, -164499, -7836, 70261, 371381, -59529, -68131, 146855, 18527, -170772, -5364, 160374, -109143, -180825, 117404, -344451, -73931, 210446, 173310, -115244, 128946, 261678, 93395, -318238, 53682, -229683, -36104, -135469, 6444, -226081, -94228, -57446, -107688, -14006, 154616, -271265, -241912, -112353, 153837, 184190, -25962, -162118, -311509, -192236, -48465, -344308, 241471, -73852, -253840, -62067, -76732, -99365, -48186, -52511, -110385, 355456, -9135, -347771, -138796, 101432, 52632, -218112, -105012, 163244, -33059, -102383, -18155, -102831, -117664, 53112, -80499]
18919A75520G3311b78062J33883n8026B12735a71418F9210c47025D3807h6392
18908h9129j17761O8252e3269m6478j47625j66826b570A21433D834a9436A982
18896b43918a09241j76315d2250j6879b3418E8974i1774q3169A54900a32342j33977
18885b66319A81494g0767A33454k7868K798J1375a88167d300j25413j93885b2039
18873f407o8210A58105d2705J8719j29433A46620A9897L2920e2259A23471a31600
18861D7886L14448A12140g2782j93090J31168G0788c36381a63580N2308B7381
18850C74487a07715E6323J74462a29599D6481b37818q9844a2106C28290a4127
18839B05719b17009B0482J784a28976q8134I7929i5821b678j32408j10772G1681
$$ y = [175520, 73311, -278062, -144179, -202205, 212735, -171418, 69210, -347025, 43807, -86392, -89129, -206890, -138638, -53269, -99747, -247372, -414198, -2570, 121433, 4834, -19436, 1982, -243918, -109241, -285556, -42250, -59129, -23418, 58974, -91774, -174943, 154900, -132342, -266319, 181494, -70767, 133454, 105586, 108384, 119759, -188167, -4300, -129713, -323598, -22039, -6407, -74617, 158105, -42705, -23986, -153419, 146620, 19897, 52817, -52259, 123471, -131600, 47886, 362334, 112140, -72782, -265872, -134704, 70788, -336381, -163580, -111272, 27381, 374487, -107715, 56323, 230785, -129599, 46481, -237818, -327662, -12106, 328290, -14127, 205719, -217009, 20482, 22266, -128976, -217110, 97929, -95821, -2678, -135086, -245858, 71681]
18827h1315G5809j5810c20200J04942A12302R374a11923k4151G7888b07739F9817
18815A11863b50324B8755J4078g4900D001N53270b39835i5232A66443b1640Q094
18804a3546k9634A26431N1132c64503a0506o5771J9142A10343a97074F4691b94141
18792a81449F2311a6194j70453A46143a60025B14853b68087J13270A2125f0656
18781i5031L5458l88799E8528a50050j27385a14127E8431b87B42879B2956b71829
18769h1006o19a395G0223g479E3482e0983j60848R7629d9081j73011m0982a7764
18756A30812c76542g988k7128j01927j15747J10871N1044l7878d8738q8098A72475
18744a87760K3134k9662A31086l6095L07385a40824d0782J0342a453A31509b26785
$$ y = [-81315, 75809, 59999, -320200, -215258, 112302, 121676, -111923, -136074, 77888, -207739, 69817, 111863, -250324, 28755, 42833, -74900, 4001, 557271, -239835, -95232, 166443, -21640, -13546, -43180, 126431, 177563, -364503, -10506, -76277, -57135, 110343, -197074, 64691, -294141, -181449, 62311, -16194, -186647, 146143, -160025, 214853, -268087, -154817, 12125, -60656, -95031, -59573, -448372, 58528, -150050, -277435, -114127, 58431, -287, 242879, 22956, -271829, -81006, -81625, -1395, 70223, -7479, 53482, -50983, -211831, -114202, -49081, -222092, -263074, -17764, 130812, -376542, -7988, -35116, -137043, -252790, -141919, -90875, -128753, -48738, -136836, 172475, -187760, -164626, -194288, 131086, 94991, 402376, -140824, -40782, -30440, -1453, 131509, -226785]
18732d9982k03007g7511A24882b89702f5421J3343A19654a55155d5215R914m7808
18721h3109B9652a65681N9587j78399g1146j09677q3157H0481M4127h1863K6001
18710e5862j17220D778a64542p8714d5759j06738H8562a3130q6606C7584l511
18699C4073a1379A73574B1110K24416a55411j1228h1048I9307b35855I3194q326
18688H4868a13329G3305B8446a0653C11179I164B075a41092L3486E041J04491
18677A09532a60683A05535K8785b2592B23147d7684C3846d22210K01140a4071
18666G4235J22910B6137c18420B46556B1645b13778k8200I2745g1885k2348H1280
18654b77839a9768k43667B78142a94923j141d3368o016A12681a03789j87005B46835
$$ y = [-49982, -252989, -77511, 124882, -289702, -65421, -52078, 119654, -155155, -45215, -35301, -83109, 29652, -165681, -106094, -284493, -71146, -180823, -263980, 80481, 124608, -81863, -55862, -173082, 4778, -164542, -243256, -45759, -152497, 88562, -13130, -99736, 37584, 34073, -11379, 173574, 21110, 245526, -155411, -166639, -81048, 99307, -235855, 93194, 84868, -113329, 73305, 28446, -10653, 311179, 9164, 2075, -141092, -107606, 5041, 109532, -160683, 105535, 134320, -22592, 223147, -47684, 33846, -422210, -221070, -14071, 74235, 197145, 26137, -318420, 246556, 21645, -213778, -241978, 92745, -71885, -94233, 81280, -277839, -19768, -263435, 278142, -194923, -196064, -43368, -49384, 112681, -103789, -290794, 246835]
18642b88285A82492d33313h4058j47753a14248j35985E0262a62391J4309k770
18632a50852O1525F9134k4233J19179d1467B5766J33280O2276a18680A26206d1971
18620a06661j03693E7930J36707b00525B05781o5185g8597k7685j58570B29674
18609g049j13539j08736a13583A47356J71806e3056C16256c3812A96771H4975
18598D6634B79a65710A32631i0821g688l89630J69728f5624k00071a14735g465
18586a01018A50892b14096e0843p6884B61052H0121a27554C43083a06872B53004
18575C8115a71038A40592b05574H8531B4425M13037a06317l50165a64029A76419
18564b29639I5912a21C4930J52337d6823k18122F6373i5561j81834A55050b59036
$$ y = [-288285, 182492, -433313, -84058, -231811, -114248, -250233, 50262, -162391, -148082, -150852, -89327, 69134, 44901, 164080, -41467, 25766, 159046, 221322, -118680, 126206, -41971, -106661, -210354, 57930, 194637, -200525, 205781, 140596, -78597, -106282, -264852, 229674, -7049, -120588, -229324, -113583, 147356, 319162, -53056, 316256, -33812, 196771, 84975, 46634, 279, -165710, 132631, -90821, -7688, -397318, -227590, -65624, -265695, -114735, -7465, -101018, 150892, -214096, -50843, -127727, 261052, 80121, -127554, 343083, -106872, 253004, 38115, -171038, 140592, -205574, 88531, 24425, 437462, -106317, -456482, -164029, 176419, -229639, 95912, -121, 34930, 187267, -46823, -264945, 66373, -95561, -277395, 155050, -259036]
18552c52495E2250L9530a05806r2749G3219A1577a11378A72715b11711B15547
18541c48612H5240a74795H3855b40879N2013e210A84906p3178D8303e282q8768
18530i4050J8154A0955L1931L8259b9967l39571i8838d80C87902A16059g8143
18518A29820O4015D674b839A16034c94420b371o4363D7960a41879D4924g9627
18506c51634C3114R7958E8310J17409c0398m9792j41516c7742r1932q8381B95241
18494A6337a30406a3963B23487j06060D1153b7315l64525O5574O2827J03519I4689
18482d14960f5189j78461g1162F9524i5420k69274a3723k34056C00474b52590
18471a11032j33595D1942a34155M1023j69052H0303a13144J1665j726A8301O0896
$$ y = [-352495, 52250, 91780, -105806, -198555, 73219, 11577, -111378, 172715, -211711, 215547, -348612, 85240, -174795, 83855, -240879, -188866, -5210, 184906, 111728, 48303, -5282, -94050, -75896, 10955, 42886, 81145, -29967, -369538, -98838, -480, 387902, 116059, -78143, 129820, 193835, 4674, -2839, 116034, -394420, -2371, -66734, 47960, -141879, 44924, -79627, -351634, 33114, 131072, 58310, 175719, -30398, -80190, -221706, -37742, -129674, -218055, 295241, 16337, -130406, -13963, 223487, 117427, 41153, -27315, -391840, -326266, -263439, -159920, 94689, -414960, -65189, -243650, -71162, 69524, -95420, -364694, -13723, -247779, 300474, -252590, -111032, -244627, 41942, -134155, -93132, -262184, 80303, -113144, -101479, -103205, 18301, 79197]
18460G9197R7576a35331O2128j87304O3925c0940F1993b21830o4185E1183a2243
18448b16194O7110c7919H5413b61200q7563B2760K20805a32544j7488A7876O5757
18437H3633b00225I9408a07032l3925a8767m6404A82668H7505a2647l73756C0155
18425C10152D928M2123a1364j05329O121D44109a5001j29940j17786g3397A73038
18413f3525j09769B28302b48920Q5163K2591A61114j732c53926j9218J67530A6574
18401c1610j74827A01783a13836C8393A8501L6956b31696A50462A6732M6235N6205
18390A19172A0480b30465B08057J93000A86405E8497b99122H2335O0171a3867
18379c5718I5825K64185b7914A99005N4515b0743C9806f0612A18098b09613O2003
$$ y = [79197, 176773, -135331, -73203, -260507, -196582, -30940, 61993, -221830, -286015, 51183, -12243, -216194, -149084, -37919, 85413, -261200, -348763, 22760, 243565, -132544, -150032, 17876, 83633, -200225, 99408, -107032, -140957, -18767, -65171, 182668, 87505, -12647, -386403, 30155, 310152, 4928, 47051, -11364, -116693, -110572, 444109, -15001, -144941, -262727, -73397, 173038, -63525, -173294, 228302, -248920, -163757, -141166, 161114, 159382, -353926, -373144, -205614, 16574, -31610, -206437, 101783, -113836, 38393, 18501, 55457, -231696, 150462, 16732, 62967, 119172, 10480, -230465, 208057, 401057, 186405, 58497, -299122, 82335, 142506, -13867, -35718, 95825, 360010, -27914, 199005, 253520, -20743, 39806, -60612, 118098, -209613, -147610]
18368a47610O2190B37192b52800a10742B10330G845L6163b47940A04679b33778
18357H9774K1655i4387j2158K041m1840O3126k693j01754N9231j50447B27490
18345b06764f9412B38469l2881J48801H0326M6487B8595a77663A31155a84283
18334a09619K2674k29475J23431B13866l3311a16120j65589A81168a82136j02919
18324b85055O1498j58892B0986M9155b80389a18431M4008E5031a76801G8767Q5179
18313A63946K6285f9264H7718c4748B01972n3395C0125J70224H762e9242P337
18302e1905C49903b42690f2937H6915c92147g5628b8651m50026K36568O3850B77498
18290d53208B01752g6734c2701F0397e8014l6366A76904h6784N02A4770c10771
$$ y = [-147610, -85420, 237192, -252800, -110742, 210330, 7845, 44008, -247940, 104679, -233778, 89774, 111429, -94387, -106545, -104504, -146344, -83218, -85911, -187665, -128434, -278881, 227490, -206764, -69412, 238469, 205588, 354389, 80326, 126813, 28595, -177663, 131155, -184283, -109619, -86945, -316420, -192989, 213866, 180555, -116120, -281709, 181168, -182136, -285055, -223557, -382449, 20986, 70141, -280389, -118431, -74423, 55031, -176801, 78767, 163946, 190231, -69264, 87718, -34748, 201972, 148577, 30125, 200349, 8762, -59242, -51905, 349903, -242690, -62937, 86915, -392147, -75628, -28651, -478677, -242109, -178259, 277498, -453208, 201752, -76734, -32701, 60397, -58014, -94380, 176904, -86784, -86282, 14770, -310771]
18278b36101B73687b50318l8850H3705b09605B10885M8111d6717j56889r6028
18268b99634d552A30937a25067k42542J76568f615l0237j28435j22494C26907
18257C30940b2342H2914b00712A42371R723c5554A51995I856J02534m5269b52541
18245A20372c9662C2989J40526M8488r420q3389K3564a87268j72375M6147H2274
18233a432j66836C25519I1446a21467q2939C3260K63872b19366c632j85621L7992
18222a51261j51336A74617b50677J2901A39586a31266C7657b23788O9502A03611
18211d6547j91845P9109n8299R2777M319k61839d243r5444A19888c6818D3353
18199d53267b0863G954f6074p8218l3232A83255e8221k00900J09758A22964J29922
$$ y = [-236101, 273687, -250318, -289168, 83705, -209605, 210885, 258996, -46717, -203606, -299634, -4552, 130937, -125067, -367609, -191041, -6615, -36852, -165287, -287781, 326907, 330940, -22342, 82914, -200712, 142371, 152094, -35554, 151995, 9856, 112390, 67121, -252541, 120372, -39662, 32989, 173515, 222003, 212583, 129194, 152758, -187268, -359643, -313496, 82274, -1432, -168268, 325519, 91446, -121467, -204406, 33260, 297132, -219366, -3632, -189253, -151261, -302597, 174617, -250677, -237776, 139586, -131266, 37657, -223788, -154286, 103611, -46547, -238392, -159283, -217582, -124805, -120486, -382325, -4243, -99687, 119888, -36818, 43353, -453267, -20863, 7954, -66074, -144292, -177524, 183255, -58221, -259121, -149363, 122964, 252886]
18188B52886A05870B8799J1174g4384l83079C57918D6697K88223N1024a0068j8972
18177b9040p2271A59403a95805k1106E9354a24109J2983k62552A28405a61199
18166a09386j92112d7532j26106M2401A7320J49861L2840b65581J14901a426B97033
18154f7115m4025B40894N9568b3470C9338a53994n6149A4486b43671a01812j12638
18143b14450O5311p5082h004m1229H0445k1158O5694a71738g3934B4356i0911
18131e2787E8274a78260N4104D9357j1733a83080e336j14530o2055A27912B6674
18119a11743m4475B42578a1405q5618j27598D5407b51048i0766J5663A46551a06883
18107h6471j67288e417E9318a04927A08650a18590N8385C9652n405a52334R210
$$ y = [252886, 105870, 28799, 39973, -74384, -457463, 357918, 46697, 334920, 385944, -10068, -29040, -101311, 159403, -195805, -216911, 59354, -124109, -111126, -373678, 128405, -161199, -109386, -301498, -47532, -173638, -131237, 17320, 167181, 200021, -265581, -150680, -1426, 297033, -67115, -111140, 240894, 300462, -23470, 39338, -153994, -210143, 14486, -243671, -101812, -214450, -149139, -224221, -8004, -49233, 80445, 59287, 124981, -171738, -73934, 24356, -90911, -52787, 58274, -178260, -124156, 49357, 37624, -183080, -5336, -119866, -181921, 127912, 26674, -111743, -156218, 242578, -11405, -97023, -224621, 45407, -251048, -90766, -75103, 146551, -106883, -86471, -253759, -5417, 59318, -104927, 108650, -118590, -60205, 39652, 34247, -152334, -143124]
18096a43124P1161A23998J91043A4737c7309j31406B47406A0851b10388C3688
18085A56583J44145a23164d0707j64818h8648E2610c3025A8974J46575j6872i1165
18073B29813h8999l31393H8194J32232J24822a78362A17843n3349R3394l8026
18063A19862c23175C2079h8677n8143j55083g6501l76108C3422a53455A92450
18052A66781a4823F8453O8917a39062L2917k5389L5189b9939j37094p9449a08219
18040H2557c26294l7287a4308A51813R8681c5634C08570a29600I1721b61673A09260
18028b15095k62068C9256b5960A44516J3002K15518A44155K6510a03465B53644
18017b04910h685q2655D01028b63886A73070q3892b2711H6209K3323L3839h9412
$$ y = [-143124, -71963, 123998, 315041, 14737, -37309, -168715, 247406, 10851, -210388, 33688, 156583, 300728, -123164, -40707, -205525, -88648, 52610, -33025, 18974, 165549, 148677, -91165, 229813, -88999, -420392, 88194, 220426, 345248, -178362, 117843, 64494, 157888, 119862, -323175, 32079, -88677, -146820, -301903, -76501, -452609, 33422, -153455, 192450, 166781, -14823, 68453, 137370, -139062, -106145, -131534, -96345, -29939, -167033, -246482, -108219, 82557, -326294, -363581, -14308, 151813, 250494, -35634, 308570, -129600, 91721, -261673, 109260, -215095, -477163, 39256, -25960, 144516, 157518, 373036, 144155, 170665, -103465, 253644, -204910, -8685, -91340, 401028, -263886, 173070, 89178, -22711, 86209, 109532, 143371, -89412]
18005F4164A7993b27592L8395K6960A59588g487p653A09961c5665A4873b03953
17993I5218J1891e35495J74365B2944N156d03311J89497R4742h875F0591d8066
17981e1114A76779A8476i6788G4758b25782f0582k32508G8613h0486H9702g3057
17969i803C1588K30507a48256A92171a20152q2681A51953D4204e8808J6746A30617
17957d9852j54341b9074o2558B12202a01894j03336A31172a37338j84467D0074
17946b48297A51443C2730a4190j3714j78208N0352n599C7060a160k31362G8744
17934d9337C75150j77356q9415d7494J2557H8628B2714L72328a61126E1475O8927
17923A20402b46018N2498c4881A53231E6834j1517b67357B52911B6467O459N9218
$$ y = [64164, 17993, -227592, -189197, -162237, 159588, -7487, -15140, 109961, -35665, 14873, -203953, 95218, 107109, -535495, -361130, 22944, 28100, -403311, -213814, -119072, -8875, 60591, -48066, -51114, 176779, 18476, -96788, 74758, -225782, -60582, -293090, 78613, -80486, 89702, -73057, -9803, 31588, 262095, -148256, 192171, -120152, -202833, 151953, 44204, -58808, -42062, 130617, -49852, -204193, -29074, -91632, 212202, -101894, -205230, 131172, -137338, -321805, 40074, -248297, 151443, 32730, -14190, -27904, -206112, -155760, -161359, 37060, -1160, -232522, 78744, -49337, 375150, 197794, 108379, -47494, -34937, 88628, 22714, 395042, -161126, 51475, 120402, -246018, -193520, -34881, 153231, 56834, 45317, -267357, 252911, 26467, 32926, 92144]
17912I2144J03234G0309a56756c6563O697L820A75448b89963a00792A883h1936
17900A89277C5690h948l4340j02547L3206I9751c17015L6590J11291r2291L3447
17889b27978K1018B98978j46048f4803A23120C7358a64534A52353i1803k44860
17879c36663c4646j77682O8220j19555A37050b18459H6790a21737j44577b3667
17868a59817A7564J58535a01639a5706j65735J0610J8712l3564b4513B50974E9661
17856E0331f5589q5151P0382B70465a03630A62503f9241A10421b2529j4429E4336
17844A74345a7087l6461D6209b10385E1526c2599k09609A21905h3657b7670k09058
17833b36728A62769i1338A06469a2025A46516g2343a0358j37504D1400b41517
$$ y = [92144, 195378, 70309, -156756, -36563, -29866, -26046, 175448, -289963, -100792, 1883, -81936, 189277, 35690, -8948, -43288, -145835, -112629, 99751, -317015, -280425, -169134, -261425, -227978, -206960, 298978, 152930, -64803, 123120, 37358, -164534, 152353, -91803, -336663, -34646, -212328, -144108, -263663, 137050, -218459, 86790, -121737, -266314, -23667, -159817, 17564, 176099, -101639, -15706, -181441, -170831, -152119, -185683, -24513, 250974, 59661, 50331, -65589, -150740, -80358, 270465, -103630, 162503, -69241, 110421, -22529, -36958, 54336, 174345, -17087, -53548, 46209, -210385, 51526, -32599, -242208, 121905, -83657, -27670, -236728, 162769, -91338, 106469, -12025, 146516, -72343, -10358, -147862, 41400, -241517]
17822a90672n3491N5823D21863b3338B74253A09583B3338K06242n4844a33893
17811A93931a69100k933b4850j39689C6414a40660k225G5933a46099A7735J07117
17800A24852h6944j69123B91205g1212H3462b4594k64708g0793A65824a14162
17789A51771a75380d6579B0774h6955I8961h3845G9713e9157k15203j0740A50692
17777C2573O0668b51077f1108A6931b77467a14878c5389B66351e8442A87341g172
17765D18049i8894d7090A36974f8057A24287D5623h627A48350J1721b71636H987
17753a0523k75121H6430b0216A36377M7031c1878B36955A440J06249J7863m8320
17742G7232L9514J62073F2242m723M1659F658M6302b04206A5493P3968J24961
$$ y = [-190672, -244163, -188340, 421863, -23338, 274253, 109583, 23338, 229580, 174736, -133893, 193931, -169100, -172033, -24850, -164539, 36414, -140660, -142885, 75933, -146099, 17735, 124852, -86944, -256067, 291205, -71212, 83462, -24594, -289302, -70793, 165824, -114162, 151771, -175380, -46579, 20774, -86955, 98961, -83845, 79713, -59157, -274360, -285100, 150692, 32573, 93241, -251077, -61108, 16931, -277467, -114878, -35389, 266351, -58442, 187341, -7172, 418049, -98894, -47090, 136974, -68057, 124287, 45623, -8627, 148350, 160071, -271636, 8987, -10523, -285644, 86430, -20216, 136377, 183408, -31878, 236955, 1440, 107689, 125552, 77232, 116746, 278819, 62242, 57519, 99178, 6658, 52960, -204206, 15493, 89461, 214422]
17731B14422C220J45314P6312I6801J0846m1905e9969C2730J19740a4062j53080
17720a67142A81691m9963a22673A5549K74898a43002A22830a97124C0436L8353
17710F8789b348A90638D244K38732p1850l530K28405c3813k6070A20869N0142
17699A71011p1578m7376J7313J02562P8138c4049n1953B71447p8837b28507B15853
17687I9895a56060B14208A2345N5464a38114D3728K53976d9494l59183I7674a56812
17675A71492J853a43160k115B2583L8175b66735m2540a30667A6739Q9581l4707
17664G1613J62872A09401C6182J30451a14650g405A31045d9964j06855e0507a0647
17652A31114O2841a70393A9488d502j23140f1909B57870a60581F7276N2506a83049
$$ y = [214422, 3220, 148534, 224846, 96801, 107647, 65742, -59969, 32730, 152470, -14062, -167142, 181691, 131728, -122673, 15549, 290447, -143002, 122830, -197124, 30436, 68789, -2348, 190638, 4244, 242976, 171126, 167596, 396001, -33813, -59883, 120869, 171011, 99433, 52057, 69370, 171932, 250070, -34049, -86002, 271447, 192610, -228507, 215853, 99895, -156060, 214208, 12345, 67809, -138114, 43728, 297704, -49494, -408677, 97674, -156812, 171492, 173345, -143160, -145275, 22583, 60758, -266735, -309275, -130667, 16739, 106320, 71613, 234485, 109401, 36182, 166633, -114650, -7405, 131045, -49964, -156819, -50507, -10647, 131114, 193955, -170393, 19488, -4502, -127642, -61909, 257870, -160581, 67276, 119782, -183049]
17640a41245O6281E4114A0991L79054b49244h4236I5261J09840e7620A18997b9873
17628A58247K8422a80919A10474m9803J22912l5467a5270E0626L56674a13982
17617C58296a64797m5124j02995J00940A72278F5476J08270b10922B92313h0219
17606b9899G0675O8781K0499a469j24307H5482e19944B02131j8317G0491J5424
17595H5915j9734b15667B01804k7981H3505a52808A38972P860J02571q8927J18313
17584B78789j08638k1556d6243n0407B28177c02674J02992H0657k2265n791L19358
17573C71959a7741H6996j8769J3603B8636i801A40767a03626J2962D3053J68830
17562B11883I1153a10011b5267E7921J91712I0094a51455B55307e5669A43486
$$ y = [-141245, -74964, 54114, 10991, 390045, -249244, -84236, 95261, 205101, -57620, 118997, -29873, 158247, 186669, -180919, 110474, 60671, 183583, 148116, -15270, 50626, 407300, -113982, 358296, -164797, -209921, -312916, -211976, 172278, 65476, 173746, -210922, 292313, -80219, -29899, 70675, 139456, 159955, -1469, -125776, 85482, -519944, 202131, 183814, 70491, 85915, 66181, -215667, 201804, 173823, 83505, -152808, 138972, 146832, 249403, 160476, 278789, 170151, 148595, -46243, -96650, 228177, -302674, -199682, 80657, 58392, 52601, 371959, -17741, 86996, 68227, 81830, 28636, -9801, 140767, -103626, -90664, 43053, 211883, 91153, -110011, -25267, 57921, 249633, 90094, -151455, 255307, -55669, 143486]
17551D00086K6441A14826a41682M5758a5318l5163A18202b28357N2867F6596a51744
17539a4504N522p441k95492a19114d3627B02263g7256j42856c3469j41198A99185
17527C809J58970p0192J75968j6027h1297J2324A21951i8990E6633K77634A06475
17515b99031A15502k0636K52645a01023G7863a12599M0428A45230K4249H0421
17504e34114A5603C346J81960N7378p1036k3527a53285B0301J22464J0948K3699
17493A77412D0118J40710K1078J95539a03367A77711f374A7987J46376e9066D83720
17481C09375a32212A7845Q8852O3628J31845b0635B25415o7565B211b15495B06283
17469A87748K93155f2511o7333K0055A23498d35976F5275Q9399g6269G5950J36872
$$ y = [400086, 426527, 114826, -141682, -95924, -15318, -50481, 118202, -228357, -175490, 66596, -151744, -14504, -8982, -16423, -311915, -119114, -43627, 202263, -77256, -220112, -33469, -174667, 199185, 3809, 162779, 92587, 268555, 252528, -81297, -68973, 121951, -98990, 56633, 334267, 106475, -299031, 115502, 94866, 347511, -101023, 77863, -112599, -72171, 145230, 169479, 80421, -534114, 15603, 3346, 185306, 242684, 171648, 148121, -153285, 20301, 142765, 153713, 177412, 40118, 180828, 201906, 397445, -103367, 177711, -6374, 17987, 164363, -59066, 483720, 309375, -132212, 17845, 106697, 170325, 302170, -20635, 225415, 157850, 2211, -215495, 206283, 187748, 480903, -62511, -129844, -109789, 123498, -435976, 65275, 154674, -76269, 75950, 212822]
17458B12822A0502J74093q5648K80367G4034M23279k07658j19295J82173A27145
17447A71403K04792A5814L82853A08857K38118j34734R047J2002J3136n5303J27986
17436C19109P6631l5391A72379p8982Q2145J64980H0078K57031P4004k00538a02959
17424e5845A54033J39365j08346r0695C8815K60988L06225k66608A07997M01042
17414E09039j44473G7375R2300J40682B1423L18773A06770K24887c9134A81409
17403D21565j31986A07905j9942c56778A17201M7822M11690A32494L1601L8353
17393B02448O4142K8076g4111C55370j43869M3144A05603h8296B27676j7943A7538
17381b7338C78337F9305B3574J46404d4003B49133P7726a76720D52560h870A38441
$$ y = [212822, 10502, 184595, 98947, 379314, 74034, 497313, 289655, 170360, 352533, 127145, 171403, 376195, 15814, 398667, 108857, 346975, 212241, 221288, 233290, 246426, 191123, 319109, 395740, 360349, 172379, 93397, 175542, 340522, 80078, 337109, 411113, 210575, -102959, -55845, 154033, 293398, 185052, 94357, 38815, 299803, 606028, 339420, 107997, 509039, 364566, 77375, 169675, 310357, 21423, 340196, 106770, 331657, -39134, 181409, 421565, 289579, 107905, 87963, -356778, 117201, 165023, 576713, 132494, 164095, 202448, 266590, 294666, -74111, 355370, 211501, 254645, 105603, -88296, 227676, 209733, 17538, -27338, 378337, 69305, 23574, 169978, -44003, 249133, 326859, -176720, 452560, -8870, 138441]
17369C25608A08694C4208M69074j99750b143B3756P5476J46247a5344A06713m0933
17358F5780L64435a69353A23882M4465N0545Q797a63907H7293A5817K69792A14694
17346D1121b4552A50924C5742L89037a02364B49781i3124D00463P295l8874c4305
17334C93877j45895c5628A82576P2850o1193d6008B2406c6493R530C02413I7378
17322b1601C86564j81797B2896R2341L6347p0752K06647I8199K39668A44199J45641
17311B89840A41506L963l9083j6904J88571j26681A9236N37668k50499A49051
17300A91815K8303a94913A91459a05731H0354a18393b3786A62377a46162C38813
17289i6129A14958J82112A6885J83235r7445M304K36382d8666G6174K9138R4709
$$ y = [325608, 108694, 34208, 503282, 303532, -2143, 23756, 99232, 245479, -15344, 106713, 65780, 430215, -169353, 123882, 168347, 218892, 227689, -163907, 87293, 15817, 285609, 114694, 41121, -24552, 150924, 35742, 424779, -102364, 249781, -93124, 400463, 407758, 368884, -34305, 393877, 247982, -35628, 182576, 255426, 194233, -46008, 22406, -36493, -26963, 302413, 97378, -21601, 386564, 204767, 22896, 115237, 151584, 80832, 287479, 98199, 337867, 144199, 289840, 141506, 145469, 106386, 89482, 278053, 151372, 19236, 556904, 306405, 149051, 191815, 220118, -194913, 191459, -105731, 80354, -118393, -23786, 162377, -146162, 338813, -96129, 114958, 297070, 16885, 200120, 102675, 106979, 343361, -48666, 76174, 105312, 200021]
17278B00021a10484A47815K8529L2801a96442n3228E2822J83330d5700k20018
17268b65718B33493N3805N789E9376N7670a06187E15380A14325K795c6505B17663
17256H3495L9993J5845F2938J95484J27036A10933n2253J06634g0342D60459I9197
17244D6733O8820L33534A43550R8944O879K21055k18986L9899B8881P2565B0839
17232D19478j86151D7541K65997R5338A94422J53360j53163L7920A11817J11909
17222B23726Q9766G0412J84963L3549o3927m914B7223P7019h6456A42030J39459
17211B81489A31723m7909K71141A70650J03288e3943C98326A10006a94174C35542
17200B28755j7001L2881H679L7045K01905b9896A50850R8048j04073K33405b13779
$$ y = [200021, -110484, 147815, 176344, 209145, -196442, -249670, 52822, 236152, -45700, -265718, 233493, 287298, 293087, 59376, 117046, -106187, 515380, 114325, 117120, -36505, 217663, 83495, 123488, 139333, 62938, 258422, 385458, 110933, 58680, 165314, -70342, 460459, 99197, 46733, 115553, 449087, 143550, 242494, 249373, 470428, 251442, 291341, 28881, 101446, 20839, 419478, 233327, 47541, 313538, 408876, 194422, 347782, 194619, 232539, 111817, 223726, 313492, 70412, 255375, 288924, 224997, 220083, 27223, 104242, -86456, 142030, 281489, 131723, 83814, 354955, 170650, 273938, -53943, 398326, 110006, -194174, 335542, 228755, 211754, 244635, 8679, 45724, 247629, -29896, 150850, 248898, 144825, 378230, -213779]
17188c6069C28356A41220K61833A51427G5510J29261K40286I5619J24349M9646
17178B69614o5484O1979b9805B59162A13843K78052k8875q1740J2127A26518m0077
17167H6441M7675L5748M59743A91845J19444k9198p6976J4999p4149J30926H811
17155B59762P7713j21504G7713K15304A8671J84459j4439d1091C02047K51575
17145E53622A77244M38263E3536K50580A24986K87238O256A21974J40539J82890
17135D45403o8173j14600H2412J76866K0688f4021B19584P0769E7821L69065M3695
17124D70581q1933j73598L11538B56984L52316j95817o5892o5224L36232A51189
17113C68457M9884A39645J31077N1845K78937i6266A22478Q3276M97544c6582
$$ y = [-36069, 328356, 141220, 403053, 151427, 75510, 204771, 445057, 95619, 219968, 269614, 204130, 266109, -29805, 259162, 113843, 391895, 363020, 281280, 293407, 126518, 86441, 134116, 169864, 629607, 191845, 311289, 282091, 205115, 220114, 145965, 276891, 8811, 259762, 337475, 215971, 77713, 293017, 18671, 203130, 188691, -41091, 302047, 553622, 177244, 615507, 53536, 304116, 124986, 412224, 418480, 121974, 262513, 445403, 377230, 262630, 82412, 259278, 279966, -64021, 219584, 290353, 57821, 426886, 470581, 388648, 215050, 526588, 256984, 609300, 413483, 347591, 282367, 618599, 151189, 368457, 418341, 139645, 270722, 322567, 601504, -96266, 122478, 205754, 703298, -36582]
17102B93120k7148K9247L16781A43549M82274C11278K91048j28108r3213A87900
17091B87925D5773L64472Q872j08037J44235k07616J24098O3155N3527k6367j46264
17080C15848Q0093J24903j90489r9900M24324C21378q864J98667O510j38907M03599
17069G82383l54130n6190Q8722N2300o7935K66664C45864J54417N179Q9953O8535
17058F63948r4532j07618L5812k38840H563L77243J04224O3672j4448K48341k15797
17047E71798O7689j87731r3857L15494q6994j42000J16777R1449j38226L8144
17037E52543O8056J54867q1389M6760p8072J0544j68243A26644K89154K59331
17027F75129m9977k5812J22082K7606j77500r9211j27848L81646L55100m58990
$$ y = [293120, 265972, 295219, 612000, 143549, 625823, 311278, 602326, 474218, 381005, 187900, 287925, 45773, 410245, 419117, 311080, 455315, 247699, 371797, 434952, 488479, 462112, 315848, 395941, 520844, 330355, 230455, 654779, 321378, 312514, 511181, 517691, 378784, 782383, 428253, 372063, 460785, 513085, 445150, 711814, 345864, 500281, 505460, 595413, 663948, 569416, 461798, 497610, 258770, 8563, 385806, 490030, 553702, 539254, 787595, 571798, 639487, 451756, 357899, 673393, 586399, 444399, 561176, 652625, 514399, 552543, 620599, 775466, 694077, 740837, 662765, 673309, 505066, 126644, 415798, 675129, 625152, 599340, 721422, 749028, 571528, 472317, 344469, 726115, 1081215, 622225]
17017F22225K66113D07086L87815j31149j41607J47216J00599M7012j07533K52726
17007I62165l97960j33605J49405k49356M93919C64383L35660N4899e4038D43850
16996F37046J60266q0536o5895N8114J66702q6652J32575p9108k95331O26581
16986A173762m56567L13877j59058q7046R4530L4264l41603L3593L0781L11071
16976I47604m11872L77986k37164Q0519k05923M49160P396N9486m84070L10436
16966H93558l18894K79392P5968j91783M58906m10017J33379K39932j73098N4239
16956A041582l10560K11982Q6879k75083L27171k01654K92879J13546l88994K19691
16946A117439r6300k88670L04762J40974R2103m92650J9458L76705J20103j85489
$$ y = [622225, 888338, 407086, 794901, 663752, 522145, 669361, 769960, 816972, 709439, 962165, 564205, 430600, 580005, 330649, 824568, 364383, 700043, 754942, -54038, 443850, 637046, 797312, 716776, 650881, 708995, 875697, 789045, 921620, 842512, 547181, 1173762, 717195, 1031072, 872014, 784968, 879498, 913762, 572159, 605752, 636533, 947604, 535732, 913718, 676554, 757073, 551150, 1000310, 1007706, 1067192, 583122, 893558, 574664, 854056, 930024, 738241, 1197147, 787130, 920509, 1160441, 987343, 1041582, 731022, 943004, 1029883, 754800, 1081971, 880317, 1173196, 1286742, 897748, 1117439, 1021139, 732469, 1037231, 1178205, 1270308, 777658, 797116, 1173821, 1293924, 1108435]
16936A108435N733j07714n6503M0528R1177L44754o1129k36797J04932j79371
16926A054045J3890K2953j79760O0634K88616K31372k74457L07618L1094m8679
16916A507326o1486P9217l01260K92736k80073J74493j79734n7169K15553r482
16906A380121Q765L16691k06517K85182j14688J41829l54996P6686J56923K8887
16896A718883l931J42053l4539l72543M62101l18236K23356m40755M53912J48193
16886A978494k08206Q476K26840j1755M51181k76627o9845l93214M40065j32971
16876B012438j05625K03737Q1232K8805J8958M313K54892l07319J29437n7680
16866B263188j9676l8334L26042j84122K78217M415k87893J06209K67308K96573
$$ y = [1108435, 1114168, 1006454, 949951, 990479, 1081656, 1426410, 1365281, 1128484, 1233416, 1054045, 1067935, 1090888, 911128, 971762, 1260378, 1491750, 1217293, 1524911, 1556005, 1507326, 1445840, 1525057, 1223797, 1516533, 1236460, 1410953, 1231219, 1174050, 1389603, 1380121, 1388886, 1705577, 1499060, 1784242, 1669554, 1811383, 1456387, 1533073, 1689996, 1718883, 1714952, 1857005, 1822466, 1449923, 1912024, 1593788, 1817144, 1376389, 1830301, 1978494, 1770288, 1778764, 2005604, 1993849, 2445030, 2168403, 2098558, 1705344, 2145409, 2012438, 1906813, 2110550, 2191782, 2220587, 2239545, 2243858, 2498750, 2191431, 2320868, 2263188, 2243512, 2205178, 2531220, 2347098, 2625315, 2629730, 2341837, 2448046, 2715354, 3011927]
16856C011927m16203J61706J41870M9509j29649K16101J6107L0998k0136J16657
16846C178887l00860O36535k19694R886Q2984L9305p1663M07454j74125J91373
16836C780082J18454j67230K07482j96973J94665J92207L00007m58775P4985K66443
16826D311347O1110p4836K89061j2535j10448N72595J11074n1954J974o9780R0012
16815E117620M6141R3878J81496K97028J8474l4488L51744j28152Q833J97275
16805F149849L55778jR2452L31136N09262m32157M44364N09640j31769j95250
16795G633304O22339o7969p503L88065N2320M44341K96696J53582J73801J32585
16785I821561L88377M24515L76910N7035N87906J6614J85886O34948J87403N19803
$$ y = [3011927, 2595724, 2757430, 2899300, 2948809, 2819160, 3035261, 3051368, 3082366, 3062230, 3178887, 2878027, 3514562, 3294868, 3304754, 3387738, 3427043, 3355380, 3762834, 3588709, 3780082, 3898536, 3731306, 3938788, 3741815, 3936480, 4128687, 4428694, 3969919, 4044904, 4311347, 4372457, 4297621, 4586682, 4574147, 4463699, 5036294, 5147368, 5095414, 5097388, 5027608, 5117620, 5163761, 5257639, 5439135, 5736163, 5754637, 5720149, 6071893, 5943741, 5952574, 6149849, 6505627, 6505626, 6598078, 6929214, 7438476, 7006319, 7450683, 7960323, 7828554, 7633304, 8255643, 8187674, 8180171, 8568236, 8620556, 9064897, 9361593, 9515175, 9688976, 9821561, 10209938, 10634453, 11011363, 11068398, 11656304, 11672918, 11858804, 12493752, 12681155, 13200958]
16775A3200958M40892M1674P25924L59867J009456M8318M68763O54403N38917
16766A7489172P25738P97847N89082O53159R62669R35586L20150J341656J161697
16757B4976756Q23133Q40024J515007R86803J551784J162358J419511J803723
16749C5079099J272108K105951J506079K469166K083784K192542K642477K671686
16741E2022892K759949L165975L571045L483545L962885M022635M477200M962256
16733H2428382N388547N343545O064520O896080O602495P595990P922212Q236401
16725A36478172Q087939R156227Q586149Q630450Q696031Q010689P067516O254568
16717B00967741N076808L418675J638494K23343j658132l706113m438332o069102
$$ y = [13200958, 13641850, 13683524, 14409448, 14769315, 15778771, 15827089, 16295852, 16950255, 17489172, 18214910, 19012757, 19601839, 20254998, 21217667, 22153253, 22473403, 23815059, 24976756, 25799889, 26639913, 28154920, 29141723, 30693507, 31855865, 33275376, 35079099, 36351207, 38457158, 39963237, 42432403, 44516187, 46708729, 49351206, 52022892, 54782841, 57948816, 61519861, 65003406, 68966291, 72988926, 77466126, 82428382, 87816929, 93160474, 99224994, 106121074, 112723569, 120319559, 128241771, 136478172, 144566111, 153722338, 162308487, 170938937, 179634968, 187645657, 194713173, 200967741, 206044549, 209463224, 211101718, 211325061, 209666929, 205960816, 201522484, 195453382]
16709A95453382p366204p904419q727017r174444q956989r421210q592618q688035
16701A26622446q085019p762524p073229o939946o391275n560255n444890n393325
16693G3971983m202874m802240l796649l588151l272873l100301l104644k655479
16685D5448772k452041k249789k181416k429270j111037j896182j725866j537000
16677B9866171j355882j404006j142943j130141j188222q69337j102411j096599
16669B0576630p56225l73353r24127n93988o30277j001007m33499n69738k70653
16660A5023763r95970o50346J98545o99723m82145K1968o62703m46666m69410
16651A0837313m17277k01556j55704m15196l5801p88049k14439l37954K91550
$$ y = [195453382, 188087178, 180182759, 171455742, 162281298, 153324309, 143903099, 135310481, 126622446, 118537427, 110774903, 103701674, 96761728, 90370453, 84810198, 79365308, 73971983, 69769109, 64966869, 61170220, 57582069, 54309196, 51208895, 48104251, 45448772, 42996731, 40746942, 38565526, 36136256, 35025219, 33129037, 31403171, 29866171, 28510289, 27106283, 25963340, 24833199, 23644977, 22775640, 21673229, 20576630, 19820405, 19447052, 18522925, 17928937, 17298660, 16297653, 15864154, 15294416, 15023763, 14027793, 13377447, 13575992, 12876269, 12394124, 12416092, 11753389, 11306723, 10837313, 10420036, 10218480, 10062776, 9647580, 9611779, 8823730, 8609291, 8271337, 8562887]
16642H562887l82865J9824k44463o29998m05601L33429j34903o20132L57608m04015
16632F451771J1614k88341l57245p6765j51876r3150k0570k66150M05701r08018
16622D706971m5013M89936n82514J4868k83593K44629k86616K10127k45887l98562
16612C824346l2000K88915j56316l36212J17217k54067J64507k42087q904n5511
16602C309888k27605L43260m17288k74476J14127M5289n161r5014j12394p0110
16592B610516n6416J46609k6813M4863m70967L62656N186j68124p9160k8487q3205
16581B256658L03165p5615l43686j67343k61994K95290l7921j46026j10559J00016
16571A811985J2210K48346l49829k63476j27935K76114n3580k70906O64752r6956
$$ y = [8562887, 8180022, 8199846, 7955383, 7325385, 6919784, 7253213, 7118310, 6498178, 6855786, 6451771, 6463385, 6175044, 5817799, 5741034, 5589158, 5496008, 5475438, 5209288, 5614989, 4706971, 4661958, 5151894, 4569380, 4584248, 4300655, 4545284, 4258668, 4468795, 4222908, 3824346, 3792346, 4081261, 3924945, 3588733, 3705950, 3451883, 3616390, 3374303, 3365399, 3309888, 3082283, 3425543, 3008255, 2733779, 2847906, 2893195, 2888034, 2793020, 2680626, 2610516, 2554100, 2700709, 2673896, 2718759, 2247792, 2610448, 2615634, 2447510, 2368350, 2339863, 2256658, 2559823, 2484208, 2140522, 1973179, 1711185, 2006475, 1968554, 1822528, 1711969, 1811985, 1824195, 2072541, 1722712, 1459236, 1331301, 1607415, 1553835, 1282929, 1947681, 1850725]
16561A850725l33525P5478k56555J01714J19453j52313L20872n03644K08664l4751
16551A396118r9187P141j2238J33205r6998k42186L67957j35481k17416K77943
16541A378858P9166m46413J49006K4513k54460L8151j15802R8123K79042k36230
16531I93954j13895n4027K00269k39552P03753n23995j76998M47221n01394M78091
16521A213427m75411K99891O1466O6500m65008q2792J05820j3103K74993n1123
16511I34660J556l17289j9533J4440M46421j15710k77566l0791M98373n7112k97972
16500G79477P7957n1239q6180K57681k48324j36397n471q5286L32904l19437P3804
16489E89489Q5282l7807Q1941k04784K63620l47977J15757J42962j91018k11604
$$ y = [1850725, 1517200, 1592678, 1336123, 1437837, 1557290, 1404977, 1725849, 1222205, 1430869, 1396118, 1296931, 1304072, 1291834, 1425039, 1328041, 1085855, 1453812, 1318331, 1100915, 1378858, 1458024, 1011611, 1160617, 1185130, 930670, 968821, 853019, 951142, 1230184, 993954, 880059, 826032, 1026301, 786749, 1490502, 966507, 789509, 1236730, 735336, 1213427, 738016, 1037907, 1099373, 1165873, 700865, 618073, 723893, 710790, 985783, 934660, 936216, 618927, 599394, 613834, 1060255, 944545, 666979, 636188, 1134561, 1077449, 779477, 857434, 806195, 720015, 977696, 729372, 592975, 587504, 502218, 835122, 515685, 589489, 674771, 636964, 718905, 514121, 777741, 429764, 545521, 688483, 497465, 285861]
16479B85861L05729j71204P436J06733L3134J44897k49562K12235j7863j58277
16469D99119j87187L76694j20438n4384J4790N5817k90811n969J39444R4361P7134
16458E98570r0237E4427J76559J56795r9939N01737j7366C21032K57852p2025
16448E06859j74715J47790l0145l8430A10867L63786r4070M2618n8214n2409O7563
16437C80141j65180R6231J94729A16227l3498K77576j64416K09235p4145L71207
16427G02186A74939o3692J35740m5501K21485j05356j08709L08972r8134A99551
16416B72860q8035J29405n5115A03374K52165j32932M2972K18079J15845D9673
16405A82803J90668j0304J2640K21113j37449A46504J97369J93154A61299L93728
$$ y = [285861, 591590, 420386, 427822, 534555, 567689, 712586, 463024, 675259, 657396, 499119, 311932, 688626, 568188, 513804, 528594, 584411, 293600, 287631, 427075, 521436, 598570, 508333, 54427, 230986, 387781, 287842, 789579, 772213, 321032, 578884, 506859, 332144, 479934, 449789, 411359, 110867, 474653, 380583, 423201, 364987, 312578, 380141, 214961, 311192, 505921, 116227, 82729, 360305, 195889, 405124, 330979, 702186, 174939, 111247, 246987, 201486, 422971, 317615, 208906, 517878, 419744, 199551, 272860, 184825, 314230, 259115, 103374, 355539, 222607, 265579, 483658, 599503, 49673, 182803, 373471, 363167, 375807, 596920, 459471, 146504, 343873, 537027, 161299, 555027]
16395E55027B15963A04424K39558A26658K9058J2639l393k2538K98922e917I1243
16383A24147N3355O6158F0170K60672J09807I2420J46638E2348d4422A10887J23156
16372B34043C8510d362D05047q5868k2229B4815K39547j08664p2492K26105I8765
16360C14723j19517M13b4642j2852B67453J72761A62108L3781K10625b49643A89659
16348C36908i2538A4199N9559J82781H1396L15456A18752L16110G3029L30262
16338D03291B7898K61416R8588A31344M0307a10190B44235C4011J06623J26050
16328B66684F7655K2009K96562a14213G7542K82527h4962G1440c09738C73410
16317B49954E4492Q3840J81606j37839R2036c3601B92783a35644D25923A10918
$$ y = [555027, 215963, 104424, 343982, 126658, 155716, 168355, 164962, 142424, 441346, -5917, 91243, 124147, 177502, 243660, 60170, 320842, 430649, 92420, 239058, 52348, -44422, 110887, 234043, 38510, -4362, 405047, 319179, 296950, 24815, 264362, 155698, 83206, 309311, 98765, 314723, 195206, 195619, -24642, -37494, 267453, 440214, 162108, 195889, 406514, -249643, 189659, 336908, -92538, 14199, 73758, 256539, 81396, 396852, 118752, 434862, 73029, 403291, 27898, 289314, 387902, 131344, 171651, -110190, 244235, 34011, 140634, 266684, 67655, 89664, 386226, -114213, 77542, 360069, -84962, 71440, -309738, 373410, 249954, 54492, 138332, 319938, 182099, 274135, -33601, 292783, -135644, 425923, 110918]
16306A92541N4743g5964A89563E9419N0349L477a4675A2904g4399G8615l0543
16295D8072L4858P1974a26892C7560O6948a10810B37328G1371b22358A37743k8025
16284A09718L3273a21233G799a11640C38148A66569J04221B2343K77706A45608
16273A48013c70564A08367k1346J01966b70047A3772K65525A7348K35460L38673
16263E91481d8359P919A02445K98058d8975j01188f0228A33763a24603A33887
16252D0223M919a2365A71153e5906j9707E6935K4814a84182C17187A03824M6591
16241A50415K84681q5820A58791p1586C9296i3776l9314A78407H4884f2443q1771
16230a44214H2781C1948b13616M4724H6498P4962D5696C127J00594m7519R6423
$$ y = [192541, 247284, -75964, 189563, 59419, 109768, 113245, -14675, 12904, -74399, 78615, 48072, 82930, 154904, -126892, 37560, 104508, -110810, 237328, 71371, -222358, 137743, 109718, 142991, -121233, 7799, -111640, 338148, 166569, 270790, 22343, 300049, 145608, 148013, -370564, 108367, 87021, 188987, -270047, 13772, 279297, 17348, 252808, 591481, -48359, -40440, 102445, 400503, -48975, -150163, -60228, 133763, -124603, 133887, 40223, 45142, -12365, 171153, -55906, -75613, 56935, 81749, -184182, 317187, 103824, 150415, 435096, 349276, 158791, 87205, 39296, -93776, -133090, 178407, 84884, -62443, -144214, 82781, 31948, -213616, -168892, 86498, 161460, 45696, 3127, 103721, 56202, 152625]
16219A52625G5945J15312h7836K4159k31888a42427C7909K83253G9691k3241a65537
16207A13130N2693b6330A82533d7888r5982d4012k20129I259J25180J3455e6317
16195a04333B4154c7244A8503a51501F6635b71695J27392f0155A82774N6521D7337
16183h5586b561C58876j63475b49794Q8661G6815a40035c7651A89993n3460j9007
16172A17526a06880k27915a13710a2592H0821Q8079b9752j83425A60728J7163
16162A77891b02179I198f1288A34728O2226q1776D00a24879b7756I4020K37967
16151C31987b53090C23768a83815A30159h7981E4055j839e5759A87663j8695G6764
16139a52412E8356k3341d4960a1655n3290l9898A91147F5327J94141A01019g7314
$$ y = [152625, 75945, 191257, -87836, -63677, -295565, -142427, 37909, 321162, 79691, 56450, -165537, 113130, 165823, -26330, 182533, -47888, -143870, -44012, -264141, 9259, 134439, 147894, -56317, -104333, 24154, -37244, 18503, -151501, 66635, -271695, -144303, -60155, 182774, 239295, 47337, -85586, -2561, 358876, 195401, -249794, -161133, 76815, -140035, -37651, 189993, 136533, 117526, -106880, -334795, -113710, -12592, 80821, 168900, -29752, -213177, 160728, 177891, -202179, 9198, -61288, 134728, 196954, 115178, 400, -124879, -27756, 94020, 331987, -253090, 323768, -183815, 130159, -87981, 54055, 52216, -55759, 187663, 168968, 76764, -152412, 58356, 35015, -44960, -11655, -64945, -104843, 191147, 65327, 259468, 101019, -77314]
16127c17319O5568A00076a41139I6605a35721M7348b8506k8547k39476A71445
16116C65866F008Q745A951M1775M1224a0140j5396D4944i7980n5941J6003f4891
16103A61781E8867O1639n2861b10186j5593A8553N3536K2975D2403A4890b76443
16091a45471j42287G5006R005A2121g942B06227a10942G022a79006L9843A24007
16079a7235H084b66967g8017G909a84988f0581A61037b81139N2812O8892N2436
16068a06999m658p4554b5422B48996d0801C7683b9400j96415j72802a91733D2456
16056I911a18322j18409A55943c4296I2032D0534P6561m3028R2314n4699a18218
16044d5029o0358j52557L7273B8760a55417r2763A41859c55536A28790j2945c6844
$$ y = [-317319, -251751, 100076, -141139, 96605, -135721, -88373, -28506, -57053, -296529, 171445, 365866, 6008, 14753, 1951, 43726, 84950, -10140, -25536, 44944, -97980, -153921, -137918, -64891, 161781, 58867, 120506, 67645, -210186, -225779, 18553, 72089, 95064, 42403, 14890, -276443, -145471, -287758, 75006, 84011, 12121, -7942, 206227, -110942, 7022, -179006, -139163, 124007, -17235, 8084, -266967, -78017, 7909, -184988, -60581, 161037, -281139, -228327, -159435, -106999, -111657, -186211, -25422, 248996, -40801, 37683, -29400, -225815, -398617, -191733, 42456, 9911, -118322, -236731, 155943, -34296, 92032, 40534, 117095, 74067, 166381, 111682, -118218, -45029, -105387, -257944, -220671, 28760, -155417, -248180, 141859, -355536, 128790, 115845, -36844]
16032A05130h0546E3770f9074j60241j0522H2224h5327A50746a35217B7140J09778
16021A36918C5619m666J50074P2293d885j90329C5762M6731M3856a7770B65048
16009d41835G1513e4013j10397k2817C78825b11170P5575A85240q2028f2928n3999
15998a16927k8004A9899a22158a9395o749G3886C4346b38226I8164J84242d4639
15986C90187E1454P8415J49532D2487K61459J46548o6193A9632L2048a12120A11896
15974a12044F1805b3136A38101O4208e1946I7116a27616j63759o9937B24170c20105
15962A34477b64744A62567a40885H7693M2432Q5911G685a28185B12875A00756
15951A35041a43263f9108l0101A41729J3444c89314h7914a4630k18687G0277a94529
$$ y = [105130, -80546, 53770, -69074, -229315, -239837, 82224, -85327, 150746, -135217, 27140, 136918, 35619, 30953, 181027, 253320, -4885, -195214, 35762, 82493, 126349, -17770, 265048, -441835, 71513, -54013, -164410, -187227, 378825, -211170, -135595, 185240, 103212, -62928, -116927, -144931, 19899, -122158, -19395, -26144, 73886, 34346, -238226, 98164, 282406, -44639, 390187, 51454, 129869, 279401, 42487, 303946, 450494, 384301, 19632, 51680, -112120, 111896, -112044, 61805, -23136, 138101, 202309, -51946, 97116, -127616, -291375, -361312, 224170, -320105, 134477, -264744, 162567, -140885, 87693, 130125, 216036, 7685, -128185, 212875, 100756, 135041, -143263, -69108, -99209, 141729, 155173, -389314, -87914, -14630, -233317, 70277, -194529]
15939a49118k01522b9773j15687M8064J5647A51909b29022a11372M9538b688k37548
15928b40236k7818p6115a31563O827r998B48955c6200j95127M5617H1835h6096
15916A51859f6966j23412C8739Q4390a07792l9147N4751k68979C9797c1391l2576
15905f3967j05895J5079N1323j48076h6556k47184R5873B36181b03084K8487B05812
15893c41088N9416A95852j4490a02104o3376J6103E6136K42936c7204r6685A06572
15881a42884K0622A88568L2223c6758E4310h9943l3764O837A50212J7423i9213
15869A64539J98067A00131a17475C8800J00545I974a34680A12058a37076N8899
15859g8177q0325A28687m1996J39428c33338J27128c1953j35668B39148o936a48512
$$ y = [-149118, -350640, -29773, -145460, -97396, -81749, 151909, -229022, -111372, -61834, -2688, -240236, -268054, -344169, -131563, -124736, -134734, 248955, -36200, -231327, -185710, 81835, -86096, 151859, -66966, -190378, 38739, 123129, -107792, -146939, -92188, -361167, 39797, -31391, -63967, -169862, -154783, -103460, -251536, -86556, -333740, -237867, 236181, -203084, -174597, 205812, -341088, -281672, 195852, 181362, -102104, -165480, -149377, 56136, 299072, -37204, -133889, 106572, -142884, -122262, 188568, 220791, -36758, 54310, -89943, -123707, -116870, 150212, 167635, -99213, 164539, 362606, 100131, -117475, 38800, 139345, 9974, -134680, 112058, -137076, -78177, -158502, 128687, 86691, 226119, -333338, -206210, -31953, -167621, 239148, 232212, -148512]
15847b68415A14593A651c25513a09356c6170B61684f1864r6847m1141B6305b10813
15835F752L6141J28846a73101I5047b4814p6407L9615B45347a88861e1619E723
15823D14240D439a32050M6925l4918A13159C6750a39655C95924d8395o0966A27283
15811a28672A49425b43454n6085A97110b94046a28231A05164a83226k4030L086
15801b04170l164b2123I7403a63223B35203B5962g1230q7744A7723O6149L0983
15790A14855b91626a5333j0521H1727d6634A6796g0292K2003j97772B12239O744
15779B18983I5265J5865a62555j1699P8404I9538l0606a26104e6212A5615J10048
15768A25663d6775n5912F0984N165c9790a4835r514A5423f5676j69060G9846e5444
$$ y = [-268415, 114593, 1651, -325513, -109356, -36170, 261684, -61864, -158711, -199852, 26305, -210813, 6752, 42893, 171739, -173101, 95047, -24814, -101221, -61606, 245347, -188861, -51619, 5723, 414240, 4439, -132050, -85125, -120043, 113159, 36750, -139655, 395924, -48395, -109361, 127283, -128672, 149425, -243454, -299539, 197110, -294046, -128231, 105164, -183226, -207256, -204170, -207334, -22123, 97403, -163223, 235203, 25962, -71230, -158974, 17723, 83872, 114855, -291626, -15333, -25854, 81727, -46634, 16796, -70292, -48289, -246061, 212239, 218983, 95265, 111130, -162555, -174254, -95850, 99538, 68932, -126104, -56212, 15615, 125663, -46775, -102687, 60984, 66149, -39790, -14835, -24349, 15423, -65676, -234736, 79846, -55444]
15755B29744p7177a26489a8527j32544B8012e4469A73860h3262k18385K4728J27350
15744a49569A35277f3262B00670o6599b02268N3066N8488k58399D5760O720c1594
15732b71455d0252E602a4847k15771J07125B76622b1815l1101k44932J48913D9532
15720A06055c158p9011c2912F5399Q2402g2577k24378N4888B28022b91121A57060
15708b19838C01003d09746A26575n2615a43654r4209g4693n0528e0796j01561
15698a52357A24578b76958a06892j75282a8873j50862j9702b6984j83524C06514
15687B27153b18511A66478b28470k9262j9716A14818a69656j0501o1374H2404
15676E1446k2743N7997B1968J79061Q1766g4641I8465d4741B27693J36056I0910
$$ y = [229744, 152567, -126489, -18527, -151071, 28012, -54469, 173860, -83262, -301647, -276919, -149569, 135277, -63262, 200670, 134071, -202268, -149202, -90714, -349113, 45760, 52480, -31594, -271455, -40252, 5602, -14847, -230618, -123493, 276622, -21815, -52916, -297848, -148935, 49532, 106055, -3158, -82169, -32912, 65399, 147801, -72577, -296955, -242067, 228022, -291121, 157060, -219838, 301003, -409746, 126575, 73960, -143654, -237863, -74693, -125221, -50796, -152357, 124578, -276958, -106892, -282174, -18873, -169735, -189437, -26984, -210508, 306514, 227153, -218511, 166478, -228470, -257732, -277448, 114818, -169656, -180157, -241531, 82404, 51446, 28703, 86700, 21968, 201029, 282795, -74641, 98465, -44741, 227693, 363749, 90910]
15664A13939d5374k94133a14156l65748E1079a9661j12884e6810C41644b59494
15653a26372C4834a84320M2883G1656c0930l5607A67965l3414G098a73594C07987
15641F7447M629d9224A16361c1497r7942m8136A50616a74980A11578K8368a11433
15629a22473A17297C9783a40950B80835A37584a65002C87979c1998A62803b11129
15618a35896A80216d558j88391E0963g8187j39297o3266K6833B60150C3852b7390
15606a09321A01307a16540A07619b0492D0261a54221o6363b4343j1402k52854
15596b88599a17898f027B9037e19142g8682A35739i8320k12690e5162j22484A56981
15584A08841b24292B7596a39415d1054Q780F6448Q9889E9601K35313r7506e2186
$$ y = [113939, -45374, -339507, -114156, -479904, 51079, -19661, -132545, -56810, 341644, -259494, -126372, 34834, -184320, -141437, 71656, -30930, -66537, 167965, 134551, 7098, -173594, 307987, 67447, 72076, -49224, 116361, -31497, -129439, -177575, 150616, -174980, 111578, 139946, -111433, -122473, 117297, 39783, -140950, 280835, 137584, -165002, 387979, -31998, 162803, -211129, -135896, 180216, -4558, -192949, 50963, -78187, -217484, -280750, -253917, 260150, 33852, -27390, -109321, 101307, -116540, 107619, -20492, 40261, -154221, -220584, -24343, -35745, -288599, -117898, -6027, 29037, -519142, -78682, 135739, -98320, -311010, -55162, -177646, 156981, 108841, -224292, 27596, -139415, -41054, -32274, 66448, 156337, 59601, 294914, 197408, -52186]
15572A57472O9058c0913B72444H7095d9655n7924b0229A22259N9399p7401C6150
15560d8707G1706e0896k45841D707g021j00395b1459A90561D1788R7324J88700
15549C27812A12856a19249l8700C1268K38444A00228c7346j93855k260A63728
15538h9897C23194H1509k7377j3181l598o202b28021C4774J94469L3125a96272
15526d94332D2363f6804h907j25719A44704K43344c7249j33184A97585J49554
15516C47139j22438B5184h5454L939k7345j35159A33648o4576f5331j38459A47004
15504C2689a49466b2802A94869r1973L52690g2786L6314a5450C0023a8415l962
15493b2377k9474A66758g127k2712q5889B5332K1479K04925a63628f6323j4582
$$ y = [157472, 226530, -30913, 272444, 87095, -49655, -107579, -20229, 122259, 181658, 104257, 36150, -48707, 71706, -50896, -296737, 4707, -7021, -107416, -21459, 190561, 41788, 139112, 327812, 112856, -119249, -157949, 31268, 269712, 100228, -37346, -231201, -233461, 163728, -89897, 323194, 81509, 54132, 40951, 37353, 31151, -228021, 34774, 229243, 262368, -196272, -494332, 42363, -66804, -8907, -134626, 144704, 388048, -37249, -170433, 197585, 347139, 224701, 25184, -85454, -81515, -108860, -244019, 133648, 69072, -65331, -203790, 147004, 32689, -149466, -22802, 194869, 102896, 455586, -72786, -36472, -15450, 30023, -18415, -22377, -51851, 166758, -7127, -29839, -115728, 25332, 46811, 251736, -163628, -66323, -80905]
15482h0905D8253Q344a00180n8898C1454b9988A22587a48396A51121J16221a04473
15470A56664A2188J35707L7190Q6830K3551b35275A8283c31816A08838J33a03540
15458b30359A6369J18226J9155a07239b2554G0274c2451o1574E3182K6489L4390
15447A14061a40466A33253b40800M2146i3810B08818B1a67093E8540A0495a7378
15435a1387A48969b7884p7991H3226J97363j27815a29916j61046H4848a97835
15424g8674q515C56392b60493F0974f9113b9123B5540a60465B34219i0649A80035
15412C0261Q6568h7019j06589b454q4716c1011B91492g0985K522L3479j39504
15401a74488o4926B25405b36208C1581b38534A8025L5188K04125d5068j73859
$$ y = [-80905, 48253, 56597, -100180, -159078, 31454, -29988, 122587, -148396, 151121, 267342, -104473, 156664, 12188, 147895, 185085, 271915, 295466, -235275, 18283, -331816, 108838, 108971, -103540, -230359, 16369, 134595, 153750, -107239, -22554, 70274, -32451, -94025, 53182, 79671, 114061, -140466, 133253, -240800, -198654, -93810, 208818, 21, -167093, 58540, 10495, -17378, -11387, 148969, -27884, -105875, 83226, 280589, 152774, -129916, -290962, 84848, -197835, -78674, -87189, 356392, -260493, 60974, -69113, -29123, 25540, -160465, 234219, -90649, 180035, 30261, 116829, -87019, -193608, -2454, -87170, -31011, 291492, -70985, -68463, -34984, -174488, -239414, 225405, -236208, 31581, -238534, 18025, 53213, 257338, -45068, -218927]
15391b18927c1987j74683h959n872k1548B61324f7533c978C2784a45957l9980
15380a85937c3586j85741g8685c3314j38400C08220c2273B8936c12396f4139m8256
15369a12395I920M6900k0464K9931a25552A5914a40515K4335K6639r5094P9910
15358a04725l9958B23856m1263a92003N56i2G6399L3596c10666a14299j11094
15347b25393A91343d93325A4647K18720i0456c5898a546r2446O513j10772o6598
15336b64849A80999J41921H1404h9118j3639J9456l4140F4338j6951J80323b07582
15324C25289A47438a21837e1372A66752J98280A54494j9931g6696C5994K5088
15314F1082i7193A19055k1813J7552C1881a27112k8847r2051D5684a32300D9266
$$ y = [-218927, -31987, -206670, -8959, -14831, -36379, 261324, -67533, -3978, 32784, -145957, -185937, -33586, -219327, -78685, -33314, -171714, 308220, -32273, 28936, -312396, -64139, -112395, 9920, 56820, 36356, 66287, -125552, 15914, -140515, -116180, -89541, -184635, -104725, -144683, 223856, 182593, -192003, -191447, -92, 76399, 109995, -310666, -114299, -225393, 191343, -493325, 14647, 233367, -90456, -35898, -1546, -93992, -87479, -198251, -264849, 180999, 322920, 81404, -89118, -102757, -83301, -117441, 64338, 47387, 227710, -207582, 325289, 147438, -121837, -51372, 166752, 365032, 154494, 134563, -76696, 35994, 61082, -97193, 119055, 97242, 114794, 31881, -127112, -155959, -248010, 45684, -132300, 49266]
15302B98809g4196l5878A56491P8786A15262J64222a86991F9586b39453M8497
15292a90956B09813J9116o1663H1503b5604l3659C38117g1167A39258J9725a01843
15280C8690J06428d4127A37512M6799N6491J48579j29187b3822o2336B25338c7921
15268C2573a16937E0635L08804q1854m3182r958p7705h3596F973a82835l896E2196
15255B36679o0576J33855N3388A57324G233M9396J57135Q49262M08107k10237
15245A260896K49364o13452C56212l9154B6177J18799o0696J06006D8322b43842
15234c52418J12350P6390e4740a0797j28908D8194a93119A66366P0859A0843M4088
15223E4931a57967A17550K7738a98241A37845h8321I4293K4846A2906L76397n3076
$$ y = [298809, -74196, -110074, 156491, 235277, 115262, 279484, -186991, 69586, -239453, -190956, 209813, 228929, 167266, 81503, -25604, -59263, 338117, -71167, 139258, 158983, -101843, 38690, 145118, -44127, 137512, 184311, 240802, 389381, 260194, -23822, -86158, 225338, -37921, 32573, -116937, 50635, 359439, 277585, 234403, 224445, 146740, -83596, 6973, -182835, -186731, 52196, 236679, 176103, 309958, 363346, 157324, 7233, 56629, 213764, 1063026, 1471133, 1260896, 1510260, 896808, 356212, 317058, 26177, 144976, 84280, 190286, 48322, -243842, -352418, -240068, -163678, -54740, -10797, -139705, 48194, -193119, 166366, 237225, 10843, 54931, -157967, 117550, 145288, -198241, 137845, -88321, 94293, 119139, 12906, 389303, 336227]
15212C36227J20078I8638C7999d5652B20403b36715I873P7420J24762g7497A07868
15200a57745f1588J8988A60159J41884j28219f8858n9529N2399A66957j6123J05002
15189B55836A20558d538I2263K0487Q0396h3695e568A17331J6452o3262J03503
15178A74024E5072j2971J11538m6345J20370b0278C33611j40757p4858J2850J05622
15167B36468c270A25205f2860A90466G0824c2526j31411B32864I4381e3152o7258
15156a20410A06701N7254j5814m216M8842a48998G7072J18118n5253J8073K82004
15145D40014a18692F4103K76741C7957J00953K50205A05298R8185r1878M7063
15135A58668D5349K18948J48717G5187b1990A16331m5056J22986e2331H4191C8912
$$ y = [336227, 456305, 98638, 37999, -45652, 220403, -236715, 9873, 87293, 212055, -77497, 107868, -157745, -61588, -42600, 160159, 302043, 173824, -68858, -128387, -75988, 166957, 150834, 255836, 120558, -4538, 92263, 112750, 193146, -83695, -5568, 117331, 133783, 70521, 174024, 55072, 42101, 153639, 107294, 227664, -20278, 333611, 192854, 117996, 130846, 236468, -3270, 125205, -62860, 190466, 70824, -32526, -163937, 232864, 94381, -53152, -120410, 106701, 163955, 148141, 143925, 192767, -148998, 77072, 195190, 139937, 158010, 440014, -118692, 64103, 340844, 37957, 138910, 389115, 105298, 203483, 111605, 158668, 45349, 264297, 413014, 75187, -21990, 116331, 71275, 194261, -52331, 84191, 38912]
15123H2808c5847B95417A20706M402J67695n5194b82226J21196C59839A10297
15112A61454J50615a8402H4614l7636Q2441E4000G368M8419J92740j01358l9643
15101A07526B3702f4871B69938A32595J3834A0992L5093K93699q0519a35635I2003
15089h8253D8266e2690A76157h6590C36569J0094A00226K37674p4416E1399P4340
15078A25739L60330G4386J12988n5136J15786j02913L0889j2036N239L3462m289
15067A98376J50817j48719b3111B81816A14485L30151M5890A01934Q9709j0646
15057A80997e8460B22991n8542b33394E82891i1033A33915M375f3420j20949G4257
15045B94834K7335A0301c574A19117C2037J61773B8974a34760D45639A42724C3626
$$ y = [82808, -35847, 295417, 120706, 125108, 292803, 237609, -282226, -161030, 359839, 110297, 161454, 312069, -18402, 84614, 46978, 129419, 54000, 7368, 55787, 248527, 147169, 107526, 23702, -64871, 269938, 132595, 146429, 10992, 46085, 339784, 259265, -135635, 92003, -88253, 48266, -52690, 176157, -86590, 336569, 346663, 100226, 337900, 263484, 51399, 125739, 486069, 74386, 187374, 132238, 248024, 145111, 176000, 163964, 169203, 202665, 198376, 349193, 200474, -23111, 281816, 114485, 444636, 490526, 101934, 191643, 180997, -58460, 222991, 164449, -233394, 582891, -91033, 133915, 138290, -63420, -184369, 74257, 294834, 322169, 10301, -3574, 119117, 32037, 193810, 28974, -134760, 445639, 142724, 33626]
15033A3237a74529E37784A49206l9528O3966G8381J11114E3357J05719J8341k7356
15022A50061F1675N0635b7495o51G7378N2448K12949r7221n3084i1679M3244B62010
15009a15714A68112E8379b27795I2739a1915B07952G5816Q1549J04337q7401Q3175
14998B57476c63158A53807K17397C6715L46918A55905K22949j71287J0355d4568
14987E32601j25670l0797d8265E53620k43865k0757h9170K9854B49188j19873
14977A29315K13935b5024A475K27782E4696A102M22209Q0164O6930B0603J47788
14966A68391J76102q1874q2259J69848j62518n2002K75702I7736j2726L99243
14956D84253E2250J805L96573j39675G885J77385o9612K1699R4724D5934K63724
$$ y = [13237, -174529, 537784, 149206, 109678, 173644, 78381, 189495, 53357, 159076, 177417, 150061, 61675, 112310, -27495, -28146, 77378, 129826, 342775, 245554, 192470, -91679, -48435, 262010, -115714, 168112, 58379, -227795, 92739, -11915, 207952, 75816, 157365, 261702, 174301, 257476, -363158, 153807, 371204, 36715, 383633, 155905, 378854, 207567, 217922, -44568, 532601, 406931, 376134, -48265, 553620, 309755, 288998, -89170, -59316, 249188, 129315, 343250, -25024, 1475, 229257, 54696, 1102, 423311, 503475, 570405, 20603, 168391, 344493, 262619, 180360, 350208, 187690, 135688, 411390, 97736, 85010, 484253, 52250, 54055, 450628, 310953, 7885, 185270, 115658, 137357, 232081, 45934, 309658]
14945C09658L74910B12801n968k5167b8568I1550K93085j15470K39845A92163
14934C3235J83952r9060P11286C82803J73647b22843A24195J24536R4078J21763
14924D64572N0527j11204A02935f544B37653o4573M24353k60957j01215F6231
14913A38810K13172j05464Q2956R9194H3541K18310J54014B27255P3674j27760
14903A73169K01040L9183Q5523j56376A45244R4018l9057J33285k4964o255J14279
14892D16550A43028M90897A68891J65944j53180J70582j43016J42051k8178J68393
14882D91487Q3402A53983M07976B04437H6216M24018D2034Q0637J76433I2907
14871A60473K95828n2080R0080B13589J74541J46876c062C67682K98271A87546
$$ y = [309658, 684568, 212801, 206833, 181666, -28568, 91550, 384635, 269165, 509010, 192163, 33235, 217187, 118127, 829413, 382803, 556450, -222843, 124195, 248731, 342809, 464572, 515099, 403895, 102935, -6544, 237653, 173080, 597433, 336476, 235261, 66231, 138810, 351982, 246518, 329474, 428668, 83541, 301851, 455865, 227255, 300929, 173169, 374209, 413392, 498915, 342539, 145244, 239262, 200205, 333490, 308526, 302271, 416550, 143028, 633925, 168891, 334835, 181655, 352237, 209221, 351272, 323094, 491487, 574889, 153983, 561959, 204437, 86216, 510234, 42034, 122671, 299104, 92907, 160473, 456301, 404221, 494301, 213589, 388130, 535006, -3062, 367682, 665953, 187546]
14860D42558q1840O3204H0801K29572J30263J9305o8153p347J17248K00024J79854
14849H81567A31706K3513J22510q7882K98723k42307J72685J44946K27664l86225
14839D05333J34351k03936j32960L12491m7121r8413M09804j83165k61927K10375
14829E44832o5874L0127k50523K06941k30639K04849Q3641k00464P2717K35705
14819F31312J35530p4736j32255B62543J78012J32672N9076j67692J05064k50333
14809C19342J33810K67333k91781A28043M35916K00773C53935M75082k56652K43370
14799H15735l19649n9545r6182K37582J2229Q0603B12461B06J82257M79570J9524
14788F81557l1843k48145Q6416B17226M29087r5927J86475o1788j25085j94888
$$ y = [442558, 360718, 423922, 80801, 310373, 440636, 459941, 391788, 384441, 501689, 701713, 881567, 131706, 155219, 277729, 189847, 488570, 246263, 418948, 563894, 791558, 405333, 539684, 335748, 202788, 515279, 468158, 369745, 779549, 596384, 334457, 544832, 478958, 509085, 258562, 465503, 234864, 439713, 523354, 322890, 395607, 631312, 766842, 692106, 559851, 262543, 440555, 573227, 632303, 464611, 569675, 319342, 453152, 720485, 428704, 128043, 563959, 764732, 353935, 829017, 572365, 815735, 496086, 436541, 340359, 577941, 590170, 670773, 212461, 206, 182463, 662033, 681557, 649714, 401569, 487985, 217226, 646313, 550386, 736861, 675073, 549988, 355100]
14778C55100N45638k79017J8302K00832N0912k18036k71852J10376R7116L06741
14768I16112A97587K34678L15603o1442J10289l03820N299J74712k86596L57057
14758G43367k46856A06198M97912K2459P3370j53798K14667j78352p8702M60418
14748I64172k28056k74943O8569o1736L07060j16635J9479Q4837j00946J53997
14738H15798j56506K0626J18726j48412L48101k49127N1456k05426J5308L27353
14728I37897j49932j81225q084J65011J87196M9766q3659j25581j54259J51582
14718G88712k57261j12215O8708R5878J15111L6642k5482J7350K72023j6377P6942
14707A060031E19172K15487J14039K54908m87338L29681J5294j90961J73153Q24
$$ y = [355100, 900738, 621721, 640023, 840855, 891767, 673731, 401879, 512255, 609371, 916112, 197587, 432265, 747868, 686426, 796715, 492895, 498194, 672906, 386310, 743367, 496511, 106198, 604110, 626569, 699939, 546141, 760808, 582456, 503754, 964172, 736116, 461173, 529742, 468006, 775066, 658431, 677910, 762747, 661801, 815798, 659292, 679918, 798644, 650232, 998333, 749206, 800662, 595236, 610544, 937897, 787965, 606740, 598656, 763667, 950863, 1000629, 916970, 791389, 637130, 788712, 531451, 419236, 487944, 583822, 698933, 735575, 710093, 727443, 999466, 983089, 1060031, 519172, 734659, 848698, 1103606, 616268, 945949, 961243, 770282, 943435, 944259]
14697I44259k11162Q970O01843n11844M37073m26709L7870Q3922D43228J85486
14687F28714K87717M2086J32078j6636j92430J87818M4181k29358r0298M21034
14677A214906N1365j55572j77202J80954R4930j95285N0701P947k06326J20629
14667I87047r6876P1021K29019l8301j78664K8304K98082k52267M458k16527M13585
14656A248881k80849K66133j22090r0259m2856L07922k86075J40912j45658N11806
14646A507867k07918j06357j52750K46156K88088o95052M06123J92731k20716
14637A258172K10101o63461K02905K56545J43823j51671M542l28568L69131J51046
14627A452565l68395L07607j54606j20891K40853m77617K11600K32465M83384
$$ y = [944259, 733097, 742067, 1343910, 832066, 1269139, 842430, 880300, 964222, 443228, 628714, 916431, 958517, 1090595, 1073959, 881529, 1069347, 1113528, 884170, 793872, 1214906, 1266271, 1110699, 933497, 1114451, 1209381, 1014096, 1064797, 1072744, 866418, 987047, 890171, 961192, 1190211, 1151910, 973246, 1001550, 1299632, 1047365, 1051823, 835296, 1248881, 968032, 1234165, 1112075, 1021816, 978960, 1286882, 1000807, 1141719, 996061, 1507867, 1299949, 1193592, 1040842, 1286998, 1575086, 880034, 1286157, 1478888, 1258172, 1468273, 804812, 1007717, 1264262, 1408085, 1256414, 1260956, 932388, 1301519, 1452565, 1084170, 1391777, 1237171, 1116280, 1357133, 879516, 1091116, 1323581, 1806965]
14618A806965l58025l50254L84583k21702N8202M19437k12339L5636J2299k70265
14608A304537K04139p6473J917J86350j02979q8084N57346l15041R5204j18328
14598A648588k16954N50846n44616L89224k11527j64913J44711O6926J85312l32933
14588A514664L25882l30379L27470L2032j0660K45930j99442J53010j09198M6308
14578A995617j53616K75908o5833J23617k01068L51609o5927J19593j92140J17914
14568B305674l9455o7572M50646m14476M8864L50822k14211J59056J6147K08521
14558B804016K69049k02988N84338L027Q5708K88366J95267P99949N10723J739698
14548G077153L302698Q359090K2089048O435497B1035117A0152120D569500j500315
$$ y = [1806965, 1448940, 1098686, 1483269, 1261567, 1319769, 1739206, 1526867, 1562503, 1574802, 1304537, 1508676, 1432203, 1434120, 1620470, 1517491, 1429407, 1986753, 1671712, 1766916, 1648588, 1431634, 1982480, 1437864, 1827088, 1615561, 1450648, 1595359, 1662285, 1847597, 1514664, 1840546, 1510167, 1837637, 1869669, 1859009, 2104939, 1905497, 2058507, 1949309, 1995617, 1842001, 2117909, 2052076, 2175693, 1974625, 2326234, 2260307, 2379900, 2187760, 2305674, 2266219, 2198647, 2649293, 2234817, 2283681, 2634503, 2420292, 2579348, 2595495, 2804016, 3073065, 2870077, 3454415, 3457442, 3543150, 3831516, 4026783, 4826732, 5337455, 7077153, 10379851, 18738941, 40827989, 47263486, 21035117, 10152120, 4569500, 3069185]
14540C069185p92362k39921k6545k03360K98527q3197N9641j69424K61838r0921
14530B083461J52376j39425O9660Q7677O3880k9085m5607J59143l05977J57796
14520B253899M19691q3648P4088O5967k42552L17800k96212J57891M3792J32547
14510B843263J56868k38865K44644j60369J88103j75896K7455J29327J91106l75953
14500B829683M07676J24648k03353L47822j22604j74968K1607K8224M17927l49233
14490C327429K14675J32238k3771L02861k65271J88058K78104n68361J64637K42503
14480C993102m1136M8114L43261p21394M31911J5387L447J61696M47791m70398
14470D211781L77988k20046Q9061J30892N5161K88302l87733L386n3106J43580
$$ y = [3069185, 2276823, 2036902, 2010357, 1806997, 2105524, 2022327, 2081968, 1912544, 2174382, 2083461, 2235837, 2096412, 2166072, 2253749, 2317629, 2288544, 2242937, 2402080, 2096103, 2253899, 2673590, 2589942, 2664030, 2729997, 2487445, 2805245, 2509033, 2666924, 2710716, 2843263, 3000131, 2761266, 3005910, 2845541, 3033644, 2857748, 2885203, 3014530, 3205636, 2829683, 3237359, 3362007, 3158654, 3506476, 3383872, 3208904, 3230511, 3258735, 3676662, 3327429, 3542104, 3674342, 3650571, 3953432, 3688161, 3876219, 4154323, 3585962, 3750599, 3993102, 3951966, 4000080, 4343341, 3621947, 4053858, 4069245, 4072692, 4234388, 4682179, 4211781, 4589769, 4369723, 4458784, 4589676, 4644837, 4933139, 4545406, 4548792, 4495686, 4639266]
14460D639266J43014N83195l17001l2371k34083M64564l13658L73890Q1327l5655
14450E352488j71152M92172K67477j19051J60901j96846m5834l3797J42094K47999
14440F096451r6835J42382K80161j0577j0649J5744L09371L26300r6770K01239
14430G156817M695l48943N31654m0799Q0422J32770l8325J6671O137N11461r9927
14419G912633N6346M53447J8910K82362L92880m30075m4945K47437o5250M25159
14409I248904J4941p0260N54642m3758L62054o0121J07342L55250M9888K69520
14399A0788402J34685M2K21370L45635J4691M82217K36043k56089K34504O91504
14389A2893004j36737N39208K60793j68410O91735K85497k97468M89117L26738
$$ y = [4639266, 4782280, 5365475, 5048474, 5016103, 4782020, 5246584, 4932926, 5306816, 5388143, 5352488, 5181336, 5673508, 5940985, 5821934, 5982835, 5785989, 5740155, 5706358, 5848452, 6096451, 5999616, 6141998, 6422159, 6411582, 6400933, 6416677, 6726048, 7052348, 6955578, 7156817, 7161512, 6812569, 7344223, 7303424, 7383846, 7516616, 7478291, 7494962, 7501099, 8012560, 7912633, 7968979, 8422426, 8441336, 8723698, 9116578, 8686503, 8641558, 8888995, 8823745, 9248904, 9263845, 9193585, 9748227, 9704469, 10066523, 10006402, 10113744, 10468994, 10518882, 10788402, 10923087, 10923129, 11144499, 11490134, 11504825, 11987042, 12223085, 11966996, 12201500, 12893004, 12756267, 13295475, 13556268, 13387858, 14079593, 14365090, 14067622, 14556739, 14883477]
14380A4883477K09534j44860P30583J4589O20109M37942O6407K64514K75641N41963
14370A7899899M45313P4765L14640L92079N48770M98225J97844N66974M07478
14361B1345987M86238M66669O49396L09884N33301M86793M34669Q72074N88948
14352B6173959N48714M63030Q42244O36342Q27084N44545R02173Q59842O09961
14343C2407894J057568O20429J102852Q56923J118546O65468J453834J149404
14335D0432918J068033J328047J352576J184664J015519J959055J606429J059797
14327E1007038J899481J694537J837924J869650J559920K480199K190762K065387
14319F6604898K339370K583023K623527K661676L318031K598907L272969L518303
$$ y = [14883477, 15093011, 14948151, 15678734, 15693323, 16313432, 16751374, 16817781, 17082295, 17357936, 17899899, 18345212, 18419977, 18734617, 19126696, 19675466, 20173691, 20371535, 20938509, 21345987, 21832225, 22298894, 22948290, 23258174, 23791475, 24278268, 24712937, 25585011, 26173959, 26722673, 27185703, 28027947, 28664289, 29491373, 30035918, 30938091, 31797933, 32407894, 33465462, 34085891, 35188743, 36045666, 37164212, 37829680, 39283514, 40432918, 41500951, 42828998, 44181574, 45366238, 46381757, 48340812, 49947241, 51007038, 52906519, 54601056, 56438980, 58308630, 59868550, 62348749, 64539511, 66604898, 68944268, 71527291, 74150818, 76812494, 80130525, 82729432, 86002401, 89520704]
14311H9520704L513793L941359L858714M487280M254351M535568N012197N643475
14303A24767441N250529O044742O183316O311432O909569P712683P699859Q125340
14295A79004911Q900108R067584R806281J0184353J0942106J1185720J2042112
14288B51133175J2128423J3054783J3525391J3698082J4096752J4694424J4918456
14281C47249486J4515978J4526578J4424932J3730688J3116019J1849829J0570671
14274D39984181Q703167O801981K370133K22481p2237k549193l837468n200320
14266D46422725o699725q395458j0380204j2258470j3145820j3693289j4626950
14259C67222809j5177892j5340439j5417144j5312800j4545368j2831965j3799592
$$ y = [89520704, 93034497, 96975856, 100834570, 105321850, 109576201, 114111769, 119123966, 124767441, 130017970, 136062712, 142246028, 148557460, 155467029, 163179712, 170879571, 179004911, 187905019, 196972603, 206778884, 216963237, 227905343, 239091063, 251133175, 263261598, 276316381, 289841772, 303539854, 317636606, 332331030, 347249486, 361765464, 376292042, 390716974, 404447662, 417563681, 429413510, 439984181, 448687348, 455489329, 457859462, 458081943, 458009706, 455460513, 451623045, 446422725, 439723000, 431327542, 420947338, 408688868, 395543048, 381849759, 367222809, 352044917, 336704478, 321287334, 305974534, 291429166, 278597201, 264797609]
14252B64797609j3211228j2538302j1403357j1378536j0707016j0254893r326363
14245A85977914r555023p693601q346815p071872p392225o487722o466383n520395
14237A27443878n364513n431393n087451m760608m096847m151514l646966l852260
14229I1052326l791426l240891l068487l075533l249422k540177k644878k130190
14221F7311322k470152k031592j679482k547538k139276j464970j999243j268349
14213E1710720j237726j927125j533784j579893j186217r65059o99444j211234
14205D1370238j376114j278604j260883q10545j030768o03194q71304j092698
14197C3046128r69558o94633p18930o96038j047960l85992o46255q06088q90622
$$ y = [264797609, 251586381, 239048079, 227644722, 216266186, 205559170, 195304277, 185977914, 176422891, 168729290, 160382475, 153310603, 145918378, 139430656, 132964273, 127443878, 122079365, 116647972, 111560521, 106799913, 102703066, 98551552, 94904586, 91052326, 87260900, 84020009, 80951522, 77875989, 74626567, 72086390, 69441512, 67311322, 64841170, 62809578, 61130096, 58582558, 56443282, 54978312, 52979069, 51710720, 50472994, 48545869, 47012085, 45432192, 44245975, 43280916, 42581472, 41370238, 39994124, 38715520, 37454637, 36644092, 35613324, 35010130, 34138826, 33046128, 32076570, 31381937, 30663007, 29966969, 28919009, 28533017, 27886762, 27080674, 26190052]
14188B6190052k33625m39298r60692m97979l27102p18131m18575o33032l57755
14179B1603863l43094m22107n99071l37679n79588n58569l55714r8773l50128
14170A7959140k91536o79230r8280l89017l51822o7797k43807o89521o0004k67407
14160A4820719l42004j04404k39677m03099Q2352k37313j35480p21075K8267r9439
14150A2648847k61576j48822j68010k04197j30129j71073l41573m08982K46673
14141A1061158j93472k42892m69727L30522l47740k29837j42540j1042l55375
14132I399055j6445Q9871l26445m81562J95167R730l5989j28467k75461j29674
14122H299780l14672k02889K49323M2599m25819o4232m6661k13171k38435L43783
$$ y = [26190052, 25956427, 25517129, 24556437, 24058458, 23731356, 23013225, 22594650, 21961618, 21603863, 21260769, 20838662, 20239591, 19901912, 19322324, 18763755, 18408041, 18309268, 17959140, 17667604, 16988374, 16890094, 16501077, 16149255, 16081458, 15837651, 15148130, 15088126, 14820719, 14478715, 14374311, 14134634, 13731535, 13813887, 13576574, 13441094, 12720019, 12748286, 12648847, 12387271, 12238449, 12070439, 11866242, 11736113, 11565040, 11223467, 10814485, 11061158, 10867686, 10624794, 10155067, 10485589, 10137849, 9908012, 9765472, 9754430, 9399055, 9382610, 9472481, 9146036, 8664474, 8859641, 8869371, 8833382, 8704915, 8429454, 8299780, 7985108, 7782219, 8031542, 8074141, 7648322, 7584090, 7537429, 7324258, 7085823, 7429606]
14112G429606j84636k05956j35750L3822J6339k42710R3896m00055k11319K46254
14102F439491q5434k22376J30563j86895Q4791K92472m34864l68990r8238k06540
14092E343980K65310k41293Q3535L5123k20371M3767L4263J1901k26276j60752
14082D969187K21174k9249l29781M15224l87714m66127J67394K18351j04930J72704
14072D846233m89501L42663m98420j0843L3325J35612J62461m52402K74362j23780
14062D219710J48449j53768k31848J60025R9464L7234P7079p92626M07985j11403
14052C860301M0812j73859J88514l21267N0620r3762m170m30823M94445k07784
14042C403027l233l2668q2834J40178L15035l97320k55627J90195r3446o3843
$$ y = [7429606, 7244970, 7039014, 6903264, 6937086, 6953425, 6710715, 6804611, 6404556, 6193237, 6439491, 6354057, 6131681, 6262244, 6075349, 6160140, 6452612, 6017748, 5648758, 5550520, 5343980, 5609290, 5367997, 5451532, 5486655, 5266284, 5310051, 5344314, 5356215, 5129939, 4969187, 5190361, 5161112, 4831331, 5246555, 4858841, 4392714, 4560108, 4778459, 4673529, 4846233, 4356732, 4699395, 4200975, 4190132, 4223457, 4359069, 4521530, 4069128, 4343490, 4219710, 4368159, 4214391, 3982543, 4142568, 4242032, 4279266, 4356345, 3563719, 3971704, 3860301, 3901113, 3727254, 3915768, 3594501, 3645121, 3551359, 3547189, 3116366, 3610811, 3403027, 3399794, 3367126, 3284292, 3424470, 3739505, 3342185, 3086558, 3276753, 3183307, 3119464]
14032C119464L03255m15198J20381o8586n1312M5602k73104K4810J67638K6123
14022B999073k2408j15342j13306M9840o1822j27505j20909J05994M7348j01198
14012B539765K43807m8081l14248j59094M27343k16423k58908M1791o1288J93640
14002B388304l91081J74842p0157O8001r2080K4818m9255J05248k71695L28941
13992B215886k05497K46508M08878L87250K308684O328923K0472673J8148225
13984E0311530k5039536j1731863m941556k736793r83039q50400j98600o99337
13976C130406K20455m29009j13084j04240M61343q40846K18645j5932J98270j19001
13966B607007l00912J55698o8511j16114j42260j57439L23528K25567n90020P0057
$$ y = [3119464, 3422719, 3007521, 3127902, 3059316, 3008004, 3053606, 2780502, 2805312, 2972950, 2999073, 2976665, 2861323, 2748017, 2797857, 2736035, 2608530, 2487621, 2593615, 2640963, 2539765, 2783572, 2735491, 2421243, 2262149, 2689492, 2473069, 2214161, 2255952, 2194664, 2388304, 1997223, 2172065, 2101908, 2169909, 2077829, 2102647, 2053392, 2158640, 1886945, 2215886, 2010389, 2256897, 2665775, 3053025, 5361709, 11690632, 32163305, 50311530, 25271994, 13540131, 8598575, 5861782, 4878743, 4028343, 3829743, 3130406, 3350861, 2921852, 2808768, 2704528, 3165871, 2325025, 2543670, 2527738, 2726008, 2607007, 2306095, 2461793, 2393282, 2277168, 2134908, 1977469, 2300997, 2526564, 1936544, 2006601]
13956B006601K28074N6834j85003M51305l73645l7960j56551j3589j06949P2492
13946A941609k60663M7846J95953M1766J43543q4191J9005j51858k21289J69692
13936A841413L6764p2136L5465J95474j22906j15998j91505M47946m61166L77298
13926A970649l16926K85525m549n18850o8781J71612j23106J95599P5657J34721
13916A801551k29206j04983Q5533K9482k69789q770J60471l91097N46127O4270
13906A683589k37328L70342j68104l37466K4099L846k49148M75829J97556n16250
13896A246965K23428n0721L1109q8225j69128K47867j84507n4764m6895M1990
13886A197119Q4063J20628K98074j93411k94072K80290l08211K57931k28222J72692
$$ y = [2006601, 2234675, 2291509, 2106506, 2557811, 2184166, 2146206, 1989655, 1976066, 1869117, 1941609, 1680946, 1728792, 1924745, 1966511, 2110054, 2025863, 2044868, 1893010, 1671721, 1841413, 1878177, 1806041, 1841506, 2036980, 1914074, 1798076, 1606571, 2054517, 1593351, 1970649, 1653723, 1939248, 1934699, 1415849, 1347068, 1518680, 1395574, 1591173, 1666830, 1801551, 1572345, 1467362, 1552895, 1582377, 1312588, 1303818, 1464289, 1073192, 1619319, 1683589, 1446261, 1816603, 1648499, 1311033, 1335132, 1338978, 1089830, 1565659, 1763215, 1246965, 1470393, 1419672, 1450781, 1362556, 1193428, 1441295, 1256788, 1202024, 1155129, 1197119, 1281182, 1401810, 1699884, 1506473, 1212401, 1492691, 1184480, 1442411, 1214189, 1386881]
13876A386881j48670r3526q578K3740J45035k53958J84612j09911K4873k50558
13866H99940M28192k75464N3638K7223l91966J72982J44206J49517k64805L40599
13856A284062l12605M41664j78735j47264R4679k21097K87009K0308m71428J95389
13846I91982J13052k38611K46090j28706J41799q8309Q360k86775J47345N5194
13836I61421j92478M63209k88490M07231l13439P0686j2173k95811J24505l978
13826I20683M5538Q8385k34586J48124J0728J79518J26735n75173J86119K79577
13816A175648m18817K33881K07132m53231L60977J5711j59379J76177k06889j32666
13806G98544k0608j91466L84194P392l65291K77787K15145C90750O41255m7947
$$ y = [1386881, 1238211, 1144685, 1136107, 1159847, 1304882, 1050924, 1235536, 1125625, 1150498, 899940, 1328132, 1052668, 1106306, 1133529, 741563, 914545, 1058751, 1208268, 943463, 1284062, 971457, 1413121, 1234386, 1087122, 1181801, 960704, 1247713, 1268021, 796593, 991982, 1105034, 866423, 1112513, 983807, 1125606, 1037297, 1045657, 758882, 906227, 961421, 768943, 1232152, 943662, 1350893, 1037454, 1108140, 1095967, 800156, 924661, 920683, 966221, 1054606, 820020, 968144, 978872, 1158390, 1285125, 709952, 896071, 1175648, 756831, 990712, 1197844, 744613, 1105590, 1121301, 961922, 1138099, 931210, 798544, 777936, 586470, 970664, 978056, 612765, 890552, 1105697, 390750, 1032005, 984058]
13796I84058m9908k29262K49310m75714L00785M2667j457k83618M02212j37127
13786H01946p6036R5263m2552L5842O4049k9562J26617l6813l46430K38767K2973
13775H54064n4486k95053N00733j58156l4628k30216M05154l87543q7811L1560
13765E43618L36759j77790k884j7550l2582k0652J74323j8830j63242q380P0919
13754F83709K8190k29L2441k29834N4069M19408l27799l3228j6473K47147k16856
13743F40545j84657J18227J78597l02252J77926M6508p9105Q4095l3357M37086
13733A083613k54824l24293K56700B54102L79766L51139k01900K0699l50626j83584
13723B69596N01874k63380j18974q5564M06055J05535k36274N37L7864J51803
$$ y = [984058, 934150, 704888, 954198, 478484, 779269, 821936, 820479, 536861, 939073, 801946, 725910, 821173, 778621, 814463, 878512, 848950, 975567, 938754, 592324, 831091, 854064, 799578, 504525, 1005258, 847102, 812474, 582258, 987412, 599869, 512058, 543618, 880377, 702587, 699703, 682153, 649571, 628919, 803242, 784412, 621170, 612790, 683709, 711899, 711670, 744111, 514277, 568346, 987754, 659955, 626727, 610254, 857401, 640545, 455888, 574115, 752712, 450460, 628386, 674894, 595789, 679884, 646527, 1083613, 828789, 504496, 761196, 254102, 633868, 985007, 783107, 803806, 453180, 269596, 771470, 508090, 389116, 303552, 709607, 815142, 578868, 579405, 617269, 769072]
13713G69072l59036B03826J94427o9406j9006J61089K02102K3001l11280O1892
13703D46645J5896O808K3478Q3344J35256o2672j57057r7591J14989J92819J57145
13692H59060j31405r0098o7985O1449r5713m657J20040l5029k8602Q2400L31100
13681A000560D53682P7572P3632B97044K62991N9640k21055o4615K84444o5577
13671E52872K16102l09777B28982L61310m9224N2141k44938K21050q0131K02294
13661F91484k79376L7328A68484K54286L5523N8033J05619j43443k30475J96244
13651D44271L03338p9066j01056Q2305B46445O9354J22206K1426j76537J9586
13641C02480M05782K3892k20251a19003B55513L28060l3007k17182J24351l2771
$$ y = [769072, 410036, 203826, 398253, 328847, 309841, 470930, 673032, 696033, 384753, 446645, 462541, 469349, 492827, 576171, 711427, 648755, 491698, 394107, 509096, 701915, 859060, 727655, 637557, 569572, 631021, 535308, 530651, 650691, 615662, 587060, 669460, 1000560, 453682, 531254, 604886, 297044, 560035, 619675, 398620, 334005, 618449, 552872, 768974, 459197, 228982, 590292, 541068, 593209, 348271, 569321, 489190, 691484, 412108, 449436, 168484, 422770, 458293, 516326, 621945, 478502, 248027, 444271, 747609, 668543, 567487, 649792, 246445, 315799, 438005, 459431, 282894, 302480, 708262, 732154, 511903, -119003, 255513, 583573, 550566, 333384, 457735, 424964]
13631D24964j8475m6746j79645L25106J19952j36721o407k18053J93793k06875
13621B50893p8985J74381l4051J54369J58032J6772l2377k50404j61031Q663J25905
13610C32167K0437K68539k49065K21840B11998Q0230N3199J33793j07596Q1008
13600D52632P7315L2700o2923j7667j87433k9296R7561l1413O9762m2758N2240
13589D10720j28176K26753a306E4673K93243A06865l1739L27951L1332A91690
13578C17453K02465A88101L31555B29079K5579J57631A78292K55286B11044p6987
13568A34057N73122k55582B17493A00601O16599k14333A63654m056K23045J51974
13558E34617O8774k48854j7271J62110j81851N5148M88296C84407j47441q0760
$$ y = [424964, 406489, 359743, 180098, 505204, 625156, 488435, 482028, 263975, 457768, 250893, 171908, 346289, 312238, 466607, 624639, 641411, 609034, 358630, 197599, 206262, 332167, 352604, 621143, 372078, 593918, 211998, 292228, 345427, 479220, 371624, 452632, 529947, 562647, 499724, 482057, 294624, 265328, 362889, 331476, 401238, 358480, 410720, 282544, 509297, -1306, 54673, 347916, 106865, 75126, 403077, 434409, 191690, 317453, 519918, 188101, 519656, 229079, 254658, 412289, 178292, 433578, 211044, 134057, 707179, 451597, 217493, 100601, 717200, 502867, 163654, 159598, 382643, 534617, 603391, 354537, 337266, 499376, 317525, 372673, 860969, 384407, 236966, 156206]
13548A56206a124C08878O7092R4322O5564k56879A13626L01503P4456j61728P7364
13537D05221q3388b3456C73038J1265L0705j15616J61909N5146K18963B86420
13526E23866B39243J35552O2592I7156J25291M69777j87376j92906J94600k7199
13516D79343N1094k60818M2780e5272C95839k9387q28J25779B20261K72934P788
13505E00983k27808p1393C2636J90273l7271K40691m5241A42829L77468G8599
13494B84266K31286A48766J36117n0413J88235J88081A23957e4698A02792J46976
13484B49768K4091o4597p4846n5287K35390J42806b35024A46633K96839l7703
13474D05769A72468f766E17218A01308M9352j3553P4728Q219J1567L1843A08326
$$ y = [156206, -1124, 308878, 375970, 470292, 535856, 278977, 113626, 415129, 489585, 327857, 405221, 321833, -23456, 373038, 384303, 415008, 299392, 461301, 516447, 735410, 286420, 523866, 239243, 374795, 437387, 97156, 222447, 692224, 504848, 311942, 506542, 479343, 530437, 269619, 312399, -55272, 395839, 366452, 365624, 491403, 220261, 493195, 500983, 273175, 201782, 32636, 222909, 185638, 426329, 381088, 142829, 520297, 78599, 284266, 515552, 148766, 284883, 234470, 422705, 610786, 123957, -54698, 102792, 249768, 273859, 209262, 134416, 79129, 314519, 457325, -235024, 146633, 443472, 405769, 172468, -6766, 517218, 101308, 150660, 137107, 211835, 220054, 231621, 263464, 108326]
13462F7642K88781J35815j36778j02057J36236A46790L02961j35853k3891o0258
13452B29749j8208J96661j17604J80020j42992l7181a25809B44295n4278J14116
13442C04133L8749G0805K91241l8637R1308b0748D73763j84917n8924K77665i4494
13430C4099R7882j0819M5481J5078K47011j72192o799H1833a5798C38595A32865
13418C82811M9220J34086A34232O3160k4001l4562K42440a07782f992D03302I8671
13406A06267N9070B0082K90292A07644m2210L35460P2620B32822P6136q1457d942
13394B39074M1896j12683M9798M3090K54219D906J30841P407K61827j64694J56345
13383C96632j06192D4139a41554j51834e3878A78622M1186F6558J90636J67342
$$ y = [67642, 356423, 492238, 355460, 253403, 389639, 146790, 449751, 313898, 290007, 229749, 211541, 408202, 290598, 470618, 327626, 290445, -125809, 244295, 190017, 304133, 342882, 70805, 362046, 323409, 414717, -20748, 473763, 288846, 229922, 507587, -94494, 34099, 131981, 121162, 166643, 181721, 428732, 256540, 249741, 81833, -15798, 338595, 132865, 382811, 432031, 566117, 134232, 197392, 173391, 138829, 381269, -107782, -6992, 403302, 98671, 106267, 165337, 20082, 310374, 107644, 65434, 400894, 473514, 232822, 308958, 227501, -4942, 239074, 280970, 168287, 218085, 261175, 515394, 4906, 135747, 143154, 404981, 240287, 396632, 290440, 44139, -141554, -293388, -53878, 178622, 219808, 66558, 257194, 424536]
13373D24536A92956J283L51649j65685k7635O32K10511j81920o8588l8549A2091
13361C97438M4009j25952N4544j0538m5418k295j25152a73418F69082B76676r8566
13350A78110m9204L15866k03282q9612R3016K68703j82676N8573b5330D81452
13339B18518B4519M89018A01455L13984G3938J77069N1342l8191q2357q0360A3024
13327b7637C97869o5274k7593n9556B8486M72372k09310l0939E8045O5259L9069
13316A62373D8069N8979L35553A03992K15577A20020K24935P8159j75950A19305
13305h5345G6395L49997j80062o1569b3562I8066A3064K10691D9426K25806p5961
13294A99271a45677B10167J95567A47346K9760o9456O969M03161A88729j2861
$$ y = [424536, 192956, 194239, 545888, 380203, 352568, 353200, 563711, 381791, 313203, 274654, 12091, 397438, 441447, 315495, 370039, 359501, 314083, 311788, 186636, -173418, 669082, 276676, 178110, 128906, 444772, 241490, 151878, 244894, 513597, 330921, 389494, -25330, 481452, 218518, 24519, 513537, 101455, 415439, 73938, 251007, 302349, 264158, 181801, 101441, 13024, -27637, 397869, 332595, 305002, 245446, 28486, 500858, 291548, 260609, 58045, 123304, 162373, 48069, 107048, 442601, 103992, 319569, 120020, 344955, 423114, 247164, 119305, -85345, 76395, 426392, 246330, 184761, -23562, 98066, 13064, 223755, 49426, 275232, 199271, -145677, 210167, 405734, 147346, 177106, 107650, 114619, 517780, 188729, 175868]
13284A75868L7822H6351a7488F5152J50997J58664g1201D19086B607M86674a25149
13272C99958d5058B3486b25186A2343J37272K04219d1703A81570E9643d4147A30789
13260I6926d9784B53477D7229K01011B2580K54073A27397e4417D2716A0852c5113
13248B65435b9895A37793a28092E5151J96794G8956K14853r5976F3363j4748K31871
13237B80486E8899P1874r929J8247A6368b7800D20454j75441m4238J02401A47931
13225B30582p6884i9777j7790C70213H3182L16489a4970C40227e6438B82240I7890
13213A73006b6697H9999B9983J40245b95196A32901L8050b3096A09989J33740
13203B43729B0808K14187n931l8159Q004k3218G9393b6007I1982Q3314j310f9617
$$ y = [175868, 213690, 86351, -17488, 65152, 216149, 374813, -71201, 419086, 2607, 489281, -125149, 399958, -45058, 23486, -225186, 12343, 149615, 353834, -41703, 181570, 59643, -44147, 130789, 96926, -49784, 253477, 47229, 248240, 22580, 276653, 127397, -54417, 42716, 10852, -35113, 265435, -29895, 137793, -128092, 55151, 251945, 78956, 293809, 197833, 63363, 48615, 280486, 58899, 130773, 120844, 139091, 16368, -27800, 420454, 245013, 200775, 303176, 147931, 230582, 153698, -99777, -117567, 370213, 83182, 399671, -14970, 340227, -56438, 282240, 97890, 173006, -26697, 89999, 29983, 170228, -295196, 132901, 170951, -23096, 109989, 243729, 20808, 234995, 229064, 190905, 198909, 175691, 79393, -26007, 91982, 175296, 173986, -69617]
13190a24428E52155a36223H5491C3086K98185j45242b78937B49985d2986B39599
13179e2712C30193A3331J45440C6764N7037M58776b52625B26686o7007L2088L8528
13168B30295O9007p1275p5565J07346M5143J02564A29268m7505b5144I2732K33501
13157C26233g748C99368A4317J65941f7020b8702G5774J3039J40771J184p2378
13146A58390J4857L0875r8251f5590A28064b28858D24363A39512N4201J36541
13136C30254H3380E875L10753A03565P9157m9658o897K20123E3532A4742b23214
13124A79157d6071B7170J4634R2210L83753A30286L45011F3652c0246C17413q0331
13113B37082n7684K77434B3814b11384C37232j32665q9745O0164b7362j3810k62044
$$ y = [-124428, 552155, -136223, 85491, 33086, 331271, 186029, -278937, 249985, -42986, 239599, -52712, 330193, 13331, 158771, 36764, 93801, 552577, -252625, 226686, 159679, 191767, 230295, 299302, 228027, 152462, 259808, 304951, 407515, 129268, 81763, -25144, 92732, 326233, -7748, 399368, 14317, 180258, -67020, -28702, 75774, 88813, 229584, 230768, 158390, 173247, 204122, 105871, -65590, 128064, -228858, 424363, 139512, 193713, 330254, 83380, 5875, 316628, 103565, 182722, 133064, 126167, 346290, 53532, 14742, -223214, 179157, -46071, 27170, 41804, 134014, 517767, 130286, 475297, 63652, -30246, 317413, 237082, 179398, 456832, 23814, -211384, 337232, 204567, 114822, 174986, -27362, -41172, -303216]
13102c03216B63047h8306A22752K52615a31640B17903I007a40842A65130m8524
13092A16606m2852a13635d1621F3266b20581l785C223N7656J36170g4157J2391
13081f1766B58739p1606G8633L0694O0897R2624J59743j99448i0908j47019b4828
13069h0205A95254H7781i4647A09091J0248a06757A49556K53584R419j44570n3939
13058B14050m8845c1093k3449F9593J19483g665A86617a37362o444B63525B6460
13046B62965j04482o297E2223e5252I6833L1155c1469A33851b29895F9358a88065
13034D0440K5257m905a64555B60886I1164G560J94029p3241J54437K80022A00875
13022C18750r4101C6213j7449K1816I676a64020C27025d4802j29040H0201a22113
$$ y = [-303216, 263047, -88306, 122752, 375367, -131640, 217903, 9007, -140842, 165130, 116606, 73754, -113635, -41621, 63266, -220581, -224366, 3223, 60879, 197049, -74157, -61766, 258739, 187133, 78633, 109327, 170224, 262848, 422591, 223143, -90908, -237927, -24828, -80205, 195254, 87781, -94647, 109091, 119339, -106757, 149556, 403140, 412559, 267989, 214050, 165205, -31093, -54542, 69593, 189076, -7665, 186617, -137362, -143806, 263525, 26460, 262965, 158483, 152186, 52223, -55252, 96833, 127988, -31469, 133851, -229895, 69358, -188065, 40440, 65697, 60792, -164555, 260886, 91164, 7560, 201589, 128348, 282785, 562807, 100875, 318750, 224649, 36213, 18764, 40580, 9676, -164020, 327025, -44802, -173842, 80201, -122113]
13010A74827m5693a2411D4272J91350a8007C78837B0938b572n3458A86176a94196
12998A48368o6613K24975a24935B05951b04490B48043a38629G5284a07651B60499
12987a27507C701J42359c10358C19372a56269a4114k0338B38345e8685H7059d865
12975B69347j1652B9574k991Q6052h7542D7254J12655a03460B07020J17318C5671
12963C00212a87957A93043l5434E1278h1149D536a22870o0256l2151j0585C11771
12951h2191G4653Q7844i5209C6061b01656H2140a56817C19825A32975E0930P0950
12940A21880M237a40659H5742J16978b08054H9328b63136A78820J27920a4826
12929B43198J8770M0189N6959B3242N7706K8982a1818j87701c1214A46907M7308
$$ y = [174827, 129134, -12411, 44272, 235622, -18007, 378837, 20938, -2572, -56030, 186176, -194196, 148368, 81755, 306730, -124935, 205951, -204490, 248043, -138629, 75284, -107651, 260499, -127507, 3701, 146060, -310358, 319372, -156269, -14114, -34452, 238345, -58685, 87059, -4865, 269347, 257695, 29574, 26583, 112635, -87542, 47254, 159909, -103460, 207020, 324338, 35671, 300212, -187957, 193043, 157609, 51278, -81149, 4536, -122870, -183126, -215277, -225862, 311771, -82191, 74653, 162497, -95209, 36061, -201656, 82140, -156817, 319825, 132975, 50930, 121880, 126117, -140659, 85742, 202720, -208054, 89328, -263136, 178820, 306740, -14826, 243198, 261968, 302157, 359116, 23242, 80948, 109930, -11818, -199519, -31214, 146907, 194215]
12918A94215P5915h701j59641a1139A38208f0722I6454J5199a02715A83308p7254
12907A06054B9883K59512A34538a29008c6273A80238N7239a37157K4463B67039
12896A77377P7447c3754j07213C5556J23396M5997c3823C07963j29536b41275
12885A97622g3570B23672b87694B8375R3613p933h5443A22895E2104b48248H7326
12873A15813K4275B1972M6680R4756a66233c8027k41767D11006i5851A90003a26877
12861e0854k61414A23968o0613J96293f4777A6344J34115a11908L9912A94410
12850F2193R2725k3186c6790A69027J88754G0020J76245b52821C16600b28548
12839D5532a33365B64947c8221G0270a21959A77642k4626L06275c09274J40898
$$ y = [194215, 270130, -8701, -168342, -11139, 138208, -60722, 96454, 111653, -102715, 183308, 106054, 29883, 289395, 134538, -129008, -36273, 180238, 237477, -137157, -112694, 267039, 177377, 254824, -33754, -140967, 35556, 158952, 204949, -33823, 307963, 178427, -241275, 197622, -73570, 223672, -287694, 28375, 121988, 114055, -85443, 122895, 52104, -248248, 87326, 115813, 140088, 21972, 68652, 163408, -166233, -38027, -279794, 411006, -95851, 190003, -126877, -50854, -312268, 123968, 63355, 259648, -64777, 16344, 150459, -111908, -71996, 194410, 62193, 154918, 131732, -36790, 169027, 357781, 70020, 246265, -252821, 316600, -228548, 45532, -133365, 264947, -38221, 70270, -121959, 177642, 153016, 459291, -309274, -168376]
12829a68376j1744n2142H564J271J29127P5011B2424a25459A78236C5291a30762
12817A8656J37325Q9355b22971a1460B90827b34416N4501B10977a63441p0315
12807b33756B21025m5580a11088A20729k175g9954E4665a09699A72976F2546J54122
12796B16668a34505G6087M7174a85604B13897b75609b5517A02416N0286B7592
12785a49265B7251b57675B48192a84062A75686G4747L0431c2207A92583b2838
12774C85226a46818J8729B70661o7618e9002J2324D77355e4915F8003a4885A80583
12762C57507A38013b83881A66497d4215j65567A03089j1920K4820a20405j50193
12752b70598D20901c4619A15177K0857b14562F9052a9787B29686A04671a1321
$$ y = [-168376, -180120, -232262, 8564, 9835, 138962, 213973, 22424, -125459, 178236, 35291, -130762, 18656, 155981, 245336, -222971, -11460, 290827, -234416, -179915, 210977, -163441, -233756, 221025, 175445, -111088, 120729, 118554, -79954, 54665, -109699, 172976, 62546, 216668, -134505, 76087, 123261, -185604, 213897, -275609, -25517, 102416, 152702, 27592, -149265, 27251, -257675, 248192, -184062, 175686, 74747, 105178, -32207, 192583, -22838, 385226, -146818, -128089, 270661, 203043, -59002, -46678, 477355, -54915, 68003, -14885, 180583, 357507, 138013, -283881, 166497, -44215, -209782, 103089, 91169, 115989, -120405, -270598, 420901, -34619, 115177, 136034, -214562, 69052, -19787, 229686, 104671, -11321]
12741D05296b16358D0307i1725B92155j27636a6305r2782F4116K66563a33889
12730G8373i8497a4630H3406q035O0890B4679K43245q6449j6210L02670h225G1371
12717A15585N09661A08474C2696g8506I2505K3338K65618G8638Q8497p5161a14054
12705B16911J43655A16177N5830F8405K8005K40420A20033q344g4663E6207a59184
12693A89873r893J97838p4723f9547k8888n5988B50303a65298E6781e1827E64166
12681b7087A98341e0788C18991E9933O5916A2350L10805C6921J66392J1339h4726
12669E18779H7761O2034F4960J54363b04760G43N10936A07994l9405P7429a5816
12657a17210B27540O9894j39290C0624J25818K16792j27089j9448A7545L11012
$$ y = [405296, -216358, 40307, -91725, 292155, 164519, -16305, -109087, 64116, 330679, -133889, 78373, -98497, -14630, 83406, 75371, 136261, 24679, 267924, 181475, 165265, 467935, -8225, 71371, 115585, 625246, 108474, 32696, -78506, 92505, 115843, 381461, 78638, 167135, 91974, -114054, 216911, 360566, 116177, 172007, 68405, 96410, 336830, 120033, 111689, -74663, 56207, -159184, 189873, 179980, 377818, 303095, -69547, -98435, -154423, 250303, -165298, 56781, -51827, 564166, -27087, 198341, -50788, 318991, 59933, 125849, 12350, 323155, 36921, 203313, 214652, -84726, 518779, 87761, 149795, 64960, 219323, -204760, 743, 511679, 107994, 68589, 146018, -15816, -117210, 227540, 297434, 158144, 30624, 156442, 373234, 246145, 226697, 17545, 328557]
12647C28557j0517b56512N3981f7067q7055d8253K3748J0044H3607N3829L23036
12636D60472A57686d1547B20864C882L95388A00158n392m6283K56335k3443a12969
12624A45189P443Q0892b81392B56306q4190o9279J12795E4751J41212j8213C9724
12612D2369P9037K20887c2729A68401a99485A10323f3066j4527A07320N5163d1418
12600B80480A22304A3464K1277M9259K59110b04254B04571H4598J72660n6284
12590B00974r7927b84979b4378C03653b56837F9638L84657a61190A05774d06436
12579d7701A4266J90028J27378A10652a13021l1679m5737G3735R5308F9890a1508
12567B11998b19956l1358E5514e8137r77B02352q8245e8592l6476B49460a57625
$$ y = [328557, 318040, -256512, -202531, -67067, -154122, -48253, -24505, -14461, 83607, 137436, 460472, 157686, -41547, 220864, 3882, 399270, 100158, 94766, 48483, 304818, 281375, -112969, 145189, 152632, 233524, -281392, 256306, 172116, 102837, 215632, 54751, 195963, 177750, 39724, 42369, 121406, 342293, -32729, 168401, -199485, 110323, -63066, -77593, 107320, 162483, -41418, 280480, 122304, 13464, 34741, 84000, 343110, -204254, 204571, 84598, 257258, 200974, 103047, -284979, -24378, 303653, -256837, 69638, 454295, -161190, 105774, -406436, -47701, 14266, 204294, 331672, 110652, -113021, -144700, -190437, 73735, 169043, 69890, -11508, 211998, -219956, -251314, 55514, -58137, -59114, 202352, 114107, -58592, -95068, 249460, -157625]
12555a72061A55118M8859n1670L3200g0195H2966B4841N998b13A19668O6511O1122
12543B47301b14117L5983D508J45586e4136p0731A45942G500J10133e7989C99327
12531A70173B4417J37681i5837A27997L17453k00306F3469d40984a23491e5036
12520B7921h124k50650Q9020C35351C1110J12361k7777a08385A5269Q6055h7901
12508b5811B0604J32234i5000B01995d7227C2468K99054n9822r6665c00006A17956
12496a74302a9610L985A92325K2772E4631a65118I6595N7083p6608c678B09138
12484g2414F4511J50982a0636l9501f282k06849h8074L5717A41121n7293k6948
12473E6880P6578j9430k5673J5957b90180E5514J45656M3718a09791D6490H530
$$ y = [-172061, 155118, 203977, 152307, 185507, -70195, 82966, 24841, 30839, -213, 119668, 186179, 247301, -214117, -178134, 4508, 150094, -54136, -124867, 145942, 7500, 117633, -57989, 399327, 170173, 24417, 162098, -95837, 127997, 445450, 245144, 63469, -440984, -123491, -55036, 27921, -8124, -258774, -169754, 335351, 31110, 143471, 115694, -108385, 15269, 101324, -87901, -25811, 20604, 152838, -95000, 201995, -47227, 32468, 331522, 271700, 175035, -300006, 117956, -174302, -19610, -15625, 192325, 215097, 54631, -165118, 96595, 153678, 77070, -3678, 209138, -72414, 64511, 215493, -10636, -50137, -6282, -213131, -88074, -52357, 141121, 83828, 56880, 133458, 114028, 88355, 104312, -290180, 55514, 201170, 244888, -109791, 46490, 8530]
12461b19764P7471A87213k1432J30092F8219J94316a56037Q381i004j32970K8406
12450a13568A14645a06589L2627B69850h4352f028A12435A6083L73030A8024b65855
12438a25146b5938A18161a61420d3336E36369a72540E5275k7219O9891g9604q0126
12427a59730A35696J99300n3364C4767i631j76963C010a33603K4932B50259j3419
12416B36840d646C72151i1244G0941g8536p7275B72259a5371D849L75557I8137
12404B5822a31732c8203n916B38724F6115a92032k9945B28162H2611C6280P9020
12393A15300c3567A66561A6324a8136N749B44540b91935D30730H7560j8866J66363
12382B35057b53339A58390b33266j161A3088Q3732a0369j45286c9760J1989i754
$$ y = [-219764, -142293, 187213, 165781, 295873, 68219, 262535, -156037, -147656, -9004, -141974, -113568, 114645, -106589, -73962, 269850, -84352, -6028, 112435, 16083, 389113, 18024, -265855, -125146, -25938, 118161, -161420, -43336, 536369, -172540, 55275, 28056, 97947, -79604, -159730, 135696, 334996, 281632, 34767, -9631, -186594, 3010, -133603, -108671, 250259, 236840, -4646, 372151, -91244, 70941, -78536, -155811, 272259, -15371, 4849, 380406, 98137, 25822, -131732, -38203, -44119, 238724, 66115, -192032, -221977, 228162, 82611, 36280, 115300, -33567, 166561, 16324, -18136, -12387, 244540, -291935, 430730, 87560, 68694, 235057, -253339, 158390, -233266, -234427, 13088, 96820, -10369, -155655, -39760, -27771, -9754]
12370F5640h4268F2098B2517E978e3803A83656b37789B20496L9765m3626C2846
12358C3762J24794E0918R7678J35218A03168f4438B27566H5218R92J51451K1542
12347B59203D5341b7884q5050C24109f3673A69208F3056f2662I2335d1513K835
12336c8678j43000d8710k01596B35833i9459A99569O3945h2589a6653q7299C30956
12324G6302L9230E0148c13358A17421a69510a9007F3183a35711j09005B0591a322
12312a01899M3554A212J89282D0911c07549c1884C03354e5299A79202a03270A4180
12300b1632H2913b67620A72290c6683k01586Q614b9477j28819L3507G7728N7138
12289A34866k8817B0723L70225F8942L30275B5300f256p6243A31298l9688N267
$$ y = [65640, -84268, 62098, 22517, 5978, -53803, 183656, -237789, 220496, 260261, 216635, 32846, 33762, 158556, 50918, 148596, 283814, 103168, -64438, 227566, 85218, 86210, 237661, 259203, 45341, -27884, -112934, 324109, -63673, 169208, 63056, -62662, 92335, -41513, -38678, -181678, -48710, -250306, 235833, -99459, 199569, 263514, -82589, -16653, -103952, 330956, 76302, 115532, 50148, -313358, 117421, -169510, -19007, 63183, -135711, -244716, 20591, -1322, -101899, -58345, 1212, 190494, 40911, -307549, -31884, 303354, -55299, 179202, -103270, 14180, -21632, 82913, -267620, 172290, -36683, -238269, -229655, -29477, -158296, -124789, 77728, 134866, 106049, 20723, 390948, 68942, 399217, 25300, -6256, -82499, 131298, 91610, 96877]
12278I6877B1997O7266C4656a12946A67988K84126A87074N6271l238B3113J17624
12267A40737b03242E0634Q0483J41138f3920H0575d8902B73833e3072H0898l1448
12256D9450c0602H7737a20937j10229P4276C0094L80677D5608J0132h4020a0343
12244D34724j63370B4599a02050A29739b71336C4762K00798L390r8721O2501j6958
12233A85772o6583j4259B0912a4122m9837A01518K12746J9842j38543c0139D19290
12221D02638B6793P2153g6498B33865L3513o7499e1213C71769M4937a12998A44620
12209a48208N6311A15910b0815H4218J88384A32999J73903G1480l639R2232K33724
12198C93797j05435G0914M71941c8538I7940J82107k2640l4546a8624j39353A24138
$$ y = [96877, 21997, 89263, 34656, -112946, 167988, 452114, 187074, 243345, 240107, 23113, 140737, -203242, 50634, 131117, 272255, -63920, 80575, -48902, 273833, -53072, 80898, 49450, -30602, 87737, -120937, -231166, -156890, 30094, 410771, 45608, 55740, -84020, -10343, 434724, 271354, 24599, -102050, 129739, -271336, 34762, 235560, 238950, 140229, 202730, 185772, 119189, 104930, 20912, -14122, -63959, 101518, 314264, 334106, 195563, -30139, 419290, 402638, 26793, 98946, -76498, 233865, 267378, 199879, -51213, 371769, 416706, -112998, 144620, -148208, -91897, 115910, -20815, 84218, 272602, 132999, 306902, 71480, 67841, 160073, 393797, 288362, 70914, 542855, -38538, 97940, 280047, 257407, 222861, -18624, -157977, 124138]
12186B26624M4371J08159k460B9634L44138G1153d38D5388J10517J73764n4504
12175B75165N0083H7397K36509F9007h1741A25797g2795H1890D0694K47608A21202
12163I6014M1429J14848N5679a02788D0898K63074G6842J51857a30126E22154
12152B43212G4765L5127c65680B4475d17881a0970q5711H8317f8301B49030O9779
12141C18809d1326A3270J83303O0219f5072j20175F2694a41093B73011D3538K64995
12130C08533I6226H61d9660l6328K5291O869l872j31802k6872d7556m1845l5979
12118a25380A51257k7341l9440A6703g3959K5422E8466c0287A03848J9785a83481
12106g1298q5179C46047r9720c62376g963D8479p191c31245I5319Q854m8502K32141
$$ y = [226624, 270995, 379154, 376694, 29634, 373772, 71153, -438, 45388, 155905, 329669, 275165, 325248, 87397, 323906, 69007, -81741, 125797, -72795, 81890, 40694, 288302, 121202, 96014, 137443, 252291, 307970, -102788, 40898, 303972, 76842, 228699, -130126, 522154, 243212, 74765, 109892, -365680, 24475, -417881, -10970, -96681, 88317, -68301, 249030, 318809, -41326, 13270, 196573, 256792, -65072, -185247, 62694, -141093, 273011, 43538, 308533, 96226, 861, -49660, -85988, -60697, -53828, -57700, -189502, -216374, -47556, -89401, -125380, 151257, 123916, 84476, 16703, -73959, -48537, 58466, -30287, 103848, 123633, -183481, -71298, -156477, 346047, 246327, -362376, -7963, 48479, 41288, -331245, 95319, 104173, 55671, 287812]
12094B87812a29508I975J3917a18189A20518b72008C58234A19608J95445i4160
12083b05568C32030A32776i045j7443E34907P24327R72648j003337B96539a57785
12072F5477L27379i5418B45921a96863Q8818j7392E896L6076J29811e8004B18415
12060A84574G9401b01295A09447L3768n0540B2256J6419J8048K833P3332n4674
12049G8214Q7568a04554J4095o3826H1112J2366a431B42421D2867J94792a67376
12037b73502d5628I3502a29186m9768B67921a19492E7150a42201f1718C4978R8601
12026A33579a33970A4274f0204b7737A6808a63589A70669O6099A2872J79736i1763
12014a29450A59102m8949a53217e8304B20025a2282k91621F0300a78123A10197
$$ y = [287812, -129508, 9975, 23892, -118189, 120518, -272008, 358234, 119608, 315053, -94160, -205568, 332030, 132776, -9045, -26488, 534907, 1259234, 2231882, 1228545, 296539, -157785, 65477, 392856, -95418, 245921, -196863, -108045, -125437, 5896, 41972, 171783, -58004, 218415, 184574, 79401, -201295, 109447, 143215, 92675, 22256, 38675, 56723, 59556, 132888, 78214, 165782, -104554, -90459, -154285, 81112, 93478, -1431, 242421, 42867, 237659, -167376, -273502, -45628, 93502, -129186, -178954, 267921, -119492, 57150, -142201, -61718, 34978, 133579, -133970, 14274, -60204, -27737, 16808, -163589, 170669, 236768, 12872, 192608, -91763, -129450, 159102, 110153, -153217, -58304, 220025, -12282, -303903, 60300, -178123, 110197]
12003A79253p1143d7610B3641a76002P8080r0616b9442C89581A80528c37870a28370
11991b26313j04541F0675b1120B18840C457b09804G5110d6776F2354a26860A18973
11979b1950C987L43506E0449j6775c0137r0727P460E0957R0142e1702A76543b1205
11966e3306A08445h0750j43575G1003f2190A25769D0901a34223L0053B76890c54537
11954F5675a06548B17791g5747K6245B82907a84418B77818j30541C7066h4316
11943a00660N0019r1726c5000C62821b51221A41894a95962l405H4423L0036b29692
11931C8372L3047c87516I0093j6365K28471I5891K8789E1510a49499M2011G6539
11919b00673O1541B21121b7990C81778a00112C00682r6378i1253A5748N2941b46877
$$ y = [179253, 108110, -47610, 23641, -176002, -97922, -188538, -29442, 389581, 180528, -337870, -128370, -226313, -330854, 60675, -21120, 218840, 3457, -209804, 75110, -46776, 62354, -126860, 118973, -21950, 3987, 347493, 50449, 33674, -30137, -120864, -113404, 50957, 141099, -51702, 176543, -21205, -53306, 108445, -80750, -224325, 71003, -62190, 125769, 40901, -134223, -104170, 276890, -354537, 65675, -106548, 217791, -75747, -49502, 282907, -184418, 277818, 147277, 37066, -84316, -100660, -50641, -142367, -35000, 362821, -251221, 141894, -195962, -199367, 84423, 114459, -229692, 38372, 71419, -387516, 90093, 73728, 302199, 95891, 124680, 51510, -149499, -107488, 76539, -200673, -139132, 221121, -27990, 381778, -100112, 300682, 204304, -91253, 15748, 68689, -246877]
11907a74328j91552H3117B5868J71931J0355a98435r4172J21318O1549n3354a3725
11895B91856I8682K95466h3982B8376J85015a31086j8841f9877l15567d0446j17445
11884a57891k029k6726l8098B8796F279J46991b34025e9102B392M69a21354A74808
11871B80798d3512E5074J41227G1347e4565A5840P4093h8680j32483E8350j5274
11860D3076J77578a37602f2067D42102B8973a51284j80931d9664A69371l3052
11850A36319b65363a5843A94252a11794k19144i9817k4670a7911B1838K12750
11840B34588a51683B84738A31891e6221G388b65177e5413N852m4308c041k35900
11829b38941A31638C7430L1858B1918O5619C237b5268G5540A7086o701c45387
$$ y = [-174328, -365880, 83117, 25868, 197799, 208154, -198435, -292607, -171289, -109740, -163094, -13725, 291856, 98682, 394148, -83982, 28376, 213391, -131086, -149927, -69877, -385444, -40446, -157891, -159920, -186646, -224744, 28796, 6279, 153270, -234025, -59102, 2392, 2861, -121354, 174808, 280798, -43512, 55074, 196301, 71347, -54565, 15840, 89933, -88680, -221163, 58350, 43076, 220654, -137602, -62067, 442102, 28973, -151284, -332215, -49664, 169371, 136319, -265363, -15843, 194252, -111794, -330938, -99817, -124487, -17911, 21838, 234588, -151683, 284738, 131891, -56221, 7388, -265177, -55413, -49561, -93869, -3041, -238941, 131638, 37430, 69288, 21918, 87537, 3237, -25268, 75540, 17086, 10385, -345387]
11817H5047b49898A81289j3980E9798j6419M7364b5446j47251C9339c5256n2649
11806h7905j82295D952P9525K07181b74853B31299G6113a06861c4078D3211c28269
11794d1534A98142a1048B02477d2293k52604J30499C0884b44367P7555b8885k49987
11783b78872B03998a27680I1035j4337L38353f8904C0107a0682k20116D0295R9350
11772A39645n7079A9281i012G5624N9989b26222Q9200A95601E1453K2065J6072
11761H9590m3565J96021J31980I6298b63007a25003M2286D31543g4239B20926
11750I7280J83323A8006a99645i0371B87998j02452C727J32246b46389L6055C56097
11738i4520G1596J03690a76544B89084a60151C404a46535n5275B49893K5023j21732
$$ y = [85047, -249898, 181289, 167309, 59798, 43379, 90743, -25446, -172697, 39339, -35256, -87905, -270200, 4952, 84477, 291658, -274853, 231299, 76113, -106861, -34078, 43211, -328269, -41534, 198142, -11048, 202477, -42293, -294897, -164398, 30884, -244367, -166812, -28885, -278872, 203998, -127680, 91035, 76698, 415051, -68904, 30107, -10682, -230798, 40295, 139645, 82566, 19281, -9012, 75624, 135613, -226222, -137022, 195601, 51453, 73518, 89590, 46025, 242046, 374026, 96298, -263007, -125003, -82717, 431543, -74239, 220926, 97280, 280603, 18006, -199645, -90371, 287998, 185546, 3727, 135973, -246389, -210334, 356097, -94520, 71596, 175286, -176544, 289084, -160151, 3404, -146535, -201810, 249893, 274916, 153184]
11727A53184G4717J08961E9144c1755J0578M757e107F3112a78712O0195b9051
11715A15602a08040l2333B84441H8805a46587A08805j4222I393h7850A5640J38101
11704A53741D6997J09112c69585a54607N1215A86009g4384C5227h1428B40566
11693F8912h58j99628M6023P0160M2057B99369g1952K9714A68753P2130a43639
11681C4604J06431a83126j76756c4480B86490i2773L9311D9671J59194c91689
11670h4908A09806J23221g3658A29564g0972n1752j6793h223B83927a71279D92012
11658B05791J55835a23653A64503d20321C06172a0128A17187b3941B04624O0337
11648B64961a00116B97123A7911J42700M2009b01736i1752A81742e5140E2916
$$ y = [153184, 74717, 183678, 59144, -31755, -21177, -16420, -5107, 63112, -178712, -118517, -29051, 115602, -108040, -140373, 284441, 88805, -146587, 108805, 94583, 9393, -87850, 15640, 153741, 46997, 156109, -369585, -154607, -103392, 186009, -74384, 35227, -81428, 240566, 68912, -858, -200486, -154463, -84303, -42246, 299369, -71952, -42238, 168753, 240883, -143639, 34604, 141035, -183126, -359882, -34480, 286490, -92773, -53462, 49671, 208865, -391689, -84908, 109806, 233027, -73658, 129564, -70972, -122724, -139517, -8223, 283927, -171279, 492012, 205791, 361626, -123653, 164503, -420321, 306172, -10128, 117187, -23941, 204624, 264961, -100116, 297123, 17911, 160611, 202620, -201736, -91752, 181742, -55140, 52916]
11637A28938a5204C9666a6136k12494C6320f1274k14781H2062J49415G4050J80164
11626B54214n5154i4299A22917g8494j0621K9208D40008D8453k3460b08161f7452
11614b41623D4899a59487F110b40337j80150a8236A92831r1780L16870A55625
11603F3865L17193H9391J84881D758L9568J42730a634G4438R701R538b7497I0233
11590B11603O3992j01295D5431g3533E1122J62689r2613D7841L20564a4240C49544
11578A74411a67279A55673J09744c486l79770b5542B73698E7053K35308C4238
11567a09708B10887d01559A20515g0894j2710B3773m91L13877d2972A84244F3452
11555A92231c05971I2313b57192B04468C5192a48300I3564a92087I9107K4706
$$ y = [128938, -15204, 39666, -16136, -228630, 36320, -61274, -276055, 82062, 231477, 74050, 254214, 199060, -94299, 122917, -78494, -89115, -59907, 440008, 48453, 24993, -208161, -67452, -241623, 44899, -159487, 6110, -240337, -420487, -18236, 192831, 101051, 417921, 155625, 63865, 381058, 89391, 274272, 4758, 44326, 187056, -1634, 74438, 84139, 93677, -27497, 90233, 211603, 275595, 174300, 45431, -73533, 51122, 213811, 121198, 47841, 368405, -14240, 349544, 174411, -167279, 155673, 265417, -3486, -383256, -25542, 273698, 57053, 292361, 34238, -109708, 210887, -401559, 120515, -70894, -83604, 23773, 23282, 337159, -42972, 184244, 63452, 192231, -305971, 92313, -257192, 204468, 35192, -148300, 93564, -192087, 99107, 123813]
11545A23813L6676p5804K02178j34314m7198j1472N6241K4984n893J49906b01291
11533b39961O3643k8922C4384a79976B01183K673J34116A03914k9910L40831j24645
11522B90190F4873J9088B3786K15530G0253C615P6298i0303C99114A60369B6089
11510A35155b44318a03948C01333a38605A86120c23411F4267a2019j28938O4777
11500g6180D58614a61822C17561H5874j2691J10400q6709c37932f9483A12316
11489B45267a2892C5266K18359d8918C77921d2546g009I989L92286j47861I0922
11477C51125A3099L09516N140j38093k0329K03866A11482J81874J29753A8495
11466A9286L55350F8644q63N5569e0273A90368J34434j56410a18851D2367J2531
$$ y = [123813, 160489, 84685, 286863, 152549, 105351, 93879, 150120, 175104, 169211, 319117, -201291, -239961, -176318, -205240, 34384, -179976, 201183, 203856, 337972, 103914, 74004, 414835, 290190, 64873, 83961, 23786, 239316, 70253, 3615, 79913, -90303, 399114, 160369, 26089, 135155, -244318, -103948, 301333, -138605, 186120, -323411, 64267, -12019, -140957, -76180, 458614, -161822, 317561, 85874, 73183, 183583, 96874, -337932, -69483, 112316, 245267, -12892, 35266, 253625, -48918, 377921, -42546, -7009, 9989, 402275, 254414, 90922, 351125, 13099, 322615, 327755, 189662, 169333, 373199, 111482, 293356, 423109, 18495, 19286, 374636, 68644, 67781, 123350, -50273, 190368, 324802, 168392, -118851, 42367, 54898]
11455E4898K69692r0717a39461A03485a34634C9112N9502m795l9127K49162a93150
11443b01243B35482R3833A38821n3977A0485L14656A60766a13050A09920a37438
11432c39628C4756L6808A6690a26379F1070K57860b20323D5781D207L39679c64354
11420E7355N6873J4387P270b7516k83998f0389l10898J47629A27707l3363b01129
11408g4562j0447G249a9951o6503c465A91479c1526B26275b1753B48011D2860
11396B83431A07757a18155J4405I4354d5880a6788C37283f0236j233o8646k83306
11385d13421f7006j82157F6571J44476d53673A3211c9388q0368B84010q7736E8031
11373B11926a302p027A10981a39763j9880A12940a66388Q2792L5163J7923j79895
$$ y = [54898, 324590, 233873, -139461, 103485, -134634, 39112, 98614, 93819, 54692, 303854, -193150, -201243, 235482, 329315, 138821, 84844, 10485, 325141, 160766, -113050, 109920, -137438, -339628, 34756, 71564, 16690, -126379, 61070, 318930, -220323, 45781, 4207, 343886, -364354, 57355, 114228, 128615, 135885, -27516, -311514, -60389, -371287, -223658, 127707, 94344, -201129, -74562, -85009, 7249, -19951, -86454, -3465, 191479, -31526, 226275, -21753, 248011, 42860, 283431, 107757, -118155, -103750, 94354, -45880, -16788, 337283, -60236, -61469, -130115, -413421, -67006, -249163, 66571, 211047, -453673, 13211, -39388, -119756, 284010, 196274, 58031, 211926, -1302, -8329, 110981, -139763, -159643, 112940, -166388, -83596, -48433, -30510, -210405]
11362b10405E4745J28583a67942A56323l7838i9753i528j52285b4619A11408G995
11350a23376B67713c43917f4703b7397k56658a3119A44411a96186K9273A97799
11339e6093j8740m4901j72692J13532O695e7786j7667A3372o359c5475B05832
11327i3416L240A45072G0280g6484l4223E7021b27768G9061O6943h9563B10253
11315a77271I1818f3161A10175c8999I6133C6974f28923b32570C22013j45941
11305A76072K6840r5772k3170j735c12070j4696e1144C4341e1231r3977a8962
11293b85948F9238J0250C6218g026E3230b34883n5579C884b06030A94715B3610
11281a24645A15174e5814k28175A03469b29976P8141A3065J18754a88247B1673
$$ y = [-210405, 54745, 183328, -167942, 156323, 118485, -99753, -9528, -161813, -24619, 111408, 7995, -123376, 267713, -343917, -64703, -27397, -284055, -13119, 144411, -196186, -166913, 197799, -56093, -74833, -119734, -292426, -178894, -172199, -57786, -75453, 13372, 7013, -35475, 205832, -93416, -90176, 145072, 70280, -76484, -110707, 57021, -227768, 79061, 146004, -89563, 210253, -177271, 91818, -63161, 110175, -38999, 96133, 36974, -628923, -232570, 322013, 176072, 202912, 107140, 83970, 82235, -312070, -326766, -51144, 34341, -51231, -145208, -18962, -285948, 69238, 79488, 36218, -7026, 53230, -234883, -290462, 3884, -206030, 194715, 23610, -124645, 115174, -55814, -283989, 103469, -229976, -151835, 13065, 131819, -188247, 21673]
11270a42196B54415R9344d0694a227m0017H899a1538j21776F788J53276r631a17171
11257b4058l9388C3288b65379B23801i1287G6038a73763l359C8089h9336I022
11245b16792q6575k7650Q5531B01368m9427i2001j2212b1131j35894g159j89647
11234a96806B77806A03199b47428f8946A6465K6200J66331I974L7672J90887r8045
11223A40488a24957H761a05125B77330c2211A5728J17605b53221R4478k0911f7518
11211b7992C7423J00219a20989P798A36803d19369J63536a4034j29729j55536
11201b99299g2909I6811b22014B56134f3625A59034c71537B68803l9248d3621
11190H1700N0180c2475m7022k34884G8936C7219a85445r7683A4534d8407o4402
$$ y = [-142196, 254415, 353759, -40694, -1227, -41244, 8899, -11538, -133314, 6788, 160064, 150433, -117171, -24058, -63446, 33288, -265379, 223801, -91287, 76038, -173763, -177122, 38089, -89336, 9022, -216792, -303367, -331017, -245486, 201368, 151941, -92001, -104213, -21131, -157025, -7159, -196806, 277806, 103199, -247428, -68946, 16465, 42665, 208996, 9974, 47646, 238533, 140488, -124957, 8761, -105125, 277330, -32211, 15728, 133333, -253221, -158743, -179654, -67518, -27992, 37423, 137642, -120989, -113191, 136803, -419369, -255833, -14034, -143763, -299299, -72909, 96811, -222014, 256134, -63625, 159034, -371537, 268803, 229555, -43621, 81700, 131880, -32475, -79497, -314381, 78936, 37219, -185445, -283128, 14534, -48407, -112809]
11179a12809b5212o5459A33361i1619n2034l1485B9716p358a6998b581j37953
11168a40534j4790F6818L08390I4248B204J82257b1285A22477D0628J95335f822
11156B0757a32480A59053n3594F935Q8895b05795B14637J7010a9120j49608J0313
11145a58415I7489g0146G3342C5019a50393J0623e3963n1244l593B22356j11139
11134A11217O164B3902N4248A0778L9955K34604c0151B11243M4638b8408A56993
11122A27147e2758B71805B6741N5914N9232a91640r2770A51884A3887a37822B63942
11110B55147A5240K18337b17243R6841E8414K63992a44130A85369M0199H5843
11099B57864J02579K0454F325b4595B40639J84293b7567a0577C06356B8063L06957
$$ y = [-112809, -25212, -90671, 133361, -91619, -143653, -175138, 29716, 22358, -16998, -2581, -140534, -155324, 66818, 375208, 94248, 2204, 184461, -21285, 122477, 40628, 235963, -6822, 20757, -132480, 159053, 105459, 6935, 95830, -205795, 214637, 231647, -19120, -168728, -158415, 97489, -70146, 73342, 35019, -150393, -139770, -53963, -105207, -108800, 222356, 111217, 117381, 23902, 78150, 10778, 50733, 285337, -30151, 211243, 255881, -28408, 156993, 127147, -52758, 271805, 26741, 82655, 141887, -191640, -284410, 151884, 13887, -137822, 263942, 255147, 15240, 233577, -217243, -120402, 58414, 322406, -144130, 185369, 225568, 85843, 257864, 360443, 380897, 6325, -24595, 240639, 424932, -27567, -10577, 306356, 28063, 335020]
11088C35020B5699J41331a10776H2823K37425O0269N9117d6967A54895J96558
11078C51453o289E6238E555K29980J80399I3355K75442j20606J4981q2478L05731
11067D86425j79241M9055j01707J48902K92158C32123G9010P29576A61195M88366
11057F49561j00155J43692L4247J81788k89560L33764k72600J39758D01602K85561
11047F87163Q2123M10416m04609k07247J05859j4853l2647J86439k4391J98783
11037I87036l82509j22201l7634K24478k71256l1210J46984Q2976k7509k7451
11027E41704L04065o5622L4239J1868k06986j9171J26723p3183P8816n1930L43
11016F80866M9505j36712L01184k61258o8530n775k486N31392k71262j74689q3875
$$ y = [335020, 25699, 167030, -110776, 82823, 320248, 380517, 439634, -46967, 154895, 351453, 345164, 56238, 5555, 235535, 415934, 93355, 368797, 248191, 263172, 180694, 486425, 307184, 356239, 254532, 403434, 695592, 332123, 79010, 808586, 161195, 649561, 549406, 693098, 727345, 909133, 619573, 953337, 680737, 820495, 401602, 687163, 769286, 1179702, 775093, 567846, 673705, 658852, 626205, 812644, 788253, 987036, 604527, 482326, 444692, 669170, 397914, 366704, 513688, 596664, 569155, 541704, 845769, 780147, 814386, 826254, 619268, 600097, 726820, 653637, 732453, 680523, 680866, 730371, 593659, 894843, 633585, 565055, 559280, 556794, 1088186, 816924, 642235, 558360]
11005E58360N6828j38662L96029j23425k65295K90500k01053J26324o9445J03857
10995G34018R2369K52410m53948Q12J96945q3776O9099j2865M2428J45429m8410
10984I34511K86261M413M6700j33314L13978p2130P4625L03463K69129J75705
10974B203341L80439L22980L22353j16704j76549J87463n27827l51107j01389
10965B143000j5280l96272m25873J74962J17052K05537r8938J64509q4526j1738
10955A772433j08837Q3328m26453m64294j78811k60138J63825m7404N29820D12246
10944C90006L32642B96704l7082I3672K86430L7726A07363K0215L38618A55876
10933c12148C06934a03543j32515e1477j0518A18321C1767a47959B59830I0515
$$ y = [558360, 615188, 476526, 872555, 749130, 483835, 774335, 573282, 699606, 630161, 734018, 826387, 1078797, 624849, 625661, 822606, 738830, 807929, 795064, 837492, 982921, 934511, 1220772, 1225185, 1271885, 1138571, 1452549, 1380419, 1455044, 1758507, 2027636, 2203341, 2583780, 2906760, 3229113, 3112409, 2935860, 3123323, 2595496, 2244389, 2143000, 2127720, 1731448, 1305575, 1480537, 1597589, 1803126, 1704188, 1868697, 1784171, 1772433, 1663596, 1746924, 1320471, 856177, 677366, 417228, 581053, 533649, 1063469, 412246, 390006, 722648, 296704, 259622, 93672, 380102, 417828, 107363, 127578, 466196, 155876, -312148, 306934, -103543, -236058, -51477, -61995, 118321, 31767, -147959, 259830, 90515]
10922B32785a60728P5695A29054E3078J87704b09208d2203N552j3826B57724G3884
10910h1500a3845C5654a74323j78314d8788j69731i3548A02309a50805k49392
10900d00197I7497c00979J28262E0956a68370O0079k26873H2888a11912R318k3398
10889a25992O2924A30440d3107n3172B08412B4175J1103j3300K61408A16605K11028
10878C27633c73223a13145E3209J14783e1829F4951r53G579e6438q8963j23514
10867b68915g0061j28388A31968M8413o3353J3975n5514K1131l7993b2403C0167
10855D2251L07773a25736j0123C22614N2377a37650A2127c15258h256G0611B6886
10843a75313P0644A00789K02407h5277B59386f30492K28866H1050c8775j2599
$$ y = [232785, -160728, -85033, 129054, 53078, 240782, -209208, -42203, -36651, -50477, 257724, 73884, -81500, -13845, 35654, -174323, -352637, -48788, -218519, -93548, 102309, -150805, -400197, 97497, -300979, -172717, 50956, -168370, -108291, -335164, 82888, -111912, -102594, -125992, -63068, 130440, -43107, -96279, 208412, 24175, 35278, 21978, 283386, 116605, 327633, -373223, -113145, 53209, 167992, -51829, 64951, 63998, 7579, -56438, -145401, -268915, -70061, -198449, 131968, 180381, 117028, 131003, 75489, 96620, 58627, -22403, 30167, 42251, 350024, -125736, -135859, 322614, 374991, -137650, 12127, -315258, -8256, 70611, 26886, -175313, -104669, 100789, 303196, -85277, 259386, -630492, -401626, 81050, -38775, -51374]
10833e1374n5824A5439L32510A60155g3003k13935a09240I2830Q8118B1742K18394
10822B40136b58156d0042k65713D2134g4613A69597b20038M3993N8821I932J94352
10811B04284i9921L6741r4014m1383q539H5601b52980B24278l5152c9756j26167
10800a65923O950J5678B558R9889h5966A81587F667b20420P4351A42563g9059
10788a44184k28766f6685l09855A17671M27e7858A46150j6932a58267c7586j43292
10777a80878P3740K7512c7101B80147i0961j08273A80324a52434K2166j30564
10767b60832n4508e4072m4138L4297E6792b03904j08502k0681A38052d99913A13596
10755a25414G056K5100K11690J6994E3673a68665F8934L1249a12029A46295m8417
$$ y = [-51374, -107198, 15439, 347949, 160155, -73003, -286938, -109240, 92830, 180948, 21742, 240136, -258156, -40042, -305755, 42134, -74613, 169597, -220038, -176045, -117224, 9932, 204284, -99921, -63180, -157194, -198577, -207116, 85601, -252980, 224278, 189126, -39756, -165923, -158973, -143295, 2558, 102447, -85966, 181587, 6667, -220420, -146069, 142563, -79059, -144184, -372950, -66685, -376540, 117671, 118098, -57858, 146150, 129218, -158267, -37586, -180878, -107138, -79626, -37101, 280147, -90961, -199234, 180324, -152434, -130268, -260832, -315340, -54072, -98210, -63913, 56792, -203904, -312406, -333087, 138052, -499913, 113596, -125414, 7056, 32156, 243846, 260840, 53673, -168665, 68934, 100183, -112029, 146295, 97878]
10744I7878g5657D5977M0170B770e1541A9256J79594f0971A33833d18287A13863
10732E1145i7765H3114J31359h1334j66614A97636k7982c64297A55414o3669C4294
10720b3739j79281A34172i2057B74653g4835c0722E5170L3775R2839b26529A32129
10708A81614a44540D2271e439r4500D58e3966C03803a27449I7597B1797i8440
10696D029a50060A26545j9544j0282l7695a91541K2267I3038C1659J33093Q7677
10685B52429F5900a17365j7533j63914A00754C5084d52496F4138c7102j72982
10675b10084g890l0879r9207A23992c7254G5707J4413a49761e390A09204n160
10664A04044E824a11946j68681f1245j60576j1814A70415B0940J70112c3418A57102
$$ y = [97878, -75657, 45977, 86147, 2770, -51541, 19256, 198850, -60971, 133833, -418287, 113863, 51145, -97765, 83114, 214473, -81334, -247948, 197636, 169654, -364297, 155414, 91745, 34294, -23739, -203020, 134172, -92057, 274653, -74835, -30722, 55170, 88945, 181784, -226529, 132129, 181614, -144540, 42271, -5439, -99939, 458, -53966, 303803, -127449, 97597, 21797, -98440, 4029, -150060, 126545, 107001, 96719, 59024, -191541, -169274, 93038, 31659, 164752, 252429, 65900, -117365, -134898, -298812, 100754, 35084, -452496, 64138, -37102, -210084, -7890, -38769, -137976, 123992, -37254, 75707, 90120, -149761, -5390, 109204, 104044, 5824, -111946, -280627, -61245, -221821, -233635, 170415, 20940, 191052, -33418, 157102]
10652a83904A63747c7657E2184d1813C06057g8070C1011i6814k63781B00862g3357
10640f17201g3410o9669a7942A5490K36653f9641l06574f6220B2213J38299a36273
10628A85366f5375p5837j03388G2357e6967I013a51026b0723j43178G0655J5558
10617H6213d7250j29702g9298A2623a67299H5394g1611J0454k2469o8323A36448
10605E3758J19599l9815a05246c1447B1333a97473e8875F2564b6512I3195Q817
10594A02012R5478B6186L9344Q1570i0836F6502L5360c0009k86311a18792n5811
10583a74603n72841G6206a057j57542p5093B13516b08164B16141h5037F8746N7625
10572A26371K7909F9311a26735D4635f802k88006e0607A34951c76230B94495b704
$$ y = [-183904, 163747, -37657, 52184, -41813, 306057, -78070, 31011, -96814, -360595, 200862, -73357, -617201, -73410, -143079, -17942, 15490, 252143, -69641, -376215, -66220, 22213, 160512, -136273, 185366, -65375, -141212, -244600, 72357, -56967, 9013, -151026, -20723, -163901, 70655, 86213, -47250, -176952, -79298, 12623, -167299, 85394, -71611, -61157, -83626, -151949, 136448, 53758, 173357, 133542, -105246, -31447, 21333, -197473, -58875, 62564, -26512, 93195, 102012, 197490, 26186, 65530, 147100, -90836, 66502, 101862, -30009, -316320, -118792, -174603, -747444, 76206, -1057, -158599, -233692, 213516, -208164, 216141, -85037, 68746, 126371, 154280, 69311, -126735, 44635, -6802, -294808, -50607, 134951, -376230, 294495, -2704]
10560A48607F6301b2740A27753J79324p4617L5547c06415e440A80095A3806l117
10549A0689P46a08564c8464p0679G2109L84245f7679D8487b06127C92161C963
10537A17262l4506b44225b1041l65606a31941l12448H3869m837e6507l02104a14506
10525a31863b6190A21063L0190g2370j94633I0834c31432A47659l9289J110a07347
10513i5774B3320g5683J6719q3915h656l20706l6537A49956a71291C2961Q1821
10502A14782g8477q519m3394k06640a802B908b47314A92731D420c0199j40245
10491a70444l5682o7455i3850D3301c09814A45293a72754g3508B95393L4674Q8727
10480D18794Q9751J2090B53506A24687a01753A16906k17b41239A46957b60240
$$ y = [148607, 66301, -22740, 127753, 307077, 232460, 268007, -306415, -5440, 180095, 13806, 10689, 11435, -108564, -38464, -109143, 72109, 456354, -67679, 48487, -206127, 392161, 3963, 117262, 82756, -244225, -21041, -386647, -131941, -444389, 83869, 79032, -56507, -358611, -114506, -131863, -26190, 121063, 151253, -72370, -267003, 90834, -331432, 147659, 108370, 109480, -107347, -95774, 23320, -75683, -58964, -142879, -8656, -329362, -365899, 149956, -171291, 32961, 114782, -78477, -86996, -130390, -337030, -1802, 2908, -247314, 192731, 4420, -30199, -170444, -206126, -273581, -93850, 43301, -309814, 145293, -172754, -73508, 295393, 330067, 418794, 508545, 520635, 253506, 124687, -101753, 116906, 116689, -241239, 146957, -260240]
10469a14270A38221K33336o9045p9760i8816A04030c49011j2053a44942J6449
10459a28493c6757A09554i6548k58415a01178F8998h7834G4030d8369A29182b26440
10447C088L1084j4947a78682A02032e6500m20203A93808I206h0875A34542d0021
10435A93914a62651j414d8264k32791e9714G4284d969B75769O9153C0270b9230
10423a87865Q1682B30932H1075c57147a09302k0012C5657A2062h6269C15262i5666
10411F0699a96123B64315a92107F4865i0641A82565m1511a57041k02502a44680
10400a68775B77283d6234k29773c6058B3151K23311L0913a13114F9974L6102a69722
10388D0150K8999L210b24604D39552A46989o0770i2832G1970B5810M09711O8863
$$ y = [-114270, 138221, 371557, 302512, 222752, -98816, 104030, -349011, -361064, -144942, -128493, -36757, 109554, -96548, -354963, -101178, 68998, -87834, 74030, -48369, 129182, -226440, 3088, 34172, 19225, -178682, 102032, -56500, -476703, 193808, 9206, -80875, 134542, -40021, 193914, -162651, -164065, -48264, -281055, -59714, 74284, -4969, 275769, 344922, 30270, -29230, -187865, -106183, 230932, 81075, -357147, -109302, -129314, 35657, 12062, -86269, 315262, -95666, 60699, -196123, 264315, -192107, 64865, -90641, 182565, 141054, -157041, -359543, -144680, -168775, 277283, -46234, -276007, -36058, 23151, 246462, 277375, -113114, 69974, 106076, -169722, 40150, 69149, 72359, -224604, 439552, 146989, 86219, -92832, 71970, 25810, 435521, 504384]
10377E04384A07499J64941j22649J80805j30559Q1567J15921r2744j15440K78115
10367D67456K6659B31662K13019A74053J18467A07277K29667J74394q344k40792
10357B62202A02998K4132J96340J85988A28191M67604J71417j12936k48539D442
10346D94138B22362P685K91670p8083r1267I4756K50986B6651K39443h0302C36426
10334C08275A37716J15393n7586q8757B2250a10808A27809a78196B86049J21933
10324D07982B7250K3075b8615n8814B39070C7542b76445A12938h3325C900b8266
10312B25746b6588k33841C2985J32418Q53e9514j04722j16276C5280d5265B80454
10300a09593c3649j10779j92299J38131e3970D26649A89515d068A02404b45945
$$ y = [504384, 107499, 272440, 149791, 330596, 200037, 281604, 397525, 304781, 189341, 467456, 494115, 231662, 444681, 174053, 292520, 107277, 336944, 511338, 502994, 262202, 102998, 127130, 323470, 509458, 128191, 595795, 767212, 654276, 405737, 4442, 494138, 222362, 230047, 521717, 443634, 352367, 94756, 345742, 26651, 266094, -80302, 336426, 308275, 137716, 253109, 195523, 106766, 22250, -110808, 127809, -178196, 286049, 407982, 27250, 50325, -28615, -87429, 239070, 37542, -276445, 112938, -83325, 3900, -28266, 225746, -26588, -260429, 32985, 165403, 166256, -59514, -164236, -280512, 35280, -45265, 280454, -109593, -33649, -144428, -336727, -198596, -53970, 426649, 189515, -4068, 102404, -245945]
10289A08455b92730a00753j53638A15183p412n1047K14843e7543B11348c5638
10278a65632C64712H6930J3187K43927b15242B01421j9981p2905e4297A4361K09842
10267B24203h4778c945D67c3819B00327a82535h0920D44612n3744j34594O7194
10256C23468n2389M1651G206M757i76k3159A70496f4398A46405K01621n9812j24886
10244A63328b2976k33304G7942g5074A44333P080h2737a2775k40515e910l38489
10233c44399g2426K2634A37478b79982J28822j4744m7239p7898A42210a62589
10222b15367P40e9078A214c55760a21589k4296j2073l6422P5883P985j97986G0811
10209a26031j45818a10202A67453a23760k78640g8030A17705a68595G4615a9505
$$ y = [108455, -292730, -100753, -254391, 115183, 107771, 56724, 271567, -57543, 211348, -35638, -165632, 364712, 86930, 100117, 344044, -215242, 201421, 181440, 108535, -54297, 14361, 224203, -84778, -3945, 467, -33819, 200327, -182535, -80920, 444612, 390868, 256274, 323468, 271079, 312730, 7206, 11963, -976, -24135, 170496, -64398, 146405, 348026, 288214, 163328, -22976, -256280, 77942, -75074, 144333, 151413, -82737, -12775, -253290, -5910, -344399, -72426, -49792, 137478, -279982, -151160, -165904, -213143, -291041, 142210, -162589, -215367, -214627, -59078, 1214, -355760, -121589, -145885, -157958, -194380, -118497, -110512, -308498, 70811, -126031, -271849, -110202, 167453, -123760, -402400, -78030, 117705, -168595, 74615, -19505]
10198A55404M8184C1933h7123A47182j9565m0934b133m5023c845l7866M517k42538
10186b79732I1414J46132a37421C6858i9477c7371j92563a9087L570j46557K9673
10175a32401A37239A9591O4124h4915d1949k07879J08864K7625A68100A9243J47636
10164A66879e8575I1319b94853L4794G0377J42264K5419h2264o6305j53128P4798
10153b26899c5909A69688a32554j81260A28910f2537k97275a8597k92739a48216
10142b38113q3521A96529b08909R6245L7561A7602J73937G3136B3671a90044b9487
10130B36148c26087N1029k58399J58546b8509B532e8066l5630m3649j73271D5386
10118b4425H8417a06017C6016J91666b51377B4689a67087O2168j25065h9154c8560
$$ y = [155404, 203588, 31933, -87123, 147182, 127617, 86683, -2133, -47156, -3845, -41711, -37194, -279732, 91414, 237546, -137421, 36858, -99477, -37371, -229934, -19087, -15517, -162074, -132401, 137239, 19591, 83715, -84915, -41949, -249828, -140964, -113339, 168100, 19243, 166879, -58575, 91319, -294853, -260059, 70377, 212641, 238060, -82264, -148569, -301697, -226899, -35909, 169688, -132554, -313814, 128910, -62537, -359812, -18597, -311336, -148216, -238113, -321634, 196529, -208909, -112664, -75103, 17602, 191539, 73136, 23671, -190044, -29487, 236148, -326087, -275058, -533457, -374911, -28509, 2532, -58066, -93696, -137345, -310616, 45386, -24425, 88417, -106017, 36016, 227682, -251377, 24689, -167087, -104919, -229984, -89154, -38560]
10106a0087j7848A39901F3562R425d05496g1701A47808c35001B06408h3638A13825
10094A25897a29910B8976J1536a18057j86630a29846N5765l7146B84810a17710
10083b19003E9566a15155j39350n0175B1797M2628J42001c08816C45567A027a15093
10071i2241g816A07433L5266d074C1462a6121B3455a36545J1821C6940K38240
10060B75180j35953i5674j35066H2234q875Q2315J10160H7188j7765L5997a78460
10048A42605l0833a09604K1779j77440B6991L5821i5178B7251c8661H241a5633
10036A78157a32282m0762p607k15092A23177g4566A8397g0573j33305M3128f870
10024a03625B9919Q1212b46095A84293a14453M9384m25308A53968m6909a68537
$$ y = [-10087, -27935, 139901, 63562, 72987, -405496, -71701, 147808, -335001, 206408, -83638, 113825, 125897, -129910, 28976, 40512, -118057, -304687, -129846, -74081, -111227, 284810, -117710, -219003, 59566, -115155, -254505, -304680, 21797, 64425, 206426, -308816, 345567, 1027, -115093, -92241, -7816, 107433, 142699, -4074, 31462, -16121, 23455, -136545, -124724, 36940, 275180, 139227, -95674, -230740, 82234, 73359, 155674, 265834, 87188, 69423, 105420, -178460, 142605, 111772, -109604, -87825, -265265, 26991, 62812, -95178, 27251, -38661, 8241, -15633, 178157, -132282, -173044, -180651, -395743, 123177, -74566, 18397, -70573, -203878, -160750, -6870, -103625, 29919, 111131, -246095, 184293, -114453, -65069, -490377, 153968, 107059, -168537]
10013a67684B44325A10677a90106e0616k9679C06549l5545b53852J01171G6989
10002C9330b54109J04024J068P2401m15277K08457a22496B3516d4652j38358M5365
9991a37645e7699j57649Q0070G0998k4180j6979d63611a01234B12337D3734e79
9979b2975A37717b23012Q1900O954f076j17006M3446H8739j071e1584m3583F1747
9966E3527j1762j3340J80341q0113b28248J9959A8380K12076j8205a49704k94500
9955d44204A50616b63476B8589L14692a55763j07329c5361D8957a91406L3002
9945a58404r9256A08910l1420i0063b9254j51108B98224c12651a01365k8663d7304
9933a7674j58307e474o2447D7768J3121b43547e7805j73543A39088b74720a11342
$$ y = [-167684, 244325, 110677, -190106, -50616, -80295, 306549, 271004, -253852, -152681, 76989, 39330, -254109, -150085, -149017, -76616, -491893, -283436, -122496, 23516, -44652, -183010, -137645, -57699, -215348, -135278, 70998, 46818, 29839, -463611, -101234, 212337, 43734, -579, -22975, 137717, -223012, -141112, -134158, -6076, -123082, -79636, 88739, 87668, -51584, -95167, 61747, 53527, 41765, 28425, 208766, 128653, -228248, -208289, 18380, 230456, 212251, -149704, -444204, 150616, -263476, 28589, 343281, -155763, -263092, -35361, 48957, -191406, -158404, -257660, 108910, 77490, -90063, -29254, -180362, 298224, -312651, -101365, -130028, -47304, -17674, -175981, -5474, -67921, 47768, 60889, -243547, -57805, -231348, 139088, -274720, -111342]
9921c53540l0047G1927J83952h9462A34012f4901D44359b8983A88265F0446D660
9909b50468M5887A74464C5905g1708j11176l64663d0950a0850j88605d4702q2223
9898a26925B01367a81479k85373d781k93846f9806j27937l0202b9541D0787J97686
9887B38473b86890a30590L2174p7165A4527f9146J2946k37111d4619A44861b71352
9875H731g8205p0563m2232E329L5244a63945K7317b5143D8523a89853B17016a83485
9862E3290O7704h7609A7895g6141o8329O696A86577c48354R0943C1082a5892B6313
9849a88615h2229B10562a03128A03876a8873j77362b0784k4276j4959C7098J43990
9838A81088E3318i286A13764B3728a21123c2549k2700H1780b6631A9453K55014
$$ y = [-353540, -383587, 71927, 255879, -89462, 134012, -64901, 444359, -28983, 188265, 60446, 4660, -250468, -204581, 174464, 35905, -71708, -182884, -547547, -40950, -10850, -199455, -44702, -126925, 201367, -181479, -466852, -4781, -298627, -69806, -197743, -227945, -29541, 40787, 238473, -286890, -130590, -98416, -175581, 14527, -69146, -56200, -293311, -44619, 144861, -271352, 8731, -78205, -148768, -191000, 5329, 40573, -163945, -136628, -25143, 48523, -189853, 217016, -183485, 53290, 120994, -87609, 17895, -76141, -144470, -137774, 186577, -348354, -257411, 31082, -15892, 26313, -188615, -82229, 210562, -103128, 103876, -18873, -196235, -20784, -45060, -60019, 37098, 181088, 53318, -9286, 113764, 23728, -121123, -32549, -55249, 81780, -26631, 19453, 274467]
9827B74467b88902a3664A85835a57781a2399E9543a02471j58622J04438g0733
9816A82598p5469d6062m5789j6487A06453l1658b41006a14632j16971n5022A15134
9804C94968A91225c149j26678M6603j59964A45272a64457p4966N2784A92593J29253
9793C21846J2052a87529B66153j10628a47146O646p6407Q5482q414n1949h6827
9781i3215C2517J30447b35100a9052E4274R3156a57998d5921k73952a03616A65207
9769b48972L8333K6839a0260j17815p8992C7140a14169l34880a90854j3651G3817
9757F2808k774e8164h888n8119k50891G1d0426A4054J95718O8492a41205A23347
9744c50747E8453c9181l3310p9569P0616c8989j94050Q4405B952a73341b6270
$$ y = [274467, -288902, -13664, 185835, -157781, -12399, 59543, -102471, -261093, -156655, -70733, 182598, 107129, -46062, -91851, -108338, 106453, 74795, -241006, -114632, -231603, -286625, 115134, 394968, 191225, -3149, -129827, -83224, -243188, 145272, -164457, -239423, -186639, 192593, 321846, 333898, -187529, 266153, 155525, -147146, -140500, -216907, -131425, -139839, -191788, -86827, -93215, 32517, 162964, -235100, -19052, 54274, 147430, -157998, -45921, -319873, -103616, 165207, -248972, -210639, -183800, -10260, -128075, -207067, 37140, -114169, -449049, -190854, -204505, 73817, 62808, 60034, -58164, -8888, -67007, -317898, 71, -40426, 14054, 209772, 278264, -141205, 123347, -350747, 58453, -39181, -72491, -152060, -81444, -38989, -233039, -148634, 2952, -173341, -26270]
9732b30365k64q141b4908B3020b326C0557K94484b19147C1374l847e7718j87554
9720b45272O3670k18458B74393B4183c53177g4964m1022c640n00785b10303i4235
9708c62416E9948d14522a74085d4042k26477F1825a75971p4543N3804B03969g7314
9696b12257m162I2511g3270A09718b50280A6974i0586B71504a22351A45332B1177
9684f2437A10675a21289A14754d3363B35776a42444a4723o9283I4211i8569G0385
9672C4807b78452f8936B00457b17642j7819c991G9098O4909b56169A37451c03335
9660c6329b697k82993A67097g224r6508M9489m2808j41979B34096a69036e0255
9648h3579p5771d52k31483R3599d3158G2027n872a32281J5255A74486a96018a6090
$$ y = [-230365, -230629, -238770, -24908, 23020, -2326, 30557, 325041, -219147, 31374, 27527, -57718, -245272, -181602, -400060, 274393, 24183, -353177, -74964, -115986, -3640, -504425, -210303, -94235, -362416, 59948, -414522, -174085, -44042, -270519, 61825, -175971, -250514, -196710, 203969, -77314, -212257, -216419, 92511, -73270, 109718, -250280, 16974, -90586, 271504, -122351, 145332, 21177, -62437, 110675, -121289, 114754, -43363, 235776, -142444, -14723, -84006, 94211, -98569, 70385, 34807, -278452, -68936, 200457, -217642, -235461, -3991, 79098, 144007, -256169, 137451, -303335, -36329, -2697, -285690, 167097, -7224, -103732, -54243, -97051, -239030, 234096, -169036, -50255, -83579, -159350, -452, -231935, -138336, -43158, 72027, 66155, -132281, -117026, 174486, -196018, -16090]
9635a79765p3994c9321m10189a0296I9481b99995C1049J06845m9941a09034B34725
9623f0049k8231I5855i2768k03682J100f7741c633r9519r7927g5052j60684a14961
9610A86671a85162B21623a29903a2140B42722i4651r306m6846A70395H1351a87582
9598c8796q7623C4419F55a89676i3328A26474c7640B28843a02100A12053b8057
9586a05024G5456b20268M0524e9506R469j31671K0822A98909h6589F8118O0072
9575A28190d26258e1298A57275K2270D6087c08537A76289a89009A2661b20671
9564a32308m8536A56745b61441l5529j18401a26984n2700A8126i5333B04885O6749
9553B71634b0227l23993I1327a40404k69427F6712f526o02485J53005b14806P0762
$$ y = [-179765, -253759, -39321, -449510, -10296, 99481, -299995, 31049, 137894, 87953, -109034, 234725, -60049, -88280, 95855, -92768, -296450, -295350, -67741, -3633, -103152, -201079, -75052, -235736, -114961, 186671, -185162, 221623, -129903, -12140, 242722, -94651, -103957, -150803, 170395, 81351, -187582, -38796, -126419, 34419, 655, -189676, -93328, 126474, -37640, 228843, -102100, 112053, -28057, -105024, 75456, -220268, -179744, -59506, -50037, -181708, -160886, 198909, -86589, 68118, 128190, -426258, -51298, 157275, 179545, 46087, -308537, 176289, -189009, 12661, -220671, -132308, -180844, 156745, -261441, -296970, -415371, -126984, -179684, 18126, -95333, 204885, 271634, -20227, -344220, 91327, -140404, -409831, 66712, -6526, -609011, -456006, -214806, -144044]
9542a44044f3163k00545A68749L639c68346A85146A3970K846J74484b12622E0274
9530G395N4794J66831e7068C4883b86225E3159f3864m1326F966a33767G4178h2465
9517e4074b1309m24525A1788a98018B8322f5692k1481E5242b09093A58775R1749
9506B50524j23078b86338J4403f2127B4792j1640f7210q7515f1917G9665j9133
9495F0532g4689b1340C7295L7516g3934j78284G7226c23842j57292a98838A44384
9483A5400b70045i8940d2339C2651O9315i3190G2977f6875m31129a1281j74606
9472a85887e6004m7882j41802a10331G1853J7332g7454I1253a3350j2700E3900
9460B2816M5575b52611c9906A39473a56197O1863M0793C51151a19680d3347r4412
$$ y = [-144044, -63163, -263708, 168749, 172388, -368346, 185146, 13970, 16816, 191300, -212622, 50274, 7395, 62189, 229020, -57068, 34883, -286225, 53159, -63864, -105190, 6966, -133767, 74178, -82465, -54074, -21309, -445834, 11788, -198018, 28322, -65692, -87173, 55242, -209093, 158775, 250524, 127446, -286338, -271935, -62127, 24792, 13152, -67210, -154725, -61917, 79665, 60532, -74689, -21340, 37295, 74811, -73934, -252218, 77226, -323842, -481134, -198838, 144384, 15400, -270045, -98940, -42339, 32651, 101966, -93190, 72977, -66875, -498004, -11281, -185887, -56004, -103886, -245688, -110331, 71853, 89185, -77454, 91253, -13350, -26050, 53900, 22816, 68391, -252611, -39906, 139473, -156197, -94334, -53541, 351151, -119680, -43347, -137759]
9449a37759A93077b96087b3475o2826n87913a22624j91901i9195B28116M8729
9439B76845b10744e632l52637G4889k7885P8742g6051K5316k40442I2065N7904
9428A49969g8282A21425J01627f7733r5682A0692b3527k49690h6440j57427j07421
9417c51288h9872L7593B4436J03341a79866P5247A09661K38864B5820b9787j70941
9406b00728A287m29L67376A28010c8324o6011a8875j10020M5490B3152a10360
9394C13241F6099M5767c28824i2316A75586O1369c0556A00672c12017G3497k3204
9383E0293a35342H1646a52276q0987e4399G5962C0281a11719p4436K9474r6496
9372b53177j9332C4822b02485b0544l8944b4631k24403A1468M1119d2719j55934
$$ y = [-137759, 193077, -296087, -23475, -86301, -674214, -122624, -314525, -99195, 228116, 276845, -210744, -5632, -358269, 74889, 47004, 125746, -76051, -50735, -291177, 92065, 149969, -78282, 121425, 223052, -67733, -163415, 10692, -23527, -273217, -86440, -243867, -351288, -89872, -52279, 24436, 127777, -179866, -104619, 109661, 348525, 25820, -29787, -200728, 1287, 858, 368234, 128010, -38324, -104335, -18875, -128895, -83405, 23152, -110360, 313241, 66099, 111866, -328824, -92316, 175586, 236955, -30556, 100672, -312017, 73497, 50293, -135342, 81646, -152276, -233263, -54399, 75962, 30281, -111719, -186155, -156681, -253177, -272509, 34822, -202485, -20544, -59488, -24631, -249034, 11468, 52587, -42719, -198653]
9361a98653B7375O4140b369r3833k46506A99550a51255b0365j60415J345j5198
9350a94633p6568J04686M7010p7847J5773F2316J01969g2368K3000n4510J6919
9339h6959k26959A17834e5948F8574a41773J6954A8798a89358j81333N8192c6074
9327c23785a35663b338n5976C0953J37400C1487a89201A58926a93647H4541J0953
9316I5494b12516c2316j92358j74368a34775B0406a22163A36096i6490k55344
9306c51834Q8503h5489j35626L3614c27j50015n3046R1725D2998A8434a32386
9294b30933C41380a64555A67329B8965h0600I6611C4353J30811c78233B91848
9283A08519a02737C9425h9463A3936a55563E592K08241k9709a29937C25126f6267
$$ y = [-198653, 27375, 91515, -2369, -96202, -342708, 199550, -151255, -20365, -180780, -179435, -194633, -271201, -166515, -119505, -197352, -181579, 62316, 164285, -72368, -49368, -103878, -86959, -313918, 117834, -55948, 68574, -141773, -124819, 18798, -189358, -370691, -312499, -36074, -323785, -135663, -2338, -58314, 30953, 168353, 31487, -189201, 158926, -193647, 84541, 95494, -212516, -32316, -224674, -399042, -134775, 20406, -122163, 136096, -96490, -351834, -263331, -85489, -221115, -187501, -327, -150342, -203388, -111663, 42998, 18434, -132386, -230933, 341380, -164555, 167329, 28965, -80600, 96611, 34353, 165164, -378233, 291848, 108519, -102737, 39425, -89463, 13936, -155563, 5592, 213833, 184124, -129937, 325126, -66267]
9271C57772B2452b52306A4262b92507A57156a30800B86487b67684B08854a64011
9260a75805P7392B54773f1107k39381H4799a13968h677D9667a89139o2930P6773
9249a75296P5722H3933b80124A60256k7628O5442e1394j85170b8685m73294A6945
9237g1915A39123b44469K8122A77123q5032C1591J11548a50930j13576F503J59984
9226A66487a64768A00539c17239l8467D292b2607r9353j15390B24674b63020A50353
9214H3553a82281H2631k860a25040j5607j8659A47489b66039A47954r681a57703
9202a8425A8403J90007d85515e3532l8522A21300a99123N0947d1614j90648m152
9191b36414a05944k05163I7070l5325e3025B1816e2072j37108B2822b47499B7179
$$ y = [357772, 22452, -252306, 14262, -292507, 157156, -130800, 286487, -267684, 208854, -164011, -175805, -98413, 254773, -61107, -300488, 84799, -113968, -8677, 49667, -189139, -252069, -175296, -99574, 83933, -280124, 160256, 132628, 198070, -51394, -236564, -28685, -501979, 16945, -71915, 139123, -244469, -216347, 177123, 92091, 31591, 143139, -150930, -264506, 6503, 166487, -164768, 100539, -317239, -355706, 4292, -22607, -121960, -237350, 224674, -263020, 150353, 83553, -182281, 82631, 79771, -125040, -140647, -159306, 147489, -266039, 147954, 138273, -157703, -18425, 18403, 208410, -485515, -53532, -92054, 121300, -199123, -148176, -41614, -232262, -236414, -105944, -311107, 97070, 61745, -53025, 21816, -52072, -189180, 22822, -247499, 27179]
9179C5364a23300A32175c3911A47734f1693B19131a96136q96G3676c01508e0753
9167b93822P9889g964G5597a56157B4776c6485A76074a19867H3507b977B668a6920
9154G6867a25863O692K0366a40j3635j77339B9031d5363K0947G6206d7146A12399
9141c5052J3408B29879b23740j42043i5160F367h4695j01637B98392n7243E9047
9129e6050j52879a6637k45157A03960b51549Q0135K514I0547R7141f292k33476
9118b39768F1276a09624M463e1236A70690i8460G0103b30285F0228a14021k40778
9107c54799a46275E9353a19363j73173I3647a74400O2654B12255b51318D8828
9096G3340K07785O7922b93756J46746j94855E7183d53326A13261J17453b11361
$$ y = [35364, -123300, 132175, -33911, 147734, -61693, 219131, -196136, -197032, 73676, -301508, -50753, -293822, -213933, -7964, 75597, -156157, 24776, -36485, 176074, -119867, 83507, -2977, 2668, -16920, 76867, -125863, -119171, -98805, -140, -13775, -191114, 29031, -45363, -24416, 76206, -47146, 112399, -35052, -21644, 229879, -223740, -365783, -95160, 6367, -84695, -186332, 298392, 241149, 59047, -56050, -208929, -16637, -261794, 103960, -251549, -171414, -168900, 90547, 187688, -6292, -239768, 61276, -109624, -105161, -51236, 170690, -98460, 70103, -230285, 60228, -114021, -354799, -146275, 59353, -119363, -292536, 93647, -174400, -111746, 212255, -251318, 48828, 73340, 281125, 349047, -293756, -147010, -341865, 57183, -453326, 113261, 230714, -211361]
9085c9941C20135a74692j99862J26173l4703F3559a71193K2299m9219M1679B07186
9073a89594m6440n667F9675a61286A31841i7769q1818A10163c0872A54692a09348
9061d5826j7766C23082j55408a90914b3008m17049K17175l0923k6872L6320E2482
9049A62486d3447k57616a7346B45948a84236e4565j50917R0773l0445A01586d70079
9037b59061h5752b1664j00875N5654D7256g369j3115B60473B3643a85192j19878
9026c05070e6345B28340P6447a25502L0248l1524B10183e6843D2732a85302l4252
9015b19554L5365N4429m2059j13473B3553b78086a32323k15138J70601A06899
9004b4867j2910j1030j78937C276J25721e76884b03461M90n7564A41105a06654
$$ y = [-39941, 320135, -174692, -374554, -248381, -283084, 63559, -171193, -148894, -198113, -156434, 207186, -189594, -236034, -241701, 69675, -161286, 131841, -97769, -179587, 110163, -30872, 154692, -109348, -45826, -63592, 323082, 167674, -190914, -23008, -440057, -222882, -253805, -280677, -244357, 52482, 162486, -43447, -301063, -17346, 245948, -184236, -54565, -205482, -114709, -145154, 101586, -470079, -259061, -85752, -21664, -122539, -66885, 47256, -7369, -20484, 260473, 23643, -185192, -305070, -56345, 228340, 304787, -125502, -95254, -126778, 210183, -56843, 42732, -185302, -219554, -184189, -129760, -171819, -285292, 23553, -278086, -132323, -347461, -176860, 106899, -24867, -37777, -48807, -227744, 3276, 128997, -576884, -203461, -202971, -260535, 141105, -106654]
8992A13411l7931a80936D607K66965a99337A7088c754l89182a35766q9798B18051
8980f6141D94267B47100D1138a41590f8536A65588b89904A15619a32953k60993
8970c93946a47383b4743G8298O5769a434j0689j62576f4752H1914k6138b9692
8958A23840i2879q2015L4792k58574b5619m9982H7515c18822c4465j94717A10035
8946I8221K060L16393a0003B56198A17653a62755B90460d8733h887G0510b30007
8934B58718K96494g13C02703a70860C16288b0088C2471K03668O3380K90300N33637
8923A123456K479510J4392988H792604B261109A115747C22405N4048A20632j8797
8914A01835a2422k48351F8429a24277H0539J26313K1245a23355b931r5572b8688
$$ y = [113411, 75480, -180936, 4607, 271572, -199337, 17088, -3754, -392936, -135766, -225564, 218051, -66141, 494267, 247100, 41138, -141590, -68536, 165588, -289904, 115619, -132953, -393946, -147383, -24743, 78298, 144067, -1434, -12123, -174699, -64752, 81914, 55776, -29692, 123840, -92879, -174894, -140102, -398676, -25619, -75601, 87515, -318822, -34465, -229182, 110035, 98221, 100281, 416674, -10003, 256198, 117653, -162755, 290460, -48733, -8887, 70510, -230007, 258718, 555212, -713, 302703, -170860, 316288, -20088, 32471, 236139, 299519, 589819, 1123456, 3602966, 17995954, 8792604, 2261109, 1115747, 322405, 376453, 120632, 101835, -12422, -260773, 68429, -124277, 80539, 206852, 228097, -123355, -2931, -98503, -28688]
8902g8247C8885L160b57220m074J13372G7220p140B5221F374c63098C40116E138
8889d4007A25266J43352a78822C9436e8383E4731a28062j71481G1340a64644O9098
8878i5546H3562a26624A91978F802Q2614i9936N109j18162N7285O8184A82933
8866g2385j26622B101J962a27974b2562o7416k20595J19729B362a49986k78242
8855d28228B85222Q098a23930D1390J28219a1288l3040B7514J30903B069a52657
$$ y = [-78247, 38885, 42045, -257220, -261294, -147922, 77220, 70080, 25221, 6374, -363098, 340116, 5138, -44007, 125266, 268618, -178822, 39436, -58383, 54731, -128062, -299543, 71340, -164644, -95546, 83562, -126624, 191978, 6802, 89416, -99936, -94827, -212989, -155704, -87520, 182933, -72385, -199007, 2101, 4063, -127974, -22562, -89978, -310573, -190844, 2362, -149986, -428228, 285222, 293320, -123930, 41390, 169609, -11288, -44328, 27514, 158417, 2069, -152657]
$$ [...]
##END NTUPLES=NMR SPECTRUM
##END=
