##TITLE=AC1396_KENAH12208_7519595_p3BysR0INB
##JCAMPDX= 6.0         $$ Bruker NMR JCAMP-DX V2.0
##DATA TYPE= NMR SPECTRUM
##DATA CLASS= NTUPLES
##ORIGIN= BRUKER
##OWNER= Administrator
$$ 1.72 TOPSPIN		Version 2.1
$$ 2013-07-18 14:31:41.324 -0700  Administrator@X
$$ Compression mode = diff/dup
##.OBSERVE FREQUENCY= 400.02188249412
##.OBSERVE NUCLEUS= ^1H
##.ACQUISITION MODE= SIMULTANEOUS (DQD)
##.ACQUISITION SCHEME= undefined
##.AVERAGES= 8
##.DIGITISER RES= 22
##SPECTROMETER/DATA SYSTEM= spect
##.PULSE SEQUENCE= zg30
##.SOLVENT NAME= COFFEE_meoh
##.SHIFT REFERENCE= INTERNAL, COFFEE_meoh, 1, 14.98509
##AUDIT TRAIL= $$ (NUMBER, WHEN, WHO, WHERE, PROCESS, VERSION, WHAT)
$$ ##TITLE= Audit trail, TOPSPIN		Version 2.1
$$ ##JCAMPDX= 5.01
$$ ##ORIGIN= Bruker BioSpin GmbH
$$ ##OWNER= Administrator
$$ $$ E:\/data/COFFEE/nmr/AC1396_KENAH12208_7519595_p3BysR0INB/10/pdata/1/auditp.txt
$$ ##AUDIT TRAIL=  $$ (NUMBER, WHEN, WHO, WHERE, PROCESS, VERSION, WHAT)
(   1,<2013-07-18 14:31:34.917 -0700>,<Administrator>,<X>,<go>,<TOPSPIN 2.1>,
      <created by zg
	started at 2013-07-18 14:30:29.183 -0700,
	POWCHK enabled, PULCHK disabled,
       configuration hash MD5:
       C8 4E 4E 5D D3 5C D8 9E 9F 52 82 E0 59 8A DE 15
       data hash MD5: 64K
       B9 35 79 81 F0 1C 0F 4D 5F 3D 04 4F 38 32 48 1F>)
(   2,<2013-07-18 14:31:37.745 -0700>,<Administrator>,<X>,<proc1d>,<TOPSPIN 2.1>,
      <Start of raw data processing
       efp LB = 0 FT_mod = 6 PKNL = 1 PHC0 = 0 PHC1 = 0 SI = 32K 
       data hash MD5: 32K
       23 B1 A4 72 82 F0 F6 D3 FC 23 4A 1D D6 0E DB 3A>)
(   3,<2013-07-18 14:31:38.027 -0700>,<Administrator>,<X>,<proc1d>,<TOPSPIN 2.1>,
      <pk PHC0 = 96.7511 PHC1 = 0 
       data hash MD5: 32K
       15 D2 D6 E7 6E D1 27 39 EF 27 DB 2C 64 42 DB 11>)
(   4,<2013-07-18 14:31:38.120 -0700>,<Administrator>,<X>,<proc1d>,<TOPSPIN 2.1>,
      <abs ABSG = 1 
       data hash MD5: 32K
       A0 AC 95 06 6B 47 52 9E 8B 25 FB 47 66 0C 96 23>)
(   5,<2013-07-18 14:31:38.167 -0700>,<Administrator>,<X>,<proc1d>,<TOPSPIN 2.1>,
      <abs ABSG = 2 
       data hash MD5: 32K
       6C 28 AB 7E 80 FF 2D A8 D0 6C 5E 08 47 01 5B 94>)
(   6,<2013-07-18 14:31:38.245 -0700>,<Administrator>,<X>,<proc1d>,<TOPSPIN 2.1>,
      <abs ABSG = 3 
       data hash MD5: 32K
       80 62 B4 4D D6 02 DA F9 A5 C2 62 63 59 54 48 7C>)
(   7,<2013-07-18 14:31:38.292 -0700>,<Administrator>,<X>,<proc1d>,<TOPSPIN 2.1>,
      <abs ABSG = 4 
       data hash MD5: 32K
       80 A7 26 9C E6 88 E3 E2 C5 A2 D5 98 3D D2 FC 41>)
(   8,<2013-07-18 14:31:38.355 -0700>,<Administrator>,<X>,<proc1d>,<TOPSPIN 2.1>,
      <abs ABSG = 5 
       data hash MD5: 32K
       6C 21 32 0D DB 6E 0F 6B DA 29 25 B8 C1 AC 34 B7>)
$$ ##END=
$$ 
$$ $$ hash MD5
$$ $$ AC 08 20 B8 28 BB 74 A6 9B 56 74 3D FA C6 74 19
##$RELAX= 
##$RELAX= 
##$RELAX= 
##$RELAX= 
##$RELAX= 
##$RELAX= 
##$RELAX= 
$$ Bruker specific parameters
$$ --------------------------
##$DU= <E:\>
##$EXPNO= 10
##$NAME= <AC1396_KENAH12208_7519595_p3BysR0INB>
$$ [...]
##$TP= (0..7)
150 150 150 150 150 150 150 150
##$TP07= 0
##$TPNAME0= <>
##$TPNAME1= <>
##$TPNAME2= <>
##$TPNAME3= <>
##$TPNAME4= <>
##$TPNAME5= <>
##$TPNAME6= <>
##$TPNAME7= <>
##$TPOAL= (0..7)
0.5 0.5 0.5 0.5 0.5 0.5 0.5 0.5
##$TPOFFS= (0..7)
0 0 0 0 0 0 0 0
##$TUNHIN= 0
##$TUNHOUT= 0
##$TUNXOUT= 0
##$USERA1= <user>
##$USERA2= <user>
##$USERA3= <user>
##$USERA4= <user>
##$USERA5= <user>
##$V9= 5
##$VALIST= <valist>
##$VCLIST= <CCCCCCCCCCCCCCC>
##$VD= 0
##$VDLIST= <DDDDDDDDDDDDDDD>
##$VPLIST= <PPPPPPPPPPPPPPP>
##$VTLIST= <TTTTTTTTTTTTTTT>
##$WBST= 1024
##$WBSW= 4
##$XGAIN= (0..3)
0 0 0 0
##$XL= 0
##$YL= 0
##$YMAX_a= 602387
##$YMIN_a= -508992
##$ZGOPTNS= <>
##$ZL1= 120
##$ZL2= 120
##$ZL3= 120
##$ZL4= 120
##$ABSF1= 14.98509
##$ABSF2= -5.573092
##$ABSG= 5
##$ABSL= 3
##$ALPHA= 0
##$AQORDER= 0
##$ASSFAC= 0
##$ASSFACI= 0
##$ASSFACX= 0
##$ASSWID= 0
##$AUNMP= <proc_prof1d_extract_pilot.lims>
##$AXLEFT= 0
##$AXNAME= <>
##$AXNUC= <1H>
##$AXRIGHT= 0
##$AXTYPE= 0
##$AXUNIT= <>
##$AZFE= 0.1
##$AZFW= 0.1
##$BCFW= 0
##$BC_mod= 0
##$BYTORDP= 0
##$COROFFS= 0
##$CY= 15
##$DATMOD= 1
##$DC= 0
##$DFILT= <>
##$DTYPP= 0
##$F1P= 0
##$F2P= 0
##$FCOR= 0.5
##$FTSIZE= 32768
##$FT_mod= 6
##$GAMMA= 0
##$GB= 0
##$INTBC= 1
##$INTSCL= 1
##$ISEN= 128
##$LB= 0
##$LEV0= 0
##$LPBIN= 0
##$MAXI= 10000
##$MC2= 0
##$MEAN= 0
##$ME_mod= 0
##$MI= 0
##$NCOEF= 0
##$NC_proc= -8
##$NLEV= 6
##$NOISF1= 0
##$NOISF2= 0
##$NSP= 0
##$NTH_PI= 0
##$NZP= 0
##$OFFSET= 14.98509
##$PC= 1
##$PHC0= 96.7511
##$PHC1= 0
##$PH_mod= 1
##$PKNL= yes
##$PPARMOD= 0
##$PPDIAG= 0
##$PPIPTYP= 0
##$PPMPNUM= 2147483647
##$PPRESOL= 1
##$PSCAL= 4
##$PSIGN= 0
##$PYNMP= <proc.py>
##$REVERSE= no
##$SF= 400.02
##$SI= 32768
##$SIGF1= 0
##$SIGF2= 0
##$SINO= 400
##$SIOLD= 32768
##$SPECTYP= <>
##$SREGLST= <1H.CDCl3>
##$SSB= 0
##$STSI= 32768
##$STSR= 0
##$SW_p= 8223.68421052631
##$SYMM= 0
##$S_DEV= 0
##$TDeff= 65536
##$TDoff= 0
##$TI= <>
##$TILT= no
##$TM1= 0
##$TM2= 0
##$TOPLEV= 0
##$USERP1= <user>
##$USERP2= <user>
##$USERP3= <user>
##$USERP4= <user>
##$USERP5= <user>
##$WDW= 1
##$XDIM= 32768
##$YMAX_p= 366435565
##$YMIN_p= -722406
##$CURPLOT= <Network HP LaserJet P1505>
##$CURPRIN= <$Network HP LaserJet P1505>
##$DFORMAT= <normdp>
##$LAYOUT= <+/1D_H.xwp>
##$LFORMAT= <normlp>
##$PFORMAT= <normpl>
##$SURQMSG= 1
$$ End of Bruker specific parameters
$$ ---------------------------------
##NTUPLES= NMR SPECTRUM
##VAR_NAME=  FREQUENCY,     SPECTRUM/REAL,   SPECTRUM/IMAG
##SYMBOL=    X,             R,               I
##VAR_TYPE=  INDEPENDENT,   DEPENDENT,       DEPENDENT
##VAR_FORM=  AFFN,          ASDF,            ASDF
##VAR_DIM=   32768,         32768,           32768
##UNITS=     HZ,            ARBITRARY UNITS, ARBITRARY UNITS
##FACTOR=    0.250966925370066, 1,           1
##FIRST=     8223.43324360094, -130822,      52663
##LAST=      0,             -52893,          58713
##MIN=       0,             -722406,         0
##MAX=       8223.43324360094, 366435565,    0
$$ Real data points
##PAGE= N=1
##DATA TABLE= (X++(R..R)), XYDATA
$$ [...]
$$ plain form
19574 158026 90666 -212776 -432997 113070 112257 -191099 -106518 152907 -195254 -276650 -235109
19563 -235109 199651 73424 -163481 -149109 81233 -142047 183136 -107901 -80835 -27272
19552 -225479 43356 -309645 23232 156103 -18758 81312 86517 229113 -65995 138255 313974
19541 313974 38106 230818 78320 -88275 272090 -50445 812 -1459 -180984 -120282 -91523
19530 -91523 -47116 -41951 30650 -247451 -109825 -67942 211714 -57541 99501 35819 4598
19518 204901 94960 -416675 -78213 -241829 -87835 136529 -106342 42007 -200863 63424
19507 5976 74385 190903 -128075 86165 -7305 -76451 -233750 -160389 -424828 -171170 148761
19495 34326 66367 229801 -201131 -334922 -17355 45251 -178951 -43454 -201571 127640
$$ packed form
19574A58026o7360b12776k20221A13070q13a91099Q4581A52907a95254q1396M1541
19563b35109A99651G3424a63481J4372H1233a42047A83136a07901K7066b7272
19552b25479D3356c09645B3232J32871a8758H1312N205J42596f5995A38255J75719
19541C13974C8106J92712G8320h8275B72090e0445H12a459j79525O0702K8759
19530i1523M4407N165C0650b47451a09825M1883B11714e7541I9501C5819D598
19518B04901I4960d16675g8213j63616h7835A36529a06342D2007b00863F3424
19507E976O8409J16518a28075H6165g305o9146j57299P3361k64439a71170A48761
19495C4326L2041J63434b01131j33791a7355D5251a78951d3454j58117A27640
$$ plain form
19484 102737 22633 -191647 89454 66152 -35603 88688 27225 158362 -25370 250869 -50807
19472 -126264 -12214 -317362 -101116 70242 24541 -148682 19693 -49213 20331 -340192 -117436
19460 -282588 -102714 181682 -13463 90929 302982 -141292 -40305 -96887 -136530 -371487
19450 -371487 -91155 -266918 -55175 -155293 -80923 18453 -32180 -111141 -53938 -379018 -78430
19438 111741 -1962 71731 -7661 -5463 17030 -73219 -193653 -205667 64794 -89593 -384693 -3406
19425 97455 150555 -260360 -127225 -50512 -722406 14447 -358955 -49138 -263733 23596 -164153
19413 -390142 -175382 -154833 -184110 -226074 -181070 -186712 -28033 -156359 -65872 -113349 -268761
19402 -268761 -39477 18716 -150618 205863 63425 -113494 -65777 150271 -2920 192176 -68105
$$ packed form
19484A02737B2633a91647H9454k3302c5603H8688B7225J31137b5370B50869e0807
19472a26264a2214l05148a01116G0242B4541a48682A9693d9213B0331c40192a17436
19460b82588a02714A81682a3463I0929K12053a41292d0305n6582l9643k34957
19450c71487i1155j75763e5175j00118P4370A8453c2180p8961e3938l25080g8430
19438A11741a962G1731g661K198A7030g3219j20434j2014F4794h9593k95100c406
19425I7455N3100b60360a27225e0512o71894A4447c58955d9138k14595B3596a64153
19413c90142a75382K0549k9277m1964M5004n642b8033j28326f5872m7477j55412
19402b68761c9477A8716a50618B05863F3425a13494M7717A50271b920A92176f8105
$$ plain form
19390 286545 238991 -225029 -90961 -171132 -311029 -34773 157135 -309872 47530 -137746
19379 10473 -110141 -256989 31574 -180340 120779 -111643 -206891 -302836 -231571 -169922 -99102
19368 -99102 -424165 185886 -373040 -320847 -259337 -205162 -227032 165021 -25550 -24530 -117111
19357 -117111 -80573 282900 113554 -262799 86106 -120379 100301 -99776 -422084 113582
19346 -91473 -36434 -63367 326901 -22749 404870 -99791 39477 370991 147551 -15924 349864
19334 -44881 -70556 -190911 -178937 -74994 -145884 -38297 143909 -6599 -10571 -356638 47118
19322 -43681 38381 68954 -74953 2376 67835 -110498 -133221 -44208 75087 -63690 119603
19310 -100098 24583 -155224 -166773 -71646 -3513 12532 -295258 -99798 -280648 -108651 -108879
$$ packed form
19390B86545m7554b25029i0961q0171j39897c4773A57135c09872D7530a37746
19379A0473a10141j46848C1574a80340A20779a11643r5248r5945P1265O1649P0820
19368i9102l25063A85886c73040N2193O1510N4175k1870A65021b5550J020r2581
19357a17111L6538B82900A13554b62799H6106a20379A00301i9776l22308A13582
19346i1473c6434k6933C26901b2749D04870i9791C9477L31514A47551a5924C49864
19334d4881k5675j20355J1974g4994p0890c8297A43909f599l972l46067D7118
19322d3681C8381L0573g4953B376O5459a10498k2723d4208G5087f3690A19603
19310a00098B4583a55224j1549g1646c513A2532b95258i9798j80850a08651k28
$$ plain form
19299 -108879 126460 158457 -167157 -122624 139781 -367633 -140008 -136668 100148 -177612
19288 -51866 -325057 -157552 -210990 173584 56440 37244 -123354 -203749 -131158 80103 186456
19277 186456 -217317 258676 46233 26345 -220658 -199275 167772 -144358 -185216 -20359
19266 149879 74638 -90068 -41224 -269531 179511 -69551 -500433 -53558 -20997 -9369 -69744
19255 -69744 -189491 -384747 177223 -27709 -146001 227384 -322332 -188634 245223 -34846
19244 104768 394929 -191187 -120299 -119571 57330 -266130 -262642 58718 -65547 28200 96799
19233 96799 155866 73506 -213260 -103285 13296 -209322 -169109 -133110 -311657 -14380 81381
19221 45311 -180425 -113646 94135 146047 13722 -243642 119166 -74787 -218509 69525 -98201
$$ packed form
19299a08879A26460L1997a67157M4533A39781c67633a40008L340A00148a77612
19288e1866k73191a57552n3438A73584E6440j9196a23354q0395P2591H0103J06353
19277A86456b17317B58676D6233j9888b20658K1383A67772a44358m0858b0359
19266A49879G4638i0068d1224k28307A79511f9551m30882e3558b0997i369o0375
19255f9744j19747j95256A77223b7709j18292B27384c22332J33698B45223c4846
19244A04768K90161a91187P0888P28E7330b66130L488E8718f5547B8200O8599
19233I6799N9067G3506b13260a03285A3296b09322M0213L5999j78547a4380H1381
19221D5311a80425O6779I4135N1912A3722b43642A19166g4787j43722F9525i8201
$$ plain form
19209 -223967 174395 36434 -19174 -61211 -14686 -26492 -105791 21969 -251037 96720 -345423
19197 -306126 10023 -141469 -22209 -46955 -220258 122466 -60815 -642 -76685 -182938 95058
19185 21867 -194539 54981 -131022 -81268 -7133 -170969 154458 190562 -337371 -234617 94740
19173 -248951 -450808 -141742 -63901 -27774 -151264 265913 17979 107956 170887 -254719
19162 238185 -182117 -16670 -64405 -56379 -152575 -123501 132228 -322372 -232853 43035 -9811
19150 -143651 -325797 -131324 -9279 -159222 -389026 46879 61533 -97944 172715 213930 -326230
19138 -383476 45005 120116 -17611 -4220 80648 156969 -61228 -100651 189831 -300986 -179857
19127 -179857 -146122 -244140 -67325 80220 -290844 35323 53348 -264832 -291685 -119441 -191611
$$ packed form
19209b23967A74395C6434a9174m2037a4686j1806p9299B1969b51037I6720c45423
19197c06126A0023a41469b2209k4746j73303A22466f0815f42p6043j06253I5058
19185B1867a94539E4981a31022M9754g133j63836A54458L6104c37371J02754I4740
19173b48951k01857a41742f3901b7774j23490B65913A7979Q9977O2931b54719
19162B38185a82117a6670m7735Q026r6196K9074A32228c22372Q9519D3035i811
19150a43651j82146a31324i279j49943k29804D6879J4654i7944A72715M1215c26230
19138c83476D5005P5111a7611d220H0648P6321f1228l9423A89831c00986J21129
19127a79857L3735r8018f7325H0220b90844C5323J8025b64832k6853a19441p2170
$$ plain form
19116 -191611 -53104 51021 17948 335879 -311324 -54596 75112 136710 -54200 -126798 25457
19104 136366 -341670 49108 136030 13515 73633 -99261 -18758 -105771 19421 -27890 -145848
19093 -145848 40783 15616 -81519 254339 -16918 60817 -180091 153076 -515898 -59252 251171
19081 -80724 -246374 294206 -250049 -194225 52358 -48132 -37950 232173 90843 -110843 -217373
19070 -217373 53907 60036 165255 -99800 -118539 310593 -327749 -162602 -127671 -194911 -26673
19058 -144536 -186254 -340571 53800 -82658 -162599 15130 30445 -76092 210966 -316203 -280654
19047 -280654 -190145 -63504 -124046 -56382 -44296 -31285 -87463 -107327 110895 -38693 30610
19035 -94482 -26505 -48732 -201503 55467 -215500 -62010 -243411 -146182 37522 2139 -145613
$$ packed form
19116a91611e3104E1021A7948L17931c11324e4596G5112O1598e4200p2598B5457
19104A36366c41670D9108Q6922A3515O0118i9261a8758q7013A9421b7890j17958
19093a45848D0783A5616h1519B54339a6918F0817a80091A53076e15898e9252B51171
19081h0724j65650B94206b50049N5824E2358d8132J0182B32173I0843a10843j06530
19070b17373E3907O129J05219i9800j8739C10593c27749a62602L4931o7240b6673
19058a44536m1718j54317E3800h2658p9941A5130J5315g6092B10966c16203L5549
19047b80654R0509f3504o0542e6382J2086J3011n6178j9864A10895c8693C0610
19035i4482b6505k2227j52771E5467b15500f2010j81401R7229C7522B139a45613
$$ plain form
19023 141142 -32026 63924 -189002 -14062 -124662 181753 279703 -218644 -177082 -186808 230082
19011 148122 8904 260399 -468959 51525 53928 103275 56015 -259826 -221166 -232116 215146
18999 -468463 18090 -394115 302152 -46431 15711 -131469 83117 313799 -142679 48918
18988 -109188 124618 86706 -334002 -236417 -116698 -115335 170155 -136603 165264 123766
18978 123766 130984 -149856 -342328 29616 -246107 139943 123490 7911 -95264 516519 -147211
18966 29016 -251727 -25062 -265101 235377 -30418 1231 104127 113659 -60218 -357646 -231485
18955 -231485 25514 20683 -75583 -165066 20214 288059 281921 -142521 77132 222451 -165120
18943 -199572 -230700 -118600 -90545 -53875 -126550 -215380 235981 -147702 44547 -102531 66380
$$ packed form
19023A41142c2026F3924a89002a4062j10600A81753R7950b18644M1562r726B30082
19011A48122H904K51495d68959E1525K403M9347m7260b59826L8660j0950B15146
18999d68463A8090c94115C02152d6431A5711a31469H3117K30682a42679D8918
18988a09188A24618l7912c34002R7585a16698J363A70155a36603A65264m1498
18978A23766P218a49856j92472B9616b46107A39943j6453G911i5264E16519a47211
18966B9016b51727b5062k40039B35377c0418A231J02896R532f0218k97428J26161
18955b31485B5514m831g5583q9483B0214K67845o138a42521G7132J45319a65120
18943a99572l1128J12100K8055L6670p2675q8830B35981a47702D4547a02531F6380
$$ plain form
18931 -632107 138152 74170 131528 -217075 -388559 419699 384135 -238700 290428 81484
18920 203398 -297595 -232339 -21786 279851 -281027 -45675 176494 291916 36719 -398002
18909 -106256 -165500 229526 324050 -301306 -47976 536363 -254634 15882 45874 -66943 167742
18897 183784 150574 18558 -19328 -121064 -34965 65318 -62788 80002 78619 25067 39720
18886 39720 18182 -338794 -86690 254278 57705 35474 -77907 126082 99313 -60196 24246
18874 -109406 82110 -60639 29572 -238337 5418 -55866 -402610 -161014 -230542 -112835 -242727
18863 -242727 -64806 -275905 -76956 -42229 -148394 60160 189476 -85965 -58194 28147 79467
18852 79467 -208841 -9921 -393466 231887 -9756 86521 -42037 -268715 7977 15544 -145862
$$ packed form
18931f32107A38152o3982N7358b17075j71484D19699l5564b38700B90428H1484
18920B03398b97595O5256b1786B79851b81027d5675A76494J15422C6719c98002
18909a06256n9244B29526R4524c01306d7976E36363b54634A5882K9992f6943A67742
18897A83784l3210A8558a9328j01736c4965F5318f2788H0002j383B5067J4653
18886C9720A8182c38794h6690B54278E7705k2231g7907A26082k6769f0196B4246
18874a09406H2110f0639B9572b38337E418e5866l46744a61014o9528a12835j29892
18863b42727f4806k11099g6956L4727j06165F0160J29316h5965K7771B8147N1320
18852G9467b08841i921l83545B31887i756H6521d2037k26678G977P567a45862
$$ plain form
18840 38901 -121356 -90416 -157288 115394 -151890 -291722 1230 292546 -50849 438751 -411980
18828 -207733 -64016 296877 -277 -59039 -120366 -32605 -235133 -403376 47539 -234828 -151825
18817 -151825 -13304 64415 -379933 -42936 256086 -94195 -48113 -122008 -42749 -157213 -89449
18806 -89449 155319 -174979 150110 194626 -81264 -197305 162965 -46401 -122681 -74861 142484
18794 127118 -269637 -12515 -145289 211936 139100 -157144 135834 -222510 -113661 77548
18783 -12368 256709 -66987 -100616 92544 -137358 -134611 101756 54686 46261 36979 -233802
18771 25508 82797 -161707 -142902 -214875 -167891 -212439 -351225 -45620 -138590 -97143 64434
18759 -287254 -197594 -188987 -147088 -123139 13711 -60381 158700 171583 271951 -32732 -79213
$$ packed form
18840C8901a21356L0940o6872A15394a51890j39832A230K91316e0849D38751d11980
18828b07733f4016B96877b77n8762o1327c2605k02528j68243D7539b34828Q3003
18817a51825a3304F4415c79933d2936B56086i4195M6082p3895d2749j14464O7764
18806h9449A55319a74979A50110M4516h1264j16041A62965d6401p6280M7820A42484
18794A27118b69637a2515j32774B11936p2836a57144A35834b22510J08849G7548
18783a2368B56709f6987l3629I2544a37358K747A01756m7070q425r282b33802
18771B5508N7289a61707J8805p1973M6984m4548j38786d5620r2970M1447F4434
18759b87254Q9660Q607M1899K3949A3711f0381A58700J2883J00368c2732m6481
$$ plain form
18748 -79213 -322277 6578 17157 16362 159086 -98450 29303 -301999 -159949 -75355 -407665
18737 -407665 -297445 78980 90538 195159 41206 -14820 124896 -115039 91966 103624 -38578
18725 -44863 242284 -72479 -104627 -24652 -196509 28542 14735 19900 -159970 -219313 -340712
18714 -340712 -64069 388788 -33357 -55255 -309171 -344448 -79287 -146032 40468 83128 176781
18703 176781 32536 -327041 -143420 8578 -190175 -159091 -13037 21755 -103588 -32915 428158
18691 -338174 -173820 -101557 38545 -54630 -92275 43516 174887 193090 -218142 -234978 -185087
18680 -185087 -312328 -300580 71147 -202069 -377721 -113322 -308131 166379 -3075 363577
18669 -128089 -220658 171793 17446 73516 193508 281113 29661 -175958 -111342 -74342 124552
$$ packed form
18748g9213k43064F578J0579p95J42724i8450B9303c01999J42050g5355l32310
18737d07665J10220G8980J1558J04621D1206a4820A24896a15039I1966J1658c8578
18725d4863B42284g2479l2148b4652j71857B8542j3807N165a59970n9343j21399
18714c40712f4069C88788c3357k1898k53916l5277g9287o6745D0468M2660R3653
18703A76781C2536c27041a43420H578a90175L1084a3037B1755a03588c2915D28158
18691c38174J64354P2263C8545e4630l7645D3516J31371J8203b18142j6836M9891
18680a85087j27241J1748G1147b02069j75652a13322j94809A66379c075C63577
18669a28089r2569A71793A7446N6070J19992Q7605B9661a75958O4616L7000A24552
$$ plain form
18657 46084 28772 -75853 -195931 110332 211434 145112 -249979 74692 17069 -362398 71126
18645 961 -219555 -125291 253601 -119563 -114986 196839 -266624 39176 -340646 26785 -52383
18633 -416087 89187 -66261 -106398 -27474 -46976 138656 -90199 -18175 -202786 -320149 44578
18621 -98233 80227 186696 87782 -22912 60092 -47317 -49800 -75829 47297 -28856 -180877
18610 -180877 108062 240148 -93431 -70352 121621 -578094 22800 46894 -28739 191912
18599 186271 316411 9353 -106534 73707 288503 248242 -101272 28874 -56119 -42153 80045
18587 215470 -85354 252108 -41619 -176162 -158726 -325462 -220904 -120861 9329 -197895
18576 129885 -202343 -189032 229992 196685 15467 -188169 -99001 -225185 100936 -124491
$$ packed form
18657D6084j7312g5853j20078A10332J01102o6322b49979G4692A7069c62398G1126
18645I61b19555R4264B53601a19563M577A96839b66624C9176c40646B6785e2383
18633d16087H9187f6261m0137b7474j9502A38656i0199a8175j84611j17363D4578
18621i8233H0227J06469H7782b2912F0092d7317k483k6029D7297b8856j52021
18610a80877A08062J32086i3431K3079A21621e78094B2800K4094b8739A91912
18599A86271J30140I353a06534G3707K14796m0261a01272B8874e6119J3966H0045
18587B15470h5354B52108d1619j34543J7436j66736J04558J00043I329a97895
18576A29885b02343J3311B29992l3307A5467a88169Q9168j26184A00936a24491
$$ plain form
18565 123975 235209 -171419 35924 -21632 58763 -126328 -233301 -65534 -357832 -144733
18554 186478 46685 28535 -109673 -126349 -29454 -25398 -90580 28321 34071 -139741 106691
18542 357309 -56873 -398093 156484 7552 104127 -95468 -108736 13645 -205829 145535 -99438
18530 -203185 -125335 57091 35326 -532 -179338 74295 -29207 2573 -15465 -102802 -295 284700
18517 59276 72948 -512308 -106514 -356522 18974 -264479 -38843 -171448 209425 -5832 -165594
18506 -165594 -25507 -180906 10952 177078 70207 171678 -35448 54020 36997 -21242 50651
18494 34531 -167680 119944 -45767 -261599 129884 -277864 -256846 -129798 -164226 211538
18483 63896 -160243 -177328 22594 216494 -34222 -218078 -79352 85198 -126839 -160436 40548
$$ packed form
18565A23975J11234a71419C5924b1632E8763a26328j06973f5534k92298a44733
18554A86478D6685j8150a09673j6676b9454M056o5182B8321N750a39741A06691
18542C57309e6873l41220A56484G552R6575i5468j3268A3645b05829A45535i9438
18530b03185P7850E7091k1765e32j78806G4295b9207B573a5465q7337b95B84700
18517E9276J3672e12308a06514k50008A8974b64479c8843j32605B09425e832j59762
18506a65594b5507j55399A0952J66126G0207J01471c5448E4020j7023b1242E0651
18494C4531a67680A19944d5767k15832A29884b77864K1018J27048l4428B11538
18483F3896a60243j7085B2594J93900c4222j83856g9352H5198a26839l3597D0548
$$ plain form
18471 43541 12081 -246079 -122485 -128922 -114603 -111300 143663 -101677 -92039 244703 180077
18460 180077 -126027 221271 -273359 -192128 -165021 61178 -205341 -186100 -399202 113925
18449 -130928 38198 -709094 58582 95206 188657 4780 112477 -420246 198143 -65816 38
18437 -34329 -437791 207722 85050 95759 -209997 -78001 -115021 -156270 -165989 86340 126869
18426 126869 -347434 61489 -183198 -55455 -210996 -235721 -107139 -32514 258670 -190900
18415 131505 -12526 43270 -269232 -166666 55224 -351243 -422205 74465 -56142 -208634 103534
18403 -14028 -73377 247621 -282764 -171352 9353 -130914 -15281 -51373 66895 198173 150777
18392 150777 -234748 82818 -99162 -73408 197164 67463 -299851 96300 -448326 86655 -131785
$$ packed form
18471D3541A2081b46079a22485o437J4319L303A43663a01677R638B44703o4626
18460A80077a26027B21271b73359Q1231K7107F1178b05341J9241k13102A13925
18449a30928C8198g09094E8582L6624R3451D780J07697d20246A98143f5816C8
18437c4329m03462B07722H5050J0709b09997g8001l7020m1249r719H6340M0529
18426A26869c47434F1489a83198e5455j55541k4725a07139c2514B58670a90900
18415A31505a2526D3270b69232J02566E5224c51243p0962G4465e6142j52492A03534
18403a4028n9349B47621b82764J11412I353a30914a5281l6092F6895J31278m7396
18392A50777b34748H2818i9162K5754A97164F7463b99851I6300d48326H6655a31785
$$ plain form
18380 -352873 -28245 -211654 -27301 116369 272668 -63335 -81316 -92228 -149100 79360 -87665
18368 -122690 -17042 -125690 -59375 42112 410464 184211 21097 26458 184884 55345 -160266
18356 -211019 126987 65234 66315 -75980 103157 58677 -49815 -155074 -71132 182029 -370058
18344 216833 137141 -120197 188390 98830 -393784 -137452 -202291 -213963 -293731 239611
18333 106770 126324 -70806 -212031 52892 149584 48447 356300 -11714 -351558 150374 136029
18322 136029 234037 142878 -162811 46622 -158894 -91416 15404 -283430 -179957 -297494
18312 -297494 -326482 -126998 -35546 -107486 68526 -65054 -44480 -202027 -207551 -144964 112145
18300 64469 -175996 -36870 -101632 19223 -150631 115221 157361 -74914 -98006 84240 -11661
$$ packed form
18380c52873b8245j83409b7301A16369J56299f3335j7981j0912n6872G9360h7665
18368a22690a7042j08648e9375D2112L68352A84211B1097N361J58426E5345a60266
18356b11019A26987o1753J081g5980A03157m4480d9815j05259g1132A82029c70058
18344B16833p9692a20197A88390q9560c93784a37452o4839j1672p9768B39611
18333A06770J9554g0806j41225E2892R6692D8447L07853a1714l39844A50374j4345
18322A36029R8008r1159a62811D6622a58894O7478A5404b83430J03473j17537
18312b97494k8988a26998c5546p1940F8526f5054K0574j57547n524O2587A12145
18300F4469a75996c6870o4762A9223a50631A15221M2140g4914k3092H4240a1661
$$ plain form
18288 -143714 -162342 -2240 232801 301360 91496 -97068 -18976 143093 -48320 -83622 -54629
18277 -54629 -489740 -158904 51907 -266746 170345 14204 111554 171978 -347618 -95840 44518
18265 133079 -256626 132719 -6348 40336 6389 110888 -35607 203341 -169441 -77751 -151136
18254 -151136 113648 -247257 -579 -139395 13634 -287752 13892 -359185 -113175 16785 384583
18243 384583 185613 -10270 -249839 -248833 79110 52725 188671 -231575 44083 -194405 -154393
18232 -154393 -79570 -59567 -123536 88528 -60054 -4937 95723 -97019 -63120 -35621 -244279
18221 -244279 -137655 -54854 27194 20476 -31098 -49217 -275395 89794 -175205 209695 413593
18210 413593 -168964 -207676 113158 147397 -49160 -114476 249699 -179630 176485 -261130
$$ packed form
18288a43714j8628b240B32801O8559I1496i7068a8976A43093d8320l5302K8993
18277e4629m35111a58904E1907b66746A70345A4204R7350O0424c47618i5840D4518
18265A33079b56626A32719f348D0336F389J04499c5607B03341a69441g7751p3385
18254a51136A13648b47257e79j38816A3634b87752A3892c59185a13175A6785L67798
18243C84583A85613a0270k39569J006G9110k6385J35946b31575D4083a94405M0012
18232a54393P4823K0003o3969H8528f0054d937I5723i7019L3899K7499k08658
18221b44279J06624e4854B7194o718c1098j8119k26178H9794a75205B09695K03898
18210D13593a68964l8712A13158L4239d9160o5316B49699a79630A76485b61130
$$ plain form
18199 204651 -14874 -144909 -299968 53704 78196 -66967 -128248 -110368 -208526 -174065 -76615
18187 235586 -171745 -140588 31991 28905 -12301 -401255 127270 86466 58381 -19436 242711
18175 -175915 -179625 13284 -45562 81868 -11327 -232845 70968 -217108 -37803 -73671 -27129
18163 -224057 -89013 35608 -254295 -117169 -42727 -264307 -170936 30226 61839 84369 -202361
18151 -41346 322103 -140441 -15215 58022 -15917 -86578 55472 -49284 48780 105715 -99765
18139 176815 -149317 -54922 -185370 271198 283509 -291170 124901 -149105 -182144 -107625
18129 -107625 334820 -225644 211530 35601 155052 -79983 -179897 -59278 88009 -6112 227010
18117 -167472 -216805 82496 38839 -43185 31750 -112529 -137180 -45512 -152287 -335453 -210381
$$ packed form
18199B04651a4874j30035j55059E3704K4492f6967o1281J7880r8158L4461g6615
18187B35586a71745L1157C1991l086a2301l88954A27270m0804k8085a9436B42711
18175a75915l710A3284d5562H1868a1327k21518G0968b17108c7803l5868b7129
18163b24057h9013C5608b54295a17169d2727k21580R3371C0226L1613K2530b02361
18151d1346C22103a40441a5215E8022a5917p0661E5472d9284D8780N6935i9765
18139A76815a49317e4922j30448B71198J2311b91170A24901a49105l3039P4519
18129a07625C34820b25644B11530C5601J19451g9983r9914e9278H8009f112B27010
18117a67472m9333H2496C8839d3185C1750a12529k4651d5512j06775j83166J25072
$$ plain form
18106 -210381 -39191 -62832 121357 -32505 95181 236095 -79121 76205 -184031 -66019 -48145
18095 -48145 210180 99455 -288935 -10010 -259493 -57959 55995 -44768 77584 174826 87711
18084 87711 -499299 109837 -18152 -376853 152585 218008 -199066 -218063 -142669 -35572 67887
18072 31372 71611 168027 -71222 -129345 180521 285076 239341 -153339 -36169 30697 -141432
18060 -1887 21455 287507 12224 -373144 33462 -267144 -91912 69327 -36843 78352 -152821
18048 -37294 268984 201621 161000 -20223 -287809 -106435 -269334 -217340 -80549 188677 -284938
18036 118047 193616 291425 -206119 -15619 62409 236205 -30765 -19046 8876 -244517 157132
18024 123995 -18674 -161294 -22417 -166860 -28616 -79032 -54533 207920 -162219 157366
$$ packed form
18106b10381c9191k3641A21357c2505I5181J40914g9121G6205a84031f6019J7874
18095d8145B10180I9455b88935a0010k49483e7959E5995d4768G7584R7242q7115
18084H7711d99299A09837a8152l58701A52585O5423a99066j8997P5394c5572F7887
18072C1372M0239R6416g1222n8123A80521J04555m5735a53339c6169C0697a41432
18060a887B1455K66052A2224c73144C3462b67144i1912F9327c6843G8352a52821
18048c7294B68984o7363m0621b0223k67586a06435j62899N1994h0549A88677b84938
18036A18047P5569R7809b06119a5619F2409J73796c0765J1719H876b44517A57132
18024A23995a8674j42620b2417j44443b8616n0416K4499B07920a62219A57366
$$ plain form
18013 26387 142989 -111292 -226255 -130396 -113517 201253 -117949 157019 236151 201447
18003 201447 -256014 -82635 -46312 -5371 -156519 -223797 -357190 168637 -66735 -168000 -310556
17992 -310556 307805 -177794 42782 69387 -10556 -193097 -77765 -19949 37479 -196721 -324546
17981 -324546 163596 -529550 283464 -38086 207181 51535 17189 -55579 -189807 7385 -196079
17969 -70733 -30208 -260092 110578 -210333 -26328 -56664 -17180 178791 93191 -45695 18560
17957 -152222 10347 50841 -64074 -246995 188217 160872 323110 -15289 314564 -197869
17946 -118392 45860 -39279 209122 -41184 -83619 -292857 -32476 94396 23955 193654 99229
17935 99229 114664 -139627 109791 -71485 -214728 -307108 123282 -76160 -118590 89945 -204238
$$ packed form
18013B6387J16602a11292j14963R5859J6879B01253a17949A57019P9132l4704
18003B01447b56014h2635L6323e371j51148o7278j33393A68637f6735j01265j42556
17992c10556C07805a77794D2782K6605a0556j82541g7765a9949C7479a96721j27825
17981c24546A63596e29550B83464c8086B07181E1535A7189e5579j34228G385a96079
17969g0733c0208k29884A10578b10333b6328l0336a7180A78791q5600d5695A8560
17957a52222A0347M0494f4074j82921A88217k7345J62238a5289C14564a97869
17946a18392D5860c9279B09122d1184m2435k09238c2476I4396B3955J69699r4425
17935I9229J5435a39627A09791g1485j43243r2380A23282g6160m2430H9945b04238
$$ plain form
17923 -71804 161935 -86534 -210481 -119635 210835 -291930 -153567 -247730 -189926 -194652 -195040
17912 -195040 14990 153258 106788 7446 -58428 295543 -15885 -131220 6565 -412389 289307
17900 65213 -90311 278884 -91988 -163943 -179441 -285486 -94219 43387 -59937 34783 124766
17889 124766 -74654 -22258 19993 -186320 -325297 50118 -97205 -244392 -164330 55307 225015
17878 225015 98107 51827 -96164 -307680 167437 160090 131563 -48510 -108742 -344863 100736
17866 249218 195911 -84675 20862 -43760 -80752 2376 -125396 -28790 29636 -237555 -274373
17855 -274373 28005 128555 171091 98222 -174644 -65771 116529 -110 -27688 275086 158848
17844 158848 -13701 91330 -24657 -110251 306421 378525 86076 -242833 -11125 31368 93853
$$ packed form
17923g1804A61935h6534j23947R0846B10835b91930J38363r4163N7804m726l88
17912a95040A4990J38268m6470G446e8428B95543a5885j15335F565d12389B89307
17900F5213i0311B78884i1988p1955j5498j06045i4219D3387e9937C4783Q9983
17889A24766g4654b2258A9993a86320j38977E0118i7205j47187Q0062E5307J69708
17878B25015I8107m6280i6164k11516A67437p347k8527d8510o0232k36121A00736
17866B49218n3307h4675B0862d3760l6992B376a25396b8790B9636b37555l6818
17855b74373B8005J00550M2536p2869a74644f5771A16529a10k7578B75086j16238
17844A58848a3701I1330b4657q5594C06421P2104H6076b42833a1125C1368O2485
$$ plain form
17833 93853 -173658 43783 -16202 -152250 -187053 -324468 -223860 -72348 -57552 -281880 158241
17821 -291977 103932 -107518 250150 -2174 62447 -132575 -114712 -111915 81697 30992 273753
17810 273753 -58302 265321 -199690 212880 128684 56881 -145451 -95749 215317 48950
17799 6007 -65531 -173287 210824 13253 56803 33125 89649 55544 -169906 5751 66579
17788 66579 -10167 90119 83430 261480 113250 -28726 60621 -145214 20903 -376496 -80647
17776 181933 -127132 -9612 -54192 -67796 270822 -44218 -43334 -151503 -59143 256274 52741
17764 361778 -110095 -18983 -371696 124326 -223875 69902 110537 -12425 11690 -19341 126141
17752 183432 26184 212282 183271 57389 133046 -93541 -105635 227257 199084 60086 -83917
$$ packed form
17833I3853a73658D3783a6202j36048l4803j37415J00608g2348J4796k24328A58241
17821b91977A03932a07518B50150b174F2447a32575J7863K797H1697C0992K42761
17810B73753e8302B65321a99690B12880q4196E6881a45451M9702B15317D8950
17799F007f5531j07756B10824A3253M3550k3678N6524l4105a69906E751O0828
17788F6579a0167I0119o689J78050A13250b8726F0621a45214B0903c76496h0647
17776A81933a27132i612m4580j3604B70822d4218Q84j08169e9143B56274E2741
17764C61778a10095a8983l52713A24326b23875F9902M0635a2425A1690a9341A26141
17752A83432B6184J86098k9011E7389P5657i3541j2094B27257k8173F0086h3917
$$ plain form
17740 277825 -158139 -30928 -17846 68728 92412 2625 152649 -261337 192650 -24319 17686
17728 -108714 143152 -185290 -58527 131715 -42595 -258603 28832 -91963 -2350 176334 253726
17717 253726 -53380 -101622 218303 35491 11802 204583 -79453 -28451 35486 329503 -327686
17705 -217773 98338 -307134 166384 174231 65977 157741 -183245 3239 254287 -332768 -160554
17693 93306 -74748 48362 -166561 168305 -23423 100293 -183185 28262 217184 -95275 -36452
17681 -316115 181491 186123 -109347 218691 4879 -69778 92599 74579 -106324 -154571 261219
17669 -53057 196382 -130748 -44356 -97700 284810 -76626 -21852 -5403 42073 44698 44213 163898
17657 163898 -34357 91576 32170 -255093 119776 285681 -128488 55395 47097 -123974 210674
$$ packed form
17740B77825a58139c0928J3082F8728K3684B625J50024b61337A92650b4319A7686
17728a08714A43152a85290e8527A31715d2595k16008B8832i1963b350A76334P7392
17717B53726e3380m8242B18303C5491A1802J92781g9453b8451C5486K94017c27686
17705b17773I8338c07134A66384P847F5977R1764a83245C239K51048c32768a60554
17693I3306g4748D8362a66561A68305b3423A00293a83185B8262J88922i5275c6452
17681c16115A81491M632a09347B18691D879f9778I2599j8020a06324m8247B61219
17669e3057A96382a30748d4356n3344B84810g6626b1852e403D2073K625m85J19685
17657A63898c4357I1576C2170b55093A19776J65905a28488E5395q298a23974B10674
$$ plain form
17645 -128186 -86882 -419805 -149483 251099 82725 38142 104760 48895 -43510 -242885 329146
17633 -49956 8707 172873 -304048 -191898 41887 35453 -29572 204291 -63822 -10236 68051
17621 316828 -92444 -333919 -344172 -189897 25943 -19041 223889 -347162 3510 -139655 -171389
17610 -171389 236387 -104686 59526 114113 53535 -45541 -140695 84931 -195151 -24249 169036
17598 53023 290943 -105196 -36320 -156120 -89530 25618 160568 -91047 -15164 397237 331203
17587 331203 55374 -48403 -83013 -43928 -156934 -112199 19826 -56337 -97432 13298 -71968
17575 99014 259778 154928 87666 18553 -199593 -37917 64461 119149 -249490 158740 -407140
17563 403182 -100277 -201661 268140 -52100 103591 51964 124594 16712 31436 61664 372309
$$ packed form
17645a28186M1304l32923a49483B51099H2725C8142O6618D8895d3510j99375C29146
17633d9956H707J64166c04048J12150D1887o434b9572B04291f3822a0236F8051
17621C16828i2444k41475j0253J54275B5943a9041B23889c47162C510a39655l1734
17610a71389B36387a04686E9526N4587E3535d5541r5154H4931a95151b4249A69036
17598E3023K37920a05196c6320j19800O6590B5618J34950i1047a5164C97237o6034
17587C31203E5374d8403l4610L9085j13006M4735A9826e6337m1095A3298g1968
17575I9014J60764j04850o7262A8553a99593c7917F4461N4688b49490A58740d07140
17563D03182a00277j01384B68140e2100A03591n1627P2630A6712J4724L0228L10645
$$ plain form
17552 372309 131722 162135 -3294 -109990 348970 -41864 -48335 -153869 109374 -33661 77940
17540 95250 96597 331361 121237 -80868 -190660 2860 238229 -67119 -68904 343926 106602
17528 -113412 -490766 -310110 322235 -184572 -102189 308650 256881 -90827 210763 324062
17518 324062 175553 -76337 312926 71226 249124 15297 309260 130525 274322 13042
17507 25844 137892 1648 229813 195234 -86831 258913 -35528 -12530 159716 -33842 213651
17495 176748 122928 32144 60966 77539 -38367 92012 52222 -147026 35443 467122 139709
17483 284239 177948 -80309 208868 12672 221543 289810 258532 -49395 299629 235201 245939
17472 245939 -105255 256184 -112787 338699 244761 259727 74776 -167474 143484 -128263
$$ packed form
17552C72309A31722L0413c294j06696C48970d1864o471j05534A09374c3661G7940
17540I5250J347K34764A21237h0868j09792B860K35369f7119j785C43926A06602
17528a13412l77354J80656C22235a84572Q2383C08650n1769i0827B10763J13299
17518C24062j48509g6337C12926G1226J77898A5297K93963A30525J43797A3042
17507B5844J12048A648K28165l4579h6831B58913c5528a2530A59716c3842B13651
17495A76748n3820C2144K8822J6573c8367I2012l9790a47026C5443M31679A39709
17483B84239j06291h0309B08868A2672K08871O8267l1278d9395B99629o4428J0738
17472B45939a05255B56184a12787C38699r3938J4966G4776a67474A43484a28263
$$ plain form
17461 53023 -167727 242801 35714 236046 466918 289993 200775 46980 94381 -4273 290319
17449 64492 191005 227160 84985 10019 -38659 182452 240665 91206 126545 152525 336004
17438 336004 25432 375620 141393 272227 296136 157094 33281 323017 104458 187218
17428 187218 249448 121362 125404 203843 429504 490108 133259 367644 46922 39709 -32311
17416 270114 688302 596313 83105 7221 189766 -71580 -391468 248654 18648 190124 246671
17405 246671 44172 104664 263225 -93646 89752 223058 204970 561250 212458 80895 106221
17394 106221 491639 191590 -115088 169124 370189 157048 89293 62786 -122987 323384
17383 -156979 23149 80528 99102 178257 320183 88386 149371 495603 -239415 252275 19766
$$ packed form
17461E3023a67727B42801C5714K00332K30872j76925q9218D6980M7401d273B90319
17449F4492J26513L6155H4985A0019c8659A82452N8213I1206L5339K5980J83479
17438C36004B5432L50188A41393J30834K3909j39042C3281K89736A04458Q2760
17428A87218O2230A21362M042P8439K25661O0604A33259K34385D6922p213c2311
17416B70114M18188r1989H3105G221J82545g1580l19888B48654A8648J71476N6547
17405B46671D4172O0492J58561i3646H9752J33306j8088L56280B12458H0895K5326
17394A06221L85418A91590a15088A69124K01065A57048o7755k6507a22987C23384
17383a56979B3149N7379J8574P9155J41926H8386O0985L46232b39415B52275A9766
$$ plain form
17371 285713 306118 303992 205003 101061 352130 260123 201091 -216121 84805 179173 451100
17360 451100 304124 483118 365287 246517 198255 -61957 157886 -234342 233371 -92759
17349 -200852 67044 34734 282560 286202 94828 485609 28934 -106400 82895 72512 -7241
17337 59299 -59652 265282 67982 217789 -85342 -32569 -36963 182672 354160 39918 273482
17326 273482 311032 396458 136680 269024 28255 229349 196022 253196 223343 237389 385534
17315 385534 33656 -93891 166855 35219 94863 280677 74625 154446 158250 283743 83400
17303 178647 -30193 166039 63890 -23209 90842 -121910 -27337 295666 276956 196840 67047
17291 -166582 166465 -26531 52456 38718 295274 8778 230462 39385 -10912 -72637 176932
$$ packed form
17371B85713K0405k126r8989A01061K51069r2007n9032b16121H4805R4368K71927
17360D51100j46976J78994j17831j18770m8262f1957A57886b34342B33371i2759
17349b00852F7044l2310K47826L642I4828L90781B8934a06400H2895j0383g241
17337E9299e9652B65282F7982J49807h5342c2569m394A82672J71488C9918K33564
17326B73482L7550Q5426A36680J32344B8255K01094l3327N7174k9853J4046J48145
17315C85534C3656i3891A66855C5219N9644J85814G4625P9821L804J25493H3400
17303A78647c0193A66039F3890b3209I0842a21910b7337B95666j8710q0116F7047
17291a66582A66465b6531E2456j3738K56556H778K21684C9385a0912o1725A76932
$$ plain form
17279 -91789 199782 185895 107963 136426 137644 261893 135043 314686 543992 134390 130348
17268 130348 92182 109294 298226 -17404 -49320 260975 202319 170143 -10022 441579 146963
17256 61419 277489 243984 106789 97423 96890 141541 7330 172028 11252 41167 117228 16028
17243 394697 2202 224212 220371 -144827 313514 103851 97161 519424 45314 567433 510943
17232 510943 205923 421151 75241 329833 181816 466095 405564 171036 109551 113304
17222 113304 280475 146469 261307 -14219 223036 -64120 197342 -16425 290378 148882
17212 148882 405476 548614 75536 573695 514001 315647 137434 25306 406737 9101
17201 260057 350388 254021 117970 309536 8626 178617 343074 243567 120234 -85874 478570
$$ packed form
17279i1789A99782j3887p7932K8463J218J24249j26850J79643K29306A34390m042
17268A30348l8166J7112J88932a7404l1916B60975n8656l2176a0022D41579A46963
17256F1419K16070l3505A06789r366n33M4651G330J64698A1252K9915P6061A6028
17243C94697B202K22010l841a44827C13514A03851o690M22263D5314N22119n6490
17232E10943B05923K15228G5241K54592j48017K84279o0531A71036o1485L753
17222A13304J67171j34006J14838a4219B23036f4120A97342a6425B90378j41496
17212A48882K56594J43138G5536M98159n9694j98354A37434B5306L81431I101
17201B60057R0331r6367A17970J91566H626J69991J64457r9507A20234h5874D78570
$$ plain form
17189 359838 374335 244280 273380 3464 43424 441094 261069 215734 382385 57284 444339
17178 444339 522391 290216 105896 340409 111340 213812 116331 49616 185256 317580
17168 317580 285955 401469 68852 420879 70006 166763 549222 149317 -41038 232786
17157 257479 306150 552376 620612 101520 145593 407736 352251 201791 189051 411713
17147 411713 181549 373182 654271 410141 140787 380372 422739 124042 217260 233471
17137 233471 606546 509892 231079 111628 428411 240610 372504 124475 -15202 138157
17126 295817 587684 384088 521208 355996 72311 286275 312617 199878 23524 275933
17116 275933 704751 209169 426397 410426 161053 330485 469224 417360 207638 352256
$$ packed form
17189C59838J4497j30055K9100C464L9960L97670j80025m5335J66651E7284L87055
17178D44339P8052k32175A05896K34513A11340J02472r7481D9616J35640J32324
17168C17580l1625J15514F8852L52027G0006R6757L82459A49317d1038B32786
17157B57479M8671K46226O8236A01520M4073K62143n5485j50460j2740K22662
17147D11713A81549J91633K81089k44130A40787K39585M2367A24042R3218J6211
17137B33471L73075r6654B31079A11628L16783j87801J31894A24475a5202A38157
17126B95817K91867k03596J37120j65212G2311K13964K6342j12739B3524K52409
17116B75933M28818B09169K17228j5971A61053J69432J38739n1864B07638J44618
$$ plain form
17106 352256 409272 297425 506539 388057 530059 26696 527260 349833 386057 355925
17096 355925 258678 281902 180545 517922 453577 336808 -66232 531833 414901 679051
17086 679051 367263 452933 472110 385456 344600 394270 443928 605159 382350 522246 325098
17075 325098 393246 311603 695970 342388 323366 342219 336298 441403 339422 183386 481269
17064 481269 842067 340676 618525 670868 576259 597038 295912 351697 474269 410687
17054 410687 581645 306442 487395 729267 417367 826922 327803 355118 277949 562913
17044 562913 389186 326039 405396 577092 304405 291630 726056 403867 525426 737961
17034 737961 625211 465507 607258 436376 716649 410128 283484 548055 686115 402245
$$ packed form
17106C52256N7016j11847K09114j18482J42002B6696N00564j77427L6224l0132
17096C55925r7247K3224j01357L37377o4345j16769f6232E31833j16932K64150
17086F79051l11788Q5670J9177q6654m0856M9670M9658J61231k22809J39896j97148
17075C25098O8148q1643L84367C42388j9022J8853n921J05105j01981j56036K97883
17064D81269L60798C40676K77849N2343r4609K0779B95912N5785J22572o3582
17054D10687J70958k75203J80953K41872l11900M09555C27803K7315p7169K84964
17044E62913j73727o3147P9357J71696k72687j2775M34426l22189J21559K12535
17034G37961j12750j59704J41751j70882K80273l06521j26644K64571J38060k83870
$$ plain form
17024 402245 686930 553833 418549 677451 388079 317950 542490 621136 172303 488364
17014 488364 500047 19924 657975 555513 504310 573068 541707 729214 525130 458584 544119
17003 544119 562788 622158 561144 503319 582542 648088 119357 390082 377692 664890 925824
16992 925824 912934 451127 573192 715493 711034 644873 502024 798793 694129 790832
16982 790832 852814 728177 655697 901694 746120 895907 652413 650796 821734 1075849
16972 1075849 679253 541962 722722 1019096 859342 510231 1005451 564473 1046659
16963 1046659 961430 504460 889130 698171 772195 859337 1012245 921541 955986 653430
16953 653430 1174738 841393 533956 863379 797893 1163444 958666 793724 827064 1279301
$$ packed form
17024D02245K84685j33097j35284K58902k89372p0129K24540P8646A72303L16061
17014D88364J1683A9924O38051j02462n1203O8758l1361J87507k04084o6546Q5535
17003E44119J8669N9370o1014n7825P9223O5546A19357K70725j2390K87198K60934
16992I25824j2890D51127J22065J42301m459o6161j42849K96769j04664R6703
16982G90832O1982j24637p2480K45997j55574J49787k43494j617J70938K54115
16972A075849l96596j37291J80760K96374j59754l49111M95220m40978M82186
16963A046659q5229m56970L84670j90959P4024Q7142J52908r0704L4445l02556
16953F53430N21308l33345l07437L29423o5486L65551k04778j64942L3340M52237
$$ plain form
16943 1279301 847444 987364 983582 966679 627837 691448 880454 1024140 1036143 1027976 1087475
16932 1087475 1095678 1370457 1068403 1003495 703932 1066116 1056423 864401 1003910 1110498
16922 1110498 859078 863347 956960 984217 1229280 1291906 1268320 1081624 1014753 1072573 1319874
16911 1319874 1410225 1102470 944280 1048143 1316796 1376180 1472444 1544601 1571434 1463520
16901 1463520 1260014 1161195 1773748 1538060 1480682 1506484 1341336 1367203 1134588 1437464
16891 1437464 1181810 1248924 1430193 1201288 1535192 1573558 1577915 1744047 1838734 1449942
16881 1449942 1753018 1549986 1613820 1579485 1719717 2011080 1407260 1858976 1873406 1930797
16871 1930797 1739913 2058950 1817889 1742855 2012329 2088628 2007362 2171633 2001993 2478858
$$ packed form
16943A279301m31857J39920l782j6903l38842O3611J89006J43686J2003q167N9499
16932A087475Q203K74779l02054o4908k99563L62184r693j92022J39509J06588
16922A110498k51420M269R3613K7257K45063O2626k3586j86696o6871N7820K47301
16911A319874R0351l07755j58190J03863K68653N9384R6264P2157K6833j07914
16901A463520k03506r8819O12553k35688n7378K5802j65148K5867k32615L02876
16891A437464k55654O7114J81269k28905L33904L8366M357J66132R4687l88792
16881A449942L03076k03032O3834l4335J40232K91363o03820M51716J4430N7391
16871A930797j90884L19037k41061p5034K69474P6299q1266J64271j69640M76865
$$ plain form
16861 2478858 1888851 2281693 2208347 2196835 2111192 2469885 2264866 2083786 2446862 2609006
16851 2609006 2448161 2410354 2276659 2907518 2462238 2695408 2541086 2747517 2574563 2714110
16841 2714110 2859918 2969211 2839044 2696416 3136015 3363000 3192039 3285268 3260121 2987087
16831 2987087 3164084 3672289 3399961 3415202 3479723 3370324 3661681 3878723 3830494 3791631
16821 3791631 3666825 4147832 3986627 4053716 3969620 4178568 4501516 4007401 4311002 4420597
16811 4420597 4502209 4750039 4466285 4817630 5041193 4974511 5267664 5452583 5084103 5582143
16801 5582143 5190121 5752840 5436718 5633132 5811442 5874148 6519877 6456015 6390831 6492149
16791 6492149 7026487 7101129 7143657 7241097 7645161 7742735 7819522 7890274 8173304 8270363 8347205
$$ packed form
16861B478858n90007L92842p3346j1512q5643L58693k05019j81080L63076J62144
16851B609006j60845l7807j33695O30859m45280K33170j54322K06431j72954J39547
16841B714110J45808J09293j30167j42628M39599K26985j70961R3229k5147k73034
16831B987087J76997N08205k72328J5241O4521j09399K91357K17042m8229l8863
16821C791631j24806M81007j61205O7089q4096K08948L22948m94115L03601J09595
16811D420597Q1612K47830k83754L51345K23563o6682K93153J84919l68480M98040
16801E582143l92022N62719l16122J96414J78310O2706O45729o3862o5184J01318
16791F492149N34338P4642M2528R7440M04064R7574P6787P0752K83030R7059P6842
$$ plain form
16780 8347205 8473683 8901311 9131655 9076156 9944291 10405344 10527495 10898743 11236303 11813256
16770 11813256 11814713 12172670 12669021 13031861 13348486 13999923 14191911 14748609 15617297 15731895
16760 15731895 15989138 17027700 17722335 18582422 19262995 19761034 20730079 21528297 22649157
16751 22649157 23668833 24646456 25931048 27040870 28419587 29672232 31232159 32783205
16743 32783205 34655100 36472892 38442848 40421643 42678347 45066887 47834385 50870548
16735 50870548 53723455 57186846 60582788 64795269 68771433 72946912 77672379 82227205
16727 82227205 87811165 92928926 98073486 103155198 108381387 113218403 117425170 121387240
16719 121387240 124847526 127310310 129673707 130667804 131641695 131782595 131827756 131028548 130175115
$$ packed form
16780H347205J26478M27628K30344n5499Q68135M61053J22151L71248L37560N76953
16770A1813256J457L57957M96351L62840L16625O51437J91988N56698Q68688J14598
16760A5731895K57243J038562O94635Q60087O80573M98039R69045P98218J120860
16751B2649157J019676R77623J284592J109822J378717J252645J559927J551046
16743C2783205J871895J817792J969956J978795K256704K388540K767498L036163
16735E0870548K852907L463391L395942M212481L976164M175479M725467M554826
16727H2227205N583960N117761N144560N081712N226189M837016M206767L962070
16719A21387240L460286K462784K363397R94097R73891J40900M5161p99208q53433
$$ plain form
16710 130175115 129244293 128112490 126561002 125042211 123366730 121486272 119590655 117572413
16702 117572413 115986180 113869525 112343290 110127805 107972275 105632982 103392719 101295790
16694 101295790 98544256 96575370 93678055 91306772 88554734 86200423 83698831 81204438
16686 81204438 78589258 75723823 73210160 71200777 68375411 66257424 64453718 61799211
16678 61799211 59819194 57906108 55857664 53950911 51979753 50204844 48642647 47142847
16670 47142847 45077854 44024126 42550414 41205824 39610426 38253492 37334149 35938911
16662 35938911 34758301 34012446 32578852 31843099 30389886 29653969 28730965 27989436 27085469
16653 27085469 26244072 25692915 24620525 24254911 23143352 22455662 21904098 21329708 20567949
$$ packed form
16710A30175115r30822j131803j551488j518791j675481j880458j895617k018242
16702A17572413j586233k116655j526235k215485k155530k339293k240263k096929
16694A01295790k751534j968886k897315k371283k752038k354311k501592k494393
16686H1204438k615180k865435k513663k009383k825366k117987j803706k654507
16678F1799211j980017j913086k048444j906753j971158j774909j562197j499800
16670D7142847k064993j053728j473712j344590j595398j356934r19343j395238
16662C5938911j180610p45855j433594p35753j453213p35917r23004p41529r03967
16653B7085469q41397n51157j072390l65614j111559o87690n51564n74390p61759
$$ plain form
16644 20567949 20092732 19507774 18776919 18629048 18108324 17386706 16746248 16575020 16024934
16635 16024934 15552198 14845900 14868234 14592714 13689881 13703103 13364787 12699873 12071427 11998220
16625 11998220 11706661 11233586 10974411 10711675 10339075 10029094 9658753 9613350 9480872
16616 9480872 9032744 8741408 8475406 8429108 8094566 7650592 7574480 7513520 7199849 7269419
16606 7269419 6973630 6630841 6643408 6152874 6215151 6023832 5880996 5644728 5470997 5516209
16596 5516209 5600043 5018485 4944791 4890420 4940654 4611777 4673624 4782390 4091899 4228382
16586 4228382 4264532 4088508 4153924 4048750 3696849 3891147 3350405 3560044 3226239 3310354
16576 3310354 3321643 3149790 2967197 3071580 2933456 2791303 3115048 2968180 2645703 2851479
$$ packed form
16644B0567949m75217n84958p30855j47871n20724p21618o40458j71228n50086
16635A6024934m72736p06298K2334k75520r02833J3222l38316o64914o28446p3207
16625A1998220k91559m73075k59175k62736l72600l09981l70341m5403j32478
16616I480872m48128k91336k66002m6298l34542m43974p6112o0960l13671O9570
16606G269419k95789l42789J2567m90534O2277j91319j42836k36268j73731M5212
16596E516209Q3834n81558p3694n4371N0234l28877O1847J08766o90491J36483
16586D228382L6150j76024O5416j05174l51901J94298n40742K09639l33805Q4115
16576C310354J1289j71853j82593J04383j38124j42153L23745j46868l22477K05776
$$ plain form
16566 2851479 3101266 2691903 2526800 2439830 2559939 2502247 2505709 2325575 2427958 2503574
16556 2503574 2384878 2237078 2370407 1960130 2009611 2151729 2073097 1951311 2027350 1963187
16546 1963187 1538374 1735985 1789268 1967882 1696075 1516720 1927649 1607056 1821277 1288772
16536 1288772 1657660 1419411 1417070 1359785 1521438 1484051 1459371 1423809 1230303 1352186
16526 1352186 1293473 1345100 1303877 1230456 1286253 1662589 1183067 1064923 917361 1009460
16516 1009460 1265403 1144847 1093089 862898 982931 998537 1058458 1187392 1113264 913551
16506 913551 1226512 979810 1235549 786967 848073 1108701 966984 889166 842890 686446
16496 686446 1044362 901014 1003227 812970 806242 972927 950064 728439 721418 924902
$$ packed form
16566B851479K49787m09363j65103q6970J20109n7692L462j80134J02383P5616
16556B503574j18696j47800J33329m10277M9481J42118p8632j21786P6039o4163
16546A963187m24813J97611N3283J78614k71807j79355M10929l20593K14221n32505
16536A288772L68888k38249k341n7285J61653l7387k4680l5562j93506J21883
16526A352186n8713N1627m1223p3421N5797L76336m79522j18144j47562R2099
16516A009460K55943j20556n1758k30191J20033J5606N9921J28934p4128j99713
16506I13551L12961k46702K55739m48582O1106K60628j41717p7818m6276j56444
16496F86446L57916j43348J02213j90257o728J66685k2863k21625p021K03484
$$ plain form
16486 924902 805765 772680 876021 618919 767438 717803 518030 590944 743287 620085
16476 620085 790341 721190 336192 748915 773632 714811 227544 823347 748723 669114
16466 669114 620590 692805 647933 661062 258825 600538 575951 535913 214575 825923 468966
16455 468966 729936 528400 523367 435297 809031 491321 655304 337887 308458 752781
16445 752781 414071 713859 518553 278470 257963 551232 727176 430461 27581 392376
16435 392376 382989 81394 450980 616547 594527 801242 468842 479418 406961 373455 278856
16424 278856 494042 -14570 187635 295373 264251 126379 613232 192419 450661 55897
16413 360536 636951 95760 193014 200711 164895 480591 457132 250964 57171 276405 714380
$$ packed form
16486I24902j19137l3085J03341k57102J48519m9635j99773P2914J52343j23202
16476F20085J70256o9151C36192M12723K4717n8821B27544N95803p4624p9609
16466F69114m8524P2215m4872J3129B58825L41713k4587m0038B14575O11348l56957
16455D68966K60970k01536n033q8070L73734l17710J63983l17417k9429M44323
16445G52781l38710K99788j95306k40083k0507K93269J75944k96715B7581L64795
16435C92376r387H1394L69586J65567k2020K06715l32400J0576p2457l3506r4599
16424B78856K15186a4570A87635J07738l1122A26379M86853A92419K58242E5897
16413C60536K76415I5760R7254P697l5816L15696k3459k06168E7171K19234M37975
$$ plain form
16402 714380 205458 530263 274413 208227 22833 64492 409330 328043 -18895 269336
16391 163062 268421 345475 261315 109526 365889 190412 627830 556588 546786 344314
16381 344314 393150 216437 296090 317438 152215 -21634 52553 180790 251173 53439 228853
16370 228853 179431 49632 166813 488391 73005 402388 218309 453422 160180 421468
16360 421468 390049 -8833 134091 18023 451284 333099 25783 -108748 345866 164851
16349 340758 300743 360848 275003 333712 387125 352950 400668 187167 203913 22473 161157
16338 161157 101460 25169 269925 66005 98582 152594 7272 80113 295455 -260417 88447
16326 134074 245430 -102398 235210 213166 266562 171785 460399 212857 298959 47463
$$ packed form
16402G14380B05458L24805k55850o6186B2833M1659L44838q1287a8895B69336
16391A63062J05359P7054q4160A09526K56363j75477M37418p1242r802k02472
16381C44314M8836j76713P9653K1348A52215b1634E2553J28237P0383E3439J75414
16370B28853m9422D9632J17181L21578G3005L29383j84079K35113A60180K61288
16360D21468l1419h833A34091A8023M33261j18185B5783a08748C45866A64851
16349C40758m0015O0105q5845N8709N3413l4175M7718A87167J6746B2473J38684
16338A61157n9697B5169K44756F6005L2577N4012G272P2841K15342b60417H8447
16326A34074J11356a02398B35210k2044N3396r4777K88614B12857Q6102D7463
$$ plain form
16315 58733 -58584 -96668 130680 378491 109170 49906 26951 149325 -14601 -88914 29372
16303 -57917 65982 -18292 -70315 302240 136697 -123140 167672 174882 -95577 51164 66007
16292 66007 -76788 -129606 168153 -40984 294731 159965 193978 236500 481405 398858 -54772
16280 -47545 51990 -76344 188307 74257 60280 67268 107112 -178869 268735 -64030 140636
16268 -315186 -232894 -58116 -47765 268477 70640 -149308 -85735 108402 242948 13525 180292
16257 180292 -6794 37046 214637 -23508 248530 -166209 -203201 -38475 -137123 22537 262639
16246 262639 -44939 63587 -169662 -82311 158143 253636 336729 -377809 136567 11482 -57737
16234 134821 -13543 -17551 -70199 136893 136964 271189 -7438 119024 1408 -163508 -9228 -103249
$$ packed form
16315E8733e8584l8084A30680K47811A09170D9906k2955J22374a4601p4313B9372
16303e7917F5982a8292n2023C02240A36697a23140A67672P210i5577E1164J4843
16292F6007g6788n2818A68153d0984B94731j34766L4013M2522K44905q2547e4772
16280d7545E1990g6344A88307G4257j3977O988L9844a78869B68735f4030A40636
16268c15186Q2292e8116J0351B68477G0640a49308O3573A08402J34546A3525J66767
16257A80292f794C7046J77591b3508B48530a66209l6992c8475r8648B2537K40102
16246B62639d4939F3587a69662h2311A58143R5493Q3093c77809A36567A1482e7737
16234A34821a3543m008n2648A36893P1J34225g438A19024A408a63508i228r4021
$$ plain form
16222 -103249 273049 19690 104283 27643 -341451 -177520 -13173 153854 150102 88940 252731
16211 252731 6128 52139 -110329 -75061 -155174 -156391 149078 -134042 52003 -111339 -246316
16200 -246316 -71164 -128356 164327 -172064 118603 -4384 -124193 190147 78789 202201
16190 202201 81882 33984 -325211 -290493 189676 82937 -32861 -10369 366705 49865 -13785
16178 -49630 -206610 -90746 -250673 72934 176784 -16259 214645 51953 -112360 150140
16167 392276 -204016 -307589 -235176 121401 92141 170400 -153425 -116859 -198626 150326
16156 -32743 656536 -91598 -96988 45898 -91014 -208547 -292827 -185104 -120376 86529 126538
16145 126538 94425 -81722 -71194 -215701 176305 12116 176093 -4160 152184 -46055 10920
$$ packed form
16222a03249B73049A9690Q4593B7643c41451J63931a3173A53854l752o1162J63791
16211B52731F128M6011a10329L5268q0113j217A49078a34042E2003a11339j34977
16200b46316g1164n7192A64327a72064A18603d384j19809A90147G8789J23412
16190B02201H1882C3984c25211L4718A89676H2937c2861a0369C66705D9865a3785
16178d9630j56980i0746j59927G2934J03850a6259B14645E1953a12360A50140
16167C92276b04016j03573P2413A21401k9260P8259a53425L6566q1767A50326
16156c2743F56536i1598n390D5898i1014j17533q4280J07723O4728H6529M0009
16145A26538l2113h1722J0528j44507A76305A2116J63977d160A52184d6055A0920
$$ plain form
16133 72921 234523 328254 360860 -98654 128504 -17488 -158481 131588 -337623 -344178 -155423
16121 97009 152986 -18400 115788 -334407 52674 3637 -261850 284610 289851 10595 -103305
16109 -234513 -6885 -407385 326962 -299522 164630 -39147 41036 -32517 182708 -260415
16098 -100566 67529 -51614 6496 236630 109060 -225491 77261 -37212 241387 247647 -91557
16086 -347161 32773 216209 189753 45199 72781 -9262 48866 -204884 -153716 291997 -246275
16074 53901 284811 145715 -1176 -34284 -126628 -67730 -96018 -34246 160000 67869 -54016
16062 -332287 97183 331756 -212711 301306 -164066 74434 -213343 -210404 -3562 -126529 -189383
16051 -189383 126109 -178075 -12975 102100 85287 -166319 -185072 87692 -78888 -189517
$$ packed form
16133G2921J61602R3731L2606i8654A28504a7488j40993A31588c37623o555a55423
16121I7009N5977a8400A15788c34407E2674C637b61850B84610N241A0595a03305
16109b34513f885m00500C26962b99522A64630c9147D1036c2517A82708b60415
16098a00566F7529e1614F496K30134A09060b25491G7261c7212B41387O260i1557
16086c47161C2773J83436k6456D5199K7582i262D8866b04884N1168B91997b46275
16074E3901K30910j39096a176l3108r2344N8898k8288c4246A60000F7869e4016
16062c32287I7183K34573b12711C01306a64066G4434b13343K939c562j22967o2854
16051a89383A26109a78075a2975A02100j6813a66319j8753H7692g8888j10629
$$ plain form
16041 -189517 -14812 -220312 -71306 -35270 -221430 -203257 -41324 -175067 -245286 -286915 -130703
16029 3655 -180965 114238 -380204 24778 -376027 -78077 -254859 203735 176357 98174 94425
16018 94425 67417 269828 -221558 -59373 -200513 -98358 26607 23935 -16843 -66918 6329
16006 -59140 15803 63064 38671 134794 -149984 246073 -223367 304309 -77223 133925 128365
15995 128365 27235 -279143 -356389 -453369 270241 -163817 273759 149439 -31270 176492
15984 -115480 -48068 -20039 -26435 -271557 -50802 113919 235757 73123 262012 -138505 -48691
15972 231929 137684 59160 34715 156813 111870 -167759 205657 81959 -293739 92657 -315236
15960 -56711 43473 100749 -81695 431673 -271381 -111390 194134 -70837 -332529 -112323
$$ packed form
16041a89517a4812k05500g1306c5270j86160J8173d1324j33743p0219m1629a30703
16029C655a80965A14238c80204B4778c76027g8077j76782B03735k7378p8183l749
16018I4425k7008K02411b21558e9373j41140i8358B6607k672a6843n0075F329
16006e9140A5803M7261k4393R6123a49984B46073b23367C04309g7223A33925n560
15995A28365B7235b79143p7246r6980B70241a63817B73759j24320c1270A76492
15984a15480d8068b0039o396k45122e0802A13919J21838G3123J88889a38505d8691
15972B31929r4245E9160k4445J22098m4943a67759B05657H1959b93739I2657c15236
15960e6711D3473N7276h1695D31673b71381a11390A94134g0837k61692a12323
$$ plain form
15949 -82362 -19140 -339620 -72346 -186625 -176445 8630 -11747 89742 -129871 -13561 -87697
15938 -87697 -215982 101906 308078 -198396 -44023 -32385 -143064 -82248 -13268 101446
15927 418213 -108561 -106580 6703 -21945 105949 -438603 -78854 -138060 65992 -212374 -130218
15916 -130218 -107700 56400 -96877 187910 -210422 -9854 -103209 -145616 -209478 140395 -166923
15904 197151 9046 20969 -121645 -157465 -29982 -77516 40907 -205555 -57045 -38278 -204977
15893 -204977 322097 117286 -331141 131359 161536 6245 70554 -95386 -90018 -63185 22560
15881 -431297 49723 -106298 48238 51022 54481 -62985 -32302 21211 -51092 -99924 16098 -73236
15868 15057 140528 -94910 23532 326120 83588 -48284 -266575 -168856 -125902 -182197 -64113
$$ packed form
15949h2362a9140l20480g2346j14279J0180H630a1747H9742a29871a3561p4136
15938h7697j28285A01906K06172a98396d4023J1638j10679O0816a3268A01446
15927D18213a08561J981F703b1945A05949d38603g8854n9206F5992b12374Q2156
15916a30218K2518E6400i6877A87910b10422i854r3355m2407o3862A40395a66923
15904A97151I046J1923a21645l5820b9982m7534D0907b05555e7045J8767j66699
15893b04977C22097A17286c31141A31359L0177F245O4309i5386N368K6833B2560
15881d31297D9723a06298D8238K784L459f2985L0683B1211e1092m8832A6098g3236
15868A5057J25471i4910B3532L02588H3588d8284k18291R7719M2954n6295f4113
$$ plain form
15856 -321469 -14567 72747 -152068 16168 -10978 -146202 -24632 -43323 5494 33606 -478319
15844 7417 -173014 -255071 -30762 7820 -324694 -238241 -362205 -186478 -100330 -351532 256318
15832 60477 -286133 110713 -86582 135280 77550 -220377 -258307 221161 140662 109456 321424
15821 321424 -260422 6192 -101188 257516 -28841 -53832 -262105 -160560 149242 -379019
15810 99089 266975 101292 26127 44422 46079 67941 128566 327685 327044 -477452 152485
15798 118647 -14543 88216 -9548 -138602 -60915 -188494 -98181 -31303 162430 230106 -311840
15786 -64687 -89149 -200371 -287466 -255967 142088 -72322 -25717 -164304 -54898 -230905 -165404
15775 -165404 -366599 171327 -69994 -8038 -166207 34615 -245033 -110510 -75431 17749 -136665
$$ packed form
15856c21469a4567G2747a52068A6168a0978j35224b4632j8691E494K8112d78319
15844G417a73014q2057c0762G820c24694Q6453j23964J75727Q6148k51202B56318
15832F0477b86133A10713h6582A35280n7730b20377l7930B21161q0499l1206K11968
15821C21424b60422F192a01188B57516b8841k4991k08273J01545A49242c79019
15810I9089J67886A01292B6127J8295J657K1862O0625J99119o41d77452A52485
15798A18647a4543H8216i548j29054f0915j27579R0313c1303A62430O7676c11840
15786f4687k4462j11222q7095L1499A42088g2322b5717j38587e4898j76007O5501
15775a65404k01195A71327f9994h038j58169C4615b45033a10510L5079A7749a36665
$$ plain form
15763 -122336 -305044 284595 29542 -53254 -24525 -254425 308065 -82564 145525 -75605
15752 -64444 -238415 -194900 -101404 -334676 12674 294676 -72056 146154 -37068 -335928 -180568
15741 -180568 -170791 225054 -111997 -396732 441206 136883 -4379 -188948 22967 -79751 -7194
15729 25844 43584 58708 -173027 273747 -123776 -109940 -359626 -36824 -120593 294856 6623
15717 47304 378162 191341 -50959 -247726 -27155 -41396 -206362 -70915 -12563 22676 33482
15706 33482 -1828 -94175 -166336 -28760 73564 -176223 36434 -341214 -17006 147484 -115994
15694 94094 -12692 -40016 -261153 -182233 55879 247625 -275260 -133344 90840 -43630 28871
15682 349084 -84503 -182717 96017 336820 -291914 119770 201916 -29088 -10665 -75456 1686
$$ packed form
15763a22336j82708B84595B9542e3254b4525k29900C08065h2564A45525g5605
15752f4444j73971M3515R3496k33272A2674K82002g2056A46154c7068k98860J55360
15741a80568R777B25054a11997k84735D41206A36883d379j84569B2967g9751g194
15729B5844J7740J5124a73027B73747a23776J3836k49686c6824q3769B94856F623
15717D7304L30858j86821e0959j96767b7155j4241j64966g0915a2563B2676J0806
15706C3482a828r2347p2161b8760G3564a76223C6434c41214a7006A47484a15994
15694I4094a2692k7324k21137P8920E5879J91746b75260a33344I0840d3630B8871
15682C49084h4503r8214I6017K40803b91914A19770Q2146b9088a0665o4791A686
$$ plain form
15670 18478 -16359 43072 -43642 -50285 -238868 -120936 192140 -136010 164490 65820 -246299
15658 47696 95880 -116028 -209683 33317 -149337 -193451 -68680 13787 -112301 17015 -28037
15646 159693 -53432 61011 -237745 173620 -102962 -90101 88042 114269 -51330 152583 -27835
15634 -72415 321077 -240001 8657 -123578 -71445 -108815 -33799 77968 45799 -88813 -64419
15623 -64419 -155037 -32884 -186301 -77094 -99612 140980 -54633 -42677 -141518 -30469 -39700
15612 -39700 -12161 -29860 -42881 180598 -11097 -122894 -242340 -191882 -218448 -68427 -3269
15600 85524 269571 25417 129412 -256500 -7782 -146575 70897 119119 -148554 -336384 -65884
15588 112088 -335859 -125038 -162423 234743 -6203 203838 72881 101746 152992 -308036 -175601
$$ packed form
15670A8478a6359D3072d3642o643j88583J17932A92140a36010A64490F5820b46299
15658D7696M8184a16028r3655C3317a49337m4114f8680A3787a12301A7015b8037
15646A59693e3432F1011b37745A73620a02962J2861H8042K6227e1330A52583b7835
15634g2415C21077b40001H657a23578N2133l7370c3799G7968l2169h8813K4394
15623f4419r0618c2884j53417g7094k2518A40980e4633J1956r8841c0469r231
15612c9700a2161j7699j3021A80598a1097j11797j19446N0458k6566f8427c269
15600H5524J84047B5417J03995b56500g782j38793G0897M8222a48554j87830f5884
15588A12088c35859a25038l7385B34743f203B03838G2881K8865N1246c08036J32435
$$ plain form
15577 -175601 331438 110796 15590 -144888 237253 -263865 73326 -221800 -218464 -92675
15566 -4898 -98198 -141067 -259713 112833 37742 -304553 -101382 95299 -25796 -159569 -365108
15555 -365108 213280 -89737 -413 -129699 -224859 -185966 254807 168902 41568 53368 -70658
15543 -48764 315607 18972 -159543 -88553 79166 -80981 -157474 47711 37869 -74350 -171637
15532 -171637 207938 -124507 -100084 -343626 145131 -159235 -3048 214143 97628 143220
15522 143220 -3056 155766 27955 -134751 145671 -250142 -339774 112540 48089 -247053
15511 -77003 -109233 105557 -220725 -124139 45667 97404 -158860 299932 -237395 -34404 -76624
15500 -76624 -61662 -53012 346560 12988 -127708 58571 10708 225935 -226688 157288 -261549
$$ packed form
15577a75601C31438A10796A5590a44888B37253b63865G3326b21800L336i2675
15566d898r3300m2869j18646A12833C7742c04553a01382I5299b5796j33773k05539
15555c65108B13280h9737d13j29286r5160L8893B54807q5905D1568J1800g0658
15543d8764C15607A8972a59543P0990G9166h0981p6493D7711r842g4350r7287
15532a71637B07938a24507K4423k43542A45131a59235c048B14143I7628M5592
15522A43220c056A55766B7955a34751A45671b50142q9632A12540D8089b47053
15511g7003l2230A05557b20725R6586D5667N1737a58860B99932b37395c4404m2220
15500g6624J4962Q650C46560A2988a27708E8571A0708K15227b26688A57288b61549
$$ plain form
15488 354320 -279674 -114633 -228736 -397656 19330 -180396 -322453 365266 -254025 254428
15477 -242891 92807 -188408 -169840 78423 -51358 146351 -23701 1473 -277729 238199 132877
15466 132877 -231659 27575 62233 -4546 -218957 -155143 39445 324307 64782 -76952 117387
15454 166550 151973 -140807 94011 235629 -126421 88417 188877 -107038 78022 72534 -261531
15442 37236 125381 -109962 -371858 -130893 229486 9009 -105539 112116 48962 189021
15432 189021 -84240 -153159 69524 -56963 -89011 -70536 180130 -271320 8314 -331776 -141232
15420 216489 284990 7514 -121933 -185588 -71740 -247908 15265 -55028 64101 2908 -62449
15408 379901 -64107 298684 -46438 78917 398889 -15892 -180313 88584 262776 168880 108632
$$ packed form
15488C54320b79674a14633j14103j68920A9330a80396j42057C65266b54025B54428
15477b42891I2807a88408J8568G8423e1358A46351b3701A473b77729B38199j05322
15466A32877b31659B7575L4658d546k14411O3814C9445K84862F4782g6952A17387
15454A66550j4577a40807I4011J41618a26421H8417J00460a07038G8022n488b61531
15442C7236Q8145a09962k61896a30893B29486I009a05539A12116D8962J40059
15432A89021h4240o8919F9524e6963l2048J8475A80130b71320H314c31776a41232
15420B16489O8501G514a21933o3655g1740j76168A5265e5028F4101B908f2449
15408C79901f4107B98684d6438G8917L19972a5892j64421H8584J74192r3896o0248
$$ plain form
15397 108632 -92282 57167 221557 -10023 -200628 63107 60130 -58179 -46915 -57076 -142885
15386 -142885 -149241 131601 -30670 -167384 56687 -267063 299898 1656 -78667 42568 211480
15375 211480 161763 -151780 242504 199650 8451 -136647 244192 -133886 -17920 -160737
15365 -160737 183045 140850 17693 -13254 -113337 31164 -113162 -175200 86375 45646 -52459
15353 -262245 -128927 -477276 -42579 89554 -40162 311896 161800 -88786 64080 -389941
15342 -13481 -118104 -89284 74009 185617 -55622 -226999 -188816 64182 -50134 -11619 -174791
15331 -174791 175502 -86118 51004 -105805 362906 -58163 -327996 -22972 -87587 -125653 303515
15319 23715 22965 19957 50496 16361 -52551 402336 296756 -26495 283172 196554 362883
$$ packed form
15397A08632i2282E7167J64390a0023j90605F3107k977e8179J1264j0161q5809
15386a42885o356A31601c0670j36714E6687b67063B99898A656g8667D2568J68912
15375B11480m9717a51780B42504m2854H451a36647B44192a33886a7920j42817
15365a60737A83045m2195A7693a3254j00083C1164a13162o2038H6375m0729e2459
15353b62245a28927l48349d2579H9554d0162C11896j50096h8786F4080c89941
15342a3481j04623K8820G4009J11608e5622j71377L8183F4182e0134a1619j63172
15331a74791A75502h6118E1004a05805C62906e8163k69833b2972o4615l8066C03515
15319B3715p50l008L0539A6361e2551D02336j05580b6495B83172q6618J66329
$$ plain form
15308 362883 -74791 64317 39919 206619 -337021 26840 -187450 113852 174077 91199 132762
15297 132762 57007 -56685 66038 249825 -200010 67518 72954 143067 208765 215715 785 156305
15285 156305 99588 49490 94492 -161524 263827 -13613 -218665 277055 -127881 -93285
15275 -93285 -178043 -52649 98578 347662 -129729 173764 167197 266146 272722 -209385 112150
15263 111274 -18022 -274948 261358 128466 157048 83803 58821 -42036 -60107 408414 64824
15251 -130876 11861 186586 99190 236621 363867 169493 498206 244449 58974 499478
15241 499478 305947 157723 496098 164655 372992 197632 467173 373921 400477 -14450
15230 -189544 275383 -49201 262883 116376 253229 131471 -15016 151374 129770 255229
$$ packed form
15308C62883g4791F4317k4398J66700c37021B6840a87450A13852O0225q2878M1563
15297A32762E7007e6685F6038J83787b00010F7518N436P0113O5698O950G85J55520
15285A56305n6717D9490M5002a61524B63827a3613k05052B77055a27881L4596
15275i3285q4758e2649I8578K49084a29729A73764o567R8949O576b09385A12150
15263A11274a8022k56926B61358A28466K8582p3245k4982d2036j8071D08414F4824
15251a30876A1861J74725q7396J37431J27246A69493L28713B44449E8974M40504
15241D99478j93531j48224L38375A64655K08337j75360K69541r3252K6556a4450
15230a89544B75383d9201B62883A16376J36853j21758a5016A51374k1604J25459
$$ plain form
15220 255229 -24103 135069 -25283 60115 -75071 391455 -143093 228223 -48242 297582
15209 258535 123583 113631 100032 -43839 -82653 111783 380074 -47451 50708 46835 -50375
15197 -202572 177502 46779 13160 354430 -131532 135008 40740 393863 79137 95295
15187 95295 78946 6015 80415 -242371 72654 -100786 -108758 181135 51560 -262162 91244
15175 -119940 246484 117467 70998 325369 147230 257113 247181 -195276 131127 199343
15165 199343 -32290 -89692 201827 26725 101468 16810 214542 297579 63721 88815 182617
15154 182617 -63077 63382 66064 -59741 -9770 209304 -155743 325736 -133369 -218526 -97400
15142 146936 -189829 173232 27321 44614 23137 127702 212177 -85951 7890 270208 250381
$$ packed form
15220B55229b4103A35069b5283F0115g5071C91455a43093B28223d8242B97582
15209B58535A23583r952j3599d3839l8814A11783K68291d7451E0708l873e0375
15197b02572A77502D6779A3160L41270a31532A35008D0740L53123G9137J6158
15187I5295j6349F015P4400b42371G2654a00786p972A81135E1560b62162I1244
15175a19940B46484A17467m6469K54371A47230J09883r932a95276A31127O8216
15165A99343c2290n7402B01827B6725P4743A6810J97732Q3037F3721K5094R3802
15154A82617f3077F3382K682e9741i770B09304a55743C25736a33369q5157i7400
15142A46936a89829A73232B7321J7293k1477J04565Q4475h5951G890K62318j9827
$$ plain form
15131 250381 216079 -199098 433904 187725 82637 99275 365432 89783 198131 305320
15121 305320 80663 5069 -107226 112493 319966 -9348 34013 92690 -242337 315813 5286
15109 412070 -161413 328739 188013 -166208 -37928 88807 192464 257519 159980 2923 -50096
15097 162465 245880 -77356 153040 374089 342950 2510 37537 377103 133879 114759 172728
15086 172728 127857 260176 -137148 263806 167812 95311 188778 310644 23044 62642 233085
15075 233085 60387 -18895 565571 75172 217345 142744 304376 50038 444759 175948
15064 266303 108787 -41673 76355 255860 211866 416349 144213 -2653 43556 33663 63765
15053 63765 -129716 119984 159332 292236 138455 333935 191823 32913 381292 134419
$$ packed form
15131B50381l4302a99098D33904A87725H2637J6638K66157H9783J08348J07189
15121C05320H0663E069a07226A12493K07473i348C4013N8677b42337C15813E286
15109D12070a61413C28739j40726a66208c7928H8807J03657O5055r7539B923e0096
15097A62465Q3415g7356A53040K21049l1139B510L5027L39566A33879j9120N7969
15086A72728m4871J32319a37148B63806r5994p2501R3467J21866B3044L9598J70443
15075B33085F0387a8895E65571G5172J42173p4601J61632E0038L94721A75948
15064B66303A08787d1673G6355J79505m3994K04483A44213b653D3556r893L0102
15053F3765a29716A19984L9348J32904A38455J95480j42112C2913L48379A34419
$$ plain form
15042 -238825 292748 324286 -46156 176044 181081 103320 334223 215169 162958 239454 233920
15031 233920 161029 260424 250671 -98166 60306 277480 -11810 17677 17446 266897 253162 21870
15018 -185277 552769 196038 218688 310296 126193 -123149 205599 243164 52658 205650
15008 205650 -9583 -42230 323210 595293 -37788 358696 38853 94358 195982 72442 483033
14997 483033 98557 79290 185602 51453 277205 279616 234844 84838 37626 80192 264975
14986 264975 208699 240396 -19293 283283 117335 555197 39284 151150 95762 240728
14976 240728 314243 337822 -314668 242169 50966 289516 183911 104682 353778 43562
14965 45174 -13219 56494 429047 367175 264779 229699 109731 262897 492668 -93601 412334
$$ packed form
15042b38825B92748L1538d6156A76044N037p7761K30903j19054n2211P6496n534
15031B33920p2891R9395r753i8166F0306K17174a1810A7677k31K49451j3735B1870
15018a85277E52769A96038K2650R1608A26193a23149B05599L7565E2658J52992
15008B05650i583l2647C23210K72083c7788C58696C8853N5505J01624G2442M10591
14997D83033I8557j9267J06312E1453K25752K411m4772H4838C7626M2566J84783
14986B64975n6276L1697a9293B83283A17335M37862C9284J11866n5388J44966
14976B40728P3515K3579c14668B42169E0966K38550j05605p9229K49096D3562
14965D5174a3219E6494L72553o1872j02396l5080A09731J53166K29771i3601D12334
$$ plain form
14953 -6714 271723 312340 122066 193968 294315 123598 187829 356635 -160562 269223
14942 14681 256223 -217093 461397 40599 366881 276831 93821 260249 325708 65857 292102
14931 292102 212299 48873 274610 -22499 20348 258470 422803 495575 493498 323823 90830
14919 146313 122712 49308 325982 173713 257366 320107 284662 296302 53842 346615 241242
14908 241242 298041 442167 305667 371335 407598 143969 388212 431311 591778 164444
14897 555477 49908 358823 465102 53945 199514 387870 461618 129696 63247 326435
14887 326435 186804 463637 302399 332577 -14056 140066 571830 493291 305101 -56527
14876 6834 152397 159800 273933 769 367238 383067 275568 300861 352134 199929 240872
$$ packed form
14953f714B71723M0617A22066P1902J00347A23598O4231J68806a60562B69223
14942A4681K41542b17093D61397D0599L26282r0050I3821J66428O5459F5857K26245
14931B92102p9803D8873K25737b2499B0348K38122J64333P2772k077j69675I0830
14919A46313k3601D9308K76674j52269Q3653O2741l5445J1640E3842K92773j05373
14908B41242N6799J44126j36500O5668L6263A43969K44243M3099J60467A64444
14897E55477D9908L08915J06279E3945J45569J88356P3748A29696F3247K63188
14887C26435j39631K76833j61238L0178a4056A40066M31764p8539j88190e6527
14876F834J45563P403J14133G69L66469J5829j07499K5293N1273j52205M0943
$$ plain form
14865 240872 225612 474564 378089 306790 294229 375004 367263 663369 -77272 292753 414386
14854 414386 622263 523844 561373 343381 544799 147995 172034 605338 495567 467869
14844 467869 499834 661432 585903 474867 328105 470066 604517 502764 783666 293031
14833 237972 381312 617885 443283 628757 271634 494719 531075 392298 609098 433316
14823 433316 518818 546535 280397 358774 296553 520809 401972 218128 337991 61591
14812 717424 415161 353259 467144 310632 919800 461175 382103 665649 330179 366123
14802 366123 633742 906834 650297 620266 439855 557990 472653 654748 527974 367487
14792 367487 300935 367360 513187 782012 425705 590756 721939 402966 377875 546310
$$ packed form
14865B40872j5260K48952r6475p1299j2561Q0775p741K96106g7272B92753J21633
14854D14386K07877r8419L7529k17992K01418A47995K4039M33304j09771k7698
14844D67869L1965J61598p5529j11036j46762J41961J34451j01753K80902B93031
14833B37972J43340K36573j74602J85474B71634K23085L6356j38777K16800j75782
14823D33316Q5502K7717k66138P8377o2221K24256j18837j83844J19863F1591
14812G17424l02263o1902J13885j56512O09168m58625p9072K83546C30179L5944
14802C66123K67619K73092k56537l0031j80411J18135q5337J82095j26774j60487
14792C67487o6552O6425J45827K68825l56307J65051J31183l18973k5091J68435
$$ plain form
14782 546310 809264 239171 385913 588352 561431 438319 571443 232811 843789 410534
14771 395540 389623 817060 366539 630298 368500 356383 473150 535417 534069 725277 544533
14760 544533 411459 467985 716829 523526 475228 571561 605718 823413 606206 540327
14750 540327 561645 943423 365420 482878 352696 552143 725705 426565 412873 767591
14740 767591 678194 528289 609362 480478 262647 526433 609656 566056 737366 765982
14730 765982 686856 684315 568389 872731 983901 716300 822500 722699 673365 344754
14720 344754 842566 881490 772187 742623 867921 670586 633113 463315 770761 871276
14710 871276 717611 569283 815133 971666 235350 715915 791518 799766 915393 717579
$$ packed form
14782E46310K62954B39171J46742K02439k6921j23112J33124B32811O10978D10534
14771C95540n917M27437C66539K63759k61798j2117J16767O2267j348J91208j80744
14760E44533j33074N6526K48844j93303m8298R6333L4157K17695k17207o5879
14750E40327K1318L81778C65420J17458j30182J99447J73562k99140j3692L54718
14740G67591q9397j49905Q1073j28884k17831K63786Q3223m3600J71310K8616
14730G65982p9126k541j15926L04342J11170k67601J06200r9801m9334l28611
14720C44754M97812L8924j09303k9564J25298j97335l7473j69798L07446J00515
14710H71276j53665j48328K45850J56533B35350M80565P5603Q248J15627j97814
$$ plain form
14700 717579 638348 1006596 775857 738171 875523 1167059 740528 690972 1027022 1066680
14690 1066680 743742 931732 547894 755665 928098 926806 439400 706870 855503 746713
14680 746713 990899 942342 753972 909299 1037630 1024821 937515 836745 868041 866595 755509
14669 755509 943055 708214 794747 530222 1232389 1105148 945249 992423 900798 935771
14659 935771 1073083 932911 729228 1307037 710961 916191 696065 831545 875706 1124025
14649 1124025 999702 1329837 762207 992905 1120137 1176402 970142 1116295 914068 884472
14639 884472 1009427 728319 1196969 1256768 1168823 1199163 978434 920825 970591 1038355 1515191
14628 1515191 1216111 1280272 781505 1316068 1443236 1431323 1318551 1461863 1283055 1185627
$$ packed form
14700G17579p9231L68248k30739l7686J37352K91536m26531m9556L36050L9658
14690A066680l22938J87990l83838K07771J72433j292D39400K67470J48633j08790
14680G46713K44186m8557j88370J55327J28331j2809q7306j00770L1296j446j11086
14669G55509J87546k34841Q6533k64525P02167j27241j59899M7174r1625L4973
14659I35771J37312j40172k03683N77809n96076K05230k20126J35480M4161K48319
14649A124025j24323L30135n67630K30698J27232N6265k06260J46153k02227k9596
14639H84472J24955k81108M68650N9799q7945L0340k20729n7609M9766O7764M76836
14628A515191k99080O4161m98767N34563J27168j1913j12772J43312j78808r7428
$$ plain form
14618 1185627 1241199 1270018 1384138 1164966 1440921 1187911 1517865 1344144 1310413 1526524
14608 1526524 1241112 1602075 1161287 1471379 1389161 1232381 1641679 1314181 1202853 1133460
14598 1133460 1062342 1903203 1526526 1221693 1502485 1335355 1777280 1165979 1422754 1012320
14588 1012320 1464777 1524203 1249045 1376423 1568566 1482386 1471463 1654446 1661193 1567512
14578 1567512 1564124 1233752 1719846 1458600 1526858 1703151 1670281 1772586 1891332 1889039
14568 1889039 1428990 1607903 1660713 1935322 2051196 1596012 1880229 1984409 1801418 2237729
14558 2237729 1902300 1880877 2348145 2189491 2466853 2354951 3156751 3121834 3720464 4563252
14548 4563252 6049896 7083241 7799874 8398986 8704875 8766007 7921263 7407265 6241091
$$ packed form
14618A185627N5572K8819J14120k19172K75955k53010L29954j73721l3731K16111
14608A526524k85412L60963m40788L10092q2218j56780M09298l27498j11328o9393
14598A133460p1118Q40861l76677l04833K80792j67130M41925o11301K56775m10434
14588A012320M52457N9426k75158J27378J92143q6180j0923J82983O747r3681
14578A567512l388l30372M86094k61246O8258J76293l2870J02305J18746k293
14568A889039m60049J78913N2810K74609J15874m55184K84217J04180j82991M36311
14558B237729l35429k1423M67268j58654K77362j11902Q01800l4917N98630Q42788
14548D563252J486644J033345P16633N99112L05889O1132q44744n13998j166174
$$ plain form
14539 6241091 6241152 5964155 5646946 5445649 5186511 5485600 5085288 5426788 5056808 4954564
14529 4954564 4833149 4656158 4868502 4731459 4766900 4121859 4362168 4077179 3887270 3827730
14519 3827730 3107171 3512674 3525219 3371964 3217346 3382139 3106079 2988816 3231043 3076555
14509 3076555 2874393 2758587 2988363 2845018 2939956 2797135 2974712 2909545 2884847 3076733
14499 3076733 3026122 3040793 2844088 3148978 2871622 2674271 2867037 3052360 3127497 2849059
14489 2849059 3037433 2883654 2846749 2915320 2910414 2994574 3202262 3321881 3204685 3121529
14479 3121529 3577425 3164851 3506142 3054759 2960528 3058136 3250881 3171429 3521058 3439651
14469 3439651 3565568 3318909 3416673 3731091 3575088 3442952 3720522 3598923 3683677 3593063
$$ packed form
14539F241091O1k76997l17209k01297k59138K99089m00312L41500l69980j02244
14529D954564j21415j76991K12344j37043L5441o45041K40309k84989j89909n9540
14519C827730p20559M05503J2545j53255j54618J64793k76060j17263K42227j54488
14509C076555k02162j15806K29776j43345R4938j42821J77577o5167k4698J91886
14499C076733n0611J4671j96705L04890k77356j97351J92766J85323P5137k78438
14489B849059J88374j53779l6905O8571m906Q4160K07688J19619j17196q3156
14479C121529M55896m12574L41291m51383r4231R7608J92745p9452L49629q1407
14469C439651J25917k46659R7764L14418j56003j32136K77570j21599Q4754r0614
$$ plain form
14459 3593063 3963249 3669248 3485875 3740709 4155789 3940777 4005527 3601801 3881045 4285332
14449 4285332 3749093 4320492 4282516 4189707 4017757 4134612 4066539 4389081 4978688 4491753
14439 4491753 4589806 4716153 4882412 4614849 4525764 4677279 4928178 5067262 4834341 4827887
14429 4827887 5404872 5164851 5492762 5390037 5625660 5415924 5674147 5665093 5645104 5707261
14419 5707261 5892422 6065348 6276554 6204447 6361951 6240866 6404729 6757096 6535855 6741694
14409 6741694 6918145 6933609 7162586 6840698 7407402 7458978 7537342 7625937 7430917 7709935
14399 7709935 7753453 7604058 8136449 8129013 8513120 8589653 8795336 8825475 8621575 8889905
14389 8889905 8981138 9104487 9425882 9454930 9375197 9705324 9809366 10229213 10363527 10447921
$$ packed form
14459C593063L70186k94001j83373K54834M15080k15012O4750m03726K79244M04287
14449D285332n36239N71399l7976r2809j71950J16855o8073L22542N89607m86935
14439D491753R8053J26347J66259k67563q9085J51515K50899J39084k32921o454
14429D827887N76985k40021L27911j02725K35623k09736K58223r054j9989O2157
14419E707261J85161J72926K11206p2107J57504j21085J63863L52367k21241K05839
14409F741694J76451J5464K28977l21888N66704N1576P8364Q8595j95020K79018
14399G709935M3518j49395N32391p436L84107P6533K05683L0139k03900K68330
14389H889905R1233J23349L21395K9048p9733L30127J04042M19847J34314Q4394
$$ plain form
14379 10447921 11011384 10965111 10854168 11425747 11290171 11465459 12123863 12045992 12347889 12495760
14369 12495760 12807246 13169292 13262951 13541145 13638128 14077774 14303498 14452010 14649037 15054889
14359 15054889 15298270 15737064 15753619 16398210 16806254 16933121 17241895 17632671 18124081
14350 18124081 18306132 18720092 19498992 19656342 20105457 20222151 21169569 21235889 21578764
14341 21578764 22636136 22680391 23661245 24056740 24422616 25343901 25777455 26505403 27320232
14332 27320232 28098610 29180904 29597644 30244472 31288518 32249981 33090434 33981602 35059850
14323 35059850 36201030 37295954 38506374 39705734 41261077 42676712 43854283 45156492
14315 45156492 47044495 48726740 50218775 52209420 54097612 56194599 58207054 60647738
$$ packed form
14379A0447921N63463m6273j10943N71579j35576J75288O58404p7871L01897J47871
14369A2495760L11486L62046R3659K78194R6983M39646K25724J48512J97027M05852
14359A5054889K43381M38794J6555O44591M08044J26867L08774L90776M91410
14350A8124081J82051M13960P78900J57350M49115J16694R47418O6320L42875
14341B1578764J057372M4255R80854L95495L65876R21285M33554P27948Q14829
14332B7320232P78378J082294M16740O46828J044046R61463Q40453Q91168J078248
14323C5059850J141180J094924J210420J199360J555343J415635J177571J302209
14315D5156492J888003J682245J492035J990645J888192K096987K012455K440684
$$ plain form
14307 60647738 63263742 65768456 68117902 71049005 74070898 77393339 81311520 85173984
14299 85173984 88943003 93431009 97790668 102468257 107704164 113217699 119134474 125267605
14291 125267605 132035855 139527083 147341557 155745428 164807685 174735881 185453440 197325790
14283 197325790 210302414 223971630 238964977 255572212 272986975 292501242 313409954
14276 313409954 331966754 346655317 357931114 366435565 366394673 355593050 351148908 349515837
14268 349515837 348835562 335635650 322840609 310898847 302358289 295072353 288067703 282286113
14260 282286113 278309261 275642339 273839084 272878399 272803341 269905872 266849280 263993846
14252 263993846 261761622 259589177 258611965 255995683 253833058 251404696 248424758 244633137
$$ packed form
14307F0647738K616004K504714K349446K931103L021893L322441L918181L862464
14299H5173984L769019M488006M359659M677589N235907N513535N916775O133131
14291A25267605O768250P491228P814474Q403871R062257R928196J0717559J1872350
14283A97325790J2976624J3669216J4993347J6607235J7414763J9514267K0908712
14276C13409954J8556800J4688563J1275797Q504451m0892j0801623m444142j633071
14268C49515837o80275j3199912j2795041j1941762q540558p285936p004650n781590
14260B82286113l976852k666922j803255r60685p5058k897469l056592k855434
14252B63993846k232224k172445r77212k616282k162625k428362k979938l791621
$$ plain form
14244 244633137 240336506 235880448 231016299 226313322 220570907 215295980 209943211 204025866
14236 204025866 198144769 192511867 186954679 181491408 176139719 171172070 166334416 161257096
14228 161257096 156647012 152298591 147726024 143647194 139587571 135651643 131836693 128516506
14220 128516506 124648197 121694091 118320546 115002624 112083049 108990369 105764644 102975534
14212 102975534 100442596 97392095 94837640 92235063 89893539 87292134 85188361 82755037
14204 82755037 80720108 78561781 76344055 74398280 72321231 70454147 68835416 67275718
14196 67275718 65013004 64045868 62244929 60260418 59424421 57855586 56143359 55145433
14188 55145433 53645271 52376691 50943804 49680611 48205039 47029873 45907956 44284097
$$ packed form
14244B44633137m296631m456058m864149m702977n742415n274927n352769n917345
14236B04025866n881097n632902n557188n463271n351689m967649m837654n077320
14228A61257096m610084m348421m572567m078830m059623l935928l814950l320187
14220A28516506l868309k954106l373545l317922k919575l092680l225725k789110
14212A02975534k532938l050501k554455k602577k341524k601405k103773k433324
14204H2755037k034929k158327k217726j945775k077049j867084j618731j559698
14196F7275718k262714r67136j800939j984511q35997j568835j712227r97926
14188E5145433j500162j268580j432887j263193j475572j175166j121917j623859
$$ plain form
14180 44284097 43409599 41846078 40864377 40181598 38886928 37924156 36823307 35882831 34452118
14171 34452118 33789843 32859584 32219849 31216895 30658603 29905413 28890976 28133143 27696165
14162 27696165 26486403 25790394 25494532 24841821 24241656 23543784 23016367 22431583 21757680
14153 21757680 21333522 21251030 20301811 19901809 19625414 19113389 18570348 18254558 17752716
14144 17752716 17271959 16927737 16498091 16537472 15967633 15618055 15120956 14723835 14159207
14135 14159207 14343781 14089271 13673537 13545252 13119847 12831366 12418795 12266792 11808982
14126 11808982 11859629 11684635 11448274 11331252 10603764 10824865 10743666 10485415 10305459 9830419
14116 9830419 9842224 10087885 9308057 9492362 9505792 8965080 8584847 8827435 8693880 8479970
$$ packed form
14180D4284097q74498j563521r81701o82779j294670r62772j100849r40476j430713
14171C4452118o62275r30259o39735j002954n58292p53190j014437p57833m36978
14162B7696165j209762o96009k95862o52711o00165o97872n27417n84784o73903
14153B1757680m24158q2492r49219m00002k76395n12025n43041l15790n01842
14144A7752716m80757l44222m29646L9381n69839l49578m97099l97121n64628
14135A4159207J84574k54510m15734j28285m25405k88481m12571j52003m57810
14126A1808982N0647j74994k36361j17022p27488K21101q1199k58251j79956m75040
14116I830419J1805K45661p79828J84305J3430n40712l80233K42588j33555k13910
$$ plain form
14106 8479970 8220820 8301505 8054573 7713539 7586920 7945934 7623029 7227397 7348678 7380868
14096 7380868 7170933 7182612 6966644 6665436 6859563 6744700 6655489 6469465 6273218 6111115
14086 6111115 6107762 6023601 6017388 5807720 5873804 5575748 5370525 5486551 5434136 5547542 5746732
14075 5746732 5272099 5329568 5050027 5018087 5081180 4757169 5178885 4824859 5033916 4864893
14065 4864893 4450548 4624779 4524572 4564138 4722668 4709701 4814701 4594509 4417672 4284142
14055 4284142 4367067 4277782 3921807 4247739 4443506 4059658 4044823 3703916 3767159 3852164
14045 3852164 3899305 3725262 3853896 3879419 3430207 3392106 3592771 3334880 3506959 3532320
14035 3532320 3324353 3378886 3286225 3671852 3187736 3422474 3045997 3213760 3120121 2796188
$$ packed form
14106H479970k59150Q0685k46932l41034j26619L59014l22905l95632J21281L2190
14096G380868k09935J1679k15968l01208J94127j14863q9211j86024j96247j62103
14086F111115l353q4161o213k09668O6084k98056k05223J16026n2415J13406J99190
14075E746732m74633N7469k79541l1940O3093l24011M21716l54026K09057j69023
14065D864893m14345J74231j00207L9566J58530j2967J05000k20192j76837j33530
14055D284142Q2925q9285l55975L25932J95767l83848j4835l40907O3243Q5005
14045C852164M7141j74043J28634K5523m49212l8101K00665k57891J72079K5361
14035C532320k07967N4533r2661L85627m84116K34738l76477J67763r3639l23933
$$ plain form
14025 2796188 3121366 3057942 2995346 3208585 3231727 3183139 2704099 2713424 2746711 3100018 2973937
14014 2973937 2691571 2587483 2894001 2633538 2653412 2709606 2836316 2694302 2944453 2627270
14004 2627270 2331709 2407801 2435947 2649179 2310236 2045745 2165147 2769778 2247846 2025778
13994 2025778 1965954 2271716 2276134 2859391 2985965 4144654 4951763 6165340 6898587 7616359
13984 7616359 8571885 8292508 7999902 7202821 6940287 6224069 6037333 6240290 6018813
13975 6018813 5884132 5946003 5701687 5648404 5362730 5326975 5325136 5002637 5250959 5078461
13965 5078461 4867551 4852616 4585793 4255944 4255126 3999395 3758949 3453226 3789676 3424677
13955 3424677 3352139 3203812 2888269 3361655 2937807 2757942 2889102 2426748 2843490 2325243
$$ packed form
14025B796188L25178o3424o2596K13239K3142m8588m79040R325L3287L53307j26081
14014B973937k82366j04088L06518k60463J9874N6194J26710j42014K50151l17183
14004B627270k95561P6092K8146K13232l38943k64491J19402O04631n21932k22068
13994B025778n9824L05762M418N83257J26574J158689Q07109J213577P33247P17772
13984G616359R55526k79377k92606p97081k62534p16218j86736K02957k21477
13975F018813j34681O1871k44316n3283k85674l5755j839l22499K48322j72498
13965E078461k10910j4935k66823l29849q18k55731k40446l05723L36450l64999
13955C424677p2538j48327l15543M73386m23848j79865J31160m62354M16742n18247
$$ plain form
13945 2325243 2571866 2476661 2310280 2265774 2356200 2201454 1910459 2478442 2079426 2129142
13935 2129142 1865012 2253331 2226489 1848527 2381287 1779450 1921678 2126709 1858762 1947754
13925 1947754 2053140 1880629 1805466 1766967 1800440 1703220 1656846 1512105 1898470 1565218
13915 1565218 1944552 1784735 1784419 1728933 1620486 1379089 1500869 1542280 1577001 1390283
13905 1390283 1378622 1474322 1459682 1741994 1347540 1472405 1598719 1478694 1416313 1060611
13895 1060611 1504343 1087849 1442653 1103543 1621381 1310523 1444850 1332737 1224179
13886 1224179 1334116 1380889 1247689 884998 1387898 1133091 1323503 1302553 1256380 822301
13876 822301 773989 1246530 1156295 1158919 1057883 1040164 1187320 1240757 970880 1152680 1144561
$$ packed form
13945B325243K46623r5205j66381m4506R0426j54746k90995N67983l99016M9716
13935B129142k64130L88319k6842l77962N32760o01837J42228K05031k67947Q8992
13925A947754J05386j72511p5163l8499L3473r7220m6374j44741L86365l33252
13915A565218L79334j59817l16n5486j08447k41397J21780M1411L4721j86718
13905A390283j1661R5700j4640K82312l94454J24865J26314j20025o2381l55702
13895A060611M43732m16494L54804l39110N17838l10858J34327j12113j08558
13886A224179J09937M6773j33200l62691N02900k54807J90412k0950m6173m34079
13876H22301m8312M72541r0235K624j01036j7719J47156N3437k69877J81800q119
$$ plain form
13865 1144561 942462 1206988 1199606 981041 824313 928552 1287577 1064427 1005447 760998
13855 760998 1163425 950763 786477 850637 1084505 836227 990007 1016305 1013298 1255792
13845 1255792 998922 1066168 1107647 801757 668465 735160 945305 1196024 1079560 903679
13835 903679 1050078 674601 810005 863340 1077017 674330 977167 1039114 750704 650817
13825 650817 978936 816122 599221 1041778 747910 892432 648950 522971 636669 856644
13815 856644 587748 439477 987752 780557 645184 795690 953219 643178 560286 1030441
13805 1030441 521145 837945 632609 936768 896959 465259 853101 682563 743472 596255
13795 596255 821019 524424 691889 893498 238375 867864 804481 875518 482972 649328
$$ packed form
13865A144561k02099K64526p382k18565j56728J04239L59025k23150n8980k44449
13855G60998M02427k12662j64286O4160K33868k48278J53780K6298l007K42494
13845A255792k56870O7246M1479l05890j33292O6695K10145K50719j16464j75881
13835I03679J46399l75477J35404N3335K13677m02687L02837O1947k88410r9887
13825F50817L28119j62814k16901M42557k93868J44522k43482j25979J13698K19975
13815H56644k68896j48271N48275k07195j35373J50506J57529l10041q2892M70155
13805A030441n09296L16800k05336L04159l9809m31700L87842j70538O0909j47217
13795E96255K24764k96595J67465K01609B38375O29489o3383P1037l92546J66356
$$ plain form
13785 649328 401594 720129 897577 581649 579061 853754 746930 835360 466954 445707
13775 445707 765646 435257 457734 493051 425381 709940 681824 301092 762762 560670
13765 560670 279699 462199 546597 491718 872262 709560 415273 731320 499702 201672
13754 817910 785294 669515 416238 915842 599013 317332 508878 664972 619971 484915
13744 484915 814584 527845 446826 574079 493449 727772 648004 511141 371890 693136
13734 693136 621382 451647 739000 624935 316951 211132 180640 587979 601806 541087
13724 541087 252318 491518 550581 508364 505476 413008 772073 534114 538068 436565 677790
13713 677790 553454 484595 505399 423160 475387 168402 475917 680054 789406 575172
$$ packed form
13785F49328k47734L18535J77448l15928k588K74693j06824Q8430l68406k1247
13775D45707L19939l30389K2477L5317o7670K84559k8116C01092M61670k02092
13765E60670B79699J82500Q4398n4879L80544j62702k94287L16047k31618B01672
13754H17910l2616j15779k53277M99604l16829k81681J91546J56094m5001j35056
13744D84915L29669k86739q1019J27253q0630K34323p9768j36863j39251L21246
13734F93136p1754j69735K87353j14065l07984j05819l0492M07339J3827o0719
13724E41087B52318K39200N9063m2217k888r2468L59065k37959L954j01503K41225
13713F77790j24336o8859K0804q2239N2227A68402L07515K04137J09352k14234
$$ plain form
13703 575172 496896 274924 299020 455260 398452 610397 508972 382475 413261 297772
13693 297772 393867 279518 605582 144256 240376 730965 577002 303917 355074 465348
13683 465348 568500 493930 356186 533326 476770 555094 312000 87169 327086 190032
13673 190032 480408 429114 659619 124677 603778 644302 488393 145416 675280 313000
13662 250867 244887 196034 21059 734762 434601 645525 484742 613319 284196 289980 552043
13651 552043 164837 439008 298012 326578 196749 724996 495318 278114 634256 622404
13641 622404 69016 511013 357464 314667 647715 703964 267696 334553 271521 441344
13631 441344 544443 374851 549241 312421 471947 487876 487071 377594 47791 158794
$$ packed form
13703E75172p8276k21972K4096J56240n6808K11945j01425j26497L0786j15489
13693B97772R6095j14349L26064A44256R6120M90589j53963k73085N1157J10274
13683D65348J03152p4570j37744J77140n6556P8324k43094H7169K39917j37054
13673A90032K90376n1294K30505A24677M79101M0524j55909A45416N29864C13000
13662B50867n980m8853B1059P13703l00161K10924j60783J28577B84196N784K62063
13651E52043A64837K74171j40996K8566j29829N28247k29678k17204L56142j1852
13641F22404F9016M41997j53549m2797L33048N6249B67696O6857o3032J69823
13631D41344J03099j69592J74390k36820J59526J5929q05j09477D7791J11003
$$ plain form
13621 158794 301991 148187 661990 181475 -109992 326944 689533 275091 365306 350318
13611 350318 435188 605257 433208 188281 339572 431598 478086 492673 363900 390147
13601 390147 264412 233583 270038 284011 470558 224690 365733 93932 40821 651476
13591 651476 -178825 496649 383673 127787 220364 247256 362666 311412 380716 427027
13581 427027 563004 255809 122644 544979 656037 298903 249737 835608 103006 582349
13571 582349 333065 470115 400731 65468 170468 428596 182168 476937 270378 337864
13561 337864 542867 316584 142507 60517 338483 873069 307308 227729 100142 70649
13551 70649 103950 205482 144022 141554 616039 407823 371499 45110 190928 282859 349509
$$ packed form
13621A58794J43197A48187N13803A81475a09992C26944L62589B75091R0215j4988
13611C50318Q4870J70069j72049A88281J51291R2026M6488J4587j28773K6247
13601C90147j25735l0829L6455J3973J86547B24690J41043I3932D0821O10655
13591F51476a78825D96649j12976A27787R2577K6892J15410n1254O9304M6311
13581D27027J35977B55809A22644M22335J11058B98903m9166N85871A03006M79343
13571E82349k49284J37050o9384F5468J05000K58128A82168K94769k06559O7486
13561C37864K05003k26283A42507F0517K77966N34586C07308p9579A00142k9493
13551G0649L3301J01532o1460k468M74485k08216l6324D5110J45818R1931O6650
$$ plain form
13540 349509 284733 297631 561449 111365 447406 251460 239887 366608 522655 332996
13530 332996 110440 254650 428620 173426 9511 598929 272277 240874 -44220 113392
13519 23256 194784 33870 -58854 77534 138791 148710 295273 394604 17576 38964 234704
13508 234704 121692 -37598 374395 331003 383573 97854 -147616 232099 331226 -560 241427
13496 56012 -76970 259538 -105204 -95533 140156 333704 505406 95946 171721 359047 69325
13484 281406 429672 420883 108326 71825 5435 537625 161675 173442 357654 206454 384000
13473 384000 291412 147158 188594 98217 -2733 106368 -132660 -32301 286054 190349 12357
13461 -27186 358323 263797 98512 687882 350768 222133 283336 -104645 137706 155999
$$ packed form
13540C49509o4776J2898K63818A11365L36041j95946j1573J26721J56047j89659
13530C32996A10440J44210J73970A73426I511N89418B72277l1403d4220A13392
13519B3256J71528C3870e8854G7534O1257R919J46563R9331A7576K1388J95740
13508B34704j13012c7598C74395m3392N2570I7854a47616B32099R9127e60B41427
13496E6012g6970B59538a05204R671A40156J93548J71702I5946P5775J87326F9325
13484B81406J48266q789A08326l6501E435N32190A61675J1767J84212j51200J77546
13473C84000r2588j44254M1436r0377b733A06368a32660c2301B86054r5705A2357
13461b7186C58323r4526I8512N89370l37114j28635O1203a04645A37706J8293
$$ plain form
13451 155999 128342 216163 34099 50052 294099 30931 309609 246524 -1493 145389 246618
13440 246618 181169 153815 272299 405193 39091 86886 -148537 282043 227191 252757 -261937
13428 191488 15498 237279 81396 468502 39934 303293 359774 331286 81090 338413 128315
13416 -147067 58857 214913 349592 239312 137664 -183963 -34949 -44298 86709 148155 394159
13405 394159 302823 -27524 -43387 363705 410784 301550 162522 273225 484087 -93719
13394 395432 -158385 185465 67643 327506 -69183 112201 308950 138103 -140448 59021
13383 28639 216743 155046 -16969 -306295 314400 318720 450055 -48791 -89918 -163109 193020
13371 222921 42049 269886 282737 -6830 -53261 159829 411455 298566 329228 142654 162425
$$ packed form
13451A55999k7657Q7821C4099J5953K44047C0931K78678o3085a493A45389J01229
13440B46618o5449k7354J18484J32894C9091M7795a48537B82043n4852K5566b61937
13428A91488A5498K21781H1396L87106C9934K63359N6481k8488H1090K57323A28315
13416a47067E8857J56056J34679j10280j01648a83963c4949r349H6709O1446K46004
13405C94159r1336b7524j5863C63705M7079j09234j39028J10703K10862i3719
13394C95432a58385A85465F7643K59863f9183A12201J96749A38103a40448E9021
13383B8639J88104o1697a6969k89326C14400M320J31335d8791m1127p3191A93020
13371B22921D2049K27837J2851f830m6431A59829K51626j12889L0662A42654J9771
$$ plain form
13360 162425 393223 319498 139649 -69208 53944 177706 35177 319256 -480207 545333
13349 281992 -19967 204695 -131539 54504 -166762 348723 610854 240296 377780 262463
13339 262463 440862 91047 171429 205023 196015 249298 213703 218606 128336 387890 610270
13328 610270 234996 179057 335051 215888 299794 31953 -27211 247983 258187 190760 302582
13317 302582 -100911 268577 91574 -23695 126959 222649 468217 22719 26577 226727 -44111
13305 516240 109979 258815 182104 357772 149139 339949 -172191 502488 56610 88912
13295 88912 103746 1145 48388 612426 40251 272288 116137 143017 258734 67703 294295
13284 294295 244855 -178923 76616 555827 90235 244283 157333 98246 330774 -40612 -137542
$$ packed form
13360A62425K30798p3725A39649f9208E3944J23762C5177K84079d80207E45333
13349B81992a9967B04695a31539E4504a66762C48723K62131B40296J37484j15317
13339B62463J78399I1047Q0382L3594r008N3283l5595M903r0270K59554K22380
13328F10270B34996n5939J55994j19163Q3906C1953b7211B47983J0204o7427J11822
13317C02582a00911B68577I1574b3695A26959R5690K45568B2719L858K00150d4111
13305E16240A09979J48836p6711J75668A49139J90810a72191E02488E6610L2302
13295H8912J4834A145M7243N64038D0251K32037A16137K6880J15717F7703K26592
13284B94295m9440a78923G6616M79211I0235J54048q6950n9087K32528d0612r6930
$$ plain form
13273 -137542 149568 47368 194402 -28837 176073 -144545 -100659 78785 10008 150086
13263 150086 62948 -220945 289678 322582 -288642 101705 -219770 198794 192212 45500
13252 209142 346440 325354 -115129 22963 51808 351204 58239 -36969 270239 180337 301617
13241 301617 -139171 138995 -14603 174570 3425 346393 -128454 16733 452452 217132
13230 426510 571 87929 -14682 208608 163560 132686 52563 -95211 147145 169723 138935
13219 138935 349372 104804 185194 189528 212874 111308 86797 256604 148476 65039 -46589
13207 153761 -479332 80987 85623 59002 -56653 208247 158174 -219100 304433 118672 9481
13195 43657 60113 -209893 -8507 96281 252208 11669 -58232 -29860 -26613 -174348 196389
$$ packed form
13273a37542A49568D7368J47034b8837A76073a44545M3886G8785A0008J40078
13263A50086F2948b20945B89678L2904b88642A01705b19770A98794o582D5500
13252B09142J37298k1086a15129B2963K8845K99396E8239c6969B70239q9902J21280
13241C01617a39171A38995a4603A74570C425L42968a28454A6733M35719B17132
13230D26510E71Q7358a4682B08608m5048l0874E2563i5211A47145K2578l0788
13219A38935K10437A04804Q0390M334K3346j01566k4511J69807j08128F5039d6589
13207A53761d79332H0987M636k6621e6653B08247n0073b19100C04433A18672I481
13195D3657J6456b09893h507I6281J55927A1669e8232K8372L247j47735A96389
$$ plain form
13183 -42193 182590 -58163 40978 334581 232188 -61665 116201 11795 -70581 -100225 -231638
13172 -231638 -191206 204701 -140840 118404 268390 -102954 51454 -275199 -275197 88657 289285
13161 289285 123975 -7134 121830 572525 -38984 -75923 -198364 -106825 128794 14366 111322
13150 111322 -31913 56259 75139 129499 50923 271210 131187 374623 -40150 38397 94734
13139 94734 131222 163263 -65437 33077 -142303 -150600 202536 205520 -215338 17210 -14552
13127 -41257 298001 -31831 232927 167475 19358 398651 31884 217138 53475 325630 -72128
13115 -18737 -149400 42865 -6706 342117 -27464 260747 62719 89583 35132 61242 -32812
13103 -39791 143628 338082 257300 26472 19935 27443 137483 -66942 -119563 293333 -94211
$$ packed form
13183d2193A82590e8163D0978K93603j02393f1665A16201A1795g0581k9644j31413
13172b31638M0432B04701a40840A18404J49986a02954E1454b75199KH8657K00628
13161B89285A23975g134A21830M50695c8984l6939j22441R1539A28794A4366R6956
13150A11322c1913E6259J8880N4360E0923K20287A31187K43436d0150C8397N6337
13139I4734L6488L2041f5437C3077a42303q297B02536K984b15338A7210a4552
13127d1257B98001c1831B32927o5452A9358L79293C1884J85254E3475K72155g2128
13115a8737j30663D2865f706C42117b7464B60747F2719K6864C5132K6110c2812
13103c9791A43628J94454q0782B6472o537P508J10040f6942n2621B93333i4211
$$ plain form
13091 62018 -207855 -47661 274433 -134741 -246616 301963 219201 210957 -15582 414774 -67944
13079 257251 212893 10221 -48447 -38357 -34333 103863 218051 309553 114510 -105985 -247981
13068 -247981 124411 23842 137737 54722 88478 144038 202876 345093 34186 387957 246328
13057 246328 52730 243983 186167 237838 199579 399976 1438 62213 98815 161350 10747
13045 228142 201966 60030 -114568 239079 6807 289722 57642 62315 -3408 270348 133386
13033 -52934 -319300 29523 124908 -110344 72161 -70792 81098 1104 161073 -81178 193038
13021 407483 198948 337270 -224650 252399 183688 46860 -91311 -32643 64108 147440 61752
13009 -134504 -204193 135180 277332 113438 -62985 55340 176859 192755 -27038 506961
$$ packed form
13091F2018b07855d7661B74433a34741j11875C01963q2762q244a5582D14774f7944
13079B57251m4358A0221d8447J0090M024A03863J14188R1502A14510a05985j41996
13068b47981A24411B3842J13895E4722L3756N5560N8838J42217C4186L53771j41629
13057B46328E2730J91253n7816N1671l8259K00397A438O0775L6602O2535A0747
13045B28142k6176F0030a14568B39079F807K82915E7642M673c408B70348A33386
13033e2934k66366B9523R5385a10344G2161g0792H1098A104J59969h1178A93038
13021D07483A98948J38322b24650B52399o8711D6860i1311c2643F4108Q3332F1752
13009a34504o9689A35180J42152A13438f2985E5340J21519J5896b7038E06961
$$ plain form
12998 350617 80677 245084 -57850 -105773 61929 -29569 125384 281068 2204 44183 179430
12987 179430 1837 4143 -97575 187377 160736 340531 173732 186298 381340 120253 62214
12976 62214 -56949 139895 -13262 295271 -42009 -110240 36143 -188785 2313 296375 134747
12964 75032 52146 -149063 248519 7670 -31466 -162325 -11375 -379847 8768 35707 124446
12953 124446 48797 103958 2082 149169 64264 -47542 -8451 31538 148927 237747 217704
12942 217704 131123 56916 -73841 129090 69078 33216 141888 274543 -74322 114811 107584
12931 107584 -2086 207032 285240 -242891 225984 -149694 -45586 23010 -85976 77317 160314
12920 160314 -31395 -99261 232587 16264 -15044 6126 66678 -58348 -33010 4465 197522
$$ packed form
12998C50617H0677J64407e7850m7923F1929b9569A25384J55684B204M1979J35247
12987A79430A837K306i7575A87377k6641J79795j66799J2566J95042A20253n8039
12976F2214e6949A39895a3262B95271d2009o8231C6143a88785B313K94062A34747
12964G5032k2886a49063B48519G670c1466j30859a1375l68472H768K6939Q8739
12953A24446D8797N5161B082J47087F4264d7542h451C1538J17389Q8820k0043
12942B17704q6581E6916g3841A29090o0012C3216J08672J32655g4322A14811p227
12931A07584b086B07032P8208b42891B25984a49694d5586B3010h5976G7317Q2997
12920A60314c1395o7866B32587A6264a5044F126O0552e8348K5338D465J93057
$$ plain form
12909 197522 -101296 110652 282873 105701 -232942 129465 -130608 63432 -56706 254819
12898 39435 -359048 -131249 226718 -205525 -3507 -226249 -489708 17605 22914 346623 132928
12886 337850 2115 99023 256450 -103086 113633 185761 273613 -338526 123029 111755 -225556
12874 60315 -31363 -80271 119175 69312 83582 36930 1917 -108796 146194 -144975 -130993
12863 -130993 -161218 -209234 89971 78105 -255435 -79670 266053 23245 181832 -89254 -444083
12852 -444083 301552 7848 -113199 218444 117277 101981 15544 1692 -87340 53684 42044
12841 42044 -131805 151712 -228183 -143370 312010 -111805 -47359 29434 -100724 -87803
12831 -87803 -95030 155097 203736 52971 -194255 -197562 -60686 117196 -283511 -87676 141766
$$ packed form
12909A97522a01296A10652J72221A05701b32942A29465a30608F3432e6706B54819
12898C9435c59048a31249B26718b05525c507k22742k63459A7605N309L23709A32928
12886C37850B115R6908J57427a03086A13633P2128Q7852c38526A23029j1274b25556
12874F0315c1363m8908A19175m9863J4270C6930A917a08796A46194a44975J3982
12863a30993l0225m8016H9971j1866b55435g9670B66053B3245J58587h9254l54829
12852d44083C01552G848a13199B18444j01167j5296A5544A692h7340E3684j1640
12841D2044a31805A51712b28183Q4813C12010a11805d7359B9434a00724J2921
12831h7803p227A55097M8639E2971a94255l307f0686A17196b83511h7676A41766
$$ plain form
12819 809 136433 -148076 60275 -116170 -92419 132801 -44177 -171709 -299071 -114642 -143014
12808 -143014 17202 128618 217644 161065 273 42027 13038 191256 -7043 199054 32501
12796 -238439 -19718 -210050 160805 315972 278066 97766 3962 -32405 461197 241218 49235
12784 -117731 246079 -229349 -148103 -96570 -84144 -59966 170175 108830 17133 -155406 -216012
12773 -216012 201412 136060 209373 -64816 -14968 -118310 -107697 -97310 112374 105176 -148912
12761 -10439 207766 -14499 1761 -118536 62540 34848 35809 107221 -152296 40057 4313 -123734
12748 258669 -56441 -151249 -82080 -67400 94130 -225804 -308285 304168 327633 155826 187003
12737 187003 72997 248535 -65415 -85148 -215803 7855 64739 97658 300292 107332 274126
$$ packed form
12819H09J35624a48076F0275a16170K3751A32801d4177j27532j27362a14642k8372
12808a43014A7202J11416Q9026n6579B73M1754A3038J78218g043A99054C2501
12796b38439a9718j90332A60805J55167l7906I7766C962c2405D61197k19979D9235
12784a17731B46079b29349Q1246N1533J2426K4178A70175o1345A7133a55406o0606
12773b16012B01412o5352P3313f4816a4968j03342J0613J0387A12374p198a48912
12761a0439B07766a4499A761a18536F2540k7692R61P1412a52296D0057D313a23734
12748B58669e6441r4808O9169J4680I4130b25804q2481C04168K3465A55826L1177
12737A87003G2997J75538f5415j9733j30655G855N6884L2919K02634A07332J66794
$$ plain form
12726 274126 -162967 88111 133073 457025 -136260 -34776 38725 -5881 -82702 24030 -19537
12714 118802 50340 344901 22553 115410 -28112 -300402 -132106 -52336 242430 61254 134881
12703 134881 -28734 144619 343927 -50308 -108123 -137048 11597 392414 -124044 66335 243249
12692 243249 -106935 58716 415366 130488 29654 -319250 141491 -360205 79512 94733
12682 94733 -178320 57087 -24579 326500 233335 -17004 320308 28286 25983 -166584 35990
12670 -93415 -102502 99404 -79923 -54141 48781 -82758 107834 231517 154487 -427330 -236127
12659 -236127 139191 -126178 63559 81175 163709 -42089 -68788 -21512 -73010 102874 -10109
12647 3522 55976 -118842 43162 126100 336 232134 -20953 -190422 -260359 -102518 48786
$$ packed form
12726B74126a62967H8111M4962L23952a36260c4776C8725e881p6821B4030a9537
12714A18802E0340K94561B2553R2857b8112k72290a32106e2336B42430F1254P3627
12703A34881b8734A44619J99308e0308n7815k8925A1597L80817a24044F6335J76914
12692B43249a06935E8716L56650A30488B9654c19250A41491c60205G9512J5221
12682I4733a78320E7087b4579C26500r3165a7004C20308B8286k303a66584C5990
12670i3415r087I9404g9923K5782D8781h2758A07834J23683p7030d27330J91203
12659b36127A39191a26178F3559J7616Q2534d2089k6699b1512n1498A02874a0109
12647C522N2454a18842D3162Q2938C36K31798b0953j69469o9937a02518D8786
$$ plain form
12635 117187 110524 113624 188873 -116654 266964 280448 227017 -136807 66108 36444 30396
12624 30396 423747 82858 83969 -41650 21832 298838 15091 -240884 238744 155081 -149410
12612 348360 248558 136093 -28583 242828 38111 349061 222171 -127350 186842 -8136
12601 -158009 88040 70667 -17668 281657 252392 -151165 171718 429411 -95549 -21809 35556
12589 32930 93591 273466 -136223 -88220 -108201 138227 -54458 53993 -35680 298746 -184014
12577 -65337 -6138 83204 151904 -273663 198767 -131576 67305 233569 -193691 75417 32047
12565 -167811 -4367 102497 -43152 153114 199469 -117489 -100523 -18847 -81496 -113647 -76856
12554 -76856 278396 -92024 218695 -141893 -35877 -177253 -61190 70677 -234599 33945 194007
$$ packed form
12635A17187o663L100P5249a16654B66964J3484n3431a36807F6108k9664o048
12624C0396L93351H2858J111d1650B1832K77006A5091b40884B38744q3663a49410
12612C48360r9802j12465b8583B42828C8111L10950j26890a27350A86842h136
12601a58009H8040j7373a7668B81657k9265a51165A71718K57693i5549b1809C5556
12589C2930O0661J79875a36223M8003j9981A38227e4458E3993c5680B98746a84014
12577f5337f138H3204O8700b73663A98767a31576F7305J66264a93691G5417C2047
12565a67811d367A02497d3152A53114M6355a17489J6966a8847o2649l2151L6791
12554g6856B78396i2024B18695a41893c5877j41376f1190G0677b34599C3945J60062
$$ plain form
12543 194007 -251289 87812 -269237 -47720 18552 52009 66476 -71042 -50847 335040 75208
12531 -111719 217703 46966 99180 -218009 -136991 -229258 375673 -304465 -40319 63976 -6109
12519 41137 66100 93570 -165557 146064 -168403 279913 -104790 272229 -134574 -41003
12508 -141545 207724 153654 438673 289117 -92904 -35441 -193516 34076 345602 238920
12498 238920 138837 60005 -48648 28792 84681 194854 86781 -73280 -71090 -339584 -72743
12486 175709 -14933 -115528 175882 -261563 -101559 257820 -401701 -247553 -124693 -32643
12475 271674 165596 -240727 -289011 -29017 -302603 -35005 -877 -77349 84374 111732 -46013
12463 135847 -176741 -48568 56887 265566 -212757 -433446 -176608 -106994 -2487 -41678 -10112
$$ packed form
12543A94007b51289H7812b69237d7720A8552L3457J4467g1042K0195C35040G5208
12531a11719B17703D6966N2214b18009Q1018r2267C75673c04465d0319F3976f109
12519D1137K4963K7470a65557A46064a68403B79913a04790B72229a34574d1003
12508a41545B07724n4070K85019j49556i2904c5441j58075C4076L11526j06682
12498B38920j00083F0005d8648B8792N5889J10173H6781g3280K190k68494g2743
12486A75709a4933j00595A75882b61563a01559B57820d01701J54148J22860c2643
12475B71674j06078b40727m8284b9017k73586c5005h77p6472H4374K7358d6013
12463A35847a76741d8568E6887K08679b12757k20689a76608O9614b487l9191a0112
$$ plain form
12451 -263055 -272901 192238 -444535 117309 -66389 132782 -208326 128 -133026 -111514 359
12439 102361 -33641 -139846 163666 -54643 -239679 -28611 -191794 -333457 -53504 -115799
12429 -115799 256930 91223 1982 -30007 294088 100694 282678 88541 -84270 -253703 84983
12417 -187793 -67165 49373 -226066 -70812 177174 -113308 -142514 -277928 54022 -134825
12406 42747 135368 271950 -223946 205946 -203072 -2826 -23188 44880 72233 -290017 -211862
12395 -211862 -63987 165267 49485 73278 -151726 19362 -97424 -438053 260484 -105541
12384 -92651 2096 -357437 -69454 146854 127150 125241 43105 -79912 -28296 -143916 344140
12372 22456 160644 400879 -48788 -113511 55724 -197570 -18111 -36419 31278 -84492 101916
$$ packed form
12451b63055r846A92238d44535A17309f6389A32782b08326A28a33026K1512C59
12439A02361c3641j06205A63666e4643j85036b8611j63183j41663e3504o2295
12429a15799B56930I1223A982c0007B94088A00694J81984H8541h4270j69433H4983
12417a87793f7165D9373b26066g0812A77174a13308k9206j35414E4022a34825
12406D2747R2621J36582b23946B05946b03072b826k0362D4880K7353b90017P8155
12395b11862f3987A65267D9485K3793a51726A9362i7424l40629B60484a05541
12384i2651B096c57437f9454A46854j9704j909D3105g9912b8296j15620C44140
12372B2456J38188K40235d8788o4723E5724a97570a8111j8308C1278h4492A01916
$$ plain form
12360 -8649 138078 182883 213629 -401050 157109 219804 83700 -32213 100979 -54472 24619
12348 -478451 -94012 54239 -350568 70960 72736 346142 116975 125221 23812 212454 39957
12336 -196652 -151310 167120 98545 89851 39258 -24669 7111 39999 593 -40721 -90631 30308
12323 3815 82936 117049 64820 72468 -301579 -170616 -99692 273510 322357 -39431 645 344958
12311 344958 186805 159515 76580 19904 -166092 118219 356704 -121547 -126307 -148090 -208662
12300 -208662 -68205 -111060 -96963 36177 396363 -48760 -137414 -126784 63880 257092 116584
12288 146157 158549 118743 -151402 -187701 -115380 277452 -277048 -14700 49620 40652 -81786
12276 11384 266189 -156298 -357676 164776 143892 86972 137382 -155916 74723 109606 73748
$$ packed form
12360h649A38078M4805L0746d01050A57109O2695H3700c2213A00979e4472B4619
12348d78451i4012E4239c50568G0960J776K73406A16975Q246B3812J88642C9957
12336a96652M5342A67120o8575q694C9258b4669G111L2888E93d0721m9910C0308
12323C815P9121L4113n2229P648c01579J30963P0924B73510M8847c9431F45L44313
12311C44958j58153k7290G6580A9904a66092A18219K38485a21547m760k1783o0572
12300b08662f8205m2855J4097C6177L60186d8760q8654J0630F3880J93212A16584
12288A46157J2392l9806a51402l6299P2321B77452b77048a4700D9620q968h1786
12276A1384K54805a56298k01378A64776k0884n6920N0410a55916G4723L4883l5858
$$ plain form
12265 73748 88824 72602 -36874 347837 -36815 93925 -48987 491864 208754 179512 61128
12253 34494 -45582 382585 333432 -369522 299924 226706 103508 -75684 -107062 8134 -104596
12241 -19812 185561 198559 29750 -127273 381337 114636 -300844 83994 -303031 72637
12230 -289456 -160669 -55679 506256 55468 16747 -162530 140303 -184592 358074 202099
12220 202099 342904 405409 -103948 243995 -47456 -63608 278132 265805 125752 82184
12210 82184 366831 101666 -41797 -75724 -112228 283075 -168697 -24650 158226 237082 85507
12198 124700 130311 219404 180228 -35471 324275 -209437 40779 190033 131177 246724 -7028
12186 293823 94646 362997 49370 65311 27683 205799 107768 77361 57331 23872 216597
$$ packed form
12265G3748J5076j6222c6874C47837c6815I3925d8987D91864B08754k9242F1128
12253C4494d5582C82585m9153c69522B99924p3218A03508g5684l1378H134a04596
12241a9812A85561J2998B9750a27273C81337A14636c00844H3994c03031G2637
12230b89456J28787e5679E06256E5468A6747a62530A40303a84592C58074j55975
12220B02099J40805O2505a03948B43995d7456j6152B78132j2327A25752m3568
12210H2184K84647A01666d1797l3927l6504B83075a68697b4650A58226P8856H5507
12198A24700N611Q9093l9176c5471C24275b09437D0779J49254n8856J15547g028
12186B93823I4646K68351D9370J5941B7683J78116r8031l0407k0030B3872J92725
$$ plain form
12175 216597 269456 91301 206122 189518 372455 67164 541232 270223 160374 275795
12165 275795 1260 157834 -223929 358287 3804 472907 -62114 -92330 104516 88154 257569
12154 257569 -161286 363949 91568 238493 -4347 32481 74752 -180713 77506 -22239 78518
12142 -61461 315391 -1384 77217 364878 -67205 336045 71632 346015 199802 -14950 176813
12130 219529 -193245 309775 14483 123399 195566 70144 239574 -290950 -63380 182003
12119 308617 -40239 -215060 71598 -97368 25225 8060 -291659 -97122 -4007 58509 40093
12108 40093 60013 142740 213957 250782 -79144 -125750 3377 -203218 -7300 -169540 -25688 -194763
12096 -194763 -30352 122204 41509 -183721 -273668 229182 -69263 424346 6591 160706 -76491
$$ packed form
12175B16597N2859I1301J14821j6604J82937F7164M74068B70223j09849J15421
12165B75795A260J56574b23929C58287C804M69103f2114l0216A04516j6362J69415
12154B57569a61286C63949I1568J46925d347C2481M2271a80713G7506b2239G8518
12142f1461C15391a384G7217K87661f7205C36045G1632K74383j46213a4950A76813
12130B19529a93245C09775A4483J08916P2167G0144J69430b90950f3380A82003
12119C08617d0239j74821G1598i7368B5225H060b91659i7122d007E8509j8416
12108D0093J9920Q2727P1217L6825g9144m6606C377b03218g300j62240b5688j69075
12096a94763c0352A22204D1509a83721q9947B29182f9263D24346F591J54115g6491
$$ plain form
12084 164769 118673 42832 -218136 281660 131971 -34723 329760 408932 665816 -1016 169660
12072 51875 -7341 304928 435261 -120682 -56420 61632 332260 233416 -13109 188314 330551
12061 330551 90387 147635 53821 -254503 75989 -14902 -141348 -142506 499143 250805 127799
12050 127799 -103717 158081 20726 47302 68735 -48434 43303 -191936 31931 -79971 327729
12038 141483 133865 212349 -146090 248086 -265768 -133278 -87637 5849 -40743 -253650 -169173
12027 -169173 -84864 -87222 88783 -54661 -138412 90567 -66235 414854 138158 -61171 -1739
12015 -67573 119209 -53162 206429 -259113 -219022 88567 124219 73673 229440 -303227 -204752
12004 -204752 -21938 -82289 -261985 168213 247294 65980 190504 315300 315711 -195872 115464
$$ packed form
12084A64769m6096D2832b18136B81660A31971c4723C29760P9172K56884a016A69660
12072E1875g341C04928J30333a20682e6420F1632K70628r8844a3109A88314J42237
12061C30551I0387N7248E3821b54503G5989a4902j26446j158D99143k48338j23006
12050A27799a03717A58081B0726K6576K1433d8434D3303a91936C1931g9971C27729
12038A41483p618P8484a46090B48086b65768J32490M5641E849d0743k12907Q4477
12027a69173Q4309k358H8783e4661q3751I0567f6235D14854A38158f1171a739
12015f7573A19209e3162B06429b59113M0091H8567L5652n0546J55767c03227R8475
12004b04752b1938o0351j79696A68213P9081F5980J24524J24796M11a95872A15464
$$ plain form
11992 102715 -242823 34016 -166586 -183230 -75699 -20794 -60059 -55021 -13227 -229357 -215393
11981 -215393 -306131 316292 117756 97329 -95662 35540 -184863 -15180 -60120 107748 44950
11969 204796 97393 -183611 -243711 77026 79650 129708 226589 -330236 -9938 -13061 35339 -16842
11956 -250210 204544 -128245 -229611 2794 -154484 -253581 -13294 -163948 -30363 237532
11945 -11032 170932 216054 -7521 58455 14627 94721 -30407 -261793 -172395 25472 -66713
11933 -10983 23831 -91246 -206644 -176531 1464 -345771 13059 238681 133470 146202 -216957
11921 185716 2828 -510707 127152 -44288 -149819 -9345 181688 277973 -16205 -165966 84768
11909 -395598 220188 -195495 187046 -40688 -60452 253231 121210 -366534 -636 298457
$$ packed form
11992A02715b42823C4016a66586j6644g5699b0794l9265N038a3227k16130J3964
11981b15393r0738C16292A17756k0427i5662C5540a84863a5180m4940A07748D4950
11969B04796I7393a83611o0100G7026K624N0058R6881c30236i938l123C5339a6842
11956b50210B04544a28245j01366B794a54484r9097a3294j50654c0363B37532
11945a1032A70932M5122g521E8455A4627Q0094c0407k31386Q9398B5472f6713
11933a0983B3831i1246j15398L0113A464c45771A3059K25622j05211J2732b16957
11921A85716B828e10707A27152d4288j05531i345A81688R6285a6205j49761H4768
11909c95598B20188a95495A87046d0688j9764B53231A21210c66534f36B98457
$$ plain form
11898 -158836 -166705 44308 222712 -67601 -78233 153709 -176646 -191243 128416 -149060 -31988
11886 41221 -193570 -125028 -40188 170615 58118 120896 -69513 -150349 130993 122744 -101827
11874 -94828 76854 -205035 -36206 -165917 -321627 -70890 -158917 -125654 16203 24955 -175934
11862 -370890 -195689 69900 -203465 -158471 69224 113006 57399 -78145 169911 192557 -153276
11850 -286568 13746 -445599 246342 -43623 75018 -113470 112942 339137 -115921 -384767
11840 -384767 -118101 -226460 37781 114382 91476 -308948 162144 -158123 -23236 243050
11829 -50511 1464 -87056 -59718 -255523 27585 -268896 41935 -39612 65885 -27262 -143401
11818 -143401 -105158 -112088 -81842 -11713 185734 -143498 174650 189786 -28577 158145 153615
$$ packed form
11898a58836p869D4308J78404f7601j0632A53709a76646j4597A28416a49060c1988
11886D1221a93570O8542d0188A70615E8118O2778f9513q0836A30993q249a01827
11874i4828G6854b05035c6206j29711j55710g0890q8027L3263A6203Q752a75934
11862c70890J75201F9900b03465M4994F9224M3782n5607g8145A69911K2646a53276
11850b86568A3746d45599B46342d3623G5018a13470A12942K26195a15921k68846
11840c84767a18101j08359C7781P6601k2906c08948A62144a58123b3236B43050
11829e0511A464h7056K7338j95805B7585b68896D1935c9612F5885b7262j16139
11818a43401L8243o930L0246a1713A85734a43498A74650J5136b8577A58145m530
$$ plain form
11807 153615 192853 -135790 82776 146395 -31212 42147 86759 -317492 9780 -239039 200057
11795 -106533 -33043 -411689 76852 184230 -97366 10988 -296465 -205550 105458 335355
11785 335355 -37731 -32001 40968 207613 -21202 -99623 -161081 181975 21343 319042 -77115
11773 129674 179415 -242286 -133855 -49985 -304327 17094 437129 -335282 -174316 -268315
11763 -268315 -76462 -188405 71584 -223883 125581 97038 -8624 -160426 138404 172331 115693
11752 115693 126936 171684 -155849 -194720 42210 242385 -305908 -80957 -207542 -151469 366565
11740 49605 -26655 -38642 191236 -235005 61520 166815 -146475 -382336 140713 -220802
11729 262998 -7507 261946 -37482 -236860 -179584 143334 188549 -39649 -138583 -14558 -148704
$$ packed form
11807A53615L9238a35790H2776O3619c1212D2147M4612c17492I780b39039B00057
11795a06533c3043l78646G6852J07378i7366A0988b96465R0915A05458K29897
11785C35355c7731N730D0968J66645b1202p8421o1458A81975B1343K97699g7115
11773A29674M9741b42286J08431d9985k54342A7094M20035c35282J60966r3999
11763b68315g6462j11943G1584b23883A25581k8543h624j51802A38404L3927n6638
11752A15693J1243M4748a55849l8871D2210K00175c05908h0957j26585N6073C66565
11740D9605b6655j1987A91236b35005F1520J05295a46475k35861A40713b20802
11729B62998g507B61946c7482j99378N7276A43334M5215c9649r8934a4558j34146
$$ plain form
11718 -148704 53990 -126023 66214 20774 -10909 -89243 169500 206813 122777 -682 140513
11706 72803 -65552 43382 196711 255087 237934 -244934 -173296 -17417 -102212 -182793 -123718
11695 -123718 -58001 20169 58046 -13443 15490 -192679 -82947 39897 33939 -79540 110224
11683 -204392 -30783 -118605 251639 265293 -220743 -450702 112780 -68968 113969 191014
11673 191014 -81101 47683 106307 -29533 459545 163888 312008 -46624 174000 30571 375027
11662 375027 49580 441546 107440 -381141 -86183 92172 -130948 168740 -19663 121687
11651 -104965 -29586 -57789 24333 -144800 -2570 149011 -314851 125126 -85091 500797 -14862
11639 94005 85939 45441 35515 -156351 20871 -182707 -201537 9363 51413 -347445 -62887 13762
$$ packed form
11718a48704E3990a26023F6214B0774a0909p8334A69500L7313q4036f82A40513
11706G2803f5552D3382J53329N8376j7153b44934P1638a7417q4795q0581N9075
11695a23718e8001B0169L7877a3443A5490a92679h2947C9897n958g9540A10224
11683b04392c0783q7822B51639J3654b20743k29959A12780f8968A13969P7045
11673A91014h1101D7683N8624b9533D59545A63888J48120d6624A74000C0571L44456
11662C75027D9580L91966A07440c81141h6183I2172a30948A68740a9663A21687
11651a04965b9586k8203B4333a44800b570A49011c14851A25126h5091E00797a4862
11639I4005q066m0498r926a56351B0871a82707j8830I363M2050c47445f2887A3762
$$ plain form
11626 -90522 139912 156810 -55343 187439 9867 111649 66779 78759 133905 63736 150750
11615 150750 164980 -329178 164450 145873 3821 85294 55097 420496 245055 369503 -232194
11603 91919 -113411 -96879 19862 -172957 -255447 142955 65148 -408314 -208500 379623
11592 -121284 161247 63759 47445 -40187 83487 -80189 403415 103861 99013 -46185 219480
11580 106530 -127174 263195 -145666 45496 113658 -194553 351847 -203987 33886 -119468
11569 111950 -79382 322965 -32076 220816 -85616 51973 81725 343220 293596 -41726 91576
11557 178032 20260 14999 157297 -51883 -306354 453876 25854 131177 38105 68169 -231815
11545 -217854 -244875 -14125 -123129 -282779 279103 76509 224001 216182 -451664 -183684
$$ packed form
11626i0522A39912J6898e5343A87439I867J01782m4870J1980N5146F3736Q7014
11615A50750J4230c29178A64450j8577C821Q1473l0197L65399j75441J24448b32194
11603I1919a13411J6532A9862a72957q2490A42955F5148d08314J99814C79623
11592a21284A61247F3759j6314d0187H3487h0189D03415A03861m848d6185B19480
11580A06530a27174B63195a45666D5496O8162a94553C51847b03987C3886a19468
11569A11950g9382C22965c2076B20816h5616E1973K9752K61495m9624d1726I1576
11557A78032B0260n261J42298e1883k54471D53876B5854J05323C8105L0064b31815
11545b17854k7021a4125j09004j59650B79103G6509J47492p819d51664a83684
$$ plain form
11534 -99460 84920 16630 33833 -86722 74455 -105803 1874 -90618 145980 -99675 -36562
11522 -28788 88117 248443 435289 -142436 97974 290154 -119686 226820 62923 63839 109518
11511 109518 -113693 48683 131353 287595 347945 100044 124363 -105629 322447 -125686
11500 -166737 10667 77449 237562 -50243 211345 170298 378003 117627 79400 -107688
11489 92825 -1459 109098 263726 -78735 -87887 144593 -40695 -202018 -341370 -10763 -133570
11478 -133570 145998 552876 169189 40338 -196701 305161 392409 135361 339626 169817
11468 169817 354742 158868 200417 79499 -40063 -57330 -85156 -197931 29391 -72100 140206
11456 194132 -82449 -162483 373229 175284 57954 325839 -102388 71420 366221 -32165
$$ packed form
11534i9460H4920A6630J7203h6722G4455a05803A874i0618A45980i9675c6562
11522b8788H8117J60326J86846a42436I7974J92180a19686B26820F2923R16M5679
11511A09518a13693D8683Q2670J56242O0350A00044K4319a05629C22447a25686
11500a66737A0667O6782J60113e0243B11345m1047K07705A17627l8227a07688
11489I2825a459A09098J54628g8735r152A44593d0695j61323j39352a0763j22807
11478a33570A45998M06878A69189D0338a96701C05161Q7248A35361K04265j69809
11468A69817J84925A58868M1549G9499d0063j7267k7826j12775B9391g2100A40206
11456A94132h2449q0034C73229A75284E7954K67885a02388G1420K94801c2165
$$ plain form
11445 -133990 161114 -213919 -21867 -146781 47116 192694 126475 -119997 -34120 194949
11434 214550 228263 106037 -120244 98860 411936 67971 -148219 110960 -30620 -160706
11424 -160706 -97237 114663 72512 92748 127069 -170536 -147594 -4308 166774 79676 -17964
11412 71298 23346 385174 -19865 -2432 34613 -168761 160898 21551 141969 -212768 180638
11400 144827 294870 711 -31966 103083 269266 -247127 83088 -176317 370817 34467 -76402
11388 -43931 5555 -368847 -285632 10517 42278 94631 35556 -2852 244183 -208625 -109111
11377 -109111 -24880 -88901 99262 -165633 -13448 -5887 -23375 -20 -60901 18587 -76916 -210045
11365 -210045 -2208 157310 -4602 -166120 -4446 192619 -6453 -82034 90607 -110565 222322
$$ packed form
11445a33990A61114b13919b1867j24914D7116J45578o6219a19997c4120A94949
11434B14550J3713A06037a20244I8860L13076F7971a48219A10960c0620j30086
11424a60706O3469A14663m2151K0236L4321a70536K2942d308A66774G9676a7964
11412G1298B3346L61828a9865b432C4613a68761A60898B1551J20418b12768A80638
11400A44827J50043G11c1966A03083J66183b47127H3088a76317C70817C4467g6402
11388d3931E555c68847Q3215A0517L1761N2353C5556b852B44183b08625R9514
11377a09111b4880o4021I9262a65633a3448e887j7488b0o0881A8587g6916j33129
11365b10045b208A57310d602j61518d446A92619f453p5581I0607a10565B22322
$$ plain form
11353 -83379 -186676 259388 -136853 38991 45030 219608 85263 -44207 -163838 118863 -243255
11341 -70009 243190 48449 -75706 -13218 126145 -80718 64968 115692 286224 -298712 246745
11329 164701 17589 -129259 -154814 182840 125597 286027 141413 2256 47102 -200897 235242
11317 70511 23919 -204301 287199 -265301 -47104 117119 -143926 -4620 -30839 -245489 -175571
11306 -175571 -71690 -51506 -51568 -298019 112648 -327561 -122627 59427 125776 128528 86625
11295 86625 195022 97266 289352 -6554 170931 -35534 238426 -210166 -91243 -60780 -117638
11284 -117638 176948 -216490 -7874 -71331 244717 36612 115525 190354 -35153 -250542 -140711
11273 -140711 -20939 -166189 -186533 -334855 114444 -341060 -189663 -23691 -70401 4904 -142536
$$ packed form
11353h3379j03297B59388a36853C8991O039J74578H5263d4207j19631A18863b43255
11341g0009B43190D8449g5706a3218A26145h0718F4968N0724J70532b98712B46745
11329A64701A7589a29259k5555A82840n7243J60430A41413B256M4846b00897B35242
11317G0511B3919b04301B87199b65301d7104A17119a43926d620k6219k14650O9918
11306a75571g1690K0184o2k46451A12648c27561a22627E9427O6349K752m1903
11295H6625J08397I7266J92086f554A70931c5534B38426b10166i1243L0463n6858
11284a17638A76948b16490g874o3457B44717C6612P8913P4829c5153k15389J09831
11273a40711b0939j45250k0344j48322A14444c41060J51397b3691m6710D904a42536
$$ plain form
11261 -9415 100176 -120040 -137233 -78818 -155554 249958 -174066 -228340 -57273 -170062 -144048
11250 -144048 -101795 218894 157448 -129501 154175 -181942 -189027 -104324 -33393 63442 113488
11239 113488 -12415 -299661 -106271 -173820 -167362 -238696 109225 -45971 74944 -133593 -77495
11228 -77495 -15824 198113 -91765 -50382 148237 -203796 60124 -63052 -52883 -150715 175875
11216 -58713 142832 23070 -147675 -201955 -180418 258935 66418 123943 238843 122043 174261
11205 174261 -51689 105085 57507 -47745 156326 75467 -180030 -329631 -263288 -443176
11195 -443176 17374 28781 -261244 -159057 128133 9627 -250773 103708 -143130 -167198
11185 -167198 242170 -254195 -215755 -29729 71803 284308 -124242 -237087 16340 -233901
$$ packed form
11261i415A00176a20040j7193N8415p6736B49958a74066n4274e7273j12789K6014
11250a44048M2253B18894o1446a29501A54175a81942p085Q4703c3393F3442N0046
11239A13488a2415k87246a06271o7549O458p1334A09225d5971G4944a33593N6098
11228g7495a5824A98113i1765M1383A48237b03796F0124f3052J0169r7832A75875
11216e8713A42832B3070a47675n4280K1537B58935F6418N7525J14900j16800N2218
11205A74261e1689A05085m7578d7745A56326G5467a80030j49601O6343j79888
11195d43176A7374J1407b61244J02187A28133I627b50773A03708a43130k4068
11185a67198B42170b54195L8440b9729G1803K12505a24242j12845A6340b33901
$$ plain form
11174 -118274 93641 -186241 -5449 48629 -124397 -127563 -325290 -106850 207738 -184485 -123563
11163 -123563 -41725 -63292 -156764 3271 -175947 -337617 -146782 225130 152359 -354523 -164003
11151 -46542 -53927 -74941 -143608 -40865 -128801 82512 38261 -92177 52154 -409171 60707 -157798
11138 -13534 86010 15108 398795 81516 -178298 -18993 190894 -86803 -167809 -156234 -143449
11127 -143449 29259 -411640 -49542 171527 -25923 -122796 103321 324144 -16264 298189
11116 57550 -186849 -1923 -15714 226346 -102642 71903 -130304 40263 48665 -22977 -163157
11105 -163157 163437 -69365 -159345 304360 253944 106062 115392 -44361 -56730 157504 321104
11094 321104 340904 213841 60614 82097 -66077 75764 38022 103661 59478 275701 238428
$$ packed form
11174a18274I3641a86241e449D8629a24397l166j97727a06850B07738a84485O0922
11163a23563d1725k1567r3472C271a75947j61670a46782B25130p2771c54523a64003
11151d6542p385k1014o8667d0865q7936H2512C8261i2177E2154d09171F0707a57798
11138a3534H6010A5108L83687H1516a78298a8993A90894h6803q1006J1575J2785
11127a43449B9259d11640d9542A71527b5923r6873A03321K20823a6264B98189
11116E7550a86849a923j3791B26346a02642G1903a30304D0263Q402b2977j40180
11105a63157A63437f9365q9980C04360n0416A06062R330d4361j2369A57504J63600
11094C21104J9800j27063F0614K1483f6077G5764l7742O5639m4183K16223l7273
$$ plain form
11083 238428 -260232 219150 117121 25569 173602 177072 -42792 76896 72418 122404 293640
11072 293640 366865 -59645 223114 23755 20058 203661 -70920 -16017 22360 93538 199537
11061 199537 424167 448364 223036 280458 200046 59386 680878 414939 126553 490512
11051 490512 514502 413462 331417 676154 413288 262791 564893 369827 646199 547107
11041 547107 646280 669450 268205 607894 87214 279376 584151 737126 582901 844002
11031 844002 619053 374736 460347 555976 730824 689215 889306 769518 570553 892768
11021 892768 589090 562384 368948 218021 567868 659432 587444 1110368 355950 443155
11011 443155 833086 675637 492369 524283 282862 491999 317233 465651 549455 834063
$$ packed form
11083B38428b60232B19150j02029B5569J48033L470d2792G6896m478M9986J71236
11072B93640P3225e9645B23114B3755l697J83603g0920a6017B2360P1178J05999
11061A99537K24630K4197B23036N7422q0412E9386O21492k65939A26553L63959
11051D90512K3990j01040q2045L44737k62866j50497L02102j95066K76372r9092
11041E47107R9173K3170B68205L39689H7214J92162L04775J52975j54225K61101
11031H44002k24949k44317Q5611R5629J74848m1609K00091j19788j98965L22215
11021H92768l03678k6706j93436j50927L49847R1564p1988N22924C55950Q7205
11011D43155L89931j57449j83268L1914k41421K09137j74766J48418Q3804K84608
$$ plain form
11001 834063 495834 680516 810639 614373 722991 329250 516141 419465 351394 732326
10991 732326 713082 604875 603737 742241 671583 866141 559734 440152 761989 551148
10981 551148 862944 576201 991687 711839 797764 1190381 1012885 948426 1046880 1601053
10971 1601053 1634223 1592965 1042881 1394460 1439480 1438736 1263627 1618530 1319830 1562929
10961 1562929 1449021 1426854 1555757 1293519 1393079 1569493 1388603 1437776 1416856 1562600
10951 1562600 1506659 1518068 837497 1292302 1441780 977576 1255699 872567 833280 896790
10941 896790 756701 872322 775538 942767 667872 340273 597522 377668 541154 688824
10931 688824 684978 301835 548577 473603 694023 400460 160426 470703 125685 192263
$$ packed form
11001H34063l38229J84682J30123j96266J08618C29250J86891r6676o8071L80932
10991G32326j9244j08207j138J38504p0658J94558l06407j19582L21837k10841
10981E51148L11796k86743M15486k79848Q5925L92617j77496o4459R8454N54173
10971A601053L3170m1258n50084L51579M5020p44j75109L54903k98700K43099
10961A562929j13908k2167J28903k62238R9560J76414j80890M9173k0920J45744
10951A562600n5941J1409o80571M54805J49478m64204K78123l83132l9287O3510
10941H96790j40089J15621r6784J67229k74895l27599K57249k19854J63486J47670
10931F88824l846C01835K46742p4974K20420k93563A60426L10277A25685O6578
$$ plain form
10921 192263 465884 640401 247103 108955 633550 146036 85549 26283 205725 415093
10911 415093 92023 118381 193976 375123 122090 99136 93201 172244 125249 75750 318421
10900 318421 93880 51236 189451 -402658 -207902 233637 116368 79139 323993 382535
10890 382535 -29594 -20634 120089 354982 -174070 65904 -6709 -102439 119890 342135 12135
10878 -62776 218152 -57931 -197488 70047 -310854 168883 -2439 160180 -335468 -13411 98118
10866 143722 228221 -180770 -106404 128858 -21217 16736 -2047 -86000 50737 123918 177850
10855 177850 52348 5265 110490 253952 -95117 -61738 273265 -126265 22064 -112266 -71226
10844 -71226 -255672 232558 -104698 31768 -21302 -148647 -10057 45875 66847 -156198 -23999
$$ packed form
10921A92263K73621J74517B47103A08955N24595A46036o0487B6283J79442K09368
10911D15093I2023K6358P5595J81147A22090k2954n935P9043m6995m9499K42671
10900C18421I3880m2644J38215d02658J94756B33637A16368l7229K44854N8542
10890C82535b9594Q960A20089K34893a74070F5904f709r5730A19890K22245A2135
10878f2776B18152e7931j39557G0047c10854A68883b439A60180c35468a3411I8118
10866A43722Q4499a80770P4366A28858b1217A6736b047q3953E0737P3181N3932
10855A77850E2348E265J05225J43462i5117L3379B73265a26265B2064a12266M1040
10844g1226j84446B32558a04698C1768b1302j27345a0057D5875K0972a56198b3999
$$ plain form
10832 -74392 -9955 250540 202505 26221 -189147 -130881 105445 -20830 -261105 -96307 -3686
10820 216736 216609 195460 -194795 -124011 -99229 103431 102559 -220009 -79659 -114880 214661
10808 -518344 -46664 72513 91092 69615 159768 -45879 -207412 -209768 101922 207129 31395
10796 -268692 191703 -140770 197598 -425218 -143338 146475 205278 322316 280846 108692
10785 141256 -310715 -222123 7058 -162400 252608 298215 -186378 -408020 -73076 265552
10774 27400 -45876 353092 26118 -84603 -239692 -484979 182099 -286157 189055 -107868
10763 432413 -107274 -40859 -13366 132218 -68305 -228768 -126113 -142696 -269293 -152636
10753 -152636 -7028 -127966 -306463 -212271 55182 -27250 -184450 -146205 130511 158822 -71653
$$ packed form
10832g4392i955B50540m8035B6221a89147N8266A05445b0830k40275i6307c686
10820B16736j27k1149a94795P0784K4782A03431q72b20009g9659l5221B14661
10808e18344d6664G2513J8579k1477R0153d5879j61533k356A01922J05207C1395
10796b68692A91703a40770A97598d25218a43338A46475N8803J17038m1470A08692
10785A41256c10715Q8592G058a62400B52608M5607a86378k21642g3076B65552
10774B7400d5876C53092B6118h4603j55089k45287A82099b86157A89055a07868
10763D32413a07274d0859a3366A32218f8305j60463J02655j6583j26597J16657
10753a52636g028j20938j78497R4192E5182b7250j57200L8245A30511K8311g1653
$$ plain form
10741 -273904 71669 -297099 71010 130080 -48518 119584 -55463 37626 10685 93471 85139
10730 85139 189884 -126549 -12371 -420493 26775 26916 19438 -279173 -18402 -170239 273359
10718 -91958 20710 60715 -33485 109825 -155132 -55632 16596 -282871 -33352 24717 -172661
10706 -122617 -186409 -57092 -55780 14563 174212 -178441 21252 93875 216541 -49719 -103710
10695 -103710 -91990 -39427 -107130 193040 128163 135121 36807 -80080 -63418 92048 15204
10683 163597 -1108 -375373 166669 77588 -37881 -254443 -67894 -281955 -197189 -207624 177576
10671 -79427 86580 -13501 129860 -194350 -39456 295790 -272648 64115 27718 -423912 -76081
10659 122480 -216228 -70646 40428 177452 -60797 -147356 -242891 95983 -398815 -99040 -56681
$$ packed form
10741b73904G1669b97099G1010N9070d8518A19584e5463C7626A0685Q2786q332
10730H5139J04745a26549a2371m08122B6775J41p478b79173a8402j51837B73359
10718i1958B0710M0005c3485A09825a55132e5632A6596b82871c3352B4717a72661
10706a22617o3792e7092J312A4563J59649a78441B1252P2623J22666d9719n3991
10695a03710J1720c9427o7703A93040o4877O958C6807h0080J6662I2048A5204
10683A63597a108l74265A66669G7588c7881k16562f7894k14061Q4766j0435A77576
10671g9427H6580a3501A29860a94350c9456B95790b72648F4115B7718d23912g6081
10659A22480b16228g0646D0428J37024f0797q6559r5535I5983c98815i9040M2359
$$ plain form
10648 -56681 111696 71317 -6050 -189106 -255006 49304 101882 -69680 -277959 -34235 -158244
10637 -158244 -87306 7815 -45436 -128327 182664 -66260 53919 -114577 -256401 -311837 -283972
10626 -283972 10113 565527 5437 -469960 -172593 -293141 -79745 -378850 -54935 34888 -207266
10614 -293627 -290868 315566 135098 -326216 -54663 -73519 299758 -114950 -38486 -151667
10604 -151667 -163612 157905 -201113 -144631 -179844 -73253 -478021 134237 -59664 -58766 3405
10592 -350710 -7441 -62481 -68573 -360962 -115643 63622 -85308 -136550 -27409 -50859 -121804
10581 -121804 -39385 -266715 89458 -197616 145774 -212293 340972 -109371 80892 -36339
10570 -10172 -198673 -98408 -107599 -54477 -227814 -47238 188011 -106097 -51114 34284 -454982
$$ packed form
10648e6681A11696m0379f050j83056o5900D9304N2578f9680k08279c4235j24009
10637a58244P0938G815d5436q2891A82664f6260E3919a14577j41824n5436K7865
10626b83972A0113N55414E437d69960a72593j20548g9745k99105e4935C4888b07266
10614b93627K759C15566A35098c26216e4663j8856B99758a14950c8486j13181
10604a51667j1945A57905b01113N6482l5213g3253m04768A34237e9664Q98C405
10592c50710g441n5040o092k92389a15643F3622h5308n1242b7409k3450p0945
10581a21804c9385k27330H9458a97616A45774b12293C40972a09371H0892c6339
10570a0172j88501i8408r191N3122j73337d7238A88011a06097e1114C4284d54982
$$ plain form
10558 -304887 -204634 -189454 -19548 -106781 -61318 -202755 198862 82201 -192123 -971 -220076
10547 -220076 296868 50663 -346862 -62487 -213772 -55099 111363 24086 -298150 -13705
10536 -144692 -62934 -26060 -95636 200029 -282718 172873 -159763 -277251 -35815 220885
10525 167499 -245819 -168993 60347 -40319 -146048 -31382 -118251 50599 93183 264952 -84134
10513 -56466 -29885 20715 10354 -117453 20412 -38613 -82687 123973 -256363 166442 248618
10502 248618 517 -256182 40690 -48958 -191276 -196746 -30669 339010 7670 -275269 -117757
10490 21630 -133774 -363998 -117459 -391003 -112407 -315330 -104074 209363 213044 258253
10480 258253 304139 203845 35393 484178 -234298 -241257 81310 -52661 -256587 82144 -5614
$$ packed form
10558c04887J00253J5180a9548q7233M5463j41437A98862H2201a92123i71k19105
10547b20076B96868E0663c46862f2487j51285e5099A11363B4086b98150a3705
10536a44692f2934b6060o9576B00029b82718A72873a59763j17488c5815B20885
10525A67499b45819P6826F0347d0319j05729c1382q6869E0599M2584J71769h4134
10513e6466K6581B0715A0354a17453B0412c8613m4074A23973b56363A66442Q2176
10502B48618E17b56182D0690d8958j42318n470c0669C39010G670b75269a17757
10490B1630a33774k30224a17459k73544a12407k02923a04074B09363L681M5209
10480B58253M5886j00294C5393M48785b34298o959H1310e2661k03926H2144e614
$$ plain form
10468 -227327 -224342 24237 248994 165021 239264 113533 -130016 130514 131203 -201295 270118
10456 -54089 -109997 2790 -199766 275699 -262233 13105 213725 -185912 306214 159719
10446 159719 113414 -214823 -168183 -120049 135409 180733 -129285 65589 -194661 229448
10435 -131952 -216927 222745 37354 77209 -22275 -81913 19972 90791 131966 -11384 -229571
10424 -229571 92740 129287 -61441 -161309 152081 -813 78498 -412787 509923 -355990 -420159
10413 -420159 34307 -11411 -36053 117312 -322112 -11465 -247117 -214438 -29042 -65937 21194
10401 57792 -13553 -344654 147735 -308932 143532 -211017 -294987 -317039 -144461 147489
10390 7519 163355 -7620 122336 474932 119306 -2193 191061 11905 114476 132219 -38543
$$ packed form
10468b27327K985B4237K24757q3973P4243A13533a30016A30514O89b01295B70118
10456e4089n5908B790a99766B75699b62233A3105K00620a85912C06214j46495
10446A59719m6305b14823M6640M8134A35409M5324a29285F5589a94661B29448
10435a31952q4975B22745C7354L9855b2275n9638A9972P0819M1175a1384k18187
10424b29571I2740L6547f1441r9868A52081h13G8498d12787E09923c55990o4169
10413d20159C4307a1411k4642A17312c22112a1465k35652L2679b9042l6895B1194
10401E7792a3553l31101A47735c08932A43532b11017q3970k2052a44461A47489
10390G519J55836g620A22336L52596A19306b193A91061A1905J02571J7743c8543
$$ plain form
10378 323721 24923 40659 291288 456345 130043 -62420 178393 111396 -176288 70250
10367 -55181 188478 132829 51595 211256 295199 107371 314641 183587 333440 146446
10356 43396 116362 -108083 -39143 217221 298104 106368 -61216 395264 358241 531078 247929
10344 142041 138051 218769 92333 59523 253521 337310 238449 -127188 287113 21176 46185
10333 46185 212536 408533 388942 156189 477137 282625 -70780 67787 224431 332713
10323 332713 115173 130137 58894 -47880 211014 40413 -117868 178097 -14355 3591 94679
10312 94679 -118632 64553 134311 57269 280853 81653 382490 88329 260491 166136 -120070
10300 -154670 60030 -52995 298011 354497 33063 74988 -158395 -312152 75997 68656 -92343
$$ packed form
10378C23721B4923J5736K50629J65057A30043f2420A78393o6997a76288G0250
10367e5181A88478n5649E1595J59661Q3943A07371K07270j31054J49853A46446
10356D3396P2966a08083c9143B17221Q0883A06368f1216C95264l7023J72837B47929
10344A42041l990Q0718I2333l2810J93998Q3789r8861a27188B87113B1176K5009
10333D6185J66351J95997j9591A56189L20948j94512g0780F7787J56644J08282
10323C32713A15173J4964E8894d7880B11014D0413a17868A78097a4355C591R1088
10312I4679a18632F4553O9758E7269K23584H1653L00837H8329J72162r4355a20070
10300a54670F0030e2995B98011N6486C3063M1925a58395j53757G5997p341i2343
$$ plain form
10288 66031 54775 -48635 229371 -126296 65055 272426 -72790 18926 185370 -207482 96830
10276 6450 12656 120069 -77078 334577 -21192 -160500 108963 -65712 -352515 67261 -403603
10264 -190896 -86789 1323 -166662 113686 -50741 31238 -247611 -74208 -289549 90049 304854
10253 304854 25860 -172826 142092 202159 45937 34806 -146859 522773 -18297 365303
10242 -30514 -22710 163083 -161305 44960 -198856 -116137 108061 129670 -250122 88766 111955
10231 111955 127402 2705 -33607 236501 -370129 -329801 -114282 143467 -101671 -62210 131554
10219 22741 17863 139689 137466 -114691 292722 -9828 -68973 154613 102139 -148845 -102953
10208 -102953 265074 -72209 -324980 24062 -173140 17536 215369 -78605 192637 -105317
$$ packed form
10288F6031j1256d8635B29371a26296F5055K07371g2790A8926J66444b07482I6830
10276F450O206J07413g7078C34577b1192j39308A08963f5712k86803F7261d03603
10264a90896h6789A323a66662A13686e0741C1238b47611g4208k15341I0049K14805
10253C04854B5860a72826A42092O0067D5937j1131a46859E22773a8297C65303
10242c0514P804A63083a61305D4960a98856Q2719A08061K1609b50122H8766K3189
10231A11955J5447B705c3607B36501c70129M0328a14282A43467a01671L9461A31554
10219B2741m878J21826k223a14691B92722i828n9145A54613n2474a48845M5892
10208a02953B65074g2209k52771B4062a73140A7536J97833g8605A92637a05317
$$ plain form
10197 30710 4815 -125163 -215430 11582 120673 254072 41791 -241904 -42712 -108361 180953
10185 -250800 13953 -88119 127236 -107718 -241878 233333 -14443 -91089 -127384 -155067 -234959
10174 -234959 23043 -43581 -5670 124668 -77264 310100 -261215 -190523 273907 -329337 462235
10162 233378 -119772 -80704 14984 -155858 36394 -209194 -122027 -158255 -140772 -232996 -584917
10151 -584917 59448 78572 84402 -89402 -170297 116560 42464 393065 -141625 -410525 -355397
10140 -355397 -81440 -78858 173437 -80792 -64755 24983 303188 -128772 23176 157851 115610
10129 115610 -165273 -38849 -53851 -100307 -293419 -78396 48465 66091 -289933 198182 -74544
10117 -79137 -53948 137165 -194998 -75087 76073 -288701 -4919 -322860 110775 -52052 2390
$$ packed form
10197C0710D815a25163r0267A1582J09091J33399D1791b41904d2712o5649A80953
10185b50800A3953h8119A27236a07718j34160B33333a4443p6646l6295k7683p9892
10174b34959B3043d3581e670A24668g7264C10100b61215P0692B73907c29337D62235
10162B33378a19772L9068A4984a55858C6394b09194Q7167l6228J7483r2224l51921
10151e84917E9448J9124N830h9402q0895A16560D2464L50601a41625k68900N5128
10140c55397h1440K582A73437h0792J6037B4983K78205a28772B3176J34675m2241
10129A15610a65273c8849j5002m6456j93112g8396D8465J7626b89933A98182g4544
10117g9137K5189A37165a94998g5087G6073b88701d919l17941A10775e2052B390
$$ plain form
10105 -420170 -131126 76578 -204280 67675 -131031 -213942 211883 155742 -195433 -420069
10095 -420069 51062 70982 100855 188419 -264116 -8980 -38488 -162232 -174413 -21236 -5993
10083 -576779 -160942 27329 -167222 -366206 167609 -302192 -345894 210305 -186409 104743
10072 9048 293758 19526 63681 -221457 -35312 78082 -325598 -262102 -183138 -23145 -156193
10061 -156193 -154292 -280100 142121 -275086 -154584 21909 69600 189122 51007 -254101
10050 -161771 -299474 -43805 85961 377920 50466 3609 -165795 -65984 -255211 -78840 -215828
10039 -215828 -255437 -119311 -70338 88110 142083 104262 150731 -77869 -60172 -254854 126362
10027 115943 279013 65569 193716 -240062 -82886 199070 -28039 -397617 -197987 -154051
$$ packed form
10105d20170a31126G6578b04280F7675a31031q2911B11883n6141a95433k24636
10095d20069E1062J9920K9873Q7564b64116h980k9508j23744j2181b1236e993
10083e76779a60942B7329a67222j98984A67609c02192m3702B10305a86409A04743
10072I048K84710A9526M4155b21457c5312G8082c25598O3496P8964b3145j33048
10061a56193J901j25808A42121b75086J20502B1909M7691J19522E1007b54101
10050a61771j37703d3805H5961K91959E0466C609a65795f5984j89227g8840j36988
10039b15828l9609a19311M8973H8110N3973l7821M6469g7869J7697j94682A26362
10027A15943J63070F5569J28147b40062h2886A99070b8039l69578a97987M3936
$$ plain form
10017 -154051 -22776 -388079 74400 -160096 -136863 180294 -6736 -16287 -235032 195808 -147893
10005 50968 -4841 -184973 -16779 119230 34939 230668 -117521 23597 -304853 144101 -165319
9993 -134632 -58799 8502 -216712 103167 -174093 -282099 -156530 -290029 18129 -71319 -260956
9982 -260956 221198 -87376 -124193 -196401 -377099 -305222 -30966 147816 67643 116968 -76702
9970 -124586 -133086 25514 81996 -165274 -159401 -52542 -37461 110071 -115931 -331797 -15502
9958 221676 -38604 -36431 -199563 -172245 -75424 -81039 -242820 -160203 -3338 137474 -66803 97537
9945 -55736 -163440 -274971 -351763 73283 130011 -197377 -36798 -29424 14081 99438 -6096 -55308
9933 -55308 -282780 -138082 -102283 -231042 -61700 -178041 -61993 -391564 264888 -126173
$$ packed form
10017a54051b2776l65303G4400a60096K3233A80294f736r551k18745A95808a47893
10005E0968d841j80132a6779A19230C4939J95729a17521B3597c04853A44101a65319
9993a34632e8799H502b16712A03167a74093j08006J25569j33499A8129g1319j89637
9982b60956B21198h7376l6817p2208j80698P1877c0966A47816F7643M9325g6702
9970a24586q500B5514N6482a65274N873e2542J5081A10071a15931k15866a5502
9958B21676c8604K173j63132K7318g5424n615j61781Q2617c338A37474f6803I7537
9945e5736j07704j11531p6792G3283N6728a97377c6798P374A4081Q5357f096m9212
9933e5308k27472a38082L5799j28759f1700j16341f1993l29571B64888a26173
$$ plain form
9922 25995 -136933 294338 167864 60042 90908 -220596 -105450 -63251 -341726 -155239
9911 -188613 -50564 -4686 148285 -122757 -5781 -18537 -340215 391780 242540 116480 41573
9899 -115060 58585 -124697 -102570 -208942 -26720 -17248 5990 38999 14630 215262 22075
9887 45242 64080 -30444 -180109 -194997 -187658 93196 -1778 -337848 -363803 27650 4746 -430922
9874 232412 -116555 -144585 -73133 -145899 -52511 -351395 -47449 -47157 -257204 -80233 -169486
9863 -169486 -66512 12805 -34110 -79074 109310 -179746 -145185 -245346 241158 94411 -28052
9851 182131 -50071 -169211 -24978 46160 -369993 50471 127742 -402652 -65150 -83341 -453821
9840 -453821 169550 -66590 -33498 181558 211972 -187037 -131814 -52232 -238697 -32665 -241418
$$ packed form
9922B5995a36933B94338j26474F0042L0866b20596a05450M2199k78475a55239
9911a88613e0564d686A48285a22757e781j2756l21678C91780j49240A16480D1573
9899a15060E8585a24697K2127j06372b6720R472E990L3009A4630K00632B2075
9887D5242J8838c0444j49665j4888P339I3196a778l36070k5955B7650D746d30922
9874B32412a16555k8030P1452p2766e2511k98884d7449K92k10047h0233q9253
9863a69486f6512A2805c4110m4964A09310a79746L4561j00161B41158I4411b8052
9851A82131e0071j19140b4978D6160c69993E0471P7271d02652f5150j8191l70480
9840d53821A69550f6590L3092A81558L0414a87037N5223e2232j86465c2665k08753
$$ plain form
9829 -241418 -116155 188266 1743 -167982 -146810 65435 -27901 -325164 -66644 229007 -222367
9817 27133 -92659 -167596 -161304 86799 91200 -391587 -239085 -249628 -45013 107624 -72261 76668
9804 38770 33087 -365694 -177593 -111550 130412 -303403 68787 -62333 134835 -56547 85127
9792 -114620 -310879 -122678 106516 -308924 -285127 73355 -192190 -270503 -13102 124596
9781 -21835 -3650 157169 -208114 -19505 -317442 -68231 64005 -292969 207319 -13612 21621
9769 23941 -229154 -38133 299695 -180342 32994 59508 399248 -165724 33304 -154726 -365225
9758 -365225 6351 -238124 -14956 -151334 -96588 -349419 56133 28300 -7140 257518 19499
9746 -98272 -125432 -279051 -132471 -104785 177393 121589 -277616 -251016 -267098 -49815 -107887
$$ packed form
9829b41418a16155A88266A743a67982K1172F5435b7901k97263f6644B29007b22367
9817B7133i2659p4937O292H6799M401c91587J52502j0543d5013A07624g2261G6668
9804C8770n683c65694a77593O6043A30412c03403F8787f2333A34835e6547H5127
9792a14620j96259a22678A06516c08924K3797G3355a92190p8313a3102A24596
9781b1835c650A57169b08114a9505k97937f8231F4005b92969B07319a3612B1621
9769B3941b29154c8133B99695a80342C2994K6514L39740a65724C3304a54726k10499
9758c65225F351b38124a4956j36378N4746k52831E6133k7833g140B57518A9499
9746i8272k7160j53619a32471K7686A77393n5804b77616K6600j6082d9815n8072
$$ plain form
9735 -107887 63994 245757 -103309 -260690 -326861 -104795 258232 -180004 -111953 -175309
9725 -175309 -216428 -47066 73952 -114714 31553 -47585 45153 217518 503867 -86780 409688
9713 -101802 121517 -371930 -86684 -4010 56498 -281695 59577 17688 167756 -208964 44930
9701 21292 5429 -39836 -203480 209052 162923 -116433 14289 -128777 -146264 -392931 280380
9689 -208874 106461 -160896 -235226 -173785 -215074 -131133 -145018 -214783 130593 -64073 -7101
9677 -185557 219247 -274527 -47401 -101244 -169375 -48818 -226149 108493 -116418 123380
9666 -112219 -183396 -25602 -202600 -203714 -174721 -161456 -200949 153342 50547 -219190 49097
9654 -32027 -67988 -23797 18159 -420742 241697 121271 -161783 66379 -304073 -241904 104408
$$ packed form
9735a07887F3994J81763a03309j57381o6171a04795B58232a80004O8051o3356
9725a75309m1119d7066G3952a14714C1553d7585D5153J72365K86349h6780D09688
9713a01802A21517c71930h6684d010E6498b81695E9577A7688J50068b08964D4930
9701B1292E429c9836j63644B09052m6129a16433A4289a28777j7487k46667B80380
9689b08874A06461a60896p4330O1441m1289Q3941j3885o9765A30593f4073g101
9677a85557B19247b74527d7401n3843o8131d8818j77331A08493a16418A23380
9666a12219p1177b5602j76998j114K8993J3265l9493A53342E0547b19190D9097
9654c2027l5961b3797A8159d20742B41697j20426a61783F6379c04073O2169A04408
$$ plain form
9642 127447 87751 -159712 -155549 -364613 182371 -171377 200133 -99353 -38838 88692 -92204
9630 -59866 -168830 -442201 -209277 60944 -102274 143474 30730 -97608 -282325 -10337 -195533
9619 -195533 -379909 -343521 -236903 309503 15028 -163792 -137822 37578 26258 -45919 -97069
9608 -97069 36737 -241832 -236146 -41016 -54182 53685 -415236 178629 -402379 -401 -388654
9597 -388654 -150699 -199272 -176526 181706 -192622 -232445 -134990 175962 173099 -84266 -284531
9586 -284531 -222047 -189620 10524 -234893 -47228 -67188 -309301 54213 74511 7873 -177761
9574 76428 -113958 -6041 57668 -252607 -257617 50477 -127243 73740 160867 160908 -162494 -92713
9562 -92713 -213407 129125 14265 -83805 -163932 -366657 -20086 -285171 -212212 -58423 -255741
$$ packed form
9642A27447l9696a59712M163k09064A82371a71377B00133i9353c8838H8692i2204
9630e9866j08964k73371b09277F0944a02274A43474C0730i7608j84717a0337j85196
9619a95533j84376L6388J06618C09503A5028a63792K5970C7578j1320d5919n1150
9608i7069C6737b41832N686d1016j3166E3685d15236A78629d02379d01l88253
9597c88654a50699m8573K2746A81706a92622l9823R7455A75962k863h4266k00265
9586b84531O2484L2427A0524b34893d7228j9960k42113E4213K0298G873a77761
9574G6428a13958f041E7668b52607n010E0477a27243G3740Q7127M1a62494O9781
9562i2713j20694A29125A4265h3805q0127k02725b0086k65085P2959e8423j97318
$$ plain form
9551 -255741 -321616 284015 -23760 -281430 79114 -262211 3786 -172797 -71200 -230851 50963
9539 -16409 52329 -47903 -204022 -158766 -314934 262500 -130502 127216 -63997 -177282 48076
9527 148011 -189591 53083 -136122 -39446 -91050 -281365 -90446 -336107 -166742 -11717 -177670
9516 -177670 -315172 243489 -130461 -96005 -20595 127257 201688 -217048 -16734 -15090 83721
9504 298733 164522 -8512 49579 31739 126381 -118449 35604 -76288 -34851 -39934 -53511 -258524
9492 -258524 -371285 -61482 -164114 293373 70373 -195414 -174710 -33277 -217564 19236 72511
9481 72511 180963 -256237 -63501 -43926 -164928 -11954 -168481 -165166 -6524 -134227 -222142
9470 -222142 302031 -371537 -57162 -159251 -160079 -428796 42683 59475 -111829 205851 -210200
$$ packed form
9551b55741o5875B84015b3760k57670G9114b62211C786a72797g1200j59651E0963
9539a6409E2329d7903j56119M5256j56168B62500a30502A27216f3997j13285D8076
9527A48011a89591E3083a36122c9446n1604j90315i0446k45661a66742a1717j65953
9516a77670j37502B43489a30461L4456b0595A27257P4431b17048a6734J644H3721
9504B98733j34211h512D9579j7840R4642a18449C5604g6288c4851n083j3577k05013
9492b58524j12761f1482j02632B93373G0373a95414K0704c3277j84287A9236N3275
9481G2511J08452b56237f3501J9575j21002a1954j56527L315f524j27703q7915
9470b22142C02031c71537e7162j02089q28k68717D2683J6792a11829B05851b10200
$$ plain form
9458 -34770 136218 -104810 -84937 -76578 -205803 -160628 -22169 -151122 66698 -48294 -77203
9447 -77203 -180422 -68412 -120016 -62457 -74280 -174120 69831 -6115 123885 132337 -27168 -115176
9435 -115176 -549578 80279 -86418 -209864 41197 -240050 -49927 -33031 -90746 -351972 -64589
9423 37628 -359859 253359 146152 296291 -95704 -138135 -124998 -119474 -148263 -412005 -63324
9411 26261 239013 -226175 88918 -76156 -108212 -244265 365711 63259 230876 -82486 -71307
9400 -71307 -253428 -149524 -54508 -426688 -115735 45939 154951 -135374 -299818 -174834
9390 -174834 58415 -36828 -109178 224763 94881 -207074 137036 200772 -192172 -10301 -188730
9379 -188730 2237 -208311 -224216 -275610 30221 -121582 -148478 -105784 -61182 54945 -355282
$$ packed form
9458c4770A36218a04810J9873Q359j29225M5175b2169j28953F6698d8294k8909
9447g7203j03219f8412n1604N7559j1823r9840F9831f115A23885Q452b7168q8008
9435a15176m34402H0279h6418j23446D1197b40050d9927J6896n7715k61226f4589
9423C7628c59859B53359j07207J50139i5704m2431J3137N524k8789k63742f3324
9411B6261K12752b26175H8918g6156l2056j36053C65711F3259J67617h2486J1179
9400g1307j82121J03904e4508l72180a15735D5939J09012a35374j64444J24984
9390a74834E8415c6828p2350B24763I4881b07074A37036O3736a92172a0301j78429
9379a88730B237b08311j5905n1394C0221a21582k6896M2694M4602E4945c55282
$$ plain form
9367 8914 -77264 -111015 106994 -106152 -17368 140544 46514 -125516 -337617 161323 -215298
9355 235358 -118129 236599 -95670 365712 18465 100003 -163024 7274 -237410 167577 -226314
9343 105577 -147131 -316699 137416 -292084 17845 -419394 245701 38677 368403 49173
9332 -101891 5840 -224856 108194 197130 -66076 44343 171447 -9137 2465 386550 61899
9320 -128296 -56828 -165409 130281 11367 -39177 24383 143463 -109383 -40413 -246485 131843
9308 223597 -112693 48249 135636 -21751 -358258 4509 21377 -45007 -249150 211946 367187
9297 367187 -40628 2763 -159613 -95436 -321595 -123539 -26845 -269536 -74461 -151145 -316604
9286 -316604 -122641 -92517 -81776 -213974 -61228 191453 -413305 99899 -65269 -296969 114425
$$ packed form
9367H914g7264l3751A06994a06152a7368A40544D6514a25516k12101A61323b15298
9355B35358a18129B36599i5670C65712A8465Q1538a63024G274b37410A67577b26314
9343A05577a47131j69568A37416b92084A7845d19394B45701C8677L29726D9173
9332a01891E840b24856A08194Q8936f6076D4343J27104i137B465L84085F1899
9320a28296e6828j08581A30281A1367c9177B4383J19080a09383d0413k06072A31843
9308B23597a12693D8249Q7387b1751l36507D509J6868d5007k04143B11946J55241
9297C67187d0628B763a59613O4177k26159a23539b6845k42691g4461p6684j65459
9286c16604a22641L0124J0741j32198f1228A91453d13305I9899f5269k31700A14425
$$ plain form
9274 -297409 66488 -290271 -166649 -438128 -234367 -91343 170036 -103086 -44462 119777
9263 -235623 -68858 29596 -226584 -117952 -191100 37912 -864 202371 -302337 -148226 36772
9251 -83153 -80189 33556 -328813 -20915 106309 -221923 -167637 -222814 -145962 347658 -189442
9239 123713 49783 -322558 -441920 66652 -351401 -531691 -237956 -481190 -14661 164730
9228 94912 102743 -9085 61794 200441 -12795 -288016 190760 -120530 62348 22117 -188171
9216 -56240 44085 181046 -101236 -471571 -119738 -40512 -51627 351344 145223 -168036
9205 -53981 136603 -242562 -124933 51595 -45028 -9804 161480 -152189 182568 14720 -289958
9193 -140651 -6358 -58146 -104496 -354737 -219599 -78459 208154 -288588 -33791 8162 122204
$$ packed form
9274b97409F6488b90271J23622k71479K03761i1343A70036a03086d4462A19777
9263b35623f8858B9596b26584J08632p3148C7912h64B02371c02337a48226C6772
9251h3153K964C3556c28813b0915A06309b21923N4286n5177P6852C47658a89442
9239A23713D9783c22558j19362F6652c51401j80290b37956k43234a4661A64730
9228I4912P831i085F1794J38647a2795k75221A90760a20530F2348B2117a88171
9216e6240D4085J36961a01236l70335a19738d0512j1115C51344A45223a68036
9205e3981A36603b42562J17629E1595d5028i804A61480a52189A82568A4720b89958
9193a40651f358n1788m6350k50241J35138g8459B08154b88588c3791H162J14042
$$ plain form
9182 122204 -153188 196002 -109890 50238 93074 183679 -279273 -66501 -261025 -185161 -153397
9171 -153397 -95664 204755 -267938 121995 51989 -340343 56106 -294514 -434938 -263175
9161 -263175 135107 -292736 6998 -168712 -60743 34216 201740 -453099 -205987 38880 32488
9150 32488 34994 29992 83961 76701 25616 -121164 151139 563 -229943 -335759 29565 -364437
9137 -3869 -170809 30545 117828 -402130 -40920 -398471 -564472 -156645 -336103 203801 -163468
9125 -72224 109047 109023 -206321 206919 209187 -48680 -150068 -186375 153773 6891 -83600 -153774
9113 -153774 -148557 -283436 8129 -3851 242394 8092 -429400 -89605 -129979 247330 -129489
9101 157010 -38474 212674 -93927 66632 -129286 -394734 -310695 -37775 -160294 -66540 -17478
$$ packed form
9182A22204a53188A96002a09890E0238M2836R0605b79273f6501j94524P5864L1764
9171a53397N7733B04755b67938A21995E1989c40343E6106b94514j40424J71763
9161b63175A35107b92736F998a68712f0743C4216J67524d53099b05987C8880o392
9150C2488K506n002N3969p260B5616a21164A51139E63b29943j05816B9565c64437
9137c869j66940C0545Q7283d02130d0920l57551j66001a56645j79458B03801a63468
9125g2224A09047k4b06321B06919K268d8680j01388l6307A53773F891h3600p0174
9113a53774N217j34879H129c851B42394H092d29400h9605m0374B47330a29489
9101A57010c8474B12674i3927F6632a29286k65448Q4039c7775j22519f6540a7478
$$ plain form
9089 -112882 -27325 40526 52628 -27913 196437 -60041 462698 -334370 338398 -132856 -29372
9077 -185829 28541 40370 -232666 -36593 122345 -312485 152871 -58972 -23021 -3958 -148547
9066 -148547 -19262 33613 119704 -136270 66874 -18199 -64399 297484 -248332 -105504 -73850
9055 -73850 -142067 -110228 26495 80935 170393 -43322 -14041 -127614 -134464 -218745 -19343 -6448
9042 -30524 15622 -50696 126232 29883 262779 -205032 147537 34009 -114765 -67271 -132918
9031 -132918 -284949 -65551 -118354 134439 260107 -222007 -114946 -452881 37809 -27677
9020 -181301 -275491 -376821 -151760 -25601 180211 -211930 -107854 50690 72331 263738
9010 263738 15431 77887 9608 301524 14108 2744 62372 20438 24365 30977 367306 -58333
$$ packed form
9089a12882b7325D0526J2102b7913A96437f0041D62698c34370C38398a32856b9372
9077a85829B8541J1829b32666c6593A22345c12485A52871e8972b3021c958j44589
9066a48547a9262C3613Q6091a36270F6874a8199m6200B97484b48332a05504L1654
9055g3850o8217L1839B6495N4440Q9458d3322a4041j13573o850q4281a9343f448
9042c0524A5622e0696A26232B9883K32896b05032A47537C4009a14765M7494o5647
9031a32918j52031f5551n2803A34439J25668b22007J07061l37935C7809b7677
9020a81301r4190j01330a51760b5601A80211b11930J04076E0690K1641J91407
9010B63738A5431O2456I608K91916A4108B744N9628B0438L927O612L36329e8333
$$ plain form
8997 -97660 -245175 9412 -146192 -152557 217562 20316 -224682 -323415 -146115 -313393 -53929
8985 -285062 -92726 97478 113644 -112959 236983 -208354 -162749 22074 -384345 -299726 -350411
8974 -350411 65910 -25698 27685 128580 -180609 -70238 8047 -112016 60917 -36863 -122949
8963 -122949 -46046 -271906 -65174 -36111 -31363 24185 -96892 70595 -245417 -116404 48016
8951 -202615 31341 -45103 -132604 56442 -10651 -33949 12969 133085 -244146 -140364 -53145
8939 -100713 968 -264324 -163383 52153 114515 91001 41156 180208 -99684 158641 84314
8928 84314 346532 246203 381780 747021 1324979 1747560 1602067 1548815 2230681 2328396
8918 2328396 1568197 1534266 1590811 1432802 1221048 1146677 1009684 949372 1327327 918363
$$ packed form
8997i7660j47515I412a46192o365B17562B0316b24682r8733a46115j67278e3929
8985b85062i2726I7478J6166a12959B36983b08354M5605B2074c84345Q4619n0685
8974c50411F5910b5698B7685J00895a80609g0238H047a12016F0917c6863q6086
8963a22949d6046k25860f5174K9063M748B4185i6892G0595b45417a16404D8016
8951b02615C1341d5103q7501E6442a0651k3298A2969J20116b44146J03782e3145
8939a00713I68b64324J00941E2153O2362k3514D1156J39052i9684A58641p4327
8928H4314K62218j00329J35577L65241N77958M22581j45493n3252O81866R7715
8918B328396p60199l3931N6545j58009k11754p4371j36993o0312L77955m08964
$$ plain form
8908 918363 1159323 1166958 1128823 996062 858004 1071545 943656 572655 989580 671963
8898 671963 524030 756005 534332 653309 536684 535267 110114 673874 215797 274668
8888 274668 283596 255343 -63168 -56353 410484 170249 32561 318819 477368 -78861 112006
$$ packed form
8908I18363K40960P635l8135j32761j38058K13541j27889l71001M16925l17617
8898F71963j47933K31975k21673J18977j16625j417A10114N63760B15797N8871
8888B74668Q928k8253f3168O815D10484A70249C2561K86258J58549g8861A12006
$$ [...]
##END NTUPLES=NMR SPECTRUM
##END=
