##TITLE=AC1396_KENAH12208_7519595_p3BysR0INB
##JCAMPDX= 6.0         $$ Bruker NMR JCAMP-DX V2.0
##DATA TYPE= NMR SPECTRUM
##DATA CLASS= NTUPLES
##ORIGIN= BRUKER
##OWNER= Administrator
$$ 1.72 TOPSPIN		Version 2.1
$$ 2013-07-18 14:44:39.294 -0700  Administrator@X
$$ Compression mode = diff/dup
##.OBSERVE FREQUENCY= 400.02188249412
##.OBSERVE NUCLEUS= ^1H
##.ACQUISITION MODE= SIMULTANEOUS (DQD)
##.ACQUISITION SCHEME= undefined
##.AVERAGES= 64
##.DIGITISER RES= 22
##SPECTROMETER/DATA SYSTEM= spect
##.PULSE SEQUENCE= noesygpps1d.comp
##.SOLVENT NAME= COFFEE_meoh
##.SHIFT REFERENCE= INTERNAL, COFFEE_meoh, 1, 14.96213
##AUDIT TRAIL= $$ (NUMBER, WHEN, WHO, WHERE, PROCESS, VERSION, WHAT)
$$ ##TITLE= Audit trail, TOPSPIN		Version 2.1
$$ ##JCAMPDX= 5.01
$$ ##ORIGIN= Bruker BioSpin GmbH
$$ ##OWNER= Administrator
$$ $$ E:\/data/COFFEE/nmr/AC1396_KENAH12208_7519595_p3BysR0INB/12/pdata/1/auditp.txt
$$ ##AUDIT TRAIL=  $$ (NUMBER, WHEN, WHO, WHERE, PROCESS, VERSION, WHAT)
(   1,<2013-07-18 14:44:34.513 -0700>,<Administrator>,<X>,<go>,<TOPSPIN 2.1>,
      <created by zg
	started at 2013-07-18 14:33:04.886 -0700,
	POWCHK enabled, PULCHK disabled,
       configuration hash MD5:
       C8 4E 4E 5D D3 5C D8 9E 9F 52 82 E0 59 8A DE 15
       data hash MD5: 64K
       22 36 86 7B 2F 12 78 F1 40 81 BB BE 8B 79 1F 8E>)
(   2,<2013-07-18 14:44:37.450 -0700>,<Administrator>,<X>,<proc1d>,<TOPSPIN 2.1>,
      <Start of raw data processing
       efp LB = 0.3 FT_mod = 6 PKNL = 1 PHC0 = 0 PHC1 = 0 SI = 128K 
       data hash MD5: 128K
       74 C6 F5 97 FF 30 B3 6A 3A 03 C3 7F 5F 00 2E 01>)
(   3,<2013-07-18 14:44:38.357 -0700>,<Administrator>,<X>,<proc1d>,<TOPSPIN 2.1>,
      <pk PHC0 = -79.78271 PHC1 = 0 
       data hash MD5: 128K
       53 9F 2A FE A6 7D 17 9E 7D E6 DB 27 EB 30 E9 90>)
(   4,<2013-07-18 14:44:38.763 -0700>,<Administrator>,<X>,<proc1d>,<TOPSPIN 2.1>,
      <abs ABSG = 1 
       data hash MD5: 128K
       20 A6 BA A7 91 B6 8A 9F F8 3A 0B C1 82 EC B7 CA>)
(   5,<2013-07-18 14:44:38.857 -0700>,<Administrator>,<X>,<proc1d>,<TOPSPIN 2.1>,
      <abs ABSG = 2 
       data hash MD5: 128K
       A5 A5 E1 13 08 11 A9 8D CE 30 9E F4 4C 6C 1E FA>)
(   6,<2013-07-18 14:44:38.950 -0700>,<Administrator>,<X>,<proc1d>,<TOPSPIN 2.1>,
      <abs ABSG = 3 
       data hash MD5: 128K
       64 D8 1E 84 B8 6B FF 61 D3 C3 70 61 47 95 DE DD>)
(   7,<2013-07-18 14:44:39.028 -0700>,<Administrator>,<X>,<proc1d>,<TOPSPIN 2.1>,
      <abs ABSG = 4 
       data hash MD5: 128K
       B8 88 62 BD 54 81 35 6D 26 6E 2A 5B 51 D8 DB 0C>)
(   8,<2013-07-18 14:44:39.107 -0700>,<Administrator>,<X>,<proc1d>,<TOPSPIN 2.1>,
      <abs ABSG = 5 
       data hash MD5: 128K
       C2 27 FE CD 38 AC CC D1 9C 0D 58 02 AF 8A 17 01>)
$$ ##END=
$$ 
$$ $$ hash MD5
$$ $$ 7A 74 82 5C C9 3D AD 3D 09 7E 85 77 F3 72 60 E8
##$RELAX= 
##$RELAX= 
##$RELAX= 
##$RELAX= 
##$RELAX= 
##$RELAX= 
##$RELAX= 
##$RELAX= 
$$ Bruker specific parameters
$$ --------------------------
##$DU= <E:\>
##$EXPNO= 12
$$ [...]
##$TP07= 0
##$TPNAME0= <>
##$TPNAME1= <>
##$TPNAME2= <>
##$TPNAME3= <>
##$TPNAME4= <>
##$TPNAME5= <>
##$TPNAME6= <>
##$TPNAME7= <>
##$TPOAL= (0..7)
0.5 0.5 0.5 0.5 0.5 0.5 0.5 0.5
##$TPOFFS= (0..7)
0 0 0 0 0 0 0 0
##$TUNHIN= 0
##$TUNHOUT= 0
##$TUNXOUT= 0
##$USERA1= <user>
##$USERA2= <user>
##$USERA3= <user>
##$USERA4= <user>
##$USERA5= <user>
##$V9= 5
##$VALIST= <valist>
##$VCLIST= <CCCCCCCCCCCCCCC>
##$VD= 0
##$VDLIST= <DDDDDDDDDDDDDDD>
##$VPLIST= <PPPPPPPPPPPPPPP>
##$VTLIST= <TTTTTTTTTTTTTTT>
##$WBST= 1024
##$WBSW= 4
##$XGAIN= (0..3)
0 0 0 0
##$XL= 0
##$YL= 0
##$YMAX_a= 7452245
##$YMIN_a= -12807633
##$ZGOPTNS= <>
##$ZL1= 120
##$ZL2= 120
##$ZL3= 120
##$ZL4= 120
##$ABSF1= 14.96213
##$ABSF2= -5.596052
##$ABSG= 5
##$ABSL= 3
##$ALPHA= 0
##$AQORDER= 0
##$ASSFAC= 0
##$ASSFACI= 0
##$ASSFACX= 0
##$ASSWID= 0
##$AUNMP= <proc_prof1d_extract.lims>
##$AXLEFT= 0
##$AXNAME= <>
##$AXNUC= <1H>
##$AXRIGHT= 0
##$AXTYPE= 0
##$AXUNIT= <>
##$AZFE= 0.1
##$AZFW= 0.1
##$BCFW= 0
##$BC_mod= 0
##$BYTORDP= 0
##$COROFFS= 0
##$CY= 15
##$DATMOD= 1
##$DC= 0
##$DFILT= <>
##$DTYPP= 0
##$F1P= 0
##$F2P= 0
##$FCOR= 0.5
##$FTSIZE= 131072
##$FT_mod= 6
##$GAMMA= 0
##$GB= 0
##$INTBC= 1
##$INTSCL= 1
##$ISEN= 128
##$LB= 0.3
##$LEV0= 0
##$LPBIN= 0
##$MAXI= 10000
##$MC2= 0
##$MEAN= 0
##$ME_mod= 0
##$MI= 0
##$NCOEF= 0
##$NC_proc= -3
##$NLEV= 6
##$NOISF1= 0
##$NOISF2= 0
##$NSP= 0
##$NTH_PI= 0
##$NZP= 0
##$OFFSET= 14.96213
##$PC= 1
##$PHC0= -79.78271
##$PHC1= 0
##$PH_mod= 1
##$PKNL= yes
##$PPARMOD= 0
##$PPDIAG= 0
##$PPIPTYP= 0
##$PPMPNUM= 2147483647
##$PPRESOL= 1
##$PSCAL= 4
##$PSIGN= 0
##$PYNMP= <proc.py>
##$REVERSE= no
##$SF= 400.020009184797
##$SI= 131072
##$SIGF1= 0
##$SIGF2= 0
##$SINO= 400
##$SIOLD= 131072
##$SPECTYP= <>
##$SREGLST= <1H.CDCl3>
##$SSB= 0
##$STSI= 131072
##$STSR= 0
##$SW_p= 8223.68421052631
##$SYMM= 0
##$S_DEV= 0
##$TDeff= 65536
##$TDoff= 0
##$TI= <>
##$TILT= no
##$TM1= 0
##$TM2= 0
##$TOPLEV= 0
##$USERP1= <user>
##$USERP2= <user>
##$USERP3= <user>
##$USERP4= <user>
##$USERP5= <user>
##$WDW= 1
##$XDIM= 131072
##$YMAX_p= 155817944
##$YMIN_p= -358971497
##$CURPLOT= <Network HP LaserJet P1505>
##$CURPRIN= <$Network HP LaserJet P1505>
##$DFORMAT= <normdp>
##$LAYOUT= <+/1D_H.xwp>
##$LFORMAT= <normlp>
##$PFORMAT= <normpl>
##$SURQMSG= 1
$$ End of Bruker specific parameters
$$ ---------------------------------
##NTUPLES= NMR SPECTRUM
##VAR_NAME=  FREQUENCY,     SPECTRUM/REAL,   SPECTRUM/IMAG
##SYMBOL=    X,             R,               I
##VAR_TYPE=  INDEPENDENT,   DEPENDENT,       DEPENDENT
##VAR_FORM=  AFFN,          ASDF,            ASDF
##VAR_DIM=   131072,        131072,          131072
##UNITS=     HZ,            ARBITRARY UNITS, ARBITRARY UNITS
##FACTOR=    0.0627417313425164, 1,          1
##FIRST=     8223.62146879497, 325,          -125306
##LAST=      0,             5760,            -126258
##MIN=       0,             -358971497,      0
##MAX=       8223.62146879497, 155817944,    0
$$ Real data points
##PAGE= N=1
##DATA TABLE= (X++(R..R)), XYDATA
$$ [...]
62705A645435P519R043J1636J3620J4403J4764J5311J5910J6592J7759J9252K0171
62693A821415J9937J8968J8099J7829J8045J7967J6579J3851J1289J0374J0729
62682A995082J0835J0213R564Q842O963L808R28o27j847m129p171r558j0648j0851
62668B001404j0623j0249j0176j0704j1621j2661j3901j5217j6016j6082j6026
62657A858128j6291j6379j5829j5135j4867j4690j4180j3858j4197j4328j3105
62646A695269j1055r843r941j0222r940r764j0453j1575j2104j1601j0452r352
62634A568967q831q894r035q816q259p539o749o324o926q163q299o377m019l710
62620A467026n522p032o487m604l114k832l605m869n674n149l577k201j610j168
$$ y = [1645435, 1652954, 1661997, 1673633, 1687253, 1701656, 1716420, 1731731, 1747641, 1764233, 1781992, 1801244, 1821415, 1841352, 1860320, 1878419, 1896248, 1914293, 1932260, 1948839, 1962690, 1973979, 1984353, 1995082, 2005917, 2016130, 2025694, 2034536, 2041499, 2045307, 2046235, 2045608, 2043761, 2039632, 2032461, 2022903, 2012255, 2001404, 1990781, 1980532, 1970356, 1959652, 1948031, 1935370, 1921469, 1906252, 1890236, 1874154, 1858128, 1841837, 1825458, 1809629, 1794494, 1779627, 1764937, 1750757, 1736899, 1722702, 1708374, 1695269, 1684214, 1674371, 1664430, 1654208, 1644268, 1634504, 1624051, 1612476, 1600372, 1588771, 1578319, 1568967, 1560136, 1551242, 1542207, 1533391, 1525132, 1517593, 1510844, 1504520, 1497594, 1489431, 1481132, 1474755, 1470736, 1467026, 1461504, 1454472, 1447985, 1443381, 1440267, 1437435, 1433830, 1428961, 1423287, 1418138, 1414561, 1412360, 1410750, 1409582]
62606A409582m29o5p42j876k228j214Q58L197M810N077M601M837O326P934Q372
62591A449040P835P492P830Q195P727O285M605L717L911M255L690K520J902J897
62577A520901J203p88k912l921m025l909l424k452k082l383n646p277p944q451
62563A465890q857q471p618p708r053j0097r482p794o537o298o654p197p835q400
62549A353889q617q399p832p049o218n435m613l813l535m104m890m866m015l345
62535A277158l329l283k691k115k091j935p50R44J716J256Q66J799L793N570O173
62520A283081N593M508L801M115N539P529R106R365Q285P156P682J0073J2564
62507A378397J3388J2905J2894J3985J4966J4796J4160J4294J5089J5304J4340
$$ y = [1409582, 1409153, 1409088, 1408346, 1406470, 1404242, 1403028, 1403886, 1407083, 1411893, 1416970, 1421571, 1426408, 1432734, 1440668, 1449040, 1456875, 1464367, 1472197, 1480392, 1488119, 1494404, 1499009, 1502726, 1506637, 1510892, 1514582, 1517102, 1519004, 1520901, 1522104, 1521316, 1518404, 1514483, 1510458, 1506549, 1503125, 1500673, 1498591, 1495208, 1489562, 1482285, 1474341, 1465890, 1457033, 1448562, 1440944, 1433236, 1424183, 1414086, 1404604, 1396810, 1390273, 1383975, 1377321, 1370124, 1362289, 1353889, 1345272, 1336873, 1329041, 1321992, 1315774, 1310339, 1305726, 1301913, 1298378, 1294274, 1289384, 1284518, 1280503, 1277158, 1273829, 1270546, 1267855, 1265740, 1263649, 1261714, 1260964, 1261908, 1263624, 1264880, 1265746, 1267545, 1271338, 1276908, 1283081, 1288674, 1293182, 1296983, 1301098, 1306637, 1314166, 1323272, 1332637, 1340922, 1348078, 1355760, 1365833, 1378397, 1391785, 1404690, 1417584, 1431569, 1446535, 1461331, 1475491, 1489785, 1504874, 1520178, 1534518]
62496A534518J3021J2572J3377J4735J5633J5640J5148J4598J3712J2089J0532
62485A685575J0718J3039J5651J6571J5886J4897J3823J1921R473P899P657P606
62473A830716O871N905N060L646J400m16p09l88j169l201n196o453p381q281q893
62458A811511r144r285r273q986r024j0175j2059j3202j2693j1059r537r107j0056
62445A677911j1608j2244j1214r510q417p598o000m111l526m318m884m659m901
62432A584921o077o579n258l414k859l486m216m865n425m942l184k204l958p017
62418A521437q077o455m672m541n104n041m857n487o478o875o827p045p392p117
62404A435469o075m938m453m887n905o689o679o274o254o507o195n283m883n622
$$ y = [1534518, 1547539, 1560111, 1573488, 1588223, 1603856, 1619496, 1634644, 1649242, 1662954, 1675043, 1685575, 1696293, 1709332, 1724983, 1741554, 1757440, 1772337, 1786160, 1798081, 1807554, 1815453, 1823110, 1830716, 1837587, 1843492, 1848552, 1852198, 1853598, 1853182, 1852473, 1852085, 1850916, 1847715, 1842519, 1836066, 1828685, 1820404, 1811511, 1802367, 1793082, 1783809, 1774823, 1765799, 1755624, 1743565, 1730363, 1717670, 1706611, 1697074, 1687967, 1677911, 1666303, 1654059, 1642845, 1633335, 1624918, 1617320, 1611320, 1607209, 1603683, 1599365, 1594481, 1589822, 1584921, 1578844, 1572265, 1567007, 1563593, 1560734, 1557248, 1553032, 1548167, 1542742, 1537800, 1534616, 1532412, 1528454, 1521437, 1513360, 1506905, 1502233, 1497692, 1492588, 1487547, 1482690, 1477203, 1470725, 1463850, 1457023, 1449978, 1442586, 1435469, 1429394, 1424456, 1420003, 1415116, 1409211, 1402522, 1395843, 1389569, 1383315, 1376808, 1370613, 1365330, 1360447, 1354825]
62390A354825o676o919o217n006l512k047j198r65m17Q43J658P30j339k578j954
62375A319228k59J160J632J214M70L65J585L686N398N971N874O017O795Q078R731
62360A376945J1724J3761J5127J5199J4243J3352J3289J3609J3481J3178J3837
62349A527745J5624J7145J7180J6070J4696J3132J1309J0087J0230J0785J0027
62338A674030P994O449O122N493L089k26k333k464j714j405j871k767l735m498
62324A682164m845m790m690n062o112p409q144q045p793q087q513q096o989o665
62310A586924p895r409r391p831o416o314o939p089o463n611m909m278l769l797
62296A496813m470n099m899m074l574l644l351k070p26n99j401j744j334j276
$$ y = [1354825, 1348149, 1341230, 1335013, 1330007, 1326495, 1324448, 1323250, 1322285, 1321868, 1322711, 1324369, 1325099, 1323760, 1321182, 1319228, 1318969, 1320129, 1321761, 1322975, 1323445, 1323810, 1325395, 1329081, 1334479, 1340450, 1346324, 1352341, 1359136, 1367214, 1376945, 1388669, 1402430, 1417557, 1432756, 1446999, 1460351, 1473640, 1487249, 1500730, 1513908, 1527745, 1543369, 1560514, 1577694, 1593764, 1608460, 1621592, 1632901, 1642988, 1653218, 1664003, 1674030, 1682024, 1688473, 1694595, 1700088, 1703177, 1702951, 1700618, 1698154, 1696440, 1695035, 1693164, 1690397, 1686662, 1682164, 1677319, 1672529, 1667839, 1662777, 1656665, 1649256, 1641112, 1633067, 1625274, 1617187, 1608674, 1600578, 1593589, 1586924, 1579029, 1569620, 1560229, 1552398, 1545982, 1539668, 1532729, 1525640, 1519177, 1513566, 1508657, 1504379, 1500610, 1496813, 1492343, 1487244, 1482345, 1478271, 1474697, 1471053, 1467702, 1465632, 1464906, 1464307, 1462906, 1461162, 1459828, 1458552]
62282A458552j962k280j577r32j266j477K7K663M287M083L241K882L017L670N231
62267A478159P131P739O576N422O154Q391J0370J1325J1827J2337J2734J3148
62255A591313J4056J5336J6043J5422J3740J2026J1385J2273J3937J4686J3520
62244A743737J1434J0352J0676J0701Q886N931L863L424L352K321P36j31k88j265
62230A813729l960p113q669q184p016o420o464o839p550q425q855q636q291q012
62216A709295p167n608m586n382p460r048r031p525n148k889k150l482n421n888
62202A628510m675l278k428j422m9N89m2p74m91K16K64o4K62J221J845J750J430
62185A622864J254J153J223J799K790L603L762L252K368J646J712K707L996M824
$$ y = [1458552, 1456590, 1454310, 1452733, 1451801, 1450535, 1449058, 1449085, 1451748, 1456035, 1460118, 1463359, 1466241, 1469258, 1472928, 1478159, 1485290, 1493029, 1499605, 1505027, 1511181, 1519572, 1529942, 1541267, 1553094, 1565431, 1578165, 1591313, 1605369, 1620705, 1636748, 1652170, 1665910, 1677936, 1689321, 1701594, 1715531, 1730217, 1743737, 1755171, 1765523, 1776199, 1786900, 1795786, 1801717, 1805580, 1809004, 1812356, 1814677, 1815413, 1815282, 1814994, 1813729, 1809769, 1802656, 1793987, 1785803, 1778787, 1772367, 1765903, 1759064, 1751514, 1743089, 1734234, 1725598, 1717307, 1709295, 1702128, 1696520, 1691934, 1686552, 1679092, 1670044, 1661013, 1653488, 1648340, 1645451, 1643301, 1639819, 1634398, 1628510, 1623835, 1620557, 1618129, 1616707, 1616658, 1617247, 1617205, 1616431, 1615940, 1616156, 1616420, 1616356, 1616618, 1617839, 1619684, 1621434, 1622864, 1624118, 1625271, 1626494, 1628293, 1631083, 1634686, 1638448, 1641700, 1644068, 1645714, 1647426, 1650133, 1654129, 1658953]
62171A658953N182N639O611P997R336J0047R882R331R141R211Q681P402O520O878
62157A770811P657P560O649N955N744N395M816M723N320N774N229L611J309j185
62143A839368l139l864l426k645k233k404l179m377n328n390m908m868n476n892
62129A782239n604n278n660o421o662o213n686n481n373n131n070n546o102n665
62115A702347m004k549k875m444m998l568j904j950l162l706l408l627m529m620
62101A653003l292j978k026k893l335l152k865k626k397k472k951l304l127k692
62087A613893k114q09J417L404L722K352O00l07L4J277K487K718K142K253M191
62072A637260P212R364R479Q051O498N920O318O611N847M465L789M217M852N136
$$ y = [1658953, 1664135, 1669774, 1676385, 1684382, 1693718, 1703765, 1713647, 1722978, 1732119, 1741330, 1750011, 1757413, 1763933, 1770811, 1778468, 1786028, 1792677, 1798632, 1804376, 1809771, 1814587, 1819310, 1824630, 1830404, 1835633, 1839244, 1840553, 1839368, 1836229, 1832365, 1828939, 1826294, 1824061, 1821657, 1818478, 1814101, 1808773, 1803383, 1798475, 1793607, 1788131, 1782239, 1776635, 1771357, 1765697, 1759276, 1752614, 1746401, 1740715, 1735234, 1729861, 1724730, 1719660, 1714114, 1708012, 1702347, 1698343, 1695794, 1692919, 1688475, 1683477, 1679909, 1678005, 1676055, 1672893, 1669187, 1665779, 1662152, 1657623, 1653003, 1649711, 1647733, 1645707, 1642814, 1639479, 1636327, 1633462, 1630836, 1628439, 1625967, 1623016, 1619712, 1616585, 1613893, 1611779, 1610970, 1612387, 1615791, 1619513, 1621865, 1622465, 1622158, 1622192, 1623469, 1625956, 1628674, 1630816, 1633069, 1637260, 1644472, 1653836, 1663315, 1671366, 1677864, 1683784, 1690102, 1696713, 1702560, 1707025, 1710814, 1715031, 1719883, 1725019]
62058A725019N555O230O239N246M489M832N086L736J356l78j260k310l553m065
62044A756222l988m556o029p392q200r076j0084j0353r739r250r351r363r041
62031A649800r129r782j0072r799j0033j0926j0857r122p772q764j0704j0696
62019A532144q669p420q429r969r986q871q279q524q497p486n966m748m229m551
62005A426520n732p339q353p849n946l823k643k566l014l601m319n010n306n357
61991A355662n836o920p746p426o173n012m718n320o294o806o274n134m645n446
61977A271912o740p343p052o333n401m394l921m329m844m625m308n158o860p741
61963A192863p333o917p025o414m687l998o149r204r468o430l323k595l181l057
$$ y = [1725019, 1730574, 1736804, 1743043, 1748289, 1752778, 1757610, 1762696, 1766432, 1767788, 1767410, 1766150, 1763840, 1760287, 1756222, 1752234, 1747678, 1741649, 1734257, 1726057, 1716981, 1706897, 1696544, 1686805, 1677555, 1668204, 1658841, 1649800, 1640671, 1630889, 1620817, 1611018, 1600985, 1590059, 1579202, 1570080, 1562308, 1553544, 1542840, 1532144, 1523475, 1516055, 1507626, 1497657, 1487671, 1478800, 1470521, 1461997, 1453500, 1446014, 1440048, 1435300, 1431071, 1426520, 1420788, 1413449, 1405096, 1397247, 1391301, 1387478, 1384835, 1382269, 1379255, 1375654, 1371335, 1366325, 1361019, 1355662, 1349826, 1342906, 1335160, 1327734, 1321561, 1316549, 1311831, 1306511, 1300217, 1293411, 1287137, 1282003, 1277358, 1271912, 1265172, 1257829, 1250777, 1244444, 1239043, 1234649, 1230728, 1226399, 1221555, 1216930, 1212622, 1207464, 1200604, 1192863, 1185530, 1178613, 1171588, 1165174, 1160487, 1156489, 1150340, 1141136, 1131668, 1125238, 1121915, 1119320, 1116139, 1113082]
61949A113082k220j674j220k27M96l08k008k689j918j010n64K82J660K150J108
61934A104940L6L73J375J701J732K547L632L719L293L993N695O421N349L804K765
61919A151375J594J25j61J497L327L379K337K071K353J330j033k315q94J904L679
61904A170568L732L144K869K728K011N68p63q12O53K550L671L914L763L090J455
61889A203141o32k047k675l423m321m057k221o47j167k874l297j954j047k195
61875A170584m108m496l209k048j858j413L04K137K140L11j326j257O5J431K373
61860A159630K858K634J809J471K471M035M649M193M012M813N812O341P010Q484
61846A220222J0008J0307R470Q918R520J0631J1099J0558R442Q174O766N091L367
$$ y = [1113082, 1110862, 1109188, 1107968, 1107741, 1108237, 1107929, 1105921, 1103232, 1101314, 1100304, 1099740, 1100022, 1101682, 1103832, 1104940, 1104976, 1105349, 1106724, 1108425, 1110157, 1112704, 1116336, 1120055, 1123348, 1127341, 1133036, 1139457, 1144806, 1148610, 1151375, 1152969, 1153094, 1152933, 1154430, 1157757, 1161136, 1163473, 1165544, 1167897, 1169227, 1168194, 1165879, 1164985, 1166889, 1170568, 1174300, 1177444, 1180313, 1183041, 1185052, 1185620, 1184857, 1184045, 1184698, 1187248, 1190919, 1194833, 1198596, 1201686, 1203141, 1202509, 1200462, 1197787, 1194364, 1190043, 1185986, 1183765, 1183118, 1181951, 1179077, 1175780, 1173826, 1172779, 1170584, 1166476, 1161980, 1158771, 1156723, 1154865, 1153452, 1153756, 1155893, 1158033, 1158344, 1157018, 1155761, 1155826, 1157257, 1159630, 1162488, 1165122, 1166931, 1168402, 1170873, 1174908, 1179557, 1183750, 1187762, 1192575, 1198387, 1204728, 1211738, 1220222, 1230230, 1240537, 1250007, 1258925, 1268445, 1279076, 1290175, 1300733, 1310175, 1318349, 1325115, 1330206, 1333573]
61833A333573K264K391L685N341O546P169P613Q089Q279P652O082M115K623K147
61819A407569K512L069L222K649J324l43j549j838j718j996k400j710L64K177
61805A411332J841m63k784l798m028m478n132n271m656l643k638k081k683m680
61791A366838o880p436n910l856k899k953l081l313m400o087p025o645n845n402
61777A295106m832l650k637k717l352l347k745k611l097l182k408j631j713k464
61763A254720l227l531k964j461j0K7j260k300k319k309l023l449k553j356j594
61748A223391l014l740l030k055j911k340k677k754k592k215k105k817l864m067
61734A184210l311k853l374l917l551k989l423m430m397k851j205r29j776k310
$$ y = [1333573, 1335837, 1338228, 1341913, 1347254, 1353800, 1360969, 1368582, 1376671, 1384950, 1392602, 1398684, 1402799, 1405422, 1407569, 1410081, 1413150, 1416372, 1419021, 1420345, 1420002, 1418453, 1416615, 1414897, 1412901, 1410501, 1408791, 1409155, 1411332, 1413173, 1412710, 1409926, 1406128, 1402100, 1397622, 1392490, 1387219, 1382563, 1378920, 1376282, 1374201, 1371518, 1366838, 1359958, 1352522, 1346612, 1342756, 1339857, 1336904, 1333823, 1330510, 1326110, 1320023, 1312998, 1306353, 1300508, 1295106, 1290274, 1286624, 1283987, 1281270, 1277918, 1274571, 1271826, 1269215, 1266118, 1262936, 1260528, 1258897, 1257184, 1254720, 1251493, 1247962, 1244998, 1243537, 1243527, 1243554, 1242294, 1239994, 1237675, 1235366, 1232343, 1228894, 1226341, 1224985, 1223391, 1220377, 1216637, 1213607, 1211552, 1209641, 1207301, 1204624, 1201870, 1199278, 1197063, 1194958, 1192141, 1188277, 1184210, 1180899, 1178046, 1174672, 1170755, 1167204, 1164215, 1160792, 1156362, 1151965, 1149114, 1147909, 1146980, 1145204, 1142894]
61720A142894j772j001j359l016m576m671l563k642k531k541k168k030k729l600
61706A104695l639l173l426m571n274m511k853j511q67o63j053k469m461n592
61692A060632n040l777l557m804o028n574l539j685j610l278n297o409o550o513
61678I96971o529n604k819P61K466J009j615k312n97R91K46k253m412n129m642
61663I66532l338j520j08l22k297m518n060l384q64M06m22k184l071k629j881
61648I35340j556j184l57J95l10j305j652j372j432k001k121j251n3N80M66j94
61632I21793j203k132k435k236k260k618k385r62Q25J664J294M22m92j532k660
61617I05083l565m125m404m102k766p04Q79J023q0j570k944m206n245n585m803
$$ y = [1142894, 1141122, 1140121, 1138762, 1135746, 1131170, 1126499, 1122936, 1120294, 1117763, 1115222, 1113054, 1111024, 1108295, 1104695, 1101056, 1097883, 1094457, 1089886, 1084612, 1080101, 1077248, 1075737, 1074870, 1074207, 1073154, 1070685, 1066224, 1060632, 1055592, 1051815, 1048258, 1043454, 1037426, 1031852, 1028313, 1026628, 1025018, 1021740, 1016443, 1010034, 1003484, 996971, 990442, 984838, 982019, 982780, 985246, 986255, 984640, 982328, 981731, 982722, 982968, 980715, 976303, 971174, 966532, 963194, 961674, 961566, 961244, 958947, 954429, 949369, 945985, 945121, 945527, 945105, 942921, 939850, 937221, 935340, 933784, 932600, 932243, 932438, 932128, 930823, 929171, 927799, 926367, 924366, 922245, 920994, 920941, 921521, 921987, 921793, 920590, 918458, 916023, 913787, 911527, 908909, 906524, 905562, 906387, 908051, 909345, 909767, 909275, 907743, 905083, 901518, 897393, 892989, 888887, 886121, 885417, 886296, 887319, 887239, 885669, 882725, 878519, 873274, 867689, 862886]
61602H62886l002q53O26N61j044l010l836l183k171j963k483k948l214l806m705
61587H27855n079m453l435k877k865k928k810k533k150j800j651j466p51K74N57
61572G93888l93j638k068j798j492j091l91k44j571l482m022k850j660j625k001
61557G67562j757j137q25q45j110j894k829k654r92O10N98n69j395j508j429j084
61541G48742j89L63p25l005m491m162k855j476J43K071L347L113J819N51k60p61
61525G42225r25o26j79j32n59r74r32n63m67j094k048k241j086N80J310P18k53
61508G32754p22p88q38p66l51J05J75Q2M05J093J320N05q25j562j260n91l99o11
61490G27726m10N63J719K272J929P03j233l098l633k368l44J147K031K876L379
$$ y = [862886, 859884, 859031, 859657, 860218, 859174, 856164, 852328, 849145, 846974, 845011, 842528, 839580, 836366, 832560, 827855, 822776, 818323, 814888, 812011, 809146, 806218, 803408, 800875, 798725, 796925, 795274, 793808, 793057, 793331, 793888, 793495, 791857, 789789, 787991, 786499, 785408, 785017, 784773, 783202, 779720, 775698, 772848, 771188, 769563, 767562, 765805, 764668, 763843, 762998, 761888, 759994, 757165, 754511, 753519, 754129, 754727, 754158, 752763, 751255, 749826, 748742, 748553, 748916, 748191, 745186, 740695, 736533, 733678, 732202, 732345, 734416, 737763, 740876, 742695, 743246, 742986, 742225, 741300, 740674, 740495, 740363, 739804, 738830, 737898, 737335, 736868, 735774, 733726, 731485, 730399, 730979, 732289, 733007, 732754, 732032, 731244, 730406, 729640, 729289, 729394, 729569, 729651, 730056, 731149, 732469, 732974, 732149, 730587, 729327, 728736, 728337, 727726, 727316, 727879, 729598, 731870, 733799, 734502, 733269, 730171, 726538, 724170, 723826, 724973, 727004, 729880, 733259]
61475G33259K587N44j459k383k325j733p10N15J216P60o80k130k352p51J655K676
61459G28689J266r18j385J66J860K388K077J312j14j572j516J86J587J538J564
61444G37128L358N715N973L756J323M50O13L82p57k179k876k264p69N25J115J458
61428G52951J687J039n74j530m75J574K686K822L293L960L240J050m76M7J343
61413G72637J435K29q68q12L67J997L124L125K369J647R25l35j592j387L87J877
61397G85125J715P26K56J88j28j35J039K711L276K424J306P20M55L35N30P53L28
61380H01624o14j130r08o94r60j140p79m94j022j855j650J62K755M751N311M533
61364H07890L267K504K560K830K489J460M58J58O16J560K884M476N786O048N143
$$ y = [733259, 735846, 736390, 734931, 732548, 730223, 728490, 727780, 728295, 729511, 730271, 729591, 727461, 725109, 724358, 726013, 728689, 729955, 729037, 727652, 727818, 729678, 732066, 734143, 735455, 735341, 733769, 732253, 732439, 734026, 735564, 737128, 740486, 746201, 752174, 755930, 757253, 757703, 758316, 758698, 757941, 755762, 752886, 750622, 749853, 750378, 751493, 752951, 754638, 755677, 755103, 753573, 753098, 754672, 757358, 760180, 763473, 767433, 770673, 771723, 771247, 771294, 772637, 774072, 774301, 773433, 772621, 772988, 774985, 778109, 781234, 783603, 785250, 786175, 785840, 784248, 782861, 783248, 785125, 786840, 787566, 787822, 788010, 787882, 787747, 788786, 791497, 794773, 797197, 798503, 799223, 799678, 800013, 800543, 801296, 801624, 801010, 799880, 798972, 798278, 797318, 796178, 795399, 794905, 793883, 792028, 790378, 790540, 793295, 798046, 803357, 807890, 811157, 813661, 816221, 819051, 821540, 823000, 823458, 823616, 824232, 825792, 828676, 833152, 838938, 844986, 850129]
61349H50129L932L320L192K651J441N95J241K953L843K661M92k77J176K915K587
61334H82851N09o42O34K796L557K796J918J270J08j184r04J395L842M663M269
61319I07878L982L972L770L657M063M297L556K671L134M568N057M119L517M384
61305I62625N361M752L179K541L076L217K207J214J391K024J660L46k79Q69K940
61290I97123M259M208L495K845K157J090k04j276j934k146j683l44J491L048L859
61275A015988M036L842L388K799K367K471L268M427N008M165K233Q05J034K164
61261A057995K558K014K110L891O138O660M832K245R20J465K908L944M109L770
61247A105559L177K007J78j232p35J734M496N984O246O106N565M013J699q6n31
$$ y = [850129, 854061, 857381, 860573, 863224, 864665, 865260, 866501, 869454, 873297, 875958, 876450, 876173, 877349, 880264, 882851, 883360, 882718, 883352, 886148, 889705, 892501, 894419, 895689, 895797, 894613, 893709, 895104, 898946, 903609, 907878, 911860, 915832, 919602, 923259, 927322, 931619, 935175, 937846, 940980, 945548, 950605, 954724, 958241, 962625, 967986, 972738, 975917, 978458, 981534, 984751, 986958, 988172, 989563, 991587, 993247, 993593, 993314, 994183, 997123, 1001382, 1005590, 1009085, 1011930, 1014087, 1015177, 1014973, 1013697, 1011763, 1009617, 1007934, 1007590, 1009081, 1012129, 1015988, 1020024, 1023866, 1027254, 1030053, 1032420, 1034891, 1038159, 1042586, 1047594, 1051759, 1053992, 1054797, 1055831, 1057995, 1060553, 1062567, 1064677, 1068568, 1074706, 1081366, 1086198, 1088443, 1089363, 1090828, 1093736, 1097680, 1101789, 1105559, 1108736, 1110743, 1110921, 1109689, 1108954, 1110688, 1115184, 1121168, 1127414, 1133520, 1139085, 1143098, 1144797, 1144711, 1144180]
61232A144180k09q1j98J67J376K909L951M165L859L670M141N349O706P168O070
61217A193223L972K416K403L224L377K597K257L450N410O558O517O190O120N911
61203A253625N466N537O531P606P811P417P221P000N863M170L741N658Q665J0554
61189A346865J0619R951R571R232Q180O400M721L976M413N609O663O721N693M491
61175A443105M206N015O110O690O754O787P000P164O992O406N474M381L429K800
61161A522313K318J795J487J743K139J775Q23Q87L031N933P221O312M732L685
61147A566194K882K115K261L562M412L485K122K668M900O234N515M487M869N918
61133A621624O150N838O193P063P187O337N560N458N561N561N834O441O661O126
$$ y = [1144180, 1143971, 1143890, 1143692, 1143859, 1145235, 1148144, 1152095, 1156260, 1160119, 1163789, 1167930, 1173279, 1179985, 1187153, 1193223, 1197195, 1199611, 1202014, 1205238, 1208615, 1211212, 1213469, 1216919, 1222329, 1228887, 1235404, 1241594, 1247714, 1253625, 1259091, 1264628, 1271159, 1278765, 1286576, 1293993, 1301214, 1308214, 1314077, 1318247, 1321988, 1327646, 1336311, 1346865, 1357484, 1367435, 1377006, 1386238, 1394418, 1400818, 1405539, 1409515, 1413928, 1419537, 1426200, 1432921, 1438614, 1443105, 1447311, 1452326, 1458436, 1465126, 1471880, 1478667, 1485667, 1492831, 1499823, 1506229, 1511703, 1516084, 1519513, 1522313, 1524631, 1526426, 1527913, 1529656, 1531795, 1533570, 1534393, 1535280, 1538311, 1544244, 1551465, 1557777, 1562509, 1566194, 1569076, 1571191, 1573452, 1577014, 1581426, 1584911, 1587033, 1589701, 1594601, 1600835, 1606350, 1610837, 1615706, 1621624, 1627774, 1633612, 1639805, 1646868, 1654055, 1660392, 1665952, 1671410, 1676971, 1682532, 1688366, 1694807, 1701468, 1707594]
61119A707594N522N571N947N935N750O367P996R364R028P148N514N577O879P808
61105A802000P608O882O247N532M656M230M457M302K865R56J8q9q26k530l765
61090A842543l483k438j806j544j044n54r21k295m005n466o556p219p341o921
61076A790950o069m945m018l950m804n624n380m208l295l553m688n518n031l309
61062A726558j544r49j557k374k638k412j962j344q80j100j734j597k05J416K302
61047A709980L030M434N706N484M298M108N380O513O650P106R123J1677J2969
61034A796458J2947J3044J4085J5777J7749J9751K1219K1972K3167K6251L0916
61023B013336L5434L9123M3224M8803N5195O1382O7864P5988Q5979R6819J07962
$$ y = [1707594, 1713116, 1718687, 1724634, 1730569, 1736319, 1742686, 1750682, 1760046, 1769074, 1776222, 1781736, 1787313, 1794192, 1802000, 1809608, 1816490, 1822737, 1828269, 1832925, 1837155, 1841612, 1845914, 1848779, 1849735, 1849753, 1849664, 1848838, 1846308, 1842543, 1839060, 1836622, 1834816, 1833272, 1832228, 1831674, 1830753, 1828458, 1824453, 1818987, 1812431, 1805212, 1797871, 1790950, 1784881, 1779936, 1775918, 1771968, 1767164, 1761540, 1756160, 1751952, 1748657, 1745104, 1740416, 1734898, 1729867, 1726558, 1725014, 1724065, 1722508, 1720134, 1717496, 1715084, 1713122, 1711778, 1710898, 1709798, 1708064, 1706467, 1706262, 1707678, 1709980, 1713010, 1717444, 1723150, 1728634, 1732932, 1737040, 1742420, 1748933, 1755583, 1762689, 1771812, 1783489, 1796458, 1809405, 1822449, 1836534, 1852311, 1870060, 1889811, 1911030, 1933002, 1956169, 1982420, 2013336, 2048770, 2087893, 2131117, 2179920, 2235115, 2296497, 2364361, 2440349, 2526328, 2623147, 2731109]
61012B731109J20089J34065J49996J67709J87467K09571K33384K57168K78880
61003D469438K96999L10715L19870L25236L28805L33072L39352L46888L53953
60994G424328L59523L63066L62930L56501L42942L24910L06190K87834K67682
60985A0395906K43605K15948J86634J57263J28819J02238P7940N5064L2052Q030
60975A1603499j6831m1967o6629q9495j08918j24021j35236j43690j50337j55687
60965A0570688j59883j62720j63729j62564j59280j54277j48037j41013j33754
60956I185431j26905j20838j15088j08405r9983r0657q2409p6469p2399o9216
60946H223062o6583o4360o1884n8718n5768n4432n4688n4963n3955n1682m8769
$$ y = [2731109, 2851198, 2985263, 3135259, 3302968, 3490435, 3700006, 3933390, 4190558, 4469438, 4766437, 5077152, 5397022, 5722258, 6051063, 6384135, 6723487, 7070375, 7424328, 7783851, 8146917, 8509847, 8866348, 9209290, 9534200, 9840390, 10128224, 10395906, 10639511, 10855459, 11042093, 11199356, 11328175, 11430413, 11508353, 11563417, 11595469, 11603499, 11586668, 11544701, 11478072, 11388577, 11279659, 11155638, 11020402, 10876712, 10726375, 10570688, 10410805, 10248085, 10084356, 9921792, 9762512, 9608235, 9460198, 9319185, 9185431, 9058526, 8937688, 8822600, 8714195, 8614212, 8523555, 8441146, 8364677, 8292278, 8223062, 8156479, 8092119, 8030235, 7971517, 7915749, 7861317, 7806629, 7751666, 7697711, 7646029, 7597260]
60935G597260m5876m4103m4642m7263n0009n1218n1293n1810n3558n6129n8776
60924G042583o0604o0500n8070n4576n1948n0738m9887m8546m7265m7114m8372
60913F464963n0441n2407n3368n2764n0940m9068m8076m7827m7595m7227m7406
60902E917844m8880n1508n4193n5778n6221n6721n8373o0712o2171o1989o1089
60891E290209o0687o0740o0361n9311n8196n7329n6443n5730n6144n8013o0014
60880D647241o0461n9352n8233n7978n7674n6109n3607n1786n1771n3202n4739
60869D032329n5138n4037n2175n0736n0078m9405m8013m6417m5497m4975m3829
60858C492029m2148m1217m1446m1499m0363l9050l9118m0197m0432l8968l6705
$$ y = [7597260, 7551384, 7507281, 7462639, 7415376, 7365367, 7314149, 7262856, 7211046, 7157488, 7101359, 7042583, 6981979, 6921479, 6863409, 6808833, 6756885, 6706147, 6656260, 6607714, 6560449, 6513335, 6464963, 6414522, 6362115, 6308747, 6255983, 6205043, 6155975, 6107899, 6060072, 6012477, 5965250, 5917844, 5868964, 5817456, 5763263, 5707485, 5651264, 5594543, 5536170, 5475458, 5413287, 5351298, 5290209, 5229522, 5168782, 5108421, 5049110, 4990914, 4933585, 4877142, 4821412, 4765268, 4707255, 4647241, 4586780, 4527428, 4469195, 4411217, 4353543, 4297434, 4243827, 4192041, 4140270, 4087068, 4032329, 3977191, 3923154, 3870979, 3820243, 3770165, 3720760, 3672747, 3626330, 3580833, 3535858, 3492029, 3449881, 3408664, 3367218, 3325719, 3285356, 3246306, 3207188, 3166991, 3126559, 3087591, 3050886]
60847C050886l4647l2939l1753l1732l2728l3189l1780k9214k7467k7424k8089
60836B709924k8126k7440k6952k7330k8282k8908k8491k6984k4945k3058k1696
60825B417712k0888k0639k1086k2242k3584k4178k3477k2027k1054k1197k1812
60814B175528k1766k0787j9611j8900j8421j7565j6358j5484j5418j5913j6451
60803A978854j6825j7020j6771j5812j4591j4119j4753j5502j5081j3506j2060
60792A812814j1721j2253j2951j3651j4505j5307j5512j4852j3564j2190j1316
60781A664992j1189j1356j1049j0275j0010j0885j2156j2697j2524j2471j2592
60770A537788j1969j0243q403p626q038r050j0195j1164j1569j1351j1060j1166
$$ y = [3050886, 3016239, 2983300, 2951547, 2919815, 2887087, 2853898, 2822118, 2792904, 2765437, 2738013, 2709924, 2681798, 2654358, 2627406, 2600076, 2571794, 2542886, 2514395, 2487411, 2462466, 2439408, 2417712, 2396824, 2376185, 2355099, 2332857, 2309273, 2285095, 2261618, 2239591, 2218537, 2197340, 2175528, 2153762, 2132975, 2113364, 2094464, 2076043, 2058478, 2042120, 2026636, 2011218, 1995305, 1978854, 1962029, 1945009, 1928238, 1912426, 1897835, 1883716, 1868963, 1853461, 1838380, 1824874, 1812814, 1801093, 1788840, 1775889, 1762238, 1747733, 1732426, 1716914, 1702062, 1688498, 1676308, 1664992, 1653803, 1642447, 1631398, 1621123, 1611113, 1600228, 1588072, 1575375, 1562851, 1550380, 1537788, 1525819, 1515576, 1507173, 1499547, 1491509, 1482459, 1472264, 1461100, 1449531, 1438180, 1427120, 1415954]
60758A415954j1291j0728r467q129p000n886n042n410p366r639j0267q672o364
60745A310693n267n729o579o865o843p110p456p252o588o239o305n808m235k913
60731A225504l858p082j0022j0241q142o156n546n258m276l688n186q152r890
60718A138007q841o323m552m180m440m696m791m540l988l845m688n963o596o432
60704A064132o220o301o225n607m557l294k149j848k832m244m601l732l055l602
60690A005865m705n102m483l390k301j503j287j650k180k619l114l619l724l504
60676I62684l692m436m616l329j445o39j242k053k162j916j927k103k074j914
60662I29136j922j994j662q34j70n49j889k737j585J162L077K205p52l274l852
$$ y = [1415954, 1404663, 1393935, 1384468, 1376339, 1369339, 1363453, 1358411, 1353001, 1345635, 1335996, 1325729, 1317057, 1310693, 1305426, 1299697, 1293118, 1286253, 1279410, 1272300, 1264844, 1257592, 1251004, 1244765, 1238460, 1232652, 1228417, 1225504, 1221646, 1214564, 1204542, 1194301, 1186159, 1180003, 1174457, 1169199, 1164923, 1161235, 1156049, 1147897, 1138007, 1129166, 1122843, 1118291, 1114111, 1109671, 1104975, 1100184, 1095644, 1091656, 1087811, 1083123, 1077160, 1070564, 1064132, 1057912, 1051611, 1045386, 1039779, 1035222, 1031928, 1029779, 1027931, 1025099, 1020855, 1016254, 1012522, 1009467, 1005865, 1001160, 996058, 991575, 988185, 985884, 984381, 983094, 981444, 979264, 976645, 973531, 969912, 966188, 962684, 958992, 954556, 949940, 946611, 945166, 944527, 943285, 941232, 939070, 937154, 935227, 933124, 931050, 929136, 927214, 925220, 923558, 922724, 922554, 922005, 920116, 917379, 915794, 916956, 920033, 922238, 921486, 918212, 914360]
60647I14360l160k572k499k531k515k687l021l053k567j992j948k544l299l647
60633H76325l283k201p50K74J03j171k541l225l350l190k360o12R59P65j158k926
60617H51659l075k076j274j217j616k041k006j053N19J621J671J268J007M45q91
60602H42941k249k586k143j921j981j562p02l55p23p87N4Q60L50j335k735k718
60586H22408j638q16r75j310n37J223K368J993J097R23J041L92n50k73J311K564
60570H29221K453J729J480J787K177K289J745N28k19Q76L234M474L397J473N26
60555H57170L79Mk65O48K376L193K271O36k14K00J191J680J233O63J323L327N148
60538H80963N510M937M678M905M985M832M767M500L594K611K488K958K918K323
$$ y = [914360, 911200, 908628, 906129, 903598, 901083, 898396, 895375, 892322, 889755, 887763, 885815, 883271, 879972, 876325, 873042, 870841, 870091, 870365, 870468, 869297, 866756, 863531, 860181, 856991, 854631, 854019, 854978, 855743, 854585, 851659, 848584, 846508, 845234, 844017, 842401, 840360, 838354, 837301, 837820, 839441, 841112, 842380, 843387, 843832, 842941, 840692, 838106, 835963, 834042, 832061, 830499, 829797, 829442, 828719, 827932, 827986, 828846, 829196, 827861, 825126, 822408, 820770, 819954, 818979, 817669, 817132, 818355, 820723, 822716, 823813, 824736, 825777, 826169, 825619, 825346, 826657, 829221, 831674, 833403, 834883, 836670, 838847, 841136, 842881, 843409, 843190, 844066, 847300, 851774, 855171, 856644, 857170, 857549, 857553, 857288, 857936, 860312, 863505, 865776, 866412, 866198, 866398, 867589, 869269, 870502, 871165, 872488, 875815, 880963, 886473, 891410, 896088, 900993, 905978, 910810, 915577, 920077, 923671, 926282, 928770, 931728, 934646, 936969]
60524I36969K272L101L790L603L102L008L244L578M172M923N203M802M260L902
60510I89929L484L185L752N006N520M742M176N249P078P880P678P914Q913R688
60496A074194J0056J0987J2535J3338J2706J1667J1119J0451R102Q105Q645R891
60484A202796R820P955O001N698O939Q050P244M018k58l246l822l173l120l751
60470A241151l801k975k449k844l174k571j947k817n016o727o625n255m150m153
60456A186647m750m778l715k258j619k269l703n272o701p665p618o470m984l997
60442A120848l627l492l225k473j059K70k6k474n373o372n042k996j683j114q19
60427A081343q37j259j588j296n99k09n50j479k472k916k510j666j270j743k509
$$ y = [936969, 939241, 942342, 946132, 949735, 952837, 955845, 959089, 962667, 966839, 971762, 976965, 981767, 986027, 989929, 993413, 996598, 1000350, 1005356, 1010876, 1015618, 1019794, 1025043, 1032121, 1040001, 1047679, 1055593, 1064506, 1074194, 1084250, 1095237, 1107772, 1121110, 1133816, 1145483, 1156602, 1167053, 1176155, 1184260, 1192905, 1202796, 1212616, 1220571, 1226572, 1232270, 1239209, 1247259, 1254503, 1258521, 1258263, 1255017, 1251195, 1248022, 1244902, 1241151, 1237350, 1234375, 1231926, 1229082, 1225908, 1223337, 1221390, 1218573, 1213557, 1206830, 1200205, 1194950, 1190800, 1186647, 1181897, 1177119, 1173404, 1171146, 1169527, 1167258, 1163555, 1158283, 1151582, 1143917, 1136299, 1129829, 1124845, 1120848, 1117221, 1113729, 1110504, 1108031, 1106972, 1107242, 1107216, 1104742, 1099369, 1092997, 1087955, 1084959, 1083276, 1082162, 1081343, 1080506, 1079247, 1077659, 1076363, 1075764, 1075555, 1075005, 1073526, 1071054, 1068138, 1065628, 1063962, 1062692, 1060949, 1058440]
60412A058440k618j840r51p84j166j070n4Q70M93o84r69j08l1k047m462m603k407
60395A036009k30N67Q83J561J776N56j552l300m143m036k871j008N45J240J474
60380A027471J386L56j375j950k57J974K116K11j190n73R12J550J154N21Q9p2
60364A032323K41J020J800K337L051M207N011M280J961m32j266l89Q80J463J783
60349A058270K879M530N155L921J941P35L13k31q66p16K48R67R05P02Q89J083
60333A080725R25Q16J048J041K25q77j271p79l5N25J007J535J987K179J927J077
60317A092055j65j107j164m36O26J824L027L690L304K252J609J926K795L664M378
60302A118278M736M161K372J4j897k806k585j177J066L057L782L354K547J450
$$ y = [1058440, 1055822, 1053982, 1053031, 1052247, 1051081, 1050011, 1049957, 1050827, 1051320, 1050636, 1049667, 1049559, 1049528, 1047481, 1043019, 1038416, 1036009, 1035779, 1036346, 1037229, 1038790, 1040566, 1041122, 1039570, 1036270, 1032127, 1028091, 1025220, 1024212, 1024757, 1025997, 1027471, 1028857, 1029213, 1027838, 1025888, 1025631, 1027605, 1029721, 1029932, 1028742, 1028169, 1029081, 1030631, 1031785, 1032306, 1032395, 1032323, 1032564, 1033584, 1035384, 1037721, 1040772, 1044979, 1049990, 1054270, 1056231, 1055799, 1054533, 1054144, 1055024, 1056487, 1058270, 1061149, 1065679, 1070834, 1074755, 1076696, 1077431, 1077744, 1077513, 1076647, 1075931, 1076179, 1077146, 1078051, 1078753, 1079642, 1080725, 1081650, 1082466, 1083514, 1084555, 1084780, 1083903, 1082632, 1081853, 1081818, 1082343, 1083350, 1084885, 1086872, 1089051, 1090978, 1092055, 1091890, 1090783, 1089619, 1089183, 1089809, 1091633, 1094660, 1098350, 1101654, 1103906, 1105515, 1107441, 1110236, 1113900, 1118278, 1123014, 1127175, 1129547, 1129561, 1127664, 1124858, 1122273, 1121096, 1122162, 1125219, 1129001, 1132355, 1134902, 1136352]
60288A136352m00k557l575k861j601j183j617k236k915l541l185j344N99O74j117
60273A109493l030m098m751m992m051k279j421k087k687j946q12n57n58L41J496
60258A078061J352p5j491k448l324l605k220L21J912J406j94j366j716j643j481
60243A063489j357j139m42O19R69r2j469j434kJ277J698J914K062J354j54j143
60227A066150j064q52r82n09J023K464K888K933L073K337L66r05L25K752L637
60212A083636K704K077K633K981K325K093L638N895O548M773J897q5j19J408L199
60197A125603M197M281L785K699J068j96J7J463K617K622K168K049J823P07q49
60182A154054j534q91K16Q26Q29M24n91k363m135m638l533j928j088j028r08l78
$$ y = [1136352, 1135952, 1133395, 1129820, 1126959, 1125358, 1124175, 1122558, 1120322, 1117407, 1113866, 1110681, 1109337, 1109936, 1110610, 1109493, 1106463, 1102365, 1097614, 1092622, 1088571, 1086292, 1084871, 1082784, 1080097, 1078151, 1077339, 1076782, 1076224, 1076565, 1078061, 1079413, 1079338, 1077847, 1075399, 1072075, 1068470, 1066250, 1066571, 1068483, 1069889, 1069695, 1068329, 1066613, 1064970, 1063489, 1062132, 1060993, 1060551, 1061170, 1062139, 1062047, 1060578, 1059144, 1059142, 1060419, 1062117, 1064031, 1066093, 1067447, 1067293, 1066150, 1065086, 1064234, 1063252, 1062743, 1063766, 1066230, 1069118, 1072051, 1075124, 1077461, 1077827, 1076922, 1077247, 1079999, 1083636, 1086340, 1088417, 1091050, 1094031, 1096356, 1098449, 1102087, 1107982, 1114530, 1119303, 1121200, 1121115, 1120996, 1122404, 1125603, 1129800, 1134081, 1137866, 1140565, 1141633, 1141437, 1141454, 1142917, 1145534, 1148156, 1150324, 1152373, 1154196, 1154903, 1154054, 1152520, 1151629, 1151845, 1152671, 1153500, 1153924, 1153333, 1150970, 1146835, 1142197, 1138664, 1136736, 1135648, 1134620, 1133712, 1133334]
60166A133334J09K83L81L99j18j082j389j40K090L773L951K788J119j06l07J15
60150A145200%j168k350k104l54J664K962L555L730L463K794K160J996K216K304
60135A166068J765N79n58o80M60J992K861K903K685K578K581K842L625M681N227
60120A199609M728L460K188J541J637K080K361K388K432K537K391J948J610J498
60106A232408J228P78Q43J632K133J463K56l08k69l72l25Q71K889L931K940P97
60090A250895j036j938j907j098r8K88ql23m76r36j548j380m46k69j812l872m594
60073A229442l766k471j293j26O96N21l86q71m38J03k15j338k366k558j986j390
60057A211558j455k050k482k538k806l620m200l500j599L86J480J454N73n39j011
$$ y = [1133334, 1133443, 1133726, 1134107, 1134506, 1134388, 1133306, 1131917, 1131777, 1133867, 1137640, 1141591, 1144379, 1145498, 1145392, 1145085, 1145200, 1145200, 1144032, 1141682, 1139578, 1139224, 1140888, 1143850, 1147405, 1151135, 1154598, 1157392, 1159552, 1161548, 1163764, 1166068, 1167833, 1168412, 1167854, 1167174, 1167634, 1169626, 1172487, 1175390, 1178075, 1180653, 1183234, 1186076, 1189701, 1194382, 1199609, 1204337, 1207797, 1209985, 1211526, 1213163, 1215243, 1217604, 1219992, 1222424, 1224961, 1227352, 1229300, 1230910, 1232408, 1233636, 1234414, 1235257, 1236889, 1239022, 1240485, 1240741, 1240433, 1240164, 1239792, 1239467, 1240338, 1243227, 1247158, 1250098, 1250895, 1249859, 1247921, 1246014, 1244916, 1244818, 1245106, 1245098, 1244775, 1244299, 1243363, 1241815, 1240435, 1239989, 1239720, 1237908, 1234036, 1229442, 1225676, 1223205, 1221912, 1221786, 1222482, 1223003, 1222617, 1221746, 1221308, 1221411, 1221196, 1219858, 1217492, 1214934, 1212948, 1211558, 1210103, 1208053, 1205571, 1203033, 1200227, 1196607, 1192407, 1188907, 1187308, 1187694, 1189174, 1190628, 1191201, 1190662, 1189651]
60042A189651n20O6l60j538k024j186j74m17j731k664k418j702j602k147k421
60027A168813j896j246j515k636l271k317l47R56O77l75q35n24n72j783l439m167
60011A145523l653k884k645k646k520k877m396o301o904n676l840k700k296k005
59997A094180j509p26L75J350J431O88J71K29l31k350m504m803l435k451k798
59982A075517l288k871k267k431k751k020m76M81L26M5N56J450J673Q83k87j110
59966A063430j464j725k162k557k419j580n12M8j74p81j296j671k058k233j797
59951A041049r32l90m51m29J67N52l37j966k533j376Q6L77j82m71n03j110k227
59934A029324k877k749k440k001o48J595L190K888J384K42k08q25j836k341j809
$$ y = [1189651, 1189131, 1189197, 1188837, 1187299, 1185275, 1184089, 1183915, 1183498, 1181767, 1179103, 1176685, 1174983, 1173381, 1171234, 1168813, 1166917, 1165671, 1164156, 1161520, 1158249, 1155932, 1155585, 1156541, 1157218, 1156843, 1156008, 1155484, 1154912, 1153129, 1149690, 1145523, 1141870, 1138986, 1136341, 1133695, 1131175, 1128298, 1123902, 1117601, 1110697, 1105021, 1101181, 1098481, 1096185, 1094180, 1092671, 1091945, 1092320, 1093670, 1095101, 1095789, 1095960, 1096189, 1095858, 1093508, 1089004, 1084201, 1080766, 1078315, 1075517, 1072229, 1069358, 1067091, 1064660, 1061909, 1059889, 1059413, 1059894, 1060220, 1060265, 1060821, 1062271, 1063944, 1064827, 1064540, 1063430, 1061966, 1060241, 1058079, 1055522, 1053103, 1051523, 1051011, 1051059, 1050885, 1050104, 1048808, 1047137, 1045079, 1042846, 1041049, 1040117, 1039727, 1039276, 1038847, 1039014, 1039566, 1039229, 1037263, 1034730, 1033354, 1033440, 1033817, 1033635, 1033164, 1032661, 1031551, 1029324, 1026447, 1023698, 1021258, 1019257, 1018609, 1020204, 1023394, 1026282, 1027666, 1027908, 1027700, 1026875, 1025039, 1022698, 1020889]
59919A020889j049j079j705j915j406r39j158j667j553m93J063K498L371L345
59905A018202K320P74m61r14p58k63M72J147J228O76K81P19J544J781J253P54
59889A028755J004J987L291M469N033M626L342J595k19j533j439L84K634L343
59875A057272K111M64m34j260k880m259l469m83K444L389K648J676J151Q45O90
59860A059905J014J805K518K762K739K780K753K189R84l49j152j237q48q6J205
59845A076982K882M235M720M726M995N362M875L437K404K912M191M499L441K335
59831A131996K194K439J931N68p63j306j090p86j192k339k991j796O63K014J042
59816A130584m36P0K230L339K013k44j447j467j299j301j157p81l23K02O64O47
$$ y = [1020889, 1019840, 1018761, 1017056, 1015141, 1013735, 1012796, 1011638, 1009971, 1008418, 1007925, 1008988, 1011486, 1014857, 1018202, 1020522, 1021296, 1020835, 1019921, 1019163, 1018900, 1019372, 1020519, 1021747, 1022423, 1022704, 1023423, 1024967, 1026748, 1028001, 1028755, 1029759, 1031746, 1035037, 1039506, 1044539, 1049165, 1052507, 1054102, 1053883, 1052350, 1050911, 1051295, 1053929, 1057272, 1059383, 1059847, 1059413, 1058153, 1055273, 1051014, 1047545, 1047062, 1049506, 1052895, 1055543, 1057219, 1058370, 1059215, 1059905, 1060919, 1062724, 1065242, 1068004, 1070743, 1073523, 1076276, 1078465, 1079449, 1079100, 1077948, 1076711, 1075863, 1075777, 1076982, 1079864, 1084099, 1088819, 1093545, 1098540, 1103902, 1108777, 1112214, 1114618, 1117530, 1121721, 1126220, 1129661, 1131996, 1134190, 1136629, 1138560, 1139128, 1138365, 1137059, 1135969, 1135183, 1133991, 1131652, 1128661, 1126865, 1127528, 1129542, 1130584, 1130148, 1130218, 1132448, 1135787, 1137800, 1137556, 1136109, 1134642, 1133343, 1132042, 1130885, 1130104, 1129781, 1129983, 1130647, 1131294]
59800A131294N9o08j072j681k477k719k066j441j737k310j896n11P37J442K130
59785A117144K743K318O10j036j233k74L23k76j350j573m94J085K145K601L030
59770A125763L311K424R3k179k655j512l55L9L03Q72J170Q78Q19J720K851K791
59754A136333J284l85q47J0J228J940K154K416K941L436L747M076M281L601J821
59739A168036J96K62J903L477L869L531L364L467L344K727J769Q24L48O75J679
59724A199471K748L040J895m93k547k367j0K149K274J362J336J849J099p02j208
59709A209896M11K122K213J625J843K396K063J148Q29J238J620J680J491R47M22
59694A231944J028K934M419M072K924K791L310K595K84j952k738k089l43K081
$$ y = [1131294, 1131353, 1130745, 1129673, 1127992, 1125515, 1122796, 1120730, 1119289, 1117552, 1115242, 1113346, 1112835, 1113572, 1115014, 1117144, 1119887, 1122205, 1122815, 1121779, 1120546, 1120272, 1120595, 1120319, 1118969, 1117396, 1116902, 1117987, 1120132, 1122733, 1125763, 1129074, 1131498, 1131591, 1129412, 1126757, 1125245, 1124890, 1124929, 1125232, 1126104, 1127274, 1128152, 1128971, 1130691, 1133542, 1136333, 1137617, 1137232, 1136385, 1136395, 1137623, 1139563, 1141717, 1144133, 1147074, 1150510, 1154257, 1158333, 1162614, 1166215, 1168036, 1168232, 1168494, 1170397, 1173874, 1177743, 1181274, 1184638, 1188105, 1191449, 1194176, 1195945, 1196769, 1197117, 1197792, 1199471, 1202219, 1205259, 1207154, 1206661, 1204114, 1201747, 1201737, 1203886, 1206160, 1207522, 1208858, 1210707, 1211806, 1211104, 1209896, 1210307, 1212429, 1214642, 1216267, 1218110, 1220506, 1222569, 1223717, 1224546, 1225784, 1227404, 1229084, 1230575, 1231522, 1231944, 1232972, 1235906, 1240325, 1244397, 1247321, 1250112, 1253422, 1256017, 1256301, 1254349, 1251611, 1249522, 1249179, 1251260]
59680A251260L848L490J475jK56J212J401O42m25j204j070L31K189K970K211R88
59664A269573K32k56p69r61p55q07j319j422o43J6m98j608j942j311o96n31j65
59647A256138R00K112K564K024R57k03j385k553l287l129k316j705j695j730j273
59632A245419p31p79j316j929k773l933m395l223j483j332k970m208l519j857
59618A210971q13n81p71j651l276m542m514l804l436l222k525j737j559j628j210
59603A175702o09l02M52K324L833K726n98l194l342k255j571j278j014j410k670
59588A166794l323k154l70j21j485k499k027r57n38r06j655k656l665l961l102
59573A137375j695p89p62j135j274r51l40J75K16l13j150j861k050j446j48J079
$$ y = [1251260, 1255108, 1258598, 1260073, 1260072, 1260328, 1261540, 1262941, 1263583, 1263158, 1261954, 1260884, 1261215, 1263404, 1266374, 1268585, 1269573, 1269805, 1269549, 1268780, 1267819, 1267064, 1266257, 1264938, 1263516, 1262873, 1262889, 1262391, 1260783, 1258841, 1257530, 1256834, 1256303, 1256138, 1257038, 1259150, 1261714, 1263738, 1264695, 1264492, 1263107, 1260554, 1257267, 1254138, 1251822, 1250117, 1248422, 1246692, 1245419, 1244688, 1243909, 1242593, 1240664, 1237891, 1233958, 1229563, 1226340, 1224857, 1223525, 1220555, 1216347, 1212828, 1210971, 1210158, 1209577, 1208806, 1207155, 1203879, 1199337, 1194823, 1191019, 1187583, 1184361, 1181836, 1180099, 1178540, 1176912, 1175702, 1175093, 1174791, 1175243, 1177567, 1181400, 1184126, 1183528, 1180334, 1176992, 1174737, 1173166, 1171888, 1170874, 1169464, 1166794, 1163471, 1161317, 1160947, 1160826, 1159341, 1156842, 1154815, 1153858, 1153320, 1152414, 1150759, 1148103, 1144438, 1140477, 1137375, 1135680, 1134891, 1134129, 1132994, 1131720, 1130769, 1130429, 1130604, 1130820, 1130507, 1129357, 1127496, 1125446, 1124000, 1123852, 1124931]
59557A124931J117m17k523l644l127j610o0J075J716J805J453J043R07J043J400
59542A125109K061K860L233K814J906R89J73m32l76M96J497J994K419L379M217
59527A152339L722K176J152J095O33j116l051l821l701l471k632l92K250L208
59513A148391K071O69N86J291J142n62k908m307l869k285j310j896l026k905j222
59498A129860M50M64j267l291l782j945J038K647J503r49k033r51O63J188Q04
59483A124399O00R90J638K135K217J799J156P03L71k41j017j365j191j015q96
59468A130283j36J442K658K188J84j725j928k10J949K575J267q9M64K386L484
59453A144792L220L309M542N100L324N45n47O03K309L266L466K922J365n99j526
$$ y = [1124931, 1126048, 1125631, 1123108, 1119464, 1116337, 1114727, 1114667, 1115742, 1117458, 1119263, 1120716, 1121759, 1122666, 1123709, 1125109, 1127170, 1130030, 1133263, 1136077, 1137983, 1138972, 1139145, 1138713, 1138337, 1138833, 1140330, 1142324, 1144743, 1148122, 1152339, 1156061, 1158237, 1159389, 1160484, 1161117, 1160001, 1156950, 1153129, 1149428, 1145957, 1143325, 1142933, 1145183, 1148391, 1150462, 1151131, 1151717, 1153008, 1154150, 1153588, 1150680, 1146373, 1142504, 1140219, 1138909, 1137013, 1133987, 1131082, 1129860, 1130310, 1130774, 1129507, 1126216, 1122434, 1120489, 1121527, 1124174, 1125677, 1124728, 1122695, 1121744, 1122407, 1123595, 1124399, 1124999, 1125989, 1127627, 1129762, 1131979, 1133778, 1134934, 1135637, 1136008, 1135767, 1134750, 1133385, 1132194, 1131179, 1130283, 1130147, 1131589, 1134247, 1136435, 1136619, 1134894, 1132966, 1132756, 1134705, 1137280, 1138547, 1138458, 1138922, 1141308, 1144792, 1148012, 1151321, 1155863, 1160963, 1164287, 1164832, 1164285, 1164888, 1167197, 1170463, 1173929, 1176851, 1178216, 1177617, 1176091]
59438A176091p03J203L107M231M135L111K397K857L539K892J239O34K054M289
59424A211076N969P029P575O911M902L034K805L786M550M798N287O010N940M758
59410A284430L760M455O775R038R562Q209O334N174M517L379J743Q05J319K597
59396A352097L533L713L023J299q45j866j183m43j374k963k528M38L329L732K134
59381A362096M92m91j425k478k895k243j107l94l91n76k32P50J664J877J866K667
59365A359180M190M895L695J532L08P04J800K512K579K300K111K504L732N380
59351A397422O636P037O691N903N048M542M442M218L504K814K742K731J777L14
59337A455821L3J393K588J948K08p61o23n71j080j315q39l53k83M3J023J610N60
$$ y = [1176091, 1175388, 1176591, 1179698, 1183929, 1188064, 1191175, 1193572, 1196429, 1199968, 1202860, 1204099, 1204733, 1206787, 1211076, 1217045, 1224074, 1231649, 1238560, 1243462, 1246496, 1249301, 1253087, 1257637, 1262435, 1267722, 1273732, 1279672, 1284430, 1288190, 1292645, 1299420, 1308458, 1318020, 1326229, 1332563, 1337737, 1342254, 1345633, 1347376, 1348181, 1349500, 1352097, 1355630, 1359343, 1362366, 1363665, 1362820, 1360954, 1359771, 1359328, 1357954, 1354991, 1352463, 1352901, 1356230, 1359962, 1362096, 1362588, 1362097, 1360672, 1358194, 1355299, 1353056, 1351949, 1351555, 1351164, 1350588, 1350356, 1351106, 1352770, 1354647, 1356513, 1359180, 1363370, 1368265, 1371960, 1373492, 1373800, 1374504, 1376304, 1378816, 1381395, 1383695, 1385806, 1388310, 1392042, 1397422, 1404058, 1411095, 1417786, 1423689, 1428737, 1433279, 1437721, 1441939, 1445443, 1448257, 1450999, 1453730, 1455507, 1455821, 1455854, 1457247, 1459835, 1461783, 1461991, 1461230, 1460607, 1460036, 1458956, 1457641, 1456802, 1456449, 1456166, 1456209, 1457232, 1458842, 1459402]
59320A459402j663l299l467l114l658n279o681o349m083j433m11j501l266m141
59306A411057m029l589k721r87P74Q27r64k341j309J251K715J902K9j233j365
59291A400017o66N10J665K162J846J194N40k47j045j153k58Q63J294J087Q36O61
59275A409306M67P09J858L362M145M129M061L836K340m83k637k183L92K854L800
59260A435956L582L008K201Q89p73j924j420J093M209N354L213n92k980k579p56
59245A448481L95K37m72r96j361j958k904l777l967l349k465j854j371o60o7m21
59229A423491j803l167l430k548j300m39j98l00k84m2k2o17j515k173k640l188
59213A399825l267j977K61J599Q92r62k388k951l192l414l586l801l972l560k465
$$ y = [1459402, 1457739, 1454440, 1450973, 1447859, 1444201, 1438922, 1432241, 1425892, 1421809, 1420376, 1419965, 1418464, 1415198, 1411057, 1407028, 1403439, 1400718, 1399731, 1400505, 1401332, 1400368, 1398027, 1396718, 1397969, 1400684, 1402586, 1402615, 1401382, 1400017, 1399351, 1399861, 1401526, 1403688, 1405534, 1406728, 1407268, 1407021, 1405976, 1404823, 1404565, 1405428, 1406722, 1407809, 1408645, 1409306, 1409773, 1410482, 1412340, 1415702, 1419847, 1423976, 1428037, 1431873, 1434213, 1433730, 1431093, 1428910, 1429302, 1432156, 1435956, 1439538, 1442546, 1444747, 1445636, 1444863, 1442939, 1441519, 1442612, 1446821, 1452175, 1455388, 1454796, 1451816, 1449237, 1448481, 1448876, 1449113, 1448641, 1447645, 1446284, 1444326, 1441422, 1437645, 1433678, 1430329, 1427864, 1426010, 1424639, 1423979, 1423912, 1423491, 1421688, 1418521, 1415091, 1412543, 1411243, 1410804, 1410606, 1410306, 1410022, 1409980, 1409958, 1409341, 1407826, 1405653, 1403013, 1399825, 1396558, 1394581, 1394842, 1396441, 1397333, 1396371, 1393983, 1391032, 1387840, 1384426, 1380840, 1377039, 1373067, 1369507, 1367042]
59198A367042j696k213l505m290m248l986l551k303l48J032Q56l66j245q71N09
59183A340817J705J506l4j460j671j467k361m146n031m214k932k482k481j853
59169A313896m97Q80J750J844R69m24j161o79J20Q3p23j586k480l754m911m926
59153A298401l751k460j772j312n52K50L57n65k078l331l851m069m732n698n982
59138A258855n366m966n458n684m316k177j239j742k027j287n69o32p42m01n73
59123A221676j897l163k967j776p18O60L430O573P391M966J471n20o25M5Q50J814
59107A237210K719L151L133K921K415J404K58j74O19K349M047M481K937J02k094
59092A265478k175n69J007J450J049M98j00r35j759j968j312l35l2r95k639l368
$$ y = [1367042, 1365346, 1363133, 1359628, 1355338, 1351090, 1347104, 1343553, 1341250, 1340902, 1341934, 1342790, 1342424, 1341179, 1340308, 1340817, 1342522, 1344028, 1343994, 1342534, 1340863, 1339396, 1337035, 1332889, 1327858, 1323644, 1320712, 1318230, 1315749, 1313896, 1313399, 1314279, 1316029, 1317873, 1318842, 1318418, 1317257, 1316578, 1316698, 1316781, 1316058, 1314472, 1311992, 1308238, 1303327, 1298401, 1294650, 1292190, 1290418, 1289106, 1288554, 1288804, 1289161, 1288596, 1286518, 1283187, 1279336, 1275267, 1270535, 1264837, 1258855, 1253489, 1248523, 1243065, 1237381, 1233065, 1230888, 1229649, 1227907, 1225880, 1224593, 1224024, 1223392, 1222650, 1222249, 1221676, 1219779, 1216616, 1213649, 1211873, 1211155, 1211815, 1215245, 1221818, 1229209, 1234175, 1235646, 1235126, 1234501, 1234546, 1235396, 1237210, 1239929, 1243080, 1246213, 1249134, 1251549, 1252953, 1253211, 1253037, 1253656, 1256005, 1260052, 1264533, 1267470, 1267572, 1265478, 1263303, 1262734, 1263741, 1265191, 1266240, 1266738, 1266638, 1265703, 1263944, 1261976, 1260664, 1260329, 1260297, 1259302, 1256663, 1253295]
59076A253295k037N56K112J248q40j751q06J77o65k813m149l781k976l138l965
59061A230467m312m070l985l974l019j029N19N00k74l83P6r8j044j587j229r83
59045A205575j713k775l051k481j668p43M11J270J174N54N28J175J199k91k387
59030A196777l282k208q2J552J979J783J994K729K976K064Q67Q05J811K389J816
59015A213970J208J730K793K991K285K012K832L738L472K152J097J306K533L633
59001A247752L676K711J580J032J166J638K022J841P38j019k481k977k774k381
58987A252524j608n2J803K874K880K561K423K207J833J923K794L726L901L457
58973A283246L016K760K692L157M188M821M246L355L810N489O276M905K802K107
$$ y = [1253295, 1251258, 1251814, 1253926, 1255174, 1254334, 1252583, 1251777, 1251954, 1251289, 1248476, 1244327, 1240546, 1237570, 1234432, 1230467, 1226155, 1222085, 1218100, 1214126, 1211107, 1210078, 1210597, 1211097, 1210823, 1210440, 1210516, 1210418, 1209374, 1207787, 1206558, 1205575, 1203862, 1201087, 1198036, 1195555, 1193887, 1193144, 1193555, 1194825, 1195999, 1196553, 1197081, 1198256, 1199455, 1199164, 1196777, 1193495, 1191287, 1191205, 1192757, 1194736, 1196519, 1198513, 1201242, 1204218, 1206282, 1207149, 1207954, 1209765, 1212154, 1213970, 1215178, 1216908, 1219701, 1222692, 1224977, 1226989, 1229821, 1233559, 1237031, 1239183, 1240280, 1241586, 1244119, 1247752, 1251428, 1254139, 1255719, 1256751, 1257917, 1259555, 1261577, 1263418, 1264156, 1263137, 1260656, 1257679, 1254905, 1252524, 1250916, 1250864, 1252667, 1255541, 1258421, 1260982, 1263405, 1265612, 1267445, 1269368, 1272162, 1275888, 1279789, 1283246, 1286262, 1289022, 1291714, 1294871, 1299059, 1303880, 1308126, 1311481, 1315291, 1320780, 1327056, 1331961, 1334763, 1336870]
58959A336870K843L299K652J809J607J551Q25l50j107j091n80J17P05O80j50j071
58943A348609j122m66k59j017j805j567n72P4r1o43j234j931k567k603j941j284
58927A329581j296j830k252k186j605n93N08R60K78r60j430m21J389K588K465
58912A325196J664J468K453L883M484L813K652K111K623L851N155N846N419M094
58898A374712K965L035L998M571M147L671M382O014O844N698L520K495L633N672
58884A435357O637O149N543N883O653O830O365N790M949L340J513Q60J630K304
58870A499803J594J99l60Q2L55j77r40j279j207q64k03M11J43j147k383k569k131
58853A489327k253l154l862l616k787k199k122k212k106j823j771k424l777n053
$$ y = [1336870, 1339713, 1343012, 1345664, 1347473, 1349080, 1350631, 1351456, 1351106, 1349999, 1348908, 1348328, 1348445, 1349150, 1349830, 1349680, 1348609, 1347487, 1347021, 1346762, 1345745, 1343940, 1342373, 1341801, 1341875, 1341784, 1341141, 1339907, 1337976, 1335409, 1332806, 1330865, 1329581, 1328285, 1326455, 1324203, 1322017, 1320412, 1319819, 1320327, 1321287, 1321565, 1320605, 1319175, 1318754, 1320143, 1322731, 1325196, 1326860, 1328328, 1330781, 1334664, 1339148, 1342961, 1345613, 1347724, 1350347, 1354198, 1359353, 1365199, 1370618, 1374712, 1377677, 1380712, 1384710, 1389281, 1393428, 1397099, 1401481, 1407495, 1414339, 1420037, 1423557, 1426052, 1429685, 1435357, 1441994, 1448143, 1453686, 1459569, 1466222, 1473052, 1479417, 1485207, 1490156, 1493496, 1495009, 1495869, 1497499, 1499803, 1501397, 1501596, 1501236, 1501318, 1501673, 1501496, 1500556, 1499277, 1498070, 1497206, 1497003, 1497414, 1497557, 1496410, 1494027, 1491458, 1489327, 1487074, 1483920, 1480058, 1476442, 1473655, 1471456, 1469334, 1467122, 1465016, 1463193, 1461422, 1458998, 1455221, 1450168]
58839A450168n226m061k440j566j926l054m037m212l602k845k523k492k099j152
58825A408933l50n12j647l030l943m103l603k889k609k996l385k844j335J08N67
58810A376362J71l82r12j861l336m444l935j608J032J861J12k779m539m237k849
58795A348656j829j655j939k341k786l096l034k691k338j936j339j073k124m450
58781A316025o274n730l114o97j27p72j093q93j251k504l527l396k849l242m588
58766A275968n513n091l864k874k428k151j731j168o48n61j287k469k919j959
58752A241305o13o22k121l244k490p28l5j004k198k243j395p53p22q74p50j16
58736A221397J142K660L397K746J603J355J744J038j231k973k043Q05K787K517
$$ y = [1450168, 1444942, 1440881, 1438441, 1436875, 1434949, 1431895, 1427858, 1423646, 1420044, 1417199, 1414676, 1412184, 1410085, 1408933, 1408583, 1408071, 1406424, 1403394, 1399451, 1395348, 1391745, 1388856, 1386247, 1383251, 1379866, 1377022, 1375687, 1375795, 1376362, 1376533, 1376151, 1375239, 1373378, 1370042, 1365598, 1361663, 1360055, 1361087, 1362948, 1363060, 1360281, 1355742, 1351505, 1348656, 1346827, 1345172, 1343233, 1340892, 1338106, 1335010, 1331976, 1329285, 1326947, 1325011, 1323672, 1322599, 1320475, 1316025, 1309751, 1304021, 1300907, 1300210, 1300083, 1299311, 1298218, 1297325, 1296074, 1293570, 1290043, 1286647, 1283798, 1280556, 1275968, 1270455, 1265364, 1261500, 1258626, 1256198, 1254047, 1252316, 1251148, 1250500, 1249939, 1248652, 1246183, 1243264, 1241305, 1240692, 1240070, 1237949, 1234705, 1232215, 1231487, 1231452, 1230448, 1228250, 1226007, 1224612, 1223859, 1223137, 1222263, 1221513, 1221397, 1222539, 1225199, 1228596, 1231342, 1232945, 1234300, 1236044, 1237082, 1235851, 1232878, 1230835, 1231640, 1234427, 1236944]
58722A236944J188M98P70J553K678L869M181K917Q15n82o75k58k91p22p74J1J122
58705A253244J508O43q42j816j985k129k879l715l696k822k027j927k216k437
58691A226904k734l489m570n433n904o352o930p001n797l667k132k328l672m529
58677A162366m039k867k134k191k534k524k073j779k311l328l383j667M52P30
58663A132718j007k493k050o30m9m11o10m10m99q77q34l39j51m16n02k80l35o90
58645A120135o52k72o76k288l895m261l710l265l067k714k408k651l117k965k237
58630A081957j895k296k503j577o3M71p20k549l259k320q36L5M18R70J436Q25
58614A068094r41k636l176k708j904r06M43J891K847K938K172Q50m53j194j282
$$ y = [1236944, 1238132, 1238630, 1239400, 1240953, 1243631, 1247500, 1251681, 1254598, 1255413, 1254831, 1254156, 1253898, 1253607, 1252885, 1252111, 1252122, 1253244, 1254752, 1255395, 1254553, 1252737, 1250752, 1248623, 1245744, 1242029, 1238333, 1235511, 1233484, 1231557, 1229341, 1226904, 1224170, 1220681, 1216111, 1210678, 1204774, 1198422, 1191492, 1184491, 1178694, 1175027, 1172895, 1170567, 1166895, 1162366, 1158327, 1155460, 1153326, 1151135, 1148601, 1146077, 1144004, 1142225, 1139914, 1136586, 1133203, 1131536, 1131988, 1132718, 1131711, 1129218, 1127168, 1126538, 1126489, 1126078, 1125468, 1125058, 1124559, 1123682, 1122848, 1122509, 1122358, 1121942, 1121440, 1121160, 1120825, 1120135, 1119483, 1119211, 1118535, 1116247, 1112352, 1108091, 1104381, 1101116, 1098049, 1095335, 1092927, 1090276, 1087159, 1084194, 1081957, 1080062, 1077766, 1075263, 1073686, 1073623, 1074094, 1073374, 1070825, 1067566, 1065246, 1064410, 1064445, 1064863, 1065833, 1067269, 1068094, 1067153, 1064517, 1061341, 1058633, 1056729, 1055823, 1056266, 1058157, 1061004, 1063942, 1066114, 1066964, 1066511, 1065317, 1064035]
58599A064035r27j31J040J854J442J51o08q6J091K149K937L123K152O72O11K594
58583A082099M627M705L579L319M126M497L938L346L053K479J976K935N594Q262
58569A138535R430R260Q594P844P392P736Q505Q549P639O896P005P233O997P056
58555A248671Q100R272R273Q105O751N908N897O939Q369Q425O109K737N11J02
58541A335169N88J050R98q0k009l274k582q34q2o94j286j302j773l140m168l882
58525A312699l058k759k693k153j599k021l371m670n205m696k933l31J511J129
58511A279850r36k590k594j644j008j058j488k168l056l649l181j459O77J813
58497A257509J069j031k813k885j403K51J039J219J696K762L681L578K593J991
$$ y = [1064035, 1063108, 1062977, 1064017, 1065871, 1067313, 1067464, 1066856, 1066770, 1067861, 1070010, 1072947, 1076070, 1078222, 1078894, 1079505, 1082099, 1086726, 1091431, 1095010, 1098329, 1102455, 1106952, 1110890, 1114236, 1117289, 1119768, 1121744, 1124679, 1130273, 1138535, 1147965, 1157225, 1165819, 1173663, 1181055, 1188791, 1197296, 1205845, 1213484, 1220380, 1227385, 1234618, 1241615, 1248671, 1256771, 1266043, 1275316, 1283421, 1290172, 1296080, 1301977, 1308916, 1317285, 1325710, 1331819, 1334556, 1335067, 1335169, 1335757, 1336807, 1337805, 1337725, 1335716, 1332442, 1329860, 1329026, 1328944, 1328250, 1326964, 1325662, 1323889, 1320749, 1316581, 1312699, 1309641, 1306882, 1304189, 1302036, 1300437, 1298416, 1295045, 1290375, 1285170, 1280474, 1277541, 1277210, 1278721, 1279850, 1278914, 1276324, 1273730, 1272086, 1271078, 1270020, 1268532, 1266364, 1263308, 1259659, 1256478, 1255019, 1255696, 1257509, 1258578, 1257547, 1254734, 1251849, 1250446, 1250697, 1251736, 1252955, 1254651, 1257413, 1261094, 1264672, 1267265, 1269256]
58483A269256K871M694N679M944L780M021N514O222M919K657J156P14N74N99J293
58468A318893K444K976K391J497J278J691J998J757J086L09k53l60p3K95N79Q41
58452A337349R47O60L29Q76K540M210M675M058L190K036lk285k907j116J251J698
58436A357508q5k161k844k381k166k987m300m880l970j919K55J945L353M690N393
58421A345451M635K492j3j930k939k879j581L32J269J54k071l298k711j663j704
58406A333544k518k646j713q65r43j347j244r91j378k029j709k15J151J323P77
58391A319197O37J098J441J161M20m77j390k110k217j360L79K267L108K112K8
58376A324294j075J96K870M596M246K931K328K807L613M243M860N586O142O326
$$ y = [1269256, 1272127, 1276821, 1282500, 1287444, 1291224, 1295245, 1300759, 1306981, 1311900, 1314557, 1315713, 1316427, 1317001, 1317600, 1318893, 1321337, 1324313, 1326704, 1328201, 1329479, 1331170, 1333168, 1334925, 1336011, 1336320, 1336067, 1335707, 1335634, 1335929, 1336508, 1337349, 1338296, 1338956, 1339285, 1340161, 1342701, 1346911, 1351586, 1355644, 1358834, 1360870, 1360867, 1358582, 1355675, 1354559, 1355810, 1357508, 1357423, 1355262, 1352418, 1350037, 1347871, 1344884, 1340584, 1335704, 1331734, 1329815, 1330070, 1332015, 1335368, 1340058, 1345451, 1350086, 1352578, 1352565, 1350635, 1347696, 1344817, 1343236, 1343568, 1344837, 1344991, 1342920, 1339622, 1336911, 1335248, 1333544, 1331026, 1328380, 1326667, 1325802, 1324859, 1323512, 1322268, 1321277, 1319899, 1317870, 1316161, 1315946, 1317097, 1318420, 1319197, 1319834, 1320932, 1322373, 1323534, 1323954, 1323477, 1322087, 1319977, 1317760, 1316400, 1316779, 1319046, 1322154, 1324266, 1324294, 1323219, 1323415, 1326285, 1330881, 1335127, 1338058, 1340386, 1343193, 1346806, 1351049, 1355909, 1361495, 1367637, 1373963]
58362A373963O268N922M790K684N67O2J798M570O375O205M606K753J385O45N18
58347A423111J013K079L460M679N171M704L741L212L646M663N445N629N580N797
58333A481930O259O479O218N992O584P973R107Q964P656O135N129M842N424O799
58319A575491Q093Q140O971N945N930O146N542M519M306N096O037O937Q595J1135
58305A668883J3092J3013J1383J0045R943J0299J0134R862J0698J2717J4293J3832
58293A808194J1715R978J0260J2426J4995J6423J6162J5187J5460J7905K0819
58282A969524K1358J8888J5865J4808J5614J6713J7605J8861K0498K1984K3422
58271B175140K5127K6319K5891K4374K3630K4501K6251K8377L1134L3886L5028
$$ y = [1373963, 1380231, 1386153, 1390943, 1393627, 1394194, 1394256, 1396054, 1400624, 1406999, 1413204, 1417810, 1420563, 1421948, 1422593, 1423111, 1424124, 1426203, 1429663, 1434342, 1439513, 1444217, 1447958, 1451170, 1454816, 1459479, 1464924, 1470553, 1476133, 1481930, 1488189, 1494668, 1500886, 1506878, 1513462, 1521435, 1530542, 1539506, 1547162, 1553297, 1558426, 1563268, 1568692, 1575491, 1583584, 1591724, 1598695, 1604640, 1610570, 1616716, 1622258, 1626777, 1631083, 1636179, 1642216, 1649153, 1657748, 1668883, 1681975, 1694988, 1706371, 1716416, 1726359, 1736658, 1746792, 1756654, 1767352, 1780069, 1794362, 1808194, 1819909, 1829887, 1840147, 1852573, 1867568, 1883991, 1900153, 1915340, 1930800, 1948705, 1969524, 1990882, 2009770, 2025635, 2040443, 2056057, 2072770, 2090375, 2109236, 2129734, 2151718, 2175140, 2200267, 2226586, 2252477, 2276851, 2300481, 2324982, 2351233, 2379610, 2410744, 2444630, 2479658]
58260B479658L4465L4478L6723L9808M1331M1305M1984M4834M9231N3681N7054
58249B954552N8777N9160N9606O1555O5046O8978P2615P6110P9824Q3884Q8456
58238C728563R3682R9430J05584J12432J20267J28968J38436J48960J60564J72678
58228E009564J85364K00218K18869K41062K65525K92446L23700L60861M04460
58219G502069M55301N14749N83102O58924P40711Q28355R22688J024746J136095
58210A4366740J258805J394522J544416J710444J895417K101461K330099K584951
58202B9186855K872598L198145L558406L937275M303905M614211M820407M889936
58194F1381738M822502M649710M416104M158125L896677L642746L404408L188140
$$ y = [2479658, 2514123, 2548601, 2585324, 2625132, 2666463, 2707768, 2749752, 2794586, 2843817, 2897498, 2954552, 3013329, 3072489, 3132095, 3193650, 3258696, 3327674, 3400289, 3476399, 3556223, 3640107, 3728563, 3822245, 3921675, 4027259, 4139691, 4259958, 4388926, 4527362, 4676322, 4836886, 5009564, 5194928, 5395146, 5614015, 5855077, 6120602, 6413048, 6736748, 7097609, 7502069, 7957370, 8472119, 9055221, 9714145, 10454856, 11283211, 12205899, 13230645, 14366740, 15625545, 17020067, 18564483, 20274927, 22170344, 24271805, 26601904, 29186855, 32059453, 35257598, 38816004, 42753279, 47057184, 51671395, 56491802, 61381738, 66204240, 70853950, 75270054, 79428179, 83324856, 86967602, 90372010, 93560150]
58186I3560150K996487K826539K670566K518084K358323K181753J979149J738961
58178A12830012J446814J090849O70834K02580k89559p87967j290328j801467
58170A12071768k315593k806057l230521l543713l707265l695661l502347l144785
58162H6125826k663165k112501j553320j044144o34245l56407k22955k27179l48063
58153G6963847n55501q15354j094012j360766j587671j748989j821791j787590
58145F6192173j635668j369493j013566o13579k26471R4044L08122L94300L50604
58136F2480466J93111m8984l39849o41127r13726j121170j235568j242610j143157
58127E5987386r53197p03283m34894j92093j1933Q1617P9373j3492j79106l90202
$$ y = [93560150, 96556637, 99383176, 102053742, 104571826, 106930149, 109111902, 111091051, 112830012, 114276826, 115367675, 116038509, 116241089, 115951530, 115163563, 113873235, 112071768, 109756175, 106950118, 103719597, 100175884, 96468619, 92772958, 89270611, 86125826, 83462661, 81350160, 79796840, 78752696, 78118451, 77762044, 77539089, 77311910, 76963847, 76408346, 75592992, 74498980, 73138214, 71550543, 69801554, 67979763, 66192173, 64556505, 63187012, 62173446, 61559867, 61333396, 61427440, 61735562, 62129862, 62480466, 62673577, 62624593, 62284744, 61643617, 60729891, 59608721, 58373153, 57130543, 55987386, 55034189, 54330906, 53896012, 53703919, 53691986, 53773603, 53852976, 53839484, 53660378, 53270176]
58117E3270176o14298q17419r67611j039530j019567r09499p27252n04402k80247
58108D6390351r3259K7127O5140J9264r9289k68807m60190o41303p82151q60120
58098D3296763q64536p99088o80845n36033l94166k82296k20355k17981k73137
58089C9028326l72828m96091o18730p18358p78326p90237p55225o83413n91030
58080C3224088m96306m16185l64057l47426l65873m11314m70864n30174n75985
58071B9245904n98686n94701n66705n21472m67938m16598l77793l58023l57657
58062B4986331l72531l96616m22549m42051m48989m42357m24850l99180l67640
58053B1269568l34639l06553k87935k79371k79393k86314k97195l07056l11247
$$ y = [53270176, 52655878, 51838459, 50870848, 49831318, 48811751, 47902252, 47175000, 46670598, 46390351, 46297092, 46324219, 46389359, 46408623, 46309334, 46040527, 45580337, 44939034, 44156883, 43296763, 42432227, 41633139, 40952294, 40416261, 40022095, 39739799, 39519444, 39301463, 39028326, 38655498, 38159407, 37540677, 36822319, 36043993, 35253756, 34498531, 33815118, 33224088, 32727782, 32311597, 31947540, 31600114, 31234241, 30822927, 30352063, 29821889, 29245904, 28647218, 28052517, 27485812, 26964340, 26496402, 26079804, 25702011, 25343988, 24986331, 24613800, 24217184, 23794635, 23352584, 22903595, 22461238, 22036388, 21637208, 21269568, 20934929, 20628376, 20340441, 20061070, 19781677, 19495363, 19198168, 18891112, 18579865]
58044A8579865l08060k98273k83399k65603k48234k34515k25685k21178k20152
58035A6274766k21880k25073k27989k29111k27289k21724k12632k01577j90308
58026A4317183j79617j69991j62682j59046j58990j61062j63907j66709j68355
58017A2826824j67382j63060j55969j47344j38434j30585j25264j23584j25733
58008A1549469j30707j36417j40472j41399j39035j33746j26001j17103j09393
57999A0375196j04605j02422j01490j01349j02336j04110j05646j06514j06759
57990I439965j05561j01658r5510q9671q6279q5291q5731q7437r0493r3835r5735
57979H422764r5510r3900r1950r0066q7979q5167q1593p8326p6933p7730p9205
$$ y = [18579865, 18271805, 17973532, 17690133, 17424530, 17176296, 16941781, 16716096, 16494918, 16274766, 16052886, 15827813, 15599824, 15370713, 15143424, 14921700, 14709068, 14507491, 14317183, 14137566, 13967575, 13804893, 13645847, 13486857, 13325795, 13161888, 12995179, 12826824, 12659442, 12496382, 12340413, 12193069, 12054635, 11924050, 11798786, 11675202, 11549469, 11418762, 11282345, 11141873, 11000474, 10861439, 10727693, 10601692, 10484589, 10375196, 10270591, 10168169, 10066679, 9965330, 9862994, 9758884, 9653238, 9546724, 9439965, 9334404, 9232746, 9137236, 9047565, 8961286, 8875995, 8790264, 8702827, 8612334, 8518499, 8422764, 8327254, 8233354, 8141404, 8051338, 7963359, 7878192, 7796599, 7718273, 7641340, 7563610, 7484405]
57968G484405p9691p9087p8212p7162p5328p2737p0153o7891o5683o3907o3747
57957F690807o5514o7683o8456o7740o6783o6252o5598o4182o2188o0198n8622
57946E977591n7904n8549o0269o1577o1069n9129n7501n7047n6672n4975n2305
57935E340594n0366n0063n0627n0885n0639n0373n0228m9910m9423m9195m9323
57924D789562m9111m7820m5747m4152m3868m4371m4563m4256m4122m4215m3502
57913D293835m1540l9763l9937m1592m2207m0253l6900l4302l3128l2642l2397
57902C879174l2636l3272l3687l3711l3842l4165l3947l2957l2266l2869l3932
57891C511890l3649l1701k9665k8694k8180k7492k7651k9673l2005l1702k8312
$$ y = [7484405, 7404714, 7325627, 7247415, 7170253, 7094925, 7022188, 6952035, 6884144, 6818461, 6754554, 6690807, 6625293, 6557610, 6489154, 6421414, 6354631, 6288379, 6222781, 6158599, 6096411, 6036213, 5977591, 5919687, 5861138, 5800869, 5739292, 5678223, 5619094, 5561593, 5504546, 5447874, 5392899, 5340594, 5290228, 5240165, 5189538, 5138653, 5088014, 5037641, 4987413, 4937503, 4888080, 4838885, 4789562, 4740451, 4692631, 4646884, 4602732, 4558864, 4514493, 4469930, 4425674, 4381552, 4337337, 4293835, 4252295, 4212532, 4172595, 4131003, 4088796, 4048543, 4011643, 3977341, 3944213, 3911571, 3879174, 3846538, 3813266, 3779579, 3745868, 3712026, 3677861, 3643914, 3610957, 3578691, 3545822, 3511890, 3478241, 3446540, 3416875, 3388181, 3360001, 3332509, 3304858, 3275185, 3243180, 3211478, 3183166]
57880C183166k4766k3766k4977k6700k8562l0807l2256l1257k8425k6314k6147
57869B879189k6578k6092k4937k4064k3678k3846k5138k7466k9153k8539k6013
57858B593685k3456k2077k1763k2031k2543k2791k2326k1378k0601k0318k0529
57847B353872k1280k2197k2152k0442j8207j7439j8506j9735j9715j8921j8554
57836B136724j8835j9225j9617k0328k1220k1692k1394k0454j9104j7740j7203
57825A919912j8302k0699k2695k2450j9631j5897j3633j3930j5648j6725j6517
57814A723785j6311j7218j8276j7569j4952j2502j1990j3005j4120j4879j5647
57803A557316j6180j5700j4321j3146j2789j2747j2575j2557j2791j2639j1869
$$ y = [3183166, 3158400, 3134634, 3109657, 3082957, 3054395, 3023588, 2991332, 2960075, 2931650, 2905336, 2879189, 2852611, 2826519, 2801582, 2777518, 2753840, 2729994, 2704856, 2677390, 2648237, 2619698, 2593685, 2570229, 2548152, 2526389, 2504358, 2481815, 2459024, 2436698, 2415320, 2394719, 2374401, 2353872, 2332592, 2310395, 2288243, 2267801, 2249594, 2232155, 2213649, 2193914, 2174199, 2155278, 2136724, 2117889, 2098664, 2079047, 2058719, 2037499, 2015807, 1994413, 1973959, 1954855, 1937115, 1919912, 1901610, 1880911, 1858216, 1835766, 1816135, 1800238, 1786605, 1772675, 1757027, 1740302, 1723785, 1707474, 1690256, 1671980, 1654411, 1639459, 1626957, 1614967, 1601962, 1587842, 1572963, 1557316, 1541136, 1525436, 1511115, 1497969, 1485180, 1472433, 1459858, 1447301, 1434510, 1421871, 1410002]
57792A410002j1354j1684j1864j0683q748p786q207q823q985r393j0457j1382
57780A290636j1575j1611j1864j1418r641p957q456j0989j3071j2807j0843r090
57768A161314q466q466q390q221q219q145p383n999n121n716p204q109q113q307
57754A055455r223r771q998p694p196p403p307o872o855p042o322m679l655m311
57740I58127n818o568n863m087k113j027j643l572n283n602m818m047l897m101
57726H99688m077l579l011l109l996m699m190k778j744j764k467l393m338m780
57712H51763m259l544m044n610o301n028l043j897j330n80m53k186m904o207n331
57697G97046l948l605l805l240j739j89P53J161J307J177M66r06k276k536j315
$$ y = [1410002, 1398648, 1386964, 1375100, 1364417, 1355669, 1347883, 1339676, 1330853, 1321868, 1312475, 1302018, 1290636, 1279061, 1267450, 1255586, 1244168, 1234527, 1226570, 1218114, 1207125, 1194054, 1181247, 1170404, 1161314, 1152848, 1144382, 1135992, 1127771, 1119552, 1111407, 1104024, 1098025, 1092904, 1087188, 1079984, 1071875, 1063762, 1055455, 1046232, 1036461, 1027463, 1019769, 1012573, 1005170, 997863, 990991, 984136, 977094, 970772, 966093, 962438, 958127, 952309, 945741, 939878, 935791, 933678, 932651, 931008, 927436, 922153, 916551, 911733, 907686, 903789, 899688, 895611, 892032, 889021, 885912, 881916, 877217, 873027, 870249, 868505, 866741, 864274, 860881, 856543, 851763, 847504, 843960, 839916, 834306, 828005, 822977, 819934, 818037, 816707, 816127, 815674, 813488, 808584, 802377, 797046, 793098, 789493, 785688, 782448, 780709, 780520, 781273, 782434, 783741, 784918, 785384, 784478, 782202, 779666, 778351]
57682G78351M49J602J989K069J968J815K420M283O177O257M709L670M095M368
57668H24222K986J167J167K874L879K793R69M75J579K875L200K537J295m34k531
57653H49053m179m292k929j804k635n015o758o571n552n415o031n855m433l201
57639G84383l470m726n624n922o398p197p226n551k753m86R1r09k571l947m411
57624G23283l750k350j117q57j549k360k604k541k998m107m868m287k768j716
57610F85411j818k312k293k023k293l003l271k716j802q91MM48l22k091l432l455
57594F54141k941k963l193k611j302l62l08p76j659l282n235o159n211l007p84
57579F14348P46J350Q66n00j930k587k408k087k336l176l787l260j855j097k043
$$ y = [778351, 778800, 780402, 782391, 784460, 786428, 788243, 790663, 794946, 801123, 807380, 812089, 815759, 819854, 824222, 827208, 828375, 829542, 832416, 836295, 839088, 840057, 840532, 842111, 844986, 848186, 850723, 852018, 851584, 849053, 844874, 840582, 837653, 835849, 833214, 828199, 821441, 814870, 809318, 803903, 797872, 792017, 787584, 784383, 780913, 776187, 770563, 764641, 758243, 751046, 743820, 738269, 735516, 735030, 735121, 734212, 731641, 727694, 723283, 719533, 717183, 716066, 715209, 713660, 711300, 708696, 706155, 703157, 699050, 694182, 689895, 687127, 685411, 683593, 681281, 678988, 676965, 674672, 671669, 668398, 665682, 663880, 662989, 662993, 663441, 663119, 661028, 657596, 654141, 651200, 648237, 645044, 642433, 641131, 640769, 640461, 639685, 638026, 634744, 629509, 623350, 618139, 615132, 614348, 615094, 616444, 617310, 616810, 614880, 612293, 609885, 607798, 605462, 602286, 598499, 595239, 593384, 592287, 590244]
57564E90244l807m673m360l973l863l117j579p90j875l738m468l721k534j503
57550E46243m74M28P28M41j4n92j326j631j025l80j055k725l407k118l45j34j546
57533E31068k851k704j368p1J93o69j838k194j286K21J099O51p38j961k197j588
57517E13767q58l33K36P43L79j154k669k707j469n34p27j323j471j264r81l71
57501D99264O19J189N94p52j750j908j639j581k023k774l248k969k208j668j470
57486D77676j047k04N00Q20J191J555R40q68k327k100j184j429k583k653j144
57471D67143O8m26j555j484oJ782L082L608K988J155r67k205k400k318k483k717
57455D63265k615j973q94J39N42K69j24l57p63j366j390m79K85l42j841k379j096
$$ y = [590244, 586437, 581764, 577404, 573431, 569568, 566451, 564872, 564082, 562207, 558469, 554001, 550280, 547746, 546243, 545769, 546197, 546925, 547366, 547352, 546760, 545434, 543803, 542778, 542398, 541343, 538618, 535211, 533093, 532748, 532614, 531068, 528217, 525513, 524145, 524074, 524267, 523598, 521760, 519566, 518280, 518501, 519600, 520251, 519513, 517552, 515355, 513767, 512909, 512576, 512812, 513555, 513934, 512780, 510111, 507404, 505935, 505401, 504674, 503351, 501880, 500616, 499635, 499264, 499883, 501072, 501666, 500914, 499164, 497256, 495617, 494036, 492013, 489239, 485991, 483022, 480814, 479146, 477676, 476629, 476425, 476925, 477745, 478936, 480491, 481431, 480563, 478236, 476136, 474952, 473523, 470940, 468287, 467143, 467211, 466785, 465230, 463746, 463740, 465522, 468604, 472212, 475200, 476355, 475388, 473183, 470783, 468465, 465982, 463265, 460650, 458677, 457783, 457922, 458464, 458733, 458609, 458252, 457489, 456123, 454733, 454254, 454539, 454197, 452356, 449977, 448881]
57438D48881R73K374K618K036J077N2j036k453l946m253k324Q50K793K219K55
57423D50116j280j774j582r84k98j56o98j056m31P42J409J186L42r16k230k753
57407D39637k087j268j715l261m258l578j724Q3R50N21q44j884j362M24J803J608
57391D23045L23r05j603k062k599l119l087j905J73J713J437j50j345j343p58
57376D07815q3R91K314K782J870O06J15J90R2j95m68j073k069k490j674n55m01
57359D07767q30n69L75P45k6j349k665l635l443j608N05Q35n01j181p3J211R86
57342C96544K1K7R75J396N56r09k032k131j031L13J26k116m492m847l664l246
57326C75490m280m975l876j895p91q28r33n28j06l11j174k262l071l275k950k569
$$ y = [448881, 449854, 452228, 454846, 456882, 457959, 458011, 456975, 454522, 450576, 446323, 443999, 444849, 447642, 449861, 450116, 448836, 447062, 445480, 444496, 444198, 444042, 443344, 442288, 441857, 442599, 444008, 445194, 445536, 444620, 442390, 439637, 437550, 436282, 434567, 431306, 427048, 423470, 421746, 421829, 422779, 423300, 422456, 420572, 419210, 419634, 421437, 423045, 423368, 422463, 420860, 418798, 416199, 413080, 409993, 408088, 408261, 409974, 411411, 411261, 409916, 408573, 407815, 407732, 408723, 411037, 413819, 415689, 416295, 416410, 416600, 416692, 416497, 416029, 414956, 412887, 410397, 408723, 408168, 407767, 406937, 406368, 406743, 407488, 407462, 406113, 403448, 399813, 396370, 394762, 395267, 396102, 395601, 394420, 394347, 395558, 396544, 396565, 396592, 397567, 398963, 399519, 398610, 396578, 394447, 393416, 393729, 393855, 391739, 387247, 382400, 378736, 375490, 371210, 366235, 362359, 360464, 359673, 358845, 357912, 357384, 357278, 356967, 355793, 353531, 350460, 347185, 344235, 341666]
57310C41666k528k673k493j810j113j096j837k580k576k100k163k957l159j564
57296C11017Q17J442o77l495m319l037j980k930n235p025p211n952m038k543k332
57281B62502l054l102j550K01j16k555m721m913m184m410n546o134n756n320n077
57266B06265m043j903j48l54k070l320k973j882j658k710l753l285j450j32q91
57251A75693l206n179n647m925l784k760k427l245m686n458n078m464m590n294
57237A14950n976o550p149p512p384o980o516n927n537o101p515q401p889o918
57223A8595o641E391c35m898n607p319p737o114m259l576l026j253R57J975K078
57208c9114L080N637Q517J0563E26J2596J2316J0881R485R358R848Q780M911q69
$$ y = [341666, 339138, 336465, 333972, 332162, 331049, 329953, 328116, 325536, 322960, 320860, 318697, 315740, 312581, 311017, 311834, 313276, 312599, 309104, 304785, 301748, 299768, 296838, 291603, 284578, 277367, 271415, 267377, 264834, 262502, 259448, 256346, 254796, 254997, 254881, 252326, 247605, 242692, 238508, 234098, 228552, 222418, 216662, 211342, 206265, 202222, 200319, 200171, 199817, 197747, 194427, 191454, 189572, 187914, 185204, 181451, 178166, 176716, 176584, 175693, 172487, 167308, 161661, 156736, 152952, 150192, 147765, 144520, 139834, 134376, 129298, 124834, 120244, 114950, 108974, 102424, 95275, 87763, 80379, 73399, 66883, 60956, 55419, 49318, 41803, 33402, 25513, 18595, 11954, 5391, -335, -5233, -10840, -18159, -25896, -32010, -36269, -39845, -42871, -44124, -43167, -41192, -39114, -36034, -30397, -21880, -11317, 526, 13122, 25438, 36319, 45804, 55162, 65010, 73790, 78701, 77832]
57194G7832p013j3099j9197A4400a1452k4024k0813j8550j7266j5612j3438j1980
57182a33135j1518j0498p550l350L85K996N004O632P333O838N722M434K305j867
57168a26269q304j5722k2410k7489l1003l3153l3990l3736l2839l1452k9292k6235
57156d51894k2771j9573j7027j5563j5953j8599k2724k6881l0273l3166l6035
57145g10459l8896m1643m4528m8020n2268n6981o1826o7002p3202q0735q8820
57134a364380r6313j03185j10637j19492j29243j39093j49087j59635j70764j82798
57124b724627j96992k14263k33805k54132k75340k99102l26646l57959l92963
57115e275829m32197m76146n25077n80302o45271p25573q28251r60584j128448
$$ y = [77832, 70819, 57720, 38523, 14400, -11452, -35476, -56289, -74839, -92105, -107717, -121155, -133135, -144653, -155151, -162701, -166051, -165666, -162670, -157666, -151034, -143701, -136863, -131141, -126707, -124402, -126269, -134573, -150295, -172705, -200194, -231197, -264350, -298340, -332076, -364915, -396367, -425659, -451894, -474665, -494238, -511265, -526828, -542781, -561380, -584104, -610985, -641258, -674424, -710459, -749355, -790998, -835526, -883546, -935814, -992795, -1054621, -1121623, -1194825, -1275560, -1364380, -1460693, -1563878, -1674515, -1794007, -1923250, -2062343, -2211430, -2371065, -2541829, -2724627, -2921619, -3135882, -3369687, -3623819, -3899159, -4198261, -4524907, -4882866, -5275829, -5708026, -6184172, -6709249, -7289551, -7934822, -8660395, -9488646, -10449230, -11577678]
57106a1577678j336090j588633j894714k266185k716107l258259l907028m674290
57098c3218984n564683o573483p685863q872320j0081388j1238455j2256578j3056603
57090a08548357j3590163j3857011j3904062j3799777j3599834j3333622j3020285
57083b03653111j2688765j2373808j2092784j1831317j1552415j1219014j0814029
57076b86225243j0349346r857906r367148q866777q295154p557863o569716n299399
57068c52388552l796272k182266o04407Q28508K080807L169984M112387M883226
57060c43896585N421155N666969N603036N268159M744835M132722L524892K994348
57052c06540469K588306K325933K200084K184886K246692K353351K479435K608505
$$ y = [-11577678, -12913768, -14502401, -16397115, -18663300, -21379407, -24637666, -28544694, -33218984, -38783667, -45357150, -53043013, -61915333, -71996721, -83235176, -95491754, -108548357, -122138520, -135995531, -149899593, -163699370, -177299204, -190632826, -203653111, -216341876, -228715684, -240808468, -252639785, -264192200, -275411214, -286225243, -296574589, -306432495, -315799643, -324666420, -332961574, -340519437, -347089153, -352388552, -356184824, -358367090, -358971497, -358142989, -356062182, -352892198, -348779811, -343896585, -338475430, -332808461, -327205425, -321937266, -317192431, -313059709, -309534817, -306540469, -303952163, -301626230, -299426146, -297241260, -294994568, -292641217, -290161782, -287553277]
57044b87553277K733049K851998K967037L079850L191064L300367L407343L512258
57036b62510311L615596L716581L812899L902375L984113M057538M121801M178045
57028b31121363M231979M292280M365412M452164M548879M650663M753108M852296
57020a94974582M944759N027878N100148N161102N211093N250762N280144N298024
57012a53700672N302111N289952N260069N212718N150226N077085M999909M926618
57004a12481984M864383M817167M784583M762702M745676M727130M701286M663624
56996g4415433M610276M536411M435741M302629M135636L940131L729037L521923
56988d1203649L342223L212224L147216L151418L217130L326436L454299L572703
$$ y = [-287553277, -284820228, -281968230, -279001193, -275921343, -272730279, -269429912, -266022569, -262510311, -258894715, -255178134, -251365235, -247462860, -243478747, -239421209, -235299408, -231121363, -226889384, -222597104, -218231692, -213779528, -209230649, -204579986, -199826878, -194974582, -190029823, -185001945, -179901797, -174740695, -169529602, -164278840, -158998696, -153700672, -148398561, -143108609, -137848540, -132635822, -127485596, -122408511, -117408602, -112481984, -107617601, -102800434, -98015851, -93253149, -88507473, -83780343, -79079057, -74415433, -69805157, -65268746, -60833005, -56530376, -52394740, -48454609, -44725572, -41203649, -37861426, -34649202, -31501986, -28350568, -25133438, -21807002, -18352703, -14780000]
56980a4780000L655819L685300L653776b19895C212623L274315L111547K963745
56972A2562230K844961K761713K714333K699699K712521K745568K790982K842161
56964C4674168K893635K939425K973381K991883K994859K983431K957950K919213
56956E8327945K869686K810970K740102K649858K532695K383586K200174J983239
56948G8498255J738900J479948J224221R91215P98993O61971N89813N87366O54359
56939H7225041P84090R63020J173481J397647J618556J818397J978651K083907
56931I9042790K125363K100653K012035J866079J673870J449226J206081R57784
56923A12433881P17742M98627L10212J58691M8143j8476m0236j9063M1359J37233
$$ y = [-14780000, -11124181, -7438881, -3785105, -219895, 3212623, 6486938, 9598485, 12562230, 15407191, 18168904, 20883237, 23582936, 26295457, 29041025, 31832007, 34674168, 37567803, 40507228, 43480609, 46472492, 49467351, 52450782, 55408732, 58327945, 61197631, 64008601, 66748703, 69398561, 71931256, 74314842, 76515016, 78498255, 80237155, 81717103, 82941324, 83932539, 84731532, 85393503, 85983316, 86570682, 87225041, 88009131, 88972151, 90145632, 91543279, 93161835, 94980232, 96958883, 99042790, 101168153, 103268806, 105280841, 107146920, 108820790, 110270016, 111476097, 112433881, 113151623, 113650250, 113960462, 114119153, 114167296, 114148820, 114108584, 114089521, 114130880, 114268113]
56913A14268113K64563M17598N88241P67482R47330J121189J282642J424611J540373
56904A22622142J625426J677844J696734J681138J631268J550443J444775J320683
56896A35250453J183439J038237Q91419P49382O16455M94817L86495K94586K22074
56887A41127357J69834J36193J18145J12683J17320J29768J47494J67787J88704
56878A42415285K09888K32058K55512K79428L02691L24784L45453L63947L79219
56869A45108265L90662L98298M02512M04101M04186M03483M01878L99293L96650
56860A48709328L95077L94296L92727L89199L83733L76521L67296L56184L44261
56851A52108622L32638L21493L10340K98461K84835K68639K50564K32696K16186
$$ y = [114268113, 114532676, 114950274, 115538515, 116305997, 117253327, 118374516, 119657158, 121081769, 122622142, 124247568, 125925412, 127622146, 129303284, 130934552, 132484995, 133929770, 135250453, 136433892, 137472129, 138363548, 139112930, 139729385, 140224202, 140610697, 140905283, 141127357, 141297191, 141433384, 141551529, 141664212, 141781532, 141911300, 142058794, 142226581, 142415285, 142625173, 142857231, 143112743, 143392171, 143694862, 144019646, 144365099, 144729046, 145108265, 145498927, 145897225, 146299737, 146703838, 147108024, 147511507, 147913385, 148312678, 148709328, 149104405, 149498701, 149891428, 150280627, 150664360, 151040881, 151408177, 151764361, 152108622, 152441260, 152762753, 153073093, 153371554, 153656389, 153925028, 154175592, 154408288, 154624474]
56842A54624474J99879J82201J63607J45732J28725J11079R2003P2329N2794L2913
56832A55805736J2208q675k9015m9182o9864r0809j11277j31285j51347j71261
56822A55005229j90107k07548k24322k41361k58930k76625k93653l09146l23010
56813A52680527l36577l51572l68082l84335l98960m12597m26308m39315m49822
56804A49112959m57798m65166m72852m79316m83042m85105m87873m92015m96280
56795A44793512m99673n02139n03313n02410m99724m96908m95469m96104m99791
56786A40297981n07740n19690n33679n48536n65215n84508o04714o23090o38754
56777A35172055o52604o65176o76364o87002o98841p12633p27473p42343p57285
$$ y = [154624474, 154824353, 155006554, 155170161, 155315893, 155444618, 155555697, 155647700, 155720029, 155772823, 155805736, 155817944, 155809269, 155780254, 155731072, 155661208, 155570399, 155459122, 155327837, 155176490, 155005229, 154815122, 154607574, 154383252, 154141891, 153882961, 153606336, 153312683, 153003537, 152680527, 152343950, 151992378, 151624296, 151239961, 150841001, 150428404, 150002096, 149562781, 149112959, 148655161, 148189995, 147717143, 147237827, 146754785, 146269680, 145781807, 145289792, 144793512, 144293839, 143791700, 143288387, 142785977, 142286253, 141789345, 141293876, 140797772, 140297981, 139790241, 139270551, 138736872, 138188336, 137623121, 137038613, 136433899, 135810809, 135172055, 134519451, 133854275, 133177911, 132490909, 131792068, 131079435, 130351962, 129609619, 128852334]
56768A28852334p72721p88458q03738q17750q29994q40470q49376q56216q59882
56759A21433729q60298q59138q57599q54121q45892q32426q16081p99091p81758
56750A13927325p63899p46304p30199p16553p06633p01844p02328p06904p15046
56741A07437615p27719p45599p67720p92780q20430q50252q80689r10437r39923
56732A00002066r70052j000193j028842j055561j080783j104107j124237j140180
56724I1498111j151025j154830j149426j134445j110912j078707j036062r82278
56716H2700426r19573q51415p80254p07885o36932n70701n11994m63171m26898
56707G6831603m05377l98587m04298m20261m45771m80609n23137n70188o18739
$$ y = [128852334, 128079613, 127291155, 126487417, 125669667, 124839673, 123999203, 123149827, 122293611, 121433729, 120573431, 119714293, 118856694, 118002573, 117156681, 116324255, 115508174, 114709083, 113927325, 113163426, 112417122, 111686923, 110970370, 110263737, 109561893, 108859565, 108152661, 107437615, 106709896, 105964297, 105196577, 104403797, 103583367, 102733115, 101852426, 100941989, 100002066, 99032014, 98031821, 97002979, 95947418, 94866635, 93762528, 92638291, 91498111, 90347086, 89192256, 88042830, 86908385, 85797473, 84718766, 83682704, 82700426, 81780853, 80929438, 80149184, 79441299, 78804367, 78233666, 77721672, 77258501, 76831603, 76426226, 76027639, 75623341, 75203080, 74757309, 74276700, 73753563, 73183375, 72564636]
56698G2564636o67125p14599p60193q02139q38073q65462q82229q87335q80830
56689F5266651q63157q34487p94898p45208o87762o26591n66756n12660m66400
56680E9168732m28022l97682l77043l67932l70259l82262m02371m29532m61809
56671E5551820m96111n29845n61747n90469o13492o28356o34343o32115o22202
56662E0243140o04764n80510n51264n19659m88506m60071m35578m15687m01391
56653D5785710l93715l92416l95995m03361m14513m29018m45009m60564m74875
56644D1976244m87094m95159m97132m92971m83650m69476m51000m30773m12130
56635C7756859l96283l82401l70459l61988l57798l57076l59383l65668l76199
$$ y = [72564636, 71897511, 71182912, 70422719, 69620580, 68782507, 67917045, 67034816, 66147481, 65266651, 64403494, 63569007, 62774109, 62028901, 61341139, 60714548, 60147792, 59635132, 59168732, 58740710, 58343028, 57965985, 57598053, 57227794, 56845532, 56443161, 56013629, 55551820, 55055709, 54525864, 53964117, 53373648, 52760156, 52131800, 51497457, 50865342, 50243140, 49638376, 49057866, 48506602, 47986943, 47498437, 47038366, 46602788, 46187101, 45785710, 45391995, 44999579, 44603584, 44200223, 43785710, 43356692, 42911683, 42451119, 41976244, 41489150, 40993991, 40496859, 40003888, 39520238, 39050762, 38599762, 38168989, 37756859, 37360576, 36978175, 36607716, 36245728, 35887930, 35530854, 35171471, 34805803, 34429604]
56626C4429604l89028m01711m13408m24134m32977m38572m40704m40163m37329
56617C0611578m32038m24710m16572m08580m00669l92186l82792l73069l64423
56608B7016539l58121l54065l50778l46746l41357l34506l26073l16298l06000
56599B3982595k95697k85065k73830k62730k52727k43757k35207k27550k22457
56590B1683575k20931k21965k23515k24544k25749k28418k32860k38101k42972
56581A9624520k46905k49544k50255k48912k46905k46100k46534k46227k43838
56572A7399300k40425k37735k35750k33150k29564k25859k22383k18373k13439
56563A5342622k08374k03990j99971j95561j90780j86370j82934j80568j79041
$$ y = [34429604, 34040576, 33638865, 33225457, 32801323, 32368346, 31929774, 31489070, 31048907, 30611578, 30179540, 29754830, 29338258, 28929678, 28529009, 28136823, 27754031, 27380962, 27016539, 26658418, 26304353, 25953575, 25606829, 25265472, 24930966, 24604893, 24288595, 23982595, 23686898, 23401833, 23128003, 22865273, 22612546, 22368789, 22133582, 21906032, 21683575, 21462644, 21240679, 21017164, 20792620, 20566871, 20338453, 20105593, 19867492, 19624520, 19377615, 19128071, 18877816, 18628904, 18381999, 18135899, 17889365, 17643138, 17399300, 17158875, 16921140, 16685390, 16452240, 16222676, 15996817, 15774434, 15556061, 15342622, 15134248, 14930258, 14730287, 14534726, 14343946, 14157576, 13974642, 13794074, 13615033]
56554A3615033j77913j76628j74941j73205j71954j71295j70890j70496j70254
56545A2057457j70371j70667j70561j69600j67893j65899j63858j61625j59152
56536A0557831j56782j54790j52917j50595j47631j44427j41609j39487j37677
56527I231916j35223j31521j27299j24128j22625j21732j20385j19142j19078
56518H110783j19584j18765j16218j13883j13493j14364j14771j14405j14146
56509G071154j13954j12719j10343j08483j08412j09077j08276j05373j01951
56500F092566r9902r9531r9570r8512r5742r1959q8764q7430q7648q7647q5948
56489E069913q2914q0294p9321p9573p9682p8784p7239p6189p6393p7307p7364
$$ y = [13615033, 13437120, 13260492, 13085551, 12912346, 12740392, 12569097, 12398207, 12227711, 12057457, 11887086, 11716419, 11545858, 11376258, 11208365, 11042466, 10878608, 10716983, 10557831, 10401049, 10246259, 10093342, 9942747, 9795116, 9650689, 9509080, 9369593, 9231916, 9096693, 8965172, 8837873, 8713745, 8591120, 8469388, 8349003, 8229861, 8110783, 7991199, 7872434, 7756216, 7642333, 7528840, 7414476, 7299705, 7185300, 7071154, 6957200, 6844481, 6734138, 6625655, 6517243, 6408166, 6299890, 6194517, 6092566, 5992664, 5893133, 5793563, 5695051, 5599309, 5507350, 5418586, 5331156, 5243508, 5155861, 5069913, 4986999, 4906705, 4827384, 4747811, 4668129, 4589345, 4512106, 4435917, 4359524, 4282217, 4204853]
56478D204853p5611p2904p1058p0683p0641o9750o8266o7187o6694o6115o4977
56467C440967o3338o1317n9143n7427n6543n5762n3989n1479m9852n0064n1139
56456B830914n1418n0294m8268m6010m4077m2985m2795m2877m2704m2513m2527
56445B334446m2070m0378l8050l6695l6887l7368l6623l4579l2412l1142l0863
56434A937379l1027l1058l0758l0334l0035k9834k9651k9692l0187l0830l0967
56423A603006l0371k9439k8581k7854k7238k6775k6361k5915k5797k6362k7039
56412A301274k6661k5073k3542k2980k2644k1474j9999j9783k1153k2613k2542
56401A052810k0738j8349j6894j7292j8999k0146j9283j7017j5188j4619j4645
$$ y = [4204853, 4129242, 4056338, 3985280, 3914597, 3843956, 3774206, 3705940, 3638753, 3572059, 3505944, 3440967, 3377629, 3316312, 3257169, 3199742, 3143199, 3087437, 3033448, 2981969, 2932117, 2882053, 2830914, 2779496, 2729202, 2680934, 2634924, 2590847, 2547862, 2505067, 2462190, 2419486, 2376973, 2334446, 2292376, 2251998, 2213948, 2177253, 2140366, 2102998, 2066375, 2031796, 1999384, 1968242, 1937379, 1906352, 1875294, 1844536, 1814202, 1784167, 1754333, 1724682, 1694990, 1664803, 1633973, 1603006, 1572635, 1543196, 1514615, 1486761, 1459523, 1432748, 1406387, 1380472, 1354675, 1328313, 1301274, 1274613, 1249540, 1225998, 1203018, 1180374, 1158900, 1138901, 1119118, 1097965, 1075352, 1052810, 1032072, 1013723, 996829, 979537, 960538, 940392, 921109, 904092, 888904, 874285, 859640]
56390H59640j4765j5347j6311j6545j5496j4280j4164j4714j4578j3543j2606
56379F97291j2283j2061j1482j0805j0391j0296j0544j1032j1080r913p867o325
56367E73212o129o729p282p842q751r600r692r268r258r686r309p333m773l394
56353D64166l666m493m830m659m339m017m113n413p652q835p368m577l490m912
56339C91802o322n406l220k536m013n642n635m356l234k881k780k179j019j97
56325C42382q27k879m828n135l754j742L5J051P80n87j580r44M97Q88N5m69p5
56308C22868J82o9M12K093L241K452J034J072K135K040L14j180j097k55L6j88
56292C35090n6P80J975L073L776L993L872L577L146K807L050L787L954K884J739
$$ y = [859640, 844875, 829528, 813217, 796672, 781176, 766896, 752732, 738018, 723440, 709897, 697291, 685008, 672947, 661465, 650660, 640269, 629973, 619429, 608397, 597317, 587404, 579537, 573212, 567083, 560354, 553072, 545230, 536479, 526879, 517187, 507919, 498661, 488975, 479666, 472333, 467560, 464166, 460500, 456007, 451177, 446518, 442179, 438162, 434049, 428636, 420984, 412149, 404781, 400204, 396714, 391802, 385480, 380074, 376854, 374318, 370305, 364663, 359028, 354672, 351438, 348557, 345777, 343598, 342579, 342382, 341555, 338676, 333848, 328713, 324959, 323217, 323252, 324303, 325083, 324496, 322916, 321972, 322469, 323357, 323412, 322943, 322868, 323050, 322981, 323393, 325486, 328727, 331179, 332213, 333285, 335420, 337460, 337774, 336594, 335497, 335242, 335278, 335090, 335034, 335814, 337789, 340862, 344638, 348631, 352503, 356080, 359226, 362033, 365083, 368870, 372824, 375708, 377447]
56277C77447K429N087P873R378R973J0493J0926J1293J2550J5354J8544K0110
56265E11457J9635J8803J9468K1917K5000K7313K8153K7997K8333L0536L4532
56254G93144L8691M1385M2524M3412M5132M7358M8949M9437M9637N0599N2320
56243A302588N3777N3982N2758N0541M7993M5786M4372M3644M2977M1754L9741
56232A819913L7058L4004L0779K7143K2605J7365J2834J0401R642Q492N544J460
56220B037240k125m440n846p011q561j0937j3765j5756j6050j5377j5063j5168
56208A907141j4700j3541j2939j3783j5332j6240j6020j4946j3299j1495j0379
56197A754467j0518j1382j1897j1685j1174j0728j0265r694r073q389p676p291
$$ y = [377447, 379876, 384963, 392836, 402214, 412187, 422680, 433606, 444899, 457449, 472803, 491347, 511457, 531092, 549895, 569363, 591280, 616280, 643593, 671746, 699743, 728076, 758612, 793144, 831835, 873220, 915744, 959156, 1004288, 1051646, 1100595, 1150032, 1199669, 1250268, 1302588, 1356365, 1410347, 1463105, 1513646, 1561639, 1607425, 1651797, 1695441, 1738418, 1780172, 1819913, 1856971, 1890975, 1921754, 1948897, 1971502, 1988867, 2001701, 2012102, 2021744, 2030236, 2035780, 2037240, 2035115, 2030675, 2024829, 2017818, 2009257, 1998320, 1984555, 1968799, 1952749, 1937372, 1922309, 1907141, 1892441, 1878900, 1865961, 1852178, 1836846, 1820606, 1804586, 1789640, 1776341, 1764846, 1754467, 1743949, 1732567, 1720670, 1708985, 1697811, 1687083, 1676818, 1667124, 1658051, 1649662, 1641986, 1634695]
56185A634695p477p775p504o855o704p181p221n992m104k890k964m016n521o920
56171A551571p388o282l977j806q66j119j695j918j805j613j061M92K765M083
56157A529381L103Q83P9J737M106N236N491O416Q189R782J0822J1679J2050J1375
56143A620329J0615J1716J4859J7965J9407J9588J9152J7697J5432J4335J5755
56132A796850J8056J8541J6965J5300J4519J3822J2825J2412J2838J2810J1318
56121A956256R061P210N734L872J461j023l249n112o407p073p444p811q122q448
56107A928905r295j0905j2635j3635j3851j3795j3586j2854j1665j0865j1216
56096A794603j2405j3176j2528j0703q884p882p231n873l659j732j385k837n193
$$ y = [1634695, 1627218, 1619443, 1611939, 1605084, 1598380, 1591199, 1583978, 1577986, 1573882, 1570992, 1568028, 1564012, 1558491, 1551571, 1544183, 1537901, 1533924, 1532118, 1531252, 1530133, 1528438, 1526520, 1524715, 1523102, 1522041, 1522533, 1525298, 1529381, 1532484, 1533367, 1533446, 1535183, 1539289, 1544525, 1550016, 1556432, 1564621, 1574403, 1585225, 1596904, 1608954, 1620329, 1630944, 1642660, 1657519, 1675484, 1694891, 1714479, 1733631, 1751328, 1766760, 1781095, 1796850, 1814906, 1833447, 1850412, 1865712, 1880231, 1894053, 1906878, 1919290, 1932128, 1944938, 1956256, 1965317, 1972527, 1978261, 1982133, 1983594, 1982571, 1979322, 1974210, 1967803, 1960730, 1953286, 1945475, 1937353, 1928905, 1919610, 1908705, 1896070, 1882435, 1868584, 1854789, 1841203, 1828349, 1816684, 1805819, 1794603, 1782198, 1769022, 1756494, 1745791, 1736907, 1729025, 1721794, 1715921, 1712262, 1710530, 1709145, 1706308, 1701115]
56083A701115p183p689o229l451r29J11p6j88O24K008L074L399L283L304L722
56068A694895M199M111L333K648K958M089M854M625M317N246P229Q658Q566P825
56054A767553P681P898P241N672M824N932Q111R434R315Q986R628J0756J0903
56041A873934R568Q010P926R653J2021J3873J5149J6289J7254J7794J8287J9346
56029B039104K0639K1068K0404J9831K0502K2240K4134K5718K7006K8015K8921
56018B297582L0259L2257L4331L5783L6783L8146M0395M3448M6873N0079N2674
56007B738610N4942N7587O0718O3812O6860P0523P4675P8089Q0501Q3803Q9835
55996C519955R7850J05692J12662J19783J27848J36950J47496J59878J73405J87312
$$ y = [1701115, 1693932, 1686243, 1680014, 1676563, 1675634, 1675745, 1675669, 1675481, 1676105, 1678113, 1681187, 1684586, 1687869, 1691173, 1694895, 1699094, 1703205, 1706538, 1709186, 1712144, 1716233, 1721087, 1725712, 1730029, 1735275, 1742504, 1751162, 1759728, 1767553, 1775234, 1783132, 1790373, 1796045, 1800869, 1806801, 1814912, 1824346, 1833661, 1842647, 1852275, 1863031, 1873934, 1883502, 1891512, 1899438, 1909091, 1921112, 1934985, 1950134, 1966423, 1983677, 2001471, 2019758, 2039104, 2059743, 2080811, 2101215, 2121046, 2141548, 2163788, 2187922, 2213640, 2240646, 2268661, 2297582, 2327841, 2360098, 2394429, 2430212, 2466995, 2505141, 2545536, 2588984, 2635857, 2685936, 2738610, 2793552, 2851139, 2911857, 2975669, 3042529, 3113052, 3187727, 3265816, 3346317, 3430120, 3519955, 3617805, 3723497, 3836159, 3955942, 4083790, 4220740, 4368236, 4528114, 4701519, 4888831]
55986D888831K02685K21714K45114K72096L02704L38209L79233M25726M79054
55977G755366N41678O13920O93259P77720Q67931R64991J068689J179506J300435
55968A5763495J435121J585669J753541J941092K151022K386525K653338K958177
55960C2627980L300442L664335M019064M324386M536307M617250M554712M375581
55952F6020057M136419L891903L668898L466675L274264L082605K884973K676185
55944I3101979K457194K238326K033375J847577J668662J466260J200057Q37059
55936A06850489L75692j36644o13661r74281j194415j323660j449934j640653
55928I9892933j906223k204524k469242k637257k666229k544314k291954j954310
$$ y = [4888831, 5091516, 5313230, 5558344, 5830440, 6133144, 6471353, 6850586, 7276312, 7755366, 8297044, 8910964, 9604223, 10381943, 11249874, 12214865, 13283554, 14463060, 15763495, 17198616, 18784285, 20537826, 22478918, 24629940, 27016465, 29669803, 32627980, 35928422, 39592757, 43611821, 47936207, 52472514, 57089764, 61644476, 66020057, 70156476, 74048379, 77717277, 81183952, 84458216, 87540821, 90425794, 93101979, 95559173, 97797499, 99830874, 101678451, 103347113, 104813373, 106013430, 106850489, 107226181, 107089537, 106475876, 105501595, 104307180, 102983520, 101533586, 99892933, 97986710, 95782186, 93312944, 90675687, 88009458, 85465144, 83173190, 81218880]
55920H1218880j587971j248222r79375q08217p41959p71650q77628j032928j204928
55911G1966002j358352j460159j484294j415683j254128j016284p32794m40898
55903F2803410j76633L0488J60859K07151J74301P5736p2056k52542m48270o38918
55893F1863526q01990r16570r67396r47387q58957p14712n36267l50141j82120
55884E5587986n2836K4418M4360R376p1899j86915l21598m62299n96557p12551
55874E3261485p98617q44835q46017q02750p19499o03228m64700l19201j83211
55865D7679427o9920J1652N4936N6353J7905n3014j47351k57046l74470m91916
55855D6426556o02896p02604p86341q48927q86380q96822q79202q33315p62419
$$ y = [81218880, 79630909, 78382687, 77403312, 76595095, 75853136, 75081486, 74203858, 73170930, 71966002, 70607650, 69147491, 67663197, 66247514, 64993386, 63977102, 63244308, 62803410, 62626777, 62657265, 62818124, 63025275, 63199576, 63275312, 63203256, 62950714, 62502444, 61863526, 61061536, 60144966, 59177570, 58230183, 57371226, 56656514, 56120247, 55770106, 55587986, 55535150, 55559568, 55603928, 55613304, 55541405, 55354490, 55032892, 54570593, 53974036, 53261485, 52462868, 51618033, 50772016, 49969266, 49249767, 48646539, 48181839, 47862638, 47679427, 47609507, 47621159, 47676095, 47732448, 47750353, 47697339, 47549988, 47292942, 46918472, 46426556, 45823660, 45121056, 44334715, 43485788, 42599408, 41702586, 40823384, 39990069, 39227650]
55846C9227650o74284n78035m81051l90000l12766k56661k24910k16431k28432
55837C5865080k57619k99819l50721m07153m66267n23824n75141o17655o50865
55828C1716016o73734o83986o80320o63609o35414n96882n49889m97901m44792
55819B6289489l93608l47040l07782k77420k55770k42025k35799k36325k41650
55810B3752070k49940k61071k75749k93266l11219l27416l41039l51834l59083
55801B0981453l61916l59980l53275l41866l26457l08981k91632k74910k57372
55792A8105064k37957k18175k01168j88768j80343j74530j70837j69016j68063
55783A6396207j67180j67167j69458j73794j77950j79983j79938j79247j79264
$$ y = [39227650, 38553366, 37975331, 37494280, 37104280, 36791514, 36534853, 36309943, 36093512, 35865080, 35607461, 35307642, 34956921, 34549768, 34083501, 33559677, 32984536, 32366881, 31716016, 31042282, 30358296, 29677976, 29014367, 28378953, 27782071, 27232182, 26734281, 26289489, 25895881, 25548841, 25241059, 24963639, 24707869, 24465844, 24230045, 23993720, 23752070, 23502130, 23241059, 22965310, 22672044, 22360825, 22033409, 21692370, 21340536, 20981453, 20619537, 20259557, 19906282, 19564416, 19237959, 18928978, 18637346, 18362436, 18105064, 17867107, 17648932, 17447764, 17258996, 17078653, 16904123, 16733286, 16564270, 16396207, 16229027, 16061860, 15892402, 15718608, 15540658, 15360675, 15180737, 15001490, 14822226]
55774A4822226j80443j82007j82091j79204j74029j69005j65590j62663j58212
55765A3268982j51929j45275j39586j35078j31566j29047j27361j25963j24458
55756A2058719j22969j21716j20652j19799j19553j20197j21164j21302j20051
55747A0971316j18068j16477j15690j15194j14282j12654j10401j07882j05792
55738I954876j04814j04805j04593j03034j00268r7707r6779r7673r9178r9597
55728H946428r8193r5902r4282r3730r3207r2004r0908r0990r1814r1857r0482
55717G923059q8561q7175q6476q5868q4582q2158p9160p7274p7731p9496q0113
55706G014465p8609p6510p5501p5187p3982p1462o8848o7548o7900o9101o9803
$$ y = [14822226, 14641783, 14459776, 14277685, 14098481, 13924452, 13755447, 13589857, 13427194, 13268982, 13117053, 12971778, 12832192, 12697114, 12565548, 12436501, 12309140, 12183177, 12058719, 11935750, 11814034, 11693382, 11573583, 11454030, 11333833, 11212669, 11091367, 10971316, 10853248, 10736771, 10621081, 10505887, 10391605, 10278951, 10168550, 10060668, 9954876, 9850062, 9745257, 9640664, 9537630, 9437362, 9339655, 9242876, 9145203, 9046025, 8946428, 8848235, 8752333, 8658051, 8564321, 8471114, 8379110, 8288202, 8197212, 8105398, 8013541, 7923059, 7834498, 7747323, 7660847, 7574979, 7490397, 7408239, 7329079, 7251805, 7174074, 7094578, 7014465, 6935856, 6859346, 6783845, 6708658, 6634676, 6563214, 6494366, 6426818, 6358918, 6289817, 6220014]
55695F220014o9156o7574o6090o4791o2884o0652n9972o1639o3447o2640n9625
55684E521544n7222n6470n5592n3515n1949n2483n3545n2504m9721m8189m9338
55673D941016n1310n1896n1226n0677n0529n0149m9595m9575m9972m9648m7977
55662D388462m5685m3938m3157m2943m2697m2077m1198m0608m0638m0757m0051
55651C924713l8540l7384l7494l8451l9306l9867m0389m0518l9577l8012l7461
55640C497714l8804m0744m1134l9505l7641l7473l8876l9958l9286l7372l5792
55629C071129l5346l5537l5552l5091l4218l3089l2195l2167l2946l3713l4138
55618B697137l4899l6214l6677l4890l1788k9816k9741k9917k9061k8127k8451
$$ y = [6220014, 6150858, 6083284, 6017194, 5952403, 5889519, 5828867, 5768895, 5707256, 5643809, 5581169, 5521544, 5464322, 5407852, 5352260, 5298745, 5246796, 5194313, 5140768, 5088264, 5038543, 4990354, 4941016, 4889706, 4837810, 4786584, 4735907, 4685378, 4635229, 4585634, 4536059, 4486087, 4436439, 4388462, 4342777, 4298839, 4255682, 4212739, 4170042, 4127965, 4086767, 4046159, 4005521, 3964764, 3924713, 3886173, 3848789, 3811295, 3772844, 3733538, 3693671, 3653282, 3612764, 3573187, 3535175, 3497714, 3458910, 3418166, 3377032, 3337527, 3299886, 3262413, 3223537, 3183579, 3144293, 3106921, 3071129, 3035783, 3000246, 2964694, 2929603, 2895385, 2862296, 2830101, 2797934, 2764988, 2731275, 2697137, 2662238, 2626024, 2589347, 2554457, 2522669, 2492853, 2463112, 2433195, 2404134, 2376007, 2347556]
55607B347556k9515k9951k9760k9960l0553l0516k9606k8712k8238k7638k6849
55596B026258k6786k7670k8162k7101k5249k4269k4506k4947k4979k4999k5381
55585A742209k5802k5905k5794k5678k5490k4987k3753k1358j8208j6042j6387
55574A492805j8393j9509j8844j8384j9850k1756k1344j8669j6706j7472j9944
55563A281934k2131k3299k3385k1929j8994j6059j4672j4683j4913j4895j4964
55552A082010j5191j5448j6038j7064j7430j5800j2541r632q559r151j0349j1209
55540I23598j1232j0749j0945j2419j3803j3113j0548q571q829j0402j1581j2067
55528G89339j2455j2778j2669j2247j1816j1197j0186r173q608q391q360q784
$$ y = [2347556, 2318041, 2288090, 2258330, 2228370, 2197817, 2167301, 2137695, 2108983, 2080745, 2053107, 2026258, 1999472, 1971802, 1943640, 1916539, 1891290, 1867021, 1842515, 1817568, 1792589, 1767590, 1742209, 1716407, 1690502, 1664708, 1639030, 1613540, 1588553, 1564800, 1543442, 1525234, 1509192, 1492805, 1474412, 1454903, 1436059, 1417675, 1397825, 1376069, 1354725, 1336056, 1319350, 1301878, 1281934, 1259803, 1236504, 1213119, 1191190, 1172196, 1156137, 1141465, 1126782, 1111869, 1096974, 1082010, 1066819, 1051371, 1035333, 1018269, 1000839, 985039, 972498, 962866, 954307, 945156, 934807, 923598, 912366, 901617, 890672, 878253, 864450, 851337, 840789, 832218, 823389, 812987, 801406, 789339, 776884, 764106, 751437, 739190, 727374, 716177, 705991, 696818, 688210, 679819, 671459, 662675]
55516F62675r634j0131r839r604j0331j1325j0969q940o765o082o928p857p403
55503E46867n623m277m979p074q191p260n819n593o124o079n712o254p512q039
55489D58331p489o941o846o400n283m388m401m902n387n908o321o089n281m618
55475C78077m167l345k563l329n805p712o881l884j125j71r89k755m212m029k166
55460C24944n07r55l141m942m970l692k435k205l161m489m947m236l400l328l494
55445B75042l012k287k436l542m600m940m665l931k873j991j639j347o33j39p70
55430B36237k170l329m301n671o557n196j825J001J593Q79K11o30k010k793j936
55415B03503n58n05j567j972j164l48l44o30p05r21j527k118k510l064l641l282
$$ y = [662675, 653041, 642910, 633071, 623467, 613136, 601811, 590842, 581902, 575137, 569055, 562127, 554270, 546867, 541244, 536967, 531988, 524914, 516723, 509463, 503644, 498051, 491927, 485848, 480136, 473882, 466370, 458331, 450842, 443901, 437055, 430655, 425372, 420984, 416583, 411681, 406294, 400386, 394065, 387976, 382695, 378077, 373910, 370565, 368002, 364673, 358868, 351156, 344275, 340391, 339266, 339095, 338106, 335351, 331139, 327110, 324944, 324437, 323482, 320341, 315399, 310429, 306737, 304302, 302097, 298936, 294447, 289500, 285264, 281864, 278536, 275042, 272030, 269743, 267307, 263765, 259165, 254225, 249560, 245629, 242756, 240765, 239126, 237779, 237146, 237007, 236237, 234067, 230738, 226437, 220766, 214209, 209013, 207188, 208189, 209782, 210661, 210872, 210242, 208232, 205439, 203503, 202945, 202440, 200873, 198901, 197737, 197389, 197045, 196415, 195710, 194789, 193262, 191144, 188634, 185570, 181929, 178647]
55399A78647j659K3L97l37r69j105j432k308k961k483j029K83M82m99j900k771
55383A60379k660j842q58J50J365K532K697J190j367l485m271l918k884j349K29
55368A45908R49N52J14P57J953K029L40j853k840k123n52O32P62K57K09R55J298
55351A49347p7k575m113l626k161j216j200j826k778l306k422l82J010O17m86
55336A24806o46J18O84P83R34J051O37K8j3L32L16O9K47M21n31k403l651l643
55318A19539l240k874j698N59K539K940K125J111P6j122j915j628m59R42K199
55303A19094K896K494J382J040K093L122K542Q83j81m13r80k128k574j574k46
55288A27450k37j796l612m133k895r69j8n92j528j499n92L15J133K297L281K938
$$ y = [178647, 176988, 177011, 177408, 177071, 176102, 174997, 173565, 171257, 168296, 165813, 164784, 165067, 165549, 165050, 163150, 160379, 157719, 155877, 155019, 155169, 156534, 159066, 161763, 162953, 161586, 158101, 153830, 149912, 147028, 145679, 145908, 146857, 147409, 147523, 148280, 150233, 152262, 152602, 150749, 147909, 145786, 145234, 145866, 146628, 146885, 147094, 148049, 149347, 149270, 146695, 142582, 138956, 136795, 135579, 134379, 132553, 129775, 126469, 124047, 123665, 124675, 125292, 124806, 124160, 124278, 124962, 125745, 126679, 127730, 128367, 128395, 128382, 128714, 129030, 129099, 129346, 129767, 129236, 126833, 123182, 119539, 116299, 113425, 111727, 112286, 114825, 117765, 119890, 121001, 121077, 119955, 118040, 116412, 115953, 116895, 119094, 121990, 124484, 125866, 126906, 128999, 132121, 134663, 135546, 135365, 134952, 133972, 131844, 129270, 127696, 127450, 127213, 125417, 121805, 117672, 114777, 113808, 113790, 113198, 111670, 110171, 109579, 109894, 111027, 113324, 116605, 119543]
55272A19543J519Q11J602K316J190j172k715k843l027m310n577m934k158J065
55258A01310L064L548L091K142J013K33J05J19m64j475k003j679j006l52M44J249
55242A09339J439J018R36J574J851P92q87j838j985k127k213j458K5J152J419
55227A09037J303J112O72K79O06J372J416N12o8O00J731K044J438O73J08l92p56
55210A21687p18l26L1K1m05q75p48J89J214J482J181J011P23n43k298k664r28
55193A18034J180J695O78o86k004l255l533j984M84K067K402K516K642J925M61
55178A22622j27R50K174J713n6j281j247j015j494k140j930q96n1q1o26p39J78
55161A15954J838L162L018J355l90n78O95J614R53l23n39K58O63K98K89J104J516
$$ y = [119543, 121062, 121873, 123475, 125791, 126981, 125809, 123094, 120251, 117224, 112914, 107337, 102403, 100245, 101310, 104374, 107922, 111013, 113155, 114168, 114401, 114506, 114625, 114161, 112686, 110683, 109004, 107998, 107646, 108090, 109339, 110778, 111796, 112732, 114306, 116157, 116949, 116062, 114224, 112239, 110112, 107899, 106441, 106466, 107618, 109037, 110340, 111452, 112124, 112403, 113009, 114381, 115797, 116309, 116241, 116841, 118572, 120616, 122054, 122727, 122835, 122443, 121687, 120969, 120643, 120674, 120695, 120290, 119415, 118667, 118856, 120070, 121552, 122733, 123744, 124467, 123924, 121626, 118962, 118034, 119214, 120909, 121587, 120901, 118897, 115642, 112109, 110125, 110609, 112676, 115078, 117594, 120236, 122161, 122622, 122495, 123445, 125619, 127332, 127276, 125995, 124748, 123733, 122239, 120099, 118169, 117273, 117222, 117141, 116515, 115776, 115954, 117792, 120954, 123972, 125327, 124937, 124359, 125054, 126668, 127621, 127298, 126759, 127017, 127680, 127978, 128267, 129371, 130887]
55144A30887O17n44m69N33R05J91n84o69m85o02p98o42k76j96m60n18J03J007
55126A28000J034l59k048k265q67L55J30n41L6J730K855K510J448P04M86M90M47
55109A34145J53l63p17o72n61o01k95O78J519J320O45P15J261Q66n10j096Q0J705
55091A38272K123J418N74j17o72n06O75J756J381j23j167j021l00L93J079J635
55075A45400J503O42k14n13m67l45LN73P87K36o56j135j020o82m10l20n54j050
55057A41778j236o16L84P33J24o55q43o39n07k19O91J922K707K964L124K891J392
55040A53995j052k501j608N28J674J088j02p37p88p88j054j449j366j26J903L013
55024A50630K030J80k31J119K216J692N55K21L54k33j444k157j993j564j177n23
$$ y = [130887, 131504, 130960, 130491, 131024, 131929, 132120, 131536, 130867, 130382, 129780, 128982, 128340, 128064, 127868, 127408, 126890, 126993, 128000, 129034, 128675, 126627, 124362, 123495, 123850, 123980, 123439, 123475, 125205, 128060, 130570, 132018, 132722, 133208, 133698, 134145, 134298, 133935, 133218, 132546, 131985, 131384, 131089, 131767, 133286, 134606, 135251, 135966, 137227, 138093, 137583, 136487, 136567, 138272, 140395, 141813, 142387, 142270, 141598, 141092, 141767, 143523, 144904, 144781, 143614, 142593, 142293, 142686, 143765, 145400, 146903, 147545, 147331, 146818, 146351, 146006, 146009, 146582, 147369, 147605, 146949, 145814, 144794, 144112, 143702, 143382, 142828, 141778, 140542, 139926, 140310, 141043, 141167, 140512, 139669, 139030, 138523, 138304, 138995, 140917, 143624, 146588, 149712, 152603, 153995, 152943, 150442, 148834, 149362, 151036, 152124, 152022, 151285, 150497, 149709, 148655, 147206, 145840, 145714, 147617, 150630, 152660, 152840, 152609, 153728, 155944, 157636, 158191, 158412, 158766, 158533, 157089, 154932, 152939, 151375, 150198, 149675]
55008A49675L38O95J63p91j520j795j541o14Q08J997K292J778J163R97J206J255
54992A56106P17k29q68n88L64R99O24k25k74R03K163K137J047M54J100J904J535
54975A67869K14q32j052q34n37l42p39j994l242l261k152j078l85N81J652J617
54959A55485M51L6J421K856K104l20j960j748q10k33J69Q30J672K630L732M424
54943A70739L995K865K182J877M91k308m469l851r35J851K916K482J354K8q71
54928A78346n58R66K584L178K737K047J656J532J467J380J156O10j81p22m91L64
54912A96071R27L42j164k356k272j291m74p4O99K220L529L457K107M56j060k483
54896A98634l205k336m32P38P01J050K680L761K217r09k604j818j43J202K602
$$ y = [149675, 150013, 150708, 150871, 150080, 148560, 146765, 145224, 144610, 145418, 147415, 149707, 151485, 152648, 153645, 154851, 156106, 156823, 156594, 155726, 155138, 155502, 156501, 157125, 156900, 156626, 157529, 159692, 161829, 162876, 163330, 164430, 166334, 167869, 168083, 167251, 166199, 165365, 164828, 164486, 163747, 161753, 158511, 155250, 153098, 152020, 151635, 152216, 153868, 155485, 155936, 155972, 157393, 160249, 162353, 162033, 160073, 158325, 157515, 157282, 157451, 158281, 159953, 162583, 166315, 170739, 174734, 177599, 179781, 181658, 182149, 179841, 175372, 171521, 170586, 172437, 175353, 177835, 179189, 179217, 178346, 177788, 178754, 181338, 184516, 187253, 189300, 190956, 192488, 193955, 195335, 196491, 197101, 196920, 196198, 195707, 196071, 196998, 197340, 196176, 193820, 191548, 190257, 189783, 189709, 190408, 192628, 196157, 199614, 201721, 202177, 201117, 198634, 195429, 193093, 192661, 193399, 194100, 195150, 197830, 201591, 203808, 202899, 200295, 198477, 198334, 199536, 202138]
54881B02138M007M093K531J109J160J550O78r09j595j276j068j142p93j71j10
54866B10202l35L62J966K946K510J737J725J876R81p44j792j315k17q5j405k998
54850B15414l231j689M88J874J979J215J89o01r37j068j361j510p54P99J878J621
54834B14306N86l74j258k081j969n07R36Q03l49p70l09l91j377j941j407p79q77
54817B02242j064o93l62q48j837k507k416j181J511M760O381N036J762j318l170
54802B06296l978l976l128j481P11K863L776K529J26r23M84K511K779J233m42
54787B09380j342j698j599r47l47m34n42M29J895K069Q06J23J310K985L098J652
54771B16838J10r45k139l539m082l056j115N66J526J945J938J543J085R58J158
$$ y = [202138, 206145, 210238, 212769, 213878, 215038, 216588, 217266, 216357, 214762, 213486, 212418, 211276, 210483, 210312, 210202, 209867, 210229, 212195, 215141, 217651, 219388, 221113, 222989, 223970, 223226, 221434, 220119, 219902, 219817, 218412, 215414, 212183, 210494, 210982, 212856, 214835, 216050, 216239, 215638, 214701, 213633, 212272, 210762, 210008, 210807, 212685, 214306, 214892, 214518, 213260, 211179, 209210, 208703, 209639, 210442, 210093, 209323, 209014, 208623, 207246, 205305, 203898, 203119, 202242, 201178, 200485, 200123, 199275, 197438, 194931, 192515, 191334, 192845, 197605, 203986, 209022, 210784, 209466, 206296, 202318, 198342, 195214, 193733, 194444, 197307, 201083, 203612, 203738, 202815, 203299, 205810, 208589, 209822, 209380, 208038, 206340, 204741, 203794, 203447, 203013, 202471, 202900, 204795, 206864, 207670, 207793, 209103, 212088, 215186, 216838, 216948, 216003, 213864, 210325, 206243, 203187, 202072, 202638, 204164, 206109, 208047, 209590, 210675, 211633, 212791]
54756B12791J534K261L408M114L208R14r41j106m30m56j209j494r30k62J38O91
54740B22231J333J160j29j558k101j727p88N42J723J861J010M23P53J049M46k74
54724B25954pP59Q43M10N27J180J350R48R80J671J982J312M00Jj97p11j276j333
54706B34793q84l16P6J22q9Q4J205K509K278M3k412l142k421k022k527k612j202
54689B23483Q04J715J257O98Q57J067N25j67J49J223J468K58j127j317o53l10
54673B29930n44q58j150j470j234k37J30j564m012m079j041K047K346Q46L66J301
54657B20777J471j96k103k380j211p9K10j36p42j379j748j655j317j054q14l68
54641B07276J84M37K15k15m39k51L37J105J615J389L00j213k357k365r22J376
$$ y = [212791, 214325, 216586, 219994, 224108, 227316, 228230, 227289, 226183, 225753, 225297, 224088, 222594, 221664, 221402, 221540, 222231, 223564, 224724, 224595, 223037, 220936, 219209, 218421, 218963, 220686, 222547, 223557, 223980, 224733, 225782, 226228, 225954, 225947, 226706, 227549, 227959, 228486, 229666, 231016, 231964, 232944, 234615, 236597, 237909, 238309, 238310, 238113, 237402, 236126, 234793, 233909, 233593, 233669, 233791, 233702, 233786, 234991, 237500, 239778, 239821, 237409, 234267, 231846, 229824, 227297, 224685, 223483, 224287, 226002, 227259, 227957, 228814, 229881, 230406, 230239, 230388, 231611, 233079, 233337, 232210, 230893, 230240, 229930, 229386, 228528, 227378, 225908, 224674, 224437, 224567, 223003, 218991, 214912, 213871, 215918, 218264, 219110, 219476, 220777, 222248, 222052, 219949, 217569, 216358, 216279, 216489, 216353, 215611, 214232, 212484, 210829, 209512, 208458, 207644, 207276, 207460, 207897, 208112, 207897, 207458, 207207, 207544, 208649, 210264, 211653, 211953, 210740, 208383, 206018, 205096, 206472]
54625B06472L003K546K29k035k619j858j101n77O02K287K707Q90j437j721J52
54610B07540J749J253n27j578j093N6P01N37Q2j13p5j30j19N37J682K023P11j160
54592B12076j811j245j104j944k306j148K76K78o45o65M42J002K05n23L28K017
54576B05233K513J253k45m86J93M42j29n36J4R16R85K02j88N49J383P24j303k596
54558B08924j452J236K734J435j455l373l075j421J05Q76J025P06M0o05q71p90
54542B04039n67j81M03R05J048J027J140J181Q02L46M77J009Q48n40k233k875
54526B06829k104o09Q12J722J815Q97p08j976j891n54O16K80j177j934r75P31
54510B01774J746K014K219K120R78n83q75M08J553J208J22k85J63P96J345J681
$$ y = [206472, 209475, 212021, 212250, 210215, 207596, 205738, 204637, 204060, 204662, 206949, 209656, 210546, 209109, 207388, 207540, 209289, 210542, 210015, 208437, 207344, 207400, 208101, 208638, 208720, 208607, 208532, 208402, 208283, 208820, 210502, 212525, 213236, 212076, 210265, 209020, 207916, 205972, 203666, 202518, 202794, 203072, 202427, 201762, 202204, 203206, 203411, 202888, 203216, 205233, 207746, 208999, 208754, 208268, 208461, 208903, 208774, 208238, 208252, 209168, 210153, 210355, 210167, 210716, 212099, 212823, 211520, 208924, 207472, 208708, 211442, 212877, 211422, 208049, 204974, 203553, 203658, 204534, 205559, 206265, 206305, 205700, 204829, 204039, 203472, 203291, 203694, 204599, 205647, 206674, 207814, 208995, 209797, 210143, 210620, 211629, 212477, 211937, 209704, 206829, 204725, 204116, 204928, 206650, 208465, 209362, 208654, 206678, 204787, 204233, 204849, 205129, 203952, 202018, 201043, 201774, 203520, 205534, 207753, 209873, 210851, 210268, 209393, 209801, 211354, 212562, 212684, 212399, 212562, 213358, 214703, 216384]
54494B16384J235j46j450j740j468j415j021O69K760L025Q86j608k302j202L13
54479B12920J452K314K911K941K364J640J276J371J502J107Q9r19j185o74M6N19
54463B29674O37K20r57k602l777l628k121m6J507J866J283O78N94O26J71o30j177
54446B22318j306j218q29qP93R96Q08Q50J001P11K82M98R62M11r57j127Q07K964
54428B27956L224K136J681K080J768J79j414j933j770j708j843k025k261k170
54414B23900j107O71J867J768J229J405K199K673K438J923J511J062K31j058k357
54399B38355k812j950l35R75J682K277K785K514J490R23J455J935J109k47k76
54384B49880J242K582K399J062l90j355j499p12L14M94j66m17M04J387J540J272
$$ y = [216384, 217619, 217473, 216023, 214283, 212815, 211400, 210379, 211048, 213808, 216833, 217719, 216111, 213809, 212607, 212920, 214372, 216686, 219597, 222538, 224902, 226542, 227818, 229189, 230691, 231798, 231887, 230968, 229783, 229109, 229155, 229674, 230311, 230531, 229574, 226972, 223195, 219567, 217446, 217400, 218907, 220773, 222056, 222734, 223328, 223954, 224125, 223495, 222318, 221012, 219794, 218965, 218957, 219750, 220746, 221554, 222404, 223405, 224116, 224398, 224896, 225858, 226269, 225312, 224185, 224992, 227956, 231180, 233316, 234997, 237077, 238845, 239024, 237610, 235677, 233907, 232199, 230356, 228331, 226070, 223900, 222793, 223464, 225331, 227099, 228328, 229733, 231932, 234605, 237043, 238966, 240477, 241539, 241770, 240712, 238355, 235543, 233593, 233258, 234233, 235915, 238192, 240977, 243491, 244981, 245904, 247359, 249294, 250403, 250156, 249880, 251122, 253704, 256103, 257165, 256775, 255420, 253921, 253209, 253523, 254017, 253851, 253434, 253838, 255225, 256765, 258037]
54368B58037J510K025J740L10j410k358k099r42K05M13k99q50l96P11J725K553
54352B60875L210K966J211j130k309j901j082p31l63O99K059K718K174O98r70
54337B68124j925j682p64k53o17j371j829j632o23R34J994J600L66k7Q15J256
54321B64366J4j769j955k60J485J712O32n23r31o03k7K75M0o06j279j469p09R10
54303B59303K378K498J177m63j402j523j064k15M08j05j563k319j223Q03K028
54288B58718K051J648J223P21N41J122J742J260j6n56J3K73q26k383k871k045
54272B60615p35M47J375J826J475L76q84j442o56J185K644K365P07n48l45N56
54256B68961Q67L30n59j487k189k009n94J189J939J338N37P28J755K314J433l23
$$ y = [258037, 259547, 261572, 263312, 263622, 262212, 259854, 257755, 256813, 257018, 257431, 257132, 256282, 255886, 256597, 258322, 260875, 264085, 267051, 268262, 267132, 264823, 262922, 261840, 261109, 260746, 261445, 263504, 266222, 268396, 269094, 268124, 266199, 264517, 263753, 263500, 262883, 261512, 259683, 258051, 257428, 258362, 260356, 261956, 262322, 262295, 263110, 264366, 264380, 262611, 260656, 260396, 261881, 263593, 264225, 263702, 262771, 262168, 262141, 262416, 262456, 261850, 260571, 259102, 258393, 259303, 261681, 264179, 265356, 264893, 263491, 261968, 260904, 260689, 261097, 260992, 259429, 257110, 255887, 256690, 258718, 260769, 262417, 263640, 264361, 264902, 266024, 267766, 269026, 269010, 268454, 268467, 268740, 267914, 265531, 262660, 260615, 259880, 260327, 261702, 263528, 265003, 265379, 264495, 263053, 262397, 263582, 266226, 268591, 269298, 268750, 268405, 268961, 269828, 270158, 269599, 268112, 265923, 263914, 263320, 264509, 266448, 267786, 268323, 269051, 270806, 273120, 274553, 274230]
54240B74230j240k84J597K411J338n50j787j971j514q28l11m40j162j617j089
54225B66783N3R93J508J724J401L68o43o45P1Q7j158k383j988l2J834K170J115
54208B71258j5k10J59j41j588l043k912j070Q47J199K6j277j679j484j560j926
54192B56584j615q5J642J936O14o67m09R91K064K236K118K139J909J033k33j428
54176B68829k275k388j321N58J863J613N30J89Q78J115l29k539l259j532J125
54161B63057K448J819M58l77n08k03M86J195Q98q88k903l207j497N23J172M54
54145B62927n37r52o06L10J301J856K051K413K936K910K203J816K395K945K185
54130B86153N56m76p93j577k855k896q91J426K051J393J190J663J526M52k81J97
$$ y = [274230, 272990, 272706, 274303, 276714, 278052, 277502, 275715, 273744, 272230, 271402, 271091, 270651, 269489, 267872, 266783, 266836, 267829, 269337, 271061, 272462, 272830, 272187, 271542, 271613, 271700, 270542, 268159, 266171, 266139, 267973, 270143, 271258, 271243, 271033, 271192, 271051, 269463, 266420, 263508, 262438, 263285, 264484, 264510, 263233, 261554, 260070, 258510, 256584, 254969, 254884, 256526, 258462, 259076, 258409, 258000, 258991, 261055, 263291, 265409, 267548, 269457, 270490, 270257, 268829, 266554, 264166, 262845, 263403, 265266, 266879, 267409, 267598, 268476, 269591, 269262, 266723, 263464, 261932, 263057, 265505, 267324, 267782, 267405, 266897, 266694, 267180, 268375, 269273, 268385, 265482, 262275, 260778, 261301, 262473, 262927, 262390, 261438, 260832, 261142, 262443, 264299, 266350, 268763, 271699, 274609, 276812, 278628, 281023, 283968, 286153, 286709, 286233, 285440, 283863, 281008, 278112, 277221, 278647, 280698, 282091, 283281, 284944, 286470, 286922, 286641, 286838]
54114B86838J169J563J112k7j568k543j805J83J308N03p68p06L60J137J804L253
54098B91813M701M341K349Q03L51p43l237m899l620p56P09L15K09J551L037L223
54082C00147K392J467N68m96j295j304p16j60Pk90r75j570j416o34k42p02r91
54065B93790R4K068L218K853K080K085K485K030N08q91j001K6J058J228N28n63
54049C11596j589k217k171j344P2J662K948L564L488L203L312L860M225L992L552
54034C38153L444L358K480P92o54j033o67k11M94K058M250N917O161N071L233
54019C72846J217j61P0J933L782L673J520p53j344l01J047J603R24r87l340m358
54003C77371k717N90K825K427N98o27r88j617k576k250L76L838N506M416K135
$$ y = [286838, 288007, 289570, 290682, 290655, 289087, 286544, 284739, 284922, 286230, 286733, 285965, 285259, 285619, 286756, 288560, 291813, 296514, 300855, 303204, 304007, 304358, 303615, 300378, 295479, 291859, 291103, 291812, 292127, 292336, 293887, 296924, 300147, 302539, 304006, 304574, 304078, 302783, 301479, 300763, 300603, 300610, 300320, 299345, 297775, 296359, 295725, 295483, 294781, 293790, 293884, 295952, 299170, 302023, 304103, 306188, 308673, 310703, 311211, 310320, 309319, 309345, 310403, 311631, 312159, 311596, 310007, 307790, 305619, 304275, 304347, 306009, 308957, 312521, 316009, 319212, 322524, 326384, 330609, 334601, 338153, 341597, 344955, 347435, 348227, 347573, 346540, 345873, 345662, 346156, 348214, 352464, 358381, 364542, 369613, 372846, 374063, 373902, 373972, 375905, 379687, 383360, 384880, 384127, 382783, 382482, 383529, 385132, 386056, 385069, 381729, 377371, 374654, 375244, 378069, 380496, 381094, 380467, 379479, 377862, 375286, 373036, 373412, 377250, 382756, 387172, 389307]
53988C89307Q16R73J370P68o85j851k042j647j357j183o15M47J367J598J469J847
53972C90582K903L518K219j146m788o336m888j681J195K480K225J171P1n14k96
53957C86715N46J327J269K47q40o94J035L197M292M046L325K647J584p0j303q32
53941D06491J301L627M499L221M67j898j967L77K975L551K116N55J40N44J213
53926D27212K335L923N008M614L097J807J634K399L385M033M224M134L855L165
53912D74825K017J120J396K743L907L930L154K467K150J954J800J814J940K019
53898E07236K006J748J015J99L84J963L582L356J052j754l596m268m024k688k19
53883E05992K404L644K729L37j940k757j977o65p4n17j325j773j683j178m55O2
$$ y = [389307, 390123, 391096, 392466, 393234, 392549, 390698, 388656, 387009, 385652, 384469, 383854, 384301, 385668, 387266, 388735, 390582, 393485, 397003, 399222, 398076, 393288, 386952, 382064, 380383, 381578, 384058, 386283, 387454, 387525, 387011, 386715, 387261, 388588, 389857, 390104, 389264, 388570, 389605, 392802, 397094, 401140, 404465, 407112, 408696, 408626, 407323, 406491, 407792, 411419, 415918, 419139, 419606, 417708, 415741, 416118, 419093, 422644, 424760, 425315, 425455, 425999, 427212, 429547, 433470, 438478, 443092, 446189, 447996, 449630, 452029, 455414, 459447, 463671, 467805, 471660, 474825, 476842, 477962, 479358, 482101, 486008, 489938, 493092, 495559, 497709, 499663, 501463, 503277, 505217, 507236, 509242, 510990, 512005, 512204, 512588, 514551, 518133, 521489, 522541, 520787, 517191, 512923, 508899, 506211, 505992, 508396, 512040, 514769, 515106, 513166, 510409, 508432, 507767, 507693, 507176, 505851, 504078, 502395, 501217, 500762, 500824]
53867E00824k34j398k517k384p26J458K690K177L18j735l061l486l246k488j428
53852D84764p21r53j761k179k014k160l054l667k803q56O98J315J693K129J772
53837D72203J37j627j955q46K00P9q49j594j736j613j717k156k545k406j789j301
53821D50485j204p80P63K842L717K362l61k682l540l012j793o95k52k56O9J038
53805D46701J985K157J722J329J072O38J30p3j69o49j087k83K011M347N196M655
53789D69682L902L462K840J679M91L3M11J025J221Q79M16K46K48q2j003k234l273
53772D79943l713l312k190j067p44j010o67Q29K242J854l06k336k652j608o32
53757D64631l55k83L2J87m61j794k886k941j994p23J47K26m44j350j752j303l60
$$ y = [500824, 500590, 499192, 496675, 494291, 493565, 495023, 497713, 499890, 500208, 498473, 495412, 491926, 488680, 486192, 484764, 484043, 483090, 481329, 479150, 477136, 474976, 471922, 468255, 465452, 464596, 465294, 466609, 468302, 470431, 472203, 472340, 470713, 468758, 467912, 468112, 468191, 467342, 465748, 464012, 462399, 460682, 458526, 455981, 453575, 451786, 450485, 449281, 448501, 449264, 452106, 455823, 458185, 457824, 455142, 451602, 448590, 446797, 446102, 445850, 445594, 445663, 446701, 448686, 450843, 452565, 453894, 454966, 455604, 455734, 455661, 455492, 454843, 453756, 453473, 455484, 459831, 465027, 469682, 473584, 477046, 479886, 481565, 482056, 482089, 482500, 483525, 484746, 485625, 486041, 486287, 486535, 486453, 485450, 483216, 479943, 476230, 472918, 470728, 469661, 468917, 467907, 467240, 468069, 470311, 472165, 471859, 469523, 466871, 465263, 464631, 464276, 463993, 464025, 464212, 463751, 461957, 459071, 456130, 454136, 453413, 453560, 453786, 453342, 451992, 450240, 448937, 448577]
53740D48577M59Q81R09N37O4K95J648L111L076J391l00o68k72m60j535k818l858
53723D51037m551m381k702J81K913M243L910K467Q56mK22R87J485J351O02o08
53707D58008j620j348L68J967J900P80M97J460K221J959J506J399P76o92j384
53692D67797N8K231K590J010j30O10K004K346J719J316J481J551J151P37Q52J336
53676D88659J403N34o94q60P34K859L458K094M99K79P82J87j759l141k277J68
53660D92925J966J850N72l43k54M28J167J806K249K226J694J218J550K752L932
53645E15738L964K553P39J11J267K910L019J143q77r62O91J881J104p86j804j132
53629E29559M09J729K540K998K950K065N77n34l63R96K539L319L150K434J615
$$ y = [448577, 449036, 449917, 450826, 451363, 451427, 451722, 453370, 456481, 459557, 460948, 460648, 459980, 459708, 459248, 457713, 454895, 451037, 446486, 442105, 439403, 439584, 442497, 446740, 450650, 453117, 453973, 453969, 454191, 455178, 456663, 458014, 458616, 458008, 456388, 455040, 455408, 457375, 459275, 460055, 460552, 462012, 464233, 466192, 467698, 469097, 469873, 469181, 467797, 467855, 470086, 472676, 473686, 473556, 474166, 476170, 478516, 480235, 481551, 483032, 484583, 485734, 486471, 487323, 488659, 490062, 490596, 489902, 489042, 489776, 492635, 496093, 498187, 498686, 498965, 499747, 499934, 498175, 495034, 492757, 492925, 494891, 496741, 497313, 496970, 496716, 497144, 498311, 500117, 502366, 504592, 506286, 507504, 509054, 511806, 515738, 519702, 522255, 522994, 523105, 524372, 527282, 530301, 531444, 530567, 529605, 530296, 532177, 533281, 532495, 530691, 529559, 529968, 531697, 534237, 537235, 540185, 542250, 542827, 542293, 541930, 542926, 545465, 548784, 551934, 554368, 555983]
53614E55983R86P71R56J265J528J961K648L070K670J961K235L852N431N235L101
53599E93653N24r05o55P81K427L231K621R80o18j222n40J153L116M228L643J822
53583F14239M39P28K013K437J180n50r55L10J983K864K992L054L234L168K707
53568F39843K001R32p45k490k975j588N62J726J316J18r63j543j382l10J175K027
53552F37704J752J022Q26J374K055K250J957J803K360L282L398K211R38J162K623
53537F66717L566L345L193L920M464L812K940L281M358M693M415M896O110O483
53523G26193N651N321O693Q695R764R989J0430J1413J2529J3444J3724J2801J1013
53510H57660R934J0591J2068J2819J2712J2669J3040J3609J4604J6308J7962J8434
$$ y = [555983, 556969, 557740, 558696, 559961, 561489, 563450, 566098, 569168, 571838, 573799, 576034, 579886, 585317, 590552, 593653, 594177, 593272, 592617, 593398, 595825, 599056, 601677, 602657, 602039, 600817, 600277, 601430, 604546, 608774, 612417, 614239, 614678, 615406, 617419, 619856, 621036, 620486, 619531, 619841, 621824, 624688, 627680, 630734, 633968, 637136, 639843, 641844, 642776, 642031, 639541, 636566, 634978, 635540, 637266, 638582, 638700, 637737, 636194, 634812, 634502, 635677, 637704, 639456, 640478, 641304, 642678, 644733, 646983, 648940, 650743, 653103, 656385, 659783, 661994, 662932, 664094, 666717, 670283, 673628, 676821, 680741, 685205, 689017, 691957, 695238, 699596, 704289, 708704, 713600, 719710, 726193, 731844, 737165, 743858, 752553, 762317, 772306, 782736, 794149, 806678, 820122, 833846, 846647, 857660, 867594, 878185, 890253, 903072, 915784, 928453, 941493, 955102, 969706, 986014, 1003976, 1022410]
53498A022410J7934J7705J8073J8138J7495J6897J6867J6834J6316J5868J6244
53487A210781J7298J8345J8998J9163J8767J7994J7375J7256J7509J7923J8307
53476A409716J8125J6789J4693J3223J3186J3821J3925J3336J2727J2380J1938
53465A563859J1157J0334R920J0072J0402J0078Q469N990L959L403M277N887P502
53452A665309Q323P640N596L286J577L35o58q67O8J200J275N75N51J608K440J943
53436A700201P74M87J724L881O008P418P696O852N525M684M852N692O392O542
53422A768728O633P546R412J1179J1599J0610R474R561J1227J3732J5958J7168
53410A902827J7515J7921J9155K0926K2150K2249K1829K1934K2940K4428K5878
$$ y = [1022410, 1040344, 1058049, 1076122, 1094260, 1111755, 1128652, 1145519, 1162353, 1178669, 1194537, 1210781, 1228079, 1246424, 1265422, 1284585, 1303352, 1321346, 1338721, 1355977, 1373486, 1391409, 1409716, 1427841, 1444630, 1459323, 1472546, 1485732, 1499553, 1513478, 1526814, 1539541, 1551921, 1563859, 1575016, 1585350, 1595270, 1605342, 1615744, 1625822, 1634291, 1640281, 1644240, 1647643, 1651920, 1657807, 1665309, 1673632, 1681272, 1686868, 1690154, 1691731, 1692066, 1691408, 1690541, 1690609, 1691809, 1693084, 1693659, 1694210, 1695818, 1698258, 1700201, 1700975, 1701462, 1703186, 1707067, 1713075, 1720493, 1728189, 1735041, 1740566, 1745250, 1750102, 1755794, 1762186, 1768728, 1775361, 1782907, 1792319, 1803498, 1815097, 1825707, 1835181, 1844742, 1855969, 1869701, 1885659, 1902827, 1920342, 1938263, 1957418, 1978344, 2000494, 2022743, 2044572, 2066506, 2089446, 2113874, 2139752]
53399B139752K7091K8061K8786K9335K9888L0640L1672L2879L3861L4092L3499
53388B479556L2837L3073L4163L4849L4143L2674L1981L2478L2963L2334L1012
53377B842063L0058K9612K9050K8312K7963K7901K7052K4718K1515J8602J6600
53366C123446J5487J4948J4269J2549R715O964N581N465N263L845J276j439l194
53353C214175l540l023k746l343m535n700o504o917p057p337q230r477j0069r371
53339C126326p866o504n851o231p843j0168j1909j2378j2337j2704j3098j2612
53327C006825j1323r979q761p574p040p801r117r665r473r522r644q642o601n066
53313B886617m528l783k610k865n392p653o626l040n93j312l517m456l353j488
$$ y = [2139752, 2166843, 2194904, 2223690, 2253025, 2282913, 2313553, 2345225, 2378104, 2411965, 2446057, 2479556, 2512393, 2545466, 2579629, 2614478, 2648621, 2681295, 2713276, 2745754, 2778717, 2811051, 2842063, 2872121, 2901733, 2930783, 2959095, 2987058, 3014959, 3042011, 3066729, 3088244, 3106846, 3123446, 3138933, 3153881, 3168150, 3180699, 3190414, 3197378, 3202959, 3208424, 3213687, 3217532, 3218808, 3217369, 3214175, 3210635, 3207612, 3204866, 3201523, 3196988, 3191288, 3184784, 3177867, 3170810, 3163473, 3155243, 3145766, 3135697, 3126326, 3118460, 3111956, 3106105, 3099874, 3092031, 3081863, 3069954, 3057576, 3045239, 3032535, 3019437, 3006825, 2995502, 2985523, 2976762, 2969188, 2962148, 2954347, 2945230, 2935565, 2926092, 2916570, 2906926, 2898284, 2891683, 2886617, 2882089, 2878306, 2875696, 2872831, 2867439, 2859786, 2853160, 2850120, 2849527, 2848215, 2844698, 2840242, 2836889, 2835401]
53299B835401l73l22k57J156L754N583N029K849J135O58M06l39q49j99J431L267
53283B858330M822N686N241L414J299K36M27Q68N82n56k030l304m190m859n563
53268B860403o254o553o288n930o179p127q273r473j1309j3943j5984j5588j2991
53255B734511j0916j1656j4404j6520j6941j6955j7625j8108j7269j5630j4742
53244B563745j5286j6793j8572k0025k0492j9742j8493j7677j7462j7490j7637
53233B364076j7821j7639j7049j6904j7725j8371j7210j4453j2189j1988j3586
53222B189141j5842j7782j8576j7761j6033j4843j4912j5841j7245j9031k0395
53211B000880k0002j7878j5831j5194j5169j4359j2875j1915j2083j3244j5221
$$ y = [2835401, 2835028, 2834706, 2834449, 2835605, 2839359, 2844942, 2849971, 2852820, 2853955, 2854613, 2855019, 2854680, 2853831, 2853632, 2855063, 2858330, 2863152, 2868838, 2874079, 2877493, 2878792, 2879028, 2879455, 2880323, 2880905, 2880349, 2878319, 2875015, 2870825, 2865966, 2860403, 2854149, 2847596, 2841308, 2835378, 2829199, 2822072, 2813799, 2804326, 2793017, 2779074, 2763090, 2747502, 2734511, 2723595, 2711939, 2697535, 2681015, 2664074, 2647119, 2629494, 2611386, 2594117, 2578487, 2563745, 2548459, 2531666, 2513094, 2493069, 2472577, 2452835, 2434342, 2416665, 2399203, 2381713, 2364076, 2346255, 2328616, 2311567, 2294663, 2276938, 2258567, 2241357, 2226904, 2214715, 2202727, 2189141, 2173299, 2155517, 2136941, 2119180, 2103147, 2088304, 2073392, 2057551, 2040306, 2021275, 2000880, 1980878, 1963000, 1947169, 1931975, 1916806, 1902447, 1889572, 1877657, 1865574, 1852330, 1837109]
53200A837109j7412j8369j7151j4883j3647j4001j4673j4644j4265j4253j4634
53189A669177j5026j5126j4741j3962j3338j3183j2925j2049j1451j2608j5214
53178A519554j7065j6751j5259j4238j3846j3363j2793j2599j2435j1544j0183
53167A369478r528j0086j1186j2067j2634j3020j3165j3145j3200j3245j2831
53156A235371j1761j0328q913p875p740q708r865r832q555p617q171r373r594
53143A117039q565p397p009p524q927j1034j2789j2753j0828q656p776p991q063
53130I97727p429o567n992n617n125m515m148m396n226o175o857p401q014q260
53116I12005p505o183n761o782p738o824m445k854l295m582m888m025l299l571
$$ y = [1837109, 1819697, 1801328, 1784177, 1769294, 1755647, 1741646, 1726973, 1712329, 1698064, 1683811, 1669177, 1654151, 1639025, 1624284, 1610322, 1596984, 1583801, 1570876, 1558827, 1547376, 1534768, 1519554, 1502489, 1485738, 1470479, 1456241, 1442395, 1429032, 1416239, 1403640, 1391205, 1379661, 1369478, 1359950, 1349864, 1338678, 1326611, 1313977, 1300957, 1287792, 1274647, 1261447, 1248202, 1235371, 1223610, 1213282, 1204369, 1196494, 1188754, 1180046, 1170181, 1160349, 1151794, 1144177, 1136006, 1126633, 1117039, 1108474, 1101077, 1094068, 1086544, 1077617, 1066583, 1053794, 1041041, 1030213, 1021557, 1013781, 1005790, 997727, 990298, 983731, 977739, 972122, 966997, 962482, 958334, 953938, 948712, 942537, 935680, 928279, 920265, 912005, 904500, 898317, 892556, 885774, 878036, 871212, 866767, 863913, 860618, 856036, 851148, 847123, 843824, 840253]
53102H40253m324m602m241l925m304n396o707p588p509o439n157m731n251n459
53088G64620m378k901k727l794m162k896j618k177m020n218n260n136n213m813
53074G10307l923l571m098m546m197l487k845k018j166j336k869m471m873m440
53060F62467l983l100j091J054J356n10k690l509l230l133l674m119l594k131
53046F30113p60n62j529k604l055l229l573l627k832j824j807k802l598l434k672
53031E92205j710l18J430K559K262J020j7m71r34j797k532k406j594j169j777
53016E84751k681k608j549r75j938l629m488m209l723l622l604l479l563l785
53002E40898l294j519P84K098J587j24j451j211J85J056K69j439k442k168j352
$$ y = [840253, 835929, 831327, 827086, 823161, 818857, 813461, 806754, 799166, 791657, 785218, 780061, 775330, 770079, 764620, 760242, 757341, 754614, 750820, 746658, 743762, 742144, 739967, 735947, 730729, 725469, 720333, 715120, 710307, 706384, 702813, 698715, 694169, 689972, 686485, 683640, 681622, 680456, 679120, 676251, 671780, 666907, 662467, 658484, 655384, 654293, 655347, 656703, 656193, 653503, 649994, 646764, 643631, 639957, 635838, 632244, 630113, 629353, 628791, 627262, 624658, 621603, 618374, 614801, 611174, 608342, 606518, 604711, 601909, 598311, 594877, 592205, 590495, 590177, 591607, 594166, 596428, 597448, 597431, 596960, 596026, 594229, 591697, 589291, 587697, 586528, 584751, 582070, 579462, 577913, 576938, 575000, 571371, 566883, 562674, 558951, 555329, 551725, 548246, 544683, 540898, 537604, 536085, 536869, 538967, 540554, 540430, 538979, 537768, 537953, 539009, 539278, 537839, 535397, 533229, 531877]
52987E31877o85j64K07J59j59o3O80J406J326K80j421l141l871k831m49J757K499
52970E27407J526n30k318k166K43K706K568J21j685j388p89j704k974k441l72
52955E18204J089J017K44n09j181j397q48m78j541l427m100k893j186l4J081K472
52939E06513K897J310j131k124r71P48J149k1j525k234k259k437k960l076k303
52924D91576j193m09K63J188J851J604Q86N89N78J53m59m67j77o01j491j503n33
52907D91855n1o92j269r24m68n46k91Q95J689O34j408k285j354J81J142J197L34
52890D88639r96j476l5K519M059L372J145j051k006j442k00L64k09r73j026p16
52874D89968o56m92K17P43L14k21N44K100K557J372j05r23j465j877j462l59k5
$$ y = [531877, 531192, 531028, 531235, 531394, 531235, 531172, 531852, 533258, 534584, 534864, 533443, 530302, 526431, 523600, 523151, 524908, 527407, 528933, 528403, 526085, 523919, 524162, 526868, 529436, 529557, 527872, 526484, 525695, 523991, 521017, 518576, 518204, 519293, 520310, 520554, 520045, 518864, 517467, 516619, 516141, 514600, 511173, 507073, 504180, 502994, 502960, 504041, 506513, 509410, 510720, 509589, 507465, 506494, 507242, 508391, 508370, 506845, 504611, 502352, 499915, 496955, 493879, 491576, 490383, 489974, 490237, 491425, 493276, 494880, 495766, 496355, 496933, 497086, 496627, 496160, 495983, 495382, 493891, 492388, 491855, 491804, 491112, 489843, 488919, 488451, 487905, 487614, 488509, 490198, 490832, 489424, 487139, 485785, 485966, 487108, 488305, 488639, 487643, 486167, 486132, 488651, 492710, 496082, 497227, 496176, 494170, 492728, 492528, 492892, 492683, 491710, 490684, 489968, 489312, 488820, 489037, 489780, 490094, 489873, 490417, 492517, 495074, 496446, 496341, 495418, 493953, 492076, 490614, 490255, 490230]
52857D90230j020j714n29J587K209L95k443m314m385l184j797q95l19L25Q66Q52
52841D75864M60L14L96J38l67l97p6n09j853k571j446O48J951J876R54l66j742
52824D73274k480k235j694j582j487o57M61P09n8p84p56l31j14k24n25r32j270
52807D59315j227n49P43K049K247Q30q61p20J222K330P42k005l192k509j623j087
52791D55705k4J361J506J43r92q15l95p78j210q09n08j588l223l228r59J960L714
52774D49860L975L392K501J480N20q2j95j09l50j048j681j805j696j712j366j
52758D51683J797K634K239J632J178k4k035l002j448J431L115K707J232k23j261
52743D61655j492o91M49Q48L71l49j100j945k125n75K237M266M118K376M03j133
$$ y = [490230, 489210, 487496, 486967, 488554, 490763, 491158, 488715, 484401, 480016, 476832, 475035, 474140, 473821, 474146, 475012, 475864, 476324, 476638, 477034, 477172, 476805, 476408, 476332, 475823, 473970, 471399, 469953, 470601, 472552, 474428, 475382, 475016, 473274, 470794, 468559, 466865, 465283, 463796, 463139, 463600, 464309, 464251, 463467, 462711, 462380, 462266, 462042, 461517, 460585, 459315, 458088, 457539, 458282, 460331, 462578, 463408, 462547, 461827, 463049, 465379, 466121, 464116, 460924, 458415, 456792, 455705, 455681, 457042, 458548, 458691, 457699, 456884, 456489, 455711, 454501, 453692, 453184, 451596, 448373, 445145, 444186, 446146, 449860, 453835, 457227, 459728, 461208, 461728, 461646, 461451, 461342, 460992, 459944, 458263, 456458, 454762, 453050, 451684, 451683, 453480, 456114, 458353, 459985, 461163, 461139, 459104, 456102, 454654, 456085, 459200, 461907, 463139, 462916, 461655, 460163, 459472, 459921, 460769, 461140, 460791, 459691, 457746, 455621, 455046, 457283, 461549, 465667, 468043, 468446, 467313]
52727D67313k075k124j169K25J218J425J021N02M11Q36J139N96o21j671k121k174
52711D62731j874j020N9M91Ro51p46k12P73K054K988K769J770J521K632L680L035
52694D80009J023p56j499j561j277p03k42l00m41k2L84n39k749m397l991k092
52678D60847j75J250K570L649L569J840p40k622k734j267M23Q80j80j525j570
52663D64215J7J965K632J487m91j803j738q02N7M60O40O94L56k90l48R36K862
52646D70849L643K416L62o79l24L12N05Q34J892K933K634Q34j256k409k210q22
52630D79514J268L092L691L084K186J612J142N16j22q14j906k995k773q16J396
52615D88075K242K049K050J963L76k462m181l186n80J655L027M048M506L757K187
$$ y = [467313, 465238, 463114, 461945, 462170, 463388, 464813, 465834, 466336, 466747, 467583, 468722, 469318, 468697, 467026, 464905, 462731, 460857, 459837, 459896, 460387, 460396, 459745, 458999, 458787, 459560, 461614, 464602, 467371, 469141, 470662, 473294, 476974, 480009, 481032, 480276, 478777, 477216, 475939, 475236, 474994, 474694, 474253, 474231, 474615, 474076, 471327, 466930, 462939, 460847, 460672, 461922, 464492, 468141, 471710, 473550, 472810, 470188, 467454, 466187, 466610, 467490, 467310, 465785, 464215, 464232, 466197, 468829, 470316, 469825, 468022, 466284, 465482, 465539, 465999, 466639, 467333, 467689, 467399, 467051, 467987, 470849, 474492, 476908, 477270, 476591, 476267, 476579, 477084, 477918, 479810, 482743, 485377, 486211, 484955, 482546, 480336, 479514, 480782, 483874, 487565, 490649, 492835, 494447, 495589, 496105, 495983, 495169, 493263, 490268, 487495, 486679, 488075, 490317, 492366, 494416, 496379, 496755, 494293, 490112, 486926, 486346, 488001, 491028, 495076, 499582, 503339, 505526]
52600E05526Q41k96k209m755n981m417j264O92J79j367j789o67O23Q50L14J73
52584D86453R52K094K725K509J792J197J115J358J365R27M80M25M56O3m75l15
52568E03121P29J886K426K272J516K07j056j339p14n53j581k496j629N84K073
52553E05446J878J066Q09Q58M89j20j69N21J220J126J86o44j54J714L331K979
52537E20536R61p63j110r81j489k300k422j703n98O73J711J478m56k677l309k345
52521E05206j326q84k41Q35J313P92N27J481K532K053N05m6J230K879L071J640
52505E21567r5o99L62K373L588K474o20l263l104m50J737Q34k392m262k120K508
52489E18438N381M140O15j749j802j207j641k720k834j239J122K543K187R20M33
$$ y = [505526, 506367, 506071, 503862, 499107, 493126, 488709, 487445, 488137, 488316, 486949, 485160, 484493, 485116, 485966, 486280, 486453, 487405, 489499, 492224, 494733, 496525, 497722, 498837, 500195, 501560, 502487, 502967, 503392, 503848, 503911, 503436, 503121, 503850, 505736, 508162, 510434, 511950, 512157, 511101, 509762, 509048, 508495, 506914, 504418, 502789, 503373, 505446, 507324, 508390, 509199, 510057, 510546, 510426, 510257, 510778, 511998, 513124, 513310, 512666, 512512, 514226, 517557, 520536, 521497, 520734, 519624, 518643, 517154, 514854, 512432, 510729, 510131, 510804, 512515, 513993, 513537, 510860, 507551, 505206, 503880, 502996, 502755, 503590, 504903, 505695, 506222, 507703, 510235, 512288, 512793, 512747, 513977, 516856, 519927, 521567, 521472, 520773, 521135, 523508, 527096, 529570, 528950, 525687, 522583, 522133, 523870, 524704, 522312, 518050, 515930, 518438, 523819, 527959, 528574, 526825, 525023, 523816, 522175, 519455, 516621, 515382, 516504, 519047, 521234, 522154, 522587]
52474E22587J297K267J867K18j369k071j924r31Q60K390K144J08j862k197j143
52459E22241K67J564K420K215J094M80J168J777O15j518k149n58J391J988J521
52444E34516R52L55l90o94j28O33P85P15J320K405K714J551l16j439j067J78Q39
52427E42929J34j081j323m27L94O29J272K825L802K734P13J35J181J477l01k351
52411E52742k208l6J827J914R54L74N64R62J123J137J180J097P34M39Q01J752
52395E65356K398K188J720J749J888J294M75R48K745L594J608k056m290l415n37
52380E75665K128L192K502P99o06o01P48K214K833K955L574M690M935L061k70
52365F07819k690k460l24J460J765J481J724K136J636J06j509k295j805O9K656
$$ y = [522587, 523884, 526151, 528018, 528236, 526867, 524796, 522872, 521941, 522801, 525191, 527335, 527443, 525581, 523384, 522241, 522508, 524072, 526492, 528707, 529801, 530281, 531449, 533226, 533841, 532323, 530174, 529616, 531007, 532995, 534516, 535468, 535823, 535433, 534739, 534611, 535244, 536029, 536744, 538064, 540469, 543183, 544734, 544418, 542979, 541912, 542090, 542929, 543063, 541982, 540659, 540232, 540626, 541255, 542527, 545352, 549154, 551888, 552601, 552736, 553917, 555394, 555093, 552742, 550534, 550498, 552325, 554239, 555193, 555567, 556131, 557093, 558216, 559353, 560533, 561630, 562364, 562803, 563604, 565356, 567754, 569942, 571662, 573411, 575299, 576593, 577068, 578016, 580761, 584355, 585963, 583907, 579617, 576202, 575665, 577793, 580985, 583487, 584286, 583680, 583079, 583827, 586041, 588874, 591829, 595403, 600093, 605028, 608089, 607819, 605129, 602669, 602345, 603805, 605570, 607051, 608775, 610911, 612547, 612653, 611144, 608849, 607044, 607113, 609769]
52350F09769M294L759J924Q78J368K202K336K319L059M213M725M307L548L035
52336F51736K941L248L727M023M131M434N028N483N653O032O803P251O911O529
52322G23930O990P849Q087P965Q735J0576J2034J1892J0639R649R633J0287J0880
52309H49146J0812J0024R164R099J0153J2061J4244J5646J4836J1502P705O265
52297I80657P619R455R909R682J0244J1236J1120R608Q026P565Q291R675J1050
52284A104137J1534J0533Q538O773O044O330P313Q579R493R642R362R183Q916
52271A216377Q159P472P914R227R749Q661P294P442R126J0903J1861J2320J2713
52258A339218J2759J2069J0949J0134R943J0034R955R683R455R303R071Q812Q769
$$ y = [609769, 614063, 617822, 619746, 620624, 621992, 624194, 626530, 628849, 631908, 636121, 640846, 645153, 648701, 651736, 654677, 657925, 661652, 665675, 669806, 674240, 679268, 684751, 690404, 696436, 703239, 710490, 717401, 723930, 730920, 738769, 746856, 754821, 763556, 774132, 786166, 798058, 808697, 818346, 827979, 838266, 849146, 859958, 869982, 879146, 888245, 898398, 910459, 924703, 940349, 955185, 966687, 974392, 980657, 988276, 997731, 1007640, 1017322, 1027566, 1038802, 1049922, 1059530, 1067556, 1075121, 1083412, 1093087, 1104137, 1115671, 1126204, 1134742, 1141515, 1147559, 1153889, 1161202, 1169781, 1179274, 1188916, 1198278, 1207461, 1216377, 1224536, 1232008, 1239922, 1249149, 1258898, 1267559, 1274853, 1282295, 1291421, 1302324, 1314185, 1326505, 1339218, 1351977, 1364046, 1374995, 1385129, 1395072, 1405106, 1415061, 1424744, 1434199, 1443502, 1452573, 1461385, 1470154]
52245A470154Q828Q510P815P498P949Q370P824O730O285O529O230M907L759L953
52231A565341M916N155M140K622J537J306J865K680K993K627K343K807L594L821
52217A607747L636M088N498O694O295M386K536K202L337M624N055M982N296N830
52203A672206N379L474J267J73L76J241K436L809M793M983M894N186N493N014
52189A720724L960L115K475J707J711L690O509P081M403J253N44J646K080J478
52175A762376J458K394K780J949J095J062J072N02K08Q78J483Q42k33oJ430K120
52159A781410R64p87j138L97K550L647K985J278rq2M50N51J81J34O90J360J996
52142A796577L093M635N599N285M430M170M403M094L017K254K873M635O235O603
$$ y = [1470154, 1478982, 1487492, 1495307, 1502805, 1510754, 1519124, 1526948, 1533678, 1539963, 1546492, 1552722, 1557629, 1561388, 1565341, 1570257, 1575412, 1579552, 1582174, 1583711, 1585017, 1586882, 1589562, 1592555, 1595182, 1597525, 1600332, 1603926, 1607747, 1611383, 1615471, 1620969, 1627663, 1633958, 1638344, 1640880, 1643082, 1646419, 1651043, 1656098, 1661080, 1666376, 1672206, 1677585, 1681059, 1682326, 1682499, 1682875, 1684116, 1686552, 1690361, 1695154, 1700137, 1705031, 1710217, 1715710, 1720724, 1724684, 1727799, 1730274, 1731981, 1733692, 1737382, 1743891, 1750972, 1755375, 1756628, 1757172, 1758818, 1760898, 1762376, 1763834, 1766228, 1769008, 1770957, 1772052, 1773114, 1774186, 1774688, 1774896, 1775774, 1777257, 1778099, 1777866, 1777860, 1779290, 1781410, 1782374, 1781587, 1780449, 1780846, 1783396, 1787043, 1790028, 1791306, 1791297, 1791215, 1791665, 1792216, 1792397, 1792531, 1793221, 1794581, 1796577, 1799670, 1804305, 1809904, 1815189, 1819619, 1823789, 1828192, 1832286, 1835303, 1837557, 1840430, 1845065, 1851300, 1857903]
52128A857903N939N550O442Q064Q855Q221P236P111P768Q591R605J0877J1574
52115A963736J1076J0380J0824J1818J1736J0825J0960J2196J2171J0007Q293
52104B084022R305J1357J1370R536Q637R416R742Q422O987O867P226O799N961
52091B195647N528N026L725K306J991K657L199L273L370L464K982K124K001L025
52077B240318M042L617J843K98L53J875L711N198O613Q075Q735P838O146N273
52063B303935N591N940N536N010N011N108M880N096O625Q805J0050R692Q349O758
52049B396386N232L968L035K195J454J385K160K756K184J031N49N51l83k543m417
52034B415543m721l813k654j543n51k32j055k717m476n704n910n120m437n155
$$ y = [1857903, 1863842, 1869392, 1875834, 1883898, 1892753, 1900974, 1908210, 1915321, 1923089, 1931680, 1941285, 1952162, 1963736, 1974812, 1985192, 1996016, 2007834, 2019570, 2030395, 2041355, 2053551, 2065722, 2075729, 2084022, 2093327, 2104684, 2116054, 2125590, 2134227, 2143643, 2153385, 2161807, 2168794, 2175661, 2182887, 2189686, 2195647, 2201175, 2206201, 2209926, 2212232, 2214223, 2216880, 2220079, 2223352, 2226722, 2230186, 2233168, 2235292, 2237293, 2240318, 2244360, 2247977, 2249820, 2250118, 2250471, 2252346, 2256057, 2261255, 2267868, 2275943, 2284678, 2292516, 2298662, 2303935, 2309526, 2315466, 2321002, 2326012, 2331023, 2336131, 2341011, 2346107, 2352732, 2361537, 2371587, 2381279, 2389628, 2396386, 2401618, 2405586, 2408621, 2410816, 2412270, 2413655, 2415815, 2418571, 2420755, 2421786, 2422335, 2422886, 2422503, 2419960, 2415543, 2410822, 2407009, 2404355, 2402812, 2402261, 2402029, 2400974, 2398257, 2393781, 2388077, 2382167, 2377047, 2372610, 2367455]
52020B367455o837p422n946m035l750n039o502p626q721r379q854p846q021r481
52006B267996j0301r178p246o414o974p792q118q172q321q659r211r958j0691
51993B156961j1307j2107j3240j4103j3851j2540j1235j0886j1444j2129j2161
51982B021958j1260r828q854r169j0560j1797j1888j1048j0241r918r697r197
51970A898501q774r079j0121j1114j1261j0467r273q224p535p186p115p219p301
51957A783832p157o762o262n729n005l993l154l388m937o551o413m225j930j679
51943A716647l358m854m759l997m385o240q137q704p935o846o383o816p670q149
51929A628414p950p724q292r367r730q931q136q692j0233j1102j0535r529r262
$$ y = [2367455, 2360618, 2353196, 2347250, 2343215, 2339465, 2334426, 2327924, 2320298, 2311577, 2302198, 2293344, 2285498, 2277477, 2267996, 2257695, 2248517, 2241271, 2234857, 2227883, 2220091, 2211973, 2203801, 2195480, 2186821, 2177610, 2167652, 2156961, 2145654, 2133547, 2120307, 2106204, 2092353, 2079813, 2068578, 2057692, 2046248, 2034119, 2021958, 2010698, 2000870, 1992016, 1982847, 1972287, 1960490, 1948602, 1937554, 1927313, 1917395, 1907698, 1898501, 1889727, 1880648, 1870527, 1859413, 1848152, 1837685, 1828412, 1820188, 1812653, 1805467, 1798352, 1791133, 1783832, 1776675, 1769913, 1763651, 1757922, 1752917, 1748924, 1745770, 1742382, 1737445, 1730894, 1724481, 1720256, 1718326, 1716647, 1713289, 1708435, 1703676, 1699679, 1695294, 1689054, 1680917, 1672213, 1664278, 1657432, 1651049, 1644233, 1636563, 1628414, 1620464, 1612740, 1604448, 1595081, 1585351, 1576420, 1568284, 1559592, 1549359, 1538257, 1527722, 1518193, 1508931]
51916A508931r460r017p797o964p407q560r228r030q525q093p577p076p215q085
51902A394897q621p941o869p007q417r474r292q897r202r195p466m681k881k717
51888A292237l011l035l372m226m675m417m725o338p739p060m865l414l616m397
51874A227347m889n453o272o540n771m650l820k915j645q31j283k366k929l167
51860A174816m175n756o267n035l615l769n072n671m924l969l764l851l581l388
51846A111979l959m798m794m032l847m919o282o635n835m604l504k873l090m010
51832A048797m565l911k740k527l561m633m758m230l704l190k501j930j833k001
51818A002713k076k300l152m426n182m723l299j891j359j775k416k700k981m026
$$ y = [1508931, 1499471, 1490454, 1482657, 1475693, 1468286, 1459726, 1450498, 1441468, 1432943, 1424850, 1417273, 1410197, 1402982, 1394897, 1386276, 1378335, 1371466, 1364459, 1356042, 1346568, 1337276, 1328379, 1319177, 1309982, 1302516, 1297835, 1294954, 1292237, 1289226, 1286191, 1282819, 1278593, 1273918, 1269501, 1264776, 1258438, 1250699, 1243639, 1238774, 1235360, 1231744, 1227347, 1222458, 1217005, 1210733, 1204193, 1198422, 1193772, 1189952, 1187037, 1185392, 1184561, 1183278, 1180912, 1177983, 1174816, 1170641, 1164885, 1158618, 1153583, 1149968, 1146199, 1141127, 1135456, 1130532, 1126563, 1122799, 1118948, 1115367, 1111979, 1108020, 1103222, 1098428, 1094396, 1090549, 1085630, 1079348, 1072713, 1066878, 1062274, 1058770, 1055897, 1052807, 1048797, 1044232, 1040321, 1037581, 1035054, 1031493, 1026860, 1022102, 1017872, 1014168, 1010978, 1008477, 1006547, 1004714, 1002713, 1000637, 998337, 995185, 990759, 985577, 980854, 977555, 975664, 974305, 972530, 970114, 967414, 964433, 960407]
51804I60407n573o149m875k887k180l243m564m576l281j802r05m88k04J0N5N1
51788I19796K99Q39J157N53j081l039m472n054m785l466j073J410K279Q99j252
51773I03010k036j058J9l23j616k263j683q45q07j428j853j696j360j400j899
51758H82762k354k108j100j91l66j466k186j558n3J147J399P22p24k499l615l393
51742H64417k457k089k575k968k493j411l49L88P12O00L46L01K44l22j132j339
51726H49873q81p28j323j788j274k67L36O59J410K466K912K312J163K45J1L93
51710H55519O72p6j838l234k909j046R11J704Q75j329l815m872l721j624n70q69
51694H33778j147n65P7k54j343k089j780n10J077K134K071R48o88k290l358l264
$$ y = [960407, 954834, 948685, 943810, 940923, 938743, 935500, 930936, 926360, 923079, 921277, 920372, 919884, 919680, 919690, 919745, 919796, 920095, 920934, 922091, 922644, 921563, 918524, 914052, 908998, 904213, 900747, 899674, 901084, 903363, 904262, 903010, 900974, 899916, 899935, 899612, 897996, 895733, 894050, 893205, 892398, 890970, 889117, 887421, 886061, 884661, 882762, 880408, 878300, 877200, 877009, 876643, 875177, 872991, 871433, 871380, 872527, 873926, 874648, 873924, 871425, 867810, 864417, 861960, 859871, 857296, 854328, 851835, 850424, 850075, 850463, 851175, 851775, 852121, 852422, 852666, 852344, 851212, 849873, 848992, 848264, 846941, 845153, 843879, 843612, 843948, 844607, 846017, 848483, 851395, 853707, 854870, 855115, 855126, 855519, 856191, 856115, 854277, 851043, 848134, 847088, 847999, 849703, 850578, 849249, 845434, 840562, 836841, 835217, 834647, 833778, 832631, 832066, 832143, 831889, 830546, 828457, 826677, 826167, 827244, 829378, 831449, 832397, 831709, 829419, 826061, 822797]
51678H22797j724N80K401L024K538J289k25j078n22J011K200K349J870J202J58
51663H37870j269k210j659M16K977M643M480K657M66p53q50o35n34k59K71N99
51647H46210N81O39R03Q21R8p54j167j127p73j77J32o64k381l599l406k601k393
51630H30342k678k560j956j638j927k286k205j815j741k578m263n688n497l692
$$ y = [822797, 821073, 821653, 824054, 827078, 829616, 830905, 830680, 829602, 829080, 830091, 832291, 834640, 836510, 837712, 837870, 836601, 834391, 832732, 833148, 836125, 840768, 845248, 847905, 848371, 847618, 846768, 846133, 845599, 845340, 845611, 846210, 846791, 847430, 848333, 849154, 849252, 848498, 847331, 846204, 845431, 845254, 845386, 844722, 842341, 838742, 835336, 832735, 830342, 827664, 825104, 823148, 821510, 819583, 817297, 815092, 813277, 811536, 808958, 804695, 799007, 793510, 789818]
$$ [...]
##END NTUPLES=NMR SPECTRUM
##END=
