
##TITLE=AC1397_PANAS12209_7519683_e0SbUa46xL
##JCAMPDX= 6.0         $$ Bruker NMR JCAMP-DX V2.0
##DATA TYPE= NMR SPECTRUM
##DATA CLASS= NTUPLES
##ORIGIN= BRUKER
##OWNER= Administrator
$$ 1.72 TOPSPIN		Version 2.1
$$ 2013-02-19 23:29:47.862 -0500  Administrator@X
$$ Compression mode = diff/dup
##.OBSERVE FREQUENCY= 400.02188249412
##.OBSERVE NUCLEUS= ^1H
##.ACQUISITION MODE= SIMULTANEOUS (DQD)
##.ACQUISITION SCHEME= undefined
##.AVERAGES= 8
##.DIGITISER RES= 22
##SPECTROMETER/DATA SYSTEM= spect
##.PULSE SEQUENCE= zg30
##.SOLVENT NAME= COFFEE_meoh
##.SHIFT REFERENCE= INTERNAL, COFFEE_meoh, 1, 14.98509
##AUDIT TRAIL= $$ (NUMBER, WHEN, WHO, WHERE, PROCESS, VERSION, WHAT)
$$ ##TITLE= Audit trail, TOPSPIN		Version 2.1
$$ ##JCAMPDX= 5.01
$$ ##ORIGIN= Bruker BioSpin GmbH
$$ ##OWNER= Administrator
$$ $$ E:\/data/COFFEE/nmr/AC1397_PANAS12209_7519683_e0SbUa46xL/10/pdata/1/auditp.txt
$$ ##AUDIT TRAIL=  $$ (NUMBER, WHEN, WHO, WHERE, PROCESS, VERSION, WHAT)
(   1,<2013-02-19 23:29:39.565 -0500>,<Administrator>,<X>,<go>,<TOPSPIN 2.1>,
      <created by zg
	started at 2013-02-19 23:28:33.682 -0500,
	POWCHK enabled, PULCHK disabled,
       configuration hash MD5:
       86 BA 57 50 F2 9D 5C 9B 26 00 A9 28 5F 66 2E 89
       data hash MD5: 64K
       39 E3 2D 32 7C E5 08 14 C5 B2 18 AA 81 57 EE F5>)
(   2,<2013-02-19 23:29:42.706 -0500>,<Administrator>,<X>,<proc1d>,<TOPSPIN 2.1>,
      <Start of raw data processing
       efp LB = 0 FT_mod = 6 PKNL = 1 PHC0 = 0 PHC1 = 0 SI = 32K 
       data hash MD5: 32K
       97 2E C2 35 48 39 BD C1 8B 8F 12 92 A5 AC BB 3A>)
(   3,<2013-02-19 23:29:43.190 -0500>,<Administrator>,<X>,<proc1d>,<TOPSPIN 2.1>,
      <pk PHC0 = 73.00415 PHC1 = 0 
       data hash MD5: 32K
       20 2D 55 E9 4A A2 08 80 D1 5F C6 FB EA 9D 8E 58>)
(   4,<2013-02-19 23:29:43.424 -0500>,<Administrator>,<X>,<proc1d>,<TOPSPIN 2.1>,
      <abs ABSG = 1 
       data hash MD5: 32K
       D9 DA E2 95 7A 0E EF 08 E3 97 DA 4C EC DC 63 C9>)
(   5,<2013-02-19 23:29:43.565 -0500>,<Administrator>,<X>,<proc1d>,<TOPSPIN 2.1>,
      <abs ABSG = 2 
       data hash MD5: 32K
       3B 67 01 4C E1 B9 AB EA F0 F5 AD B0 8A 88 B1 F8>)
(   6,<2013-02-19 23:29:43.706 -0500>,<Administrator>,<X>,<proc1d>,<TOPSPIN 2.1>,
      <abs ABSG = 3 
       data hash MD5: 32K
       21 8E 14 C4 F6 64 14 CC C7 84 38 8E FD 5B 1E FB>)
(   7,<2013-02-19 23:29:43.846 -0500>,<Administrator>,<X>,<proc1d>,<TOPSPIN 2.1>,
      <abs ABSG = 4 
       data hash MD5: 32K
       1C F4 E2 64 7C D9 D6 0E D8 2B A0 5A EC 8C 31 C7>)
(   8,<2013-02-19 23:29:44.003 -0500>,<Administrator>,<X>,<proc1d>,<TOPSPIN 2.1>,
      <abs ABSG = 5 
       data hash MD5: 32K
       B8 3E 96 D6 17 41 86 44 02 E7 84 A9 BB B1 83 F8>)
$$ ##END=
$$ 
$$ $$ hash MD5
$$ $$ D7 49 64 B7 00 C9 4D CB 2E 2F A8 2E 06 4B 5D 3A
##$RELAX= 
##$RELAX= 
##$RELAX= 
##$RELAX= 
##$RELAX= 
##$RELAX= 
##$RELAX= 
$$ Bruker specific parameters
$$ --------------------------
##$DU= <E:\>
##$EXPNO= 10
##$NAME= <AC1397_PANAS12209_7519683_e0SbUa46xL>
$$ [...]
150 150 150 150 150 150 150 150
##$TP07= 0
##$TPNAME0= <>
##$TPNAME1= <>
##$TPNAME2= <>
##$TPNAME3= <>
##$TPNAME4= <>
##$TPNAME5= <>
##$TPNAME6= <>
##$TPNAME7= <>
##$TPOAL= (0..7)
0.5 0.5 0.5 0.5 0.5 0.5 0.5 0.5
##$TPOFFS= (0..7)
0 0 0 0 0 0 0 0
##$TUNHIN= 0
##$TUNHOUT= 0
##$TUNXOUT= 0
##$USERA1= <user>
##$USERA2= <user>
##$USERA3= <user>
##$USERA4= <user>
##$USERA5= <user>
##$V9= 5
##$VALIST= <valist>
##$VCLIST= <CCCCCCCCCCCCCCC>
##$VD= 0
##$VDLIST= <DDDDDDDDDDDDDDD>
##$VPLIST= <PPPPPPPPPPPPPPP>
##$VTLIST= <TTTTTTTTTTTTTTT>
##$WBST= 1024
##$WBSW= 4
##$XGAIN= (0..3)
0 0 0 0
##$XL= 0
##$YL= 0
##$YMAX_a= 561419
##$YMIN_a= -548865
##$ZGOPTNS= <>
##$ZL1= 120
##$ZL2= 120
##$ZL3= 120
##$ZL4= 120
##$ABSF1= 14.98509
##$ABSF2= -5.573092
##$ABSG= 5
##$ABSL= 3
##$ALPHA= 0
##$AQORDER= 0
##$ASSFAC= 0
##$ASSFACI= 0
##$ASSFACX= 0
##$ASSWID= 0
##$AUNMP= <proc_prof1d_extract_pilot.lims>
##$AXLEFT= 0
##$AXNAME= <>
##$AXNUC= <1H>
##$AXRIGHT= 0
##$AXTYPE= 0
##$AXUNIT= <>
##$AZFE= 0.1
##$AZFW= 0.1
##$BCFW= 0
##$BC_mod= 0
##$BYTORDP= 0
##$COROFFS= 0
##$CY= 15
##$DATMOD= 1
##$DC= 0
##$DFILT= <>
##$DTYPP= 0
##$F1P= 0
##$F2P= 0
##$FCOR= 0.5
##$FTSIZE= 32768
##$FT_mod= 6
##$GAMMA= 0
##$GB= 0
##$INTBC= 1
##$INTSCL= 1
##$ISEN= 128
##$LB= 0
##$LEV0= 0
##$LPBIN= 0
##$MAXI= 10000
##$MC2= 0
##$MEAN= 0
##$ME_mod= 0
##$MI= 0
##$NCOEF= 0
##$NC_proc= -8
##$NLEV= 6
##$NOISF1= 0
##$NOISF2= 0
##$NSP= 0
##$NTH_PI= 0
##$NZP= 0
##$OFFSET= 14.98509
##$PC= 1
##$PHC0= 73.00415
##$PHC1= 0
##$PH_mod= 1
##$PKNL= yes
##$PPARMOD= 0
##$PPDIAG= 0
##$PPIPTYP= 0
##$PPMPNUM= 2147483647
##$PPRESOL= 1
##$PSCAL= 4
##$PSIGN= 0
##$PYNMP= <proc.py>
##$REVERSE= no
##$SF= 400.02
##$SI= 32768
##$SIGF1= 0
##$SIGF2= 0
##$SINO= 400
##$SIOLD= 32768
##$SPECTYP= <>
##$SREGLST= <1H.CDCl3>
##$SSB= 0
##$STSI= 32768
##$STSR= 0
##$SW_p= 8223.68421052631
##$SYMM= 0
##$S_DEV= 0
##$TDeff= 65536
##$TDoff= 0
##$TI= <>
##$TILT= no
##$TM1= 0
##$TM2= 0
##$TOPLEV= 0
##$USERP1= <user>
##$USERP2= <user>
##$USERP3= <user>
##$USERP4= <user>
##$USERP5= <user>
##$WDW= 1
##$XDIM= 32768
##$YMAX_p= 456516133
##$YMIN_p= -842486
##$CURPLOT= <Network HP LaserJet P1505>
##$CURPRIN= <$Network HP LaserJet P1505>
##$DFORMAT= <normdp>
##$LAYOUT= <+/1D_H.xwp>
##$LFORMAT= <normlp>
##$PFORMAT= <normpl>
##$SURQMSG= 1
$$ End of Bruker specific parameters
$$ ---------------------------------
##NTUPLES= NMR SPECTRUM
##VAR_NAME=  FREQUENCY,     SPECTRUM/REAL,   SPECTRUM/IMAG
##SYMBOL=    X,             R,               I
##VAR_TYPE=  INDEPENDENT,   DEPENDENT,       DEPENDENT
##VAR_FORM=  AFFN,          ASDF,            ASDF
##VAR_DIM=   32768,         32768,           32768
##UNITS=     HZ,            ARBITRARY UNITS, ARBITRARY UNITS
##FACTOR=    0.250966925370066, 1,           1
##FIRST=     8223.43324360094, -27265,       -78681
##LAST=      0,             -22468,          -189097
##MIN=       0,             -842486,         0
##MAX=       8223.43324360094, 456516133,    0
$$ Real data points
##PAGE= N=1
##DATA TABLE= (X++(R..R)), XYDATA
$$ [...]
19559b7572B66887a46356j40055B22144a22681B8448P3102k2360J99888E9675
19548a82137e3434k5068j19712b5589E1248A7344b58057R3613g2129k77992D07244
19536C7437a51274A61471l04J32656b087F0009i5583b6440q1542c4241j25372
19525a59613c713k52528a26907m5282I2819j3686a37737q1829j30247O984d8790
19513C5402a32362d1904A41653i4473B41823A19847J14037b2208B6465a89851
19502B50611j14784b71724Q8912A88475D3942J15455B9320a39271a5873A73183
19491H4879J043i7233B4706a97652B72214D9754a71396B84325j28445b96988h7227
19479b19006l401b4224H3501c17259Q2917D04585a28282f0359a4160o373k02398
$$ plain form
19559 -27572 266887 -146356 -286411 222144 -122681 28448 101550 79190 279078 59675
19548 -182137 -53434 -78502 -198214 -25589 51248 17344 -258057 -164444 -72129 -350121 407244
19536 37437 -151274 161471 161167 293823 -2087 60009 -95583 -26440 -107982 -34241 -159613
19525 -159613 -3713 -256241 -126907 -172189 92819 79133 -137737 -219566 -349813 -342829 -48790
19513 35402 -132362 -41904 141653 -94473 241823 119847 233884 -22208 26465 -189851
19502 250611 135827 -271724 -182812 188475 43942 159397 29320 -139271 -15873 173183
19491 84879 85922 -97233 24706 -197652 272214 49754 -171396 284325 155880 -296988 -87227
19479 -219006 -222407 -24224 83501 -317259 -234342 404585 -128282 -60359 -14160 -20533 -222931
19468b22931C07009j34013c27455E2133a26108n2645a9897I1113j5938a96364
19457a8372B33809A08321c8730k21902h784k34981c4601B42982b60202A31954
19446a23450J0149o1789b6341b178H7607a25448a5094A44886b30311N3867D7558
19434b85512K9797d0958j44206O8151j14832J04649j68255M0093M7350A730R519
19423A1249a21812q5089f3862I2823m2559e25090f1487k3744o5471M7001D14900
19411c6118n4448B01334a08575G3220a94642B05069a73749p743A51377b66709
19400d03792a51097O6285G51c27143F2417b53558C9428a8181A07288a34448j17608
19389b52056G8851l8041Q0147a87523F9660g169H9225b4769g542j41632I962M0239
$$ plain form
19468 -222931 307009 172996 -327455 52133 -126108 -178753 -19897 91113 75175 -196364
19457 -18372 233809 108321 -38730 -260632 -8784 -243765 -34601 242982 -260202 131954
19446 -123450 -113301 -175090 -26341 -2178 87607 -125448 -15094 144886 -230311 -176444 47558
19434 -285512 -255715 -40958 -185164 -117013 -231845 -127196 -295451 -255358 -208008 1730 11249
19423 11249 -121812 -206901 -63862 92823 50264 -525090 -61487 -85231 -150702 -103701 414900
19411 -36118 -90566 201334 -108575 73220 -194642 205069 -173749 -181492 151377 -266709
19400 -403792 -151097 -84812 751 -327143 62417 -253558 39428 -18181 107288 -134448 -252056
19389 -252056 78851 40810 120957 -187523 69660 -7169 89225 -24769 -7542 -149174 9962 50201
19377E0201h4061B1610c45132e0093p0774B01863m0896a1364k73385J18944P0466
19366i5339q4895Q9741E98893d74412a50316A122b14881a6130p1578A45891b5437
19354b69762B03881b59299A281f4236R477D2804K70423a82651C79312j41316a72090
19342a02823j8877j26600a06929q4135j76A31787b2785n7935k89768A22032m7485
19331G4547k9588P3180a12799j91949A37758a1561j88957D1368c15323h278p5073
19320h3351q4102q7207M9276k9977P9646B09254a22581B93951a25927G2048a25276
19308E16889a29594L2454E3771i7698E0879M9789c53634a08022A77886c2490D1496
19296E75c0630k37783A48123a53660d4580l18184d5669J944B05897c6253A80240
$$ plain form
19377 50201 -84061 21610 -345132 -50093 -120867 201863 160967 -11364 -284749 -165805 -95339
19366 -95339 -180234 -90493 598893 -474412 -150316 1122 -214881 -16130 -87708 145891 -25437
19354 -269762 203881 -259299 1281 -64236 -54759 42804 313227 -182651 379312 237996 -172090
19342 -102823 -121700 -248300 -106929 -191064 -191240 131787 -22785 -80720 -370488 122032 74547
19331 74547 44959 118139 -112799 -304748 137758 -11561 -200518 41368 -315323 -8278 -83351
19320 -83351 -167453 -254660 -205384 -235361 -155715 209254 -122581 293951 -125927 72048 -125276
19308 516889 -129594 -97140 53771 -97698 50879 100668 -353634 -108022 177886 -32490 41496
19296 575 -30630 -268413 148123 -153660 -44580 -362764 -45669 -43725 205897 -36253 180240
19284E4203f1490H7099k9096b16478D3916J20580E2539a3229K543j68284A84347
19272a95014O9460k18202P8478c7897E8709N4980J01745L0639R202h6831l46802
19261d33633c4745n310e089l10390B1613c00832b7199j61131e7706o1096l0383
19250a49185A49544g0338p5279A01092A7374J41667a58545i891j70855K6533A20596
19238b343I6770c9301j35296n8975q9164J15541j3259J7412d2008D0251L414K58029
19226C01694a17263E3962i2423o868k55686a32980M6288A06107K13134a61620
19215A74469a0124l17235D7031f4690A8555J48156O6843a0403k0386A86076a7396
19203a68863j49515J38697A06357b52011C77249D1521c3102k25849L7472P174
$$ plain form
19284 54203 -61490 87099 58003 -216478 43916 164496 52539 -13229 -10686 -178970 184347
19272 -195014 -125554 -343756 -265278 -37897 58709 113689 215434 246073 255275 -86831 -433633
19261 -433633 -34745 -40055 -5089 -315479 21613 -300832 -27199 -188330 -57706 -118802 -149185
19250 -149185 149544 -70338 -145617 101092 17374 159041 -158545 -9891 -180746 -154213 120596
19238 -2343 96770 -39301 -174597 -233572 -322736 -207195 -220454 -203042 -42008 40251 43665 301694
19226 301694 -117263 53962 -92423 -99291 -354977 -132980 -86692 106107 319241 -161620
19215 174469 -10124 -327359 47031 -64690 18555 166711 233554 -10403 -30789 186076 -17396
19203 -168863 -318378 -179681 106357 -252011 377249 41521 -33102 -258951 -221479 -214305
19193b14305D0049d2819I0436k8981b43277g2971a5980k93334a03545j04573e0570
19181G9722C5637d00730R9185R3591c2062E9755A9580i710A01848e9289A54009
19169b24375O0650o2017A08192i1620A266L7265d5164A43526a36925B8627b41290
19157A52147K6486d22484F1069a07772n2370B14590d06650a32346f2288k49497
19147c11785A22940a63480j2079l8297E37070a10622r2963N5148a6585m48764
19137d65349b05855K4865m6715J00889n8444P6559q1992d4764q3611L0295C06504
19125A99360b82236f608k39705J19018A76097a96834l6128a08608A06205i6704
19114a19664B64373l0102H0916J02318b11703j73350j5621A43094B4080d6135
$$ plain form
19193 -214305 40049 -42819 90436 61455 -243277 -72971 -15980 -309314 -103545 -208118 -50570
19181 79722 35637 -400730 -301545 -207954 -32062 59755 19580 -9710 101848 -59289 154009
19169 -224375 -163725 -225742 108192 -91620 1266 38531 -45164 143526 -136925 28627 -241290
19157 152147 178633 -422484 61069 -107772 -160142 214590 -406650 -132346 -62288 -311785
19147 -311785 122940 -163480 -175559 -213856 537070 -110622 -203585 -148437 -16585 -465349
19137 -465349 -205855 -180990 -227705 -126816 -185260 -108701 -190693 -44764 -128375 -98080 306504
19125 199360 -282236 -6608 -246313 -127295 176097 -196834 -232962 -108608 106205 -96704
19114 -119664 264373 234271 80916 183234 -211703 -385053 -400674 143094 24080 -46135
19103a08901Q886d0061B27462c8167J4415H3170a88538R1850a2192k70275b8641
19091E9975i4387C16771a86082q6160a22418C7546c23512a4226B8997a06806n7516
19080a64322D69241A18123b7603A35536b94198A73907e41836e5846r2191E1022
19069e1960j7085I9777l8063J57110b4758j88954K9938P1914I7774a6371j4629
19058c1000j28172J2294e4281C37069I3460a73913P4709J5229o8114a0430p0659
19047h1089k79335A790b86187F0063J9130h1876D3089c33372k5466C67057C4684
19035e2571j65712A10128j8134k6957K59955j61808l9504k4694c6696H0725J35773
19024B16498j7309b54476G5851J56172q6821a0694k99610J47016B16870b01819
$$ plain form
19103 -108901 -100015 -40061 227462 -38167 -23752 83170 -188538 -96688 -12192 -282467 -28641
19091 59975 -94387 316771 -186082 -272242 -122418 37546 -323512 -14226 28997 -106806 -164322
19080 -164322 469241 118123 -27603 135536 -294198 173907 -541836 -55846 -148037 51022
19069 -51960 -69045 99777 61714 218824 -24758 -213712 -183774 -111860 97774 -16371 -31000
19058 -31000 -159172 -146878 -54281 337069 93460 -173913 -99204 -83975 -152089 -10430 -81089
19047 -81089 -360424 1790 -286187 60063 79193 -81876 43089 -333372 -358838 367057 34684
19035 -52571 -218283 110128 91994 65037 324992 163184 123680 98986 -36696 80725 216498
19024 216498 199189 -254476 75851 232023 145202 -10694 -310304 -163288 216870 -201819
19013b50198J15951A36758L4427a32986m7361K9830A7891L3180a69187K8923B00602
19001B90941a43454N7629G8198a56070f3621o2916j30068j65171a513B86016b2873
18989I4538L36520D6365L1739l2261j5907L46833C5286d0396q6356l27599a56691
18977F6612N4155a67434k7597q7592A06820e906l1199C4622J00619a85804A01553
18965d2283j56498O3422q769m12054b29164A80752c13671I6101a6535k50949A85266
18953A76865g375A2579K40293a02973B19375F3136b35359o1632H7982b93866N2528
18942b41338B9136d3034k84650H0809m479J71605g0121B41397I492g7188K202
18931g4986g752j69507e6259A5518b51046H7240d0279p3107r29n186F5048e89
$$ plain form
19013 -250198 -134247 136758 171185 -132986 -180347 -150517 17891 51071 -169187 -140264 200602
19001 290941 -143454 -85825 78198 -156070 -63621 -126537 -256605 -421776 -1513 286016 -22873
18989 94538 431058 46365 78104 45843 29936 376769 35286 -40396 -126752 -454351 -156691
18977 66612 120767 -167434 -195031 -282623 106820 -5906 -37105 34622 135241 -185804 101553
18965 -42283 -198781 -135359 -144128 -556182 -229164 180752 -313671 96101 -16535 -267484 185266
18953 176865 -7375 12579 252872 -102973 219375 63136 -235359 -296991 87982 -293866 -241338
18942 -241338 29136 -43034 -327684 80809 76330 247935 -70121 241397 9492 -77188 -74986
18931 -74986 -7752 -177259 -56259 15518 -251046 87240 -40279 -113386 -114315 -119501 65048 -589
18918A69391C9752c47448J24788i5556h081l69649a82392O308A88763a65478G3317
18906B14803a98011D62230A4811m326M4679G746J41219h0343m7188e486A37074
18894A93782c50600h6477I783a15827A10973D4187d29791a14777G5096g4565c4263
18882A34861c5113A17881H867a12845k6560A59058a93490B42561H1553b79674
18871b2532B5761J64686h7733E6206f2330n6974l140C5403L09K6582g1068j59195
18859b30263e2492j3534A01758b31630a12248n2690M895O6367B81211H7505J60336
18848B47841A04003i6288j1806j3481e8000A06287a1340j56992A13405f6814f183
18836a84359A33992a60456B87939c86963D5318a96299C032R3733j2921a84161
$$ plain form
18918 169391 39752 -347448 -222660 -95556 -8081 -377730 -182392 -176084 188763 -165478 73317
18906 214803 -198011 462230 14811 10485 55164 7746 148965 -80343 -127531 -5486 137074
18894 193782 -350600 -86477 9783 -115827 110973 44187 -429791 -114777 75096 -74565 -34263
18882 134861 -35113 117881 8867 -112845 -139405 159058 -193490 242561 81553 -279674
18871 -22532 25761 190447 -87733 56206 -62330 -119304 -122444 35403 35712 62294 -71068 -230263
18859 -230263 -52492 -66026 101758 -231630 -112248 -164938 -160043 -93676 281211 87505 247841
18848 247841 104003 -96288 -108094 -121575 -58000 106287 -11340 -168332 113405 -66814 -6183
18836 -184359 133992 -160456 287939 -386963 45318 -196299 3032 96765 83844 -184161
18825c8260n6543j76296C0335O6278o89J29113A0857d7823l01588C63994i0971
18813d869I4796K33903r1349a31049E721h5552A56883F4752K8782a20873J4849
18802a06024A84401i9973o9682a8505m60180J69235A04680M4822p4325a60556
18791a14543K9260F0230J73319b56603H2001a18051j53425a27177D1850b53867
18780a55264j90491a68096A0852a0095p788j01366p7783A41328d9964A13987c27956
18768a34262k3081j2179M2233L9417A22752f5435J6699l40923a07676J1682C381
18756a91211B82555r7033b0267A68828g2503A43734c77195a18069k79891A78700
18745F6143i1396r0882b8235A32667j3593Q4282b64542e2682j00544L0442j48783
$$ plain form
18825 -38260 -94803 -271099 30335 96613 95924 225037 10857 -47823 -349411 363994 -90971
18813 -4869 94796 328699 237350 -131049 5721 -85552 156883 64752 93534 -120873 -106024
18802 -106024 184401 -99973 -169655 -18505 -478685 -309450 104680 149502 75177 -160556
18791 -114543 -85283 60230 233549 -256603 82001 -118051 -271476 -127177 41850 -253867
18780 -155264 -345755 -168096 10852 -10095 -17883 -119249 -197032 141328 -49964 113987 -327956
18768 -134262 -157343 -169522 -127289 -87872 122752 -65435 -48736 -389659 -107676 -95994 3381
18756 -191211 282555 185522 -20267 168828 -72503 143734 -377195 -118069 -397960 178700
18745 66143 -91396 -182278 -28235 132667 119074 203356 -264542 -52682 -153226 -122784 -271567
18734b71567J24202A90744j7499F6294J59126n6926o60a43673k36476E1191J99918
18723B51109E969J41540L9589N5536b22519c9137C7937K55737e6417G5830J39712
18712B15542m2867a11066A86647J41352C4793L04013G9530J6787c37394A62250
18701F5903J04082q0359a37879G2871b47513i9830j4035j32763J05146A35772
18690B7475a41966d8910l0606r7738C9595h819n0489p48B017E99J12881O8970
18678A82450d0009k80925a25313L8162r228d4068k08976F4934a6986j51257A81356
18666a61228j53940c3339n7828j86726D328K30001D468a30934B80278B0727J52788
18655A73515a42448O3544a5002B29460G9156Q8995b85187c5735j64735n2781J5350
$$ plain form
18734 -271567 -147365 190744 173245 66294 225420 168494 167834 -143673 -380149 51191 251109
18723 251109 5969 147509 187098 242634 -222519 -39137 37937 293674 -56417 75830 215542
18712 215542 172675 -111066 186647 327999 34793 338806 79530 96317 -337394 162250
18701 65903 169985 89626 -137879 72871 -247513 -99830 -113865 -246628 -141482 135772
18690 27475 -141966 -48910 -79516 -177254 39595 -8819 -59308 -60056 2017 599 113480 182450
18678 182450 -40009 -320934 -125313 -87151 -96379 -44068 -253044 64934 -16986 -168243 181356
18666 -161228 -315168 -33339 -91167 -277893 4328 234329 4468 -130934 280278 20727 173515
18655 173515 -142448 -78904 -15002 229460 79156 168151 -285187 -35735 -200470 -253251 -237901
18644b37901A49186k0904o2300g6697A48118F7017J25517E9042A6444D354d6382
18632h4509k5741p6865a7604l38102a09621j65542a00000p1902j04856B77365
18621A78154e9814B1240o964a46172B468f7409f023j08052n6301M1041D3230a16701
18608B54927g9604k05395g8273B12500a61418j3933F6720a21793K1508j53962
18598b54247h8694a7911A34927b65300n0566J37512a6244j22930o2548A56706
18587a69242E2374a00896A18561m4806N2602D4167a62610n8256L4204A59913g8249
18575f9056m3042E9127B0610M7157b75935O9531C17378A50734c8697q2723C4038
18563b27869J08323J8879C03649D7915h9392K3311m1209L1672j33686j92807i192
$$ plain form
18644 -237901 149186 128282 65982 -76697 148118 67017 192534 59042 16444 4354 -46382
18632 -84509 -110250 -187115 -17604 -355706 -109621 -275163 -100000 -171902 -276758 277365
18621 178154 -59814 21240 14276 -146172 2468 -67409 -6023 -114075 -170376 -129335 43230 -116701
18608 254927 -79604 -284999 -78273 212500 -161418 -175351 66720 -121793 -100285 -254247
18598 -254247 -88694 -17911 134927 -265300 -315866 -178354 -16244 -139174 -201722 156706
18587 -169242 52374 -100896 118561 73755 126357 44167 -162610 -220866 -186662 159913 -78249
18575 -69056 -112098 59127 20610 67767 -275935 -206404 317378 150734 -38697 -121420 34038
18563 -227869 -119546 -100667 303649 47915 -89392 -66081 -107290 -75618 -209304 -402111 -9192
18551a14294D7552A5043R5555J3099a85626A52713B3673K57945a13684B646M3149
18540D5795J10667J15512h9656j87839J23094B29653a23042j216c2151k97383
18530c29534A30486b51550A12252b0714A54208d0306o0407H0639h2874F0920d7092
18518a30089D372e8620k82950I1326B8526c72370J47762F4565I759b05571N0903
18507a54668O3971l53827B33571E261g5029D2952J56919M7854e43505H9053c28647
18495B7224P9510b01217j61166f2747j1456K6055A0911O0287d03431J76023O0273
18484a67135j15855J07970B09012J07108A37401J07099A8626L5965h4901A45878
18473b61435C0065c86221D4169a38306A41129D4010e0463A25801c2228B459K3938
$$ plain form
18551 -114294 47552 15043 110598 123697 -185626 152713 23673 281618 -113684 2646 45795
18540 45795 156462 271974 -89656 -277495 -154401 229653 -123042 -124258 -32151 -329534
18530 -329534 130486 -251550 112252 -20714 154208 -40306 -100713 80639 -82874 60920 -47092
18518 -130089 4372 -58620 -341570 91326 28526 -372370 -224608 64565 9759 -205571 -154668
18507 -154668 -90697 -444524 233571 5261 -75029 42952 199871 247725 -543505 89053 -328647
18495 27224 106734 -201217 -362383 -62747 -74203 -48148 10911 71198 -403431 -227408 -167135
18484 -167135 -282990 -175020 209012 316120 137401 244500 18626 54591 -84901 145878
18473 -261435 30065 -386221 44169 -138306 141129 44010 -50463 125801 -32228 2459 26397
18462B6397J1623b94r3845C7642a03939A6119i6015A3379a30779d9952j13649
18451a63601b9093j6048B03145J13415a34104l9014m8875A9298L5694h866j90854
18440a99720J5806b3755A29968l0135l87b34994j273A62195d3909A63175b77024
18428a16569d5499A4302a56391M6891r9699k41120A27766b2642k3979A99085C2107
18416f189k10021K9240G596i4085B8180J4735b52167f6731j61306O5543c4008
18404b12963h6396C31137e109I9953A1039i5358q4975c6673o3703D3801e9477
18392b16224K5635K133C48869D4166J36739F9659f7070o6448B8291I501J83043
18381A92544k6232h8016a5589j03542L9634D5199a61883C96008a5474A81979d6263
$$ plain form
18462 26397 38020 -294 -94139 37642 -103939 16119 -96015 13379 -130779 -49952 -163601
18451 -163601 -29093 -45141 203145 316560 -134104 -173118 -221993 19298 54992 -8866 -199720
18440 -199720 -183914 -23755 129968 99833 99446 -234994 -236267 162195 -43909 163175 -277024
18428 -116569 -45499 14302 -156391 -109500 -209199 -450319 127766 -22642 -46621 199085 32107
18416 -6189 -216210 -186970 7596 -94085 28180 42915 -252167 -66731 -228037 -162494 -34008
18404 -212963 -86396 331137 -5109 99953 11039 -95358 -180333 -36673 -100376 43801 -59477
18392 -216224 -190589 -188456 348869 44166 180905 69659 -67070 -133518 28291 9501 192544
18381 192544 166312 -88016 -15589 -119131 -79497 45199 -161883 396008 -15474 181979 -46263
18369A67742L7336a60423A14751c1252l1529B0653J60827P1028l1595r7767f0945
18357a24099H2362b11719R7781q5313D0316Q0390P5045A1547b38227j64830J50846
18346b52211J12671l9073G8401l4357a1622k7672k1311f848A69134a04829B83595
18334a43941B03362c8533j64991f914m01075A04503A1821N5730d9847A17144N3506
18323A70650b77028i4812j12015R9562j17828C0832i5052q4554r948O6542I3199
18311c38156G8660a2596j07497e2481n4249A75263a32724l0096k10750g8703c5437
18299E2823M9978m7093A8765L6865c03567l9038J30412g3755j12077Q6226D0684
18287a22497G1930a09832J6100D8982e8531r3766E3282L2899L22116f8939A9176
$$ plain form
18369 167742 205078 -160423 114751 -31252 -62781 20653 181480 252508 220913 123146 -60945
18357 -124099 82362 -211719 -113938 -199251 40316 120706 195751 11547 -238227 -403057 -252211
18346 -252211 -139540 -178613 78401 44044 -11622 -39294 -60605 -6848 169134 -104829 283595
18334 -143941 203362 -38533 -203524 -6914 -407989 104503 11821 67551 -49847 117144 170650
18323 170650 -277028 -94812 -206827 -107265 -225093 30832 -95052 -179606 -189554 -123012 93199
18311 -338156 78660 -12596 -120093 -52481 -106730 175263 -132724 -162820 -373570 -78703 -35437
18299 52823 102801 55708 18765 55630 -303567 -342605 -212193 -73755 -185832 -99606 40684
18287 -122497 71930 -109832 -93732 48982 -58531 -152297 53282 86181 408297 -68939 19176
18275B87147b20349N7963E0659h5548F7222K44513A3631J9358c5414J3109l26679
18264c48984E9423b06016b3221q9703a6112k35284C20489d3119C19119a83460
18253H9860a88873i0087A25669F2287b12670A11121b03262B41082a46071A13900
18242a27102k14336H0173J66873c45474A22948P0926m1720b17222A05007J45492
18232B50499H0136R6382d07026J10402f0686A26948f550E8243g5698r5295a3623
18220c51257J50269C02586b45866D807N3123L2127B7481e3013A0037d02156e3343
18208A32397h0660C00209a14107C48664a27582k8914r6360a25085B6052b91929
18197a53961A2526a5040j65396D04871j66201m7756m3274g4003B7484a37960c258
$$ plain form
18275 287147 -220349 -162386 50659 -85548 67222 311735 13631 32989 -35414 -22305 -348984
18264 -348984 59423 -206016 -23221 -112924 -16112 -251396 320489 -43119 319119 -183460
18253 89860 -188873 -90087 125669 62287 -212670 111121 -203262 241082 -146071 113900
18242 -127102 -341438 80173 247046 -345474 122948 193874 152154 -217222 105007 250499
18232 250499 80136 176518 -407026 -296624 -60686 126948 -6550 58243 -75698 -170993 -13623
18220 -351257 -200988 302586 -245866 4807 57930 90057 27481 -53013 10037 -402156 -53343
18208 132397 -80660 300209 -114107 348664 -127582 -156496 -252856 -125085 26052 -291929
18197 -153961 12526 -15040 -180436 404871 238670 190914 147640 -74003 27484 -137960 -3258
18185f0911G0092o054c12258N2736A29542f0248J1304A41005q803a02978n6521
18174a59499b3901j22523n2525g6336G8585J24306h1662D18769A8343b0648A88001
18162b11906c9548p395B1374J68151K19182a6668k4835F7956A4946K7009L0125
18151G2080b14498C7590a45487A36667D6566a99573O9365A87785b80033g8165
18140C8567j0323L8992k6312c56862A89029e3278E3617J33244C6313P163a09270
18128C0198J68213J25509A3627J03096c5196A41063C1191c51397B35935a46711
18117H0382d7695B19653b08443R0439c7863A8074a76184B25442c64709B70448
18106c0403D39338j99924a34058O0572I075b32320I5631J06259h991j52551A74491
$$ plain form
18185 -60911 70092 64038 -312258 -259522 129542 -60248 -48944 141005 132202 -102978 -159499
18174 -159499 -23901 -146424 -198949 -76336 78585 202891 -81662 418769 18343 -20648 188001
18162 -211906 -39548 -46943 21374 189525 408707 -16668 -41503 67956 14946 41955 72080
18151 72080 -214498 37590 -145487 136667 46566 -199573 -130208 187785 -280033 -78165
18140 38567 28244 67236 40924 -356862 189029 -53278 53617 186861 36313 43476 -109270
18128 30198 198411 323920 13627 116723 -35196 141063 31191 -351397 235935 -146711
18117 80382 -47695 219653 -208443 -118004 -37863 18074 -176184 225442 -364709 270448
18106 -30403 439338 239414 -134058 -73486 9075 -232320 95631 201890 -8991 -161542 174491
18094A067c59388C3892A4597a47960b2051n301A5504N720a78788f1728E69192
18082a44553K0131f617k14847A22286b63050h9323j63904C2026l0a93440P5406
18071a18034p0275A51059a9196A22963c20341I6992f6092G8683J36293a41651
18060a01738C13712b75007d8870C08804n811j34425b29255F9709i9442p114E6059
18048F3537a6241j43249g8185a1257j61870A24418J57245I2554a93998O9305M9822
18037g4871C6841b1583o7772I543a9979j12493M4201b7044m9641J1001B540K0143
18025B2683O9039N7556a88085j10168a33976A86114b7709A56251N4311f6385H0585
18013A36604q096a00898B47573f0440I5563a98048B1436R7456B7129K77441B2099
$$ plain form
18094 1067 -359388 33892 14597 -147960 -22051 -27352 15504 21224 -178788 -61728 569192
18082 -144553 -124422 -6617 -221464 122286 -263050 -89323 -253227 32026 31996 -193440 -118034
18071 -118034 -188309 151059 -19196 122963 -320341 96992 -66092 78683 214976 -141651
18060 -101738 313712 -275007 -48870 308804 302993 168568 -229255 69709 -99442 -106556 56059
18048 63537 -16241 -159490 -78185 -11257 -173127 124418 281663 92554 -193998 -124693 -74871
18037 -74871 36841 -21583 -89355 9543 -19979 -132472 -88271 -27044 -76685 -65684 2540 22683
18025 22683 91722 149278 -188085 -298253 -133976 186114 -27709 156251 210562 -66385 80585
18013 136604 128508 -100898 247573 -60440 95563 -198048 21436 118892 27129 304570 22099
18001B66365i2913k00145J30979A94592L3963c9783o7571E1826c03119J36316
17991a66803D2558b00552E00391a91808A3073L29573C58b93485A2773c2956j78949
17980b11905A3219k114O9713c35075i8058p993G1690b20185F3801b71080B571
17968C1333b42702B8691b48624a14442b5066A41178c7842B933b6650j63608Q324
17957a81934h4417D7686h9691L8928K780j15818e6853H924K91189A43892a24239
17945b45545A02745b82249a3279D1267J50527I2633m6231K12350I2559A8882l981
17934A4901a79832A47040o7025J39096C4359a43578C36965b96296A60504A9810
17923g049j40577d7441k9866D2528a49575H6362B0717K48168C3204a56185E4833
$$ plain form
18001 266365 -92913 -293058 -162079 194592 228555 -39783 -107354 51826 -303119 -166803
17991 -166803 42558 -200552 500391 -191808 13073 342646 358 -293485 12773 -32956 -211905
17980 -211905 13219 11105 80818 -335075 -98058 -106051 71690 -220185 63801 -271080 2571
17968 31333 -242702 28691 -248624 -114442 -25066 141178 -37842 2933 -26650 -190258 -181934
17957 -181934 -84417 47686 -89691 -50763 -47983 -163801 -56853 8924 300113 143892 -124239
17945 -245545 102745 -282249 -13279 41267 191794 92633 46402 258752 92559 18882 14901
17934 14901 -179832 147040 80015 219111 34359 -143578 336965 -296296 160504 19810
17923 -7049 -147626 -47441 -77307 42528 -149575 86362 20717 268885 33204 -156185 54833
17911b39243E5070J89477b96161A31390C2464J33632D0752b15612B01084a64384
17900i9545a0A15728b7141r0130B79883H7538a34555i78A39686F9149a95813i3927
17887b0608o8993A93726l7439h6403n2340B5791a80926R0300C08339f0599G9397
17875a09606A3912a54524f2684j0020n4272n733p1563E0689M5632i3244k3797
17864a17041o6569N5812B61248b12230g4063r4242k94188A16748m3850a09862
17853b39519A96448b06341g9089m5164B87769A16052a66053j42555f6645j1443
17843g8088J7773j7364p0089B37971o6716B6024d0042j16325J9788e1625C88072
17831G0803F77L0295a56244b1057A01964b6277l57026I9883Q3708a77858A5693
$$ plain form
17911 -239243 55070 244547 -296161 131390 32464 166096 40752 -215612 201084 -164384
17900 -99545 -10 115728 -27141 -117271 279883 87538 -134555 -978 139686 69149 -195813 -93927
17887 -20608 -89601 193726 156287 -86403 -138743 25791 -180926 -90626 308339 -60599 79397
17875 -109606 13912 -154524 -62684 -72704 -126976 -132709 -204272 50689 96321 -93244 -117041
17864 -117041 -183610 -127798 261248 -212230 -74063 -168305 -462493 116748 72898 -109862
17853 -239519 196448 -206341 -79089 -124253 287769 116052 -166053 -308608 -66645 -78088
17843 -78088 -60315 -77679 -147768 237971 171255 26024 -40042 -156367 -136579 -51625 388072
17831 70803 677 30972 -156244 -21057 101964 -26277 -383303 99883 183591 -177858 15693
17819A32138c4173G627J16524O739c0935a1303B25302d1497A41842n8312j922
17808H1608D7J2076O1614h8639L1998C4624i7988B07991a63256c052l6642A22883
17795G229N4616M292P2640a98529D63438C9703K62693j08908d57553A16932D4653
17783b09743D1108K35633m0891L75009b3070G9467j7839b4501a652B01505n4583
17772A46922a45639P1045A86631i011n8024A26425b39450E4745b51834n7058D67631
17760e6750B64032c60726d3463A827K616b62520D3494A2784J12426a38535b1626
17748e7352K6639p5067j20076A7920a69632A44678e4318k8756n0169q8843A16575
17736g5986m0197m2889r8725J06466B46308A16924J41961H7462L4487N5533j8662
$$ plain form
17819 132138 -34173 7627 124151 130890 -30935 -11303 225302 -41497 141842 83530 81608
17808 81608 47 12123 73737 -88639 -56641 34624 -97988 207991 -163256 -3052 -39694 122883
17795 7229 61845 66137 138777 -198529 463438 39703 302396 193488 -457553 116932 44653
17783 -209743 41108 276741 235850 610859 -23070 79467 61628 -24501 -1652 201505 146922
17772 146922 -145639 -74594 186631 -9011 -67035 126425 -239450 54745 -251834 -308892 467631
17760 -56750 264032 -360726 -43463 1827 4443 -262520 43494 12784 125210 -138535 -21626
17748 -57352 -30713 -105780 -225856 17920 -169632 144678 -54318 -83074 -133243 -222086 116575
17736 -75986 -116183 -159072 -257797 -151331 246308 116924 258885 87462 121949 177482 158820
17725A58820a14782G9836d45242A60450b27736O2152j01887C6499J2921e9307
17714a54612r9513p9323A88171J10381h2943m6192G5183J70934F5798b90770A04172
17702B6465a43688d5297j36130A14866g9306I3739a60482e6129o266j18582d0476
17690A61474c33964I5589m5146b7900B64753f915l6984B81441c3139k05438B15849
17678H782C416j62K01198p0756a82454d2220k1249k46660B94496e2405H9141f2234
17665c9360A26302a61843A77497d61459b9439B32802D6297c57642B18093a97447
17654A23302E9778b98733B02017L45901a4977l82748B68956b22354b4062j46477
17644a70539A33938b3735G6402j3142e5527p0992A03651n1605J59516I2626b73934
$$ plain form
17725 158820 -114782 79836 -445242 160450 -227736 -165584 -267471 36499 49420 -59307
17714 -154612 -254125 -333448 188171 298552 -82943 -129135 75183 246117 65798 -290770 104172
17702 26465 -143688 -45297 -181427 114866 -79306 93739 -160482 -56129 -62395 -180977 -40476
17690 161474 -333964 95589 50443 -27900 264753 -6915 -43899 281441 -33139 -238577 215849
17678 8782 3416 3254 204452 133696 -182454 -42220 -63469 -310129 294496 -52405 89141 -62234
17665 -39360 126302 -161843 177497 -461459 -29439 232802 46297 -357642 218093 -197447
17654 123302 59778 -298733 202017 547918 -14977 -397725 268956 -222354 -24062 -170539
17644 -170539 133938 -23735 76402 63260 -55527 -126519 103651 52046 211562 92626 -273934
17632C299a37235c8225r3897C34897j40270a40461j25446C4427a68382p0933A77136
17620H8025P1007Q6245a46129B9493h4373A43332a19615C02602G2670b44218B97107
17608b28602A8608a38838F5918J94459j25275n6597R6432J18228a2544r4724E8137
17596A31232p361J26794K182q9693J51984i4792k19162A6922O9295J11140e3414
17584c8849a2341B8757P1366C455J31321J48430c8779J117A48823q243f9048r2234
17572a61282k9463k1499i3008H61Q6047g2239K4528A21667P4342h5337o6694o8166
17560b20197D0031a87194a4239E6450K15960j28484g755k79938a20058B13764
17549b8103M154I8886L7216a27189C30206a13170A67717n4438a51744C08322b4293
$$ plain form
17632 3299 -137235 -38225 -132122 334897 194627 -140461 -265907 34427 -168382 -239315 177136
17620 88025 159032 245277 -146129 29493 -84373 143332 -119615 302602 72670 -244218 297107
17608 -228602 18608 -138838 65918 260377 135102 78505 174937 293165 -12544 -107268 58137
17596 131232 123871 250665 252847 163154 315138 -94792 -313954 16922 86217 197357 -53414
17584 -38849 -12341 28757 100123 3455 134776 283206 -38779 -37662 148823 140580 -69048 -161282
17572 -161282 -190745 -212244 -93008 861 86908 -72239 -47711 121667 196009 -85337 -152031 -220197
17560 -220197 40031 -187194 -14239 56450 272410 143926 -7755 -287693 -120058 213764
17549 -28103 -23949 98886 136102 -127189 330206 -113170 167717 113279 -151744 308322 -24293
17537A96240J10763p2143M224K31951j82251b3992j30281A96415b47302a2937
17526A42709K3293p1640a1741j20273j27487A14367n3969m499a31530B02353F1285
17514B57174n8122C9859N5586K37729l3470q777B6973L4912b18439A23333J07731
17503B31064a1067k22063A93587J35679r0284A10823J29794c7441C10307j12282
17493A98025P7008b21247Q4967C39524I4349b7152k37287C66018K82617h8741
17482a56053D53542f4790B3848f1960F2361O0481a1348I1945L8408j2313f8557
17470A70103a8777A21006K79817k9284B5946M20433A79733d7160E7497b25936
17459B20161j03627C6434K08734b1629B11499K81416A13176J23591F4653K32882
$$ plain form
17537 196240 307003 234860 239084 471035 288784 -23992 -154273 196415 -247302 -12937
17526 142709 166002 94362 -11741 -132014 -259501 114367 60398 55899 -131530 202353 61285
17514 257174 199052 39859 95445 333174 299704 290927 26973 61885 -218439 123333 231064
17503 231064 -11067 -233130 193587 329266 238982 110823 240617 -37441 310307 198025
17493 198025 275033 -221247 -136280 339524 94349 -27152 -264439 366018 648635 -88741
17482 -156053 453542 -64790 23848 -61960 62361 122842 -11348 91945 130353 118040 -68557
17470 170103 -18777 121006 400823 371539 25946 446379 179733 -47160 57497 -225936
17459 220161 116534 36434 245168 -21629 211499 492915 113176 236767 64653 297535
17449B97535A07888K29940b3092A20670L50508H8075L99693b06838E23328A90789
17438B01224b8073D92544I4658K73359I0270k2692M29204B32544n7115m8850J9777
17427A46356J60387J7963k1545A15948J39114b7472E3668P6526O3376a45233F5256
17415C12883l2130J77239j78061K06549b2061A45170K91157j86888A0826h4468
17404A72502J85424A06960a14497B9549K47651r4394J72543l3586b87981F745
17393A17114L77575I7207K11118c00648B17480L6157K9754e2688A71030h5972
17382B45741F7572m094A4745J3754J36595J16329m3305L4657a82735A17018K32638
17371C49656F8223K33821J0857a1644A75111P7222A21401P6087J5004q2059m5840
$$ plain form
17449 297535 107888 337828 -23092 120670 471178 88075 487768 -206838 523328 190789
17438 201224 -28073 492544 94658 368017 90270 67578 496782 232544 175429 126579 146356
17427 146356 306743 324706 303161 115948 255062 -27472 53668 130194 193570 -145233 65256
17415 312883 280753 457992 279931 486480 -22061 145170 436327 249439 10826 -84468
17404 172502 357926 106960 -114497 29549 277200 182806 355349 321763 -287981 6745
17393 117114 494689 97207 308325 -300648 217480 253637 283391 -52688 171030 -85972
17382 245741 67572 63478 14745 28499 165094 281423 238118 272775 -182735 117018 349656
17371 349656 68223 302044 312901 -11644 175111 252333 121401 197488 212492 130433 84593
17360H4593O8549j3106R415J13418E5572K44979b38788A16520J78546I4462K41311
17349C35773c73E99789B29989J44961g4770A00270a12291B72082H2839b63269
17338H6682a9833A3733J06445C6193O0255c3374j07631A91835H703L02732H5082
17326a85954B05992E7373K511a12528A61391b24258F36089A88099D4554L29886
17316C74440E6198M9617R6487Q1847k6984I6253K80133G5814J68959J76183j4574
17305D06382j94837L42463b3509I8436K25701b3678B52017q4394K1073Q0489M5720
17294C14905J72104B35683p2907l1399n1982f6148A87121a55619A38448L29495
17284D67943A55289J031K64617j27925G5969M2237J47822j16828P6469J53924
$$ plain form
17360 84593 153142 140036 149451 262869 55572 300551 -238788 116520 295066 94462 335773
17349 335773 -373 599789 229989 374950 -74770 100270 -112291 272082 82839 -263269
17338 86682 -19833 13733 120178 36193 96448 -33374 -141005 191835 8703 311435 85082
17326 -185954 205992 57373 59884 -112528 161391 -224258 636089 188099 44554 374440
17316 374440 56198 105815 202302 284149 257165 96253 376386 75814 244773 420956 406382
17305 406382 211545 554008 -23509 98436 324137 -23678 252017 167623 188696 269185 314905
17294 314905 487009 235683 162776 131377 79395 -66148 187121 -155619 138448 467943
17284 467943 155289 156320 420937 293012 75969 118206 266028 149200 225669 379593
17274C79593b31943C46255A40574R4829L9113H1894a9168D54615F9000N20698
17264E89698k48880b05342C37188p4475r9724p4628b5900A33755L05845k11500
17254B28100L0633K1747J24310e56B17067a1496r0224A96495E9490J27536N598
17243A92624K22421A12863d8265C85634c7459B67017A5479M01067C4161K52086
17233B86247E5865K12108d9795A88794r0902K74510c21847B58313J68814k351
17223D24776j64835Q3215b8515A54613M9208N2784E8416H949L36640K1373H4264
17211f0279C89005G0442J4417k864M06853B24696j9030K4005J15974J60300B51601
17199B77789J25635A85194R0201p2224J33549a5654a154B43723Q8544J45725j15424
$$ plain form
17274 379593 -231943 346255 140574 235403 274516 81894 -19168 454615 69000 589698
17264 589698 340818 -205342 337188 262713 162989 88361 -25900 133755 439600 228100
17254 228100 258733 280480 404790 -556 217067 -11496 -101720 196495 59490 187026 192624
17243 192624 415045 112863 -48265 385634 -37459 267017 15479 416546 34161 286247
17233 286247 55865 267973 -49795 188794 97892 372402 -321847 258313 427127 424776
17223 424776 259941 343156 -28515 154613 203821 256605 58416 8949 345589 366962 84264
17211 -60279 389005 70442 84859 81995 488848 224696 205666 229671 345645 505945 251601
17199 277789 403424 185194 275395 203171 336720 -15654 -1154 243723 332267 477992 362568
17188C62568D1071K49585P8869K52506A12345K21k3689J73054J6269q8432B6881
17176F7859L75136k511j10357j64042J08642l0291J69237R7265A30810L7821J41283
17165C09914l6710j10258a88999B56175J99330k01627l9863M22881A62953n7836
17155A05117M40097A33700J472K45369J48289B53896J1796J74704j68026J04592
17145C76962J18649j45992K41438k05990j73520H4208M17891C5009L55140j65054
17135B25095n3369L08552k09017J41548H3891K77771K7969P4132n5264O945j14222
17124C01222L38151n974j62928M6751K18803B80439O7750M6128C785L49519A47382
17112A39551K29708o8331K20794B9364R6888k695K96452p6973M3857q2163K56208
$$ plain form
17188 362568 41071 290656 369525 622031 112345 112566 88877 261931 278200 189768 26881
17176 67859 442995 440484 330127 166085 274727 244436 413673 510938 130810 168631 309914
17165 309914 273204 162946 -188999 256175 455505 253878 214015 636896 162953 105117
17155 105117 545214 133700 135172 380541 528830 253896 265692 440396 272370 376962
17145 376962 495611 349619 591057 385067 211547 84208 502099 35009 390149 225095
17135 225095 171726 480278 271261 412809 83891 361662 389631 463763 408499 415444 301222
17124 301222 639373 633399 470471 517222 736025 280439 348189 394317 3785 353304 147382
17112 139551 369259 300928 521722 29364 126252 123557 420009 343036 386893 304730 560938
17101E60938l5686k35563C6510L40675r0244K78186L0597Q1998A74400L92392
17091E66792A64273J26907j9605L5159J02332j31626K59730l5488J71974j32038
17081E41618j13412P3397j65801L98129k16693j73689O0338j17945J81467n9015
17071D08394m5314K79476k06881K37346B95085m8229M07431k00067m6800K29451
17061F36871j59608l5935k7994A58340L26968n0453j58674L20095p0774p089J3824
17050E32237L706r9547K41025n1923l911R4499P0294K1040C12482j7657L15441
17039F10266k10259R8020L97280C44666J6659K53095K03159j68781j01891L5304
17029E82211j11422N1039j91280M46029l12693J31165J96935j51386q9257J4581
$$ plain form
17101 560938 525252 289689 36510 377185 286941 565127 595724 677722 174400 566792
17091 566792 164273 291180 271575 306734 409066 277440 537170 501682 673656 541618
17081 541618 428206 501603 335802 733931 517238 343549 403887 285942 467409 408394
17071 408394 363080 642556 435675 673021 295085 246856 654287 454220 407420 636871
17061 636871 477263 441328 413334 158340 485308 434855 276181 596276 525502 518413 532237
17050 532237 535943 436396 677421 625498 621587 716086 786380 807420 312482 294825 610266
17039 610266 400007 498027 895307 344666 361325 614420 817579 648798 546907 582211
17029 582211 470789 521828 330548 776577 463884 595049 791984 640598 551341 565922
17019E65922K74715k00067P8048j18384r1242L64026l55881K29323k20000L97530
17009I23990k50351J96159j97115j09619k9456J59759J78671J587P3677k26356
16999G20946J89100j35064q3353J48528J31235D24063L89585k04267j63464K95815
16989G41732J99750j56201j0579l4976K1960K35735R661k57066r6563L40056M8063
16978A041572j95800O5966K2225l63429L56751m5783K30739k53636J46094R7145
16968A101844j67263k19735L45782l25607J82998r6933K73215j88780K42545m27553
16958G20513K24759K2872J5344M8672m1661j01881K33732J33583j29404J6619
16948A143148j40607J62194J10420j91030L58759o74391L87773j74619J59475
$$ plain form
17019 565922 840637 640570 718618 600234 508992 873018 517137 746460 526460 923990
17009 923990 673639 869798 672683 563064 533608 693367 872038 873625 947302 720946
16999 720946 910046 774982 691629 840157 971392 424063 813648 609381 445917 741732
16989 741732 941482 785281 774702 739726 761686 997421 1007082 750016 653453 993509 1041572
16978 1041572 845772 911738 933963 570534 927285 881502 1112241 858605 1004699 1101844
16968 1101844 934581 714846 1060628 735021 918019 821086 1094301 905521 1148066 720513
16958 720513 945272 968144 983488 1032160 990499 888618 1122350 1255933 1126529 1143148
16948 1143148 1002541 1164735 1275155 1084125 1442884 768493 1156266 981647 1141122
16939A141122n4849J16686j08534K12745k38564p2615k1504K13191J51423k45807
16929A093294K85048j05606K96116k17158J16483J24513k95838K25180j4826l5756
16919A471450L28856l36095n2891j62407K24474N7720Q2957j22925L28862k56045
16909A563956k30398M59008j39571n7598Q5618k0049k20748J08548q3946n4997
16899A409823N89507l783r9695j48122j8375J89363J61681k87184J56387j04786
16889A844816k35791J36235K02763J69160j63949J34581m38058N09610j86524
16880A972843J3576N860M62438j84575K43724n24102M09818k14590K57305n6127
16870B386170R0561K2281k2426q3961K28698J7262l60695L64695l04922L94023
$$ plain form
16939 1141122 1086273 1202959 1094425 1307170 1068606 995991 974487 1187678 1339101 1093294
16929 1093294 1378342 1272736 1568852 1351694 1468177 1592690 1296852 1522032 1507206 1471450
16919 1471450 1800306 1464211 1411320 1248913 1473387 1531107 1614064 1491139 1820001 1563956
16909 1563956 1333558 1792566 1652995 1595397 1681015 1660966 1440218 1548766 1464820 1409823
16899 1409823 1999330 1995547 1895852 1747730 1729355 1918718 2080399 1793215 1949602 1844816
16889 1844816 1609025 1745260 1948023 2117183 1953234 2087815 1649757 2159367 1972843
16880 1972843 1986419 1992279 2454717 2270142 2513866 1989764 2399582 2184992 2442297 2386170
16870 2386170 2476731 2499012 2476586 2392625 2621323 2638585 2277890 2642585 2337663 2731686
16860B731686J58733O0685k07011j16661L57585k94932K69228j220r0651J04966
16850B972408K19065K04112j01091l86621N70928K44194j00496m85216L75815
16841C513098K88089m44930N43340l15603O1874J21458Q3049K83042j68761k37492
16831C727164O58108J36705l59020K28027Q147J40716j4105L8861L39470k69757
16821D634316K64667J08491O7276N4941L28030k45317N94150l08548L02405K68767
16811F069178j39288L01832l87637J75072N41495L07915L3226Q7283K48062N5880
16801G293018o1840O96117j00684L40440l7408M51122O3745L25510L31371j33778
16791I167613K28905K53542J67562M3531L51933N19387K66637K33652M14909L60270
$$ plain form
16860 2731686 2890419 2951104 2744093 2627432 2985017 2690085 2959313 2958093 2867442 2972408
16850 2972408 3191473 3395585 3294494 2907873 3478801 3722995 3622499 3137283 3513098
16841 3513098 3801187 3356257 3899597 3583994 3645868 3767326 3850375 4133417 3964656 3727164
16831 3727164 4385272 4521977 4162957 4390984 4399131 4539847 4525742 4564603 4904073 4634316
16821 4634316 4898983 5007474 5074750 5129691 5457721 5212404 5806554 5498006 5800411 6069178
16811 6069178 5929890 6231722 5844085 6019157 6560652 6868567 6901793 6989076 7237138 7293018
16801 7293018 7231178 7927295 7826611 8167051 8129643 8580765 8644510 8970020 9301391 9167613
16791 9167613 9396518 9650060 9817622 9861153 10213086 10732473 10999110 11232762 11647671 12007941
16781A2007941J41579O32850K80284K94525M25622O68058M86587J92083O74299
16772A5803828O45608J82477P36701K12094N59003J177938O36664M60266Q19250
16763B1233829N28702R57506R77379J103791J062498O25432J263988J348992J435172
16754C0537289J099800J385543J671096J645784J528061K120401J910760K029238
16746D3927972K099141K630268K588227K962977L229054K816049L602084L561861
16738F7417633M310291M479288M573912M896968N218069N456362O047561O399057
16730A08799141P173652O940425P716345P643638Q118890P994726Q282007P929062
16722A70597886P337111P216071O363347N316363M033792K785439J538942n09094
$$ plain form
16781 12007941 12149520 12782370 13062654 13357179 13782801 14450859 14937446 15129529 15803828
16772 15803828 16449436 16631913 17368614 17580708 18139711 19317649 19954313 20414579 21233829
16763 21233829 21762531 22720037 23697416 24801207 25863705 26489137 27753125 29102117 30537289
16754 30537289 31637089 33022632 34693728 36339512 37867573 39987974 41898734 43927972
16746 43927972 46027113 48657381 51245608 54208585 57437639 60253688 63855772 67417633
16738 67417633 71727924 76207212 80781124 85678092 90896161 96352523 102400084 108799141
16730 108799141 115972793 122913218 130629563 138273201 146392091 154386817 162668824 170597886
16722 170597886 177934997 185151068 191514415 196830778 200864570 203650009 205188951 204679857
16714B04679857j461429k805059m362955n684342o406064p583000p765995q206217
16706A60404796q332794q128867q229105p752622p885385p337273o966753o435853
16698I9336144o090722n697055n363618m982204m981470m296145l715074l664025
16690F0545831l363175l001919l661871k193795k626596j892765k728915j896272
16682C9180523k158585j553838j582446j621500j680750j455237r73249j297508
16674B6857410j306226j100110j172806m69972j270735q39684o10106j013304
16666A9074467n28332r60968n50201n43531o30094m25591n64752m89315o77271
16657A3704412n35975k84645j53413o54166l44331k90974m91949l23782m90420
$$ plain form
16714 204679857 203218428 200413369 196050414 190366072 183960008 176377008 168611013 160404796
16706 160404796 152072002 143943135 135714030 127961408 120076023 112738750 105771997 99336144
16698 99336144 93245422 87548367 82184749 77202545 72221075 67924930 64209856 60545831
16690 60545831 57182656 54180737 50518866 48325071 45698475 43805710 41076795 39180523
16682 39180523 37021938 35468100 33885654 32264154 30583404 29128167 28154918 26857410
16674 26857410 25551184 24451074 23278268 22808296 21537561 20697877 20087771 19074467
16666 19074467 18546135 17585167 17034966 16491435 15861341 15435750 14870998 14381683 13704412
16657 13704412 13168437 12883792 12730379 12076213 11731882 11440908 10948959 10625177 10134757
16648A0134757J9673m32884j48775l76970k95340p1011n57948l0850n91708J34521
16638G783465r0710j51495k07458J36500n45029l99257M1477P0362l68453r5515
16628F173887k03292K26289m45183j23925k0430k87329J15217n68121J69465k79294
16618D757284L6077J14285k71405j79582j84262L38168k96559J49315n57959J80013
16608D085375K16285o20488J71129k65181l3364r2641J01296l80426J39914R935
16598C331834J1170k19269m117j55623J13449k88939J30840j70005r2454n2679
16588B604207R1138o4702j57492Q4753L5098l23160J48700q4583j40187J37803
16578B331575j49476k534P2060O6438O6599l53552L21409j85269J4753k63860
$$ plain form
16648 10134757 10154430 9721546 9572771 9195801 8900461 8829450 8271502 8240652 7648944 7783465
16638 7783465 7692755 7541260 7333802 7470302 6925273 6526016 6567493 6637855 6269402 6173887
16628 6173887 5970595 6196884 5751701 5627776 5607346 5320017 5435234 4867113 5036578 4757284
16618 4757284 4793361 4907646 4636241 4456659 4272397 4610565 4314006 4463321 3905362 4085375
16608 4085375 4301660 3681172 3852301 3587120 3553756 3461115 3562411 3181985 3321899 3331834
16598 3331834 3343004 3123735 3119618 2963995 3077444 2788505 2919345 2749340 2656886 2604207
16588 2604207 2695345 2630643 2473151 2557904 2593002 2269842 2418542 2333959 2193772 2331575
16578 2331575 2182099 2179565 2251625 2318063 2384662 2031110 2352519 2167250 2182003 1918143
16568A918143J32587J69600m65383J6118J31082N0089l97141P36627n32726j82741
16558A576255J92910o6244l29433R6912J97612r981l08696N10180j73602j92355
16548A493558j67624N6816J49016k68447L84347m8733k39559Q2270q8777k4638
16538A328229j55913J22292J00854k11659o137j61913M08257k22682j94084L7600
16528A044844J27583L6618k4185j73245J87163k16317J1771K03012l3150L7181
16518A201275k52998K06527j51568Q9826l39452J87650j5090L55062n23980K82121
16508A039373j80032M6883J68303k47028J62829j56360j30549r168L0400J5584
16498G40235K53305l33939q8734N02638l54876Q0370j7256K8354k89023J91682
$$ plain form
16568 1918143 2050730 2220330 1754947 1771065 1902147 1952236 1555095 2291722 1758996 1576255
16558 1576255 1769165 1702921 1373488 1470400 1668012 1658031 1349335 1859515 1685913 1493558
16548 1493558 1325934 1382750 1531766 1263319 1647666 1598933 1359374 1441644 1352867 1328229
16538 1328229 1172316 1294608 1395462 1183803 1177666 1015753 1424010 1201328 1007244 1044844
16528 1044844 1172427 1209045 1184860 1011615 1198778 982461 994232 1197244 1164094 1201275
16518 1201275 948277 1154804 1003236 1093062 753610 941260 926170 1281232 757252 1039373
16508 1039373 859341 906224 1074527 827499 990328 833968 703419 694251 724651 740235
16498 740235 993540 659601 570867 1073505 718629 798999 781743 810097 521074 712756
16488G12756N6134k47325J6368K68998k79237J06238J06316j65929P8698L79076
16478A032093l71133k75819j1953N81189D39850K26295j91221J19662B89259P6838
16468C66097k0907J77905B57401J11048J52526J67351o1382l4876j65904K20459
16458F46623J42966j93551j97927j9279M12306C74458K77103k65422A89858L75168
16448E65026L05509o6912k35024j47678j83378N14765C47245A19102L05874A73832
16437E45602N8j35738A62468m1258M14274L15043k81481j72669J07182r6934r8104
16426C08521K11912j77274R1822n709k13783k4757J13746n1291q5722K78424b2628
16414F81541F1628Q2374J05052L8867J46235A93984J17872j14396K26864j21720
$$ plain form
16488 712756 768890 521565 537933 806931 527694 633932 740248 574319 653017 1032093
16478 1032093 660960 385141 373188 954377 439850 666145 474924 594586 289259 366097
16468 366097 345190 523095 257401 368449 520975 688326 626944 592068 426164 646623
16458 646623 789589 596038 398111 378832 791138 374458 651561 386139 189858 565026
16448 565026 870535 803623 568599 420921 237543 752308 347245 119102 424976 173832
16437 545602 545660 409922 162468 121210 535484 850527 569046 396377 503559 406625 308521
16426 308521 520433 343159 434981 429272 215489 190732 304478 253187 167465 445889 -22628
16414 681541 61628 144002 249054 287921 434156 193984 311856 197460 424324 302604
16404C02604p0199I7893M04079c4156C47604E3099K31058K25137B51491J85641
16394D37132A42553K45174O9737A93727n778b5664F7267j7995J85226L23990A13008
16382B93506j6300j29384L36283j15717j60291P8446Q4271j07558H1455N7100
16372A38555O8279M2924a3458C41164J417j20408H6295R5816n0716J85731A14257
16360A87651J56644e6382D52445d0448B30201n6405K02713A1402M6263J23105
16350A80770q7120J23063H7913R346K34A55Q8459a7721G1668J44651L98776l04066
16338C11029j48329J89737l802j47587G7580K23494j4307n8563k6161b7504B2153
16326F796M3207K04620j13396L22690B9842M1427R9447K26886j80706R1817j7185
$$ plain form
16404 302604 232405 97893 501972 -34156 347604 53099 284157 509294 251491 437132
16394 437132 142553 387727 457464 193727 187949 -25664 67267 49272 234498 558488 113008
16382 293506 277206 147822 484105 368388 208097 286543 370814 263256 81455 138555
16372 138555 206834 249758 -13458 341164 342581 222173 86295 182111 131395 317126 114257
16360 187651 344295 -56382 452445 -40448 230201 173796 376509 11402 57665 180770
16350 180770 93650 216713 87913 97259 97493 155 88614 -17721 71668 216319 615095 311029
16338 311029 162700 352437 348635 201048 77580 301074 286767 228204 202043 -27504 22153
16326 6796 50003 254623 141227 463917 29842 71269 170716 397602 216896 308713 291528
16315B91528k1029n6693a1709l0710B46840A91L18088F1130i9573B54452m6230
16304B08222K07662A8237a42941f7212A72546L98211A02232g0380A42604R3256
16294B35860P4441K03825D9036A4675a9070B6513a16129d2306I7498i4795q4877
16283a79672c467j68616C82622d6023A61680B6128a78446C91053j29133A26247
16272A64455p7336j7460c6910D37930A03964h2201A39456J14522I7941j0706J42224
16261B29459E3199b1695j75342B42967g6061A45959J66762m7086A19211L13807
16251D33018k13504p0022O606Q3057n9450a3364G6842K25955G6806c40405B37521
16239I3029h472C10452F5609G264J04928C9515K5016N9293l6256M9904Q231f0439
$$ plain form
16315 291528 270499 213806 -11709 -42419 246840 191 318279 61130 -99573 254452 208222
16304 208222 415884 18237 -142941 -67212 172546 570757 102232 -70380 142604 235860
16294 235860 310301 514126 49036 14675 -19070 26513 -116129 -42306 97498 -94795 -179672
16283 -179672 -3467 -172083 382622 -46023 161680 26128 -178446 391053 261920 126247
16272 164455 87119 69659 -36910 437930 103964 -82201 139456 253978 97941 87235 229459
16261 229459 53199 -21695 -197037 242967 -76061 145959 312721 265635 119211 433018
16251 433018 219514 149492 156098 239155 179705 -13364 76842 302797 76806 -340405 237521
16239 93029 -8472 310452 65609 7264 112192 39515 64531 123824 87568 137472 145703 -60439
16226B2847f8232A6513J69810J90962A66858q0338L2114P6599i1131j56581c7031
16214a91902B2058J14885b3499A37271J00404i9525j40918D5558K3521b7350A29452
16202c21816A44554G65b07803I0979d9423B4371K7331R6788A4646a59891A42736
16190B8412J99127b21435l6531Q6914d2992E1216A6825O5017B6056d1724A95576
16178G6785A3159J36682P0492f4654J9866A36459B0355e3635A47057e1237H0526
16166A33303m0376J38688d47961a53875q8521H1254a30695C00972b41794A48802
16155E3289j3122a22146B23952a58384B72677b1542A5734d3884K156H4895K02189
16144B87084D9033a18808j01371K1085i3702A34050a5402G5308K062a3445C21014
$$ plain form
16226 22847 -68232 16513 186323 377285 166858 86520 118634 195233 -91131 -247712 -37031
16214 -191902 22058 136943 -23499 137271 237675 -99525 -240443 45558 69079 -27350 129452
16202 -321816 144554 765 -207803 90979 -49423 24371 51702 148490 14646 -159891 142736
16190 28412 227539 -221435 -257966 -171052 -42992 51216 16825 81842 26056 -41724 195576
16178 76785 13159 149841 220333 -64654 -44788 136459 20355 -53635 147057 -51237 80526
16166 133303 92927 231615 -447961 -153875 -242396 81254 -130695 300972 -241794 148802
16155 53289 40167 -122146 223952 -158384 272677 -21542 15734 -43884 -41728 84895 287084
16144 287084 49033 -118808 -220179 -199094 -93702 134050 -15402 75308 77370 -13445 321014
16132A1655a66005f1720n9488l2504F9169d7722B76212a57913I6782b74321H7558
16120B25212b33713E2262P2875c17180A3844c27692A04133b70899j8771a0556
16109C5121J59360b14494O1786A7130M9324b15013J208j4185B60270j21163d6434
16097F4966J63412H8941J5672b16555j3002c1779q4201A33441a67827A58836n4305
16086A04531m5261K4370J08080A1775m409b37087j7878P4570A99410p6556B5977
16074A26437e4394H5928b80828A8746b47997E529c1402A38305a98170d6809B90818
16062i1507n2167A83391B2592J15236b99454J39274F2486a25703G1520B4827b8097
16050a89824D5176K606b30966o1743a24741N0740J7625A50794a44863b0161k21884
$$ plain form
16132 11655 -166005 -61720 -121208 -153712 69169 -47722 276212 -157913 96782 -274321 87558
16120 225212 -233713 52262 125137 -317180 13844 -327692 104133 -270899 -289670 -10556
16109 35121 194481 -214494 -152708 17130 66454 -215013 -213805 -227990 260270 139107 -46434
16097 64966 228378 88941 104613 -216555 -229557 -31779 -115980 133441 -167827 158836 104531
16086 104531 59270 83640 191720 11775 7366 -237087 -254965 -180395 199410 122854 25977
16074 126437 -54394 85928 -280828 18746 -247997 5529 -31402 138305 -198170 -46809 290818
16062 -91507 -143674 183391 22592 137828 -299454 -160180 62486 -125703 71520 24827 -28097
16050 -189824 45176 47782 -230966 -292709 -124741 -74001 -56376 150794 -144863 -20161 -242045
16039b42045l0300a20470G5665J9750a45095A84115a06971L2403A92959a59065
16028D7548J70063C256b3495o9801C11036c37839d636k2362k47140O4215J840
16017b08083m6574K428P9950A11338a91165d2717j35638A21640a4176j20990B51578
16005b72600A29640E2788b16178g8016m0786d0241B12604J9439j6396a84175j69143
15994c53318a74602Q6089G8676d2169C24155c36073p623M4915b4217A24954f6614
15982A16104K7088L27070B09222j9416L6467B9408a34818e1970j51800d2220A27098
15970A0138a09317M7882H890Q4875c55473R1490F18644E469b4917F3087g1910
15958A61026a4120j86826B81847i2217g103j3101k34891j99279E5125R7956j5277
$$ plain form
16039 -242045 -272345 -120470 75665 95415 -145095 184115 -106971 -74568 192959 -159065
16028 47548 217611 3256 -23495 -93296 311036 -337839 -4636 -26998 -274138 -209923 -208083
16017 -208083 -254657 -252229 -172279 111338 -191165 -42717 -178355 121640 -14176 -135166 251578
16005 -272600 129640 52788 -216178 -78016 -118802 -40241 212604 232043 215647 -184175 -353318
15994 -353318 -174602 -88513 78676 -42169 324155 -336073 -343696 -298781 -24217 124954 -66614
15982 116104 143192 470262 209222 189806 226273 29408 -134818 -51970 -203770 -42220 127098
15970 10138 -109317 -61435 8890 93765 -355473 -263983 618644 5469 -24917 63087 -71910
15958 161026 -14120 -200946 281847 -92217 -7103 -20204 -255095 -454374 55125 153081 137804
15947A37804g8044I8734a3223B1612a10761J9021k81731d9976m02A44119b92476
15935a6946k59199A28167b04659l7556A6842N5231b07342R4705A30218D7171a53333
15923c3763A52415m2108j207a63335e7352C0163b76668I9367a62228k9070A35056
15911D4157Q3804c2017A17370P2374c21223a11365M3529A30465D683g754l30748
15900c38502a1361H8899b95649J15572P974f3409n0560L7800r3778o3534B54014
15888e4756j97865B594a84206IM7617c10407b3454d066A25896m9788l4822b08433
15875g0724b6840o0441B0823d3310j92381F738a77078N4909j3294d2379r2323
15864a34702A6624a05970a5399k40372B97433f6708B7096a87076j10750B24742
$$ plain form
15947 137804 -78044 98734 -13223 21612 -110761 -91740 -373471 -49976 -50378 144119 -292476
15935 -16946 -276145 128167 -204659 -242215 16842 72073 -207342 -112637 130218 47171 -153333
15923 -33763 152415 110307 109100 -163335 -57352 30163 -276668 99367 -162228 -191298 135056
15911 44157 127961 -32017 117370 189744 -321223 -111365 -67836 130465 4683 -7754 -338502
15900 -338502 -11361 88899 -295649 -180077 -172103 -63409 -113969 -76169 -169947 -233481 254014
15888 -54756 -252621 2594 -184206 9 47626 -310407 -23454 -4066 125896 76108 41286 -208433
15875 -70724 -26840 -87281 20823 -43310 -235691 6738 -177078 -122169 -135463 -42379 -134702
15864 -134702 16624 -105970 -15399 -255771 297433 -66708 27096 -187076 -297826 224742
15853A05786j6090f5011m2615A8687J24845D0051P1944E1695a27989A91087B0464
15841A20436n3092a20338r8767A53132J57187n1845h2198C5222f4003b3577k39286
15830b62863A02658a82711B51620n9208E7412b38510N331j7295q5272A48320e2637
15818C14318b14364K1303f7977A71647J15892a84130k32294J63041B29502B7162
15807D747a83932h4172n8265O8181P32E8141c6562j29190j81041A00056F858Q9093
15795I5951L4390a56094A36139L7621h7317k66846D39307g9590I4587b88443n5800
15784c44243A12615b37345j2251A12663l6374c45460A6803b77121a28391d7579
15773i0299J9544I9106J14319a76839j01060A31720g6813j98998j24456a81503
$$ plain form
15853 105786 89696 -65011 -107626 18687 143532 40051 111995 51695 -127989 191087 20464
15841 120436 67344 -120338 -219105 153132 310319 258474 -82198 35222 -64003 -23577 -262863
15830 -262863 102658 -182711 251620 192412 57412 -238510 -233179 -250474 -335746 148320 -52637
15818 314318 -214364 -193061 -67977 171647 287539 -184130 -416424 -253383 229502 27162
15807 4747 -183932 -84172 -142437 -74256 -73524 58141 -36562 -165752 -346793 100056 6858 95951
15795 95951 130341 -156094 136139 173760 -87317 -354163 439307 -79590 94587 -288443 -344243
15784 -344243 112615 -237345 -249596 112663 76289 -345460 16803 -277121 -128391 -47579
15773 -90299 -70755 99106 213425 -176839 -277899 131720 -76813 -275811 -400267 -181503
15762a16351K2127c4580k39173a00904A13493L2527a19568B29216A12774D7596
15751a62243K6165N565D6392e0387r1201A29029K36238e2301B85780a37351j3353
15740a50704j68147K4383K1401a6887p1055j0129L8055l1402j43649A8129a01252
15728E2888i2468o1430I507J11938J0300m6112c700A93983E1751a5026k1199A80439
15715b29548r461C6398h0634j06729A13176K1947a59991D0144N2158e7369r6968
15704a54337A97036p1011H095O6190c5225H607e9651J6933j02178d9868L440A60734
15691a95768A8396J50012C6426g3801I5222m3970b7577l55605l2413f7372q7034
15680a54406j0403E9983K75825f3712p5186E1022N7536K3482a1723B54674A26187
$$ plain form
15762 -116351 -94224 -34580 -273753 -100904 113493 146020 -119568 229216 112774 47596
15751 -162243 -136078 -130513 46392 -50387 -141588 129029 365267 -52301 285780 -137351 -150704
15740 -150704 -318851 -294468 -273067 -16887 -87942 -98071 -60016 -91418 -235067 18129 -101252
15728 52888 -92468 -153898 9507 121445 131745 85633 -3700 193983 51751 -15026 -36225 180439
15715 -229548 -239009 36398 -80634 -187363 113176 135123 -159991 40144 92302 -57369 -154337
15704 -154337 197036 126025 8095 74285 -35225 8607 -59651 -42718 -144896 -49868 -46428 160734
15691 -195768 18396 168408 36426 -73801 95222 51252 -27577 -383182 -415595 -67372 -154406
15680 -154406 -164809 59983 335808 -63712 -138898 51022 108558 132040 -11723 254674 126187
15668g359D3521b42609Q4296A08970e2085A78696b29387D24c3179A9099J0467
15657B9566O7399i6629D9865N0819a36526B16217e1533r090B9499a79597d0285
15645c6155A20754D6426R90d3808B35909a23154r5350I4961i0067C70188e8235
15633a60260e390l439j99077h3761k56234e0204A32750a9193o3876H7501D1868
15621b56067m0217A09891c78796a66635J7769k125H6220c52303e9596n277i613
15609C7209P4611l026J06851A04865a17912e6179c604C46217c01660e1769C9579
15597c75753A35270a54857C1218M1146J70782a81016O2401A66697a33490A69407
15586B12075c6332j69506j1897B21891l9704G0710b15160L8201Q5722c1320j42369
$$ plain form
15668 -7359 43521 -242609 -158313 108970 -52085 178696 -229387 424 -33179 19099 29566
15657 29566 96965 -96629 49865 100684 -136526 216217 -51533 -60623 29499 -179597 -40285
15645 -36155 120754 46426 47416 -43808 235909 -123154 -218504 94961 -90067 370188 -58235
15633 -160260 -5390 -8829 -207906 -83761 -339995 -50204 132750 -19193 -83069 87501 41868
15621 -256067 -296284 109891 -378796 -166635 -148866 -150991 86220 -352303 -59596 -64873 -9613
15609 37209 111820 108794 215645 104865 -117912 -56179 -3604 346217 -301660 -51769 39579
15597 -375753 135270 -154857 31218 72364 243146 -181016 -118615 166697 -133490 169407
15586 212075 -36332 -205838 -217735 221891 182187 70710 -215160 -176959 -91237 -31320 -173689
15575a73689B98220f818C7938M3965J21215o7602c5238A84022O8996C7288f6029
15563A22018J67233o0959a58542e7753j2690r4145a2846B252i4145D3134a2216
15551a93325N605L5707G4649e2470H0149a15689d4174b0011q1382E8106Q491a44906
15538D5116h2973B06334c6129k31972i0480q1678D6946a28475D556f6306D32784
15526G1404a74114C75502b1404G5797a52770k9545A17361a696o4216C2848i8861
15514a07793B07937j3838r411f2078C0671K74963g8567j88715D861M4387K9293
15503G8541a63997a7297A31353l9622B8388J24021c7342A16556a50207r2255j7558
15492b60020L7754J10554n2504K5303a413j8097j23844g795C28039a40583q1531
$$ plain form
15575 -173689 298220 -6818 37938 81903 203118 135516 -35238 184022 253018 37288 -66029
15563 122018 289251 228292 -158542 -57753 -70443 -164588 -12846 2252 -94145 43134 -12216
15551 -193325 -187720 -152013 74649 -52470 80149 -115689 -44174 -20011 -101393 58106 66597 -144906
15538 45116 -82973 206334 -36129 -268101 -90480 -172158 46946 -128475 4556 -66306 432784
15526 71404 -174114 375502 -21404 75797 -152770 -182315 117361 -1696 -65912 32848 -98861
15514 -107793 207937 194099 184688 -62078 30671 305634 -78567 -267282 4861 49248 78541
15503 78541 -163997 -17297 131353 91731 28388 152409 -37342 116556 -150207 -242462 -260020
15492 -260020 -222266 -111712 -164216 -138913 -1413 -19510 -143354 -7795 328039 -140583 -222114
15481b22114J10322c8609m9029A70128b79149A63253b92496K4825J13773B84699
15470A17358J57236A35035f0906C2644L32877a44219A97194p0557D6697c6263
15459A3402a91946A54550g8684k09293a5841C10144G152K9705a8518G7589j1175
15448F6414a057j34833A02141i8666I5352a84454m644B7565a33083f2750A60086
15436a03449B17073o4745L22484I3148B3706m284a3194j29613J1352D57755A69160
15424A73713P7882I9517L8801a58985M1082J1426d5266k56133R458B77247a18061
15412A532c59760I8898N6144b5502m5417k31276j39647a7122A1658a12404A5845
15400b43153a18965G4550J69426r2864a27489B50111i2483G887J55371J82398
$$ plain form
15481 -222114 -111792 -38609 -87638 170128 -279149 163253 -292496 -267671 -153898 284699
15470 117358 274594 135035 -60906 32644 365521 -144219 197194 126637 46697 -36263
15459 13402 -191946 154550 -78684 -287977 -15841 310144 7152 36857 -18518 77589 66414
15448 66414 -1057 -135890 102141 -98666 95352 -184454 -189098 27565 -133083 -62750 160086
15436 -103449 217073 152328 474812 93148 23706 19422 -13194 -142807 -131455 457755 169160
15424 173713 251595 99517 138318 -158985 -117903 -106477 -45266 -301399 -291941 277247 -118061
15412 1532 -359760 98898 155042 -25502 -70919 -302195 -441842 -17122 11658 -112404 15845
15400 -243153 -118965 74550 243976 151112 -127489 250111 -92483 7887 163258 345656
15390C45656j56504b13832N2732A51556h9964A11476g3012A1521b4746J0655C4554
15378B5867J41364L9823O2623a57471A69688n1364a56507H6177a3696k11248M4488
15367a80456A70320A104d5763k41713P2382E7546R018Q5112g4253K3706j14527
15356a65074B224a15471c1363D1888L2104b57142A86469i929A09190l1604J07463
15345A85049b5953A46271g0356H1812f744B03547N3697D8335c40897F2133J40319
15334B02452a80007A47272A2555L45670c21622a04353B31997a09904c7012q0425
15324a17437C5506i9688a1803A41998i7749F0845b45153B4761J76086E8317r324
15313D8993k4189J74288c8807B33833b74458a33760F4201l1432d33476G1809a73364
$$ plain form
15390 345656 189152 -213832 -161100 151556 -89964 111476 -73012 11521 -24746 -14091 34554
15378 25867 167231 207054 269677 -157471 169688 118324 -156507 86177 -13696 -224944 -180456
15367 -180456 170320 1104 -45763 -287476 -215094 57546 66564 151676 -74253 -50547 -165074
15356 -165074 2224 -115471 -31363 41888 73992 -257142 186469 -9929 109190 77586 185049
15345 185049 -25953 146271 -70356 81812 -6744 203547 257244 48335 -340897 62133 202452
15334 202452 -180007 147272 12555 358225 -321622 -104353 231997 -109904 -37012 -117437
15324 -117437 35506 -99688 -11803 141998 -97749 60845 -245153 24761 200847 58317 48993
15313 48993 24804 199092 -38807 233833 -274458 -133760 64201 32769 -433476 71809 -173364
15301a9271l55565J53937G9621b0280D14012g8542A08921a41137j89056B0109
15290A41904a19340A43575c0185H3099L38293c29512B25157c29118C9020l212
15280C5808a00163j27556J02947B51505b78416C49100A31997d7932c95A73398
15269D3024i8218G5367K02495J29422H3009l4654L37830o3764n5145k6654p2015
15258A68607J88553h7545A65155J44539A33633K7009D5823J42921N0687M67747
15248G07178N85111k39830o3399K58435D99157k24523O3358b04121K3862A59090
15237B8239m43J87821b6148A5501K55072A05547D5016d7446a2668A25337a50070
15225g6374k2903j01249A75502a63263q3985h1929B68360i1987C86729b54457
$$ plain form
15301 -19271 -374836 -220899 79621 -20280 414012 -78542 108921 -141137 -330193 20109
15290 141904 -119340 143575 -30185 83099 421392 -329512 225157 -329118 39020 35808
15280 35808 -100163 -227719 -124772 251505 -278416 349100 131997 -47932 -395 173398
15269 43024 -98218 75367 277862 407284 83009 48355 386185 322421 267276 240622 168607
15258 168607 357160 -87545 165155 309694 133633 160642 45823 188744 239431 707178
15248 707178 1292289 1052459 989060 1247495 499157 274634 337992 -204121 -180259 159090
15237 28239 27796 215617 -26148 15501 270573 105547 45016 -47446 -12668 125337 -150070
15225 -76374 -99277 -200526 175502 -163263 -247248 -81929 268360 -91987 386729 -254457
15214g0A24244O0125c84629a01190B1868J29051l2335a72493C6783J92474r2618
15203A36639r315n0096g445C55779A05257M8464b30694A88362A6814e2761q599
15192f1360B6963a68044C13608a17385A7051R7918O3395p5446J07433a60782A15634
15180G7739l3169P0673J37745j21724E6469M45351I0322m0452L03209e858j24472
15169a30330B08887i2380K9216A36017j719B4692J40266n9542R0801a5566B30493
15157A76618A0588J48596J826l1973l3241K19185j12885G5464j7765j2638a45501
15145G7180J42841J27116A10305P949K05740G5522k4841J74815J99055i9351G9702
15133c1829B40025B2982b8265A47143K64778a82057A06607J53406E1902P805f6139
$$ plain form
15214 -70 124244 184369 -384629 -101190 21868 150919 118584 -172493 36783 229257 136639
15203 136639 127324 77228 -7445 355779 105257 153721 -230694 188362 16814 -52761 -61360
15192 -61360 26963 -168044 313608 -117385 17051 114969 178364 102918 210351 -160782 115634
15180 77739 44570 115243 252988 131264 56469 501820 90322 49870 353079 -5858 -130330
15169 -130330 208887 -92380 -63164 136017 134298 24692 164958 105416 196217 -15566 230493
15157 176618 10588 159184 161010 129037 95796 314981 202096 75464 57699 45061 -145501
15145 77180 220021 347137 110305 118254 323994 75522 50681 225496 424551 -99351 79702
15133 -31829 240025 22982 -28265 147143 411921 -182057 106607 260013 51902 59707 -66139
15121C06515i909C10170L7358A34810i5542C17278f0136C1251j2060a71609B12062
15109a04664B44186r0737i2913B02074K0208q5546a3501e152A6869L85196a30911
15097H8615J69535N035G7798C3954r73c7638G7172R7155J63363A56269R1468D1429
15084F7898b32919I635P8353Q8828c4772D69141o2481j59397H5153M0039J901
15073A27093a4888p8672C13116a2711F8452J50438J62229f1485I5691M6389J3126
15062A55206B503O8456J61714d807q3306C07816n6447j0935j5702C9080J34879
15051A73959J02724I3555i5864G4618K35002A42733F2865E37L40648a4293B52886
15039A44248i9229A37595F4621K98609e3253A78062N5342A03271a616A31755J15503
$$ plain form
15121 306515 -9909 310170 347528 134810 -95542 317278 -60136 31251 19191 -171609 212062
15109 -104664 244186 153449 -92913 202074 222282 136736 -13501 -5152 16869 402065 -130911
15097 88615 258150 263185 77798 33954 32981 -37638 77172 174327 337690 156269 247737 41429
15084 67898 -232919 9635 87988 176816 -34772 469141 406660 247263 85153 125192 127093
15073 127093 -14888 -93560 313116 -12711 68452 218890 381119 -61485 95691 142080 155206
15062 155206 2503 70959 232673 -4807 -88113 307816 251369 240434 224732 39080 173959
15051 173959 276683 93555 -95864 74618 309620 142733 62865 537 341185 -14293 252886
15039 144248 -99229 137595 64621 363230 -53253 178062 233404 103271 -1616 131755 247258
15028B47258A3344J01124J29806K9803F9857J28079K71972k19913G6205P2516
15018A48721C8744M55508i5614A59895b39176B1449N42333B66295B790J40424
15008A43214M3667r0542O51700A12308P6167J73239A09150K93402r3097Q8644
14998C98099q5281l170a5320B9862g3480D22590j76913J20046H7842J26619O5954
14987B80415l5100K7321A30247l8584K83152J81912j80306j69264L4417j13403
14977A28171B2848O22822k86523A39315R0996I2923J09790K29636A53397K90517
14967D43914i5079D97020B30352G0024K75027j11824J17647j15731q678O8205
14957B94670n3875K60282p7769B01604Q6422m4537j05044J05877J29947L4513
$$ plain form
15028 247258 13344 114468 244274 274077 69857 197936 469908 249995 76205 148721
15018 148721 38744 494252 -95614 159895 -239176 21449 563782 266295 2790 143214
15008 143214 186881 96339 748039 112308 188475 361714 109150 402552 309455 398099
14998 398099 312818 309648 -15320 29862 -73480 422590 245677 365723 87842 214461 280415
14987 280415 245315 272636 130247 91663 374815 556727 376421 207157 241574 128171
14977 128171 22848 645670 359147 139315 230311 92923 202713 432349 153397 443914
14967 443914 -95079 497020 230352 70024 345051 233227 350874 235143 226465 294670
14957 294670 240795 501077 423308 201604 288026 243489 138445 244322 374269 408782
14947D08782o1477j14389J47011a45551A11913J57193d0952B71107N6571o0701
14937B66977N4498K17148j56187A04798J33090M3179A03300E0649N40333j31848
14927D59134m3006j41220L60350c3864D98268j54328M356J62596M1484n58k54259
14916B97559k5687Q7025j71086N6716A05461P3879K80129M5542L8468r5327n0351
14905C97801m0190j01178B7172L34415j6235k4708K9372j21795n4019j8618J16187
14894B71771F0605K04755k0575q753o0619M82970j98833n4129j17490J87964B00373
14882G15626q0992k76536A66503K8350K30064A27844L19827J79677B92891J63642
14872D56533j48848r614J67498o9496K28385l02525J79753M7429j10305O2183
$$ plain form
14947 408782 347305 232916 379927 -145551 111913 269106 -40952 271107 327678 266977
14937 266977 321475 538623 382436 104798 237888 281067 103300 50649 590982 459134
14927 459134 416128 274908 635258 -33864 498268 343940 348296 510892 552376 551818 297559
14916 297559 271872 358897 187811 244527 105461 179340 459469 505011 543479 448152 397801
14905 397801 357611 256433 27172 361587 345352 320644 350016 228221 174202 155584 271771
14894 271771 60605 265360 244785 236032 175413 658383 459550 405421 287931 475895 200373
14882 715626 634634 358098 166503 194853 424917 127844 447671 627348 292891 456533
14872 456533 307685 298071 465569 396073 624458 321933 501686 549115 438810 500993
14862E00993A89635J44697Q2943j70389J38009O6936J56422j99238n0619J7622
14852C76018J1559M8972J32816k83629K93067j30789n5736L39428k35013B03998
14841B04840K87203j92990K23835A93552J89771j11415L03638k40678J15711K62320
14831G12899j68320j08183L4888j01650L32435j66794J48680A36163O51801l08654
14821D79310j80629k1773K77070k11083O1139J90937J42393q3932q7053n3022
14811E13357k45138M32079k96441M50775k79696J0869j45895p3959J40195p5770
14801D30376J61758l7981k34813j05613K67545J59405j19951M2817J86368l70266
14791C79645L91325l66092K23996L6337j56275A99224N07153k70045k7773m5238
$$ plain form
14862 500993 189635 334332 417275 246886 384895 451831 608253 409015 358396 376018
14852 376018 387577 436549 569365 285736 578803 448014 392278 731706 496693 203998
14841 204840 492043 299053 522888 193552 383323 271908 575546 334868 450579 712899
14831 712899 544579 436396 471284 369634 702069 535275 683955 136163 787964 479310
14821 479310 298681 276908 553978 342895 404034 594971 737364 653432 566379 513357
14811 513357 268219 700298 403857 854632 574936 585805 439910 365951 506146 430376
14801 430376 592134 554153 319340 213727 481272 640677 520726 563543 749911 379645
14791 379645 770970 404878 628874 665211 508936 199224 706377 436332 408559 363321
14781C63321r8467r9403L31109L97164q8761C75386K85868j30193j30789J4763
14771D15035K15571J7397m558R9642p2024j42971K34795Q9220o6764j41938l1131
14760F12274N0079L60812J1052j27554j31236k20486R4393j39014J78464J38804
14750H27588j20178j36339L6256M15983l29458K0072j6170N4040k47541K78131
14740G82384j41049K64530J09611l53402n0410Q1318n0312J20929K46k5329j61918
14729E76598J16289j44820l7489L10353K78540n19664M83104l64709J81227l01168
14719E78261L95028M5299m4788j38601J2341J0572k13723L47280n4384M7488k16493
14708G68280L4775M06917l82022q2340K50674l1647M3805j46061L42906k79791
$$ plain form
14781 363321 264854 165451 496560 893724 804963 375386 661254 531061 400272 415035
14771 415035 630606 648003 643445 743087 671063 528092 762887 852107 785343 643405 612274
14760 612274 662353 1023165 1034217 906663 775427 554941 649334 510320 688784 827588
14750 827588 707410 571071 607327 1023310 693852 713924 697754 751794 504253 782384
14740 782384 641335 905865 1015476 662074 611664 692982 642670 763599 763845 738516 576598
14729 576598 692887 548067 510578 820931 1099471 579807 1062911 698202 879429 578261
14719 578261 973289 1018588 973800 835199 847540 858112 644389 991669 937285 984773 768280
14708 768280 803055 1209972 827950 745610 996284 964637 1008442 862381 1205287 925496
14698I25496k22751K12207j596J14081p6895K51543l44897L14640k80262l8547
14688H53019K26260m34648j2429O04521o2528l8273o6090p0948K2898J60033j25227
14677A056588E11142N51146P4145j01172q0381m9646M8085K70806j49486j78681
14667H95958r4919R6659J64798J73839p6606p5218K17221K52943n23124K04297
14657A235848l3091j18156r2692K06794m8807K41471l35471J33082q3347J30929
14647A236560J49231Q3226k30771K2076m0254o2986q207j18834L60400j95463
14637A194978M27658l52113J3917J4624R9838k96344L51124o2155J24549k92231
14627A223845j21880J89207K84326k12994j82991N39606n60629K73334J03259
$$ plain form
14698 925496 702745 914952 913356 1027437 950542 1202085 857188 1171828 891566 853019
14688 853019 1079279 644631 632202 1236723 1174195 1135922 1069832 998884 1021782 1181815 1056588
14677 1056588 511142 1062288 1136433 1035261 954880 905234 953319 1224125 1074639 895958
14667 895958 801039 897698 1062496 1236335 1159729 1084511 1301732 1554675 1031551 1235848
14657 1235848 1202757 1084601 991909 1198703 1149896 1391367 1055896 1188978 1105631 1236560
14647 1236560 1385791 1469017 1238246 1260322 1220068 1157082 1148875 1030041 1390441 1194978
14637 1194978 1622636 1270523 1284440 1299064 1398902 1102558 1453682 1391527 1516076 1223845
14627 1223845 1101965 1291172 1575498 1362504 1179513 1719119 1158490 1431824 1535083
14618A535083o0733O0655J30651m0681l9867j72572O5092J41181N1364l45814
14608A324359N11589j81797J17506k58398o578K16152R4804j9084R7211Q9086
14598A984850m2231j86335Q8188N7138l41581K16185R0465J23480l69575k81J71858
14587A792161J2111J69759j9446J58483J32880p6987l09996n3240L19852J88893
14577B314470m37066M12566Q4495m13951J91232K6222l2710K27730o1917k74962
14567B036109O09802j72284k58269L94328l60076O47753p4178m2951K34390J40191
14557C154815j22951L09577l1214L32214j1177N42220N43523R15350J666340M446129
14547A1744826Q293879J8472962J0891631B4564912H732751m312587j436145o57138
$$ plain form
14618 1535083 1474350 1535005 1665656 1624975 1585108 1412536 1477628 1618809 1670173 1324359
14608 1324359 1835948 1654151 1771657 1513259 1506681 1722833 1817637 1798553 1895764 1984850
14598 1984850 1942619 1756284 1844472 1901610 1560029 1776214 1866679 1990159 1620584 1620303 1792161
14587 1792161 1804272 1974031 1954585 2113068 2245948 2168961 1858965 1805725 2125577 2314470
14577 2314470 1877404 2289970 2374465 1960514 2151746 2177968 2145258 2372988 2311071 2036109
14567 2036109 2645911 2473627 2215358 2609686 2249610 2897363 2823185 2780234 3014624 3154815
14557 3154815 3031864 3341441 3310227 3642441 3631264 4173484 4717007 5632357 7298697 11744826
14547 11744826 20038705 38511667 49403298 24564912 8732751 4420164 2984019 2326881
14539B326881j37613k70383j64763K24869j1266j43387L77222M9030j7905K17555
14529B450240n01574M34530R3793R2176m02439K72847J81512k98557P3331J0993
14519B406852L91239k83745K79308M4891j58861J61381J17156r7888J34382p0369
14509B924346j97202J51301J92819p321J94573J83283l79311J57885l36788M77003
14499C360588j20181J31278J65322q7599O0571k54330K47342k32214J94888L34470
14489C800135j17381J16932k69748L94235j11403L58533l38271J49196K2043j27495
14479C876776L7313J60706l07772L23430P1389L48729l56886J27327O2778J8374
14469D362164k9667k39590K87861K82956l5178L41222N4420J16324l36597K1629
$$ plain form
14539 2326881 2189268 1918885 1754122 1978991 1967725 1824338 2201560 2250590 2232685 2450240
14529 2450240 1948666 2383196 2476989 2569165 2166726 2439573 2621085 2322528 2395859 2406852
14519 2406852 2798091 2514346 2793654 2838545 2679684 2841065 2958221 2860333 2994715 2924346
14509 2924346 2727144 2878445 3071264 3063943 3258516 3441799 3062488 3220373 2883585 3360588
14499 3360588 3240407 3371685 3537007 3449408 3509979 3255649 3502991 3270777 3465665 3800135
14489 3800135 3682754 3799686 3529938 3924173 3812770 4171303 3833032 3982228 4004271 3876776
14479 3876776 3914089 4074795 3767023 4090453 4161842 4510571 4153685 4281012 4343790 4362164
14469 4362164 4332497 4092907 4380768 4663724 4628546 4969768 5024188 5140512 4803915 4825544
14459D825544M55160k27257J37102K66012j85117m32325N42681j0027J83037K45844
14449E800654l44532L45935j37180N67228n4819j17873K4159J94818J00976J15678
14439F495044l00530N28826o8972J19600k2357L4914J65772P8505K59335n9297
14429G230840n9860j20739O28974j88321L25232J04493o748K54320j07421m8077
14419H012693J47362J65272J54511J61166P1857J13138J47886J32358R6141o6740
14409I135644J96595O19589k31609J7626O56801j04305m4704R6064L31142J204
14399A0674047N17931O3347M20341k31334L25905J81440K57766J79324J72455
14390A2561222L37500K86871j83878N53525n7527O36471l21982N09736l04871
$$ plain form
14459 4825544 5280704 5053447 5190549 5456561 5271444 4839119 5381800 5371773 5554810 5800654
14449 5800654 5456122 5802057 5664877 6232105 6177286 6059413 6083572 6278390 6379366 6495044
14439 6495044 6194514 6723340 6654368 6773968 6751611 6786525 6952297 7030802 7290137 7230840
14429 7230840 7170980 7050241 7679215 7490894 7816126 7920619 7913871 8168191 8060770 8012693
14419 8012693 8160055 8325327 8479838 8641004 8712861 8825999 8973885 9106243 9202384 9135644
14409 9135644 9332239 9951828 9720219 9737845 10394646 10290341 10245637 10341701 10672843 10674047
14399 10674047 11191978 11255325 11675666 11444332 11770237 11951677 12209443 12388767 12561222
14390 12561222 12898722 13185593 13001715 13555240 13497713 14134184 13812202 14321938 14017067
14381A4017067R32499K90147Q7761K55932K59294L62519M50174J76371N51201
14372A7382965K07885L14909M20655m257Q01849M75878J53707O48577P3988M74879
14362B0951035N41569O4661J108453J82914L91920P95316N22719N29444L32805
14353B5420836P17229N39330J092745M62907K92460J094800N98738R39248M14378
14344C1572671J172998O18580J048771Q51139M36264J380698J110709J173131
14336C9364961N80032J762744R14503J400512J301437J106476J471925J452864
14328D9355454J340457K030521J429133J919952J921859J668408K212973J842350
14320F3721107K288605K396477K725668K509973K445335K629615L549557L025704
$$ plain form
14381 14017067 14949566 15239713 15327474 15583406 15842700 16205219 16655393 16831764 17382965
14372 17382965 17590850 17905759 18326414 18322157 19124006 19599884 19753591 20402168 20476156 20951035
14362 20951035 21492604 21557265 22665718 22848632 23240552 24035868 24558587 25088031 25420836
14353 25420836 26138065 26677395 27770140 28233047 28525507 29620307 30219045 31158293 31572671
14344 31572671 32745669 33364249 34413020 35264159 35700423 37081121 38191830 39364961
14336 39364961 39944993 41707737 42622240 44022752 45324189 46430665 47902590 49355454
14328 49355454 50695911 52726432 54155565 56075517 57997376 59665784 61878757 63721107
14320 63721107 66009712 68406189 71131857 73641830 76087165 78716780 82266337 85292041
14312H5292041L254494L316947L950798M156658L881224M761477M144603M784907
14304A17543149N474227N777702N407097O029211O713028O920080P724813P435082
14296A69024389Q328232Q420325R354226R660157J0176211J0760875J1120301
14289B36844716J1814120J2160007J2986139J3270634J3800699J4071288J4441413
14282C29389016J4591064J4570366J4480486J4307938J3638623J3068874J1997380
14275D26043747J0775150R252746O933128J849256J73761R06661N81684j564425
14267D54951708j593403n072549p756221r640130j1219198j1796409j2670132
14260C95203666j4355291j4625966j5320762j5033740j4811629j4381009j4069510
$$ plain form
14312 85292041 88546535 91863482 95814280 99970938 103852162 108613639 112758242 117543149
14304 117543149 123017376 128795078 134202175 140231386 146944414 153864494 161589307 169024389
14296 169024389 177352621 185772946 195127172 204787329 214963540 225724415 236844716
14289 236844716 248658836 260818843 273804982 287075616 300876315 314947603 329389016
14282 329389016 343980080 358550446 373030932 387338870 400977493 414046367 426043747
14275 426043747 436818897 446071643 453004771 454854027 455027788 455934449 456516133 454951708
14267 454951708 453358305 448285756 440529535 430889405 419670207 407873798 395203666
14260 395203666 380848375 366222409 350901647 335867907 321056278 306675269 292605759
14253B92605759j3613098j3422290j3003394j2129094j1538358j1297417j0713831
14246B06888277r747325r388305q664153q222964p722910p620382p159566o675719
14238A41686953n731422n788866n945826n400700m613322m954757m299208l904850
14230A01048002l779457m082227l745086l568350l329250k901501l045545k352713
14222G4243873k850533k108046k339530k614678j917219k231341j855538k009574
14214E6317414j199352j791034j654446j823828j691195j355650j183384p62054
14206D4856471j254185j533726j206313j266262j187127o76139p63765q42521
14198C6126433j419072q92934j018678o57709r06148m79691o62999q66269p13703
$$ plain form
14253 292605759 278992661 265570371 252566977 240437883 228899525 217602108 206888277
14246 206888277 197140952 187752647 179088494 170865530 163142620 155522238 148362672 141686953
14238 141686953 135955531 130166665 124220839 118820139 114206817 109252060 104952852 101048002
14230 101048002 97268545 93186318 89441232 85872882 82543632 79642131 76596586 74243873
14222 74243873 71393340 69285294 66945764 64331086 62413867 60182526 58326988 56317414
14214 56317414 55118062 53327028 51672582 49848754 48157559 46801909 45618525 44856471
14206 44856471 43602286 42068560 40862247 39595985 38408858 37732719 36968954 36126433
14198 36126433 34707361 33814427 32795749 32138040 31231892 30752201 30089202 29222933 28509230
14189B8509230j000774n48510m90164n73416m41224j065382M2583p67191n91253
14180B3073899m42090m28897n03698n88349r0596n22918o82203r4080l05734o32106
14170A8783228n46649l00457M8059q02567j07376k87670k20004l99845j75823
14161A5990896l67744j02113o17997k9841l19325m10766K235k3219n25354j50153
14151A3446619n84437K7616q5446l70515l26096P9524m56756l55339L02808l20240
14141A1357738k39832J34292n83855L728m3474l98801O00j95225j08954j11044
14131I815173j74237m88491p3637r3719j04755q4086J90462l55699r7881j86264
14121H346866j56172M3073J31913R335n03913j40904L3156j97644l75259N7279
$$ plain form
14189 28509230 27508456 26959946 26469782 25896366 25455142 24389760 24432343 23665152 23073899
14180 23073899 22631809 22202912 21699214 21110865 21020269 20497351 19815148 19721068 19415334 18783228
14170 18783228 18236579 17936122 17984181 17181614 17074238 16786568 16566564 16166719 15990896
14161 15990896 15623152 15521039 14903042 14873201 14553876 14143110 14145345 14122126 13596772 13446619
14151 13446619 12862182 12889798 12804352 12433837 12107741 12187265 11730509 11375170 11677978 11357738
14141 11357738 11117906 11252198 10668343 10672071 10628597 10229796 10230396 10035171 9926217 9815173
14131 9815173 9640936 9152445 9078808 8985089 8880334 8796248 8986710 8631011 8533130 8346866
14121 8346866 8190694 8233767 8365680 8375015 7871102 7730198 7763354 7565710 7190451 7247730
14111G247730j30455j40385l9218K76197n09427M08170o5776n04292R7039J31475
14101F771058j41761J85460o08835K8648j08808j0204M1973k6177J1895l97316
14091E745933P7132r5846J9535j59587j58717j87725J29006l81212J77213Q5160
14081E250892j91734M71246P2922n87308l9062l58537P2496j59955R5263j89061
14071D437162J14399o9243J75143j74653J09175n8201j90202J43405k71989L48827
14061D563823k94175L2826j15551L7548O2987l93807J35152l5506j96349J30612
14051C927560n4568r9355k02182N0165K0889j59155j64024J52396M7312M6918
14041C565956J07141m24324K37689m42244K5354M544K13742j61689N53555m21281
$$ plain form
14111 7247730 7117275 6976890 6937672 7213869 6704442 7112612 7046836 6542544 6639583 6771058
14101 6771058 6629297 6814757 6205922 6234570 6125762 6115558 6157531 6131354 6143249 5745933
14091 5745933 5823065 5727219 5746754 5587167 5428450 5240725 5369731 4988519 5165732 5250892
14081 5250892 5059158 5530404 5603326 5016018 4976956 4618419 4690915 4530960 4626223 4437162
14071 4437162 4551561 4482318 4657461 4482808 4591983 4533782 4343580 4486985 4214996 4563823
14061 4563823 4269648 4302474 4186923 4224471 4287458 3893651 4028803 3993297 3796948 3927560
14051 3927560 3872992 3773637 3571455 3621620 3642509 3483354 3319330 3471726 3519038 3565956
14041 3565956 3673097 3248773 3486462 3044218 3069572 3074116 3287858 3126169 3679724 3258443
14031C258443l76433O0478K71443O9063l10761J58092k58207k6184J65275m7927
14021B963282m15660N047K72424J10034N0628R5277k09825Q3131j02523k27771
14011B624044j2669q604J70123m18062J73184l59173K74038j42060j09737J65608
14001B356692J36991j80111j29875q6804J57143r8754J94026k26754J9100L04546
13991B446200p140J55707R02231K605768P048669J7630047J8666290j9172324
13983C0275448A4148180o182681j866686r13746n44440q65428l94139k49981O4502
13974C195581k77120M40389o35377r0669L64287j83529l24946J1676Q7331l31760
13964B255863j36051J96749J15237n24442M11903l89056K71870k0106K72134n43620
$$ plain form
14031 3258443 2882010 2942488 3213931 3282994 2972233 3130325 2872118 2845934 3011209 2963282
14021 2963282 2547622 2552669 2825093 2935127 2985755 3081032 2871207 2954338 2851815 2624044
14011 2624044 2611375 2602771 2772894 2354832 2528016 2168843 2442881 2300821 2191084 2356692
14001 2356692 2493683 2313572 2183697 2096893 2254036 2155282 2349308 2122554 2141654 2446200
13991 2446200 2439060 2594767 3496998 6102766 13151435 30781482 49447772 30275448
13983 30275448 14148180 7965499 6098813 5185067 4640627 3775199 3381060 3131079 3195581
13974 3195581 2918461 3358850 2723473 2632804 2997091 2813562 2488616 2500292 2587623 2255863
13964 2255863 2119812 2316561 2431798 1907356 2319259 1930203 2202073 2181967 2454101 1910481
13954A910481k7721j15788N86465l91975R2858o1852P9705P1851r8859n2582L40249
13943B332832n95379J09979j71860L11392J2301n48394N02458j43050J76231o6307
13933A920203J3291k22146K37976l6164j85271M2224o4780K19J97350k61257Q6566
13922A728211k52621O54136m32741R4608n2107R6505n49812N62677P2554l54465
13912A566945l41593J65742L26444m95675L78523j80853K21490j68645j57954
13903A314424L4109R3234O36m0486N6983o0396L32931l26362j27975J22237J0483
13892A409818M40017l21353j20049m0572M0760j15798R5633j56427R5454l762
13882A323721m49638O33165N8766k05054n239k7139Q4615o2989R2761k67323L02537
$$ plain form
13954 1910481 1882760 1766972 2353437 1961462 2054320 1992468 2072173 2144024 2045165 1992583 2332832
13943 2332832 1737453 1847432 1675572 1986964 1999265 1450871 1953329 1810279 1986510 1920203
13933 1920203 1933494 1711348 1949324 1913160 1727889 1770113 1705333 1705552 1902902 1641645 1728211
13922 1728211 1475590 2129726 1696985 1791593 1739486 1835991 1286179 1848856 1921410 1566945
13912 1566945 1225352 1391094 1717538 1221863 1600386 1419533 1641023 1472378 1314424
13903 1314424 1348533 1441767 1442403 1401917 1458900 1398504 1731435 1405073 1277098 1399335 1409818
13892 1409818 1849835 1528482 1408433 1367861 1408621 1292823 1388456 1232029 1327483 1323721
13882 1323721 874083 1507248 1566014 1360960 1355721 1328582 1413197 1350208 1442969 1175646 1478183
13871A478183j25847j88502J64175j24535Q9927J54424m14525Q4311L53437l78994
13861A092054k5415L74706k99128p7215J61998k59459P8446N9487n1403J83975
13851A238046p8784k14006L4584q1846J11643J90381m80861N39105Q967l70188
13841H97041K45387m10919M10742m5715K08838k40744j95536J42654M2938j04768
13831I49918J37827l45200l6714M0684N07138k31986J93103E52958O53222k87603
13821I18577q5417K88647m64932K45607K50852o7286J36462q6611k80386j41171
13811G14342J36943L33628l50691L4538K97999n6305l66469m2151O0636J39372
13801I01842j18826k89719J14077K6276O4970R8300P0408j08535p2293L09415
$$ plain form
13871 1478183 1352336 1163834 1328009 1203474 1293401 1447825 1033300 1117611 1471048 1092054
13861 1092054 1066639 1441345 1142217 1065002 1227000 967541 1045987 1105474 1054071 1238046
13851 1238046 1159262 945256 979840 897994 1009637 1200018 719157 1258262 1267229 897041
13841 897041 1142428 731509 1142251 1096536 1305374 1064630 869094 1011748 1054686 949918
13831 949918 1087745 742545 705831 746515 1253653 1021667 1214770 552958 1206180 918577
13821 918577 833160 1121807 656875 902482 1153334 1086048 1222510 1135899 855513 714342
13811 714342 851285 1184913 834222 868760 1166759 1110454 743985 701834 762470 901842
13801 901842 783016 493297 607374 633650 698620 796920 867328 758793 686500 995915
13791I95915j41103P791p3031k13520J56195J06627o4461p4559Q7132J62787j91133
13780G58640j47979J23534j93360M49984j77757L6476j5556j19495J5907k93831
13770D36563K59544m9229K55938l23711J65342j88011J61907J95029M2539m37321
13760E18590J30244K23204m7343j87657l528K60411L9930j63387o6853r9648J32058
13749G36021k1466j55946j26020M12526q4003j52047o173k04427L90130M2929
13739H31524l10944O1395k52347L71164k71637K91953j24333k9089G3666M54640
13729E28306J67279j16373k5423L71365m34256L98427J30835l16774k70532n962
13719D26892K16934j28986K05901j6033k38711K79840l58218M24585j92461Q959
$$ plain form
13791 995915 854812 862603 789572 576052 732247 838874 774413 699854 786986 949773 758640
13780 758640 610661 734195 540835 990819 813062 849538 833982 714487 730394 436563
13770 436563 696107 646878 902816 579105 744447 556436 718343 913372 955911 518590
13760 518590 648834 872038 824695 637038 633510 893921 933851 770464 703611 603963 736021
13749 736021 714555 558609 432589 845115 761112 609065 602892 398465 788595 831524
13739 831524 520580 581975 329628 700792 429155 721108 596775 567686 73666 528306
13729 528306 695585 579212 553789 925154 490898 889325 1020160 703386 432854 426892
13719 426892 643826 514840 720741 704708 465997 745837 387619 812204 619743 628702
13709F28702j31450J17699r1413m1649J23498j05212n4500n1110J42526O9422
13699F06513j86397K81818k12456K13632m2704J12863j53927j72252k783j02329
13689C41978N6056q6256M10791p1319n930k07593R3256A95203M71812O261C19526
13677F40664o8424J21080j73457L66152D33667Q8061J30933l14268J11369j5804
13667D33958L05422j59891j1452l8484n5124K21913J67778j93210j25085k18989
13657C26836j6873K17215L6454K5378j62212j30258J27745l8155k8541J22128
13647D79717r7010q0513K47713q0431k0212J76041B53333M92024j02642k0458
13637F22257k71111o5546L20873A39277L82549j00558j46461J70762R8891j73743
$$ plain form
13709 628702 497252 614951 523538 481889 605387 500175 445675 394565 537091 606513
13699 606513 420116 701934 489478 703110 660406 773269 619342 447090 444307 341978
13689 341978 398034 311778 722569 651250 645320 437727 530983 195203 667015 673276 319526
13677 640664 572240 693320 519863 886015 433667 521728 652661 338393 449762 433958
13667 433958 739380 579489 568037 529553 474429 696342 864120 670910 545825 326836
13657 326836 309963 527178 563632 589010 426798 296540 424285 386130 357589 479717
13647 479717 382707 302194 549907 469476 449264 625305 253333 745357 642715 622257
13637 622257 351146 285600 606473 139277 521826 421268 274807 445569 544460 370717
13627C70717k8446q6880J26980J25501J33972B67645q8649L17731B39867P1339
13617C11206K7448l8575p3443l0620K42589K98923C64089J46102J096E4358K35604
13606B89962P0688q5993J64787j27371m3932J39033e1207B28786R4272K63058
13596E86116N8330J17318l08794P0747k39369R4424j25660L98738k63470j78074
13586B10306j04216J22821n0457H7977J63154L828e7193A03989L60515J7792j32688
13575C49608J17341K06213k2813N718j64792L75356B53004K73581o8760A27187
13564C84731j43794Q9810J89471D8005K90779J98484A76077K70582P050j69868
13554B83841r9544L56895j33478o9534M308J62926j74693K8537n2448q9585K92392
$$ plain form
13627 370717 342271 255391 382371 507872 641844 267645 178996 496727 239867 311206
13617 311206 338654 300079 226636 196016 438605 737528 364089 510191 511287 54358 289962
13606 289962 360650 274657 439444 312073 268141 407174 -51207 228786 323058 586116
13596 586116 644446 761764 452970 523717 284348 378772 253112 651850 388380 210306
13586 210306 106090 228911 178454 87977 251131 254959 -57193 103989 464504 482296 349608
13575 349608 466949 673162 650349 656067 491275 866631 253004 526585 457825 127187
13564 384731 240937 330747 520218 48005 338784 537268 176077 446659 453709 283841
13554 283841 184297 541192 407714 338180 342488 505414 330721 359258 306810 217225 509617
13543E09617j23054K99539B14764R9058j8497J44160n7402j77714J05593P960
13533C17922K86480k45430R3451B02987K33451k10314J46476J2161l1992A07823
13522B2910M36648A56934J91350J89431B63823m0057J53606m9368j38881N6140
13512B45263Q533I1576L09859P8753l4027I6651J53672J85124q6397K60641k21367
13501C88324J93827A34678k2512J34650J62502j78995O0657n6076J47078H4787
13490C30003h01E44168j29728J2587B06448h5939C34067p5710E0312N8294n2617
13479E5989L67123j11536A18406n2103K24884J61874p1611k0863J41148A81834
13468c9216B76980O0982K58337A42443L7854k0223J67171j24895j8063K24247
$$ plain form
13543 509617 386563 686102 214764 313822 295325 439485 382083 204369 309962 317922
13533 317922 604402 358972 452423 202987 436438 226124 372600 384761 352769 107823
13522 22910 459558 156934 348284 537715 263823 223766 377372 328004 189123 245263
13512 245263 253796 91576 401435 480188 446161 96651 250323 435447 349050 609691 388324
13501 388324 582151 134678 112166 246816 409318 230323 290980 234904 381982 84787
13490 330003 -801 544168 414440 427027 206448 -85939 334067 258357 50312 108606 55989
13479 55989 423112 311576 118406 66303 291187 453061 381450 360587 501735 181834
13468 -39216 276980 337962 596299 142443 180297 160074 327245 202350 184287 408534
13458D08534j78054Q8207p6979c5820F6661O11397l37201J34345A74243J83727
13448C57970A97L69244q1511j24952K9739P5237A28800m6618M21265H1704K12078
13437B93782A12060M57190A65845a00892c9329A98813J5363o5352L4596o3792
13427A19628L52109m1317A40949a323C63679A66756n2253K61591O2542A1643K66717
13416B78360Q2061A14776K49704l2608o2515d2117D5489K02036b77159A72274
13405D3377M43293G7056c1467C09133m2653j01388K05877j43182A1086a03111
13394A78051m7930K06234o6368k7762F4913a32560A18462a81553D49280j37447
13384C11833q2028N402E1991J07246F7994K42867m2166N7405l9745a5066B77524
$$ plain form
13458 408534 230480 318687 241708 -35820 66661 678058 340857 475202 174243 357970
13448 357970 197 369441 287930 162978 192717 267954 128800 82182 503447 81704 293782
13437 293782 112060 569250 165845 -100892 -39329 198813 214176 148824 183420 119628
13427 119628 471737 430420 140949 -1323 363679 166756 114503 376094 438636 11643 278360
13416 278360 360421 114776 364480 331872 269357 -42117 45489 247525 -277159 172274
13405 43377 486670 77056 -31467 309133 266480 165092 370969 227787 11086 -103111
13394 178051 130121 336355 269987 242225 64913 -132560 118462 -181553 449280 311833
13384 311833 229805 235207 51991 159237 67994 310861 268695 326100 286355 -15066 277524
13372C95603j06397J54671H2869K98069A55005n7507P9262G5013a8978A56149
13361A16182D0568J32804n0832b10530C01331m5475J58691o3190G1333N5979J64432
13350B91744m3181j07625N6485n3153J44138K40083A4690N54694j15721o1705
13340C91958o4532K80731A48953J0129N1210K90823q3173H7771B6332J34008K66357
13329D26697k12652L12996A35007L3004M2146n5122m3686L50031N7923j61286
13319C58017q5935p0672K10387e6284D85150a8475A98692o664r0419c09925B83379
13307C23650J40314A801M9269K83695F4613L9870K05380b5410C11332c49869B8119
13295B31495A9931c0823A87339M0069D6224Q2502E4190J72749Q1545A46277A3207
$$ plain form
13372 395603 289206 443877 82869 380938 155005 97498 176760 75013 -18978 156149
13361 116182 40568 173372 122540 -210530 301331 255856 414547 351357 71333 127312 291744
13350 291744 248563 140938 197423 144270 288408 528491 14690 569384 453663 391958
13340 391958 327426 608157 148953 159082 210292 501115 417942 87771 26332 160340 426697
13329 426697 214045 527041 135007 168011 210157 155035 111349 461380 519303 358017
13319 358017 272082 201410 411797 -56284 485150 -18475 198692 192028 101609 -309925 283379
13307 323650 463964 1801 51070 334765 64613 104483 309863 -25410 311332 -349869 28119
13295 231495 19931 -30823 187339 227408 46224 128726 54190 226939 308484 146277 13207
13283g6008B51381Q6856C7785J33678N2605L53276b6780D71331I93J23635a32685
13271A80737J13974j09844k9912N9663l9945h6889F7477g7867B85510j04726k3030
13260A57754N06008F3872K15832A05896K35779q530Q796c6024I2254j6834A4298
13248B15870k0907P3275B4265J45507m9457d9236A49233D6139N15658A96424g1111
13236D0649J79825b75231J32604B26727r1792J63133e8216F1549M138P0386o7769
13225F8304J82511D3282J59411H4893J01632a04447A49952J47321q5816a349C00664
13213D31456D5380j2944a76400A86485P4862m549F1278M2245J75054G8467K26683
13202C05150o8508A05877a68077H0995L19668A78968J13681j34469i9147G1383
$$ plain form
13283 -76008 251381 338237 37785 171463 224068 577344 -26780 471331 993 124628 -132685
13271 180737 294711 184867 154955 214618 174673 -86889 67477 -77867 285510 180784 157754
13260 157754 663762 63872 279704 105896 341675 333145 341941 -36024 92254 75420 14298
13248 215870 194963 268238 24265 169772 120315 -49236 149233 46139 561797 196424 -71111
13236 40649 220474 -275231 -142627 226727 134935 298068 -58216 61549 65687 136073 68304
13225 68304 250815 43282 202693 84893 186525 -104447 149952 297273 211457 -1349 300664
13213 431456 45380 32436 -176400 186485 261347 256798 61278 103523 278577 78467 305150
13202 305150 236642 105877 -168077 80995 400663 178968 292649 158180 -99147 71383
13191A99943B3044R9595d5281A06975a95519F4961h051o4400j39944a8328H0889
13179B9945J65046P4093p9745J6152g8578K5250B12019F2243J18436a81338G1425
13167D96872c4492A32687c0758R423A13204b549l2853H1452c59577I0417R709
13156A00126J60162I8064a58972B48495r4176P653Q4890a73973I2539J0644b4947
13144B34797q7237N4520K7685q9761a2908I4862R1940d2632C71943d26937C5942
13132D00066a10307p3033A57006c55705c5395j6254r4537C14029a85727C5610
13121I0601L31000F1096K19010N0434b43437G7773N2654R0811h425A75554L33503
13110E09057f4540q9573b2932B82232Q5031p7972g7838l3117A9567b82701M6589
$$ plain form
13191 199943 23044 122639 -45281 106975 -195519 64961 -8051 -72451 -212395 -18328 80889
13179 29945 194991 269084 189339 205491 -78578 -53328 212019 62243 180679 -181338 71425
13167 496872 -34492 132687 -30758 -21335 113204 -2549 -35402 81452 -359577 90417 100126
13156 100126 260288 98064 -158972 248495 154319 161972 246862 -173973 92539 103183 -24947
13144 234797 147560 202080 229765 140004 -12908 94862 186802 -42632 371943 -426937 35942
13132 400066 -110307 -183340 157006 -355705 -35395 -51649 -146186 314029 -185727 35610
13121 90601 421601 61096 280106 330540 -243437 77773 130427 221238 -8425 175554 509057
13110 509057 -64540 -154113 -22932 282232 367263 289291 -77838 -110955 19567 -282701 -236112
13099b36112e1353A14748j8485J24048g9351A92437a6724B50456O1025D1105R5864
13088A36969R1267E1443K0062b0588A48331a3493G2041K70593i046I8619J78347
13077B76966p2668A797L37791B8324L283b71809C11598a31800G9431e216A73591
13065E0360b1301k37087D2407K30709j07997b1528A97384b67140a8000j28383
13055a46383f6161b6544A94295O7265b8324E8544J30154p1693K37460E7290b85327
13043B35906E835J16762J4818n434K5114L80117k48782H0416P8175N5198a8967
13031A06824f5020A94602J17769j38547n274l8989l296J64926e6587B42990m7352
13020A95638L7523H4353k0096M66572A3227g0149p7910B6231A2752R2057J58368
$$ plain form
13099 -236112 -51353 114748 96263 220311 -79351 192437 -16724 250456 311481 41105 136969
13088 136969 228236 51443 71505 -20588 148331 -13493 72041 342634 -9046 98619 276966
13077 276966 204298 1797 339588 28324 31607 -271809 311598 -131800 79431 -5216 173591
13065 50360 -21301 -258388 42407 273116 165119 -21528 197384 -267140 -18000 -146383
13055 -146383 -66161 -26544 194295 261560 -28324 58544 188698 117005 354465 57290 -285327
13043 235906 5835 122597 137415 131981 157095 537212 288430 80416 158591 213789 -18967
13031 106824 -65020 194602 312371 173824 168550 129561 126265 291191 -56587 242990 195638
13020 195638 233161 84353 64257 530829 13227 -70149 -148059 26231 12752 104809 263177
13009B63177b6338j05905C23833j26791f0434m0651C05668j14919J6877h8152
12998A30129a96088A13501m8158a46280B79726m2229a89503e5444P179H0346a08040
12986B8668Q2936P8609d1308j79482g3930n7172A45313K6526J25773j5621a24320
12974b83112c0954A57870D4509N0295K1484K39881j64649F5437f0746j9347c5000
12962A88226H0110g4716I9793J52622A04225K0435J923M5042N4766p1512F0418
12950H0825L601g641I1882O8371a04734A41378O6713I8050J1455a59104e877l1137
12938c7014H7515c95273B5787K14667F2178b8152j61565B2217a10935j17380D5419
12926C2251c2284I4565a26006E9802a9602j6620C52673c7672k39745f6990B1336
$$ plain form
13009 263177 -26338 -132243 323833 197042 -60434 -101085 305668 190749 207626 -88152
12998 130129 -196088 113501 65343 -146280 279726 237497 -189503 -55444 -48265 80346 -108040
12986 28668 111604 190213 -41308 -220790 -73930 -131102 145313 171839 297612 281991 -124320
12974 -283112 -30954 157870 44509 94804 116288 356169 191520 65437 -60746 -80093 -35000
12962 188226 80110 -74716 99793 252415 104225 124660 126583 171625 226391 154879 60418
12950 80825 84426 -7641 91882 160253 -104734 141378 208091 98050 109505 -159104 -5877 -37014
12938 -37014 87515 -395273 25787 240454 62178 -28152 -189717 22217 -110935 -228315 45419
12926 32251 -32284 94565 -126006 59802 -19602 -36222 352673 -37672 -277417 -66990 21336
12914a66521A20097b12052A75177q5904C8974N9289e1971k8958p925A67745c9148
12902E6410L99353F5475a97162A20051a59516J8146q163B10945J15888I9727C4863
12890B2230J80599K38321I1991J11678c13484F707b88151B69668j12832b0661
12879a02360j26857J03880A07507a86716A142J03678a87494B89965b64623B17766
12868E2341L50102h334l7538o8553H2055J63411b26590b8294A09763D6803e6020
12856H1854K74865n5689A03403K04450j14857a70377A38563l6390J87200E4391
12845a9308A88060J85842A52293P8582i3671I252J72956a53509d2558j40830B3950
12833a03960b0985A01896C3499R6249A0542L3484K52730D0854L4491g1682j15797
$$ plain form
12914 -166521 120097 -212052 175177 89273 38974 98263 -51971 -80929 -88854 167745 -39148
12902 56410 455763 65475 -197162 120051 -159516 -141370 -149533 210945 326833 99727 34863
12890 22230 202829 441150 91991 203669 -313484 6707 -288151 269668 156836 -20661
12879 -102360 -229217 -125337 107507 -186716 1142 104820 -187494 289965 -264623 217766
12868 52341 402443 -8334 -45872 -114425 82055 245466 -226590 -28294 109763 46803 -56020
12856 81854 356719 301030 103403 307853 192996 -170377 138563 102173 289373 54391
12845 -19308 188060 373902 152293 230875 -93671 9252 182208 -153509 -42558 -183388 23950
12833 -103960 -20985 101896 33499 129748 10542 44026 296756 40854 75345 -71682 -187479
12822a87479B16075j3999b41115b4758j57443A11591m2825J58899f6609j2015
12812g8624o4511f3205J5086k49145A83639e5219H8013c9592j09351M3018A98636
12800C31619a35834E2316i4090l1552c8882C42843C3848a53094g1335B30403J27368
12789C57771J5349I544g0023H9712c4507r9893F5410K23887D7019l546J92476
12778B35949C6275r832b33190a7951j352B23880J56673e1421A0415K66481c75543
12766h4894K9432A69066H0978c93887e9698B45680f5059p2621I3119b7222A06833
12754h3077A83401b10593A10281k8214a59523A30863O3623H263a1484A11401J55782
12743B67183d75353J64556e9250k80678a1563E1486L1901R7570O4071J63454J21022
$$ plain form
12822 -187479 216075 202076 -241115 -24758 -182201 111591 68766 227665 -66609 -78624
12812 -78624 -143135 -63205 -48119 -297264 183639 -55219 88013 -39592 -148943 -105925 198636
12800 331619 -135834 52316 -94090 -125642 -38882 342843 33848 -153094 -71335 230403 357771
12789 357771 373120 9544 -70023 89712 -34507 -134400 65410 289297 47019 43473 235949
12778 235949 36275 26443 -233190 -17951 -19303 223880 380553 -51421 10415 276896 -375543
12766 -84894 -55462 169066 80978 -393887 -59698 245680 -65059 -137680 93119 -27222 106833
12754 -83077 183401 -210593 110281 82067 -159523 130863 194486 8263 -11484 111401 267183
12743 267183 -475353 -310797 -59250 -339928 -11563 51486 83387 180957 245028 408482 529504
12732E29504A64607a02575D88222A27383B1971h4007j36920F3227J0485P0810
12722A44522R9227b128k54937d111B15980E8589L4697P069a20530B15411F7401
12710B00468B6264J05978N9757J28762D0257L27020j4807j5279n018C9195K0730
12699E9925c3501B06167p853c05526A52705a22339K1671j54101B48545h8197p057
12688i5254F1986c38253B47941B1700c8627A61896l4396J6047j3575M7298a34018
12676f3971A77842b27683B95872D1480c28870a7494j18808C63619h8138C39957
12665a05392j09641c1533A21395d9703I7873A6474N18173D2955L2590L28420j38199
12654B65766d4519p3225a9482A20348d8794j72090g0443P988A19649b8257l45604
$$ plain form
12732 529504 164607 -102575 488222 127383 21971 -84007 -220927 63227 73712 144522
12722 144522 243749 -2128 -257065 -4111 215980 58589 93286 100355 -120530 215411 67401
12710 200468 26264 132242 191999 320761 40257 367277 352470 337191 332173 39195 59925
12699 59925 -33501 206167 198314 -305526 152705 -122339 -100668 -254769 248545 -88197 -95254
12688 -95254 61986 -338253 247941 21700 -38627 161896 127500 143547 129972 177270 -134018
12676 -63971 177842 -227683 295872 41480 -328870 -17494 -136302 363619 -88138 339957
12665 -105392 -215033 -31533 121395 -49703 97873 16474 534647 42955 75545 403965 265766
12654 265766 -44519 -117744 -19482 120348 -48794 -220884 -70443 -62455 119649 -28257 -373861
12643c73861a60164A21092L30165A688a1441G7983L18245B4796K43073j05260
12633A62609a9396F9867M0865K2180J35380j03602o7451K41640A57540B4245J55081
12622A79326h4714B14270J52041R4221j63814A01781J54639a62135n2125h987
12611a3933n6840k3512E04864E9890K725A9446Q9327a54415d4951B08847C0951
12599C57520j09892J4529a78042A49325d3226C67898E1723K4542B3375d6449A54118
12587G0778h9787n8845C06011a39196J6136I8265J29078B6766q710L49962A58728
12575D23910B4480a82360A45406J46007L3850b9050k05672c7767A87625H404h7446
12563A81205D8728c5181A97432a88054c3390B4393J30037n3815C6759Q4613m8533
$$ plain form
12643 -373861 -160164 121092 451257 1688 -11441 77983 396228 24796 267869 162609
12633 162609 -19396 69867 110732 132912 268292 164690 97239 338879 157540 24245 179326
12622 179326 -84714 214270 366311 460532 296718 101781 256420 -162135 -214260 -8987
12611 -13933 -70773 -94285 504864 59890 62615 19446 108773 -154415 -44951 208847 30951
12599 357520 247628 262157 -178042 149325 -43226 367898 51723 76265 23375 -46449 154118
12587 70778 -89787 -148632 306011 -139196 -123060 98265 227343 26766 18056 368018 158728
12575 423910 24480 -182360 145406 291413 325263 -29050 -234722 -37767 187625 8404 -87446
12563 181205 48728 -35181 197432 -188054 -33390 24393 154430 100615 36759 121372 72839
12552G2839K4048c6202a6658C244h6488k66505A30123a3024k26844a4335m0221
12541e4556C4958c51752C5821K13270d2592j22954A74439O3097m6636D4783K6848
12530G1631L94549C4333b80616R9478F6786J07170H0578a49264c1912o7937o6152
12519a66001O7435A62603d16220A1583J7689Q6429a40042B37576p8907b7321B956
12507D22206G2260B4080J52579b58933a14634a6710j92451B08386J26548r2758
12497B42176a53427P1917r6849M7580n0603B7261i8147A2321M1831J09299e20539
12485A00415c5746A52863b486C69966a7744m014F1088d1029C6685h2010A86750
12473e8903D5319J27535e4386A180c23758a54192f5121C94969G4076a7535j06037
$$ plain form
12552 72839 96887 -36202 -16658 3244 -86488 -352993 130123 -13024 -239868 -14335 -54556
12541 -54556 34958 -351752 35821 249091 -42592 -165546 174439 237536 190900 44783 71631
12530 71631 466180 34333 -280616 -181138 66786 173956 80578 -149264 -31912 -99849 -166001
12519 -166001 -98566 162603 -416220 11583 29272 115701 -140042 237576 158669 -27321 2956
12507 422206 72260 24080 176659 -258933 -114634 -16710 -209161 208386 334934 242176
12497 242176 -153427 -81510 -178359 -130779 -181382 27261 -98147 12321 54152 163451 -520539
12485 100415 -35746 152863 -2486 369966 -17744 -21758 61088 -41029 36685 -82010 186750
12473 -58903 45319 172854 -54386 1180 -323758 -154192 -65121 394969 74076 -17535 -123572
12462a23572m3475B97348c566A78639A8180N1581O7025D3535a14032j4029o3364
12451a91425d9478H376e803B09783c5616A36577a70440j52691i5440m7866J2498
12440a30808b0160j6356q0178a3219l0524G5067O9727Q2554A3645c58856f8574
12428A02787J70388D5938k0826i2230A25160a2775C309b10521B33826a36336D9883
12416h1261n57a9235B70603r4619b615B38297k3580o7971a91860P1183H7767K22822
12404C10589A3134J90363a0196l36265J20603M3686D8653B359a79843I5799e9507
12392A8597a02612B17661M2778c8359A89279a7171B37654h9129A48440b52372
12381h8985J0634K7143n3107a0380G638O2570G586K8973a42829C254J15144b4195
$$ plain form
12462 -123572 -167047 297348 -3566 178639 18180 69761 136786 43535 -114032 -128061 -191425
12451 -191425 -49478 8376 -5803 209783 -35616 136577 -170440 -323131 -95440 -143306 -130808
12440 -130808 -20160 -36516 -116694 -13219 -43743 75067 144794 227348 13645 -358856 -68574
12428 102787 273175 45938 25112 -92230 125160 -12775 3309 -210521 233826 -136336 49883
12416 -81261 -81818 -19235 270603 175984 -2615 238297 214717 146746 -191860 -120677 87767 310589
12404 310589 13134 203497 -10196 -346461 -225858 -182172 48653 2359 -179843 95799 -59507
12392 18597 -102612 217661 260439 -38359 189279 -17171 237654 -89129 148440 -252372
12381 -88985 -78351 -51208 -104315 -10380 7638 70208 7586 36559 -142829 3254 118398 -24195
12368e5270E4753a54698A91382q1539h1058B2981a25939e7155A78770q9213J11769
12357B01326a50135e0918A64402N2645b90583A18737c5543j65732j03385B6210
12346e3216A51523b08032A07394C9308K63655R2404a30807C61568j36486a07139
12335H5111J3309g7649F8467K4608a51952G1053B6141i1742c5418q7551j2479
12324a35448A8947b25072a04914B41680i9854C2562f9861j60318A6316e094E1701
12312b5049k56912C2170K73231E6810P0104B1290R031b72589B08219O395a07815
12300a22412r069A99824c1404j23292a8170j36355e281A0110K93979A9926a94994
12288a6349L095o6080A00324c95555J73919F06525B89767J8234A42409G0660J35170
$$ plain form
12368 -55270 54753 -154698 191382 109843 -81058 22981 -125939 -57155 178770 89557 201326
12357 201326 -150135 -50918 164402 217047 -290583 118737 -35543 -201275 -304660 26210
12346 -53216 151523 -208032 107394 39308 302963 395367 -130807 361568 225082 -107139
12335 85111 98420 -77649 68467 93075 -151952 71053 26141 -91742 -35418 -122969 -135448
12324 -135448 18947 -225072 -104914 241680 -99854 32562 -69861 -230179 16316 -5094 51701
12312 -25049 -281961 32170 305401 56810 126914 21290 30321 -272589 208219 214614 -107815
12300 -122412 -131481 199824 -31404 -154696 -18170 -154525 -5281 10110 304089 19926 -194994
12288 -16349 -13254 -79334 100324 -395555 -221636 606525 289767 308001 142409 70660 205830
12277B05830r8870L66789k31755o8308M03314A90222K58631a95101B52274e2369
12266a59320F6196k2137a21917B58020j06310K7999P6567D369J32323K0069L4339
12255A91100a95182c2695R105A52004M1474e3547j3232L2517A12277D4802J96456
12244B41258D3613K88405f2006F53672f40892c4807F7933J64344b6047B5422N67
12233B5989N1971J30640a65733A26428e8783n8821B43567a8434A88368L6669A07053
12221E9593L21025j7639K2452a46283F5219K66055G5515L72132j49414o2119q2421
12210A53693b0363q1943d9546I3925K28852k9866p1271p6472J9117p4100O9238
12199A59423O2705J32661b01314A94782k8352j1863K7443b17913A2345J39689
$$ plain form
12277 205830 106960 473749 241994 173686 577000 190222 448853 -195101 252274 -52369
12266 -159320 66196 44059 -121917 258020 151710 179709 256276 4369 136692 156761 191100
12255 191100 -195182 -32695 -23590 152004 193478 -53547 -66779 -34262 112277 44802 241258
12244 241258 43613 332018 -62006 653672 -640892 -34807 67933 232277 -26047 25422 25989
12233 25989 77960 208600 -165733 126428 -58783 -117604 243567 -18434 188368 225037 107053
12221 59593 380618 362979 385431 -146283 65219 331274 75515 447647 298233 236114 153693
12210 153693 -20363 -102306 -49546 93925 322777 292911 221640 145168 164285 90185 159423
12199 159423 222128 354789 -201314 194782 166430 154567 182010 -217913 12345 152034
12189A52034p0685J77110F8586J32805O2522e6089a1821G2354K26474G2380C5581
12177C17669q4939A04358C9889d4881l4363F19139a0463C94100m4836I7329J03418
12166B00747c2548A22644N7908D1743K53491b38007B53969J33066d4819C50169
12155D16687J462E2638J89289R1564B4733a0079B8359J90375c1542B32908E1326
12143c33693A07306c8641A52397b47629A91184j7113b74157R9442B22713l21H6699
12131a86874q7374L9865h7133D5463J29737l9123a50650A05974Q6318C73K59364
12120B59737j19750b43911J04746F519M0801a80640Q4680K6320j013a8824m0869
12109e9693l693L905C7545J57344a83553A18956d264B83669a67101g26H199a14821
$$ plain form
12189 152034 81349 258459 68586 201391 263913 -56089 -11821 72354 298828 72380 35581
12177 317669 232730 104358 39889 -44881 -79244 619139 -10463 394100 349264 97329 200747
12166 200747 -32548 122644 180552 41743 295234 -238007 253969 387035 -44819 350169
12155 416687 418149 52638 241927 333491 24733 -10079 28359 218734 -31542 232908 51326
12143 -333693 107306 -38641 152397 -247629 191184 174071 -274157 -174715 222713 222392 86699
12131 -186874 -274248 -234383 -87133 45463 175200 136077 -150650 105974 192292 373 259737
12120 259737 139987 -243911 -139165 6519 47320 -180640 -95960 -69640 -70653 -18824 -59693
12109 -59693 -63386 -59481 37545 194889 -183553 118956 -4264 283669 -167101 -726 8199 -114821
12096H8245a49869A12681a91224m4900B07372N0373q2920a44338j72999E2515
12085f489p766B3724A0880c5878A48340i042j23598C77658n845J411968M61693
12074B245474H24674D4543J34311C2749j2404L36868j41260J83281A78686a07233
12063E2473a19856D8031A7042R91J41522a57859E1323m957M3079a18132K9123
12052h9009j22553p2232F460J80055q7649d5917j37671l1845D9680a07216k50799
12041c58015D2754a29119A29967a41525m8449H8988b9601B83347d7017A92409
12030B92504j39567n1368a23669K0954b5280A9514a57931O8219j6284r0043c7306
12018b6919A02655c18110I4208f2535r6718D5855Q5359j0115a63328B037a82943
$$ plain form
12096 88245 -149869 112681 -191224 -236124 207372 257745 174825 -144338 -317337 52515
12085 -6489 -14255 23724 10880 -35878 148340 -9042 -132640 377658 371813 1783781 2245474
12074 2245474 824674 44543 178854 32749 20345 357213 215953 399234 178686 -107233
12063 52473 -119856 48031 17042 18033 159555 -157859 51323 46366 89445 -118132 -89009
12052 -89009 -211562 -283794 6460 186515 98866 -45917 -183588 -215433 49680 -107216 -358015
12041 -358015 42754 -129119 129967 -141525 -189974 88988 -29601 283347 -47017 192409
12030 292504 152937 101569 -123669 -102715 -25280 19514 -157931 -89712 -105996 -196039 -37306
12018 -26919 102655 -318110 94208 -62535 -159253 45855 131214 121099 -163328 2037 -182943
12006i0603B18364a6648j17443k81829J39993A50335d98062c8455j68347a3070
11995A76064n6590b27689D38381a7821e948A11644R3415c21191J07591K7936A52578
11983a32959j2081B56863a33772o4970C4722K90850b93881c6365O734k26002B763
11971A52773J26499A5977d4944B45006I7758a19807I689a44605K5480k66097A90411
11959H1054e7196A437a82852I0571c9890b600A47468b11122B31764b09362k93129
11948e02491A02793c26765A7170a00985j05513b9769k20801a0722k43389R4828
11938a59283j5836I6891D5336P0746l3167J99633b7166n6834A00292b94088a3848
11926A02125g3107A26855D1860e1019I0322O8776L7121j8276b61469A5705L67556
$$ plain form
12006 -90603 218364 -16648 -134091 -415920 -275927 150335 -498062 -38455 -206802 -13070
11995 176064 119474 -227689 438381 -17821 -5948 111644 205059 -321191 -213600 -185664 152578
11983 -132959 -145040 256863 -133772 -198742 34722 325572 -293881 -36365 -29631 -255633 2763
11971 152773 279272 15977 -44944 245006 97758 -119807 9689 -144605 -119125 -385222 190411
11959 81054 -57196 1437 -182852 90571 -39890 -2600 147468 -211122 231764 -209362 -502491
11948 -502491 102793 -326765 17170 -100985 -206498 -29769 -250570 -10722 -254111 -159283
11938 -159283 -175119 96891 45336 116082 82915 282548 -27166 -84000 100292 -294088 -13848
11926 102125 -73107 126855 41860 -51019 90322 159098 196219 177943 -261469 15705 383261
11915C83261a6280A39959N2330a25332D807J38210j7733o0119O3903B9312a94862
11903A20156c005A30146c3385M785q8699j68704b0153N106F9709A0552J62063
11892A72615a69093C6996d8093k32324a37836j23175J18384j56060A10205D2561
11881d64588B91259a63608N3698D7364J85039b5400F741J22507b34874L3338G8556
11869H4913a11080j18412c7028I9221g6101B22517A4301Q374c7338A509M8566
11858E0075J7822F846d14n1370G9a16898C4911b8963m41448D1310a02544A45888
11845c77636B22626l9567c6802j86759B3738a41715j90977i8573C2505O0043c0050
11833c51636e0325a542j30113k04729J57377A12456C0175a1693l7041J3577A08761
$$ plain form
11915 383261 -16280 139959 192289 -125332 4807 143017 125284 65165 129068 29312 -194862
11903 120156 -3005 130146 -33385 -28600 -117299 -286003 -20153 -15047 69709 10552 172615
11892 172615 -169093 36996 -48093 -280417 -137836 -261011 -142627 -298687 110205 42561
11881 -464588 291259 -163608 -109910 47364 232403 -25400 6741 129248 -234874 -201536 78556
11869 84913 -111080 -229492 -37028 99221 -76101 222517 14301 22675 -37338 1509 50075
11858 50075 67897 6846 -414 -51784 79 -116898 34911 -28963 -470411 41310 -102544 145888
11845 -377636 222626 183059 -36802 -223561 23738 -141715 -332692 -98573 32505 92548 -30050
11833 -351636 -50325 -1542 -131655 -336384 -179007 112456 30175 -11693 -48734 -35157 108761
11821B08184a2853n5801n6777l881k5893k00846c6698j07226A53195K0648g6519
11809e5084m5219A58267a130n4738d924G1790a47551h826j23173N1230n666k8477
11797a14912B22824e6827j0926A23801m2577L26104a44095e9371B40451J11162
11787C51613G9631L06391F9249N8622d9547m5201I7413M63755A71616l0030a82614
11775A72935i509A1867N1493b33089k8735L2102A83407f9869A17141a31658H2458
11763A8988J24992b13628B27443r1007a07167q8171j29024A37727a59982A61812
11752a7201B60585H964a07644k10373a34670d6901j6965Q935j12866P6783b421
11740A61318d59845F1152c70523J11499J02271b6425h605k57695B05984j5584
$$ plain form
11821 208184 -12853 -68654 -125431 -129312 -155205 -356051 -36698 -143924 153195 173843 -76519
11809 -55084 -100303 158267 -1130 -55868 -4924 71790 -147551 -8826 -131999 -80769 -86435 -114912
11797 -114912 222824 -56827 -67753 123801 81224 407328 -144095 -59371 240451 351613
11787 351613 79631 386022 69249 127871 -49547 -94748 97413 561168 171616 141586 -182614
11775 172935 -9509 11867 63360 -233089 -261824 -229722 183407 -69869 117141 -131658 82458
11763 18988 143980 -213628 227443 136436 -107167 -195338 -324362 137727 -159982 161812
11752 -17201 260585 8964 -107644 -318017 -134670 -46901 -63866 -54931 -167797 -91014 -2421
11740 161318 -459845 61152 -370523 -259024 -156753 -26425 -8605 -266300 205984 190400
11730A90400C722K61938a80066P1343k6837B55864A00424c1813A51007C4850d0700
11718A6102c8830G1218L1813D6155b28065E9964c2799M720G9957b51947G4573
11706C31795D3989J09125b36966a07886B66922R089j21353d35272b9129k88208
11696c17337a31714A7826h9411l0596j52753a24951B3387A1641L86839b85552
11685D4137b9196A6725L80359a52028A2347a78988j6586B05656a0873A05982a50934
11673A53143b38490B40352e5461D2990c5058A57236a8444o2585p5878L0991j69049
11662b94965H9052K9827a79643F1581J06813a17495A32043a2812k5130f192F9095
11650A28050j5029K59407c54899c2173C5598L66992a52191A44766a68988A37602
$$ plain form
11730 190400 3722 265660 -180066 -108723 -135560 255864 100424 -31813 151007 34850 -40700
11718 16102 -38830 71218 103031 46155 -228065 59964 -32799 -28079 79957 -251947 74573
11706 331795 43989 153114 -236966 -107886 266922 276011 154658 -435272 -29129 -317337
11696 -317337 -131714 17826 -89411 -120007 -272760 -124951 23387 11641 398480 -285552
11685 44137 -29196 16725 397084 -152028 12347 -178988 -195574 205656 -10873 105982 -150934
11673 153143 -238490 240352 -55461 42990 -35058 157236 -18444 -81029 -156907 -125916 -294965
11662 -294965 89052 118879 -179643 61581 168394 -117495 132043 -12812 -37942 -6192 69095
11650 128050 113021 372428 -354899 -32173 35598 402590 -152191 144766 -168988 137602
11639D89792f5548A83070b108j53891d03j76233B44613L8222b63699B8319J48496
11628A76815a49958O1797D8851N6431D9279a28621O0267C63128a88366A54228
11617b13263F7567J51523b39976J10545A44380a03516A45233F4225j2364R290
11607F1151P2688b06236O7875k23688A83448e866B82020b58545o5658A6478N2054
11596F8532L03030i7772B2706J75898c0858A79070C3515Q8865k126K61931a4897
11584A42620b1539r5556F8144O1769d247B4307a20938a1267C7147K0969J64520
11573B22636b30271N4127g7666A88102Q7699a24778A45142l7601P3653a0325n018
11562a5343m4885G2559e3060B59791a39298d6833l358A53633K0527G7386N37898
$$ plain form
11639 489792 -65548 183070 -2108 -155999 -403 -176636 244613 282835 -263699 28319 176815
11628 176815 -149958 -88161 48851 105282 49279 -128621 -68354 363128 -188366 154228
11617 -213263 67567 219090 -239976 -129431 144380 -103516 145233 64225 51861 61151
11607 61151 133839 -206236 -138361 -362049 183448 -5866 282020 -258545 -324203 16478 68532
11596 68532 371562 -97772 22706 198604 -30858 179070 33515 122380 120254 382185 -14897
11584 142620 -21539 -117095 68144 129913 -4247 24307 -120938 -11267 37147 58116 222636
11573 222636 -230271 -176144 -77666 188102 275801 -124778 145142 107541 181194 -10325 -15343
11562 -15343 -60228 72559 -53060 259791 -139298 -46833 -50191 153633 174160 77386 615284
11551F15284h5397A1509K49913F5999Q1731J81237e1753K5863A5214e4908j94302
11540b49210D45737j11312i029B55949c3418k71284B07721L13564a78234A55917
11529C31080F8911e9528C62494a05489k28147D14247A40707D7349P1516O0860
11519A79725C4271J35379P1905a28896j71124B82886J21964c3476A49423a9259
11508F19286A06563a20878g39A44398P5338p0693J4622l6025Q9858p7741a10777
11496A19533L0300G0045L56807F0063J88462M2973a40461A03007P1075q877P315
11485A72520B3548d9444I4977l638J1677J50215B6997M53770j49598l3771j43664
11474A53734J15291a28958B57348A27211J57569g7266B55911L38694A60908L8507
$$ plain form
11551 615284 -85397 11509 261422 65999 147730 328967 -51753 -25890 15214 -54908 -249210
11540 -249210 445737 334425 -9029 255949 -33418 -304702 207721 521285 -178234 155917
11529 331080 68911 -59528 362494 -105489 -333636 414247 140707 47349 118865 179725
11519 179725 34271 169650 241555 -128896 -300020 282886 404850 -33476 149423 -19259
11508 619286 106563 -120878 -739 144398 219736 149043 163665 127640 217498 139757 -110777
11496 119533 149833 70045 426852 60063 248525 291498 -140461 103007 174082 165205 172520
11485 172520 23548 -49444 94977 91339 103016 253231 26997 480767 331169 297398 153734
11474 153734 269025 -128958 257348 127211 284780 -77266 255911 594605 160908 199415
11464A99415d4497p4510A88979q4732J32190h3231A48791J76254j47735N0225
11454B27535R6407L3092A3496J54172h4375A1567M35048i4416C41421j13078b26233
11442C04025e6336k3225K0302b7279A39611C0293a61209A5112R8227a69375I0237
11430D93686c23300C8481d2646o9337l31342d0116B48705e9526k0395k62501e6091
11418B12407I5780M034g7323k75254A98888a35222c5085j79579B24625G2428D597
11406a50827B21174n7711b98401J07779A9953L4362c1388n3825j5718E4767K70768
11395C25535i5645B62078k7519b19579P6907m061L8034B23401b78653a24086j01728
11384b25814g664k34179h0064k1904j93668F3263k7061a95822b1019B56105a5468
$$ plain form
11464 199415 -44497 -119007 188979 104247 236437 -83231 148791 325045 177310 227535
11454 227535 323942 357034 13496 167668 -84375 11567 446615 -94416 341421 228343 -226233
11442 304025 -56336 -79561 -59259 -27279 139611 30293 -161209 15112 113339 -169375 90237
11430 493686 -323300 38481 -42646 -111983 -443325 -40116 248705 -59526 -79921 -342422 -56091
11418 212407 95780 99814 -77323 -352577 198888 -135222 -35085 -214664 224625 72428 4597
11406 -150827 221174 163463 -298401 -190622 19953 54315 -31388 -85213 -100931 54767 325535
11395 325535 -95645 262078 234559 -219579 -142672 -146733 -108699 223401 -278653 -124086 -225814
11384 -225814 -7664 -241843 -80064 -101968 -295636 63263 36202 -195822 -21019 256105 -15468
11372B4856J45925A3592J40102n238a56810B3612M688J4500h1976H9522k9666
11361E9856b45703C7439a31025A02408a47586p5606I3937J97330G1363J37577
11351B08940e2156k05673M8311M6736A34975a15536A33582a85545P9304l1229
11341a37470A69772p6134a68236C7610i9075q1153G9595b55215g0893B46507l9314
11330B07193b37241A13225B9417g4963H1353a77785c8417m6155J6077G8982J16893
11319A95875g5873j7909B6802a06589B40239j2774o74r2163c85840b4871k65625
11308b90496A29499L1160e1327I7310g1959G2649J10066B273O731c31750M3248
11297b88502G249e738B30685G3186d420D7171d1348H8041k9038a23532j17423
$$ plain form
11372 24856 170781 13592 153694 148456 -156810 23612 28300 42800 -81976 89522 59856
11361 59856 -245703 37439 -131025 102408 -147586 -223192 93937 291267 71363 208940
11351 208940 -52156 -257829 -209518 -162782 134975 -115536 133582 -185545 -106241 -137470
11341 -137470 169772 93638 -168236 37610 -99075 -180228 79595 -255215 -70893 246507 207193
11330 207193 -237241 113225 29417 -74963 81353 -177785 -38417 -84572 -68495 78982 195875
11319 195875 -75873 -93782 26802 -106589 240239 227465 226791 134628 -385840 -24871 -290496
11308 -290496 129499 160659 -51327 97310 -71959 72649 182715 2273 9004 -331750 -288502
11297 -288502 7249 -5738 230685 73186 -4420 47171 -41348 88041 59003 -123532 -240955
11286b40955A3729a70162k9436i1445j58463a17031D3758c55362C4566N6435G435
11274A82912O4281c55891B44539b36920C36040a18475A73729D9714R6781b1433
11263a69415L1243M0988k35228j03685f1157A80564a34657j43356J4879F5897
11252B65500a10227q9195D6644M1621a69305B8298N366c06787G2896a01494L9116
11241f2378D32319D7033a66104C5778J79701g5831A9430O7917b69470c0703r0096
11230a20799p3121d1619k01016C460J68168B4269K9300a13500M1932o1654A43115
11218B66547f3484A65298k0032i3898A38437b52083B76514f5764l8904j36644
11208b41312a0096j66786A03290e1044k79774J19858c8234l168A4858a46212k68291
$$ plain form
11286 -240955 13729 -170162 -199598 -91445 -249908 -117031 43758 -355362 34566 91001 7435
11274 182912 247193 -355891 244539 -236920 336040 -118475 173729 49714 146495 -21433
11263 -169415 -138172 -97184 -332412 -436097 -61157 180564 -134657 -278013 -263134 65897
11252 265500 -110227 -199422 46644 88265 -169305 28298 33664 -306787 72896 -101494 -62378
11241 -62378 432319 47033 -166104 35778 215479 -75831 19430 87347 -269470 -30703 -120799
11230 -120799 -193920 -41619 -242635 3460 171628 24269 53569 -113500 -71568 -133222 143115
11218 266547 -63484 165298 145266 -93898 138437 -252083 276514 -65764 -104668 -241312
11208 -241312 -10096 -176882 103290 -51044 -330818 -210960 -38234 -41402 14858 -146212 -414503
11197d14503a16704A75076d00454B26073c00305E8445b85280G2520a25608j47925
11187b73533d6653k05003k8223J16859F8708k6450k244h3016q0387B05963a95763
11175A7023G47b31939A97230b01138h1158m2538q8579i822j23566D3019a9250
11163a77718N1339M1533B48279b03283R219B8897K05845e5727p7286A91708Q2593
11152B74301k3588c01477d7286D9141b12942I9259h0522A16075L777k4531a32433
11140a39515a0251j33259r0127f3600j64894L2890A66630K0702G9653a87102c0738
11128C41013f8214B42324a64491A84677c35907D1983J12630J05871p4764p4461
11118A11259C5680K30791r0916B5548J18967M33036d4969E49199j72434A00343
$$ plain form
11197 -414503 -116704 175076 -400454 226073 -300305 58445 -285280 72520 -125608 -273533
11187 -273533 -46653 -251656 -279879 -163020 68708 42258 40014 -83016 -163403 205963 -195763
11175 17023 747 -231939 197230 -201138 -81158 -123696 -212275 -9822 -133388 43019 -19250
11163 -177718 -126379 -84846 248279 -203283 -194064 28897 234742 -55727 -133013 191708 274301
11152 274301 250713 -301477 -47286 49141 -212942 99259 -80522 116075 119852 95321 -132433
11140 -139515 -10251 -143510 -233637 -63600 -228494 -195604 166630 187332 79653 -187102 -30738
11128 341013 -68214 242324 -164491 184677 -335907 41983 154613 260484 185720 111259
11118 111259 35680 266471 175555 25548 144515 577551 -44969 549199 376765 100343
11107F0605L3311J1242L26085j73773l7106J55145j50436d8585A59449J82878
11097C42327A49453k8555K90573A76002J08860f2334B70201r2562O9826D8138
11086h1380k2205A48421j7873J27034O960K06636B31505j09200A8350a17214E10527
11074B99494m9110G7055J42485A09380K65761K67596B48117M7798k7959q7410
11064A80546K55423j01800L37473k73923p6119N38937m00938N37419D63628K10620
11054F74248Q7442k36133K74250J3318r5652j36510L6561n159N5735j14719L13384
11043H66765k40912j94092L44763j1366n7726L6806o5028n5567J34817k68882
11033D89578N16425m39872K37583L8221l37550J19762R9785K43707l41948B27311
$$ plain form
11107 60605 93916 105158 431243 257470 220364 375509 225073 -48585 159449 342327
11097 342327 149453 120898 411471 176002 284862 -62334 270201 177639 247465 48138
11086 -81380 -103585 148421 130548 257582 264542 471178 231505 122305 18350 -117214 510527
11074 299494 250384 77055 219540 109380 375141 642737 248117 295915 267956 180546
11064 180546 435969 334169 671642 397719 321600 860537 459599 997018 463628 674248
11054 674248 761690 525557 799807 813125 717473 580963 617524 612365 668100 553381 866765
11043 866765 625853 431761 776524 765158 707432 744238 679210 623643 758460 489578
11033 489578 1006003 566131 803714 841935 504385 624147 723932 967639 625691 227311
11022F26400J14788l14230p2979K39351O5295j57102j90744M98021k51007o2550
11012D95243L17817l27572J69883J6340C29907K48989M79470l00459j17660Q5137
11002G25384L12615D62645j68937N60176N9997k19243p0529J82655Q399J24122
10992I39285j26845k4390j84401P898L44178k56466K22223J2823J81360k12450
10982I03215M2931K07977M5372n1199M62926J0038J68698L91870P6384O85641
10972B943853o50026N48654m173L6256l00311l08136m46897k45025n5842J56951
10962A675304k42572J84852k09755K03815K67817n33984L19234j52113M432k48520
10952A268510m30148Q1837o2873A57960K51551A34553K44034j55294K84896A50308
$$ plain form
11022 626400 741188 426958 353979 593330 658625 501523 310779 808800 557793 495243
11012 495243 813060 485488 655371 671711 329907 578896 1058366 757907 640247 725384
11002 725384 1037999 462645 293708 853884 913881 694638 624109 806764 815163 939285
10992 939285 812440 788050 603649 611547 955725 699259 921482 934305 1115665 903215
10982 903215 946146 1154123 1199495 1148296 1611222 1621260 1789958 2181828 2258212 2943853
10972 2943853 2293827 2842481 2838308 2874564 2574253 2266117 1819220 1574195 1518353 1675304
10962 1675304 1432732 1617584 1407829 1611644 1879461 1345477 1664711 1512598 1517030 1268510
10952 1268510 838362 920199 857326 157960 409511 134553 378587 223293 508189 150308
10941E6645J29651p5934N3211B2409J04995N5388d2201C50795J7884A29679D0557
10929I251J28912a36692B64776h9541b2425j56609j19968j07578a23330H8816
10918d1906k28524A22955J15441f0414A37414C4053a72303A52691j9061M4137
10908A77767L1210n1662g4963A09826a01636j4854j56261G8275O2991A7203J46855
10897A64058M4982f8417B34128b63175e8060E47a49776H0523J13370a32202p6557
10886b08759c2679C80855b36383a15666j9773O7580m50520d705C4327K30792b06491
10874g8910C47871c7503p1903d1929A62040J2002f3117A23063C8724b59285a22344
10862g2523C70109A47246a60730A96013a9981A2543c21080g8225A10231N9804
$$ plain form
10941 56645 186296 110362 163573 22409 127404 182792 -42201 350795 368679 129679 40557
10929 9251 138163 -136692 264776 -89541 -22425 -179034 -299002 -406580 -123330 88816
10918 -41906 -270430 122955 238396 -60414 137414 34053 -172303 152691 133630 177767
10908 177767 208977 157315 -74963 109826 -101636 -116490 -272751 78275 141266 17203 164058
10897 164058 209040 -68417 234128 -263175 -58060 547 -149776 80523 193893 -132202 -208759
10886 -208759 -32679 380855 -236383 -115666 -135439 -67859 -518379 -4705 34327 265119 -206491
10874 -78910 347871 -37503 -109406 -41929 162040 174042 -63117 123063 38724 -259285 -122344
10862 -72523 370109 147246 -160730 196013 -19981 12543 -321080 -78225 110231 170035
10852A70035A3791f2552j07334F297A763J99360a72476R894B9420f2099j16518
10841a78617B63224c2058A0725J03193C6443a32599b535B9195g7687c7357A03022
10829B83286a63554L3088A03682H846a97443m3327i5560l9253A42164a28966K494
10818a26472A12687a69507n0663g0122A3984L48851h7243K9576j19389B98879
10807a48457G1338a2355j43391C4380b8058j90039C13334e6176B08090a52699
10796d015m50499a32322k549I7279b12319c4820M041k10198A16439E1978b64265
10784a87394j35427h1313j80559F6119P9127D3383a78632A53912c1392j76387
10774b07779K8767r7916Q4956Q9092D81512h3945B28028E6422J21112K7988D5756
$$ plain form
10852 170035 13791 -62552 -169886 6297 1763 201123 -172476 -162582 29420 -62099 -178617
10841 -178617 263224 -32058 10725 113918 36443 -132599 -2535 29195 -77687 -37357 103022
10829 283286 -163554 -130466 103682 8846 -197443 -240770 -95560 -134813 142164 -128966 -126472
10818 -126472 112687 -169507 -220170 -70122 13984 362835 -87243 -57667 -177056 298879
10807 -148457 71338 -12355 -155746 34380 -28058 -218097 313334 -56176 208090 -152699
10796 -4015 -454514 -132322 -134871 97279 -212319 -34820 -30779 -240977 116439 51978 -264265
10784 -187394 -322821 -81313 -261872 66119 145246 43383 -178632 153912 -31392 -207779
10774 -207779 -179012 -276928 -191972 -102880 481512 -83945 228028 56422 177534 205522 45756
10762a19127A10058a14764c788q549B660a04385B34632a26741O1863A18709i1858
10750d8788A30367D5413j161r800P8290b27371i9665M5012j72683A2423l278a37340
10737D2461j6006a04733j6857a0774b341B74837a587k04395O6303j71460J55307
10726a55832A11639A3464g5774E4876J55609e4518A38459a45901B8013a62899
10715i0961k33580e1433b5108B0644K11440H5967K04070f6794j0428p8211n3503
10704b08936h6901A31506O8092a23747A95189q6087b48729C63320a08282A56513
10693c26334J23261K1638K7530g3295k9391K7824k03322N9897g9785j13017j90232
10682c83034B70842e7914A79256b00177f3265I215a17028D677a48346b1529B10472
$$ plain form
10762 -119127 110058 -114764 -3788 -12337 2660 -104385 234632 -126741 -64878 118709 -91858
10750 -48788 130367 45413 44252 34452 112742 -227371 -99665 -54653 -227336 12423 9145 -137340
10737 42461 26455 -104733 -121590 -10774 -2341 274837 -1587 -205982 -139679 -311139 -155832
10726 -155832 111639 13464 -75774 54876 210485 -54518 138459 -145901 28013 -162899
10715 -90961 -324541 -51433 -25108 20644 232084 85967 290037 -66794 -77222 -155433 -208936
10704 -208936 -86901 131506 199598 -123747 195189 109102 -248729 363320 -108282 156513
10693 -326334 -203073 -181435 -153905 -73295 -102686 -74862 -278184 -218287 -79785 -192802 -383034
10682 -383034 270842 -57914 179256 -200177 -63265 9215 -117028 4677 -148346 -21529 210472
10670B52581E6048q811g2373N747b8650A63943a33783b0756A61389a82746C36285
10658C14656H069e86051b4779r8535C6420h7669A93993i4372b415r6291A5194
10646G4734D565J41099g5882A17896K9071b75144g5589l84499A45452b94398E9091
10634b00157h1652N67A66344j2282a4276j76880E4750b62018a30185p3907A4680
10622c46909A31635A4685h9274l25907A33959n5158b9909j02136C03422C145R0066
10611I3211O4892J34734L7537c10248A59565A4207a51080a6535A9159h8464b9248
10599c15248Q6296B90197b72807B03216I2867b24839B7709P6312J058D2999L7052
10588H0051i7795o3816O0146E4377N956J5464a17173E4893L2811j4873A7173N5378
$$ plain form
10670 252581 56048 47237 -72373 -66626 -28650 163943 -133783 -20756 161389 -182746 336285
10658 314656 8069 -586051 -24779 -123314 36420 -87669 193993 -94372 -2415 -98706 15194
10646 74734 4565 145664 -75882 117896 146967 -275144 -75589 -460088 145452 -294398 59091
10634 -200157 -81652 -81085 166344 154062 -14276 -191156 54750 -262018 -130185 -204092 14680
10622 -346909 131635 14685 -89274 -415181 133959 78801 -29909 -132045 303422 3145 93211
10611 93211 158103 292837 330374 -310248 159565 14207 -151080 -16535 19159 -88464 -29248
10599 -315248 -228952 290197 -272807 203216 92867 -224839 27709 104021 105079 42999 80051
10588 80051 -97795 -161611 -101465 54377 60333 75797 -117173 54893 87704 72831 17173 72551
10576G2551B6049d3047a3842A2085P0785b3562j1227a6779m249j74953k1380B0959
10563A74224E8096b37001G8589N2577h754q9498J1944Q824F8764b79595Q2248
10552a97347l6006F6297a54611A8315L3124b1435q6704j52325I5619f2890r0593
10541a53483P5388A89377b91556B69603B7971J32117b69409i5751B09360a98209
10530g2524k57384A34503f784E0416h7161a4111C5506o048a79948k7498A57584
10518a4908I6391K76135B8359a41309A90640M0097D2948j7441a62614d0834A46669
10506d0070r7982N3077h514A79526a9417m5928q9412f8634B2925b06800g6652
10494D6336h8615k47313O168J24234r257I0401L6363P0050q6050b54434B95440
$$ plain form
10576 72551 26049 -43047 -13842 12085 82870 -23562 -34789 -16779 -21028 -195981 -217361 20959
10563 174224 58096 -237001 78589 131166 -8754 -98252 -86308 -77484 68764 -279595 -197347
10552 -197347 -233353 66297 -154611 18315 51439 -21435 -108139 -260464 95619 -62890 -153483
10541 -153483 -78095 189377 -291556 269603 27971 160088 -269409 -95751 209360 -198209
10530 -72524 -329908 134503 -6784 50416 -87161 -14111 35506 29458 -179948 -207446 157584
10518 -14908 96391 372526 28359 -141309 190640 230737 42948 25507 -162614 -40834 146669
10506 -40070 -138052 -84975 -8514 179526 -19417 -65345 -154757 -68634 22925 -206800 -76652
10494 46336 -88615 -335928 -329760 -205526 -214783 90401 126764 196814 110764 -254434 295440
10482B08936L28512J42968l16914M97025m12380b05087A97474o4973h6261O577
10472g9684D5164i7840B66166A05196L26842c54815a16554B11049H4916g2336
10461b74419C8090b5128j55554B92384b90773J03576A58137n7650l3948B5567
10450A35273f24595a70829B94479E0674a51150L4795I4568J47332h8225E44701
10439a09983G1514i7553A60763J66130g3813l71366F3997f23638h4420q4807f1283
10427C96068A85077c41110B5800g0022m9797L0393D8277f3120J4347J4285j56041
10416a90529O2345B55980c24247A2705M6011J14469b01102D5589J96757E599f8638
10404H7667d53582g9111A89753b08048F7679c34968A15904c0796A49799c678G9295
$$ plain form
10482 208936 537448 680416 363502 860527 448147 -205087 197474 132501 -86261 -79684
10472 -79684 45164 -97840 266166 105196 432038 -354815 -116554 211049 84916 -72336
10461 -274419 38090 -25128 -180682 292384 -290773 -187197 158137 100487 66539 25567
10450 135273 -624595 -170829 294479 50674 -151150 -116355 94568 241900 -88225 544701
10439 -109983 71514 -97553 160763 326893 -73813 -445179 63997 -623638 -84420 -169227 -61283
10427 396068 185077 -341110 25800 -70022 -119819 -89426 48277 -63120 -48773 -34488 -190529
10416 -190529 -128184 255980 -324247 12705 58716 173185 -201102 45589 242346 5599 -68638
10404 87667 -453582 -79111 189753 -208048 67679 -334968 115904 -30796 149799 -3678 79295
10392C07548c16634C30356K06043k38049G621K55848H3057J63914d04319F2327
10381E0296d9001A88953O695B1520K88513c1541d518p4434C08387r6612b8191
10369B58996J44474I9672K62765K9173J86916B01042K13177K5795A40228R3679
10359B33907E4100j298Q7678J23644o2148R2241j40820D3901K25806K8340L58194
10348F56241j30515o0521j34586F6094J91643L01658R4624A25319b4359N297A37116
10336C73547A33646J35771i9994C5035M3205R3666J96256a62549A74910q2339
10326I2571b240A14497K8810J1549K5143n4015n6506K30802A18214J620c03175
10314A29034M8393n669o5085b22505F6049a67230A64740G8098J72354a17296J9394
$$ plain form
10392 307548 -316634 330356 536399 298350 7621 263469 83057 246971 -404319 62327
10381 50296 -49001 188953 195648 21520 310033 -31541 -4518 -78952 308387 211775 -28191
10369 258996 403470 99672 362437 391610 578526 201042 414219 440014 140228 233907
10359 233907 54100 52802 140480 264124 201976 294217 153397 43901 269707 298047 656241
10348 656241 525726 465205 330619 66094 257737 559395 654019 125319 -24359 -19062 137116
10336 373547 133646 269417 -99994 35035 78240 171906 368162 -162549 174910 92571
10326 92571 -2240 114497 143307 154856 179999 125984 69478 300280 118214 119834 -303175
10314 129034 177427 171758 106673 -222505 66049 -167230 164740 78098 250452 -117296 -97902
10303i7902C02178c0691A83564m8544b71570b0919B20294H4737J84458d6795p8381
10292a25176j52604G2869K25806c08880A5376a7855A37180m7568A9858J21319
10282A41177e2161j4474B6240b38772F0952f1782l49463a05411c2597h939A69543
10270a77669B08519H2031J83864m0126b32919L7806h9871m2162C88742b01627
10259A59179K798r5a7873B74526F0941O6830g1250k08330Q9582B9568b09545f1985
10246b7782k42232f2705A99602a51578p498F6017a97803E8012j0620e4196A16270
10234A79899b19394A53328i7580k97057f2698j67194j02612a32132K7308k1874
10224a26698J2205l0569l7667P4724J9769o558n4735e1623B5430e2160F9677Q6838
$$ plain form
10303 -97902 302178 -30691 183564 135020 -271570 -20919 220294 84737 269195 -46795 -125176
10292 -125176 -277780 72869 298675 -308880 15376 -17855 137180 89612 19858 141177
10282 141177 -52161 -66635 26240 -238772 60952 -61782 -411245 -105411 -32597 -8939 169543
10270 -177669 208519 82031 265895 225769 -232919 -195113 -89871 -132033 388742 -201627
10259 159179 161977 161882 -17873 274526 60941 127771 -71250 -279580 -189998 29568 -209545 -61985
10246 -27782 -270014 -62705 199602 -151578 -159076 66017 -197803 58012 47392 -54196 116270
10234 179899 -219394 153328 -97580 -394637 -62698 -229892 -332504 -132132 -104824 -126698
10224 -126698 -114493 -145062 -182729 -108005 -88236 -94794 -149529 -51623 25430 -52160 69677 156515
10212A56515a02512h80j09214j2483A19715b30815p1032d654k16168I5528a96185
10200b287r6723a3594l75375D9612R9740a9943q9469A15314h0470j94014F6257
10188B62586b00699B90795d8778A18575b9909C0428a84997b6441m38860A48660
10177C8883h1871E7702K73666a60108H9551N4740e4815E6341k7259a1308q071
10166a9379D9877b85478n30M9885D28396G5186b8396l5232C21061A12851b13463
10154A81521a67507A25495h2179R550j9372m0381L9465j37678n4091j36286a1560
10142a82751r2931B5799a439j07701J4178B30694G8652R0829p6868B008K39779
10131B41787A08413c99385D8987C453K24380I5165b21321k59448h3234j20342
$$ plain form
10212 156515 -102512 -880 -110094 -122577 119715 -230815 -301847 -4654 -220822 95528 -196185
10200 -2287 -99010 -13594 -388969 49612 149352 -19943 -109412 115314 -80470 -274484 66257
10188 262586 -200699 290795 -48778 118575 -29909 30428 -184997 -26441 -465301 148660
10177 38883 -81871 57702 331368 -160108 89551 144291 -54815 56341 29082 -11308 -19379
10166 -19379 49877 -285478 -286008 -236123 428396 75186 -28396 -63628 321061 112851 -213463
10154 181521 -167507 125495 -82179 -72629 -92001 -132382 -92917 -230595 -284686 -420972 -11560
10142 -182751 -275682 25799 -1439 -109140 -94962 230694 78652 169481 92613 2008 241787
10131 241787 108413 -399385 48987 3453 227833 95165 -221321 -480769 -83234 -203576
10121b03576i6360A23695K06610H8225b00895H1655i317C4054P00J57288L2356
10110B24398f6606j24264j98559A45163E6809J86345a41724M5508j65129a8081
10099b92442B82859a73863E2134K54620a64102K7293p3106A03857a24508m9047
10089a73555J8488j22715J28814A32046d82028h9985k9318j78933j70985g1616
10078c74778B03956f7480C91836a19198H0394b72955P9049C9675N0957f7311A93074
10066B4404P0101M561f9667q2226f4660j02118Q0606A21762D7103B3242e837p2842
10054g8679l25686I9840i3206R435F3595a07721A90059g8218r7045E5858b06717
10042b00620p0903A489g6116A12781d1215A56439M5197b04722G4870c9421A83947
$$ plain form
10121 -203576 -96360 123695 330305 88225 -200895 81655 -9317 34054 34754 192042 224398
10110 224398 -66606 -190870 -389429 145163 56809 243154 -141724 -96216 -261345 -18081
10099 -292442 282859 -173863 52134 306754 -164102 -136809 -209915 103857 -124508 -173555
10089 -173555 -155067 -277782 -148968 132046 -482028 -89985 -119303 -298236 -469221 -71616
10078 -374778 203956 -67480 391836 -119198 80394 -272955 -193906 39675 90632 -67311 193074
10066 24404 94505 99066 -69667 -151893 -64660 -166778 -86172 121762 47103 23242 -5837 -78679
10054 -78679 -404365 99840 -93206 -83771 63595 -107721 190059 -78218 -175263 55858 -206717
10042 -200620 -271523 1489 -76116 112781 -41215 156439 201636 -204722 74870 -39421 183947
10030e7717A34950h3108B80925d5338j38813F4498a32370d5059A21528f6380G3117
10018d7062o6006A84639a20317H0031J79989b66687J27579c2178k37637N3659
10008b16156g2925A81901c285B56670G344J9845K57354h4526q073A00274a9120
9996A54600b07731J3578a4154A09506a8945A8042a17310M3174j5708J66c2666
9984a91225E5578b4804D6420c07515A16584c06818G0094b16519L5734k28418F3070
9972a4526q4095j31988B59305d35951K03399A54242K4170c65103B7793b13921
9961b1392l39825A48366K37554i8504B09892A00594D7271e7300H0434k3336a4952
9949B48279D8030J5653c826D7196a77123j4690f7168j86653r4107H07a39203B6571
$$ plain form
10030 -57717 134950 -83108 280925 -45338 -184151 64498 -132370 -45059 121528 -66380 73117
10018 -47062 -113068 184639 -120317 80031 260020 -266687 -139108 -32178 -269815 -216156
10008 -216156 -72925 181901 -3285 256670 7344 27189 284543 -84526 -92599 100274 -19120
9996 154600 -207731 -194153 -14154 109506 -18945 18042 -117310 -74136 -89844 -89678 -32666
9984 -191225 55578 -24804 46420 -307515 116584 -306818 70094 -216519 -180785 -409203 63070
9972 -14526 -98621 -230609 259305 -435951 -232552 154242 178412 -365103 27793 -213921
9961 -21392 -361217 148366 385920 -98504 209892 100594 47271 -57300 80434 57098 -14952
9949 248279 48030 63683 -3826 47196 -177123 -191813 -67168 -253821 -347928 807 -139203 26571
9936A36255e8289K3496B01146c454p7824a0223k37810M3888C4272A1834m271J06241
9924A13804b77693O6190C6718a81067C4278a7851l18122J44739E5792J30677N8599
9913B45068c5180G0337l1170e9120B7549b67271J19089A09044K5996f1662n3380
9902a15042A11708d5633k43705D1363a36340l2119j8870r2835A6131d1184j85749
9891b26933J10712j14118h7817k5439G9997c0774k44847a37439j81956O129L0689
9880b82577i3135F2295f5299j71368G964a433A60921N0982a55437k03937J60320
9869a99054J0392B33227b44488j44100A14395e3022j88128B44721c61915e0953
9858b23249C0916b54520G3535B252o10f9462A73178d6624n6528j39496E7850Q0282
$$ plain form
9936 136255 -58289 -34793 201146 -3454 -81278 -10223 -248033 -204145 34272 11834 7563 113804
9924 113804 -277693 -211503 36718 -181067 34278 -17851 -335973 -191234 55792 186469 245068
9913 245068 -35180 70337 39167 -59120 27549 -267271 -148182 109044 135040 -61662 -115042
9902 -115042 111708 -45633 -289338 41363 -136340 -168459 -187329 -280164 16131 -41184 -226933
9891 -226933 -116221 -230339 -87817 -113256 79997 -30774 -275621 -137439 -319395 -313266 -282577
9880 -282577 -93135 62295 -65299 -236667 7964 -1433 160921 211903 -155437 -359374 -199054
9869 -199054 -188662 233227 -244488 -388588 114395 -53022 -241150 244721 -361915 -50953
9858 -223249 30916 -254520 73535 2252 1642 -69462 173178 -46624 -103152 -242648 57850 138132
9846A38132F5054b44018C20568d27314I9355A5142a0396k39197I9348a7611H4814
9834a96492A29738a44947B09607g5934j13591A73114D1191b31486k1777M0896
9824b12367a01386k67016F1627b09076D16a38930o2382j5569j3093E0535A3190
9812i8143L6252B12857A9757b50051C975a41824o076j47508M501j08595G5698
9800d8415D1434b77957d8304B40774f26883C7110a69471B38379F449a10939D3109
9788c0780C31403a59987f3469A05486O4609a24258A99575i3765B3816b38087k04638
9777d42725E1141J9706b65072A06645b63244B07564I154Q7215b17725f1633b3572
9765a36988B35703Q9279G0976a87866C3419b895A65419L5639d85442p381B6797
$$ plain form
9846 138132 65054 -244018 320568 -427314 99355 15142 -10396 -249593 99348 -17611 84814
9834 -196492 129738 -144947 209607 -75934 -189525 173114 41191 -231486 -253263 -212367
9824 -212367 -101386 -368402 61627 -209076 416 -138930 -201312 -216881 -229974 50535 13190
9812 -98143 -61891 212857 19757 -250051 3975 -141824 -147900 -295408 -290907 -399502 75698
9800 -48415 41434 -277957 -48304 240774 -626883 37110 -169471 238379 6449 -110939 43109
9788 -30780 331403 -159987 -63469 105486 170095 -124258 199575 -93765 23816 -238087 -442725
9777 -442725 51141 70847 -265072 106645 -263244 207564 9154 96369 -217725 -61633 -23572
9765 -136988 235703 324982 70976 -187866 33419 -2895 165419 201058 -485442 -492823 26797
9753A16151e19673b48266i0345A73320A1521h0128B4523h5254r6428P3943k96593
9742d04332J87092Q3236A13210R0067a69555M2810A93658a61542A5139J77380
9732A92519e1673j61147F0211c5166r3362l08727J41153A84860h6809L0842K459
9721e3508C2620d12432a0258A65887a96488I845e5844A7723P1879g5314j07662
9710a82976e9806j7125A90190c31169D53929b12935A93794n1120b8538l25250
9700c53788J50641D2942h3134p3621L3737m7893F116b65206h8609A66983q0420
9689H6563C7158c0852B0437b18130h1606j10107A97106E0564J77369c09524i1149
9677b30458A03309K3991k2671o399a21564B30043A0381b7957A03667a54220A52620
$$ plain form
9753 116151 -519673 -248266 -90345 173320 11521 -80128 24523 -85254 -181682 -107739 -404332
9742 -404332 -217240 -134004 113210 203277 -169555 -126745 193658 -161542 15139 192519
9732 192519 -51673 -212820 60211 -35166 -128528 -437255 -296102 184860 -86809 -55967 -53508
9721 -53508 32620 -412432 -10258 165887 -196488 9845 -55844 17723 89602 -75314 -182976
9710 -182976 -59806 -76931 190190 -331169 453929 -212935 193794 142674 -28538 -353788
9700 -353788 -203147 42942 -83134 -156755 -123018 -170911 6116 -265206 -88609 166983 86563
9689 86563 37158 -30852 20437 -218130 -81606 -191713 197106 50564 227933 -309524 -91149
9677 -230458 103309 127300 104629 98230 -121564 230043 10381 -27957 103667 -154220 152620
9665a77327B9860e8636k32235a16758k69551f9092j7217j63764g2444I6464c52418
9653A20289M55919f7391q5754G924P2054Q1766l3885b37730B25795e0865B1418
9641f8029q7555N6852n7662P0749j31276A43027Q4698a71953D5725N10b79420
9629h7247j13822N0642A96383A1823c57964D0037a98482A01522b31610o8600D261
9617c18679F2720L9944g1380j21376e2345j68973E6176c3904k7569k42539J29571
9606a74441A743e2037B18402j05124d48439a53344L9731B90046a15419b1152j1983
9595c3135j12552j42923r5323b6675j22193A5113b34415B27793Q2933a43655N5759
9584h7896o9307f4262F0933N4007i7110F6514h6331j32163E0243J44577l8144
$$ plain form
9665 -177327 29860 -58636 -290871 -116758 -386309 -69092 -86309 -250073 -72444 96464 -352418
9653 120289 576208 -67391 -153145 7924 79978 161744 127859 -237730 225795 -50865 21418
9641 -68029 -155584 -98732 -156394 -85645 -216921 143027 227725 -171953 45725 46235 -279420
9629 -87247 -201069 -150427 196383 11823 -357964 40037 -198482 101522 -231610 -300210 4261
9617 -318679 62720 102664 -71380 -192756 -52345 -221318 56176 -33904 -61473 -304012 -174441
9606 -174441 1743 -52037 218402 113278 -448439 -153344 -113613 290046 -115419 -21152 -33135
9595 -33135 -145687 -288610 -383933 -26675 -148868 15113 -234415 227793 310726 -143655 -87896
9584 -87896 -157203 -64262 60933 114940 -97110 66514 -86331 -218494 50243 194820 156676
9573A56676b05135b1279j84178L3433B18502c55876B296a4973A31977L5519b49279
9561a55615A9343b42195A87346b16434C47884i6684H9031J09033F46f8929A42756
9549H1117B9441J38236i0878G1120a55601f9165k9280j91586A09573b14393N9899
9538a54494k9803M6314d2592A26547f2710A76648a27851A15008b49989A33083
9527D6610a01567l1596B49034j22564k86l0549c1610C5985f0499C08195a40868
9515A35019a46158d2661C4742c7857j89098Q3851k7988F012J60804f1637A07016
9503a50956o8277D5617N528M7298M2534B7365J67771a26365k37141k5913h2276
9491a49916A50560b54614k43253F1111c60442a07127q9591f7518j39358A41350
$$ plain form
9573 156676 -205135 -21279 -205457 -172024 218502 -355876 2296 -14973 131977 167496 -249279
9561 -155615 19343 -242195 187346 -216434 347884 -96684 89031 198064 646 -68929 142756
9549 81117 29441 167677 -90878 71120 -155601 -69165 -98445 -290031 109573 -214393 -154494
9538 -154494 -184297 -137983 -42592 126547 -62710 176648 -127851 115008 -249989 133083
9527 46610 -101567 -133163 249034 126470 126184 95635 -31610 35985 -60499 308195 -140868
9515 135019 -146158 -42661 34742 -37857 -226955 -143104 -171092 6012 166816 -61637 107016
9503 -150956 -219233 45617 51145 98443 140977 27365 195136 -126365 -363506 -389419 -82276
9491 -149916 150560 -254614 -497867 61111 -360442 -107127 -196718 -67518 -206876 141350
9480f4681b235l4633J7342A14555a65947A14302d8580k01429C4825e9585C566
9468B10039p4503n7643h529B20762i0899k18792A43658e3938p3141B12662c28089
9456b98B84243a39978M5662A11743a24775j12304I2844b23588A03153a74399L2454
9445a41945M5979j49878B54247b0994k74551d7472A30273h6797E016R1457a37763
9433b41415b4831F3709a69370B72532b89342O5872j01635A11170a40116O8429
9423g1687H071K0593a90621k90574a89570J0695O2251A1955M4789b62641k41260
9412e03901c8504o0025A10351C0686O3168a63296B6050e1545j95879A0836L0702
9401D1538f1552k12135a36329p3962G201d3074C11835b36200i7687B61477c91736
$$ plain form
9480 -64681 -2235 -36868 -19526 114555 -165947 114302 -48580 -250009 34825 -59585 3566
9468 210039 135536 77893 -8529 220762 -90899 -309691 143658 -53938 -127079 212662 -328089
9456 -298 284243 -139978 -94316 111743 -124775 -237079 92844 -223588 103153 -174399 -141945
9445 -141945 -95966 -245844 254247 -20994 -295545 -47472 130273 -86797 5016 96473 -137763
9433 -241415 -24831 63709 -169370 272532 -289342 -223470 -325105 111170 -140116 -71687
9423 -71687 8071 28664 -190621 -481195 -189570 -178875 -116624 11955 56744 -262641 -503901
9412 -503901 -38504 -98529 110351 30686 93854 -163296 26050 -51545 -247424 10836 41538
9401 41538 -61552 -273687 -136329 -210291 7201 -43074 311835 -236200 -97687 261477 -391736
9389i4834k37920d7097G4139b39450B42328e2463k6758a6175j90257e0492I7934
9377A57414b09827O0753H4624b33360j30138J52006j01911J37371j5190d742l24154
9366c28896d6775j79259J11583E0841L4945a74158A53586d1293C7173b4143j07055
9355a31198A8414a25486k50813E3749a38102A27110b8310H5173c90748A60898
9344A95055G1369a16527C7471c1235r5969N5493j65661m0204J15582g8681a2096
9332b71571J8355d8158A71871J37749a43039b7942j8498A17364c22574R5415n1696
9321b78855h9864k06143a4720D2694j3412d03473A62559e7597d34k7330j38304
9310a66068r5573G5099c9389q8796C07944L67a35619e8877A54747E6809b80372
$$ plain form
9389 -94834 -332754 -47097 74139 -239450 242328 -52463 -79221 -16175 -206432 -50492 97934
9377 157414 -209827 -149074 84624 -233360 -363498 -211492 -313403 -176032 -191222 -4742 -328896
9366 -328896 -46775 -226034 -114451 50841 85786 -174158 153586 -41293 37173 -24143 -131198
9355 -131198 18414 -125486 -376299 53749 -138102 127110 -28310 85173 -390748 160898
9344 195055 71369 -116527 37471 -31235 -127204 -71711 -237372 -277576 -161994 -78681 -12096
9332 -271571 -253216 -48158 171871 309620 -143039 -27942 -46440 117364 -322574 -227159 -278855
9321 -278855 -89864 -296007 -14720 42694 29282 -403473 162559 -57597 -434 -27764 -166068
9310 -166068 -261641 75099 -39389 -128185 307944 308311 -135619 -58877 154747 56809 -280372
9298c9268I2573a2563m7160H3170J37589b14267D457a98297a5651j59376p1502
9287b46529J01142f8189j51492k9750n5736F3329a35282c1788j04703M5185I8335
9275f8616k1307P094j32044A38395b45228A6311K3486b20987g1983b8392l481
9264c1873m6420D1343a63793A05445d70142C5308h0346B8439J23316a89192j01526
9253b90718P6940m0717B6527a02250F5638a15352A91514o5354b2330A39210a3559
9241B16914f8972J1085j34909B26423a34341P809A5811R6663d35555A97748a11744
9229A74330c8401j63865P5197l8466K5342r7964B1321d3424A14079L5637c4462
9217A87956m0109D2344a26191i459j11397a5781E0586K54844B6583c00106a00254
$$ plain form
9298 -39268 92573 -12563 -59723 83170 220759 -214267 4457 -198297 -15651 -175027 -246529
9287 -246529 -145387 -68189 -219681 -249431 -305167 63329 -135282 -31788 -136491 -91306 98335
9275 -68616 -89923 -82829 -214873 138395 -245228 16311 39797 -220987 -71983 -28392 -31873
9264 -31873 -78293 41343 -163793 105445 -470142 35308 -80346 28439 151755 -189192 -290718
9253 -290718 -213778 -254495 26527 -102250 65638 -115352 191514 126160 -22330 139210 -13559
9241 216914 -68972 -57887 -192796 226423 -134341 -126532 15811 112474 -435555 197748 -111744
9229 174330 -38401 -202266 -127069 -165535 -140193 -238157 21321 -43424 114079 149716 -34462
9217 187956 147847 42344 -126191 -9459 -120856 -15781 50586 305430 26583 -300106 -100254
9205a83946A63057a02744B4169b17799B3643g4248r2280A28857i747k35544j79337
9194d24628A79020G5942B8417a81751j45302h3763j9710l29851A51718a83982
9183I1500a45628a822I8444a75277p9195c0427k8112r5871c9219A65265b19666
9171c0786A37461b32029d2988n8846I5293a22940i708B03891A01114g5817n1836
9160a27653j22408p0052a34637J5364p0060L5776G7813b25418Q1128j3982o6670
9149b24942g2083B5091a0581m1308k44649a41312K0045I0208e4010j63609A40223
9137A25213a18591l7669l754B34300D7102a42525H0641a27855n9698M6367C8314
9125B9170b23188B16850b15837A95300l2194o052n2743a36853k57391a36775j4371
$$ plain form
9205 -183946 163057 -102744 24169 -217799 23643 -74248 -166528 128857 -9747 -245291 -424628
9194 -424628 179020 75942 28417 -181751 -327053 -83763 -103473 -433324 151718 -183982
9183 91500 -145628 -1822 98444 -175277 -254472 -30427 -58539 -154410 -39219 165265 -219666
9171 -30786 137461 -232029 -42988 -101834 95293 -122940 -9708 203891 101114 -75817 -127653
9160 -127653 -250061 -320113 -134637 -119273 -189333 -153557 77813 -225418 -144290 -158272 -224942
9149 -224942 -72083 25091 -10581 -51889 -296538 -141312 -121267 90208 -54010 -217619 140223
9137 125213 -118591 -156260 -160014 234300 47102 -142525 80641 -127855 -187553 -141186 38314
9125 29170 -223188 216850 -215837 195300 163106 157054 104311 -136853 -394244 -136775 -151146
9114a51146j24519e4551m5828A35835f8908A59708p5815a80674q858F7299c39984
9102E8638g1964j18509N8822m0322g2234F7194M2488b3211j52307I1835a53692
9090c9832A01572a40653j83189A22660a13567B02356H446h5959b1025M517A42282
9078a25487k55838R8850a4934j67497p0907A39242f4353a6827k12158g5693C05549
9066f1251A30274R9163a6494A15933a17014B55957a34213L9982m9732b0521p9655
9055a00176A7037c25403c0240j00604q6226b8105A35456E0706b37654J0638j81599
9044d08615B39206b5859j24879j44619e4511r6004k3628M248A71631n2934c6367
9032a05667m3691p738n5026i1165f289B44300A13593a27925D5974L5960b44987
$$ plain form
9114 -151146 -275665 -54551 -100379 135835 -68908 159708 83893 -180674 -189532 67299 -339984
9102 58638 -71964 -190473 -131651 -171973 -72234 67194 109682 -23211 -175518 91835 -153692
9090 -39832 101572 -140653 -323842 122660 -113567 202356 8446 -85959 -21025 -16508 142282
9078 -125487 -381325 -282475 -14934 -182431 -253338 139242 -64353 -16827 -228985 -75693 305549
9066 -61251 130274 229437 -16494 115933 -117014 255957 -134213 -94231 -143963 -20521 -100176
9055 -100176 17037 -325403 -30240 -130844 -217070 -28105 135456 50706 -237654 -227016 -408615
9044 -408615 239206 -25859 -150738 -295357 -54511 -150515 -174143 -169895 171631 118697 -36367
9032 -105667 -149358 -157096 -212122 -91165 -6289 244300 113593 -127925 45974 81934 -244987
9020C744J92689a18980B3863b30591k7242B4920c91820b2433I4157a4323q8941
9009a03264k1534j26848Q0925L5723B67605g899b173A34990a1886E9526c05545
8997b35361j33619A08541g5413k28084J46416m7075c710p5063k75260I6686K02600
8986B99286A09016a308j48278A72800a28243I6853b08992g4200B01102f4563l09713
8975c74276D6910a83536B41748b3105k74873J12435H0389j7154M9393A9371C783
8963g6510l1579j40745B2850a13669A5022M2631b03803e8452A21002J62032E533
8951A22456d23595A15792a1076j98156Q8845E2911b28688g5260I6566K1867b40888
8939A72598a25909F4608a28888A51821M2220K72937b28221j7112G0452j1814j5140
$$ plain form
9020 3744 196433 -118980 23863 -230591 -257833 24920 -391820 -22433 94157 -14323 -103264
9009 -103264 -124798 -251646 -170721 -134998 267605 -7899 -2173 134990 -11886 59526 -305545
8997 -235361 -368980 108541 -75413 -303497 -157081 -204156 -3710 -78773 -354033 96686 299286
8986 299286 109016 -1308 -149586 172800 -128243 96853 -208992 -74200 201102 -64563 -374276
8975 -374276 46910 -183536 241748 -23105 -297978 -185543 80389 63235 112628 19371 3783
8963 -76510 -108089 -248834 22850 -113669 15022 57653 -203803 -58452 121002 283034 5533
8951 122456 -423595 115792 -11076 -209232 -120387 52911 -228688 -75260 96566 118433 -240888
8939 172598 -125909 64608 -128888 151821 194041 466978 -228221 -245333 70452 58638 43498
8928D3498J9604J75337J20998P0501Q36503J731689P013293L774364C449637E85031
8917F10888k50765j5715j41657f5629C08544e1786A79001b1553F01454k19987
8907C81467A3289a90953P9245m1529A11699h4676j99618G4152a81093e6471l1760
8896h8231k17185P449f7727B8253r413L1797a34483o9535e190A04331J05132m6265
8884A63198o1394l0041K2328P200b36939k22687a84023j35188M8363a17748p1615
$$ plain form
8928 43498 63102 238439 359437 429938 1266441 2998130 10011423 13785787 3449637 585031
8917 610888 360123 344408 202751 -65629 308544 -51786 179001 -21553 601454 381467
8907 381467 13289 -190953 -111708 -153237 111699 -84676 -284294 74152 -181093 -56471 -88231
8896 -88231 -305416 -297967 -67727 28253 18840 50637 -134483 -204018 -5190 104331 209463 163198
8884 163198 101804 71763 94091 101291 -236939 -459626 -184023 -319211 -270848 -117748 -189363
$$ [...]
##END NTUPLES=NMR SPECTRUM
##END=
