
##TITLE=AC1398_2151uv_7519910_E9KT24DFFK
##JCAMPDX= 6.0         $$ Bruker NMR JCAMP-DX V2.0
##DATA TYPE= NMR SPECTRUM
##DATA CLASS= NTUPLES
##ORIGIN= BRUKER
##OWNER= Administrator
$$ 1.72 TOPSPIN		Version 2.1
$$ 2013-02-19 19:53:02.659 -0500  Administrator@X
$$ Compression mode = diff/dup
##.OBSERVE FREQUENCY= 400.02188249412
##.OBSERVE NUCLEUS= ^1H
##.ACQUISITION MODE= SIMULTANEOUS (DQD)
##.ACQUISITION SCHEME= undefined
##.AVERAGES= 8
##.DIGITISER RES= 22
##SPECTROMETER/DATA SYSTEM= spect
##.PULSE SEQUENCE= zg30
##.SOLVENT NAME= COFFEE_meoh
##.SHIFT REFERENCE= INTERNAL, COFFEE_meoh, 1, 14.98509
##AUDIT TRAIL= $$ (NUMBER, WHEN, WHO, WHERE, PROCESS, VERSION, WHAT)
$$ ##TITLE= Audit trail, TOPSPIN		Version 2.1
$$ ##JCAMPDX= 5.01
$$ ##ORIGIN= Bruker BioSpin GmbH
$$ ##OWNER= Administrator
$$ $$ E:\/data/COFFEE/nmr/AC1398_2151uv_7519910_E9KT24DFFK/10/pdata/1/auditp.txt
$$ ##AUDIT TRAIL=  $$ (NUMBER, WHEN, WHO, WHERE, PROCESS, VERSION, WHAT)
(   1,<2013-02-19 19:52:54.175 -0500>,<Administrator>,<X>,<go>,<TOPSPIN 2.1>,
      <created by zg
	started at 2013-02-19 19:51:48.065 -0500,
	POWCHK enabled, PULCHK disabled,
       configuration hash MD5:
       86 BA 57 50 F2 9D 5C 9B 26 00 A9 28 5F 66 2E 89
       data hash MD5: 64K
       3A 37 AD 68 44 C3 CE AC 84 9B 31 10 02 A8 91 A2>)
(   2,<2013-02-19 19:52:57.409 -0500>,<Administrator>,<X>,<proc1d>,<TOPSPIN 2.1>,
      <Start of raw data processing
       efp LB = 0 FT_mod = 6 PKNL = 1 PHC0 = 0 PHC1 = 0 SI = 32K 
       data hash MD5: 32K
       3C 57 74 77 F5 30 66 62 6A D0 93 07 B1 53 18 00>)
(   3,<2013-02-19 19:52:57.878 -0500>,<Administrator>,<X>,<proc1d>,<TOPSPIN 2.1>,
      <pk PHC0 = 73.03162 PHC1 = 0 
       data hash MD5: 32K
       D3 D2 4D BB 79 64 1F 6A 03 6F E5 73 BE D2 9D A6>)
(   4,<2013-02-19 19:52:58.128 -0500>,<Administrator>,<X>,<proc1d>,<TOPSPIN 2.1>,
      <abs ABSG = 1 
       data hash MD5: 32K
       C0 8C 7D F2 97 C8 C4 A3 58 84 79 7F 1F 28 77 1E>)
(   5,<2013-02-19 19:52:58.268 -0500>,<Administrator>,<X>,<proc1d>,<TOPSPIN 2.1>,
      <abs ABSG = 2 
       data hash MD5: 32K
       18 1D 4A B5 98 D4 D9 48 63 EF FC EC 9F C0 95 D4>)
(   6,<2013-02-19 19:52:58.425 -0500>,<Administrator>,<X>,<proc1d>,<TOPSPIN 2.1>,
      <abs ABSG = 3 
       data hash MD5: 32K
       EC 38 1C CF 1A 6B 4E 06 9D AA DE BD D7 80 E9 34>)
(   7,<2013-02-19 19:52:58.565 -0500>,<Administrator>,<X>,<proc1d>,<TOPSPIN 2.1>,
      <abs ABSG = 4 
       data hash MD5: 32K
       09 DE E1 DA 21 AE 64 31 5D 40 51 44 1B 98 7E B2>)
(   8,<2013-02-19 19:52:58.737 -0500>,<Administrator>,<X>,<proc1d>,<TOPSPIN 2.1>,
      <abs ABSG = 5 
       data hash MD5: 32K
       D2 3B C8 58 FE 77 C8 52 42 1A B4 2E 15 CB 6F 91>)
$$ ##END=
$$ 
$$ $$ hash MD5
$$ $$ 5E 53 45 50 7E BC FA E5 3F 0C 87 17 FE 37 1F 7E
##$RELAX= 
##$RELAX= 
##$RELAX= 
##$RELAX= 
##$RELAX= 
##$RELAX= 
##$RELAX= 
$$ Bruker specific parameters
$$ --------------------------
##$DU= <E:\>
##$EXPNO= 10
##$NAME= <AC1398_2151uv_7519910_E9KT24DFFK>
##$PROCNO= 1
$$ [...]
150 150 150 150 150 150 150 150
##$TP07= 0
##$TPNAME0= <>
##$TPNAME1= <>
##$TPNAME2= <>
##$TPNAME3= <>
##$TPNAME4= <>
##$TPNAME5= <>
##$TPNAME6= <>
##$TPNAME7= <>
##$TPOAL= (0..7)
0.5 0.5 0.5 0.5 0.5 0.5 0.5 0.5
##$TPOFFS= (0..7)
0 0 0 0 0 0 0 0
##$TUNHIN= 0
##$TUNHOUT= 0
##$TUNXOUT= 0
##$USERA1= <user>
##$USERA2= <user>
##$USERA3= <user>
##$USERA4= <user>
##$USERA5= <user>
##$V9= 5
##$VALIST= <valist>
##$VCLIST= <CCCCCCCCCCCCCCC>
##$VD= 0
##$VDLIST= <DDDDDDDDDDDDDDD>
##$VPLIST= <PPPPPPPPPPPPPPP>
##$VTLIST= <TTTTTTTTTTTTTTT>
##$WBST= 1024
##$WBSW= 4
##$XGAIN= (0..3)
0 0 0 0
##$XL= 0
##$YL= 0
##$YMAX_a= 555174
##$YMIN_a= -541814
##$ZGOPTNS= <>
##$ZL1= 120
##$ZL2= 120
##$ZL3= 120
##$ZL4= 120
##$ABSF1= 14.98509
##$ABSF2= -5.573092
##$ABSG= 5
##$ABSL= 3
##$ALPHA= 0
##$AQORDER= 0
##$ASSFAC= 0
##$ASSFACI= 0
##$ASSFACX= 0
##$ASSWID= 0
##$AUNMP= <proc_prof1d_extract_pilot.lims>
##$AXLEFT= 0
##$AXNAME= <>
##$AXNUC= <1H>
##$AXRIGHT= 0
##$AXTYPE= 0
##$AXUNIT= <>
##$AZFE= 0.1
##$AZFW= 0.1
##$BCFW= 0
##$BC_mod= 0
##$BYTORDP= 0
##$COROFFS= 0
##$CY= 15
##$DATMOD= 1
##$DC= 0
##$DFILT= <>
##$DTYPP= 0
##$F1P= 0
##$F2P= 0
##$FCOR= 0.5
##$FTSIZE= 32768
##$FT_mod= 6
##$GAMMA= 0
##$GB= 0
##$INTBC= 1
##$INTSCL= 1
##$ISEN= 128
##$LB= 0
##$LEV0= 0
##$LPBIN= 0
##$MAXI= 10000
##$MC2= 0
##$MEAN= 0
##$ME_mod= 0
##$MI= 0
##$NCOEF= 0
##$NC_proc= -8
##$NLEV= 6
##$NOISF1= 0
##$NOISF2= 0
##$NSP= 0
##$NTH_PI= 0
##$NZP= 0
##$OFFSET= 14.98509
##$PC= 1
##$PHC0= 73.03162
##$PHC1= 0
##$PH_mod= 1
##$PKNL= yes
##$PPARMOD= 0
##$PPDIAG= 0
##$PPIPTYP= 0
##$PPMPNUM= 2147483647
##$PPRESOL= 1
##$PSCAL= 4
##$PSIGN= 0
##$PYNMP= <proc.py>
##$REVERSE= no
##$SF= 400.02
##$SI= 32768
##$SIGF1= 0
##$SIGF2= 0
##$SINO= 400
##$SIOLD= 32768
##$SPECTYP= <>
##$SREGLST= <1H.CDCl3>
##$SSB= 0
##$STSI= 32768
##$STSR= 0
##$SW_p= 8223.68421052631
##$SYMM= 0
##$S_DEV= 0
##$TDeff= 65536
##$TDoff= 0
##$TI= <>
##$TILT= no
##$TM1= 0
##$TM2= 0
##$TOPLEV= 0
##$USERP1= <user>
##$USERP2= <user>
##$USERP3= <user>
##$USERP4= <user>
##$USERP5= <user>
##$WDW= 1
##$XDIM= 32768
##$YMAX_p= 458044192
##$YMIN_p= -777719
##$CURPLOT= <Network HP LaserJet P1505>
##$CURPRIN= <$Network HP LaserJet P1505>
##$DFORMAT= <normdp>
##$LAYOUT= <+/1D_H.xwp>
##$LFORMAT= <normlp>
##$PFORMAT= <normpl>
##$SURQMSG= 1
$$ End of Bruker specific parameters
$$ ---------------------------------
##NTUPLES= NMR SPECTRUM
##VAR_NAME=  FREQUENCY,     SPECTRUM/REAL,   SPECTRUM/IMAG
##SYMBOL=    X,             R,               I
##VAR_TYPE=  INDEPENDENT,   DEPENDENT,       DEPENDENT
##VAR_FORM=  AFFN,          ASDF,            ASDF
##VAR_DIM=   32768,         32768,           32768
##UNITS=     HZ,            ARBITRARY UNITS, ARBITRARY UNITS
##FACTOR=    0.250966925370066, 1,           1
##FIRST=     8223.43324360094, 63616,        -254767
##LAST=      0,             -62927,          -34889
##MIN=       0,             -777719,         0
##MAX=       8223.43324360094, 458044192,    0
$$ Real data points
##PAGE= N=1
##DATA TABLE= (X++(R..R)), XYDATA
$$ [...]
19567a74883B3105J20735f1777b1277D04662j68274c16106B67895H2970a08534
$$ -174883 23105 143840 -61777 -21277 404662 236388 -316106 267895 82970 -108534
19556b31288P3693D9114b5387j12161C08536a07968d6556F5920a80487o4807D7421
$$ -231288 -157595 49114 -25387 -137548 308536 -107968 -46556 65920 -180487 -245294 47421
19544A0223b43502D5909J751K29852b8111j2886k48709n830G7546h6365k59820
$$ 10223 -243502 45909 47660 277512 -28111 -40997 -289706 -295536 77546 -86365 -346185
19533c46185R8917F6406b2018m1732D3941L7280c77159B62166e82806H1265a54767
$$ -346185 -247268 66406 -22018 -63750 43941 81221 -377159 262166 -582806 81265 -154767
19521a82760A73071b82351A00658a15413j45282j6093f3252j66820g3654D03J9209
$$ -182760 173071 -282351 100658 -115413 -260695 -276788 -63252 -230072 -73654 403 19612
19510A9612c11526A7859b46166I9136N2604a07959q1326B07892D4760a54764F4907
$$ 19612 -311526 17859 -246166 99136 151740 -107959 -189285 207892 44760 -154764 64907
19498a49076r0618C55240a48643d4398E8513h1083L2134j88027g6488A30419i4789
$$ -149076 -239694 355240 -148643 -44398 58513 -81083 -48949 -236976 -76488 130419 -94789
19486e1072j64968a7627l02666m647J11786R1584B22895b28871k0020B62334d5607
$$ -51072 -216040 -17627 -320293 -324940 -213154 -121570 222895 -228871 -248891 262334 -45607
19474B11756d02165B80251C7293a22262j4071N7072b9870l79237A79293b61484
$$ 211756 -402165 280251 37293 -122262 -136333 -79261 -29870 -409107 179293 -261484
19463B18822o3154i4994j09200C911a83722C5213b51312j4734A10831c63909i9461
$$ 218822 155668 -94994 -204194 3911 -183722 35213 -251312 -266046 110831 -363909 -99461
19451a47671P2633b5634D6013a51661q5472B45976a48800A20277b5492p5270n3684
$$ -147671 -75038 -25634 46013 -151661 -237133 245976 -148800 120277 -25492 -100762 -154446
19440a54446d5543l6962D118J09966a09580j4618b7484A01017a0121j4060k14321
$$ -154446 -45543 -82505 4118 114084 -109580 -124198 -27484 101017 -10121 -24181 -238502
19429b38502f8428A67033g2226A25395J1607M027c13197a11033B188b5789n4324
$$ -238502 -68428 167033 -72226 125395 137002 141029 -313197 -111033 2188 -25789 -80113
19418h0113J6738p9308M5676C40060B0596P2372Q889b290p1137n4085j09574f9077
$$ -80113 -63375 -142683 -97007 340060 20596 92968 101857 -2290 -73427 -127512 -237086 -69077
19405i9473L1745l35010A12856a92985k49438D0197q158J91210a37666B45501
$$ -99473 -67728 -402738 112856 -192985 -442423 40197 32039 223249 -137666 245501
19394g6832j22922A22076b91972m85747a4450k6191k51984G1467c13748R8307
$$ -76832 -199754 122076 -291972 -777719 -14450 -40641 -292625 71467 -313748 -215441
19384b15441D0698j3751a23373r8973N3863a6885j37039A05405a59840A02082
$$ -215441 40698 26947 -123373 -222346 -168483 -16885 -153924 105405 -159840 102082
19373b5207A458b7709l64273a94323A29340b53273A02087b73698j45954G9737
$$ -25207 1458 -27709 -391982 -194323 129340 -253273 102087 -273698 -419652 79737
19362d7274n7888I8817N9620E810a5916k8950n786A04094B3239P6144C3613J03793
$$ -47274 -105162 98817 158437 5810 -15916 -44866 -50652 104094 23239 99383 33613 137406
19350A37406F8387f9655r4257n1988B35445C0017f6646j4495A27076l6402e3033
$$ 137406 68387 -69655 -163912 -215900 235445 30017 -66646 -81141 127076 90674 -53033
19338a26384j92951J20782B6462L40194A453h663j3404A5759a2683B3296b06927
$$ -126384 -319335 -198553 26462 366656 1453 -8663 -22067 15759 -12683 23296 -206927
19326a51877m3363M0120F8025h5987B78835c08231A2860a0151l57434e1449l3991
$$ -151877 -195240 -155120 68025 -85987 278835 -308231 12860 -10151 -367585 -51449 -85440
19315h5440k00738j01830a65905e1361F0904b18928a5626j7189A71430b89171
$$ -85440 -286178 -388008 -165905 -51361 60904 -218928 -15626 -32815 171430 -289171
19304h3702H0433P9475h9592K4941p8317A53601c25336A02996b41595I7378C8353
$$ -83702 80433 159908 -89592 -64651 -142968 153601 -325336 102996 -241595 97378 38353
19292b62705A87824b83301L9806A72651L2089L6976h5432G9695N4633a77766J9828
$$ -262705 187824 -283301 -243495 172651 204740 241716 -85432 79695 134328 -177766 -157938
19281a57938E3280c41781a8841k28629B55969b03162A78080a34018A37331a22301
$$ -157938 53280 -341781 -18841 -247470 255969 -203162 178080 -134018 137331 -122301
19270A11305a70504q1257G6657c27091I21J00789C2158a87958E3468c97395C62357
$$ 111305 -170504 -251761 76657 -327091 921 101710 32158 -187958 53468 -397395 362357
19258a37102A7654c33499G0737g5131G1859n019b04887N4953H3550f4536B2887
$$ -137102 17654 -333499 70737 -75131 71859 66840 -204887 -149934 83550 -64536 22887
19246A69300b05176C3547a41626A47483a67183k75750d2984B0057c46975J56767
$$ 169300 -205176 33547 -141626 147483 -167183 -442933 -42984 20057 -346975 -190208
19236a90208j93753a8277A10057b70583R4478b2336d330A88287K9967D8876b00793
$$ -190208 -383961 -18277 110057 -270583 -176105 -22336 -4330 188287 218254 48876 -200793
19224b09988i4307I9934a36604k2548g5548H9999b26756Q8644B41328i9600B08186
$$ -209988 -94307 99934 -136604 -159152 -75548 89999 -226756 -138112 241328 -99600 208186
19212b08377c0223o2320D1050b21970p6747I6450b36150q2568a40573m8933A27685
$$ -208377 -30223 -92543 41050 -221970 -298717 96450 -236150 -318718 -140573 -189506 127685
19200A5354J97669r8874m8670a60121m4628B70664f0874I7765h0272A01066C5382
$$ 15354 213023 114149 65479 -160121 -204749 270664 -60874 97765 -80272 101066 35382
19188H330P5647a45878B0137d15284a2216B9801J4874L6802j2971b74412A0532
$$ 8330 83977 -145878 20137 -415284 -12216 29801 44675 81477 68506 -274412 10532
19176c86956B17702H3793a22815k23789f2237j07393C9866M9432B8494h582j23579
$$ -386956 217702 83793 -122815 -346604 -62237 -169630 39866 89298 28494 -8582 -132161
19165a32161A89105a74020F984b7211j03816j87648L2458a7300j77851j1092k8968
$$ -132161 189105 -174020 6984 -27211 -131027 -318675 -286217 -17300 -195151 -206243 -235211
19154b35211c0094j70154P2174q2369c4470J0695F3165L8455a49297j6803A59176
$$ -235211 -30094 -200248 -128074 -210443 -34470 -23775 63165 101620 -149297 -166100 159176
19142A61281a28992d889B97350b24042K1447N3813O4376n2142b9094m31694e1290
$$ 161281 -128992 -4889 297350 -224042 -202595 -148782 -84406 -136548 -29094 -460788 -51290
19130f6231k13813J02901H0859f3893A06956K2670b88970J23732m5050B61801
$$ -66231 -280044 -177143 80859 -63893 106956 129626 -288970 -165238 -210288 261801
19119A02435a69050n9470c2948A46343a51591N9008k11022b3526j79255i5256
$$ 102435 -169050 -228520 -32948 146343 -151591 -92583 -303605 -23526 -202781 -95256
19108c664j73413k41721c5557B68138c17531a17605D9969a97500A31757d2476
$$ -3664 -177077 -418798 -35557 268138 -317531 -117605 49969 -197500 131757 -42476
19097A18360a77364A77401B5434a23441n2508h7741k24337G3412a3406A33750
$$ 118360 -177364 177401 25434 -123441 -175949 -87741 -312078 73412 -13406 133750
19086b53662q6336A32992b81191J39461j97606F9858c55349j342e7210F3341a88909
$$ -253662 -339998 132992 -281191 -141730 -339336 69858 -355349 -356691 -57210 63341 -188909
19074B49308E6356a54327A09439c29599J59964b9576B16108b40294A15320g568
$$ 249308 56356 -154327 109439 -329599 -169635 -29576 216108 -240294 115320 -7568
19063B82184i6106A89897J74121g985j13160b3994o0895m18756G5914g4319c2933
$$ 282184 -96106 189897 364018 -7985 -121145 -23994 -84889 -503645 75914 -74319 -32933
19051A30082J7082a35023D7941a14879L7294j33923B36195e5672B2688j725a32070
$$ 130082 147164 -135023 47941 -114879 -77585 -211508 236195 -55672 22688 20963 -132070
19039g6798E2731c98783A45293i2438D21850c6094k35251b8275D1417c4494j40799
$$ -76798 52731 -398783 145293 -92438 421850 -36094 -271345 -28275 41417 -34494 -175293
19028a75293A00801b19458P5371F9443J2982L04484K31654F2377K64276b70097
$$ -175293 100801 -219458 -144087 69443 82425 386909 618563 62377 326653 -270097
19017B2496c1621l4358k09695J2110a7908B7544a5307j7072B0327a93489A26252
$$ 22496 -31621 -65979 -275674 -263564 -17908 27544 -15307 -32379 20327 -193489 126252
19005h2598j72234B10307b73064p722A08606d6032j27206B45662a5376p8325N062
$$ -82598 -254832 210307 -273064 -280786 108606 -46032 -173238 245662 -15376 -93701 -88639
18994h8639A57984e60620E8403Q3816c78813J59727E0504L185d6207j27581c0486
$$ -88639 157984 -560620 58403 142219 -378813 -219086 50504 53689 -46207 -173788 -30486
18982B39837F2675l381P7109Q4290b49231f2064j31309j00090d478j82476o9967
$$ 239837 62675 59294 136403 220693 -249231 -62064 -193373 -293463 -4478 -186954 -256921
18971b56921d8562j16200O1681j52213j11237A51720M152a26010H6635k5011a70009
$$ -256921 -48562 -164762 -103081 -255294 -366531 151720 155872 -126010 86635 61624 -170009
18959B61226l8389a77788o1289R2529l7883h059j16903A66956E7676c366j04257
$$ 261226 222837 -177788 -239077 -146548 -184431 -8059 -124962 166956 57676 -3366 -107623
18948a07623B61100b17j8586B93547E1629a67100e64A73924a84193m1817A57596
$$ -107623 261100 -217 -18803 293547 51629 -167100 -564 173924 -184193 -226010 157596
18936a21245f0487l8722O296A0161R372g4287c3510l64311l288a2715E6866J8313
$$ -121245 -60487 -99209 -92913 10161 19533 -74287 -33510 -397821 -401109 -12715 56866 75179
18924G5179a76214f8419j58841B65173b7290k13825B60083J99924h4632F1744
$$ 75179 -176214 -68419 -227260 265173 -27290 -241115 260083 460007 -84632 61744
18913i8525j63548A31811c6380d133A82068a65531I230a28651R566A66769a08319
$$ -98525 -262073 131811 -36380 -4133 182068 -165531 9230 -128651 -119085 166769 -108319
18901a29660M5851A26007l3140a49345C18993p4552c72952A33438J59409G0947
$$ -129660 -83809 126007 92867 -149345 318993 244441 -372952 133438 292847 70947
18890H6857d02983g9548a4196B24739b2065k9634A16852E3153a08754A75621k0296
$$ 86857 -402983 -79548 -14196 224739 -22065 -51699 116852 53153 -108754 175621 155325
18879A55325b87307F3524L6225i7775A55746j5899b88035J00261A59022j2252
$$ 155325 -287307 63524 99749 -97775 155746 139847 -288035 -187774 159022 146770
18869A46770J03943C5303K28045h2835A04674c12194a01308l18411A80934b5578
$$ 146770 250713 35303 263348 -82835 104674 -312194 -101308 -419719 180934 -25578
18858a8895D0908a58852K1070O4577j4406k4013l62005A55371i2578g769B27572
$$ -18895 40908 -158852 -137782 -73205 -87611 -111624 -473629 155371 -92578 -7769 227572
18846A00059J08433i9368B7022b0597G883b51742F2570a66573A10807c0088C37403
$$ 100059 208492 -99368 27022 -20597 7883 -251742 62570 -166573 110807 -30088 337403
18834i9517k37394j2679A44911o0934c62699B1124b7652R056j41990J4249r1274
$$ -99517 -336911 -349590 144911 83977 -362699 21124 -27652 -18596 -160586 -146337 -237611
18823b37611J3182a03849B0445a27933M6149A93161J6439F7541K16291p6937f6885
$$ -237611 -224429 -103849 20445 -127933 -81784 193161 209600 67541 283832 206895 -66885
18811g2474A47470J43206p4193a64292f9444j46333D9201J98100o5383a66256
$$ -72474 147470 290676 216483 -164292 -69444 -215777 49201 247301 181918 -166256
18800a9851A5290c32580g1749B05450a92693j80748g7856A70499o220b59847h3015
$$ -19851 15290 -332580 -71749 205450 -192693 -373441 -77856 170499 164279 -259847 -83015
18788C20864j1764c84013d8280I0166A3285a62466M9833j25105j12068A77728
$$ 320864 309100 -384013 -48280 90166 13285 -162466 -112633 -237738 -349806 177728
18777C3757b77321A08674C6995b2511H5641c0717A3881a74224N1410B09642b9219
$$ 33757 -277321 108674 36995 -22511 85641 -30717 13881 -174224 -122814 209642 -29219
18765I9981i6213c3986j7279P624j71157b324r6839B802J37206K18229D020f4092
$$ 99981 -96213 -33986 -51265 -43641 -214798 -2324 -99163 2802 140008 358237 4020 -64092
18752A06338a38557a6840B0034h8024j59748J0095i2831o68B24609L1069h0127
$$ 106338 -138557 -16840 20034 -88024 -247772 -237677 -92831 -93499 224609 255678 -80127
18740b28190i7584G635i9580j5224I1280D2530i09l3031H3832L6743j9981d01211
$$ -228190 -97584 7635 -99580 -114804 91280 42530 -909 -33940 83832 120575 100594 -401211
18727B9341J86439E1279c55534a76326n3193E4163a52815o2969k9166d7744n3614
$$ 29341 215780 51279 -355534 -176326 -229519 54163 -152815 -215784 -244950 -47744 -101358
18716a01358q2004h4870N950C28638d719k8100m10159J66794B29391M2135a4643
$$ -101358 -183362 -84870 -78920 328638 -4719 -32819 -442978 -276184 229391 271526 -14643
18704G4434O563J42338G2869a46432a6581j70612k6592b9452j15207f6509a715
$$ 74434 80997 223335 72869 -146432 -16581 -187193 -213785 -29452 -144659 -66509 -1715
18692f9792G9395B5850r875g3726A03161p640b10382a7852m719j90842M4329L794
$$ -69792 79395 25850 15975 -73726 103161 95521 -210382 -17852 -22571 -213413 -169084 -165290
18680a65290C26785H5397c4422r8494r9518O4069D3474a72256P0423L8362k05530
$$ -165290 326785 85397 -34422 -132916 -232434 -168365 43474 -172256 -101833 -63471 -269001
18669b69001j08397b8387n03341R6684F2467d01990B12957c89751f1073B0502
$$ -269001 -377398 -28387 -531728 -435044 62467 -401990 212957 -389751 -61073 20502
18658B9119a28718o9189A4681o5e9451r3938A17851L6490b07221H274g6366j77816
$$ 29119 -128718 -197907 14681 14616 -59451 -153389 117851 154341 -207221 8274 -76366 -254182
18646b54182O7468A88415B3841a75297f1099A37057e921k00922h1421A32285b3970
$$ -254182 -186714 188415 23841 -175297 -61099 137057 -5921 -206843 -81421 132285 -23970
18634c07963H7264L1352B56a0049n3311j85045e5712n2134d0689A37413b45011
$$ -307963 87264 118616 256 -10049 -63360 -248405 -55712 -107846 -40689 137413 -245011
18622a04212D849M2653g9234E9004J54805g4729l27584R1090A26732L6975c4482
$$ -104212 4849 47502 -79234 59004 213809 -74729 -402313 -311223 126732 163707 -34482
18610a66483n897k12944C2700P9242j6900L9269a43115e4289C9932J13206a21401
$$ -166483 -172380 -385324 32700 111942 95042 134311 -143115 -54289 39932 153138 -121401
18598b52475B8147R8737h868A0528h5300m6381j8804j8063e7075C55485c39141
$$ -252475 28147 126884 -8868 10528 -85300 -131681 -150485 -168548 -57075 355485 -339141
18586B57044C5927b04040o1316h7627a6379n4930A455a59987I9050J24700b6915
$$ 257044 35927 -204040 -265356 -87627 -16379 -71309 1455 -159987 99050 223750 -26915
18574a14236m7507K319o3164A3231J08218c12885Q9352h7886n7321B5238c6786
$$ -114236 -161743 -159424 -222588 13231 121449 -312885 -223533 -87886 -145207 25238 -36786
18562b47716J09972A29067c86990f7539A68264b51849j34078A4035b80j34228
$$ -247716 -137744 129067 -386990 -67539 168264 -251849 -385927 14035 -280 -134508
18552a34508N5357n4729L4027l83929B40754a67132J9124C1289b10553H2835N8413
$$ -134508 -79151 -133880 -99853 -483782 240754 -167132 -148008 31289 -210553 82835 141248
18541A41248A2777a59550M6678j2203j82088A65595K53825g9755a1457B2949f8187
$$ 141248 12777 -159550 -112872 -125075 -307163 165595 419420 -79755 -11457 22949 -68187
18529I99a9049k00716A78857a96918B79962i6138F4614B2191h6154G9348e0724
$$ 999 -19049 -219765 178857 -196918 279962 -96138 64614 22191 -86154 79348 -50724
18517a2846n6864p2421A11461k5645L02142h8573m8085B28944a62963G7481e9653
$$ -12846 -69710 -142131 111461 85816 387958 -88573 -136658 228944 -162963 77481 -59653
18505A80177b24272A9558c65494a19537A74159b51652P9651C3618a52976A05082
$$ 180177 -224272 19558 -365494 -119537 174159 -251652 -172001 33618 -152976 105082
18494g4259j72830i5792G0382N4091J2659a37877k2782D6403K91938a47194O1632
$$ -74259 -247089 -95792 70382 124473 137132 -137877 -160659 46403 338341 -147194 -85562
18483h5562j06270l3440A22463L8731O4377J47630B1638N8780L6332a75847g0726
$$ -85562 -191832 -225272 122463 161194 225571 373201 21638 80418 116750 -175847 -70726
18471c4711l3471q832m4022G8950b71691n1967N3300J29919A9302a60830O8598
$$ -34711 -68182 -77014 -121036 78950 -271691 -323658 -270358 -140439 19302 -160830 -92232
18460i2232o8360a2849j37606O3654G1161b6861l655n5543E081g2419j67774L0605
$$ -92232 -160592 -12849 -150455 -86801 71161 -26861 -30516 -86059 5081 -72419 -240193 -209588
18448b09588A13667e8185b2801j77216E5923L5492P3730D4146h2016j39107c4427
$$ -209588 113667 -58185 -22801 -200017 55923 91415 165145 44146 -82016 -221123 -34427
18436A73115b52481i2555j42418M0808B60859a43503j66890B06750I5624M6386
$$ 173115 -252481 -92555 -234973 -194165 260859 -143503 -310393 206750 95624 142010
18426A42010B7148d30916R1055a54466D6388b3744A53264b64148h5235E814M9382
$$ 142010 27148 -430916 -339861 -154466 46388 -23744 153264 -264148 -85235 5814 55196
18415E5196K12487c08777a41879A2578L09687G9782c12342g3893E1644M2161l8484
$$ 55196 267683 -308777 -141879 12578 322265 79782 -312342 -73893 51644 93805 55321
18404E5321a78333o5402A18031c17989M3851g8125k66986E3661e0683j68297j3909
$$ 55321 -178333 -243735 118031 -317989 -274138 -78125 -345111 53661 -50683 -218980 -232889
18393b32889i9088A98482k9868h1108B08616r9593f2799r4237j12032B6951c76227
$$ -232889 -99088 198482 168614 -81108 208616 109023 -62799 -157036 -269068 26951 -376227
18381b16815B2641K87360a96733k13677h6181B36663A2342Q1340A8302K31955
$$ -216815 22641 310001 -196733 -410410 -86181 236663 12342 93682 18302 250257
18371B50257a61445P8009G4832K7085b64972a05696j20258b0623A53228a76835
$$ 250257 -161445 -83436 74832 101917 -264972 -105696 -225954 -20623 153228 -176835
18360B33434E7222B6188c5888l815B34231f3979p0549J7898j41024A52794M4711
$$ 233434 57222 26188 -35888 -39703 234231 -63979 -134528 -116630 -257654 152794 197505
18349A97505a4007j09258C8743f1274b5581j64429p3792J11246D5741J13051a71317
$$ 197505 -14007 -123265 38743 -61274 -25581 -190010 -263802 -152556 45741 158792 -171317
18337C0165d67394g2015A32872K52623A16218c00785C47630A23246c7934j56085
$$ 30165 -467394 -72015 132872 385495 116218 -300785 347630 123246 -37934 -194019
18327a94019C9771a73801B75079b69950e768D0487b8534k40809A18882b56454
$$ -194019 39771 -173801 275079 -269950 -5768 40487 -28534 -269343 118882 -256454
18316a62694A88568G7928O2450a35811e6184A59869c12558e1444j0908B10296
$$ -162694 188568 77928 140378 -135811 -56184 159869 -312558 -51444 -62352 210296
18305b42719k3788R3365A84072c7799q8315q6512F0756K56223j02308A02908c2409
$$ -242719 -266507 -173142 184072 -37799 -126114 -212626 60756 316979 214671 102908 -32409
18293B37914b6476A88247c07030A73130D8796L22727e6565G6979C7810f7095A08365
$$ 237914 -26476 188247 -307030 173130 48796 371523 -56565 76979 37810 -67095 108365
18281b5748H1061d8985A7728J12538a50991H2716Q2492a76316A06275e2506l03663
$$ -25748 81061 -48985 17728 130266 -150991 82716 165208 -176316 106275 -52506 -356169
18270c56169I6179b78465H0692R9647J37954a65329j86641g3239j95453A29175
$$ -356169 96179 -278465 80692 180339 318293 -165329 -351970 -73239 -268692 129175
18259g2175j79248d1850j29385B832L8926O6526G398c03873J46341P2957l21101
$$ -72175 -251423 -41850 -171235 2832 41758 108284 7398 -303873 -157532 -84575 -405676
18248d05676I442K8532J47524D5791a12002b3186r0072a2888p0512K2644B2177
$$ -405676 9442 37974 185498 45791 -112002 -23186 -113258 -12888 -83400 -60756 22177
18236C00544d7683a4487A62151e9818q4682E4612c45936f9746j45170i9421J7218
$$ 300544 -47683 -14487 162151 -59818 -144500 54612 -345936 -69746 -214916 -99421 -82203
18225h2203l06680a64335D997a18535q6385R6940k80897a49498e6384G361b61188
$$ -82203 -388883 -164335 4997 -118535 -204920 -107980 -388877 -149498 -56384 7361 -261188
18213B94153h1445G242J16258e8237A56793D4065j2641i6506d2066l0891j8782
$$ 294153 -81445 7242 123500 -58237 156793 44065 31424 -96506 -42066 -72957 -91739
18202i1739A7072i7990B29866g3818H0380b3877j63945B6195b5240l3708R619
$$ -91739 17072 -97990 229866 -73818 80380 -23877 -187822 26195 -25240 -58948 -49329
18191d9329C57368E3722j1580a31008a6089k08379h6105A6884P697d4904F4199
$$ -49329 357368 53722 42142 -131008 -16089 -224468 -86105 16884 24581 -44904 64199
18179A3037a04B41101F7232C485J0018g8465j17202i084C1850c3491q5435B03195
$$ 13037 -104 241101 67232 3485 13503 -78465 -195667 -9084 31850 -33491 -118926 203195
18166f4821l3493K7893j91812H591E89K5273K62296a41002N9159A81789q7561
$$ -64821 -98314 -70421 -262233 8591 589 25862 288158 -141002 -81843 181789 94228
18155I4228K2643c39264J43643M8513p1930A27117C4776K8738K031L60434A63129
$$ 94228 116871 -339264 -195621 -147108 -219038 127117 34776 63514 65545 425979 163129
18143A0640f3237r0656g1058j96768f4681F1299O1675a72915E8177k3019N8946
$$ 10640 -63237 -153893 -71058 -267826 -64681 61299 122974 -172915 58177 35158 94104
18132I4104a14059B6444g7269j0436m2403K6656k7909f3054C17174F6067K4887
$$ 94104 -114059 26444 -77269 -87705 -130108 -103452 -131361 -63054 317174 66067 90954
18121I0954b50559B9203J9081a90555d0600B471b46334A15872c75353a05703G826
$$ 90954 -250559 29203 48284 -190555 -40600 2471 -246334 115872 -375353 -105703 7826
18109h4504A78119g0585D8754a40621O9324A65117a75145K3913B72158a58243
$$ -84504 178119 -70585 48754 -140621 -71297 165117 -175145 -151232 272158 -158243
18098H9691J14964b39658B02484J88878a32408A14895c36669G3639J51439a33979
$$ 89691 204655 -239658 202484 391362 -132408 114895 -336669 73639 225078 -133979
18087b00385j90148A07156K20112A51256b62320J18155a7819I8001K3004K839
$$ -200385 -390533 107156 327268 151256 -262320 -144165 -17819 98001 121005 123844
18077A23844n1612K38118a13049B93121E7438j4875a73923K2519G4247b00570
$$ 123844 72232 310350 -113049 293121 57438 42563 -173923 -151404 74247 -200570
18066b82783Q716C9222N5808a26849O2204j4884b2193c730E9773c6400C98276
$$ -282783 -274067 39222 95030 -126849 -64645 -79529 -22193 -3730 59773 -36400 398276
18054a99695B19694H7105g3941G8312Q5779n0876b47759f1722j10808f6273l59265
$$ -199695 219694 87105 -73941 78312 164091 113215 -247759 -61722 -172530 -66273 -425538
18043d25538J38849F0580A8419g3765B7079J66000E4387a86136P907G2651b44276
$$ -425538 -286689 60580 18419 -73765 27079 193079 54387 -186136 -178229 72651 -244276
18031D6007b65479e5749h28j92974D4346J86167F0029A9313a08524n6250k62575
$$ 46007 -265479 -55749 -828 -193802 44346 230513 60029 19313 -108524 -164774 -427349
18020d27349a71400p5723d1475q7095A9030e9654j24213B62589a34246j18399
$$ -427349 -171400 -247123 -41475 -128570 19030 -59654 -183867 262589 -134246 -252645
18010b52645E07239b21485F9133j6949c2713k91727A21280b9787G6977J15978
$$ -252645 507239 -221485 69133 52184 -32713 -324440 121280 -29787 76977 192955
18000A92955c32302B00402a04848l1212k2580P8091B3488K1371g7033j1743A96316
$$ 192955 -332302 200402 -104848 -136060 -158640 -80549 23488 44859 -77033 -88776 196316
17988a30A19414L5302i756l7258D67614A71720e4349k10922A65409g805L771r6383
$$ -130 119414 154716 -9756 -47014 467614 171720 -54349 -265271 165409 -7805 -4034 -100417
17976a00417B38200E7481c06809J22849B2301R179J62434H6047j7361a30384A94538
$$ -100417 238200 57481 -306809 -183960 22301 31480 193914 86047 68686 -130384 194538
17964f1334j82728c2997l2145A15198L351P1656g4124A44402F0459k2234a83350
$$ -61334 -244062 -32997 -65142 115198 118549 190205 -74124 144402 60459 38225 -183350
17952f7741C09165a01098F3621Q412J08677a69982j6396B81981a49153B04020
$$ -67741 309165 -101098 63621 72033 180710 -169982 -186378 281981 -149153 204020
17941a0175l90914f8125J1012J7619A51533b17132Q1795N4216G7015F958c77109
$$ -10175 -401089 -68125 -57113 -39494 151533 -217132 -135337 -81121 77015 6958 -377109
17929a06251j01456C7982b2689j4842k42231Q9555A81885g5914k979E705i1348
$$ -106251 -207707 37982 -22689 -37531 -279762 -190207 181885 -75914 -78893 5705 -91348
17917c82463F3J54065A6384P3612L486b65216H2177K53246a31737B86867A29945
$$ -382463 63 154128 16384 89996 93482 -265216 82177 335423 -131737 286867 129945
17905a4854k5613I9655b305q0145j4271A4503J68932A8785d8287B23700N5082
$$ -14854 -40467 99655 -2305 -82450 -96721 14503 183435 18785 -48287 223700 278782
17894B78782I3515c88221E9744J92238b55696g2249A81268g0102F5649c1484j43632
$$ 278782 93515 -388221 59744 251982 -255696 -72249 181268 -70102 65649 -31484 -175116
17883a75116A1935d5030k82701a31258B79979n0367j06486A0108d01389C7682
$$ -175116 11935 -45030 -327731 -131258 279979 229612 123126 10108 -401389 37682
17872b89704A21346O8945E3955A2764h4951j6658E2942a29182I752J15890P612
$$ -289704 121346 190291 53955 12764 -84951 -101609 52942 -129182 9752 125642 133254
17861A33254B8950a88589Q049P0237C52296I8183C2086K4212h7973D6944B133
$$ 133254 28950 -188589 -180540 -110303 352296 98183 32086 56298 -87973 46944 2133
17849A99621F1508k7103B05b58001a09465B22067a29751p9410R8292p7954N6978
$$ 199621 61508 34405 205 -258001 -109465 222067 -129751 -209161 -110869 -188823 -131845
17838a31845A63624G3563c7359I8035a9723B79847d2621C01337F0564l0142M6045
$$ -131845 163624 73563 -37359 98035 -19723 279847 -42621 301337 60564 30422 76467
17827G6467C5127f8702j37538H3996J5186f8153q8526m8236P1749a2770A96776
$$ 76467 35127 -68702 -206240 83996 99182 -68153 -156679 -204915 -133166 -12770 196776
17815b41726g7390c1783c808p71k87783f2608j20993B38350a18547n0774O3467
$$ -241726 -77390 -31783 -3808 -4579 -292362 -62608 -183601 238350 -118547 -169321 -105854
17804a05854A36840O8926h2390A26189a95919k8562C42645F6042l0723P3432d6164
$$ -105854 136840 205766 -82390 126189 -195919 -224481 342645 66042 35319 108751 -46164
17792A16202a36757A12396b636k80978a20634C0500D233P898Q2391K72211A27132
$$ 116202 -136757 112396 -2636 -283614 -120634 30500 4233 12131 94522 366733 127132
17780A32147d8877p8893D1938f0566j48778N3699q5079f506j17272A92596I5780
$$ 132147 -48877 -127770 41938 -60566 -209344 -155645 -240724 -6506 -123778 192596 95780
17768I7549b24392A05153b82316J33306E0627J43325e8585j38867a5916D8517
$$ 97549 -224392 105153 -282316 -149010 50627 193952 -58585 -197452 -15916 48517
17757f7602I7871J25574c2729j016j17896m1337H996c0445B18272C9157a99988
$$ -67602 97871 223445 -32729 -33745 -151641 -192978 8996 -30445 218272 39157 -199988
17745a43397H8902N0970b9011j74385c5890A22092j5764k1854b21606i044p1682
$$ -143397 88902 139872 -29011 -203396 -35890 122092 106328 84474 -221606 -9044 -80726
17734h0726A41525a53645b8026k63111B89690C1621a72985A36896A7905b8505
$$ -80726 141525 -153645 -28026 -291137 289690 31621 -172985 136896 17905 -28505
17723D2368R0167d6809c062k94698A07826h2612n2184c0034r542aj63880C9601
$$ 42368 132535 -46809 -3062 -297760 107826 -82612 -134796 -30034 -39576 -1 -163881 39601
17710I0442Q3801c238C86629b47038g6168A06401f6716A86913R531G0549j8624
$$ 90442 174243 -3238 386629 -247038 -76168 106401 -66716 186913 196444 70549 51925
17699E1925A9921a71077l05315B627b1594j74149A48946p0411b40128a06783E7289
$$ 51925 19921 -171077 -476392 2627 -21594 -195743 148946 78535 -240128 -106783 57289
17687B8447J42950i3855n5078J5735A69671a23676I1956c3123a6518B0711J90025
$$ 28447 171397 -93855 -148933 -133198 169671 -123676 91956 -33123 -16518 20711 210736
17676B10736a50018A30433A7549O5065c20285B59354C13O2682J7907M6271b03209
$$ 210736 -150018 130433 17549 82614 -320285 259354 313 62995 80902 127173 -203209
17664g1800m3129c0375C32558c20650E055J02924c19671J21707B19279c79136
$$ -71800 -114929 -30375 332558 -320650 5055 107979 -319671 -197964 219279 -379136
17653B22571o2499g1304A3894K65929r7304a6968B49729j2639m6095C8364K3817
$$ 222571 160072 -71304 13894 279823 182519 -16968 249729 237090 190995 38364 62181
17642F2181L25547e7700C1115K3351g3686B23480j02677l0488P5825a9463k10376
$$ 62181 387728 -57700 31115 54466 -73686 223480 120803 90315 166140 -19463 -229839
17631b29839B09193R5203C4252K77067d1914D8328h5304b3714C6303J76830l2585
$$ -229839 209193 304396 34252 311319 -41914 48328 -85304 -23714 36303 213133 180548
17620A80548l4433a9061l9370k9954H8572a31225b994k43082A68078c89355A20799
$$ 180548 146115 -19061 -58431 -88385 88572 -131225 -2994 -246076 168078 -389355 120799
17608B41078q8982b27266A6918K96570f1059j9120b1555j3171J5801A503K01269
$$ 241078 152096 -227266 16918 313488 -61059 -80179 -21555 -34726 -18925 1503 202772
17597B02772r7509B1973J36469M4656L84756B33846m8282n7619h262C46258a36796
$$ 202772 105263 21973 158442 203098 587854 233846 185564 127945 -8262 346258 -136796
17585B3683K19411a5014b46A65886Q4274J71161A3026K10670c49953D2891a65082
$$ 23683 243094 -15014 -246 165886 250160 421321 13026 223696 -349953 42891 -165082
17573I2072l2185i6388a1500q6442A08610L4157a17838B06568b90664J37588A14647
$$ 92072 59887 -96388 -11500 -97942 108610 142767 -117838 206568 -290664 -153076 114647
17561I6970N4831a0213n6324C3652L4595J20297l8114b90470D115a05040B87503
$$ 96970 151801 -10213 -66537 33652 68247 188544 150430 -290470 4115 -105040 287503
17549A71859O6707H1102K16694j39229f5533K9285B17499k3248J81684g7793b571
$$ 171859 238566 81102 297796 158567 -65533 -36248 217499 194251 375935 -77793 -2571
17537B75279A07895a09575e2780R246i384B20623a67310A70112O4001l6691o9683
$$ 275279 107895 -109575 -52780 -43534 -9384 220623 -167310 170112 234113 197422 127739
17526A27739r516B7071J83164q5120a6092A0508K4331Q2373O1053c5605H0631
$$ 127739 118223 27071 210235 125115 -16092 10508 34839 117212 178265 -35605 80631
17514a29940b0676A32981R6807F904J75730K9029d9822A92480o5372b6952F996
$$ -129940 -20676 132981 229788 6904 182634 211663 -49822 192480 127108 -26952 6996
17502C6800P3811k1060j2913l637j4609k2083h0174A1949d3200p7160B31406N1405
$$ 36800 110611 89551 76638 73001 58392 36309 -80174 11949 -43200 -120360 231406 282811
17490B82811J00246I9013j4168R0048J48295I696a76617d3063o592A5479a21950
$$ 282811 383057 99013 84845 174893 323188 9696 -176617 -43063 -49655 15479 -121950
17478e0945B25486B6887Q6119f0284j05225A05810D3542Q7324C5000J64003H1951
$$ -50945 225486 26887 113006 -60284 -165509 105810 43542 130866 35000 199003 81951
17466A67681C4683Q7673O9860I010K30210D4166p394g6950D51661A9534J22639
$$ 167681 34683 122356 192216 9010 239220 44166 36772 -76950 451661 19534 142173
17455A42173H270J62856h2380D6844Q1130q852J69583A41034J732K06345B9828
$$ 142173 8270 171126 -82380 46844 127974 119122 288705 141034 142766 349111 29828
17443b2342A00737J24692P8790A3356a33402C53150J8134J82986B75076r861n9919
$$ -22342 100737 225429 304219 13356 -133402 353150 371284 554270 275076 265215 205296
17432B05296n9579b245B84333a93706F602K70650F729N46904A21325K29579K52522
$$ 205296 145717 -2245 284333 -193706 6602 277252 6729 553633 121325 350904 603426
17421F03426B95508C6148K78595D5203M91398l3457m6513G3454K60890j24554
$$ 603426 295508 36148 314743 45203 536601 503144 456631 73454 334344 209790
17411B09790J07987b52941A18140E7582L48121n240G0709J82158H6118J43547
$$ 209790 317777 -252941 118140 57582 405703 400463 70709 252867 86118 229665
17401B29665l2867B1925I103d3980A11218E4214L76656D9635J6282h8680F0305
$$ 229665 196798 21925 9103 -43980 111218 54214 430870 49635 65917 -88680 60305
17389A5926J60893L1151q7935L00064a00811c2482A28890J68720d5118D06804
$$ 15926 176819 207970 120035 420099 -100811 -32482 128890 297610 -45118 406804
17378A50634J2737B4487b96604a11452B83810J30421j87718b6926B27353j06795
$$ 150634 163371 24487 -296604 -111452 283810 414231 226513 -26926 227353 120558
17368A20558b06545g1141A70832J35707a38669C07336A14810k1877g6272B15295
$$ 120558 -206545 -71141 170832 306539 -138669 307336 114810 92933 -76272 215295
17357c07198A50929J34817l307G952N9799J42860N1936O5462j62216l0976a35743
$$ -307198 150929 285746 282439 7952 67751 210611 262547 328009 165793 134817 -135743
17345B7364e1006I5161K44251A32189F1947b812C33207G8549J72309p997B2962
$$ 27364 -51006 95161 339412 132189 61947 -2812 333207 78549 250858 242861 22962
17333E04142a9703o1832H5676a13917m1113C02312j23378K12666j90797J13055
$$ 504142 -19703 -81535 85676 -113917 -155030 302312 178934 391600 200803 313858
17323C13858E3210J50000H438K17930a6790k9373A11310K11417Q146q8773d6304
$$ 313858 53210 203210 8438 226368 -16790 -46163 111310 322727 330873 242100 -46304
17311A15165f9199B07457O2980l9409I9043J18900L1397p6235b3287A95619M1721
$$ 115165 -69199 207457 270437 231028 99043 217943 249340 173105 -23287 195619 237340
17300B37340K33644J4641k31157K4012a19334D8515j1952R585M13377A64063l7744
$$ 237340 470984 485625 254468 278480 -119334 48515 36563 46148 459525 164063 126319
17289A26319J24514I6533J95862a05216A36454a557C3709K86944c860j16017I8919
$$ 126319 250833 96533 292395 -105216 136454 -1557 33709 320653 -3860 -119877 98919
17277C26109A7009e5270A91825l6820K71129k1764m0425k5155n6132B7968J57518
$$ 326109 17009 -55270 191825 155005 426134 404370 363945 338790 282658 27968 185486
17266A85486a47037C66118o1990k368p6376j07600R3205a12751B47968k8094I5974
$$ 185486 -147037 366118 304128 301760 225384 117784 210989 -112751 247968 219874 95974
17254B95905k7406I4992e3680f359A67993O9465K6560m1208q2724B7260L49867
$$ 295905 268499 94992 -53680 -6359 167993 237458 264018 222810 140086 27260 377127
17243C77127m4206j36130J7831l682c0671A99386d3521I8187L20582G0357K71656
$$ 377127 332921 196791 214622 210940 -30671 199386 -43521 98187 418769 70357 342013
17232C42013A63476m3046L56777A9349J92306a2826A9048K06097A02590K09183
$$ 342013 163476 120430 477207 19349 211655 -12826 19048 225145 102590 311773
17222C11773j3497J8732E9518a14281E13419j67954K67148C03104B7631A0695
$$ 311773 298276 317008 59518 -114281 513419 345465 612613 303104 27631 10695
17211A42925L42574A85881J53205j45935J48012j38000M4629H8034m2385Q9206
$$ 142925 485499 185881 339086 193151 341163 203163 247792 88034 45649 134855
17201A34855k7198b2821B46665k1438I141N57490k10169J9287H9950K96905O9610
$$ 134855 107657 -22821 246665 225227 9141 566631 356462 375749 89950 386855 456465
17190D56465i9627D51246A75006J81238j46211n5257J97581E5624L89390h6683
$$ 456465 -99627 451246 175006 356244 210033 154776 352357 55624 445014 -86683
17179D04951A54976J20165j7788H7770C3017L69004L6504A77981L33342j19475
$$ 404951 154976 275141 257353 87770 33017 402021 438525 177981 511323 391848
17169C91848P9927M5436B53976A20645J24879i8741B61222a14326A25544J45173
$$ 391848 471775 517211 253976 120645 245524 -98741 261222 -114326 125544 270717
17159B70717r7376J33596A16583J91410j7276j09538Q4D6053N88861j75821p0263
$$ 270717 173341 306937 116583 307993 290717 181179 181263 46053 634914 459093 388830
17148C88830j10821R0223r4703R9366J53164A76048R5884L21689B06410J9374
$$ 388830 278009 368232 273529 372895 526059 176048 271932 593621 206410 225784
17138B25784l1332J60766E6594J55455K22654a06098B46744M4871p3718J60232
$$ 225784 194452 355218 56594 212049 434703 -106098 246744 291615 217897 378129
17128C78129n6528M1618j10376L03429j01673J2863A90893H7639J00209K75007
$$ 378129 321601 363219 252843 556272 454599 467462 190893 87639 187848 462855
17118D62855A21653L97535p4157p5000r2189K9973l3788O1852J72477k09241A05804
$$ 462855 121653 519188 445031 370031 277842 307815 274027 335879 508356 299115 105804
17106A37490K12698j05839m5571O8833R7300L6252J00877J391J0810o1886r6361
$$ 137490 350188 244349 198778 267611 364911 401163 502040 503431 514241 452355 355994
17095C55994P9021j59036J8836A46525K45438j08188j7899J73186j21286O5088
$$ 355994 435015 275979 294815 146525 391963 283775 265876 439062 317776 382864
17085C82864K14554B00534P40081D14183m3418E0918M92724G2425J00260N96592
$$ 382864 597418 200534 940615 414183 370765 50918 543642 72425 172685 769277
17075G69277o3737j25327k43725K23964B29519L86271n4025r0621k05481L08901
$$ 769277 705540 580213 336488 560452 229519 615790 561765 471144 265663 574564
17065E74564J75688l48383L6057o9026Q2605J99361j38710B49472k9196L49065
$$ 574564 750252 401869 437926 368900 451505 650866 512156 249472 220276 569341
17055E69341m9970j12814j92531K05074q7723J10190K3167p1343K58479J11172
$$ 569341 519371 406557 214026 419100 331377 441567 464734 393391 651870 763042
17045G63042B55814N28554C09247K88634M8804e6152E29644O137B44804O24532
$$ 763042 255814 784368 309247 597881 646685 -56152 529644 535781 244804 869336
17035H69336C19981L91597O8978j28002J10753j97598o7777J77604J02972l72798
$$ 869336 319981 711578 780556 652554 763307 565709 497932 675536 778508 405710
17025D05710L42635l08798o296J61630K18386o6594M1216j7829j15812J5510n5222
$$ 405710 748345 439547 433251 594881 813267 746673 787889 770060 654248 669758 614536
17014F14536R1553J9733j83312K05702J78020J3430j39856j90376J40200j5380
$$ 614536 706089 725822 542510 748212 926232 939662 799806 609430 749630 734250
17004G34250J52487j86103K8776j39272N4630L28249l21483J7261N3863K11496
$$ 734250 886737 700634 729410 590138 644768 973017 651534 668795 722658 934154
16994I34154C78950M35968J84964J21940E24453J68811K15688j57221K86048m62235
$$ 934154 378950 814918 999882 1121822 524453 693264 908952 751731 1037779 575544
16984E75544J85588J18787R1739j96891K54950l23831J6085O1673J89550K78865
$$ 575544 761132 879919 971658 774767 1029717 705886 721971 783644 973194 1252059
16974A252059m84441k38446J04425M25334L4901m33171K15026N5933j2676k27802
$$ 1252059 767618 529172 633597 1058931 1093832 660661 875687 931620 918944 691142
16964F91142J89525L11513m70654J31102M19266l51912J43779K370K02319m06216
$$ 691142 880667 1192180 721526 852628 1271894 919982 1063761 1066131 1268450 862234
16954H62234m9978j08958L21334j42876K39573N2565L3298l69914J75528L92891
$$ 862234 812256 703298 1024632 881756 1121329 1173894 1207192 837278 1012806 1405697
16944A405697k69877R4634k42139L26443m42098N80395j68434j01251k94415J69033
$$ 1405697 1135820 1230454 988315 1314758 872660 1453055 1284621 1183370 888955 1057988
16934A057988J00039J55454J46887k43509m4580J2718M56369o60727M01937n21478
$$ 1057988 1158027 1313481 1460368 1216859 1172279 1184997 1641366 980639 1382576 861098
16924H61098L84303L73312j50605j46555j9217J55841m4532l96285O17924j18612
$$ 861098 1245401 1618713 1468108 1321553 1302336 1458177 1413645 1017360 1635284 1516672
16914A516672O1500j81716J11555J5169J83061j6118l6091R9269j24911j91098
$$ 1516672 1578172 1396456 1508011 1523180 1706241 1690123 1654032 1753301 1628390 1437292
16904A437292K24827K69542k92478n6020J31522o6664o451K80752R32j37651K02392
$$ 1437292 1662119 1931661 1639183 1583163 1714685 1648021 1641570 1922322 1923254 1785603 1987995
16893A987995l84345L85646R9863k20308k59091L13053J27802j47335J62080l11297
$$ 1987995 1603650 1989296 2089159 1868851 1609760 1922813 2050615 1903280 2065360 1754063
16883A754063K76995J96996K92007l46544r90L8712k01488K98899J87621l13114
$$ 1754063 2031058 2228054 2520061 2173517 2172527 2211239 2009751 2308650 2496271 2183157
16873B183157q6073K50329j55947K29731K22231J26319K43113l15314J44452R8205
$$ 2183157 2097084 2347413 2191466 2421197 2643428 2769747 3012860 2697546 2841998 2940203
16863B940203K32193k02038m0147k3659J74441l01888M62871N764k02739K74493
$$ 2940203 3172396 2970358 2930211 2906552 3080993 2779105 3241976 3247740 3045001 3319494
16853C319494P3154l06957K52094L11515k77539O9088L9555k8743L44519j74350
$$ 3319494 3392648 3085691 3337785 3649300 3371761 3440849 3480404 3451661 3796180 3621830
16843C621830J18721L00291j61913K50390j15306k8203K50327l1768J56421j61025
$$ 3621830 3740551 4040842 3878929 4129319 4014013 3985810 4236137 4204369 4360790 4199765
16833D199765K55101O637L25953N9815q2604Q9745K16225p1272L55068k14403
$$ 4199765 4454866 4461503 4787456 4847271 4764667 4854412 5070637 4999365 5354433 5140030
16823E140030M07111j80905L42886j21409J34313K31822m6669M87446J08594k93416
$$ 5140030 5547141 5366236 5709122 5587713 5722026 5953848 5907179 6394625 6503219 6209803
16813F209803L26968J41519n7966J73950K79250n3875P23464L0264k08086L4515
$$ 6209803 6536771 6678290 6620324 6794274 7073524 7019649 7743113 7773377 7565291 7599806
16803G599806O45176l43485P07276J18066L97674j71995L45666K41178o4791K42343
$$ 7599806 8244982 7901497 8608773 8726839 9124513 8952518 9298184 9539362 9474571 9716914
16793I716914L00575K68973L04453L36662N12338p7053O23757j63787M16647N91952
$$ 9716914 10017489 10286462 10590915 10927577 11439915 11362862 11986619 11822832 12239479 12831431
16783A2831431J30916O44543M14422M04491P55536q6161P43625L04083M04664
$$ 12831431 12962347 13606890 14021312 14425803 15181339 15095178 15838803 16142886 16547550
16774A6547550R44515L21372Q72548O23260L93621P74688P10130Q45328Q32962
$$ 16547550 17492065 17813437 18685985 19309245 19702866 20477554 21187684 22033012 22865974
16765B2865974O90621Q32745J441717N80816J233009J036205P50851J583559J196495
$$ 22865974 23556595 24389340 25831057 26411873 27644882 28681087 29431938 31015497 32211992
16756C2211992J402510J714597J453986J489179K338947J738061K078645K326879
$$ 32211992 33614502 35329099 36783085 38272264 40611211 42349272 44427917 46754796
16748D6754796J838536K284308L099433K820636K636647L564572L222795L585834
$$ 46754796 48593332 50877640 53977073 56797709 59434356 62998928 66221723 69807557
16740F9807557M216055M284497M347286M789703N293598N243632O126163N900737
$$ 69807557 74023612 78308109 82655395 87445098 92738696 97982328 104108491 110009228
16732A10009228O093031O518422O775843P131511P233308O685186O921211O639014
$$ 110009228 116102259 122620681 129396524 136528035 143761343 150446529 157367740 164006754
16724A64006754O209223N611335M617050M101472K729318J265868P81633j123867
$$ 164006754 170215977 175827312 180444362 184545834 187275152 188541020 189322653 188198786
16716A88198786j997115l223205m211405n249129n465531o574931o833179o978538
$$ 188198786 186201671 182978466 178767061 173517932 168052401 161477470 154644291 147665753
16708A47665753p172691p361294p048484o796885o858038o329510n819560n800065
$$ 147665753 140493062 133131768 126083284 119286399 112428361 106098851 100279291 94479226
16700I4479226n912034m841993m717711m513145m235722m247578l372076l265197
$$ 94479226 88567192 83725199 79007488 74494343 70258621 66011043 62638967 59373770
16692E9373770l418320l072353k497578k686883k249393k069649k487514j728562
$$ 59373770 55955450 52883097 50385519 47698636 45449243 43379594 40892080 39163518
16684C9163518k039246j383876j766807j355292k138312q27933j435966j176532
$$ 39163518 37124272 35740396 33973589 32618297 30479985 29652052 28216086 27039554
16676B7039554j118071r54236j068570n75588j039893j002633o78893q66395p81552
$$ 27039554 25921483 24967247 23898677 23323089 22283196 21280563 20601670 19735275 18953723
16667A8953723k99063o65223r84607m74331m62967q75378l06537l79097p69098
$$ 18953723 18654660 17989437 17004830 16530499 16067532 15192154 14885617 14506520 13737422
16658A3737422k80787j37200k34067o56102n38712K644l35392l50020o79893j34245
$$ 13737422 13456635 13319435 13085368 12429266 11890554 11893198 11557806 11207786 10527893 10393648
16648A0393648o37958P1009j39309k63805m08225q2581n95510L1338j51710j91485
$$ 10393648 9755690 9826699 9687390 9423585 9015360 8932779 8337269 8368607 8216897 8025412
16638H025412m49590J21220j84827j25016m59975J50600l5991k61611m56857l12520
$$ 8025412 7575822 7697042 7512215 7387199 6927224 7077824 7041833 6780222 6323365 6010845
16628F010845J57829P9127k14488l51748l24140L52341m00307J77309l96693j44380
$$ 6010845 6168674 6247801 6033313 5681565 5357425 5709766 5309459 5486768 5090075 4945695
16618D945695K69018j89881N0084l82731l03386r8779k0552P3610k09735J61416
$$ 4945695 5214713 5024832 5074916 4692185 4388799 4290020 4269468 4343078 4133343 4294759
16608D294759l93258j20904J89786q8325r761l5558P8752j96601l22340J83914
$$ 4294759 3901501 3780597 3970383 3882058 3872297 3836739 3915491 3718890 3396550 3580464
16598C580464k13893K94147l32378p7145J465j40139r8512k0359L5088M3391p2795
$$ 3580464 3366571 3660718 3328340 3251195 3252660 3112521 3014009 2993650 3028738 3072129 2999334
16587B999334r1246N9156j75341j32681l59905L51064l0492j1770k64469L39027
$$ 2999334 2908088 2967244 2791903 2659222 2299317 2650381 2619889 2608119 2343650 2682677
16577B682677O358l24809j35678j7252M33770l75902j48641K93111j29515j98793
$$ 2682677 2689035 2364226 2228548 2211296 2645066 2269164 2120523 2413634 2284119 2085326
16567B085326m3057J48439k58231L41937R259k96246n3015l93439L69136q1863
$$ 2085326 2042269 2190708 1932477 2274414 2283673 1987427 1934412 1540973 1910109 1828246
16557A828246q9338K59619J18720j91176j01412k57523N391P4100K05174k06828
$$ 1828246 1738908 1998527 2117247 1926071 1824659 1567136 1572527 1646627 1851801 1644973
16547A644973k02973J1477J18257k09194L32704l06509P1137L1288j35257O7238
$$ 1644973 1442000 1453477 1571734 1362540 1695244 1388735 1459872 1491160 1355903 1423141
16537A423141j2957m2837k73729L32120k27641j0053L80452l07159K66150L414
$$ 1423141 1410184 1367347 1093618 1425738 1198097 1188044 1568496 1261337 1527487 1530901
16527A530901n6249j84690m8123K48155l71248M5316k38512L7022M58061l66554
$$ 1530901 1474652 1289962 1241839 1489994 1118746 1164062 925550 962572 1420633 1054079
16517A054079J08570K9151J3528l74813K55672n3478K34337j56135j25677k3964
$$ 1054079 1162649 1191800 1205328 830515 1086187 1032709 1267046 1110911 985234 961270
16507I61270m7462K59075j58913L29980n56795L27390n0133q6223R3251j95455
$$ 961270 913808 1172883 1013970 1343950 787155 1114545 1064412 978189 1071440 875985
16497H75985j20563N04366k51511q8743l60850K44063k1893K90371k56230K2912
$$ 875985 755422 1259788 1008277 919534 558684 802747 780854 1071225 814995 837907
16487H37907q5674K55813j49476J74977m61461L429M53334j83649J79023m40131
$$ 837907 752233 1008046 858570 1033547 572086 575515 1028849 845200 1024223 584092
16477E84092L37814q7556j82397L84749k92049K25829N8649l55484J17265J94792
$$ 584092 921906 834350 651953 1036702 744653 970482 1029131 673647 790912 985704
16467I85704j17869r1005p8869L18273m47319K07565O4144J43517j77557j45144
$$ 985704 867835 776830 697961 1016234 568915 776480 840624 984141 806584 661440
16457F61440o9520M0639L2319p9349P674Q3235j96772r2102l7426M57792j40122
$$ 661440 591920 632559 664878 585529 593203 676438 479666 387564 350138 807930 667808
16446F67808k79004l4631N50623k49953n3680r9323R0092O7674J35438l44280
$$ 667808 388804 354173 904796 654843 601163 501840 591932 659606 795044 450764
16436D50764M28245l72574J86063M37476n61078k8651R1057n5403j01620J89813
$$ 450764 879009 506435 692498 1129974 568896 540245 631302 575899 474279 664092
16426F64092k20303K27670j42750J79466j50721B13670K64118A50364L34686R899
$$ 664092 443789 671459 528709 708175 557454 213670 477788 150364 485050 494949
16416D94949r8670J03782J59834k22737j01350K7016K48071l4256M6304Q1637
$$ 494949 396279 500061 659895 437158 335808 362824 610895 576639 622943 704580
16406G04580K8774k55091A80635M79196I7473g765B29764J99299k08088K08840
$$ 704580 733354 478263 180635 659831 97473 -7765 229764 429063 220975 429815
16396D29815k13100J71938K32198A92614M11766J302k94623L54663j31230j3051
$$ 429815 216715 388653 620851 192614 604380 605682 311059 665722 534492 521441
16386E21441j17486J5089L1821J00225A82879m716L32080l0787k01887J11166
$$ 521441 403955 419044 450865 551090 182879 178163 510243 479456 277569 388735
16376C88735D037P5345M18589j39388j17037k111J69155N2691A07998J08457n9735
$$ 388735 4037 79382 497971 358583 241546 239435 408590 461281 107998 216455 156720
16365A56720F2364K57490b5252A79088o1386M16127E1572L59402j43296H4999
$$ 156720 62364 319854 -25252 179088 117702 533829 51572 410974 267678 84999
16354B87814K02136k1247n0691D9440R6003L83113J06076j59519p4303j90979
$$ 287814 489950 468703 418012 49440 145443 528556 634632 475113 400810 209831
16344B09831G4812J88916J55426K46305I1838J95020j35683m4141L59721A71847
$$ 209831 74812 263728 419154 665459 91838 286858 151175 107034 466755 171847
16333B80460D040j26L91045j40967R467L7372a04010F27460A80628D851Q0800
$$ 280460 4040 3914 394959 253992 263459 300831 -104010 627460 180628 4851 85651
16322H5651K40263b9406B17505D6022e9357D64410j01410a45885C15696G4180
$$ 85651 325914 -29406 217505 46022 -59357 464410 363000 -145885 315696 74180
16311D55299m0466A04595J95053J38139A65822K05404L0990A92768n2821J20388
$$ 455299 414833 104595 299648 437787 165822 371226 402216 192768 139947 260335
16301B60335K14830A93472B0394N7033K03549R5770A33714k9292K77631A56949
$$ 260335 475165 193472 20394 77427 280976 376746 133714 104422 382053 156949
16290F3984N85510F9658R5173L7711l3397J40487A39570R0923M5485c6874k28658
$$ 63984 649494 69658 164831 202542 169145 309632 139570 230493 275978 -36874 -265532
16279b65532a26141B5833a00345C79352j82264L3677J4859J35806H8334Q1009
$$ -265532 -126141 25833 -100345 379352 197088 230765 245624 381430 88334 169343
16269A69343l383c016D39372A96467r2825a60121A59357J72555j17517m4455l5524
$$ 169343 165960 -3016 439372 196467 103642 -160121 159357 331912 214395 169940 134416
16258A34416O5423G0796J5141J13910g8183C84311j36071I1338J36918k6357K5536
$$ 134416 199839 70796 85937 199847 -78183 384311 248240 91338 228256 201899 227435
16247B27435K0831A5829c6881B50836j03906C6769K0040J01265M6712P837E0242
$$ 227435 248266 15829 -36881 250836 146930 36769 56809 158074 204786 212623 50242
16235h2511B009a7808B23515k7158d4023A51667J16553D3278a4319D3376o159
$$ -82511 2009 -17808 223515 196357 -44023 151667 268220 43278 -14319 43376 37217
16224C7217K31299a01204B49293P374F0210K10100I1812N5175J41218A11107N9756
$$ 37217 268516 -101204 249293 256667 60210 270310 91812 146987 288205 111107 170863
16213A70863h7946e414H8385K71872A68456N95D6410a9341C91449a19752G6055
$$ 170863 -87946 -5414 88385 360257 168456 169051 46410 -19341 391449 -119752 76055
16201a39536C18349j24507m6596l3208a34993B5652b67692B98427j34277Q9451
$$ -139536 318349 193842 147246 114038 -134993 25652 -267692 298427 164150 253601
16191B53601a10612A19080C6186J37637O6503K3497K5224M1477a90873A34431
$$ 253601 -110612 119080 36186 173823 240326 263823 289047 330524 -190873 134431
16180A97250D0798Q9604K82734A93705k850g4966m2412C08167A5880R1968E0445
$$ 197250 40798 130402 413136 193705 190855 -74966 -117378 308167 15880 107848 50445
16168i9313E6671a33837O6253k81542D91266B01737D1661J23398h4508C3639i658
$$ -99313 56671 -133837 -67584 -349126 491266 201737 41661 165059 -84508 33639 -9658
16156D31321a05314l9299F1344i632H6676L39706a47318B46254B3625L16543a54331
$$ 431321 -105314 -144613 61344 -9632 86676 426382 -147318 246254 23625 340168 -154331
16144A09125A8419J62300l465J95688a5547j66886C31441H4404h4081p4189C797
$$ 109125 18419 180719 177254 372942 -15547 -182433 331441 84404 -84081 -158270 3797
16132a0790k23407g1203B23806b5732A46355c5068A06989j4201C769a26367b6943
$$ -10790 -234197 -71203 223806 -25732 146355 -35068 106989 92788 3769 -126367 -26943
16120d26277a64058J7651B61571A00421a14059L7935B43140j2942J1797j07509
$$ -426277 -164058 -146407 261571 100421 -114059 -76124 243140 230198 241995 134486
16110A34486m8369J0945k1305a0707A49231B6741N55150I6425c14917C44558g6246
$$ 134486 86117 97062 75757 -10707 149231 26741 581891 96425 -314917 344558 -76246
16098A33056A3100K55851a63137C037a93012A37536a17770N5960A3923a0352j01045
$$ 133056 13100 268951 -163137 3037 -193012 137536 -117770 -61810 13923 -10352 -111397
16087a11397e4507E1012a30318A5911K8104J06885O0737e9638k2413B8331l249
$$ -111397 -54507 51012 -130318 15911 44015 150900 211637 -59638 -82051 28331 25082
16076B5082c20548B65746K87138A67356o4508O2419h6555A50578b68464a7492
$$ 25082 -320548 265746 552884 167356 102848 165267 -86555 150578 -268464 -17492
16065a4598D3508b45857A30928f0668b6985A00327J85499F43a2293B29148H5359
$$ -14598 43508 -245857 130928 -60668 -26985 100327 285826 643 -12293 229148 85359
16053A80648R0066F7250O5222A9560I736a16067A539J42447i9420b5015j03071
$$ 180648 270714 67250 132472 19560 9736 -116067 1539 143986 -99420 -25015 -128086
16042a28086r9630B68621d80268a44751I2882a34965B17151E1430M2607b10131
$$ -128086 -227716 268621 -480268 -144751 92882 -134965 217151 51430 94037 -210131
16031a7123B20214a85884B26007J90562I2898g337C0540c43215C01125b46969
$$ -17123 220214 -185884 226007 416569 92898 -7337 30540 -343215 301125 -246969
16020d2812B997L33729i329l33096a09019A87303d0885l61991J98755I792K5426
$$ -42812 2997 336726 -9329 -342425 -109019 187303 -40885 -402876 -204121 9792 35218
16009C5218L36617b25946b9894D0979L4658b4125j76386B01957b2945j86440Q9911
$$ 35218 371835 -225946 -29894 40979 75637 -24125 -200511 201957 -22945 -209385 -119474
15998a19474A79937H2760M8604b35996B45123b39707R916h1931K2151o2945j92354
$$ -119474 179937 82760 131364 -235996 245123 -239707 -229791 -81931 -59780 -122725 -315079
15987c15079a24977A99178b45488J07383B1216L26788a42307B34405A12105C0975
$$ -315079 -124977 199178 -245488 -138105 21216 348004 -142307 234405 112105 30975
15976a29488A28107J19309D7294M284J89268b31157F9479N4020a01372M6402l9788
$$ -129488 128107 247416 47294 51578 240846 -231157 69479 123499 -101372 -54970 -94758
15965i4758o2667q936C09595K8095c9030k6134o9702G7839L0209D4655a84801
$$ -94758 -157425 -166361 309595 337690 -39030 -65164 -134866 77839 108048 44655 -184801
15953C6460J70864a34026A57801K74137d4845b0277n0920A3572a52144H7068a20569
$$ 36460 207324 -134026 157801 431938 -44845 -20277 -71197 13572 -152144 87068 -120569
15941C13012b40717k33196b8842D167a07703G012d47572K00585D2835R6804E4514
$$ 313012 -240717 -473913 -28842 4167 -107703 7012 -447572 -246987 42835 139639 54514
15929a71369L5158E8368e5622p096a5126k96521a08760i004k40868H0224j792
$$ -171369 -136211 58368 -55622 -62718 -15126 -311647 -108760 -9004 -249872 80224 78432
15918G8432a19380l02264a6980k686j18267j14224A63498P5397a85481n8067e8773
$$ 78432 -119380 -421644 -16980 -19666 -137933 -252157 163498 238895 -185481 -243548 -58773
15906c78208E6673a83910L2349E6444a92431A77741a36829B90143j1822d7118
$$ -378208 56673 -183910 -151561 56444 -192431 177741 -136829 290143 278321 -47118
15895e8249A34276D70d91538R2797G3637E672f3803j74597g6166D2597j7587c05641
$$ -58249 134276 470 -491538 -398741 73637 5672 -63803 -238400 -76166 42597 25010 -305641
15882F9832J2543a3676k8651A11923c68869Q5720h0567A92551d9147G6831Q1094
$$ 69832 82375 -13676 -42327 111923 -368869 -283149 -80567 192551 -49147 76831 157925
15871A57925c5628k7114l3247j00280K1789j40160B55408F0207a92162D4321e1313
$$ 157925 -35628 -62742 -95989 -196269 -174480 -314640 255408 60207 -192162 44321 -51313
15859G0919J3617k4542f29430b96273A51778P9240j13461b86417J33671A83830
$$ 70919 84536 59994 -629430 -296273 151778 231018 117557 -286417 -152746 183830
15848A90245F8105b50542O6277Q036J5456A30447j0288b8278G1549Q4384a47592
$$ 190245 68105 -250542 -184265 -176229 -160773 130447 120159 -28278 71549 155933 -147592
15836A95793l8038h2027r502n2759b0116k07760K9292H3674a66120l39993E5313
$$ 195793 157755 -82027 -91529 -144288 -20116 -227876 -198584 83674 -166120 -506113 55313
15824a48960c4492E7275J23003C8135j5993b26027B2805a12921E1402p005J97016
$$ -148960 -34492 57275 180278 38135 22142 -226027 22805 -112921 51402 44397 241413
15813B41413b5298k36264K0384m7156a43283f1994A87791g2541q7344E0148a97956
$$ 241413 -25298 -261562 -241178 -288334 -143283 -61994 187791 -72541 -159885 50148 -197956
15801d1226q3132q008F425K52430e6230B5659b08861D9257h4868r4444A09692
$$ -41226 -124358 -132366 6425 258855 -56230 25659 -208861 49257 -84868 -179312 109692
15789C78996b06984H2289C7954a28936m451B5928b37608P6858d6143A56544e3644
$$ 378996 -206984 82289 37954 -128936 -133387 25928 -237608 -160750 -46143 156544 -53644
15777A4005F228k331e4558p7708k8274j10136J28981p592j08021j83212G5183
$$ 14005 6228 3897 -54558 -132266 -160540 -270676 -141695 -149287 -257308 -440520 75183
15765c1463l8840p1720B51959a89641l7714a3592r747E8688k1487a89071e5368
$$ -31463 -70303 -142023 251959 -189641 -227355 -13592 -23339 58688 37201 -189071 -55368
15753E1586g550k01423j6279J01702B10284c52341a51681K8379C83796q7666c4128
$$ 51586 -7550 -208973 -225252 -123550 210284 -352341 -151681 -123302 383796 296130 -34128
15741B8412d0805j56726d5115i993p5020D7962K84518r4328a69184C3797a6796
$$ 28412 -40805 -197531 -45115 -9993 -85013 47962 332480 238152 -169184 33797 -16796
15729a11236k37312h2727B60885i9725A64524i8334L0814E8343P5087b75624A47749
$$ -111236 -348548 -82727 260885 -99725 164524 -98334 -67520 58343 133430 -275624 147749
15717I5787a0407A93337a76166k4627A62219M5767a92285J8293G3263L50078a98151
$$ 95787 -10407 193337 -176166 -200793 162219 207986 -192285 -173992 73263 423341 -198151
15705d33047a8055j12861C7913c21064P0646M5352K5612k40923c1348l7815B34234
$$ -433047 -18055 -130916 37913 -321064 -250418 -205066 -179454 -420377 -31348 -69163 234234
15693a26850A8552b05436F3323G442b14791j69744a40810N3371A6599J71155b56229
$$ -126850 18552 -205436 63323 7442 -214791 -384535 -140810 -87439 16599 187754 -256229
15681d1714j84172R2604D6946h6816B34737a59051a8174r6884r1595A25909J98019
$$ -41714 -225886 -133282 46946 -86816 234737 -159051 -18174 -115058 -206653 125909 323928
15670C23928i6234A72421N0465b8365G1330O4863O2486o486C7244K99831a67435
$$ 323928 -96234 172421 222886 -28365 71330 136193 198679 192193 37244 337075 -167435
15658e7282O341p5935k06167h1274C81831d12314d7816E3795b79374b8364k54069
$$ -57282 -50941 -126876 -333043 -81274 381831 -412314 -47816 53795 -279374 -28364 -282433
15647b82433A96221i7933l5782n2292q2809A62346C6221g4746C0666d2187p1685
$$ -282433 196221 -97933 -133715 -186007 -268816 162346 36221 -74746 30666 -42187 -113872
15636a13872M1813j14200A18154a25134A10399c4289k4560A71518a12457j14548
$$ -113872 -72059 -186259 118154 -125134 110399 -34289 -58849 171518 -112457 -227005
15626b27005L3248B41805B4958b17983A01611b0118k7525a3080k80974G2654j7422
$$ -227005 -193757 241805 24958 -217983 101611 -20118 -47643 -13080 -294054 72654 55232
15615E5232a58346A1108c38235L3889g5862D1289K1718L80752b64467p667k16818
$$ 55232 -158346 11108 -338235 -304346 -75862 41289 63007 443759 -264467 -272134 -488952
15604d88952d2323A21265c3764a4218q6603j19776A99549g0611A21929i8831j87662
$$ -488952 -42323 121265 -33764 -14218 -100821 -220597 199549 -70611 121929 -98831 -286493
15593b86493H2468L6406c6804l3673A93353b9237B1990K01867H3543b8696C0404
$$ -286493 82468 118874 -36804 -70477 193353 -29237 21990 223857 83543 -28696 30404
15581c27576C62553A13143c08471b2897j29507L1614A11867A6602b24936P4799
$$ -327576 362553 113143 -308471 -22897 -152404 -120790 111867 16602 -224936 -150137
15571a50137K2555e5881p1530N0940q0736D2555c9492j9911A11998k0454e0457
$$ -150137 -127582 -55881 -127411 -76471 -157207 42555 -39492 -59403 111998 91544 -50457
15559A07584R732a42232N4953O014c2180j41044b6364j6119k3346A74058e0932
$$ 107584 117316 -142232 -87279 -81265 -32180 -173224 -26364 -42483 -65829 174058 -50932
15547b44370j285J18496A91727g8589A97541d5800j21799d472G0329a38A05638
$$ -244370 -245655 -127159 191727 -78589 197541 -45800 -167599 -4472 70329 -138 105638
15535a23966E8580b18460A36086c5063k45641A24149c3964G9406C196c5625B19791
$$ -123966 58580 -218460 136086 -35063 -280704 124149 -33964 79406 3196 -35625 219791
15523b9392j01467f2149b1840j39794o2224K3982e7009i540p9693A84093a1373
$$ -29392 -130859 -62149 -21840 -161634 -223858 -199876 -57009 -9540 -89233 184093 -11373
15511B76079A06339D6545J62271a06009F5687K540f7908C5520J04363a74131A20790
$$ 276079 106339 46545 208816 -106009 65687 68227 -67908 35520 139883 -174131 120790
15499a31795B33740e29855H2970a66470A19680k5359f0028C31378G2711o7d9627
$$ -131795 233740 -529855 82970 -166470 119680 94321 -60028 331378 72711 72644 -49627
15487a90768n8929j43857d9569B8470D456a567C23646a16593M2618j46523c5927
$$ -190768 -249697 -393554 -49569 28470 4456 -1567 323646 -116593 -73975 -220498 -35927
15475d09104c0544j05270k7320f4305D91463A71564d5877b175A70155a48878A65460
$$ -409104 -30544 -135814 -163134 -64305 491463 171564 -45877 -2175 170155 -148878 165460
15463b31597C89799A77731a78715g745E982K0956K42196A30387J58701J7473h5783
$$ -231597 389799 177731 -178715 -7745 5982 26938 269134 130387 289088 306561 -85783
15451b60358E7135a66728E1097K18487b52021A65973d4481A98196H7413a44427
$$ -260358 57135 -166728 51097 269584 -252021 165973 -44481 198196 87413 -144427
15440b2125F731K19977a98849E6391b0864j21343A26506L8673a22823m871N0039
$$ -22125 6731 226708 -198849 56391 -20864 -142207 126506 165179 -122823 -127694 -77655
15429g7655j18503d5462B6381J18380B3216J74525q5766d047D8296A1126K61682
$$ -77655 -196158 -45462 26381 144761 23216 197741 111975 -4047 48296 11126 272808
15418B72808e3109J3526B2431J84370a5796G9982h4425l6617D5604M8225A0562
$$ 272808 -53109 -39583 22431 206801 -15796 79982 -84425 -121042 45604 93829 10562
15406B45556j17547B8797N8406a30896e7185B73661C5611M38466a70055G1648
$$ 245556 128009 28797 87203 -130896 -57185 273661 35611 474077 -170055 71648
15395e8593j13901k8531A48709i6809A37004g2175j4494A50005l5912a64579B11597
$$ -58593 -172494 -201025 148709 -96809 137004 -72175 -86669 150005 114093 -164579 211597
15383G9272l2673f9693D6043j5412Q391M3006c11895P92p584B27960B5442a94337
$$ 79272 46599 -69693 46043 30631 39022 82028 -311895 -311103 -318687 227960 25442 -194337
15370a39845J1807B30934a81620J3668L9808d0981r092A20799f5100A11586k3896
$$ -139845 -128038 230934 -181620 -167952 -128144 -40981 -50073 120799 -65100 111586 87690
15359H7690L1789Q945m719a19883B20677a20048A70337b0775j6486J4686k08844
$$ 87690 119479 128424 123705 -119883 220677 -120048 170337 -20775 -37261 -22575 -231419
15348b31419B625c2369A3095b56198A4112f2853m3947E7694e0054j33000A12171
$$ -231419 2625 -32369 13095 -256198 14112 -62853 -106800 57694 -50054 -183054 112171
15336b61251R9483M7376B58442b62223I4999k6497P6881A6501c1319n3429B33073
$$ -261251 -161768 -114392 258442 -262223 94999 68502 145383 16501 -31319 -84748 233073
15324A72264g9361n2273e2169H2695K31336I5093g3932k20970Q1483I7424c39189
$$ 172264 -79361 -131634 -52169 82695 314031 95093 -73932 -294902 -213419 97424 -339189
15312a74239F1299k3398j986K83418G7464a74631h4731C07410j05796H196K13449
$$ -174239 61299 37901 35915 319333 77464 -174631 -84731 307410 201614 8196 221645
15301B21645e0945E741c01059h0321C94402b03609h7473A98374D73f3555A32687
$$ 221645 -50945 5741 -301059 -80321 394402 -203609 -87473 198374 473 -63555 132687
15289b32146g2811H0957J84649a45614D0507a27278B5300f4958j02327J8296j93018
$$ -232146 -72811 80957 265606 -145614 40507 -127278 25300 -64958 -167285 -148989 -342007
15278c42007b8144A56681b31121A39273n3110J4750m2616J46436G4803J32933
$$ -342007 -28144 156681 -231121 139273 86163 100913 58297 204733 74803 207736
15268B07736D6815L00832D8405N158J51005q7677c1474A56866c51217b2602k29624
$$ 207736 46815 347647 48405 53563 204568 116891 -31474 156866 -351217 -22602 -252226
15257b52226o9862G9090R5930a32674m3880A73242e769A41553J1545R07334J187490
$$ -252226 -322088 79090 175020 -132674 -176554 173242 -5769 141553 153098 1060432 2247922
15246B247922j017848M14651N42233B78490K36546a8441A65985b50482I1537m34
$$ 2247922 1230074 1644725 2186958 278490 515036 -18441 165985 -250482 91537 91103
15236I1103b71552a5262G1677N3209b14857B33979A8180g13B16547H5445J63223
$$ 91103 -271552 -15262 71677 124886 -214857 233979 18180 -713 216547 85445 248668
15225B48668n962a35050a8921A27012L629a6279A21139L4045M8920E628a21403
$$ 248668 242706 -135050 -18921 127012 130641 -16279 121139 155184 204104 5628 -121403
15213c6039k2695q7714D20433A24692O2810G6505a29031M1788J7771A24846e4330
$$ -36039 -58734 -146448 420433 124692 187502 76505 -129031 -87243 -69472 124846 -54330
15201A87066p9715j1239M695N1171i5890H1759Q3899J8256n6666a28315D33665
$$ 187066 107351 96112 100807 151978 -95890 81759 165658 183914 127248 -128315 433665
15189d6452L205r4274B15230N9492H2670c7802A49954e5995j24846H6171J22557
$$ -46452 -43247 -137521 215230 274722 82670 -37802 149954 -55995 -180841 86171 208728
15178B08728a15457A10954R8913G1179L05140C5103a97438G8099C4143M3278K08124
$$ 208728 -115457 110954 209867 71179 376319 35103 -197438 78099 34143 77421 285545
15167B85545i6220k4423i754B32830B4822L47580A9826a50850E03891A34600D6543
$$ 285545 -96220 -120643 -9754 232830 24822 372402 19826 -150850 503891 134600 46543
15155g3378F1725a01551A78819F0320K50146r7227m3019k4313L08415j29971A24493
$$ -73378 61725 -101551 178819 60320 310466 213239 170220 145907 454322 324351 124493
15143A36866N7762E5495N2259M47384B07801G2919K4379P5739b34964J07987F1868
$$ 136866 194628 55495 107754 555138 207801 72919 97298 173037 -234964 -126977 61868
15131G3291N2674J61267c9155k18076F9630N9896a89112D78189j95811J16172
$$ 73291 125965 287232 -39155 -257231 69630 129526 -189112 478189 282378 398550
15121C98550A79480J91541m6693D9202M92J25228q0287k0382L892B4802h0033
$$ 398550 179480 371021 324328 49202 49694 174922 94635 74253 78145 24802 -80033
15109c0875C0309a89295n2035i0750L52A41542K0359H657J10043b4729I4294h7995
$$ -30875 30309 -189295 -241330 -90750 -90398 141542 161901 8657 118700 -24729 94294 -87995
15096B85669C247d4999j22712E89924j51333A91033d339A84452K23758j76014
$$ 285669 3247 -44999 -167711 589924 438591 191033 -4339 184452 408210 232196
15086B32196G0358b6918B24721I205J9280A486J62783k2021l935L8297k0413a87566
$$ 232196 70358 -26918 224721 9205 28485 1486 164269 142248 138313 176610 156197 -187566
15073g2717c4402A64662b842A99206q5842J81092j04203A1753c5676A12267L3603
$$ -72717 -34402 164662 -2842 199206 113364 294456 190253 11753 -35676 112267 145870
15062A45870b69918F1298K31320K6737A46263J05897R0403A46229J01185k4861
$$ 145870 -269918 61298 292618 319355 146263 252160 342563 146229 247414 222553
15052B22553k5153l8060N4460D3462j3314i9226M1816K556K6138B93028J09088
$$ 222553 197400 159340 213800 43462 30148 -99226 -57410 -54854 -28716 293028 402116
15041D02116j54911K2757q8652n1320o3753j6829L425i0423A43598J67867q1139
$$ 402116 247205 269962 181310 129990 66237 49408 52833 -90423 143598 311465 230326
15030B30326Q8860h3446B72725l7222j13813L15556F9504a68580B41485Q4183
$$ 230326 319186 -83446 272725 235503 121690 437246 69504 -168580 241485 325668
15020C25668K2123n6320J1914H3359f5241B09263H7563O2477n2777J78048j13867
$$ 325668 347791 291471 303385 83359 -65241 209263 87563 150040 97263 275311 161444
15009A61444K1139q1028J34736H1070J68214l7971k7136I0236a37334f8075m0392
$$ 161444 182583 101555 236291 81070 249284 211313 184177 90236 -137334 -68075 -108467
14998a08467H6008J22916I6826J08949R2397J92006A1811L12655J78679k41633
$$ -108467 86008 208924 96826 205775 298172 490178 11811 324466 503145 261512
14988B61512J67670a17013B4739J80681N5883r6858J27285j06331a46946B15431
$$ 261512 429182 -117013 24739 205420 261303 164445 291730 185399 -146946 215431
14977C37028A0166L58578c8878B84096j18924M65177A36544O3182l1957j9708
$$ 337028 10166 368744 -38878 284096 165172 630349 136544 199726 167769 148061
14967A48061C1136K04874Q463L9884o1682A05195L56566A07065K15221M405A14585
$$ 148061 31136 236010 244473 284357 222675 105195 461761 107065 322286 326691 114585
14955B71097j257K02188j89795b1248C59633H8215Q327L01650h942j46753B34207
$$ 271097 269840 472028 282233 -21248 359633 88215 96542 398192 -8942 -155695 234207
14943f7708D36163d82248A5133L05673K29813d341D55937o5693N4397B04547r0514
$$ -67708 436163 -482248 15133 320806 550619 -4341 455937 390244 444641 204547 114033
14932A14033J66460K3616K2216A03738N1576K33518j36278p7799M7890L36610
$$ 114033 280493 304109 326325 103738 155314 388832 252554 174755 222645 559255
14922E59255B25234e6334A91633I846J58420K8978N7360K7483J22346q4418E6003
$$ 559255 225234 -56334 191633 9846 168266 197244 254604 282087 404433 320015 56003
14910B20842K02097j06802n288K335j0087O998O8673P6224q1606A58063K05478
$$ 220842 422939 316137 310849 313184 303097 310095 378768 454992 373386 158063 363541
14899C63541N7218I2504K49504R9245A00527M12273n8610Q743j70297Q8446I0655
$$ 363541 420759 92504 342008 441253 100527 512800 454190 462933 292636 381082 90655
14887D38608o4474o6927k5744A07742L53548j38250a4124C52626j73314l4649
$$ 438608 374134 307207 281463 107742 461290 323040 -14124 352626 179312 144663
14877A44663K6467J25338O7496n0739P2572D5832K71362J41388B05707P6104K84895
$$ 144663 171130 296468 363964 313225 385797 45832 317194 458582 205707 281811 566706
14866E66706B38868J12120P7418k05815o691M33048A71000P06177B47640J15888
$$ 566706 238868 350988 428406 222591 215900 648948 171000 877177 247640 363528
14856C63528j9039r9516K03485j7625A59338L47957j00069g0188C68939K03932
$$ 363528 344489 244973 448458 430833 159338 507295 407226 -70188 368939 572871
14846E72871j2216j49799j89693J22265J0831M2756K54126B64447M50638C44372
$$ 572871 560655 410856 221163 343428 354259 397015 651141 264447 715085 344372
14835B86725J78679J51757A94871J9484n9347J78621L29276k18426J27926j94448
$$ 286725 465404 617161 194871 214355 155008 333629 662905 444479 572405 377957
14825C77957l0964r1662L51940J75410k11473B71523A00093P37453C84525K23795
$$ 377957 346993 255331 607271 782681 571208 271523 100093 837546 384525 608320
14815F08320j4580B9734M30369L3929p937j84607q9619N08277n3308j71359N1803
$$ 608320 593740 29734 460103 494032 486095 301488 211869 720146 666838 495479 547282
14804E47282k08145n1102J4311A28937K72058L71616k66813N2814P7419B33515
$$ 547282 339137 288035 302346 128937 400995 772611 505798 558612 636031 233515
14793C76956L14290r2289j10106n2938J9977K16942k1151O6811A82328K97552
$$ 376956 691246 598957 488851 435913 455890 672832 651681 718492 182328 479880
14783D79880L01616j82351R6928M9427C34997J36244J7894N02944D64118R2422
$$ 479880 781496 599145 696073 745500 334997 471241 489135 992079 464118 556540
14773E56540j22955K46518l5097k28590J55470q2541K95020B19465L70370J76212
$$ 556540 433585 680103 645006 416416 571886 489345 784365 219465 589835 766047
14763G66047C65617L63454B66271J89251Q5000l1040P7589k57530L71052L6335
$$ 766047 365617 729071 266271 455522 540522 509482 587071 329541 700593 736928
14753G36928q9046O2125C41141l0526O50388K67918D95782J80383M577N17909
$$ 736928 647882 710007 341141 310615 961003 1228921 495782 676165 680742 1198651
14743A198651E10063P05151m02472J9378l65008J83928J24880N7607k39283R4944
$$ 1198651 510063 1215214 812742 832120 467112 651040 775920 833527 594244 689188
14733F89188K03877l6327j99925J01649j5518k04182P4181O1399K75849J75073
$$ 689188 893065 856738 656813 758462 742944 538762 612943 674342 950191 1125264
14723A125264E54555L20839j34159J66242j57986J46811j62018m6526L4553p858
$$ 1125264 554555 875394 741235 907477 749491 896302 734284 687758 722311 714453
14713G14453J06827R592k7093J03827j20816j61781M4389J77106n0285j82605
$$ 714453 821280 830872 803779 907606 786790 625009 669398 846504 796219 613614
14703F13614l4656K2482J41909k3003J60618r7874J94629j44044R4358J66831
$$ 613614 578958 601440 743349 720346 880964 783090 977719 833675 928033 1094864
14693A094864k66894k8632J3874n136o616J91618q3923j79034j021J13078J55596
$$ 1094864 827970 799338 813212 808076 801460 993078 909155 730121 729100 842178 997774
14682I97774L86222l54106M55734l01192j39859m7927L6596j86772P3045o1471
$$ 997774 1383996 1029890 1485624 1184432 1044573 996646 1033242 846470 919515 858044
14672H58044j51428M64549l33268l854K45552j55763J02298m0978q9062J5833
$$ 858044 706616 1171165 837897 834043 1079595 923832 1026130 985152 896090 911923
14662I11923j73945L81583J4033P0049j73698N7632j17502J5333K17864L1360
$$ 911923 737978 1119561 1133594 1203643 1029945 1087577 970075 985408 1203272 1234632
14652A234632P3538j35987J46383j51042o8124j41732L96078o7555K30245k57746
$$ 1234632 1308170 1172183 1318566 1167524 1099400 957668 1353746 1286191 1516436 1258690
14642A258690j19245R9212J77547o3147l64696P1467K06203L816n2347M0151l443
$$ 1258690 1139445 1238657 1416204 1353057 988361 1059828 1266031 1269847 1217500 1257651 1254208
14631A254208K05695k81253K07647J51586j13722k45933J77517k07747K12576
$$ 1254208 1459903 1178650 1386297 1537883 1424161 1178228 1355745 1147998 1360574
14622A360574O192J15263k11172N6959L85722m13595K95106j97656o3602J18169
$$ 1360574 1366766 1482029 1270857 1327816 1713538 1299943 1595049 1397393 1333791 1451960
14612A451960q545K96549m4867l35374K43064J7792J80911l9843K3034m15230
$$ 1451960 1443415 1739964 1695097 1359723 1602787 1620579 1801490 1761647 1784681 1369451
14602A369451N05097L6043l68912J72759n7287K669r0737L30989j38358l6642
$$ 1369451 1874548 1910591 1541679 1714438 1657151 1659820 1569083 1900072 1761714 1725072
14592A725072j6619q5776J31309L07037l33373n1155L6253Q900J40109K54156
$$ 1725072 1708453 1622677 1753986 2061023 1727650 1676495 1712748 1721648 1861757 2115913
14582B115913l88997J538K6203J50824k2339J44675j36197L68539K3549k6919
$$ 2115913 1726916 1728454 1754657 1905481 1883142 2027817 1891620 2260159 2283708 2256789
14572B256789R1836k54721m2178K91819J24347k25845R9133J14444P6656k21167
$$ 2256789 2348625 2093904 2051726 2343545 2467892 2242047 2341180 2455624 2532280 2311113
14562B311113N9383O21980j82669J89917j182N9357q5175j91299O02060L76501
$$ 2311113 2370496 2992476 2809807 2999724 2998542 3057899 2972724 2781425 3383485 3759986
14552C759986K84344O43263P77438J520672L087851Q175783J8833425J1807424
$$ 3759986 4044330 4687593 5465031 6985703 10073554 18249337 37082762 48890186
14544D8890186B1470609r034620n842648k457948j340930o22499r5381j10695
$$ 48890186 21470609 12435989 6593341 4135393 2794463 2171964 2076583 1965888
14536A965888j4021P5464J79936l17249L11409J03000k18221K84554k40237K71185
$$ 1965888 1951867 2027331 2207267 1890018 2201427 2304427 2086206 2370760 2130523 2401708
14526B401708l25790M21906k38208Q6837k5049L5252R8654L19176l60218J20143
$$ 2401708 2075918 2497824 2259616 2346453 2321404 2356656 2455310 2774486 2414268 2534411
14516B534411K73924m81956M20653q775K8536j17264N17143l62682m7750O77870
$$ 2534411 2808335 2326379 2747032 2738257 2766793 2649529 3166672 2803990 2756240 3434110
14506C434110n12951L1276L5993j8148J43551j3435k794n3367M47765k20983J44492
$$ 3434110 2921159 2952435 2988428 2970280 3113831 3100396 3097602 3044235 3492000 3271017 3415509
14495C415509p2587p9456M27196j41533k07051M36024l3542m32456M99693m01934
$$ 3415509 3342922 3263466 3690662 3549129 3342078 3778102 3744560 3312104 3811797 3409863
14485C409863J08840L92484k73620L88703j25801J16653J34511m03407L71003
$$ 3409863 3518703 3911187 3637567 4026270 3900469 4017122 4151633 3748226 4119229
14476D119229J42242l53762M05614j96756Q82J38466j81491K58118R2906L39256
$$ 4119229 4261471 3907709 4313323 4116567 4117449 4255915 4074424 4332542 4425448 4764704
14466D764704k74032K52929J24841k65550J68057J02884l86813L03986L41181
$$ 4764704 4490672 4743601 4868442 4602892 4770949 4873833 4487020 4791006 5132187
14457E132187K10352R266j50040j20626M7303K18479r4742J10394j4932K1464
$$ 5132187 5342539 5351805 5201765 5081139 5128442 5346921 5252179 5362573 5347641 5369105
14447E369105L97190L9782k57014L12277J00973m8801L48646J22916r3662K24572
$$ 5369105 5766295 5806077 5549063 5861340 5962313 5913512 6262158 6385074 6291412 6515984
14437F515984K71877j75885N9213j6630M9640K93061Q4593q2696L71689r4410
$$ 6515984 6787861 6611976 6671189 6654559 6704199 6997260 7081853 6999157 7370846 7276436
14427G276436J23700K7572L2716J0517P3984K64245p4322L20720K19994J9646
$$ 7276436 7400136 7427708 7460424 7470941 7544925 7809170 7734848 8055568 8275562 8295208
14417H295208K08001J18588K43815j54791N74842l27330J90700L22972M1321M96490
$$ 8295208 8503209 8621797 8865612 8710821 9285663 8958333 9149033 9472005 9513326 10009816
14407A0009816j11205M47776j99187j40765M81288M7652j15129M56792o5025N03518
$$ 10009816 9898611 10346387 10147200 10006435 10487723 10535375 10420246 10877038 10812013 11315531
14397A1315531K70947J21525L58200J57686K09357P1220j35426M27839L18167
$$ 11315531 11586478 11708003 12066203 12223889 12433246 12504466 12369040 12796879 13115046
14388A3115046N24647J4686J01363K25486L53179J65486L48659R8201K02944M73604
$$ 13115046 13639693 13654379 13755742 13981228 14334407 14499893 14848552 14946753 15149697 15623301
14378A5623301k530J75301P55141N2691L41589K63950O76136J62085M86754L09319
$$ 15623301 15620771 15796072 16551213 16603904 16945493 17209443 17885579 18047664 18534418 18843737
14368A8843737L22877K58613O34606K77265L86094M97150M42135M32047O70634
$$ 18843737 19166614 19425227 20059833 20337098 20723192 21220342 21662477 22094524 22765158
14359B2765158j77024Q45765L36628P26447P27689L82174P05043P38367L36929
$$ 22765158 22588134 23433899 23770527 24496974 25224663 25606837 26311880 27050247 27387176
14350B7387176P61196J045681M48492P26657P73818P73072P77488J026724N06780
$$ 27387176 28148372 29194053 29642545 30369202 31143020 31916092 32693580 33720304 34227084
14341C4227084O30347J419146R37097J176824Q01480J189209J168910J166564
$$ 34227084 34857431 36276577 37213674 38390498 39191978 40381187 41550097 42716661
14333D2716661J255075J162798J316051J532744J344386J472122J901332J624967
$$ 42716661 43971736 45134534 46450585 47983329 49327715 50799837 52701169 54326136
14325E4326136J503005J953674J855618K162821K079029K080497K385720K446106
$$ 54326136 55829141 57782815 59638433 61801254 63880283 65960780 68346500 70792606
14317G0792606K036674L143092K363471L135793L635092K749544L800956L513360
$$ 70792606 72829280 75972372 78335843 81471636 85106728 87856272 91657228 95170588
14309I5170588L678166L964750M524267M265143M917157N236112N345319N322452
$$ 95170588 98848754 102813504 107337771 111602914 116520071 121756183 127101502 132423954
14301A32423954O128379N955927O732081O722857P715963P883526Q242749Q564543
$$ 132423954 138552333 144508260 151240341 157963198 165679161 173562687 181805436 190369979
14293A90369979R687979R355492J0374231J0772408J1254614J1729489J2571215
$$ 190369979 200057958 209413450 219787681 230560089 241814703 253544192 266115407
14286B66115407J2857368J3438520J4139653J3911002J4426601J4868291J4564816
$$ 266115407 278972775 292411295 306550948 320461950 334888551 349756842 364321658
14279C64321658J4533724J4350770J3435765J3324721J1595439J0512834Q336394
$$ 364321658 378855382 393206152 406641917 419966638 431562077 442074911 450411305
14272D50411305N106122J358310P2306J096149k038836m462120o492122p922781
$$ 450411305 455517427 456875737 456948043 458044192 456005356 451543236 445051114 437128333
14264D37128333r005752r744382j1280738j2912366j4350402j4698558j5248019
$$ 437128333 428122581 418378199 407097461 394185095 379834693 365136135 349888116
14257C49888116j5344045j5391777j5054951j4298949j2569542j3764992j2942180
$$ 349888116 334544071 319152294 304097343 289798394 277228852 263463860 250521680
14250B50521680j2270971j1709661j1284196j0640454j0102001r166048q853599
$$ 250521680 238250709 226541048 215256852 204616398 194514397 185348349 176494750
14243A76494750q031881p916920p993669o582976o615352o327959n539296n637685
$$ 176494750 168462869 160545949 152552280 145969304 139353952 133025993 127486697 121849012
14235A21849012n363959m716700m847479m437638l580791m137542l723061l536208
$$ 121849012 116485053 111768353 106920874 102483236 98902445 94764903 91041842 87505634
14227H7505634l816748l241072k714527k815722k597427l118120j916688j924245
$$ 87505634 83688886 80447814 77733287 74917565 72320138 69202018 67285330 65361085
14219F5361085k818746j727348k526146j605595j898078j317410j440577j883935
$$ 65361085 62542339 60814991 58288845 56683250 54785172 53467762 52027185 50143250
14211E0143250j741523j249313j734234r51429o00801j403812j439905j127019
$$ 50143250 48401727 47152414 45418180 44466751 43865950 42462138 41022233 39895214
14203C9895214j484739j125301p35000l50780j250175j302058n75247j201230
$$ 39895214 38410475 37285174 36550174 36199394 34949219 33647161 33071914 31870684
14195C1870684m54938m32892j106917r36738p52602q39491o95183n60067m25900
$$ 31870684 31415746 30982854 29875937 28939199 28186597 27347106 26651923 26091856 25665956
14186B5665956o80815l56752j031918j36789k59637q46966k33077q62009k50320
$$ 25665956 24985141 24628389 23596471 23459682 23200045 22353079 22120002 21257993 21007673
14177B1007673m11922k33757m88992p12279l99820j65853l31706n17351l10226
$$ 21007673 20595751 20361994 19873002 19160723 18760903 18595050 18263344 17745993 17435767
14168A7435767k0284o06907l48240m73690l15768j29452k22169n76532M7556k31948
$$ 17435767 17415483 16808576 16460336 15986646 15670878 15541426 15319257 14742725 14790281 14558333
14158A4558333k63385k60274m14062p4715m97324L01583j83610p93250J42891
$$ 14558333 14294948 14034674 13620612 13545897 13048573 13350156 13166546 12373296 12516187
14149A2516187k62874k42175K3196k85793k60881k19334j14993k79297j9836j8998
$$ 12516187 12253313 12011138 12034334 11748541 11487660 11268326 11153333 10874036 10854200 10835202
14139A0835202l2953n84891Q2894n32065r639j52828L3558N0582n24663L2104
$$ 10835202 10802249 10217358 10300252 9768187 9758548 9605720 9639278 9689860 9165197 9197301
14129I197301k31911J40543j00322k40877l27169J15214j57230j57704j32277
$$ 9197301 8965390 9105933 9005611 8764734 8437565 8552779 8395549 8237845 8105568
14120H105568p6653j79148p0505j62382K56607l18844j37358j77983k405J2064
$$ 8105568 8028915 7849767 7779262 7616880 7873487 7554643 7417285 7239302 7236897 7248961
14110G248961Q2109l66354J78023l60060K36811m80701j6773L32057l68728j92993
$$ 7248961 7331070 6964716 7142739 6782679 7019490 6538789 6522016 6854073 6485345 6292352
14100F292352j64869k3255M5006O732j17616l78117K31759j99967j51549K52967
$$ 6292352 6127483 6104228 6149234 6155966 6038350 5660233 5891992 5692025 5540476 5793443
14090E793443k73772l54993L08668j4365j0053j36079J25386j49k91865j69742
$$ 5793443 5519671 5164678 5473346 5458981 5448928 5312849 5438235 5438086 5146221 4976479
14080D976479L17835m01380J50531L1498j62638J69879m24182j46939L7048J28246
$$ 4976479 5294314 4892934 5043465 5074963 4912325 5082204 4658022 4511083 4548131 4676377
14070D676377m4155k17690P8232k74801J80613l6429r7640j48829K1320q9679
$$ 4676377 4632222 4414532 4492764 4217963 4398576 4362147 4264507 4115678 4136998 4047319
14060D047319q081L23420k28867l70871K46634p9049J74305m41878J33080N1915
$$ 4047319 4039238 4362658 4133791 3762920 4009554 3930505 4104810 3662932 3796012 3847927
14050C847927k13334k48080M08024m09379M34558k63961j05135m6905J07849j27155
$$ 3847927 3634593 3386513 3794537 3385158 3819716 3555755 3450620 3403715 3511564 3384409
14040C384409j01316N5041m026J11753p2579K05258k86738J87380k02316M797
$$ 3384409 3283093 3338134 3334108 3445861 3373282 3578540 3291802 3479182 3276866 3281663
14030C281663j29097Q5850O5483p8610l81234K23984n5496N980J9086j79113j26817
$$ 3281663 3152566 3238416 3303899 3225289 2844055 3068039 3012543 3018523 3037609 2858496 2731679
14019B731679J27180J12009l1871l36973M197p0J83501l14337J62449J77654j19871
$$ 2731679 2858859 2970868 2938997 2602024 2606221 2606151 2789652 2475315 2637764 2815418 2695547
14008B695547k10959n4240r6477M0561J90259p4768j56211r2275j33546J55829
$$ 2695547 2484588 2430348 2333871 2374432 2564691 2489923 2333712 2241437 2107891 2263720
13998B263720k7334J06436R6451n36972M03246N6877k16127K07725J77083M31214
$$ 2263720 2236386 2342822 2439273 1902301 2305547 2362424 2146297 2354022 2531105 2962319
13988B962319K440426O164584J7841283K0931884k3409102j2997729n323279k045544
$$ 2962319 5402745 11567329 29408612 50340496 26931394 13933665 8610386 6564842
13980F564842j036154j124900p53549k7137k50819L2960J53218m85265m06569
$$ 6564842 5528688 4403788 3650239 3623102 3372283 3405243 3558461 3073196 2666627
13971B666627l72965Q0868J98302q7100J1268k1527j92191J546R0281k49805J67504
$$ 2666627 2293662 2374530 2572832 2485732 2497000 2475473 2283282 2284828 2375109 2125304 2292808
13960B292808j26955J151R1999k19904L71772j32077l15042q638L889m6970J93448
$$ 2292808 2165853 2167004 2259003 2039099 2410871 2278794 1963752 1955114 1959003 1912033 2105481
13949B105481k62057K15422J55482M7559j41986k71696K6139K58130n7688j53197
$$ 2105481 1843424 2058846 2214328 2261887 2119901 1848205 1874344 2132474 2074786 1921589
13939A921589j33108K03796o8884p887m94000N68526n11313J78149K66247N1005
$$ 1921589 1788481 1992277 1923393 1915506 1421506 1990032 1478719 1656868 1923115 1974120
13929A974120j31296k62230L07269o86556P68727j16586J81252m63486J68230
$$ 1974120 1842824 1580594 1887863 1201307 1970034 1853448 2034700 1571214 1739444
13920A739444Q2525O5390k99250l0323L16322m44671Q5683j60817K16366K9058
$$ 1739444 1821969 1887359 1588109 1557786 1874108 1429437 1515120 1354303 1570669 1599727
13910A599727j96829l1310L09123j65445j70179L04868k68406j8106o8007j3389
$$ 1599727 1402898 1371588 1680711 1515266 1345087 1649955 1381549 1363443 1295436 1282047
13900A282047m1585j51366M74324j55081j3468L19711k72862k25564K54397J19672
$$ 1282047 1240462 1089096 1563420 1408339 1394871 1714582 1441720 1216156 1470553 1590225
13890A590225n55138K57767j39696J16732q843n0187K13611Q6487q1631M8046
$$ 1590225 1035087 1292854 1153158 1269890 1261047 1210860 1424471 1510958 1429327 1477373
13880A477373j13619l5426l3578j45498M65485k46237j86584j87072K19496K36028
$$ 1477373 1363754 1328328 1294750 1149252 1614737 1368500 1181916 994844 1214340 1450368
13870A450368j59140J9763j03121j25793K08304l68864J93907R439n147n6864
$$ 1450368 1291228 1310991 1207870 1082077 1290381 921517 1115424 1124863 1119716 1062852
13860A062852k57859L61268K3881o5036k8971k82287M60548J09058k7082l44640
$$ 1062852 804993 1166261 1190142 1125106 1096135 813848 1274396 1383454 1356372 1011732
13850A011732J88280k35072J68739j26150J8399M9559L05050m28675n1695k76933
$$ 1011732 1200012 964940 1133679 1007529 1025928 1075487 1380537 951862 900167 623234
13840F23234M84960q189O70j80378J64776r6870Q364J3977J0247o4642j63046
$$ 623234 1108194 1100005 1100675 920297 1085073 988203 996567 1010544 1020791 956149 793103
13829G93103P3438J31830j29445J8094r5110L02530j50135j2679J14580l1911
$$ 793103 866541 998371 868926 887020 791910 1094440 944305 931626 1046206 1014295
13819A014295k65060J99544l0930M8199J3512j36142K5925j55631J80242j87906
$$ 1014295 749235 948779 917849 966048 979560 843418 869343 713712 893954 706048
13809G06048P6303j65875P0536K38663J82667j35185J56681l05312K22500l05758
$$ 706048 782351 616476 687012 925675 1108342 973157 1129838 824526 1047026 741268
13799G41268K3177p6034J6422j07227L7526K73779k28965Q0133Q7680J2771L3148
$$ 741268 764445 688411 704833 597606 635132 908911 679946 760079 847759 860530 893678
13788H93678l28306K61329K43932m98101O2910m0449K89330l4190n0267k82760
$$ 893678 565372 826701 1070633 572532 635442 594993 884323 850133 799866 517106
13778E17106M00554m13444L84256l71475J73906r5156J45518K6638K47855j82865
$$ 517106 917660 504216 888472 516997 690903 595747 741265 767903 1015758 832893
13768H32893o5401o1326B87736M71175p3682j47328j27034L06520M5717R9249
$$ 832893 767492 706166 287736 758911 685229 537901 410867 717387 763104 862353
13758H62353j24503K4598k89892O7576L42156k95314J31803K00649j36441j15565
$$ 862353 737850 762448 472556 540132 882288 586974 718777 919426 782985 667420
13748F67420j62012M50898B76370N89871D18307K30026r2632K81286o7674k27650
$$ 667420 505408 956306 276370 866241 418307 648333 555701 836987 769313 541663
13738E41663R396N7837K16118k35044j34588J60832K1919j42698R4513o0489L13015
$$ 541663 551059 608896 825014 589970 455382 616214 638133 495435 589948 529459 842474
13727H42474K17639l61543j20636L2984L51691C93260Q7493L36988j80224N1424
$$ 842474 1060113 698570 577934 610918 962609 393260 480753 817741 637517 688941
13717F88941r7077J06260k59851j74749L74237k56866J59547L8037j27045j17951
$$ 688941 591864 698124 438273 263524 637761 380895 540442 578479 451434 333483
13707C33483J86269j66979j11233M77246l20332K30106M1315l22655L50358j13425
$$ 333483 519752 352773 241540 718786 398454 628560 669875 347220 697578 584153
13697E84153J32528k12659l315o8747L72094j61426k93342L32112K7683k32994
$$ 584153 716681 504022 500707 431960 804054 642628 349286 681398 709081 476087
13687D76087O8679M9304l2611J01438m3468r5705J29774k00498K76604B69441
$$ 476087 544766 594070 561459 662897 619429 523724 653498 453000 729604 269441
13676A50983J70342A03851O04176k08726J82730A71256J15134J80406A74829M11025
$$ 150983 321325 103851 708027 499301 682031 171256 286390 466796 174829 585854
13666E85854B07001F5770M25421j26374J62936J84612k78687O9195q2167B05507
$$ 585854 207001 65770 491191 364817 527753 712365 433678 502873 420706 205507
13655E34775L9186J03331C38594j3670j22844N65317C21713P2800J14767L26542
$$ 534775 573961 677292 338594 324924 202080 767397 321713 394513 509280 835822
13645H35822l73020n7948J11157P1583K831j81132J14639j80109J92866k61727
$$ 835822 462802 404854 516011 587594 590425 409293 523932 343823 536689 274962
13635B74962l210L2687L61062l06867J07276k13500L18995p1189n7780B18316
$$ 274962 271752 304439 665501 358634 465910 252410 571405 500216 442436 218316
13624F25422k1213B79539J60129j83830J07597J01442k8710O7858A23698K88715
$$ 625422 604209 279539 439668 255838 363435 464877 436167 504025 123698 412413
13614D12413N3065P491Q3678m8286r690m3523p762J38322j79117P2002B09509
$$ 412413 465478 472969 556647 508361 498671 455148 447386 585708 406591 478593 209509
13602A16075L08795A13721M26214j18910J4992J76548A34261K43835A33121K42348
$$ 116075 424870 113721 539935 421025 436017 612565 134261 378096 133121 375469
13592C75469j37297L75794A40843L12060F2652L98257j77540J10927A93076K81408
$$ 375469 238172 613966 140843 452903 62652 460909 283369 394296 193076 474484
13582D74484j20716N4067j93965m8425L32312J269j47034k8702J1705A17609K21762
$$ 474484 353768 407835 213870 165445 497757 499026 351992 323290 334995 117609 339371
13571C39371m1069a73159C55921L15963A53249k7400L43596j03622n9967J23356
$$ 339371 298302 -173159 355921 671884 153249 125849 469445 365823 305856 429212
13561D29212j75820j22142N9476J74971Q0872J23729J0658A42781K00490K22207
$$ 429212 253392 131250 190726 365697 446569 570298 580956 142781 343271 565478
13551E65478j51604B3122J53911K43835n2353a4268B43843a45141C15393J29087
$$ 565478 413874 23122 177033 420868 368515 -14268 243843 -145141 315393 444480
13541D44480a08869N4424E72218B32962J25958M7469j02420N4801L5373j16527
$$ 444480 -108869 -54445 572218 232962 358920 406389 303969 358770 394143 277616
13531B77616A26117K64570J53959A36130k3952K34205j05013J52076A56737L20717
$$ 277616 126117 390687 544646 136130 112178 346383 241370 393446 156737 477454
13521D77454j62248L28695A74227J05697L39561k61789j6516j4664l1702K2660
$$ 477454 315206 643901 174227 279924 619485 357696 341180 326516 294814 317474
13511C17474r1478A9355L46805q801J05519B19929c6060A815M07951A32410N1232
$$ 317474 225996 19355 366160 357359 462878 219929 -36060 1815 409766 132410 183642
13500A83642l0208j0267f8026D53938A07871L05153b4859D47806H1188M4670M54978
$$ 183642 153434 143167 -68026 453938 107871 413024 -24859 447806 81188 125858 580836
13489E80836i3711B62799N7059K28569k10831Q0202I8086L39792m5372M6671j77762
$$ 580836 -93711 262799 319858 548427 337596 417798 98086 437878 392506 439177 261415
13478B61415J07120I5780k2074K14218K37582I8608K42225q0418k2103J87394
$$ 261415 368535 95780 73706 287924 525506 98608 340833 260415 238312 425706
13468D25706J02447j87517j8263J25985k09593K72866k9023D8343K09984I3095
$$ 425706 528153 340636 322373 448358 238765 511631 482608 48343 258327 93095
13457G2121C0401L0811J79564n5259M921J77780C7779K56124A44066R1023J18738
$$ 72121 30401 61212 240776 185517 190438 368218 37779 293903 144066 235089 353827
13446C53827A16952k321L51584k25580b1513A96572Q9844J83017i2208C79541
$$ 353827 116952 114631 466215 240635 -21513 196572 286416 469433 -92208 379541
13435g4410a5036B36916k6608l8861J56147I9263g3344a0510M380m4164B09584
$$ -74410 -15036 236916 210308 171447 327594 99263 -73344 -10510 -6130 -50294 209584
13423A25175J0640A8193J01290b3398B55901r270n0364j9744J03228J1184o4976
$$ 125175 135815 18193 119483 -23398 255901 246631 196267 176523 279751 290935 225959
13412B25959n3287G3950P3797D0592J00473k3341L16997j81150L41288b2840G4696
$$ 225959 172672 73950 147747 40592 141065 117724 434721 253571 594859 -22840 74696
13400D44587a3232C26963A33559j6793K49519A42661K65839L4722k14106J7863
$$ 444587 -13232 326963 133559 116766 366285 142661 408500 443222 229116 246979
13390B46979N0044E7026K20930A05702K42820M3529j63928j11372J05997b80256
$$ 246979 297023 57026 277956 105702 348522 392051 228123 116751 222748 -280256
13379A77653C9405J95127J5415A267Q6328L36927K9787A30605J54370n8686k9430
$$ 177653 39405 234532 249947 1267 87595 424522 454309 130605 284975 226289 196859
13368A96859J59536n7861N3699H3296J29008J94441j80364j7003p763n7163J5846
$$ 196859 356395 298534 352233 83296 212304 406745 226381 209378 201615 144452 160298
13357A60298n9412a34720D43335k5713A14564J55171A15964J94614K71222k3446
$$ 160298 100886 -134720 443335 417622 114564 269735 115964 310578 581800 558354
13347E58354k51627J20748j4718G0362K82550r1336K63591B41868J43860J49903
$$ 558354 306727 427475 412757 70362 352912 261576 525167 241868 385728 535631
13337E35631j68341Q9687E1578N7473L70026k39273L27059j76128f6607A33116
$$ 535631 367290 456977 51578 109051 479077 239804 566863 390735 -66607 133116
13326B04182K59654M0543B29131J04950D5681J29195M4355L99107A68035L33600
$$ 204182 463836 504379 229131 334081 45681 174876 219231 618338 168035 501635
13316E01635j94700a8070H037K09728K87674j96410A40369Q3819h6349A02495
$$ 501635 306935 -18070 8037 217765 505439 309029 140369 224188 -86349 102495
13305A00127K67860l9755H5380a9612D36516r0642e5151Q295B0799O1671L4824
$$ 100127 367987 328232 85380 -19612 436516 345874 -55151 -46856 20799 82470 117294
13294A17294J89272J1696j55642c90C15456g9396I521J33431O2877O2671l8072
$$ 117294 306566 318262 162620 -390 315456 -79396 9521 142952 205829 268500 230428
13283B30428L6305m8121A5639i1700B23062e5976A74380H3719K3976J70701h2939
$$ 230428 266733 218612 15639 -91700 223062 -55976 174380 83719 107695 278396 -82939
13271C0403K80579b7262m5256B38090m7276M6098b28222C12616D5287J31056l1244
$$ 30403 310982 -27262 -72518 238090 190814 236912 -228222 312616 45287 176343 145099
13260A45099J49290E7484O3019M3185b23971A5173K51924J4716n7308b07512A21688
$$ 145099 294389 57484 120503 163688 -223971 15173 267097 281813 224505 -207512 121688
13248A13229E5132J13273N6171N7078j24072n8174K41593j47227j0458b2580G0995
$$ 113229 55132 168405 224576 281654 157582 99408 341001 193774 183316 -22580 70995
13236C14933p4154E9687K79630B2542d1793B54024j0881E693J8970c6597I5734
$$ 314933 240779 59687 339317 22542 -41793 254024 243143 5693 24663 -36597 95734
13224C3412A3068J28280O8286j3178d9878D12889B0520O048M5713J05851p1953
$$ 33412 13068 141348 209634 196456 -49878 412889 20520 26568 72281 178132 106179
13213A06179J65499H488N2766J90304P5232e4251a0537k04670A22945e3798k1598
$$ 106179 271678 8488 61254 251558 326790 -54251 -10537 -215207 122945 -53798 -75396
13202g5396C42960I0216J57269A07039f1037A80321K58910a68046A10970N8350
$$ -75396 342960 90216 247485 107039 -61037 180321 439231 -168046 110970 169320
13192A69320k3798a04856r292C14210E0932K1930K4083B0728J54728a59365B20612
$$ 169320 145522 -104856 -114148 314210 50932 72862 96945 20728 175456 -159365 220612
13180A16849L47912D3362c9269C04281A49778J55338a20271F9539L95167j21963
$$ 116849 464761 43362 -39269 304281 149778 305116 -120271 69539 464706 342743
13170C42743b02900B55929A03915K3340J58102G8760J97769d0343B46449j17793
$$ 342743 -202900 255929 103915 127255 285357 78760 276529 -40343 246449 128656
13160A28656E8517b31264D2843H062N49193A27690R5450b9561A05795B0116L12029
$$ 128656 58517 -231264 42843 8062 557255 127690 223140 -29561 105795 20116 332145
13149C32145A14012d5857n3910B79461q3220b5713A71722k1287a36621G1309a3592
$$ 332145 114012 -45857 -99767 279461 196241 -25713 171722 150435 -136621 71309 -13592
13137B75563I8866m396C3329e870k44695B98403f845B07521F9992c7379J5889
$$ 275563 98866 94470 33329 -5870 -250565 298403 -6845 207521 69992 -37379 -21490
13126b1490I7004E795K52564A2997P4620J00181d0570j10445A45077J49128A4082
$$ -21490 97004 5795 258359 12997 87617 187798 -40570 -151015 145077 294205 14082
13114A13282a12987C05775E9757l497P5351l6998O8794D3049B826h5985A94767
$$ 113282 -112987 305775 59757 56260 131611 94613 163407 43049 2826 -85985 194767
13102A55797a62229A73224K5078A448b14874N8895g2049q4230E2145J69584q3652
$$ 155797 -162229 173224 198302 1448 -214874 -155979 -72049 -156279 52145 221729 138077
13091A38077C2113J79757b7229B09958K2273h7930L9539B17477l5334m566j3716
$$ 138077 32113 211870 -27229 209958 232231 -87930 -48391 217477 182143 177577 163861
13080A63861p9148J7428P9278O8154E4501K4787P7230J7550a22925D6330g0753
$$ 163861 84713 102141 181419 249573 54501 79288 156518 174068 -122925 46330 -70753
13068a28031F4105a61278D91898D6584N79764l10682a78741A62324O7024O6768
$$ -128031 64105 -161278 491898 46584 626348 315666 -178741 162324 229348 296116
13058B96116a74422D09998D9157b52700C66788l8896D4473h1803k35647B23957
$$ 296116 -174422 409998 49157 -252700 366788 327892 44473 -81803 -317450 223957
13047a7298m5153A60710J62981l4760b38630a17209j33289A96584J77420J7710
$$ -17298 -62451 160710 323691 288931 -238630 -117209 -250498 196584 374004 391714
13037C91714A01191E05K23213C0532J56500K4558J1723c4440G872R6693J74404
$$ 391714 101191 505 223718 30532 187032 211590 223313 -34440 7872 104565 278969
13026B78969O6942K8250e1206C48185a85939F7701L89750C0857q40c1944C839
$$ 278969 345911 374161 -51206 348185 -185939 67701 457451 30857 30017 -31944 3839
13014B98507j0439J20222A67041a1855A65067L5888r1669a07760B34446N4908
$$ 298507 288068 408290 167041 -11855 165067 200955 109286 -107760 234446 289354
13004B89354J31056A56202B7471J93138K3709J3529A894f088G8531C8011J12788
$$ 289354 420410 156202 27471 220609 244318 257847 1894 -6088 78531 38011 150799
12993A50799R966A4737K77491a97541n1935B00898o3717c08987L4959R9562l5547
$$ 150799 160765 14737 292228 -197541 -249476 200898 137181 -308987 -274028 -174466 -210013
12982b10013j47146B55362b4847l9975e102E8676f6705Q030H5454a86435I3231
$$ -210013 -357159 255362 -24847 -64822 -5102 58676 -66705 -58675 85454 -186435 93231
12970B21843J3720g4219A71625K30060A71352l8335l4138J37791O9645a76918
$$ 221843 235563 -74219 171625 401685 171352 133017 98879 236670 306315 -176918
12959a28324C91859A33353O1046n9396f7512A65877a12317B61243C8221b670B26338
$$ -128324 391859 133353 194399 135003 -67512 165877 -112317 261243 38221 -2670 226338
12947A28951a82552d4974j31563O0529A60016c42217I6092C39L77917j31856D9607
$$ 128951 -182552 -44974 -176537 -116008 160016 -342217 96092 339 378256 246400 49607
12935B96407a75693H2805J88679j23223a01160D4644a63819B04600d2592D5313
$$ 296407 -175693 82805 271484 148261 -101160 44644 -163819 204600 -42592 45313
12924E7491P2021R4038j07372b0874C22508b5010A09220e6090E5489L1182a29594
$$ 57491 129512 223550 116178 -20874 322508 -25010 109220 -56090 55489 86671 -129594
12912A7831J1326a80751M1130C9121O3373a02999K7327l7089B36190b7864B24670
$$ 17831 29157 -180751 -139621 39121 102494 -102999 -75672 -112761 236190 -27864 224670
12900B68102K4243j30298K3109C4178J47917i9387B09831F982J40657g1160A45732
$$ 268102 292345 162047 185156 34178 182095 -99387 209831 6982 147639 -71160 145732
12888G2132M85044a26945N5771B03354a92099g3888j45829c7928k48862H5338
$$ 72132 557176 -126945 -71174 203354 -192099 -73888 -219717 -37928 -286790 85338
12877i8524j4631B62255G8911K25335p5117i2768K0593B3778K09546b14372C05751
$$ -98524 -113155 262255 78911 304246 229129 -92768 -72175 23778 233324 -214372 305751
12865b81323D7923a8547j9619D380g1147B06239B0519a65523A28653a23617m7805
$$ -281323 47923 -18547 -38166 4380 -71147 206239 20519 -165523 128653 -123617 -171422
12854a71422j63708A07708Q5952K26856b5686a048C40375d8188A12771Q3982D9567
$$ -171422 -335130 107708 193660 420516 -25686 -1048 340375 -48188 112771 196753 49567
12842b93000f4843B41133m5532E2851d2079A90241n5284k5465f1931G3519K3470
$$ -293000 -64843 241133 195601 52851 -42079 190241 134957 109492 -61931 73519 96989
12831I6989a15966D22674H0212J8476J0760g3140H2094N3629n6288B207r0a26227
$$ 96989 -115966 422674 80212 98688 109448 -73140 82094 135723 79435 2207 2117 -126227
12818g2232D0512Q4527i2444N742B21676r1606c89438B0154r26e6325I9110J94499
$$ -72232 40512 125039 -92444 -86702 221676 130070 -389438 20154 19228 -56325 99110 293609
12806B93609b39739c5015B8957a72595e4520k7657A1643J81956l6366b6778A0156
$$ 293609 -239739 -35015 28957 -172595 -54520 -82177 11643 193599 157233 -26778 10156
12794b57632g6069j5519k52611E5339a40318k0890O3386A44363M1340n8739a71215
$$ -257632 -76069 -91588 -344199 55339 -140318 -161208 -97822 144363 185703 126964 -171215
12782C86625c8573J4511m4856k01212a01367B77248j05818a21571M9197r5979
$$ 386625 -38573 -24062 -68918 -270130 -101367 277248 171430 -121571 -72374 -168353
12772a68353A0093a05041M5432K5995D54763A07880l9812B6088K57021a09211
$$ -168353 10093 -105041 -59609 -33614 454763 107880 68068 26088 283109 -109211
12761d5339A15712R6270n1113b46825c8304H9344i4362b8041I3178B711J2327
$$ -45339 115712 211982 160869 -246825 -38304 89344 -94362 -28041 93178 2711 15038
12750A5038R4939k0866J93329f3950B10913J1212A02770J25720D8016c16174c7699
$$ 15038 109977 89111 282440 -63950 210913 222125 102770 228490 48016 -316174 -37699
12738a01567d2165I5910K5999L611l8625i1481A43559F333d110A7781P4860R1569
$$ -101567 -42165 95910 121909 125520 86895 -91481 143559 6333 -4110 17781 92641 184210
12726A84210g1275H3046j2520B6865a12842B30476m2502c77H3953J3668k9531
$$ 184210 -71275 83046 70526 26865 -112842 230476 187974 -377 83953 97621 68090
12715F8090K5515J38850D3680L4162c0832A79880f2814m4635A46002J57690b7309
$$ 68090 93605 232455 43680 77842 -30832 179880 -62814 -107449 146002 303692 -27309
12703a57807E7405R2706o6685A3719N6774k4375J67025j02567J87994E6053j0655
$$ -157807 57405 150111 83426 13719 70493 46118 213143 110576 298570 56053 45398
12692D5398A4331a38016r506B22533a24267B2165J09842c8193I3002a68108A63283
$$ 45398 14331 -138016 -147522 222533 -124267 22165 132007 -38193 93002 -168108 163283
12680b95525h8074B87003L6942a85138B30456J37485j25443J9621k105e2389A85521
$$ -295525 -88074 287003 323945 -185138 230456 367941 242498 262119 260014 -52389 185521
12668a63615B14568j7831L50113k15363j49322L3471a51674C37165A65607R0137
$$ -163615 214568 196737 546850 331487 182165 215636 -151674 337165 165607 255744
12658B55744A26909N2884K07917C5802J34210G0877P0848m8075a82497A91673
$$ 255744 126909 179793 387710 35802 170012 70877 141725 93650 -182497 191673
12647C24604A35378c52064I2271l8353H645J48564M641E9364J14781m8894K20999
$$ 324604 135378 -352064 92271 53918 8645 157209 161850 59364 174145 125251 346250
12636C46250E4155A3415J30492L1086A5500e3134A84838P1170g9417E4293R8952
$$ 346250 54155 13415 143907 174993 15500 -53134 184838 256008 -79417 54293 153245
12625A53245K92342r3890R0773j93451K11421j96551k2674Q9392H3228K04653
$$ 153245 445587 351697 442470 249019 460440 263889 241215 330607 83228 287881
12615B87881a30143A65234b4344H4512a7569L763j21988H0083a53189A87423b71022
$$ 287881 -130143 165234 -24344 84512 -17569 -13806 -135794 80083 -153189 187423 -271022
12603C7044O1487A7782K58211B3750J62788a72121M3571A83912n1651R0425a05101
$$ 37044 98531 17782 275993 23750 186538 -172121 -128550 183912 132261 222686 -105101
12591b14851C34372A35948F5931L37112a34697A54788D9068a9653B67703q0588
$$ -214851 334372 135948 65931 403043 -134697 154788 49068 -19653 267703 187115
12581A87115c12557D6913a71379A26763c63819C63636a121B24299A05404a99823
$$ 187115 -312557 46913 -171379 126763 -363819 363636 -1121 224299 105404 -199823
12570c1647j40566k7230C09a69386G4021f0071F3666h7859K2766B54539D7626
$$ -31647 -172213 -199443 309 -169386 74021 -60071 63666 -87859 -65093 254539 47626
12558d5699A5005K28889e0088C10894j16612r0895c72209J79347k13077f1367
$$ -45699 15005 243894 -50088 310894 194282 103387 -372209 -192862 -405939 -61367
12547a8631p0664L5570A22505e8556E17223E8183a68833B3890K66764C9521N4880
$$ -18631 -89295 -53725 122505 -58556 517223 58183 -168833 23890 290654 39521 94401
12536I4401c0739J0309A95675L6382b7672A54876b02008i4474p1721f8003B51066
$$ 94401 -30739 -20430 195675 232057 -27672 154876 -202008 -94474 -166195 -68003 251066
12524B94881f7763C2178K59307a43983J8408q1953C0128A650N86364H8439J99701
$$ 294881 -67763 32178 291485 -143983 -125575 -207528 30128 1650 588014 88439 288140
12513B88140M3186D3699J69217l1004a16239A75894G2853C0059f6009H8097K51866
$$ 288140 331326 43699 212916 181912 -116239 175894 72853 30059 -66009 88097 339963
12502C39963c2773o4791p6849l8470A51593f9734l8054j3709I1566a65796a9410
$$ 339963 -32773 -97564 -174413 -212883 151593 -69734 -107788 -121497 91566 -165796 -19410
12490a02553r1760g8382J059p0595E9944J21176C3079K12749F3178L2445J91820
$$ -102553 -194313 -78382 -77323 -147918 59944 181120 33079 245828 63178 95623 287443
12479B87443l1870a46506e9927C35961P9947a347l4676j116I97b03560C47710
$$ 287443 255573 -146506 -59927 335961 415908 -1347 -36023 -37139 997 -203560 347710
12467a99334A78375l8783i3465d1990B6119b24351A56760J4502H4384a25970r6812
$$ -199334 178375 139592 -93465 -41990 26119 -224351 156760 171262 84384 -125970 -222782
12456b22782h471G6557a25873o2054b3497A49389J44682A28567l4770J26016e33047
$$ -222782 -8471 76557 -125873 -187927 -23497 149389 294071 128567 93797 219813 -533047
12444h5538B1142P7253e285E1031R6082A9882L56118B9410c32056H4007j434c02825
$$ -85538 21142 98395 -5285 51031 147113 19882 376000 29410 -332056 84007 82573 -302825
12431C67549G4947K2249E641c37056d3538A98064a46460j45225f6504A28260n8511
$$ 367549 74947 97196 5641 -337056 -43538 198064 -146460 -291685 -66504 128260 69749
12420F9749a77573n4448c9817j1692A39R5508a5862A85379n8231i4271k51927
$$ 69749 -177573 -232021 -39817 -51509 139 95647 -15862 185379 127148 -94271 -346198
12409c46198k9867i5699M7063B7399L4100d7246k61727J12008A88549f701A9600
$$ -346198 -376065 -95699 -48636 27399 61499 -47246 -308973 -196965 188549 -6701 19600
12397A69904b7601G4235l3883b56874k82402b44982A11438l0297B1163a09350
$$ 169904 -27601 74235 40352 -256874 -539276 -244982 111438 81141 21163 -109350
12386A34230m9404J8470N4780p5425K5590a28711A89103F0780a59158B96441A15394
$$ 134230 84826 103296 158076 82651 108241 -128711 189103 60780 -159158 296441 115394
12374a76917H2808e7221A26279j7696b53827A87110b51641A35653a8797A10405
$$ -176917 82808 -57221 126279 108583 -253827 187110 -251641 135653 -18797 110405
12363g2223j11505C75677a22742c8790A259K1085h1803D5351B1577a3298o0664
$$ -72223 -183728 375677 -122742 -38790 1259 22344 -81803 45351 21577 -13298 -73962
12352g3962C7038J5519h6955d650A44186a11812M1607A26412d21911B1462a8103
$$ -73962 37038 52557 -86955 -4650 144186 -111812 -70205 126412 -421911 21462 -18103
12340a32023d1064j39936d8422B06157m4790N609B0516K64327A29488O4342c0336
$$ -132023 -41064 -181000 -48422 206157 161367 166976 20516 284843 129488 193830 -30336
12328A65684F5933a22410N9455j50195A46577J55959c9434k8210H7417a60802
$$ 165684 65933 -122410 -62955 -213150 146577 302536 -39434 -67644 87417 -160802
12317A05392a75406A66506a81210a8312a875F7372A3998h3909C8938J13571b8688
$$ 105392 -175406 166506 -181210 -18312 -1875 67372 13998 -83909 38938 152509 -28688
12305b95805b2784k99056A7982a40539a1810E4745K94195c12418A63234k3112
$$ -295805 -22784 -321840 17982 -140539 -11810 54745 348940 -312418 163234 140122
12295A40122n3704k2278a49414C37720j01381G9959f8590B32601e2669A25425
$$ 140122 86418 64140 -149414 337720 236339 79959 -68590 232601 -52669 125425
12284D04283I3370M9240b11471B07612j0840b40283A46109k5051K88320C187K90432
$$ 404283 93370 142610 -211471 207612 196772 -240283 146109 121058 409378 3187 293619
12273B93619p1222I3571J70905o5320b03020a2099A7205M6031J61476j05980l1979
$$ 293619 222397 93571 264476 199156 -203020 -12099 17205 63236 224712 118732 86753
12262H6753l4146d9019D3826f4555j88264D908Q9510g8072J2009a4173j86002
$$ 86753 52607 -49019 43826 -64555 -252819 4908 94418 -78072 -66063 -14173 -200175
12251b00175G1615g942H4536Q9089e2008B30630j11019K22039n1096n1928b87526
$$ -200175 71615 -7942 84536 173625 -52008 230630 119611 341650 290554 238626 -287526
12239A55621N327O6702A4755J24847L457M9988G0106L233a12886G9004J43585
$$ 155621 160948 227650 14755 139602 143059 193047 70106 73339 -112886 79004 222589
12228B22589h9889C24673J38578A4139J69870K89404A31088L37630j96718q6820
$$ 222589 -89889 324673 463251 14139 184009 473413 131088 468718 272000 185180
12218A85180A5065K74987A03495a05954D07867D8480Q305f5399k44090B48483
$$ 185180 15065 290052 103495 -105954 407867 48480 56785 -65399 -309489 248483
12207A19062B020K85270D9997J46942J10981M1958e9694E46197m2981p4091a9382
$$ 119062 2020 287290 49997 196939 307920 349878 -59694 546197 503216 429125 -19382
12195B32473J57356A42738N8568J39924J70266B46441H4195J06850L3110A11401
$$ 232473 389829 142738 201306 341230 511496 246441 84195 191045 224155 111401
12184A34752E2237M23775D957J66543a38507A63036m2198K52719A1058a7849C04426
$$ 134752 52237 476012 4957 171500 -138507 163036 120838 373557 11058 -17849 304426
12172A9147f6060q4459B81532q1816O91N7165m3295J08711b15763A07961f8465
$$ 19147 -66060 -150519 281532 199716 200407 257572 214277 322988 -215763 107961 -68465
12160c9915B51827q3972a71443B66315G4855C4626c52477J74757A15829a00177
$$ -39915 251827 167855 -171443 266315 74855 34626 -352477 -177720 115829 -100177
12149A38092C0729K25012A08011j0401D4154P3827f5978B0807K9750L72669f7929
$$ 138092 30729 255741 108011 97610 44154 117981 -65978 20807 50557 423226 -67929
12137A47442b46204b1765k99528B8621a18748A00983J2067a01591A01272P0867
$$ 147442 -246204 -21765 -321293 28621 -118748 100983 113050 -101591 101272 172139
12127A72139M5957C811R3166K62807l1268b87550b6733E4103a02293C16043F2832
$$ 172139 218096 3811 96977 359784 328516 -287550 -26733 54103 -102293 316043 62832
12115B66908A22420g6284C21739b21283A40445J81528j53425B0138E099M6746
$$ 266908 122420 -76284 321739 -221283 140445 321973 168548 20138 5099 51845
12105E1845c22992G7181b36762B83683G8367N4937b98074c5948k09742n7147a02880
$$ 51845 -322992 77181 -236762 283683 78367 133304 -298074 -35948 -245690 -302837 -102880
12093E5356B6092b1844C1057a19388N4142A44907b60272D4034a38946b2930l3729
$$ 55356 26092 -21844 31057 -119388 -65246 144907 -260272 44034 -138946 -22930 -56659
12082e6659A77885D1746J29536J03725j04841F3586L43108b42852g9103c4384
$$ -56659 177885 41746 171282 275007 170166 63586 406694 -242852 -79103 -34384
12071C9485J38571p8234L7573a11919r6292A68773a62811A32786i0987o7687O6307
$$ 39485 178056 99822 137395 -111919 -208211 168773 -162811 132786 -90987 -158674 -92367
12060i2367c2493o5342A47222P7035J60198J421922F85093j72830A72382P3173
$$ -92367 -32493 -97835 147222 224257 384455 1806377 685093 512263 172382 245555
12050B45555d4984k28420K531A98219e9146m7575d2363g53j0519A02187B0130
$$ 245555 -44984 -273404 -270873 198219 -59146 -106721 -42363 -753 -11272 102187 20130
12038G3713a18323K910j56164J21602N4108A8556d2620o9047B88376a5526o9969
$$ 73713 -118323 -115413 -271577 -149975 -95867 18556 -42620 -111667 288376 -15526 -85495
12027h5495p2595P1636B21987A07079h8042J4387F9449k0791J51047h4848A59586
$$ -85495 -158090 -86454 221987 107079 -88042 -73655 69449 48658 199705 -84848 159586
12015a44140D08108j15586e3530B77582B0718M1881a40208B07445B3249c60916
$$ -144140 408108 292522 -53530 277582 20718 62599 -140208 207445 23249 -360916
12004b3999D54585B9697J46216g7366C8628a584C7661K11265j21586a85217B46122
$$ -23999 454585 29697 175913 -77366 38628 -1584 37661 248926 127340 -185217 246122
11992a02756C40898I863h5438A88590D5923L0261A4225J84195d8223j51834f6389
$$ -102756 340898 9863 -85438 188590 45923 76184 14225 198420 -48223 -200057 -66389
11980b24374d9067J1767F965a48525j13278G3103J73832E3975l452i2731A21393
$$ -224374 -49067 -37300 6965 -148525 -261803 73103 246935 53975 50523 -92731 121393
11968A4871b8143j80151B8701c08730a47579d4400A02463h4649K2880k1237A9200
$$ 14871 -28143 -208294 28701 -308730 -147579 -44400 102463 -84649 -61769 -83006 19200
11956i809A3916c42488a32972L1092A58058c0953k27739A65191B194b04696C6653
$$ -9809 13916 -342488 -132972 -101880 158058 -30953 -258692 165191 2194 -204696 36653
11944I2778m800J6192C8287R4080b12531A94384D4210a86165f042m6288k98575
$$ 92778 87978 104170 38287 132367 -212531 194384 44210 -186165 -6042 -52330 -350905
11933c50905a57872f5830B3303J83257b09114K1223e9778m3803A63297f096o1292
$$ -350905 -157872 -65830 23303 206560 -209114 -187891 -59778 -103581 163297 -6096 -67388
11922f7388l2993A04163J46345Q9869a80016h6997A58136h2520F1680K03750F2758
$$ -67388 -100381 104163 250508 340377 -180016 -86997 158136 -82520 61680 265430 62758
11910A05861E1579a04907p8810j23553e744o2094C0415R5848a04203G6263C4732
$$ 105861 51579 -104907 -183717 -307270 -5744 -67838 30415 126263 -104203 76263 34732
11898a70904A05318l144L9239c69547a55431d5161l9783a1514j48527f7609j59510
$$ -170904 105318 102174 141413 -369547 -155431 -45161 -84944 -11514 -160041 -67609 -227119
11887b27119O9430A84383b02158m4201A0679P4312J1404h6261B32406b09828D531
$$ -227119 -157689 184383 -202158 -246359 10679 84991 96395 -86261 232406 -209828 4531
11875C1339a35530C34206e9215k4050A21328J4690f8516j73433G3395a58820E6097
$$ 31339 -135530 334206 -59215 -83265 121328 136018 -68516 -241949 73395 -158820 56097
11863G753a03505p0706f3981k84817A36459a19273F9027J7067l194b89993a08317
$$ 7753 -103505 -174211 -63981 -348798 136459 -119273 69027 86094 82900 -289993 -108317
11851A77292F7552K10801A8450J25788m7905b80914A62951d10329K03236A34765
$$ 177292 67552 278353 18450 144238 96333 -280914 162951 -410329 -207093 134765
11840B442c1434j96476j28742L5431D5708b9453E4711h2858A54297a56888a5230
$$ 2442 -31434 -227910 -356652 -321221 45708 -29453 54711 -82858 154297 -156888 -15230
11828a30776k78646a6519O654j16617j71943D6716b239j50000P5284j29778b1375
$$ -130776 -409422 -16519 -9865 -126482 -298425 46716 -2239 -152239 -76955 -206733 -21375
11816c2657e852k64394a33303e7503k8298C09052g0954r8533B94943R5437c16258
$$ -32657 -5852 -270246 -133303 -57503 -85801 309052 -70954 -169487 294943 390380 -316258
11804b07926e8163B1322c27042L2085E733b99638f1002j97653g8277C5125c5324
$$ -207926 -58163 21322 -327042 -294957 5733 -299638 -61002 -258655 -78277 35125 -35324
11792A51555c92772a34961A54161b60431A92236a2926A45914N2680c6937E07311
$$ 151555 -392772 -134961 154161 -260431 192236 -12926 145914 198594 -36937 507311
11781A85625F1497a54752H6310b77262A25421i8458C03609b6719j36588A2308
$$ 185625 61497 -154752 86310 -277262 125421 -98458 303609 -26719 -163307 12308
11770a20278A81285b88607d5971A2702b56507D5128a11876F5784k2987a77364
$$ -120278 181285 -288607 -45971 12702 -256507 45128 -111876 65784 42797 -177364
11759A78785o666a58587m7742j64874e2834a6087k94615J11703A15618c1798A69355
$$ 178785 172119 -158587 -206329 -371203 -52834 -16087 -310702 -198999 115618 -31798 169355
11747I7299Q6060I1323q385E306K84342Q3190c83410A58472i3806B75323j19642
$$ 97299 183359 91323 82938 5306 289648 372838 -383410 158472 -93806 275323 155681
11736A55681f6321j84296I051c3223A75035i7222B30016d0366E460K12285b07842
$$ 155681 -66321 -250617 9051 -33223 175035 -97222 230016 -40366 5460 217745 -207842
11724B3612a24752K7523n8024k22070a80427d8838C06314C0383J46475G2459a52904
$$ 23612 -124752 -97229 -155253 -377323 -180427 -48838 306314 30383 176858 72459 -152904
11712f9412F2692M4883J66136b5052A17089J42669f4362j9886j69483J05976E8297
$$ -69412 62692 107575 273711 -25052 117089 259758 -64362 -84248 -253731 -147755 58297
11700h9745A29534b18346H7572P9164b8705A67343h3541I938J37748o4612Q6091
$$ -89745 129534 -218346 87572 166736 -28705 167343 -83541 9938 147686 83074 169165
11689A69165a60021B2009b17174D66998f3923A70309b89844D5013a53866B48599
$$ 169165 -160021 22009 -217174 466998 -63923 170309 -289844 45013 -153866 248599
11678A87729a25156D1101b57226K5591i8223A81572L5478a55481f1456p7608e3622
$$ 187729 -125156 41101 -257226 -231635 -98223 181572 217050 -155481 -61456 -139064 -53622
11666a85956A2350K24900j5804I0654J92486c9625k02612E4032R2989b8347j15676
$$ -185956 12350 237250 221446 90654 283140 -39625 -242237 54032 147021 -28347 -144023
11655a44023B91059D5994a00004I5662J7101i2150H8924D2176J31525e8165k2040
$$ -144023 291059 45994 -100004 95662 112763 -92150 88924 42176 173701 -58165 -80205
11644h0205K7922A71750L0534a4124A69662b56638n0396A44596b27533h020I4468
$$ -80205 -52283 171750 202284 -14124 169662 -256638 -307034 144596 -227533 -8020 94468
11632a13333A03333a81361d5660k49178C98254b6162A95253q0485g0913C0541
$$ -113333 103333 -181361 -45660 -294838 398254 -26162 195253 114768 -70913 30541
11621A29668A8116J64591c5239r8354m7330e8219A3494m614b4263a033k90901
$$ 129668 18116 182707 -35239 -133593 -180923 -58219 13494 8880 -24263 -1033 -291934
11610b91934A10080J7888k6690i6696C4289a2173C3950a81791c2858o7277A1083
$$ -291934 110080 127968 101278 -96696 34289 -12173 33950 -181791 -32858 -100135 11083
11598C00291A48996g0832A57850J41208L4659d6656F0950K0014a27007h214F5249
$$ 300291 148996 -70832 157850 299058 333717 -46656 60950 80964 -127007 -8214 65249
11586A27762b02770A09589J33022a3956A93674i3686m4859A33211a43590C46728
$$ 127762 -202770 109589 242611 -13956 193674 -93686 -138545 133211 -143590 346728
11575B15988B3010a11162C37440j45857a19133d4885O054l3444j33610d0551B387
$$ 215988 23010 -111162 337440 191583 -119133 -44885 -38831 -72275 -205885 -40551 2387
11563a61033J6689A84492n5608K53359G6502h7858B20960B8939J71254a89814
$$ -161033 -144344 184492 128884 382243 76502 -87858 220960 28939 200193 -189814
11552a04223r4467i6350I4145a16838q0343A11952a51433B02898r4056j8109J15346
$$ -104223 -198690 -96350 94145 -116838 -197181 111952 -151433 202898 108842 90733 206079
11541B06079p1980b30665G5494J54528a89501H117M0846I037L96691a5980A43163
$$ 206079 134099 -230665 75494 230022 -189501 8117 48963 9037 405728 -15980 143163
11529B47907a29677H9330R1455c62287f0742B15370e3438A82075O9124i3956m6391
$$ 247907 -129677 89330 180785 -362287 -60742 215370 -53438 182075 251199 -93956 -140347
11518a40347B23267d4837B48609a00463B94695G0595a30777A67097p6512h0095
$$ -140347 223267 -44837 248609 -100463 294695 70595 -130777 167097 90585 -80095
11507a235B42364q310d11420A85727E0581J51514I1613Q0469a1874A89292M0782
$$ -1235 242364 234054 -411420 185727 50581 202095 91613 172082 -11874 189292 230074
11496B30074o191l6109R8912D1858J47432j8151C8746M2801J8636K17938A40771
$$ 230074 223883 187774 286686 41858 189290 171139 38746 81547 100183 318121 140771
11484C42250H6732J60059m8022a03356C41576g1000B2469a56535D13371G3489
$$ 342250 86732 246791 198769 -103356 341576 -71000 22469 -156535 413371 73489
11473C18903o2227A25057K28448A17721K2569J93864q2408G1389J85617m2016
$$ 318903 256676 125057 353505 117721 140290 334154 251746 71389 257006 214990
11463B14990L8389K64248B0461J88581C8023K02059e6050G9887C5179i5539B24207
$$ 214990 253379 517627 20461 209042 38023 240082 -56050 79887 35179 -95539 224207
11451B48507b7869j97662e5075q8998c9511C00797f4133B06424a53674b4388F6680
$$ 248507 -27869 -225531 -55075 -144073 -39511 300797 -64133 206424 -153674 -24388 66680
11439a49311B58902i327B61980B5494J4515a33845L6333A09295L6251r689m2821
$$ -149311 258902 -9327 261980 25494 40009 -133845 -97512 109295 145546 135857 93036
11428I3036C9163a78765G8616R6236F8277c951D13236A79926b075k65877K8820
$$ 93036 39163 -178765 78616 174852 68277 -3951 413236 179926 -2075 -267952 -239132
11417b39132A11417b05629a00197n0235A39762n7405b94273i396q1897B85929
$$ -239132 111417 -205629 -100197 -150432 139762 82357 -294273 -9396 -91293 285929
11406C42913B0177Q4569e929j44006q4958A54480h5071M2526A13610J85884D0315
$$ 342913 20177 104746 -5929 -149935 -234893 154480 -85071 -42545 113610 299494 40315
11394A2707J05856K30863g4944A10481O2745a3580I8736P9911a31131I1609b92883
$$ 12707 118563 349426 -74944 110481 173226 -13580 98736 178647 -131131 91609 -292883
11382A62578o5369h574A85454d404k27581D6440O1266b07487M0124g2481A70595
$$ 162578 97209 -8574 185454 -4404 -231985 46440 107706 -207487 -167363 -72481 170595
11370F0804J6529i8475r0741b7A03409h1675n0061F6567L0094f1263o471E8990
$$ 60804 77333 -98475 -189216 -27 103409 -81675 -131736 66567 96661 -61263 -67734 58990
11357H1132J21617d21480a681k41416B8671Q2375a65923O0077b8171C9844P3545
$$ 81132 202749 -421480 -1681 -243097 28671 111046 -165923 -105846 -28171 39844 113389
11346A13389a38304B62329B2598B103a0833l464j64354J1504p0936c4754A52269
$$ 113389 -138304 262329 22598 2103 -10833 -14297 -178651 -167147 -238083 -34754 152269
11334b653k54018A88283G6711K7283C0097J58812N787a79513A53380L4928Gg2423
$$ -2653 -256671 188283 76711 103994 30097 188909 194696 -179513 153380 188308 7 -72423
11321e148B22401G5962b60351D98623a24489j75339a36301A16212F611i4701B73998
$$ -5148 222401 75962 -260351 498623 -124489 -299828 -136301 116212 6611 -94701 273998
11309A71132c4623E32445h6694k6136B2276K5515c65712G1612l4256d79290B8708
$$ 171132 -34623 532445 -86694 -112830 22276 47791 -365712 71612 37356 -479290 28708
11297B40592A3443a18195l2055A14905c08309b8431j14468n5136a9598r6106e1115
$$ 240592 13443 -118195 -150250 114905 -308309 -28431 -142899 -198035 -19598 -115704 -51115
11285b04674h5671j35638F0086g8943b9613k83104e0166b2840j81564e4853o9456
$$ -204674 -85671 -221309 60086 -78943 -29613 -312717 -50166 -22840 -204404 -54853 -124309
11274a24309L1832j17255b4350C86680b15535a5963k62559C6888b23893j3774
$$ -124309 -92477 -209732 -24350 386680 -215535 -15963 -278522 36888 -223893 -237667
11264b37667O8428P3677K5641j57317B59797d0808D981c83476f0163B22697j00889
$$ -237667 -169239 -95562 -69921 -227238 259797 -40808 4981 -383476 -60163 222697 121808
11253A21808K24991j57283d2035C21696j12377G3432O2758b10691f0756p5758
$$ 121808 346799 189516 -42035 321696 209319 73432 136190 -210691 -60756 -136514
11243a36514k41025a00205O141j5892j31804D4919k0234B284b04591n22N4729
$$ -136514 -377539 -100205 -94064 -109956 -241760 44919 24685 2284 -204591 -205113 -150384
11232a50384A97809b66383A2471J67473a75690f9388l7381p3870f7807c3647j28113
$$ -150384 197809 -266383 12471 179944 -175690 -69388 -106769 -180639 -67807 -33647 -161760
11221a61760r302P082N8892A99983G7626R4925a87986A72792C3189J1257b45974
$$ -161760 -171062 -163980 -105088 199983 77626 172551 -187986 172792 33189 44446 -245974
11209b99518B2392g0237j14855B03631k7589B9707a26375r8421A61196a95510
$$ -299518 22392 -70237 -185092 203631 176042 29707 -126375 -224796 161196 -195510
11198a30103j67038A29663b57713C64780a99118Q3537o1632H2445a11856a2954
$$ -130103 -297141 129663 -257713 364780 -199118 -115581 -177213 82445 -111856 -12954
11187b87549a41431A6792h7578c6591k87633l2962a08715B99444f805A40451M4449
$$ -287549 -141431 16792 -87578 -36591 -324224 -357186 -108715 299444 -6805 140451 184900
11176A84900i0725r5953n3551p4302G5917k648b56323j0766I2555a66356e8561
$$ 184900 -90725 -186678 -240229 -314531 75917 73269 -256323 -267089 92555 -166356 -58561
11164d504C23048h9066B2540a02620a7968H0474K7662Q445E894a82057F0773b42693
$$ -4504 323048 -89066 22540 -102620 -17968 80474 108136 116581 5894 -182057 60773 -242693
11151a11239C03521b5925E0894a65536K2920E0866R9552d8082C53513A59614O8164
$$ -111239 303521 -25925 50894 -165536 -142616 50866 150418 -48082 353513 159614 227778
11140B27778f2388A45693K56183e6611j05026A17051N1052Q561K01505A04837
$$ 227778 -62388 145693 401876 -56611 -161637 117051 168103 176664 378169 104837
11129A9737J2995M0453L0771R7405A6R7060D7887i2432j4461J8158B86864A32320
$$ 19737 32732 73185 103956 201361 16 97076 47887 -92432 -106893 -88735 286864 132320
11116g9904n6671D17585d2096F3025O622j4199b0526C618J90970J18496J3115
$$ -79904 -136575 417585 -42096 63025 69647 55448 -20526 3618 194588 313084 326199
11105C26199G5052M773L80552A66067K51292q9474A00336P3539e6057D40726B17178
$$ 326199 75052 79825 460377 166067 417359 327885 100336 173875 -56057 440726 217178
11093D26475j96685n2215O7450K48240B4552N31042A00914R8714k5438M6448M6155
$$ 426475 229790 177575 245025 493265 24552 555594 100914 199628 174190 220638 266793
11082B66793J404p4485r0422J73574O5131K26392o0414L58043B95620L09609j87438
$$ 266793 268197 193712 103290 276864 341995 568387 507973 866016 295620 605229 417791
11071D17791A66155L18519O9898j96821l8757J35265j06567K60901A57799J05111
$$ 417791 166155 484674 554572 357751 318994 454259 347692 608593 157799 262910
11061B62910K47547J81018k38646J52290K09385q151o8385n9153K28111N9861
$$ 262910 510457 691475 452829 605119 814504 806353 737968 678815 906926 966787
11051I66787r0585r0812j50294M27210m28103J61379K64653N2185k38967r5520
$$ 966787 876202 785390 635096 1062306 634203 795582 1060235 1112420 873453 777933
11041G77933L25971R5431n0014m51456K84795J97621m26795M4461N29085F51100
$$ 777933 1103904 1199335 1149321 697865 982660 1180281 753486 797947 1327032 651100
11030G38345J73803J25156r5050j74231J86755j16737J48205J51018E50693J40832
$$ 738345 912148 1037304 942254 768023 954778 838041 986246 1137264 550693 691525
11020F91525K19903r4453j28511R2692J44367J47204l69595L18417k39049K04064
$$ 691525 911428 816975 688464 781156 925523 1072727 703132 1021549 782500 986564
11010I86564j53546k07177K97438j32328O7300O6733k79076M0050j01596L08341
$$ 986564 833018 625841 923279 790951 858251 924984 645908 685958 584362 892703
11000H92703m8725J0392J74407r2122J71650k73025n9673K83680p9594n9851J60112
$$ 892703 843978 854370 1028777 936655 1108305 835280 775607 1059287 979693 919842 1079954
10989A079954J22174j93818k26298K86649j03327J56727J298L45685n0199K55343
$$ 1079954 1202128 1008310 782012 1068661 965334 1122061 1123359 1469044 1418845 1674188
10979A674188K67772J72716J4309R8898K14971N87849J53871N65062K78931o6525
$$ 1674188 1941960 2114676 2128985 2227883 2442854 3030703 3184574 3749636 4028567 3962042
10969C962042j8175m2682m80048l37044l70754k98114m02254n33569K32604L7341
$$ 3962042 3943867 3901185 3421137 3084093 2713339 2415225 2012971 1479402 1712006 1749347
10959A749347P9982l65282j43211l1007J32876M8752m10823k715k70568j53222
$$ 1749347 1829329 1464047 1320836 1289829 1422705 1471457 1060634 1057919 787351 634129
10949F34129j8141j61528k5364j08117A37902J55189j0514c0794B07515A00314
$$ 634129 615988 454460 429096 320979 137902 293091 282577 -30794 207515 100314
10938a40503F4453a65145A34531L1960C8807d5786A81650i3342c0720a3058B32034
$$ -140503 64453 -165145 134531 166491 38807 -45786 181650 -93342 -30720 -13058 232034
10926b30383B391c62678a22082A87273J53931r1737D0101N7040b66363A1621a62532
$$ -230383 2391 -362678 -122082 187273 341204 249467 40101 97141 -266363 11621 -162532
10914A5185K84763a47156e778A35286l4264d4426k11690L5187F6280J32785J6629
$$ 15185 299948 -147156 -5778 135286 101022 -44426 -256116 -220929 66280 199065 215694
10903B15694a84580A02170a13015k85945P0040J45569A00209l5144f427G581a22261
$$ 215694 -184580 102170 -113015 -398960 -328920 -183351 100209 65065 -6427 7581 -122261
10891C4848J93183a54813e0385j17909g5618B21211G0393i2259F549a9947q5238
$$ 34848 228031 -154813 -50385 -168294 -75618 221211 70393 -92259 6549 -19947 -105185
10880a05185A17332M5208c2204A24729F526J4307j0196a6801j69527D2670f9088
$$ -105185 117332 162540 -32204 124729 6526 20833 10637 -16801 -186328 42670 -69088
10868H1557K11553b94999i6345A58292N620R0174J80634H7878b6973A79615H3953
$$ 81557 293110 -294999 -96345 158292 163912 254086 434720 87878 -26973 179615 83953
10856c44463R0260b6471j3108A71544q4185M3140b7069l38926C9075e1067o5580
$$ -344463 -254203 -26471 -39579 171544 87359 130499 -27069 -365995 39075 -51067 -116647
10845a16647p5257H590K67080e0734j08659p8957P9677A35412a62651C9919c41945
$$ -116647 -191904 8590 275670 -50734 -159393 -238350 -158673 135412 -162651 39919 -341945
10833B35285B259N5391R5587C123b08630F667M7477b03027A74238i8096r8317
$$ 235285 2259 57650 153237 3123 -208630 6667 54144 -203027 174238 -98096 -196413
10822a96413R3540j9473A13832a8948n9676p4994A94590a86914C4170h6960K9310
$$ -196413 -102873 -122346 113832 -18948 -78624 -153618 194590 -186914 34170 -86960 -57650
10811e7650a3117I5571b15704i7900q1624c8923k19960Q7628C28443j40140f7192
$$ -57650 -13117 95571 -215704 -97900 -179524 -38923 -258883 -171255 328443 188303 -67192
10799c8197I2817a30902E736N3096L03860a67416O9190l53109G2150K2391e03398
$$ -38197 92817 -130902 5736 58832 362692 -167416 -98226 -451335 72150 94541 -503398
10787c3634B7076g9280D111J68684a55938C0920b02601B047J70744A5086J22852
$$ -33634 27076 -79280 4111 172795 -155938 30920 -202601 2047 172791 15086 137938
10776A37938M8502e5431D76749h9574j73679g0780I9195c0040N133j06727D7727
$$ 137938 186440 -55431 476749 -89574 -263253 -70780 99195 -30040 -24907 -131634 47727
10764D5790a01222l04596D5371j999a16467L1755j53788B19099p1875F9686c48021
$$ 45790 -101222 -405818 45371 43372 -116467 -84712 -238500 219099 147224 69686 -348021
10752a94285p7732B18324a79362H2648a28480G1751a10266M5910b6458p2293A5223
$$ -194285 -272017 218324 -179362 82648 -128480 71751 -110266 -64356 -26458 -98751 15223
10740C04820A02087m7569K21946a09431A87073k5312c66948I9378d2006q2773
$$ 304820 102087 54518 276464 -109431 187073 161761 -366948 99378 -42006 -124779
10730a24779l6189P0923o9648G4417h9652I4147l7419l108N3141a09123j78555
$$ -124779 -160968 -90045 -159693 74417 -89652 94147 56728 53620 106761 -109123 -287678
10719b87678A19456b10449f2866G1837C1400a42051D54917B00252I3202a69884
$$ -287678 119456 -210449 -62866 71837 31400 -142051 454917 200252 93202 -169884
10708i822n5277A60661m991a74060L1302N3437A13120f4149A06547a92442B1689
$$ -9822 -65099 160661 155670 -174060 -142758 -89321 113120 -64149 106547 -192442 21689
10696H4419c0777I355J33392a04813K6550F1825a07914j02404j69281J59251B20831
$$ 84419 -30777 9355 142747 -104813 -78263 61825 -107914 -210318 -379599 -220348 220831
10684a58337l8612i5072a1717E1718d02599A71128b6544n9995H4033a25789B89636
$$ -158337 -196949 -95072 -11717 51718 -402599 171128 -26544 -86539 84033 -125789 289636
10672C61668A18357b57929Q7617j12479q7310a84608E19J9693a26166A58779a45653
$$ 361668 118357 -257929 -170312 -282791 -370101 -184608 519 20212 -126166 158779 -145653
10660a46867O2231Q055L3517q4620c7033E6567a71770L4581o5890A275e7069j71786
$$ -146867 -84636 -76581 -43064 -127684 -37033 56567 -171770 -137189 -203079 1275 -57069 -228855
10648b28855E0931J9528g8948k0880D8500P8728b40524J05749L383j00000P9989
$$ -228855 50931 70459 -78948 -99828 48500 127228 -240524 -134775 -131392 -231392 -151403
10637a51403j794H8339m1002K0962b92366b508A8535g087F0478b06237I3611K6541
$$ -151403 -153197 88339 47337 68299 -292366 -2508 18535 -7087 60478 -206237 93611 120152
10625A20152C0562K5920a61230A05645a62408M9630j37380Q6787j05358J33335
$$ 120152 30562 56482 -161230 105645 -162408 -112778 -250158 -163371 -268729 -135394
10615a35394n7494M7443D7868b14407H4989J68626e2043n0172F4924c02196B3764
$$ -135394 -192888 -145445 47868 -214407 84989 253615 -52043 -102215 64924 -302196 23764
10603b13581p801I104a43454k2398j47264D0971J03786F3787e4685k00489B5225
$$ -213581 -221382 9104 -143454 -165852 -313116 40971 144757 63787 -54685 -255174 25225
10591a70957A09591B127O3212i4208k51145c5043A8247L0276M8667c2463i435
$$ -170957 109591 2127 65339 -94208 -345353 -35043 18247 48523 97190 -32463 -9435
10579C0907K46205i3609j18007A897a35551l0311e4356D0138c95060a8796j03884
$$ 30907 277112 -93609 -211616 1897 -135551 -165862 -54356 40138 -395060 -18796 -122680
10568a22680k9568G5950b17501o0792A27627N3366i549B62208C9953Q5052A2556
$$ -122680 -152248 75950 -217501 -278293 127627 180993 -9549 262208 39953 125005 12556
10556d4736j09215q2982B39877J9689f0599j3673H0895g5223Q76K9660A38079
$$ -44736 -153951 -236933 239877 259566 -60599 -74272 80895 -75223 -74347 -44687 138079
10544d32435G527c3588a147j89410E1642i217k35495C33674b87301b3899k20804
$$ -432435 7527 -33588 -1147 -190557 51642 -9217 -244712 333674 -287301 -23899 -244703
10533b44703B14467d37429i4554c7323J0542k36206B6892b78764d5785B06450
$$ -244703 214467 -437429 -94554 -37323 -26781 -262987 26892 -278764 -45785 206450
10522A18753i3355G8876b27216E6396e4346l28533C2758Q3864e4867E4448R6839
$$ 118753 -93355 78876 -227216 56396 -54346 -382879 32758 116622 -54867 54448 151287
10511A51287a19375M4863q4947j28700A70289K0709a39434A46414J52418a61209
$$ 151287 -119375 -74512 -159459 -288159 170289 190998 -139434 146414 298832 -161209
10500c9681a4033o9201A32571f9257j42069A50676B020L4188M82576C6069M1615
$$ -39681 -14033 -83234 132571 -69257 -211326 150676 2020 36208 518784 36069 77684
10489G7684k9187k445K69663C1375I912N4280J7565O6605P1497J30503l389K60608
$$ 77684 48497 46052 315715 31375 9912 64192 81757 148362 219859 350362 346973 607581
10477F07581A56129J19426D0319c0383C06410f0239j26634A4188J32720f2837
$$ 607581 156129 275555 40319 -30383 306410 -60239 -186873 14188 146908 -62837
10466C6240d763j91956a6732B67366A1788g5027m5721K109m329k8622I1996p455
$$ 36240 -4763 -196719 -16732 267366 11788 -75027 -120748 -118639 -122968 -151590 91996 84541
10454H4541b05808j85934A8252e8329k23998b9544B5269K67586b00606l1228N9173
$$ 84541 -205808 -391742 18252 -58329 -282327 -29544 25269 292855 -200606 -231834 -172661
10443a72661a7503A38416D8536g4705k71839K0883G3559C4501Q7681d08447a65702
$$ -172661 -17503 138416 48536 -74705 -346544 -325661 73559 34501 122182 -408447 -165702
10431a64010a7398A79187a7293D3460h0864j79030E0383b636o9362D23450b01668
$$ -164010 -17398 179187 -17293 43460 -80864 -259894 50383 -2636 -71998 423450 -201668
10419a56251j35643B60322b16726M5435C53309a65885A6946a42887f6497A44129
$$ -156251 -291894 260322 -216726 -171291 353309 -165885 16946 -142887 -66497 144129
10408G6031k6242P4569b02733C13436a50067e1019K4279A43718E7009J09658A756
$$ 76031 49789 124358 -202733 313436 -150067 -51019 -26740 143718 57009 166667 1756
10396a0349C099b33699B23746K17080j4943A79564K87532j62284L0844A65163
$$ -10349 3099 -233699 223746 440826 425883 179564 467096 304812 335656 165163
10385B17884L2984j3319c6733A28281j792K3861c2699D51977j98524N3619K56071
$$ 217884 250868 237549 -36733 128281 126489 150350 -32699 451977 253453 307072 563143
10374E63143k16605D9366L70788n983A64583p7330K83989l7527O8207K07980K6257
$$ 563143 346538 49366 420154 414171 164583 87253 371242 333715 401922 609902 636159
10363F36159q3499k41570o5656l2077K63474a57065C7224I056L64381J31706A51717
$$ 636159 552660 311090 245434 213357 476831 -157065 37224 9056 373437 505143 151717
10351B3721K55472O15759k24083l00610j11429J12875R5076K6300q4694l3222
$$ 23721 279193 894952 670869 370259 258830 371705 466781 493081 408387 375165
10341C75165J3859Q1583M1321B37670K16144A59560D2655J03018J78129G392c0725
$$ 375165 389024 470607 511928 237670 453814 159560 42655 145673 323802 7392 -30725
10329B29686a86650e6284C7582J94025o504o8727L49964l9042A25783J80967h4583
$$ 229686 -186650 -56284 37582 231607 225103 156376 506340 467298 125783 306750 -84583
10317A87337J02682a16454B73537c70301a01850A10987C0192L67051A05242c41166
$$ 187337 290019 -116454 273537 -370301 -101850 110987 30192 397243 105242 -341166
10306A96107i9165E0689N382B5977c80077a34673C97917E8980b27711k3802a21751
$$ 196107 -99165 50689 56071 25977 -380077 -134673 397917 58980 -227711 -251513 -121751
10294a21814A32446C6759J34690h1385b4254C6927L3818b1627o7165A5164a94205
$$ -121814 132446 36759 171449 -81385 -24254 36927 70745 -21627 -88792 15164 -194205
10282c38916d6798p4551e1406j13331N9624A43300h6519k2556A71278p2200a0848
$$ -338916 -46798 -121349 -51406 -164737 -105113 143300 -86519 -109075 171278 99078 -10848
10270b46160f5452a7844j17048E2636f0236F1522K62795c5142B15581c7258D64
$$ -246160 -65452 -17844 -134892 52636 -60236 61522 324317 -35142 215581 -37258 464
10258a75018A53201a64804B51826L57045A41180m5985D7062b40196e9812D09477
$$ -175018 153201 -164804 251826 608871 141180 95195 47062 -240196 -59812 409477
10247E6455J37608a79136A42007c87881a13952p6214A8965J42538J8528i1827
$$ 56455 194063 -179136 142007 -387881 -113952 -190166 18965 161503 180031 -91827
10236B86514a6614l43527E6980b6145k47694N5097h1813l47438A15641a33358
$$ 286514 -16614 -360141 56980 -26145 -273839 -218742 -81813 -429251 115641 -133358
10225D0568b11848r024e9993B33133g6587A32829E9341h0781B7415G661K22554
$$ 40568 -211848 -220872 -59993 233133 -76587 132829 59341 -80781 27415 7661 230215
10214B30215a98910H8132P846a62342g3561C4754a16535N7905B07945n4137M970
$$ 230215 -198910 88132 95978 -162342 -73561 34754 -116535 -58630 207945 153808 158778
10203A58778a95502q9777A83859B7277e47525A51491E3701L7013P6760a52349
$$ 158778 -195502 -285279 183859 27277 -547525 151491 53701 90714 167474 -152349
10192a8321B305J00373a02692a2082I507J23060F1891a24600B92002i9018q6129
$$ -18321 2305 102678 -102692 -12082 9507 132567 61891 -124600 292002 -99018 -185147
10181a85147Q6335A4349J90187m7034C8558b52054E9226b85742a39207D2733a3095
$$ -185147 -98812 14349 204536 157502 38558 -252054 59226 -285742 -139207 42733 -13095
10169c78795B3808h0861C18677b20056e9140A28385D9985J01500h2462F3461c18081
$$ -378795 23808 -80861 318677 -220056 -59140 128385 49985 151485 -82462 63461 -318081
10157b39352M3377H1565f9414p842l85628J2053B837N1345d1933k32565g7001
$$ -239352 -195975 81565 -69414 -77256 -462884 -450831 2837 54182 -41933 -274498 -77001
10145a66925k98521A93264J41771g5802k4390k88993f6877a5532j93968R7255
$$ -166925 -465446 193264 335035 -75802 -100192 -389185 -66877 -15532 -209500 -112245
10135a12245B6737a75879b4418n4193q2945e7735j18007M5896I6495a11044B84255
$$ -112245 26737 -175879 -24418 -78611 -161556 -57735 -175742 -129846 96495 -111044 284255
10123b3955L957C83108A04199J27558A13664d9316k25742H711a90381j61636A12394
$$ -23955 -19998 383108 104199 231757 113664 -49316 -275058 8711 -190381 -352017 112394
10111h154j94552d5882k18678R0715A08107f3894l3292A20136a09926N1498b3954
$$ -8154 -202706 -45882 -264560 -173845 108107 -63894 -97186 120136 -109926 -58428 -23954
10099G2798a34561A37676p102E0364J54809a62710f6940A46094j396a32931H2116
$$ 72798 -134561 137676 130574 50364 205173 -162710 -66940 146094 144698 -132931 82116
10087c11011J10044j63272h2515l3878r2294I892f578l17214A29545E6443a33075
$$ -311011 -200967 -364239 -82515 -116393 -208687 9892 -6578 -323792 129545 56443 -133075
10075c0887D8014b57225d9911j40675j78604J76705J2464B4969a10041A17969
$$ -30887 48014 -257225 -49911 -190586 -369190 -192485 -180021 24969 -110041 117969
10064A5631M6328P889a98652K2475C15856a32242B2167F855c94598A74943o2218
$$ 15631 61959 69848 -198652 -176177 315856 -132242 22167 6855 -394598 174943 112725
10053A12725d5863C39276A48811l0751A8136J85721A1609c7236j83740H8326C4807
$$ 112725 -45863 339276 148811 118060 18136 203857 11609 -37236 -220976 88326 34807
10041c06690B1392J5921N9692a97291l4579B70213e6611A38659e19557B23967
$$ -306690 21392 37313 97005 -197291 -231870 270213 -56611 138659 -519557 223967
10030f870j09000A68732J76698a74940k1252O086A11960B8013a51518A30986a33688
$$ -6870 -115870 168732 345430 -174940 -196192 -190106 111960 28013 -151518 130986 -133688
10018B34g1668r528j44194l7473f3657o8839F059L8244H775b72733c5537A95728
$$ 234 -71668 -81196 -225390 -262863 -63657 -132496 6059 44303 8775 -272733 -35537 195728
10005a51675J7519B58918a64914j07792a5522B6684e856n5324b0725j30099A70122
$$ -151675 -134156 258918 -164914 -272706 -15522 26684 -5856 -61180 -20725 -150824 170122
9993c2138g927j25146f2225n9794d7486E05000a29600j27171R7769l0655m2535
$$ -32138 -7927 -133073 -62225 -122019 -47486 505000 -129600 -256771 -159002 -189657 -232192
9982b32192j0841b7913R541j42445K0767C42588h4826A22846K1336a96767k23678
$$ -232192 -243033 -27913 -18372 -160817 -140050 342588 -84826 122846 144182 -196767 -420445
9971d20445a47754L6552m1967N8536B52289g5175G187d39670A32072g9287F4783
$$ -420445 -147754 -111202 -153169 -94633 252289 -75175 7187 -439670 132072 -79287 64783
9959a06641L0800A10108A0932c5413l2157f163j55343n0729l09774a52193j88219
$$ -106641 -75841 110108 10932 -35413 -67570 -6163 -161506 -212235 -522009 -152193 -340412
9948c40412J23269f501q5914q9546I0681d12232A71694b52528h5291C8866b2857
$$ -340412 -217143 -6501 -92415 -181961 90681 -412232 171694 -252528 -85291 38866 -22857
9936b1076A34830c68546f2660B3371i848j32621M1049j46350A96797d3389b110
$$ -21076 134830 -368546 -62660 23371 -9848 -142469 -101420 -247770 196797 -43389 -2110
9924f6814j12337l9627J03437q207A40944d1496r422A0670h2215c9086l52738
$$ -66814 -179151 -218778 -115341 -123548 140944 -41496 -50918 10670 -82215 -39086 -391824
9913c91824i5251k3357M6203a649k75832A97712c57787A11519b35696j8299H0533
$$ -391824 -95251 -118608 -72405 -1649 -277481 197712 -357787 111519 -235696 -253995 80533
9901a01941B8056M5158k9070K1138l1525b74086j83101R8969b8785j85587B22046
$$ -101941 28056 73214 44144 65282 33757 -274086 -457187 -358218 -28785 -214372 222046
9889A06249J69108b61081E1245b01602f8769k32245G8064J5780a549j92848M9007
$$ 106249 275357 -261081 51245 -201602 -68769 -301014 78064 93844 -1549 -194397 -145390
9878a45390J8109o3577N9718O61G5214b6367j17898k29530G0218F759i7910B9655
$$ -145390 -127281 -190858 -131140 -130479 75214 -26367 -144265 -373795 70218 6759 -97910 29655
9865I1209J3001a33678C4798J44694H5625O7881b06333A34046E2953c03326A19858
$$ 91209 104210 -133678 34798 179492 85625 153506 -206333 134046 52953 -303326 119858
9853I628b73041L3420G6024b83859A39892e3935m6291B77292a81566A22223b3546
$$ 9628 -273041 -239621 76024 -283859 139892 -53935 -100226 277292 -181566 122223 -23546
9841d6347k23746q2219A17809h7550B11981j5692a15595A03796j4086c3793j65745
$$ -46347 -270093 -352312 117809 -87550 211981 196289 -115595 103796 89710 -33793 -199538
9830a99538o5453F0921b7802j12614f6718J4075m881N931B21231a91173k6849
$$ -199538 -264991 60921 -27802 -140416 -66718 -52643 -57524 -51593 221231 -191173 -218022
9819b18022j78122D9919a31979b386l40301a52939B38880b12359D8574J55625
$$ -218022 -396144 49919 -131979 -2386 -342687 -152939 238880 -212359 48574 204199
9809B04199b55134d550q8456o296A94435a06497E0467e380j93015H2782a06056
$$ 204199 -255134 -4550 -93006 -99302 194435 -106497 50467 -5380 -198395 82782 -106056
9797A98307o8169N3913F6222c34781C7504a19282j00906M5930A7647b06394G9520
$$ 198307 130138 184051 66222 -334781 37504 -119282 -220188 -174258 17647 -206394 79520
9785b41569i3126r6065I6258b977B7977b07341P6736e9565k01159A83113b60575
$$ -241569 -93126 -189191 96258 -2977 27977 -207341 -130605 -59565 -260724 183113 -260575
9773C49112f3978a9505I3211a4538A7907a86707F3182f2756C26390f176A91758
$$ 349112 -63978 -19505 93211 -14538 17907 -186707 63182 -62756 326390 -6176 191758
9761a2059k50356F8808J24614g8139r37M354j0039D2116e824j33956j025M8355
$$ -12059 -262415 68808 193422 -78139 -79076 -74722 -84761 42116 -5824 -139780 -140805 -92450
9749i2450j6886D0097a8571A32295i2670A74629m124b30877n1965A00591K9055
$$ -92450 -109336 40097 -18571 132295 -92670 174629 170505 -230877 -282842 100591 129646
9738A29646a38292P656j18555B2555a28775F8140L1055e8472j37949c5332n1012
$$ 129646 -138292 -130636 -249191 22555 -128775 68140 99195 -58472 -196421 -35332 -86344
9727h6344k32230H1920b226k2487k39565i3880b3878k47925a22439r0878a8336
$$ -86344 -318574 81920 -2226 -24713 -264278 -93880 -23878 -271803 -122439 -213317 -18336
9715b6603A0824O6286c12228a15211o0406b7315C8069a82770J1838p9493A59057
$$ -26603 10824 77110 -312228 -115211 -175617 -27315 38069 -182770 -170932 -250425 159057
9703B2465a14467C9263K15953e3920D0913c14470i6107L5744A4329a44041B6869
$$ 22465 -114467 39263 255216 -53920 40913 -314470 -96107 -60363 14329 -144041 26869
9691A5976c13860C06713a17017b5250l24486A08331b9385q2856L2536l3817r1997
$$ 15976 -313860 306713 -117017 -25250 -349736 108331 -29385 -112241 -79705 -113522 -205519
9680b05519F6356B8397L38597F9789a65344O5942A13055f0700j07996A00387C1147
$$ -205519 66356 28397 366994 69789 -165344 -99402 113055 -60700 -168696 100387 31147
9668C8937K14248c95246J80134J6075j22226g1216j80035E2888o182b69673f8244
$$ 38937 253185 -395246 -215112 -199037 -321263 -71216 -251251 52888 46706 -269673 -68244
9656a23293m8105M4402j09796A16209A7469i1073E4427R3265G3545b50166A5672
$$ -123293 -171398 -126996 -236792 116209 17469 -91073 54427 147692 73545 -250166 15672
9644C83126a00655p7965C3383i4002C6928a9507H8182Q2353a14594e2038A8294
$$ 383126 -100655 -178620 33383 -94002 36928 -19507 88182 170535 -114594 -52038 18294
9632b74275J27413p5609A41703b7693e48q9576l05953h1485j32943A2990c4159
$$ -274275 -146862 -222471 141703 -27693 -548 -90124 -396077 -81485 -214428 12990 -34159
9620b63756a26474j0345D1985J6097A3021b37689B72927H4639a13008M5621A51962
$$ -263756 -126474 -136819 41985 58082 13021 -237689 272927 84639 -113008 -67387 151962
9608b38056A89679e9354B8103C901L6411c35l8284n8925L6257K5057A09384n4596
$$ -238056 189679 -59354 28103 3901 40312 -335 -38619 -97544 -61287 -36230 109384 54788
9596E4788M2366g3904A42437a09963A8595a16393j65803a38485l2193K8685C56811
$$ 54788 97154 -73904 142437 -109963 18595 -116393 -282196 -138485 -170678 -141993 356811
9584i8459k2482A22536n8206J40063h4717j33307a0772A28808b06468N9564L5464
$$ -98459 -120941 122536 64330 204393 -84717 -218024 -10772 128808 -206468 -146904 -111440
9573a11440A30131B998c64474a13514n5546l4177l03586C3862J9234a21057N3947
$$ -111440 130131 2998 -364474 -113514 -169060 -203237 -506823 33862 53096 -121057 -67110
9562f7110K2362C0519K29043b1506l2169F8989A2772L6448K8882O8284a37502
$$ -67110 -44748 30519 259562 -21506 -53675 68989 12772 49220 78102 146386 -137502
9550a7202C12595a58795K4033m1521k17781a40592k10950c017k81109A47900B928
$$ -17202 312595 -158795 -134762 -176283 -394064 -140592 -351542 -3017 -284126 147900 2928
9538b49495D4145a89811j7459J02954n4234A11666a23640B75092a32444d3570
$$ -249495 44145 -189811 -207270 -104316 -158550 111666 -123640 275092 -132444 -43570
9527e0821k08162E1084a01767d925r6355M4150j54333k58693b26137A54810a54380
$$ -50821 -258983 51084 -101767 -4925 -101280 -57130 -211463 -470156 -226137 154810 -154380
9515f9289j54780j2755M1169r723H7132l6009d7128j18780j14488B16241a88948
$$ -69289 -224069 -236824 -195655 -205378 87132 51123 -47128 -165908 -280396 216241 -188948
9503c49825B9933h2382o6630j61998d6895B57939f5050k6497G0923c06329g3670
$$ -349825 29933 -82382 -149012 -311010 -46895 257939 -65050 -91547 70923 -306329 -73670
9491c9901C1156b39282A24101f8011a7999l690G4261g6113D0569K28371i5748
$$ -39901 31156 -239282 124101 -68011 -17999 -21689 74261 -76113 40569 268940 -95748
9479A04350P158b90683a17098m3171o967H0597q95R6361A042K53045b91771C29251
$$ 104350 111508 -290683 -117098 -160269 -167236 80597 79702 176063 1042 254087 -291771 329251
9466A9873d43401J84994j34136J32418A40246A3023R6942h0609p4873A96303d7769
$$ 19873 -443401 -258407 -392543 -260125 140246 13023 109965 -80609 -155482 196303 -47769
9454c81684A00609a39050A60899o3411m1891a12428I9763P404n1841a98143G8919
$$ -381684 100609 -139050 160899 97488 55597 -112428 99763 107167 55326 -198143 78919
9442c67530E9597J96750A10722a30332b3804l30992o2508a25026b8586j38415
$$ -367530 59597 256347 110722 -130332 -23804 -354796 -417304 -125026 -28586 -167001
9432a67001a7337m3950J766j61994f6858r7970r0480P0732B19081a58123k9592
$$ -167001 -17337 -61287 -59521 -221515 -66858 -164828 -255308 -184576 219081 -158123 -187715
9421a87715A1524h8511l1463B12314a28416A9121a85812C6017J25350g3636B13409
$$ -187715 11524 -88511 -119974 212314 -128416 19121 -185812 36017 161367 -73636 213409
9409f8318m8285O874M2703E40826b58100C4614e04239A10628a01526A07032b87780
$$ -68318 -116603 -109729 -67026 540826 -258100 34614 -504239 110628 -101526 107032 -287780
9397a09994p4865M7772C2785J43128F4950a44878c3034m6000I5255E062e48635
$$ -109994 -184859 -137087 32785 175913 64950 -144878 -33034 -79034 95255 5062 -548635
9385d3744B11271d392J010m57456J11815a44305A1305b5934j7304j49399p7881
$$ -43744 211271 -4392 -3382 -460838 -349023 -144305 11305 -25934 -43238 -192637 -270518
9374b70518Q6262P9425B24440g4733D44884c46588d994A00999m8462A2263K4662
$$ -270518 -184256 -104831 224440 -74733 444884 -346588 -4994 100999 52537 12263 36925
9363C6925a01282p9434j34843j18558a43808j8926j92390B1063o642b92775A75281
$$ 36925 -101282 -180716 -315559 -434117 -143808 -162734 -355124 21063 14421 -292775 175281
9351h5362k9235M9435A27949a08884F1868O9791a23510I3623C0071g1819j77377
$$ -85362 -114597 -65162 127949 -108884 61868 131659 -123510 93623 30071 -71819 -249196
9340b49196L0556C1184c25119G9358a8183q9721k0789E2487e0344c291H2951B6940
$$ -249196 -218640 31184 -325119 79358 -18183 -107904 -128693 52487 -50344 -3291 82951 26940
9327A79581a06188A80512a21784E5740b44416P7402I5385d8367j27859d1311j44575
$$ 179581 -106188 180512 -121784 55740 -244416 -167014 95385 -48367 -176226 -41311 -185886
9316a85886p5346A38554D9446a8543j29924j41606A06945C5637a22414C1847N5027
$$ -185886 -261232 138554 49446 -18543 -148467 -290073 106945 35637 -122414 31847 86874
9305H6874i9653K0061j7365D0026K1476L33164a94975R44A81370a42026r6974
$$ 86874 -99653 -79592 -96957 40026 61502 394666 -194975 -194031 181370 -142026 -239000
9294b39000j12097B74476r6881J50238J274b81605e2288A09744A5224J10352k6583
$$ -239000 -351097 274476 177595 327833 329107 -281605 -52288 109744 15224 125576 98993
9283I8993i375A42916b29507a04042B10590a17E4590a08723K1696O045j83934
$$ 98993 -9375 142916 -229507 -104042 210590 -117 54590 -108723 -87027 -80982 -264916
9272b64916b5147M235A210J15460g5508a7901j2209l2603C18266i8273j13190
$$ -264916 -25147 -20912 1210 116670 -75508 -17901 -30110 -62713 318266 -98273 -211463
9261b11463B10908a9215I713M2707R3757a34720k31988F3811b26043k28726A69254
$$ -211463 210908 -19215 9713 52420 146177 -134720 -366708 63811 -226043 -454769 169254
9249B28447h7071n5537A99227a28850D7288a24783e1318l11209a43387j17874
$$ 228447 -87071 -142608 199227 -128850 47288 -124783 -51318 -362527 -143387 -261261
9239b61261O8528j8523D4454b27507m3370j77502d3397j94839E6747g5842D3783
$$ -261261 -192733 -211256 44454 -227507 -270877 -448379 -43397 -238236 56747 -75842 43783
9227A0137j806b22789o0599P1543F1000M9878K6609E9967R9395m516a69030l7641
$$ 10137 8331 -222789 -283388 -211845 61000 110878 137487 59967 159362 154846 -169030 -206671
9215b06671R9898o4115o0598f0098k97635D6913c29387J52751m8686K0503K7288
$$ -206671 -106773 -170888 -231486 -60098 -357733 46913 -329387 -176636 -225322 -204819 -177531
9204a77531c2438r6177k00789a14121A15592M2101a75180Q3596A99379b30386
$$ -177531 -32438 -128615 -329404 -114121 115592 157693 -175180 -91584 199379 -230386
9193a60461B7502R4035a09415j53448i7678b9159k31134C7152l517K2577a3467
$$ -160461 27502 121537 -109415 -262863 -97678 -29159 -260293 37152 33635 56212 -13467
9181A55762E0310O9747D756g9227R898o8669j57388f1709j02344B89292D3808
$$ 155762 50310 120057 4756 -79227 -69329 -137998 -295386 -61709 -164053 289292 43808
9169F9576c43276f701r3483j06207e0002j22632a011B86442a30971B1425a11865
$$ 69576 -343276 -6701 -100184 -206391 -50002 -172634 -1011 286442 -130971 21425 -111865
9157b91319J45529f2828E5566b94067I0323G670K06481J03515f3414A08852B0490
$$ -291319 -145790 -62828 55566 -294067 90323 7670 214151 317666 -63414 108852 20490
9145B84970b20932A19169B9469d5318B43149F1799M7427d7104B10177g900H038
$$ 284970 -220932 119169 29469 -45318 243149 61799 109226 -47104 210177 -7900 8038
9133a33191A36243D790a3654B83703E7932J0406a98683n4304j1588A05659P3721
$$ -133191 136243 4790 -13654 283703 57932 68338 -198683 -252987 -264575 105659 179380
9122A79380q6610c7719A88065e2240j30787G630J40961M2219a52486L9781B4380
$$ 179380 92770 -37719 188065 -52240 -183027 7630 148591 190810 -152486 -112705 24380
9110G9613a68752F9149N0455a62674C90230m9839b39881j50842a70832r5909R5189
$$ 79613 -168752 69149 119604 -162674 390230 340391 -239881 -390723 -170832 -266741 -171552
9099a71552B1726M4638b37663K4181Q6846e3275j94764g9050A21209M121a43588
$$ -171552 21726 66364 -237663 -213482 -126636 -53275 -248039 -79050 121209 125330 -143588
9087b88330B53075c30869A41216d12255B41695j03907J10970D4612J43054h8439
$$ -288330 253075 -330869 141216 -412255 241695 137788 248758 44612 187666 -88439
9076a98566F2131A3329d1995j38526e9870J3873A05372b79886C8541b36541M7963
$$ -198566 62131 13329 -41995 -180521 -59870 -45997 105372 -279886 38541 -236541 -188578
9065a88578q2736K8531b4286k25350J9035a12084q4460f2895C5824J06859a27745
$$ -188578 -271314 -242783 -24286 -249636 -230601 -112084 -196544 -62895 35824 142683 -127745
9053b396k48902G4895K02475b02018c9231m9152k64445a04634M4429G0754K12350
$$ -2396 -251298 74895 277370 -202018 -39231 -88383 -352828 -104634 -60205 70754 283104
9042B83104b33266k17973a80628B31165c6286l03152A97226r5531a80167h9000
$$ 283104 -233266 -451239 -180628 231165 -36286 -339438 197226 101695 -180167 -89000
9031a77862N004j12280f2893A80720D2860b79987g1747n4498j20835C37877A34434
$$ -177862 -172858 -285138 -62893 180720 42860 -279987 -71747 -126245 -247080 337877 134434
9019A83669K10308b73570A08953i5053A1617L04415c993l10612h5128j95034m064
$$ 183669 393977 -273570 108953 -95053 11617 316032 -3993 -314605 -85128 -280162 -284226
9008b84226f5923j21286C2336a10853j67667D6091b68340J25999N4555j38894
$$ -284226 -65923 -187209 32336 -110853 -278520 46091 -268340 -142341 -87786 -226680
8998b26680F0377a40359B00996C8130b35089A43122j1809b6648k69161N1058l01731
$$ -226680 60377 -140359 200996 38130 -235089 143122 131313 -26648 -295809 -244751 -546482
8987e46482A89888b08330P1725r3423C280f7117C76156k0465h3017G5267b32023
$$ -546482 189888 -208330 -136605 -230028 3280 -67117 376156 355691 -83017 75267 -232023
8975G5230J21040d3491A04652A1768b27059l1059l7113b4848B13736F3369b43203
$$ 75230 196270 -43491 104652 11768 -227059 -258118 -295231 -24848 213736 63369 -243203
8963b23618I6796a58922E5565J07882g0534I9893a46549A10841e3124j18771a2034
$$ -223618 96796 -158922 55565 163447 -70534 99893 -146549 110841 -53124 -171895 -12034
8951A42525g3660B51357d77350f09j47510B47393j23355A4020n962J86684P019
$$ 142525 -73660 251357 -477350 -609 -148119 247393 124038 14020 8058 194742 201761
8940B01761i7146C2396L0483a26808i476B34091J27765F8915e2339j01843C70203
$$ 201761 -97146 32396 62879 -126808 -9476 234091 361856 68915 -52339 -154182 370203
8928e5285B02830j0287J15705K77621L22282J778433P981990L589552C765000
$$ -55285 202830 192543 308248 585869 908151 2686584 10668574 14258126 3765000
8918A304234E14193O1331a32460E13420A27897e5498A91824Q6445F3310O7406
$$ 1304234 514193 575524 -132460 513420 127897 -55498 191824 278269 63310 130716
8908A30716K55602a38577G214c7682l7299C6486h2010A39558f3259r0430j37188
$$ 130716 386318 -138577 7214 -37682 -74981 36486 -82010 139558 -63259 -153689 -290877
8897b90877H015b14766H2221J23090c01942O868A4021J67819D8441b63249a9448
$$ -290877 8015 -214766 82221 205311 -301942 -295074 14021 181840 48441 -263249 -19448
8885a49030j29823k8346J39960N6417j03690c5069p4736A73125B7564K02922e2833
$$ -149030 -278853 -307199 -167239 -110822 -214512 -35069 -109805 173125 27564 230486 -52833
8873a61060J5765j75848a5295l386n3812D6604a29231e1647r8978E4296a67991
$$ -161060 -145295 -321143 -15295 -18681 -72493 46604 -129231 -51647 -150625 54296 -167991
8861I4237D4811O662b44946A69185C9626J35540E7680J13259b23723g1815B14389
$$ 94237 44811 51473 -244946 169185 39626 175166 57680 170939 -223723 -71815 214389
$$ [...]
##END NTUPLES=NMR SPECTRUM
##END=
