##TITLE=AC1398_2151uv_7519910_E9KT24DFFK
##JCAMPDX= 6.0         $$ Bruker NMR JCAMP-DX V2.0
##DATA TYPE= NMR SPECTRUM
##DATA CLASS= NTUPLES
##ORIGIN= BRUKER
##OWNER= Administrator
$$ 1.72 TOPSPIN		Version 2.1
$$ 2013-04-17 03:03:35.025 -0700  Administrator@X
$$ Compression mode = diff/dup
##.OBSERVE FREQUENCY= 400.02188249412
##.OBSERVE NUCLEUS= ^1H
##.ACQUISITION MODE= SIMULTANEOUS (DQD)
##.ACQUISITION SCHEME= undefined
##.AVERAGES= 64
##.DIGITISER RES= 22
##SPECTROMETER/DATA SYSTEM= spect
##.PULSE SEQUENCE= noesygpps1d.comp
##.SOLVENT NAME= COFFEE_meoh
##.SHIFT REFERENCE= INTERNAL, COFFEE_meoh, 1, 14.96114
##AUDIT TRAIL= $$ (NUMBER, WHEN, WHO, WHERE, PROCESS, VERSION, WHAT)
$$ ##TITLE= Audit trail, TOPSPIN		Version 2.1
$$ ##JCAMPDX= 5.01
$$ ##ORIGIN= Bruker BioSpin GmbH
$$ ##OWNER= Administrator
$$ $$ E:\/data/COFFEE/nmr/AC1398_2151uv_7519910_E9KT24DFFK/12/pdata/1/auditp.txt
$$ ##AUDIT TRAIL=  $$ (NUMBER, WHEN, WHO, WHERE, PROCESS, VERSION, WHAT)
(   1,<2013-04-17 03:03:29.712 -0700>,<Administrator>,<X>,<go>,<TOPSPIN 2.1>,
      <created by zg
	started at 2013-04-17 02:51:59.712 -0700,
	POWCHK enabled, PULCHK disabled,
       configuration hash MD5:
       33 CF 6A 21 5C D3 B9 40 6C 15 AA 8D 27 A2 4F 13
       data hash MD5: 64K
       34 3F 08 33 8C D2 12 9B 8E 1A 35 2E D8 66 20 EE>)
(   2,<2013-04-17 03:03:32.775 -0700>,<Administrator>,<X>,<proc1d>,<TOPSPIN 2.1>,
      <Start of raw data processing
       efp LB = 0.3 FT_mod = 6 PKNL = 1 PHC0 = 0 PHC1 = 0 SI = 128K 
       data hash MD5: 128K
       5E F3 AA 35 10 82 45 F0 63 87 1B 0F F5 DC 19 0B>)
(   3,<2013-04-17 03:03:33.869 -0700>,<Administrator>,<X>,<proc1d>,<TOPSPIN 2.1>,
      <pk PHC0 = -78.00293 PHC1 = 0 
       data hash MD5: 128K
       A7 C6 3A 50 FE F1 03 3D 3F B8 DF 6A 1C 95 C7 68>)
(   4,<2013-04-17 03:03:34.322 -0700>,<Administrator>,<X>,<proc1d>,<TOPSPIN 2.1>,
      <abs ABSG = 1 
       data hash MD5: 128K
       C5 2C 99 92 D9 93 C3 AB AB D2 83 24 05 5B 9F 51>)
(   5,<2013-04-17 03:03:34.447 -0700>,<Administrator>,<X>,<proc1d>,<TOPSPIN 2.1>,
      <abs ABSG = 2 
       data hash MD5: 128K
       4E 69 FA 8E D9 20 44 8D 81 A1 D5 19 A3 26 16 BC>)
(   6,<2013-04-17 03:03:34.572 -0700>,<Administrator>,<X>,<proc1d>,<TOPSPIN 2.1>,
      <abs ABSG = 3 
       data hash MD5: 128K
       FD CA D6 AF 61 33 E9 CC EE 3A 42 4F 1C 83 BF 9A>)
(   7,<2013-04-17 03:03:34.666 -0700>,<Administrator>,<X>,<proc1d>,<TOPSPIN 2.1>,
      <abs ABSG = 4 
       data hash MD5: 128K
       9B AA 89 6A 05 C0 E9 F3 48 9B 63 D9 3F 47 E9 72>)
(   8,<2013-04-17 03:03:34.759 -0700>,<Administrator>,<X>,<proc1d>,<TOPSPIN 2.1>,
      <abs ABSG = 5 
       data hash MD5: 128K
       49 98 07 E3 F9 E8 37 C5 50 62 9B 83 54 BD EA 6F>)
$$ ##END=
$$ 
$$ $$ hash MD5
$$ $$ 0B 6C D1 DD F0 F1 EB A7 F5 7F BB 72 12 41 01 5F
##$RELAX= 
##$RELAX= 
##$RELAX= 
##$RELAX= 
##$RELAX= 
##$RELAX= 
##$RELAX= 
##$RELAX= 
$$ Bruker specific parameters
$$ --------------------------
##$DU= <E:\>
##$EXPNO= 12
$$ [...]
##$TP07= 0
##$TPNAME0= <>
##$TPNAME1= <>
##$TPNAME2= <>
##$TPNAME3= <>
##$TPNAME4= <>
##$TPNAME5= <>
##$TPNAME6= <>
##$TPNAME7= <>
##$TPOAL= (0..7)
0.5 0.5 0.5 0.5 0.5 0.5 0.5 0.5
##$TPOFFS= (0..7)
0 0 0 0 0 0 0 0
##$TUNHIN= 0
##$TUNHOUT= 0
##$TUNXOUT= 0
##$USERA1= <user>
##$USERA2= <user>
##$USERA3= <user>
##$USERA4= <user>
##$USERA5= <user>
##$V9= 5
##$VALIST= <valist>
##$VCLIST= <CCCCCCCCCCCCCCC>
##$VD= 0
##$VDLIST= <DDDDDDDDDDDDDDD>
##$VPLIST= <PPPPPPPPPPPPPPP>
##$VTLIST= <TTTTTTTTTTTTTTT>
##$WBST= 2048
##$WBSW= 25
##$XGAIN= (0..3)
0 0 0 0
##$XL= 0
##$YL= 0
##$YMAX_a= 6876470
##$YMIN_a= -14612611
##$ZGOPTNS= <>
##$ZL1= 120
##$ZL2= 120
##$ZL3= 120
##$ZL4= 120
##$ABSF1= 14.96114
##$ABSF2= -5.597042
##$ABSG= 5
##$ABSL= 3
##$ALPHA= 0
##$AQORDER= 0
##$ASSFAC= 0
##$ASSFACI= 0
##$ASSFACX= 0
##$ASSWID= 0
##$AUNMP= <proc_prof1d_extract.lims>
##$AXLEFT= 0
##$AXNAME= <>
##$AXNUC= <1H>
##$AXRIGHT= 0
##$AXTYPE= 0
##$AXUNIT= <>
##$AZFE= 0.1
##$AZFW= 0.1
##$BCFW= 0
##$BC_mod= 0
##$BYTORDP= 0
##$COROFFS= 0
##$CY= 15
##$DATMOD= 1
##$DC= 0
##$DFILT= <>
##$DTYPP= 0
##$F1P= 0
##$F2P= 0
##$FCOR= 0.5
##$FTSIZE= 131072
##$FT_mod= 6
##$GAMMA= 0
##$GB= 0
##$INTBC= 1
##$INTSCL= 1
##$ISEN= 128
##$LB= 0.3
##$LEV0= 0
##$LPBIN= 0
##$MAXI= 10000
##$MC2= 0
##$MEAN= 0
##$ME_mod= 0
##$MI= 0
##$NCOEF= 0
##$NC_proc= -2
##$NLEV= 6
##$NOISF1= 0
##$NOISF2= 0
##$NSP= 0
##$NTH_PI= 0
##$NZP= 0
##$OFFSET= 14.96114
##$PC= 1
##$PHC0= -78.00293
##$PHC1= 0
##$PH_mod= 1
##$PKNL= yes
##$PPARMOD= 0
##$PPDIAG= 0
##$PPIPTYP= 0
##$PPMPNUM= 2147483647
##$PPRESOL= 1
##$PSCAL= 4
##$PSIGN= 0
##$PYNMP= <proc.py>
##$REVERSE= no
##$SF= 400.020009579874
##$SI= 131072
##$SIGF1= 0
##$SIGF2= 0
##$SINO= 400
##$SIOLD= 131072
##$SPECTYP= <>
##$SREGLST= <1H.CDCl3>
##$SSB= 0
##$STSI= 131072
##$STSR= 0
##$SW_p= 8223.68421052631
##$SYMM= 0
##$S_DEV= 0
##$TDeff= 65536
##$TDoff= 0
##$TI= <>
##$TILT= no
##$TM1= 0
##$TM2= 0
##$TOPLEV= 0
##$USERP1= <user>
##$USERP2= <user>
##$USERP3= <user>
##$USERP4= <user>
##$USERP5= <user>
##$WDW= 1
##$XDIM= 131072
##$YMAX_p= 440041121
##$YMIN_p= -63319
##$CURPLOT= <Network HP LaserJet P1505>
##$CURPRIN= <$Network HP LaserJet P1505>
##$DFORMAT= <normdp>
##$LAYOUT= <+/1D_H.xwp>
##$LFORMAT= <normlp>
##$PFORMAT= <normpl>
##$SURQMSG= 1
$$ End of Bruker specific parameters
$$ ---------------------------------
##NTUPLES= NMR SPECTRUM
##VAR_NAME=  FREQUENCY,     SPECTRUM/REAL,   SPECTRUM/IMAG
##SYMBOL=    X,             R,               I
##VAR_TYPE=  INDEPENDENT,   DEPENDENT,       DEPENDENT
##VAR_FORM=  AFFN,          ASDF,            ASDF
##VAR_DIM=   131072,        131072,          131072
##UNITS=     HZ,            ARBITRARY UNITS, ARBITRARY UNITS
##FACTOR=    0.0627417313425164, 1,          1
##FIRST=     8223.62146879497, 1941,         -62295
##LAST=      0,             2819,            -62158
##MIN=       0,             -63319,          0
##MAX=       8223.62146879497, 440041121,    0
$$ Real data points
##PAGE= N=1
##DATA TABLE= (X++(R..R)), XYDATA
$$ [...]
61488D43519J405Q09P8o27r65o76j70k54q84r33K40J617J778Q13J35N42J407J810
$$ 443519 444924 445733 445811 445184 444219 443543 443373 443119 442235 441302 441542 443159 444937 445750 445885 446427 447834 449644
61470D49644J674J451J308J093P93N99N65M79J56l17p01q76q34m32M95J658K229
$$ 449644 451318 452769 454077 455170 455963 456562 457127 457606 457762 457445 456744 455868 455034 454602 455097 456755 458984
61453D58984J658M30l73k66K15L51R4n0L38J227K240K988L431L896M604N271N474
$$ 458984 460642 461072 460699 460433 460648 460999 461093 461043 461381 462608 464848 467836 471267 475163 479767 485038 490512
61436D90512N319N377N929O627O981O807O151N130M005L115K608K428K583L129
$$ 490512 495831 501208 507137 513764 520745 527552 533703 538833 542838 545953 548561 550989 553572 556701
61422E56701L863M387M566M586M503L985K680O47j671l643m739m862m485m260
$$ 556701 560564 564951 569517 574103 578606 582591 585271 585918 584247 580604 575865 571003 566518 562258
61408E62258m510n175n966o350n757m354l239l296m011m187l613l191l450l828
$$ 562258 557748 552573 546607 540257 534500 530146 526907 523611 519600 515413 511800 508609 505159 501331
61394E01331l658k930j862m86Q99J586J313P06N15P99J212J522J526R83J49k16
$$ 501331 497673 494743 492881 492395 493294 494880 496193 496899 497414 498213 499425 500947 502473 503456 503605 503389
61378E03389K63J005J341J437J905K810L625L991M006L877L662L350K979K705
$$ 503389 503652 504657 505998 507435 509340 512150 515775 519766 523772 527649 531311 534661 537640 540345
61364E40345K742L069L325L305L452M265N393O060O395P389R289J1069J1964J2584
$$ 540345 543087 546156 549481 552786 556238 560503 565896 571956 578351 585740 595029 606098 618062 630646
61350F30646J3738J5111J6042J6930J8640K0849K2144K1768K0261J8355J6095
$$ 630646 644384 659495 675537 692467 711107 731956 754100 775868 796129 814484 830579
61339H30579J3294J0132O891L628M04k478m782o589q101r326j0180j0725j1141
$$ 830579 843873 854005 860896 864524 864928 862450 857668 851079 842978 833652 823472 812747 801606
61326H01606j1468j1451j0815r616q237o965n721m481l647l612m040m141l585
$$ 801606 790138 778687 767872 758256 750019 743054 737333 732852 729205 725593 721553 717412 713827
61313G13827k706j758o25O16J525K008K618L840N568P555R826J2235J4179J5132
$$ 713827 711121 709363 708738 709354 710879 712887 715505 719345 724913 732468 742294 754529 768708 783840
61299G83840J5063J3964J1522P682L067j588n939r559j1665j1975j1324j0729
$$ 783840 798903 812867 824389 832071 835138 833550 827611 818052 806387 794412 783088 772359
61287G72359j0202r131p464n738m160k513q81K14N62O70J301K778M744O434P388
$$ 772359 762157 753026 745562 739824 735664 733151 732270 732484 733046 733716 735017 737795 742539 748973 756361
61272G56361Q016R092J0635J1770J2033J2067J2614J3445J3988J4437J5468J7217
$$ 756361 764377 773469 784104 795874 807907 819974 832588 846033 860021 874458 889926 907143
61260I07143J9327K1684K4367K7094K9359L0891L1333K9819K5690J9416J2131
$$ 907143 926470 948154 972521 999615 1028974 1059865 1091198 1121017 1146707 1166123 1178254
61249A178254M550k959r629j4659j8206k1036k3185k4016k3531k2607k1663k0039
$$ 1178254 1182804 1179845 1170216 1155557 1137351 1116315 1093130 1069114 1045583 1022976 1001313 981274
61237I81274j7215j3853j1106r410q360p380o147m738l569k901k355j331P0J118
$$ 981274 964059 950206 939100 929690 921330 913950 907803 903065 899496 896595 894240 892909 892979 894097
61223H94097J572K073L103M070L980K685J040r8o57j132j822k358k117j039J48
$$ 894097 895669 897742 900845 904915 908895 911580 912620 912522 911865 910733 908911 906553 904436 903397 903545
61208I03545P29P87Q51J074J224J422K249M002O253Q406J0416J2743J5747J9222
$$ 903545 904274 905061 905912 906986 908210 909632 911881 915883 922136 930542 940958 953701 969448 988670
61194I88670K2532K5164K7225K9224L1301L2870L3103L1558K8308K3853J9155
$$ 988670 1011202 1036366 1063591 1092815 1124116 1156986 1190089 1221647 1249955 1273808 1292963
61183A292963J5233J2324R770P107M738L130J854J52k018m198o376q832j1293
$$ 1292963 1308196 1320520 1330290 1337397 1342135 1345265 1347119 1347271 1345253 1341055 1334679 1325847 1314554
61170A314554j3161j4550j6227j8458k0711k2606k4313k5835k6636k6345k5307
$$ 1314554 1301393 1286843 1270616 1252158 1231447 1208841 1184528 1158693 1132057 1105712 1080405
61159A080405k4087k2822k1313j9427j7202j4897j2839j0963q617n374j903O35
$$ 1080405 1056318 1033496 1012183 992756 975554 960657 947818 936855 928238 922864 920961 921596
61147I21596K017L140M629O003O426N578L484J31m180q443j1415j2482j1816r932
$$ 921596 923613 926753 931382 937385 943811 949389 952873 953004 948824 940381 928966 916484 904668 894736
61133H94736p284m211j072J760M137O385Q957J1796J4363J6520J8854K1696K4443
$$ 894736 887452 883241 882169 883929 888066 894451 903408 915204 929567 946087 964941 986637 1011080
61120A011080K6433K7942K9549L0994L1742L2220L3298L4508L4203L1740K8469
$$ 1011080 1037513 1065455 1095004 1125998 1157740 1189960 1223258 1257766 1291969 1323709 1352178
61109A352178K6007K4455K2813K0404J7239J3577R790O298L158j21l976q346j2997
$$ 1352178 1378185 1402640 1425453 1445857 1463096 1476673 1486463 1492761 1495919 1495798 1491822 1483476 1470479
61096A470479j7982k3410k8997l4052l7826l9888m0353l9696l8213l5936l3228
$$ 1470479 1452497 1429087 1400090 1366038 1328212 1288324 1247971 1208275 1170062 1134126 1100898
61085A100898l0955k9430k7753k5019k1811j9435j7913j6016j3331j0978r842
$$ 1100898 1069943 1040513 1012760 987741 965930 946495 928582 912566 899235 888257 878415
61074H78415r295q323o989o037n698n547n156m267k752q80O82J520J858K167K731
$$ 878415 869120 860797 853808 847771 842073 836526 831370 827103 824351 823471 824153 825673 827531 829698 832429
61059H32429L704N109O606P772Q695R877J1495J3367J5542J8154K0728K2435K3306
$$ 832429 836133 841242 847848 855620 864315 874192 885687 899054 914596 932750 953478 975913 999219
61046I99219K4274K5836K7470K8628K9459L0215L0753L0996L1145L1115L0520
$$ 999219 1023493 1049329 1076799 1105427 1134886 1165101 1195854 1226850 1257995 1289110 1319630
61035A319630K9545K8955K8977K8923K8341K7645K7282K7124K7077K7391K8141
$$ 1319630 1349175 1378130 1407107 1436030 1464371 1492016 1519298 1546422 1573499 1600890 1629031
61024A629031K9182L0894L3918L7872M1554M4709M8222N2077N4785N5850N7386
$$ 1629031 1658213 1689107 1723025 1760897 1802451 1847160 1895382 1947459 2002244 2058094 2115480
61013B115480O2145P0984Q3221R8123J14782J31739J48289J65449J84711K06962
$$ 2115480 2177625 2248609 2331830 2429953 2544735 2676474 2824763 2990212 3174923 3381885
61003C381885K33853K68927L15817L76390M51925N44739O57212P91497R52808
$$ 3381885 3615738 3884665 4200482 4576872 5028797 5573536 6230748 7022245 7975053
60994G975053J151115J396178J692591K041980K441268K859411L205245L332816
$$ 7975053 9126168 10522346 12214937 14256917 16698185 19557596 22762841 26095657
60986B6095657L111010K516774J672597P92700Q4209l22527l89914j67884K06387
$$ 26095657 29206667 31723441 33396038 34188738 34272947 33950420 33560506 33392622 33599009
60977C3599009N25490N78250K47333m29560j283222k100750k714427l046002l103587
$$ 33599009 34124499 34702749 34950082 34520522 33237300 31136550 28422123 25376121 22272534
60968B2272534k951252k671623k336814j996336j679148j399426j160351r58351
$$ 22272534 19321282 16649659 14312845 12316509 10637361 9237935 8077584 7119233
60960G119233p88832o49104n36647m47284l76564l21373k78821k45037k16710
$$ 7119233 6330401 5681297 5144650 4697366 4320802 3999429 3720608 3475571 3258861
60951C258861j92982j74200j59408j46357j33555j21031j09291r8552q9122q1636
$$ 3258861 3065879 2891679 2732271 2585914 2452359 2331328 2222037 2123485 2034363 1952727
60941A952727p6674p4268p3711p3616p2560p0001o6386o2332n8089n3785m9536
$$ 1952727 1876053 1801785 1728074 1654458 1581898 1511897 1445511 1383179 1325090 1271305 1221769
60930A221769m5166m0459l5899l2389k9955k7581k4671k1862j9849j8226j6225
$$ 1221769 1176603 1136144 1100245 1067856 1037901 1010320 985649 963787 943938 925712 909487
60919I09487j3901j1821j0031q139o114m323l013k212j861j642r84K43J417J975
$$ 909487 895586 883765 873734 865595 859481 855158 852145 849933 848072 846430 845446 845689 847106 849081
60905H49081K120K287K288J595J52j658l522n162o087o070n696n887o883q164
$$ 849081 851201 853488 855776 857371 857523 855865 852343 847181 841094 835024 829328 823441 816558 808394
60891H08394r233r950j0296j0264j0078j0052j0150r983r324q372p492o895o578
$$ 808394 799161 789211 778915 768651 758573 748521 738371 728388 719064 710692 703200 696305 689727
60878F89727o482o548o703o703o225n295m472m232m215l596k238q90q2N78J641
$$ 689727 683245 676697 669994 663291 657066 651771 647299 643067 638852 635256 633018 632128 632046 632624 634265
60863F34265K935M001M927O067P248P941Q231Q903J0422J2262J3467J3580J2802
$$ 634265 637200 641201 646128 652195 659443 667384 675615 684518 694940 707202 720669 734249 747051
60850G47051J1523R991Q412P088O265N917N869O082O500O606N539K990l50l534
$$ 747051 758574 768565 776977 784065 790330 796247 802116 808198 814698 821304 826843 829833 829483 825949
60836H25949o226q408r682r645q768q115q104q215p937p263o294n216m791n847
$$ 825949 819723 811315 801633 791988 783220 775105 767001 758786 750849 743586 737292 732076 727285 721438
60822G21438p911r299r109q356q473r503j0459j0790j0583r777q284o655n742
$$ 721438 713527 704228 695119 686763 678290 668787 658328 647538 636955 627178 618894 612239 606497
60809F06497n640n638n194m434l681l053k549k137j713j297j127j291j399j054
$$ 606497 600857 595219 590025 585591 581910 578857 576308 574171 572458 571161 570034 568743 567344 566290
60795E66290l94J90P15J504K475L101L093K782K719L106L737M300M741N296O093
$$ 566290 565896 566086 566801 568305 570780 573881 576974 579756 582475 585581 589318 593618 598359 603655 609748
60780F09748O784O903O609O560O981P392P483P594P949Q094P712P390P792Q499
$$ 609748 616532 623435 630044 636604 643585 650977 658460 666054 674003 682097 689809 697199 704991 713490
60766G13490Q534P773O982O598O275N643M816L997L257K755K668K786K720K464
$$ 713490 722024 729797 736779 743377 749652 755295 760111 764108 767365 770120 772788 775574 778294 780758
60752G80758K330K344K208J829J334O94m3k77N52J812K017O04j335k516k812k742
$$ 780758 783088 785432 787640 789469 790803 791497 791454 791177 791729 793541 795558 796162 794827 792311 789499 786757
60736G86757k308j148N62K171L425M670O131P501Q420R104J0239J2256J4728J6665
$$ 786757 784449 783301 783863 786034 789459 794129 800260 807761 816181 825285 835524 847780 862508 879173
60722H79173J7562J8043J9176K1203K3249K4393K4594K4376K4028K3435K2480
$$ 879173 896735 914778 933954 955157 978406 1002799 1027393 1051769 1075797 1099232 1121712
60711A121712K1209J9691J7915J5820J3276J0131O397K301j913o075r992j3468
$$ 1121712 1142921 1162612 1180527 1196347 1209623 1219754 1226151 1228452 1226539 1220464 1210472 1197004
60699A197004j6571j9607k2555k4806k5787k5748k5552k5679k5795k5447k4841
$$ 1197004 1180433 1160826 1138271 1113465 1087678 1061930 1036378 1010699 984904 959457 934616
60688I34616k4547k4520k3903k2062j9571j7651j6717j5935j4464j2644j1464
$$ 934616 910069 885549 861646 839584 820013 802362 785645 769710 755246 742602 731138
60677G31138j1085j0539q982o714m762l819l835m356m868m992m698m417m624n239
$$ 731138 720053 709514 700532 693818 689056 685237 681402 677046 672178 667186 662488 658071 653447 648208
60663F48208n576n111m232l938m648n530n338l860k116j115q31o36j65O40J870
$$ 648208 642632 637521 633289 629351 624703 619173 613835 609975 607859 606744 605913 605277 605112 605752 607622
60648F07622L387M495M534L772L069K726K351J830J671K135K742L088L441M093
$$ 607622 611009 615504 620038 623810 626879 629605 631956 633786 635457 637592 640334 643422 646863 650956
60634F50956M626M465L775L241L075K827K068Q98k05p36n47j47m30j725l346m406
$$ 650956 655582 660047 663822 667063 670138 672965 675033 675931 675726 674990 674443 674296 673866 672141 668795 664389
60618F64389m803n029n334n660o153o960p566p058n362l576k795k999l409l524
$$ 664389 659586 654557 649223 643563 637410 630450 622884 615826 610464 606888 604093 601094 597685 594161
60604E94161l451l482l708l961l896l280k357j762j862k324k476j986j054r3O45
$$ 594161 590710 587228 583520 579559 575663 572383 570026 568264 566402 564078 561602 559616 558562 558469 559114
60589E59114J209J812K394K499J827Q96O29J162J607J188J80o44r27o58K82J734
$$ 559114 560323 562135 564529 567028 568855 569751 570380 571542 573149 574337 574517 573873 572946 572288 572570 574304
60573E74304K874L022K693L018M155N195N743O610Q532J1060J3289J5041J6690
$$ 574304 577178 580200 582893 585911 590066 595261 601004 607614 616146 627206 640495 655536 672226
60560F72226J8266J9453K0136K0221J9155J6362J2177P689L590l11m314p972j0279
$$ 672226 690492 709945 730081 750302 769457 785819 797996 805685 809275 808964 804650 796678 786399
60547G86399j0457q578n612k815p40J126L529O394R001J1090J3213J5954J9274
$$ 786399 775942 767364 761752 758937 758197 759323 762852 769246 778247 789337 802550 818504 837778
60534H37778K2821K6281K9096L0276K8942K4987J9000J1821M358k493q129j2399
$$ 837778 860599 886880 915976 946252 975194 1000181 1019181 1031002 1035360 1032867 1024738 1012339
60522A012339j5290j6642j6407j4973j2979j0866q845p099n731m629l663k925
$$ 1012339 997049 980407 964000 949027 936048 925182 916337 909238 903507 898878 895215 892290
60510H92290k464j868n21J609L731N043N605O252P682R847J2287J4904J8199K2726
$$ 892290 889826 887958 887437 889046 892777 897820 903425 909677 917359 927206 939493 954397 972596 995322
60496I95322K8557L5312M2563M9942N7099O3878P0391P6480Q1071Q2660Q0618
$$ 995322 1023879 1059191 1101754 1151696 1208795 1272673 1343064 1419544 1500615 1583275 1663893
60485A663893P5496O7774N6843M1830K3167K705j7582l6508n3373o7460p8149
$$ 1663893 1739389 1807163 1864006 1905836 1929003 1931708 1914126 1877618 1824245 1756785 1678636
60474A678636q5127q8301q7742q3936p7861p0642o3191n6136m9801m4150l9025
$$ 1678636 1593509 1505208 1417466 1333530 1255669 1185027 1121836 1065700 1015899 971749 932724
60463I32724l4532l0936k8074k5293k2155j8979j6354j4390j2783j1422j0448
$$ 932724 898192 867256 839182 813889 791734 772755 756401 742011 729228 717806 707358
60452G07358r777q969p807o590n706n147m688m324m199m130l645k571j372p12
$$ 707358 697581 688612 680805 674215 668509 663362 658674 654350 650151 646021 642376 639805 638433 637721
60438F37721p88j327k059k927l788m246m018l313k627k169j791j463j462j859
$$ 637721 636933 635606 633547 630620 626832 622586 618568 615255 612628 610459 608668 607205 605743 603884
60424F03884k134j682o64J05J36k18l69j90J64P55J679K544K707K050J069K00
$$ 603884 601750 600068 599404 599509 599645 599427 599058 598868 599032 599787 601466 604010 606717 608767 609836 610036
60408F10036m77p56k50Q74J622J283M32K25Q96J597J675J401J320J490J689J844
$$ 610036 609559 608803 608553 609427 611049 612332 612764 612989 613885 615482 617157 618558 619878 621368 623057 624901
60392F24901J925J753J372J326K068L202L741L244K395K188K734L130K608J497
$$ 624901 626826 628579 629951 631277 633345 636547 640288 643532 645927 648115 650849 653979 656587 658084
60378F58084Q66J238K040K371J987J299P41N45Q46J518J947J522M71k87k03L62
$$ 658084 658950 660188 662228 664599 666586 667885 668626 669171 670017 671535 673482 675004 675475 675188 674985 675347
60362F75347P94R90J199J522J918K378K823K986K729K298K073K138K344K557K785
$$ 675347 676141 677131 678330 679852 681770 684148 686971 689957 692686 694984 697057 699195 701539 704096 706881
60347G06881L112L704M653N780O798P752Q940J0234J0936J0557R384P883N971
$$ 706881 709993 713697 718350 724130 730928 738680 747620 757854 768790 779347 788731 796614 802585
60334H02585L324J28l058n899q202r506r449q568p920p771p295n883m072k745
$$ 802585 805909 806037 802979 797080 788878 779372 769923 761355 753435 745664 738369 732486 728414 725669
60320G25669j953j195n16m96j130j499r10J30O13M18N24J752L783N577O549P124
$$ 725669 723716 722521 722005 721509 720379 718880 717970 718100 718713 719131 719655 721407 725190 730767 737316 744440
60304G44440Q268J0634J4059J7798K1286K4609K7854L0150K9922K6576K1335J5828
$$ 744440 752708 763342 777401 795199 816485 841094 868948 899098 929020 955596 976931 992759
60292I92759J0251L695l801j0628j5193j7333j7829j7293j6077j4688j3506j2466
$$ 992759 1003010 1006705 1002904 992276 977083 959750 941921 924628 908551 893863 880357 867891
60280H67891j1549j1254j2013j3333j4208j4274j3989j3742j3267j2042r957p502
$$ 867891 856342 845088 833075 819742 805534 791260 777271 763529 750262 738220 728263 720761
60268G20761n589m951n401n780n096l620k405j888j565r78l99k86o03r69j105
$$ 720761 715172 710221 704820 699040 693944 690324 687919 686031 684466 683488 683089 682803 682200 681231 680126
60253F80126q65k26N06P09O4r69j502j063N8J097J353O44n52j422j479q91j50
$$ 680126 679261 679035 679541 680250 680314 679345 677843 676780 676838 677935 679288 679932 679380 677958 676479 675588 675438
60236F75438M52Q88J140J169J137J434K263L345M163M499M515M319L797L021K555
$$ 675438 675890 676778 677918 679087 680224 681658 683921 687266 691429 695928 700443 704762 708559 711580 714135
60221G14135K866L570L764L168K537K706L609M579N269N837O378O585O155N245
$$ 714135 717001 720571 724335 727503 730040 732746 736355 740934 746203 752040 758418 765003 771158 776403
60207G76403M448M260M612M907M627L821K830J696K75j110j727j380q41r49j689
$$ 776403 780851 785111 789723 794630 799257 803078 805908 807604 807879 806769 805042 803662 802821 801872 800183
60192H00183k504l146l768m432m972n182m829l754k319j433j597k237k423j955
$$ 800183 797679 794533 790765 786333 781361 776179 771350 767596 765277 763844 762247 760010 757587 755632
60178G55632j240m81L13Q21O68J90J39N95R39R59J181J868K464K409J933J600
$$ 755632 754392 753911 754224 755045 755713 755903 756042 756637 757576 758535 759716 761584 764048 766457 768390 769990
60162G69990J566J631J683J636J305O96K47L73J020J862K743L625M315M578M416
$$ 769990 771556 773187 774870 776506 777811 778507 778754 779127 780147 782009 784752 788377 792692 797270 801686
60147H01686M068L766L658L856M341M909N275N207M670L943L554L845M705N880
$$ 801686 805754 809520 813178 817034 821375 826284 831559 836766 841436 845379 848933 852778 857483 863363
60133H63363P362R058J0256J0112Q667O851N203L234L65k947n588o951p246o905
$$ 863363 870725 879783 890039 900151 908818 915669 920872 924106 924471 921524 915936 908985 901739 894834
60119H94834o153n136m026k953k098j784k166k853l180k961k749l145l991m458
$$ 894834 888681 883545 879519 876566 874468 872684 870518 867665 864485 861524 858775 855630 851639 847181
60105H47181l870k373p55K59N45N62R32J964L424M725N468N811O179O702P176
$$ 847181 843311 840938 840183 840442 840987 841549 842481 844445 847869 852594 858062 863873 870052 876754 883930
60090H83930P555Q088Q819R358R325Q828Q242P831P773Q055Q080O809L911L81
$$ 883930 891485 899573 908392 917750 927075 935903 944145 951976 959749 967804 975884 982693 986604 986985
60076I86985k518m672o886r515j2057j3988j5223j5766j5604j5027j4448j3785
$$ 986985 984467 979795 972909 963394 951337 937349 922126 906360 890756 875729 861281 847496
60064H47496j2622j1037r662q812q189p523o881o266n564n045n098n298m660l187
$$ 847496 834874 823837 814175 805363 797174 789651 782770 776504 770940 765895 760797 755499 750839 747652
60050G47652k217k636l530l367j925j86J152K199L161L950M508M792M502L379
$$ 747652 745435 742799 739269 735902 733977 733791 734943 737142 740303 744253 748761 753553 758055 761434
60036G61434J768L66o25j553k585l428l914m412n413o912q325q987q721q074p819
$$ 761434 763202 763568 762943 761390 758805 755377 751463 747051 741638 734726 726401 717414 708693 700619 692800
60021F92800q109q278p718o688n908n557n145m323l299k364j454n08J43J89K3
$$ 692800 684691 676413 668695 662007 656099 650542 645397 641074 637775 635411 633957 633449 633592 633781 633804
60006F33804N25K008L669M437M185L755L822M157M243M088M062M214M372M713
$$ 633804 634329 636337 640006 644443 648628 652383 656205 660362 664605 668693 672755 676969 681341 686054
59992F86054N633O979P962Q025P382O558N778M964M063L081K025Q52n57k305m075
$$ 686054 691687 698666 706628 714653 722035 728593 734371 739335 743398 746479 748504 749356 748799 746494 742419
59977G42419n107n023m549m747n601o091n653m736l779k577j139j96k02m51j8
$$ 742419 737312 732289 727740 722993 717392 711301 705648 700912 697133 694556 693417 693221 693019 692568 692550
59962F92550R68J722K136K831M081N396O150O043N056L494K051J273R13K11j070
$$ 692550 693518 695240 697376 700207 704288 709684 715834 721877 726933 730427 732478 733751 734664 734875 733805
59947G33805k247k524j934j390j799l073m196m399m125m321m951n051m325l758
$$ 733805 731558 729034 727100 725710 723911 720838 716642 712243 708118 703797 698846 693795 689470 685712
59933F85712m104m666m360l238k084j121j38N10L04k70q0J025K057K451K699L163
$$ 685712 681608 676942 672582 669344 667260 666139 666001 666511 666815 666545 666465 667490 669547 671998 674697 677860
59917F77860L356K979K766L537M962O055O433O454O339N961N343M818M494M055
$$ 677860 681216 684195 686961 690498 695460 701515 707948 714402 720741 726702 732045 736863 741357 745412
59903G45412L253K314J653J335J071O96M77P78J500K163K537K941L674M501N024
$$ 745412 748665 750979 752632 753967 755038 755734 756211 756989 758489 760652 763189 766130 769804 774305 779329
59888G79329N375O047P063P771P604O735N769N068M583M139L646L117K621K194
$$ 779329 784704 790751 797814 805585 813189 819924 825693 830761 835344 839483 843129 846246 848867 851061
59874H51061J666P28p04k264l416l989m315m805n441n859n802n382m867m390l993
$$ 851061 852727 853455 852751 850487 847071 843082 838767 833962 828521 822662 816860 811478 806611 802221 798228
59859G98228l704l477l192k966l121l538l348j836L99J886J962J464J553K489
$$ 798228 794524 791047 787855 784889 781768 778230 774882 773046 773445 775331 777293 778757 780310 782799
59845G82799L832N252O635P832Q873J0105J1672J2994J3266J2261J0266P542M414
$$ 782799 786631 791883 798518 806350 815223 825328 837000 849994 863260 875521 885787 893329 897743
59832H97743J689L60O96J980L177L558K665J19m162r530j4632j8142j9708k0057
$$ 897743 899432 899792 900488 902468 905645 909203 911868 911987 907825 898295 883663 865521 845813 825756
59818H25756j9962j9301j7484j4698j2028j0292r280q375p314o074m639l271k468
$$ 825756 805794 786493 769009 754311 742283 731991 722711 714336 707022 700948 696309 693038 690570
59805F90570k253j973j198l01K57N20M80k95j806l051l204k779k725k871k407
$$ 690570 688317 686344 685146 684845 685102 685622 686102 685807 684001 680950 677746 674967 672242 669371 666964
59790F66964j461r48j008q50k37J00k27o65q80j437k675l643l119j264M30Q18
$$ 666964 665503 664555 663547 662697 662460 662560 662333 661668 660788 659351 656676 653033 649914 648650 649080 649898
59774F49898K09k28J84J026J528J648K106L277M555N132M965M546M142L896M285
$$ 649898 650107 649879 650063 651089 652617 654265 656371 659648 664203 669335 674300 678846 682988 686884 691169
59759F91169N575P015P406O565N509N114N322N696O017O124N845N398N288N512
$$ 691169 696744 703759 711165 717730 723239 728353 733675 739371 745388 751512 757357 762755 768043 773555
59745G73555N444M662L496K436J559P45P6l12m64m92n03o25q50q31k79M85P89
$$ 773555 778999 783661 787157 789593 791152 791897 791973 791661 791197 790705 790202 789577 788727 787896 787617 788102 788891
59728G88891M22k35q13j154j042m04J95k0r37j567j294m96K19P80J347J872K300
$$ 788891 789313 789078 788265 787111 786069 785665 785860 785840 784903 783336 782042 781546 781765 782545 783892 785764 788064
59711G88064K732L173L523L953M756N736O327O464O693P224P566P428P173P045
$$ 788064 790796 793969 797492 801445 806201 811937 818264 824728 831421 838645 846211 853639 860812 867857
59697H67857O651N719M741M212L812K858J247o46k561m308n449n620n032m230
$$ 867857 874508 880227 884968 889180 892992 895850 897097 896451 893890 889582 884133 878513 873481 869251
59683H69251l546l072k891k903k752k289j924k123k828l648m405n092n547n578
$$ 869251 865705 862633 859742 856839 854087 851798 849874 847751 844923 841275 836870 831778 826231 820653
59669H20653n324n118n085n077m890m410l697l001k542k217j784j263q38l57M84
$$ 820653 815329 810211 805126 800049 795159 790749 787052 784051 781509 779292 777508 776245 775407 775050 775534
59654G75534J475K063K312K940M058M643L791J882r7j862l735n676p203q097q543
$$ 775534 777009 779072 781384 784324 788382 793025 796816 798698 798601 796739 793004 787328 780125 772028 763485
59639G63485q615q128o953n134k868p28L71J5j047j583j223p50j050k179l404
$$ 763485 754870 746742 739789 734655 731787 731059 731430 731445 730398 728815 727592 726842 725792 723613 720209
59624G20209l898l403k425j681j263o76J33L35o89k253l060k823k375k240j923
$$ 720209 716311 712908 710483 708802 707539 706863 706996 707331 706642 704389 701329 698506 696131 693891 691968
59609F91968q62N77J611K121K603L230L558L194K407J808J608J503J198P88N40
$$ 691968 691106 691683 693294 695415 698018 701248 704806 708000 710407 712215 713823 715326 716524 717312 717852
59594G17852N29P00J072J647K252K669K896L017K903K288J157j77j356k126k377
$$ 717852 718381 719081 720153 721800 724052 726721 729617 732634 735537 737825 738982 738805 737449 735323 732946
59579G32946k312k496l352m610n589n993o085o106n947n474m790m067l381k735
$$ 732946 730634 728138 724786 720176 714587 708594 702509 696403 690456 684982 680192 676125 672744 670009
59565F70009k071j258m22mj79l58J55J232K135K526K609K454J954J488J726K606
$$ 670009 667938 666680 666258 666254 666075 665717 665872 667104 669239 671765 674374 676828 678782 680270 681996 684602
59549F84602L232L097K719K880L778N142O599P752Q513R493J1454J4310J7362
$$ 684602 687834 690931 693650 696530 700308 705450 712049 719801 728314 737807 749261 763571 780933
59536G80933K0377K3322K5018K3479J8260J1405N420J247j117j362N78L511N887
$$ 780933 801310 824632 849650 873129 891389 902794 908214 909461 908344 906982 907560 911071 916958
59523I16958P398Q683R802J0027Q863O489L284l58l871o918r777j2822j5774j7878
$$ 916958 924356 933039 942841 952868 961731 968220 971504 971146 967275 960357 950580 937758 921984 904106
59509I04106j8657j8070j6400j4282j2437j0897r084p006n599n231m815l329j424
$$ 904106 885449 867379 850979 836697 824260 813363 804279 797273 791674 786443 781628 778299 776875
59496G76875m06k41J12P77Q28m2r96j377j373j176m70P82J915K408K626L338M863
$$ 776875 776469 776228 776340 777117 777945 777903 776907 775530 774157 772981 772511 773293 775208 777616 780242 783580 788443
59479G88443O856Q707J0090J1289J2789J4289J4607J3050J0393P780N155J732
$$ 788443 795299 804006 814096 825385 838174 852463 867070 880120 890513 898293 903448 905180
59467I05180k214n204o270n849m724k998n12K421N261P904J0666J3777J6976J9583
$$ 905180 902966 897762 891492 885643 880919 877921 877409 879830 885091 892995 903661 917438 934414 953997
59453I53997K1070K1650K2016K2327K1947K0550J8822J7408J5660J2288O917K16
$$ 953997 975067 996717 1018733 1041060 1063007 1083557 1102379 1119787 1135447 1147735 1154652 1154868
59441A154868p104j4420k0522k4024k4657k3417k1394j9166j7217j5962j5256
$$ 1154868 1147764 1133344 1112822 1088798 1064141 1040724 1019330 1000164 982947 966985 951729
59430I51729j4590j3826j3081j1938r772o787l751o48L374Q447J3418J7215J9869
$$ 951729 937139 923313 910232 898294 888522 881735 877984 877336 880710 889157 902575 919790 939659
59417I39659K1749K2766K2990K3366K4955K7710L0215L0288K5819J5920K023j2464
$$ 939659 961408 984174 1007164 1030530 1055485 1083195 1113410 1143698 1169517 1185437 1187460 1174996
59405A174996k4104l1099l3295l1334k6108j8476r163O63Q607J1593P821j814
$$ 1174996 1150892 1119793 1086498 1055164 1029056 1010580 1001417 1002080 1010687 1022280 1030101 1028287
59393A028287j4189k5460l2548l4359l2307k9046k6197k3447j9934j5796j2028
$$ 1028287 1014098 988638 956090 921731 889424 860378 834181 810734 790800 775004 762976
59382G62976r341p647o322m659k448k96R91J429J764K264K388J897J515J915K676
$$ 762976 753635 745988 739666 735007 732559 732263 733254 734683 736447 738711 741099 742996 744511 746426 749102
59367G49102K868K289J585J474K258L806N575O982Q028R251J0828J2245J3217
$$ 749102 751970 754259 755844 757318 759576 763382 768957 775939 783967 793218 804046 816291 829508
59354H29508J4336J6223J8553K0613K2459K4671K7157K9010K9652K9487K9166
$$ 829508 843844 860067 878620 899233 921692 946363 973520 1002530 1032182 1061669 1090835
59343A090835K8776K7968K6474K4123K0587J5575R405L117k332o910j1353j6033
$$ 1090835 1119611 1147579 1174053 1198176 1218763 1234338 1243743 1246860 1244528 1237618 1226265 1210232
59331A210232k0303k3245k4818k5786k6651k7069k6447k4690k2225j9619j7329
$$ 1210232 1189929 1166684 1141866 1116080 1089429 1062360 1035913 1011223 988998 969379 952050
59320I52050j5567j4242j3126j2098j1072r852q357o911n907n222m345l155k153
$$ 952050 936483 922241 909115 897017 885945 876093 867736 860825 854918 849696 845351 842196 840043
59307H40043j788j841j600n50J158K782L686M045M583N528O345O848P861J0097
$$ 840043 838255 836414 834814 834264 835422 838204 841890 845935 850518 856046 862391 869239 877100 887197
59293H87197J2977J5451J7612K0402K3962K7303K9447K9684K6892K0142J0465
$$ 887197 900174 915625 933237 953639 977601 1004904 1034351 1064035 1090927 1111069 1121534
59282A121534O89p002j2344j5473j5681j2679p959l596j81L025O409R496J1849
$$ 1121534 1122223 1115221 1102877 1087404 1071723 1059044 1051085 1047489 1047308 1050333 1056742 1066238 1078087
59269A078087J3469J4423J4678J4240J2932J0338O444K023k194o306j0635j4711
$$ 1078087 1091556 1105979 1120657 1134897 1147829 1158167 1164611 1166634 1164440 1158134 1147499 1132788
59257A132788j7690j9558k1146k2941k4478k4925k3831k1378j8313j5589j3613
$$ 1132788 1115098 1095540 1074394 1051453 1026975 1002050 978219 956841 938528 922939 909326
59246I09326j1968j0120q094o093l832r89J979M224N661P001Q551R704R822R020
$$ 909326 897358 887238 879144 873051 869219 868230 870209 874433 880094 887095 895646 905350 915172 924192
59232I24192P719N901L332K22k762n196p282r390j1446j2944j3633j3905j4248
$$ 924192 931911 937812 941144 941366 938604 933408 926126 916736 905290 892346 878713 864808 850560
59219H50560j4488j3916j2281j0194q351o771n125l513k406j865j344m36N17Q36
$$ 850560 836072 822156 809875 799681 791330 784559 779434 775921 773515 771650 770306 769870 770387 771223
59205G71223M06j00J1O34J103J207J600K899M665N776N755N293N368O251P498
$$ 771223 771629 771529 771540 772174 773277 774484 776084 778983 783648 789424 795179 800472 805840 812091 819589
59190H19589Q478Q775Q426P998Q157Q912R516R279Q268P071O109N441M962M551
$$ 819589 828067 836842 845268 853266 861423 870335 879851 889130 897398 904469 910578 916019 920981 925532
59176I25532M102L654L432L663M404N559O919Q239R433J0699J2194J3584J4125
$$ 925532 929634 933288 936720 940383 944787 950346 957265 965504 974937 985636 997830 1011414 1025539
59163A025539J3334J1381Q849O321M048J869o40l665o841r617j1746j3202j3886
$$ 1025539 1038873 1050254 1059103 1065424 1069472 1071341 1070701 1067036 1060195 1050578 1038832 1025630 1011744
59150A011744j3791j3340j3065j2980j2665j1867j0684r267p785o573n812n179
$$ 1011744 997953 984613 971548 958568 945903 934036 923352 914085 906300 899727 893915 888736
59138H88736m264l219k471j938j145j5J052J903K841M078N488O888Q100Q825R073
$$ 888736 884472 881253 878782 876844 875699 875684 876736 878639 881480 885558 891046 897934 906034 914859 923932
59123I23932R556J1003J3230J5475J7450J9274K0682K1314K1718K2938K4962K6535
$$ 923932 933488 944491 957721 973196 990646 1009920 1030602 1051916 1073634 1096572 1121534 1148069
59111A148069K6718K5749K4206K2309K0240J8222J6041J3284J0231P545N031J781
$$ 1148069 1174787 1200536 1224742 1247051 1267291 1285513 1301554 1314838 1325069 1332614 1337645 1339426
59099A339426k258o077r148j1936j4451j5751j5463j4548j3766j2568j0437q141
$$ 1339426 1337168 1331091 1321943 1310007 1295556 1279805 1264342 1249794 1236028 1223460 1213023 1204882
59087A204882o803o552p031q291j0293j2345j3987j5635j7522j8913j9160j8705
$$ 1204882 1198079 1191527 1184496 1176205 1165912 1153567 1139580 1123945 1106423 1087510 1068350 1049645
59075A049645j8116j7073j5336j3737j3062j2696j1617j0040q849q044p045n949
$$ 1049645 1031529 1014456 999120 985383 972321 959625 948008 937968 929119 921075 914030 908081
59063I08081n284m889m366m167m928o050o263n455m727m716m988n035m825m323
$$ 908081 902797 897908 893542 889375 884447 878397 872134 866679 861952 857236 852248 847213 842388 838065
59049H38065l436k427j632q92L5Q39J245J776K919M012M168L938M613O106P012
$$ 838065 834629 832202 830570 829678 829713 830552 831797 833573 836492 840504 844672 848610 853223 859329 866341
59034H66341O867O866P915R392J0434J1365J3058J5676J8759K1896K4725K6703
$$ 866341 873208 880074 887989 897381 907815 919180 932238 947914 966673 988569 1013294 1039997
59022A039997K7543K7514K6900K5365K2319J7756J2412P138K347j812n048o981
$$ 1039997 1067540 1095054 1121954 1147319 1169638 1187394 1199806 1206944 1209291 1207479 1202431 1195450
59010A195450p774q231q758q520o492l200l10J662L914P073R726J0312R343Q378
$$ 1195450 1187676 1179445 1170687 1162167 1155675 1152475 1152165 1153827 1157741 1164814 1174540 1184852 1194195 1202573
58996A202573P609N987L221J74k578n221p777r948j1848j3869j5759j6877j7343
$$ 1202573 1210182 1216169 1219390 1219564 1216986 1211765 1203988 1194040 1182192 1168323 1152564 1135687 1118344
58983A118344j7820j8158j7351j5009j1925r008o490m289k265j8K683N204O664
$$ 1118344 1100524 1082366 1065015 1050006 1038081 1029073 1022583 1018294 1016029 1016011 1018694 1023898 1030562
58970A030562P353Q534J0739J3174J5099J6755J8511K0044K0936K1366K1513K0755
$$ 1030562 1037915 1046449 1057188 1070362 1085461 1102216 1120727 1140771 1161707 1183073 1204586 1225341
58958A225341J8053J3083O695K98n136r668j3938j8042k1226k2926k3564k3800
$$ 1225341 1243394 1256477 1263172 1263470 1258334 1248666 1234728 1216686 1195460 1172534 1148970 1125170
58946A125170k3443k1876j9154j5778j1724o690j235L247N886O856O608N305L134
$$ 1125170 1101727 1079851 1060697 1044919 1033195 1026505 1025270 1028517 1034403 1041259 1047867 1053172 1056306
58933A056306L48l107p300j1517j4500j5660j5565j5116j4752j4467j4000j2956
$$ 1056306 1056654 1053547 1046247 1034730 1020230 1004570 989005 973889 959137 944670 930670 917714
58921I17714j1171r064p214n687m228k882j951j482j267j132q06J24J665L254
$$ 917714 906543 897479 890265 884578 880350 877468 875517 874035 872768 871636 870830 870954 872619 875873
58907H75873M657O473R089J1835J4004J6048J8633K1129K2262K2001K1515K1543
$$ 875873 880530 887003 896092 907927 921931 937979 956612 977741 1000003 1022004 1043519 1065062
58895A065062K1914K2494K3380K4316K5124K6488K9169L2525L5055L6199L6304
$$ 1065062 1086976 1109470 1132850 1157166 1182290 1208778 1237947 1270472 1305527 1341726 1378030
58884A378030L4983L1187K5051J8124J1405M534k734r660j5705k1324k6826l1393
$$ 1378030 1413013 1444200 1469251 1487375 1498780 1503314 1500580 1490920 1475215 1453891 1427065 1395672
58872A395672l3961l4360l3149l1007k8593k6305k3868k0814j7533j5076j3849
$$ 1395672 1361711 1327351 1294202 1263195 1234602 1208297 1184429 1163615 1146082 1131006 1117157
58861A117157j3252j2762j2487j2518j2597j2543j2309j1608j0318r161r052r803
$$ 1117157 1103905 1091143 1078656 1066138 1053541 1040998 1028689 1017081 1006763 997602 988550 978747
58849I78747j0419j0602j0922j1580j2122j2347j2403j2027j0889r594r076r115
$$ 978747 968328 957726 946804 935224 923102 910755 898352 886325 875436 865842 856766 847651
58837H47651q681p678o821n984m334k229j078j079q54J49Q48O79O87J536K203
$$ 847651 838970 831292 824471 818487 814153 811924 810846 809767 808913 809062 809910 810589 811276 812812 815015
58822H15015J783J048R84J144P15N4j41j98p86j626j990j841j559j205q71r84
$$ 815015 816798 817846 818830 819974 820689 820743 820602 820404 819618 817992 816002 814161 812602 811397 810526 809542
58806H09542j553j868j651j686k525l457l558l035k614k388k083j819j790j739
$$ 809542 807989 806121 804470 802784 800259 796802 793244 790209 787595 785207 783124 781305 779515 777776
58792G77776j447j153r10j71J404L337N107O819Q589R993J0691J0907J0788J0061
$$ 777776 776329 775176 774266 774095 775499 778836 783943 790762 799351 809344 820035 830942 841730 851791
58778H51791Q799P721P187O560N161L142R58j235l259m765n805o850p902q396
$$ 851791 860590 868311 875498 882058 887219 890361 891319 890084 886825 882060 876255 869405 861503 853107
58764H53107q143p526o571m997l278k354k024j037Q03K156K248J957K115K346
$$ 853107 844964 837438 830867 825870 822592 820238 818214 817177 817980 820136 822384 824341 826456 828802
58750H28802K385K977M479O033P156Q737J1276J3609J4612J5005J6077J7754J9247
$$ 828802 831187 834164 838643 844676 851832 860569 871845 885454 900066 915071 931148 948902 968149
58737I68149K0551K2040K3446K4504K5668K7021K7434K6002K3397K0548J7018
$$ 968149 988700 1010740 1034186 1058690 1084358 1111379 1138813 1164815 1188212 1208760 1225778
58726A225778J1972N924J53m827q920j1383j1495r812p529n153k768r41j92j91
$$ 1225778 1237750 1243674 1243827 1239000 1230080 1218697 1207202 1197390 1189861 1184708 1181940 1180999 1180807 1180616
58712A180616m41j202k902n269p895j0786j3638j5658j6918j8732k1691k4543
$$ 1180616 1180175 1178973 1176071 1170802 1162907 1152121 1138483 1122825 1105907 1087175 1065484 1040941
58700A040941k6152k7181k8502k9273k8262k5929k3560k1271j8613j6119j4461
$$ 1040941 1014789 987608 959106 929833 901571 875642 852082 830811 812198 796079 781618
58689G81618j2915j0530q166p390p905p893o671n214m335l957m010m477m631l688
$$ 781618 768703 758173 750007 742617 734712 726819 720148 714934 710599 706642 702632 698155 693524 689836
58675F89836k057o94M96K359M932P449R632J1723J3638J5374J7744K1241K4511
$$ 689836 687779 687085 687581 689940 694872 702321 711953 723676 737314 752688 770432 791673 816184
58662H16184K5367K3174J9005J3835P986K039l203p607j1412j4159j5111j4569
$$ 816184 841551 864725 883730 897565 905551 907590 904387 896780 885368 871209 856098 841529
58650H41529j3611j2716j1629j0312r003p618o049m680l721k660j252k53j40j3
$$ 841529 827918 815202 803573 793261 784258 776640 770591 765911 762190 759530 758278 758025 757885 757872
58636G57872R59J825J166o37k070k749l391m024l921l108k310j619n90O06J476
$$ 757872 758831 760656 761822 761185 759115 756366 752975 748951 745030 741922 739612 737993 737403 738009 739485
58621G39485K348L881N797P408Q941J1072J3517J5451J6802J7766J7621J5522
$$ 739485 741833 745714 751511 758919 767860 778932 792449 807900 824702 842468 860089 875611
58609H75611J1997Q299M750J124k045m047n257o286o601n623m405m383n109n119
$$ 875611 887608 895907 900657 901781 899736 895689 890432 884146 877545 871922 867517 863134 858025 852906
58595H52906m343l663k792q06J800L862N898R323J3591J6668J8225J9862K1974
$$ 852906 848563 844900 842108 841302 843102 846964 852862 862185 875776 892444 910669 930531 952505
58582I52505K2988K2046K0163J8114J5407J1969Q812O270L532O76o30O63L572
$$ 952505 975493 997539 1017702 1035816 1051223 1063192 1072004 1078274 1081806 1082482 1081852 1082515 1086087
58569A086087O703R901J3669J8075K2859K7657L1768L4611L6388L7370L6880L4295
$$ 1086087 1092790 1102691 1116360 1134435 1157294 1184951 1216719 1251330 1287718 1325088 1361968 1396263
58557A396263L0561K7100K3619J8793J2839P332K515l004r589j5767k0502k4372
$$ 1396263 1426824 1453924 1477543 1496336 1509175 1516507 1519022 1516018 1506429 1490662 1470160 1445788
58545A445788k7885l0468l1789l2535l3190l3380l2872l2022l0860k9009k6692
$$ 1445788 1417903 1387435 1355646 1323111 1289921 1256541 1223669 1191647 1160787 1131778 1105086
58534A105086k4577k2567k0043j7219j4880j2923j0695q546p304o476m750k201
$$ 1105086 1080509 1057942 1037899 1020680 1005800 992877 982182 973636 966332 959856 955106 952905
58522I52905j22J220K737M478N453N545N599N554M604L219K891L642M003L640
$$ 952905 952783 954003 956740 961218 966671 972216 977815 983369 987973 991192 994083 997725 1001728 1005368
58508A005368L755M618M984M420L895L523J977j095m144o020p237q325q861q784
$$ 1005368 1009123 1013741 1018725 1023145 1027040 1030563 1032540 1031445 1027301 1021281 1014044 1005719 996858 988074
58494I88074q812q837p690n178k661j005M06K221M348O877J0063J3233J5515J7598
$$ 988074 979262 970425 962735 957557 954896 953891 954297 956518 960866 967743 977806 991039 1006554 1024152
58480A024152K0704K3902K4819K3076K0515J7870J3935Q438K835k304p956j3908
$$ 1024152 1044856 1068758 1093577 1116653 1137168 1155038 1168973 1177411 1180246 1177942 1169986 1156078
58468A156078j8188k0184k1534k2956k2956k0895j8452j6660j4115r744m951j307
$$ 1156078 1137890 1117706 1096172 1073216 1050260 1029365 1010913 994253 980138 970394 965443 964136
58456I64136J619M499O485O906O812P112O891N088K288m70l161n846p772q469
$$ 964136 965755 970254 976739 983645 990457 997569 1004460 1009548 1011836 1011366 1008205 1002359 994587 986118
58442I86118q297p195m674j551L47R16K003M173N650N425M934N557O796Q089J0082
$$ 986118 977821 970626 965952 964401 964748 965664 967667 971840 977490 982915 987849 993406 1000202 1008291 1018373
58427A018373J2819J4973J6153J7717K0063K1393K0483J8469J6694J5157J4179
$$ 1018373 1031192 1046165 1062318 1080035 1100098 1121491 1141974 1160443 1177137 1192294 1206473
58416A206473J5013J7323J8427J6502J2331O729j012j0570j9150k4443k6833k7288
$$ 1206473 1221486 1238809 1257236 1273738 1286069 1292798 1291786 1281216 1262066 1237623 1210790 1183502
58404A183502k5513k1802j8127j5554j2849r238o094m387k941r54L08K6n48o75
$$ 1183502 1157989 1136187 1118060 1102506 1089657 1080419 1074325 1069938 1066997 1066043 1066351 1066377 1065829 1065154
58390A065154j672m087o010o134n830o234n995m029j807o43O85L304N789O563
$$ 1065154 1063482 1059395 1053385 1047251 1041421 1035187 1029192 1025163 1023356 1022713 1023398 1026702 1032491 1039054
58376A039054O435O499N925M069K414K199K454K382L204N622Q040R317J0646J2670
$$ 1039054 1045489 1051988 1057913 1061982 1064396 1066595 1069049 1071431 1074635 1080257 1088297 1097614 1108260 1120930
58362A120930J3666J2761J1939J2501J2590J0724Q647P958P028M164R75m36q17
$$ 1120930 1134596 1147357 1159296 1171797 1184387 1195111 1203758 1211716 1218744 1222908 1223883 1223447 1222630
58349A222630j497j539r0J312J629K700N833Q992J0340J1509J4288J7179J8418
$$ 1222630 1221133 1219594 1219504 1220816 1222445 1225145 1230978 1239970 1250310 1261819 1276107 1293286 1311704
58336A311704J9224K0813K1433J9812J8134J7956J6715J2231P248N091M182J467
$$ 1311704 1330928 1351741 1373174 1392986 1411120 1429076 1445791 1458022 1465270 1470361 1474543 1476010
58324A476010j783k432j110l79K31K512N073N408M672N786Q437J0248J1176J2709
$$ 1476010 1474227 1471795 1470685 1470306 1470537 1473049 1478122 1483530 1488202 1493988 1502425 1512673 1523849 1536558
58310A536558J4392J5125J6003J8121J9673J8960J7874J8662J9824J9096J7692
$$ 1536558 1550950 1566075 1582078 1600199 1619872 1638832 1656706 1675368 1695192 1714288 1731980
58299A731980J7549J7276J5096J2858J2789J3319J2495J2222J4497J6892J6626
$$ 1731980 1749529 1766805 1781901 1794759 1807548 1820867 1833362 1845584 1860081 1876973 1893599
58288A893599J5750J7214J9343J9604K0074K3497K7423K8266K7739K9287L1572
$$ 1893599 1909349 1926563 1945906 1965510 1985584 2009081 2036504 2064770 2092509 2121796 2153368
58277B153368L1775L1801L4651L8144L8979L9592M3881M9617N2373N3679N7723
$$ 2153368 2185143 2216944 2251595 2289739 2328718 2368310 2412191 2461808 2514181 2567860 2625583
58266B625583O3153O5985O7563P1595P6141P6621P4088P2398P0110O3605N5421
$$ 2625583 2688736 2754721 2822284 2893879 2970020 3046641 3120729 3193127 3263237 3326842 3382263
58255C382263N0960M9482M7033M5357M8833N5430N9903O3374P0392P9326Q5321
$$ 3382263 3433223 3482705 3529738 3575095 3623928 3679358 3739261 3802635 3873027 3952353 4037674
58244D037674Q9947R8013J07683J13934J18822J27729J38539J45562J51005J61062
$$ 4037674 4127621 4225634 4333317 4447251 4566073 4693802 4832341 4977903 5128908 5289970
58234E289970J73855J83234J91260K04322K20208K32292K43322K61104K83713
$$ 5289970 5463825 5647059 5838319 6042641 6262849 6495141 6738463 6999567 7283280
58225G283280L03419L22058L47361L77314M04361M31821M69154N14013N56985
$$ 7283280 7586699 7908757 8256118 8633432 9037793 9469614 9938768 10452781 11009766
58216A1009766O01033O57134P23740P90946Q62237R50523J055512J168211J295044
$$ 11009766 11610799 12267933 12991673 13782619 14644856 15595379 16650891 17819102 19114146
58207A9114146J452568J641337J852555K098422K406608K787873L243232L801948
$$ 19114146 20566714 22208051 24060606 26159028 28565636 31353509 34596741 38398689
58199C8398689M515404N413546O507225P833331R454478J1421022J3792459J6692479
$$ 38398689 42914093 48327639 54834864 62668195 72122673 83543695 97336154 114028633
58191A14028633K0265214K4564945K9550900L5108202M0765411M5167609M6029141
$$ 114028633 134293847 158858792 188409692 223517894 264283305 309450914 355480055
58184C55480055M1127653K9794915J3638498m127003k0120484l1962254l8700251
$$ 355480055 396607708 426402623 440041121 435914118 415793634 383831380 345131129
58177C45131129m0655233l8962994l5004441k9939310k4536826j9287193j4590776
$$ 345131129 304475896 265512902 230508461 200569151 176032325 156745132 142154356
58170A42154356j0844672q379300p302855p383972q107412q901073r364048r340253
$$ 142154356 131309684 122930384 115627529 108243557 100136145 91235072 81871024 72530771
58162G2530771q858489q050690p088234o117310n215911m409362l711294l130555
$$ 72530771 63672282 55621592 48533358 42416048 37200137 32790775 29079481 25948926
58154B5948926k654645k258311j928453j661770j444459j256613j093527r62270
$$ 25948926 23294281 21035970 19107517 17445747 16001288 14744675 13651148 12688878
58146A2688878q59405p70973o92383o29702n82059n39750m99463m65592m36630
$$ 12688878 11829473 11058500 10366117 9736415 9154356 8614606 8115143 7649551 7212921
58137G212921m04984l70281l39050l11606k82294k52074k27713k08923j89167
$$ 7212921 6807937 6437656 6098606 5787000 5504706 5252632 5024919 4815996 4626829
58128D626829j69059j56395j52537j50659j47803j47161j47876j44148j35537
$$ 4626829 4457770 4301375 4148838 3998179 3850376 3703215 3555339 3411191 3275654
58119C275654j27699j21869j13600j02680r4283q9373q3457p5910p1215o9950
$$ 3275654 3147955 3026086 2912486 2809806 2715523 2626150 2542693 2466783 2395568 2325618
58109B325618o7508o2897o0112n9759n7802n3658n1283n1163m9386m5604m3838
$$ 2325618 2258110 2195213 2135101 2075342 2017540 1963882 1912599 1861436 1812050 1766446 1722608
58098A722608m4301m2500l7726l4508l4147l2592k8389k5108k3975k1408j6064
$$ 1722608 1678307 1635807 1598081 1563573 1529426 1496834 1468445 1443337 1419362 1397954 1381890
58087A381890j1498r655q113n886n739q676j1913j4233j7757k2737k6168k7162
$$ 1381890 1370392 1360737 1352624 1346738 1340999 1332323 1320410 1306177 1288420 1265683 1239515 1212353
58075A212353k8300l0235l0296k7905k5909k5198k3323j9842j7645j7520j6635
$$ 1212353 1184053 1153818 1123522 1095617 1069708 1044510 1021187 1001345 983700 966180 949545
58064I49545j3904j1771j1204j0033p663o389o650n932l823l162m716n634m696
$$ 949545 935641 923870 912666 902633 894970 888581 881931 875999 872176 869014 864298 858664 853968
58051H53968m225n357o249o405p840j0446j1167r448q547r760j0330q973q404
$$ 853968 849743 844386 838137 831732 823892 813446 802279 792831 784284 774524 764194 755221 746817
58038G46817j0092j1319j0018q084p428o946n800n641p118q054p452p511r356
$$ 746817 736725 725406 715388 707304 699876 692930 687130 681489 674371 666317 658865 651354 641998
58025F41998j0584r496q060q175q478p377n964n522n163m159l607l808l051r64
$$ 641998 631414 621918 613858 605683 597205 589828 583864 578342 573179 569020 565413 561605 558554 557590
58011E57590J94n08q16N88J557M84o27K99J827J807R84J057J599J514J516K589
$$ 557590 557784 557276 556460 557048 558605 559089 558462 558761 560588 562395 563379 564436 566035 567549 569065 571654
57995E71654L978M826N936P952R741J0399J0851J1760J1915J0382Q207O383M222
$$ 571654 575632 580458 586394 594346 604087 614486 625337 637097 649012 659394 667601 673984 678206
57982F78206J346r53j973l027m982o465o196n013m018k842j244l35n99p87j67
$$ 678206 679552 678599 676626 673599 668617 662152 655956 650943 646925 644083 642839 642504 641905 641118 640951
57967F40951J36n60j124q92r91j983k510j812j208j519j475m22j50k036m627o012
$$ 640951 641087 640527 639403 638511 637520 635537 633027 631215 630007 628488 627013 626591 626441 624405 619778 613766
57951F13766o466o880o662n298m062m055m218l133j255M42K282M668O701P756
$$ 613766 607300 600420 593758 588460 584398 580343 576125 572992 571737 572179 574461 579129 585830 593586
57937E93586Q863J0891J2943J4049J4871J6200J7382J7616J7192J6135J3464R110
$$ 593586 602449 613340 626283 640332 655203 671403 688785 706401 723593 739728 753192 762302
57925G62302M793J577j478m908p309p836q136r831j1970j2894j2928j3311j3940
$$ 762302 767095 768672 767194 762286 754977 747141 739005 729174 717204 704310 691382 678071 664131
57912F64131j4043j3747j3353j2381j0748r548r377r333q837q695r236r362q625
$$ 664131 650088 636341 622988 610607 599859 590311 580934 571601 562764 554069 544833 535471 526846
57899E26846q259q806q889p764o813o905o594m758k724j764q03J286L233L573
$$ 526846 518587 509781 500892 493128 486315 479410 472816 468058 465334 463570 462767 464053 467286 470859
57885D70859L240L670M110L318K160K008K071Q28j184k416k869l486m160m403
$$ 470859 474099 477769 481879 485197 487357 489365 491436 492264 491080 488664 485795 482309 478149 473746
57871D73746m716n397n324l824k260j835j503r9J299J398J302K573M407N358O295
$$ 473746 469030 463633 458309 454485 452225 450390 448887 448788 450087 451485 452787 455360 459767 465125 471420
57856D71420Q757J1742J3090J2987J3145J3499J2638J0856R839R763R234P694
$$ 471420 480177 491919 505009 517996 531141 544640 557278 568134 577973 587736 596970 604664
57844F04664N615K924l88k849l108k363k803m330n304n711o891q546q903p662
$$ 604664 610279 613203 612815 609966 606858 604495 601692 597362 592058 586347 579456 570910 562007 554345
57830E54345o309n550m795m003l752l636k756j598j243j145P1J900K563K007J795
$$ 554345 548036 542486 537691 533688 529936 526300 523544 521946 520703 519558 519629 521529 524092 526099 527894
57815E27894K114J534q5j041n41L71J048K114L572M159L249J631k03k732n866
$$ 527894 530008 531542 531457 530416 529875 530246 531294 533408 536980 541139 544388 546019 545816 543084 537218
57800E37218q380r475r528q954p731o272n313m689l573k114j406j746k313k602
$$ 537218 528838 519363 509835 500881 493150 486878 481565 476876 473303 471189 469783 468037 465724 463122
57786D63122k832k892k351j516j081q02J79J760L076L971M850N332M786L894L855
$$ 463122 460290 457398 455047 453531 452450 451648 451827 453587 456663 460634 465484 470816 475602 479496 483351
57771D83351M244L511J562j38j105k425m516o357p369q247r347r941r697r373
$$ 483351 487595 491106 492668 492530 491425 489000 484484 478127 470758 462511 453164 443223 433526 424153
57757D24153r379r047p951o658n663m753l882l581l991m516m654m317l327j672
$$ 424153 414774 405727 397776 391118 385455 380702 376820 373239 369248 364732 360078 355761 352434 350762
57743C50762j87J69l40p49j033j842k842k936k111j451j299r80m32m52j081j326
$$ 350762 350575 350744 350404 349655 348622 346780 343938 341002 338891 337440 336141 335161 334729 334277 333196 331870
57727C31870q18k55K7M89J138J265Q11N61Q18J082J184J327J117M2j119j089k57
$$ 331870 331052 330797 330824 331313 332451 333716 334527 335088 335906 336988 338172 339499 340616 340658 339539 338450 338193
57710C38193k13j074j370q03p86j655j661J41K144K574J991J917K480K821K734
$$ 338193 337980 336906 335536 334733 333947 332292 330631 330772 332916 335490 337481 339398 341878 344699 347433
57695C47433K575K376K130K186K505K393J696J349J929K702K927L165M317O184
$$ 347433 350008 352384 354514 356700 359205 361598 363294 364643 366572 369274 372201 375366 379683 385867
57681C85867P975R671J1955J5224J9382K4307L0027L6757M5009N5253O7477Q1546
$$ 385867 393842 403513 415468 430692 450074 474381 504408 541165 586174 641427 708904 790450
57669G90450R7928J16943J36898J53344J60115J50932J21519P2737J2386m7673
$$ 790450 888378 1005321 1142219 1295563 1455678 1606610 1728129 1800866 1813252 1765579
57659A765579r7322j31410j48767j50710j41034j25169j07569r0362p4663o1629
$$ 1765579 1668257 1536847 1388080 1237370 1096336 971167 863598 773236 698573 636944
57649F36944n1508m3153l5564k8945k3623j9168j5356j2762j1447j0224q246o325
$$ 636944 585436 542283 506719 477774 454151 434983 419627 406865 395418 385194 376948 370623
57637C70623n551n546n140m128l113k278j373o02n11j060j591j657j439j377j684
$$ 370623 365072 359526 354386 350258 347145 344867 343494 342892 342381 341321 339730 338073 336634 335257 333573
57622C33573k109k113j556j027j142j648j856j736j801k118k314k429k782l106
$$ 333573 331464 329351 327795 326768 325626 323978 322122 320386 318585 316467 314153 311724 308942 305836
57608C05836k856k225j846j578p87K92P67O34P39J203J284Q01L04j69r63j517
$$ 305836 302980 300755 298909 297331 296544 296836 297603 298237 298976 300179 301463 302264 302568 302399 301436 299919
57592B99919r31J15J0j112j383l27K99n27j541j600j459j875k034j340r66j918
$$ 299919 298988 299103 299113 298001 296618 296291 296590 296063 294522 292922 291463 289588 287554 286214 285248 283330
57576B83330l112l090k278j929k002j794j537j765j978j487q05p14q22m11Q1k04
$$ 283330 280218 277128 274850 272921 270919 269125 267588 265823 263845 262358 261553 260839 260017 259606 259687 259483
57560B59483r93j375j188p15K10J623K706K831K573K563K342J524J000J559K333
$$ 259483 258490 257115 255927 255212 255422 257045 259751 262582 265155 267718 270060 271584 272584 274143 276476
57545B76476K128J439J520K216K525K591L318M435M737L988K948J747j33k355
$$ 276476 278604 280043 281563 283779 286304 288895 292213 296648 301385 305373 308321 310068 309935 307580
57531C07580l812m272m480m620m105l000k298k469k892k958k703k228j393l61
$$ 307580 303768 299496 295016 290396 286291 283291 280993 278524 275632 272674 269971 267743 266350 265989
57517B65989L82O57O36K97m12j023r33l15N4k00p96j335j473q95J51O91J26q03
$$ 265989 266371 267028 267664 267961 267549 266526 265593 265278 265332 265132 264336 263001 261528 260633 260784 261475 261601 260798
57499B60798r54l55L7j80n28o12n45m76l89l56m16l58o5K67N32Q89J136O65m33
$$ 260798 259844 259489 259526 259346 258818 258206 257661 257185 256796 256440 256024 255666 255601 255868 256400 257289 258425 259090 258657
57480B58657j056n63K57M97M51P04Q79M21j80k27j31n68j041o47L32R93J396K085
$$ 258657 257601 257038 257295 257792 258243 258947 259826 260247 260067 259840 259709 259141 258100 257453 257785 258778 260174 262259
57462B62259K613K157J275J374K588L642L777L366K758J969J479J797K193J378
$$ 262259 264872 267029 268304 269678 272266 275908 279685 283051 285809 287778 289257 291054 293247 294625
57448B94625m62j658j315k88L33M52M59O09J121J923K231J417K48PN51N85j30
$$ 294625 294163 292505 291190 290902 291235 291687 292146 292755 293876 295799 298030 299447 299695 299702 300253 300838 300708
57431C00708m05L22J110J126P54N30K57k18m20r3K74K40m8m25r25j177o43L17
$$ 300708 300303 300625 301735 302861 303615 304145 304402 304184 303764 303671 303945 304185 304137 303712 302787 301610 300967 301284
57413C01284O64K80J72P59J213R62N98O06M55k17o28m8Q73R99K62n98j204j526
$$ 301284 301948 302228 302400 303159 304372 305334 305932 306538 306993 306776 306148 306100 306973 307972 308234 307636 306432 304906
57395C04906j224o1J270J659R22k0l17j1L94P26J236K030K676K678K238K086K349
$$ 304906 303682 303621 304891 306550 307472 307452 307135 307124 307518 308244 309480 311510 314186 316864 319102 321188 323537
57378C23537K307J673J394K241L292L033J625O76Q79J262J038O86P34P50L75K19
$$ 323537 325844 327517 328911 331152 334444 337477 339102 339778 340657 341919 342957 343643 344377 345127 345502 345721
57362C45721Q90J868K190J683P95k14j226j790j447l18J004J962K256J911J384
$$ 345721 346611 348479 350669 352352 353147 352933 351707 349917 348470 348152 349156 351118 353374 355285 356669
57347C56669J233J479J667J635J686J957K169K166K145K126J853J333R78R90J199
$$ 356669 357902 359381 361048 362683 364369 366326 368495 370661 372806 374932 376785 378118 379096 380086 381285
57332C81285J504J931K190J943J538J682K261K399J861J441J675K110K271K357
$$ 381285 382789 384720 386910 388853 390391 392073 394334 396733 398594 400035 401710 403820 406091 408448
57318D08448K517K286J532J089J699K853L418L064K463K286K524K621K053J010
$$ 408448 410965 413251 414783 415872 417571 420424 423842 426906 429369 431655 434179 436800 438853 439863
57304D39863M80J186K440K803J968J155J433K487L432L957M155L993L609L498
$$ 439863 440343 441529 443969 446772 448740 449895 451328 453815 457247 461204 465359 469352 472961 476459
57290D76459L848M183M127L936L913L924L913M284N239O299O924P055O765O031
$$ 476459 480307 484490 488617 492553 496466 500390 504303 508587 513826 520125 527049 534104 540869 546900
57276E46900N242N125N611N618M600L432L058L064K594J897J898K647L361L702
$$ 546900 552142 557267 562878 568496 573096 576528 579586 582650 585244 587141 589039 591686 595047 598749
57262E98749M014M321M151L430K817K931L735M719N358N370M992M875N336N893
$$ 598749 602763 607084 611235 614665 617482 620413 624148 628867 634225 639595 644587 649462 654798 660691
57248F60691N920N577N589O146O644O555O106N972O485P365Q048Q235Q141Q260
$$ 660691 666611 672188 677777 683923 690567 697122 703228 709200 715685 723050 731098 739333 747474 755734
57234G55734Q863R773J0531J0729J0405J0160J0587J1403J1608J0905J0387J1096
$$ 755734 764597 774370 784901 795630 806035 816195 826782 838185 849793 860698 871085 882181
57222H82181J2435J3049J2829J2831J3329J3427J2824J2553J3274J4156J4188
$$ 882181 894616 907665 920494 933325 946654 960081 972905 985458 998732 1012888 1027076
57211A027076J3671J3485J3735J4009J4393J5346J6902J8707K0351K1356K1307
$$ 1027076 1040747 1054232 1067967 1081976 1096369 1111715 1128617 1147324 1167675 1189031 1210338
57200A210338K0642K0535K1445K2407K2438K1963K2054K2833K3558K3894K4193
$$ 1210338 1230980 1251515 1272960 1295367 1317805 1339768 1361822 1384655 1408213 1432107 1456300
57189A456300K4728K5390K6045K6711K7464K8470K9832L1170L1894L2127L2690
$$ 1456300 1481028 1506418 1532463 1559174 1586638 1615108 1644940 1676110 1708004 1740131 1772821
57178A772821L3756L4400L4017L3376L3401L3638L2923L1088K9075K7702K7197
$$ 1772821 1806577 1840977 1874994 1908370 1941771 1975409 2008332 2039420 2068495 2096197 2123394
57167B123394K7646K8945L0454L1452L1905L2303L2890L3560L4196L4628L4575
$$ 2123394 2151040 2179985 2210439 2241891 2273796 2306099 2338989 2372549 2406745 2441373 2475948
57156B475948L4035L3471L3176L2951L2782L3212L4490L5949L6849L7206L7208
$$ 2475948 2509983 2543454 2576630 2609581 2642363 2675575 2710065 2746014 2782863 2820069 2857277
57145B857277L6563L5290L4470L5174L7167L9461M1726M4173M6514M8081M8714
$$ 2857277 2893840 2929130 2963600 2998774 3035941 3075402 3117128 3161301 3207815 3255896 3304610
57134C304610M8678M8027M6854M5732M5019M4135M2483M0633L9657L9693M0269
$$ 3304610 3353288 3401315 3448169 3493901 3538920 3583055 3625538 3666171 3705828 3745521 3785790
57123C785790M1613M4551M9336N5684O3680P3500Q4355R4825J04168J12331J19066
$$ 3785790 3827403 3871954 3921290 3976974 4040654 4114154 4198509 4293334 4397502 4509833 4628899
57112D628899J24273J29241J36265J47035J62354J83266K11027K45730K86145
$$ 4628899 4753172 4882413 5018678 5165713 5328067 5511333 5722360 5968090 6254235
57103F254235L31392L82163M40433N09155N92348O94365Q18404R65968J137345
$$ 6254235 6585627 6967790 7408223 7917378 8509726 9204091 10022495 10988463 12125808
57094A2125808J331874J548375J786567K047513K330636K629383K930032L213968
$$ 12125808 13457682 15006057 16792624 18840137 21170773 23800156 26730188 29944156
57086B9944156L459836L643467L735504L696964L478647L038115K377142J571831
$$ 29944156 33403992 37047459 40782963 44479927 47958574 50996689 53373831 54945662
57078E4945662P54471M4297n19651r84369j426544j889749k364347k808498l176758
$$ 54945662 55700133 55744430 55224779 54240410 52813866 50924117 48559770 45751272 42574514
57069D2574514l435184l566056l570043l464863l277839l036582k764105k479011
$$ 42574514 39139330 35573274 32003231 28538368 25260529 22223947 19459842 16980831
57061A6980831k196644j928669j682138j459634j260770j084029r28177p92583
$$ 16980831 14784187 12855518 11173380 9713746 8452976 7368947 6440770 5648187
57053E648187o76539n78549m96426m27829l70514l22436k82173k49148k22811
$$ 5648187 4971648 4393099 3896673 3468844 3098330 2775894 2493721 2244573 2021762
57044B021762k01622j83383j66576j50831j36043j21969j08893r7706q8633q0563
$$ 2021762 1820140 1636757 1470181 1319350 1183307 1061338 952445 854739 766106 685543
57034F85543p2304o3955n6360m9769m3750l7997l2352k6413j9981j3565p685j845
$$ 685543 613239 549284 492924 443155 399405 361408 329056 302643 282662 269097 261412 259567
57022B59567M990J3318K3254L5481N1063P0313R2262J14263J30772J33462J15349
$$ 259567 264557 277875 301129 336610 387673 457986 550248 664511 795283 928745 1044094
57011A044094P6505K5287k6497o9477r8996j14423j18049j13765j05170r4337
$$ 1044094 1120599 1145886 1119389 1049912 950916 836493 718444 604679 499509 405172
57001D05172q2283o9945n8260m7884l9287l2735k7789k3346E028h737r433n885
$$ 405172 322889 252944 194684 146800 107513 74778 46989 23643 5028 -8737 -18170 -24055
56989b4055l005n24K038N268R351B885J7827K0362K0266J6802J0464K803m668
$$ -24055 -27060 -27584 -25546 -20278 -10927 2885 20712 41074 61340 78142 88606 91409 86741
56976H6741j0988j5354j7129j6642A1404b480j2438j0282p464m550j802R08L712
$$ 86741 75753 60399 43270 26628 11404 -2480 -14918 -25200 -32664 -37214 -39016 -38108 -34396
56963c4396O645R773d951A1194J9028K1953K5152K7991K8734K5351J7063N425
$$ -34396 -27751 -17978 -4951 11194 30222 52175 77327 105318 134052 159403 176466 181891
56951A81891o390j5806k2110k5592k6277k4313k0920j7660G887d228q975n845
$$ 181891 175501 159695 137585 111993 85716 61403 40483 22823 7887 -4228 -13203 -19048
56939a9048k580J385N770d847H153J7174K2791K8987L4652L9203M1337L8530K9113
$$ -19048 -21628 -20243 -14473 -4847 8153 25327 48118 77105 111757 150960 192297 230827 259940
56926B59940J4389k162j7123k8241l4496l6400l5671l3620l0229k5429A0553f031
$$ 259940 274329 272167 255044 226803 192307 155907 120236 86616 56387 30958 10553 -6031
56913a9994j1526r053p229o159m986l163j209M2M22M80R29K077L446M105L798
$$ -19994 -31520 -40573 -47802 -53961 -58947 -62110 -63319 -63277 -62855 -62375 -61446 -59369 -55923 -51818 -48020
56898d8020L500M384O422Q555J0090c710I306J5194J7535J9799K2190K5180K8772
$$ -48020 -44520 -40136 -33714 -25159 -15069 -3710 9306 24500 42035 61834 84024 109204 137976
56885A37976L1843L2502K9367K2519J3169K834p043j5127k0459k2705k2060j9146
$$ 137976 169819 202321 231688 254207 267376 270210 263167 248040 227581 204876 182816 163670
56873A63670j5028j0860p150l543M64M907R524J4292J9532K5711L3150M1719N0731
$$ 163670 148642 137782 130632 127089 127553 132460 141984 156276 175808 201519 234669 276388 327119
56860C27119N9336O6619P0772O8650N7446L7363J2140j3116l4145m8184n4280
$$ 327119 386455 453074 523846 592496 649942 687305 699445 686329 652184 604000 549720
56849E49720n3799m9569m3621l6213k7289j7773q659J65R287J8767K8627L9580
$$ 549720 495921 446352 402731 366518 339229 321456 312797 312962 322249 341016 369643 409223
56837D09223N2239O6186Q0706R5561J09522J18384J16083R8474O6075K3832k0696
$$ 409223 461462 527648 608354 703915 813437 931821 1047904 1146378 1212453 1236285 1215589
56826A215589n9513q6741j00649j03397r8664q9456p7637o4481n1069l8287k6630
$$ 1215589 1156076 1069335 968686 865289 766625 677169 599532 535051 483982 445695 419065
56815D19065j6022n942M204J4826K6194L8328N0873O3297P4866Q3566Q5269P5476
$$ 419065 403043 397101 401305 416131 442325 480653 531526 594823 669689 753255 838524 914000
56803I14000N2874K0973j3898m5570o9406q2879q6399q2942p5704o6319n5593
$$ 914000 966874 987847 973949 928379 858973 776094 689695 606753 531049 464730 409137
56792D09137m4808l5110k6424j8200j0646m108K099Q973J6304K3241K9978L7232
$$ 409137 364329 329219 302795 284595 273949 269841 271940 280913 297217 320458 350436 387668
56780C87668M3882M6531M1998K9722J1862p986k5984l9307m7090n0151m9734m6778
$$ 387668 431550 478081 520079 549801 561663 553677 527693 488386 441296 391145 341411 294633
56768B94633m2098l6547l0871k5702k1488j8126j5023j1996r702q559p871o704
$$ 294633 252535 215988 185117 159415 137927 119801 104778 92782 83080 74521 66650 59946
56756E9946n196m132l655l371l362l951m607m223k686j173p39j241j809j759j009
$$ 59946 54750 50618 46963 43592 40230 36279 31672 27449 24763 23590 22851 21610 19801 18042 17033
56741A7033j28O6n77j234j132n29r5J49N07P45N19K58O19J287J421R97O90O43
$$ 17033 16905 16971 16394 15160 14028 13499 13404 13553 14060 14805 15324 15582 16201 17488 18909 19906 20596 21239
56723B1239M51K74P16J604K005J636J224J337J754K061K030J417K88m81m5J148
$$ 21239 21690 21964 22680 24284 26289 27925 29149 30486 32240 34301 36331 37748 38036 37555 37510 38658
56707C8658J869J812J683J734J483R50P94J002P74N8j44N02R17K86o57q40l79
$$ 38658 40527 42339 44022 45756 47239 48189 48983 49985 50759 50817 50673 51175 52092 52378 51721 50881 50502
56690E0502r0k14m54p05j007j189j138j061j069q79k65N72J331J892K091J777
$$ 50502 50412 50198 49744 49039 48032 46843 45705 44644 43575 42696 42431 43003 44334 46226 48317 50094
56674E0094J200Q24O44K88j59j31M07P65N25P3j14l0K54Q08J457J780J785J840
$$ 50094 51294 52118 52762 53050 52891 52760 53167 53932 54457 54530 54416 54386 54640 55448 56905 58685 60470 62310
56656F2310J854J276J58o01l59N38J426K016K187J853J342J246J609J890J962
$$ 62310 64164 65440 65598 64997 64638 65176 66602 68618 70805 72658 74000 75246 76855 78745 80707
56641H0707K271K843K941K147J001J96k51o13r01j085j241j234q11k04k2k98l42
$$ 80707 82978 85821 88762 90909 91910 92106 91855 91242 90341 89256 88015 86781 85970 85766 85744 85446 85104
56624H5104K08R24J385J658J704J189K22m39l62K6J83J14Pj19j28K27P46R18P53
$$ 85104 85312 86236 87621 89279 90983 92172 92394 91955 91593 91619 91802 91916 91923 91804 91676 91903 92649 93567 94320
56605I4320Q26J301J661J579J259Q12N8q74j614k193k847l103k229n73O46R81
$$ 94320 95146 96447 98108 99687 100946 101758 101816 100942 99328 97135 94288 91185 88956 88383 89029 90010
56589I0010R66O87l01j415j156O02K014J777P84M20O04O82Q48J482K062K039J889
$$ 90010 90976 91663 91362 89947 88791 89393 91407 93184 93968 94388 94992 95674 96522 98004 100066 102105 103994
56572A03994K175K431K163K132L376N549P362Q230Q514Q651R044J0287J2566J5086
$$ 103994 106169 108600 110763 112895 116271 121820 129182 137412 145926 154577 163621 173908 186474 201560
56558B01560J6886J7766J7902J7163J5590J3859J2571J1599J0764J0369J0350
$$ 201560 218446 236212 254114 271277 286867 300726 313297 324896 335660 346029 356379
56547C56379R727P823N378L514K288J065l17j655l096m810o459p757r038j0575
$$ 356379 366106 373929 379307 382821 385109 386174 385857 384202 381106 376296 369837 362080 353042 342467
56533C42467j1945j2743j3210j3526j3237j2183j1088j0515j0003r111q351q134
$$ 342467 330522 317779 304569 291043 277806 265623 254535 244020 234017 224906 216555 208421
56521B08421p851p018o324o329o101m656k911k609l732m576m113k863j674q97
$$ 208421 200570 193552 187228 180899 174798 170142 167231 164622 160890 156314 152201 149338 147664 146767
56507A46767p15j160j753j959j882j831j641j159q22r70j190j184j494k355k730
$$ 146767 146052 144892 143139 141180 139298 137467 135826 134667 133845 132875 131685 130501 129007 126652 123922
56492A23922j769m43k43q75q11K75J208J284J075J192J483J534J033j80j649k203
$$ 123922 122153 121710 121467 120592 119781 120056 121264 122548 123623 124815 126298 127832 128865 128685 127036 124833
56476A24833j382l78n01j252j177j47O67P81Q40J188J372J121O31o7r37j293n08
$$ 124833 123451 123073 122572 121320 120143 119996 120663 121444 122284 123472 124844 125965 126596 126529 125592 124299 123791
56459A23791Q28J554J596J832K499K966K903K530J833P10k84n26m11p64j394j418
$$ 123791 124619 126173 127769 129601 132100 135066 137969 140499 142332 143042 142758 142232 141821 141057 139663 138245
56443A38245p10J61J070K051K365J386J07R7J137J593J047O96J079J288Q71O88
$$ 138245 137535 137696 138766 140817 143182 144568 144675 144772 145909 147502 148549 149245 150324 151612 152483 153171
56427A53171J238J709J477J185J515J971J716P93j02m49j72L82N36J9m46p9O72
$$ 153171 154409 156118 157595 158780 160295 162266 163982 164775 164673 164224 164052 164434 164970 164989 164543 164464 165136
56410A65136P16J0n26o04q50j398j575j123o24m67m35m42o00n76R8R98J268R84
$$ 165136 165852 165862 165336 164732 163882 162484 160909 159786 159162 158695 158260 157818 157218 156642 156740 157738 159006 159990
56392A59990R53J181R67M54O98J929L112L498L407L245K916K453K169J995J660
$$ 159990 160943 162124 163091 163545 164243 166172 169284 172782 176189 179434 182350 184803 186972 188967 190627
56377A90627J514K028K697K629K051J850J828J088j9k07M29L53q64j824j626j048
$$ 190627 192141 194169 196866 199495 201546 203396 205224 206312 206293 206086 206515 206868 206004 204180 202554 201506
56361B01506p58k21P85J221M23o58q33k06M41Q16R94J089J508K524L339K806J270
$$ 201506 200748 200527 201312 202533 202956 202298 201465 201259 201700 202516 203510 204599 206107 208631 211970 214776 216046
56344B16046L07L93L84k71n63J64J019J176J177J650K117K032J888K209K536K285
$$ 216046 216353 216746 217130 216859 216296 216460 217479 218655 219832 221482 223599 225631 227519 229728 232264 234549
56328B34549J690J152N91O8N9M89N63J21L5P16J316J116N53L13M00P00J336J980
$$ 234549 236239 237391 237982 238050 238109 238598 239161 239282 239317 240033 241349 242465 243018 243331 243731 244431 245767 247747
56310B47747J892J146P51J120J593J840K438L606M668N243N737O165N849M713
$$ 247747 249639 250785 251536 252656 254249 256089 258527 262133 266801 272044 277781 283946 289795 294508
56296B94508L576K744J696M59k09l09o13q75J28K268L694L455K629K212J905J736
$$ 294508 298084 300828 302524 302983 302774 302465 301852 300977 301105 303373 307067 310522 313151 315363 317268 319004
56280C19004K630M389N210M497M003M874N716N172M347M817N961O284N981O246
$$ 319004 321634 326023 331233 335730 339733 344607 350323 355495 359842 364659 370620 376904 382885 389131
56266C89131P219Q376R851J1732J3151J3622J4284J6282J8950K1108K3056K5760
$$ 389131 396350 404726 414577 426309 439460 453082 467366 483648 502598 523706 546762 572522
56254E72522K8994L1860L4315L6873L9564M2392M5918N0223N4177N6888N8869
$$ 572522 601516 633376 667691 704564 744128 786520 832438 882661 936838 993726 1052595
56243A052595O0683O1532O0367N7367N3229M7917M1143L3111K3948J3599K919
$$ 1052595 1113278 1174810 1235177 1292544 1345773 1393690 1434833 1467944 1491892 1505491 1508410
56232A508410o505j4453k2302l0407l7103m1348m4367m7302m9362m9774m9617
$$ 1508410 1501905 1487452 1465150 1434743 1397640 1356292 1311925 1264623 1215261 1165487 1115870
56221A115870m9789m9191m6790m3827m1817m0020l6962l3107k9861k7251k4702
$$ 1115870 1066081 1016890 970100 926273 884456 844436 807474 774367 744506 717255 692553
56210F92553k2794k2133k1593j9832j7485j5947j4955j3378j1354r699q193o310
$$ 692553 669759 647626 626033 606201 588716 572769 557814 544436 533082 523383 515190 508880
56198E08880m681m051l727k776j657j074m93N46J095N43J42Q61J373K88j172j115
$$ 508880 504199 500148 496421 493645 491988 490914 490421 490967 492062 492605 492747 493608 494981 495269 494097 492982
56182D92982q9J64k65k21J8l69n03R07K867L379K600K265K695K788K411K462L109
$$ 492982 492893 493057 492792 492571 492589 492220 491717 492624 495491 498870 501470 503735 506430 509218 511629 514091 517200
56165E17200L978N368P384Q846Q980Q985J0000J0957J0597J0058J0942J2370J2733
$$ 517200 521178 526546 533930 542776 551756 560741 570741 581698 592295 602353 613295 625665 638398
56152F38398J2849J4444J6796J8016J8540K0241K3025K5567K8525L3727M0731
$$ 638398 651247 665691 682487 700503 719043 739284 762309 787876 816401 850128 890859
56141H90859M7434N3768O1725P2082Q3963R7248J12596J29184J44978J58599J68555
$$ 890859 938293 992061 1053786 1125868 1209831 1307079 1419675 1548859 1693837 1852436 2020991
56130B020991J71593J65014J50222J31484J11929R3348P8426O9360O4507N9531
$$ 2020991 2192584 2357598 2507820 2639304 2751233 2844581 2923007 2992367 3056874 3116405
56120C116405N1733M0800K6460Q943q816k2860l2245l8884m4370n0088n9279p5089
$$ 3116405 3168138 3208938 3235398 3244341 3235525 3212665 3180420 3141536 3097166 3047078 2987799 2912710
56108B912710r6377j18483j37761j52561j60871j60866j53716j42594j29076j13325
$$ 2912710 2816333 2697850 2560089 2407528 2246657 2085791 1932075 1789481 1660405 1547080
56098A547080r6966q2390o9754n7857m7227l9123l2552k5773j9651j5992j3726
$$ 1547080 1450114 1367724 1297970 1240113 1192886 1153763 1121211 1095438 1075787 1059795 1046069
56087A046069j0607p312n744m682j702J853K812K007K972N662O907O608P772J0576
$$ 1046069 1035462 1028150 1022406 1017724 1016022 1017875 1020687 1022694 1025666 1031328 1038235 1044843 1052615 1063191
56073A063191J2094J2190J3931J7565J9709J9360J9259K0289J9832J6935J4001
$$ 1063191 1075285 1087475 1101406 1118971 1138680 1158040 1177299 1197588 1217420 1234355 1248356
56062A248356J2095R468N924L885L955L965L409M245O523P918Q200R452J1404
$$ 1248356 1260451 1269919 1275843 1279728 1283683 1287648 1291057 1295302 1301825 1309743 1317943 1327395 1338799
56049A338799J1661J0903J2403J5905J7678J7298J8426K1962K4514K4804K5529
$$ 1338799 1350460 1361363 1373766 1389671 1407349 1424647 1443073 1465035 1489549 1514353 1539882
56038A539882K7498K8106K7046K7485K9982L1295L0779L1729L4789L6451L5820
$$ 1539882 1567380 1595486 1622532 1650017 1679999 1711294 1742073 1773802 1808591 1845042 1880862
56027A880862L6472L9658M2072M2394M3458M6060M7121M6131M6711M9811N1994
$$ 1880862 1917334 1956992 1999064 2041458 2084916 2130976 2178097 2224228 2270939 2320750 2372744
56016B372744N2402N4393N8450O0839O1411O4922P2251P8161Q0398Q3056Q8250
$$ 2372744 2425146 2479539 2537989 2598828 2660239 2725161 2797412 2875573 2955971 3039027 3127277
56005C127277R2663R5203R9756J07271J13457J17301J23295J32341J39582J44199
$$ 3127277 3219940 3315143 3414899 3522170 3635627 3752928 3876223 4008564 4148146 4292345
55995D292345J51725J63451J73525J80038J88565K01125K12595K21878K35207
$$ 4292345 4444070 4607521 4781046 4961084 5149649 5350774 5563369 5785247 6020454
55986F020454K54077K71910K87180L07260L34361L61034L85017M14640M53620
$$ 6020454 6274531 6546441 6833621 7140881 7475242 7836276 8221293 8635933 9089553
55977I089553M95010N36414N85765O45420P07123P70186Q47047R42721J047769
$$ 9089553 9584563 10120977 10706742 11352162 12059285 12829471 13676518 14619239 15667008
55968A5667008J160601J296332J463585J655108J873389K142060K479298K886887
$$ 15667008 16827609 18123941 19587526 21242634 23116023 25258083 27737381 30624268
55960C0624268L381388M007712M803836N782336O965889Q408152J0164117J2288416
$$ 30624268 34005656 38013368 42817204 48599540 55565429 63973581 74137698 86426114
55952H6426114J4888097J8115085K2062209K6718326L2011955L7648510M2607924
$$ 86426114 101314211 119429296 141491505 168209831 200221786 237870296 280478220
55945B80478220M4852861M1990419L2732546J7983456N87761j6000232k9068312
$$ 280478220 325331081 367321500 400054046 418037502 418625263 402625031 373556719
55938C73556719l7297598m0724912m0320839l7423054l3243845k8644726k4166499
$$ 373556719 336259121 295534209 255213370 217790316 184546471 155901745 131735246
55931A31735246k0122382j6642299j3721119j1304208r339748p764671o493926
$$ 131735246 111612864 94970565 81249446 69945238 60605490 52840819 46346893
55924D6346893n453878m604763l916831l350107k872700k475506k152278j883175
$$ 46346893 40893015 36288252 32371421 29021314 26148614 23673108 21520830 19637655
55916A9637655j650612j453235j291284j153775j031372r26839q41863p67291
$$ 19637655 17987043 16533808 15242524 14088749 13057377 12130538 11288675 10521384
55908A0521384o96216o33318n81917n34626m85994m42021m07828l77549l45291
$$ 10521384 9825168 9191850 8609933 8075307 7589313 7147292 6739464 6361915 6016624
55899F016624l15271k92153k71584k48922k27918k12440j98533j82483j68171
$$ 6016624 5701353 5409200 5137616 4888694 4660776 4448336 4249803 4067320 3899149
55890C899149j58827j49860j37272j25199j17721j10897j00257q8879q0741p2884
$$ 3899149 3740322 3590462 3453190 3327991 3210270 3099373 2999116 2910237 2829496 2756612
55880B756612o1401m8849l8754k8663j5414j902P667J3837J7392J4218R70j8814
$$ 2756612 2695211 2646362 2607608 2578945 2563531 2561629 2569296 2583133 2600525 2614743 2615713 2596899
55868B596899l9702o0652q1280r7199j04918j06916j06653j03024r4711q5295
$$ 2596899 2557197 2496545 2415265 2318066 2213148 2106232 1999579 1896555 1801844 1716549
55858A716549p8612p3244o6606o0264n6226n2239m5946l9778l6733l5031l1823
$$ 1716549 1637937 1564693 1498087 1437823 1381597 1329358 1283412 1243634 1206901 1171870 1140047
55847A140047k8547k7734k7904k6453k4360k3630k3189k1517k0106k0194j9522
$$ 1140047 1111500 1083766 1055862 1029409 1005049 981419 958230 936713 916607 896413 876891
55836H76891j6450j3787j4244j5587j4633j2627j2182j2206j0612q905r322j0187
$$ 876891 860441 846654 832410 816823 802190 789563 777381 765175 754563 745658 736336 726149
55824G26149q878o885p203r039r637r221r652j0182q889o659n634n273l734j474
$$ 726149 717271 710386 703183 694144 684507 675286 665634 655452 646563 639904 634270 628997 625263 623789
55810F23789N3J509M058O528P492Q144R855J1061R995Q157P435O232K373k469
$$ 623789 623842 625351 629409 635937 643429 651573 661428 672489 682484 690641 698076 704308 706681 704212
55796G04212n409p402j1276j6397j9660k0522k0823k0712j8768j5417j2477r956
$$ 704212 698803 691401 680125 663728 644068 623546 602723 582011 563243 547826 535349 525393
55784E25393o732l523j955j531p79l37j635l514l519j755j67J142L595O917R412
$$ 525393 518661 515138 513183 511652 510873 510536 508901 505387 501868 500113 499946 501088 504683 511600 521012
55769E21012J0877J2129J2184R046K910m153j1095j7869k3226k5520k5310k4510
$$ 521012 531889 544018 556202 565248 568158 564005 552910 535041 511815 486295 460985 436475
55757D36475k3470k1332j8588j6578j5035j2744j0032q152o787m777k674k053
$$ 436475 413005 391673 373085 356507 341472 328728 318696 310544 303757 298980 296306 294253
55745B94253k652k736j901j274j267j303j213r72K17K506M050L211J199K29J76
$$ 294253 291601 288865 286964 285690 284423 283120 281907 280935 281152 283658 287708 290919 292118 292347 292523
55730B92523n52j857k355k071k121k423k232k206l341m606m293l028k761l359
$$ 292523 291971 290114 287759 285688 283567 281144 278912 276706 273365 268759 264466 261438 258677 255318
55716B55318k981j422k36J14O90J776K619L249M231M986M570L643L356K891P09
$$ 255318 252337 250915 250679 250793 251483 253259 255878 259127 263358 268344 272914 276557 279913 282804 283513
55701B83513k336l912l863m228n685o839o976o837o522n218l328k394k557k341
$$ 283513 281177 277265 273402 269174 263489 256650 249674 242837 236315 231097 227769 225375 222818 220477
55687B20477j286m93l63J02J299K344K755L019L315L382L635M594N313M299J905
$$ 220477 219191 218698 218335 218437 219736 222080 224835 227854 231169 234551 238186 242780 248093 252392 254297
55672B54297m6q85j413j899j822j503j779k136j296M03J389J525K155L513M431
$$ 254297 254251 253366 251953 250054 248232 246729 244950 242814 241518 241921 243310 244835 246990 250503 254934
55657B54934M744N550O788O935N596M135L184J691q65l410n157o688q398r559
$$ 254934 259678 265228 272016 278951 284547 288682 291866 293557 292692 289282 284125 277437 269039 259480
55643B59480r732r571r529r103p945o490n126l895l179l366l869l699k990k536
$$ 259480 249748 240177 230648 221545 213600 207110 201984 198089 194910 191544 187675 183976 180986 178450
55629A78450k169j231k80m48j242j110j29k0j273k402k465k229k407k587k479
$$ 178450 176281 175050 174770 174322 173080 171970 171841 171821 170548 168146 165681 163452 161045 158458 155979
55614A55979k425k229j221J26M10m35q75k32M00J94k90o01j234k224k616k035
$$ 155979 153554 151325 150104 150230 150640 150205 149330 149098 149498 149692 149402 148801 147567 145343 142727 140692
55598A40692j409j379j386r04k74J46M38M34j58o81r2J211J652P73k70p29j067
$$ 140692 139283 137904 136518 135614 135340 135486 135924 136358 136200 135519 135427 136638 138290 139063 138793 138064 136997
55581A36997j493j429q67n79o10j20R54J727K101K847L779L790L102L327M698
$$ 136997 135504 134075 133208 132629 132019 131899 132853 134580 136681 139528 143307 147097 150199 153526 158224
55566A58224N388M394K978K282J576R6j258j496j236j425j725j487j186j555k316
$$ 158224 163612 168006 170984 173266 174842 174938 173680 172184 170948 169523 167798 166311 165125 163570 161254
55551A61254k827l100l223k774j702r21j086j587j454n79N45J472J821J399O76
$$ 161254 158427 155327 152104 149330 147628 146707 145621 144034 142580 142001 142546 144018 145839 147238 147914
55536A47914L54L90L39M79J301K055J445k54j442j666j979k638k583j662j246
$$ 147914 148268 148658 148997 149476 150777 152832 154277 154023 152581 150915 148936 146298 143715 142053 140807
55521A40807j869k287j752j282j675k105j830j583k053k580k500k303k360k011
$$ 140807 138938 136651 134899 133617 131942 129837 128007 126424 124371 121791 119291 116988 114628 112617
55507A12617r72j53o9R9Q48J364J162J008J161M58j516l202l342k848k848k633
$$ 112617 111645 111492 111423 111522 112370 113734 114896 115904 117065 117523 116007 112805 109463 106615 103767 101134
55491A01134j240M65J138J090J288J421P78j10l91m53r36j243o98p1k69n59J10
$$ 101134 99894 100359 101497 102587 103875 105296 106074 105964 105573 105120 104184 102941 102243 102172 101903 101344 101454
55474A01454J113J218O94M27J6j225k237j495K96J066N04J65P01J194J216J433
$$ 101454 102567 103785 104479 104906 104922 103697 101460 99965 100261 101327 101831 101996 102697 103891 105107 106540
55458A06540J916J801R58L32K25j28r07j131l06P28J144J149J153R01J12q13j257
$$ 106540 108456 110257 111215 111547 111772 111644 110737 109606 109300 110028 111172 112321 113474 114375 114487 113674 112417
55441A12417j031k62P89J640J840J496J125R70Q62O98N49L72J01j06q5mq9k98
$$ 112417 111386 111124 111913 113553 115393 116889 118014 118984 119846 120544 121093 121465 121566 121460 121375 121371 121282 120984
55423A20984n04o99p21k98L55O48P24J526L229M534M386L520L263L584L476K618
$$ 120984 120480 119781 119060 118762 119117 119765 120489 122015 125244 129778 134164 137684 140947 144531 148007 150625
55407A50625J423p2j982l550l715k693j803j765k120k383k630k834k536j602n70
$$ 150625 152048 151976 149994 146444 142729 140036 138233 136468 134348 131965 129335 126501 123965 122363 121793
55392A21793mN2j36l13l24j79p3j5K54P84J144R89M95o0o60j104q78J8O90M30
$$ 121793 121789 121841 121705 121392 121068 120889 120816 120801 121055 121839 122983 123972 124467 124407 123747 122643 121765 121783 122473 122903
55372A22903l37q51j126j639k338k788k836k547j910j226j182j868k260j450R3
$$ 122903 122566 121715 120589 118950 116612 113824 110988 108441 106531 105305 104123 102255 99995 98545 98638
55357I8638J195J386R18N7q48j154o72j70k75m97j52M22N17K82K50K50q9l03J72
$$ 98638 99833 101219 102137 102194 101346 100192 99520 99350 99075 98578 98426 98848 99365 99647 99897 100147 100058 99755 99927
55338I9927P79O32J52M35J232J111k65j472j180L11J842K622K442J517M67r1j78
$$ 99927 100706 101338 101490 101925 103157 104268 104003 102531 101351 101662 103504 106126 108568 110085 110552 110461 110283
55321A10283j87j54J12L06j15r68j420j145o88n72o63n44j06M49Q24Q66Q05J061
$$ 110283 110096 109942 110054 110360 110245 109277 107857 106712 106024 105452 104789 104245 104139 104588 105412 106278 107083 108144
55303A08144J548J623J002K43p5r3o5K16P36P24k21j144q95J53P03M73L76R03
$$ 108144 109692 111315 112317 112560 112485 112392 112327 112543 113279 114003 113782 112638 111743 111896 112599 113072 113448 114351
55285A14351J496J554J105M00l08n87k20K51O5o40j007o95k40j81m91q96j118
$$ 114351 115847 117401 118506 118906 118598 118011 117791 118042 118107 117467 116460 115765 115525 115344 114853 113957 112839
55268A12839r05k64M03P81J013J226J099M21l63p41p67o17o0Q83J430J020K77
$$ 112839 111934 111670 112073 112854 113867 115093 116192 116613 116250 115509 114742 114125 114065 114948 116378 117398 117675
55251A17675P2K47J36j99l26m68j051j634j464p52k85j22K35O47N19k4l04k48
$$ 117675 117747 117994 118130 117931 117605 117137 116086 114452 112988 112236 111951 111829 112064 112711 113230 113206 112902 112654
55233A12654k87l40J9N87P92O91O99O17P6m25j80L52J90m11l44L79N87o2n58k33
$$ 112654 112367 112027 112046 112633 113425 114116 114815 115432 115508 115083 114903 115255 115445 115034 114690 115069 115656 115594 115036 114803
55213A14803L99P49Q33O48M3n73n37j9K60M28J157K048J862O23j44K81P82L20
$$ 114803 115202 115951 116784 117432 117475 116902 116365 116346 116606 117034 118191 120239 122101 122724 122580 122861 123643 123963
55195A23963n96j082j211j312j015j5J062J415J042L79l30q02o23L4L17q4l68
$$ 123963 123367 122285 121074 119762 118747 118732 119794 121209 122251 122630 122300 121498 120875 120909 121226 121142 120774
55178A20774K06J188J606J243P08N90R47J397J478J155R03R59P62j33j009p98
$$ 120774 120980 122168 123774 125017 125725 126315 127262 128659 130137 131292 132195 133154 133916 133783 132774 131976
55162A31976K54Q47N58K95P08J389J922K472K916K547J311K69J59K94m12j868
$$ 131976 132230 133077 133635 133930 134638 136027 137949 140421 143337 145884 147195 147464 147623 147917 147505 145637
55146A45637l015l126k459j893k070k675k701j765p80o10o82K0J010R29j66p98
$$ 145637 142622 139496 137037 135144 133074 130399 127698 125933 125153 124543 123861 123881 124891 125820 125654 124856
55130A24856m40j34m00k88P04J432Q26l91q57l89K28N11L89j04o00m62J99L52
$$ 124856 124416 124282 123882 123594 124298 125730 126556 126165 125308 124919 125147 125658 126047 125943 125343 124881 125080 125432
55112A25432n38j669k020j509n90M89J388J563J060P15J022J493J602J480J285
$$ 125432 124894 123225 121205 119696 119106 119595 120983 122546 123606 124321 125343 126836 128438 129918 131203
55097A31203Q26K60J91N93P05M71Q14J853K130O51j468k416j919j003m04k20m25
$$ 131203 132029 132289 132480 133073 133778 134249 135063 136916 139046 139697 138229 135813 133894 132891 132487 132267 131842
55080A31842p38n26L26J011R53O16N49M79J04j50L0N9n26j133j084o54k84K91
$$ 131842 131104 130578 130904 131915 132868 133484 134033 134512 134616 134466 134496 134555 134029 132896 131812 131158 130874 131165
55062A31165J100J099l40j986k172j137m91q32j257j058n42j76J9M6j85n60q17
$$ 131165 132265 133364 133024 131038 128866 127729 127238 126406 125149 124091 123549 123373 123392 123438 123253 122693 121876
55045A21876q12l51P33J894J972P38m20k03Q44J284Q57M25L64K51n9k22j51p5
$$ 121876 121064 120713 121446 123340 125312 126050 125630 125427 126271 127555 128412 128837 129201 129452 129393 129171 129020 128945
55027A28945N7M07O01J44o67r63l80O18J394J537Q94k43j200j546j351o92L87
$$ 128945 129002 129409 130010 130154 129487 128524 128144 128762 130156 131693 132587 132344 131144 129598 128247 127555 127942
55010A27942J167O47p72j179L71K315K702J767J087J057Q58L34J07J82j25q42
$$ 127942 129109 129756 128984 127805 128176 130491 133193 134960 136047 137104 137962 138296 138403 138585 138460 137618
54994A37618j292j283j164q74q1R10J497J821K338K712K323J585J322J266O12
$$ 137618 136326 135043 133879 133005 132924 133834 135331 137152 139490 142202 144525 146110 147432 148698 149310
54979A49310k60k30M63M67l60o75oM58K8l28J66O92M02PN83J714K157J682J179
$$ 149310 149050 148820 149283 149750 149390 148715 148709 149167 149195 148867 149033 149725 150127 150134 150717 152431 154588 156270 157449
54960A57449J253J617J663J069K1p45m92N91J459J450J042J012J369J572J304
$$ 157449 158702 160319 161982 163051 163072 162327 161835 162426 163885 165335 166377 167389 168758 170330 171634
54945A71634O70o8n70n63j62K04L87O54J147J675K194K992M192N421O257O696
$$ 171634 172304 172236 171666 171103 170941 171145 171532 172186 173333 175008 177202 180194 184386 189807 196064 202760
54929B02760P082P839R318J1423J3429J4508J4552J3978J2853J0708P347L280
$$ 202760 209842 217681 226999 238422 251851 266359 280911 294889 307742 318450 325797 329077
54917C29077p50m307p269r741j1916j3636j4191j3177j1367j0104r784r559q560
$$ 329077 328327 324020 316751 307010 295094 281458 267267 254090 242723 232619 222835 213276 204716
54904B04716o778m748l086k332k552k977k666j599m79M27J451K510K954K672K457
$$ 204716 197938 193190 190104 187772 185220 182243 179577 177978 177499 177926 179377 181887 184841 187513 189970
54889A89970K887L705M664O091Q085R905J0866J1347J2172J3342J3962J3230J1013
$$ 189970 192857 196562 201226 207317 215402 225307 236173 247520 259692 273034 286996 300226 311239
54876C11239P717L957K56l253o661r751j1932j2846j2755j2147j1293j0326r407
$$ 311239 318956 322913 323169 319916 313255 303504 291572 278726 265971 253824 242531 232205 222798
54863B22798q565p622o473n267m233l578l449l684l707l083k154j679j880k302
$$ 222798 214233 206611 200138 194871 190638 187060 183611 179927 176220 173137 170983 169304 167424 165122
54849A65122k529k512k204j586j040j056j461j554j150p68o85n25n7L06J56k56
$$ 165122 162593 160081 157877 156291 155251 154195 152734 151180 150030 149262 148577 148052 147995 148301 148457 148201
54833A48201m21j75L21Q21J031Q39O06P34R49O44o2m02j86q5m06n35J3Q38J420
$$ 148201 147780 147605 147926 148747 149778 150617 151223 151957 152906 153550 153488 153086 152900 152815 152409 151874 151887 152725 154145
54814A54145J839K134J823P80j55k36N6j60p65r27m23K36P43J144J273R05M72
$$ 154145 155984 158118 159941 160721 160566 160330 160386 160226 159461 158534 158111 158347 159090 160234 161507 162412 162884
54797A62884O81J376J585R15J36P1N02O27J73l56l92J88J070J790K073K099K427
$$ 162884 163565 164941 166526 167441 167577 167648 168150 168777 168950 168594 168202 168390 169460 171250 173323 175422 177849
54780A77849L437M859N919O075N528N076N481P050R632J2724J5465J6874J6495
$$ 177849 181286 186145 192064 198139 203667 208743 214224 221274 230906 243630 259095 275969 292464
54767B92464J4733J2372R715O526K680j417n176q226j0362j1369j1204j0304r478
$$ 292464 307197 319569 329284 335810 338490 337073 331897 323671 313309 301940 290736 280432 270954
54754B70954r309r652r776r146q013p044o370n410l848k312j652j768j708q72
$$ 270954 261645 251993 242217 233071 225058 218014 211644 206234 202386 200074 198422 196654 194946 194074
54740A94074L37J112J200J093J481K504L532L937M073N074P364R962J1726J2733
$$ 194074 194411 195523 196723 197816 199297 201801 205333 209270 213343 218417 225781 235743 247469 260202
54726B60202J3672J4377J3945J2168R747O998L414j172n832r520j2135j4039j5050
$$ 260202 273874 288251 302196 314364 324111 331109 334523 333351 327519 317999 305864 291825 276775
54713B76775j4631j2894j0841r448q795q173o991n416m100l346k912k602k507
$$ 276775 262144 249250 238409 228961 220166 211993 205002 199586 195486 192140 189228 186626 184119
54700A84119k492k012r70k29n49j481j987j782j291o78J46P63N74j61n74m54l37
$$ 184119 181627 179615 178645 178416 177867 176386 174399 172617 171326 170648 170794 171557 172131 171970 171396 170942 170605
54683A70605l54n3M67M73j73o61n38l91p71j324j503j356j095n61L22J109J350
$$ 170605 170251 170198 170665 171138 170965 170304 169766 169375 168604 167280 165777 164421 163326 162765 163087 164196 165546
54666A65546J061M48l09q48q20n43p03j278j516j151p00l87J79Q61P48l06j047
$$ 165546 166607 167055 166746 165898 165078 164535 163832 162554 161038 159887 159187 158800 158979 159840 160588 160282 159235
54649A59235n19N17P72J91l64m24o0O72J503J768J261P52Q36R48L97k66m3Q20
$$ 159235 158716 159233 160005 160196 159832 159408 159348 160020 161523 163291 164552 165304 166140 167088 167485 167219 167176 167996
54631A67996J127N03k15l13j2J24j67p67j260j112k95N09P23N88N45M45P4r1M67
$$ 167996 169123 169626 169411 169098 169086 169210 169043 168276 167016 165904 165609 166118 166841 167429 167974 168419 168493 168402 168869
54612A68869J207J177N02K48P99J315R92M3q28j241j197q25l49K0K57L94K86j17
$$ 168869 170076 171253 171755 172003 172802 174117 175109 175152 174324 173083 171886 171061 170712 170732 170989 171383 171669 171552
54594A71552n06n74m91n67o77n33k46j35n5L61R47J062M80l54r21j078q71m18
$$ 171552 171046 170472 169981 169414 168737 168204 167958 167823 167768 168129 169076 170138 170618 170264 169343 168265 167394 166976
54576A66976L8L36O43J120J461J242O54L59O08Q98O79Ln71n00L24J416J952J475
$$ 166976 167014 167350 167993 169113 170574 171816 172470 172829 173437 174335 175014 175017 174446 173946 174270 175686 177638 179113
54558A79113L57n12n18J72P67N53l45r29m64M85P32R6l75k7N90Q08Q76J238J662
$$ 179113 179470 178958 178440 178612 179379 179932 179587 178658 178194 178679 179411 179507 179132 179105 179695 180503 181379 182617 184279
54539A84279J827K069K681L083K589J490O11K03Q2K71O78O64m7o47l75J35j07
$$ 184279 186106 188175 190856 193939 196528 198018 198629 198832 198914 199185 199863 200527 200480 199833 199458 199593 199486
54522A99486p22o06J47M77K84M18P89K40j318k328j792o44j95l92m96m30n22o18
$$ 199486 198764 198158 198305 198782 199066 199484 200273 200513 199195 196867 195075 194431 194236 193844 193348 192918 192396 191778
54504A91778l98J8L58O65R06P12N9l98j81L48O96J001J485J786J479Q26L71J97
$$ 191778 191380 191398 191756 192421 193327 194039 194098 193700 193519 193867 194563 195564 197049 198835 200314 201140 201511 201708
54486B01708J38L14P69J043P79L88M73Q43Q24L76J24L75P86J094J448J900K120
$$ 201708 201846 202160 202929 203972 204751 205139 205612 206455 207279 207655 207779 208154 208940 210034 211482 213382 215502
54469B15502J895J513J323J193P22o6o43n42Q9O87Q77P82O73O03M82L63K93P7
$$ 215502 217397 218910 220233 221426 222148 222082 221439 220897 220986 221673 222550 223332 224005 224608 225090 225453 225746 225823
54451B25823m34q72o48J28N12j90j463k152j850j304j316j641j337j83P97N89
$$ 225823 225389 224517 223869 223997 224509 224319 222856 220704 218854 217550 216234 214593 213256 213073 213870 214459
54435B14459m12q84l98M8l23p98k65J026J754J351N23Jk52m50m58k18n1j39k75
$$ 214459 214047 213163 212765 212813 212490 211692 211427 212453 214207 215558 216081 216082 215830 215380 214922 214704 214653 214514 214239
54416B14239l51n17o52l21L99P37L36j00R0M41J32o32q83l83R9J0k76k39kL6j25
$$ 214239 213888 213371 212719 212398 212797 213534 213870 213770 213860 214301 214433 213801 212918 212535 212634 212644 212368 212129 212127 212163 212038
54395B12038k05j60j18J5M75J169J621J522J053N41J4o43j222j261o59P2K95j09
$$ 212038 211833 211673 211555 211570 212045 213214 214835 216357 217410 217951 217965 217322 216100 214839 214180 214252 214547 214438
54377B14438p85j342j587j414p69K03J099J504J299Q55P56J193J672J600J099
$$ 214438 213653 212311 210724 209310 208541 208744 209843 211347 212646 213501 214257 215450 217122 218722 219821
54362B19821Q03Q54O32k00r61p97Q5O46L42l86q42q64p26o88p18n40ON65N09k05
$$ 219821 220624 221478 222110 221910 220949 220152 220237 220883 221225 220839 219997 219133 218407 217719 217001 216461 216467 217032 217541 217336
54342B17336p83n66K7R6m70r28p94l37K7K60M40M31R5m76j012j205q78j95L68
$$ 217336 216553 215987 216014 216110 215640 214712 213918 213581 213608 213868 214308 214739 214834 214358 213346 212141 211263 211068 211436
54323B11436N01L35L7m90j159j378p31L52J167J677K164K364J775P37J85M09Q63
$$ 211436 211937 212272 212309 211819 210660 209282 208551 208903 210070 211747 213911 216275 218050 218787 218972 219381 220244
54306B20244J216J622J899J488M67l08m55n60j059j529j569j573j967k417k434
$$ 220244 221460 223082 224981 226469 226936 226628 226173 225613 224554 223025 221456 219883 217916 215499 213065
54291B13065k165j969j697j084l74Q1L87P25P58J64n94p18j44M35M86P6n12j012
$$ 213065 210900 208931 207234 206150 205776 205857 206244 206969 207727 207891 207297 206579 206435 206870 207356 207432 206920 205908
54273B05908j147q27m05l23n45o86n94m62l93k44R9N45R70J296J347R69L14j81
$$ 205908 204761 203934 203529 203206 202661 201975 201381 200919 200526 200282 200381 200926 201896 203192 204539 205508 205822 205641
54255B05641k23K5J75O5r2p6K4m3k29j94J69M86L94l3n73j179j673j534o17K99
$$ 205641 205418 205443 205618 205683 205591 205515 205539 205496 205267 205073 205242 205728 206122 206089 205516 204337 202664 201130 200513 200812
54235B00812L91J5J67Q52J001K11n23k84M23N68J50k1L03N32K90k9P3M41N04P0
$$ 200812 201203 201218 201385 202237 203238 203449 202926 202642 203065 203633 203783 203762 204065 204597 204887 204858 204931 205372 205876 205946
54215B05946m11m63k96o53j800l025l348k552j176J82J109J274P35J61J18K36
$$ 205946 205535 205072 204776 204123 202323 199298 195950 193398 192222 192404 193513 194787 195522 195683 195801 196037
54199A96037j31o28l09P18J141L25p17p66J1N61L15n42j542k073j568j55J248
$$ 196037 195906 195278 194969 195687 196828 197153 196436 195670 195681 196242 196557 196015 194473 192400 190832 190677 191925
54182A91925J924J999J807J236K91m06l19J88M09K35kk61o74j075j168j016q72
$$ 191925 193849 195848 197655 198891 199182 198776 198457 198645 199054 199289 199287 199026 198352 197277 196109 195093 194221
54165A94221q11q92j254j673j540p00J44M18M25O50Q67P40O36J029J554J563J241
$$ 194221 193410 192518 191264 189591 188051 187351 187495 187913 188338 188988 189855 190595 191231 192260 193814 195377 196618
54148A96618J199J280Q09j38p19o16m15n78q68j013j082j011m16P50J814J979
$$ 196618 197817 199097 199906 199768 199049 198433 198018 197440 196572 195559 194477 193466 193050 193800 195614 197593
54132A97593J105k40j204j170j92R45J407J029K86k81l06L44J372K063K002J582
$$ 197593 198698 198458 197254 196084 195892 196837 198244 199273 199559 199278 198972 199316 200688 202751 204753 206335
54116B06335J426J522J410R84N58L18K00J87K00q3p75j350j243o69k14J25P24
$$ 206335 207761 209283 210693 211677 212235 212553 212753 212940 213140 213057 212282 210932 209689 209020 208806 208931 209655
54099B09655J323J152J42q09j022p33m44k44j30l14q22j178r02n5Q85J409J186
$$ 209655 210978 212130 212272 211463 210441 209708 209264 209020 208890 208576 207754 206576 205674 205619 206504 207913 209099
54082B09099L20n23o65k05J10p9l19j93m3m27j226j722j419m64O10J324J454J136
$$ 209099 209419 208896 208231 208026 208136 208057 207738 207545 207502 207075 205849 204127 202708 202244 202854 204178 205632 206768
54064B06768P71O84P82O37Lp20p74J23J314J854J535R53N48J71k86m60r9L71M25
$$ 206768 207539 208223 209005 209642 209645 208925 208151 208274 209588 211442 212977 213930 214478 214649 214363 213903 213804 214175 214600
54045B14600K64N10J275K050K388K244J755J162Q35R77J393J837K367L023L446
$$ 214600 214864 215374 216649 218699 221087 223331 225086 226248 227083 228060 229453 231290 233657 236680 240126
54030B40126L361L154L430M126M596M529M219M013L908L662K963J680L03j89N75
$$ 240126 243487 246641 250071 254197 258793 263322 267541 271554 275462 279124 282087 283767 284070 283881 284456
54015B84456J680J931J274O01L80K82J7k37l21k73N2Q88K012K840L144L224L483
$$ 284456 286136 288067 289341 289942 290322 290604 290621 290384 290063 289790 289842 290730 292742 295582 298726 301950 305433
53998C05433M335O327R608J3339J6397J8521J9951K0018J7234J1049K764n590
$$ 305433 309768 316095 325703 339042 355439 373960 393911 413929 431163 442212 444976 439386
53986D39386j2553j7335j9619j9788j8746j7087j4953j2796j1410j0793r877p934
$$ 439386 426833 409498 389879 370091 351345 334258 319305 306509 295099 284306 274429 266495
53974B66495n628m056l374k958k495k152k008j865j554j023l64O9j03o48p60l2
$$ 266495 260867 256811 253437 250479 247984 245832 243824 241959 240405 239382 239018 239087 238984 238336 237576 237544
53958B37544R83J539J558J430J343J304J361J385J005K83J0P57J886K268J808
$$ 237544 238527 240066 241624 243054 244397 245701 247062 248447 249452 249735 249745 250502 252388 254656 256464
53943B56464J577K336L608M437M598M624M960N495N931O235O469O366N427L619
$$ 256464 258041 260377 263985 268422 273020 277644 282604 288099 294030 300265 306734 313100 318527 322146
53929C22146J612J61o53j255j933k623l161l351k894j755m79K86N81J007J811
$$ 322146 323758 323919 323266 322011 320078 317455 314294 310943 308049 306294 305815 306101 306682 307689 309500
53914C09500K635L168L496L688L537K987K410K254K546K906K873K305J621J396
$$ 309500 312135 315303 318799 322487 326024 329011 331421 333675 336221 339127 342000 344305 345926 347322
53900C47322J487R93l91j578j470o72o42j407j546o08j7r68k698l709l751l660
$$ 347322 348809 349802 349411 347833 346363 345691 345049 343642 342096 341488 341471 340503 337805 334096 330345 326685
53884C26685l930m417m892n100m638l530k545k307k454k242j596r82o33n57q58
$$ 326685 322755 318338 313446 308346 303708 300178 297633 295326 292872 290630 289034 288052 287419 286862 286004
53869B86004j440j763j527j206j328j603j476j110j069j382j663j888k217k392
$$ 286004 284564 282801 281274 280068 278740 277137 275661 274551 273482 272100 270437 268549 266332 263940
53855B63940k062j582j583j885j681p89J27N95P91P92K84p22j513j429n70N22
$$ 263940 261878 260296 258713 256828 255147 254358 254485 255080 255871 256663 256947 256225 254712 253283 252713 253235
53839B53235J442J956J890J277M24l46q35q10q3J217K663L905M763N101M947M847
$$ 253235 254677 256633 258523 259800 260224 259878 259043 258233 258150 259367 262030 265935 270698 275799 280746 285593
53823B85593N589P479J0106J2932J5872J9044K2132K4051K3355J9191J2145M043
$$ 285593 291182 298661 308767 321699 337571 356615 378747 402798 426153 445344 457489 461532
53811D61532l300r039j2993j4904j4624j2778j0456q222o016m082l217l718m681
$$ 461532 458232 449193 436200 421296 406672 393894 383438 375216 369200 365118 361901 358183 353502
53798C53502m926m286l536l186k941k344j434n93m4K28K31k5k86j76K82M74j85
$$ 353502 348576 344290 340754 337568 334627 332283 330849 330256 330212 330440 330671 330646 330360 330184 330466 330940 330755
53781C30755j477k484k521j751q59l84m15p76j298j928k652l259l386k939k350
$$ 330755 329278 326794 324273 322522 321663 321279 320864 320088 318790 316862 314210 310951 307565 304626 302276
53766C02276k136k297k500k667k909k972k433j541j207j789k542k630k178j814
$$ 302276 300140 297843 295343 292676 289767 286795 284362 282821 281614 279825 277283 274653 272475 270661
53752B70661j679j507j289j241j262j022n02m9Q7o0l19m31j14O41J441J916K005
$$ 270661 268982 267475 266186 264945 263683 262661 262159 262110 262197 262137 261818 261387 261273 261914 263355 265271 267276
53735B67276J694R44J05n4P25J654J853J458J271J598K161K764L352L542K887
$$ 267276 268970 269914 270019 269965 270690 272344 274197 275655 276926 278524 280685 283449 286801 290343 293230
53720B93230J606M31k56n77n66j63K97L04rpN01J059J441J967K723L209L092K707
$$ 293230 294836 295267 295011 294434 293868 293705 294002 294306 294297 294290 294791 295850 297291 299258 301981 305190 308282 310989
53702C10989K498K448K478K827L644M579N205N508N583N190M039K374R47M53J051
$$ 310989 313487 315935 318413 321240 324884 329463 334668 340176 345759 350949 354988 357362 358309 358762 359813
53687C59813K222K993K761J988J710K112K180J120m12j091n56L52Q53R23Q10N44
$$ 359813 362035 365028 367789 369777 371487 373599 375779 376899 376487 375396 374840 375192 376045 376968 377778 378322
53671C78322K13J45M14N70K68j40j07J76m6r76j842j900j356r70j000j185j511
$$ 378322 378535 378680 379094 379664 379932 379792 379685 379861 379815 378839 376997 375097 373741 372771 371771 370586 369075
53654C69075k286l314l682k778j177oK69J5l41p02r73r31n33m9K50K90O6m14q98
$$ 369075 366789 363475 359793 357015 355838 355832 356101 356116 355775 355073 354100 353169 352636 352587 352837 353127 353193 352779 351881
53635C51881r34l04O44J306J426J308J371J677J947K079K304K700K847K385J717
$$ 351881 350947 350643 351287 352593 354019 355327 356698 358375 360322 362401 364705 367405 370252 372637 374354
53620C74354J589J990K150J857J963L128M671N368M989M338M038M069M265M557
$$ 374354 375943 377933 380083 381940 383903 387031 391702 397070 402059 406397 410435 414504 418769 423326
53606D23326M659M253L602L344L547L577L047K434K396K939L478L562L245K952
$$ 423326 427985 432238 435840 439184 442731 446308 449355 451789 454185 457124 460602 464164 467409 470361
53592D70361L003L156K773J687P08P83J711K276J702M02q16j658k191k387k216
$$ 470361 473364 476520 479293 480980 481688 482471 484182 486458 488160 488562 487746 486088 483897 481510 479294
53577D79294j868j489j009n53o86j740l086l566k721j311m82o57j300j638j424
$$ 479294 477426 475937 474928 474375 473689 471949 468863 465297 462576 461265 460783 460126 458826 457188 455764
53562D55764r35l94K89J119J712J713J370J178J086N85l76j073r10k02L01L45
$$ 455764 454829 454435 454724 455843 457555 459268 460638 461816 462902 463487 463111 462038 461128 460926 461227 461572
53546D61572K59L31N31P72J081J439J686J781J997K650L710M818N688O326O813
$$ 461572 461831 462162 462693 463465 464546 465985 467671 469452 471449 474099 477809 482627 488315 494641 501454
53531E01454P132P425Q156R641J1460J2871J3788J4891J6494J7932J8413J8039
$$ 501454 508586 516011 524167 533808 545268 558139 571927 586818 603312 621244 639657 657696
53519F57696J7503J7138J6832J6584J6586J6876J7391J8286J9683K1333K2899
$$ 657696 675199 692337 709169 725753 742339 759215 776606 794892 814575 835908 858807
53508H58807K4426K6057K7543K8562K9324L0207L0972L1067L0589L0158K9883
$$ 858807 883233 909290 936833 965395 994719 1024926 1055898 1086965 1117554 1147712 1177595
53497A177595K9250K8188K7493K7926K9449L1499L3412L4489L4370L3581L3038
$$ 1177595 1206845 1235033 1262526 1290452 1319901 1351400 1384812 1419301 1453671 1487252 1520290
53486A520290L2849L2265L0957K9501K8299K6897K4953K3049K1838K1011J9935
$$ 1520290 1553139 1585404 1616361 1645862 1674161 1701058 1726011 1749060 1770898 1791909 1811844
53475A811844J8828J8477J9011J9659J9651J8770J7144J4999J2600J0041P126
$$ 1811844 1830672 1849149 1868160 1887819 1907470 1926240 1943384 1958383 1970983 1981024 1988150
53464A988150L753J82l267o618r993j3227j6107j8689k1025k2841k3964k4826
$$ 1988150 1991903 1992085 1988818 1982200 1972207 1958980 1942873 1924184 1903159 1880318 1856354 1831528
53452A831528k6016k7481k8716k9648l0746l2122l3100l2942l1790l0570l0056
$$ 1831528 1805512 1778031 1749315 1719667 1688921 1656799 1623699 1590757 1558967 1528397 1498341
53441A498341l0149l0156k9683k8984k8309k7210k5028k1963j9063j6944j5116
$$ 1498341 1468192 1438036 1408353 1379369 1351060 1323850 1298822 1276859 1257796 1240852 1225736
53430A225736j2884j0368q082o005l728j299P82K364L978O187R058J2185J5029
$$ 1225736 1212852 1202484 1194402 1188397 1184669 1183370 1184152 1186516 1190494 1196681 1205739 1217924 1232953
53417A232953J7229J8897K0594K2715K5016K6958K8445K9809L1245L2640L3981
$$ 1232953 1250182 1269079 1289673 1312388 1337404 1364362 1392807 1422616 1453861 1486501 1520482
53406A520482L5493L7318L9316M1339M3436M5719M8146N0621N3214N6230N9987
$$ 1520482 1555975 1593293 1632609 1673948 1717384 1763103 1811249 1861870 1915084 1971314 2031301
53395B031301O4376O8617P1708P3359P4329P5626P7478P9292Q0493Q1088Q1406
$$ 2031301 2095677 2164294 2236002 2309361 2383690 2459316 2536794 2616086 2696579 2777667 2859073
53384B859073Q1553Q1180P9778P7219P3974P0708O7612O4325O0551N6438N2302
$$ 2859073 2940626 3021806 3101584 3178803 3252777 3323485 3391097 3455422 3515973 3572411 3624713
53373C624713M8271M4398M0803L7468L4171L0824K7538K4098J9665J3362M892
$$ 3624713 3672984 3717382 3758185 3795653 3829824 3860648 3888186 3912284 3931949 3945311 3950203
53362C950203n631j8030l1671m5121n6863o6297p3677p9294q3287q6062q8096
$$ 3950203 3944572 3926542 3894871 3849750 3792887 3726590 3652913 3573619 3490332 3404270 3316174
53351C316174q9293q9152q7670q5590q3636q1999q0635p9529p8564p7551p6631
$$ 3316174 3226881 3137729 3050059 2964469 2880833 2798834 2718199 2638670 2560106 2482555 2405924
53340B405924p6138p5962p5480p4250p2275o9502o5728o1309n7233n3973n0832
$$ 2405924 2329786 2253824 2178344 2104094 2031819 1962317 1896589 1835280 1778047 1724074 1673242
53329A673242m6988m2621l8390l4332l0155k6282k3438k1376j9060j6379j4522
$$ 1673242 1626254 1583633 1545243 1510911 1480756 1454474 1431036 1409660 1390600 1374221 1359699
53318A359699j4149j4128j2956j0694q531o950n398l595k056j032M8J675L532
$$ 1359699 1345550 1331422 1318466 1307772 1299241 1292291 1286893 1283298 1281242 1280210 1280258 1281933 1285465
53305A285465N134O575Q108R495J0460J1374J2872J5013J7444K0186K3473K6890
$$ 1285465 1290599 1297174 1305282 1314777 1325237 1336611 1349483 1364496 1381940 1402126 1425599 1452489
53293A452489K9438L0689L1369L2521L4450L6648L8385L9234L9342L9251L9130
$$ 1452489 1481927 1512616 1543985 1576506 1610956 1647604 1685989 1725223 1764565 1803816 1842946
53282A842946L8327L6156L3139L0752K9669K9025K7744K5935K4303K2798K0691
$$ 1842946 1881273 1917429 1950568 1981320 2010989 2040014 2067758 2093693 2117996 2140794 2161485
53271B161485J7775J4546J1241P532L441l05l306o376j0690j6214k1679k6117
$$ 2161485 2179260 2193806 2205047 2212579 2216020 2215715 2212409 2206033 2195343 2179129 2157450 2131333
53259B131333k9886l3883l8214m2148m5152m7392m9114n0146n0357n0187n0167
$$ 2131333 2101447 2067564 2029350 1987202 1942050 1894658 1845544 1795398 1745041 1694854 1644687
53248A644687n0078m9130m7030m4463m2382m1134m0403l9751l9045l8472l8317
$$ 1644687 1594609 1545479 1498449 1453986 1411604 1370470 1330067 1290316 1251271 1212799 1174482
53237A174482l8647l9222l9725l9936l9635l8588l6849l4847l2838l0520k7547
$$ 1174482 1135835 1096613 1056888 1016952 977317 938729 901880 867033 834195 803675 776128
53226G76128k4156k0872j7823j4990j2842j1958j2052j2120j1661j1034j0570
$$ 776128 751972 731100 713277 698287 685445 673487 661435 649315 637654 626620 616050
53215F16050j0118r707r749j0225j0409r920r325r167r043q350p435p184p788
$$ 616050 605932 596225 586476 576251 565842 555922 546597 537430 528387 520037 512602 505418 497630
53202D97630q495q544p762o505n356m790m734m733m753n330o588p639p577o674
$$ 497630 489135 480591 472829 466324 460968 456178 451444 446711 441958 436628 430040 422401 414824 408150
53188D08150n825n232m390l229k417k380k754k991l020l006k850k276j333n39
$$ 408150 402325 397093 392703 389474 387057 384677 381923 378932 375912 372906 370056 367780 366447 365908
53174C65908m07q25j124r25p06j102j825j917j134l17j63l60l51k21k65k85L4
$$ 365908 365501 364676 363552 362627 361921 360819 358994 357077 355943 355626 355463 355103 354752 354531 354266 353981 354015
53157C54015N08P94R10Q74M06m77j127j151j054j289j414j082j072k104l242k964
$$ 354015 354523 355317 356227 357101 357507 357030 355903 354752 353698 352409 350995 349913 348841 346737 343495 340531
53141C40531j501n98r55j459j175n89l84k93P2L02jl74k45L3j98p41p77r4O28
$$ 340531 339030 338432 337477 336018 334843 334254 333870 333577 333649 333951 333950 333576 333331 333364 333166 332425 331648 331554 332182
53122C32182O82P0o33q12k30Q46J900K483K330J398Q5q62j082j043j317j656j475
$$ 332182 332864 332934 332301 331489 331259 332105 334005 336488 338818 340216 340301 339439 338357 337314 335997 334341 332866
53105C32866r78r86j639k203k259k194k296k235j867j693j975k129j608q34n60
$$ 332866 331888 330902 329263 327060 324801 322607 320311 318076 316209 314516 312541 310412 308804 307970 307410
53090C07410p98r39o24L1P47J123P39k53r80q01j30J79L7J9K35Q4p46j560j434
$$ 307410 306612 305673 305049 305080 305827 306950 307689 307436 306456 305655 305525 305704 305741 305760 305995 306079 305333 303773 302339
53071C02339l96N25N84K47N42J568K188J495J06n84k00K90J1q02j380j339p59
$$ 302339 301943 302468 303052 303299 303841 305409 307597 309092 309198 308614 308414 308704 308715 307913 306533 305194 304435
53054C04435J04Q45J052P91O05Q34J245J436J244P05L2k45L06J286J774J456Q91
$$ 304435 304539 305384 306436 307227 307832 308666 309911 311347 312591 313296 313328 313083 313389 314675 316449 317905 318796
53037C18796M44j66r54j203n50K12J85m05q31j116j715k329k118j065j49o7n40
$$ 318796 319240 319074 318120 316917 316367 316579 316764 316359 315528 314412 312697 310368 308250 307185 307036 306969 306429
53020C06429j036j458j865k027j672q54J08Q87J293J306J068O77O0p28j291j216
$$ 306429 305393 303935 302070 300043 298371 297517 297625 298512 299805 301111 302179 302856 302916 302188 300897 299681
53004B99681n70J91P16R22Q45O43O02P95Q48M05k53m42Q3Q43J228J110Q13P20
$$ 299681 299111 299302 300018 300940 301785 302428 303030 303825 304673 305078 304825 304383 304466 305309 306537 307647 308460 309180
52986C09180R38J220J230R17N94N18N64M80K75J42K03M75R35J445J795K016K342
$$ 309180 310118 311338 312568 313485 314079 314597 315161 315641 315916 316058 316261 316736 317671 319116 320911 322927 325269
52969C25269K676K521J725R43Q11J054R56M94L01N93Q46N99k2o80j239j628j773
$$ 325269 327945 330466 332191 333134 333945 334999 335955 336449 336750 337343 338189 338788 338766 338086 336847 335219 333446
52952C33446j802j946k099j929j527j468j921k264j886j034m20l09m33o05r39
$$ 333446 331644 329698 327599 325670 324143 322675 320754 318490 316604 315570 315150 314841 314408 313803 312864
52937C12864j432j742j549q81r1L94K80l60j010j057l97L92N84L6o74q24k13O79
$$ 312864 311432 309690 308141 307260 307169 307563 307843 307483 306473 305416 305019 305411 305995 306031 305357 304533 304320 304999
52919C04999J134Q13j1p23q75m96K9L38L53K15N7l2J05O01J222J339N16q15j604
$$ 304999 306133 306946 306935 306212 305337 304841 304870 305208 305561 305776 305833 305801 305906 306507 307729 309068 309584 308769 307165
52900C07165j226j29Q11J316J809K517L032K923K442K213K463K829K812K097O24
$$ 307165 305939 305810 306621 307937 309746 312263 315295 318218 320660 322873 325336 328165 330977 333074 333698
52885C33698j204k540k797k406k323k814l232l082k612k186j780j393j311j460
$$ 333698 332494 329954 327157 324751 322428 319614 316382 313300 310688 308502 306722 305329 304018 302558
52871C02558j231m45R4k38q41p82k08P0pR6K51j95j028j080Q1J438J898J472P21
$$ 302558 301327 300882 300976 300738 299897 299115 298907 298977 298970 299066 299317 299122 298094 297014 297095 298533 300431 301903 302624
52852C02624j31r45j249p26K82J147J508J200J58j303k568l322l662l531k666
$$ 302624 302493 301548 300299 299573 299855 301002 302510 303710 303868 302565 299997 296675 293013 289482 286816
52837B86816j389o53r25j571j752j353o57K00J013J331J083P77O47K22o86j231
$$ 286816 285427 284774 283849 282278 280526 279173 278516 278716 279729 281060 282143 282920 283567 283789 283103 281872
52821B81872o10O17J154O36q1j84L24J100K070L358M952O554P620P635O442M202
$$ 281872 281262 281879 283033 283669 283588 283404 283728 284828 286898 290256 295208 301762 309382 317017 323459 327661
52805C27661J162k223n094o703p214p289o952n679l736k351k116k293k166j989
$$ 327661 328823 326600 321506 314803 307589 300300 293348 287669 283933 281582 279466 277173 275007 273018
52791B73018j947j402j83N03k35j299j056K20Q80M72R9L77O50M43K85O31J115
$$ 273018 271071 269669 269486 269989 269754 268455 267399 267619 268499 268971 269070 269447 270097 270540 270825 271456 272571
52774B72571J288J240J149R50O92N71N06L15K93Q07J370J063n0q17n25L48J031
$$ 272571 273859 275099 276248 277198 277890 278461 278967 279282 279575 280382 281752 282815 282765 281948 281423 281771 282802
52757B82802J283J126N79k6j88N7K03J31J47J67k44q63q40QR20J435J901K339
$$ 282802 284085 285211 285790 285764 285576 285633 285836 285967 286114 286281 286037 285174 284334 284342 285262 286697 288598 290937
52739B90937J999O81n33p13l65m07o78m54J49M06K57L53R28J486J573J167L82
$$ 290937 292936 293617 293084 292371 292006 291599 290921 290467 290616 291022 291279 291632 292560 294046 295619 296786 297168
52722B97168n88j289j360j071r84j051o98J26O00J2j286k225k183j494q80o17
$$ 297168 296580 295291 293931 292860 291876 290825 290127 290253 290853 290865 289579 287354 285171 283677 282797 282180
52706B82180l20M29J442J992J557L93o20p34M8J015J469J329R62N27j12q30j099
$$ 282180 281860 282289 283731 285723 287280 287673 287053 286319 286367 287382 288851 290180 291142 291669 291557 290727 289628
52689B89628p24j96J5J29N08R31J021J036J426J950K020J749J743J980J831J253
$$ 289628 288904 288708 288723 288852 289360 290291 291312 292348 293774 295724 297744 299493 301236 303216 305047 306300
52673C06300R60J212J368R22K05k70l96j69M25R17O22k64o42l6O71N71k8l50l22
$$ 306300 307260 308472 309840 310762 310967 310697 310301 310132 310557 311474 312096 311832 311190 311154 311825 312396 312368 312018 311696
52654C11696k24K04J300K576L139K837K213J441J78j584l147l795l437k477j396
$$ 311696 311472 311676 312976 315552 318691 321528 323741 325182 325360 323776 320629 316834 313397 310920 309524
52639C09524n71k27l57o52o26K3J015J696J872K152L066M156M575M273L750K893
$$ 309524 308953 308726 308369 307717 307091 307114 308129 309825 311697 313849 316915 321071 325646 329919 333669 336562
52623C36562J163j043k441k640k715l476m250m137l387k712k056j055p9K02j90
$$ 336562 337725 336682 334241 331601 328886 325410 321160 317023 313636 310924 308868 307813 307734 307936 307746
52608C07746p39j256j662j510n57N51R53N90m6p00j154q81K13J253J446J205J279
$$ 307746 307007 305751 304089 302579 302022 302573 303526 304116 304070 303370 302216 301335 301548 302801 304247 305452 306731
52591C06731J416R93M34O60J457J759J425J282J468J228N31M34J326K105J797
$$ 306731 308147 309140 309574 310234 311691 313450 314875 316157 317625 318853 319384 319818 321144 323249 325046
52576C25046Q77L15J30k37q14j119r14l64K49N77L26l42q43q96q38r94j213j237
$$ 325046 325923 326238 326368 326131 325317 324198 323284 322920 323169 323746 324072 323730 322887 321991 321153 320159 318946 317709
52558C17709j110r55p49n77o53r39j064q43m56KN97J113J099N92J66Lm14j329
$$ 317709 316599 315644 314895 314318 313665 312726 311662 310819 310363 310365 310962 312075 313174 313766 313932 313935 313521 312192
52540C12192k099k046j410q75o30m65m00n09m17L09J370J938J662J041P10Q03
$$ 312192 310093 308047 306637 305762 305132 304667 304267 303758 303341 303650 305020 306958 308620 309661 310371 311174
52524C11174J075J287J358J300J215J240J421J607J539J137P68R72J766K424K296
$$ 311174 312249 313536 314894 316194 317409 318649 320070 321677 323216 324353 325121 326093 327859 330283 332579
52509C32579J671J274J110M93o81j554j556j308j636k316k543k326k487l281l824
$$ 332579 334250 335524 336634 337127 336446 334892 333336 332028 330392 328076 325533 323207 320720 317439 313615
52494C13615l179j563r2M04J55O6P30J773K276J862J132Q93J169J378J243J084
$$ 313615 310436 308873 308781 309185 309340 309406 310136 311909 314185 316047 317179 318072 319241 320619 321862 322946
52478C22946J190J410J549J744K138K415K079J181M33M48J064J616J795J930K359
$$ 322946 324136 325546 327095 328839 330977 333392 335471 336652 337085 337533 338597 340213 342008 343938 346297
52463C46297K839K780K017R72Q6o92j688k969m165m720m292l088j815j159j191
$$ 346297 349136 351916 353933 354905 354991 354299 352611 349642 345477 340757 336465 333377 331562 330403 329212
52448C29212j413j421j283j232j286j387j609j911j898j209j39N88P04O86R85
$$ 329212 327799 326378 325095 323863 322577 321190 319581 317670 315772 314563 314424 315012 315716 316402 317387
52433C17387J309J018K8j048j582j440q81k92j33p05j689k216j765q26k41j27
$$ 317387 318696 319714 319742 318694 317112 315672 314791 314499 314366 313661 311972 309756 307991 307165 306924 306797
52417C06797O9N29P92O71Q08J771L079L729L565L481M255N609O652O956P009P601
$$ 306797 306866 307395 308187 308858 309666 311437 314516 318245 321810 325291 329546 335155 341807 348763 355772 363373
52401C63373Q874J0032J0100Q821O584L629m3l874o580p403p002o536o261n729
$$ 363373 372247 382279 392379 401200 407784 411413 411370 407496 400916 393513 386511 379975 373714 367985
52387C67985m977m470m044k971j312k26m39j205j296m65O19J342J584J530J623
$$ 367985 363008 358538 354494 351523 350211 349985 349546 348341 347045 346580 347199 348541 350125 351655 353278
52372C53278K326L459M096L644K708K263K282J849N68q86j748j996j932j525o34
$$ 353278 355604 359063 363159 366803 369511 371774 374056 375905 376473 375587 373839 371843 369911 368386 367752
52357C67752L88Q66O36K80M15R80J465J644J791K095K308K181J928J872J829J370
$$ 367752 368140 369006 369642 369922 370337 371317 372782 374426 376217 378312 380620 382801 384729 386601 388430 389800
52341C89800O72N28J246K068K038J194N03P98K033L449M271M355M399N283P053
$$ 389800 390472 391000 392246 394314 396352 397546 398049 398847 400880 404329 408600 412955 417354 422637 429690
52326D29690Q690R170Q521P632P221P276P275O698N415L977L352M007N319O250
$$ 429690 438380 447550 456071 463703 470924 478200 485475 492173 497588 501565 504917 508924 514243 520493
52312E20493O485O558O956P614Q315R086R981J0872J1676J2529J3475J4207J4332
$$ 520493 526978 533536 540492 548106 556421 565507 575488 586360 598036 610565 624040 638247 652579
52299F52579J3859J3156J2530J1947J1144R969Q599P484O932O777O536N925N093
$$ 652579 666438 679594 692124 704071 715215 725184 733783 741267 748199 754976 761512 767437 772530
52286G72530M407M132M318M776N072M793L939K913K081J495J150J222J835K689
$$ 772530 776937 781069 785387 790163 795235 800028 803967 806880 808961 810456 811606 812828 814663 817352
52272H17352L211L080K435J629R24M87M53Q55J546K260K780L062L198L262L305
$$ 817352 820563 823643 826078 827707 828631 829118 829571 830426 831972 834232 837012 840074 843272 846534 849839
52257H49839L479M074N195O471P337P689P929Q237Q178P377O310N851O124O378
$$ 849839 853318 857392 862587 869058 876395 884084 892013 900250 908428 915805 922115 927966 934090 940468
52243I40468O128N860O249P133P743P695P239O696O137N667N502N606N602N260
$$ 940468 946596 952456 958705 965838 973581 981276 988515 995211 1001348 1007015 1012517 1018123 1023725 1028985
52229A028985M745M251L620K606J324J88n07p47o48l95k84o10j374k240k812k968
$$ 1028985 1033730 1037981 1041601 1044207 1045531 1045719 1045212 1044465 1043817 1043422 1043138 1042528 1041154 1038914 1036102 1033134
52213A033134k845k546j919p55P38J870K098J635J181J113J240J313J372J451
$$ 1033134 1030289 1027743 1025824 1025069 1025807 1027677 1029775 1031410 1032591 1033704 1034944 1036257 1037629 1039080
52199A039080J477J681K693M720O953Q197Q072P144O098N252M723M448L913K448
$$ 1039080 1040557 1042238 1044931 1049651 1056604 1064801 1072873 1080017 1086115 1091367 1096090 1100538 1104451 1106899
52185A106899O5k375m015m683m612l966k991k211j954j960j875j977k801m137
$$ 1106899 1106964 1104589 1100574 1095891 1091279 1087313 1084322 1082111 1080157 1078197 1076322 1074345 1071544 1067407
52171A067407m977m713l861l289l079k567j354J97J356J640J025r8j105j577j672
$$ 1067407 1062430 1057717 1053856 1050567 1047488 1044921 1043567 1043764 1045120 1046760 1047785 1047687 1046582 1045005 1043333
52156A043333j826k053j877j089j99J69R6J98P91J647K460L120L503L333K482
$$ 1043333 1041507 1039454 1037577 1036488 1036289 1036458 1036554 1036752 1037543 1039190 1041650 1044770 1048273 1051606 1054088
52141A054088J211J7o77p69o33q63j591k189j999j132j18J019K586M235N136N342
$$ 1054088 1055299 1055316 1054639 1053870 1053237 1052374 1050783 1048594 1046595 1045463 1045345 1046364 1048950 1053185 1058321 1063663
52125A063663O049P899R781J0143R005P763P269O977O067M663L613L450L803L853
$$ 1063663 1069712 1077611 1087392 1097535 1106540 1114303 1121572 1128549 1134616 1139279 1142892 1146342 1150145 1153998
52111A153998L311K910L621N414P334Q892J0695J3231J5813J7433J8097J8506
$$ 1153998 1157309 1160219 1163840 1169254 1176588 1185480 1196175 1209406 1225219 1242652 1260749 1279255
52099A279255J8738J8259J6967J5238J3041J0039O620L876K320J430P33M46P72
$$ 1279255 1297993 1316252 1333219 1348457 1361498 1371537 1378157 1382033 1384353 1385783 1386516 1386962 1387734
52086A387734J296J600J823K216K565K408J473k65k471m304m984m741m571m883
$$ 1387734 1389030 1390630 1392453 1394669 1397234 1399642 1401115 1400850 1398379 1394075 1389091 1384350 1379779 1374896
52072A374896n118m933m885n394n850n451m286k961j654l44N53O67M90Q79J953
$$ 1374896 1369778 1364845 1359960 1354566 1348716 1343265 1338979 1336018 1334364 1334020 1334573 1335240 1335730 1336609 1338562
52057A338562L189M371N570O310N792M153K658K232K431K224J333L51q4K21J117
$$ 1338562 1341751 1346122 1351692 1358002 1363794 1367947 1370605 1372837 1375268 1377492 1378825 1379176 1379092 1379313 1380430
52042A380430K280L358M177M846N367N347M416K889J643J118P33k87j770k798
$$ 1380430 1382710 1386068 1390245 1395091 1400458 1405805 1410221 1413110 1414753 1415871 1416604 1416317 1414547 1411749
52028A411749l028l173l883m711m753l885k754j779q90q6N11J126K049K877K874
$$ 1411749 1408721 1405548 1401665 1396954 1392201 1388316 1385562 1383783 1382893 1382807 1383318 1384444 1386493 1389370 1392244
52013A392244K234J972K304K064L44k283m950p977j2099j6753k0379k2204k2677
$$ 1392244 1394478 1396450 1398754 1400818 1401162 1398879 1393929 1385952 1373853 1357100 1336721 1314517 1291840
52000A291840k2331k1264j9896j9126j9312j9808j9933j9876k0214k1069k2042
$$ 1291840 1269509 1248245 1228349 1209223 1189911 1170103 1150170 1130294 1110080 1089011 1066969
51989A066969k2661k2567k1574j9918j8273j7237j6901j6998j7293j7667j8035
$$ 1066969 1044308 1021741 1000167 980249 961976 944739 927838 910840 893547 875880 857845
51978H57845j8337j8479j8130j6812j4374j1373q718o878n481l741j275J552M075
$$ 857845 839508 821029 802899 786087 771713 760340 751622 744744 739263 735522 734247 735799 739874
51965G39874N924P036P243O285M303J858p56l764p117r906j1146j1035j0686j0599
$$ 739874 745798 752834 760077 766362 770665 772523 771767 768003 760886 750980 739834 728799 718113 707514
51951G07514j0050q256n584l100j223O33L082N933Q526J0508J1926J2707J2523
$$ 707514 697464 689208 683624 680524 679301 679934 683016 688949 697475 707983 719909 732616 745139
51938G45139J1373R846Q500P198N437L178R10j020k669m126n372o638q344j0493
$$ 745139 756512 766358 774858 782056 787493 790671 791581 790561 787892 783766 778394 771756 763412 752919
51924G52919j2545j4072j5102j5658j5555j4836j3897j2817j1144q769o434m789
$$ 752919 740374 726302 711200 695542 679987 665151 651254 638437 627293 618524 612090 607301
51912F07301l470j746L99K486M437O401Q006Q664Q478P996P122N155K010j432
$$ 607301 603831 602085 602484 604970 609407 615808 623814 632478 640956 648952 656074 661229 663239 661807
51898F61807m432p100r673j1754j2758j2695j2118j1453j0684r497p620n182k754
$$ 661807 657375 650275 640602 628848 616090 603395 591277 579824 569140 559643 552023 546841 544087
51885E44087p79R85L138N803Q557J1080J3418J5470J6892J7608J7900J7674J6187
$$ 544087 543308 544293 547431 553234 561791 572871 586289 601759 618651 636259 654159 671833 688020
51872F88020J3000Q807M851J665j123l793n834o375n043k223J441N449R413J2971
$$ 688020 701020 709827 714678 716343 715220 711427 705593 699218 694175 691952 693393 698842 708255 721226
51858G21226J6132J9652K4554L1053L8141M4282M8062M8103M3098L2674J8006
$$ 721226 737358 757010 781564 812617 850758 895040 943102 991205 1034303 1066977 1084983
51847A084983J177j5809l1064m2595m9079n0851m9463m6191m1596l6231l0904
$$ 1084983 1086160 1070351 1039287 996692 947613 896762 847299 801108 759512 723281 692377
51836F92377k6021k1402j6961j2971r572o687m540l588l666l932l912l974m441
$$ 692377 666356 644954 627993 615022 605450 598763 594223 590635 586969 583037 579125 575151 570710
51823E70710m908m766l929k591q38J067K568L405L872M043L341J426r33k599l397
$$ 570710 565802 561036 557107 554516 553678 554745 557313 560718 564590 568633 571974 573400 572467 569868 566471
51808E66471m012m750n098m547l334k200j735j987k484k639k245j567q96k36M97
$$ 566471 562459 557709 552611 548064 544730 542530 540795 538808 536324 533685 531440 529873 528977 528741 529238
51793E29238J234J866K259K128J292K29j62K83N90j09j414k285k466k558k929
$$ 529238 530472 532338 534597 536725 538017 538246 538084 538367 538957 538848 537434 535149 532683 530125 527196
51778E27196l187k808j612K86K549M624O114P199Q268R251R668R233P912N543
$$ 527196 524009 521201 519589 519875 522424 527048 533162 540361 548629 557880 567548 576781 584693 590236
51764E90236K135j511m237n808p048q413r227q759p477o441n913n312m400l643
$$ 590236 592371 590860 586623 580815 573767 565354 556127 547368 539891 533450 527537 522225 517825 514182
51750E14182l309k921j997p61K09P61J147J521J887K378L203M230N074N610O080
$$ 514182 510873 507952 505955 505194 505403 506164 507311 508832 510719 513097 516300 520530 525604 531214 537294
51735E37294O607O934O886O698O586O233N070L052Q31p03q06R03M103P501R416
$$ 537294 543901 550835 557721 564419 571005 577238 582308 585360 586191 585488 584682 585585 589688 597189 606605
51720F06605Q973O622L395k7l328n998p266o750m922k775j097k06j72r05j827
$$ 606605 615578 622200 625595 625568 622240 616242 608976 602226 597304 594529 593432 593226 593054 592149 590322
51705E90322j882m63J693L083L009K070R40m88k233l339k782r25R97K554M166
$$ 590322 588440 587977 589670 592753 595762 597832 598772 598284 596051 592712 589930 589005 590002 592556 596722
51690E96722N548N406L202O8k651m859o900q160p620n414k826q56K89M73n93k586
$$ 596722 602270 607676 610878 610946 608295 603436 596536 588376 580756 575342 572516 571660 571949 572422 571829 569243
51674E69243m408n219n197m955m560l508j431J492M753P921J0814J3310J5026
$$ 569243 564835 559616 554419 549464 544904 541396 539965 541457 546210 554131 564945 578255 593281
51661E93281J5302J3730J0635O821K863j162n173q579j0446j0242q374o049m468
$$ 593281 608583 622313 632948 639769 642632 641470 636297 627718 617272 607030 598656 592607 588139
51648E88139l952l834l258k112j075r12j874l831o566r692j2447j3914j3725j2354
$$ 588139 584187 580353 577095 574983 573908 572996 571122 567291 560725 551033 538586 524672 510947 498593
51634D98593j0611q892p087n082l085j419l06J44O6L1O97J941K782K565J833J449
$$ 498593 487982 479090 472003 466921 463836 462417 462111 462255 462321 462352 463049 464990 467772 470337 472170 473619
51618D73619J211J35j911l736m225l601k934k834l023k840j952o85J64J58j70
$$ 473619 474830 474965 473054 469318 465093 461492 458558 455724 452701 449861 447909 447224 447388 447546 447376
51603D47376J33J239K380K966L282L801M491N163O062P616R862J2429J4804J6328
$$ 447376 447509 448748 451128 454094 457376 461177 465668 470831 476893 484509 494371 506800 521604 537932
51589E37932J6291J4479J1335P435L156q32l318l397j303J943N492R002J2545
$$ 537932 554223 568702 580037 587472 590628 589796 586478 583081 581778 583721 589213 598215 610760
51576F10760J6477K0939K5077K7414K7640K7372K8292K9991L0682K9662K7920
$$ 610760 627237 648176 673253 700667 728307 755679 783971 813962 844644 874306 902226
51565I02226K6455K5345K4813K5994K9810L5771M2553M9315N5677O0620O2189
$$ 902226 928681 954026 978839 1004833 1034643 1070414 1112967 1162282 1217959 1278579 1340768
51554A340768N8575M9472L6315K1256N850r389k4237l7896m9143n7262o2470o5476
$$ 1340768 1399343 1448815 1485130 1506386 1512236 1502847 1478610 1440714 1391571 1334309 1271839 1206363
51542A206363o6919o7156o6148o3413n8556n2016m5036l8726l3348k8584k4160
$$ 1206363 1139444 1072288 1006140 942727 884171 832155 787119 748393 715045 686461 662301
51531F62301k0032j6257j3001j0529q959q000p174o241n349m760m523m477m433
$$ 662301 642269 626012 613011 602482 593523 585523 578349 572108 566759 561999 557476 552999 548566
51518E48566m254l810l085k403k279k747l132k864k392k642l611m194l735k971
$$ 548566 544312 540502 537417 535014 532735 529988 526856 523992 521600 518958 515347 511153 507418 504447
51504E04447k960l646m123l870l103k192j430j169j435j578r54J50Q89J070J234
$$ 504447 501487 497841 493718 489848 486745 484553 483123 481954 480519 478941 477987 478137 479026 480096 481330
51489D81330J583J656J208N99J3r26k346l533l757l274k932k956k709j655j44
$$ 481330 482913 484569 485777 486376 486389 485463 483117 479584 475827 472553 469621 466665 463956 462301 462157
51474D62157Q90Q81J36n42o92m82k55o3R0p7p16j314j151k80M96P19P87J158J688
$$ 462157 463047 463928 464064 463522 462830 462348 462093 462030 462120 462043 461327 460013 458862 458582 459078 459797 460584 461742 463430
51455D63430K010K210K624L256L876M530N566P127Q934J0697J2549J4838J7449
$$ 463430 465440 467650 470274 473530 477406 481936 487502 494629 503563 514260 526809 541647 559096
51442E59096J9517J9940J8260J4817J0151M764l89l729m125k136L43J614J058
$$ 559096 578613 598553 616813 631630 641781 646545 646156 642427 638302 636166 636509 638123 639181
51429F39181j182m648q545j1897j4086j4978j4568j2932j0602q468p011n971m893
$$ 639181 637999 633351 624806 612909 598823 583845 569277 556345 545743 537275 530264 524293 519400
51416E19400l633k286r92k8L67L87N13Q06Q38N06L79R39J942K899L724M448M759
$$ 519400 515767 513481 512489 512461 512828 513215 513728 514534 515372 515878 516257 517196 519138 522037 525761 530209 534968
51399E34968M399L787L629M003M372M443M614N427P028R237J1834J4633J7475
$$ 534968 539367 543154 546783 550786 555158 559601 564215 569642 576670 585907 597741 612374 629849
51386F29849K0399K3712K7820L2904L8827M5293N2037N8857O5514P1707P7124
$$ 629849 650248 673960 701780 734684 773511 818804 870841 929698 995212 1066919 1144043
51375A144043Q1310Q3366Q2003P6231O5978N1929L4932J5938l667k2233l8585
$$ 1144043 1225353 1308719 1390722 1466953 1532931 1584860 1619792 1635730 1632063 1609830 1571245
51364A571245n2335o3515p2079p7847q0597q0255p7246p2594o7212o1157n4050
$$ 1571245 1518910 1455395 1383316 1305469 1224872 1144617 1067371 994777 927565 866408 812358
51353H12358m6229l8885l2885k8093k4110k1025j8968j7458j5801j3911j2138
$$ 812358 766129 727244 694359 666266 642156 621131 602163 584705 568904 554993 542855
51342E42855j0535q916p485o779o856o959o339n112m041l572l429l146k742k540
$$ 542855 532320 523404 515919 509140 502284 495325 488986 483874 479833 476261 472832 469686 466944 464404
51328D64404k479k159j634j646k512l282k711r56N76J043J115J722K654K913K064
$$ 464404 461925 459766 458132 456486 453974 450692 447981 447025 447601 448644 449759 451481 454135 457048 459112
51313D59112O99j81J8J078K101K333K008K056K866L803M135L830L127J962L14
$$ 459112 459811 459630 459648 460726 462827 465160 467168 469224 472090 475893 480028 483858 486985 488947 489261
51298D89261j418k953m565o365p626p594o645n835n426m721l350j909j102q71
$$ 489261 487843 484890 480325 473960 466334 458740 452095 446260 440834 436113 432763 430854 429752 428881
51284D28881o56o4R56K215L330L918L938L693L469L396L571L999M392M363L932
$$ 428881 428225 428161 429117 431332 434662 438580 442518 446211 449680 453076 456647 460646 465038 469401 473333
51269D73333L536L508L842M461N329O180O522O155N434M695L673J803q71l386
$$ 473333 476869 480377 484219 488680 494009 500189 506711 512866 518300 522995 526668 528471 527600 524214
51255E24214m731m883m798n235n864n827n019m289m286m661m753m563m481m344
$$ 524214 519483 514600 509802 504567 498703 492876 487857 483568 479282 474621 469868 465305 460824 456480
51241D56480l556k107q52m83p29q70o04j17M93J312K233K876K957K540J797P98
$$ 456480 452924 450817 449965 449482 448753 447883 447279 447162 447655 448967 451200 454076 457033 459573 461370 462168
51225D62168l41j202j271m47Q19J969K769L210L262K933K424J904J261M00l41
$$ 462168 461827 460625 459354 458907 459726 461695 464464 467674 470936 473869 476293 478197 479458 479858 479517
51210D79517m71k7M97R50J743L053M352N054N246N396N596N540N011M055K805
$$ 479517 479046 479019 479516 480466 482209 485262 489614 494668 499914 505310 510906 516446 521457 525512 528317
51195E28317J479L97l04q13j255j406j143q65r84j165o46O48J809J968J171J31
$$ 528317 529796 530193 529889 529076 527821 526415 525272 524407 523423 522258 521612 522260 524069 526037 527208 527339
51179E27339n96r59j150j350j754k529l584m392m310l272j997j243r91o69j05
$$ 527339 526743 525784 524634 523284 521530 519001 515417 511025 506715 503443 501446 500203 499212 498543 498438
51164D98438K91L58N85J326K057J965R87j88j033j671k515l667m663m804l907
$$ 498438 498729 499087 499672 500998 503055 505020 506007 505819 504786 503115 500600 496933 492270 487466 483559
51149D83559k763k432k939l245k667j749j277j128p75l13j86j85K82J124J653
$$ 483559 480796 478364 475425 472180 469513 467764 466487 465359 464584 464271 464085 463900 464182 465306 466959
51134D66959J666J619J676J529J240J420K275L226L829M292M736M656L709K444
$$ 466959 468625 470244 471920 473449 474689 476109 478384 481610 485439 489731 494467 499123 502832 505276
51120E05276J644J351J131R75J169J522J438R10P54J606K996L834L647L029K813
$$ 505276 506920 508271 509402 510377 511546 513068 514506 515416 516170 517776 520772 524606 528253 531282 534095
51105E34095L088L314L164K843K462J641J14j602k660k891k897l171l664m166
$$ 534095 537183 540497 543661 546504 548966 550607 550721 549119 546459 543568 540671 537500 533836 529670
51091E29670m564m590l836k413j094m74k53K63J162J868K004J882K016K394K554
$$ 529670 525106 520516 516680 514267 513173 512699 512446 512709 513871 515739 517743 519625 521641 524035 526589
51076E26589K308K108K434L080L369L162L111L697M477M690M296L854L660L657
$$ 526589 528897 531005 533439 536519 539888 543050 546161 549858 554335 559025 563321 567175 570835 574492
51062E74492M003M951O118O636O292N937O318P025O926N397K827L53p11L84L125
$$ 574492 578495 583446 589564 596200 602492 608429 614747 621772 628698 634095 636922 637275 636564 636948 640073
51047F40073N978P741Q581R456J0774J2016J2494J2038J0911R452P962O738N988
$$ 640073 646051 653792 662373 671829 682603 694619 707113 719151 730062 739514 747476 754214 760202
51034G60202N638N265M281K233r86n132r605j3421j5583j5937j5419j5042j4641
$$ 760202 765840 771105 775386 777619 776633 771501 761896 748475 732892 716955 701536 686494 671853
51021F71853j3216j0447p248m610k597q06P26J736K436L359M607N777O573P092
$$ 671853 658637 648190 640942 636332 633735 632929 633655 635391 637827 641186 645793 651570 658143 665235
51007F65235P496P847Q241Q677Q796Q167O963N904N352M832L744K281J269J213
$$ 665235 672731 680578 688819 697496 706292 714459 721422 727326 732678 737510 741254 743535 744804 746017
50993G46017J806K509L246M422O350Q858J1470J3861J6024J8011J9603K0429K0530
$$ 746017 747823 750332 753578 758000 764350 773208 784678 798539 814563 832574 852177 872606 893136
50980H93136K0562K1239K2535K3748K4376K4536K4285K3011K0067J5903J1856
$$ 893136 913698 934937 957472 981220 1005596 1030132 1054417 1077428 1097495 1113398 1125254
50969A125254Q854O863N715N716P076R383J2198J5702K0112K4806K8779L1757
$$ 1125254 1134108 1140971 1146686 1152402 1159478 1168861 1181059 1196761 1216873 1241679 1270458 1302215
50957A302215L4165L6063L6885L6321L4794L2811L0410K7509K4472K1920K0164
$$ 1302215 1336380 1372443 1409328 1445649 1480443 1513254 1543664 1571173 1595645 1617565 1637729
50946A637729J8975J7838J6425J5076J4730J6074J8719K1337K2556K1471J7677
$$ 1637729 1656704 1674542 1690967 1706043 1720773 1736847 1755566 1776903 1799459 1820930 1838607
50935A838607J1501M203k591p970j1958j4860j6955j8799k1126k4126k7316l0329
$$ 1838607 1850108 1854311 1851720 1843750 1831792 1816932 1799977 1781178 1760052 1735926 1708610 1678281
50923A678281l3350l6491l9344m1483m2998m4089m4502m3812m1996l9396l6418
$$ 1678281 1644931 1608440 1569096 1527613 1484615 1440526 1396024 1352212 1310216 1270820 1234402
50912A234402l3562l1348k9749k7964k5308k2177j9680j8297j7395j6097j4231
$$ 1234402 1200840 1169492 1139743 1111779 1086471 1064294 1044614 1026317 1008922 992825 978594
50901I78594j2240j0464q833p253o020n562n723n608m498k809j701j681k000j670
$$ 978594 966354 955890 947057 939804 933784 928222 922499 916891 912393 909584 907883 906202 904202 902532
50887I02532p00P4K02K07Q64K135L150L253K842K861L603M431M855N274O282P659
$$ 902532 901832 901906 902108 902315 903179 905314 908464 911717 914559 917420 921023 925454 930309 935583 941865 949524
50871I49524Q638Q932Q918Q972R259J0041J1488J3180J4433J5175J5915J6949
$$ 949524 958162 967094 976012 984984 994243 1004284 1015772 1028952 1043385 1058560 1074475 1091424
50859A091424J8343K0548K4118K8619L2750L5927L8947M2833M7737N3286N9151
$$ 1091424 1109767 1130315 1154433 1183052 1215802 1251729 1290676 1333509 1381246 1434532 1493683
50848A493683O4861O9874P4402P9362Q4997R0265R4134R6685R8260R8432R6606
$$ 1493683 1558544 1628418 1702820 1782182 1867179 1957444 2051578 2148263 2246523 2344955 2441561
50837B441561R2880Q7444P9758O9439N7403M5125L3277K2126J2603N711J051k595
$$ 2441561 2534441 2621885 2701643 2771082 2828485 2873610 2906887 2929013 2941616 2947327 2948378 2945783
50825B945783n290n770l394R72O214J1933J7671K2230K4462K4029K0921J4905
$$ 2945783 2940493 2934723 2931329 2932301 2938515 2950448 2968119 2990349 3014811 3038840 3059761 3074666
50813C074666O005m917j6684k8581m0321n1611o2136p1630p9645q5516q8844q9803
$$ 3074666 3080671 3075754 3059070 3030489 2990168 2938557 2876421 2804791 2725146 2639630 2550786 2460983
50801B460983q8714q5630q0563p3874o6152n7836m9110m0076l0869k1679j2737
$$ 2460983 2372269 2286639 2206076 2132202 2066050 2008214 1959104 1919028 1888159 1866480 1853743
50790A853743m137M159J2015J8880K4173K7819L0117L1123L0485K7912K3501J7739
$$ 1853743 1849606 1853765 1865780 1884660 1908833 1936652 1966769 1997892 2028377 2056289 2079790 2097529
50778B097529J1436N547O07l713p981j2076j5257j7326j9169k1990k6224l1319
$$ 2097529 2108965 2114512 2115119 2111406 2103425 2091349 2076092 2058766 2039597 2017607 1991383 1960064
50766A960064l6358m0779m4658m8250n1274n2914n2762n1312m9113m5988m1758
$$ 1960064 1923706 1882927 1838269 1790019 1738745 1685831 1633069 1581757 1532644 1486656 1444898
50755A444898l7273l3636l0629k7036k2596j8411j5166j2153q640n082k132O63
$$ 1444898 1407625 1373989 1343360 1316324 1293728 1275317 1260151 1247998 1239358 1234276 1232144 1232807
50743A232807M152Q186J1923J5103J8112K1081K3932K7082L1075L5506L9267M2041
$$ 1232807 1236959 1245145 1257068 1272171 1290283 1311364 1335296 1362378 1393453 1428959 1468226 1510267
50731A510267M4690M7904N1257N3944N5780N6962N7401N6945N5894N4702N3265
$$ 1510267 1554957 1602861 1654118 1708062 1763842 1820804 1878205 1935150 1991044 2045746 2099011
50720B099011N1005M7569M3014L7349L0318K1764J1966J620q194j6125k1118k3157
$$ 2099011 2150016 2197585 2240599 2277948 2308266 2330030 2341996 2343616 2335422 2319297 2298179 2275022
50708B275022k3146k1864j9246j4934r172k837L214Q406J2248J4331J4611J3331
$$ 2275022 2251876 2230012 2210766 2195832 2186660 2183823 2187037 2195443 2207691 2222022 2236633 2249964
50696B249964J0552O086j08p643j5795k3564k9823l3900l6010l6667l5763l2844
$$ 2249964 2260516 2266602 2266494 2258851 2243056 2219492 2189669 2155769 2119759 2083092 2047329 2014485
50684B014485k8248k3143j8130j2674o300M69P018J3772K1547L0329L9530M9033
$$ 2014485 1986237 1963094 1944964 1932290 1925990 1926459 1933477 1947249 1968796 1999125 2038655 2087688
50672B087688N9027O9017P7988Q5400R1168R4700R4950R1542Q5129P6570O6560
$$ 2087688 2146715 2215732 2293720 2379120 2470288 2564988 2659938 2751480 2836609 2913179 2979739
50661B979739N6158M6754L9025L2490K6433K0723J5464J0474N387m3o020j2621
$$ 2979739 3035897 3082651 3121676 3154166 3180599 3201322 3216786 3227260 3232647 3232604 3226584 3213963
50649C213963j9435k5654l0613l3917l5151l4139l1489k8070k3807j7752r701
$$ 3213963 3194528 3168874 3138261 3104344 3069193 3035054 3003565 2975495 2951688 2933936 2924235
50638B924235r90O698J2704J7209K0460K2693K4248K5230K5370K4627K3444K2281
$$ 2924235 2923245 2929943 2942647 2959856 2980316 3003009 3027257 3052487 3077857 3102484 3125928 3148209
50626C148209K1425K1319K1977K1617J6881N557j1372l0750m9329o4214p2617
$$ 3148209 3169634 3190953 3212930 3234547 3251428 3256985 3245613 3214863 3165534 3101320 3028703
50615C028703p3177o7350n8169m7646l6340k5077j5388p943j946L179O532O796
$$ 3028703 2955526 2888176 2830007 2782361 2746021 2720944 2705556 2697613 2695667 2698846 2705378 2712174
50603B712174L831j481q499j7232k7661l9126n0387o0227o8093p4074p8131p9741
$$ 2712174 2716005 2714524 2706025 2688793 2661132 2622006 2571619 2511392 2443299 2369225 2291094 2211353
50591B211353p8817p6511p4157p1559o7438o1644n5683n0632m5761m0017l3835
$$ 2211353 2132536 2056025 1981868 1910309 1842871 1781227 1725544 1674912 1629151 1589134 1555299
50580A555299k8405k3914j9646j5324j1173o918k034L055P218J0268J3270J6772
$$ 1555299 1526894 1502980 1483334 1468010 1456837 1449919 1447885 1450940 1458158 1468426 1481696 1498468
50568A498468J9779K1151K1182K0931K0604J9616J8063J7121J7798K0007K3179
$$ 1498468 1518247 1539398 1560580 1581511 1602115 1621731 1639794 1656915 1674713 1694720 1717899
50557A717899K7319L2912M0075M8186N6343O3949P0745P6411Q0324Q1776Q0397
$$ 1717899 1745218 1778130 1818205 1866391 1922734 1986683 2057428 2133839 2214163 2295939 2376336
50546B376336P6346P0248O3118N6224N0678M6868M4494M3251M3256M4696M7367
$$ 2376336 2452682 2522930 2586048 2642272 2692950 2739818 2784312 2827563 2870819 2915515 2962882
50535B962882N0854N4830N8723O1508O2589O2871O4271O7981P3653Q0377Q7654
$$ 2962882 3013736 3068566 3127289 3188797 3251386 3314257 3378528 3446509 3520162 3600539 3688193
50524C688193R5129J02081J07839J12263J15294J16306J14477J09556J01700R0796
$$ 3688193 3783322 3885403 3993242 4105505 4220799 4337105 4451582 4561138 4662838 4753634
50514D753634P6513N8947L8801J6914n956k9079n1874p3860r4110j11065j23515
$$ 4753634 4830147 4889094 4927895 4944809 4938853 4909774 4857900 4784040 4689930 4578865 4455350
50503D455350j31531j35708j35815j31050j21578j08696r3270p5125n4399l2609
$$ 4455350 4323819 4188111 4052296 3921246 3799668 3690972 3597702 3522577 3468178 3435569
50493C435569j1687P362K4140L7771M7005N1109M9826M2664K9105R675j3736l8830
$$ 3435569 3423882 3431244 3455384 3493155 3540160 3591269 3641095 3683759 3712864 3722539 3708803 3669973
50481C669973o3807q7288j07822j23897j34505j39638j40236j37592j32625j25741
$$ 3669973 3606166 3518878 3411056 3287159 3152654 3013016 2872780 2735188 2602563 2476822
50471B476822j17291j08029r8936r0710q3497p7063p1161o5731o0777n6012n0868
$$ 2476822 2359531 2251502 2152566 2061856 1978359 1901296 1830135 1764404 1703627 1647615 1596747
50460A596747m5079l9134l3863k9579k5933k2539j9333j6325j3407j0588q033
$$ 1596747 1551668 1512534 1478671 1449092 1423159 1400620 1381287 1364962 1351555 1340967 1332934
50449A332934n829m006k712j960j204K49K294M080N173O049P183Q300Q949R293
$$ 1332934 1327105 1323099 1320387 1318427 1317223 1317472 1319766 1323846 1329019 1335068 1342251 1350551 1359500 1368793
50435A368793R838J0750J1808J2757J3486J4249J5807J8707K2234K4861K6144
$$ 1368793 1378631 1389381 1401189 1413946 1427432 1441681 1457488 1476195 1498429 1523290 1549434
50424A549434K7249K9084L0927L1814L2334L3808L6347L9067M1880M5581N0278
$$ 1549434 1576683 1605767 1636694 1668508 1700842 1734650 1770997 1810064 1851944 1897525 1947803
50413A947803N5087N9606O4345O9379P3790P6989P9579Q2259Q4650Q5811Q5248
$$ 1947803 2002890 2062496 2126841 2196220 2270010 2346999 2426578 2508837 2593487 2679298 2764546
50402B764546Q2788P8088P0981O1908N1445L9688K6527J2154l131j9182l5649
$$ 2764546 2847334 2925422 2996403 3058311 3109756 3149444 3175971 3188125 3184994 3165812 3130163
50391C130163n1676o6352p9153q9555r6685r9940r9673r6699r1372q3694p4094
$$ 3130163 3078487 3012135 2932982 2843427 2746742 2646802 2547129 2450430 2359058 2275364 2201270
50380B201270o3403n2087m0119k7748j5831n234L711J0984J6407J9581J9991J7105
$$ 2201270 2137867 2085780 2045661 2017913 2002082 1996848 2000559 2011543 2027950 2047531 2067522 2084627
50368B084627J0724J492r226k0174l0821m0943m9890n6653o0664o2209o2036o0796
$$ 2084627 2095351 2096843 2087617 2067443 2036622 1995679 1945789 1889136 1828472 1766263 1704227 1643431
50356A643431n8868n6452n3581n0206m6466m2744l9280l5945l2562k9304k6476
$$ 1643431 1584563 1528111 1474530 1424324 1377858 1335114 1295834 1259889 1227327 1198023 1171547
50345A171547k4009k1633j9451j7884j6926j5888j4213j2220j0706j0077j0040
$$ 1171547 1147538 1125905 1106454 1088570 1071644 1055756 1041543 1029323 1018617 1008540 998500
50334I98500j0037r721r163q739q647q506p701o175m505l068j714m05N52J279
$$ 998500 988463 978742 969579 960840 952193 943687 935986 929811 925306 922238 920524 920119 920671 921950
50320I21950K561M603O234O369N784O247Q089R842J0420J0444J1050J2356J3710
$$ 921950 924511 929114 935348 941717 947501 953748 961837 971679 982099 992543 1003593 1015949 1029659
50307A029659J4673J5113J4960J4486J4322J4562J4283J2635J0165Q435Q318R127
$$ 1029659 1044332 1059445 1074405 1088891 1103213 1117775 1132058 1144693 1154858 1163293 1171611 1180738
50295A180738R400Q223N842L243J235r7r87j256m84J191K981M448N779O791O275
$$ 1180738 1190138 1198361 1204203 1207446 1208681 1208584 1207597 1206341 1205857 1207048 1210029 1214477 1220256 1227047 1233322
50280A233322L197j897p342j2038j5886j8798k0210j9745j7728j4670j0820o520
$$ 1233322 1236519 1234622 1227280 1215242 1199356 1180558 1160348 1140603 1122875 1108205 1097385 1090865
50268A090865k527M81K486L873M710M729L958L044K752L277M205N122N974O760
$$ 1090865 1088338 1088819 1091305 1095178 1099888 1104617 1108575 1111619 1114371 1117648 1121853 1126975 1132949 1139709
50254A139709P150O733N600M343L413K744K125J503P47m60k123l627m374m562
$$ 1139709 1146859 1153592 1159192 1163535 1166948 1169692 1171817 1173320 1174067 1173607 1171484 1167857 1163483 1158921
50240A158921m820n260n394n006m501m225l989l520k975k664k512k185j558p65
$$ 1158921 1154101 1148841 1143447 1138441 1133940 1129715 1125726 1122206 1119231 1116567 1114055 1111870 1110312 1109547
50226A109547R5R93J807K457L092L887M712N296N662O076O602P121P820R109J0888
$$ 1109547 1109642 1110635 1112442 1114899 1117991 1121878 1126590 1131886 1137548 1143624 1150226 1157347 1165167 1174276 1185164
50211A185164J2378J3105J3645J4932J7198K0140K3828K8623L4307M0231M6516
$$ 1185164 1197542 1210647 1224292 1239224 1256422 1276562 1300390 1329013 1363320 1403551 1450067
50200A450067N4143O3481P3418Q2653R1075R8969J05346J08209J06436J00571
$$ 1450067 1504210 1567691 1641109 1723762 1814837 1913806 2019152 2127361 2233797 2334368
50190B334368R1757Q1019O9834O0338N4117N1127N0293N0587N0864M9096M2762
$$ 2334368 2426125 2507144 2576978 2637316 2691433 2742560 2792853 2843440 2894304 2943400 2986162
50179B986162L0298J1847j1244l7059o3218q7082j06506j20442j28683j31259
$$ 2986162 3016460 3028307 3017063 2980004 2916786 2829704 2723198 2602756 2474073 2342814
50169B342814j28394j20922j10337r8230q5679p3218o1162m9817l9625l1422k6333
$$ 2342814 2214420 2093498 1983161 1884931 1799252 1726034 1664872 1615055 1575430 1544008 1517675
50158A517675k4978k6569k9248l1464l2693l2700l0920k7280k3132k0338j9376
$$ 1517675 1492697 1466128 1436880 1405416 1372723 1340023 1309103 1281823 1258691 1238353 1218977
50147A218977j9126j8580j7894j7512j7181j6506j5787j5539j5511j4821j2998
$$ 1218977 1199851 1181271 1163377 1145865 1128684 1112178 1096391 1080852 1065341 1050520 1037522
50136A037522j0315p256m193j467P21K508M074N169N407M952M409L958L195J981
$$ 1037522 1027207 1019951 1015758 1014291 1015012 1017520 1021594 1026763 1032170 1037122 1041531 1045489 1048684 1050665
50122A050665R11N45N75K96k92l59P20K600M408N639O453P250Q252R475J0890
$$ 1050665 1051576 1052121 1052696 1052992 1052700 1052341 1053061 1055661 1060069 1065708 1072161 1079411 1087663 1097138 1108028
50107A108028J2447J3993J5305J6287J7147J8279J9918K1880K3704K5076K6031
$$ 1108028 1120475 1134468 1149773 1166060 1183207 1201486 1221404 1243284 1266988 1292064 1318095
50096A318095K6764K7496K8665L1016L4983M0058M5229N0174N5685O2625P1007
$$ 1318095 1344859 1372355 1401020 1432036 1467019 1507077 1552306 1602480 1658165 1720790 1791797
50085A791797Q0362R0650J02243J15301J29695J45261J61390J76283J87355J92671
$$ 1791797 1872159 1962809 2065052 2180353 2310048 2455309 2616699 2792982 2980337 3173008
50075C173008J91890J85883J76098J64431J53033J43769J37759J35252J35314
$$ 3173008 3364898 3550781 3726879 3891310 4044343 4188112 4325871 4461123 4596437
50066D596437J35475J32335J23027J06068Q0862M7329O612l8100q2312j22104
$$ 4596437 4731912 4864247 4987274 5093342 5174204 5221533 5228145 5190045 5107733 4985629
50056D985629j55427j81908k01875k15516k22836k24199k20689k13568k03503
$$ 4985629 4830202 4648294 4446419 4230903 4008067 3783868 3563179 3349611 3146108
50047C146108j90749j76066j60714j45382j29677j13150r6416q0985o8235n8787
$$ 3146108 2955359 2779293 2618579 2473197 2343520 2230370 2133954 2052969 1984734 1925947
50037A925947n2298m7472m2778l7686l2865k8908k5378k1661j8080j5389j3608
$$ 1925947 1873649 1826177 1783399 1745713 1712848 1683940 1658562 1636901 1618821 1603432 1589824
50026A589824j2224j1275j1217j1863j2330j2202j1920j1930j2154j2554j3475
$$ 1589824 1577600 1566325 1555108 1543245 1530915 1518713 1506793 1494863 1482709 1470155 1456680
50015A456680j5074j6904j8357j9067j8727j7128j4672j2370j0872r845q577o943
$$ 1456680 1441606 1424702 1406345 1387278 1368551 1351423 1336751 1324381 1313509 1303664 1295087 1288144
50003A288144n346m015k692r58J244L371M509M108K538P41p26j938l105m280n762
$$ 1288144 1282798 1278783 1276091 1275133 1276377 1279748 1284257 1288365 1290903 1291644 1290918 1288980 1285875 1281595 1275833
49988A275833q079j1183j4044j5468j5212j3950j2389j0701q622n826k251J724
$$ 1275833 1267754 1256571 1242527 1227059 1211847 1197897 1185508 1174807 1166185 1160359 1158108 1159832
49976A159832N540Q959J2098J4923J7149J8907K1102K4656K9587L5299M1517M8502
$$ 1159832 1165372 1174331 1186429 1201352 1218501 1237408 1258510 1283166 1312753 1348052 1389569 1438071
49964A438071N6442O5246P4995Q6038R8333J10991J22772J32839J40662J45233
$$ 1438071 1494513 1559759 1634754 1720792 1819125 1930116 2052888 2185727 2326389 2471622
49954B471622J44841J38161J25706J10035R4312Q0701P0129O3006N9240N7442
$$ 2471622 2616463 2754624 2880330 2990365 3084677 3165378 3235507 3298513 3357753 3415195
49944C415195N4768M8177L5555J5703j1818m5765q2534j17376j46651j68667j82766
$$ 3415195 3469963 3518140 3553695 3569398 3557580 3511815 3429281 3311905 3165254 2996587 2813821
49933B813821j88714j87154j79736j68198j53800j37875j22097j07550r3946q0582
$$ 2813821 2625107 2437953 2258217 2090019 1936219 1798344 1676247 1568697 1474751 1394169
49923A394169o7735n6513m7497m0290l4287k9185k4604k0039j5486j1627q988
$$ 1394169 1326434 1269921 1222424 1182134 1147847 1118662 1094058 1074019 1058533 1046906 1037918
49912A037918p232n574l563j171J630M939Q622J2140J4706J5625J4687J2418R743
$$ 1037918 1030686 1025112 1021549 1020378 1022008 1026947 1035569 1047709 1062415 1078040 1092727 1105145 1114888
$$ [...]
##END NTUPLES=NMR SPECTRUM
##END=
