##TITLE=AC1398_2151uv_7519910_E9KT24DFFK
##JCAMPDX= 6.0         $$ Bruker NMR JCAMP-DX V2.0
##DATA TYPE= NMR SPECTRUM
##DATA CLASS= NTUPLES
##ORIGIN= BRUKER
##OWNER= Administrator
$$ 1.72 TOPSPIN		Version 2.1
$$ 2013-04-17 02:50:35.445 -0700  Administrator@X
$$ Compression mode = diff/dup
##.OBSERVE FREQUENCY= 400.02188249412
##.OBSERVE NUCLEUS= ^1H
##.ACQUISITION MODE= SIMULTANEOUS (DQD)
##.ACQUISITION SCHEME= undefined
##.AVERAGES= 8
##.DIGITISER RES= 22
##SPECTROMETER/DATA SYSTEM= spect
##.PULSE SEQUENCE= zg30
##.SOLVENT NAME= COFFEE_meoh
##.SHIFT REFERENCE= INTERNAL, COFFEE_meoh, 1, 14.98509
##AUDIT TRAIL= $$ (NUMBER, WHEN, WHO, WHERE, PROCESS, VERSION, WHAT)
$$ ##TITLE= Audit trail, TOPSPIN		Version 2.1
$$ ##JCAMPDX= 5.01
$$ ##ORIGIN= Bruker BioSpin GmbH
$$ ##OWNER= Administrator
$$ $$ E:\/data/COFFEE/nmr/AC1398_2151uv_7519910_E9KT24DFFK/10/pdata/1/auditp.txt
$$ ##AUDIT TRAIL=  $$ (NUMBER, WHEN, WHO, WHERE, PROCESS, VERSION, WHAT)
(   1,<2013-04-17 02:50:28.461 -0700>,<Administrator>,<X>,<go>,<TOPSPIN 2.1>,
      <created by zg
	started at 2013-04-17 02:49:22.273 -0700,
	POWCHK enabled, PULCHK disabled,
       configuration hash MD5:
       33 CF 6A 21 5C D3 B9 40 6C 15 AA 8D 27 A2 4F 13
       data hash MD5: 64K
       42 D0 35 57 3F C0 21 67 9B 13 56 8A 91 50 8B 7E>)
(   2,<2013-04-17 02:50:31.476 -0700>,<Administrator>,<X>,<proc1d>,<TOPSPIN 2.1>,
      <Start of raw data processing
       efp LB = 0 FT_mod = 6 PKNL = 1 PHC0 = 0 PHC1 = 0 SI = 32K 
       data hash MD5: 32K
       D8 1C E1 AF 9F 51 5E 2D 4F DA 94 3E CB 6D FA CD>)
(   3,<2013-04-17 02:50:31.804 -0700>,<Administrator>,<X>,<proc1d>,<TOPSPIN 2.1>,
      <pk PHC0 = 100.1678 PHC1 = 0 
       data hash MD5: 32K
       53 7E 4D 54 20 63 DE 02 4F E7 E8 85 49 B8 F4 DF>)
(   4,<2013-04-17 02:50:31.945 -0700>,<Administrator>,<X>,<proc1d>,<TOPSPIN 2.1>,
      <abs ABSG = 1 
       data hash MD5: 32K
       2E FF F2 81 F3 9E CB 96 B9 FF F2 9E 26 F9 5A 7D>)
(   5,<2013-04-17 02:50:32.023 -0700>,<Administrator>,<X>,<proc1d>,<TOPSPIN 2.1>,
      <abs ABSG = 2 
       data hash MD5: 32K
       11 0D E4 0E 77 04 2D 9C AE 34 1A 6E ED 3F A7 2A>)
(   6,<2013-04-17 02:50:32.070 -0700>,<Administrator>,<X>,<proc1d>,<TOPSPIN 2.1>,
      <abs ABSG = 3 
       data hash MD5: 32K
       D1 17 3F EF 9C 2A 1A 06 16 04 47 B4 C3 67 DF 97>)
(   7,<2013-04-17 02:50:32.133 -0700>,<Administrator>,<X>,<proc1d>,<TOPSPIN 2.1>,
      <abs ABSG = 4 
       data hash MD5: 32K
       FE 17 FD 19 B3 2C 35 58 9F F4 91 CB 37 7D 72 A3>)
(   8,<2013-04-17 02:50:32.179 -0700>,<Administrator>,<X>,<proc1d>,<TOPSPIN 2.1>,
      <abs ABSG = 5 
       data hash MD5: 32K
       22 B8 41 52 E6 16 DE 39 97 E4 75 4A AB 2C 86 FA>)
$$ ##END=
$$ 
$$ $$ hash MD5
$$ $$ 4A 02 FB 8F 75 C6 C3 3C D3 9A EB 10 32 D0 C3 68
##$RELAX= 
##$RELAX= 
##$RELAX= 
##$RELAX= 
##$RELAX= 
##$RELAX= 
##$RELAX= 
$$ Bruker specific parameters
$$ --------------------------
##$DU= <E:\>
##$EXPNO= 10
##$NAME= <AC1398_2151uv_7519910_E9KT24DFFK>
##$PROCNO= 1
$$ [...]
150 150 150 150 150 150 150 150
##$TP07= 0
##$TPNAME0= <>
##$TPNAME1= <>
##$TPNAME2= <>
##$TPNAME3= <>
##$TPNAME4= <>
##$TPNAME5= <>
##$TPNAME6= <>
##$TPNAME7= <>
##$TPOAL= (0..7)
0.5 0.5 0.5 0.5 0.5 0.5 0.5 0.5
##$TPOFFS= (0..7)
0 0 0 0 0 0 0 0
##$TUNHIN= 0
##$TUNHOUT= 0
##$TUNXOUT= 0
##$USERA1= <user>
##$USERA2= <user>
##$USERA3= <user>
##$USERA4= <user>
##$USERA5= <user>
##$V9= 5
##$VALIST= <valist>
##$VCLIST= <CCCCCCCCCCCCCCC>
##$VD= 0
##$VDLIST= <DDDDDDDDDDDDDDD>
##$VPLIST= <PPPPPPPPPPPPPPP>
##$VTLIST= <TTTTTTTTTTTTTTT>
##$WBST= 2048
##$WBSW= 25
##$XGAIN= (0..3)
0 0 0 0
##$XL= 0
##$YL= 0
##$YMAX_a= 655379
##$YMIN_a= -557445
##$ZGOPTNS= <>
##$ZL1= 120
##$ZL2= 120
##$ZL3= 120
##$ZL4= 120
##$ABSF1= 14.98509
##$ABSF2= -5.573092
##$ABSG= 5
##$ABSL= 3
##$ALPHA= 0
##$AQORDER= 0
##$ASSFAC= 0
##$ASSFACI= 0
##$ASSFACX= 0
##$ASSWID= 0
##$AUNMP= <proc_prof1d_extract_pilot.lims>
##$AXLEFT= 0
##$AXNAME= <>
##$AXNUC= <1H>
##$AXRIGHT= 0
##$AXTYPE= 0
##$AXUNIT= <>
##$AZFE= 0.1
##$AZFW= 0.1
##$BCFW= 0
##$BC_mod= 0
##$BYTORDP= 0
##$COROFFS= 0
##$CY= 15
##$DATMOD= 1
##$DC= 0
##$DFILT= <>
##$DTYPP= 0
##$F1P= 0
##$F2P= 0
##$FCOR= 0.5
##$FTSIZE= 32768
##$FT_mod= 6
##$GAMMA= 0
##$GB= 0
##$INTBC= 1
##$INTSCL= 1
##$ISEN= 128
##$LB= 0
##$LEV0= 0
##$LPBIN= 0
##$MAXI= 10000
##$MC2= 0
##$MEAN= 0
##$ME_mod= 0
##$MI= 0
##$NCOEF= 0
##$NC_proc= -8
##$NLEV= 6
##$NOISF1= 0
##$NOISF2= 0
##$NSP= 0
##$NTH_PI= 0
##$NZP= 0
##$OFFSET= 14.98509
##$PC= 1
##$PHC0= 100.1678
##$PHC1= 0
##$PH_mod= 1
##$PKNL= yes
##$PPARMOD= 0
##$PPDIAG= 0
##$PPIPTYP= 0
##$PPMPNUM= 2147483647
##$PPRESOL= 1
##$PSCAL= 4
##$PSIGN= 0
##$PYNMP= <proc.py>
##$REVERSE= no
##$SF= 400.02
##$SI= 32768
##$SIGF1= 0
##$SIGF2= 0
##$SINO= 400
##$SIOLD= 32768
##$SPECTYP= <>
##$SREGLST= <1H.CDCl3>
##$SSB= 0
##$STSI= 32768
##$STSR= 0
##$SW_p= 8223.68421052631
##$SYMM= 0
##$S_DEV= 0
##$TDeff= 65536
##$TDoff= 0
##$TI= <>
##$TILT= no
##$TM1= 0
##$TM2= 0
##$TOPLEV= 0
##$USERP1= <user>
##$USERP2= <user>
##$USERP3= <user>
##$USERP4= <user>
##$USERP5= <user>
##$WDW= 1
##$XDIM= 32768
##$YMAX_p= 466900075
##$YMIN_p= -628642
##$CURPLOT= <Network HP LaserJet P1505>
##$CURPRIN= <$Network HP LaserJet P1505>
##$DFORMAT= <normdp>
##$LAYOUT= <+/1D_H.xwp>
##$LFORMAT= <normlp>
##$PFORMAT= <normpl>
##$SURQMSG= 1
$$ End of Bruker specific parameters
$$ ---------------------------------
##NTUPLES= NMR SPECTRUM
##VAR_NAME=  FREQUENCY,     SPECTRUM/REAL,   SPECTRUM/IMAG
##SYMBOL=    X,             R,               I
##VAR_TYPE=  INDEPENDENT,   DEPENDENT,       DEPENDENT
##VAR_FORM=  AFFN,          ASDF,            ASDF
##VAR_DIM=   32768,         32768,           32768
##UNITS=     HZ,            ARBITRARY UNITS, ARBITRARY UNITS
##FACTOR=    0.250966925370066, 1,           1
##FIRST=     8223.43324360094, -339152,      -124454
##LAST=      0,             -15709,          -201746
##MIN=       0,             -628642,         0
##MAX=       8223.43324360094, 466900075,    0
$$ Real data points
##PAGE= N=1
##DATA TABLE= (X++(R..R)), XYDATA
$$ [...]
$$ plain form
19530 32500 -82414 30277 50023 -35733 -202553 -39816 122037 156053 -123191 44077 -76568
19518 -55040 -251889 -204304 15245 285509 -282672 -116108 -226942 -132493 -389780 -493541
19508 -493541 -398066 -117109 -8442 -84559 32052 205630 -56458 157789 -129612 -98167 -147718
19497 -147718 45715 58710 -211214 -62036 35818 -19009 11578 -27169 90130 -437500 174717
19485 178100 40712 -40382 -201007 171473 -240395 -422972 43879 -19838 -63263 91319 289260
19474 289260 -39161 82800 -46002 -185956 3835 -120354 -155859 -20027 9717 -163396 258054
19462 204726 -271337 -19860 -169612 -277785 -111279 24558 84365 -79749 -88075 -101764 -246644
19451 -246644 -143853 -127412 -198999 -273348 116416 -176923 -66492 156142 -30481 -97102 -111104
$$ packed form
19530C2500h2414C0277J9746c5733j66820c9816A22037L4016a23191D4077g6568
19518e5040j96849M7585A5245K70264b82672a16108j10834R4449k57287j03761
19508d93541R5475a17109h442p6117C2052J73578e6458A57789a29612L1445m9551
19497a47718D5715J2995b11214f2036C5818a9009A1578b7169I0130d37500A74717
19485A78100D0712d0382j60625A71473b40395j82577D3879a9838m3425I1319J97941
19474B89260c9161H2800d6002j39954C835a20354l5505b0027I717a63396B58054
19462B04726b71337a9860j49752j08173a11279B4558N9807g9749q326j3689j44880
19451b46644J02791J6441p1587p4349A16416a76923f6492A56142c0481o6621j4002
$$ plain form
19440 -111104 -60456 -284387 121727 -295655 -194448 -270746 5767 266018 72315 63015 5795
19428 120732 -33104 -291342 -188913 53310 -158974 -382833 53992 69841 307551 -24942
19417 -99428 -57584 117698 155720 -215684 32304 70945 -308275 90945 -90933 -134613 36662
19405 -127714 -68682 -83923 316290 222957 -249385 -177398 -84763 -84784 141603 -4704 140556
19393 132357 -365518 -358613 172100 -165143 -137901 340078 -123303 -186217 -91534 -194203
19383 -194203 67361 -144008 361975 -216595 180530 96063 -217649 125704 -207897 -186310
19373 -186310 -254429 -84342 -231833 109516 -259105 -126846 23794 -84083 -149874 40223 -241122
19361 -180631 -60395 -157557 -49364 -326990 -135834 -418120 8370 -43972 -129651 -379600 -77749
$$ packed form
19440a11104N0648k23931A21727b95655J01207p6298E767K60251G2315r300E795
19428A20732c3104k58238J02429E3310a58974k23859E3992J5849K37710b4942
19417i9428M1844A17698L8022b15684C2304L8641c08275I0945i0933m3680C6662
19405a27714N9032j5241C16290r3333b49385P1987h4763k1A41603d704A40556
19393A32357c65518O905A72100a65143K7242C40078a23303o2914i1534j02669
19383a94203F7361a44008C61975b16595A80530q4467b17649A25704b07897K1587
19373a86310o8119h4342j47491A09516b59105a26846B3794h4083o5791D0223b41122
19361a80631f0395r7162d9364k77626a35834k82286H370d3972q5679k49949g7749
$$ plain form
19349 -35454 -204438 34043 166253 449698 -102196 -259669 -104322 336757 222881 -131064
19338 -159425 -370045 -38697 -203347 -56614 373179 32078 -165580 -184603 -255755 164576
19327 -108182 -195371 -52955 25049 278787 -135981 83062 47964 -233190 -3194 66133 237978
19316 237978 55049 -183225 80736 -74741 -8721 -72533 36153 -247355 -172315 -107420 -103606
19305 -103606 26027 -71760 -260678 -186086 -61992 -247138 322463 -198961 -497818 37803
19294 -336187 -356021 94476 291153 160125 -212562 -427229 -86543 113864 -178719 -266681
19284 -266681 -373459 18474 -232405 -316009 -276196 160483 -258807 -399190 -41339 -191718
19274 -191718 -271747 -81331 19550 -82443 -378080 -194583 113580 -347667 75119 29650 7814
$$ packed form
19349c5454j68984C4043J32210K83445a02196j57473a04322C36757j13876a31064
19338a59425k10620c8697j64650e6614C73179C2078a65580j9023p1152A64576
19327a08182q7189e2955B5049K53738a35981H3062l5098b33190c194F6133J71845
19316B37978E5049a83225H0736g4741h721o3812C6153b47355P5040O4895L814
19305a03606B6027g1760j88918P4592f1992j85146C22463a98961k98857C7803
19294c36187j9834I4476J96677j31028b12562k14667h6543A13864a78719q7962
19284b66681j06778A8474b32405q3604L9813A60483b58807j40383d1339j50379
19274a91718q0029h1331A9550h2443k95637J83497A13580c47667G5119B9650G814
$$ plain form
19262 64639 -151946 -86200 230494 67580 69419 -107108 7591 62754 2065 -53837 44267 29361
19250 29361 118434 241625 -432733 137264 -70228 142821 29040 117901 71363 -363643 -66619
19238 -153460 -128104 137412 26458 470637 -37145 507893 -226623 109774 -154038 307993
19227 -241517 149250 -209704 61154 -2644 41922 37453 242210 372060 59836 2157 -216229
19215 -141929 89892 99330 -197828 36233 278399 88490 -86244 -93817 -341191 -171463 38679
19203 -75579 -163051 77318 -188656 -218882 53996 -407595 -165132 -232315 -312827 -256831 4912
19191 -149545 -68587 -280844 -160401 -103530 135650 60166 55209 -44870 150841 44812 65749
19180 65749 91258 -84246 -221390 25820 -238427 -297717 122838 -369480 56006 -115227 93783
$$ packed form
19262F4639a51946O5746B30494F7580J839a07108G591N5163B065e3837D4267j4906
19250B9361Q9073J23191d32733A37264g0228A42821B9040Q8861m6538c63643f6619
19238a53460K5356A37412B6458M44179c7145E07893b26623A09774a54038C07993
19227b41517A49250b09704F1154b644D1922m469K04757J29850E9836B157b16229
19215a41929H9892R438a97828C6233K42166H8490h6244p573k47374J69728C8679
19203g5579q7472G7318a88656l0226E3996d07595a65132o7183q0512N5996D912
19191a49545f8587k12257J20443N6871A35650F0166m957d4870A50841D4812K0937
19180F5749K5509h4246j37144B5820b38427n9290A22838c69480E6006a15227I3783
$$ plain form
19168 -115418 49643 77584 14934 90083 -191358 232330 -133354 -31588 -142924 -129778 -385769
19157 -385769 -118210 -165205 -193117 1123 -110053 -14279 -266093 -33502 112345 134728 17341
19145 -210973 -157605 282398 -144155 -20540 -111870 -62837 -139900 -411760 -263473 -23655 -45507
19134 -45507 -168190 -28237 -340575 -3007 139710 -55850 -70965 -56931 110917 -219454 -303626
19123 -303626 -39107 -391204 146092 -149484 -128237 -186564 -210456 137440 -6481 -145081 -9919
19111 -160577 -85754 205042 -14848 38479 -212707 145739 -130679 -154373 -74562 150551
19100 -10708 -118426 -206949 -208973 -172967 48327 112445 187957 -178135 177008 310356 -41165
19088 -278464 -93206 -9979 -71805 154743 127048 6466 -174519 4794 -127684 103674 69055
$$ packed form
19168a15418D9643K7941A4934P5149a91358B32330a33354c1588j11336J3146k55991
19157c85769a18210m6995k7912A123a10053a4279k51814c3502A12345K2383A7341
19145b10973N3368B82398a44155b0540r1330M9033p7063k71860J48287b3655k1852
19134d5507j22683b8237l12338c007A39710e5850j5115J4034A10917b19454q4172
19123c03626c9107l52097A46092a49484K1247n8327k3892A37440f481j38600i919
19111a60577P4823B05042a4848C8479b12707A45739a30679k3694g4562A50551
19100a0708j07718q8523k024L6006D8327O4118P5512a78135A77008J33348d1165
19088b78464i3206i979o1826A54743k7695F466a74519D794a27684A03674l4619
$$ plain form
19077 69055 -214169 -24691 138638 -211479 -141426 -337143 39323 -14507 -95436 -82706 -49351
19066 -49351 -382666 -335483 72053 -26284 -202290 124542 -190799 -50756 -291144 139860
19055 286584 -16117 -150807 -231579 61774 -144993 -333877 -523404 204454 64961 -107777
19044 249016 -62228 -271187 -40147 -227477 31321 88396 -20902 -95591 -54060 -103732 -62869
19033 -62869 -133415 -287077 -254164 -80351 75377 192954 38186 24197 131565 -114705 -222972
19022 -222972 118020 -107119 -35740 59570 -193285 192873 27690 -129686 62209 13190
19011 -97838 185543 -124911 9640 66618 -185898 71529 -155838 -92613 122975 -175777 167429
18999 96800 178830 -154706 -44002 -191869 -312383 -188828 233686 -131964 -89110 -214153
$$ packed form
19077F9055b14169b4691A38638b11479P0053j95717C9323a4507q0929J2730L3355
19066d9351l33315M7183G2053b6284j76006A24542a90799e0756k40388A39860
19055B86584a6117j34690q0772F1774a44993j88884j89527B04454F4961a07777
19044B49016f2228k08959d0147j87330C1321N7075b0902p4689M1531m9672M0863
19033f2869p0546j53662L2913h0351G5377J17577C8186j3989J07368a14705j08267
19022b22972A18020a07119c5740E9570a93285A92873B7690a29686F2209A3190
19011i7838A85543a24911I640N6978a85898G1529a55838O3225A22975a75777A67429
18999I6800Q2030a54706d4002j47867j20514J23555B33686a31964M2854j25043
$$ plain form
18989 -214153 -268519 -136478 65841 154766 182842 -388327 -192693 -282349 -287032 -70034 -206343
18978 -206343 -279116 173917 248994 98537 -115205 42011 39002 -249529 73905 -125885 136376
18966 35488 -174525 -382813 -2015 -29082 285424 84680 -36143 -235049 -198631 -274041 -437191
18955 -437191 -962 267364 -38965 111458 358821 -106968 -20479 -17648 39662 -78086 89037
18943 -39315 62244 -190169 40794 2787 -275606 211134 -460768 -408864 -150559 -57546 -227393
18932 -227393 -18876 39959 -212418 -160488 -12824 125507 -202693 -47434 183209 -236263
18921 -265585 -279953 -26971 -67546 318027 -43794 -72042 -12137 -169497 -27990 -77332 253755
18909 6238 213744 -56530 129966 -307292 -69622 61168 79035 -166432 -208877 -124481 178403
$$ packed form
18989b14153n4366J32041F5841Q8925K8076c88327a92693q9656m683g0034j36309
18978b06343p2773A73917P5077I8537a15205D2011l009b49529G3905a25885A36376
18966C5488a74525k08288b015k7067B85424H4680c6143j98906L6418p5410j63150
18955d37191i62B67364c8965A11458K47363a06968b0479K831C9662g8086H9037
18943c9315F2244a90169D0794B787b75606B11134d60768N1904a50559e7546j69847
18932b27393a8876C9959b12418N1930a2824A25507b02693d7434A83209b36263
18921b65585j4368b6971m0575C18027d3794k8248a2137j57360b7990m9342B53755
18909F238K07506e6530A29966c07292f9622F1168J7867a66432m2445Q4396A78403
$$ plain form
18897 -31888 359810 -188052 -123444 98321 197984 248434 -126671 -126399 -8581 120612 9609 -372011
18884 -87191 -197843 -198690 -31906 -108358 93252 13041 44920 -69559 -87437 -388791 -36567 -31206
18872 -31206 103167 118444 61211 185096 -462802 -124026 -155871 -112961 -278484 -129321
18861 -175711 -237711 185754 -78758 -111382 -243332 18216 292279 6989 -409234 -68634 -111024
18850 -111024 33837 62213 200231 74713 -22661 31163 266961 -213653 -257341 -79142 69057
18838 -338643 140886 346691 116360 133067 166157 88823 -270265 181933 -90691 -215911
18828 -215911 120780 -158664 369156 -133903 -76338 -176142 -339581 -243494 -12109 -44941
18818 -44941 -46790 261103 140383 11325 -375114 38654 130700 252591 92281 84142 57456
$$ packed form
18897c1888C59810a88052O4608I8321R9663N0450a26671K72h581A20612I609c72011
18884h7191j10652q47c1906p6452I3252A3041L1879f9559j7878l01354c6567N361
18872c1206A03167J5277n7233J23885d62802a24026l1845M2910j65523a29321
18861a75711o2000A85754g8758l2624j31950A8216K74063F989d09234f8634m2390
18850a11024C3837K8376J38018G4713b2661C1163K35798b13653m3688g9142F9057
18838c38643A40886K05805A16360J6707L3090p7334b70265A81933i0691j25220
18828b15911A20780a58664C69156a33903N7565r9804j63439R6087a2109l2832
18818d4941j849B61103j20720A1325c75114C8654R2046J21891I2281q139k6686
$$ plain form
18807 57456 -300969 143585 -237893 343731 -405648 -18863 19753 -41480 -19239 -216906
18797 -216906 -120242 118334 -42111 726 -168774 68824 -301658 -213386 20334 76084 -338978
18785 -186447 -107038 -314426 -92574 -176413 117502 -214247 72394 -190975 -58218 -68392 155006
18773 379875 -549629 -19795 49572 -48992 118631 -29919 -237308 -137831 -155924 151404 -49878
18761 -203345 -135801 -197794 -168131 -299637 -16748 -378806 -76626 -74964 -238220 -202033 152760
18749 1074 -321267 -231815 -18056 -240679 -89256 -87834 145113 -260957 40515 -94376 87148
18737 -256945 -227161 174722 74051 -132071 149318 102604 -74340 102521 -115640 72681
18726 159065 32078 -180423 -194726 -67987 56309 -206484 20077 -143607 68886 -176148 -18178
$$ packed form
18807E7456c00969A43585b37893C43731d05648a8863A9753d1480a9239j97667
18797b16906R6664A18334d2111G26a68774F8824c01658Q8272B0334N5750c38978
18785a86447P9409k07388i2574q3839A17502b14247G2394a90975e8218j0174A55006
18773C79875e49629a9795D9572d8992A18631b9919k07389R9477j8093A51404d9878
18761b03345O7544o1993K9663j31506a6748l62058g6626J662j63256L6187A52760
18749A074c21267Q9452a8056k22623h9256J422A45113b60957D0515i4376H7148
18737b56945K9784A74722G4051a32071A49318m6714g4340A02521a15640G2681
18726A59065C2078a80423j4303f7987E6309b06484B0077a43607F8886a76148a8178
$$ plain form
18714 111484 -212062 -459247 78683 -305190 238314 357705 -214207 217142 482004 166345
18703 -264687 -169884 110889 80699 -23645 -55898 -221097 -23417 169139 122612 -51765 72161
18691 88381 -85677 -31921 58416 -281363 80250 -231635 187571 30652 -255175 -244090 -297742
18680 -297742 188692 49764 59346 -30028 479745 -227945 57491 -182403 -59236 234329 -129728
18668 1625 -47860 -114237 -1889 -177208 211194 170782 117330 153813 -119376 269473 -53755
18656 -136395 -90230 -102542 -161180 -156110 30615 -231831 191435 160088 -192371 -30022 -114778
18645 -114778 -168154 -104166 -222094 114752 -90965 -22048 43498 198758 62224 -17075 -24492
18634 -24492 53193 -108828 29147 -66268 -154551 -50210 -59285 -143293 -62187 -103518 66944 25722
$$ packed form
18714A11484b12062k47185G8683c05190B38314J19391b14207B17142K64862A66345
18703b64687R4803A10889l0190b3645l2253j65199b3417A69139m6527e1765G2161
18691H8381h5677c1921E8416b81363H0250b31635A87571C0652b55175J1085n3652
18680b97742A88692D9764R582c0028D79745b27945E7491a82403e9236B34329a29728
18668A625d7860o6377a889j75319B11194m0412n3452L6483a19376B69473e3755
18656a36395M6165j2312n8638N070C0615b31831A91435l1347a92371c0022q4756
18645a14778n3376O3988j17928A14752i0965b2048D3498J55260F2224a7075p417
18634b4492E3193a08828B9147f6268q8283e0210r075q4008f2187m1331F6944B5722
$$ plain form
18621 -46189 -371175 -63739 -4203 194110 55896 -110785 -323684 -405718 -178903 -93814 -333824
18610 -333824 -293930 27299 -79861 -371334 5133 -278760 -69061 48938 -300464 -169502 97853
18598 56951 -22770 -132017 -57863 -131020 142305 251083 -54937 42075 -127406 -237500 -112052
18586 101025 27308 78929 -283887 84153 -34671 141438 198149 -227383 -61901 -101690 -78377
18575 -78377 -25780 -166430 126462 -84013 -189341 175298 134255 24167 -47207 -79777 -190093
18564 -190093 -236687 -156540 -101427 -308333 -203495 -230556 -180068 -205502 -350180 -294376 -172654
18553 -172654 -228893 147230 16451 167513 -93413 274549 -367800 -140667 82586 103777
18543 103777 -6313 -45829 -48054 -180059 -335900 -63546 -20788 -129136 -156355 -36865 -202874
$$ packed form
18621d6189l24986f3739d203A94110E5896a10785k12899q2034a78903Q5089k40010
18610c33824L9894B7299g9861k91473E133b78760f9061D8938c00464J30962I7853
18598E6951b2770j09247e7863p3157A42305J08778e4937D2075a27406j10094a12052
18586A01025B7308N1621b83887H4153c4671A41438N6711b27383f1901l9789K3313
18575g8377b5780j40650A26462h4013j05328A75298m1043B4167d7207l2570j10316
18564a90093m6594Q0147N5113k06906J04838k7061N0488k5434j44678N5804J21722
18553a72654n6239A47230A6451J51062i3413B74549c67800a40667H2586K1191
18543A03777f313l9516k225j32005j55841f3546b0788j08348k7219c6865j66009
$$ plain form
18532 -202874 -102787 -36051 100152 -172900 -186491 -337226 -234158 -36416 281147 -228177
18521 431751 -96039 -60372 33109 -231282 215327 76026 158665 162734 5879 37944 176494
18510 176494 -243123 -404660 -551531 274275 -248907 25459 -226127 23464 104991 -284266
18499 -4072 -190741 2753 -68240 105074 -174300 37137 124022 -8336 101915 -193649 66160
18487 257285 363412 -71240 68774 -35442 58561 129142 130186 -102906 -215950 -225545 -316752
18476 -316752 54016 262387 280541 -179495 -430640 -235939 257794 -308053 153536 -236733
18465 -83616 98886 -189745 248201 -105138 -24057 -68790 332282 -89335 -165499 -345265 54449
18453 -301637 104210 -115870 -111801 -60829 -152188 73937 101496 183376 196255 167172 136918
$$ packed form
18532b02874J00087c6051A00152a72900j3591j50735J03068c6416B81147b28177
18521D31751i6039L5667C3109b31282B15327G6026Q2639M069E879L2065J38550
18510A76494b43123j61537j46871B74275b48907B5459b26127B3464Q1527b84266
18499d072j86669B753f8240A05074a74300C7137Q6885h336A01915a93649F6160
18487B57285J06127g1240F8774c5442E8561P0581J044a02906j13044r595r1207
18476c16752E4016K08371J8154a79495k51145J94701B57794c08053A53536b36733
18465h3616I8886a89745B48201a05138b4057m4733C32282h9335p6164j79766E4449
18453c01637A04210a15870M069N0972r1359G3937K7559Q1880J2879k9083l0254
$$ plain form
18442 136918 -1491 30778 258809 -125951 420189 275748 213046 186417 116503 -74658 3167
18430 114924 169617 101394 26452 -126893 -362547 -43145 -303368 259865 -73559 29747 325449
18419 325449 121022 -34966 -57616 -40804 -93814 -370477 70456 -117095 53805 63849 -64142
18407 152610 171910 56992 60570 -212373 -284723 -125687 223110 136025 -51153 55239 -36527
18395 -39424 138646 -144131 -18637 -107882 156315 -51466 11788 -81985 -105186 47252 -4743
18383 -229831 -199746 -103688 -410402 297553 113277 221404 -91802 -66958 3223 80704 60460
18372 60460 -33691 -296416 37397 221146 247789 290722 81253 63232 -118531 -190975 -311592
18361 -311592 256106 -156793 -131574 89404 -24709 -22863 -29875 -188244 194522 -400668 -149369
$$ packed form
18442A36918a491C0778K28031a25951D20189j44441o2702k6629o9914g4658C167
18430A14924N4693o8223B6452a26893k35654d3145k60223B59865g3559B9747K95702
18419C25449A21022c4966k2650J6812n3010k76663G0456a17095E3805J0044f4142
18407A52610J9300E6992L578b12373p2350a25687B23110q7085e1153E5239c6527
18395c9424A38646a44131a8637q9245A56315e1466A1788h1985k3201D7252d743
18383b29831L0085R6058l06714B97553A13277J08127i1802K4844C223P7481k0244
18372F0460c3691k62725C7397J83749K6643M2933H1253j8021a18531p2444j20617
18361c11592B56106a56793K5219H9404b4709J846p012j58369A94522d00668a49369
$$ plain form
18349 144456 -17895 -95123 -79873 83934 88059 -214035 68784 -66478 -341436 -199191 -47624
18337 -214929 -226313 110074 -114277 217345 291973 -360496 -79620 -217198 16438 152416
18327 152416 -127742 16529 -99799 -385776 -170097 -19353 133862 452009 -308687 -22955
18316 -13192 2241 3951 -133652 -117267 135184 97895 41728 20400 46403 -177828 1067 -189821
18303 179954 -335176 13833 -123407 -86994 -71940 -200988 103894 -164540 -234432 -19377
18292 27503 -193411 -105214 75659 46 23770 18001 117579 258378 78335 -198640 -341547 -369769
18280 -369769 -336711 31154 -10326 -54441 89897 -129533 298648 -266631 294483 -171831
18269 -190332 -225492 -37580 -78616 -157916 -277307 131055 -43463 85400 261694 -392134 29845
$$ packed form
18349A44456a7895p7228J5250H3934M125b14035F8784f6478k74958J42245d7624
18337b14929j1384A10074a14277B17345P4628c60496g9620j37578A6438J35978
18327A52416a27742A6529i9799k85977a70097a9353A33862L18147c08687b2955
18316a3192B241J710a33652J6385A35184l7289D1728B0400K6003a77828A067a89821
18303A79954c35176A3833a23407L6413J5054j29048A03894a64540o9892a9377
18292B7503a93411Q8197G5659D6K3724n769R9578J40799G8335a98640j42907k8222
18280c69769L3058C1154a0326m4115H9897a29533B98648b66631B94483a71831
18269a90332l5160c7580m1036p9300j19391A31055d3463H5400J76294c92134B9845
$$ plain form
18257 65659 -79035 -16278 331090 -138602 -89659 37498 18224 -98325 197952 58271 -53628
18245 151040 -309947 290042 -322196 255868 -70641 246131 15959 79254 -131952 -223446
18235 -223446 -183712 -98216 156934 -204390 -14401 -173642 -340154 204909 16010 41404
18225 41404 -97506 84448 105014 186938 32761 81495 88632 -126075 71777 -14314 -318932
18214 -318932 145805 -34026 136129 -88158 -70879 442098 -285987 -197365 120345 -101595
18203 -451871 29644 62752 -150622 -6897 148189 -139351 -380266 258899 1335 -21233 15989
18191 102058 1940 -143068 -63745 -98038 -108303 -97905 -22793 -255943 -144956 -110343 26513
18179 30302 -5435 -155961 -375 -91970 205431 104183 201559 -130833 -89604 -188298 -240631
$$ packed form
18257F5659g9035a6278C31090a38602M8943C7498A8224i8325A97952E8271e3628
18245A51040c09947B90042c22196B55868g0641B46131A5959O3295a31952r1494
18235b23446L9734Q5496A56934b04390a4401j59241j66512B04909A6010K5394
18225D1404i7506H4448K0566Q1924C2761M8734P137a26075G1777a4314l04618
18214c18932A45805c4026A36129h8158J7279D42098b85987Q8622A20345a01595
18203d51871B9644L3108a50622f897A48189a39351k40915B58899A335b1233A5989
18191A02058A940a43068f3745l4293j0265J0398b2793k33150J10987L4613B6513
18179C0302e435j50526c75r1595B05431j01248R7376a30833M1229r8694n2333
$$ plain form
18168 -240631 -253548 -33054 -433832 126207 -28368 108648 -69520 -7130 -87682 -385321 -250424
18157 -250424 40468 132754 183545 134037 -430007 212055 -115474 -209584 17255 -46430 -20440
18145 -43034 9030 111128 72699 -7463 -71738 -48713 -84717 -78698 17593 -47388 -208609 -175253
18133 -175253 11184 -263604 -175590 -87619 -208710 405994 -28080 -115413 38443 -23951 -15435
18122 -15435 -221635 365378 11339 141216 -382534 332351 -226006 185525 -19916 -97506
18112 -97506 -238822 -90909 41175 71592 -187142 -279955 -254570 210629 -50792 94466 -26773
18100 -136429 -86636 221425 29106 -134141 159677 168509 303672 -76379 169391 -61591 -56970
18089 -56970 16827 84975 -128258 -81038 226128 -46984 191612 251001 118202 -126942 64254
$$ packed form
18168b40631j2917c3054m00778A26207b8368A08648f9520g130q0552k97639J34897
18157b50424D0468R2286N0791m9508d30007B12055a15474r4110A7255d6430b0440
18145d3034I030J02098l8429g463o4275K3025l6004O019A7593d7388j61221L3356
18133a75253A1184b63604Q8014h7619j21091D05994b8080q7333C8443b3951Q516
18122a5435k06200C65378A1339J29877c82534C32351b26006A85525a9916p7590
18112i7506j41316i0909D1175L0417a87142r2813K5385B10629e0792I4466b6773
18100a36429M9793B21425B9106a34141A59677Q832J35163g6379A69391f1591M621
18089e6970A6827O8148a28258M7220B26128d6984A91612N9389A18202a26942F4254
$$ plain form
18077 138357 -95811 93254 -185930 70417 -219168 -185349 69033 263196 -94732 43915 312927
18066 312927 -474203 -40570 -145434 -383960 129838 -63677 -47822 42589 -284517 -36438
18055 -54115 7450 67361 296377 219758 -39173 72932 371228 121089 24982 -129513 1784
18043 -219590 133700 -75459 -75502 -126273 -172997 -3751 76395 40660 -45687 -34954 -211628 271217
18030 -135913 123012 201911 249352 17644 37195 -212967 -172668 210455 19263 -262323 -322081
18019 -322081 52675 -82509 -125480 -6194 -149407 -171128 67338 -148461 187333 212630 -54702
18007 -149297 -117378 143272 81181 -73488 -35276 -149434 8063 -134706 235577 -94473 -159067
17996 -159067 -111153 -46840 38164 118181 -46044 -216258 -232360 69170 -42076 -121267 -293044
$$ packed form
18077A38357i5811I3254a85930G0417b19168L3819F9033J94163i4732D3915K69012
18066C12927d74203d0570j04864k38526A29838f3677J5855D2589b84517c6438
18055e4115G450N9911K29016p6619c9173G2932K98296A21089B4982a29513A784
18043b19590A33700g5459m3n0771m6724c751G6395l5735d5687J0733j76674B71217
18030a35913A23012P8899M7441A7644J9551b12967M0299B10455A9263b62323n9758
18019c22081E2675h2509m2971f194j43213k1721F7338a48461A87333K5297e4702
18007a49297L1919A43272o2091g3488c5276j14158H063a34706B35577i4473o4594
17996a59067M7914d6840C8164Q0017d6044j70214j6102F9170d2076p9191j71777
$$ plain form
17985 -293044 -19785 129492 -230409 360160 -4513 -144547 -14017 -83485 -206095 -61427 -331236
17974 -331236 223 10413 -10151 148306 26558 -178709 -372718 -58180 -37230 -4777 283840
17962 60678 230053 -137092 -63360 -217149 316911 -146394 -445906 -25622 -58774 269128
17951 -168935 -280603 96625 120869 345010 -52785 -324084 228844 75059 -373589 46471
17940 -41100 46275 -327698 -166296 142612 -243405 226920 -88699 199590 -282334 80092
17929 -124734 -246314 26378 -154649 -193114 -298753 -33272 -209129 188754 -16933 -10563 816
17917 -59587 -88259 304670 -195554 76938 71117 109078 -58839 -316665 -40049 50626 -169561
17905 216763 37458 -112089 -90856 -289591 134082 109557 -10865 -13862 -18924 299637 32206
$$ packed form
17985b93044a9785A29492b30409C60160d513j40034a4017o9468j22610f1427k69809
17974c31236B23J0190a0151A48306B6558a78709j94009e8180K0950d777B83840
17962F0678J69375a37092f3360j53789C16911a46394k99512b5622l3152B69128
17951a68935j11668I6625K4244K24141e2785k71299B28844G5059c73589D6471
17940d1100D6275c27698J61402A42612b43405B26920h8699A99590b82334H0092
17929a24734j21580B6378a54649l8465j05639c3272j75857A88754a6933O370H16
17917e9587k8672C04670a95554G6938n821L7961e8839k57826d0049E0626a69561
17905B16763C7458a12089K1233j98735A34082k4525a0865k997n062B99637C2206
$$ plain form
17893 -151660 76465 9333 -17324 35541 274631 165188 -201398 154961 -222594 220157
17882 -179621 104282 -156013 110484 -215419 215747 246431 113461 91614 -16324 116905
17871 173804 -119402 154395 -15123 58905 794 -192809 -122740 257151 -239228 -146567 18186
17859 -211861 -77795 -186813 41325 -90414 -102800 -249200 -99238 -156441 315625 10048 121682
17848 121682 306259 -51044 -102254 -50082 279274 11918 -43197 16655 -188316 -216778 -24774
17836 -258452 -190943 244741 -101020 147285 163112 13423 11806 -49619 162275 -87519 -122328
17825 -122328 -26714 -6185 -90953 73489 -195597 -98156 -121238 -12928 -110178 -182323 -12287
17813 22193 141462 -39640 -32043 135443 -171821 -354 150590 -27146 168526 -204852 -127942
$$ packed form
17893a51660G6465I333a7324C5541K39090j09443b01398A54961b22594B20157
17882a79621A04282a56013A10484b15419B15747L0684A13461k1847a6324A16905
17871A73804a19402A54395a5123E8905G94a92809P0069B57151b39228R2661A8186
17859b11861g7795j09018D1325i0414j2386j46400i9238n7203C15625A0048J11634
17848A21682J84577e1044n1210e0082B79274A1918d3197A6655a88316k8462b4774
17836b58452O7509B44741a01020A47285J5827A3423j617d9619A62275h7519l4809
17825a22328b6714f185q4768G3489a95597R7441k3082a2928r7250p2145a2287
17813B2193J19269c9640P597A35443a71821c54A50590b7146A68526b04852P6910
$$ plain form
17802 -127942 -247081 -83537 163155 -5795 110258 58120 -114688 81087 -125249 316200
17791 -179994 -262797 -147491 217259 -217501 145745 -108207 225144 -170738 -380455 80152
17780 168269 -78766 153707 80284 14800 -179210 -153139 236733 -90783 249017 -45801 125720
17768 -215171 -183088 -3450 39515 -4227 -403412 -340782 11000 187483 -43274 -55077 262525
17756 171878 188495 -89677 240736 -5176 -79974 -97173 167998 31589 33764 -435616 -559251
17745 -559251 203014 -89208 88287 309 -189540 -66040 134875 -282348 55270 -230169 50718
17733 116697 -59262 -122745 -154229 13313 -95962 366833 169768 -27154 -150048 -167189 -50280
17721 66446 -109737 -210965 101251 -87375 162674 129697 52420 69576 159720 -467668 146739
$$ packed form
17802a27942j19139h3537A63155e795A10258n2138a14688H1087a25249C16200
17791a79994q2803J15306B17259b17501A45745a08207B25144a70738k09717H0152
17780A68269g8766A53707p3423A4800a79210K6071B36733i0783B49017d5801A25720
17768b15171L2083c450C9515d227l99185O2630A1000J76483d3274j1803B62525
17756A71878J6617h9677B40736e176p4798j7199A67998C1589K175d35616j23635
17745e59251B03014h9208H8287C09a89540f6040A34875b82348E5270b30169E0718
17733A16697e9262o3483l1484A3313i5962C66833A69768b7154j22894j7141e0280
17721F6446a09737j01228A01251h7375A62674l2977E2420J7156R0144d67668A46739
$$ plain form
17709 -25555 50279 189573 2517 94582 178266 10091 67978 66537 127746 -170418 332521
17697 -133978 -42010 87954 -19327 170707 -59935 -376682 26530 52508 232931 -77480 -140689
17686 -140689 184972 75553 163555 126140 135044 -79018 -131423 344673 61271 -75557 98615
17674 537390 105190 -43759 138916 74968 46751 -6453 10938 290273 115887 -144522 -100971
17663 -100971 340133 -63873 -68933 143845 45110 307962 47848 39628 -83578 77366 -239236
17651 -150310 -2249 75617 -45124 -71405 412773 19837 -94050 -319338 -262686 80715 -14247
17639 71913 257315 -229748 140385 201821 -185890 141162 161165 138826 -65699 114293
17628 -251673 14086 -330177 274771 217369 73071 -12266 -55168 198551 61599 244481 -265192
$$ packed form
17709b5555E0279J39294B517R2065Q3684A0091N7887j441O1209a70418C32521
17697a33978d2010H7954a9327A70707e9935l16747B6530K5978J80423g7480o3209
17686a40689A84972G5553Q8002l7415Q904g9018n2405C44673F1271g5557I8615
17674E37390A05190d3759A38916o3948k8217f453A0938K79335A15887a44522M3551
17663a00971C40133f3873n060A43845D5110K62852D7848q220h3578G7366b39236
17651a50310b249G5617d5124k6281D12773A9837i4050k25288N6652H0715a4247
17639G1913J85402b29748A40385O1436a85890A41162K0003k2339f5699A14293
17628b51673A4086c30177B74771n7402G3071a2266m2902A98551F1599J82882b65192
$$ plain form
17616 174251 -8979 175401 -47460 4592 -111850 -147108 289513 -99404 -3498 56745 -209673
17604 112806 -203530 -53810 188257 -85527 -80171 123479 -123046 25588 42601 197020 138095
17593 138095 161229 -170087 74693 -105052 -197162 115145 -175255 -166549 317526 -62086 100100
17581 -28347 130569 5097 230740 237189 171175 -238235 220969 23496 -149989 -6243 103194
17569 -227851 -11866 146812 331590 -45253 182689 53245 -203396 180020 74891 -122406
17558 9957 -41845 71056 -155143 -65545 -41188 -193069 -52196 170691 -104807 -267934 145995
17546 -121589 148988 -179490 16466 26777 158028 -14504 -211546 -94065 447920 -39661
17535 86419 160665 226538 25609 237804 312868 114379 277264 -223171 252687 480033
$$ packed form
17616A74251h979A75401d7460D592a11850l5258B89513i9404c498E6745b09673
17604A12806b03530e3810A88257h5527N356A23479a23046B5588J7013J54419n8925
17593A38095K3134a70087G4693a05052r2110A15145a75255Q706C17526f2086A00100
17581b8347A30569E097K25643O449o6014b38235B20969B3496a49989f243A03194
17569b27851a1866A46812J84778d5253A82689E3245b03396A80020G4891a22406
17558I957d1845G1056a55143f5545K4357j51881e2196A70691a04807j63127A45995
17546a21589A48988a79490A6466J0311J31251a4504j97042i4065D47920c9661
17535H6419P4246O5873B5609K12195P5064A14379J62885b23171B52687K27346
$$ plain form
17525 480033 140923 158243 95118 259646 152600 36315 -221400 142305 133074 67895 96640
17514 96640 248511 60756 -81088 -195430 -226003 420985 110053 322602 13135 -75406 116083
17502 98068 141831 -147754 17910 155079 523 -22274 153324 79000 -188950 -35151 81664
17490 134686 93558 249781 -18810 37637 29050 -153304 129823 347246 -30452 124955 244072
17479 244072 334721 -70538 -203234 266592 118134 -103860 490693 350182 195986 532687
17469 532687 -9691 68457 132372 -21168 84357 153390 -195458 -74567 59615 235582 -293765
17457 79111 -101522 183848 218964 352025 100000 116427 444390 387795 323482 489065
17447 489065 557985 413231 359431 172798 396171 432543 32270 9711 250988 362129 326378
$$ packed form
17525D80033A40923J7320o3125J64528j07046C6315b21400A42305r231o5179K8745
17514I6640J51871F0756h1088j14342l0573D20985A10053K12549A3135g5406A16083
17502I8068M3763a47754A7910J37169E23b2274A53324p4324a88950c5151H1664
17490A34686m1128J56223a8810C7637q587a53304A29823K17423c0452A24955J19117
17479B44072R0649g0538j32696B66592A18134a03860D90693j40511j54196L36701
17469E32687i691F8457O3915b1168H4357O9033a95458g4567E9615J75967b93765
17457G9111a01522A83848L5116J33061A00000J6427L27963n6595o4313J65583
17447D89065O8920j44754n3800A72798K23373L6372C2270I711K41277J11141l5751
$$ plain form
17436 326378 312168 163695 90299 85333 98969 50445 342376 34331 79469 215851 409841
17425 409841 446446 197748 337830 279233 379767 499939 197469 432467 22961 464167
17415 464167 434046 451314 186846 423262 430511 263961 174013 237671 40277 33272 237045
17404 237045 150309 62285 -80254 365834 441049 167307 275065 253216 269069 243026 23271
17392 114296 408942 591509 114607 129441 451531 28510 286006 494973 255677 -45966
17381 231232 259233 150254 449259 378350 -83929 357546 -71666 -32862 342032 254375 211776
17370 211776 332752 54629 387109 8611 213223 322923 242972 18395 171179 -340470
17359 194575 375790 -152429 428824 -54094 38777 425899 280963 75376 37648 176528
$$ packed form
17436C26378j4210j48473p3396m966J3636m8524K91931C4331M5138J36382J93990
17425D09841L6605A97748J40082n8597J00534J20172A97469K34998B2961M41206
17415D64167l0121J7268A86846K36416P249j66550q9948O3658D0277p005K03773
17404B37045q6736F2285h0254C65834P5215A67307J07758k1849J5853k6043B3271
17392A14296K94646J82567A14607J4834L22090B8510K57496K08967k39296d5966
17381B31232K8001j08979K99005p0909h3929C57546g1666c2862C42032q7657m2599
17370B11776J20976E4629L32480H611K04612J09700p9951A8395J52784c40470
17359A94575J81215a52429D28824e4094C8777L87122j44936G5376C7648J38880
$$ plain form
17349 176528 -5192 -78433 357042 200016 137977 49334 17074 376134 -374773 342948 317989
17338 317989 180910 254733 272334 90273 192625 210991 308858 317649 406412 276200 -149282
17326 -39670 -147614 27523 171076 106777 189805 -45410 202719 276679 -91148 480590 413058
17315 413058 180208 181921 -321788 157764 241958 259703 402417 174102 96725 40019 456412
17304 456412 260332 -253500 49516 401360 -252281 277607 69369 -80026 -41194 -165755
17294 -165755 327735 97919 -189648 267149 240837 137255 -79560 -74785 -60286 23037 503319
17283 503319 311293 7341 -26217 188353 101363 111012 -154088 72883 -112973 366827 317425
17272 317425 90199 41211 179490 -13808 427240 82025 -18513 204030 17897 46045 187761
$$ packed form
17349A76528e192p3241C57042j57026o2039D9334A7074L59060c74773C42948k4959
17338C17989j37079P3823J7601I0273J02352J8366R7867Q791Q8763j30212a49282
17326c9670j07944B7523J43553o4299Q3028d5410B02719P3960i1148D80590o7532
17315D13058A80208J713c21788A57764Q4194J7745J42714A74102p7377D0019M16393
17304D56412j96080b53500D9516L51844b52281B77607F9369h0026L8832j24561
17294a65755C27735I7919a89648B67149k6312j03582g9560M775J4499B3037M80282
17283E03319j92026G341b6217A88353q6990R649a54088G2883a12973C66827m9402
17272C17425I0199D1211J38279a3808D27240H2025a8513B04030A7897K8148J41716
$$ plain form
17261 187761 82404 101355 161872 151335 94581 297251 24949 177244 76362 399625 297067
17250 297067 -23970 300753 433496 41264 187377 111190 -122392 434350 234050 -87485
17239 433991 439817 68314 514648 -59793 209865 410748 126011 514239 311861 368788
17229 368788 364693 104857 383564 279928 -53967 31799 88161 -306717 342879 437131 -57415
17217 293205 246901 -46991 80114 264023 -27515 301510 420500 171273 484165 468157
17207 468157 272337 134961 80253 -98385 494691 32002 247676 264654 178280 11407 262748
17196 262748 374295 121513 401343 472935 163874 108336 339797 309457 518369 243478
17185 22523 44300 311131 403982 426240 87470 300004 225806 208395 -57863 296169 8550
$$ packed form
17261A87761H2404J8951O0517j0537n6754K02670B4949J52295G6362L23263j02558
17250B97067b3970C00753J32743D1264J46113p6187a22392D34350k00300h7485
17239D33991N826F8314M46334e9793B09865K00883A26011L88228k02378N6927
17229C68788m095A04857K78707j03636e3967C1799N6362c06717C42879R4252e7415
17217B93205m6304d6991H0114J83909b7515C01510J18990A71273L12892j6008
17207D68157j95820A34961n4708i8385D94691C2002K15674J6978q6374A1407K51341
17196B62748J11547A21513K79830P1592A63874n5538K31461l0340K08912B43478
17185B2523K1777K66831R2851K2258H7470K12534p4198j7411e7863B96169H550
$$ plain form
17173 287625 423806 -63760 602566 635060 272057 169691 40185 644180 205932 369851
17163 369851 400498 368579 313882 197566 95044 184728 467915 117502 -9695 52187 201213
17152 201213 380858 245188 323428 100044 427039 463410 400767 703472 372553 380570
17142 380570 559060 434018 285111 465793 320997 177087 422288 261270 102400 187974
17132 187974 49056 384494 566232 526721 32021 316830 410207 132457 -1625 462824 373159
17121 373159 391807 318270 389514 401925 382633 367885 534960 231051 416891 399703 264461
17110 264461 76886 780834 557872 369656 90684 504426 477651 563598 815352 -20540
17099 112463 469215 293229 464360 408119 273031 341668 326245 398891 561712 552939 368893
$$ packed form
17173B87625J36181f3760F02566L2494B72057j02366D0185O03995B05932J63919
17163C69851L0647l1919n4697j16316I5044Q9684K83187A17502i695E2187J49026
17152B01213J79645j35670P8240A00044L26995L6371o2643L02705l30919Q017
17142C80570J78490j25042j48907J80682j44796j43910K45201j61018A02400Q5574
17132A87974D9056L35438J81738l9511C2021K84809R3377A32457a625D62824q9665
17121C73159J8648p3537P1244J2411j9292j4748J67075B31051J85840j7188j35242
17110B64461G6886P03948k22962j88216I0684M13742k6775Q5947K51754b0540
17099A12463L56752j75986J71131n6241j35088O8637j5423P2646J62821q773j84046
$$ plain form
17088 368893 468405 282764 304355 652887 474963 798383 78765 470437 460113 434845
17078 434845 445675 541844 180756 329439 587711 571276 430190 610360 323776 106928
17067 391314 493561 587204 38752 516838 981958 823999 245090 518849 548235 501685
17057 501685 342318 766822 445950 771761 382361 447005 378380 431374 959826 452557
17046 301107 516750 418096 549744 488904 732817 603968 722858 575287 617985 474594
17036 474594 687289 880212 434886 604996 786119 375882 594218 788198 755351 454892
17026 454892 249559 718374 579503 740922 613299 658177 802180 606121 845414 792926
17016 792926 652575 753263 599420 390638 823916 820115 554839 750224 601219 677728
$$ packed form
17088C68893R9512j85641K1591L48532j77924L23420G8765L91672j0324k5268
17078D34845J0830R6169A80756J48683K58272j6435j41086J80170k86584A06928
17067C91314J02247R3643C8752M78086M65120j57959B45090K73759K9386m6550
17057E01685j59367M24504l20872L25811C82361O4644o8625N2994N28452D52557
17046C01107K15643r8654J31648o0840K43913j28849J18890j47571M2698j43391
17036D74594K12695J92923D34886J70110J81123C75882K18336J93980l2847l00459
17026D54892k05333M68815j38871J61419j27623M4878J44003j96059K39293n2488
17016G92926j40351J00688j53843k08782M33278l801k65276J95385j49005P6509
$$ plain form
17006 677728 849007 1030821 561542 819802 717137 698079 717039 837479 729150 775894
16996 775894 604081 1077532 733941 775865 1052377 625373 897324 511705 610375 826785
16986 826785 856056 880431 1100300 843230 650119 1029735 806621 792290 812447 984622
16976 984622 922893 830532 1076694 780679 669278 1158511 999946 917501 593891 1278207
16966 1278207 1202160 868556 950033 1127107 850341 1243320 1072305 1139912 891191 1276501
16956 1276501 1457499 1205851 1267639 1063834 1541402 1036378 803586 1364468 1426644 820725
16946 820725 1197623 1152068 1397399 1160345 1033300 1222530 1035654 1206386 1469080 1037157
16936 1037157 1175186 1404215 1351477 847746 1475875 1240146 1142522 1262394 1408753 1447931
$$ packed form
17006F77728J71279J81814m69279K58260j02665j9058J8960J20440j08329M6744
16996G75894j71813M73451l43591M1924K76512m27004K71951l85619R8670K16410
16986H26785K9271K4375K19869k57070j93111L79616k23114j4331K0157J72175
16976I84622o1729r2361K46162k96015j11401M89233j58565q2445l23610O84316
16966A278207p6047l33604Q1477J77074k76766L92979j71015O7607k48721L85310
16956A276501J80998k51648O1788k03805M77568n05024k32792N60882O2176o05919
16946H20725L76898m5555K45331k37054j27045J89230j86876J70732K62694m31923
16936A037157J38029K29029n2738n03731O28129k35729r7624J19872J46359L9178
$$ plain form
16926 1447931 1174920 1845444 1431755 1577660 1554746 1378760 1597727 1535304 1739361 1341672
16916 1341672 1545257 1702925 1630545 1316508 1761709 1271805 1799172 1682066 1810248 1791489
16906 1791489 1666616 1752759 1762343 1970986 2058777 1470698 1920742 1847002 2074177 2066287 1874861
16895 1874861 2140293 2224895 1849723 2124441 2068330 1733736 2587366 2152237 1856404 2035498
16885 2035498 2280043 2165849 2219474 2339528 2509103 2422947 2504813 2391717 2478213 2626972
16875 2626972 2356440 2171240 2383008 2543669 2928877 2615389 2669427 2995506 2538721 2750452
16865 2750452 2888750 2781017 2850130 3050260 3142505 2918725 3101107 3011543 3119882 3144429
16855 3144429 3414344 3445033 3536472 3000346 3220730 3537988 3382270 3634024 3556277 3508438
$$ packed form
16926A447931k73011O70524m13689J45905k2914j75986K18967o2423K04057l97689
16916A341672K03585J57668p2380l14037M45201m89904N27367j17106J28182j8759
16906A791489j24873Q6143R584K08643Q7791n88079M50044p3740K27175p890j91426
16895A874861K65432Q4602l75172K74718n6111l34594Q53630m35129k95833J79094
16885B035498K44545j14194N3625J20054J69575q6156Q1866j13096Q6496J48759
16875B626972k70532j85200K11768J60661L85208l13488N4038L26079m56785K11731
16865B750452J38298j07733O9113K00130R2245k23780J82382q9564J08339K4547
16855C144429K69915L0689R1439n36126K20384L17258j55718K51754p7747m7839
$$ plain form
16845 3508438 4061069 3974635 3926369 4129253 3878859 3831299 4273022 4261786 4542237 4290215
16835 4290215 4432235 4313774 4388335 4718836 4926004 5007131 5121146 4888762 5041829 4968582
16825 4968582 5400894 5202286 5380181 5228584 5541158 5754157 6067284 6053307 6481885 6463344
16815 6463344 6481716 6388365 6330579 6531876 7032610 6778673 7016090 7188375 7363138 7633372
16805 7633372 7962084 8207884 8117430 8148584 8243911 8877880 8760974 8923197 9087089 9413060
16795 9413060 9764786 10025741 10131888 10413256 10537662 10942613 11260817 11790096 11891830
16786 11891830 12216143 12516146 12623480 13175645 13607778 14125004 14563922 14972904 15020936
16777 15020936 15700101 16353543 16618992 17199471 17974772 18127443 18812583 19439642 20629757
$$ packed form
16845C508438N52631q6434m8266K02884k50394m7560M41723j1236K80451k52022
16835D290215J42020j18461P4561L30501K07168Q1127J14015k32384J53067p3247
16825D968582M32312j98608J77895j51597L12574K12999L13127j3977M28578j8541
16815F463344J8372r3351n7786K01297N00734k53937K37417J72285J74763K70234
16805G633372L28712K45800r0454L1154R5327O33969j16906J62223J63892L25971
16795I413060L51726K60955J06147K81368J24406M04951L18204N29279J01734
16786A1891830L24313L00003J07334N52165M32133N17226M38918M08982M8032
16777A5020936O79165O53442K65449N80479P75301J52671O85140O27059J190115
$$ plain form
16768 20629757 21044957 21694169 22454515 23168900 24143690 24961055 26110848 26970995 28152470
16759 28152470 28840202 30432164 31671110 33126796 34283867 35780375 37453777 39182627
16751 39182627 40940543 42663481 44548921 46546403 48936754 51414058 53670370 56280096
16743 56280096 59561969 62686302 65865300 69619603 73346638 76717542 81108573 85594363
16735 85594363 90076527 94788041 100180565 105869825 111541426 117443641 122954730 129300066
16727 129300066 135277978 141420737 147444010 153108114 158556004 163508245 167618875 171458528
16719 171458528 174382748 176068319 176751632 177116383 176316671 174382091 171429656 167965757
16711 167965757 163513764 158423367 153164149 147170079 141305339 135158549 129043324 123032485
$$ packed form
16768B0629757M15200O49212P60346P14385R74790Q17365J149793Q60147J181475
16759B8152470O87732J591962J238946J455686J157071J496508J673402J728850
16751C9182627J757916J722938J885440J997482K390351K477304K256312K609726
16743E6280096L281873L124333L178998L754303L727035L370904M391031M485790
16735H5594363M482164M711514N392524N689260N671601N902215N511089O345336
16727A29300066N977912O142759O023273N664104N447890M952241M110630L839653
16719A71458528K924220J685571O83313L64751p99712j934580k952435l463899
16711A67965757m451993n090397n259218n994070n864740o146790o115225o010839
$$ plain form
16703 123032485 116909975 110912873 104896156 99578089 94700662 89299273 84671445 80258477
16695 80258477 75873726 71905392 68093080 64811932 61213936 58370434 55243357 52758459
16687 52758459 50011053 48093583 45499185 43305728 41153178 39019491 37923464 36117036
16679 36117036 34637120 33340273 31598132 30182685 29189418 28263675 26776849 25395307
16671 25395307 24790575 23953100 22919204 22290612 21718669 20599610 19939891 18965957 18612279
16662 18612279 17970420 17123588 16678285 16218224 15599507 15074553 14870856 14327639 13577335
16653 13577335 13756501 12990814 12584346 12061200 12043911 11909143 11852150 11253164 10688879 10370215
16643 10370215 9847079 9951063 9460351 9515453 8992374 8825270 8668385 8411032 8509906 8246801
$$ packed form
16703A23032485o122510n997102o016717n318067m877427n401389m627828m412968
16695H0258477m384751l968334l812312l281148l597996k843502l127077k484898
16687E2758459k747406j917470k594398k193457k152550k133687j096027j806428
16679C6117036j479916j296847j742141j415447r93267r25743j486826j381542
16671B5395307o04732q37475j033896o28592n71943j119059o59719r73934l53678
16662A8612279o41859q46832m45303m60061o18717n24954k03697n43217p50304
16653A3577335J79166p65687m06468n23146j7289j34768n6993n98986n64285l18664
16643A0370215n23136J03984m90712N5102n23079j67104j56885k57353R8874k63105
$$ plain form
16633 8246801 8065861 7674161 7603960 7479400 6952598 6736297 7035331 6673808 6468547 6204652
16623 6204652 6404384 5878532 6172445 6065933 5738278 5705728 5703772 5800191 5205918 5322149
16613 5322149 5018641 4586192 4814977 4941348 4667818 4638388 4694246 4436797 4284074 4464516
16603 4464516 4039474 4172517 4213586 4016313 4265850 4162178 3711881 3739854 3676924 3818063
16593 3818063 3840356 3650583 3364730 3469493 3424466 3378038 3552501 3388947 3488108 3234322
16583 3234322 3166674 3101383 3076837 3226251 2906229 3017981 2851914 2635746 2588513 2796352
16573 2796352 2784599 2384280 2842848 2603712 2582746 2361542 2318596 2339770 2395812 2545075
16563 2545075 1962621 2172960 2238983 2403698 2278238 2300462 2225550 2071825 2273965 1823188
$$ packed form
16633H246801j80940l91700p0201j24560n26802k16301K99034l61523k05261k63895
16623F204652J99732n25852K93913j06512l27655l2550j956R6419n94273J16231
16613E322149l03508m32449K28785J26371k73530k9430N5858k57449j52723J80442
16603D464516m25042J33043M1069j97273K49537j03672m50297K7973o2930J41139
16593C818063K2293j89773k85853J04763m5027m6428J74463j63554R9161k53786
16583C234322o7648o5291k4546J49414l20022J11752j66067k16168m7233K07839
16573B796352j1753m00319M58568k39136k0966k21204m2946K1174N6042J49263
16563B545075n82454K10339O6023J64715j25460K2224p4912j53725K02140m50777
$$ plain form
16553 1823188 1688672 1821764 1806478 1852473 1693438 1710867 1680544 1851321 1687274 1559111
16543 1559111 1795281 2007895 1934873 1427257 1772110 1778264 1591127 1740481 1537994 1411398
16533 1411398 1245351 1558957 1590867 1498713 1436643 1510928 1753931 1351783 1431727 1206651
16523 1206651 1177986 1214016 1438180 1246413 1474507 1418377 1159458 1447105 1282549 1073837
16513 1073837 1394631 1369305 1110380 1195983 1636371 1220071 1358930 1225648 1099012 793453
16503 793453 1146741 862737 918308 1104044 1141758 1176145 1392779 1209055 912689 1044398
16493 1044398 912108 1069740 914545 1055440 1088872 1139024 764930 791738 1127085 772033
16483 772033 968176 988600 1111328 918502 941121 1018238 734295 582337 1205805 880553
$$ packed form
16553A823188j34516J33092j5286M5995j59035J7429l0323J70777j64047j28163
16543A559111K36170K12614p3022n07616L44853O154j87137J49354k02487j26596
16533A411398j66047L13606L1910r2154o2070P4285K43003m02148P9944k25076
16523A206651k8665L6030K24164j91767K28094n6130k58919K87647j64556k08712
16513A073837L20794k5326k58925Q5603M40388m16300J38859j33282j26636l05559
16503G93453L53288k84004N5571J85736L7714L4387K16634j83724k96366J31709
16493A044398j32290J57632j55195J40895L3432N0152l74094K6808L35347l55052
16483G72033J96143K0424J22728j92826K2619P7117k83943j51958O23468l25252
$$ plain form
16473 880553 767876 772902 797988 1141058 800996 950971 697576 1124757 870421 821926
16463 821926 741149 843230 982094 521859 519517 860454 535586 682169 630602 685383
16453 685383 767647 408075 926314 718661 560363 737947 258313 566418 480368 900275
16443 900275 639706 769497 734160 849481 293562 550494 712351 840866 457803 610694
16433 610694 845511 841410 641224 631691 364434 700672 266485 579088 327727 347963
16423 347963 479778 567035 693161 852171 598216 449149 523737 517852 294301 520980
16413 520980 609142 545268 475520 864372 359252 599898 605847 557606 382159 480076 226395
16401 284135 387910 489814 144557 129984 316872 336467 513111 720224 314125 423697
$$ packed form
16473H80553j12677N026K5086L43070l40062J49975k53395M27181k54336m8495
16463H21926q0777J02081J38864m60235k342L40937l24868J46583n1567N4781
16453F85383Q2264l59572N18239k07653j58298J77584B58313L08105q6050M19907
16443I00275k60569J29791l5337J15321B93562K56932J61857J28515l83063J52891
16433F10694K34817m101k00186r533k67257L36238B66485L12603k51361K0236
16423C47963J31815Q7257J26126J59010k53955j49067P4588n885k23551K26679
16413E20980Q8162o3874o9748L88852C59252K40646N949m8241j75447R7917B26395
16401B84135J03775J01904A44557j4573J86888J9595J76644K07113C14125J09572
$$ plain form
16391 423697 307321 443838 665195 488030 398991 316938 550094 120556 502400 417171
16381 417171 267183 724622 828479 433843 626567 524482 579725 537225 215691 631432
16371 631432 300240 711159 396456 162601 401013 -35029 291185 -4266 269204 414441
16361 414441 284482 519231 476700 123515 45772 622102 278375 404445 156516 415519
16351 415519 178777 501429 441045 230131 182733 487822 421876 305331 142634 483053
16341 483053 272664 191269 440298 249677 281651 295854 180316 330191 89401 142962
16331 142962 341047 42367 314633 -153712 90310 258893 301488 602480 -191173 281955
16320 17728 176992 238733 370626 264649 -60461 -11689 72153 -64444 420675 312964 219633
$$ packed form
16391D23697j16376J36517K21357j77165q9039q2053K33156A20556L81844q5229
16381D17171j49988M57439J03857l94636J92724j02085N5243m2500B15691M15741
16371F31432C00240M10919l14703A62601K38412c5029B91185d266B69204J45237
16361D14441j29959K34749m2531A23515D5772N76330B78375J26070A56516K59003
16351D15519A78777L22652o0384k10914m7398L05089o5946j16545A42634L40419
16341D83053k10389q1395K49029j90621L1974J4203j15538J49875H9401N3561
16331A42962J98085D2367K72266a53712I0310J68583M2595L00992a91173B81955
16320A7728J59264O1741J31893j05977f0461a1689G2153f4444D20675j07711r3331
$$ plain form
16309 219633 -232616 423338 263954 199118 205961 16084 46223 42647 -10050 146938 1988
16297 334508 300030 437298 326791 208412 143648 287869 216260 130533 388716 143975
16286 398315 234269 -19900 436514 442717 21367 311428 -62329 354045 88893 54123 -66121
16274 202188 94671 -16714 291455 221028 -29190 348854 -16619 373956 378221 53658 123295
16263 123295 152188 164380 46800 222428 282417 62461 300978 101058 291260 177191
16253 177191 345568 181026 265205 51974 -70993 360425 42361 160144 72848 -81480 193751
16241 291638 159546 122469 -101151 -111934 79094 418862 254511 99283 163620 -81227 413940
16229 50556 -37271 213342 175632 -98727 -6241 225511 233127 187901 221168 516815 148163
$$ packed form
16309B19633b32616D23338j59384o4836O843A6084L0139l576a0050A46938A988
16297C34508l4478J37268j10507j18379o4764J44221p1609q5727K58183A43975
16286C98315j64046a9900D36514O203B1367K90061f2329C54045H8893l4770f6121
16274B02188I4671a6714B91455p0427b9190C48854a6619C73956M265E3658O9637
16263A23295K8893J2192D6800J75628N9989F2461K38517A01058J90202j14069
16253A77191J68377j64542Q4179E1974g0993C60425D2361J17783G2848h1480A93751
16241B91638j32092l7077a01151j0783G9094L39768j64351I9283O4337h1227D13940
16229E0556c7271B13342l7710i8727f241B25511P616m5226L3267K95647A48163
$$ plain form
16217 218182 205306 58851 349166 -10898 -72532 51748 103175 -185928 317552 -45243 15492
16205 -30374 414036 333135 195730 65128 -12712 -36239 340830 83919 99728 147386 186205
16194 186205 -282224 221129 12902 260762 -206695 12978 60799 -61522 -92894 108972
16183 -162036 238301 530531 -53949 56038 101923 454745 -72565 227892 -255934 264466
16172 12431 -148958 270992 133512 35030 224571 442479 4958 358108 246701 275306
16162 275306 125340 97795 -147090 58812 231139 -80803 -102802 -146959 -111859 -192817 -107899
16151 -107899 48825 135061 163636 151039 203676 329257 303578 -53964 157866 -137354 291315
16139 242751 -7457 245220 88756 179028 237870 -89989 -111697 -110119 4128 13281 -7133 269614
$$ packed form
16217B18182j2876E8851K90315a0898o1634E1748N1427a85928C17552d5243A5492
16205c0374D14036q0901j37405F5128a2712k3527C40830H3919J5809M7658L8819
16194A86205b82224B21129A2902K47860b06695A2978M7821f1522l1372A08972
16183a62036B38301K92230e3949E6038M5885L52822g2565B27892b55934B64466
16172A2431a48958B70992A33512C5030J89541K17908D958L53150j11407K8605
16162B75306A25340k7545a47090E8812J72327h0803k1999m4157L5100q0958Q4918
16151a07899D8825Q6236K8575j2597N2637J25581k5679e3964A57866a37354B91315
16139B42751g457B45220H8756R0272N8842h9989k1708J578D128R153g133B69614
$$ plain form
16126 251939 -134702 156906 -44139 309207 16522 -96093 84205 -60596 -140005 50292 283736
16115 283736 161446 -27622 3938 112645 113824 -24809 13804 -71391 128324 73921 297503
16104 297503 14332 143485 188618 558388 -230418 66945 -253637 69640 -69719 69523 -227516
16092 17917 -166685 -392443 -92644 176197 53761 -173636 49953 213664 -231463 -14203
16081 104971 319324 16688 -65284 173354 -90529 70136 127474 -58878 -350810 56091 -125830
16069 -287628 -63511 -91041 35834 192850 450322 226149 -1592 -131727 -11241 49444 -197290
16057 99321 -11477 9011 -110488 -16973 -152908 -88188 5240 -204947 -19466 -56853 -996 299569
16044 28831 -361911 -158088 -258600 -65047 94498 -168514 -42705 -18022 -158076 -197523 198653
$$ packed form
16126B51939a34702A56906d4139C09207A6522i6093H4205f0596p9409E0292K33444
16115B83736j22290b7622C938J08707J179b4809A3804g1391A28324n4403K23582
16104B97503A4332J29153M5133L69770b30418F6945b53637F9640f9719F9523b27516
16092A7917a66685k25758i2644A76197E3761a73636D9953J63711b31463a4203
16081A04971K14353A6688f5284A73354i0529G0136N7338e8878k91932E6091a25830
16069b87628f3511k7530C5834J57016K57472k24173a592j30135a1241D9444a97290
16057I9321a1477I011a10488a6973j35935O4720E240b04947a9466l7387i96B99569
16044B8831c61911a58088j00512f5047I4498a68514d2705a8022j40054l9447A98653
$$ plain form
16032 6660 -286116 -20208 9529 -253514 13360 187853 -381562 219221 54574 -52768 191115
16020 -163192 -15746 97444 -12467 173856 185603 -30065 -150987 -152471 137171 -246695 35207
16008 87321 -69680 -106438 97315 105088 -183968 -111449 210694 243446 54956 60011 -218567
15996 -15708 88962 22749 -113006 -359383 -104371 -354477 -256742 174591 30821 162682
15986 162682 -300917 313783 224412 418993 157264 121513 85220 487867 145374 63963
15975 78477 -91357 60250 213737 23533 270607 120389 -312999 -5056 -119652 47040 79251
15964 79251 180650 53667 -80639 262505 59213 236160 -120274 13024 -118010 -131624 112013
15952 2901 -171787 -168539 134268 83281 318506 -189855 12044 -152281 271113 174692 -29948
$$ packed form
16032F660b86116b0208I529b53514A3360J74493c81562B19221E4574e2768A91115
16020a63192a5746I7444a2467A73856J1747c0065j20922j484A37171b46695C5207
16008H7321f9680l6758I7315P773a83968P2519B10694L2752E4956N055b18567
15996a5708H8962B2749a13006k46377a04371k50106R7735A74591C0821J31861
15986A62682c00917C13783q9371J94581A57264l5751l6293M02647A45374F3963
15975G8477i1357F0250J53487B3533K47074A20389c12999e056j14596D7040L2211
15964G9251J01399E3667h0639B62505E9213J76947a20274A3024a18010j3614A12013
15952B901a71787L248A34268n0987K35225a89855A2044a52281B71113r6421b9948
$$ plain form
15940 36286 402187 89379 -240802 -16106 120838 -284147 12111 -272450 -16066 -41693 319510
15928 77100 90610 15134 111048 160202 -35151 11632 24889 -125342 -80020 -17200 -216417
15917 -216417 149496 -178172 -447112 107245 219797 114031 -257710 -68733 993 -51244
15906 -47955 -318442 84267 -35813 -246906 -10147 -63003 -257425 142343 -143678 170456
15895 130292 120981 -54903 166613 -48335 -185555 -33952 -172497 -75170 -140048 -139998 80000 91239
15883 91239 131364 150560 291092 -53541 26675 -28708 -226098 -64595 -12698 405051 -252332
15871 -20010 -303823 -68294 60357 -183754 -162831 -151435 -228142 -57737 203936 -389902 120982
15859 69870 -83005 181756 -38427 -462804 -289435 -469661 101245 -132937 -110546 43602
$$ packed form
15940C6286L65901H9379b40802a6106A20838b84147A2111b72450a6066k5627C19510
15928G7100J3510A5134R5914M9154c5151A1632J3257a25342M5322a7200j99217
15917b16417A49496a78172k68940A07245J12552j05766b57710f8733I93e1244
15906d7955k70487H4267c5813k11093a0147n2856j94422A42343a43678A70456
15895A30292r311e4903A66613d8335j37220c3952j38545g5170o4878N0H0000J1239
15883I1239M0125J9196J40532e3541B6675b8708j97390f4595a2698D05051b52332
15871b0010k83813f8294F0357a83754K0923J1396p6707e7737B03936c89902A20982
15859F9870h3005A81756c8427m24377J73369j80226A01245a32937K2391D3602
$$ plain form
15848 -210593 15783 220587 -135312 -14406 -45657 280935 -211611 -17044 751 -207281 112914
15836 -169815 -136047 141619 -137401 317555 73710 -161537 138958 256539 74477 229205
15826 229205 -329999 -262036 -364330 205553 -65168 -83594 -174682 -237318 75515 118550 -337044
15814 -243844 -194312 59721 -239327 13014 102116 -65629 59968 -255717 241629 89362 -43147
15802 -374630 85005 -58008 1147 -86159 -376248 -276260 62839 -134631 45247 131454 23664
15790 -137653 -54426 155058 -7349 329496 -115235 -192787 -41302 -36760 -335264 -504 -207219
15779 -207219 238091 -112378 178440 161897 519386 -259510 -288175 150481 -79367 -102151
15769 -102151 307148 -192100 -167816 13971 -50823 109942 -282722 208437 -20721 -21544 178438
$$ packed form
15848b10593A5783K04804a35312a4406l1251B80935b11611a7044G51b07281A12914
15836a69815L3768A41619a37401C17555G3710a61537A38958J17581G4477J54728
15826B29205c29999O7963j02294B05553f5168j8426r1088o2636G5515M3035c37044
15814b43844M9532E9721b39327A3014Q9102f5629E9968b55717B41629H9362d3147
15802c74630H5005e8008A147h6159k90089R9988F2839a34631D5247Q6207B3664
15790a37653e4426A55058g349C29496a15235p7552d1302M542k98504e04k06715
15779b07219B38091a12378A78440j6543L57489b59510k8665A50481g9367k2784
15769a02151C07148a92100K4284A3971e0823A09942b82722B08437b0721q23A78438
$$ plain form
15757 -48620 56756 -197661 -96136 -32035 59656 -146465 39524 -140029 111311 -17912 195967
15745 -147020 190043 -51867 -453794 -241754 -89788 -101284 -278644 102744 -123798 55261
15734 184627 -348590 13823 -215906 -102254 -30107 -262121 44712 -78073 -88886 -324678
15724 -324678 -71187 -208576 -52397 -96733 34657 244780 301068 -179971 91807 -361928 41649
15712 -150817 -90611 -283622 -277160 -154617 -42298 -34902 94995 -299530 123692 84727 -6700
15700 -113678 207628 186684 108217 92949 -238687 303162 -17251 -185849 158637 -355088
15689 -331210 72571 -117239 -184659 37597 -269850 -80175 122004 286321 -113159 -163297
15679 -163297 -104957 227305 132212 -26778 -46149 56109 304283 -176718 -30091 30342 -260488
$$ packed form
15757d8620E6756a97661i6136c2035E9656a46465C9524a40029A11311a7912A95967
15745a47020A90043e1867m01927K12040h9788j1496j77360A02744a23798E5261
15734A84627c48590A3823b15906a02254c0107k32014D4712g8073j0813k35792
15724c24678g1187j37389e2397m4336C4657K10123N6288a79971I1807c61928D1649
15712a50817O0206j93011O462J22543d2298P396I4995b99530A23692l8965f700
15700a13678B07628k0944p8467j5268b38687C03162a7251j68598A58637c55088
15689c31210G2571a17239o7420C7597b69850h0175A22004J64317a13159n0138
15679a63297N8340B27305r5093b6778j9371E6109K48174a76718c0091C0342b60488
$$ plain form
15667 293531 7494 139270 2352 -216068 -17 32275 -86582 -77600 -190493 -451458 -339718 62976
15654 26920 -48370 67278 226897 -115229 126369 248860 200338 -203367 -191575 79076 186949
15643 186949 -155902 35323 -315749 -74631 52754 -169522 -146703 -85413 -118794 -179389 -224684
15632 -224684 -226861 -12673 159864 -62400 -28071 314983 -65788 -222704 -71054 -182562 -165023
15621 -165023 -127602 47081 -157230 55932 -416269 -91072 45860 -68012 -76234 -14269 -39539
15610 -39539 -106703 -44471 -219718 -156492 -5279 176242 -14188 8888 -312179 -230744 -90986
15598 -428287 43438 -105000 -105907 -159572 199606 -97428 -394960 50394 46537 44101 203645
15587 203645 -6243 443463 -15684 138246 -142733 233426 -155314 -209973 -242043 -92638 -103577
$$ packed form
15667B93531G494J31776B352b16068a7C2275h6582Q982j12893k60965J11740F2976
15654B6920d8370F7278J59619a15229A26369J22491m8522b03367J1792G9076J07873
15643A86949a55902C5323c15749g4631E2754a69522K2819O1290l3381o0595m5295
15632b24684k177a2673A59864f2400b8071C14983f5788j56916g1054j11508J7539
15621a65023L7421D7081a57230E5932d16269i1072D5860f8012q222a4269k5270
15610c9539o7164d4471j75247O3226e279A76242a4188H888c12179Q1435i0986
15598d28287D3438a05000r07n3665A99606i7428k97532E0394l857k436J59544
15587B03645f243D43463a5684A38246a42733B33426a55314n4659l2070i2638j0939
$$ plain form
15576 -103577 -177494 -85408 138134 28190 222600 91008 -163702 -141701 217545 797 -180397
15564 -3377 -170330 -23962 -283142 22107 35861 172253 -114698 41863 -94167 143333 -81267
15552 -383988 31088 291153 63200 -135345 274513 19310 -132663 -207046 35975 -148786
15541 -300978 -2636 156526 -32418 10675 2419 177420 182666 -367269 87708 -79306 -74508 257370
15528 -104119 -2343 -86741 -151503 -37608 -55119 -168884 166433 220495 335997 -211650 264335
15516 -118273 -200963 29441 40015 9168 -153587 215302 232597 124847 -245101 47834 -81192
15504 -16356 229157 -132862 -3035 -181102 365913 42742 131379 71435 -26136 168230 318489
15493 318489 71095 226135 109366 -61285 23832 179627 214426 -33324 133869 161139 -17061
$$ packed form
15576a03577p3917h5408A38134B8190J94410I1008a63702K2001B17545G97a80397
15564c377j66953b3962k59180B2107J3754J36392a14698D1863i4167A43333h1267
15552c83988C1088K60065F3200a35345B74513A9310a32663p4383C5975a48786
15541c00978b636A56526c2418A0675B419J75001N246c67269H7708g9306M798B57370
15528a04119b343q4398o4762c7608j7511j13765A66433N4062J15502b11650B64335
15516a18273q2690B9441J0574I168a53587B15302J7295j07750b45101D7834h1192
15504a6356B29157a32862c035j78067C65913D2742Q8637n9944b6136A68230J50259
15493C18489G1095J55040A09366f1285B3832J55795L4799c3324A33869K7270a7061
$$ plain form
15481 -75338 -137887 52042 288814 216730 336039 219546 -252135 258061 161143 -65499 53201
15469 53547 106367 -90967 332646 97541 201467 231638 53049 144601 -54264 152914 184111
15458 184111 216120 6059 17879 203756 43008 -117501 -162535 -99401 44889 -168096 -216880
15447 -216880 71314 -17343 -345607 244546 49047 45684 185936 -46680 -9727 -115441 274582
15435 22092 -119593 201698 118173 -173692 -13829 73144 40803 156226 -29828 -124401 52694
15423 84194 200662 -5515 299145 -93723 142067 -189034 67756 -152704 -190192 -34819 11892
15411 222618 -345331 -102374 135041 -91425 184422 60327 94085 -30674 -60973 -22031 -69363
15400 -69363 147809 -282474 180847 -256196 22824 -303909 35766 321505 59114 -211993
$$ packed form
15481g5338o2549E2042K36772p2084J19309j16493b52135B58061r6918f5499E3201
15469E3547N2820i0967C32646I7541J03926L0171E3049R1552e4264A52914L1197
15458A84111L2009F059J1820J85877D3008a17501m5034O3134D4889a68096m8784
15447b16880G1314a7343l28264B44546D9047l363J40252d6680i727j05714B74582
15435B2092a19593B01698q3525a73692a3829G3144l2341J15423b9828r4573E2694
15423H4194J16468e515B99145i3723A42067a89034F7756a52704l7488c4819A1892
15411B22618c45331a02374A35041i1425A84422F0327L3758c0674l0299b2031m7332
15400f9363A47809b82474A80847b56196B2824c03909C5766K85739E9114b11993
$$ plain form
15389 -118783 121662 -27604 -225240 -71357 -33192 49930 -130491 -6305 66630 -117919 -281585
15378 -281585 39575 95818 -180916 -243495 -190066 -105805 12413 101485 21874 4107 36784
15367 36784 -145337 -272970 195598 -75300 -68446 131553 130632 -272729 -121611 -246541 80569
15355 -10562 137429 -148306 -30345 237808 1998 -44633 45637 -158714 100836 43528 -261166
15343 -241483 -15350 70242 69224 18277 28231 68795 223491 -16312 110815 200943 184175
15332 184175 167343 65847 20175 57777 -10433 216968 104951 278811 178857 26168 -28419
15320 98625 65644 -56015 157896 -248972 159538 322228 -66271 -246201 -80648 350173
15309 405803 206842 -21418 -216011 -229455 294277 331473 -15441 5466 -177145 -132675 226304
$$ packed form
15389a18783A21662b7604j97636g1357c3192D9930a30491f305F6630a17919j63666
15378b81585C9575N6243a80916o2579N3429Q4261A2413Q9072B1874D107L2677
15367C6784a45337j27633A95598g5300O854A31553r21b72729a21611j24930H0569
15355a0562A37429a48306c0345B37808A998d4633D5637a58714A00836D3528b61166
15343b41483a5350G0242j018A8277R954M0564J54696a6312A10815R0128j6768
15332A84175j6832F5847B0175L7602a0433B16968A04951J73860r9954B6168b8419
15320I8625l2981e6015A57896b48972A59538J62690f6271j79930h0648C50173
15309D05803j98961b1418j94593j3444B94277L7196a5441E466a77145M4470B26304
$$ plain form
15297 324077 52988 -79178 226434 -37427 201865 -329115 -94290 133916 -29437 -323965
15287 -323965 213539 -172221 64561 411556 -108039 -35659 -224262 52730 -422501 -47674
15276 341238 11151 -163590 171339 -92899 -35525 24283 44184 203142 -42353 -119884 -58717
15264 65228 -67474 40227 258453 308846 -85726 -173195 160282 -150682 -211518 283440 240101
15253 240101 134164 182911 34754 237233 596497 536184 1155916 2216823 1610770 1924318
15243 1924318 2062805 791348 457139 -93349 198421 196862 78880 331361 217617 309081
15233 309081 67876 34454 241617 -185958 89174 -38463 -18719 433112 -253557 47322 -45007
15221 70305 79281 -120898 -274123 251052 33107 56457 220226 56099 -92215 -216558 544862
$$ packed form
15297C24077E2988g9178B26434c7427B01865c29115i4290A33916b9437k94528
15287c23965B13539a72221F4561L46995a08039c5659j88603E2730d22501d7674
15276C41238A1151a63590A71339i2899c5525B4283J9901J58958d2353p7531e8717
15264F5228f7474D0227K18226N0393h5726q7469A60282a50682o0836B83440m3339
15253B40101j05937M8747C4754K02479L59264o0313O19732J060907o06053L13548
15243A924318J38487G91348l34209i3349A98421j559G8880K52481j13744R1464
15233C09081F7876l3422K07163a85958H9174c8463a8719D33112b53557D7322d5007
15221G0305Q976a20898j53225B51052C3107K3350J63769E6099i2215j24343E44862
$$ plain form
15209 143381 118535 4538 -158051 229752 3347 -52186 -252379 114497 -209051 -237 -307287
15198 -307287 156507 187037 -325805 -211306 88658 304849 -143641 436860 201153 256548
15188 256548 255573 -147380 20409 12180 336733 136372 155558 134907 102999 -39044 169013
15176 239189 308963 241239 469228 19442 -2578 -258413 135832 58826 -301894 190040 -192650
15164 -159554 125706 68213 -183391 49123 76534 -299195 260906 312114 -224079 19963
15153 77301 221411 133999 98790 377768 93751 -22859 -28583 330680 200891 107164 -130075
15141 146035 -64216 95686 -116437 73961 102641 244363 161667 29614 190279 -321463 117724
15129 258736 275311 130749 -167304 147238 51441 -56953 -41417 125592 1082 535341 144896
$$ packed form
15209A43381k4846D538a58051B29752C347e2186k00193A14497b09051b37l07050
15198c07287A56507L0530c25805J14499H8658K16191a43641D36860B01153N5395
15188B56548r75a47380B0409q229L24553A36372J9186k0651l1908c9044A69013
15176B39189O9774o7724K27989A9442b578k55835A35832E8826c01894A90040a92650
15164a59554A25706n7493a83391D9123K7411b99195B60906N1208b24079A9963
15153G7301J44110q7412l5209K78978I3751b2859n724C30680j29789r3727a30075
15141A46035f4216I5686a16437G3961K8680J41722q2696B9614J60665c21463A17724
15129B58736J6575A30749a67304A47238E1441e6953J5536A25592A082N34259A44896
$$ plain form
15117 221706 -35844 118060 -47085 102658 365489 -26383 182551 85272 -46806 83780 -288769
15105 72333 235907 277188 258010 181126 -38950 143598 123868 577902 374994 380984 138333
15093 265054 270160 357553 -3796 73458 217627 -69974 36275 77859 -21133 175568 -74213
15081 305084 88016 -216421 -161520 333037 -156623 343832 424167 148885 246308 431837
15071 431837 183278 -41771 -30422 274905 -61721 22793 260253 58025 277549 -66980 29623
15059 -56023 308357 283479 235782 136338 170819 262484 274622 117752 -51025 81428 270231
15048 270231 -18951 315553 50668 288256 424435 109117 -133547 87643 -256636 359569
15037 228517 44031 386397 -154456 48109 400672 222613 245686 78599 186975 219256
$$ packed form
15117B21706c5844A18060d7085A02658K62831b6383A82551H5272d6806H3780b88769
15105G2333J63574M1281j9178p6884c8950A43598j9730M54034k02908N990A38333
15093B65054N106Q7393c796G3458J44169f9974C6275M1584b1133A75568g4213
15081C05084H8016b16421N4901C33037a56623C43832Q0335A48885R7423J85529
15071D31837A83278d1771J1349B74905f1721B2793K37460E8025K19524f6980B9623
15059e6023C08357k4878m7697r9444L4481R1665J2138A17752e1025H1428J88803
15048B70231a8951C15553E0668K37588J36179A09117a33547H7643b56636C59569
15037B28517D4031L42366a54456D8109L52563j78059K3073G8599J08376L2281
$$ plain form
15027 219256 358398 491317 495690 -86293 385945 204023 270757 74982 98008 363285 288057
15016 288057 258081 220644 184742 453678 -156763 355645 335219 274811 207252 223865 190520
15005 190520 337383 75319 479094 171100 320099 35789 287528 76632 413823 138704
14994 164773 -34529 115523 377175 232126 252226 207018 502361 337709 -299468 194125
14983 234272 145469 59253 -25747 383876 96095 74979 421855 421226 330275 255933 91309
14971 167443 386557 554494 305460 291486 241978 75540 209789 189766 343384 635795
14961 635795 310726 -96546 66698 379674 244416 -197336 197854 -64358 -142517 348263
14950 183762 -68704 235211 180805 92015 274447 8888 361633 491930 285513 436240
$$ packed form
15027B19256J39142J32919M373h6293C85945j81922O6734G4982K3026K65277p5228
15016B88057k9976l7437l5902K68936a56763C55645k0426o0408o7559J6613l3345
15005A90520J46863G5319M03775A71100J48999C5789K51739G6632L37191A38704
14994A64773c4529A15523K61652j45049K0100m5208K95343j64652b99468A94125
14983B34272q8803E9253b5747C83876I6095k1116L46876o29r0951p4342I1309
14971A67443K19114J67937k49034j3974m9508G5540J34249k0023J53618K92411
14961F35795C10726i6546F6698L12976j35258a97336A97854f4358p8159C48263
14950A83762f8704B35211n4406q8790J82432H888L52745J30297k06417J50727
$$ plain form
14940 436240 21739 216661 139834 263398 54875 539766 276854 218376 -321011 -182017
14930 -182017 304708 131610 467684 100157 15567 398213 232689 248852 200077 266314
14920 266314 216164 518463 181605 227523 231050 94036 116844 22663 239722 315222 286952
14909 286952 252068 357666 185000 208480 -14568 221773 279901 307525 90890 188944 151055
14898 151055 654367 369914 211465 451191 97699 385725 38291 537937 144997 441182
14888 441182 453934 61569 466190 124056 647227 282671 570439 94181 407313 618146
14878 618146 382126 469570 90051 332338 384099 -146022 347452 402646 408669 225205 293910
14867 293910 252386 319778 140235 -34568 710419 247665 604323 378079 631197 474855
$$ packed form
14940D36240B1739J94922p6827J23564E4875M84891k62912n8478c21011J38994
14930a82017C04708A31610L36074A00157A5567L82646j65524J6163m8775O6237
14920B66314n0150L02299A81605M5918L527I4036K2808B2663K17059P5500k8270
14909B86952l4884J05598j72666K3480a4568B21773N8128K7624I0890R8054l7889
14898A51055N03312k84453j58449K39726I7699K88026C8291M99646A44997K96185
14888D41182J2752F1569M04621A24056N23171B82671K87768I4181L13132K10833
14878F18146k36020Q7444I0051K42287N1761a46022C47452N5194O023j83464O8705
14867B93910m1524O7392A40235c4568G10419B47665L56658k26244K53118j56342
$$ plain form
14857 474855 190844 454390 340495 331544 622561 222472 399530 403110 376062 626711
14847 626711 463262 343163 299762 152379 136910 518368 613879 320699 348362 320437
14837 320437 611003 210574 607435 576523 423297 498199 292203 204247 160230 364749
14827 364749 458512 724114 632132 582366 350253 295758 403775 309199 546119 926443
14817 926443 511523 299875 81031 642095 455989 650974 431712 322621 533037 292552
14807 292552 414385 557417 457598 777546 84600 622356 496231 289062 371838 383342
14797 383342 358800 307371 611447 619421 436542 662570 721378 517120 274721 750662
14787 750662 490590 427239 313010 776726 662699 244694 573805 310777 562846 240846
$$ packed form
14857D74855A90844K63546j13895q951K91017B22472J77058L580k7048K50649
14847F26711j63449j20099m3401j47383j5469L81458R5511k93180K7663k7925
14837C20437K90566B10574L96861l0912j53226P4902k05996q7956m4017K04519
14827C64749R3763K65602r1982m9766k32113n4495J08017r4576K36920L80324
14817I26443m14920k11648H1031N61064j86106J94985k19262j09091K10416k40485
14807B92552J21833J43032r9819L19948H4600N37756j26125k07169Q2776J1504
14797C83342k4542n1429L04076P974j82879K26028N8808k04258k42399M75941
14787G50662k60072o3351j14229M63716j14027B44694L29111k63028K52069B40846
$$ plain form
14776 668521 445373 58105 552993 806248 398324 909923 400493 730025 655692 531850
14766 531850 1018069 514187 832197 458345 511261 673910 657158 1020760 690357 559880
14756 559880 358744 902266 593540 655946 587872 958297 865603 667663 774637 680563
14746 680563 1136651 753676 849565 758080 674190 962821 493765 491275 506118 326576 740051
14735 740051 324200 639011 829055 879110 879051 432744 741797 489160 859650 646816
14725 646816 680026 866622 1157597 942714 734887 723454 932908 728248 808633 858636
14715 858636 683581 735441 801779 1006819 836625 757752 867174 1103153 1017694 961818
14705 961818 644590 739941 585557 583633 751702 612655 723495 762920 697975 989523
$$ packed form
14776F68521k23148E8105M94888K53255C98324N11599D00493L29532p4333j23842
14766E31850M86219n03882L18010l73852N2916J62649j6752L63602l30403j30477
14756E59880k01136N43522l08726O2406o8074L70425r2694j97940J06974r4074
14746F80563M56088l82975R5889r1485q3890K88631m69056k490J4843j79542M13475
14735G40051C24200L14811J90044N0055n9D32744L09053k52637L70490k12834
14725F46816L3210J86596K90975k14883k07827j1433K09454k04660Q0385N0003
14715H58636j75055N1860O6338K05040j70194p8873J09422K35979q5459n5876
14705I61818l17228R5351j54384j924J68069j39047J10840L9425o4945K91548
$$ plain form
14695 989523 942663 1021392 892337 939205 629519 787597 804857 831180 750779 868078 942627
14684 942627 835199 1059595 799938 1089420 842586 855141 1053721 1191305 946033 782983
14674 782983 928480 917031 1021724 1203999 1159408 1185561 995414 1120590 1033779 808553
14664 808553 1204660 1119651 955337 1059267 1250910 911817 1154204 1036501 1160323 1112839
14654 1112839 1119526 1105535 1215887 1301737 1310134 959956 1163958 1046848 1175014 1231886 1154508
14643 1154508 920491 1448585 792679 1288574 1261337 1018812 1149693 1148353 1139235 1102391
14633 1102391 1331975 1374958 1450090 1194132 1323417 1279999 1241648 1166693 1195268 1294704 1249432
14622 1249432 1364561 1427125 1288903 1592882 1473322 1358726 1438617 1329037 1617652 1479269
$$ packed form
14695I89523m6860P8729j29055M6868l09686J58078J7260K6323q0401J17299P4549
14684I42627j07428K24396k59657K89482k46834J2555J98580J37584k45272j63050
14674G82983J45497j1449J04693J82275m4591K6153j90147J25176q6811k25226
14664H08553L96107q5009j64314J03930J91643l39093K42387j17703J23822m7484
14654A112839O687j3991J10352Q5850Q397l50178K04002j17110J28166N6872p7378
14643A154508k34017N28094o55906M95895k7237k42525J30881j340r118l6844
14633A102391K29584M2983P5132k55958J29285m3418l8351p4955K8575R9436m5272
14622A249432J15129O2564j38222L03979j19560j14596P9891j09580K88615j38383
$$ plain form
14612 1479269 1238722 1274637 1410250 1452105 1330894 1528023 1454735 1496926 1783978 1633506
14602 1633506 1599526 1420940 1577412 1483567 1789748 1700647 1296195 1718374 1442748 1810420
14592 1810420 1713636 1955015 1928849 1812444 1790043 1711821 2148105 1641082 1860604 1990793
14582 1990793 1709556 1776522 1776123 1912128 1941175 1804273 1595812 2285576 1969660 1928809
14572 1928809 2050837 2006425 2082689 2119714 2090048 2120287 2095968 2533932 2404518 2556228
14562 2556228 2166323 2392064 2624193 2760454 2519284 3083755 2991203 2705779 3436233 3268948
14552 3268948 3573168 4418210 5472968 6806210 10653234 19736776 42966681 46153963
14544 46153963 20271842 8938315 8165691 5576640 3073182 2446342 1928861 2289109
$$ packed form
14612A479269k40547L5915J35613M1855j21211J97129p3288M2191K87052j50472
14602A633506l3980j78586J56472r3845L06181q9101m04452M22179k75626L67672
14592A810420r6784K41379k6166j16405k2401p8222M36284n07023K19522J30189
14582A990793k81237O6966l99J36005K9047j36902k08461O89764l15916m0851
14572A928809J22028m4412P6264L7025k9666L0239k4319M37964j29414J51710
14562B556228l89905K25741K32129J36261k41170N64471r2552k85424P30454j67285
14552C268948L04220Q45042J054758J333242L847024R083542K3229905L187282
14544D6153963B0271842H938315p72624k589051k503458o26840n17481L60248
$$ plain form
14536 2289109 2405018 1970712 2216371 2032815 2248057 2074974 2188743 1873968 2176421
14527 2176421 2197891 2352044 2311385 2123002 2435873 2570186 2341854 2547760 2444807 2578030
14517 2578030 2570529 2354176 2584671 3027145 2815287 2778733 2613922 2686516 2746723 2398405
14507 2398405 2969806 2667264 2822839 3046771 3061624 3086857 3050102 3000804 3254573 2958784
14497 2958784 3461549 3257916 3017181 3052578 3241012 3340421 3560528 3464757 3177237 3492711
14487 3492711 3334703 3594962 3519210 3706928 3640671 4016872 3567747 3967881 4113386 4061720
14477 4061720 4163364 3989454 4164547 4028763 3983752 4175708 3830899 4335469 4355781 4538289
14467 4538289 4233222 4301260 4747282 4722041 4581668 4424111 4362029 4896104 4711134 5101896
$$ packed form
14536B289109J15909m34306K45659j83556K15242j73083J13769l14775L02453
14527B176421K1470J54153m0659j88383L12871J34313k28332K05906j02953J33223
14517B578030p501k16353K30495M42474k11858l6554j64811P2594O0207l48318
14507B398405N71401l02542J55575K23932J4853K5233l6755m9298K53769k95789
14497B958784N02765k03633k40735L5397J88434R9409K20107r5771k87520L15474
14487C492711j58008K60259p5752J87718o6257L76201m49125M00134J45505n1666
14477D061720J01644j73910J75093j35784m5011J91956l44809N04570K0312J82508
14467D538289l05067O8038M46022k5241j40373j57557o2082N34075j84970L90762
$$ plain form
14457 5101896 4792103 5013863 5305641 5255886 4909904 5100986 5306131 5333483 5586745 5322595
14447 5322595 5705041 5537963 5406085 5553059 5710593 5839652 6063197 5978771 5890997 5898516
14437 5898516 6344303 6395031 6544063 6400833 6834523 6667094 6647177 6854011 6701168 6921374
14427 6921374 7180382 6931360 7292035 6877111 7503816 7326271 7619315 7716725 8064766 7849794
14417 7849794 7961137 8339019 8475521 8613206 8416530 8754456 8498549 8982318 9204172
14408 9204172 9189120 9205612 9328700 9755253 9836792 9665190 10531900 10146584 10286349 10302021
14398 10302021 10823505 10753465 11134931 11181761 11341572 11448521 11653645 11620941 12166778 12429705
14388 12429705 12689977 12755587 13079329 13444434 13427470 13613991 13875533 14245012 14849508 14643240
$$ packed form
14457E101896l09793K21760K91778m9755l45982J91082K05145K7352K53262k64150
14447E322595L82446j67078j31878J46974J57534J29059K23545q4426q7774P519
14437E898516M45787N0728J49032j43230M33690j67429j9917K06834j52843K20206
14427F921374K59008k49022L60675m14924O26705j77545K93044R7410L48041k14972
14417G849794J11343L77882J36502J37685j96676L37926k55907M83769K21854
14408I204172j5052J6492J23088M26553Q1539j71602Q66710l85316J39765J5672
14398A0302021N21484p0040L81466M6830J59811J06949K05124l2704N45837K62927
14388A2429705K60272O5610L23742L65105j6964J86521K61542L69479O04496k06268
$$ plain form
14378 14643240 15072915 15312408 15896651 15953904 16073286 16642030 16947728 17155755 17305243
14369 17305243 17641774 18473627 18490796 18793434 19142547 19837974 20385261 20638790 20998052
14360 20998052 21529742 21823381 22608623 22997989 23601562 23874049 24626145 25170222 25531414
14351 25531414 26459742 26942530 27653042 28256604 28861229 29726919 30710586 31193718 32155851
14342 32155851 32759819 33886021 34736045 35756924 36895962 37656866 38880700 40005171
14334 40005171 41147201 42550229 43183240 44609485 46252073 47333926 49228272 50665044
14326 50665044 52462788 53686669 55812923 57783753 59597422 61877720 63872048 66119976
14318 66119976 68655166 71351056 73464711 76595751 79754132 82946690 86340889 89503416
$$ packed form
14378A4643240M29675K39493N84243N7253J19382N68744L05698K08027J49488
14369A7305243L36531Q31853J7169L02638L49113O95427N47287K53529L59262
14360B0998052N31690K93639P85242L89366O03573K72487P52096N44077L61192
14351B5531414R28328M82788P10512O03562O04625Q65690R83667M83132R62133
14342C2155851O03968J126202Q50024J020879J139038P60904J223834J124471
14334D0005171J142030J403028O33011J426245J642588J081853J894346J436772
14326E0665044J797744J223881K126254J970830J813669K280298J994328K247928
14318F6119976K535190K695890K113655L131040L158381L192558L394199L162527
$$ plain form
14310 89503416 92932076 97276983 101320387 105505927 110268250 114816324 120362352 125458188
14302 125458188 131019930 137218604 143906492 150935044 158588402 166199049 174577510 183321890
14294 183321890 192426420 202655320 212886463 223727977 235576913 247417099 260606567
14287 260606567 273954064 287615669 301950496 317089616 331696723 346964004 361983548
14280 361983548 377293287 392357495 406859072 420217047 432747305 444125262 454077496
14273 454077496 461694470 465720260 466745855 466900075 466011344 462565897 459894671 454201478
14265 454201478 446224164 436317332 424334807 410856202 396321150 381378507 365921313
14258 365921313 349943653 334284913 318420382 303379524 288269891 273986872 262163502
$$ packed form
14310H9503416L428660M344907M043404M185540M762323M548074N546028N095836
14302A25458188N561742O198674O687888P028552P653358P610647Q378461Q744380
14294A83321890R104530J0228900J0231143J0841514J1848936J1840186J3189468
14287B60606567J3347497J3661605J4334827J5139120J4607107J5267281J5019544
14280C61983548J5309739J5064208J4501577J3357975J2530258J1377957R952234
14273D54077496P616974M025790J025595J54220q88731l445447k671226n693193
14265D54201478p977314r906832j1982525j3478605j4535052j4942643j5457194
14258C65921313j5977660j5658740j5864531j5040858j5109633j4283019j1823370
$$ plain form
14251 262163502 249205735 236715247 224877783 213529189 203002981 192871932 183360309
14244 183360309 174989543 166757093 158985894 151397244 144010753 137507437 131938333 126341294
14236 126341294 120739862 115400955 110309447 105504070 101640057 97755348 93922058 89938223
14228 89938223 86233903 82888155 79867299 76970679 73819011 71367687 68795822 66516752
14220 66516752 64424387 62025253 60164371 57611858 56019914 54238505 52932945 51314834
14212 51314834 49324704 47776238 46432788 44946669 43370080 42872989 41964928 40334775
14204 40334775 39094351 38038473 37131026 36446791 35645778 34534433 33326553 32307758
14196 32307758 32163899 30854037 30255266 29533477 28797437 28024255 27259568 26815296 25965931
$$ packed form
14251B62163502j2957767j2490488j1837464j1348594j0526208j0131049r511623
14244A83360309q370766q232450p771199p588650p386491o503316n569104n597039
14236A26341294n601432n338907n091508m805377l864013l884709l833290l983835
14228H9938223l704320l345748l020856k896620l151668k451324k571865k279070
14220F6516752k092365k399134j860882k552513j591944j781409j305560j618111
14212E1314834j990130j548466j343450j486119j576589m97091r08061j630153
14204D0334775j240424j055878r07447o84235q01013j111345j207880j018795
14196C2307758j43859j309862n98771p21789p36040p73182p64687m44272q49365
$$ plain form
14187 25965931 25681837 24912355 24084842 23703520 23212405 23185301 22227885 21892827 21203986
14178 21203986 20802510 20573492 19877319 19400928 19099664 18729909 18517645 17908487 17773762
14169 17773762 17313593 17415180 16656491 16252588 16061351 15831327 15546237 15433678 14857564
14160 14857564 14769203 14636121 14038065 13946223 13894769 13262734 13265583 12952757 12581688 12462299
14150 12462299 12427016 12187666 11982979 11797012 11549473 11316919 11639466 11128355 10575100
14141 10575100 10912575 10685218 10525980 10412264 10132979 10087349 10367478 9932722 9914375 9316130
14131 9316130 9408755 9097034 8660967 9228779 8866953 8730213 8447367 8677412 8373489 7917516
14121 7917516 8025426 8101047 8167452 7763296 8101313 7866278 7221777 7682190 7282187 7191743
$$ packed form
14187B5965931k84094p69482q27513l81322m91115k7104r57416l35058o88841
14178B1203986m01476k29018o96173m76391l01264l69755k12264o09158j34725
14169A7773762m60169J01587p58689m03903j91237k30024k85090j12559n76114
14160A4857564q8361j33082n98056r1842n1454o32035K849l12826l71069j19389
14150A2462299l5283k39350k04687j85967k47539k32554L22547n11111n53255
14141A0575100L37475k27357j59238j13716k79285m5630K80129m34756j8347n98245
14131I316130R2625l11721m36067N67812l61826j36740k82846K30045l03923m55973
14121G917516J07910P5621O6405m04156L38017k35035o44501M60413m00003r0444
$$ plain form
14111 7191743 6869937 7269992 7430140 7109967 6764674 6949394 6674102 6730059 6254256 6203151
14101 6203151 6477793 6283144 6187373 5925215 6212206 5655269 6323411 5897142 5736508 5733931
14091 5733931 5713929 5206407 5585968 5548449 5643503 5629538 5307489 4937436 5037699 5170061
14081 5170061 5119104 5086439 4914810 5187566 4697716 4988266 4756878 4648462 4755711 4343812
14071 4343812 4633219 4293786 4657342 4435411 4479772 4483155 4435470 4151453 4374456 4019806
14061 4019806 4156161 4109762 3907278 4027373 4215127 4053359 3746254 4035623 3729968 3862140
14051 3862140 3743800 3468139 3897437 3810181 3349771 3636542 3749446 3361254 3608930 3059369
14041 3059369 3261617 3133526 3186935 3353068 2917928 3122700 3298782 3087954 3163296 2884954
$$ packed form
14111G191743l21806M00055J60148l20173l45293J84720k75292N5957m75803n1105
14101F203151K74642j94649r5771k62158K86991n56937O68142m26269j60634k577
14091E733931k0002n07522L79561l7519R5054j3965l22049l70053J00263J32362
14081E170061n0957l2665j71629K72756m89850K90550k31388j08416J07249m11899
14071D343812K89407l39433L63556k21931M4361L383m7685k84017K23003l54650
14061D019806J36355m6399k02484J20095J87754j61768l07105K89369l05655J32172
14051C862140j18340k75661M29298q7256m60410K86771J12904l88192K47676n49561
14041C059369K02248j28091N3409J66133m35140K04772J76082k10828P5342k78342
$$ plain form
14031 2884954 2997934 3223022 3071557 3300672 3029646 2732223 3203267 2976897 3085924
14022 3085924 3157028 2666057 2585549 2438377 2410561 2571671 2649544 2495626 2674749 2595222
14012 2595222 2413145 2533543 2680464 2299423 2443756 2289588 2764261 2341737 2304741 1939006
14002 1939006 2270467 2361736 2484389 2401719 2325174 1720793 2069887 2335892 2266217 2394517
13992 2394517 2438873 1982871 2713288 3165427 5505236 12144837 34413559 49421104 27200068
13983 27200068 13387671 8231962 6170008 4840771 4443468 3862339 3479306 3345373
13975 3345373 3083108 2912536 2944800 2833903 2521827 2509647 2474129 2344468 2397270 2389689
13965 2389689 2541237 2621757 2632279 2214990 2291384 2016650 2316480 1876347 2446244 2208103
$$ packed form
14031B884954J12980K25088j51465K29115k71026k97423M71044k26370J09027
14022C085924P1104m90971q0508j47172k7816J61110P7873j53918J79123p9527
14012B595222j82077J20398J46921l81041J44333j54168M74673m22524l6996l65735
14002A939006L31461R1269J22653q2670p6545o04381L49094K66005o9675J28300
13992B394517M4356m56002P30417M52139K339809O639601K2268722J5007545k2221036
13983B7200068A3387671n155709k061954j329237l97303n81129l83033j33933
13975C345373k62265j70572L2264j10897l12076j2180l5518j29661N2802p581
13965B389689J51548Q0520J0522m17289P6394k74734K99830m40133N69897k38141
$$ plain form
13955 2208103 1980760 1704947 1891825 1767601 1774664 2328356 2200887 2012950 2093602 2060246
13945 2060246 1850381 1826105 1951781 1984337 1992150 1797669 1628166 2153257 1958884 2225920
13935 2225920 1908927 1667961 1804748 1494345 1717108 1843754 1991094 1783800 1692666 1829805
13925 1829805 1777127 1817782 1336505 1565454 1488204 1356409 1564882 1412525 1627396 1594890
13915 1594890 1697519 1527558 1437857 1354909 1310446 1534704 1683981 1618354 1694726 1553559
13905 1553559 1670557 1495450 1258174 1076262 1464593 1279831 1392674 1521592 1503047 1382592
13895 1382592 1246952 1182023 1107586 1293319 1446154 1239437 1082651 1349997 1684639 1332220
13885 1332220 1349527 1089211 1337201 1432722 1468579 1369697 1332058 1463342 1146625 928597
$$ packed form
13955B208103k27343k75813J86878j24224P063N53692j27469j87937Q0652l3356
13945B060246k09865k4276J25676L2556P813j94481j69503N25091j94373K67036
13935B225920l16993k40966J36787l10403K22763J26646J47340k07294r1134J37139
13925A829805n2678M0655m81277K28949p7250j31795K08473j52357K14871l2506
13915A594890J02629j69961q9701q2948m4463K24258J49277o5627P6372j41167
13905A553559J16998j75107k37276j81912L88331j84762J12843J28918j8545j20455
13895A382592j35640o4929p4437J85733J52835k06717j56786K67346L34642l52419
13885A332220J7307k60316K47990R5521L5857r8882l7639J31284l16717k18028
$$ plain form
13875 928597 1218829 1366540 948477 1052669 1360974 1286042 1170471 1346965 1482304 1247891
13865 1247891 1075669 1186837 1204530 1150731 1350411 1335425 1063881 1024443 1304731 880181
13855 880181 883028 1259742 1093763 804410 1246308 1078988 757110 988706 1332114 1220489
13845 1220489 1231380 896551 964219 858980 992096 854059 845765 971061 852633 940806
13835 940806 711661 1011027 1062682 968649 622706 802402 1034522 770443 1068968 918627
13825 918627 864705 1474959 694121 823056 714017 1020055 884308 898876 910021 622247
13815 622247 1130231 1162969 999275 925945 956130 834694 927487 860393 881940 665772 509583
13804 509583 587823 606031 722742 857632 824955 477171 757599 870554 732659 567008
$$ packed form
13875I28597K90232J47711m18063J04192L08305p4932j15571J76494J35339k34413
13865A247891j72222J11168J7693n3799J99680j4986k71544l9438K80288m24550
13855H80181K847L76714j65979k89353M41898j67320l21878K31596L43408j11625
13845A220489J0891l34829O7668j05239J33116j38037q294J25296j18428Q8173
13835I40806k29145K99366N1655r4033l45943J79696K32120k64079K98525j50341
13825I18627n3922O10254F94121J28935j09039L06038j35747J4568J1145k87774
13815F22247N07984L2738j63694p3330L0185j21436R2793o7094K1547k16168j56189
13804E09583P8240J8208J16711J34890l2677l47784K80428J12955j37895j65651
$$ plain form
13794 567008 717163 876740 794316 644107 972699 930720 857100 947991 608067 965253
13784 965253 793347 550464 891106 923162 571242 437658 997071 951544 808395 886175
13774 886175 787851 475206 742040 964460 646407 514788 350209 722761 844338 610465
13764 610465 653881 803069 558893 684353 950907 735867 538391 781123 918208 1031455
13754 1031455 910786 496102 685283 412621 850734 817645 428276 779803 656879 674643
13744 674643 766466 916365 733450 684156 777567 505090 670998 362243 814772 920931
13734 920931 473036 813434 645969 476124 711607 1014338 836722 612766 152239 621784
13724 621784 636525 979818 700027 694982 519643 825949 593278 730464 625453 1027523
$$ packed form
13794E67008J50155J59577q2424j50209L28592m1979p3620R0891l39924L57186
13784I65253j71906k42883L40642L2056l51920j33584N59413m5527j43149P7780
13774H86175r8324l12645K66834K22420l18053j31619j64579L72552J21577k33873
13764F10465M3416J49188k44176J25460K66554k15040j97476K42732J37085J13247
13754A031455j20669m14684J89181k72662M38113l3089l89369L51527j22924J7764
13744F74643R1823J49899j82915m9294R3411k72477J65908l08755M52529J06159
13734I20931m47895L40398j67465j69845K35483L02731j77616k23956A52239M69545
13724F21784J4741L43293k79791n045j75339L06306k32671J37186j05011M02070
$$ plain form
13714 1027523 577351 394483 446155 670736 730507 654576 223674 469052 471198 398473
13704 398473 594413 668642 306221 721792 190395 216012 632596 806234 619807 547315
13694 547315 464827 463085 233183 378539 525859 196624 -12927 451570 497424 363384
13684 363384 661611 303656 570343 609377 597910 715351 579951 850748 461982 263697
13674 263697 370138 69093 270508 657852 278173 366057 369242 540327 174936 477091
13664 477091 482712 536731 421657 301048 384899 165761 82622 585119 423978 362172 482793
13653 482793 442156 429380 466071 611776 578925 69685 244250 712757 135618 348826
13643 348826 246899 478665 479249 583860 169939 258583 364151 378723 272636 381662
$$ packed form
13714A027523m50172j82868N1672K24581N9771p5931B23674K45378K146p2725
13704C98473J95940P4229C06221M15571A90395K5617M16584J73638j86427p2492
13694E47315q2488j742k29902J45356J47320A96624a2927D51570M5854j34040
13684C63384K98227C03656K66687L9034j1467J17441j35400K70797l88766j98285
13674B63697J06441F9093K01415L87344B78173Q7884L185J71085A74936L02155
13664D77091N621N4019j15074j20609Q3851A65761H2622N02497j61141o1806J20621
13653D82793m0637j2776L6691J45705l2851F9685J74565M68507A35618K13208
13643C48826j01927K31766N84J04611A69939Q8644J05568J4572j06087J09026
$$ plain form
13633 381662 439033 278600 387480 430405 399399 246695 470594 215239 284125 338009
13623 338009 626550 636911 15338 722182 288008 577010 430731 574498 279676 422891
13613 422891 609577 393425 629685 208128 593390 105372 321866 361732 462963 178506
13602 179684 234739 479177 464484 346146 534823 809972 716815 260106 432041 458342
13592 458342 251112 513020 376279 701901 267916 186009 573615 537732 490845 520192
13582 520192 510854 411082 221526 692697 370921 243848 136191 220617 175412 239880 17082
13570 338092 377546 351951 391502 255343 95606 351378 341253 389385 448880 209887 444931
13559 444931 383247 211340 49819 434729 328065 412416 575711 172738 224565 255519
$$ packed form
13633C81662N7371j60433J08880M2925l1006j52704K23899B15239O8886N3884
13623C38009K88541J0361A5338P06844B88008K89002j46279J43767B79676J43215
13613D22891J86686k16152K36260B08128L85262A05372K16494L9866J01231A78506
13602A79684N5055K44438j4693j18338J88677K75149r3157B60106J71935K6301
13592D58342k07230K61908j36741L25622B67916q1907L87606l5883m6887K9347
13582E20192r338r9772j89556M71171l21776j27073j07657Q4426m5205O4468A7082
13570C38092L9454k5595L9551j36159I5606K55772j0125M8132N9495B09887K35044
13559D44931o1684j71907D9819L84910j06664Q4351J63295A72738N1827L0954
$$ plain form
13549 255519 78888 485117 385858 204730 343895 506188 239792 142609 329799 255360
13539 255360 161835 432927 653205 517579 231896 409632 521648 128099 361808 387992
13529 387992 358804 253838 318874 252824 383667 240920 397224 288481 -7520 385508
13518 329217 279219 136928 274072 334583 389177 374318 394865 185569 593228 -265260
13507 302016 52521 -1275 410225 251244 107881 387005 353875 475199 200564 127797
13497 127797 365992 212743 309381 494275 130958 140953 73116 240205 240904 -9441 460415
13485 49884 321621 389921 106087 266421 304272 220137 183961 120345 10517 267598 465959
13474 465959 -46494 34870 145829 426941 218662 376936 125445 279174 287748 233836
$$ packed form
13549B55519G8888M06229r9259j81128J39165J62293B39792r7183J87190p4439
13539B55360r3525K71092K20278j35626B31896J77736J12016A28099K33709K6184
13529C87992k9188j04966O5036o6050J30843j42747J56304j08743g520C85508
13518C29217m9998A36928J37144O0511N4594j4859K0547A85569M07659b65260
13507C02016E2521a275D10225j58981A07881K79124l3130J21324B00564p2767
13497A27797K38195j53249R6638J84894A30958R995o7837J67089O99i441D60415
13485D9884K71737O8300A06087J60334L7851q4135l6176o3616A0517K57081J98361
13474D65959d6494C4870J10959K81112k08279J58274A25445J53729Q574n3912
$$ plain form
13464 233836 247296 289443 186821 80413 -105738 151215 156470 671362 -22869 556261 176167
13452 411739 375784 -78544 -9393 268207 283582 89280 82937 335539 206451 111910 340911
13441 340911 290284 508268 145630 367437 255991 38945 378768 136943 279245 203124
13431 203124 282384 357016 -52306 257255 182236 283589 132091 91935 264552 360517 293186
13420 293186 195137 384268 237776 346159 135110 -39404 360565 254340 304439 237884
13410 237884 386730 86786 172468 277262 224245 55294 -20359 141644 354350 270411 -1949
13398 93992 56758 180503 2756 136965 162230 -1004 33303 35166 -6552 176662 224979 53730
13385 317097 314952 -112017 263140 224694 217138 488874 340800 439665 257364 180291 124476
$$ packed form
13464B33836J3460M2147j02622H0413a05738A51215N255N14892b2869E56261A76167
13452D11739l5955g8544i393B68207J5375H9280o343K52602j29088r4541K29001
13441C40911n0627K17984A45630K21807j11446C8945L39823A36943J42302p6121
13431B03124P9260P4632e2306B57255p5019J01353A32091m0156J72617R5965o7331
13420B93186r8049J89131j46492J08383A35110c9404C60565j06225N0099o6555
13410B37884J48846H6786Q5682J04794n3017E5294b0359A41644K12706q3939a949
13398I3992l7234J23745B756J34209K5265a004C3303J863f552A76662M8317E3730
13385C17097k145a12017B63140l8446p556K71736j48074R8865j82301p7073n5815
$$ plain form
13374 124476 120373 406352 10251 -98599 152615 178645 69004 -186852 350499 473830 249313
13363 249313 221981 1923 76721 340871 159580 184164 396423 273899 205990 239690 246060
13352 246060 214594 120185 233636 239359 447948 37061 409079 239201 440740 477556 193344
13340 300593 648758 653786 112613 550760 321119 251294 333677 278954 -8684 290668 296599
13329 296599 69998 107905 292028 -11643 52717 122832 167557 9953 -68314 226822 219273
13318 219273 -93687 377845 316902 161499 145499 15650 532822 404303 196488 248779
13308 248779 209718 72988 241243 407675 468677 200256 36946 274548 291078 186683
13298 186683 155480 209176 93964 48750 229205 290542 -138964 229918 -1235 272613 163447
$$ packed form
13374A24476m103K85979A0251i8599A52615K6030F9004a86852C50499J23331k24517
13363B49313k7332A923P4798K64150A59580K4584K12259j22524o7909L3700O370
13352B46060l1466r4409J13451N723K08589C7061L72018j69878K01539L6816A93344
13340C00593L48165N028A12613M38147k29641o9825Q2383n4723h684B90668N931
13329B96599F9998L7907J84123a1643E2717P0115M4725I953f8314B26822p549
13318B19273i3687C77845o0943j55403j6000A5650N17172j28519A96488N2291
13308B48779l9061G2988J68255J66432O1002B00256C6946K37602J6530j04395
13298A86683l1203N3696I3964m5214J80455O1337a38964B29918a235B72613j09166
$$ plain form
13287 163447 49164 -48425 282467 232328 163052 -217504 -252790 377261 -30251 418004 -18993
13275 164673 315351 73192 116843 365261 42579 160543 192898 14878 50358 211661 292489
13264 292489 -206166 9397 139334 232600 61421 252682 -118939 -69472 -4930 26512 -20544
13252 -16799 409784 141433 52487 -17952 491695 206976 255749 157796 268269 185461 442555
13241 442555 125654 229703 19182 300295 614885 43131 -145822 -110536 107599 85999
13231 85999 169941 459271 164751 -45251 -194739 108781 89514 180579 206499 452329 347954
13220 347954 -126932 315528 231881 238876 76836 318330 144096 158373 517051 206337
13209 -39458 -44857 -414799 -144066 -60116 75436 88335 116629 345869 87700 -222620 -122329
$$ packed form
13287A63447D9164d8425B82467n0139o9276b17504l5286C77261c0251D18004a8993
13275A64673J50678G3192M3651K48418D2579J17964L2355A4878L5480J61303Q0828
13264B92489b06166I397J29937R3266F1421J91261a18939M9467d930B6512b0544
13252a6799D09784A41433E2487a7952D91695B06976M8773r7953J10473q2808K57094
13241D42555A25654J04049A9182K81113L14590D3131a45822L5286A07599k1600
13231H5999Q3942K89330A64751d5251j49488A08781j9267R1065K5920K45830j04375
13220C47954a26932C15528q3647O995G6836K41494A44096J4277L58678B06337
13209c9458n399l69942a44066f0116G5436J2899K8294K29240H7700b22620J00291
$$ plain form
13198 -122329 58552 237121 -116623 357789 171847 115117 480924 -94383 -241817 -5249
13187 -227052 5245 -215932 -13173 186512 -173664 290079 94863 -90779 138238 357381
13177 357381 13167 101732 56654 -102331 353247 396835 -30387 315111 247000 -86412 298195
13165 80339 -86103 -78304 -284065 241044 -37240 -151699 232092 -89311 310998 517987 125949
13153 350162 307443 12005 80811 -105297 151784 23433 384097 192483 179724 235924 345209
13142 345209 221613 247348 128877 285573 39288 293297 164544 60137 63241 252909
13132 252909 32309 -34396 -38385 7509 75068 277334 -174724 -8061 208018 297117 94098
13120 256985 -247814 329137 100752 172760 -18662 -80048 -141527 280646 237473 209898 -73300
$$ packed form
13198a22329E8552J78569a16623C57789A71847n6730L65807i4383j47434e249
13187b27052E245b15932a3173A86512a73664B90079I4863i0779A38238K19143
13177C57381A3167Q8565m5078a02331C53247M3588c0387C15111o8111h6412B98195
13165H0339h6103P799k05761B41044c7240j14459B32092h9311C10998K06989A25949
13153C50162m2719A2005O8806a05297A51784B3433L60664j91614j2759N6200J09285
13142C45209j23596K5735j18471J56696C9288K54009j28753F0137L104J89668
13132B52909C2309c4396l989G509O7559K02266a74724h061B08018Q9099I4098
13120B56985b47814C29137A00752P2008a8662o1386o1479B80646m3173k7575g3300
$$ plain form
13108 104099 143634 403664 209868 -40925 103991 170562 206970 100675 151595 208926 -50990
13096 202466 41593 -2772 371264 -128064 142251 -16592 234918 -150432 -390893 -17440
13085 -52414 52401 78415 -13494 85596 6982 -132201 349536 -523279 -110467 127 243656
13074 243656 88520 155131 194280 224548 41629 25062 102284 230875 210266 225408 150259
13063 150259 472597 154577 124344 82455 -290284 168348 175819 -31545 -59939 326934 1034
13051 -66534 50985 75389 55212 241226 -42641 161804 416329 492528 148776 54731 152888
13040 152888 31208 279329 -74612 6027 51094 -95231 66282 29135 327014 201673 34099
13028 159146 317338 265617 124267 112292 317395 154617 216076 253945 34244 132452 -145010
$$ packed form
13108A04099L9535K60030j93796d0925A03991O6571L6408A00675N0920N7331e0990
13096B02466D1593b772C71264a28064A42251a6592B34918a50432k40461a7440
13085e2414E2401K6014a3494H5596F982a32201C49536e23279a10467A27K43529
13074B43656H8520O6611L9149L0268D1629j6567P7222J28591k0609J5142p5149
13063A50259L22338A54577l0233m1889b90284A68348P471c1545k8394C26934A034
13051f6534E0985K4404k0177J86014d2641A61804K54525P6199A48776E4731R8157
13040A52888C1208K48121g4612F027M5067i5231F6282B9135K97879j25341C4099
13028A59146J58192n1721A24267j1975K05103A54617O1459L7869C4244R8208a45010
$$ plain form
13016 26608 308057 171032 49602 -104774 211218 94865 193507 -96701 -155246 56922 355931
13005 355931 69687 174210 258361 164460 -28492 -136433 327984 160356 249934 377021
12995 377021 74647 -48905 -68792 70344 198180 -24100 53115 112282 53568 59690 -87844
12983 164975 58280 -149335 -28452 148669 50693 -76685 90327 282399 91823 261576 112698
12971 -87626 -226688 -184839 -136036 73711 -109969 293762 -159630 -352640 229727 44595
12960 305895 241249 244493 41315 31681 -187522 233072 109844 104340 20080 -54792 28560
12948 -143870 75089 -94735 61970 -234476 76783 290575 273904 37758 -97147 95956 92554
12937 92554 140865 234465 325220 26233 -118089 2406 -115809 143443 -294133 123196 101665
$$ packed form
13016B6608K81449j37025D9602a04774B11218I4865R8642i6701n8545E6922K99009
13005C55931F9687J04523Q4151r3901b8492j07941C27984A60356Q9578J27087
12995C77021G4647d8905j9887G0344J27836b4100E3115N9167E3568O122h7844
12983A64975E8280a49335b8452A48669E0693g6685I0327J92072I1823J69753A12698
12971h7626j39062M1849M8803G3711a09969B93762a59630j93010B29727D4595
12960C05895o4646L244D1315r634a87522B33072A09844n504B0080e4792B8560
12948a43870G5089i4735F1970b34476G6783K13792j6671C7758i7147I5956l402
12937I2554M8311R3600R0755B6233a18089B406a15809A43443b94133A23196k1531
$$ plain form
12926 101665 -82963 187611 -76588 -224063 -120843 75133 305587 -105466 -219276 -263615
12916 -263615 -95285 265040 -77406 -90824 -51204 211116 163322 141436 135566 166582 -80778
12904 52500 -146316 79918 189339 233946 -201364 -175172 -56650 105109 282030 112405
12893 277118 -156244 -241392 -306798 -19364 -213613 173246 175090 207185 -254817 171429 -41440
12881 42102 104639 -162005 628804 -191965 175902 -128766 -253411 -127986 -199600 -37728
12870 204629 -109414 -231219 131821 42449 -39919 3599 235918 -43235 -146173 -10354 11172
12858 16436 -75295 456951 233723 187433 298806 -27045 243065 132155 167654 92077 -211075
12846 -115021 282665 304133 134869 -32177 51665 -109493 -139674 111308 -45362 -11558 -103266
$$ packed form
12926A01665h2963A87611g6588j47475J03220G5133K30454a05466j13810m4339
12916b63615i5285B65040g7406j3418L9620B11116m7794k1886n870L1016h0778
12904E2500a46316G9918J09421M4607b01364K6192e6650A05109J76921A12405
12893B77118a56244q5148o5406a9364j94249A73246J844L2095b54817A71429d1440
12881D2102O2537a62005F28804a91965A75902a28766j24645J25425p1614c7728
12870B04629a09414j21805A31821D2449c9919C599K32319d3235j02938a0354A1172
12858A6436g5295D56951k23228m6290J11373b7045B43065j10910L5499p5577b11075
12846a15021B82665K1468A34869c2177E1665a09493l0181A11308d5362a1558r1708
$$ plain form
12835 -103266 173632 -124364 131255 55859 298312 180474 -485389 286463 -99757 176095
12824 -10037 113029 -154682 11597 145813 33565 -29170 -33468 278498 102187 161381 159656
12813 159656 255727 -116631 130801 -158987 -52312 -124142 72053 -53282 -127427 215683 -106279
12801 259255 8920 -5189 407732 122322 98285 -19282 224417 3970 313455 147382 -101092
12789 127196 153620 -172814 16010 -71497 155174 -127545 35386 125920 541 -438614 109860
12777 -147162 417532 -72262 225082 -198876 196124 -7397 217614 140550 599722 35716
12766 48938 96795 -288322 59765 24577 -39107 -134507 317367 88243 203291 290343 63554
12754 -124660 48497 -13211 -95451 31 150401 38221 -366717 72226 418560 417519 -266269
$$ packed form
12835a03266A73632a24364A31255E5859K42453j17838d85389B86463i9757A76095
12824a0037A13029a54682A1597J34216C3565b9170m298B78498A02187N9194j725
12813A59656R6071a16631A30801a58987e2312p1830G2053e3282p4145B15683a06279
12801B59255H920e189D07732A22322k4037a9282B24417C970L09485A47382a01092
12789A27196K6424a72814A6010g1497A55174a27545C5386R0534E41d38614A09860
12777a47162D17532g2262B25082a98876A96124g397B17614p7064M59172C5716
12766D8938M7857b88322E9765B4577c9107r5400C17367H8243J15048Q7052F3554
12754a24660D8497a3211q2240C1J50370C8221c66717G2226L46334j041b66269
$$ plain form
12742 -82010 -67196 -77890 23845 131299 476890 347285 323486 382840 72882 219097 -105178
12730 121867 -119057 60397 -17196 143674 -206775 -101873 52639 219092 -337760 -174914
12720 -174914 -346276 -52263 89738 -34154 215798 155422 767 -56013 -137057 57200 43104
12709 43104 -123462 6442 175341 146756 -295744 71175 -93743 89545 209254 38998 275751
12698 275751 -166200 -99426 274088 176797 380569 478126 15363 4845 107592 29727 166459
12687 166459 -85284 72738 238068 119639 85727 -249619 89344 354460 -64382 245941
12676 242384 306447 -157224 -114072 2296 194181 106987 22619 130731 191139 -33719 -10259
12664 220373 115951 192279 352752 45555 -196701 128102 250367 311591 97428 149347
$$ packed form
12742h2010J4814j0694B3845J07454L45591j29605k3799N9354G2882J46215a05178
12730A21867a19057F0397a7196A43674b06775a01873E2639J66453c37760J62846
12720a74914j71362e2263H9738c4154B15798o0376G67e6013q1044E7200j4096
12709D3104a23462F442J68899k8585b95744G1175i3743H9545J19709C8998K36753
12698B75751a66200O6774B74088r7291K03772R7557A5363D845J02747B9727J36732
12687A66459h5284G2738J65330j18429l3912b49619H9344K65116f4382B45941
12676B42384O4063a57224M3152B296J91885q7194B2619J08112O0408c3719a0259
12664B20373j04422P6328J60473D5555a96701A28102J22265O1224I7428N1919
$$ plain form
12654 149347 -2081 145257 -221980 413609 331253 168942 -123320 -91197 224260 121487
12644 121487 -15150 2346 158962 237155 -1364 145212 -262720 47229 182230 -77597 207947
12632 174551 126265 51808 191996 409708 405764 11599 219292 404695 -127592 231975
12621 309828 114762 -16616 226993 -76236 -158915 -102225 25137 -127860 173763 62271 213031
12610 213031 -228586 309176 52869 188124 -290274 131259 213456 144193 -125649 245505
12599 65535 -84551 227074 242027 -34642 131117 351504 77638 432083 59853 125246 236768
12588 236768 -147200 -65489 104520 63781 63729 -249675 -391909 -168023 -14634 -62268 -56800
12577 -56800 -173421 -126836 146947 -220362 -89557 92014 156099 112781 -414767 -146276 -309421
$$ packed form
12654A49347b081A45257b21980D13609q2356j62311a23320L2123B24260j02773
12644A21487a5150B346J56616P8193a364A45212b62720D7229J35001g7597B07947
12632A74551m8286E1808J40188K17712l944A1599K07693J85403a27592B31975
12621C09828A14762a6616B26993g6236q2679N6690B5137a27860A73763F2271J50760
12610B13031b28586C09176E2869J35255b90274A31259Q2197o9263a25649B45505
12599F5535h4551B27074J4953c4642A31117K20387G7638L54445E9853O5393J11522
12588B36768a47200f5489A04520m0739n2b49675j42234a68023a4634m7634N468
12577e6800j16621M6585A46947b20362h9557I2014O4085m3318d14767a46276j63145
$$ plain form
12566 -309421 -233026 31211 237054 257426 157308 -292759 -288940 5259 96852 43442 -30959
12554 129077 -124612 -56251 -144671 93965 197721 -34844 182001 191259 -5122 280853 15250
12542 -67610 -196198 -198362 -74465 -233775 44776 365652 -50107 -233034 -225079 -7059 -410880
12531 -410880 55465 43075 423921 -10760 186990 64807 153089 226815 132394 -34822 308773
12519 145252 152983 132976 181010 381328 444015 200107 193919 60654 133826 186389 -425982
12507 -140164 158916 14527 308585 -11517 -7680 1776 256639 -74065 50134 121594 -10526
12495 -105100 20535 -23978 -77362 -26431 -158384 263547 218959 331456 91679 230231 -21544
12483 146341 250374 -207553 37697 -57525 -182564 -52200 -224415 270933 74697 176833
$$ packed form
12566c09421P6395C1211K05843K0372j00118b92759L819E259R1593D3442c0959
12554A29077a24612e6251q8420I3965J03756c4844A82001R258e122B80853A5250
12542f7610j28588k164g4465j59310D4776L20876e0107j82927P955g059m03821
12531d10880E5465j2390L80846a0760A86990F4807Q8282P3726r4421c4822C08773
12519A45252P731k0007M8034K00318O2687B00107o188F0654P3172N2563d25982
12507a40164A58916A4527K94058a1517L837A776K54863g4065E0134P1460a0526
12495a05100B0535b3978n3384b6431j31953B63547m4588J12497I1679J38552b1544
12483A46341J04033b07553C7697e7525j25039e2200j72215B70933G4697J02136
$$ plain form
12473 176833 -33947 45949 198127 401682 85335 -199606 41896 99680 151167 218195 177072
12462 177072 388234 -1368 -304545 -35051 -189246 31548 89566 147043 54898 -56373 120216
12450 148939 -81791 -240413 -71349 -5796 -227894 216008 -339918 321397 -106489 254386
12439 -423523 -286049 -95389 56147 -201979 202463 -180963 5609 3276 236742 144946 -117233
12427 101049 20397 235670 -112611 238520 333191 5366 -382 -111961 25618 -52324 77443
12415 93033 -102798 -22098 118875 -218535 268449 176020 101097 -175348 -260533 234642
12404 4624 89360 132069 -13541 -225982 317737 1884 -167689 -39001 113327 63972 -127882
12392 27951 10291 -209634 164560 104560 -45640 141716 -173017 149036 173844 132239 53356
$$ packed form
12473A76833c3947D5949J52178K03555H5335a99606D1896N7784N1487O7028m1123
12462A77072K11162a368l03177c5051j54195C1548N8018N7477E4898e6373A20216
12450A48939h1791j58622g1349e796k22098B16008c39918C21397a06489B54386
12439d23523J37474i5389E6147b01979B02463a80963E609k333K33466r1796a17233
12427A01049B0397K15273a12611B38520R4671E366c82j11579B5618e2324G7443
12415I3033a02798b2098A18875b18535B68449r2429p4923a75348q5185B34642
12404D624Q4736M2709a3541k12441C17737A884a67689c9001A13327m9355a27882
12392B7951A0291b09634A64560o0000d5640A41716a73017A49036K4808m1605E3356
$$ plain form
12380 123761 -234320 -171609 97464 88117 -186641 182971 -71356 -192338 -53930 -61282 -119875
12369 -119875 -93225 10957 -176105 -37629 103917 -33202 46129 112109 236355 -151759 88887
12357 188390 -70414 140999 -76255 -95749 3001 82618 -110809 88220 86091 433114 34806
12345 -89279 -254948 -172449 -55902 -34091 93083 -12499 -55100 -188840 189461 62349 136531
12334 136531 -42036 73413 -150544 6584 -283738 -88358 146044 -84560 -65427 401217 368161
12323 368161 118765 25536 68953 -187976 -284290 -111513 -243830 -360587 99791 201674
12313 201674 -109054 76406 -224937 109844 209279 295357 -24937 -318451 -166070 -68038
12302 433605 99082 -202116 290094 146993 44537 119075 220229 182885 43880 -12894 -54844
$$ packed form
12380A23761b34320O2711I7464r347a86641A82971g1356j20982e3930p352n8593
12369a19875K6650A0957a76105c7629A03917c3202D6129O5980J24246a51759H8887
12357A88390g0414A40999g6255j9494C001P9617a10809H8220k129L47023C4806
12345h9279j65669Q2499e5902K1811I3083a2499m2601j33740A89461F2349P4182
12334A36531d2036G3413a50544F584b83738h8358A46044h4560J9133D01217l3056
12323C68161A18765B5536M3417a87976r6314a11513j32317j16757I9791J01883
12313B01674a09054G6406b24937A09844R9435Q6078b4937k93514J52381f8038
12302D33605I9082b02116B90094j43101D4537P4538J01154l7344D3880a2894m1950
$$ plain form
12291 -54844 -101466 198984 -241609 -34052 -105768 -22570 233064 -157825 114278 -132901
12280 198169 -156117 191925 -91829 -49844 -105206 -16437 230960 185037 45850 241118 157621
12269 157621 309987 109866 194026 194208 369424 106163 14784 183805 48206 84235 70957
12258 70957 -6168 31783 126774 -79998 70065 -159532 459081 79001 -280129 71096 21686
12246 223561 159256 -219960 -194021 210960 28295 130414 203644 5097 47333 146376 187918
12235 187918 87113 127560 -329451 90334 200825 24139 251019 200426 205858 120237 57760
12223 251460 77831 548910 442449 362406 358899 258954 407238 208318 143607 548207 -113323
12211 479265 310767 280181 127798 240748 36953 251614 313678 -193332 378960 244086
$$ packed form
12291e4844m6622A98984b41609c4052p1716b2570B33064a57825A14278a32901
12280A98169a56117A91925i1829M1985n5362a6437B30960m5923D5850J95268q3497
12269A57621J52366A09866Q4160J82J75216A06163A4784J69021D8206L6029j3278
12258G0957f168C1783R4991g9998G0065a59532D59081G9001b80129G1096B1686
12246B23561o4305b19960K5939B10960B8295J02119P3230E097M2236R9043M1542
12235A87918H7113M0447c29451I0334J10491B4139K26880n0593N432q5621E7760
12223B51460G7831M71079j06461q0043l507r9945J48284j98920o4711M04600a13323
12211D79265j68498l0586A27798J12950C6953K14661O2064a93332C78960j34874
$$ plain form
12201 244086 155512 333750 -147660 529218 381376 462303 145158 346951 154371 149777
12191 149777 366571 226521 279539 -114233 -42656 350695 136331 589 217707 -71290 -93118
12180 -93118 202913 207886 283467 -8374 -29255 336821 -56598 92180 127560 199631 382964
12169 382964 542368 -40592 542140 42350 266061 -34387 206452 293055 -40742 -18289 -320560
12158 -320560 -86348 142637 -66346 -55105 84952 144281 323754 53448 265097 138979 196576
12147 196576 -300187 22959 -42941 29828 184704 -92090 368242 -152267 238063 -128325
12136 -181324 212252 -20715 405385 -153711 -160799 298661 -85687 -7839 55328 -286079 97914
12124 160546 -328522 -257712 82409 217989 -85364 271325 379269 153252 109995 50682
$$ packed form
12201B44086q8574J78238a47660E29218j47842Q0927A45158K01793A54371m594
12191A49777K16794j40050N3018a14233d2656C50695A36331E89K17118g1290k1828
12180i3118B02913M973P5581h374k0881C36821e6598I2180L5380P2071J83333
12169C82964J59404d0592E42140D2350K23711c4387B06452Q6603d0742a8289l02271
12158c20560h6348A42637f6346J1241H4952N9329J79473E3448K11649j26118N7597
12147A96576c00187B2959d2941B9828J54876i2090C68242a52267B38063a28325
12136a81324B12252b0715D05385a53711p088B98661h5687g839E5328b86079I7914
12124A60546c28522P0810H2409J35580h5364B71325J07944A53252m3257E0682
$$ plain form
12113 -100504 -142863 155316 230790 149739 -48370 96379 352175 6185 141688 -194791 21874
12101 -236464 -89576 -79161 -370741 137339 -307664 352859 50782 395211 -34584 45564
12090 -42576 53079 48547 -283785 -203376 110540 -45410 -156095 -173350 48710 -268396 20385
12078 -105973 303172 -586 320879 -118535 -61909 -3472 -28313 -261808 302563 -155338 225367
12066 -200955 105537 -294316 409523 -60888 -88024 186159 378022 136796 1090851 2292212
12056 2292212 1032998 427583 -26223 372294 -300969 289949 158436 210640 121351 -319412
12045 -152503 228747 196734 281211 59600 96341 -130504 -35908 128667 -34324 85936 60265
12034 60265 -103064 -6473 -116758 -3479 57453 -323725 266383 23961 -355641 -3654 -230628
$$ packed form
12113a00504m2359A55316P5474q1051d8370I6379K55796F185J35503a94791B1874
12101b36464h9576J0415k91580A37339c07664C52859E0782L44429c4584D5564
12090d2576E3079m532b83785Q0409A10540d5410j10685j7255D8710b68396B0385
12078a05973C03172e86C20879a18535N6626c472k4841k33495C02563a55338B25367
12066b00955A05537b94316D09523f0888k7136A86159J91863A36796R54055J201361
12056B292212A032998D27583b6223C72294c00969B89949j31513N2204q9289c19412
12045a52503B28747l2013Q4477E9600L6741a30504c5908A28667c4324H5936k5671
12034F0265a03064f473j10285c479E7453c23725B66383B3961c55641c654k26974
$$ plain form
12023 -230628 243982 34194 -14632 -45381 -169977 -150465 -112004 -54339 403465 -60521 -63940
12012 -63940 -43256 29453 -91033 -99442 52132 -158473 244345 160952 -226315 -118901 203706
12000 314028 275485 -200086 -180812 247293 -10938 -101037 -66927 209324 70568 245503 -36329
11988 58222 -82665 14191 253301 134869 25307 -424080 68459 30502 -96151 21993 137086
11977 137086 89390 53375 164461 -91370 223011 -150485 48088 -51965 58008 154820 -304060
11965 64534 -367252 -35637 106436 -23921 127563 -187372 171474 -48939 -38254 335182
11954 -138035 -103261 -38303 -148651 -152841 -285906 254528 151191 -207298 123883 -95569
11943 -110194 196926 -76803 288260 -2973 -362093 -371350 84118 -301374 -104398 -187524 -83182
$$ packed form
12023b30628B43982C4194a4632l0749j24596J9512L8461e4339D03465f0521l419
12012f3940K0684B9453i1033q409E2132a58473B44345q3393b26315J07414B03706
12000C14028l8543b00086J9274B47293a0938r0099L4110B09324G0568J74935c6329
11988E8222h2665A4191K39110j18432B5307d24080F8459C0502i6151B1993J15093
11977A37086m7696l6015J11086i1370B23011a50485D8088e1965E8008R6812c04060
11965F4534c67252c5637A06436b3921A27563a87372A71474d8939J0685C35182
11954a38035L4774c8303j10348m190j33065B54528j03337b07298A23883i5569
11943a10194A96926g6803B88260b973l59120r257H4118c01374a04398q3126h3182
$$ plain form
11931 8373 -78887 347020 -199415 -5445 31794 312933 6930 65975 -134984 65223 -212211
11919 -177236 -117395 15799 267930 -217668 -82163 102860 -106111 48538 210319 160883
11909 160883 -33634 -232387 102246 -41921 -129934 -32901 -4939 265305 32469 421202 31909
11897 -124498 112350 -124063 129108 -216040 53824 -124041 167084 165489 -75185 -230997
11887 -230997 -364399 117064 -27122 111494 -81174 83882 -202338 -207483 206631 -13962 86057
11875 -144229 -280124 -128043 -65487 235523 31241 148639 -177260 -88419 -237063 -303116
11865 -303116 -50027 -82180 25157 -76922 -117666 -79940 29016 24476 191872 -43136 42368
11853 -161368 -277206 -220657 -48130 91494 -11700 -112452 -189950 -142687 -243936 -445918 -79758
$$ packed form
11931H373g8887C47020a99415e445C1794K81139F930N9045a34984F5223b12211
11919a77236N9841A5799K52131b17668h2163A02860a06111D8538J61781m9436
11909A60883c3634j98753A02246d1921q8013c2901d939B65305C2469L88733C1909
11897a24498A12350a24063A29108b16040E3824a24041A67084j595g5185j55812
11887b30997j33402A17064b7122A11494h1174H3882b02338n145B06631a3962H6057
11875a44229j35895a28043O2556B35523C1241J17398a77260h8419j48644o6053
11865c03116e0027l2153B5157g6922m0744L7726B9016m540J67396d3136D2368
11853a61368j15838N6549d8130I1494a1700j00752p7498M7263j01249k01982g9758
$$ plain form
11841 16673 -141506 -89259 381471 120657 -111568 -543681 -73525 -115203 249153 -106597
11830 -250578 176521 70934 -81604 97854 34689 -42176 13468 148024 -1523 120217 -126918
11818 61431 -3443 257560 -325092 -17121 -244407 54167 -277896 -37468 49811 -160402 -316286
11807 -316286 -31719 -19536 -191685 -179051 -49673 -259694 -98983 154925 -50763 -28503 -190980
11796 -190980 51783 -15658 47588 75423 -151634 53788 9540 230096 212963 210569 -146061
11784 -68654 -143673 138544 -46506 -58229 238178 -303739 295524 17379 -69471 -108519 25510
11772 -6219 242428 -76872 82938 -296205 265532 118834 293283 166703 104276 -146551
11761 -30606 -134889 -100265 -118495 -25778 -331397 246150 -56354 72208 241586 -14887 47469
$$ packed form
11841A6673a41506N2247C81471A20657a11568m32113g3525m1678B49153a06597
11830b50578A76521G0934h1604I7854C4689d2176A3468J34556a523A20217a26918
11818F1431c443B57560c25092a7121k27286E4167b77896c7468D9811a60402j55884
11807c16286c1719J2183j72149J2634d9673k10021i8983A54925e0763K2260j62477
11796a90980E1783a5658D7588K7835a51634E3788I540K20556j7133k394a46061
11784f8654p5019A38544d6506j1723B38178c03739B95524A7379f9471l9048B5510
11772f219B42428g6872H2938b96205B65532A18834J74449j26580o2427a46551
11761c0606j04283L4624j8230b5778l05619B46150e6354G2208J69378a4887D7469
$$ plain form
11749 84896 -320964 188849 7279 -111156 226799 -29064 247409 -85812 -90237 224481 -206273
11737 -38945 -165474 -255587 -419936 357470 173290 -330253 59698 321919 5780 -81769 -149564
11726 -149564 -155687 -60377 -171904 -76845 58031 -158976 -200404 -60840 -11499 183911 163380
11715 163380 366315 92646 -156162 423743 -103250 -12524 -102083 164556 -107395 -153721
11705 -153721 -357476 -74408 -9358 214844 231239 -22470 -261506 -215707 -36974 426425 32419
11693 -329235 237000 144633 100452 362607 40523 32991 -306535 -74518 -112915 88466 -186373
11681 -371567 70584 235969 -100405 96042 -209419 327050 -8810 -114265 137873 45474
11670 -327502 392975 -94840 218007 49695 100944 223347 56006 -45884 -193186 -153790 -329633
$$ packed form
11749H4896c20964A88849G279a11156B26799b9064B47409h5812m425B24481b06273
11737c8945j26529r0113j64349C57470A73290c30253E9698K62221E780h1769o7795
11726a49564o123f0377j11527g6845E8031a58976m1428f0840a1499A83911k0531
11715A63380K02935I2646a56162D23743a03250a2524q9559A64556a07395m6326
11705a53721k03755g4408i358B14844J6395b2470k39036M5799c6974D26425C2419
11693c29235B37000r2367m4181K62155D0523p532c06535g4518l8397H8466a86373
11681c71567G0584J65385a00405I6042b09419C27050h810j05455A37873D5474
11670c27502C92975i4840B18007D9695N1249J22403E6006d5884j47302L9396j75843
$$ plain form
11659 -329633 -344807 -44616 260586 -169363 6924 4503 -181876 -87748 -101538 193356 198548
11648 198548 102189 -149815 52550 -68409 116639 -22625 64474 11690 207416 -90648 -65777
11637 -65777 -64276 37769 62070 -189536 110242 72660 133648 191504 -236623 127082 264217
11626 264217 109307 248536 251847 127992 -21164 -5452 265056 3592 195381 199586 -107686
11614 240360 61196 2106 76403 94842 78241 -39799 312961 179761 311819 49031 138545
11603 138545 25348 -353016 -84859 69778 3579 -60741 285279 -133086 -238030 -217085 -126445
11592 -126445 152003 346040 62915 77482 17334 -159201 -323190 331903 433890 12369
11581 9021 -19949 -23244 280073 373475 12411 -289470 104757 93028 293819 -209840 -420528
$$ packed form
11659c29633j5174d4616B60586a69363F924k421a81876h7748j3790A93356N192
11648A98548r6359a49815E2550f8409A16639b2625F4474A1690J95726i0648K4871
11637f5777J501C7769K4301a89536A10242l7582O0988N7856b36623A27082J37135
11626B64217A09307J39229L311j23855b1164e452B65056C592J91789M205a07686
11614B40360F1196B106P4297J8439j6601c9799C12961j33200J32058D9031Q9514
11603A38545B5348c53016h4859F9778C579f0741B85279a33086j04944K0945R0640
11592a26445A52003J94037F2915J4567A7334a59201j63989C31903J01987A2369
11581I021a9949l295B80073R3402A2411b89470A04757j1729K00791b09840k10688
$$ plain form
11570 -420528 152127 147528 307608 124819 -54725 73704 -109419 14171 581209 169692
11559 43604 -14469 201746 -82283 159347 66902 117643 -213266 -137010 -63540 234688 47578
11547 454199 160316 150930 74697 69452 -122579 13642 98800 93956 -90831 184491 -139609
11535 224809 -202769 175043 182615 322830 55159 232694 353934 74840 107658 238766
11525 238766 -299551 -118901 364709 437006 -105874 97903 200758 254104 125859 413047
11515 413047 32123 -210105 116440 293251 453728 151706 193117 400235 289005 233376
11505 233376 129347 305213 38053 -66105 73015 261583 110658 114231 48574 127672 209072
11494 209072 314413 110623 221634 114185 431024 346639 177589 185416 218515 379453
$$ packed form
11570d20528A52127m599J60080A24819e4725G3704a09419A4171N67038A69692
11559D3604a4469B01746h2283A59347F6902N0741b13266P6256f3540B34688D7578
11547D54199A60316r386G4697n245a22579A3642Q5158m844i0831A84491a39609
11535B24809b02769A75043P572J40215E5159J77535J21240G4840L2818J31108
11525B38766b99551a18901C64709P2297a05874I7903J02855N3346A25859K87188
11515D13047C2123b10105A16440J76811J60477A51706M1411K07118j11230n5629
11505B33376j04029J75866C8053f6105G3015J88568A10658L573D8574P9098Q1400
11494B09072J05341A10623J11011j07449L16839q4385j69050P827L3099J60938
$$ plain form
11484 379453 -18537 -71107 -191490 -25996 180931 209077 172114 172715 135466 1681 70498 -252265
11471 388794 426950 312324 -9181 -131838 40924 154170 373284 147671 344156 237692
11461 237692 154120 -43568 -25244 -1317 -64921 130180 378811 116674 169401 99608 214444
11450 214444 -406138 79156 174325 57187 364278 -9375 -229095 8379 80326 -6509 120220
11438 93395 -10152 18584 160213 438411 144570 36633 50611 194754 -221839 60308 102064
11427 102064 168238 15624 -104380 -13302 172482 -6560 128691 -141263 -299973 88587 -76928
11415 211466 28363 114621 124599 219283 56579 112558 -127457 -290276 -44150 87324 -70567
11403 35762 -308346 13235 250792 -62919 35749 -12689 4277 163749 7198 61162 187630
$$ packed form
11484C79453a8537n2570j20383b5996A80931K8146l6963O01l7249A681O8817b52265
11471C88794L8156j14626i181j22657D0924J13246K19114A47671J96485j06464
11461B37692q3572d3568J8324a317o3604A30180K48631A16674N2727o9793J14836
11450B14444d06138G9156R5169E7187L07091i375k19720H379P1947f509A20220
11438I3395a0152A8584J41629K78198A44570C6633J3978J44143b21839F0308M1756
11427A02064O6174A5624a04380a3302A72482f560A28691a41263j58710H8587g6928
11415B11466B8363Q6258R978R4684E6579N5979a27457j62819d4150H7324g0567
11403C5762c08346A3235K37557f2919C5749a2689D277J59472G198N3964J26468
$$ plain form
11392 187630 -8401 198796 -321133 60239 -52535 64506 -28527 -285314 225301 -186010 -52617
11380 44447 -13350 -84649 109011 80037 -215680 23300 249112 252023 -124946 44818 -18147
11368 236627 175157 51684 28850 -102945 127573 -24262 146762 -93883 -247206 -203891 -317903
11357 -317903 -86199 -100875 30306 -65547 65181 -49447 227409 15827 143672 -5804 -93537
11346 -93537 -152957 -67691 417723 140735 1353 124777 132789 200462 150170 72926 71140 91222
11334 91222 289180 -85548 -166113 -47153 -792 225063 78460 39034 110561 3002 186118 -73883
11321 -863 -205765 55995 255691 69797 -25622 -286988 -28985 14068 144339 8526 262826
11310 262826 117703 -98085 35090 82214 12592 87205 -9912 -27583 -270484 -445924 64965
$$ packed form
11392A87630h401A98796c21133F0239e2535F4506b8527k56787B25301a86010e2617
11380D4447a3350p1299A09011k8974b15680B3300K25812K911a24946D4818a8147
11368B36627o1470E1684k2834a02945A27573b4262A46762i3883j53323M3315j14012
11357c17903h6199j4676C0306f5547F5181d9447B27409A5827J27845e804q7733
11346i3537n9420f7691D17723A40735A353J23424Q012O7673n0292G2926j786K0082
11334I1222J97958h5548q0565d7153g92B25063G8460C9034P1527C002J83116g3883
11321h63k04902E5995J99696F9797b5622k61366b8985A4068J30271H526K54300
11310B62826A17703i8085C5090M7124A2592P4613i912j7671k42901j75440F4965
$$ plain form
11298 260725 -452773 -371470 -100491 -42100 114747 -265142 -190484 32298 -54509 -162156
11288 -162156 -175754 112545 -5948 -113878 -175596 7109 -25196 103856 49291 -85658 169994
11276 -22559 144652 35901 -158779 -233162 266574 -198332 -61742 -197777 140668 -75365
11265 -117345 -48517 -122232 97794 -200742 49856 -52469 -378262 254875 277315 -135310 -217953
11254 -217953 238691 -119091 -211452 128376 -288110 -284413 19912 15908 137078 -257073 -46206
11242 -106455 -84836 -119795 -38456 -239304 -119886 -229181 79799 -105383 -365991 63658
11231 -146889 -77648 -25195 25130 161087 216766 42928 122409 -16025 77981 -138244 97019
11219 -302446 -165891 25392 -26695 -340288 210638 -284934 185776 -14347 125863 255396
$$ packed form
11298B60725d52773Q1303a00491d2100A14747b65142P4658C2298e4509j07647
11288a62156j3598A12545e948j07930o1718G109b5196A03856D9291h5658A69994
11276b2559A44652C5901a58779p4383B66574a98332f1742j36035A40668g5365
11265a17345d8517p3715I7794b00742D9856e2469l25793B54875K2440a35310q2643
11254b17953B38691a19091r2361A28376b88110L697A9912m004J21170b57073d6206
11242a06455K1619l4959c8456k00848J19418j09295G9799a05383k60608F3658
11231a46889O9241b5195B5130J35957N5679D2928P9481a6025G7981a38244I7019
11219c02446J36555B5392b6695l13593B10638b84934A85776a4347A25863J29533
$$ plain form
11209 255396 115079 -124111 -63309 -245575 -223157 -119299 -165659 -64806 295931 108717
11198 -15410 64369 11010 -92941 -144708 -51621 -3330 -129779 -160304 -61736 12643 79094 -13500
11185 184363 -389521 64859 77335 86283 45415 -76556 -55451 -119597 -143959 79976 -12565
11173 -174133 -142635 -178572 -30570 332728 -160845 240092 46924 -91586 -452560 83684 29376
11161 -32478 180956 99831 118499 -6647 126752 -180428 -4108 -150863 -43275 -275380 -78454
11149 -153836 228636 -43029 -107877 -113135 -289335 246649 -64783 -298692 345844 -51419 55729
11137 -131510 45084 -169747 129755 51561 33911 -48055 -287674 -179828 15711 88554 94016
11126 94016 -15896 193734 231615 -305 -64034 -1503 68631 173982 -104637 247349 26076
$$ packed form
11209B55396A15079a24111O0802j82266K2418J03858m6360f4806B95931A08717
11198a5410F4369A1010i2941n1767e1621c330j26449l0525f1736A2643O6451a3500
11185A84363c89521F4859J2476Q948m0868g6556K1105o4146k4362G9976a2565
11173a74133L1498l5937c0570C32728a60845B40092D6924i1586l60974H3684B9376
11161c2478A80956q1125J8668f647A26752a80428d108j46755d3275k32105g8454
11149a53836B28636d3029o4848n258j76200B46649f4783k33909C45844e1419E5729
11137a31510D5084a69747A29755E1561j7650d8055k39619J07846A5711P2843N462
11126I4016a5896A93734L7881c05o3729a503F8631J05351a04637B47349B6076
$$ plain form
11114 92503 -96318 317708 -81872 -8612 -17906 85951 499176 168228 -123872 -134672 334682
11102 190151 178821 480549 -144056 -14236 130005 -42463 41654 64285 678874 123598
11091 530278 -46668 135806 138082 406218 239588 327541 402781 209262 166389 371461 522608
11080 522608 320176 224742 262916 133561 420648 45803 561702 202088 610489 490497
11070 490497 496197 395236 568366 485605 381304 489974 291585 592846 1014563 777257
11060 777257 549062 791519 721023 721566 450974 486883 1123542 787575 974433 862076
11050 862076 994362 1016146 1111796 1029264 774807 889910 835463 1167379 773515 1167179
11040 1167179 936529 1246460 1147752 695670 794314 1148225 837013 858916 748914 513277
$$ packed form
11114I2503i6318C17708h1872h612r294H5951M13225A68228a23872j0800C34682
11102A90151j1330L01728a44056a4236A30005d2463D1654K2631O14589A23598
11091E30278d6668A35806K276K68136j66630Q7953P5240j93519m2873K05072J51147
11080E22608k02432r5434L8174j29355K87087D5803N15899B02088M08401j19992
11070D90497N700j00961J73130q2761j04301J08670j98389L01261M21717k37306
11060G77257k28195K42457p0496N43k70592L5909O36659l35967J86858j12357
11050H62076J32286K1784R5650q2532k54457J15103n4447L31916l93864L93664
11040A167179k30650L09931r8708m52082R8644L53911l11212K1903j10002k35637
$$ plain form
11030 513277 1259294 905045 1130488 856633 839559 873417 1076635 974004 1056934 864966
11020 864966 759203 812983 738705 984439 1021681 899511 945342 920536 462632 978237
11010 978237 1172627 1111577 783653 1135072 645580 898028 684258 806624 939370 1017983
11000 1017983 788998 732136 1113546 762897 780940 690793 687483 509480 770440 691055
10990 691055 541509 1068055 1105550 1022764 1085400 698155 1272953 1315944 1191571 1219656
10980 1219656 1252086 1519316 1564097 1847728 1959371 2272639 2670895 3188993 3409341 3675878
10970 3675878 3792073 4051286 4180563 3892579 3885472 3013105 2464015 2086702 1689574 1916245
10960 1916245 1432164 1247463 1406263 1685712 1342845 1491602 1476535 1240349 957660 1129170
$$ packed form
11030E13277P46017l54249K25443k73855j7074L3858K03218j02631Q2930j91968
11020H64966j05763N3780p4278K45734L7242j22170M5831k4806m57904N15605
11010I78237J94390o1050l27924L51419m89492K52448k13770J22366J32746P8613
11000A017983k28985n6862L81410l50649J8043r0147l310j78003K60960p9385
10990F91055j49546N26546L7495q2786O2636l87245N74798M2991j24373K8085
10980A219656L2430K67230M4781K83631J11643L13268L98256N18098K20348K66537
10970C675878J16195K59213J29277k87984p107q72367n49090l77313l97128K26671
10960A916245m84081j84701J58800K79449l42867J48757j5067k36186k82689J71510
$$ plain form
10950 1129170 679806 992240 706534 587048 562998 209355 325775 525412 266804 154634
10940 154634 -50952 215029 218276 -20500 104258 362938 -145864 146299 135546 -29162 90704
10928 10682 -151964 132470 280322 119300 -101400 217172 171635 -116396 -112209 -197664
10918 -197664 -128340 66090 75660 77918 37869 -244569 -107928 162206 118201 -24163 74978
10906 -74204 205132 -152215 337485 -225123 -21917 392197 167259 16036 214407 168946
10896 168946 2353 155763 179147 63840 87172 182913 43886 62796 -74871 -128720 -54178
10884 153482 177002 -60660 -200108 -72210 -9362 -103414 -22946 -8496 156988 54618 249959
10873 249959 -212529 -53957 -54126 -44595 -120043 67867 94427 -401759 176067 -74015 7197 181403
$$ packed form
10950A129170m49364L12434k85706j19486k4050B09355J16420J99637k58608j12170
10940A54634e0952B15029L247b0500A04258K58680a45864A46299j0753b9162I0704
10928A0682a51964A32470J47852A19300a01400B17172m5537a16396M187q5455
10918a97664O9324F6090R570K258C7869b44569a07928A62206m4005b4163G4978
10906g4204B05132a52215C37485b25123b1917C92197A67259A6036J98371m5461
10896A68946B353J53410K3384F3840K3332R5741D3886J8910g4871n3849e4178
10884A53482K3520f0660j39448g2210i362r4052b2946h496A56988E4618J95341
10873B49959b12529e3957j69R531p5448F7867K6560d01759A76067g4015G197J74206
$$ plain form
10861 181403 455780 -84054 -82638 -325089 -160739 88169 -76714 147534 -453942 135973
10850 -9744 119135 97887 -54090 82055 95774 5061 -166803 32424 -178437 -160125 -320855
10839 -320855 -84676 -13658 139816 -137822 -99307 147797 56917 -60677 -322087 -57792 72564
10827 -217761 -235197 25765 -48619 -73596 135460 149624 90962 -55513 -32039 -117558 -41544
10815 119200 -302157 56484 72831 -197217 -107371 -137032 -149118 -58191 89617 94868 28447
10803 -146585 276821 210973 53159 -150944 -14023 -134508 27432 320738 -239918 -180890
10793 -180890 156974 93186 87682 -112257 -442846 223113 68353 46789 -172051 -23276 -359740
10782 -359740 -40524 -60986 -307262 -70529 -148870 -98166 81363 -78622 -335175 -177140 -183112
$$ packed form
10861A81403K74377h4054J416k42451a60739H8169g6714A47534d53942A35973
10850i744A19135k1248e4090H2055J3719E061a66803C2424a78437J8312j60730
10839c20855h4676a3658A39816a37822L8515A47797E6917f0677k61410e7792G2564
10827b17761j7436B5765d8619k4977A35460J4164n8662e5513K3474q5519d1544
10815A19200c02157E6484J6347a97217Q9846k9661j2086e8191H9617N251B8447
10803a46585B76821o5848E3159a50944a4023j20485B7432K93306b39918N9028
10793a80890A56974o3788n504a12257l30589B23113F8353k1564a72051b3276l36464
10782c59740d0524k0462k46276g0529p8341N0704H1363g8622k56553J58035n972
$$ plain form
10771 -183112 -146247 -133007 331841 -219984 -109634 -82219 82699 -18006 154603 -345631
10760 240398 184111 -255542 -57809 157813 246615 77078 -245866 215394 1537 92243 -152796
10748 -23846 124563 105890 -4284 -167430 56861 37442 130843 310212 225011 -201070 -110728
10737 -110728 59305 41051 -32779 -71159 -220717 175741 267081 273088 125042 -240586 62522
10725 158760 72657 89941 -149275 169952 87682 41625 -122959 -37589 -56159 -94754 -327628
10714 -327628 35089 -339117 142954 -71194 -220251 -100498 -284286 13000 112914 -96242
10703 29934 -31264 209326 24031 273494 -154900 80673 -18460 -133815 -267797 -216109 234642
10691 -105950 42119 -93450 111236 -237849 5517 -340071 -47220 233640 10174 89791 128040
$$ packed form
10771a83112L6865J3240C31841b19984a09634K7415H2699a8006A54603c45631
10760B40398n6287b55542e7809A57813Q8802G7078b45866B15394A537R0706a52796
10748b3846A24563j8673d284j63146E6861j9419R3401J79369q5201b01070R0342
10737a10728E9305j8254c2779l8380j49558A75741R1340O007A25042b40586F2522
10725A58760G2657J7284a49275A69952q2270D1625a22959c7589j8570l8595k32874
10714c27628C5089c39117A42954g1194j49057a00498j83788A3000R9914i6242
10703B9934c1264B09326B4031K49463a54900H0673a8460j15355j33982N1688B34642
10691a05950D2119i3450A11236b37849E517c40071d7220B33640A0174P9617L8249
$$ plain form
10680 128040 424986 37457 32113 -52996 -170748 -319983 27786 27449 -50420 -96875 -16417
10668 -316456 -288981 -327679 -83048 -272885 -275353 90658 -24889 32978 -23853 -234776 -237221
10657 -237221 -206055 -112677 -65255 -116234 -33700 169289 -249828 -13231 104385 -190443 -309620
10646 -309620 -117814 -111869 89718 57941 -384539 -222602 -325728 -101116 118569 -96495
10635 158400 -78489 1708 -58042 61742 46429 294043 -96319 -35232 -75515 131336 -346435
10623 148995 372034 -229035 822 106824 -5393 -39876 -189755 153606 79548 -91975 -50711
10612 -50711 51982 -122540 -271531 -424858 -169083 -208600 -102871 -157223 -247590 -111621
10601 37558 92178 -8881 119226 -113792 -300994 88099 -104751 5680 -127945 252312 -34102
$$ packed form
10680A28040K96946C7457n344e2996j17752j49235B7786l37e0420m6455a6417
10668c16456K7475l8698h3048j89837k468I0658b4889C2978b3853k10923k445
10657b37221L1166R3378M7422n0979c3700A69289b49828a3231A04385a90443j19177
10646c09620a17814N945H9718l1777c84539J61937j03126a01116A18569i6495
10635A58400g8489A708e8042F1742j5313K47614i6319c5232m0283A31336c46435
10623A48995K23039b29035H22J06002e393l4483j49879A53606p4058i1975M1264
10612e0711E1982a22540j48991j53327a69083l9517a02871n4352r0367a11621
10601C7558N4620h881A19226a13792j87202H8099a04751E680a27945B52312c4102
$$ plain form
10589 205077 -117439 329846 13181 -266557 198263 369895 -83719 -5260 -14910 -136418 -25450
10577 -221699 -181361 119496 -57583 -112589 45925 -231353 -228761 349152 -132074 74749 -301444
10565 53544 94514 -273597 -232270 -1305 -29062 -89598 -31365 -84293 163035 246214 -411326
10553 -133441 179123 -132073 -177552 121232 -216401 100198 58612 -103101 -69505 -73415
10543 -73415 25679 -238289 -147991 -27646 -50560 135160 39829 -121648 -291503 -239026 -228543
10532 -228543 -162740 -243313 111697 30952 102469 -42009 -81286 -256264 -41323 87583 -310581
10520 178425 -107411 458901 -75027 27508 -216966 -339481 -150321 77787 240522 -184802
10509 89302 125638 -200640 14980 -87921 -2012 44559 -181254 222552 194226 -5244 -122778
$$ packed form
10589B05077a17439C29846A3181b66557A98263J71632h3719e260r650j21508b5450
10577b21699M0338A19496e7583n5006D5925b31353K592C49152a32074G4749c01444
10565E3544M0970b73597M1327a305k7757o0536c1365n2928A63035Q3179d11326
10553a33441A79123a32073m5479A21232b16401A00198m1586a03101L3596l910
10543g3415B5679b38289R0298b7646k2914A35160C9829a21648j69855N2477J0483
10532b28543O5803q0573A11697C0952P1517d2009l9277j74978d1323H7583c10581
10520A78425a07411D58901g5027B7508b16966j22515a50321G7787J62735a84802
10509H9302L6336b00640A4980h7921b012D4559a81254B22552k8326e244j17534
$$ plain form
10498 -122778 -230967 428884 -167214 -138644 -106851 110125 -33217 -264561 -56095 -151650
10488 -151650 35815 350833 -46790 -83012 -53970 57417 -17857 -79408 -5174 352687 439721
10477 439721 122929 237126 330817 -142141 67440 84478 -35683 186564 -212330 -10641
10466 -306399 -166194 43229 38222 -160749 122935 115993 133276 35300 33471 -69197 11446
10454 -20405 -214036 211620 -158943 -53699 340274 -144521 499413 50918 331978 197509
10444 197509 230096 24810 192710 152159 -159846 -400247 -51847 -163129 -1803 90165 -6371
10432 -59990 -149120 83995 90631 -175431 -174277 -411593 -155819 427635 53415 -188600 -87841
10420 109727 242368 -181842 29794 -119001 -201263 -150656 -51861 132184 241556 113457
$$ packed form
10498a22778j08189D28884a67214K8570L1793A10125c3217k31344e6095r5555
10488a51650C5815L15018d6790l6222K9042E7417a7857o1551e174C52687Q7034
10477D39721A22929J14197R3691a42141F7440J7038c5683A86564b12330a0641
10466c06399J40205D3229n007a60749A22935o942J7283C5300j829f9197A1446
10454b0405j93631B11620a58943e3699C40274a44521D99413E0918K81060j34469
10444A97509L2587B4810J67900m0551a59846k40401e1847j11282a803I0165f371
10432e9990q9130H3995O636a75431J154k37316a55819D27635E3415a88600h7841
10420A09727J32641a81842B9794a19001q2262N0607e1861A32184J09372A13457
$$ plain form
10409 -36775 -146952 280953 34054 404346 265140 28128 94729 -154928 -87243 -354535
10399 -354535 82300 379728 -22176 355085 88484 178444 -91145 144914 414953 126557
10388 20027 88324 20988 243707 420893 -246523 201671 342614 121188 385899 -55676
10377 -51638 247636 492368 25343 63308 548142 180071 432485 479240 355397 528251
10367 528251 356414 777765 375729 367581 297539 648425 474177 485783 181838 518174
10357 518174 222877 255347 323274 376242 376405 531869 733310 764903 805039 594152 463403
10346 463403 355206 91667 660695 464338 281029 225645 32575 -64529 390927 197425
10336 197425 470155 319278 233473 639883 29474 385629 111020 165233 321597 -25243
$$ packed form
10409c6775j10177B80953C4054L70292j39206B8128O6601a54928O7685k67292
10399c54535H2300K97428b2176C55085H8484Q9960i1145A44914K70039A26557
10388B0027O8297B0988K22719J77186b46523B01671J40943A21188K64711e5676
10377e1638B47636K44732B5343L7965M84834A80071K52414M6755j23843J72854
10367E28251j71837M21351C75729q148p0042L50886j74248J1606A81838L36336
10357E18174B22877L2470O7927N2968J63J55464K01441L1593M0136k10887j30749
10346D63403j08197I1667N69028j96357j83309n5384C2575f4529C90927j93502
10336A97425K72730j50877q5805M06410B9474L56155A11020N4213J56364b5243
$$ plain form
10325 440299 -16080 -158881 196449 169088 -99246 352636 418137 17070 -102572 -93085 217492
10313 115563 171767 -87526 -175912 -82563 -55272 -3090 173311 -120536 -135114 187136 -9882
10301 -356418 -161041 58529 65565 30716 -2973 69985 -158468 -37944 7611 -133145 256389
10289 199784 -96317 -141517 293990 -256664 -198789 -13336 -356471 177106 30034 71855 -293879
10277 94348 -613837 164646 5875 218263 -142480 190115 -136316 446047 -10486 -76352
10267 -76352 213174 -156871 -86298 -123705 92408 -155803 507394 160721 60471 -300711
10256 29908 59946 92002 -96200 64147 -260690 -25022 -40527 -73268 148464 -73524 21824
10244 -15087 -7797 163841 188304 261783 -52083 -61431 -23076 208 -5937 131487 43121 3035
$$ packed form
10325D40299a6080j42801A96449k7361i9246C52636O5501A7070a02572R487B17492
10313A15563N6204h7526q8386h2563K7291c090A73311a20536j4578A87136i882
10301c56418a61041E8529P036C0716b973F9985a58468c7944G611a33145B56389
10289A99784i6317m5200B93990b56664N7875a3336l43135A77106C0034M1821b93879
10277I4348f13837A64646E875K12388a42480A90115a36316D46047a0486o5866
10267g6352B13174a56871P0573l7407I2408a55803E07394A60721F0471c00711
10256B9908L0038L2056i6200F4147b60690b5022j5505l2741A48464g3524B1824
10244a5087P290A63841K4463P3479e2083r348b3076B08e937A31487D3121C035
$$ plain form
10231 131980 101365 -180349 111349 -64946 -84210 197156 -125316 -106641 18199 -82640 -96965
10220 -96965 176421 137365 -58946 -33238 -207637 -270334 -184338 -45730 -58227 -230247 -222591
10209 -222591 -20550 36346 109833 -104375 432516 -180807 115830 -113375 151087 29677
10198 109816 -8347 -81622 -20788 124226 231486 -41765 -151468 178115 -307460 -82579 110097
10186 -106066 -84415 -59970 -47936 -223938 145053 44884 -230482 -133865 285127 4437 -231146
10174 -329702 -13053 -46910 -154919 -162418 116749 -36855 80574 -5715 -317419 -279974 -38515
10162 -262541 63751 -388738 88293 -47706 -58902 -238004 -37233 -168307 85146 118800 -271280
10150 -190248 197415 173035 74226 -411717 9756 241741 165803 27172 5848 -614038 -47865
$$ packed form
10231A31980l0615a80349A11349f4946j9264A97156a25316J8675A8199h2640j4325
10220i6965A76421l9056e8946K5708j74399o2697Q5996d5730j2497j72020P656
10209b22591b0550C6346P3487a04375D32516a80807A15830a13375A51087B9677
10198A09816h347p3275b0788A24226J07260d1765j09703A78115c07460h2579A10097
10186a06066K1651K4445J2034j76002A45053D4884b30482R6617B85127D437b31146
10174c29702a3053l3857j08009p499A16749c6855H0574e715l11704L7445c8515
10162b62541F3751c88738H8293d7706j1196j79102c7233j31074H5146L3654b71280
10150a90248A97415k4380G4226d11717I756K31985p5938B7172E848f14038d7865
$$ plain form
10138 -281204 -149067 -245713 -62948 237870 -45587 -340809 -114009 110468 15667 -242237
10127 -4712 15661 181980 42033 -29482 -114719 -76368 -188329 -208291 -325839 -37487 -455445
10116 -455445 -387625 257513 -44056 17296 -247213 43417 20927 -104256 -81036 -42173 -204526
10105 -204526 -14216 132266 2562 -256006 -230390 36576 -343146 207717 -288530 -48231 -24876
10094 -24876 -2606 166092 -180795 213742 -69696 -51628 -63084 36296 -337494 19116 112353
10083 112353 87320 26379 205846 -166791 -224325 -233801 5877 85247 150771 -110561 198189
10071 66693 -184716 173970 -26500 -148562 -387044 -145481 -96820 -49098 -296916 -22770
10060 177032 -55182 -67164 -21397 -43280 -236193 -207540 -111510 -158506 -154552 -104097 -66973
$$ packed form
10138b81204J32137r6646f2948B37870d5587k95222a14009A10468A5667b42237
10127d712A5661J66319D2033b9482q5237L8351j11961j9962j17548c7487m17958
10116d55445O7820B57513d4056A7296b47213D3417B0927a04256K3220L8863j62353
10105b04526a4216A32266B562b56006K5616C6576c43146B07717b88530d8231K3355
10094b4876b606A66092a80795B13742f9696J8068j1456C6296c37494A9116R3237
10083A12353k5033B6379J79467a66791n7534r476E877P9370O5524a10561A98189
10071F6693a84716A73970b6500j22062k38482a45481M8661M7722k47818b2770
10060A77032e5182j1982b1397k1883j92913K8653R6030m6996L954N0455L7124
$$ plain form
10049 -66973 175453 -13472 33875 178224 -173322 208508 154187 -11524 -2493 26080 -69040
10037 -4371 -233599 -407012 56178 -451530 -76338 -101475 -189015 18031 23864 82457 125082
10026 125082 -71024 -97505 -79514 -281528 -221618 54824 55550 17243 -212940 132127 -119469
10014 -129996 86950 134651 233677 -143282 -321876 -128253 248396 -317531 -138275 -24143
10003 -16702 -460551 16050 -192516 -249883 -95997 -2062 76867 21369 111156 234390 39073
9991 -228923 -444683 16544 -53538 -382810 81283 91141 -230927 141275 98238 -124982 15335
9979 -105096 296754 -84925 36448 -182045 -79490 79393 128464 222425 114705 130280 -68952
9967 20790 -182798 -139405 -239019 -51225 128735 -106396 100738 -131494 111352 38072 -90241
$$ packed form
10049f6973A75453a3472C3875J44349a73322B08508n4321a1524b493B6080f9040
10037d371k29228j73413E6178d51530g6338k5137q7540A8031N833N8593M2625
10026A25082g1024k6481J7991k02014N9910E4824P26A7243b12940A32127a19469
10014a29996H6950M7701R9026a43282j78594a28253B48396c17531a38275b4143
10003a6702m43849A6050a92516n7367i5997b062G6867B1369Q9787J23234C9073
9991b28923k15760A6544e3538l29272H1283R858b30927A41275m3037a24982A5335
9979a05096B96754h4925C6448a82045g9490G9393M9071R3961j07720J5575f8952
9967B0790a82798M3393r9614e1225A28735a06396A00738a31494A11352C8072i0241
$$ plain form
9955 89293 -164474 -6849 -175273 -109237 -161400 42171 -339029 198958 -281444 -120648 79870
9943 -71117 34219 116021 -151907 181380 17689 -220676 -363147 18508 -40678 -154652 171117
9931 61201 -7602 -96630 -51845 -212692 -137225 -98998 -153485 -225614 -69564 -91417 -2062 48148
9918 268528 -3426 -341589 28205 125242 141368 -247666 -22309 245516 -372265 -54055 135581
9906 55702 -133824 -117938 198039 67304 75937 -395445 -14816 -210280 22167 -9792 52952
9894 -98463 -198910 -30264 -302164 -2819 -176173 -272650 -231107 -429194 117720 246257 87127
9882 -236799 -432754 -239064 20883 -481997 -15020 168424 -296839 -184279 289645 -479570
9871 -339446 155942 27475 -60402 50734 -57125 -126038 -247275 106681 -236630 -214057 84748
$$ packed form
9955H9293a64474f849j68424O6036n2163D2171c39029A98958b81444a20648G9870
9943g1117C4219Q1802a51907A81380A7689b20676j42471A8508d0678j13974A71117
9931F1201g602q9028M4785j60847P5467L8227n4487p2129f9564k1853b062D8148
9918B68528c426l38163B8205R7037J6126b47666b2309B45516c72265e4055A35581
9906E5702a33824J5886A98039F7304Q633c95445a4816j95464B2167i792E2952
9894i8463j00447c0264k71900b819j73354r6477M1543j98087A17720J28537H7127
9882b36799j95955J93690B0883d81997a5020A68424b96839J12560B89645d79570
9871c39446A55942B7475f0402E0734e7125o8913j21237A06681b36630K2573H4748
$$ plain form
9859 69501 -82526 -155040 -402520 -120718 194404 14195 40116 -49554 229594 65487 -125484
9847 -102821 -204023 -193859 284880 -224522 -391820 128751 -78961 236710 -417075 110052
9836 -32825 -155650 -154684 43322 -5128 -240657 74079 -74796 116829 -118882 -121657 -233550 -325253
9824 -325253 -349888 230167 149459 62413 32054 -302385 -255532 55970 -229525 -215876 -319885
9813 -319885 44225 -10081 -304211 -165318 163943 79986 -132151 34858 191414 39495 -329754
9801 -84447 -181960 168042 -91870 -171876 -217391 -84833 69461 -84499 120831 115795 172725 -67935
9788 -141379 -234642 162030 -7675 194230 -244817 -171691 -36110 106628 26169 -138714 98783
9776 -339339 133723 138000 23276 122275 82733 141736 -287443 -47796 -81399 212564 -233369
$$ packed form
9859F9501h2526p2514k47480a20718A94404A4195K5921d9554B29594F5487a25484
9847a02821j01202J0164B84880b24522j67298A28751g8961B36710d17075A10052
9836c2825j22825R66D3322e128k35529G4079g4796A16829a18882k775j11893r1703
9824c25253k4635B30167q0708F2413l0359c02385M6853E5970b29525J3649j04009
9813c19885D4225a0081k94130J38893A63943G9986a32151C4858J56556C9495c29754
9801h4447r7513A68042i1870q0006m5515h4833F9461h4499A20831n036N6930f7935
9788a41379r3263A62030g675A94230b44817P3126c6110A06628B6169a38714I8783
9776c39339A33723M277B3276R8999l9542N9003b87443d7796l3603B12564b33369
$$ plain form
9764 209146 122102 -270016 -271458 43906 -303610 -159005 52458 -323837 98211 -326075 -245619
9753 -245619 -212577 -58101 -112939 -46796 54725 -227767 -86919 362677 29174 11931 -21337
9741 -72738 56024 109394 -99699 86697 -17133 -347648 49089 9154 -111724 17435 148561
9730 148561 -100706 -101207 33289 228901 -299898 -1492 -70934 -351462 -105951 42593 -218893
9718 -420260 -210812 -36191 -179442 -81447 -12687 -64554 145669 282050 44109 -135009 -204960
9707 -204960 -36423 111402 73751 -311822 -67468 61980 -35703 -670 -329774 43634 -36865
9695 344972 -49913 -50434 -115755 107333 -144117 10356 83978 -22084 207064 9034 -101898
9683 1774 -38354 113034 -214041 5902 119039 -51127 77689 -80892 40405 174716 -71597
$$ packed form
9764B09146q7044b70016j442D3906c03610J44605E2458c23837I8211c26075Q0456
9753b45619L3042e8101n4838d6796E4725b27767h6919C62677B9174A1931b1337
9741g2738E6024N3370i9699H6697a7133l30515D9089I154a11724A7435J31126
9730A48561a00706n01C3289J95612b99898a492o9442k80528a05951D2593b18893
9718d20260K09448c6191j43251h1447a2687n1867A45669J36381D4109a35009o9951
9707b04960c6423A11402l7651c11822f7468F1980c5703f70l29104D3634c6865
9695C44972d9913n21o5321A07333a44117A0356P3622b2084B07064I034a01898
9683A774c8354A13034b14041E902J13137e1127G7689h0892D0405J34311g1597
$$ plain form
9671 -199376 -99501 -63251 -59363 219462 -55614 -296253 -94453 44876 203340 -129325 18694
9659 -403673 30486 -14316 -75539 -66843 26473 -198988 118737 -255875 40965 -323754 -352964
9648 -352964 -87295 -277391 -103762 87562 -51754 -150773 -333891 -168266 80403 -485862 6695
9636 127730 -286819 37284 -33958 -99612 129047 139233 -280336 59041 -135133 -283764 45448
9624 -179368 149947 -255097 50973 -108593 379480 -329155 -119683 -205930 114794 -82262
9613 212935 221240 -204566 -47228 -122258 -307724 -29045 -142364 15938 -277678 -75721 71131
9601 -143037 -87408 83277 61871 -217518 -478122 301098 55866 271010 60129 209161 -5063
9589 -207490 -417432 -481497 -296663 25278 108114 7970 14463 -111872 -165073 -279108 43526
$$ packed form
9671a99376i9501L6250L888B19462e5614k40639i4453D4876J58464a29325A8694
9659d03673C0486a4316o1223Q696B6473a98988A18737b55875D0965c23754k9210
9648c52964h7295j90096a03762H7562e1754r9019j83118J65625H0403d85862F695
9636A27730b86819C7284c3958o5654A29047J0186b80336E9041a35133j48631D5448
9624a79368A49947b55097E0973a08593C79480c29155a19683q6247A14794h2262
9613B12935Q305b04566d7228p5030j85466b9045j13319A5938b77678g5721G1131
9601a43037N5629H3277k1406b17518k60604C01098E5866K15144F0129J49032e063
9589b07490k09942o4065J84834B5278Q2836G970O493a11872n3201j14035D3526
$$ plain form
9577 -163966 114503 -186988 11492 -295 29311 243119 -64291 118035 138809 -137721 -88315
9566 -88315 -72867 -6994 294085 122561 -246980 -382414 347128 314786 -208571 96049 -216230
9554 -238760 -78413 -571703 101960 256634 -152229 225849 -222859 30970 24567 -139607
9543 -83941 -185882 18958 -288681 -261253 -103472 -237707 -247990 33518 -94833 62528 -422963
9531 -83574 -81940 -577674 -153228 101018 -191425 -208247 -118327 66501 265735 57736 -115902
9519 -309690 -61946 -231531 -69874 -56701 -181931 -5231 -378763 40150 -33845 -102139 257909
9507 -32096 -225136 -257639 -332804 -152987 198444 51163 202520 -119275 -232827 231210
9496 -125558 22122 -71349 98846 71477 -185864 215355 98309 41711 -229779 310412 -103360
$$ packed form
9577a63966A14503a86988A1492b95B9311K13808f4291A18035K0774a37721M9406
9566h8315J5448f994B94085A22561b46980j35434C47128l2342b08571I6049b16230
9554b38760g8413m93290A01960J54674a52229B25849b22859C0970o403a39607
9543h3941j01941A8958b88681K7428a03472j34235j0283C3518i4833F2528d22963
9531h3574J634m95734a53228A01018a91425j6822Q9920F6501J99234E7736a15902
9519c09690f1946j69585f9874J3173j25230e231l73532D0150c3845o8294B57909
9507c2096j93040l2503p5165a52987A98444E1163J51357a19275j13552B31210
9496a25558B2122g1349I8846k7369a85864B15355I8309D1711b29779C10412a03360
$$ plain form
9484 194554 265778 -20090 246960 129690 88496 102949 63235 237981 -74177 34538 -115632
9472 342022 50726 107372 262850 -275626 186443 9607 -169802 -441433 -237943 -20223 -619190
9461 -619190 -301982 -374221 23883 67019 -416070 -403220 -157521 2099 -33073 60581 -124061
9449 141529 -210324 -108208 -9643 124083 -327700 -161330 -122523 -330187 64516 20206 -277096
9437 87146 -101748 208923 -268355 194215 -250859 -209547 -22214 -336564 116482 21937
9426 6616 78603 -274349 117658 -10374 -318625 74181 73740 -103351 -134767 -66075 -46500 256133
9413 212165 -42900 -189770 102045 -176418 7144 175575 -222852 -462687 58559 -37524 -130138
9402 -130138 -242110 -290374 -232584 -201079 147912 -4848 48743 -212380 -74095 -5027 -64933
$$ packed form
9484A94554P1224b0090B46960j17270m1194J4453l9714J74746g4177C4538a15632
9472C42022E0726N6646J55478b75626A86443I607a69802k71631K03490b0223n98967
9461f19190c01982p2239B3883M3136d16070J2850a57521B099c3073F0581a24061
9449A41529b10324J02116i643A24083c27700a61330L8807k07664F4516B0206b77096
9437H7146a01748B08923b68355A94215b50859M1312b2214l14350A16482B1937
9426F616P1987b74349A17658a0374l08251G4181m41a03351l1416f6075J9575B56133
9413B12165d2900j46870A02045a76418G144J68431b22852k39835E8559c7524r2614
9402a30138j11972m8264N7790L1505A47912d848D8743b12380g4095e027n9906
$$ plain form
9391 -64933 -32751 -21266 -184326 -89583 176080 161167 -6349 278549 -105885 -270036 -148144
9380 -148144 -60941 185604 30075 -122867 144413 -85514 39817 -191643 -152045 -268638 -306378
9369 -306378 -186640 195354 -190431 -59033 86334 -45185 -129666 -90733 -137708 -333308 -267182
9358 -267182 -162955 -205134 33194 253293 79461 -392133 -243592 254222 -244107 -45185
9347 318864 -131438 -305878 -312512 -6487 -192864 276781 129922 -86465 274506 -77941 -224725
9336 -224725 -17182 -16099 -62409 -117873 87612 -390841 -212462 -170895 -162464 105785 -300787
9324 -86829 5597 -95049 -33164 -456757 -135196 138177 -148431 -3718 251039 -361560 -79712
9312 -31371 -426070 126624 38550 -185577 -74126 -241760 -5312 -109147 41735 -83450 -160185
$$ packed form
9391f4933L2182J1485j63060h9583A76080j4913f349B78549a05885j64151J21892
9380a48144f0941A85604C0075a22867A44413h5514C9817a91643L9598j16593l7740
9369c06378J19738A95354a90431e9033H6334d5185q4481L8933m6975j95600O6126
9358b67182J04227m2179C3194K20099G9461c92133J48541B54222b44107d5185
9347C18864a31438j74440o634f487j86377B76781A29922h6465B74506g7941j46784
9336b24725a7182J083m6310n5464H7612c90841J78379M1567Q431A05785c00787
9324h6829E597i5049c3164m23593a35196A38177a48431c718B51039c61560g9712
9312c1371l94699A26624C8550a85577g4126j67634e312j03835D1735h3450p6735
$$ plain form
9301 -160185 -331187 72724 85101 -73830 -1099 -328908 2885 17035 24551 -100735 -186211 -459254
9289 -459254 -200064 -165259 231255 -191130 -185514 35757 -72573 137299 103936 -211168 -52718
9277 -78951 -249928 -198631 -248761 -30659 69059 -28006 -46739 -45236 -396512 232575 229 -101378
9264 -6616 -19504 128818 62819 287799 -112564 88920 167141 219498 101415 -354065 -205315
9253 -205315 176179 -66975 -137712 68194 -388725 221430 -275107 298082 -154017 -143318
9243 -143318 -60238 -6376 71936 -5823 -31525 -282638 -145767 142569 -248358 -221177 181114
9231 -5987 301354 91046 -70937 -77209 -25060 98751 -46876 141534 -196575 12553 -43974 30891
9218 107190 219772 -72577 -123705 -231174 -315531 -65949 54461 -43693 92590 -200775 168343
$$ packed form
9301a60185j71002G2724J2377g3830a099l27809B885J4150P516a00735q5476k73043
9289d59254b00064L4805B31255a91130N616C5757g2573A37299l3363b11168e2718
9277g8951j70977N1297n0130c0659F9059b8006j8733J503l51276B32575B29a01378
9264f616j2888A28818F2819K24980a12564H8920P8221N2357A01415c54065J48750
9253b05315A76179f6975p0737F8194c88725B21430b75107B98082a54017J0699
9243a43318f0238f376G1936e823k5702k51113J36871A42569b48358K7181A81114
9231e987C01354I1046g0937o272b5060I8751d6876A41534a96575A2553d3974C0891
9218A07190J12582g2577n1128j07469q4357f5949E4461d3693I2590b00775A68343
$$ plain form
9206 122018 218416 -9013 -33828 -66182 -48916 -50883 153323 -79712 -30434 130556 214174 -165316
9193 323576 -571494 -295508 -349671 41444 337893 -42463 -248085 -177945 -1719 -271921 -174080
9182 -174080 -125668 -265454 -72571 46802 -59650 181474 -94677 -50990 -335082 2523 55036
9171 55036 -140559 -232237 13889 -129155 -184657 -250838 -72028 -124753 147803 -4844 29913
9159 -131373 -159734 -82821 -305517 57949 17648 -89256 46495 -24784 -14020 -261223 -182027
9148 -182027 14540 429623 -120649 -123479 -367804 -526009 235827 -185001 -209937 34608 -118335
9136 188252 28584 -370090 208186 -71598 -67066 -299685 235819 -69798 -326501 -246206 153302
9124 198811 -271435 -87483 125901 -193679 -204180 89137 126003 29442 -212451 -123096 -393263
$$ packed form
9206A22018R6398i013k4815l2354J7266j967A53323g9712c0434A30556Q3618a65316
9193C23576e71494K75986n4163D1444K96449d2463k05622P0140a719k70202R7841
9182a74080M8412j39786g2571D6802e9650A81474i4677M3687k84092B523N2513
9171E5036a40559r1678A3889a29155n5502o6181g2028n2725A47803d844B9913
9159a31373k8361P6913k22696E7949A7648h9256D6495b4784J0764k47203P9196
9148a82027A4540M15083a20649k830k44325j58205B35827a85001k4936C4608a18335
9136A88252B8584c70090B08186g1598M532k32619B35819f9798k56703Q0295A53302
9124A98811b71435h7483A25901a93679j0501H9137L6866B9442b12451Q9355k70167
$$ plain form
9113 -393263 287550 -120988 -147463 -84600 24883 -570119 -93945 -265915 269775 305533 -217813
9101 -3573 231505 207125 -188053 -77156 -96621 385091 -8397 312720 -277661 -241487 8289
9089 -128401 120140 162044 -214246 45931 59854 -247263 90304 113388 7062 -30984 12544
9077 8301 8641 138281 -283493 76410 269109 -299478 -145876 146689 149789 -303792 -129725
9065 14323 -76034 -427616 111720 -60259 -81178 174471 169150 -16593 37990 124203 56273
9053 -357125 322184 164783 -86880 -32176 -285702 -65174 39762 -440405 -196789 65137 -64355
9041 -138112 -157268 -397049 224450 -9177 233179 83466 75981 -73474 -330090 47307 -257358
9029 7276 -161213 -90410 330003 -305389 147395 221595 40264 -181602 -467779 -86251 71767
$$ packed form
9113c93263B87550a20988k6475O2863B4883e70119i3945j71970B69775L5758b17813
9101c573B31505k4380a88053g7156j9465C85091h397C12720b77661L6174H289
9089a28401A20140M1904b14246D5931J3923b47263I0304K3084G062c0984A2544
9077H301L40J29640b83493G6410J92699b99478a45876A46689L100c03792a29725
9065A4323g6034l51582A11720f0259k0919A74471n321a6593C7990Q6213E6273
9053c57125C22184j57401h6880c2176k53526f5174C9762d40405a96789F5137f4355
9041a38112j9156k39781B24450i177B33179H3466p485g3474k56616D7307b57358
9029G276a61213P0803C30003c05389A47395P4200D0264a81602k86177h6251G1767
$$ plain form
9017 -229129 -73529 -11509 -421292 -300860 -430025 -92464 86958 -95360 -473227 -236218 229377
9005 -28433 -234090 -126953 231801 -2362 53831 -123499 -176505 -182820 -98488 80776 -119541
8993 57020 -142386 105018 -45217 -186542 32459 35454 -51169 -70941 184588 130485 -38619
8981 -219009 -140028 262597 -79825 55805 -3482 -253582 -137193 -138456 -59426 -226283 -348995
8970 -348995 -233871 -134619 -28313 -75002 400484 -4538 28367 -215722 159487 -92299 -152481
8959 -152481 -30651 75939 -386494 -97109 -125676 -79021 -50429 200889 -123583 -26205 -164593
8948 -164593 -138130 -30905 80504 -94172 246969 -261154 -59270 -78655 234322 -130604 -92451
8937 -92451 -140222 -77930 -181872 -148490 -17408 -86385 398514 -199458 -126643 -398431 -53416
$$ packed form
9017b29129g3529a1509m09783J20432j29165i2464H6958i5360l77867b36218B29377
9005b8433k05657J07137B31801b362E3831a23499n3006o315Q4332H0776a19541
8993E7020a42386A05018d5217j41325C2459K995e1169j9772A84588n4103c8619
8981b19009P8981B62597g9825E5805c482k50100J16389j263e9426j66857j22712
8970c48995J15124R9252b8313m6689D00484d538B8367b15722A59487i2299o0182
8959a52481c0651G5939c86494i7109k8567M6655K8592B00889a23583b6205j38388
8948a64593K6463c0905H0504i4172B46969b61154e9270j9385B34322a30604L8153
8937i2451m7771O2292j03942L3382a7408o8977C98514a99458P2815k71788e3416
$$ plain form
8925 -136427 225861 -48458 -64 679766 2685226 989700 184165 -150960 -385379 8973 161666
8914 161666 228097 -33660 -6290 284081 -31565 104395 20411 14026 78239 -16014 -167407
8903 -167407 113187 -93537 112431 -45586 -276680 333337 81811 -187662 24265 50038 -334633
8891 28534 156268 -38315 -168504 -70630 -111811 -311017 -156992 -46089 -316524 -35407 -108416
8880 -108416 32318 -125728 -63706 238447 98104 -289663 -375834 244441 -52537 -59067 -321599
$$ packed form
8925a36427B25861d8458f4F79766K005460I89700A84165a50960k34419H973J52693
8914A61666O6431c3660f290B84081c1565A04395B0411o385O4213a6014j51393
8903a67407A13187i3537A12431d5586k31094C33337H1811a87662B4265K5773c34633
8891B8534J27734c8315j30189g0630m1181j99206J54025d6089k70435c5407p3009
8880a08416C2318a25728O2022B38447I8104b89663q6171B44441e2537o530k62532
$$ [...]
##END NTUPLES=NMR SPECTRUM
##END=
