##TITLE=AC1398_2151uv_7519910_E9KT24DFFK
##JCAMPDX= 6.0         $$ Bruker NMR JCAMP-DX V2.0
##DATA TYPE= NMR SPECTRUM
##DATA CLASS= NTUPLES
##ORIGIN= BRUKER
##OWNER= Administrator
$$ 1.72 TOPSPIN		Version 2.1
$$ 2013-04-16 22:59:23.489 -0700  Administrator@X
$$ Compression mode = diff/dup
##.OBSERVE FREQUENCY= 400.02188249412
##.OBSERVE NUCLEUS= ^1H
##.ACQUISITION MODE= SIMULTANEOUS (DQD)
##.ACQUISITION SCHEME= undefined
##.AVERAGES= 8
##.DIGITISER RES= 22
##SPECTROMETER/DATA SYSTEM= spect
##.PULSE SEQUENCE= zg30
##.SOLVENT NAME= COFFEE_meoh
##.SHIFT REFERENCE= INTERNAL, COFFEE_meoh, 1, 14.98509
##AUDIT TRAIL= $$ (NUMBER, WHEN, WHO, WHERE, PROCESS, VERSION, WHAT)
$$ ##TITLE= Audit trail, TOPSPIN		Version 2.1
$$ ##JCAMPDX= 5.01
$$ ##ORIGIN= Bruker BioSpin GmbH
$$ ##OWNER= Administrator
$$ $$ E:\/data/COFFEE/nmr/AC1398_2151uv_7519910_E9KT24DFFK/20/pdata/1/auditp.txt
$$ ##AUDIT TRAIL=  $$ (NUMBER, WHEN, WHO, WHERE, PROCESS, VERSION, WHAT)
(   1,<2013-04-16 22:59:16.521 -0700>,<Administrator>,<X>,<go>,<TOPSPIN 2.1>,
      <created by zg
	started at 2013-04-16 22:58:10.349 -0700,
	POWCHK enabled, PULCHK disabled,
       configuration hash MD5:
       33 CF 6A 21 5C D3 B9 40 6C 15 AA 8D 27 A2 4F 13
       data hash MD5: 64K
       5B 64 3B 69 09 91 73 F6 9A C4 D9 06 BF BB 12 99>)
(   2,<2013-04-16 22:59:19.489 -0700>,<Administrator>,<X>,<proc1d>,<TOPSPIN 2.1>,
      <Start of raw data processing
       efp LB = 0 FT_mod = 6 PKNL = 1 PHC0 = 0 PHC1 = 0 SI = 32K 
       data hash MD5: 32K
       B2 C9 6D 95 8B 1F 52 B6 0D 84 9C D2 99 7A 0D 37>)
(   3,<2013-04-16 22:59:19.802 -0700>,<Administrator>,<X>,<proc1d>,<TOPSPIN 2.1>,
      <pk PHC0 = 100.1074 PHC1 = 0 
       data hash MD5: 32K
       56 C3 8B 69 28 C8 2B F5 90 E5 E3 9C EE EC 6D E0>)
(   4,<2013-04-16 22:59:19.942 -0700>,<Administrator>,<X>,<proc1d>,<TOPSPIN 2.1>,
      <abs ABSG = 1 
       data hash MD5: 32K
       77 3D E6 49 59 13 BC D4 61 B3 3F 37 D8 33 0F A4>)
(   5,<2013-04-16 22:59:20.005 -0700>,<Administrator>,<X>,<proc1d>,<TOPSPIN 2.1>,
      <abs ABSG = 2 
       data hash MD5: 32K
       B4 14 05 4C BB 99 72 E2 8C F2 8C 88 7D 93 A7 7D>)
(   6,<2013-04-16 22:59:20.067 -0700>,<Administrator>,<X>,<proc1d>,<TOPSPIN 2.1>,
      <abs ABSG = 3 
       data hash MD5: 32K
       9B 46 C3 2C C1 B2 C5 6F ED F9 32 8E FD 59 85 36>)
(   7,<2013-04-16 22:59:20.130 -0700>,<Administrator>,<X>,<proc1d>,<TOPSPIN 2.1>,
      <abs ABSG = 4 
       data hash MD5: 32K
       47 98 4B 5E 24 ED D2 D7 69 35 A2 5F 2C 3C BA 17>)
(   8,<2013-04-16 22:59:20.177 -0700>,<Administrator>,<X>,<proc1d>,<TOPSPIN 2.1>,
      <abs ABSG = 5 
       data hash MD5: 32K
       61 77 4B BF 55 97 5C C8 46 1C 71 FC CA DD 23 DF>)
$$ ##END=
$$ 
$$ $$ hash MD5
$$ $$ 87 33 BE AD A5 62 51 FF AE AA 83 99 CB F8 E1 89
##$RELAX= 
##$RELAX= 
##$RELAX= 
##$RELAX= 
##$RELAX= 
##$RELAX= 
##$RELAX= 
$$ Bruker specific parameters
$$ --------------------------
##$DU= <E:\>
##$EXPNO= 20
##$NAME= <AC1398_2151uv_7519910_E9KT24DFFK>
##$PROCNO= 1
$$ [...]
150 150 150 150 150 150 150 150
##$TP07= 0
##$TPNAME0= <>
##$TPNAME1= <>
##$TPNAME2= <>
##$TPNAME3= <>
##$TPNAME4= <>
##$TPNAME5= <>
##$TPNAME6= <>
##$TPNAME7= <>
##$TPOAL= (0..7)
0.5 0.5 0.5 0.5 0.5 0.5 0.5 0.5
##$TPOFFS= (0..7)
0 0 0 0 0 0 0 0
##$TUNHIN= 0
##$TUNHOUT= 0
##$TUNXOUT= 0
##$USERA1= <user>
##$USERA2= <user>
##$USERA3= <user>
##$USERA4= <user>
##$USERA5= <user>
##$V9= 5
##$VALIST= <valist>
##$VCLIST= <CCCCCCCCCCCCCCC>
##$VD= 0
##$VDLIST= <DDDDDDDDDDDDDDD>
##$VPLIST= <PPPPPPPPPPPPPPP>
##$VTLIST= <TTTTTTTTTTTTTTT>
##$WBST= 2048
##$WBSW= 25
##$XGAIN= (0..3)
0 0 0 0
##$XL= 0
##$YL= 0
##$YMAX_a= 656179
##$YMIN_a= -558472
##$ZGOPTNS= <>
##$ZL1= 120
##$ZL2= 120
##$ZL3= 120
##$ZL4= 120
##$ABSF1= 14.98509
##$ABSF2= -5.573092
##$ABSG= 5
##$ABSL= 3
##$ALPHA= 0
##$AQORDER= 0
##$ASSFAC= 0
##$ASSFACI= 0
##$ASSFACX= 0
##$ASSWID= 0
##$AUNMP= <proc_prof1d_extract_pilot.lims>
##$AXLEFT= 0
##$AXNAME= <>
##$AXNUC= <1H>
##$AXRIGHT= 0
##$AXTYPE= 0
##$AXUNIT= <>
##$AZFE= 0.1
##$AZFW= 0.1
##$BCFW= 0
##$BC_mod= 0
##$BYTORDP= 0
##$COROFFS= 0
##$CY= 15
##$DATMOD= 1
##$DC= 0
##$DFILT= <>
##$DTYPP= 0
##$F1P= 0
##$F2P= 0
##$FCOR= 0.5
##$FTSIZE= 32768
##$FT_mod= 6
##$GAMMA= 0
##$GB= 0
##$INTBC= 1
##$INTSCL= 1
##$ISEN= 128
##$LB= 0
##$LEV0= 0
##$LPBIN= 0
##$MAXI= 10000
##$MC2= 0
##$MEAN= 0
##$ME_mod= 0
##$MI= 0
##$NCOEF= 0
##$NC_proc= -8
##$NLEV= 6
##$NOISF1= 0
##$NOISF2= 0
##$NSP= 0
##$NTH_PI= 0
##$NZP= 0
##$OFFSET= 14.98509
##$PC= 1
##$PHC0= 100.1074
##$PHC1= 0
##$PH_mod= 1
##$PKNL= yes
##$PPARMOD= 0
##$PPDIAG= 0
##$PPIPTYP= 0
##$PPMPNUM= 2147483647
##$PPRESOL= 1
##$PSCAL= 4
##$PSIGN= 0
##$PYNMP= <proc.py>
##$REVERSE= no
##$SF= 400.02
##$SI= 32768
##$SIGF1= 0
##$SIGF2= 0
##$SINO= 400
##$SIOLD= 32768
##$SPECTYP= <>
##$SREGLST= <1H.CDCl3>
##$SSB= 0
##$STSI= 32768
##$STSR= 0
##$SW_p= 8223.68421052631
##$SYMM= 0
##$S_DEV= 0
##$TDeff= 65536
##$TDoff= 0
##$TI= <>
##$TILT= no
##$TM1= 0
##$TM2= 0
##$TOPLEV= 0
##$USERP1= <user>
##$USERP2= <user>
##$USERP3= <user>
##$USERP4= <user>
##$USERP5= <user>
##$WDW= 1
##$XDIM= 32768
##$YMAX_p= 466720735
##$YMIN_p= -721864
##$CURPLOT= <Network HP LaserJet P1505>
##$CURPRIN= <$Network HP LaserJet P1505>
##$DFORMAT= <normdp>
##$LAYOUT= <+/1D_H.xwp>
##$LFORMAT= <normlp>
##$PFORMAT= <normpl>
##$SURQMSG= 1
$$ End of Bruker specific parameters
$$ ---------------------------------
##NTUPLES= NMR SPECTRUM
##VAR_NAME=  FREQUENCY,     SPECTRUM/REAL,   SPECTRUM/IMAG
##SYMBOL=    X,             R,               I
##VAR_TYPE=  INDEPENDENT,   DEPENDENT,       DEPENDENT
##VAR_FORM=  AFFN,          ASDF,            ASDF
##VAR_DIM=   32768,         32768,           32768
##UNITS=     HZ,            ARBITRARY UNITS, ARBITRARY UNITS
##FACTOR=    0.250966925370066, 1,           1
##FIRST=     8223.43324360094, -155860,      -335064
##LAST=      0,             -150474,         -219597
##MIN=       0,             -721864,         0
##MAX=       8223.43324360094, 466720735,    0
$$ Real data points
##PAGE= N=1
##DATA TABLE= (X++(R..R)), XYDATA
$$ [...]
19538a30971a6785B8035K23109F5823a59673c1437j23304e530H2411b42487a16244
$$ -130971 -16785 28035 251144 65823 -159673 -31437 -154741 -5530 82411 -242487 -116244
19526A20192K5571C3507b9997j0829D3252c47206B22264a96662B11231F2832b30165
$$ 120192 145763 33507 -29997 -40826 43252 -347206 222264 -196662 211231 62832 -230165
19514b97678C4840a11837B03322p1745i582k95525H2182J03172p5965a28358I5773
$$ -297678 34840 -111837 203322 131577 -9582 -305107 82182 185354 109389 -128358 95773
19502A7134L44629D3021K9877O4735J63115a67884I2173a81958E3447J14932a25771
$$ 17134 361763 43021 72898 137633 300748 -167884 92173 -181958 53447 168379 -125771
19490A55170L7350b44255p0346a03263G1850b83886h2727L5557j18024M4728j0548
$$ 155170 192520 -244255 -314601 -103263 71850 -283886 -82727 -47170 -165194 -120466 -131014
19479a31014j97863G1674A3252c8694B1181a70825H3131d8891h1G800J5837F777
$$ -131014 -328877 71674 13252 -38694 21181 -170825 83131 -48891 -81 7800 23637 6777
19466b6991j67837D0098b78670B27064J09706I6471d37475B1693J87860b55789
$$ -26991 -194828 40098 -278670 227064 336770 96471 -437475 21693 209553 -255789
19455a25186A29344a26957j88294a19262A5704J28768i0191k03525a41492b506
$$ -125186 129344 -126957 -315251 -119262 15704 144472 -90191 -293716 -141492 -2506
19444a33956c727j80634d8016l5627O271M647J7783j37654I1858B1526a18380
$$ -133956 -3727 -184361 -48016 -83643 -77372 -72725 -54942 -192596 91858 21526 -118380
19432c22308a00307j30116a0089A3380J72263h0705A08273L3105a35020A57413
$$ -322308 -100307 -230423 -10089 13380 185643 -80705 108273 141378 -135020 157413
19421b69785n4138G1105L3821B0037J59985C5929J09414f9596A35342B7083J4110
$$ -269785 -323923 71105 104926 20037 180022 35929 145343 -69596 135342 27083 41193
19410D1193K5727K01081b34273j63506a06005r498j36240Q3781F9970P3852M4245
$$ 41193 66920 268001 -234273 -397779 -106005 -115503 -251743 -167962 69970 143822 188067
19399A88067a23859j01713A51426b77252A65053f1744C37495b0911m85905a02594
$$ 188067 -123859 -225572 151426 -277252 165053 -61744 337495 -20911 -506816 -102594
19388f3048A36417a6504P12G1733A6652a4093k09496H3682J55350n019I0861a20661
$$ -63048 136417 -16504 -15792 71733 16652 -14093 -223589 83682 239032 234013 90861 -120661
19375a26701j06257A17681a75004F3760b33808g4071q2733j9951J1230M7049j26729
$$ -126701 -232958 117681 -175004 63760 -233808 -74071 -156804 -176755 -165525 -118476 -245205
19364b45205g5147a3128o9825c8888j14424A71856c51104F2516a4864A40883J62860
$$ -245205 -75147 -13128 -82953 -38888 -153312 171856 -351104 62516 -14864 140883 303743
19353C03743a32729I026d9002j64265b6032A05576H734a46903c4168A27655g8171
$$ 303743 -132729 9026 -49002 -213267 -26032 105576 8734 -146903 -34168 127655 -78171
19341g4547C43043I0021B7183R7404d8142j16320E1705b7054j18703o3839j16095
$$ -74547 343043 90021 27183 124587 -48142 -164462 51705 -27054 -145757 -209596 -325691
19330c25691H3211g0549m0311A03521a3855l97077G6559K07032b24756g3026J5216
$$ -325691 83211 -70549 -110860 103521 -13855 -410932 76559 283591 -224756 -73026 -57810
19319e7810k10155n9728J47781N2913C3652g9550A1021J43212K70273a7096j78601
$$ -57810 -267965 -327693 -179912 -126999 33652 -79550 11021 154233 424506 -17096 -195697
19308a95697A76635I803J39561L37202a42863A62132P3203G4455J70175e5094
$$ -195697 176635 9803 149364 486566 -142863 162132 235335 74455 244630 -55094
19297a52235b7422j35178j71515J00304f9406L496d625G6560a28684H7006a30995
$$ -152235 -27422 -162600 -334115 -233811 -69406 -65910 -4625 76560 -128684 87006 -130995
19285b19167k97292B64225A06958d06578H3454N1095a68932I6697e090l07544
$$ -219167 -516459 264225 106958 -406578 83454 134549 -168932 96697 -5090 -312634
19275c12634i4899B84152b74309C39234D8158a04503B33815a54289E6365L9473
$$ -312634 -94899 284152 -274309 339234 48158 -104503 233815 -154289 56365 95838
19265I5838c16313a5913j28805e8444J8945G1120c80564c0742A6695f5362j5776
$$ 95838 -316313 -15913 -144718 -58444 -39499 71120 -380564 -30742 16695 -65362 -81138
19254h1138b505j14750l3155H027a64768A2416J32444K547A2115L0040g1480D4243
$$ -81138 -2505 -117255 -150410 8027 -164768 12416 144860 147407 12115 42155 -71480 44243
19241g0774n4406A71253d13484H649a22735A4859c0806r5129B47657d4766j90574
$$ -70774 -125180 171253 -413484 8649 -122735 14859 -30806 -125935 247657 -44766 -235340
19230b35340a0563k47096R8436A81444a75123k5153A20524a53257j03282a16640
$$ -235340 -10563 -257659 -159223 181444 -175123 -200276 120524 -153257 -256539 -116640
19219h1094B06931a03676B02062a34527d7618q3481B28874a38095A64171a53079
$$ -81094 206931 -103676 202062 -134527 -47618 -131099 228874 -138095 164171 -153079
19208a89291M6638C8274c02764J16965h4577q878l47770a88762D0385L5118i9347
$$ -189291 -142653 38274 -302764 -185799 -84577 -93455 -441225 -188762 40385 75503 -99347
19196B7408a33819e8971j35829o5384L6196h9044o906j94655a26062j41832o5330
$$ 27408 -133819 -58971 -194800 -260184 -223988 -89044 -95950 -290605 -126062 -267894 -333224
19185c33224J55005j49419a22391N0242I0491c91201b2375j83202P6948M162o0673
$$ -333224 -178219 -327638 -122391 -72149 90491 -391201 -22375 -205577 -128629 -124467 -185140
19174a85140G0641b6514k93168P7995P7374j88901a55661q1451b7011A40697B5627
$$ -185140 70641 -26514 -319682 -241687 -164313 -353214 -155661 -237112 -27011 140697 25627
19162a39449E9281a96733b6621A52333j9923a9655A06647A434b74455a18756a2615
$$ -139449 59281 -196733 -26621 152333 132410 -19655 106647 1434 -274455 -118756 -12615
19150b07722C9291b14206n3100f3352k52011b8691j9672j09412P0713B11981a31635
$$ -207722 39291 -214206 -267306 -63352 -315363 -28691 -48363 -157775 -87062 211981 -131635
19138g6067A76958q7418a65323I7976j012b7267r6463k7781F1146M2525j0451
$$ -76067 176958 89540 -165323 97976 96964 -27267 -123730 -151511 61146 103671 93220
19127I3220D4323i680B14059b94433K0915J12331B0598b97667J05402B1961a11865
$$ 93220 44323 -9680 214059 -294433 -273518 -161187 20598 -297667 -192265 21961 -111865
19115b96257A45690a22024C31193A41784o5188a67866B29571A5910J7725O3406
$$ -296257 145690 -122024 331193 141784 76596 -167866 229571 15910 33635 97041
19105I7041J5549Q8122e8712I1423D2330a60532d3179B21089a45010B58764h7751
$$ 97041 112590 200712 -58712 91423 42330 -160532 -43179 221089 -145010 258764 -87751
19093A60622E7740Q4071d06122a48237b3299k8519A3782K40086d272A2181J41232
$$ 160622 57740 141811 -406122 -148237 -23299 -51818 13782 253868 -4272 12181 153413
19082A53413a75200L1327r847B4356b7934j59226Q4732C72141A33193O7465K06378
$$ 153413 -175200 -143873 -153720 24356 -27934 -187160 -102428 372141 133193 200658 407036
19071D07036c7248j08304A45856k0901b138j27560b9398H253c9613B73837A708
$$ 407036 -37248 -145552 145856 124955 -2138 -129698 -29398 8253 -39613 273837 1708
19059a2262k84574C8543a05537j54230e7280A6563J5328c6546C40437i2665D40922
$$ -12262 -296836 38543 -105537 -259767 -57280 16563 31891 -36546 340437 -92665 440922
19047B10718o3832A4152b33171D1841a61848P8797j44387p2626a16905B9464a60117
$$ 210718 146886 14152 -233171 41841 -161848 -83051 -227438 -300064 -116905 29464 -160117
19035D4143a72145A16919O1342F7689a9477n583A43043l5824g6002q0414B08457
$$ 44143 -172145 116919 178261 67689 -19477 -25060 143043 107219 -76002 -156416 208457
19023A22468J02305k7831D5570a39038H0264a1297B10293l6909a74506C7356a40391
$$ 122468 224773 196942 45570 -139038 80264 -11297 210293 173384 -174506 37356 -140391
19011b50352H1593a80579j70240a72293B51039c39070h8037A39730A3744c14429
$$ -250352 81593 -180579 -350819 -172293 251039 -339070 -88037 139730 13744 -314429
19000a56726N0676d14m5372I6871P017J20813b9903A30378e8245C0844K08745
$$ -156726 -106050 -414 -45786 96871 103888 224701 -29903 130378 -58245 30844 239589
18989B39589b6576k9803k86806A28344O7831o5457P5122b73913f424q0873A32385
$$ 239589 -26576 -56379 -343185 128344 196175 130718 205840 -273913 -6424 -87297 132385
18977a97657C4773G330c07444C6832c59372D633f7223A65326d7419B4915c04323
$$ -197657 34773 7330 -307444 36832 -359372 4633 -67223 165326 -47419 24915 -304323
18965a46800B62838a18246l5662G0910a39242K1310j40526A48145d4945k28124
$$ -146800 262838 -118246 -153908 70910 -139242 -117932 -258458 148145 -44945 -273069
18955b73069b9240A19560a67533B54620H5813b80918j22744e7793j21377m4735
$$ -273069 -29240 119560 -167533 254620 85813 -280918 -403662 -57793 -179170 -223905
18945b23905N1527F6913e19610J72649A493e2317A77848n2881B392a19732k938
$$ -223905 -172378 66913 -519610 -346961 1493 -52317 177848 124967 2392 -119732 -122670
18934a22670G9534K75588A62777a84293n3128D556K2572g2807J7333k4841j65014
$$ -122670 79534 355122 162777 -184293 -237421 4556 27128 -72807 -55474 -80315 -245329
18923b45329a13552k50430J29115j11325c0310B0982K07919g7329j44901N7962
$$ -245329 -113552 -363982 -234867 -346192 -30310 20982 228901 -77329 -222230 -164268
18913a64268e8681j6632A67920j1683J87642d53696a62546A25812a12444j07213
$$ -164268 -58681 -75313 167920 156237 343879 -453696 -162546 125812 -112444 -219657
18903b19657B54969a68560D2062J1992R7026j9870c33122i5119A31223a80249
$$ -219657 254969 -168560 42062 54054 151080 131210 -333122 -95119 131223 -180249
18892g0807k69173d1872k07190c8332R319k48248B656b30648N3086c890A00795
$$ -70807 -339980 -41872 -249062 -38332 -29013 -277261 2656 -230648 -177562 -3890 100795
18880A9482a40688B9731a61052j684A4465J99473a83835B6073a02687j42223J03317
$$ 19482 -140688 29731 -161052 -162736 14465 213938 -183835 26073 -102687 -244910 -141593
18869a41593F256J53824N749D6886b35077A22916J63872r5118a55916k29233a76537
$$ -141593 6256 160080 165829 46886 -235077 122916 286788 191670 -155916 -385149 -176537
18857B43897A15965l1925c48084P4398r3759a64916j98080A70771J64238f6499
$$ 243897 115965 84040 -348084 -273686 -367445 -164916 -362996 170771 335009 -66499
18846a19789J4418G6193d8096E2280k1017K11214A10466N7806e1690A61533b16059
$$ -119789 -105371 76193 -48096 52280 31263 242477 110466 168272 -51690 161533 -216059
18834b5113l36433J77051n9667H0625b80789A95202G7316c2943o1268M5644A03933
$$ -25113 -361546 -184495 -244162 80625 -280789 195202 77316 -32943 -94211 -48567 103933
18822b20483E3112f8822l4617j67450j70638A5620L22059D8833a75855N7122E390
$$ -220483 53112 -68822 -103439 -270889 -441527 15620 337679 48833 -175855 -118733 5390
18810b49928F7292k2533J31656d4224o4487E5930L14407b8544k54441B6290b84250
$$ -249928 67292 44759 176415 -44224 -108711 55930 370337 -28544 -282985 26290 -284250
18798i3955k06366D8326i8439B24221a69190f8416A67905a12286J2834g77l85382
$$ -93955 -300321 48326 -98439 224221 -169190 -68416 167905 -112286 -99452 -777 -386159
18787c86159A59745K62729e7810p9405A18403C629b92355B6888O0164a93358P9549
$$ -386159 159745 422474 -57810 -137215 118403 3629 -292355 26888 87052 -193358 -113809
18776a13809N0753B30863I811a63380f143j91885H797f118j43843B1375M5232
$$ -113809 -63056 230863 9811 -163380 -6143 -198028 8797 -6118 -149961 21375 66607
18765F6607b76325A26035a60991a4273k41828a17781C02360i6414j10543o4552
$$ 66607 -276325 126035 -160991 -14273 -256101 -117781 302360 -96414 -206957 -271509
18755b71509P9336c3043k5760r0077K7278C61882d7508K16C9818L15240d7424
$$ -271509 -192173 -33043 -58803 -148880 -121602 361882 -47508 -47292 39818 355058 -47424
18743B3868P893h7033k2691a6538G7829K0808l2323a193k35728A09547a91252
$$ 23868 31761 -87033 -109724 -16538 77829 98637 66314 -1193 -236921 109547 -191252
18731a44996p9073J7739A14237b30206g9548b8160A56511c9617G7393R7690d80109
$$ -144996 -224069 -206330 114237 -230206 -79548 -28160 156511 -39617 77393 175083 -480109
18719h2209C6757a12741J1860n7979g3568j97111D6973J54123b42988A05100A6819
$$ -82209 36757 -112741 -100881 -158860 -73568 -270679 46973 201096 -242988 105100 16819
18707B3767K2047a63516Q1392j3244A87012a19896E1481b66612O4576C02889a0896
$$ 23767 45814 -163516 -82124 -95368 187012 -119896 51481 -266612 -202036 302889 -10896
18695c68126B65779b34812I6035b4166B36118j08987b92662A99224J17605a2234
$$ -368126 265779 -234812 96035 -24166 236118 127131 -292662 199224 316829 -12234
18684a85877C4351P080J48175E3343c3078j7274B80079c5877B62907a36241q1355
$$ -185877 34351 41431 189606 53343 -33078 -50352 280079 -35877 262907 -136241 -217596
18673b17596b6072c373D1995b80722B61564A1422b01544J05R3915A61980a74669
$$ -217596 -26072 -3373 41995 -280722 261564 11422 -201544 -201439 -107524 161980 -174669
18661i4986j63106b599B1138b10836i1513l726d7379r3915d9765A18120K04130
$$ -94986 -258092 -2599 21138 -210836 -91513 -95239 -47379 -141294 -49765 118120 322250
18650C22250a87632A50698P6241A0251e7351A41962h1858k2629j11238k73598
$$ 322250 -187632 150698 226939 10251 -57351 141962 -81858 -104487 -215725 -489323
18640d89323a22129j98521R0602C78588j67264e8605k01909a7428B16102j7107
$$ -489323 -122129 -320650 -230048 378588 211324 -58605 -260514 -17428 216102 198995
18630A98995a41064B40K24065a17914j03154a7802C25605H4561e8276l40669a85724
$$ 198995 -141064 240 224305 -117914 -221068 -17802 325605 84561 -58276 -398945 -185724
18618c2401E1867d07838B7956J14315e9523A3360a59648C19802d1460l25547a45104
$$ -32401 51867 -407838 27956 142271 -59523 13360 -159648 319802 -41460 -367007 -145104
18606a08453A55652a1405I8293c33840I0395J60695a98287q9327A41054a20534
$$ -108453 155652 -11405 98293 -333840 90395 251090 -198287 -287614 141054 -120534
18595b01562D0104i5907M2086p5045B20854J46008g2597m9954n4775j56107C055
$$ -201562 40104 -95907 -53821 -128866 220854 366862 -72597 -122551 -177326 -333433 3055
18583b87790i0067E3546g9276J2524j63990A49066a3995m4001A58836b68574J26050
$$ -287790 -90067 53546 -79276 -66752 -230742 149066 -13995 -57996 158836 -268574 -142524
18572a42524j3440A8658b34525O9350C77579j74199i2483c1061k86450A5773b8161
$$ -142524 -155964 18658 -234525 -165175 377579 203380 -92483 -31061 -317511 15773 -28161
18560c06106R4552J01638A44184f2067j21839M181A52075F4486b5246n9951a8763
$$ -306106 -211554 -109916 144184 -62067 -183906 -179725 152075 64486 -25246 -85197 -18763
18548A28286d22446J64835B98486B9466f0148m34149c5013k50085J38242B79829
$$ 128286 -422446 -257611 298486 29466 -60148 -494297 -35013 -285098 -146856 279829
18537d20886A62105d9292l2767C0127b23488m9052A02790f9693l89526A77203
$$ -420886 162105 -49292 -82059 30127 -223488 -272540 102790 -69693 -459219 177203
18526H1149C7391J02705a83569P9692f429B7095c34405C12769i891p0374m4532
$$ 81149 37391 140096 -183569 -103877 -6429 27095 -334405 312769 -9891 -80265 -124797
18515a24797B4147a00350A2664J87379i0649a061B10105B4274K356J8654k1622
$$ -124797 24147 -100350 12664 200043 -90649 -1061 210105 24274 26630 45284 23662
18504B3662P3218c4313Q888r5870J4979e0243A12880N9175D3213r11e9695p9486
$$ 23662 96880 -34313 -25425 -121295 -106316 -50243 112880 172055 43213 42302 -59695 -139181
18492a39181r2613P9566l34431a31251c0864a2416B29331b09842B63856a38667
$$ -139181 -231794 -152228 -486659 -131251 -30864 -12416 229331 -209842 263856 -138667
18481A72157a66393j25168J1426c4166H939J71219b85700A12902E3848a25967
$$ 172157 -166393 -291561 -280135 -34166 8939 180158 -285700 112902 53848 -125967
18470a00086k13397d5653K0058B92616C0059a81518a3199o4784B05294R8662k8752
$$ -100086 -313483 -45653 -25595 292616 30059 -181518 -13199 -77983 205294 303956 275204
18459B75204b2080C09273i6895d1068j34068A23433A3217a52561B32772e4624
$$ 275204 -22080 309273 -96895 -41068 -175136 123433 13217 -152561 232772 -54624
18448a73597h2066b4708A40958J2174C8988N0491a23818l57007J23553H5122Q0350
$$ -173597 -82066 -24708 140958 153132 38988 89479 -123818 -480825 -357272 85122 165472
18437A65472K31779b2163m2185K7376m153A1452K8030a29746N0821A8386M6797
$$ 165472 397251 -22163 -64348 -36972 -41125 11452 39482 -129746 -78925 18386 65183
18426F5183i5365A18654B7975b99594n4317B10125a78428j84913Q2636j4500C56380
$$ 65183 -95365 118654 27975 -299594 -353911 210125 -178428 -363341 -280705 -295205 356380
18414b6446A17178C9317j0764a03638m9387j1073I6556j4759J15174a22934N8221
$$ -26446 117178 39317 28553 -103638 -153025 -164098 96556 81797 196971 -122934 -64713
18403f4713r51J3019o6655B11831O5593d6832m2095j88130m4579i9620A2167e4451
$$ -64713 -65664 -52645 -119300 211831 277424 -46832 -88927 -277057 -321636 -99620 12167 -54451
18390C84863d42960a74189B2156m485c47200a40705n0074j24442h2374j16429
$$ 384863 -442960 -174189 22156 17671 -347200 -140705 -190779 -315221 -82374 -198803
18380a98803A62121b03012J5950A5462c39076C18018q8695f8131A8723g12j03120
$$ -198803 162121 -203012 -187062 15462 -339076 318018 229323 -68131 18723 -712 -103832
18369a03832A9132c28129a48996b1807l52794A51494a66718A99410g3161B41660
$$ -103832 19132 -328129 -148996 -21807 -374601 151494 -166718 199410 -73161 241660
18358H4637b08859A78789a95708G5595i9129j39405C85627b63867A97940E5397
$$ 84637 -208859 178789 -195708 75595 -99129 -238534 385627 -263867 197940 55397
18347a28702e8278l32240h6412B8559L30356I1131a72674E0527b61016d3675A6025
$$ -128702 -58278 -390518 -86412 28559 358915 91131 -172674 50527 -261016 -43675 16025
18335f6559j33271P9372A19179K19365b03961i6346j82583A90327a44128A06178
$$ -66559 -199830 -120458 119179 338544 -203961 -96346 -278929 190327 -144128 106178
18324f6599A76314K2900N5385b61884q4154A04206J27688a95462I1040l0798a28862
$$ -66599 176314 199214 254599 -261884 -346038 104206 231894 -195462 91040 60242 -128862
18312a97936H9847b72530f3313G2335a97912i3655r9535c3791k26842a10779A57242
$$ -197936 89847 -272530 -63313 72335 -197912 -93655 -193190 -33791 -260633 -110779 157242
18300d38623b04900R3349C2774b30156F2803b42360a15774B54285a68749D7495
$$ -438623 -204900 -111551 32774 -230156 62803 -242360 -115774 254285 -168749 47495
18289D2792O2673f0238j96241Q4119G9177C7585M44361A97574c16183B55678c09564
$$ 42792 105465 -60238 -256479 -172360 79177 37585 481946 197574 -316183 255678 -309564
18277b53309g8587n1046r4316f6868L1492A26422a47734a8526l74308A69181a46702
$$ -253309 -78587 -129633 -223949 -66868 -35376 126422 -147734 -18526 -392834 169181 -146702
18265b2500p3077o9834N0292B09673j4876a75392A14618R7476c1545o00205h6427
$$ -22500 -95577 -165411 -115119 209673 194797 -175392 114618 212094 -31545 -631750 -86427
18253e862l1869J7287I9874Q5841D0465P9235J7219d3246A65913a65851C76014
$$ -5862 -37731 -20444 99874 185715 40465 119700 136919 -43246 165913 -165851 376014
18241i482l50938g8698A857a39868I4182d7631q2094l4160b0349j82489a01387
$$ -9482 -360420 -78698 1857 -139868 94182 -47631 -129725 -163885 -20349 -202838 -101387
18229b12967O955N8389c4532o6777B65630F4738a30027I7893b26278h4646r2914
$$ -212967 -206012 -147623 -34532 -101309 265630 64738 -130027 97893 -226278 -84646 -177560
18218a77560B41988L88336b82585D6287K88784A10791h6578b6960m91390d1799
$$ -177560 241988 630324 -282585 46287 335071 110791 -86578 -26960 -518350 -41799
18207b6980n8929b6031j21713k54171e0580j38318j91840c7678A31571e7981A72055
$$ -26980 -85909 -26031 -147744 -401915 -50580 -188898 -380738 -37678 131571 -57981 172055
18195e3669k28800E580b40856E2333i6990j88806J17596D1928b99010a00234I5576
$$ -53669 -282469 5580 -240856 52333 -96990 -285796 -168200 41928 -299010 -100234 95576
18183i4085A27902c0296A01293R1782B0960i1086a6593A57789A5073e5699j08533
$$ -94085 127902 -30296 101293 193075 20960 -91086 -16593 157789 15073 -55699 -164232
18172a64232H8227J27301a57778a569d45A4759i9122D0161j7003a77430N2943
$$ -164232 88227 215528 -157778 -1569 -445 14759 -99122 40161 23158 -177430 -124487
18161a24487o2373A05840C3612J3997a60696L2830o8855B8159J61130i8662B66045
$$ -124487 -186860 105840 33612 47609 -160696 -127866 -196721 28159 189289 -98662 266045
18149C86412C0882b47913p261L7558J00939C06094d62429A31830b8248A44810
$$ 386412 30882 -247913 -255174 -217616 -116677 306094 -462429 131830 -28248 144810
18138b68126N3078C21668J20150a45845n422L0828C4704J91969I5100K76037D1075
$$ -268126 -215048 321668 441818 -145845 -151267 -120439 34704 226673 95100 371137 41075
18126H91c0534l51602a62193g4915k95549A56030c12558J47395m3308i2769A37863
$$ 891 -30534 -382136 -162193 -74915 -370464 156030 -312558 -165163 -208471 -92769 137863
18114G5591a09877A37952c0319D290h3090A48842O7237a65634j35836b4712O360
$$ 75591 -109877 137952 -30319 4290 -83090 148842 216079 -165634 -301470 -24712 -18352
18103a8352B37004a35911B9562j968M641b7849l3063q651n4728E0954L8250j9264
$$ -18352 237004 -135911 29562 27594 32235 -27849 -60912 -69563 -124291 50954 89204 69940
18091F9940a92250j42265i3588j6382K5414C37289D6042b84764B02536a17474
$$ 69940 -192250 -334515 -93588 -109970 -84556 337289 46042 -284764 202536 -117474
18080b65270G9836i1360A17978b972k34917f8663A87989b54649a09427p999J0737
$$ -265270 79836 -91360 117978 -2972 -237889 -68663 187989 -254649 -109427 -117426 -106689
18069a06689C56586i5336o0402j22415a620k26903F021J12522n0547d6163l155
$$ -106689 356586 -95336 -155738 -278153 -1620 -228523 6021 118543 67996 -46163 -49318
18058d9318E0306K71243a4861G895d5299j61167A89069d3011k9000A43136C3297
$$ -49318 50306 321549 -14861 7895 -45299 -206466 189069 -43011 -72011 143136 33297
18046I5706R4566a57558O8255G9491e8222A62719N7393d37627K13221n8964j2764
$$ 95706 190272 -157558 -89303 79491 -58222 162719 220112 -437627 -224406 -283370 -296134
18035b96134O1209I9162b89430J1411o5300a18947j14122A70324G2442R296e4899
$$ -296134 -234925 99162 -289430 -278019 -343319 -118947 -233069 170324 72442 81738 -54899
18023A93539p4101i4962A84604a28179M5613n5321B29662b23492B21045c27528
$$ 193539 119438 -94962 184604 -128179 -82566 -137887 229662 -223492 221045 -327528
18012e8353j48895e0364E0352d92379K06946d768j99920C7930L3736N3668g1157
$$ -58353 -207248 -50364 50352 -492379 -285433 -4768 -204688 37930 71666 125334 -71157
18000b60675i1399L1663B84533j40320l3661n2419J03409i830j82425H4187a32334
$$ -260675 -91399 -59736 284533 144213 110552 58133 161542 -9830 -192255 84187 -132334
17988A19233k5706A8758c97133D0341K3182J96397a04624H5764J07621O2467c06447
$$ 119233 93527 18758 -397133 40341 63523 259920 -104624 85764 193385 255852 -306447
17976d89665A54874k86C5497K04710H4437Q248a92441A1928J5626a31260N659
$$ -489665 154874 154588 35497 240207 84437 92685 -192441 11928 27554 -131260 -125601
17965a25601o0635G744b27594f8545B01K47483l4513a6238p1680I8652m6754h9830
$$ -125601 -186236 7744 -227594 -68545 201 247684 213171 -16238 -87918 98652 51898 -89830
17952B71554g4893j258k0392C41277G4535e3131A33279a27040I1456a0092C31207
$$ 271554 -74893 -76151 -96543 341277 74535 -53131 133279 -127040 91456 -10092 331207
17940a50260E4979O6192c73733j59105C61363A62020K27069h433B34022a65942
$$ -150260 54979 121171 -373733 -532838 361363 162020 389089 -8433 234022 -165942
17929C42534A2542b06897A10336a37712N8225B50995c78176A8674b70965p5759
$$ 342534 12542 -206897 110336 -137712 -79487 250995 -378176 18674 -270965 -346724
17919c46724b0131I0422a78182F6802J04752b51501R8396I6573h1330B5959f3744
$$ -346724 -20131 90422 -178182 66802 171554 -251501 -153105 96573 -81330 25959 -63744
17907A30809k9585M01700e3827B01626F6591a76880C30h5262I9180J30206C4904
$$ 130809 101224 502924 -53827 201626 66591 -176880 330 -85262 99180 229386 34904
17895e6111G3792R9524G9868K8313C621J37469K11509n6430J28650a04157A16791
$$ -56111 73792 173316 79868 108181 3621 141090 352599 296169 424819 -104157 116791
17883E2734b30041I1145m3352K6415O2892F3235O2327a914q9564J6519c561D22651
$$ 52734 -230041 91145 47793 74208 137100 63235 125562 -1914 -91478 -74959 -3561 422651
17870d55273f3005A24132a23055C7616b6050B30763r8372N4462m1761b1736j4909
$$ -455273 -63005 124132 -123055 37616 -26050 230763 132391 186853 145092 -21736 -36645
17859c6645r8635A61492h9931G6914j5583i6515E9622K56605a1531m905j44029
$$ -36645 -135280 161492 -89931 76914 61331 -96515 59622 316227 -11531 -16436 -160465
17848a60465k19534A54640J1174i5532C1036e6703j32644A14221a36680C20703
$$ -160465 -379999 154640 165814 -95532 31036 -56703 -189347 114221 -136680 320703
17837a8604A49622K38122a74030C09954d8512G9041L3988f0246n2217e2075k83073
$$ -18604 149622 387744 -174030 309954 -48512 79041 113029 -60246 -112463 -52075 -335148
17826c35148K4340D4049d0461l19076A14103E6673L7202D3271b9382G2368b6037
$$ -335148 -310808 44049 -40461 -359537 114103 56673 93875 43271 -29382 72368 -26037
17814b57474A89497i5944A39863m0497h4432A280Q9443f9164k40078D18c835j43080
$$ -257474 189497 -95944 139863 99366 -84432 1280 90723 -69164 -309242 418 -3835 -146915
17802a46915A8745f2896A33348i4447K5396G1134J20007i4733A09691c1378k0116
$$ -146915 18745 -62896 133348 -94447 -69051 71134 191141 -94733 109691 -31378 -51494
17791e1494j71817A98538d18863b3234j80744a3084j89965D39063b5648j41659
$$ -51494 -223311 198538 -418863 -23234 -203978 -13084 -203049 439063 -25648 -167307
17781a67307N086F9968g5475M113A63245D9887R9850a78921b0409r0441e0600
$$ -167307 -162221 69968 -75475 -71362 163245 49887 149737 -178921 -20409 -110850 -50600
17769e6102J6287D3744c14422C83634G1780L2943j4561d8547B224f8806B76838
$$ -56102 -39815 43744 -314422 383634 71780 104723 90162 -48547 2224 -68806 276838
17757D6019M4174C0741L94556A43316E5455P8946L35875I4229e5673o5331n7971
$$ 46019 90193 30741 425297 143316 55455 134401 470276 94229 -55673 -121004 -178975
17746a78975M2564D8842a95184B29287J66204a2421B0858e2194C2357f1215b7181
$$ -178975 -136411 48842 -195184 229287 395491 -12421 20858 -52194 32357 -61215 -27181
17734A05478d52254C98790G77M3390a02961n7563E4878j8389c93477H7202l983
$$ 105478 -452254 398790 777 44167 -102961 -160524 54878 36489 -393477 87202 83219
17723H3219P276c15872B06254G8082P5899b06385I4527D6724J06013C1158b78016
$$ 83219 90495 -315872 206254 78082 153981 -206385 94527 46724 152737 31158 -278016
17711A68513a63385A07449K69727A36278A8713i2662I7727J843g2829D9439b852
$$ 168513 -163385 107449 377176 136278 18713 -92662 97727 99570 -72829 49439 -2852
17699a6434D7538J27012b05975H2220h8561A51374a10556A6892J3563b64184C02989
$$ -16434 47538 174550 -205975 82220 -88561 151374 -110556 16892 30455 -264184 302989
17687a62721j07428A5844L4870J43223h8518o7669M6442B78336F6903J26035d7598
$$ -162721 -270149 15844 50714 193937 -88518 -156187 -109745 278336 66903 192938 -47598
17675B8022K7700J21616P563b00026Q9080C8730R020c08628B47137H855a48863
$$ 28022 55722 177338 184901 -200026 -110946 38730 47750 -308628 247137 8855 -148863
17663c0062r8836j2363d7960I9418J8961i1470p547C1455h9024j77556G2868b4222
$$ -30062 -128898 -141261 -47960 99418 118379 -91470 -99017 31455 -89024 -266580 72868 -24222
17650e4130n3914A41278j4756F102J54115m0931B1520K0930J07911a02420H339
$$ -54130 -108044 141278 126522 6102 160217 119286 21520 42450 150361 -102420 8339
17638A6953c8501E8504Q7577e6396A48011m6511b1316B15652n8432d584k09814
$$ 16953 -38501 58504 146081 -56396 148011 101500 -21316 215652 157220 -4584 -214398
17627b14398c572a272j1931B87752j12756H6593J40871c59244A29288B7366d6761
$$ -214398 -3572 -1272 -13203 287752 174996 86593 227464 -359244 129288 27366 -46761
17615A24703L0497N9566m5875J5400c82611f1933A41103n2252C5268b5410n2987
$$ 124703 155200 214766 168891 184291 -382611 -61933 141103 88851 35268 -25410 -78397
17604g8397p5223O4647J1854l2903C25952j32409r6503g2549O350G1449b208l24378
$$ -78397 -153620 -88973 -77119 -110022 325952 193543 97040 -72549 -66199 71449 -2208 -326586
17592c26586a5876B85622A53b83426h9278n1990D863K49937A2840O3982k3128
$$ -326586 -15876 285622 153 -283426 -89278 -141268 4863 254800 12840 76822 53694
17581E3694J38101F5938a73006G137b70402D07327H2915K57360p3706a34330B39657
$$ 53694 191795 65938 -173006 7137 -270402 407327 82915 340275 266569 -134330 239657
17569a28884I0220c3102B9714K24712q0056J17478A40593a59517j07894e7774
$$ -128884 90220 -33102 29714 254426 174370 291848 140593 -159517 -267411 -57774
17558d7729C8577a43325C38766A34953K43302G9127n967C1662J6271K38148f6040
$$ -47729 38577 -143325 338766 134953 378255 79127 73160 31662 47933 286081 -66040
17546D6380J78668q3745e0521B59450C0677f2451A67146f4422B80587j10975a78129
$$ 46380 225048 141303 -50521 259450 30677 -62451 167146 -64422 280587 169612 -178129
17534B14877c9881A28409m4090a79603P0526B10310a20642B85487a20464L4383
$$ 214877 -39881 128409 84319 -179603 -109077 210310 -120642 285487 -120464 -86081
17524h6081A42217H222J93133f9319D7205A783a3220B80204q4253K89422A78468
$$ -86081 142217 8222 201355 -69319 47205 1783 -13220 280204 195951 485373 178468
17512i3387b5562d339B08155O9524j9888J45332A55716o4712K13919j14367a73731
$$ -93387 -25562 -4339 208155 277679 257791 403123 155716 91004 304923 190556 -173731
17500h479A20053P2938G2061n485a68041C337L95541j96561K50113A28803J30221
$$ -8479 120053 192991 72061 66576 -168041 3337 398878 202317 452430 128803 259024
17489B59024Q8086j37680e4959F00a3604Q59A35170g9733A23090g0464j14820
$$ 259024 347110 209430 -54959 600 -13604 -12745 135170 -79733 123090 -70464 -185284
17478a85284A59831N452e2418C9573Q6874k8485R9338P5110k4584c6734B02506
$$ -185284 159831 165283 -52418 39573 126447 97962 197300 272410 247826 -36734 202506
17466E738P0860K02235A38192b46317A27419E2184J26116q3667J37749I7880e5856
$$ 5738 76598 278833 138192 -246317 127419 52184 178300 94633 232382 97880 -55856
17454C44074P1526A54344F2284R0951K43239M24241A78875O9826L50185m9744
$$ 344074 415600 154344 62284 153235 396474 820715 178875 248701 598886 549142
17444E49142k26038A51270B3919a8146A38244J88828J33458j26067c3724A41730
$$ 549142 323104 151270 23919 -18146 138244 327072 460530 334463 -33724 141730
17433E22141k39148j11411J92192j12829J84243J43685A33280L45849j75670K20669
$$ 522141 282993 171582 363774 250945 435188 578873 133280 479129 303459 524128
17423E24128B16839J86607R5943E1768a19170G8397K57938j1265J23093J13376
$$ 524128 216839 403446 499389 51768 -119170 78397 336335 325070 448163 561539
17413E61539k72898J6324J02309A02837J23985j1003M0169A07541J4940q850K5307
$$ 561539 288641 304965 407274 102837 226822 215819 255988 107541 122481 113631 138938
17402A38938K90164k5725q1283B4807J6320N7040r939a15869B0265a20384A84140
$$ 138938 429102 403377 322094 24807 41127 98167 88228 -115869 20265 -120384 184140
17390C81780H4332d4237E14445C4007L04428l6914o0546O0307D6257M84533j89751
$$ 381780 84332 -44237 514445 34007 338435 301521 240975 301282 46257 530790 341039
17379C41039H1730C5170J93597d2811E54400d5243B74606J24718h2815P902B73338
$$ 341039 81730 35170 228767 -42811 554400 -45243 274606 399324 -82815 -74913 273338
17367B15432N318L63268I5522a11278E2000K84882j17695J2827d192B30088e0570
$$ 215432 220750 584018 95522 -111278 52000 336882 219187 232014 -4192 230088 -50570
17355i9666I1378f2973B17574B897L68048K6580e3489B45669K67146q4279A71672
$$ -99666 91378 -62973 217574 2897 370945 397525 -53489 245669 512815 428536 171672
17343C73725c7491j6966N421k11723m7481D55269C9466K74940j35174J96033a62986
$$ 373725 -37491 -54457 -49036 -260759 -308240 455269 39466 314406 179232 375265 -162986
17331A58522L4636K36797A29413a4433n580l753k08641K3788A9303a8054r1726
$$ 158522 193158 429955 129413 -14433 -20013 -23766 -232407 -208619 19303 -18054 -109780
17320a09780m6237A42599J51716a99342L890B40314a03973A6110a9284C60140
$$ -109780 -156017 142599 294315 -199342 -195452 240314 -103973 16110 -19284 360140
17309B05904E1857J00683K27382H95b8435A04585J00025g4621D1155N5190B7427
$$ 205904 51857 152540 379922 895 -28435 104585 204610 -74621 41155 96345 27427
17297A53124K87858c8975B21256A8858R7850c4837C36579F9284d092H0461L65549
$$ 153124 440982 -38975 221256 18858 116708 -34837 336579 69284 -4092 80461 446010
17286D46010a9290F1623K37897k3893o8377N3078H2224a91245A54214b45076C38601
$$ 446010 -19290 61623 299520 275627 207250 260328 82224 -191245 154214 -245076 338601
17274E04909C4198J20089l8037l1170J26461J08214b7608M22B32605E0914Q2183
$$ 504909 34198 154287 116250 85080 211541 319755 -27608 -27186 232605 50914 133097
17263A33097M3822K79517j02665j24933J91300A36995O9926l3101P5184a85310
$$ 133097 176919 456436 353771 228838 420138 136995 206921 173820 249004 -185310
17252A25631J05542j7445J19737m9217h6554A57772q57K94797j74191J78598o8070
$$ 125631 231173 213728 333465 284248 -86554 157772 156915 451712 277521 456119 388049
17241C88049j4066A20883K24720j58701e9846A5471a89945C63287m2949J61497
$$ 388049 373983 120883 345603 186902 -59846 15471 -189945 363287 320338 481835
17231D81835B12588C7072J48968l5782M3961M0027a14055E39105A99798K60009
$$ 481835 212588 37072 186040 150258 194219 234246 -114055 539105 199798 459807
17221D59807r3306A6936c1708C41485A05462P5469J2573K77884k35639M05573
$$ 459807 366501 16936 -31708 341485 105462 180931 193504 471388 235749 641322
17211F41322C17875j19407L02112A27681M7281C0264L8216J60170k0479k9896
$$ 641322 317875 198468 500580 127681 174962 30264 68480 228650 208171 178275
17201A78275J52424a49553D31676j36042O3J51445I8681M00349n8683j14139o0426
$$ 178275 330699 -149553 431676 295634 295697 447142 98681 499030 440347 326208 265782
17190B65782G8118O6344R4726r9748F2742L97190C4781K85660J32765m9849M89473
$$ 265782 78118 144462 239188 139440 62742 459932 34781 320441 453206 403357 892830
17179H92830A36179B6275b9542F63832k67311j0066l7956F9284j2634L61602H4319
$$ 892830 136179 26275 -29542 663832 396521 386455 348499 69284 56650 418252 84319
17167C53009J0931K79987B89531o7895m0582L45290j83669J47640j28284J57384
$$ 353009 363940 643927 289531 221636 181054 526344 342675 490315 362031 519415
17157E19415l9448A87876J5835k8563K22528j284j18484K5765L37106L2480j19732
$$ 519415 479967 187876 203711 175148 397676 396392 277908 303673 640779 673259 553527
17146E53527k57658l3257k9146J8514I4815K50551J90081j62628J7367K29220
$$ 553527 295869 262612 233466 251980 94815 345366 535447 372819 390186 619406
17136F19406j90025j08693M87783k09418j01330D3988K3833K9897L40078m8902
$$ 619406 429381 320688 808471 599053 497723 43988 67821 97718 437796 388894
17126C88894A17304J77427o5330H7339K38738K411o230M1071c6993D25321j59859
$$ 388894 117304 294731 229401 87339 326077 328488 322258 363329 -36993 425321 265462
17115B65462J3570J04368j16125L0585L36074B04602L35238j02558k02706L02597
$$ 265462 279032 383400 267275 297860 633934 204602 539840 437282 234576 537173
17105E37173o5908j59638K11335o6362n9096O7372Q4501B28637K06067q3572J7328
$$ 537173 471265 311627 522962 456600 397504 464876 549377 228637 434704 351132 368460
17094C68460L20854B14761K37152o6369o2912K26114k09754K18948j0784k54189
$$ 368460 689314 214761 451913 385544 322632 548746 338992 557940 547156 292967
17084B92967M37273j08466k2155j18501k24860M63446j66282k58005M66723l49921
$$ 292967 730240 621774 599619 481118 256258 719704 553422 295417 762140 412219
17074D12219K32769A23133M66220k1567j11185L05937o7791r6296J31418j90892
$$ 412219 644988 123133 589353 567786 456601 762538 694747 598451 729869 538977
17064E38977J40310N9508M1793k52844K3290K67676k63133j42339J43930k30325
$$ 538977 679287 738795 780588 527744 551034 818710 555577 413238 557168 326843
17054C26843O3458K85440j47894p8550k03908L24468j03391L63040p5072k67722
$$ 326843 390301 675741 527847 449297 245389 569857 466466 829506 754434 486712
17044D86712J55635Q3087k54328J86652k00438L98537l82302J41431K4596J05144
$$ 486712 642347 725434 471106 657758 457320 855857 473555 614986 639582 744726
17034G44726C68969M44259J29159j71258l33780p1154K50228L5360J25532k35550
$$ 744726 368969 813228 942387 771129 437349 366195 616423 651783 777315 541765
17024E41765l9938J44239j3749L07091l57791L64093j78105k13444J50817J89796
$$ 541765 501827 646066 632317 939408 581617 945710 767605 554161 704978 894774
17014H94774n6072j00589L50078l80626J7196R5498j04716J33133j08137j29881
$$ 894774 838702 738113 1088191 707565 724761 820259 715543 848676 740539 610658
17004F10658K01849P9898m5874k11022K04891j95186K66309k27600m4368j04145
$$ 610658 812507 892405 846531 635509 840400 645214 911523 683923 639555 535410
16994E35410K79334j35226o2390l5390L68882L7641O5994j43739m16107K24858
$$ 535410 814744 679518 617128 581738 950620 988261 1054255 910516 494409 719267
16984G19267L1347N2430l4148K57788j59010Q0384Q5866q2375J40688l07952L59621
$$ 719267 750614 803044 768896 1026684 867674 948058 1033924 951549 1092237 784285 1143906
16973A143906K85002F07700R012N26291k82194L32667k22523K62349m08716K02027
$$ 1143906 1428908 607700 616712 1143003 860809 1193476 970953 1233302 824586 1026613
16963A026613K48570j62281J42067l48382q0403L44593J07413j34196j20505n3741
$$ 1026613 1275183 1112902 1254969 906587 826184 1170777 1278190 1143994 1023489 969748
16953I69748J48327l1479q0863L30022k86518L51950P0441k56951q2522K13288
$$ 969748 1118075 1086596 1005733 1335755 1049237 1401187 1471628 1214677 1132155 1345443
16943A345443J3686J10193p6459J573J80019l93529J871j26056K96721K1636L40389
$$ 1345443 1359129 1469322 1392863 1394436 1574455 1180926 1182797 1056741 1353462 1375098 1715487
16932A715487m06376J4289R2986M8056j49689J89757K31826l2425R5550l90954
$$ 1715487 1309111 1323400 1416386 1464442 1314753 1504510 1736336 1703911 1799461 1408507
16922A408507N31417l83543n9105N1590J72841l4758Q9626k27651j85873M36874
$$ 1408507 1939924 1556381 1497276 1548866 1721707 1686949 1776575 1548924 1363051 1799925
16912A799925J89034k92339q9862K572N49044n9131n33370M93181k20128m2152
$$ 1799925 1988959 1696620 1606758 1609330 2158374 2099243 1565873 2059054 1838926 1796774
16902A796774l1651N6165k4216M61634q9947j46471l0832K04080k96879L22628
$$ 1796774 1765123 1821288 1797072 2258706 2168759 2022288 1991456 2195536 1898657 2221285
16892B221285J75768o8036k86125K10872q7005j10299M89164q4273j33186j94793
$$ 2221285 2397053 2329017 2042892 2253764 2166759 2056460 2545624 2461351 2328165 2133372
16882B133372K46312k43462L96802K88213n68546n6782K97902n3344L12674n0546
$$ 2133372 2379684 2136222 2533024 2821237 2252691 2195909 2493811 2440467 2753141 2702595
16872B702595O2537l08901J84508L36174j77473J78406j86325j56828M02480R9973
$$ 2702595 2765132 2456231 2640739 2976913 2799440 2977846 2791521 2634693 3037173 3137146
16862C137146k72896L19402k61730K47256K51809j00531j32609m5677M51511m59900
$$ 3137146 2864250 3183652 2921922 3169178 3420987 3320456 3187847 3142170 3593681 3133781
16852C133781L41478K60422m12703K98523N9143R7238K21912r1250J13002k07661
$$ 3133781 3475259 3735681 3322978 3621501 3680644 3777882 3999794 3908544 4021546 3813885
16842C813885q7818N74651j94236L02114l16940J25908K22842J40369J54606k74758
$$ 3813885 3726067 4300718 4106482 4408596 4091656 4217564 4440406 4580775 4735381 4460623
16832D460623M52194J97795L66195q02662J63081J96152M33032j35594K24873
$$ 4460623 4912817 5110612 5476807 4674145 4837226 5033378 5466410 5330816 5555689
16823E555689m3838N5592J58379L10731k17702j86815P26453J83118m8627L23865
$$ 5555689 5511851 5567443 5725822 6036553 5818851 5632036 6358489 6541607 6492980 6816845
16813F816845L8950J38102J15284L08195J02927p7264J63749L8321N80950p8028
$$ 6816845 6855795 6993897 7109181 7417376 7520303 7443039 7606788 7645109 8226059 8148031
16803H148031K92603l18433O37638N04656j7853J20490J93288N05533N6651J85638
$$ 8148031 8440634 8122201 8759839 9264495 9246642 9367132 9560420 10065953 10122604 10308242
16793A0308242M00237m55259R04430L38361N5136K37049M43792L03721M64943
$$ 10308242 10708479 10253220 11157650 11496011 11551147 11788196 12231988 12535709 13000652
16784A3000652K26299O57396K37704M96876L69651O92781k1577P16517M03582
$$ 13000652 13226951 13884347 14122051 14618927 14988578 15681359 15659782 16376299 16779881
16775A6779881R54861K00072P59579k5356J071602P86495O17964O55347J023327
$$ 16779881 17734742 17934814 18694393 18669037 19740639 20527134 21145098 21800445 22823772
16766B2823772M95356R23322P65301J172397J034929R79654N98586J588739J365882
$$ 22823772 23319128 24242450 25007751 26180148 27215077 28194731 28793317 30382056 31747938
16757C1747938J236712J537084J324537J167457J904068J809568J712102J970222
$$ 31747938 32984650 34521734 35846271 37013728 38917796 40727364 42439466 44409688
16749D4409688K457263J654093K633964K395695K751823K705607K627449L485621
$$ 44409688 46866951 48521044 51155008 53550703 56302526 59008133 61635582 65121203
16741F5121203L075329L852862L493335L933066M403562M326345M818790N009275
$$ 65121203 68196532 72049394 75542729 79475795 83879357 88205702 93024492 98033767
16733I8033767M947102N522464N475467N747669N602160O364596N854486N881998
$$ 98033767 102980869 108503333 113978800 119726469 125328629 131693225 137547711 143429709
16725A43429709O081656N302860N183951M734107L695659L374728K032855J986303
$$ 143429709 149511365 154814225 159998176 164732283 168427942 171802670 173835525 175821828
16717A75821828L46532p0328j745172k326828k986538m155783m475075n429926
$$ 175821828 176168360 176098032 174352860 172026032 169039494 164883711 160408636 154978710
16709A54978710n401838n945071o060645o247061o270026o045504n826127n861199
$$ 154978710 149576872 143631801 137571156 131324095 125054069 119008565 113182438 107321239
16701A07321239n643090n081240n378925n104476m429490m661625l775170l742755
$$ 107321239 101678149 96596909 91217984 86113508 81684018 77022393 73247223 69504468
16693F9504468l557625l666280k875513l004684k669101l109202k309851k223639
$$ 69504468 65946843 62280563 59405050 56400366 53731265 50622063 48312212 46088573
16685D6088573k064387k013844k118273j682280j485346j869057j425102j502675
$$ 46088573 44024186 42010342 39892069 38209789 36724443 34855386 33430284 31927609
16677C1927609j165689j255024j190219j123183n27284j730932r53963p03242
$$ 31927609 30761920 29506896 28316677 27193494 26666210 24935278 23981315 23278073
16669B3278073n82794j085990o24672p13932p87956o05289p37023m05214o60763
$$ 23278073 22695279 21609289 20984617 20270685 19482729 18877440 18140417 17735203 17074440
16660A7074440m78317q33097m99328m82607n15493n54617J83038n28211m23024
$$ 17074440 16596123 15763026 15263698 14781091 14265598 13710981 13894019 13365808 12942784
16651A2942784p00561j25817l20747n77955k92191j27200k10033k88052l86840
$$ 12942784 12242223 12116406 11795659 11217704 10925513 10798313 10588280 10300228 9913388
16642I913388l12155n130l58790l53218q6988j40222m79402J69889m32893m6569
$$ 9913388 9601233 9596103 9237313 8884095 8797107 8656885 8177483 8347372 7914479 7867910
16632G867910k28876n70011K77137m74644K0438j57254J29182n84826j79377J62100
$$ 7867910 7639034 7069023 7346160 6871516 6891954 6734700 6863882 6279056 6099679 6261779
16622F261779k62772P1582m39867M15791m40454Q7509l65783O2516l36598J55531
$$ 6261779 5999007 6070589 5630722 6046513 5606059 5693568 5327785 5390301 5053703 5209234
16612E209234m22816J95692j94683q7666k4917l29368J09942k63492n1421M2130
$$ 5209234 4786418 4982110 4787427 4699761 4674844 4345476 4455418 4191926 4140505 4182635
16602D182635J47894m74766J57848k22916R3753O8720k78000L8399K37580o98650
$$ 4182635 4330529 3855763 4013611 3790695 3884448 3953168 3675168 3713567 3951147 3252497
16592C252497J74153J64701m61786J30155q2530m1860K04260j78376N8734j60623
$$ 3252497 3426650 3591351 3129565 3259720 3177190 3135330 3339590 3161214 3219948 3059325
16582C059325q3376k36380K39879n6878L02476n18408p3201J35647j68226J38258
$$ 3059325 2975949 2739569 2979448 2922570 3225046 2706638 2633437 2769084 2600858 2739116
16572B739116J1902l39172J27428l97516N05517n38808M72273k73624l3202j06575
$$ 2739116 2751018 2411846 2539274 2141758 2647275 2108467 2580740 2307116 2273914 2167339
16562B167339M69599l45215j36718k5042J21825Q090J05303o42304L98613M3404
$$ 2167339 2636938 2291723 2155005 2129963 2251788 2259878 2365181 1722877 2121490 2164894
16552B164894j78185J05670j63769M5018L1998J9662k95254k9380M7948m35532
$$ 2164894 1986709 2092379 1928610 1973628 2005626 2025288 1730034 1700654 1748602 1313070
16542A313070O24014j04672m09078L87050j88349O6958j66108M8883o1191O6930
$$ 1313070 1937084 1832412 1423334 1810384 1622035 1688993 1522885 1571768 1510577 1577507
16532A577507j87939J45465k98992K63494R7482l84650P7984n7970k4455J01494
$$ 1577507 1389568 1535033 1236041 1499535 1597017 1212367 1290351 1232381 1207926 1309420
16522A309420j07990M01394o3255k82742o5561Q7853J1587l3851j05027J50521
$$ 1309420 1201430 1602824 1539569 1256827 1191266 1279119 1290706 1256855 1151828 1302349
16512A302349l56287N87275n48254K32405J57970l42421J67894O0727n77725M77285
$$ 1302349 946062 1533337 985083 1217488 1375458 1033037 1200931 1261658 683933 1161218
16502A161218m97363O36590l41055k28170N20488k43560j14912j37680L37835
$$ 1161218 663855 1300445 959390 731220 1251708 1008148 893236 755556 1093391
16493A093391r1763K5106q5467q3489L30036j43969l4549j39725K89403m5874
$$ 1093391 1001628 1026734 941267 857778 1187814 1043845 1009296 869571 1158974 1113100
16483A113100J97194j69554j09072l36973k16616M45451J58323j07351m01j95991
$$ 1113100 1310294 1140740 1031668 694695 478079 923530 1081853 974502 974101 778110
16473G78110o4489J59514J05912m52300M7418J48041M0607O5530j86324R6987
$$ 778110 713621 873135 979047 526747 574165 722206 762813 828343 642019 739006
16463G39006r6534O192J33129p166k50187l9021K27405P7846B71375J10247j3291
$$ 739006 642472 648664 781793 774627 524440 485419 712824 790670 271375 381622 368331
16452C68331M27509j13648j48731k4530L42933D12363K02290j12216J90447k83632
$$ 368331 795840 682192 533461 508931 851864 412363 614653 502437 692884 409252
16442D09252J99104l1850k60813J40789J35563k72278K93979J02094Q2148C38849
$$ 409252 608356 576506 315693 456482 592045 319767 613746 715840 797988 338849
16431D79742P8785B52395L31250Q0106o9998j72778M9750K31716k12145K18623
$$ 479742 558527 252395 583645 663751 593753 420975 470725 702441 490296 708919
16421G08919j70658j16464m6800N42886k34077j69335L79155m00055j8435P839
$$ 708919 538261 421797 374997 917883 683806 514471 893626 493571 475136 482975
16411D82975k32998K51117k8791N6615k16403J19256J69922k52784k6942J98035
$$ 482975 249977 501094 472303 528918 312515 431771 601693 348909 321967 520002
16401E20002P8550B20850K02538p6558q432J33371J01791p4790A25972J48598
$$ 520002 598552 220850 423388 346830 338398 471769 573560 498770 125972 274570
16391B74570K30992k34438Q07089n19453j01473j29444J75466j48417K2476J71918
$$ 274570 505562 271124 1078213 558760 457287 327843 503309 354892 377368 549286
16381E49286k48208R6283O6846m0076j48850M588j8152A00834O8232O7503J4354
$$ 549286 301078 397361 464207 424131 275281 279869 261717 100834 169066 236569 250923
16370B50923K52383A86746J09999B2362J94682L05135q5914A34665K73916j73059
$$ 250923 503306 186746 296745 22362 217044 522179 436265 134665 408581 235522
16360B35522J1477K15304G6874O29055l45167F3276R4128M6088l4008K20790K6542
$$ 235522 246999 462303 76874 705929 360762 63276 157404 203492 169484 390274 416816
16349D16816j85027A6345O5666J30009J76747a2072I394N28283k704k53621D7904
$$ 416816 231789 16345 82011 212020 388767 -12072 9394 537677 534973 281352 47904
16337B1713L19830J04078d9613A69900L36973j42567J42193B48382K28055B10470
$$ 21713 341543 445621 -49613 169900 506873 364306 506499 248382 476437 210470
16326C88880j09955c8959B20645K24822A00268J80012m9896R274J81389A13941
$$ 388880 278925 -38959 220645 445467 100268 280280 230384 239658 421047 113941
16315A45545J31868K04961C8035K40418n2010K14322c8612C41229g9616B10804
$$ 145545 277413 482374 38035 278453 226443 440765 -38612 341229 -79616 210804
16304A55238N52J41961P3479q1221O7890j33284b80681B19011l1125a24689B1374
$$ 155238 155790 297751 371230 290009 357899 224615 -280681 219011 187886 -124689 21374
16292F9032a03597B72131c12468D06282j48529j11302j2232P6196J23306A47890
$$ 69032 -103597 272131 -312468 406282 257753 146451 134219 210415 333721 147890
16281C8872J90979H1500N11732B94762A44105F7321J86505l4526o5693J71693
$$ 38872 229851 81500 593232 294762 144105 67321 253826 219300 153607 325300
16271C25300h3195C58750r423A04369J38576J65417L8474j15303c998B58767a08715
$$ 325300 -83195 358750 349327 104369 242945 408362 446836 331533 -3998 258767 -108715
16259B54432Q809I211d0153j02718B71225B1633g6577E30351C8433C756p49a6778
$$ 254432 263241 9211 -40153 -142871 271225 21633 -76577 530351 38433 3756 3007 -16778
16246A71344J40878a5819j52954B71244b2967J0069A48897J21457g663o2572A79230
$$ 171344 312222 -15819 -168773 271244 -22967 -12898 148897 270354 -7663 -70235 179230
16234G5765P9202b1653C99098G2231a7126A08613M00919b06164R6864q836B7158
$$ 75765 154967 -21653 399098 72231 -17126 108613 509532 -206164 -109300 -118136 27158
16222E1560J03806M79812A69697N2242I0092J45878K38572A75613n0456J08898
$$ 51560 155366 635178 169697 221939 90092 235970 474542 175613 125157 234055
16212B34055O3836a35588B05733K42024a2845k2379A93440F9601B6858J79469
$$ 234055 297891 -135588 205733 447757 -12845 -35224 193440 69601 26858 206327
16202B06327C5543i1073K2153K9395F3539L1357L41390b24856E7596K09125L7996
$$ 206327 35543 -91073 -68920 -39525 63539 94896 436286 -224856 57596 266721 304717
16191C04717A37971i5357B42319B198e7351o9185J1205N6820A08416c401q3295
$$ 304717 137971 -95357 242319 2198 -57351 -126536 -115331 -58511 108416 -3401 -86696
16180h6696L2279A10960J40365A12468M4315b59968d3502A24141Q4476I2595b07960
$$ -86696 -54417 110960 251325 112468 156783 -259968 -43502 124141 208617 92595 -207960
16168B83073a33626B7001N8023a18619D2633K56513j13084B5659a89574f0755
$$ 283073 -133626 27001 85024 -118619 42633 299146 186062 25659 -189574 -60755
16157e3929D5042e3263j70721A55038C351K48400K28049A17273f5552B9863J99152
$$ -53929 45042 -53263 -223984 155038 3351 251751 479800 117273 -65552 29863 229015
16146B29015Q6501b41554F4207J19694k4740j166J42846A03096e3721n4676k10354
$$ 229015 315516 -241554 64207 183901 159161 157995 300841 103096 -53721 -108397 -318751
16135c18751B84031A8610g9099j62877f9405j52345C10901A18929d3210a6788
$$ -318751 284031 18610 -79099 -241976 -69405 -221750 310901 118929 -43210 -16788
16124a01510m5525C12112J17054c61138I7326J4638K26935A24554a67749B06946
$$ -101510 -147035 312112 429166 -361138 97326 111964 338899 124554 -167749 206946
16113a29182A63115J09329b04863f9878K4511n1933n9740f3076j00223D3059a3794
$$ -129182 163115 272444 -204863 -69878 -45367 -97300 -157040 -63076 -163299 43059 -13794
16101A82267b48569A95133G3631P3025c9854A26147a24837a0695p4522H3561a67989
$$ 182267 -248569 195133 73631 146656 -39854 126147 -124837 -10695 -85217 83561 -167989
16089a83638C19266j07123b3215r0914A41459N8258B1315G076K47557b74935A50622
$$ -183638 319266 212143 -23215 -114129 141459 199717 21315 7076 254633 -274935 150622
16077G8347L0583c7558D0462f001C7371R7594M291g8416K5361A01857B3484j1684
$$ 78347 108930 -37558 40462 -6001 37371 134965 139256 -78416 -53055 101857 23484 11800
16065A1800K16371E0619J72621h253j11700F5897e9773k37736F2098b2376B3859
$$ 11800 228171 50619 223240 -8253 -119953 65897 -59773 -297509 62098 -22376 23859
16053C7203M34660a9045C2627b23437j50013c1625j948A90815n9324c14460P4072
$$ 37203 471863 -19045 32627 -223437 -373450 -31625 -33573 190815 131491 -314460 -240388
16042b40388q1150M2633a02681D68286c12644R0487c3269B64214a60376A19904
$$ -240388 -321538 -278905 -102681 468286 -312644 -222157 -33269 264214 -160376 119904
16031a44934N5236q5349l990e0454m326C9057a3346H7313J68659j03476J64515
$$ -144934 -89698 -175047 -179037 -50454 -54780 39057 -13346 87313 255972 152496 317011
16020C17011e8176l6433A312K8791a55977D5257K40805b38604E6151c1485K686
$$ 317011 -58176 -94609 1312 30103 -155977 45257 286062 -238604 56151 -31485 -28799
16009b8799A35782a37244F1059A1914K5098L5811c627k01418C33068A1010K07019
$$ -28799 135782 -137244 61059 11914 37012 72823 -3627 -205045 333068 11010 218029
15998B18029H4686E680J99170h8920A85285A001h3082c4197j74753A17189K43351
$$ 218029 84686 5680 204850 -88920 185285 1001 -83082 -34197 -208950 117189 360540
15987C60540e7889j79216O5042h1874A47814n5482J38248N0263N6128D9709h7949
$$ 360540 -57889 -237105 -172063 -81874 147814 92332 230580 280843 336971 49709 -87949
15975C04303j42499p6749c6270A10668b35289L050a973j30850A73685a47077d5401
$$ 304303 161804 85055 -36270 110668 -235289 -232239 -1973 -132823 173685 -147077 -45401
15963I742K31909j00438j8713a47345F8386e1862j38424l57926E1613j3392J33389
$$ 9742 241651 141213 122500 -147345 68386 -51862 -190286 -548212 51613 38221 171610
15952A71610a27073j63017B59049d4618l32406B60371b18973E708h0890A23013
$$ 171610 -127073 -290090 259049 -44618 -377024 260371 -218973 5708 -80890 123013
15941F1906a16498A94230c871l2982r1803O1758G0227f3316H9128m4242a44700
$$ 61906 -116498 194230 -3871 -36853 -128656 -66898 70227 -63316 89128 44886 -144700
15929A65527P1827a7376B53286A5006c79473B21066a90189e7851D00747c42503
$$ 165527 237354 -17376 253286 15006 -379473 221066 -190189 -57851 400747 -342503
15918i4174I6720L9137J04651C318b2933j27984L0696B68443j07725b15450C6137
$$ -94174 96720 135857 240508 3318 -22933 -150917 -120221 268443 160718 -215450 36137
15906a2924A34801a50083A57854f6600j73386A87909J21139a47518A28515D5945
$$ -12924 134801 -150083 157854 -66600 -239986 187909 309048 -147518 128515 45945
15895i4142k53319B59669O7524a06759b9873F3483b4347G9019A98d595B56198
$$ -94142 -347461 259669 327193 -106759 -29873 63483 -24347 79019 198 -4595 256198
15883a66726B20566b16732E6457f8897B66790b11451C5610A110f748p1623k57683
$$ -166726 220566 -216732 56457 -68897 266790 -211451 35610 1110 -6748 -78371 -336054
15872c36054J23092J0633N6274d4564F4403h2043r7036g2808B4696a78352f4327
$$ -336054 -212962 -202329 -146055 -44564 64403 -82043 -179079 -72808 24696 -178352 -64327
15860C0537P3149J24210f3222n9432k06883a13776B7875b5644j02342j13545F9418
$$ 30537 103686 227896 -63222 -122654 -329537 -113776 27875 -25644 -127986 -241531 69418
15848a15769B59234a97506d0179a5703G4814k5446J11179D7288a11206j64965
$$ -115769 259234 -197506 -40179 -15703 74814 49368 160547 47288 -111206 -276171
15838b76171F0982K15796N0843b98836c3910n4072j76906Q719M615M567i9678
$$ -276171 60982 276778 327621 -298836 -33910 -87982 -264888 -256169 -251554 -246987 -99678
15826A3857a14028A71928l5069k5980b73359b8583k89718R4308c1614E1511c15172
$$ 13857 -114028 171928 136859 110879 -273359 -28583 -318301 -223993 -31614 51511 -315172
15814c3138B3495O7420K12004D1959b70022Q0598h0905k15523A84556a94640D14841
$$ -33138 23495 90915 302919 41959 -270022 -189424 -80905 -296428 184556 -194640 414841
15802d0986A31202a65198D4823f3452I7786M0572a93298B79783j29140b50271
$$ -40986 131202 -165198 44823 -63452 97786 138358 -193298 279783 150643 -250271
15791d3536C54200L1277A20194c05220J46205l56637K20759H9448N2399c93395
$$ -43536 354200 385477 120194 -305220 -159015 -515652 -294893 89448 141847 -393395
15780H4297J12191e5083j68201A4478J76290j5605C781a99205j14137F1128a2044
$$ 84297 196488 -55083 -223284 14478 190768 175163 3781 -199205 -313342 61128 -12044
15768F5935b3497A15120d711k59628B4499M6425a13573A07343E448a3061r9670
$$ 65935 -23497 115120 -4711 -264339 24499 70924 -113573 107343 5448 -13061 -112731
15757a12731c6093m54871G271g1539B53337m4642b9588E7129A3349e3292I566
$$ -112731 -36093 -490964 7271 -71539 253337 208695 -29588 57129 13349 -53292 9566
15745F5643J5202d2914E5763K13664e21354A83317c48176A4741a20091B3353a20959
$$ 65643 80845 -42914 55763 269427 -521354 183317 -348176 14741 -120091 23353 -120959
15733d1122r7371H7344h3021o9796B192N339a62393C16358C9682a01097B34436
$$ -41122 -138493 87344 -83021 -152817 2192 7531 -162393 316358 39682 -101097 234436
15721A62491b7501D6882A4551d9028A79876a31663N4928k5510A2462L0046k402
$$ 162491 -27501 46882 14551 -49028 179876 -131663 -76735 -102245 12462 42508 40106
15710D0106a4730j28479b9582m9652j60274J06337B12565d4845D1158g0435L2751
$$ 40106 -14730 -143209 -29582 -79234 -239508 -133171 212565 -44845 41158 -70435 -37684
15699c7684B6903g9649I2357D3833b18242A3596E039J71694K75069e3695A36845
$$ -37684 26903 -79649 92357 43833 -218242 13596 5039 176733 451802 -53695 136845
15687g6460n1535N8736A94611r4948K9939c5700k1592m8942P745j39840i4315
$$ -76460 -127995 -69259 194611 99663 129602 -35700 -57292 -106234 -98489 -238329 -94315
15675a41072j25001i60p1575c790k0844j91247D570R84a17457C08056e57161D6761
$$ -141072 -266073 -960 -72535 -3790 -24634 -215881 4570 5554 -117457 308056 -557161 46761
15662A29457E2996b7450m56074D05239g7178A42678a56696j21238E3100b28191
$$ 129457 52996 -27450 -483524 405239 -77178 142678 -156696 -277934 53100 -228191
15651c30686g9209N467I229a24635M7143k01740D0106b2453M707B62641b45116
$$ -330686 -79209 -73742 9229 -124635 -77492 -279232 40106 -22453 -17746 262641 -245116
15639A51711h8523m0524q954A8448c05142D3603a89024k13873b1736G8358d4892
$$ 151711 -88523 -129047 -138001 18448 -305142 43603 -189024 -402897 -21736 78358 -44892
15627h0495H0715c06319A10319p006a30751A53410b270j30077n8027L6383c9736
$$ -80495 80715 -306319 110319 103313 -130751 153410 -2270 -132347 -190374 -153991 -39736
15615h4282H9877c0823B45241I4033l2514b34767B09096C4777J14775b68754c7581
$$ -84282 89877 -30823 245241 94033 61519 -234767 209096 34777 149552 -268754 -37581
15603A11550P2449g1615L1306G6224O8734c77630g3619A80821c36019C615a31469
$$ 111550 183999 -71615 -40309 76224 144958 -377630 -73619 180821 -336019 3615 -131469
15591a53938B26214i0323I4525i5089B13985g2108L2124j39962I9400K9482g0762
$$ -153938 226214 -90323 94525 -95089 213985 -72108 -39984 -179946 99400 128882 -70762
15579a65203B55297F012Q4660a42857E4410a43936G4977l4957K60687b5499o5642
$$ -165203 255297 6012 90672 -142857 54410 -143936 74977 40020 300707 -25499 -91141
15568i1141k26242D21533a97476Q946G3271P5309J2213F0203a23422C80312i3947
$$ -91141 -317383 421533 -197476 -188530 73271 148580 160793 60203 -123422 380312 -93947
15556C3161f9625m9655A55492J53412j00542D2332o115a28662B21460j07237a01769
$$ 33161 -69625 -119280 155492 308904 208362 42332 36217 -128662 221460 114223 -101769
15544D0181a15762b7175m15831a24375B4893K17784e7253C3435h1852a2297A15858
$$ 40181 -115762 -27175 -443006 -124375 24893 242677 -57253 33435 -81852 -12297 115858
15532F7759d7904J3493D9655a9916k97490a50322M6693D64264b19265A46997b1811
$$ 67759 -47904 -34411 49655 -19916 -317406 -150322 -103629 464264 -219265 146997 -21811
15520B8952Q6616j0871a06969o526B0938Q6330i7671j46978R9532b5997E4413
$$ 28952 115568 104697 -106969 -113495 20938 107268 -97671 -244649 -145117 -25997 54413
15508B08749B4564J5990b10394J05077C2064a44147b870j62484A64944h1251G3555
$$ 208749 24564 40554 -210394 -105317 32064 -144147 -2870 -165354 164944 -81251 73555
15496A78886l6843b6650l7503r0367L7439k3214m7284p3955I2228f2924J8074
$$ 178886 142043 -26650 -64153 -154520 -117081 -140295 -187579 -261534 92228 -62924 -44850
15485d4850q9306A32773D1116b86040a03839C3266K43605C879L25682K59134B9554
$$ -44850 -134156 132773 41116 -286040 -103839 33266 276871 3879 329561 588695 29554
15473h5618b9316m9127K4849B69244k7910a13175A79670I240d7952g595k60625
$$ -85618 -29316 -78443 -53594 269244 241334 -113175 179670 9240 -47952 -7595 -268220
15462b68220c7999B21621b68994F9526i1007b5103L861H6733K43588J29738r2485
$$ -268220 -37999 221621 -268994 69526 -91007 -25103 -21242 86733 330321 460059 367574
15451C67574G2937L8680m2674c7319h564a147j7363k79778R3021e9842k27748
$$ 367574 72937 111617 68943 -37319 -8564 -1147 -18510 -298288 -205267 -59842 -287590
15440b87590g1299B2430K36264a62312j6387c1394o8771A73882c70839a23117
$$ -287590 -71299 22430 258694 -162312 -178699 -31394 -100165 173882 -370839 -123117
15429a34910I3940a01428B91812C3932L4670a46533k7572J6628A87202J16503
$$ -134910 93940 -101428 291812 33932 68602 -146533 -174105 -157477 187202 303705
15419C03705A26313b99094I27L0935Q284a13509M380A02045c05418A43727i7696
$$ 303705 126313 -299094 927 31862 40146 -113509 -109129 102045 -305418 143727 -97696
15407A42946D4188c36472B69097r8932b87346a8041A21623a98846A06289P7657
$$ 142946 44188 -336472 269097 170165 -287346 -18041 121623 -198846 106289 183946
15397A83946a63345A86243a05618q6503a6138k66110A71812b07762P4482i356
$$ 183946 -163345 186243 -105618 -192121 -16138 -282248 171812 -207762 -133280 -9356
15386A96766B3819K48968A08760P3386D6559j4353b29101C68138j58375N9575
$$ 196766 23819 272787 108760 182146 46559 32206 -229101 368138 209763 269338
15376B69338F5687g0038B26406a19389A87091D5684Q3842d1861F6166a96961F146
$$ 269338 65687 -70038 226406 -119389 187091 45684 129526 -41861 66166 -196961 6146
15364B91503a54574P2159B525K68482a39116j97470A69813e1062j15160g7259
$$ 291503 -154574 -82415 2525 271007 -139116 -336586 169813 -51062 -166222 -77259
15353a24703a9086F0439K48557a81421i269j29753m7261A20595N2671d654j68668
$$ -124703 -19086 60439 308996 -181421 -9269 -139022 -186283 120595 173266 -4654 -173322
15342a73322A8907J32647E6023b44989A60860c14274A50078A5586J70746J609
$$ -173322 18907 151554 56023 -244989 160860 -314274 150078 15586 186332 187941
15332A87941J42557A18378L2304a33193f3680A5932J38285b73547C00241B0519
$$ 187941 330498 118378 150682 -133193 -63680 15932 154217 -273547 300241 20519
15321b6661G3681q370O700R277a5112k11543a02506j1642H8352d91C1606d74103
$$ -26661 73681 65311 72011 81288 -15112 -226655 -102506 -114148 88352 -491 31606 -474103
15308a02274L7332C33723D6210P2858m9548P3686d465A00674J24907r7930P9689
$$ -102274 -64942 333723 46210 119068 69520 143206 -4465 100674 225581 127651 207340
15297B07340b79173A35432m7061J91526c22459D926P1152K82654A0276d6022B59790
$$ 207340 -279173 135432 88371 279897 -322459 4926 76078 358732 10276 -46022 259790
15285F6610J00409a46151B54590I1008J0916Q565J22923b3321C17923a4711A28050
$$ 66610 167019 -146151 254590 91008 101924 110489 233412 -23321 317923 -14711 128050
15273A56094e8131G335e4126H948b41037I7478J14161l0952f0781D29535j90251
$$ 156094 -58131 7335 -54126 8948 -241037 97478 211639 180687 -60781 429535 239284
15262B39284G7713J48190m2001J31736o8239D4145J654a7236E55287a55809A49112
$$ 239284 77713 225903 183902 315638 247399 44145 45799 -17236 555287 -155809 149112
15250C09388j48732J17529L9536J099423O58925l22627K61626R518I28641C04018
$$ 309388 160656 278185 317721 1417144 2076069 1753442 2015068 2024586 928641 304018
15239B67651n2922N9735o4785A6874J27627b64776a09065B28799j0031A09112
$$ 267651 214729 274464 209679 16874 144501 -264776 -109065 228799 218768 109112
15228A79235M4955j03146l6039j9080a02395B19501L3180h4543A76259E2386P0393
$$ 179235 224190 121044 85005 65925 -102395 219501 252681 -84543 176259 52386 122779
15217A22779J50078D5262O171M9812g6537C97509J5072j06244b6486F9758P804
$$ 122779 272857 45262 51433 101245 -76537 397509 412581 306337 -26486 69758 77562
15206G7562K35499c52203B01361J49480A70427R710a13310b9598C02390C4999
$$ 77562 313061 -352203 201361 350841 170427 180137 -113310 -29598 302390 34999
15195A81740n9872q972Q0022b50047C77658j05433p2117J25270B2269a46038A43098
$$ 181740 121868 112896 192918 -250047 377658 272225 200108 325378 22269 -146038 143098
15183c4843p5590H7637J40934n4918n0952E898J02087c67142A20043a15126B6073
$$ -34843 -110433 87637 228571 173653 122701 5898 107985 -367142 120043 -115126 26073
15171A29843c2731q6495A82521c9110D2271J50c6576A15744a58498K8767K8599
$$ 129843 -32731 -119226 182521 -39110 42271 42421 -36576 115744 -158498 -129731 -101132
15160a01132D175K8927Q684K46754G4353J00082J24945b10519G2170h3034K6739
$$ -101132 4175 33102 41786 288540 74353 174435 299380 -210519 72170 -83034 -56295
15149e6295A61551J2352M6645a34191A31511L44569E5500K08963j26880n173b9263
$$ -56295 161551 173903 220548 -134191 131511 476080 55500 264463 137583 132410 -29263
15137B67591A26009b11188A67169o3474g4211a0274C8351D589J1689J26532o2775
$$ 267591 126009 -211188 167169 103695 -74211 -10274 38351 4589 16278 142810 80035
15126H0035L7787J44685o0754H2785i0518C44848o0425m8763c6588E659L0728
$$ 80035 117822 262507 201753 82785 -90518 344848 284423 235660 -36588 5659 36387
15115C6387D881K50164q7360R8824D1629A5695D80J89157h0228A28644B8479C078
$$ 36387 4881 255045 167685 266509 41629 15695 480 189637 -80228 128644 28479 3078
15102A67768K62341K3177a7986A67901N6480e45896F1128L40340A98938J1336
$$ 167768 430109 453286 -17986 167901 224381 -545896 61128 401468 198938 210274
15092B10274g4679A59436Q92n6594j086L31885C5328J55209a4000C491d2602A94311
$$ 210274 -74679 159436 160328 103734 102648 434533 35328 190537 -14000 3491 -42602 194311
15079C80778A58463A1587L1366e4284C10045j39904k8939K53353A69580F7107
$$ 380778 158463 11587 42953 -54284 310045 170141 141202 394555 169580 67107
15068G9280N5248J16604l8274o3994o7552M4585J86997m636B2844J40515J1133
$$ 79280 134528 251132 212858 148864 81312 125897 312894 308258 22844 163359 174492
15057A74492d5353E91534j94015g1764g927B88156P7489K9921A9577K73471f7223
$$ 174492 -45353 591534 397519 -71764 -7927 288156 365645 395566 19577 293048 -67223
15045f3158C87154m4675i6436A99584F6124N97259A72515K3955k34J7522M1543
$$ -63158 387154 342479 -96436 199584 66124 663383 172515 196470 196236 213758 255301
15034B55301A23703q01K33919j32117j11284J9553J03426c2082k1825C70981b16649
$$ 255301 123703 122902 356821 224704 113420 132973 236399 -32082 -53907 370981 -216649
15022A49474P2059B549O11136B41464J47017D853J78590a7495B56924e8300D98121
$$ 149474 221533 2549 613685 241464 388481 4853 183443 -17495 256924 -58300 498121
15010A32794P8414J56288C1673M16180A73735h1396F6341K40580j8482E5923L26141
$$ 132794 211208 367496 31673 447853 173735 -81396 66341 306921 288439 55923 382064
14999C82064b10084B53618m8195M34042h8931E36357B02814k5934o7409J48777
$$ 382064 -210084 253618 205423 639465 -88931 536357 202814 176880 109471 258248
14989B58248a561A40820m8322g4699B70357J1355A8978L41291q0942j26942B4726
$$ 258248 -1561 140820 92498 -74699 270357 281712 18978 360269 279327 152385 24726
14977A56150K8336c4522B03772E3655K12195G282K51896b31658C95933o5135n0968
$$ 156150 184486 -34522 203772 53655 265850 7282 259178 -231658 395933 330798 279830
14966B79830Q5573A80677L97770A03125J01229J0945J28115a0783A40416K19668
$$ 279830 365403 180677 578447 103125 204354 215299 343414 -10783 140416 360084
14956C60084K26613p6983C5195N59799A27659P9957o8147j1752J50875J08417
$$ 360084 586697 509714 35195 594994 127659 207616 139469 127717 278592 387009
14946C87009j46304M11983e6514B66170n7556j2818O8003n2531K7625K9700J80807
$$ 387009 240705 652688 -56514 266170 208614 195796 263799 211268 238893 268593 449400
14935D49400J77814B49385j2541M4351J63059j50729l309O2215n4334J36856Q027
$$ 449400 627214 249385 236844 281195 444254 293525 290216 352431 298097 434953 442980
14924D42980m2012J1943O3993k8689B5217N66590o3174j35246p7095j16799O5318
$$ 442980 400968 412911 476904 448215 25217 591807 528633 393387 316292 199493 264811
14913B64811r3935J14267L37115k41201K58419o2653A89837K05108o2972A58036
$$ 264811 170876 285143 622258 381057 639476 576823 189837 394945 331973 158036
14902B64064j12025J39287K89493k81693N1494K7998O4369j98440A1689O3703
$$ 264064 152039 291326 580819 299126 350620 378618 442987 244547 11689 75392
14892G5392J90653j27843J59268j8710J01804j35541q7787L532K03381J60496
$$ 75392 266045 138202 297470 278760 380564 245023 157236 160768 364149 524645
14882E24645J69374l13071A37137L34639R4615N0421l1738B00077J9618A9275
$$ 524645 694019 380948 137137 471776 566391 616812 585074 200077 219695 19275
14871B56421K27691k34298L8934J76917J64467G7932M52568n0969l4757k17397
$$ 256421 484112 249814 288748 465665 630132 77932 530500 479531 444774 227377
14861B27377K70431o7634K66338l17156j73533Q4244K05095J75344k77445L304
$$ 227377 497808 430174 696512 379356 205823 290067 495162 670506 393061 396365
14851C96365j59617J57564k8009I4453N82853P6374k89169j11792K44565J68460
$$ 396365 236748 394312 366303 94453 677306 753680 464511 352719 597284 765744
14841G65744B44322K36936j9328K5344l8888J74389B96077M41328C48176O3166
$$ 765744 244322 481258 461930 487274 448386 622775 296077 737405 348176 411342
14831D11342J20356A20409J06327K86658j7460j46509J07489j92244J19724A60585
$$ 411342 531698 120409 226736 513394 495934 349425 456914 264670 384394 160585
14820H11003B48817L50138B30104O51025k42196j88534J74002k11499j7848l4339
$$ 811003 248817 598955 230104 881129 638933 450399 624401 412902 395054 360715
14810C60715J6622J34115o0462J30446j00653K12847k42804p6697M4442j21116
$$ 360715 377337 511452 450990 581436 480783 693630 450826 374129 418571 297455
14800B97455J05765J64141j77142N9079L93031j44731A87592K295P6706R7907
$$ 297455 403220 567361 390219 449298 842329 697598 187592 189887 266593 364500
14790C64500K12199k00623J12875J91797j38691J64742l43549K78255A27272M01360
$$ 364500 576699 376076 488951 680748 542057 706799 363250 641505 127272 528632
14780E28632J41930j43468K17470l45553N63329p9514k88907n5044K06118k97162
$$ 528632 670562 527094 744564 399011 962340 882826 593919 538875 744993 447831
14770D47831O1574J92579r8467J68104C82738M06846Q759k80924J26753r5168
$$ 447831 509405 701984 603517 771621 382738 789584 798343 517419 644172 549004
14760E49004o397Q8730j60593J85670J19779P3237K8478k40545r1430J71522L88737
$$ 549004 542607 631337 470744 656414 776193 849430 877908 637363 545933 717455 1106192
14749A106192E46363L73364p694m25133K18823m0534N1428C39907J93642M22369
$$ 1106192 546363 919727 912033 486900 705723 665189 716617 339907 533549 955918
14739I55918l56767O20392k57001o3040j29952k122j86350J39567M102q3434K76042
$$ 955918 599151 1219543 962542 899502 769550 767428 581078 720645 724747 641313 917355
14728I17355k63431m5053L29626m40309K98167K4976N8928P2280M5094m71246
$$ 917355 653924 608871 938497 498188 796355 821331 880259 952539 997633 526387
14718E26387M70553j20415j41940J04391K0831K01504J54001m28253L2543k25208
$$ 526387 996940 876525 734585 838976 859807 1061311 1215312 787059 819602 594394
14708E94394N04477j57041j51204j51489L72114J08363m93199M04620n7902n4344
$$ 594394 1098871 941830 790626 639137 1011251 1119614 626415 1031035 973133 918789
14698I18789O7060r3585p8818N2228j42260K15753Q8840m02009P77601m20743
$$ 918789 985849 892264 813446 865674 723414 939167 1028007 625998 1403599 982856
14688I82856N50989F85778Q6517p1991J69938J67550q9602J84075N7513p6270
$$ 982856 1533845 685778 772295 700304 870242 1037792 948190 1132265 1189778 1113508
14678A113508j73899M19581n93243M29601k64812K01453n1693j09149k34484L52512
$$ 1113508 939609 1359190 765947 1195548 930736 1132189 1080496 971347 736863 1089375
14668A089375K21792l83994J41916J50220K89689p13118M9198K3397M90236j61809
$$ 1089375 1311167 927173 1069089 1219309 1508998 795880 845078 868475 1358711 1196902
14658A196902J0518O7091J54908q5084m86754M44401j95778K25405j32821L3794
$$ 1196902 1207420 1274511 1429419 1344335 857581 1301982 1106204 1331609 1198788 1232582
14648A232582J36081k07642q6314J95049k40534K79068l48914L87529o0865j54687
$$ 1232582 1368663 1161021 1074707 1269756 1029222 1308290 959376 1346905 1286040 1131353
14638A131353K93611Q2392j42643J68291j64928l25985L49075J0146P0150j82831
$$ 1131353 1424964 1507356 1364713 1533004 1368076 1042091 1391166 1401312 1471462 1288631
14628A288631j21240K91838n6077m0245J09040q7357J62311j3183L2971l05707
$$ 1288631 1167391 1459229 1403152 1362907 1471947 1384590 1546901 1533718 1566689 1260982
14618A260982L2960Q0627M19206j52427j47048r2424p1626N00428n13707j6070
$$ 1260982 1293942 1374569 1793775 1641348 1494300 1401876 1330250 1830678 1316971 1300901
14608A300901M46749k28448K73343k91907J79344J57032j1856m41821L51946n4834
$$ 1300901 1747650 1519202 1792545 1500638 1679982 1837014 1825158 1383337 1735283 1680449
14598A680449J50222p9534M8149n8090K22044j80338j45553J60708K5929R4772
$$ 1680449 1830671 1751137 1799286 1741196 1963240 1782902 1637349 1798057 1823986 1918758
14588A918758l73120K63248j08396L17973j85889N9100L7723J45632j60906K43328
$$ 1918758 1545638 1808886 1700490 2018463 1832574 1891674 1929397 2075029 1914123 2157451
14578B157451J03124j04892N8298r4719j4243K73467J39924k88286K82825j50605
$$ 2157451 2260575 2155683 2213981 2119262 2105019 2378486 2518410 2230124 2512949 2362344
14568B362344q818J52718q0345J51173J26668K59060l57289J21715K27385n0287
$$ 2362344 2353526 2506244 2425899 2577072 2703740 2962800 2605511 2727226 2954611 2904324
14558B904324K53201n6997m9767R6352N81889m4640O08888O66019R85534J195389
$$ 2904324 3157525 3100528 3050761 3147113 3729002 3684362 4293250 4959269 5944803 7140192
14548G140192M259634Q705561J8916088K728721k0150891I658479j842236j863276
$$ 7140192 11399826 20105387 39021475 41750196 21599305 9658479 7816243 5952967
14540E952967k411091j353739k5639r6791k39932L65232j53331Q8635k49950K94365
$$ 5952967 3541876 2188137 2162498 2065707 1825775 2191007 2037676 2126311 1876361 2170726
14530B170726K78790l55421K66797K20564n1996O9634k61345K06618j36068J49771
$$ 2170726 2449516 2094095 2360892 2581456 2529460 2599094 2337749 2544367 2408299 2558070
14520B558070k5607O3734O6673k77325J81980J18503l2011J56916M1266l78996
$$ 2558070 2532463 2596197 2662870 2385545 2567525 2686028 2654017 2810933 2852199 2473203
14510B473203N27227J09921k16035J3254o9958J06595K25402m98120P11306k33600
$$ 2473203 3000430 3110351 2894316 2907570 2837612 2944207 3169609 2671489 3382795 3149195
14500C149195k503K0215p5362L23997j28841L7891L73367L4979m05600L53717
$$ 3149195 3146692 3166907 3091545 3415542 3286701 3324592 3697959 3732938 3327338 3681055
14490C681055k9827q0997j73152K24856L14329j50188R9755n3287k24107n4369
$$ 3681055 3651228 3570231 3397079 3621935 3936264 3786076 3885831 3832544 3608437 3554068
14480C554068l0566N65160k47371K52502q6680K25312J08652k5739J08061j21052
$$ 3554068 3523502 4088662 3841291 4093793 4007113 4232425 4341077 4315338 4423399 4302347
14470D302347J1175J15626m02327L62935n8076O94555l28664J70540N5296K3738
$$ 4302347 4313522 4429148 4026821 4389756 4331680 5026235 4697571 4868111 4923407 4947145
14460D947145k11628K91042q7005J62366k62058L83887J19795n2548J16385l25424
$$ 4947145 4735517 5026559 4939554 5101920 4839862 5223749 5343544 5290996 5407381 5081957
14450E081957K99177K2961j22734L50605j35027L12599K00616n1224L45083m80207
$$ 5081957 5381134 5404095 5281361 5631966 5496939 5809538 6010154 5958930 6304013 5823806
14440E823806K16062J75166j18493K1368L4078K11884N87344m75586J32028Q19277
$$ 5823806 6039868 6215034 6096541 6117909 6151987 6363871 6951215 6475629 6607657 7426934
14430G426934o18499J65264k59398O18766p1681j20416K82896Q3412M0411J22466
$$ 7426934 6808435 6973699 6714301 7333067 7261386 7140970 7423866 7507278 7547689 7670155
14420G670155L65703q7011J07348L20683k29264P01971j76970Q3554N6672q3850
$$ 7670155 8035858 7948847 8056195 8376878 8147614 8849585 8672615 8756169 8812841 8728991
14410H728991M22405M94933k69039J93591k25330O43050m42238o0068J091097
$$ 8728991 9151396 9646329 9377290 9570881 9345551 9988601 9546363 9486295 10577392
14401A0577392o5508J2539M40029K22782k74024L09791L97057J96337J93367l7029
$$ 10577392 10511884 10524423 10964452 11187234 10913210 11223001 11620058 11816395 12009762 11972733
14391A1972733J63381M21840K9764j94736O33008J73097L08694N18085k81015
$$ 11972733 12136114 12557954 12587718 12392982 13025990 13199087 13507781 14025866 13744851
14382A3744851M09472K87329M79717J21768j86169N46804N80843K80880P9146
$$ 13744851 14154323 14441652 14921369 15043137 14856968 15403772 15984615 16265495 16344641
14373A6344641M58024O00455q6905Q04654j96299K32072N39624P41697L25686
$$ 16344641 16802665 17403120 17316215 18120869 17924570 18156642 18696266 19437963 19763649
14364A9763649K47545L20845O20104M77225M19929M99038P18985L62366N90829
$$ 19763649 20011194 20332039 20952143 21429368 21849297 22348335 23067320 23429686 24020515
14355B4020515K188R59149P00909N32653L89185J046121K31577J212481P13502
$$ 24020515 24022703 24981852 25682761 26215414 26604599 27650720 27882297 29094778 29808280
14346B9808280N52408R73216N06465R34604Q17347Q27640J077224Q46845J528010
$$ 29808280 30360688 31333904 31840369 32774973 33592320 34419960 35497184 36344029 37872039
14337C7872039Q52533J062925J279370Q05550J405117J114849J727143J245398
$$ 37872039 38724572 39787497 41066867 41872417 43277534 44392383 46119526 47364924
14329D7364924J319091J522818J490641K018983J692244J489272K546109J761763
$$ 47364924 48684015 50206833 51697474 53716457 55408701 56897973 59444082 61205845
14321F1205845K374681K168108K373509K671592K327096K967511K928623K977614
$$ 61205845 63580526 65748634 68122143 70793735 73120831 76088342 79016965 81994579
14313H1994579L030809L183435L565671L835261L580179M175239M747700M479884
$$ 81994579 85025388 88208823 91774494 95609755 99189934 103365173 108112873 112592757
14305A12592757M929107M847455N692365N477824O463894O619798O747324P839391
$$ 112592757 117521864 122369319 128061684 133539508 140003402 146623200 153370524 161209915
14297A61209915P032969P892834R146214R011175R384504J0271709J0508973J1256720
$$ 161209915 168242884 176135718 185281932 194293107 203677611 213949320 224458293 235715013
14289B35715013J1696706J2375140J2682010J3123134J4035203J3953816J4403376
$$ 235715013 247411719 259786859 272468869 285592003 299627206 313581022 327984398
14282C27984398J5005755J4865171J5090437J4920787J4357893J3978800J3397813
$$ 327984398 342990153 357855324 372945761 387866548 402224441 416203241 429601054
14275D29601054J2121544J0574231Q424676M783091J216139q09665r46550R14066
$$ 429601054 441722598 452296829 460721505 465504596 466720735 465911070 464964520 465878586
14267D65878586l906609n817463q353672j0535367j2529355j3696239j4808833
$$ 465878586 461971977 456154514 447800842 437265475 424736120 411039881 396231048
14260C96231048j5041496j6122880j5895085j6155985j5588965j5777556j4867210
$$ 396231048 381189552 365066672 349171587 333015602 317426637 301649081 286781871
14253B86781871j4022949j2655011j2567700j2437665j2002957j1222592j0384200
$$ 286781871 272758922 260103911 247536211 235098546 223095589 211872997 201488797
14246B01488797j0115746r681584q334486q045154q196369p647425o706274o546361
$$ 201488797 191373051 181691467 173356981 165311827 157115458 149468033 142761759 136215398
14238A36215398n723355n529732n605982n632695m838100m361031m385605l320819
$$ 136215398 130492043 124962311 119356329 113723634 108885534 104524503 100138898 96818079
14230I6818079l774416m065448l186029l500149l423897k480649l395213k571256
$$ 96818079 93043663 88978215 85792186 82292037 78868140 76387491 72992278 70421022
14222G0421022k308127k234972k210796k170711k260096k089604j812084j688443
$$ 70421022 68112895 65877923 63667127 61496416 59236320 57146716 55334632 53646189
14214E3646189j182072j607958j478222j806921j657383j099569j291929p94326
$$ 53646189 52464117 50856159 49377937 47571016 45913633 44814064 43522135 42727809
14206D2727809j078870j586851p58257j692117j168762l45414o84455q87257j150174
$$ 42727809 41648939 40062088 39303831 37611714 36442952 36097538 35413083 34525826 33375652
14197C3375652j358632k86578q12305p59920p73772o45500m39942q99798q20726
$$ 33375652 32017020 31730442 30918137 30158217 29384445 28738945 28299003 27399205 26578479
14188B6578479o16387j081614L4544p09610p70075j68774m48144q65072k02669
$$ 26578479 25962092 24880478 24915022 24205412 23435337 23266563 22818419 21953347 21750678
14179B1750678n92299m94833j14517n49831n14471k88665l50307k32954m33066
$$ 21750678 21158379 20663546 20549029 19999198 19484727 19196062 18845755 18612801 18179735
14170A8179735k81037r35582k00580k7650o04551r3886J17221p50624j92473m64883
$$ 18179735 17898698 16963116 16762536 16734886 16130335 16036449 16153670 15403046 15210573 14745690
14160A4745690k81988J35014n41594J43990m44385l05979p0038l88939q6261k80242
$$ 14745690 14463702 14598716 14057122 14201112 13756727 13450748 13380710 12991771 12905510 12625268
14150A2625268m10772p6707j21510l36666j24796m16756O38911p51817M2306o78939
$$ 12625268 12214496 12137789 12016279 11679613 11554817 11138061 11776972 11025155 11067461 10388522
14140A0388522j34162J99887j59131k47464J25515l78035N3920R995l87964k33242
$$ 10388522 10254360 10454247 10295116 10047652 10173167 9795132 9849052 9859047 9471083 9237841
14130I237841k14004j24307o0333j64889j86723J41321J56439l05009j97802m87899
$$ 9237841 9023837 8899530 8839197 8674308 8487585 8628906 8785345 8480336 8282534 7794635
14120G794635L77762r5245m98837L74117l43388j21929k01239P7182k66082j72925
$$ 7794635 8172397 8077152 7578315 7952432 7609044 7487115 7285876 7363058 7096976 6924051
14110F924051J24616K541j79760K10763m57606k65263J69645l35269K45988j94555
$$ 6924051 7048667 7051208 6871448 7082211 6624605 6359342 6528987 6193718 6439706 6245151
14100F245151L1625j13670k48622Q0460o573q8521m2575J62370l12769j6516j80509
$$ 6245151 6276776 6163106 5914484 5994944 5988371 5899850 5857275 6019645 5706876 5690360 5509851
14089E509851l75891K47219K33462j91027n11548J59630j66297J7799k2663J21666
$$ 5509851 5133960 5381179 5614641 5423614 4912066 5071696 4905399 4923198 4900535 5022201
14079E022201M1258k80750k21951L41178k90211P2387j79518J25227k17172K17264
$$ 5022201 5063459 4782709 4560758 4901936 4611725 4684112 4504594 4629821 4412649 4629913
14069D629913j56740k38959L70667m08889L88489n47692J31412k91872M00930
$$ 4629913 4473173 4234214 4604881 4195992 4584481 4036789 4168201 3876329 4277259
14060D277259j98652P442J42394r8535N784l06973J25111m45048N43516j23342
$$ 4277259 4078607 4086049 4228443 4129908 4135692 3828719 3953830 3508782 4052298 3928956
14050C928956n23416K71797j32882L6139P4432m45612K5327J09006j95740K01047
$$ 3928956 3405540 3677337 3544455 3580594 3655026 3209414 3234741 3343747 3148007 3349054
14040C349054j41004q4108J46157j30852p6084J61243p6241j49561k65704L57538
$$ 3349054 3208050 3123942 3270099 3139247 3063163 3224406 3148165 2998604 2732900 3090438
14030C090438k00140K56822k26579J74388j98795p7074l583L75017l58618o7772
$$ 3090438 2890298 3147120 2920541 3094929 2896134 2819060 2815477 3190494 2831876 2764104
14020B764104r3717L86379l29174k9981j51812J43693q9361K3305j17835N3688
$$ 2764104 2670387 3056766 2727592 2697611 2545799 2689492 2600131 2623436 2505601 2559289
14010B559289J25568l67953K02597k46313P7373J22856j20809J7739J6290J75932
$$ 2559289 2684857 2316904 2519501 2273188 2350561 2473417 2352608 2370347 2386637 2562569
14000B562569k80438o2582L5328M1042k54487J56930k62758J53288K48975K89652
$$ 2562569 2282131 2219549 2254877 2295919 2041432 2198362 1935604 2088892 2337867 2627519
13990B627519K40851O88038K622099O932773J9086795J1492323j5764217j3799328
$$ 2627519 2868370 3556408 6178507 13111280 32198075 43690398 27926181 14126853
13982A4126853n577328k806377o85244p92817r68841J54986j79646l44464j53543
$$ 14126853 8549525 5743148 5057904 4265087 3296246 3451232 3271586 2927122 2773579
13973B773579J59739m31458N8873L83876n88355M91543o11102K19243J6472J0514
$$ 2773579 2933318 2501860 2560733 2944609 2356254 2847797 2236695 2455938 2472410 2482924
13963B482924k88291k08016L03917j79035j75875p5951Q1810p113K42488k21783
$$ 2482924 2194633 1986617 2290534 2111499 1935624 1859673 1941483 1934370 2176858 1955075
13953A955075j54498K42515k06552K54551k27019p4258K29853K06309n40199K87025
$$ 1955075 1800577 2043092 1836540 2091091 1864072 1789814 2019667 2225976 1685777 1972802
13943A972802m6102p0671R4209l3269R0341l34616N2802J06279l76822J61488
$$ 1972802 1926700 1856029 1950238 1916969 2007310 1672694 1725496 1831775 1454953 1616441
13933A616441j22627J95310k12665N8312J64472j3551O2920j68191j2407K74924
$$ 1616441 1493814 1689124 1476459 1534771 1699243 1685692 1748612 1580421 1568014 1842938
13923A842938l89132K07384p1328J90682j23385l7734K79264m05964J96360k83631
$$ 1842938 1453806 1661190 1589862 1780544 1657159 1619425 1898689 1492725 1689085 1405454
13913A405454k87704L85028K27020o60865K62602p8021k14369J52218J53251O9301
$$ 1405454 1117750 1502778 1729798 1068933 1331535 1253514 1039145 1191363 1344614 1413915
13903A413915k05886J42448K75556l06901R3148p1401J68593m40700L76666k66052
$$ 1413915 1208029 1350477 1626033 1319132 1412280 1340879 1509472 1068772 1445438 1179386
13893A179386n5100M18286k35239l46219L17256k94995M57334l28662K2716K1917
$$ 1179386 1124286 1542572 1307333 961114 1278370 983375 1440709 1112047 1134763 1156680
13883A156680m1657K60654j21409M7242j60829J19202m9782N2102j51124J98904
$$ 1156680 1115023 1375677 1254268 1301510 1140681 1259883 1210101 1262203 1111079 1309983
13873A309983j8912m22884K44111L68253l53945K22871l45711J12555M31444l75407
$$ 1309983 1291071 868187 1112298 1480551 1126606 1349477 1003766 1116321 1547765 1172358
13863A172358J90296m84012Q1507o9485N39349n13200K10566k86654L45017l23619
$$ 1172358 1362654 878642 960149 890664 1430013 916813 1127379 840725 1185742 862123
13853H62123j2834J68208r7917K98924L0106R8723j92876J27494m97000L59928
$$ 862123 849289 1017497 919580 1218504 1248610 1347333 1154457 1281951 784951 1144879
13843A144879J32512j92753k15163o9185J39919o9398K03924l53778M01286R251
$$ 1144879 1277391 1084638 869475 800290 940209 870811 1074735 720957 1122243 1131494
13833A131494j66336j45231L35823q9208r7799Q2389k71663K29998k32726J61126
$$ 1131494 965158 819927 1155750 1066542 968743 1051132 779469 1009467 776741 937867
13823I37867L414m2892l2467k5214K38981k24595j31833N6033J55935r5985j40119
$$ 937867 941281 898389 865922 840708 1079689 855094 723261 779294 935229 839244 699125
13812F99125K15027j5551n6249K25638k52779L31854m88765L10331Q921J37360
$$ 699125 914152 898601 842352 1067990 815211 1147065 658300 968631 977552 1114912
13802A114912j73547K9980p7279M0344P2516m66005N30059k64277K9463j27174
$$ 1114912 941365 971345 894066 934410 1006926 540921 1070980 806703 836166 708992
13792G08992J50103K74069l15804j58903j29635L30544j13906K11339k77181j59579
$$ 708992 859095 1133164 817360 658457 528822 859366 745460 956799 679618 520039
13782E20039L28895K28197l49943J14195k19665K86639o2567o4495K0502M198
$$ 520039 848934 1077131 727188 841383 621718 908357 845790 781295 801797 805995
13772H05995j52735j17873L7498R0093Q3634M9191j35818o2640j13822M55610
$$ 805995 653260 535387 572885 662978 746612 795803 659985 597345 483523 939133
13762I39133j8603o4919j92514k22370K54569j39752L4167J22496j25810K3494
$$ 939133 920530 855611 663097 440727 695296 555544 589711 712207 586397 609891
13752F09891j29302J52407L0510j96312J66680L852j54372K61120j74075J44112
$$ 609891 480589 632996 663506 467194 633874 637726 483354 744474 570399 714511
13742G14511j57225J19399P7409l12789J59484j00214O1764j53759J5440O4821
$$ 714511 557286 676685 754094 441305 600789 500575 562339 408580 424020 488841
13732D88841K27078k67855k9809O4920L6393J75014j548k63351n5615K83626l00794
$$ 488841 715919 448064 418255 483175 519568 694582 693034 429683 374068 657694 356900
13721C56900l6074J33691J43628O9248L2914p5681j86842J43911j43496J52539
$$ 356900 320826 454517 598145 667393 700307 624626 437784 581695 438199 590738
13711E90738J19286J01220B67457J26393J1848N3034J52253J34520L1974r7684
$$ 590738 710024 811244 267457 393850 405698 458732 610985 745505 777479 679795
13701F79795L9857B07879O95690C53669A05758L59484j56031N96365m23210K19074
$$ 679795 719652 207879 903569 353669 105758 465242 309211 905576 482366 701440
13691G01440q8779k6036K2090j22002o43O3287A77302L84595j33863J09794L3148
$$ 701440 612661 586625 608715 486713 486070 549357 177302 561897 428034 537828 570976
13680E70976J01710q4131q4044O6205R0028k0075Q788J05936B95685J81209M70179
$$ 570976 672686 588555 504511 570716 660744 640669 649457 755393 295685 476894 947073
13669I47073D54830J07973k28392K98392B01538J70243A66729P1673L04303j66748
$$ 947073 454830 562803 334411 632803 201538 371781 166729 238402 542705 375957
13659C75957K11839n1564j1497k39651j01484K56852k3930M8489K52934l9954
$$ 375957 587796 536232 524735 285084 183600 440452 416522 465011 717945 677991
13649F77991B47008K24744p6304B7354M45645n3392J2030J12385j43173r1280
$$ 677991 247008 471752 395448 27354 472999 419607 431637 544022 400849 309569
13639C09569K03227k1364l506J3548n2098j82007q7091M17209j26216J6964J66359
$$ 309569 512796 491432 487926 501474 449376 267369 180278 597487 471271 488235 654594
13628F54594K051A91438J92301k153k841J36502k00608K46045A67336J67634K01205
$$ 654594 656645 191438 383739 381586 378745 515247 314639 560684 167336 334970 536175
13617E36175B17868A2915K29608J8167J65260I9562L06566J8240J93782j69712
$$ 536175 217868 12915 242523 260690 425950 99562 406128 424368 618150 448438
13607D48438J31689B74066L46990j24141P3161B81837I7650N25714k82605L10260
$$ 448438 580127 274066 621056 496915 570076 281837 97650 623364 340759 651019
13597F51019j92036J05333A30043J18859K85432A16667L66248j22082j54063j01999
$$ 651019 458983 564316 130043 248902 534334 116667 482915 360833 206770 104771
13587A04771L05962j57742j23150J96951j44602J54023L98561k02289k15366Q8794
$$ 104771 410733 252991 129841 326792 182190 336213 734774 532485 317119 405913
13577D05913j81262k8718J83196l2952j01790R4871J03192A591L33657j42839
$$ 405913 224651 195933 379129 346177 244387 339258 442450 1591 335248 192409
13567A92409J21408j32180J31162K35210A48913o370K86344p2457a96620A68939
$$ 192409 313817 181637 312799 548009 148913 142543 428887 356430 -196620 168939
13556D18012K385A52672R0978J22953P4062F7697L75450k03220q449P4426J30828
$$ 418012 420397 152672 243650 366603 440665 67697 443147 239927 231478 305904 436732
13545D36732n2103r2456j26023L23091O7410h2498D26683e3493D36865j83936
$$ 436732 384629 292173 166150 489241 556651 -82498 426683 -53493 436865 252929
13535B52929a0596A70410F6678L75089D4353O07364l24538K46103p113B61303
$$ 252929 -10596 170410 66678 441767 44353 651717 327179 573282 566169 261303
13524B45439K25176k06210J43533D8417J29315L06897l6707q5736j37467E2731
$$ 245439 470615 264405 407938 48417 177732 484629 447922 362186 224719 52731
13513C40014P8796A64991K40468q9929K4665J47493E7618L33930J68582A2307
$$ 340014 418810 164991 405459 315530 340195 487688 57618 391548 560130 12307
13502E63093A34618R281C6805J54352E2183J41135C8402j1513h7788A55465E0524
$$ 563093 134618 143899 36805 191157 52183 193318 38402 26889 -87788 155465 50524
13490C25385M15687C43724q1811J41472p7813E4450K03268J72212A51739J68753
$$ 325385 741072 343724 261913 403385 325572 54450 257718 429930 151739 320492
13480C20492P1326J23065q2086I7454L17700A88947K11624j97852m2373K69387
$$ 320492 391818 514883 432797 97454 415154 188947 400571 202719 160346 429733
13470D29733f377I8705K52416n9266N7023L397A30341a4636A66497L61283j23514
$$ 429733 -6377 98705 351121 291855 348878 352275 130341 -14636 166497 527780 404266
13459D04266j87052r0438a71956D9215a13641B23475J85541A72435k6559J60550
$$ 404266 217214 126776 -171956 49215 -113641 223475 409016 172435 145876 306426
13449C06426L88245j82964O629A51357K19690b2077B5841K74118D6367b41112
$$ 306426 694671 511707 518336 151357 371047 -22077 25841 299959 46367 -241112
13438A13550M11822D062L02468F5002B0089K75605a939A66524K13038p5483j24215
$$ 113550 525372 4062 306530 65002 20089 295694 -1939 166524 379562 304079 179864
13427A79864q9671L07974p1514a7481A12330O7085K06475c1077B85170m2763N8366
$$ 179864 90193 398167 326653 -17481 112330 179415 385890 -31077 285170 242407 300773
13416C00773k6813A17150K65126r1361A13514J71397H3627J16423m2866M3885
$$ 300773 273960 117150 382276 290915 113514 284911 83627 200050 157184 201069
13406B01069R7342Q9323H1304K7617e4853A89305d1309D59303A10586k127i4058
$$ 201069 298411 387734 81304 108921 -54853 189305 -41309 459303 110586 108459 -94058
13394B74021M7573A18533J68966A23339L0545J17200m449M3562d6300H9167C3952
$$ 274021 321594 118533 287499 123339 153884 271084 266635 310197 -46300 89167 33952
13382B38079J01417G9993K72948j74483J26992P9256A38803M9979o9025C6715
$$ 238079 339496 79993 352941 178458 305450 384706 138803 188782 119757 36715
13371C17867A26211i2840A63171M59678k51615A62061L23246A89310D3454M04721
$$ 317867 126211 -92840 163171 622849 371234 162061 485307 189310 43454 448175
13361D48175L9816k11488J10584E4543K77151a26715C45023A11593L19310A69453
$$ 448175 487991 276503 387087 54543 331694 -126715 345023 111593 430903 169453
13350C3406L5444L15556j5608j73014J54584H1862K41483j04990J99461M9131
$$ 33406 68850 384406 368798 195784 350368 81862 323345 218355 417816 466947
13340D66947A96016K23884A24929K41241j43958N3530L3452R5184E8943j1078
$$ 466947 196016 419900 124929 366170 222212 275742 309194 404378 58943 47865
13330D7865o414J73087F6171K10056n2287R637K54965j11243a63140B03422H4409
$$ 47865 41451 214538 66171 276227 223940 233577 488542 377299 -163140 203422 84409
13318B74146J58163B04135J65424J67941a10300B1714L93442a88322H3123M1607
$$ 274146 432309 204135 369559 537500 -110300 21714 415156 -188322 83123 124730
13308A24730J4032q394Q7610M567q0384P4372G4825K71523j21287l0402J17829
$$ 124730 138762 130368 217978 222545 142161 216533 74825 346348 225061 194659 312488
13297C12488o3778a1150j30795H3148L41733c3742E1922J25949o4932K41092Q9645
$$ 312488 248710 -11150 -141945 83148 424881 -33742 51922 177871 112939 354031 443676
13286D43676I9710l1241J74234J02269i6720D12315a29699B76481a069A07035
$$ 443676 99710 68469 242703 344972 -96720 412315 -129699 276481 -1069 107035
13275g6437B85356P9748j30387p2676l4505f3833D04707d6434A02288M7874o1019
$$ -76437 285356 365104 234717 162041 127536 -63833 404707 -46434 102288 150162 89143
13264H9143a01295B8141M9579B5795J77566g7132A86133J44681a5762M215F9685
$$ 89143 -101295 28141 77720 25795 203361 -77132 186133 330814 -15762 -11547 69685
13252D35394A03387J89362a0464C53031A23405i869m721G2007J92180D5805O7246
$$ 435394 103387 292749 -10464 353031 123405 -9869 -14590 72007 264187 45805 113051
13241A13051K1597J64264e3811A39616L2002K1050o0470a30406F7321L55014a51806
$$ 113051 134648 298912 -53811 139616 171618 192668 132198 -130406 67321 422335 -151806
13229D6214J10843P6273g1214G9021J89005G9434q465a99094e6570A61975p5223
$$ 46214 157057 233330 -71214 79021 268026 79434 70969 -199094 -56570 161975 86752
13218H6752Q5887D9097K13634A07109O146l1637L8813J9756o0561b2237A2488
$$ 86752 172639 49097 262731 107109 113255 81618 120431 140187 79626 -22237 12488
13206b80719C64901A2860a25827G5072a09095B01958G2688k3307b43115B04910
$$ -280719 364901 12860 -125827 75072 -109095 201958 72688 49381 -243115 204910
13195A24290l2262L10344j53241a7395j7455A88006E5337a3398m523D13266j35185
$$ 124290 92028 402372 249131 -17395 -34850 188006 55337 -13398 -17921 413266 278081
13184B78081b33592A22200a36935e9398D0224j8937P9978m6915l319a32804a1604
$$ 278081 -233592 122200 -136935 -59398 40224 21287 101265 54350 51031 -132804 -11604
13172A28450b77176g7986A24308a54428A55492a35208B72201m7138r2431N3454
$$ 128450 -277176 -77986 124308 -154428 155492 -135208 272201 225063 132632 186086
13162A86086H306Q3994e0105A05769Q3806l3750G129a57560B0098K20155N0466
$$ 186086 8306 92300 -50105 105769 189575 155825 7129 -157560 20098 240253 290719
13151B90719b43150A82654M7049H6887k5393B6446i9226A4122f0734D2386J22517
$$ 290719 -243150 182654 229703 86887 61494 26446 -99226 14122 -60734 42386 164903
13140A64903i9456I5442a41685A01936l8994a86930B63682j09150b5904A20196
$$ 164903 -99456 95442 -141685 101936 62942 -186930 263682 154532 -25904 120196
13129B88513k7126p8318P9562j29844J9591E6796J13570D372J00161e736B77975
$$ 288513 261387 183069 262631 132787 152378 56796 170366 4372 104533 -5736 277975
13117c67012A32539J8842a14664k0269F3002B812J69204m9484f5556A49186J6835
$$ -367012 132539 151381 -114664 -134933 63002 2812 172016 122532 -65556 149186 166021
13106A66021c659j95983H9497a09756I0753J11857F0052c76485a35259A60668
$$ 166021 -3659 -199642 89497 -109756 90753 202610 60052 -376485 -135259 160668
13095E28625j70702A25386d2109H4310M2939K39104E7686a38493I9351j493b69167
$$ 528625 357923 125386 -42109 84310 127249 366353 57686 -138493 99351 97858 -269167
13083H8844a43824b4141k4522H68K19161a0584D83a62159A40848L32704a33613
$$ 88844 -143824 -24141 -48663 868 220029 -10584 483 -162159 140848 473552 -133613
13071A98771B1120f2847C69058f8608A01938J04602o5881J4016K36435r0735j24353
$$ 198771 21120 -62847 369058 -68608 101938 206540 140659 154675 391110 300375 176022
13060A76022a96115A73059f0344j4175F528P7008D434K20260e332D41628a69974
$$ 176022 -196115 173059 -60344 -74519 6528 83536 4434 224694 -5332 441628 -169974
13048H7297C5373a34381A27972K48283a69134h0902A76363k3439c0519l546B38826
$$ 87297 35373 -134381 127972 376255 -169134 -80902 176363 152924 -30519 -34065 238826
13036h0004A6957J63120n2865A4839K39111a19669A74235A3719a5462O623A90706
$$ -80004 16957 180077 127212 14839 253950 -119669 174235 13719 -15462 -8839 190706
13024a44297A95150q5348a12186j3238A79805c02271D578J35325K1182D5179J68209
$$ -144297 195150 109802 -112186 -125424 179805 -302271 4578 139903 161085 45179 213388
13013B13388c7785J857C0074J56775g1542M408B80126A14286J07309a90628J9627
$$ 213388 -37785 -35928 30074 186849 -71542 -67134 280126 114286 221595 -190628 -171001
13002a71001C74103a70450G2817A1930h4909d1048A52637h5414o2822B22793c2012
$$ -171001 374103 -170450 72817 11930 -84909 -41048 152637 -85414 -148236 222793 -32012
12990C76050B421K27886a0603B15323M6396H5144K87333a96579C7999a29265A40034
$$ 376050 2421 230307 -10603 215323 261719 85144 372477 -196579 37999 -129265 140034
12978a04513F4513R2592p404a57115A27498J86600q6118J11917F4712C0073K82590
$$ -104513 64513 157105 149701 -157115 127498 314098 227980 339897 64712 30073 312663
12967C12663b882q1222k2174k49129A35415P402a10398C1632P5709c4826k6878
$$ 312663 -2882 -84104 -106278 -355407 135415 142817 -110398 31632 107341 -34826 -61704
12956f1704A8060g3383j8032E27085d5986n3441F1880J84318a54841H0600K72921
$$ -61704 18060 -73383 -91415 527085 -45986 -99427 61880 246198 -154841 80600 353521
12945C53521a77449B0185a92016A36591e7013C00486d0678I5817e2675l02938
$$ 353521 -177449 20185 -192016 136591 -57013 300486 -40678 95817 -52675 -355613
12935c55613G7192b42617m1654c2118G9308i2446p3042G7911h0725C8729a27220
$$ -355613 77192 -242617 -284271 -32118 79308 -92446 -165488 77911 -80725 38729 -127220
12923a90551e3350j2644A57647o4074g8902C67365j47302a63675A48657J6501
$$ -190551 -53350 -65994 157647 93573 -78902 367365 220063 -163675 148657 165158
12913A65158a04923B75118Q4937D1091J46178g3657E9285L37730A7425a21363
$$ 165158 -104923 275118 360055 41091 187269 -73657 59285 397015 17425 -121363
12902h7633A76509f3722A18485P4875a3465A43960f2007I9932c47699A67968D1974
$$ -87633 176509 -63722 118485 193360 -13465 143960 -62007 99932 -347699 167968 41974
12890b68334A69834b10158A86682c6579q9730B78843A21551B5607K9004i3166
$$ -268334 169834 -210158 186682 -36579 -126309 278843 121551 25607 54611 -93166
12879A1193J16240c5014A7620Q0228j8377b28439A04907L71224B2512L72790A77594
$$ 11193 127433 -35014 17620 97848 79471 -228439 104907 476131 22512 395302 177594
12867A19084a78681a3386D6663b1488E0275e01016E6555i273j64961a5066q4145
$$ 119084 -178681 -13386 46663 -21488 50275 -501016 56555 -9273 -174234 -15066 -99211
12856i9211B32371i6209d2965B08035q6752a26979C4699c41659a14629N0047G5643
$$ -99211 232371 -96209 -42965 208035 121283 -126979 34699 -341659 -114629 -64582 75643
12844F1368J00926j5312j7513h360A94289R3971a03063l1686A03451a87775A59333
$$ 61368 162294 146982 129469 -8360 194289 288260 -103063 -134749 103451 -187775 159333
12832A73943a30083F9165J17585R8442J5336A23464o0411c41938A55196a13972
$$ 173943 -130083 69165 186750 285192 300528 123464 63053 -341938 155196 -113972
12821E2008b95845C91450E1607a16507G3518a32800B81801h4705j20655E5640
$$ 52008 -295845 391450 51607 -116507 73518 -132800 281801 -84705 -205360 55640
12810C75372A7472N8195P7589H426J41209a38185D749Q994K45475b24148F919
$$ 375372 17472 75667 153256 8426 149635 -138185 4749 13743 259218 -224148 6919
12798a05019j44485b9317A72859Q449D961a55557A27790b48495M7950A25338a81841
$$ -105019 -249504 -29317 172859 181308 4961 -155557 127790 -248495 -200545 125338 -181841
12786b05687E8415a70907P2706A50596n5773P9692b07678C6566f7088l7400A051
$$ -205687 58415 -170907 -98201 150596 94823 174515 -207678 36566 -67088 -104488 1051
12774a08084E5163f7028A53132n6472c15128A15561m7123k8642b7891a3503A62096
$$ -108084 55163 -67028 153132 96660 -315128 115561 68438 39796 -27891 -13503 162096
12762b0443B69459F7018a09126k98108B10418j01900a64232B07208o2638g6342
$$ -20443 269459 67018 -109126 -407234 210418 108518 -164232 207208 144570 -76342
12751B9313a18003H5763i4691m9892j43277c2929I9017c25215A4492a07915j33610
$$ 29313 -118003 85763 -94691 -144583 -287860 -32929 99017 -325215 14492 -107915 -241525
12740b41525K1611j99394B67593J29941q7849a77056B09505G6600a29774B32482
$$ -241525 -219914 -419308 267593 397534 309685 -177056 209505 76600 -129774 232482
12729A06504l0503K7396k6940i4172J3786B32887e2994A4791K25513H3217a12645
$$ 106504 76001 103397 76457 -94172 -80386 232887 -52994 14791 240304 83217 -112645
12717a60987O3964E8294B2586b9839B3396K81075C4433M5224e1507B49317J45929
$$ -160987 -97023 58294 22586 -29839 23396 304471 34433 79657 -51507 249317 395246
12706C95246p4526j47542K09331j09655R9851k0498F9637M8687A2234a38586E1487
$$ 395246 320720 173178 382509 272854 372705 352207 69637 118324 12234 -138586 51487
12694a17938K1666B64322H103M4439d1964A0383J5714k74d9870n6588B0279P3740
$$ -117938 -96272 264322 8103 52542 -41964 10383 26097 25823 -49870 -106458 20279 94019
12682I4019J19285b35332B50657a47579B63247a36352B88778b75752J09146I9207
$$ 94019 213304 -235332 250657 -147579 263247 -136352 288778 -275752 -166606 99207
12671H4959J87359i1319B47120j03493C6825g1938A26088m4846e6265C46034A28670
$$ 84959 272318 -91319 247120 143627 36825 -71938 126088 81242 -56265 346034 128670
12659A0203J74284b79A86619p4304N485g9775b8871p213l1528A60361a42360A60575
$$ 10203 184487 -279 186619 112315 117800 -79775 -28871 -36084 -67612 160361 -142360 160575
12646a55935A38247L84476H3942c16041D9821a9915k9448A61056A1527R3911a4591
$$ -155935 138247 522723 83942 -316041 49821 -19915 -49363 161056 11527 105438 -14591
12634A80893J60325A04905D1904J26792L93367k34368J00507j14808p7666J61152
$$ 180893 341218 104905 41904 168696 562063 327695 428202 313394 235728 396880
12624C96880f8672D6376K08485a06468A77896c2330G21936A38921i940A78410
$$ 396880 -68672 46376 254861 -106468 177896 -32330 721936 138921 -9940 178410
12613c6286B71307H1339a31721e2828D7948K41868A44052C0991d654n9303J2658
$$ -36286 271307 81339 -131721 -52828 47948 289816 144052 30991 -4654 -63957 -51299
12602e1299k3545o255A13934m2184c0203B73327f0939B88225B0678a32772G1536
$$ -51299 -74844 -81099 113934 71750 -30203 273327 -60939 288225 20678 -132772 71536
12590A65024a21853C9623a78367f702l5831j13366A88690a50884r6715C29220
$$ 165024 -121853 39623 -178367 -6702 -42533 -155899 188690 -150884 -247599 329220
12579b18425a8697D2391g9492c0075C29052p4267n4062J08890E6221b56944e2367
$$ -218425 -18697 42391 -79492 -30075 329052 254785 200723 309613 56221 -256944 -52367
12567a40933L6621m7802O2740n9005b5658A95177h157a29B47485q3760a93357
$$ -140933 -104312 -152114 -89374 -148379 -25658 195177 -8157 -129 247485 163725 -193357
12555A39282B6773a53079j25140A7980a91222A1142d4368C02942D0906f335F8456
$$ 139282 26773 -153079 -278219 17980 -191222 11142 -44368 302942 40906 -6335 68456
12543A71552K7459K9821h3787c9040l65219h2761B7218J28387b9538G8307M12308
$$ 171552 199011 228832 -83787 -39040 -404259 -82761 27218 155605 -29538 78307 490615
12532D90615a22589p18B53963a06046j58791J10574o1214A105P2167M8722K0737
$$ 490615 -122589 -123307 253963 -106046 -264837 -154263 -215477 1105 73272 121994 142731
12521A42731f5985I8360O2706A305R8792M4206K74939m0500D8972K10655A5843
$$ 142731 -65985 98360 161066 1305 100097 144303 419242 378742 48972 259627 15843
12509B15458J6355a80680K1639D75059C5902R6707B9865a58602A91763d5052C23233
$$ 215458 231813 -180680 -159041 475059 35902 132609 29865 -158602 191763 -45052 323233
12497f8495B53301A24325a20356A83016Q9814G664a10030a8607B45253a9345A42074
$$ -68495 253301 124325 -120356 183016 272830 7664 -110030 -18607 245253 -19345 142074
12485A74007J76350j23620R5905A9059P7623A7101b09699L9661E2452a32635A2484
$$ 174007 350357 226737 322642 19059 96682 17101 -209699 -170038 52452 -132635 12484
12473C46267F9595J65223a46289c5443k81982d9321C0114N0350b6069B53318b10163
$$ 346267 69595 234818 -146289 -35443 -317425 -49321 30114 80464 -26069 253318 -210163
12461a72220g0849D3257L62995A99222B4453f3680j42483f4705r3793l65341a75417
$$ -172220 -70849 43257 406252 199222 24453 -63680 -206163 -64705 -158498 -523839 -175417
12449A70410B4913K6406K00042J82882a41893D9914a94411C5746P2121c5797p846
$$ 170410 24913 51319 251361 434243 -141893 49914 -194411 35746 107867 -35797 -43643
12438d3643j95077l00884b07267a375A72375a91743n0117b6126k39293h2005F6724
$$ -43643 -238720 -539604 -207267 -1375 172375 -191743 -241860 -26126 -265419 -82005 66724
12426G3640m664b20483C05545e6641A47193C4603b78040c9607l72804A36083k0038
$$ 73640 68976 -220483 305545 -56641 147193 34603 -278040 -39607 -412411 136083 116045
12415A16045h6957E6072b63528d5757A28406b3624G3903a57622B4416a81573Q3010
$$ 116045 -86957 56072 -263528 -45757 128406 -23624 73903 -157622 24416 -181573 -98563
12404i8563A90751n1700c4888a948r0651a3168o9547m6321A88545f6247a906j09313
$$ -98563 190751 139051 -34888 -1948 -92599 -13168 -82715 -129036 188545 -66247 -1906 -111219
12392a11219E1590f7968A32818a47886C2330P8366I051J28999p74b48031g2919
$$ -111219 51590 -67968 132818 -147886 32330 110696 9051 138050 137276 -248031 -72919
12380A75531F4887c5959j56692R5701A75043o0607b4727A89942e3573N33B13812
$$ 175531 64887 -35959 -192651 -96950 175043 114436 -24727 189942 -53573 -53040 213812
12368A15538b23764a6045l13509C3118N7015g0202A11481O2911E1082L39532G5022
$$ 115538 -223764 -16045 -329554 33118 90133 -70202 111481 174392 51082 390614 75022
12356d08714a68499A96408b20366D80003c8545n8692k37788e1580C13337d3995
$$ -408714 -168499 196408 -220366 480003 -38545 -97237 -335025 -51580 313337 -43995
12345A71527L2456a21061j1785C56154g1171C3857A5174e3873b2417k17790f8663
$$ 171527 203983 -121061 -132846 356154 -71171 33857 15174 -53873 -22417 -240207 -68663
12333b95843C10029b91736A14306C608J40878A2824R9214g3397C1121a73213H0716
$$ -295843 310029 -291736 114306 3608 144486 12824 112038 -73397 31121 -173213 80716
12321A22349E0468b16314B84150j10400C8560J28392J57980K599C6899J42387
$$ 122349 50468 -216314 284150 173750 38560 166952 324932 327531 36899 179286
12311A79286O0641m7442d7705B1692I137c8289l00097P1292J14668j46564i9432
$$ 179286 239927 192485 -47705 21692 9137 -38289 -338386 -267094 -152426 -298990 -99432
12299A13536d3837k2603A17000d8496j93588C6723M7921b2950H2475A1305a2595
$$ 113536 -43837 -66440 117000 -48496 -242084 36723 84644 -22950 82475 11305 -12595
12287C11307J7203j07458j2641q3719c97651A37881a69336A53719c7736a91F3326
$$ 311307 328510 221052 208411 124692 -397651 137881 -169336 153719 -37736 -191 63326
12275C23a36407C86710A45484A8367M64829G9199c6355J2169l1771B37440a49522
$$ 323 -136407 386710 145484 18367 483196 79199 -36355 -24186 -55957 237440 -149522
12263A21703j3143B2484Q2430J4154a025j97097E8710b5488A60335I513a20882
$$ 121703 108560 22484 104914 119068 -1025 -198122 58710 -25488 160335 9513 -120882
12251C28406e7344B20562d0167B9509Q6215J33819b3017B48388q0354p1625f5132
$$ 328406 -57344 220562 -40167 29509 115724 249543 -23017 248388 168034 96409 -65132
12239A03998K18989A54292J5560j7017A4634h1011A9374J91363a86074C03798
$$ 103998 322987 154292 169852 152835 14634 -81011 19374 210737 -186074 303798
12228A41229C7399K12811A01140J8666L8045J59409J2698A31898P9384F9689K0504
$$ 141229 37399 250210 101140 119806 157851 317260 329958 131898 211282 69689 90193
12217I0193L6793J13622a13054C03302I5877b36949C20928e5608C04175K54887
$$ 90193 126986 240608 -113054 303302 95877 -236949 320928 -55608 304175 559062
12207E59062I4947K62077H8152K97804D908K68723b557B21745J7360J04145G0540
$$ 559062 94947 357024 88152 385956 4908 273631 -2557 221745 239105 343250 70540
12195A73748J21066R6976A8954K11666R2036G4562M9218J96986b1080A99025a18940
$$ 173748 294814 391790 18954 230620 322656 74562 123780 320766 -21080 199025 -118940
12183B63393A12461n547J25482g21k6047B4075L6292j4338N09575C0042L89610
$$ 263393 112461 106914 232396 -721 -26768 24075 60367 46029 555604 30042 419652
12172D19652A06814P6218n5058d8742E91104A12077K48162b54463D53097A08408
$$ 419652 106814 183032 127974 -48742 591104 112077 360239 -254463 453097 108408
12161g1780A27687J42779A23624L0212b35560r1641g9394a2274k19406a6730f127
$$ -71780 127687 270466 123624 153836 -235560 -327201 -79394 -12274 -231680 -16730 -6127
12149c1255A46479b96593D1383P562N1443c04546A40162b11310G2464K25591L15081
$$ -31255 146479 -296593 41383 48945 100388 -304546 140162 -211310 72464 298055 613136
12138F13136A00923b12262B5828f3213J6939B4770K1619K64274e9627b2858A83192
$$ 613136 100923 -212262 25828 -63213 -46274 24770 46389 310663 -59627 -22858 183192
12126E2094P0275J77864B1538J93624A04045J72040c2163C72068A4716J95949
$$ 52094 122369 300233 21538 215162 104045 276085 -32163 372068 14716 210665
12116B10665G238J82343d1945A64442P0568K13849a88607A67157J30271h9855
$$ 210665 7238 189581 -41945 164442 235010 448859 -188607 167157 297428 -89855
12105H5067d6870D8513R9932c27121a53053A00985J01539a27680j07333e1134
$$ 85067 -46870 48513 148445 -327121 -153053 100985 202524 -127680 -235013 -51134
12094E1399h3735A10965B4211b92919f666C67124e3483C0170h428n9984A42470
$$ 51399 -83735 110965 24211 -292919 -6666 367124 -53483 30170 -8428 -68412 142470
12082c64163B73942F9179C890M9152f6230k26796f3428A44818h5714I462i8838
$$ -364163 273942 69179 3890 53042 -66230 -293026 -63428 144818 -85714 9462 -98838
12070D14841D8021J72563c0664A24310L9931J13055D2031c4080A03768a82027
$$ 414841 48021 220584 -30664 124310 164241 277296 42031 -34080 103768 -182027
12059B95862K90184M04457N36173p57685B1746K67534A05e0822B69870D4000a52031
$$ 295862 586046 990503 1526676 768991 21746 289280 105 -50822 269870 44000 -152031
12047b51302A8096K8323h2248A91295M661E3408a7621D5594q561a74577F2397
$$ -251302 18096 46419 -82248 191295 195956 53408 -17621 45594 37033 -174577 62397
12035i8048j34972i9898j74894J36902B82720a45685N1340A23853a57704c29D9237
$$ -98048 -233020 -99898 -274792 -137890 282720 -145685 -94345 123853 -157704 -329 49237
12023C3336a37889A00872d545J606B25593c2831k08165d1567B09003Q1599A02330
$$ 33336 -137889 100872 -4545 -2939 225593 -32831 -240996 -41567 209003 290602 102330
12011c08833f7890j27828P7320F7987c06458A10518a74032L9621O4612m3521F8566
$$ -308833 -67890 -195718 -118398 67987 -306458 110518 -174032 -134411 -69799 -113320 68566
11999A15847M1803j2648a14122o4177f1589m5218n8857J8560L7461I3897c05311
$$ 115847 157650 145002 -114122 -178299 -61589 -106807 -165664 -147104 -109643 93897 -305311
11987I9040a14177A31974Q3126b20680B70504c0960n7068l50185E6073j4675P1896
$$ 99040 -114177 131974 215100 -220680 270504 -30960 -88028 -438213 56073 41398 113294
11976A13294J15476o032b2040k36485A84230c73756A30366j3076K52530g80j47708
$$ 113294 228770 222738 -22040 -258525 184230 -373756 130366 117290 369820 -780 -148488
11965a48488B09022k9107a82006A06476K5877a77894J4913M7465b6238I9701K0211
$$ -148488 209022 179915 -182006 106476 132353 -177894 -162981 -115516 -26238 99701 119912
11954A19912N5262G9149a19843E4207h0403b9319A04206K02439h6091D640K74621
$$ 119912 175174 79149 -119843 54207 -80403 -29319 104206 306645 -86091 4640 279261
11943B79261A26085l7252C3745J81082e2643d902l2584A10033J59092f5308A98282
$$ 279261 126085 88833 33745 214827 -52643 -4902 -37486 110033 269125 -65308 198282
11931C5978J55739C5595O059b7679A71695n994c29261m881J42379j94512A57735
$$ 35978 191717 35595 41654 -27679 171695 165701 -329261 -334142 -191763 -386275 157735
11919B71727a02465A31463d71818A32176e07899B5559c47718G5016i7877i430
$$ 271727 -102465 131463 -471818 132176 -507899 25559 -347718 75016 -97877 -9430
11908A9584f168m9998C21202a87734B71912b2386I6041e0659A25542a53399A51819
$$ 19584 -6168 -56166 321202 -187734 271912 -22386 96041 -50659 125542 -153399 151819
11896b43772f6859n6914E1704K64211b81576o4004a66279P3641m240n0832P1124
$$ -243772 -66859 -123773 51704 315915 -281576 -345580 -166279 -92638 -96878 -147710 -76586
11885g6586r5801B58057j13025c7740j32683B00632C6702a41768A90311b4088
$$ -76586 -172387 258057 145032 -37740 -170423 200632 36702 -141768 190311 -24088
11874G6411c8791B91594c01496B4723K62447F1996b37264O888I6835c20820E8995
$$ 76411 -38791 291594 -301496 24723 287170 61996 -237264 -230376 96835 -320820 58995
11862F8646e2952h804k92076a13176r6435j57065J20299k6952a32933L8229j35415
$$ 68646 -52952 -8804 -300880 -113176 -209611 -366676 -246377 -273329 -132933 -94704 -230119
11851b30119P2060n2852d1985B84697C3932L156a62795C6330K7194M8538b02486
$$ -230119 -158059 -210911 -41985 284697 33932 37088 -162795 36330 63524 112062 -202486
11839A64809a74169C86890a57681n6968g5396D8922M1261a86690f0734o4033j96839
$$ 164809 -174169 386890 -157681 -214649 -75396 48922 90183 -186690 -60734 -124767 -321606
11828c21606B9454c39533a33745M1076B3094b54502B39697A1005Q3583Q5820G2993
$$ -321606 29454 -339533 -133745 -92669 23094 -254502 239697 11005 94588 180408 72993
11816D0085d62995b18120B23571a7524k1926G9527i4061m6908A80067a37865G4652
$$ 40085 -462995 -218120 223571 -17524 -39450 79527 -94061 -140969 180067 -137865 74652
11804b33222a16545j45563A12871a01641r3013d7237A95698a71788e9587r5917
$$ -233222 -116545 -262108 112871 -101641 -194654 -47237 195698 -171788 -59587 -155504
11794a55504A1577J5040c6319A8957R6228m4223K34973b95024c6026G5933K69208
$$ -155504 11577 26617 -36319 18957 115185 70962 305935 -295024 -36026 75933 345141
11783C45141H880g1457A36540e1136I5104E593b87857a18995N7804B7387f1214
$$ 345141 8880 -71457 136540 -51136 95104 5593 -287857 -118995 -61191 27387 -61214
11771g0024A36834D8606J72676d5507j93291b294j69084P1322A17415c3632G4167
$$ -70024 136834 48606 221282 -45507 -238798 -2294 -171378 -100056 117415 -33632 74167
11759D6339O5155a22734A18718a24583A47931p107a59952B09013a1773A43913
$$ 46339 111494 -122734 118718 -124583 147931 140824 -159952 209013 -11773 143913
11748i7686C9255L11736E3887b16233f6199K2783I8935J99018C1759a74470g8269
$$ -97686 39255 350991 53887 -216233 -66199 -43416 98935 297953 31759 -174470 -78269
11736a90031P2268I2669K68465a07049A05224C6695O7171l0747L7543a08353d3419
$$ -190031 -117763 92669 361134 -107049 105224 36695 103866 73119 110662 -108353 -43419
11724H5903C3436f5206m6754A66545L1675O88a8081L50B79443J09081b78837A71960
$$ 85903 33436 -65206 -111960 166545 198220 198908 -18081 -17731 279443 388524 -278837 171960
11711A82362a948p3565A02788Q9661D91g8727B60761M1112C7215M53383b2846
$$ 182362 -1948 -75513 102788 192449 491 -78727 260761 301873 37215 490598 -22846
11699c8874A22870J20718D4232a38662H2301b17682B62919a89463A08927a98251
$$ -38874 122870 243588 44232 -138662 82301 -217682 262919 -189463 108927 -198251
11688a31338B36847b49116a05140j94925g0853I7354P9497A6082g8298k3072C88669
$$ -131338 236847 -249116 -105140 -300065 -70853 97354 176851 16082 -78298 -101370 388669
11676c27600R8318A4734g018A27129A1775J98883a55811L9904e2202E6660f9912
$$ -327600 -229282 14734 -7018 127129 11775 210658 -155811 -115907 -52202 56660 -69912
11664C6305d1604k69830A37692e0178F9320J7668a27835j14517L4456D19048b44090
$$ 36305 -41604 -311434 137692 -50178 69320 86988 -127835 -242352 -207896 419048 -244090
11652a40382E63172A27909a63574A82711J46355A20087a00827B84284H7965a11900
$$ -140382 563172 127909 -163574 182711 329066 120087 -100827 284284 87965 -111900
11641a38785R435D0595h6135B03909E9547c87757a01308B37129F1550a05485C5821
$$ -138785 -129350 40595 -86135 203909 59547 -387757 -101308 237129 61550 -105485 35821
11629E544f3649m7861H5686G518Q9571a17254A67001R95l1559a69013f2070p9056
$$ 5544 -63649 -111510 85686 7518 97089 -117254 167001 167996 136437 -169013 -62070 -141126
11617a41126c2484A87550e6527A49972a87241o7063a6209A44549b12456P3547
$$ -141126 -32484 187550 -56527 149972 -187241 -254304 -16209 144549 -212456 -138909
11607a38909C4513L65204j84097a2963G6487N8729a62795B99016C6265b16948
$$ -138909 34513 399717 215620 -12963 76487 135216 -162795 299016 36265 -216948
11596B30654D1981O284a06343j59098A62437c12161F6943R1576N1410I245L5514
$$ 230654 41981 48265 -106343 -265441 162437 -312161 66943 158519 209929 9245 44759
11585D4759f9259K2970D0921a24397B79685j16318K2856C0402J18410R9350a19126
$$ 44759 -69259 -46289 40921 -124397 279685 163367 186223 30402 148812 248162 -119126
11573A46427M0841h5133l5952H1776j3887d6899A47921l7963M7332E6999f982
$$ 146427 187268 -85133 -121085 81776 67889 -46899 147921 109958 157290 56999 -6982
11561A60131b6289j36869N8668j7807H8310a55891I507Q1875c22111B7886K7860
$$ 160131 -26289 -163158 -104490 -122297 88310 -155891 9507 91382 -322111 27886 55746
11550E5746q876K08601a64969A76228l8256A281K89705A09397J26755C8686e27
$$ 55746 46870 255471 -164969 176228 137972 1281 290986 109397 236152 38686 -527
11538b00464K6816B17718g5650A69431j693J56063p5872D6238a08372J1025B02654
$$ -200464 -173648 217718 -75650 169431 167738 323801 247929 46238 -108372 -97347 202654
11526D34865D5445g553D8543R3482J7047D1256M54040e02A68331O9034j3714a4809
$$ 434865 45445 -7553 48543 142025 159072 41256 495296 -502 168331 237365 223651 -14809
11513A70577g1088A83136A1583a81213B18638r114n6194n815a78620A09857K0088
$$ 170577 -71088 183136 11583 -181213 218638 209524 153330 147515 -178620 109857 129945
11502A29945J20766H7246J47524n813D9625J25924F8189a19125A99737J55956
$$ 129945 250711 87246 234770 228957 49625 175549 68189 -119125 199737 355693
11492C55693G0236c26p4694H3728K35040F3461J21332Q4572B3613L13000m7846
$$ 355693 70236 -326 -75020 83728 318768 63461 184793 269365 23613 336613 288767
11481B88767L6647l3222R0064A65194R8224d5697A94056b70674a30005D58645
$$ 288767 325414 292192 382256 165194 263418 -45697 194056 -270674 -130005 458645
11470B58385k0256n6682E0321J58259l878L65743B81540H6810L21911D2636J36572
$$ 258385 238129 181447 50321 208580 204702 570445 281540 86810 408721 42636 179208
11459A79208K1821G5756f476F5207J55361P0569L8073a84586B36199J34655f9596
$$ 179208 201029 75756 -6476 65207 220568 291137 329210 -184586 236199 370854 -69596
11447B35305b11354F6577k5769P095j5110J03803e9219B30686o6061a10794A04101
$$ 235305 -211354 66577 40808 47903 32793 136596 -59219 230686 164625 -110794 104101
11435h8367B02020a44405a8503j69684A38994B1107a66960j780c7016j3001C65226
$$ -88367 202020 -144405 -18503 -188187 138994 21107 -166960 -168740 -37016 -50017 365226
11423H9134J9324J8399q677a08532A79480I178J87352f9061j54177D7182K73912
$$ 89134 108458 126857 118180 -108532 179480 9178 196530 -69061 -223238 47182 321094
11412C21094A00128m5532d6599K1098r5008j34218B2724P1428r612a98433B85386
$$ 321094 100128 54596 -46599 -25501 -120509 -254727 22724 94152 84540 -198433 285386
11400C86427b4663H5203A7111a12034a3662A06182a15942a195F0889a29687r3415
$$ 386427 -24663 85203 17111 -112034 -13662 106182 -115942 -1195 60889 -129687 -223102
11389b23102j8208E12396E8671K43693c3298B9920L5265a39787k46394G288J29778
$$ -223102 -241310 512396 58671 302364 -33298 29920 65185 -139787 -386181 7288 137066
11378A37066a69765C20875e7050A40663E6252K70327a64141c5702D8308j3871
$$ 137066 -169765 320875 -57050 140663 56252 326579 -164141 -35702 48308 34437
11368C4437a7591k09G2969c03712C06499D1956L37271a61502e5420D36648h3269
$$ 34437 -17591 -17800 72969 -303712 306499 41956 379227 -161502 -55420 436648 -83269
11356c1153l28737B36654C3786b20206I2325L29183b3137j16365A49004l5873
$$ -31153 -359890 236654 33786 -220206 92325 421508 -23137 -139502 149004 113131
11346A13131a19705B3549a34871j46141K395D1437M80447a48064M8267B99779
$$ 113131 -119705 23549 -134871 -281012 -278617 41437 521884 -148064 -99797 299779
11335a90816J4401A04657b7419d042o0847A09411a05805A83370A1887c6903k2723
$$ -190816 -176415 104657 -27419 -4042 -64889 109411 -105805 183370 11887 -36903 -59626
11324e9626j27083j25823C0433R0501K6093f1320j86059C02042D6058Q4768l7879
$$ -59626 -186709 -312532 30433 120934 147027 -61320 -247379 302042 46058 130826 92947
11313I2947b00607C24967a35214c6917j19461A46105a73118J2338E9085a43150
$$ 92947 -200607 324967 -135214 -36917 -156378 146105 -173118 -160780 59085 -143150
11302B4039J225K7304d57767A14697a91361b6389A32919J23144b78696B06871
$$ 24039 25264 52568 -457767 114697 -191361 -26389 132919 256063 -278696 206871
11291A54730f6889o0033k7953A31864B3695J78863b9127A7008L8719d8975o8589
$$ 154730 -66889 -126922 -154875 131864 23695 202558 -29127 17008 55727 -48975 -117564
11280a17564A42260F8478b34120Q2968D3137a35067A87243H2065B4365d1539R691
$$ -117564 142260 68478 -234120 -151152 43137 -135067 187243 82065 24365 -41539 -31848
11269c1848r7410r0042I3577c5814k1304j0210B4483L6860O1151a46532G2884
$$ -31848 -129258 -219300 93577 -35814 -57118 -67328 24483 61343 122494 -146532 72884
11257a23215C4009f5085I5493C8173a43788B04304H6833B1947a64843P9922j94452
$$ -123215 34009 -65085 95493 38173 -143788 204304 86833 21947 -164843 -84921 -279373
11246b79373h6578C88992f8319o8068k79254J00530A3826a4657A9743a25621n2953
$$ -279373 -86578 388992 -68319 -136387 -415641 -315111 13826 -14657 19743 -125621 -178574
11235a78574c1483l27636H5063e6900F6132c28611d6993k35243O5236a8966m3704
$$ -178574 -31483 -359119 85063 -56900 66132 -328611 -46993 -282236 -217000 -18966 -62670
11224f2670E670J01521a11702c8643j23735j24662B432K94515i0816D5055J06221
$$ -62670 5670 107191 -111702 -38643 -162378 -287040 2432 296947 -90816 45055 151276
11213A51276J302p4245f4211B39245a59031A9746b32320Q5998a4865A01458a13121
$$ 151276 152578 78333 -64211 239245 -159031 19746 -232320 -146322 -14865 101458 -113121
11201A99366c8150C8919e51187A73715G2934D361b7329m8741l79136a01791B0518
$$ 199366 -38150 38919 -551187 173715 72934 4361 -27329 -76070 -455206 -101791 20518
11189c00245e4145j61770J01301r2705P3612G3177b11745B26512b44772b3215
$$ -300245 -54145 -215915 -114614 -207319 -133707 73177 -211745 226512 -244772 -23215
11178A3407a99016A57805B7058c54849h2252A20596a9076B33312f1902A82155
$$ 13407 -199016 157805 27058 -354849 -82252 120596 -19076 233312 -61902 182155
11167H0805J650a89025r6966d6983A60705f1156O974A12332a40199J3119c7628
$$ 80805 82455 -189025 -285991 -46983 160705 -61156 -54182 112332 -140199 -127080 -37628
11155a54850F0119d3416B31454E1266h266F9561b50262j30709J9503f3565F7246
$$ -154850 60119 -43416 231454 51266 -8266 69561 -250262 -380971 -361468 -63565 67246
11143b87241g8305A09237E1675b97279K6861A41707L2573p7244M4396R7269B085
$$ -287241 -78305 109237 51675 -297279 -270418 141707 174280 97036 141432 238701 2085
11131A17654a9120j26446A45993E903M3836b00463A33447a097C41853A43191a7353
$$ 117654 -19120 -145566 145993 5903 49739 -200463 133447 -1097 341853 143191 -17353
11119A5284d2086B85175O7762A60963E0096J9300J22541a05973A45725a07388
$$ 15284 -42086 285175 352937 160963 50096 69396 191937 -105973 145725 -107388
11108a61246C77682A10765L2438J32221J78580I1275J31281k473D3199O2886J65629
$$ -161246 377682 110765 143203 275424 454004 91275 222556 220083 43199 106085 271714
11097B71714J8243A35472p774J26523M9714n9566J94595j53637K47585B38062
$$ 271714 289957 135472 127698 254221 303935 244369 438964 285327 532912 238062
11086A23486b13227C11683r673L3737j40018O6341J87352A71901r277J07783N8190
$$ 123486 -213227 311683 302010 335747 195729 262070 449422 171901 162624 270407 328597
11075C28597J18681M2443j66832J16217q1810K1627Q3721j25646K90355j19419
$$ 328597 447278 489721 322889 439106 357296 378923 462644 336998 627353 507934
11065E07934A51411R4582O69905k88171j72910L37746k92899q089J43080K85962
$$ 507934 151411 245993 915898 627727 454817 792563 499664 491575 634655 920617
11055I20617J0136k78709K24798j75190n9644N02062j65724J65269n3525R944
$$ 920617 930753 652044 876842 701652 642008 1144070 978346 1143615 1090090 1100034
11045A100034L26596o74976K55542K14519l52769K91375N8912l58347L21082j54657
$$ 1100034 1426630 751654 1007196 1221715 868946 1160321 1219233 860886 1181968 1027311
11035A027311r3305n3029j69386L4459K48117k78070K9761k456j12576J18275
$$ 1027311 934006 880977 711591 746050 994167 716097 745858 743402 630826 749101
11025G49101k21047N56567j83055R4175k87334K05324q0500j9773j84515K81294
$$ 749101 528054 1084621 901566 995741 708407 913731 833231 813458 628943 910237
11015I10237k6204l87360N33998r5194k36922k3293K74530k56115k22886M02200
$$ 910237 884033 496673 1030671 935477 698555 675262 949792 693677 470791 872991
11005H72991l8566j12294N59920k90474j73919n3389K72600l73594N43016m7595
$$ 872991 834425 722131 1282051 991577 817658 764269 1036869 663275 1206291 1158696
10995A158696m87131L37648k2329n6238r9889J13618R9486R6444k27051j5224
$$ 1158696 671565 1009213 986884 930646 830757 944375 1043861 1140305 913254 898030
10985H98030N13657m4016k15583J03633O0429K43844J06191K52976o3586L14994
$$ 898030 1411687 1367671 1152088 1255721 1316150 1559994 1666185 1919161 1855575 2170569
10975B170569K43372N08010Q4176N39527M5476L30935K95860l56497J29349m29892
$$ 2170569 2413941 2921951 3006127 3545654 3591130 3922065 4217925 3861428 3990777 3560885
10965C560885n74595n79894J34728l08530p24920J05467N4229k79348J64955J09941
$$ 3560885 2986290 2406396 2541124 2232594 1507674 1613141 1667370 1388022 1552977 1662918
10955A662918k76208k744K94936o21493k34641k04896N7407k35617L815M4481
$$ 1662918 1386710 1383966 1678902 1057409 822768 617872 675279 439662 443477 487958
10945D87958p7876A90992M22541A08152M48472k40127K1904J3826j57160L50765
$$ 487958 410082 190992 613533 108152 556624 316497 338401 352227 195067 545832
10935E45832B11429q6338K51798i0012C41857j45731P4652b35422d4780R135r5722
$$ 545832 211429 125091 376889 -90012 341857 196126 270778 -235422 -44780 -35645 -131367
10924a31367G3306a15445A92329a58227P998A21352J9105J47713j18407a09058
$$ -131367 73306 -115445 192329 -158227 -150229 121352 140457 288170 169763 -109058
10913a39093p32N4741j43708N4722M9463d9009A97394b19496p3008G4232i7489
$$ -139093 -139825 -85084 -228792 -174070 -124607 -49009 197394 -219496 -292504 74232 -97489
10901e7310j44272A21022E9737J31199c5435A6925a3930p9925A28247K1568a1455
$$ -57310 -201582 121022 59737 190936 -35435 16925 -13930 -93855 128247 149815 -11455
10889I0059J03237G3449b64352A10412a96760E5558J67387a46966C92395b81111
$$ 90059 193296 73449 -264352 110412 -196760 55558 222945 -146966 392395 -281111
10878d40540a49050E7488b63087h1583K7408A46456a93577E4717J40082g0057
$$ -440540 -149050 57488 -263087 -81583 -54175 146456 -193577 54717 194799 -70057
10867a7077p0540p7266d7066l2712a3496G7686r148l1075h0390C3930e3705H1229
$$ -17077 -87617 -164883 -47066 -79778 -13496 77686 68538 37463 -80390 33930 -53705 81229
10854c72836A94243g8573c2023C6700J98776A138J00313B3945c45864a14907A71616
$$ -372836 194243 -78573 -32023 36700 235476 1138 101451 23945 -345864 -114907 171616
10842a42741j21479Q2707A06622e0294A62375A0922a67244M6905K9686q5260g1006
$$ -142741 -264220 -181513 106622 -50294 162375 10922 -167244 -120339 -90653 -175913 -71006
10830d8880j21549L8790A0955K54184E978i4303j31750M0896G1826a24328F0892
$$ -48880 -170429 -131639 10955 265139 5978 -94303 -226053 -185157 71826 -124328 60892
10818c58966B86670a54970A40006a37805A34227a41133j3590P837O5444r4404
$$ -358966 286670 -154970 140006 -137805 134227 -141133 -154723 -146886 -81442 -175846
10808a75846c1260k48169J35361O6I4269b9382A73062k7199b5987F1466J86400
$$ -175846 -31260 -279429 -144068 -144002 94269 -29382 173062 145863 -25987 61466 247866
10797B47866e1776j16338B80925a94153h0182m4461j50835d4515H4960h2464J4279
$$ 247866 -51776 -168114 280925 -194153 -80182 -124643 -275478 -44515 84960 -82464 -68185
10786f8185I3816J10465a47368F3673K53346A29477b1354B63422a6002B16186
$$ -68185 93816 204281 -147368 63673 317019 129477 -21354 263422 -16002 216186
10775b35020p5400g0199E3598J32754E5543L7326e4827l3333A00584M5540a1195
$$ -235020 -310420 -70199 53598 186352 55543 92869 -54827 -88160 100584 146124 -11195
10763e0038j87216D7346a08882j67609d5490k40154A15440b1531k22479N9546
$$ -50038 -237254 47346 -108882 -276491 -45490 -285644 115440 -21531 -244010 -184464
10753a84464I8323A4191d8251B2789J67199a97594G1497J45524H2890J0510b46275
$$ -184464 98323 14191 -48251 22789 189988 -197594 71497 217021 82890 93400 -246275
10741A02132c65565A01657a39653a047j02829J5902A06912a85062P7368j03305
$$ 102132 -365565 101657 -139653 -1047 -103876 -87974 106912 -185062 -107694 -210999
10731b10999O457k4535b5268D281a38800A23168b60968g1568o8025r8294G1710
$$ -210999 -204542 -229077 -25268 4281 -138800 123168 -260968 -71568 -139593 -237887 71710
10719a2204p2955A41835g0071H1343a54007B07100g2890K9596l32534e8425B59103
$$ -12204 -85159 141835 -70071 81343 -154007 207100 -72890 -43294 -375828 -58425 259103
10707a17959C5434d95920a62413k61336g3909k33502g2272d145k69428Q4269m0511
$$ -117959 35434 -495920 -162413 -423749 -73909 -307411 -72272 -4145 -273573 -189304 -229815
10696b29815C07064a28125l21026g5135k8870e238C0280C276b56365A70521i9156
$$ -229815 307064 -128125 -449151 -75135 -104005 -5238 30280 3276 -256365 170521 -99156
10684b64075D7891b96037F1831i7333R188B32049K27533A70506a36592P493k01567
$$ -264075 47891 -296037 61831 -97333 -88145 232049 459582 170506 -136592 -129099 -330666
10673c30666H9322l5869J30173l3498a35136e6208K5723A28005a88888B0097a14799
$$ -330666 89322 53453 183626 150128 -135136 -56208 -30485 128005 -188888 20097 -114799
10661A8288m879a52810L4095b1809C1075b27520i8525E3705K7117R4222b11691
$$ 18288 13409 -152810 -118715 -21809 31075 -227520 -98525 53705 80822 175044 -211691
10649A36793a20140C50929D5110a59640j01880a23848A82713F1432P0374g8517
$$ 136793 -120140 350929 45110 -159640 -261520 -123848 182713 61432 131806 -78517
10638c02688a34285L5063B76660b77602i5395B24655P73c96939i0981n858B05982
$$ -302688 -134285 -99222 276660 -277602 -95395 224655 225428 -396939 -90981 -96839 205982
10626A37151a4163H009e104o4603n4644N6529A22950a18440L3889c5095D25307
$$ 137151 -14163 8009 -5104 -69707 -124351 -67822 122950 -118440 -84551 -35095 425307
10614A01024a6462l299B1124b89068B8677g8448B77836D3124Q3008i1147A47752
$$ 101024 -16462 -19761 21124 -289068 28677 -78448 277836 43124 126132 -91147 147752
10602A10457k7755i3967m5086f4125k03364D33044j87431b45132K4885F3607b94968
$$ 110457 82702 -93967 -139053 -64125 -267489 433044 245613 -245132 -220247 63607 -294968
10590a81882e9366k10379B0691J71254a52223O6975m7401n0542G0367b1510a65
$$ -181882 -59366 -269745 20691 191945 -152223 -85248 -132649 -183191 70367 -21510 -165
10578c71767E7431B19L45004f1078j55576p1941R1947k30807b782B39592c00923
$$ -371767 57431 219 345223 -61078 -216654 -288595 -196648 -427455 -2782 239592 -300923
10566a03949k84093i5057d29A31211M058a41288C13911C0206b95763H2874b90986
$$ -103949 -388042 -95057 -429 131211 135269 -141288 313911 30206 -295763 82874 -290986
10554A42395L0414a15137A37390J26990o4503e2931J3447B153J76087D4752b3089
$$ 142395 172809 -115137 137390 264380 199877 -52931 -39484 2153 178240 44752 -23089
10542A80736a581l704F6032c53185J46071j45041d0750I6463K770A0756a26570
$$ 180736 -1581 -5285 66032 -353185 -207114 -352155 -40750 96463 99233 10756 -126570
10530f09I1556a8605l24810E5576a16894K1169D597R0353a23242A77005d86458
$$ -609 91556 -18605 -343415 55576 -116894 -95725 4597 94950 -123242 177005 -486458
10518a76290C4366b91712n2182B3599b51644A76269b48864B61836h8829A83137
$$ -176290 34366 -291712 -343894 23599 -251644 176269 -248864 261836 -88829 183137
10507b24568M2472j0690R1633k51849A096a30575j24791A6175J45326d4504j37852
$$ -224568 -182096 -192786 -101153 -353002 1096 -130575 -255366 16175 161501 -44504 -182356
10496a82356g4136r8481j32851J14914I7632K24981j17006m0877B3217R7925c601
$$ -182356 -74136 -172617 -305468 -190554 97632 322613 205607 164730 23217 121142 -3601
10484D5022c39875A64721o5926b1516k6064A57817J93929b24104D50135A19939
$$ 45022 -339875 164721 98795 -21516 -47580 157817 351746 -224104 450135 119939
10473f5008A62518a03836B06535H5898c99426g2671A75250K4601c15185D3606
$$ -65008 162518 -103836 206535 85898 -399426 -72671 175250 199851 -315185 43606
10462a37030K4704G1267g0716K4832P938H1666b39770e7154j2864k1457B42295
$$ -137030 -112326 71267 -70716 -45884 -37946 81666 -239770 -57154 -70018 -91475 242295
10450B91861a37306J1705j74340c176p6219a2321p2847k99677C45584d8049D6628
$$ 291861 -137306 -125601 -299941 -3176 -79395 -12321 -85168 -384845 345584 -48049 46628
10438H7134k0716b33002h9746h171B22154A06733l8284a85752C11098A37684D3274
$$ 87134 66418 -233002 -89746 -8171 222154 106733 68449 -185752 311098 137684 43274
10426a54645B9967C004R50K33395A17554L4835f3102J9952j38988R420a4637C22385
$$ -154645 29967 3004 3954 237349 117554 152389 -63102 -43150 -182138 -172718 -14637 322385
10413D2874d9412C33865p1572d2087l2138A6827J6383a86266K8506j56646A16938
$$ 42874 -49412 333865 262293 -42087 -74225 16827 33210 -186266 -157760 -314406 116938
10401h3906k65965J63626n0316j71756a07837B42211F599P6839J48716i3277D79212
$$ -83906 -349871 -186245 -236561 -408317 -107837 242211 6599 83438 232154 -93277 479212
10389D42570A13704j8550K09476J327D2216M1343b1370B77267j20316Q1464J48044
$$ 442570 113704 95154 304630 305957 42216 83559 -21370 277267 156951 238415 386459
10378C86459G1872L07829j13651I3673J50561K55658k14381K21293H7520a17979
$$ 386459 71872 379701 266050 93673 244234 499892 285511 506804 87520 -117979
10367D80217k20765K69327J59678o2222J18936C68391J17875B24179J12599j13612
$$ 480217 259452 528779 688457 626235 745171 368391 486266 224179 336778 223166
10357B23166M8105n8211b4068C74220j21246L54318N2659L28720r7809l97886
$$ 223166 271271 213060 -24068 374220 252974 607292 659951 988671 890862 492976
10347D92976J611j05362J62273A52078K17711A83878J66916H4665L24904K8288
$$ 492976 494587 389225 551498 152078 369789 183878 350794 84665 409569 437857
10337D37857l7409n743E0451M60541F4800M003O3881L9794P7478A06735h9090
$$ 437857 400448 394705 50451 510992 64800 68803 132684 172478 249956 106735 -89090
10325A91047K0342C2100K24241J3029I092L09696J22910K4434k24521K28179B34815
$$ 191047 211389 32100 256341 269370 9092 318788 441698 466132 241611 469790 234815
10313B76687a50042g2984l4418B071a43304A12406J96560d28165a68129P6380
$$ 276687 -150042 -72984 -107402 2071 -143304 112406 308966 -428165 -168129 -91749
10303i1749j27387D9607N304g3576B3514c3816B55228d09163F192a48085j53479
$$ -91749 -219136 49607 54911 -73576 23514 -33816 255228 -409163 6192 -148085 -301564
10292c01564E644K22881b07866k8193j69776a63133C8415a49511A81579I684L3525
$$ -301564 5644 228525 -207866 -236059 -405835 -163133 38415 -149511 181579 9684 43209
10281D3209b04825c6714I6350a46383A28876h7578n1643m3190A56064b42598A79230
$$ 43209 -204825 -36714 96350 -146383 128876 -87578 -139221 -182411 156064 -242598 179230
10269E0036h1335j20400q3280a08801B18262l808C1512j458J90315a10523B31515
$$ 50036 -81335 -201735 -285015 -108801 218262 214454 31512 30054 220369 -110523 231515
10257a75817C2211R7099J51211A07782E3383a1069A65760a26995j46216C7346
$$ -175817 32211 129310 280521 107782 53383 -11069 165760 -126995 -273211 37346
10246B40295D465c57324A0653B095Q6028A5012a85846A48091a60696A15615b96961
$$ 240295 4465 -357324 10653 2095 88123 15012 -185846 148091 -160696 115615 -296961
10234e4149H0274a17778B12560b03644h5118b8238B61056c33297F7004a9783D5982
$$ -54149 80274 -117778 212560 -203644 -85118 -28238 261056 -333297 67004 -19783 45982
10222b35743M7261f806A8963c8660A87805m7097a15894p4611h3878o6244o7556
$$ -235743 -188482 -6806 18963 -38660 187805 140708 -115894 -190505 -83878 -150122 -217678
10211b17678j57289D0334e5579C2958c8096I1881R6930b43845c3269B3027K23435
$$ -217678 -374967 40334 -55579 32958 -38096 91881 188811 -243845 -33269 23027 246462
10200B46462g2038m387j49955G5243C725i00k44354a01317j0578j89425J10117
$$ 246462 -72038 -76425 -226380 75243 3725 -900 -245254 -101317 -111895 -301320 -191203
10189a91203P0752G5570c23955h2629j27510N0210B83553b7786A89466a71107
$$ -191203 -120451 75570 -323955 -82629 -210139 -159929 283553 -27786 189466 -171107
10178a3844A00395a16082F9991a75889b5541o3814j71476L4937f4511J0773m06352
$$ -13844 100395 -116082 69991 -175889 -25541 -89355 -260831 -225894 -64511 -53738 -460090
10167d60090a264m7756J1433p6881q7116h4591E7091e8806j17352P0371l4983
$$ -460090 -1264 -49020 -37587 -114468 -201584 -84591 57091 -58806 -176158 -105787 -140770
10156a40770c8729M620D01009j72144C7708h2430B92497h552l832j22063L115
$$ -140770 -38729 -34109 401009 228865 37708 -82430 292497 -8552 -12384 -134447 -131332
10145a31332L6727j86453A48142c53388b6021A41780p736a46121k1043j03371
$$ -131332 -94605 -281058 148142 -353388 -26021 141780 134044 -146121 -167164 -270535
10135b70535C0615c08928a42962G4455b47599A32543h1854A76995B1735K77416
$$ -270535 30615 -308928 -142962 74455 -247599 132543 -81854 176995 21735 299151
10125B99151a37824J7189o1017A7761c30629b8444k35007e7882P024G2304J2963
$$ 299151 -137824 -120635 -181652 17761 -330629 -28444 -263451 -57882 -50858 72304 85267
10114H5267L8428B8575a67649j07836J09068f4679A03169a04655M5149A48410
$$ 85267 123695 28575 -167649 -275485 -166417 -64679 103169 -104655 -59506 148410
10103A84768a59660H6172b0611j14614j56739l0755g7201j41216B602b17955D0443
$$ 184768 -159660 86172 -20611 -135225 -291964 -322719 -77201 -218417 2602 -217955 40443
10091b12908r1864A66509a63015d4514A7629K0758c5430j94535i662j10424B42409
$$ -212908 -304772 166509 -163015 -44514 17629 38387 -35430 -229965 -9662 -120086 242409
10079A26762a75798j45639N0831a31346j28583d3042k47602a5821C2102b58077
$$ 126762 -175798 -321437 -270606 -131346 -259929 -43042 -290644 -15821 32102 -258077
10068E8546P1094a20381b5601k4155k28536q2540a72384P7712A56413i4436b2566
$$ 58546 129640 -120381 -25601 -49756 -278292 -360832 -172384 -94672 156413 -94436 -22566
10056F5592c83992J83880C09362a77049F0874B5523c46042R7306k16528G4791
$$ 65592 -383992 -200112 309362 -177049 60874 25523 -346042 -248736 -465264 74791
10045a62107j3157P4252k64966r8359a36231J0954d8908B46217c26296B34380
$$ -162107 -175264 -101012 -365978 -464337 -136231 -125277 -48908 246217 -326296 234380
10034A21847b30392k6808k73320A88931F7514i1948A36655L8106c68394Q5382
$$ 121847 -230392 -257200 -530520 188931 67514 -91948 136655 174761 -368394 -283012
10024b83012E8922c9954r3898A29123g5776C07255r4101c3573k31398l030l2601
$$ -283012 58922 -39954 -133852 129123 -75776 307255 213154 -33573 -264971 -268001 -300602
10013c00602P3633A9388N801J2069J77418a24024F6970B0292c3933B0046n377
$$ -300602 -226969 19388 25189 37258 214676 -124024 66970 20292 -33933 20046 14669
10002A4669h3404a5927l4946k82904A33030f0798j19345a6292r7098p598a9398
$$ 14669 -83404 -15927 -50873 -333777 133030 -60798 -180143 -16292 -113390 -120988 -19398
9990a28128o5961a2759D777J64296n0212a77496d9268j99573L7983j57617B31617
$$ -128128 -194089 -12759 4777 169073 118861 -177496 -49268 -248841 -210858 -368475 231617
9978g9544A90544l1830b6258A72007m6699h91B67696a48568k74261b3986C4444
$$ -79544 190544 158714 -26258 172007 125308 -891 267696 -148568 -422829 -23986 34444
9966c13242c2706j58380N3587E810J2364P1902d41783J54745o3092g2264j2656
$$ -313242 -32706 -191086 -137499 5810 18174 90076 -441783 -287038 -350130 -72264 -84920
9955h4920L1227m382K1647D4563a4862E0729J23101h645a949p275n6562k312m4954
$$ -84920 -53693 -58075 -36428 44563 -14862 50729 173830 -8645 -1949 -9224 -65786 -68098 -113052
9942a13052G6304a03510j97942M4181e5999K1275B0023J01345P0625i299k00700
$$ -113052 76304 -103510 -301452 -257271 -55999 -34724 20023 121368 191993 -9299 -209999
9931b09999B1802b4311A36601J28398a49187n6025a6020D1123J99403p3133m2108
$$ -209999 21802 -24311 136601 264999 -149187 -205212 -16020 41123 240526 167393 125285
9920A25285a03380A6735b15410M2963j3726R1364p0799j59897B9982K70357A33340
$$ 125285 -103380 16735 -215410 -172447 -186173 -94809 -165608 -325505 29982 300339 133340
9908i8105j50079h8538j75662j14236c7195j92696n8126C018e1261j74625d6555
$$ -98105 -248184 -88538 -264200 -378436 -37195 -229891 -288017 3018 -51261 -225886 -46555
9896f0846D03924a58057g6390k2824C7096d8781J275e762I6006b9354A26453a80395
$$ -60846 403924 -158057 -76390 -99214 37096 -48781 -47506 -5762 96006 -29354 126453 -180395
9883A19231l7313b85437J21806F5720d1461r3459M7292j24874G4763a75366G6117
$$ 119231 81918 -285437 -163631 65720 -41461 -134920 -87628 -212502 74763 -175366 76117
9871i9612a9210A62127p8688a08280n4546q2231A3159K927b26619C4512d7678
$$ -99612 -19210 162127 83439 -108280 -162826 -245057 13159 16086 -226619 34512 -47678
9859a34778N8229c3171j89194d8437j22927l6044A90463a34748l7210j57174e2961
$$ -134778 -76549 -33171 -222365 -48437 -171364 -207408 190463 -134748 -171958 -329132 -52961
9847b65222J10753C32765d0899A53407b28421l28727A02864c4609o8391j04937
$$ -265222 -154469 332765 -40899 153407 -228421 -557148 102864 -34609 -103000 -207937
9837b07937A57123J00872a97248b9770j0869R468q6823j7534D3388b12416f8579
$$ -207937 157123 257995 -197248 -29770 -40639 -31171 -117994 -135528 43388 -212416 -68579
9825a91294H1679h1146j67613k6882A36730I41a4625H8147b80856A04098c93549
$$ -191294 81679 -81146 -248759 -275641 136730 941 -14625 88147 -280856 104098 -393549
9813b12925g5878j26897h842j58118a673l88180A98762E4983L2871c22209L8241
$$ -212925 -75878 -202775 -8842 -166960 -1673 -389853 198762 54983 87854 -322209 -283968
9802b83968a8775F955P7845h644A02400j3218J2784a17420k50231c3837B1929
$$ -283968 -18775 6955 84800 -8644 102400 89182 101966 -117420 -367651 -33837 21929
9790A76839b18372m4875J22339F2561J58958E3062b83349a02940m73702a12234
$$ 176839 -218372 -263247 -140908 62561 221519 53062 -283349 -102940 -576642 -112234
9779a25911B02327L5288a49216c4966j58943A44793a82066k79882A95597D9517
$$ -125911 202327 237615 -149216 -34966 -193909 144793 -182066 -461948 195597 49517
9768b34438M7294a1763l53425D341e0311B88339a27593e4467l51926P8559a14883
$$ -234438 -187144 -11763 -365188 4341 -50311 288339 -127593 -54467 -406393 -327834 -114883
9756c29280c0457l08508J51443j26947A66830D6632d06217J61564C8089J4777
$$ -329280 -30457 -338965 -187522 -314469 166830 46632 -406217 -244653 38089 52866
9746E2866a09089d7669k12481P4304G219L3610b33516C5606Q7210a22214k10550
$$ 52866 -109089 -47669 -260150 -185846 7219 40829 -233516 35606 122816 -122214 -332764
9735c32764e1704r5177A4241K46236G5191b51501A59919p5215J17065A0792b50461
$$ -332764 -51704 -146881 14241 260477 75191 -251501 159919 84704 201769 10792 -250461
9723h6576j11288j34463k946a02853A84720d6663k04844j31000h1197L3125A023
$$ -86576 -197864 -332327 -335273 -102853 184720 -46663 -251507 -382507 -81197 -48072 1023
9711c17828I5355b95096J01898l51624c3999l2008j80726a14534j13392a4590
$$ -317828 95355 -295096 -193198 -544822 -33999 -66007 -246733 -114534 -227926 -14590
9700D8427d5679j11329A86017D3306d22325a60295A6172i5586C31956C8455a55056
$$ 48427 -45679 -157008 186017 43306 -422325 -160295 16172 -95586 331956 38455 -155056
9688F068b1475n5586F0110a57035j31303A26840e5640r008j72376a03422K6006
$$ 6068 -21475 -77061 60110 -157035 -288338 126840 -55640 -64648 -237024 -103422 -77416
9677g7416p5799M2531D17811a78066g2785J7843k09365j37444B0989J16956j6686
$$ -77416 -153215 -110684 417811 -178066 -72785 -54942 -264307 -401751 20989 137945 121259
9666A21259a46711e2890H8732N4474c70299d3707k94822i1790B03240k2480a21652
$$ 121259 -146711 -52890 88732 143206 -370299 -43707 -338529 -91790 203240 180760 -121652
9654c1234J2365A76578a7981k86795A78171d089q9665b3032j55443c0820j89315
$$ -31234 -18869 176578 -17981 -304776 178171 -4089 -93754 -23032 -178475 -30820 -220135
9643b20135h9693k8008d6045r9951b6183k24429I0234a37473j2529p1290I8882
$$ -220135 -89693 -117701 -46045 -145996 -26183 -250612 90234 -137473 -150002 -221292 98882
9631a96604C07022b06719m7070a15928m7029G7018a72491H3738i9742p9950O1945
$$ -196604 307022 -206719 -253789 -115928 -162957 77018 -172491 83738 -99742 -179692 -117747
9620a17747m9616A14969p557C8291N2640A4136J41760l4891a51121A75576b6585
$$ -117747 -167363 114969 107412 38291 90931 14136 155896 121005 -151121 175576 -26585
9608c25349A90656h4468r7249N9559o2247r1136b6330k06328A19451N4079d5905
$$ -325349 190656 -84468 -181717 -122158 -184405 -275541 -26330 -232658 119451 173530 -45905
9596d9027l11715d1044A18038a94652f6646o55218g5370A27761a5663F384L3048
$$ -49027 -360742 -41044 118038 -194652 -66646 -721864 -75370 127761 -15663 6384 39432
9585C9432a01663b9729n5087K8221m7033M4118B7111i1699k4236c7172F6675O8469
$$ 39432 -101663 -29729 -84816 -56595 -103628 -59510 27111 -91699 -115935 -37172 66675 135144
9573A35144b3732j09235k6449j52754A47009b24823h8903g331F7579J62304A662
$$ 135144 -23732 -132967 -159416 -312170 147009 -224823 -88903 -7331 67579 229883 1662
9561C21372j31425l6918b34000J0364A3148a14048p1303J1001n3515f1867r5740
$$ 321372 189947 153029 -234000 -223636 13148 -114048 -185351 -174350 -227865 -61867 -157607
9550a57607I7612J01448f0378l63665a19377c5763k36424C63113a58419L3277
$$ -157607 97612 199060 -60378 -424043 -119377 -35763 -272187 363113 -158419 -125142
9540a25142k33600D596h3209j05656L9157k7888M9623g583A68646r978e5593A00047
$$ -125142 -358742 4596 -83209 -188865 -149708 -177596 -127973 -7583 168646 158668 -55593 100047
9527a7382G6670N5381b19109A8339b8508B2607f548j93182k942B8872e7527j4769
$$ -17382 76670 132051 -219109 18339 -28508 22607 -6548 -199730 -202672 28872 -57527 -72296
9515g2296m21461K23949a08253A43048a00741c815A19975d6602M038j10357k1496
$$ -72296 -493757 -269808 -108253 143048 -100741 -3815 119975 -46602 -42564 -152921 -174417
9504a74417A08387b09427e4848q4020A4974b42916J8567G1520a79375b0881k60957
$$ -174417 108387 -209427 -54848 -138868 14974 -242916 -224349 71520 -179375 -20881 -281838
9493b81838g407p3658a7750m1686B46427a22925b0327F2408b92759A38834M5131
$$ -281838 -7407 -81065 -17750 -59436 246427 -122925 -20327 62408 -292759 138834 183965
9482A83965J54210a84923A43524D8090a341p1352C8168b39117A6197M3483a38807
$$ 183965 338175 -184923 143524 48090 -1341 -72693 38168 -239117 16197 59680 -138807
9470B2581A907c0400l23539J27382p8982A00142a74156A67379j2942o3391a46841
$$ 22581 1907 -30400 -353939 -226557 -305539 100142 -174156 167379 154437 91046 -146841
9458b08619J01825b7973l58754J55363a00644b4181k01839g5345j35299d8247
$$ -208619 -106794 -27973 -386727 -231364 -100644 -24181 -226020 -75345 -210644 -48247
9447c1134A53309C6432e8671A26110b78791g2180C77423a20413I9969d3104j07911
$$ -31134 153309 36432 -58671 126110 -278791 -72180 377423 -120413 99969 -43104 -151015
9436a51015C7460Q4726b67192a20708e5065l08693J56732G9150K13151a086k38210
$$ -151015 37460 122186 -267192 -120708 -55065 -363758 -207026 79150 292301 -1086 -239296
9425b39296I6259O9780E2689b06516C2274d8005A41851i9808B25760H3323c92128
$$ -239296 96259 166039 52689 -206516 32274 -48005 141851 -99808 225760 83323 -392128
9413B34192k5702i5695j5724n8103O157f8702a3181r1788M3052D7726J55477b96751
$$ 234192 208490 -95695 -111419 -169522 -163365 -68702 -13181 -104969 -61917 47726 203203 -296751
9400C62102a14675A03564N2108c01692F3492M371A501f9903k19772c8540A26786
$$ 362102 -114675 103564 155672 -301692 63492 67863 1501 -69903 -289675 -38540 126786
9388i3071F2758b63931C1748b91345B69834F0723A5428L9575R7499c60792c6043
$$ -93071 62758 -263931 31748 -291345 269834 60723 15428 55003 152502 -360792 -36043
9376E500M0272b50883a18509A24413A3829b9257N118H5195P9030n0392N4457E7951
$$ 5500 45772 -250883 -118509 124413 13829 -29257 -24139 85195 164225 113833 168290 57951
9363c6448m3742J2310j11314o0648a15084k04101C82793n6306c17906C07745G8023
$$ -36448 -80190 -67880 -179194 -239842 -115084 -319185 382793 326487 -317906 307745 78023
9351a36797O8080A05389a09970l8836e1358H4953a83435J40O5763C4693J96334
$$ -136797 -68717 105389 -109970 -148806 -51358 84953 -183435 -183295 -117532 34693 231027
9340B31027g0021B5868a77517C4222a23761K4313n5692a9513l3191B4365g9992
$$ 231027 -70021 25868 -177517 34222 -123761 -99448 -155140 -19513 -52704 24365 -79992
9328a53995r2924a02867k0736I0315J5463c11641J48734j747k01540Q1399k13623
$$ -153995 -246919 -102867 -123603 90315 105778 -311641 -162907 -164654 -366194 -284795 -498418
9317d98418J82102a11B73459C4026d0432A43166c57117d7759G1187h8277j35576
$$ -498418 -316316 -111 273459 34026 -40432 143166 -357117 -47759 71187 -88277 -223853
9306b23853G1068c7647A08613a51234d0278A6562K3048a25720B88217d285A59937
$$ -223853 71068 -37647 108613 -151234 -40278 16562 39610 -125720 288217 -4285 159937
9294A54353l2819b13522n6513a26284e7504j66744D8204J51930q1807b88128a09799
$$ 154353 121534 -213522 -270035 -126284 -57504 -224248 48204 200134 118327 -288128 -109799
9282B40212B2825c87589A46433a29357c0653j23942m9398A35916h1689j279j36772
$$ 240212 22825 -387589 146433 -129357 -30653 -154595 -203993 135916 -81689 -82968 -219740
9271b19740P8257c5436k2817A37335a83417L5264j3688g898j45737o7203o9237
$$ -219740 -141483 -35436 -58253 137335 -183417 -148153 -161841 -7898 -153635 -220838 -290075
9260b90075M455M6262A52178b45605L3160d2729r1220j70459e5256k16127J31062
$$ -290075 -285620 -239358 152178 -245605 -212445 -42729 -133949 -304408 -55256 -271383 -140321
9249a40321C6962g516p9967k02800i4492k08838C930a1126j05106A16575a79826
$$ -140321 36962 -7516 -87483 -290283 -94492 -303330 3930 -11126 -116232 116575 -179826
9237b02116A2393J19496a32155C1722d3666p1703c5791B33345b01045N9485M3440
$$ -202116 12393 131889 -132155 31722 -43666 -115369 -35791 233345 -201045 -141560 -98120
9226i8120B41382b4623k8908m2250g057j38418G2279a98601l95306A75758a28510
$$ -98120 241382 -24623 -53531 -95781 -7057 -145475 72279 -198601 -593907 175758 -128510
9214c59048B06446F4526e26829A91330G3886a25164M9985j635k34232N1133c1440
$$ -359048 206446 64526 -526829 191330 73886 -125164 -75179 -76814 -311046 -259913 -31440
9202A36789c9463j21139k01956f9786D4701a25018B0523J49900f8042a8328j98241
$$ 136789 -39463 -160602 -362558 -69786 44701 -125018 20523 170423 -68042 -18328 -216569
9191b16569A18759j9139d19530e2581J5647o135p1081B1529e2788I4125l6815
$$ -216569 118759 99620 -419530 -52581 -36934 -43069 -114150 21529 -52788 94125 57310
9180E7310n666b58974a7867A50695a03709A834a54314k66853H8055c02855e6884
$$ 57310 51644 -258974 -17867 150695 -103709 1834 -154314 -421167 88055 -302855 -56884
9168B9587O5497A3072d301j74675j19043A20054h6758G9955i1914q427H4379C8216
$$ 29587 95084 13072 -4301 -178976 -298019 120054 -86758 79955 -91914 -100341 84379 38216
9155F3125b32721C9100b569A4847K21729o8480q1513a65441d6380j75840j8167
$$ 63125 -232721 39100 -2569 14847 236576 168096 86583 -165441 -46380 -222220 -240387
9144b40387J06768J1106k80452a20719C4912b18170P4452p7394a3455j27535A25160
$$ -240387 -133619 -122513 -402965 -120719 34912 -218170 -143718 -221112 -13455 -140990 125160
9132a96621e6459n6259I3995a74037j542C07307E9191B3102b54279J310B4922
$$ -196621 -56459 -112718 93995 -174037 -175579 307307 59191 23102 -254279 -252969 24922
9120A75629F1288B2225a10576k17083a54358A39011o1007L3338A3610O9798b27344
$$ 175629 61288 22225 -110576 -327659 -154358 139011 78004 111342 13610 83408 -227344
9108a65709j14553A47098R7862G7110a33044A05921b49008R6728A6362L7608a09809
$$ -165709 -280262 147098 244960 77110 -133044 105921 -249008 -152280 16362 53970 -109809
9096H3599d1050A59894h2126o1563L6050L6619k36540a9010F8161R1616a01412
$$ 83599 -41050 159894 -82126 -143689 -107639 -71020 -307560 -19010 68161 159777 -101412
9084d70608d383H734a0093C13578b22747A96723a76244j24590a175r7339C9996
$$ -470608 -4383 8734 -10093 313578 -222747 196723 -176244 -300834 -1175 -98514 39996
9072H8772b01293e561k9018j01158c3632m48234C2629J19664q422R6978f1868
$$ 88772 -201293 -5561 -34579 -135737 -33632 -481866 32629 152293 143871 240849 -61868
9060a63025l08276D2264a21036e914b814q7546K6618K0585E8483J03769c44661
$$ -163025 -471301 42264 -121036 -5914 -2814 -90360 -63742 -43157 58483 162252 -344661
9048f3711p9512A4581b28226E5585i9557r5383b9968A43261K64539j17709g1700
$$ -63711 -143223 14581 -228226 55585 -99557 -194940 -29968 143261 407800 290091 -71700
9036b24849N2168C68165p985c56138A26155f5560E8747j6809J12676A5135a66254
$$ -224849 -172681 368165 360180 -356138 126155 -65560 58747 41938 154614 15135 -166254
9024a82874h8881E1583J95268b56538H8764b52696H6942K9952h7437R796l47143
$$ -182874 -88881 51583 246851 -256538 88764 -252696 86942 116894 -87437 -77641 -424784
9013d24784a07903G8889b37996j28290F7356b2468A70420a08325F2230a4412A96659
$$ -424784 -107903 78889 -237996 -366286 67356 -22468 170420 -108325 62230 -14412 196659
9001a24737B70096b33117A1407b44271j37791B53297D4086J10908j6535J41491
$$ -124737 270096 -233117 11407 -244271 -382062 253297 44086 154994 138459 279950
8991B79950D3061i3696E6350R4085a35075B9994E475i8350p8850l8783e6698K5551
$$ 279950 43061 -93696 56350 150435 -135075 29994 5475 -98350 -177200 -215983 -56698 -31147
8979c1147l0924m608n1626m3174o8387B14254c9266C56689A58977e0442l1886
$$ -31147 -62071 -66679 -118305 -161479 -229866 214254 -39266 356689 158977 -50442 -82328
8968h2328R014A8791Q2833a68678C2192J32259f4205F6630l2084b0562j81313
$$ -82328 -73314 18791 101624 -168678 32192 164451 -64205 66630 34546 -20562 -201875
8957b01875j74241B3470J98562M035D2155J6437a57951C0222f1253l8040A27659
$$ -201875 -376116 23470 222032 226067 42155 58592 -157951 30222 -61253 -99293 127659
8945a44330B43628D7553J47964a80875l7108R0418d4930j73567A22559a10155
$$ -144330 243628 47553 195517 -180875 -217983 -127565 -44930 -218497 122559 -110155
8934A08112a43853j11698C2691A5750a98360a0182G2875K47397I2569A1384J97014
$$ 108112 -143853 -255551 32691 15750 -198360 -10182 72875 320272 92569 11384 208398
8923B08398L8451Q39220J430775I06730l61292H8071e3243A09221D7776J9777
$$ 208398 246849 1086069 2516844 906730 545438 88071 -53243 109221 47776 67553
8913F7553f3601A08949l5056h3551j54045h3054j76269B4589J24913b84355a03683
$$ 67553 -63601 108949 73893 -83551 -237596 -83054 -259323 24589 149502 -284355 -103683
8901A63567e2547A86875B4062J07524a05417A08267a20149N590j74424C7679i7047
$$ 163567 -52547 186875 24062 131586 -105417 108267 -120149 -114559 -288983 37679 -97047
8889E7404b83783J06524A65633i3342C43397h0576B4418b27571M0846D8493b84062
$$ 57404 -283783 -177259 165633 -93342 343397 -80576 24418 -227571 -186725 48493 -284062
8877C22449b2785A30570a2514A52913a58434l21299a19998k3036C40J0600J4712
$$ 322449 -22785 130570 -12514 152913 -158434 -479733 -119998 -143034 340 10940 25652
8866B5652O633J29514a96756A66722b18645R1962K4386A29387l7610j0025H515
$$ 25652 32285 161799 -196756 166722 -218645 -126683 -102297 129387 91777 81752 8515
8854F6931d06165I0058b55977J22817G9173O5312d0209F9467L09379A556b92281
$$ 66931 -406165 90058 -255977 -133160 79173 144485 -40209 69467 378846 1556 -292281
$$ [...]
##END NTUPLES=NMR SPECTRUM
##END=
