
##TITLE=AC1399_2357uv_7519954_JKoHcfTaAp
##JCAMPDX= 6.0         $$ Bruker NMR JCAMP-DX V2.0
##DATA TYPE= NMR SPECTRUM
##DATA CLASS= NTUPLES
##ORIGIN= BRUKER
##OWNER= Administrator
$$ 1.72 TOPSPIN		Version 2.1
$$ 2013-02-19 17:28:30.206 -0500  Administrator@X
$$ Compression mode = diff/dup
##.OBSERVE FREQUENCY= 400.02188249412
##.OBSERVE NUCLEUS= ^1H
##.ACQUISITION MODE= SIMULTANEOUS (DQD)
##.ACQUISITION SCHEME= undefined
##.AVERAGES= 8
##.DIGITISER RES= 22
##SPECTROMETER/DATA SYSTEM= spect
##.PULSE SEQUENCE= zg30
##.SOLVENT NAME= COFFEE_meoh
##.SHIFT REFERENCE= INTERNAL, COFFEE_meoh, 1, 14.98509
##AUDIT TRAIL= $$ (NUMBER, WHEN, WHO, WHERE, PROCESS, VERSION, WHAT)
$$ ##TITLE= Audit trail, TOPSPIN		Version 2.1
$$ ##JCAMPDX= 5.01
$$ ##ORIGIN= Bruker BioSpin GmbH
$$ ##OWNER= Administrator
$$ $$ E:\/data/COFFEE/nmr/AC1399_2357uv_7519954_JKoHcfTaAp/10/pdata/1/auditp.txt
$$ ##AUDIT TRAIL=  $$ (NUMBER, WHEN, WHO, WHERE, PROCESS, VERSION, WHAT)
(   1,<2013-02-19 17:28:22.222 -0500>,<Administrator>,<X>,<go>,<TOPSPIN 2.1>,
      <created by zg
	started at 2013-02-19 17:27:15.878 -0500,
	POWCHK enabled, PULCHK disabled,
       configuration hash MD5:
       86 BA 57 50 F2 9D 5C 9B 26 00 A9 28 5F 66 2E 89
       data hash MD5: 64K
       CC DD A1 69 16 CB C4 1F 04 55 E1 88 32 B5 C3 73>)
(   2,<2013-02-19 17:28:25.284 -0500>,<Administrator>,<X>,<proc1d>,<TOPSPIN 2.1>,
      <Start of raw data processing
       efp LB = 0 FT_mod = 6 PKNL = 1 PHC0 = 0 PHC1 = 0 SI = 32K 
       data hash MD5: 32K
       4A 09 ED AB 40 35 76 05 E2 AA 2F 61 C9 B0 22 B0>)
(   3,<2013-02-19 17:28:25.753 -0500>,<Administrator>,<X>,<proc1d>,<TOPSPIN 2.1>,
      <pk PHC0 = 72.07581 PHC1 = 0 
       data hash MD5: 32K
       49 9E 4B 98 E7 00 91 7F C5 9B 04 F9 AC 2B 26 F8>)
(   4,<2013-02-19 17:28:25.972 -0500>,<Administrator>,<X>,<proc1d>,<TOPSPIN 2.1>,
      <abs ABSG = 1 
       data hash MD5: 32K
       E1 C6 AB 64 AC 1C 79 15 49 C1 57 13 4F E6 99 C3>)
(   5,<2013-02-19 17:28:26.143 -0500>,<Administrator>,<X>,<proc1d>,<TOPSPIN 2.1>,
      <abs ABSG = 2 
       data hash MD5: 32K
       46 AE 4C 6C D5 DB A6 56 3F AD 39 40 EF 69 32 EF>)
(   6,<2013-02-19 17:28:26.284 -0500>,<Administrator>,<X>,<proc1d>,<TOPSPIN 2.1>,
      <abs ABSG = 3 
       data hash MD5: 32K
       F6 77 45 22 C3 83 F2 0D 19 07 58 9E F4 A8 21 D1>)
(   7,<2013-02-19 17:28:26.409 -0500>,<Administrator>,<X>,<proc1d>,<TOPSPIN 2.1>,
      <abs ABSG = 4 
       data hash MD5: 32K
       AB B1 7D 6F A2 43 F3 52 BF A6 9B 03 FA 6C 98 CF>)
(   8,<2013-02-19 17:28:26.534 -0500>,<Administrator>,<X>,<proc1d>,<TOPSPIN 2.1>,
      <abs ABSG = 5 
       data hash MD5: 32K
       F9 17 8F EA 17 06 2E E9 54 2B E8 E5 49 5A 96 FF>)
$$ ##END=
$$ 
$$ $$ hash MD5
$$ $$ 10 79 4A 78 C8 00 04 48 8D 1A 37 68 2B F2 A9 88
##$RELAX= 
##$RELAX= 
##$RELAX= 
##$RELAX= 
##$RELAX= 
##$RELAX= 
##$RELAX= 
$$ Bruker specific parameters
$$ --------------------------
##$DU= <E:\>
##$EXPNO= 10
##$NAME= <AC1399_2357uv_7519954_JKoHcfTaAp>
##$PROCNO= 1
$$ [...]
150 150 150 150 150 150 150 150
##$TP07= 0
##$TPNAME0= <>
##$TPNAME1= <>
##$TPNAME2= <>
##$TPNAME3= <>
##$TPNAME4= <>
##$TPNAME5= <>
##$TPNAME6= <>
##$TPNAME7= <>
##$TPOAL= (0..7)
0.5 0.5 0.5 0.5 0.5 0.5 0.5 0.5
##$TPOFFS= (0..7)
0 0 0 0 0 0 0 0
##$TUNHIN= 0
##$TUNHOUT= 0
##$TUNXOUT= 0
##$USERA1= <user>
##$USERA2= <user>
##$USERA3= <user>
##$USERA4= <user>
##$USERA5= <user>
##$V9= 5
##$VALIST= <valist>
##$VCLIST= <CCCCCCCCCCCCCCC>
##$VD= 0
##$VDLIST= <DDDDDDDDDDDDDDD>
##$VPLIST= <PPPPPPPPPPPPPPP>
##$VTLIST= <TTTTTTTTTTTTTTT>
##$WBST= 1024
##$WBSW= 4
##$XGAIN= (0..3)
0 0 0 0
##$XL= 0
##$YL= 0
##$YMAX_a= 555726
##$YMIN_a= -547700
##$ZGOPTNS= <>
##$ZL1= 120
##$ZL2= 120
##$ZL3= 120
##$ZL4= 120
##$ABSF1= 14.98509
##$ABSF2= -5.573092
##$ABSG= 5
##$ABSL= 3
##$ALPHA= 0
##$AQORDER= 0
##$ASSFAC= 0
##$ASSFACI= 0
##$ASSFACX= 0
##$ASSWID= 0
##$AUNMP= <proc_prof1d_extract_pilot.lims>
##$AXLEFT= 0
##$AXNAME= <>
##$AXNUC= <1H>
##$AXRIGHT= 0
##$AXTYPE= 0
##$AXUNIT= <>
##$AZFE= 0.1
##$AZFW= 0.1
##$BCFW= 0
##$BC_mod= 0
##$BYTORDP= 0
##$COROFFS= 0
##$CY= 15
##$DATMOD= 1
##$DC= 0
##$DFILT= <>
##$DTYPP= 0
##$F1P= 0
##$F2P= 0
##$FCOR= 0.5
##$FTSIZE= 32768
##$FT_mod= 6
##$GAMMA= 0
##$GB= 0
##$INTBC= 1
##$INTSCL= 1
##$ISEN= 128
##$LB= 0
##$LEV0= 0
##$LPBIN= 0
##$MAXI= 10000
##$MC2= 0
##$MEAN= 0
##$ME_mod= 0
##$MI= 0
##$NCOEF= 0
##$NC_proc= -8
##$NLEV= 6
##$NOISF1= 0
##$NOISF2= 0
##$NSP= 0
##$NTH_PI= 0
##$NZP= 0
##$OFFSET= 14.98509
##$PC= 1
##$PHC0= 72.07581
##$PHC1= 0
##$PH_mod= 1
##$PKNL= yes
##$PPARMOD= 0
##$PPDIAG= 0
##$PPIPTYP= 0
##$PPMPNUM= 2147483647
##$PPRESOL= 1
##$PSCAL= 4
##$PSIGN= 0
##$PYNMP= <proc.py>
##$REVERSE= no
##$SF= 400.02
##$SI= 32768
##$SIGF1= 0
##$SIGF2= 0
##$SINO= 400
##$SIOLD= 32768
##$SPECTYP= <>
##$SREGLST= <1H.CDCl3>
##$SSB= 0
##$STSI= 32768
##$STSR= 0
##$SW_p= 8223.68421052631
##$SYMM= 0
##$S_DEV= 0
##$TDeff= 65536
##$TDoff= 0
##$TI= <>
##$TILT= no
##$TM1= 0
##$TM2= 0
##$TOPLEV= 0
##$USERP1= <user>
##$USERP2= <user>
##$USERP3= <user>
##$USERP4= <user>
##$USERP5= <user>
##$WDW= 1
##$XDIM= 32768
##$YMAX_p= 459409140
##$YMIN_p= -697097
##$CURPLOT= <Network HP LaserJet P1505>
##$CURPRIN= <$Network HP LaserJet P1505>
##$DFORMAT= <normdp>
##$LAYOUT= <+/1D_H.xwp>
##$LFORMAT= <normlp>
##$PFORMAT= <normpl>
##$SURQMSG= 1
$$ End of Bruker specific parameters
$$ ---------------------------------
##NTUPLES= NMR SPECTRUM
##VAR_NAME=  FREQUENCY,     SPECTRUM/REAL,   SPECTRUM/IMAG
##SYMBOL=    X,             R,               I
##VAR_TYPE=  INDEPENDENT,   DEPENDENT,       DEPENDENT
##VAR_FORM=  AFFN,          ASDF,            ASDF
##VAR_DIM=   32768,         32768,           32768
##UNITS=     HZ,            ARBITRARY UNITS, ARBITRARY UNITS
##FACTOR=    0.250966925370066, 1,           1
##FIRST=     8223.43324360094, 126432,       -225681
##LAST=      0,             193081,          145971
##MIN=       0,             -697097,         0
##MAX=       8223.43324360094, 459409140,    0
$$ Real data points
##PAGE= N=1
##DATA TABLE= (X++(R..R)), XYDATA
$$ [...]
$$ plain form
19555 209373 51118 210195 -28475 26974 -67620 -82180 -75977 -69531 148536 -29333 -71593
19544 -71593 -158482 23229 124003 -24728 82706 72103 503 -9675 45930 -315030 115124 80452
19532 80452 -215249 -23500 -167839 310135 52636 145557 -506017 -211507 -227967 -222895 28768
19520 33898 -119271 -452685 -345490 202278 175467 105176 -129175 -62548 -46358 -113247 247160
19508 95987 -228656 -174793 -35292 133129 317301 -17600 -201144 -238781 108278 266851
19498 266851 50562 109126 -305842 -102081 -100113 -106752 16036 -64431 83242 -51380 59858
19486 12621 -159203 -31834 24318 67523 126735 -200756 -131958 -218123 219819 -193083 285042
19474 -26282 -99204 22296 90191 -373487 93432 -143492 -74640 -113649 15874 233517 -181974
$$ packed form
19555B09373E1118J59077b8475B6974f7620j4560O203O446A48536b9333m2260
19544g1593q6889B3229J00774b4728H2706j0603E03i675D5930c15030A15124l4672
19532H0452b15249b3500j44339C10135E2636R2921e06017b11507j6460N072B8768
19520C3898a19271l33414J07195B02278k6811p0291a29175f2548J6190o6889B47160
19508I5987b28656N3863c5292A33129J84172a7600j83544l7637A08278J58573
19498B66851E0562N8564c05842a02081J968o639A6036f4431H3242e1380E9858
19486A2621a59203c1834B4318M3205N9212b00756O8798q6165B19819a93083B85042
19474b6282p2922B2296O7895c73487I3432a43492O8852l9009A5874K17643a81974
$$ plain form
19462 -63409 -105417 -76442 36296 -116521 324848 -332054 -133523 -92790 58374 -27893 66266
19450 -133403 -193224 -328375 -43365 -223288 44616 117225 -261768 81692 -31073 8997 56706
19439 56706 77773 -150945 1983 247234 -10780 170537 229213 376754 -164997 -267401 -31630
19427 367153 -4652 -89928 -66728 108352 -55476 2864 -122507 -114006 -13519 203438 -30655
19415 -244268 52177 -172718 -443885 96509 -40274 -212898 208427 97313 152431 -11894 -98879
19404 -98879 -35135 -45215 -86811 -58658 -2735 -23075 -117154 152863 151400 -44224 85268 -158637
19391 116719 42948 223790 -92118 104056 -142702 -11686 -350257 -71087 -38295 -41396 -196241
19380 -196241 -16960 178665 -59257 154141 -285306 -92365 -193433 134853 -78765 -144615
$$ packed form
19462f3409m2008K8975C6296a16521C24848c32054a33523M0733E8374b7893F6266
19450a33403n9821j35151d3365j79923D4616P2609b61768H1692c1073H997M7709
19439E6706K1067a50945A983K45251a0780A70537N8676J47541a64997j02404c1630
19427C67153d652q5276K3200A08352e5476B864a22507Q501a3519B03438c0655
19415b44268E2177a72718k71167I6509d0274j72624B08427I7313N5118a1894q6985
19404i8879c5135j0080m1596K8153b735k0340r4079A52863j463d4224H5268a58637
19391A16719D2948J80842i2118A04056a42702a1686l38571g1087L2792l101j54845
19380a96241a6960A78665e9257A54141b85306i2365j01068A34853g8765o5850
$$ plain form
19370 -144615 -13370 -211410 105234 -86647 -61568 45109 -71298 -77305 -104847 23060 123101
19359 123101 -163808 -12282 -171859 -279298 -185796 -108034 -193336 14692 -84141 -117642 -90406
19348 -90406 -289882 -29160 -166826 -157096 146349 256854 -193692 388237 -209606 -50999
19337 -62379 131207 314103 -80433 220130 -6749 51443 -70897 -149561 -160300 -33164 -83989
19326 -83989 -44047 -225248 -147169 -461223 107246 -320212 -292594 51792 -168843 -1127 -181903
19315 -181903 -2652 -80571 -338682 132087 -16242 -133639 -182098 350900 -132117 213784
19304 -76540 -171875 287297 -169017 100351 -70090 49700 -338379 -115504 230079 -39231
19293 -399046 135150 133059 -99890 -46100 150719 -5147 340386 -36698 215202 29993 -316195
$$ packed form
19370a44615a3370j98040A05234h6647K5079D5109g1298o007k7542B3060J00041
19359A23101a63808a2282j59577j07439R3502P7762q5302A4692h4141l3501K7236
19348i0406j99476b9160j37666R730A46349J10505a93692C88237b09606e0999
19337f2379A31207J82896h0433B20130f749E1443g0897p8664j0739c3164n0825
19326h3989L9942j81201P8079l14054A07246c20212K7618E1792a68843a127j80776
19315a81903b652p7919k58111A32087a6242j17397m8459C50900a32117B13784
19304g6540r5335B87297a69017A00351g0090D9700c38379a15504B30079c9231
19293c99046A35150k091i9890d6100A50719e147C40386c6698B15202B9993c16195
$$ plain form
19281 -112471 -179396 228376 69263 145030 -328921 392675 -193646 -1460 -199452 -105560 -71791
19270 -71791 -228013 -184005 -65343 -228065 82401 209242 175415 298558 -65059 -279302 -216374
19259 -216374 -43551 -13219 258246 -59757 -163340 163966 -346640 -43129 107578 -15000
19248 -261563 -170570 -275663 -106158 357426 48531 -91535 -380020 185997 173927 54587
19237 74784 444455 -387822 -44374 127574 -13426 388 -39100 -142640 -185400 -317506 -294946
19226 -294946 115811 -13060 16656 -81507 -328767 53090 -141443 -76015 -321321 -339262 14417
19214 -18670 -81065 -143603 -138868 -30037 143206 28836 -204221 -259261 219003 -80185 -445062
19203 -445062 77626 27980 -75406 -53917 -97612 -440828 -216124 44610 -11485 239520 143743
$$ packed form
19281a12471o6925B28376F9263P5767c28921C92675a93646a460j97992R3892L3769
19270g1791j56222M4008f5343j62722H2401J26841l3827J23143f5059k14243O2928
19259b16374d3551a3219B58246e9757j03583A63966c46640d3129A07578a5000
19248b61563R0993j05093a06158C57426D8531i1535k88485A85997j2070E4587
19237G4784L69671c87822d4374A27574a3426C88c9100j03540m2760j32106K2560
19226b94946A15811a3060A6656h1507k47260E3090a41443O5428k45306j7941A4417
19214a8670o2395o2538M735c0037A43206B8836b04221n5040B19003h0185l64877
19203d45062G7626B7980g5406K1489m3695l43216b16124D4610a1485B39520r5777
$$ plain form
19192 143743 143387 -151476 -297596 -322130 -267693 -74484 -186597 18955 -142871 -93367 122370
19180 -179940 131790 58352 23990 52799 -18039 74677 70339 -106318 -109141 -202529 61762
19168 -172490 -133003 64768 -121739 -129223 448364 110229 164612 -4610 -63146 -65967 -58786 27381
19155 -135788 97908 -365153 -193714 1037 -54453 -256118 -62695 -286963 -113835 -247681
19145 -247681 -274932 20400 150647 25292 139978 -250273 -298608 -913 108067 -271756 164317
19133 21429 46951 -213405 -23140 149887 -157700 3844 51543 68162 112862 -129217 -116111
19122 -116111 182894 166556 -14805 78561 -104221 -67301 21445 26375 -169847 -178858 -104402
19111 -104402 -309061 -83587 -121616 -126210 53321 425906 134725 219152 -193015 -92318 -25459
$$ packed form
19192A43743l56a51476j46120k4534N4437g4484j12113A8955a42871M9504A22370
19180a79940A31790E8352B3990K8809a8039G4677m338a06318k823r3388F1762
19168a72490L9487F4768a21739p484D48364A10229N4383d610n8536k821P181B7381
19155a35788I7908c65153J71439A037e4453k01665f2695k24268a13835j33846
19145b47681k7251B0400J30247B5292J14686b50273m8335i13A08067b71756A64317
19133B1429K5522b13405b3140A49887a57700C844M7699J6619M4700a29217J3106
19122a16111A82894j6338a4805G8561a04221L6920B1445M930a69847r011P4456
19111a04402k04659h3587l8029m594E3321L72585A34725Q4427a93015i2318b5459
$$ plain form
19099 -402439 -164443 296686 203114 -102874 152572 -142308 156420 -127234 -361483 44731
19088 -43205 309119 -193119 108313 -144069 -911 -162797 -25948 -130106 -364551 -96946 -394095
19077 -394095 273768 10656 -81225 -252155 -4544 127647 -168054 -358324 -286722 130581
19066 -240432 66317 95648 -188301 -141370 -10450 132288 -179908 -17634 -215991 -8967 110838
19054 166829 -127777 23232 -103738 -192164 -62840 69125 433 213931 -93295 -155641 5165
19042 39882 -147236 -37624 -281974 -116769 242440 21646 -48473 -170770 377296 -134845
19031 163994 -7451 -188238 -132080 -327390 -74582 -129748 -44391 -228818 171396 -28042 -262271
19020 -262271 -65467 18869 -116281 -179445 -219294 259479 -23363 -293418 81157 -455717 49021
$$ packed form
19099d02439a64443B96686r3572a02874A52572a42308A56420a27234k34249D4731
19088d3205C09119a93119A08313a44069i11j61886b5948j04158k34445i6946k97149
19077c94095B73768A0656h1225j70930d544A27647a68054j90270P1602A30581
19066b40432F6317K9331a88301M6931a0450A32288a79908a7634j98357h967A10838
19054A66829a27777B3232a03738q8426f2840F9125D33K13498i3295o2346E165
19042C9882a47236c7624k44350a16769B42440B1646d8473j22297C77296a34845
19031A63994g451j80787N6158j95310g4582n5166d4391j84427A71396b8042k34229
19020b62271f5467A8869a16281o3164l9849B59479b3363k70055H1157d55717D9021
$$ plain form
19008 33412 -50775 -27357 -186278 179740 100712 176451 -107133 -105235 -145860 -1845 -350182
18997 -350182 -51455 -29078 115066 -140228 -46619 36552 -140599 24330 -86494 -15734 -29968
18986 -29968 216476 -292190 -7201 121926 267654 -72913 -398541 -137259 -223635 -136890 74429
18974 78585 -150999 -20637 -62221 -140658 -21801 -87374 -210184 -1038 -74166 215188 26613
18962 -47634 -163935 -38964 286015 184476 -313187 -188693 3175 -31152 14348 -167105 297087
18950 -96019 182743 -237925 -87465 273601 74046 -161049 202750 -308205 -6872 25007 90671
18939 90671 -209284 -66262 -294046 -121551 199037 -159977 -36459 -290354 -191730 -157092
18929 -157092 62843 -11385 -232841 -64001 -29620 -189003 -242489 -230908 -226926 50668 -328085
$$ packed form
19008C3412e0775K3418j58921A79740p9028P5739a07133J898m0625a845l48337
18997c50182e1455K2377A15066a40228d6619C6552a40599B4330h6494a5734j4234
18986b9968B16476b92190g201A21926J45728g2913l25628a37259q6376Q6745G4429
18974G8585a50999b0637m1584p8437b1801o5573j22810a038p3128B15188B6613
18962d7634j16301c8964B86015j01539c13187J24494C175c1152A4348a67105B97087
18950i6019A82743b37925h7465B73601G4046a61049B02750c08205f872B5007O5664
18939I0671b09284f6262k27784a21551A99037a59977c6459k53895R8624L4638
18929a57092F2843a1385k21456f4001b9620j59383n3486J1581L982E0668c28085
$$ plain form
18917 29767 16423 39490 -240985 -81680 -49183 -17025 -175725 14378 -85964 -321169 -83762
18905 220244 -152639 -120957 107104 369503 169009 -141556 220468 99262 -101546 -200426
18895 -200426 -16993 89310 122778 -197786 126576 -13433 38106 -163496 91672 64154 -135278
18883 -12389 -67899 -123363 -16657 -50949 -181273 -132680 -10822 -223693 -126242 -82100 -305696
18872 -305696 -26622 -69707 -15299 -133720 2395 -258299 29370 -168658 120136 -55160 -3798
18860 -239899 3077 -270078 -124359 95657 -38787 91653 -170911 -157391 -108187 272629 228582
18849 228582 -219188 -315986 146000 61883 -363583 130082 -189453 10518 -248105 -344992
18839 -344992 -50967 73885 114879 59737 -16840 136673 85825 -252989 5931 -106071 -63661
$$ packed form
18917B9767j3344K3067b40985h1680L2497a7025j58700A4378h5964k35205h3762
18905B20244a52639L1682A07104K62399A69009a41556B20468I9262a01546r8880
18895b00426a6993H9310L3468a97786A26576a3433C8106a63496I1672k7518a35278
18883a2389n5510n5464a6657l4292j30324M8593a0822k12871R7451M4142k23596
18872c05696b6622m3085a5299j18421B395b58299B9370a68658A20136e5160c798
18860b39899C077b70078a24359I5657c8787I1653a70911J3520M9204B72629m4047
18849B28582b19188r6798A46000F1883c63583A30082a89453A0518b48105r6887
18839c44992e0967G3885M0994n5142a6840A36673n0848b52989E931a06071M2410
$$ plain form
18828 -63661 330549 20372 254915 -143409 -361403 -119727 -315664 -127808 -275254 -228751
18818 -228751 167265 -34342 96417 -120752 -171408 -40529 6332 -82090 -65634 319462 -44146
18806 53071 72966 223295 82440 102553 13402 75358 -49880 -341198 -85925 89052 52118
18795 52118 -201644 30699 -73777 -248166 136043 114982 205242 69828 -29671 153715 -139487
18783 42722 -349339 -97716 -65540 -265953 -82976 -132640 -246808 -139951 -158046 -95740 -59100
18772 -59100 15121 -144594 -126590 11035 122283 -79905 -52329 212801 -238634 -198040 -237115
18761 -237115 -140906 265284 211697 131462 -97700 288529 21972 -165791 -104957 109608 -44481
18749 -252578 82178 -228586 51204 196142 68996 100877 -91779 -339647 -220504 -88722 1688
$$ packed form
18828f3661C30549B0372K34543a43409k17994a19727j95937a27808j47446M6503
18818b28751A67265c4342I6417a20752n0656d0529F332h2090J6456C19462d4146
18806E3071J9895J50329H2440K0113A3402O1956d9880k91318h5925H9052l6934
18795E2118b01644C0699g3777j74389A36043k1061R0260F9828b9671A53715a39487
18783D2722c49339i7716L2176k00413h2976m9664j14168J06857j8095O2306L6640
18772e9100A5121a44594J8004A1035J11248g9905K7576B12801b38634M0594l9075
18761b37115R6209B65284n3587q0235i7700B88529B1972a65791O0834A09608d4481
18749b52578H2178b28586E1204J44938F8996L1881i1779k47868J19143h8722A688
$$ plain form
18737 -390875 -111235 169113 218 -147317 -575795 -98459 -297187 53406 93564 -71080 -27083
18725 369891 -240281 -388089 15194 -169693 -147776 46093 -106430 105805 292920 -181428
18714 19831 -93302 79102 -101078 -100487 200669 135647 118423 -455496 313 -83902 1710 -145374
18701 79727 -164737 -183800 -91381 -29868 146734 -241883 -61184 -155227 -149068 -61365 30070
18689 -116969 -13394 -84823 -143641 297758 -26335 -91951 -313202 306748 149106 1533 -141383
18677 233235 -29731 -374486 -19845 308354 209147 149974 -294432 -174639 114412 132244
18667 132244 -54513 66589 -463803 -326496 -61622 -256681 58883 111406 -125334 -145646 345780
18655 -16985 256099 108163 -51657 -39261 -71438 33189 -100068 -85250 -247364 -269689 -385816
$$ packed form
18737c90875a11235A69113B18a47317m28478i8459j98728E3406M0158g1080b7083
18725C69891b40281j47808A5194a69693K1917D6093a06430A05805J87115a81428
18714A9831i3302G9102a01078N91B00669o5022j7224d55496C13h3902A710a45374
18701G9727a64737j9063i1381b9868A46734b41883f1184r4043O159f1365C0070
18689a16969a3394p1429n8818B97758b6335o5616k21251C06748A49106A533a41383
18677B33235b9731l44755a9845C08354r9207n9173b94432J19793A14412J7832
18667A32244e4513F6589d63803J37307f1622j95059E8883N2523a25334k0312C45780
18655a6985B56099A08163e1657J2396l2177C3189a00068J4818j62114k2325j16127
$$ plain form
18644 -385816 -106615 -124899 286768 -54045 111585 81799 -308667 -37233 -99862 -104427 -77465
18633 -77465 -94985 -227688 75680 24614 149075 -214433 -397576 125714 -264440 -215580
18623 -215580 -100859 36770 10473 -103314 30265 -6719 -104604 112646 225087 212942 -68477
18611 -151639 264472 -251123 172008 -268466 99517 -308586 79543 -112920 -112769 -294202
18601 -294202 -253767 -5541 306817 184604 -144127 54447 -166139 89702 -175703 -211130 -398778
18590 -398778 130029 66294 -255836 160434 165983 13860 34655 -102071 28883 -217557 34010
18578 -244428 -443641 196534 -5730 180398 14785 -152924 57250 -10366 -169656 40836 -305924
18566 -242560 70875 -104395 -147848 -33742 101184 173492 153823 -337222 135773 -221041
$$ packed form
18644c85816a06615j8284B86768e4045A11585k9786c08667c7233o2629m565K6962
18633g7465j7520j32703G5680B4614J24461b14433j83143A25714b64440M8860
18623b15580a00859C6770A0473a03314C0265f719r7885A12646J12441j2145f8477
18611a51639B64472b51123A72008b68466I9517c08586G9543a12920J51j81433
18601b94202M0435e541C06817j22213a44127E4447a66139H9702a75703l5427j87648
18590c98778A30029o3735b55836A60434N549A3860K0795a02071B8883b17557C4010
18578b44428j99213A96534e730A80398A4785a52924E7250a0366j59290D0836c05924
18566b42560G0875a04395m3453c3742A01184P2308j9669c37222A35773b21041
$$ plain form
18555 -128100 -426565 -69465 -447530 -278794 -155237 -173785 -307580 -96698 208231 39522
18544 70143 184921 -34827 156428 -271039 -167324 205796 37985 -92627 -351299 207675
18533 -334322 67895 99138 -43152 -145259 -44161 -234181 -467023 -45951 -282109 -364327 43893
18521 -310600 157094 92004 145164 -32266 -105460 -25577 -95943 84675 -170759 296798 -330625
18509 -71307 32813 -46926 -50772 85624 -18155 -23221 16636 -16079 28724 1396 -151344 -115878
18497 -115878 -141136 -43361 -163398 61795 12684 -226936 131108 71139 -153256 79906 -13918
18485 57604 -133612 -45551 -177198 66087 446119 135955 -106491 -121460 -126806 -195439 -270354
18474 -270354 -13501 -349866 -18749 -304924 -190489 84626 322256 -234534 414138 76007
$$ packed form
18555a28100k98465f9465l78065J68736J23557j8548j33795i6698B08231C9522
18544G0143J14778c4827A56428b71039J03715B05796C7985i2627k58672B07675
18533c34322F7895L1243d3152j02107d4161j90020k32842d5951k36158q2218D3893
18521c10600A57094o5090N3160c2266p3194b5577p0366H4675a70759B96798c30625
18509g1307C2813d6926l846H5624a8155n066A6636a6079B8724A396a51344L5466
18497a15878k5258d3361j20037F1795A2684b26936A31108n9969a53256G9906a3918
18485E7604a33612d5551j31647F6087L80032A35955a06491j4969n346o8633p4915
18474b70354a3501l36365a8749k86175J14435H4626K37630b34534D14138G6007
$$ plain form
18463 48602 -53083 -175159 -245222 -78410 -307032 122975 -72169 -212671 -52103 93049 131265
18452 131265 -100314 -139592 37587 -237793 133224 -38364 -269234 82876 125460 -31212 -272131
18441 -272131 61375 -12480 -165218 79379 116716 36088 -191760 -188285 -28804 3704 -163356
18429 -208090 43373 -16214 -220766 -51469 41429 159612 -38401 26056 -124808 397468 107934
18417 170544 -149676 -177904 -204253 -291712 -10785 122381 48902 -180981 93663 -143183 94907
18405 114353 -100891 120398 -108741 -85990 -159252 -423324 161881 222158 192947 55721
18394 11449 280853 353958 -226572 80691 156724 -321592 51565 -130746 13310 -150943 165513
18382 -126244 -119568 226706 -300228 108838 150506 -282885 42620 -324219 71918 -27312 -84037
$$ packed form
18463D8602e3083j22076p0063g8410k28622A22975g2169j40502e2103I3049L8216
18452A31265a00314l9278C7587b37793A33224c8364k30870H2876M2584c1212k40919
18441b72131F1375a2480j52738G9379L7337C6088a91760L475b8804C704a63356
18429b08090D3373a6214k04552e1469D1429J18183c8401B6056a24808C97468A07934
18417A70544a49676k8228k6349q7459a0785A22381D8902a80981I3663a43183I4907
18405A14353a00891A20398a08741K2751p3262k64072A61881O0277k9211E5721
18394A1449K69404P3105b26572H0691P6033c21592E1565a30746A3310a50943A65513
18382a26244O676B26706c00228A08838M1668b82885D2620c24219G1918b7312n6725
$$ plain form
18371 -84037 -164978 47428 -8032 61069 -137813 170810 35898 171064 -287397 229435 63341
18359 23444 -333456 -257726 -3596 -240577 -28148 -86590 -42921 -209106 -208682 -101782 104487
18347 -371821 -81984 -135689 -32370 267661 -82982 -41014 -132297 86644 -209484 -57467 412175
18335 -247004 280366 -210641 122067 -86365 -31833 -7553 -69258 -27793 -353017 -16257 -325243
18324 -325243 -204375 54153 267740 -256588 15348 6600 124541 -277162 -14141 -311360
18314 -311360 -541178 16531 175376 -364011 -139650 -345149 444112 212972 -67679 570012
18303 118462 67523 184809 -152374 433730 -82636 -74723 9294 -295571 -184208 201904 -299608
18291 14784 20463 42714 285317 -236754 -334211 -6037 -48126 -48078 47495 -33251 -55384 360277
$$ packed form
18371h4037q0941D7428h032F1069a37813A70810C5898J35166b87397B29435F3341
18359B3444c33456P5730c596k36981b8148n8442d2921j66185M24a01782A04487
18347c71821h1984n3705c2370B67661h2982d1014r1283H6644b09484e7467D12175
18335b47004B80366b10641A22067h6365c1833g553o1705b7793l25224a6257l08986
18324c25243J20868E4153K13587b56588A5348F600J17941b77162a4141k97219
18314c11360k29818A6531J58845c64011a39650k05499D44112B12972f7679E70012
18303A18462n0939J17286a52374D33730h2636P913I294b95571J11363B01904b99608
18291A4784N679K2251K42603b36754r7457f037m2089M8D7495c3251k2133C60277
$$ plain form
18278 79963 -166725 100635 39006 27514 -45732 -168337 -412128 -211071 73791 -46645 -127136
18267 -127136 -136627 -62202 -170864 -355744 155684 -152843 285847 -146890 53221 -180166
18256 113746 -225108 -119849 -102889 147113 2650 176859 -26962 93711 40183 -334689 22831
18244 -24486 -159932 -468703 60521 147939 -93494 85451 -118187 13714 -62868 -194969 -37537
18232 -57543 24440 85639 -274860 2496 -182183 175897 -7818 -275629 -139995 56096 -179368
18220 -125488 223767 -224943 -132582 87223 -257433 -20835 -17059 -233801 94224 -162273 -287247
18209 -287247 -57462 170732 307647 -44449 -69384 228176 -145046 308755 -86233 49927
18198 100394 328304 231176 -319290 -256495 -137213 -360076 97636 349710 -348312 100109
$$ packed form
18278G9963a66725A00635C9006j1492d5732j22605k43791K01057G3791d6645q0491
18267a27136r491f2202j08662j84880A55684a52843B85847a46890E3221a80166
18256A13746b25108J05259J6960A47113B650J74209b6962I3711D0183c34689B2831
18244b4486j35446l08771F0521Q7418i3494H5451a18187A3714f2868j32101c7537
18232e7543B4440O1199b74860B496a82183A75897g818k67811J35634E6096a79368
18220a25488B23767b24943R2361H7223b57433b0835L776k16742I4224a62273j24974
18209b87247e7462A70732J36915d4449k4935B28176a45046C08755h6233D9927
18198A00394K27910r7128c19290O2795J19282k22863I7636K52074c48312A00109
$$ plain form
18187 -20568 -273279 -198258 6061 -239487 -1742 -100338 -155305 162666 -294361 8826 -365743
18175 -53551 42226 181208 -154605 -178495 -289003 175733 198860 249764 -238572 -261657 -145601
18164 -145601 -81643 192835 -214347 58303 61119 -352211 94192 -50191 84716 39489 -124430
18152 115979 -118159 34745 -144842 85687 108360 -4757 50718 207208 45731 -143565 -89726
18141 -89726 -353697 13745 -177576 93093 -139333 21190 87378 -336907 22343 149410 -14498
18129 -54370 -103065 -96642 31492 -159224 -90126 -57712 -128154 242748 -32843 -59661 183700
18117 152305 -41020 -395831 -118277 121940 -223095 -211319 -120262 -106607 -45936 -472802
18107 -472802 45454 -200511 -263113 17440 -145078 -236065 3153 155070 70691 -98094 -129808
$$ packed form
18187b0568k52711P5021F061b39487a742r8596n4967A62666b94361H826c65743
18175e3551D2226J38982a54605k3890j10508A75733K3127N0904b38572k3085J16056
18164a45601O3958A92835b14347E8303K816c52211I4192e0191H4716C9489a24430
18152A15979a18159C4745a44842H5687K2673d757E0718J56490D5731a43565N3839
18141h9726k63971A3745a77576I3093a39333B1190O6188c36907B2343J27067a4498
18129e4370m8695O423C1492a59224O9098L2414p0442B42748c2843k6818A83700
18117A52305d1020l54811a18277A21940b23095J1776R1057J3655d5936m26866
18107d72802D5454b00511o2602A7440a45078r0987C153J51917G0691i8094l1714
$$ plain form
18096 -129808 -16185 -531 3702 77411 -26055 -199970 -162546 28065 367532 145575 89054
18085 89054 143739 -156219 -314012 241407 165045 -23281 -7026 360409 114877 321565 -66470
18073 -282241 -72282 63388 -343431 23025 351648 -160094 231041 -89158 -367140 147822
18062 -264216 205632 -110040 358441 5730 -66985 -273647 241830 -286275 36806 -202808
18051 3521 132319 -71403 -100100 -142714 43894 -385775 66880 -82108 -157319 -130763 -24921
18039 29112 -253620 -331766 144581 211668 -80217 244520 -58006 238103 -114254 126184
18028 -33201 -33999 91390 -202264 -57894 133872 81217 40849 167174 167593 -37021 78357 152659
18016 152659 235725 -136908 -170288 5771 -33316 -312200 -205446 -71252 -448351 -226403 -95601
$$ packed form
18096a29808a6185e31C702P3709b6055j73915L7424B8065L39467A45575n6521
18085H9054N4685a56219j57793B41407p6362b3281g026C60409A14877K06688f6470
18073b82241g2282F3388c43431B3025L28623a60094B31041h9158k77982A47822
18062b64216B05632a10040C58441E730f6985k06662B41830b86275C6806b02808
18051C521J28798g1403k8697m2614D3894c85775F6880h2108p5211K6556b4921
18039B9112b53620p8146A44581O7087h0217B44520e8006B38103a14254A26184
18028c3201p98I1390b02264e7894A33872n2655m0368J26325M19c7021G8357P4302
18016A52659Q3066a36908l3380E771c3316k78884J06754g1252l77099K21948i5601
$$ plain form
18004 214641 173967 -365065 -141614 198706 62609 263939 -114698 -51426 -329703 -141337
17993 -38437 -250919 305704 18937 -156044 95434 -28935 -126359 -93552 -62868 142986 94457
17982 94457 517117 -305471 -8011 -114587 73952 22591 -288732 -8905 -132865 -343292 -6929
17970 -40879 71728 -35463 -21013 -135586 -185967 -129535 208185 -135284 -15300 -29387 160760
17958 -79957 -110280 -49381 63059 -134755 251537 -263183 -495186 -29760 -30240 142203 -151511
17946 44615 -128444 -53109 -119052 -201180 294260 -23327 245948 180735 272809 -60434 72886
17934 35604 -61344 42921 -289708 -9895 -50390 -256259 154526 102917 161313 134744 -337716
17922 -215301 75372 -20044 -74664 115846 -172819 -92435 11756 -8621 37929 80967 57317
$$ packed form
18004B14641m0674c65065a41614A98706F2609K01330a14698e1426k78277a41337
17993c8437k12482C05704A8937a56044I5434b8935r7424L2807L0684A42986m8529
17982I4457M22660c05471h011j06576G3952B2591b88732h905j23960k10427f929
17970d0879G1728c5463J4450j14573n0381N6432B08185a35284a5300j4087A60760
17958g9957l0323d9381F3059a34755B51537b63183k32003b9760m80A42203a51511
17946D4615a28444e3109o5943q2128B94260b3327B45948o5213R2074f0434G2886
17934C5604f1344D2921b89708i895m0495k05869A54526n1609N8396k6569c37716
17922b15301G5372b0044n4620A15846a72819Q0384A1756h621C7929M3038k3650
$$ plain form
17911 57317 -160598 174385 -259009 4692 -100825 248002 36428 -47824 207495 323731
17901 323731 -369431 -245410 -12108 -117350 -163975 -37180 421093 -351272 250476 -20187
17890 -210232 146944 93710 -228959 -126443 -302521 66624 183254 -214739 -73893 36825
17879 -117652 447841 107487 92112 79057 22619 172666 98912 -46158 -135378 -161942 114305
17867 -60727 -30583 -245474 187425 -47758 139 -524204 -152953 -5608 141279 -54522 -78906
17856 -78906 115888 63137 -281692 97785 -24102 55540 97203 -199162 265806 -300584 204483
17844 295750 -158860 -374449 -135152 -246866 -100618 31260 -17352 36252 -224649 84054
17833 81369 201568 -7088 20819 -382413 167710 -163394 242543 -102972 87312 -87497 -31279
$$ packed form
17911E7317a60598A74385b59009D692a00825B48002C6428d7824B07495J16236
17901C23731c69431J24021a2108j05242m6625c7180D21093c51272B50476b0187
17890b10232A46944n3234b28959J02516j76078F6624J16630b14739g3893C6825
17879a17652D47841A07487j5375j3055B2619J50047p3754d6158q9220k6564A14305
17867f0727L0144k14891A87425d7758A39e24204a52953e608A41279e4522k4384
17856g8906A15888n2751b81692I7785b4102E5540M1663a99162B65806c00584B04483
17844B95750a58860k15589a35152j11714a00618C1260a7352C6252b24649H4054
17833H1369J20199g088B0819c82413A67710a63394B42543a02972H7312h7497c1279
$$ plain form
17821 101430 97258 -207349 -50975 -23817 426203 -202468 25400 -204001 149163 -182963
17810 116411 218728 56258 25547 -167368 -111115 -90948 -174667 99862 -8742 194406 360412
17799 360412 -184585 133705 -3631 -188519 -5561 -85993 100671 102467 -143608 7877 311423
17788 311423 -126722 -35717 185094 162014 176210 -205439 -141931 113571 -205535 122087
17777 -80391 48335 207043 -296721 -108263 -6252 -82346 -165579 117497 -55590 132453 43719
17765 89594 67169 307541 -110315 102407 -144711 -142039 -144540 153920 -127600 -83534 13068
17753 -77630 -3947 -144142 -144772 196618 -47284 138776 -64669 160934 67142 -65932 246648
17741 154727 -371801 50891 77529 -217570 -108121 116888 -156812 4353 259634 -202320
$$ packed form
17821A01430m172b07349e0975b3817D26203b02468B5400b04001A49163a82963
17810A16411J02317E6258B5547a67368N6253K0167q3719I9862h742A94406J66006
17799C60412a84585A33705c631j84888e561q0432A00671J796a43608G877L03546
17788C11423a26722c5717A85094k3080J4196b05439O3508A13571b05535A22087
17777h0391D8335J58708b96721a08263f252p6094q3233A17497e5590A32453D3719
17765H9594k2425K40372a10315A02407a44711K672k501A53920a27600M4066A3068
17753g7630c947j40195o30A96618d7284A38776f4669A60934F7142f5932B46648
17741A54727c71801E0891K6638b17570a08121A16888a56812D353K55281b02320
$$ plain form
17730 9784 -110583 -158313 60940 163977 112903 14352 66804 -73177 -65061 -145553 26965 141548
17718 141548 -179489 77631 142738 -301853 152106 109790 -23593 155416 -76812 -69535 -194227
17707 -194227 -85552 -104173 316935 -423935 -152501 197556 -192723 142420 791 -124 -68947
17696 -68947 114229 -160617 -205342 -156725 -114107 -9549 251878 -271406 -127415 176041 -53036
17684 -117681 224855 -58429 146883 -27876 88584 62662 28765 -218739 27147 37567 130291
17673 130291 -42817 -203339 129989 -25973 -393713 -212685 60737 142551 -269272 105635
17662 33286 -144405 41963 13061 -17673 210726 164806 -38404 458423 205384 81648 -84648
17650 -507939 15104 -51150 -32306 -9987 -144281 177645 -243002 -93460 88526 100214 -35175
$$ packed form
17730I784a10583m7730F0940J03037n1074A4352N2452g3177Q116q0492B6965J14583
17718A41548a79489G7631O5107c01853A52106m2316b3593A55416g6812P277j24692
17707a94227h5552j8621C16935d23935a52501A97556a92723A42420G91a24o8823
17696f8947A14229a60617m4725M8617M2618i549B51878b71406a27415A76041e3036
17684a17681B24855e8429A46883b7876H8584k5922B8765b18739B7147J0420R2724
17673A30291d2817j60522A29989b5973l67740J81028F0737Q1814b69272A05635
17662C3286a44405D1963A3061a7673B10726m5920c8404D58423B05384H1648h4648
17650e07939A5104e1150J8844i987j34294A77645b43002i3460H8526J1688c5175
$$ plain form
17638 -114884 199109 180175 158109 -147279 -39952 -64093 204600 -9823 -99837 -205495 81684
17626 317400 57338 -19783 -52941 -234896 110905 70817 -242792 296225 101011 247408
17616 247408 -55233 377812 315638 100423 167738 -49317 -99478 -299702 -253054 -130778 110939
17604 82050 -107325 -89928 104612 318430 -132953 264400 218434 254111 -362303 -38327
17593 99279 -27867 286240 -108708 -455415 125781 206260 182854 -185325 -200753 -352767
17583 -352767 -20493 -10886 387204 -157182 308001 -130054 -120480 153476 -237000 108497
17572 -175647 4637 -142105 -33663 -19890 80997 -172851 -150033 -354164 284059 -180983 -215235
17561 -215235 349821 133872 87301 -269802 137341 -127300 364457 -65140 254720 -282580
$$ packed form
17638a14884A99109j8934k2066a47279c9952k4141B04600i823r0014j05658H1684
17626C17400E7338a9783l3158j81955A10905m0088b42792B96225A01011J46397
17616B47408e5233C77812o2174A00423O7315d9317n0161k00224M6648J22276A10939
17604H2050a07325J7397A04612K13818a32953B64400m5966L5677c62303c8327
17593I9279b7867B86240a08708l46707A25781Q0479k3406a85325j5428j52014
17583c52767b0493R607C87204a57182C08001a30054R574A53476b37000A08497
17572a75647D637a42105c3663J3773H0997a72851K2818k04131B84059a80983l4252
17561b15235C49821A33872m6571b69802A37341a27300C64457f5140B54720b82580
$$ plain form
17550 428583 147820 197530 -174591 150570 49445 11693 -22382 46098 209488 144648 -13577
17538 -9669 143376 -198946 76441 -386537 248248 -180748 -247503 71848 -117813 89888 241531
17527 241531 -68204 -409 169736 -146666 211820 -85299 -91141 57925 264183 -176220 48325
17515 152694 128463 156616 182711 113759 75445 25586 49905 4303 -3886 162062 159845 -245740
17502 425160 -106529 204318 72183 -39546 50910 122167 360930 -278051 344457 68568
17491 4046 65724 130999 190143 -83800 -101383 70496 247609 25233 -88094 50373 -20628 83266
17478 190940 175341 193069 -93947 66903 58841 30823 453250 262551 20639 117191 387950
17467 387950 426660 120076 -96271 -83595 148052 237156 310694 237490 105010 228766 480625
$$ packed form
17550D28583A47820M9710a74591A50570D9445A1693b2382D6098J63390o4840a3577
17538i669A43376a98946G6441c86537B48248a80748o6755G1848a17813H9888J51643
17527B41531f8204d09A69736a46666B11820h5299n842E7925K06258a76220D8325
17515A52694k4231K8153K6095o8952l8314B5586K4319D303c886A62062k217b45740
17502D25160a06529B04318G2183c9546E0910P1257K38763b78051C44457F8568
17491D046O1678O5275N9144h3800j7583G0496J77113B5233h8094E0373b0628H3266
17478A90940j5599J7728i3947F6903q062k8018M22427j90699B0639R6552K70759
17467C87950L8710A20076i6271J2676A48052Q9104P3538p3204A05010J23756K51859
$$ plain form
17456 480625 78309 313495 51158 75291 -98511 86921 441629 395714 337629 311192 192053
17445 192053 534156 320215 511577 308721 155310 42318 702026 78807 400911 69300
17434 186705 339699 -49288 369859 260860 454688 381819 545948 -43525 194080 121935
17424 121935 288720 423994 289403 309349 31502 -207411 258030 150922 135680 421625
17414 421625 554079 394972 120927 210041 150999 52720 124067 309509 -385939 43796
17403 76791 -14533 305354 257104 223882 296878 -20801 -51273 140573 259922 415418 -66287
17391 289647 221732 207547 344540 297354 225293 428463 21693 260151 286858 -88560 266835
17379 169412 14469 13661 138001 -42060 70371 100927 356385 106794 191144 101504 390767
$$ packed form
17456D80625G8309K35186E1158K4133i8511H6921L54708m5915n8085k6437j19139
17445A92053L42103k13941J91362k02856j53411D2318O59708G8807L22104F9300
17434A86705J52994d9288C69859j08999J93828p2869J64129d3525A94080p2145
17424A21935J66785J35274j34591J9946C1502b07411B58030j07108j5242K85945
17414D21625J32454j59107A20927Q9114n9042E2720P1347J85442c85939D3796
17403G6791a4533C05354m8250l3222P2996b0801l0472A40573J19349J55496f6287
17391B89647o7915j4185J36993m7186p2061K03170B1693K38458K6707h8560B66835
17379A69412A4469q08J24340d2060G0371L0556K55458A06794Q4350q9640K89263
$$ plain form
17368 390767 -22644 327722 399023 234346 220937 -34727 -40504 6130 87032 161326 482575
17357 482575 20665 84659 30408 211720 142622 383266 139262 -266999 93881 338215
17347 338215 -74255 428276 169406 41392 168455 45181 -187238 -135190 -101930 300642
17336 58169 193553 167849 231296 294991 44064 183951 148063 141078 151988 387570 106111
17324 91551 79762 89215 76340 178958 390940 197045 150899 355013 120181 349274 166754
17312 -85195 27740 65164 -25518 -9832 135712 -8683 306065 131018 201347 4653 183557
17301 183557 232933 273716 363479 157036 279626 250370 90065 45389 247429 132445 9206
17289 73431 83016 103732 282021 262176 341377 95300 180465 537304 238873 157263 -66503
$$ packed form
17368C90767b2644C27722P1301j64677j3409c4727n777F130Q0902P4294L21249
17357D82575B0665O3994C0408J81312o9098K40644A39262b66999I3881K44334
17347C38215g4255D28276A69406D1392J27063D5181a87238N2048L3260C00642
17336E8169J35384k5704O3447O3695D4064J39887l5888o985J0910K35582A06111
17324I1551j1789R453j2875J02618K11982j93895m6146K04114A20181K29093A66754
17312h5195B7740L7424b5518i832A35712h683C06065A31018P0329D653J78904
17301A83557M9376M0783Q9763A57036J22590k9256I0065m4676K02040j14984I206
17289G3431R585K0716J78289j9845P9201I5300Q5165L56839B38873q1610f6503
$$ plain form
17277 14348 316837 134720 245818 26772 266061 16037 -281174 27864 187767 346725
17267 346725 130940 207742 116440 373639 95226 154447 -55654 326791 -3452 452394 114093
17255 377565 227254 668179 63146 -35951 17727 -14645 124108 210888 158112 -29199 140877
17243 111100 241932 211853 -26570 395542 -89077 184236 183404 354246 413659 130880 424611
17232 424611 144993 -15143 199117 181728 60123 -39283 303950 -137253 383574 245144
17222 245144 272227 -77881 541774 224560 171391 628483 218844 76424 312407 8661 153921
17211 153921 153497 628967 46981 293195 365246 -55605 102438 414591 297836 293920 108675
17199 110341 266632 279393 279508 213457 422786 188902 -222230 4502 209681 555922 521055
$$ packed form
17277A4348L02489A34720J11098B6772K39289A6037b81174B7864J59903J58958
17267C46725A30940P6802r1302K57199I5226N9221e5654C26791c452D52394A14093
17255C77565j50311M40925F3146c5951A7727a4645A24108Q6780n2776b9199A40877
17243A11100J30832l0079b6570C95542h9077A84236q32J70842N9413A30880K93731
17232D24611A44993a5143A99117j7389F0123c9283C03950a37253C83574j38430
17222B45144K7083g7881E41774B24560n3169M57092B18844G6424K35983H661J45260
17211A53921m24M75470D6981K46214P2051e5605A02438L12153j16755l916A08675
17199A10341J56291J2761J15o6051K09329A88902b22230D502K05179L46241l4867
$$ plain form
17188 521055 363203 416338 315173 210997 387342 516093 253086 163598 187115 371981
17178 371981 34572 513153 137859 168456 373351 572467 360644 295757 221373 332519
17168 332519 357403 120232 277179 375140 246363 461788 175897 389648 455050 241452
17158 241452 449808 438379 -152827 419085 146984 564824 216086 344794 380021 387628
17148 387628 191858 483407 263750 420833 197965 291116 519842 406725 558084 232864
17137 201094 231004 215363 147740 277176 194539 320967 365729 313986 299435 395340 1645
17125 40582 436351 178097 69637 431488 -89427 292548 434727 443869 172780 356668
17115 356668 421776 480069 282860 349841 292150 149233 489776 377979 -39284 620221
$$ packed form
17188E21055j57852N3135j01165j04176J76345J28751B53086q9488K3517J84866
17178C71981C4572M78581A37859L0597K04895J99116k11823o4887p4384J11146
17168C32519K4884A20232J56947R7961j28777K15425A75897K13751O5402k13598
17158B41452K08356j1429a52827D19085A46984M17840B16086J28708L5227P607
17148C87628A91858K91549k19657J57083A97965R3151K28726j13117J51359B32864
17137B01094K9910j5641o7623J29436q2637J26428M4762n1743j4551R5905A645
17125D0582L95769A78097F9637L61851h9427B92548J42179R142A72780J83888
17115C56668O5108N8293j97209O6981n7691j42917L40543j11797c9284F20221
$$ plain form
17104 218704 348742 316481 548114 278611 653330 413276 308119 553564 537519 493429
17094 493429 496681 373513 458509 523999 170257 547002 211344 282426 438726 364984 349362
17083 349362 603006 568161 359826 645032 437983 785850 535134 469950 338775 383752
17073 383752 77178 383683 555594 498558 532089 432210 226447 678624 687694 724092 606634
17062 606634 765226 419392 472606 159738 352780 375494 626610 524572 418155 382968
17052 382968 410630 239212 142558 764105 504070 726092 549678 694667 123625 536864
17042 536864 379723 891033 607525 472694 656803 644935 403644 416267 367197 628503
17032 628503 771959 573117 846805 473462 538862 704931 803562 823353 491902 445596
$$ packed form
17104B18704J30038l2261K31633k69503L74719k40054j05157K45445j6045m4090
17094D93429L252j23168Q4996O5490A70257L76745B11344P1082J56300p3742j5622
17083C49362K53644l4845k08335K85206k07049L47867k50716o5184j31175M4977
17073C83752G7178L06505J71911n7036L3531r9879k05763M52177R070L6398j17458
17062F06634J58592l45834N3214A59738J93042K2714K51116j02038j06417l5187
17052C82968K7662j71418r6654O21547k60035K22022j76414J44989A23625M13239
17042E36864j57141N11310k83508j34831J84109j1868k41291J2623m9070K61306
17032F28503J43456j98842K73688l73343O5400J66069R8631J9791l31451m6306
$$ plain form
17022 445596 438066 424703 470207 505485 970450 461795 837093 298500 631851 658916 738900
17011 738900 593498 580223 465760 893312 528550 840264 648806 892764 825822 498228
17001 498228 587978 739514 815902 413236 612580 603869 746614 730449 832574 708587
16991 708587 645164 768406 973175 788803 791953 612694 821986 870084 731990 634958
16981 634958 1111979 1040100 604284 1167860 956672 759410 692318 617284 1010602 795631
16971 795631 902419 884665 1130695 915975 860459 1018646 825306 1125269 1155851 1038135
16961 1038135 865569 1110484 971214 522002 966262 1116364 971680 1097420 973720
16952 973720 1127471 757155 1488649 1262760 1164817 1140821 1100083 1242314 1173706 989466
$$ packed form
17022D45596p530j3363M5504L5278M64965D61795L75298B98500L33351K7065P9984
17011G38900j45402j3275j14463M27552l64762L11714j91458K43958o6942l27594
17001D98228Q9750J51536P6388m02666J99344q711J42745j6165J02125j23987
16991G08587o3423J23242K04769j84372L150j79259K09292M8098j38094r7032
16981F34958M77021p1879m35816N63576k11188j97262o7092p5034L93318k14971
16971G95631J06788j7754K46030k14720n5516J58187j93340K99963L0582j17716
16961A038135j72566K44915j39270m49212M44260J50102j44684J25740j23700
16952I73720J53751l70316P31494k25889r7943k3996m0738J42231o8608j84240
$$ plain form
16942 989466 1037488 1057845 1095920 1092877 1356667 1208026 1227572 1210360 962375 1406355 1284716
16931 1284716 1188577 1362555 1383426 1423552 1554652 1221050 1519530 1670263 1312446 1391764
16921 1391764 1379804 1523701 1528122 1533847 1375958 1540793 1499152 1755814 1539455 1584173 1597906
16910 1597906 1914722 1788394 1637366 1541781 1492504 1779888 2051011 2102760 1909063 2021449
16900 2021449 1800155 1666041 1794811 1912143 2152145 1936783 1928776 1984174 1865989 1770289
16890 1770289 2242136 2107695 2302847 2240481 2123210 2090102 2299690 2287545 2394029 2240579
16880 2240579 2248722 2239142 2297366 2405648 2427569 2764498 2476129 2570582 2450148 2224056 2832839
16869 2832839 2943198 2526930 2776503 2722621 2688136 2735208 2907547 2678975 3137377 2699287
$$ packed form
16942I89466M8022K0357L8075l043K63790j48641J9546j7212k47985M43980j21639
16931A284716r6139J73978K0871M0126J31100l33602K98480J50733l57817P9318
16921A391764j1960J43897M421N725j57889J64835m1641K56662k16359M4718J3733
16910A597906L16816j26328j51028r5585m9277K87384K71123N1749j93697J12386
16900B021449k21294j34114J28770J17332K40002k15362q007N5398j18185r5700
16890A770289M71847j34441J95152o2366j17271l3108K09588j2145J06484j53450
16880B240579Q143r580N8224J08282K1921L36929k88369R4453j20434k26092O08783
16869B832839J10359m16268K49573n3882l4485M7072J72339k28572M58402m38090
$$ plain form
16859 2699287 2858891 3194111 3110293 2770298 2984560 3176948 3326544 3226623 3259181 3264607
16849 3264607 3310111 3371939 3598660 3254197 3683335 3847277 3818778 3810577 3932177 4001201
16839 4001201 3896808 3996181 4051632 4328532 3944012 4240515 4087296 4510225 4433072 4706641
16829 4706641 4682367 4704979 4856539 5166560 5077639 5041647 5418641 5321102 5513067 5673485
16819 5673485 5399072 5970367 5951206 5923313 5979421 6327348 6549203 6469908 6561472 6852803
16809 6852803 6868376 7222788 7325460 7243674 7484591 7736386 8088128 7889229 8348783 8299251
16799 8299251 8362575 8949705 9210063 9251460 9474423 9532246 10108557 10334072 10446455 10409256
16789 10409256 11002422 11121322 11293086 11541014 11960124 12680017 13000959 13163274 13460491
$$ packed form
16859B699287J59604L35220q3818l39995K14262J92388J49596r9921L2558N426
16849C264607M5504O1828K26721l44463M29138J63942k8499q201J21600O9024
16839D001201j04393R9373N5451K76900l84520K96503j53219M22929p7153K73569
16829D706641k4274K2612J51560L10021q8921l5992L76994r7539J91965J60418
16819E673485k74413N71295j9161k7893N6108L47927K21855p9295R1564K91331
16809F852803J5573L54412J02672q1786K40917K51795L51742j98899M59554m9532
16799H299251O3324N87130K60358M1397K22963N7823N76311K25515J12383l7199
16789A0409256N93166J18900J71764K47928M19110P19893L20942J62315K97217
$$ plain form
16780 13460491 14123920 14265784 14807806 15485735 15725947 16074601 17084639 17597547 17773605
16771 17773605 18174297 18883250 20009931 20510927 21444580 21898505 22721921 23846633 24159174
16762 24159174 25817278 26464281 27704149 28649059 29979926 30899108 32418600 33630575
16754 33630575 35280649 37046587 38496522 40145110 42029534 44169819 46498756 48664150
16746 48664150 51270212 53688598 56423378 59368142 62808423 66224773 69859510 73754721
16738 73754721 77723798 82361616 86816464 91749372 97114299 102326248 107951074 113913001
16730 113913001 120450591 126783209 133394172 139946117 146583873 153097787 158966076 165002342
16722 165002342 169941178 174737445 178582169 181476512 183260447 184327624 184023016 182387493
$$ packed form
16780A3460491O63429J41864N42022O77929K40212L48654J010038N12908J76058
16771A7773605M00692P08953J126681N00996R33653M53925Q23416J124712L12541
16762B4159174J658104O47003J239868R44910J330867R19182J519492J211975
16754C3630575J650074J765938J449935J648588J884424K140285K328937K165394
16746D8664150K606062K418386K734780K944764L440281L416350L634737L895211
16738G3754721L969077M637818M454848M932908N364927N211949N624826N961927
16730A13913001O537590O332618O610963O551945O637756O513914N868289O036266
16722A65002342M938836M796267L844724K894343J783935J067177l04608j635523
$$ plain form
16714 182387493 180316788 176965683 172888086 168087481 162580539 156465000 149995965 143452011
16706 143452011 136681994 130092931 123354262 117094870 110779710 104973884 99192845 93911179
16698 93911179 88170875 83373841 79226676 74960456 70699071 66921415 63552145 60471472
16690 60471472 57192874 54017185 51811136 48963091 46603556 44359259 42502073 40263593
16682 40263593 38204749 36381195 35094039 33583581 32253627 30917259 29294030 28195264
16674 28195264 26993443 26081636 25012158 24153426 23185833 22518410 21566218 21120964 20048026
16665 20048026 19275170 18618325 17991255 17313425 16829641 16147086 15805749 15464427 15042970
16656 15042970 14277145 14070213 13369543 13436647 12669031 12218606 11951771 11667467 11591747 10956660
$$ packed form
16714A82387493k070705l351105m077597m800605n506942o115539o469035o543954
16706A43452011o770017o589063o738669o259392o315160n805826n781039n281666
16698I3911179n740304m797034m147165m266220m261385l777656l369270l080673
16690F0471472l278598l175689k206049k848045k359535k244297j857186k238480
16682D0263593k058844j823554j287156j510458j329954j336368j623229j098766
16674B8195264j201821r11807j069478q58732r67593o67423r52192m45254j072938
16665B0048026p72856o56845o27070o77830m83784o82555l41337l41322m21457
16656A5042970p65825k06932p00670O7104p67616m50425k66835k84304p5720o35087
$$ plain form
16646 10956660 10762885 10484633 10142578 9792890 9805248 9249434 9286447 9059684 8527017 8299072
16636 8299072 8108823 8057075 8207328 7628018 7385784 7412714 6995603 6663442 6515430 6908973
16626 6908973 6180475 6390417 6133101 6166715 5855869 6079399 5609322 5545676 5238560 5793083
16616 5793083 5221617 5010540 4802133 4887770 5067507 4999871 4555804 4558053 4209346 4520469
16606 4520469 4133905 4344441 4275263 4680459 4078799 4128164 3828152 3579150 3577061 3415090
16596 3415090 3751654 3496740 3503603 3575652 3533671 3481401 3700520 3010237 3029196 3290921
16586 3290921 2922735 3216902 3154034 3035233 2797598 2767160 2836087 2482059 2379629 2917609
16576 2917609 2509853 2496211 2534075 2659089 2646932 2616152 2397715 2496170 2369527 2157526
$$ packed form
16646A0956660j93775k78252l42055l49688J2358n55814L7013k26763n32667k27945
16636H299072j90249n1748J50253n79310k42234K6930m17111l32161j48012L93543
16626F908973p28498K09942k57316L3614l10846K23530m70077o3646l07116N54523
16616E793083n71466k11077k08407Q5637J79737o7636m44067K249l48707L11123
16606D520469l86564K10536o9178M05196o01660M9365l00012k49002k089j61971
16596C415090L36564k54914O863P2049m1981n2270K19119o90283J8959K61725
16586C290921l68186K94167o2868j18801k37635l0438O8927l54028j02430N37980
16576B917609m07756j3642L7864J25014j2157l0780k18437R8455j26643k12001
$$ plain form
16566 2157526 2252311 2119234 2573390 2347680 2197546 2377300 2177322 1906853 1996825 1930992
16556 1930992 2208342 1916646 1880284 1657504 1999023 2075086 2052279 2055872 1695841 1406030
16546 1406030 1503651 1673038 1956843 1416461 1933003 1902198 1576483 1569137 1990908 1351588
16536 1351588 1633761 1673020 1377254 1601950 1301614 1742051 1017223 1319635 1264818 1344105
16526 1344105 1395381 1565723 1583330 1438085 1408613 1378505 1414485 1125576 1168586 897528
16516 897528 1617288 1213592 1210553 1297250 1298058 1127450 1047079 1088904 1224907 1225494 993370
16505 993370 1121791 1080436 1268191 1114720 1136167 1265086 1131771 899333 1290495 1141568
16495 1141568 1269401 975064 950031 1116020 750195 1005496 578420 667315 1202586 836144
$$ packed form
16566B157526R4785j33077M54156k25710j50134J79754j99978k70469Q9972o5833
16556A930992K77350k91696l6362k22780L41519P6063k2807L593l60031k89811
16546A406030R7621J69387K83805n40382N16542l0805l25715p346M21771o39320
16536A351588K82173L9259k95766K24696l00336M40437p24828L02412n4817P9287
16526A344105N1276J70342J7607j45245k9472l0108L5980k88909M3010k71058
16516H97528P19760m03696l039Q6697Q08j70608q0371M1825J36003N87k32124
16505I93370J28421m1355J87755j53471K1447J28919j33315k32438L91162j48927
16495A141568J27833k94337k5033J65989l65825K55301m27076Q8895N35271l66442
$$ plain form
16485 836144 902649 1116671 860627 789940 934369 803390 940398 794508 829994 598946
16475 598946 887327 1059587 729937 754894 968362 725727 1114569 824895 943450 566825
16465 566825 799909 868631 795440 831115 826991 634081 664362 675491 1079070 771477 832716
16454 832716 675520 531111 388686 1065105 696176 742005 558029 518744 642760 656553
16444 656553 597192 629390 471639 668853 863267 676524 767884 800216 849373 956641
16434 956641 617275 984688 465257 656598 456010 403918 769906 308369 594406 695301
16424 695301 530886 545030 464542 515616 759124 542336 671799 335772 618594 499130
16414 499130 515834 531273 568663 553103 472757 507916 435077 491646 218750 434678 362674
$$ packed form
16485H36144O6505K14022k56044p0687J44429j30979J37008j45890L5486k31048
16475E98946K88381J72260l29650K4957K13468k42635L88842k89674J18555l76625
16465E66825K33084O8722p3191L5675m124j92910L0281J1129M03579l07593O1239
16454H32716j57196j44409j42425O76419l68929M5829j83976l9285J24016J3793
16444F56553n9361L2198j57751J97214J94414j86743R1360L2332M9157J07268
16434I56641l39366L67413D65257J91341k00588n2092L65988C08369K86037J00895
16424F95301j64415J4144q0488N1074K43508k16788J29463C35772K82822j19464
16414D99130J6704J5439L7390j5560q0346L5159p2839N6569B18750K15928p2004
$$ plain form
16403 362674 271552 690457 162756 417950 221501 294300 516186 416236 476443 645257
16393 645257 715440 542225 400777 661898 617882 652036 400902 132708 332590 331952 770973
16382 770973 465467 151025 370582 561201 668141 134525 312974 17128 423098 551375
16372 551375 458373 434676 201397 306691 392013 351280 141981 244190 328072 328310 331536
16361 331536 226922 714776 237572 217753 650247 442653 606831 773432 284673 174267
16351 174267 405331 570409 215603 275357 284578 278375 450684 284159 355117 59635 507310
16340 507310 279337 246377 265668 401720 309784 288718 325475 254913 398839 505753 379300
16329 379300 288005 151165 313279 -43237 392144 394225 246796 260850 260432 297860 352496
$$ packed form
16403C62674r1122M18905A62756K55194j96449P2799K21886r9950O0207J68814
16393F45257P0183j73215j41448K61121m4016L4154k51134A32708J99882o38M39021
16382G70973l05506A51025K19557J90619J06940A34525J78449A7128M05970J28277
16372E51375r3002k3697B01397J05294Q5322m0733A41981J02209Q3882K38L226
16361C31536j04614M87854B37572j9819M32494k07594J64178J66601B84673j10406
16351A74267K31064J65078B15603N9754R221o203J72309j66525P0958E9635M47675
16340E07310k27973l2960J9291J36052r1936k1066L6757p0562J43926J06914j26453
16329C79300r1295j36840J62114d3237C92144K081j47429J4054m18L7428N4636
$$ plain form
16318 352496 88032 462699 202467 312776 211505 130695 243735 364330 133058 155817
16308 155817 -32404 362732 355755 196581 301285 159788 519843 -73118 149813 588570
16298 588570 87064 211792 214093 21158 432528 503939 210393 122042 327544 116208 221150
16287 221150 -102269 405259 132178 17130 142575 27085 184566 -130607 753153 81860
16276 234921 182087 83807 158822 491819 148709 468696 192899 -119735 391029 -81407
16265 424845 -29079 -92806 404920 62826 125842 444070 321215 -73598 451154 162834
16254 59864 119915 -3707 81650 350468 219646 133860 313585 226203 -61934 79220 -155283
16242 -82239 182475 -189281 219606 69134 155220 168627 301013 44994 92236 120963 -119659
$$ packed form
16318C52496H8032L74667B02467J10309j01271q0810J13040J20595A33058K2759
16308A55817c2404C62732o977j59174J04704j41497L60055g3118A49813M38757
16298E88570H7064J24728K301B1158M11370P1411B10393q8351K05502A16208J04942
16287B21150a02269D05259A32178A7130J25445B7085J57481a30607G53153H1860
16276B34921n2834H3807P5015L32997A48709L19987A92899a19735C91029h1407
16265D24845b9079o3727D04920F2826O3016L18228j22855g3598D51154A62834
16254E9864O0051c707H1650K68818j30822q5786J79725q7382f1934G9220a55283
16242h2239A82475a89281B19606F9134Q6086J3407J32386D4994M7242K8727a19659
$$ plain form
16230 215120 394993 351579 223262 172958 22717 827263 -125398 355642 288275 164929
16220 164929 384050 65409 -40458 -41608 -15502 -3490 91462 162598 12666 133340 99650
16209 99650 -60137 -175063 187291 189315 176341 65431 134105 145261 -12919 -26135 -197183
16198 -197183 -15313 -45937 220573 -105829 -35081 212227 402791 1089 189171 203792 -182434
16186 75353 150655 243090 -281381 114963 207374 -15133 -6540 77151 -100905 -75410 84849
16174 33553 282850 -138889 125317 -16408 54573 175335 61335 139380 -171619 -25804 21710
16162 -204738 263221 -148541 82428 349649 93146 241794 186777 -381078 131815 10096
16151 204772 147428 40142 -81951 150600 188132 -30087 107009 59646 -97829 -151638 92759
$$ packed form
16230B15120J79873m3414j28317n0304B2717Q04546a25398C55642o7367j23346
16220A64929K19121F5409d0458j150a5502c490I1462P1136A2666J20674l3690
16209I9650f0137j14926A87291K024j2974F5431O8674J1156a2919j3216j71048
16198a97183a5313l0624B20573a05829c5081B12227J90564A089J88082J4621a82434
16186G5353P5302R2435b81381A14963R2411a5133f540G7151a00905K5495H4849
16174C3553K49297a38889A25317a6408E4573J20762F1335P8045a71619b5804B1710
16162b04738B63221a48541H2428K67221I3146J48648n5017c81078A31815A0096
16151B04772n7344D0142h1951A50600L7532c0087A07009m7363i7829n3809I2759
$$ plain form
16139 -32200 96888 -222575 -114420 -2674 23221 145723 -289116 -84782 66749 519819 -134635
16127 93429 118494 58610 341909 28342 92305 211706 -81270 -213621 70600 96481 -32646
16115 246269 199082 187749 95171 74813 -106565 151973 -116763 102901 -16794 -61698 272850
16103 147432 169497 181663 48572 80753 29334 19587 337617 -142610 22500 159329 23726
16091 198233 -93144 -227264 33221 52848 -89909 92266 77693 -62044 109639 53884 -152960
16079 -96475 40715 20420 -70458 -125265 4292 72441 -21778 130123 -75166 -190841 -15863
16067 32606 407919 -167483 73352 -142773 510638 30720 161959 -22117 -13208 -89266 -177553
16056 -177553 -22531 -351957 -295124 -196632 200522 267686 310973 69120 -255546 -111912 -14917
$$ packed form
16139c2200I6888b22575J08155b674B3221J22502b89116h4782F6749M53070a34635
16127I3429K5065E8610K83299B8342O3963J19401h1270j32351G0600K5881c2646
16115B46269m7187j1333r2578k0358a06565A51973a16763A02901a6794m4904B72850
16103A47432K2065J2166D8572L2181B9334r747L18030a42610B2500J36829B3726
16091A98233i3144j34120C3221J9627h9909I2266j4573f2044A09639E3884a52960
16079i6475D0715k0295g0458n4807D292O8149b1778A30123g5166j15675a5863
16067C2606L75313a67483G3352a42773E10638C0720J31239b2117Q909p6058q8287
16056a77553b2531l29426N6833R8492B00522O7164M3287F9120b55546a11912a4917
$$ plain form
16044 217281 -137771 197572 -195715 14657 -61134 -210939 -387361 -60533 6345 5905 47074
16033 47074 28952 -13111 372353 -116877 340117 60070 111359 -152913 42220 89571 58199
16022 58199 95800 -233826 27756 -48893 -140961 86312 57194 148803 -104132 220189 -382221
16010 -103585 196173 62132 -186294 77462 55704 187916 -131576 75293 -2869 -163842 -111566
15999 -111566 -271873 176226 175881 -80385 -123373 -37354 -389207 -174841 128072 -261065 66418
15987 -50311 -297197 -118017 -102551 416504 -331841 136229 7933 -258189 -147536 95836
15976 -84669 33557 63769 -3122 -82622 -55788 -254755 216532 -353329 199042 -68213 -67508
15965 -67508 173672 -58496 -11856 147775 425191 125632 -85191 330258 47548 125716 74843
$$ packed form
16044B17281a37771A97572a95715A4657f1134j49805j76422f0533F345m40M1169
16033D7074j8122a3111C72353a16877C40117F0070N1289a52913D2220M7351l1372
16022E8199L7601b33826B7756d8893r2068H6312k9118R1609a04132B20189c82221
16010a03585A96173F2132a86294G7462k1758J32212a31576G5293b869j60973N2276
15999a11566j60307A76226l45h0385m2988c7354l51853a74841A28072b61065F6418
15987e0311k46886a18017J5466D16504c31841A36229G933b58189J10653I5836
15976h4669C3557L0212c122p9500K6834j98967B16532c53329A99042f8213P05
15965f7508A73672e8496a1856A47775K77416A25632h5191C30258D7548P8168n0873
$$ plain form
15954 74843 -102565 -261102 -20079 9518 45143 -314140 40313 51014 -111862 158271 -18425
15942 -153400 149895 -131710 120681 -141498 124908 -251577 -2671 -204244 98429 120687
15932 120687 109228 52811 -98027 -92422 96449 -80633 37287 175092 -137254 -62146 -69030
15921 -69030 -73157 -10116 -4680 -4070 49699 128961 -263509 82207 -148127 22655 138112 -65291
15908 -194228 229855 274862 6065 -162157 -57517 124801 332009 191896 -42339 -142204 -22808
15896 100354 108188 122240 217787 -56712 -28285 -171962 57154 -26640 15717 -18423 -147854
15885 -147854 -1339 -121302 28058 -170124 -212995 -50540 287154 -48974 6977 -62398 197344
15873 -67905 -73198 -1351 -232146 103945 106266 249708 -165957 -11362 -152933 20174 -28933
$$ packed form
15954G4843a02565j58537b0079I518L5625c14140D0313J0701a11862A58271a8425
15942a53400A49895a31710A20681a41498A24908b51577b671k01573I8429K2258
15932A20687j1459E2811i8027N605I6449h0633C7287J37805a37254f2146o884
15921f9030m127a0116d680O10D9699P9262b63509H2207a48127B2655J15457f5291
15908a94228B29855M5007F065a62157e7517A24801K07208j40113d2339r9865b2808
15896A00354P834J4052R5547e6712b8285j43677E7154b6640A5717a8423j29431
15885a47854a339j19963B8058a70124m2871e0540B87154d8974F977f2398A97344
15873f7905n293a351k30795A03945K321J43442a65957a1362j41571B0174b8933
$$ plain form
15861 35039 -76605 -288310 -159005 9721 259265 -237036 -66556 -216557 116605 256513
15851 256513 -82153 -51625 199898 198979 -16167 -90239 -91127 111844 -42414 -482230 122760
15839 -67525 -49052 17517 -458294 -152693 146439 -7605 142625 -148766 -140095 -231917 -78904
15827 192207 320116 -206534 231045 -161453 -70429 7072 -24565 96329 -86961 -42819 9988
15815 182606 -44476 -104913 97036 -174703 19966 811 120858 -29729 -391087 -271182 -205635
15804 -205635 -174424 -22518 -196093 164051 -192630 115329 -5348 -210891 272216 -167251
15793 -134374 132537 -186603 -76765 188396 42146 -168949 -405328 -26344 -151186 -14877
15782 -110780 8455 -66093 -292454 -49530 -135815 -63935 34682 -23530 -82405 -169871 73143
$$ packed form
15861C5039g6605k11705J29305I721K49544b37036f6556j50001A16605J39908
15851B56513h2153L0528A99898r19a6167p4072q88A11844d2414m39816A22760
15839f7525J8473A7517d58294a52693A46439g605A42625a48766Q671r1822g8904
15827A92207J27909b06534B31045a61453g0429G072b4565I6329h6961d2819I988
15815A82606d4476o0437I7036a74703A9966H11J20047b9729l61358J19905O5547
15804b05635L1211b2518j73575A64051a92630A15329e348k05543B72216a67251
15793a34374A32537a86603g6765A88396D2146a68949k36379b6344j24842a4877
15782a10780H455f6093k26361d9530q6285f3935C4682b3530n8875q7466G3143
$$ plain form
15770 -195811 -483516 249234 -275325 -38468 196790 -259207 -116365 -39587 84840 -89985
15759 -131851 190232 -35799 -33686 187540 -81098 -89157 207672 -150383 142754 -27642 -7247
15747 19995 53999 -95861 186342 226697 -57344 -196331 171624 -244425 267349 -209367
15736 193896 -236529 -155331 82406 -99317 -96259 -256672 -157011 9319 -51581 -56628 -90663 -152192
15724 -152192 210636 -129721 4769 -21194 -695912 -88145 47563 -165927 -16001 -3 -151735
15713 -151735 -41441 232061 306969 253460 308563 80162 37256 -38492 22347 -52423 -38711
15702 -38711 14404 -119405 -57607 -108532 -164035 -12270 343720 -286394 235148 -143097 180956
15690 201583 -33736 -347985 -133261 313464 -6088 -332424 -94049 300453 -116890 -26680
$$ packed form
15770a95811k87705B49234b75325c8468A96790b59207a16365c9587H4840h9985
15759a31851A90232c5799K113A87540h1098q059B07672a50383A42754b7642g247
15747A9995L4004i5861A86342M0355e7344j38987A71624b44425B67349b09367
15736A93896b36529Q1198H2406i9317L058j60413R9661I319e1581n047l4035o1529
15724a52192B10636a29721D769b1194o74718h8145D7563a65927a6001cj51732
15713a51735d1441B32061P4908n3509N5103H0162C7256c8492B2347e2423J3712
15702c8711A4404a19405e7607n0925n5503a2270C43720b86394B35148a43097A80956
15690B01583c3736l14249a33261C13464f088l26336i4049C00453a16890b6680
$$ plain form
15679 -1234 -207246 152124 -129872 -311025 -155235 -95478 53002 -219649 15812 16531 42342
15668 42342 -166692 278295 -93557 200156 -439414 154858 -79136 13562 -113659 -42722
15657 388299 54040 -141152 -262506 -389422 116418 -142153 134949 -232231 90433 -220362
15646 -314236 -192640 -135797 47476 17790 -203902 -86153 53535 -309242 252869 77717 -4754
15634 -73073 27397 115731 67043 -136860 50072 -9691 -199813 177513 -104242 282953 221993
15623 221993 -53518 -91006 -237020 -343700 -382653 213206 -9613 -37869 -52508 -238027 13126
15611 191067 -213795 219465 7187 -28132 86420 -329458 43093 115731 194517 84937 -245484
15599 248819 -279242 203246 -71295 203309 62524 34499 -77212 -409350 63838 52096 -462976
$$ packed form
15679a234k06012A52124a29872j81153a55235N9757E3002b19649A5812P19K5811
15668D2342a66692B78295i3557B00156d39414A54858g9136A3562a13659d2722
15657C88299E4040a41152j21354j26916A16418a42153A34949b32231I0433b20362
15646c14236J21596N6843D7476A7790b03902h6153E3535c09242B52869G7717d754
15634g3073B7397Q8334m8688a36860E0072i691j90122A77513a04242B82953o0960
15623B21993e3518l7488j46014j06680l8953B13206i613k8256j4639j85519A3126
15611A91067b13795B19465G187b8132H6420c29458D3093P2638P8786H4937b45484
15599B48819b79242B03246g1295B03309F2524k8025g7212l32138F3838j1742d62976
$$ plain form
15587 -49150 129262 107736 -237256 -33318 -54571 -131513 -207231 -81715 -164981 -334638 157827
15575 36325 -132091 -38395 -98369 268346 -118315 152342 -57781 -34952 42214 -37149 -118487
15564 -118487 77704 -290124 241787 245357 -130678 -175274 239024 137888 174699 377733
15554 377733 -60879 -193585 69495 61871 -273864 348282 -26532 -97461 -69090 149826 85230
15543 85230 -462113 -81990 -18892 189923 43115 -29028 29146 64484 -139444 -30152 -86813
15532 -86813 -113151 15870 73589 -166176 -215115 129831 -61285 -111054 -278223 259 11415
15521 11415 -95005 827 -112899 11035 244639 136184 -93387 271284 246044 184262 175675
15510 175675 253819 -266420 42594 -114115 3268 -188484 229863 -36166 161697 -66938 -16385
$$ packed form
15587d9150A29262k1526b37256c3318k1253p6942p5718h1715q3266j69657A57827
15575C6325a32091c8395n9974B68346a18315A52342e7781K2829D2214c7149q1338
15564a18487G7704b90124B41787L570a30678m4596B39024j01136L6811K03034
15554C77733f0879j32706F9495p624b73864C48282b6532p0929K8371A49826o4596
15543H5230d62113h1990a8892A89923D3115b9028B9146L5338a39444c0152n6661
15532h6813k6338A5870N7719a66176m8939A29831f1285m9769j67169B59J1156
15521A1415i5005H27a12899A1035K33604j08455i3387B71284k5240o1782q587
15510A75675P8144b66420D2594a14115C268a88484B29863c6166A61697f6938a6385
$$ plain form
15498 -249950 212605 -241478 71416 100461 6350 -61199 75055 30816 495307 -168339 -86527
15487 -86527 -99788 136948 432134 -70645 118362 -106876 -50371 -105021 216422 -119984
15476 -120053 -20695 109231 60734 -39183 194746 -301598 164075 55195 61289 225796 443654
15465 443654 11012 -93119 86002 -209083 44104 -100794 -465416 301 32139 -216629 -16612
15453 156598 -12353 214714 118503 113358 1075 276587 157483 -116412 -288496 111851 64229
15442 64229 -234828 185457 -186398 -52038 99538 55451 -109565 148448 -197525 -24379
15431 548476 298040 375660 15159 -181520 106731 44576 32710 -75804 260711 1681 -90228
15419 -312850 7865 -233888 -134477 -86352 -58935 62854 -164090 126508 -325911 -319705 -278910
$$ packed form
15498b49950B12605b41478G1416K9045F350f1199G5055C0816M64491a68339Q1812
15487h6527j3261A36948K95186g0645A18362a06876e0371n4650B16422a19984
15476a20053b0695A09231m8497c9183A94746c01598A64075E5195O094J64507K17858
15465D43654A1012i3119H6002b09083D4104a00794l64622C01L1838b16629a6612
15453A56598a2353B14714r6211n145A075K75512j19104a16412j72084A11851m7622
15442F4229b34828A85457a86398e2038I9538m4087a09565A48448a97525b4379
15431E48476k50436P7620A5159a81520A06731D4576j1866g5804B60711A681i0228
15419c12850G865b33888R9411M8125K7417F2854a64090A26508c25911O206M0795
$$ plain form
15408 -278910 171956 -161674 176729 104949 178646 49484 126223 32255 55619 -2927 -54646
15397 -54646 12622 260654 180922 -13990 64382 -285361 107 80277 260065 -27346 -97152
15386 -97152 105385 96267 92245 250825 -44926 104908 -165908 247922 147683 273794 -397070
15374 -113886 -120107 196600 218788 352523 125510 12295 -189050 -51378 82357 -78857 147232
15362 -161917 40218 28186 96544 -135206 -119495 -39959 -145825 -734 23987 96426 291556
15351 291556 34621 -13820 325867 -78797 -182596 -15430 -7078 -249228 -93626 -261208 319737
15339 -133281 -502896 27581 175119 255207 -179323 85384 110945 42504 -199371 -51825 -23446
15327 -109694 81095 186042 -255602 182654 -86913 164703 270356 -103734 71096 119957
$$ packed form
15408b78910A71956a61674A76729p1780P3697D9484P6739C2255K3364b927n1719
15397e4646A2622K48032p9732a3990F4382b85361A07Q0170J79788b7346o9806
15386i7152A05385r118m022J58580d4926A04908a65908B47922j00239J26111c97070
15374a13886o221A96600K2188J33735A25510A2295a89050e1378H2357g8857A47232
15362a61917D0218j2032O8358a35206J5711c9959j05866g34B3987P2439J95130
15351B91556C4621a3820C25867g8797j03799a5430g078k42150i3626j67582C19737
15339a33281l69615B7581J47538Q0088a79323H5384K5561D2504a99371e1825b3446
15327a09694H1095J04947b55602A82654h6913A64703J05653a03734G1096M8861
$$ plain form
15317 119957 306941 -82961 -178205 -93155 91661 319120 316740 180915 -319977 12351 -229978
15305 -15427 -116016 -117733 -26584 -6947 113832 -102351 254356 -70155 156848 67230 236972
15294 236972 178296 220870 -57005 21429 -100938 111492 144782 70455 -255287 -89034 59258
15282 -437067 127068 121791 220399 -152301 42816 167941 273113 185410 81863 55437 276602
15271 276602 -172440 243158 228912 95715 166718 -182995 -101053 12408 194767 -79424 -217726
15260 -217726 -115045 84277 -142911 -93032 54673 134906 13592 246322 319970 -233758 97450
15248 190313 442739 1115680 1969040 1330464 1754764 1855789 630963 152006 189119 205079
15238 205079 97796 155308 -19347 28703 197172 2153 -38881 -74949 -51669 216664 267125
$$ packed form
15317A19957J86984h2961r5244Q5050I1661K27459k380j35825c19977A2351b29978
15305a5427j00589j717b6584f947A13832a02351B54356g0155A56848F7230J69742
15294B36972n8676M2574e7005B1429a00938A11492L3290G0455b55287h9034E9258
15282d37067A27068n277R8608a52301D2816J25125J05172q7703H1863k6426K21165
15271B76602a72440B43158j4246I5715P1003a82995Q1942A2408J82359g9424j38302
15260b17726J02681H4277a42911M9879E4673Q0233A3592K32730P3648b33758I7450
15248A90313K52426O72941Q53360o38576M24300J01025F30963A52006L7113J5960
15238B05079I7796N7512a9347B8703J68469B153c8881l6068K3280B16664N0461
$$ plain form
15227 267125 251781 290434 339637 -243211 32441 148084 -96900 -133980 133155 256540 -77120
15215 40176 32831 159634 32533 138789 -41629 111531 -161149 108975 28205 161726 65104
15203 -18401 24415 287659 21254 235840 -195142 -193482 -156713 76320 -75145 253834 109699
15191 127181 22124 -230915 127671 -100351 -117096 234334 418766 37661 127611 -27571
15180 119129 15063 138568 24033 88616 -98166 -6798 141431 33025 158854 305923 331773
15169 331773 47050 250902 96010 388579 -114663 263131 -101810 171531 352006 -30199
15158 -128514 -34339 5438 173493 -164090 26586 53687 65045 -8183 -190872 48881 510204
15147 510204 335100 -171946 114551 90261 109815 216425 142331 61541 222851 184257
$$ packed form
15227B67125j5344L8653M9203b43211C2441J15643i6900l7080A33155J23385g7120
15215D0176p345J26803C2533J06256d1629A11531a61149A08975B8205J33521F5104
15203a8401B4415K63244B1254K14586a95142J660L6769G6320g5145B53834A09699
15191A27181B2124b30915A27671a00351j6745B34334J84432C7661Q9950b7571
15180A19129A5063J23505B4033O4583i8166f798A41431C3025J25829J47069K5850
15169C31773D7050K03852I6010K92569a14663B63131a01810A71531J80475c0199
15158a28514c4339E438J68055a64090B6586K7101J1358h183j82689D8881M61323
15147E10204j75104a71946A14551k4290J9554J06610p4094F1541J61310l8594
$$ plain form
15137 184257 233834 -274854 88724 -223021 160382 68885 191214 134672 192648 144470 186995
15126 186995 57972 -67274 -101334 -48665 -196806 261321 94148 -26021 19757 231074 97976
15114 -94322 27544 301504 120092 391817 -110628 -175411 -185558 306326 31858 48375 120087
15103 120087 187224 -99302 219162 59009 77723 -6803 64124 233718 205077 249964 63423
15091 14350 113201 131100 9801 244558 64270 7068 230402 -245663 295239 -144121 269881
15079 154512 -71965 251904 17186 258010 250367 126613 -60079 184644 51126 164313 -117166
15067 278339 -224719 294082 61813 193176 122960 87345 127750 -124238 306650 193539
15057 193539 243970 155940 -29266 151681 -17910 188260 286819 135642 245257 31361 -84470
$$ packed form
15137A84257M9577b74854H8724b23021A60382F8885J22329n6542N7976m8178M2525
15126A86995E7972f7274l4060d8665j48141B61321I4148b6021A9757K11317I7976
15114i4322B7544K73960A20092K71725a10628o4783j0147C06326C1858J6517P1712
15103A20087O7137i9302B19162E9009J8714f803F4124J69594k8641M4887F3423
15091A4350R8851J7899I801K34757F4270G068K23334b45663B95239a44121B69881
15079A54512g1965B51904A7186K40824p643j23754f0079A84644E1126J13187a17166
15067B78339b24719B94082F1813J31363p0216l5615M0405a24238C06650j13111
15057A93539N0431q8030b9266A51681a7910A88260R8559A35642J09615C1361h4470
$$ plain form
15045 275993 -126884 93048 107954 137101 -147355 193995 508268 101386 241090 139754
15035 139754 153433 156641 -69949 174458 186689 30582 98601 -7312 -119382 133644 277132
15024 277132 -101758 219946 24775 174824 132069 214929 143246 11321 -44365 184390 179826
15013 179826 99217 219045 7591 468176 -23677 231124 293411 509114 -182158 62135 161556
15002 161556 -92273 422506 409118 534575 185541 424148 299781 203649 -70391 255434
14991 58928 -17924 155198 371021 168096 137282 -110917 362950 97144 75169 189653
14981 189653 162706 -161026 159090 257600 393392 319613 342219 303801 346337 259133 247518
14970 247518 93919 388535 126937 200930 33852 -27662 23634 141095 307342 8607 272275
$$ packed form
15045B75993a26884I3048J4906K9147a47355A93995L14273A01386J39704j01336
15035A39754J3679L208f9949A74458J2231C0582O8019g312j12070A33644J43488
15024B77132a01758B19946B4775J50049m2755Q2860p1683A1321d4365A84390m564
15013A79826q0609J19828G591M60585b3677B31124O2287K15703a82158F2135R9421
15002A61556i2273D22506j3388J25457A85541K38607j24367r6132g0391B55434
14991E8928a7924A55198K15823A68096l0814a10917C62950I7144k1975J14484
14981A89653k6947a61026A59090R8510J35792p3779K2606l8418M2536q7204j1615
14970B47518I3919K94616A26937P3993C3852b7662B3634J17461J66247H607K63668
$$ plain form
14959 272275 198227 263868 81426 420618 363451 50763 459390 713204 244806 -162419
14948 385031 213419 368080 250158 362374 261411 223985 353837 70568 290027 252960
14938 252960 139780 -64400 475983 164866 533027 344828 862371 30931 231289 409324
14928 409324 148881 51773 331083 -29052 235356 276095 222132 327 376447 137225 507333
14917 507333 465420 434630 431860 228724 162105 238754 107944 -297710 419312 429304 8530
14905 300740 181369 536206 171081 231625 170918 523075 197387 10692 707978 339829
14894 19031 348796 187240 785359 434069 549678 610062 444721 423186 165299 213764
14884 213764 379544 193308 657608 558778 236562 385314 369311 311286 255874 345593
$$ packed form
14959B72275p4048O5641H1426L39192n7167E0763M08627K53814B44806a62419
14948C85031j71612J54661j17922J12216j00963l7426J29852G0568K19459l7067
14938B52960j13180f4400D75983A64866L68161j88199N17543C0931K00358J78035
14928D09324A48881E1773K79310b9052B35356M0739n3963C27L76120A37225L70108
14917E07333m1913l0790k770k03136o6619P6649A07944b97710D19312R992H530
14905C00740j19371L54837A71081O0544o0707L52157A97387A0692O97286C39829
14894A9031L29765j61556N98119l51290J15609O0384j65341k1535A65299M8465
14884B13764J65780j86236M64300r8830B36562J48752j6003n8025n5412Q9719
$$ plain form
14874 345593 665064 263467 631386 421129 158938 412027 247530 352812 338770 139487
14863 433100 314627 414203 155538 427308 578420 372431 738793 698836 363497 250863
14853 250863 512454 213705 343675 113546 227466 471830 442255 777973 -59961 514636
14842 461643 558045 45847 27082 477703 282660 248698 745115 671754 617969 371403 384057
14831 384057 297417 496567 628661 319415 700233 911944 715131 449476 509433 491471
14821 491471 585174 621897 77949 272518 314510 350045 341140 451658 305263 655632 445671
14810 445671 232380 196914 496305 587990 490395 551405 321825 587392 727027 746280
14800 746280 385330 549419 353584 365720 646408 672222 811764 616306 768427 454766
$$ packed form
14874C45593L19471B63467L67919k10257A58938K53089j64497J05282j4042A39487
14863D33100j18473R9576A55538K71770J51112k05989L66362l9957l35339j12634
14853B50863K61591B13705J29970A13546J13920K44364k9575L35718e9961E14636
14842D61643R6402D5847j8765M50621j95043l3962M96417p3361n3785k46566J2654
14831C84057q6640J99150J32094l09246L80818K11711j96813k65655N9957j7962
14821D91471R3703L6723G7949J94569M1992L5535q905J10518j46395L50369k09961
14810D45671k13291l5466K99391R1685r7595O1010k29580K65567J39635J9253
14800G46280l60950J64089j95835J2136K80688K5814J39542j95458J52121l13661
$$ plain form
14790 454766 512560 864181 666606 420172 371902 384514 725434 461102 513020 499957
14780 499957 272459 666439 516594 372931 469271 654018 572343 796158 553599 444955
14770 444955 278359 586175 624661 543393 695493 772074 681154 502577 641088 738730
14760 738730 674266 644337 561180 745608 690293 792796 465754 659009 764670 604932
14750 604932 764435 471105 724233 628603 453864 631171 854902 743800 689414 288089
14739 936828 573047 762422 933044 645928 751919 772850 822753 764591 613294 837682
14729 837682 775144 1006292 547593 870093 683931 724494 874881 824476 990404 590827
14719 590827 908011 688502 636004 824045 972155 1061238 564153 590271 824138 934294
$$ packed form
14790D54766N7794L51621j97575k46434m8270J2612L40920k64332N1918j3063
14780D99957k27498L93980j49845j43663R6340J84747q1675K23815k42559j08644
14770D44955j66596L07816L8486q1268J52100P6581r0920j78577J38511R7642
14760G38730o4464k9929q3157J84428n5315J02503l27042J93255J05661j59738
14750F04932J59503k93330K53128r5630j74739J77307K23731j11102n4386B88089
14739I36828l63781J89375J70622k87116J05991K0931M9903n8162j51297K24388
14729H37682o2538K31148m58699L22500j86162M0563J50387n0405J65928l99577
14719E90827L17184k19509n2498J88041J48110Q9083m97085K6118K33867J10156
$$ plain form
14709 934294 782035 949546 545703 880005 389791 915352 879208 667232 943139 975382
14699 975382 414823 686217 563760 676424 931924 939048 437064 1022443 927235 778531
14689 778531 598763 934343 1153052 1121142 839688 834470 1451074 792473 854397 917428
14679 917428 870902 836388 1126369 849761 1479263 967936 1178773 1038854 809068 1184828
14669 1184828 999786 1164413 1091112 935296 1148033 1186636 1096367 1200173 1088851 891633
14659 891633 1100558 1034690 878824 1055636 1267330 963307 1040689 1311039 1477261 1145835
14649 1145835 878128 1163194 1182992 1409791 1016307 1322013 1124242 1529422 1224339 1113779
14639 1113779 1310207 1307883 1144186 902638 1352697 1411270 1265591 1258664 1237725 1361930
$$ packed form
14709I34294j52259J67511m03843L34302C89791N25561l6144k11976K75907L2243
14699I75382D14823K71394j22457J12664K55500P124D37064N85379r5208j48704
14689G78531j79768L35580K18709l1910k81454n218O16604o58601O1924O3031
14679I17428m6526l4514K89981k76608O29502n11327K10837j39919k29786L75760
14669A184828j85042J64627p3301j55816K12737L8603r0269J03806j11322j97218
14659H91633K08925o5868j55866J76812K11694l04023P7382K70350J66222l31426
14649A145835k67707K85066J9798K26799l93484L05706j97771M05180l05083j10560
14639A113779J96428k324j63697k41548M50059N8573j45679o927k0939J24205
$$ plain form
14629 1361930 1662193 1351856 1253175 1004278 1591285 1300512 1248020 1321617 1515799 1417400
14619 1417400 1485754 1469118 1467315 1335907 1429070 1385272 1316163 1245775 1481600 1427816 1296648
14608 1296648 1522698 1636715 1537536 1517347 1726647 1722874 1368747 1723050 1556203 1655306
14598 1655306 1651804 1587132 1551476 1313002 1490546 1546975 1924977 1827701 1860313 1828975 1853510
14587 1853510 1541203 1744434 1889462 1911057 1962081 2089474 1788944 1806574 1968569 1941078
14577 1941078 1790709 2124428 1895830 1884908 2122538 1874082 2432183 2198378 2011385 2286493
14567 2286493 2476730 2331050 2104463 2644481 2489326 2401802 2607035 2584240 2669230 2544728
14557 2544728 2877685 2890853 3398130 3400813 3672470 4017988 4420433 5421088 7524753 10755265
$$ packed form
14629A361930L00263l10337r8681k48897N87007k90773n2492P3597J94182r8399
14619A417400O8354j6636j803j31408R3163m3798o9109p0388K35825n3784j31168
14608A296648K26050J14017r9179k0189K09300l773l54127L54303j66847R9103
14598A655306l502o4672l5656k38474J77544N6429L78002r7276L2612l1338K4535
14587A853510l12307K03231J45028K1595N1024J27393l00530J7630J61995k7491
14577A941078j50369L33719k28598j0922K37630k48456N58101k33805j86993K75108
14567B286493J90237j45680k26587N40018j55155q7524K05233k2795Q4990j24502
14557B544728L32957J3168N07277K683K71657L45518M02445J000655K103665L230512
$$ plain form
14547 10755265 18981584 35795012 45478423 26489125 12807194 8405029 4576514 3139432
14539 3139432 2181344 1895253 1930727 1886991 1841711 1784361 2107985 1858666 2020288 2249473
14529 2249473 2096794 2195705 2164764 2349424 2514836 2475159 2306624 2299652 2390365 2427670 2615469
14518 2615469 2397803 2442296 2865908 2615157 2523545 2908706 2415620 2777549 2585074 2886636
14508 2886636 2811163 2726096 2699574 2956880 3167278 2880947 2873383 3308924 3213290 2967497
14498 2967497 3034976 3157534 3566897 3297835 3147608 3479283 3224469 3372392 3463122 3443525
14488 3443525 3810427 3560421 3278519 3845244 3642374 3606394 3799747 3977532 3606704 4198608
14478 4198608 4272712 4096737 4050713 4107458 4346289 4258307 4146898 4237419 4419528 4407996
$$ packed form
14547A0755265Q226319J6813428R683411j8989298A2807194m402165l828515j437082
14539C139432r58088k86091L5474m3736m5280n7350L23624k49319J61622K29185
14529B249473j52679R8911l0941J84660J65412l9677j68535o972R0713L7305J87799
14518B615469k17666M4493M23612k50751r1612L85161m93086L61929j92475L01562
14508B886636p5473q5067k6522K57306K10398k86331p564M35541r5634k45793
14498B967497O7479J22558M09363k69062j50227L31675k54814J47923R0730j9597
14488C443525L66902k50006k81902N66725k02870l5980J93353J77785l70828N91904
14478D198608P4104j75975m6024N6745K38831q7982j11409R0521J82109j1532
$$ plain form
14468 4407996 4250924 4659720 4248022 4749509 4634214 4801426 4668071 4777142 5114269
14459 5114269 4697016 5076247 4989737 5245572 4876564 5108783 5282932 5119180 5321534 5438884
14449 5438884 5516697 5232886 5598303 5779167 6012535 5878459 6054348 5855580 5835088 6505959
14439 6505959 6363610 6239119 6507360 6461911 6649151 6844953 6947321 6863029 6983011 6588746
14429 6588746 7230463 6828289 7348783 7192947 7604229 7677763 7393638 7713724 7885283 7596334
14419 7596334 7984461 8215948 8198590 8433404 8432347 8485840 9012004 9019299 9026972 9090461 9114582
14408 9114582 9272828 9585550 9709928 9915046 9785834 10338009 10524209 10662755 10347494
14399 10347494 10791859 10900557 11163338 11247748 11647452 11764844 12011489 12128972 12108183 12598362
$$ packed form
14468D407996j57072M08796m11698N01487j15295J67212j33355J09071L37127
14459E114269m17253L79231q6510K55835l69008K32219J74149j63752K02354J17350
14449E438884P7813k83811L65417J80864K33368j34076J75889j98768k0492O70871
14439F505959j42349j24491K68241m5449J87240J95802J02368q4292J19982l94265
14429F588746O41717m02174N20494j55836M11282P3534k84125L20086J71559k88949
14419G596334L88127K31487j7358K34814j057N3493N26164P295P673O3489K4121
14408I114582J58246L12722J24378K05118j29212N52175J86200J38546l15261
14399A0347494M44365J08698K62781Q4410L99704J17392K46645J17483k0789M90179
$$ plain form
14389 12598362 12791863 12966651 12860945 13288763 13748173 13612178 14155771 14258268 14809649
14380 14809649 14798116 15062843 15531381 15762417 16186568 16499954 16518898 17340530 17198757 17687129
14370 17687129 18089969 18126889 18532859 19200843 19581563 19808421 20338348 20523203 20963591
14361 20963591 21623110 22261257 22670719 22803934 23539985 24119486 24698693 25218454 26062851
14352 26062851 26448025 27009636 27704022 28133687 29061883 29646402 30306375 31291281 31880679
14343 31880679 32834818 33570595 34700948 35164459 36724244 37723864 38122811 39375790 40580387
14334 40580387 41666143 43023637 44325358 45540159 47057298 48417097 50021700 51639209
14326 51639209 53328764 54967510 56829718 58508389 60602780 63049831 65191196 67310958
$$ packed form
14389A2598362J93501J74788j05706M27818M59410j35995N43593J02497N51381
14380A4809649j1533K64727M68538K31036M24151L13386J8944Q21632j41773M88372
14370A7687129M02840L6920M05970O67984L80720K26858N29927J84855M40388
14361B0963591O59519O38147M09462J33215P36051N79501N79207N19761Q44397
14352B6062851L85174N61611O94386M29665R28196N84519O59973R84906N89398
14343C1880679R54139P35777J130353M63511J559785R99620L98947J252979J204597
14334D0580387J085756J357494J301721J214801J517139J359799J604603J617509
14326E1639209J689555J638746J862208J678671K094391K447051K141365K119762
$$ plain form
14318 67310958 69633888 72149684 74808875 77364227 81107312 84002111 87102077 90495202
14310 90495202 94342653 98516367 102621097 106765205 111520909 116353001 121713023 127035322
14302 127035322 132878463 138946119 145538113 152491685 160018200 167878721 175840237 185164277
14294 185164277 194117689 204262516 214478007 225339557 236795951 249257644 261589330
14287 261589330 274695147 288585810 302908383 317513486 332279866 347380954 362598167
14280 362598167 377443473 392183238 406198873 419454778 431765665 442752471 451562126
14273 451562126 456563505 458963862 459409140 459258503 459286895 456455712 455709108 451928653 445184869
14264 445184869 435387669 424168495 411207612 397228894 382398947 367413089 351715534
$$ packed form
14318F7310958K322930K515796K659191K555352L743085K894799L099966L393125
14310I0495202L847451M173714M104730M144108M755704M832092N360022N322299
14302A27035322N843141O067656O591994O953572P526515P860521P961516R324040
14294A85164277Q953412J0144827J0215491J0861550J1456394J2461693J2331686
14287B61589330J3105817J3890663J4322573J4605103J4766380J5101088J5217213
14280C62598167J4845306J4739765J4015635J3255905J2310887J0986806Q809655
14273D51562126N001379K400357M45278j50637K8392k831183p46604l780455o743784
14264D45184869r797200j1219174j2960883j3978718j4829947j4985858j5697555
$$ plain form
14257 351715534 336182967 320876562 305600522 290844792 277556873 264844887 251905160
14250 251905160 239425390 227751650 216429035 205871230 195704397 186530064 177849572
14243 177849572 169343277 161475380 154248554 147044630 140129751 134185814 128751111 122979573
14235 122979573 117986844 112509285 107843845 103750362 99988923 95852678 91920596 88509742
14227 88509742 84937060 81733861 78477158 75643437 72945420 70391138 67927364 65557563
14219 65557563 63598372 61545326 59414269 57534477 55353041 53936046 52664271 50855731
14211 50855731 49142280 47618720 46130700 44735741 44411763 43172606 41685776 40421486
14203 40421486 38725834 37947841 37370586 36360708 35563797 34049651 33279559 32263858 31549514
$$ packed form
14257C51715534j5532567j5306405j5276040j4755730j3287919j2711986j2939727
14250B51905160j2479770j1673740j1322615j0557805j0166833r174333q680492
14243A77849572q506295p867897p226826p203924o914879n943937n434703n771538
14235A22979573m992729n477559m665440m093483l761439m136245l932082l410854
14227H8509742l572682l203199l256703k833721k698017k554282k463774k369801
14219F5557563j959191k053046k131057j879792k181436j416995j271775j808540
14211E0855731j713451j523560j488020j394959l23978j239157j486830j264290
14203D0421486j695652p77993n77255j009878p96911j514146p70092j015701p14344
$$ plain form
14194 31549514 30638222 30277410 29187696 28603247 27788557 27353912 27153223 26073301 25275551
14185 25275551 24563508 24207037 23658479 23342928 22599095 22388219 21818146 21416674 20901028
14176 20901028 20221890 19879086 19480252 19170612 18809027 18488801 18467672 17764741 17357119
14167 17357119 16900229 16619270 16534863 16104397 15833299 15414490 15226060 14868322 14615663
14158 14615663 14194953 14387071 13745686 13707524 13247308 13304556 13122992 13034458 12796770 12559397
14148 12559397 12155622 11834868 11807630 11191854 11483294 11335349 11150658 11015031 10676170
14139 10676170 10698553 10539867 10567842 10385478 9920805 9645102 9796426 9290044 9684955 9505896
14129 9505896 9095588 9179131 8985580 8842324 8666453 8557352 8669192 8343084 8259049 8552893
$$ packed form
14194C1549514r11292l60812j089714n84449q14690m34645k00689j079922p97750
14185B5275551p12043l56471n48558l15551p43833k10876n70073m01472n15646
14176B0901028o79138l42804l98834l09640l61585l20226k1129p02931m07622
14167A7357119m56890k80959q4407m30466k71098m18809j88430l57738k52659
14158A4615663m20710J92118o41385l8162m60216N7248j81564q8534k37688k37373
14148A2559397m03775l20754k7238o15776K91440j47945j84691j35627l38861
14139A0676170K2383j58686K7975j82364m64673k75703J51324n06382L94911j79059
14129I505896m10308Q3543j93551j43256j75871j09101J11840l26108q4035K93844
$$ plain form
14119 8552893 8146669 7914299 7864327 7901070 7546679 7602625 7637022 7276712 7265675 7352924
14109 7352924 7092831 7088910 6706826 6607954 6846958 6430356 6664154 6686304 6401835 6277915
14099 6277915 6334437 6239743 6348781 6256249 6147487 6045623 5763367 5596238 5986718 5389032
14089 5389032 5493498 5636031 5494355 5609579 5450519 5267190 5141502 5506013 5263947
14080 5263947 5308869 4990258 4954066 4801671 5010536 4803337 4989536 4973041 4647484 4701902
14070 4701902 4335351 4620814 4606545 4171383 4721390 4216330 4385487 4304001 4307345 4361408
14060 4361408 4059364 4139528 3866227 4345124 4146105 4152043 3889438 3957869 4178779 3910668
14050 3910668 3765693 3761978 3880068 3830369 3430983 3450867 3365333 3514017 3829162 3562386
$$ packed form
14119H552893m06224k32370m9972L6743l54391N5946L4397l60310j1037Q7249
14109G352924k60093l921l82084r8872K39004m16602K33798K2150k84469j23920
14099F277915N6522r4694J09038r2532j08762j01864k82256j67129L90480n97686
14089E389032J04466J42533j41676J15224j59060j83329j25688L64511k42066
14080E263947M4922l18611l6192j52395K08865k07199J86199j6495l25557N4418
14070D701902l66551K85463j4269m35162N50007n05060J69157q1486L344N4063
14060D361408l02044Q0164k73301M78897j99019N938k62605O8431K20910k68111
14050C910668j44975l715J18090m9699l99386J9884q5534J48684L15145k66776
$$ plain form
14040 3562386 3218232 3380759 3359921 3207572 3325030 3367517 3239761 3037487 3224347 3430679
14030 3430679 3412723 3171673 3462646 3396251 3148806 3054119 2844868 2912273 3179286 2693676
14020 2693676 2787161 2626409 2857595 2848162 2639860 2638711 2926928 2652012 2728465 2609475
14010 2609475 2298525 2352479 2371068 2303142 2725851 2184082 2390700 2398283 1896892 2232623
14000 2232623 2609504 2265297 2339214 1838543 2119761 1932430 2075138 2405427 2103473 2402978
13990 2402978 2380842 3189973 5936636 12222124 28128962 45682545 32478841 16628076
13982 16628076 9534915 6572880 5151804 4192013 3892547 3680353 3155887 3245497 3153952
13973 3153952 2596222 2541899 2673950 2650621 2651218 2684053 2828725 2552412 2674829 2452198
$$ packed form
14040C562386l44154J62527k0838j52349J17458M2487j27756k02274J86860K06332
14030C430679j7956k41050K90973o6395k47445r4687k09251O7405K67013m85610
14020B693676R3485j60752K31186r433k08302j149K88217k74916P6453j18990
14010B609475l10950N3954J8589o7926M22709n41769K06618P583n01391L35731
14000B232623L76881l44207P3917n00671K81218j87331J42708L30289l01954K99505
13990B402978k2136Q09131K746663O285488J5906838J7553583j3203704j5850765
13982A6628076p093161k962035j421076r59791k99466k12194n24466Q9610r1545
13973C153952n57730n4323J32051k3329N97L2835J44672k76313J22417k22631
$$ plain form
13963 2452198 2079058 2395155 2239884 2190050 2354025 2115808 2368664 1895833 1946285 2192625
13953 2192625 2205807 2412093 2130576 2022414 1894993 2315484 2009089 1775190 2084756 1923683
13943 1923683 1802549 1816735 1857097 2249328 2000402 1755938 1633852 1904551 1634565 2126273
13933 2126273 1760157 1822467 1703139 1747551 1793662 1834383 1594944 2081678 1704224 1828996
13923 1828996 2057540 1952764 1632954 1707408 1991535 1439586 1382393 1537121 1447344 1566963
13913 1566963 1631935 1287665 1401974 1507046 1745066 1491368 1564047 1292983 1761718 1624816
13903 1624816 1161558 1821959 1207760 1504109 1386534 1437932 1269076 1322758 1550591 1287267
13893 1287267 1204637 1128126 1353990 1339309 1298344 1397991 1642170 1343720 1554401 1536693
$$ packed form
13963B452198l73140L16097j55271m9834J63975k38217K52856m72831N0452K46340
13953B192625J3182K06286k81517j08162j27421M20491l06395k33899L09566j61073
13943A923683j21134J4186M0362L92231k48926k44464j22086K70699k69986M91708
13933B126273l66116O2310j19328M4412M6111M0721k39439M86734l77454J24772
13923A828996K28544j04776l19810P4454K84127n51949n7193J54728q9777J19619
13913A566963O4972l44270J14309J05072K38020k53698P2679k71064M68735j36902
13903A624816m63258O60401o14199K96349j17575N1398j68856N3682K27833k63324
13893A287267q2630p6511K25864j4681m0965R9647K44179k98450K10681j7708
$$ plain form
13883 1536693 1408336 1341537 1392737 1255034 1204020 1284993 1551343 1319303 1247352 1404531
13873 1404531 1195212 1113228 965546 1399789 1568518 1594765 1217160 1095914 1412183 990994
13863 990994 1168516 1309413 1318818 861771 1076118 1100860 1179711 1035236 969630 1201201
13853 1201201 1062452 1259509 1034506 1143717 895786 997631 1106782 1145108 1252760 1210077
13843 1210077 1241901 945908 998579 993676 1230159 1133168 1314452 1013503 853248 1064916
13833 1064916 929724 853849 1234417 815384 1091426 742060 1020003 1071597 936397 879399
13823 879399 1145729 904099 1165874 1180592 1022113 1129308 960675 527384 1138694 1340642
13813 1340642 922329 759311 788093 712733 605164 935783 819052 1040965 1065202 793822
$$ packed form
13883A536693j28357o6799N1200j37703n1014Q0973K66350k32040p1951J57179
13873A404531k09319q1984j47682M34243J68729K6247l77605j21246L16269m21189
13863I90994J77522J40897R405m57047K14347K4742P8851j44475o5606K31571
13853A201201j38749J97057k25003J09211k47931J01845J09151L8326J07652m2683
13843A210077L1824k95993N2671m903K36483r6991J81284l00949j60255K11668
13833A064916j35192p5875L80568m19033K76042l49366K77943N1594j35200n6998
13823H79399K66330k41630K61775J4718j58479J07195j68633m33291O11310K01948
13813A340642m18313j63018K8782p5360j07569L30619j16731K21913K4237k71380
$$ plain form
13803 793822 542480 932856 635697 803453 1118051 1167046 672521 711773 791252 1150563
13793 1150563 990302 991444 933253 704764 809392 784697 841307 792288 767525 786470 781242
13782 781242 772777 1096766 1002141 557655 837452 1086659 904929 755887 805486 555625
13772 555625 739593 988521 844998 898126 452518 704862 602857 636981 761051 622959
13762 622959 456881 759211 913747 764921 876508 511333 917570 683538 794710 818439
13752 818439 675528 713440 768566 987605 721716 912976 628514 449510 650848 1044373
13742 1044373 821937 452160 739277 477885 568463 433712 824236 694978 591572 539306
13732 539306 977078 774875 811428 438221 869900 318256 782255 501432 589876 861058
$$ packed form
13803G93822k51342L90376k97159J67756L14598M8995m94525L9252P9479L59311
13793A150563j60261J142n8191k28489J04628k4695N6610m9019k4763J8945n228
13782G81242q465L23989r4625m44486K79797K49207j81730j49042M9599k49861
13772E55625J83968K48928j43523N3128m45608K52344j02005L4124J24070j38092
13762F22959j66078L02330J54536j48826J11587l65175M06237k34032J11172K3729
13752H18439j42911L7912N5126K19039k65889J91260k84462j79004K01338L93525
13742A044373k22436l69777K87117k61392R0578j34751L90524j29258j03406n2266
13732E39306M37772k02203L6553l73207M31679C18256M63999k80823Q8444K71182
$$ plain form
13722 861058 569405 453727 543674 410140 511612 414174 704569 508098 606533 924027
13712 924027 686188 667768 530465 614461 375573 672894 587309 748034 500948 174842
13701 816759 565933 819133 439264 810523 383291 658011 679961 609669 579083 508346
13691 508346 796069 502065 460025 817082 596275 572534 298823 623484 702298 342922
13680 621655 655205 623739 774368 339868 578078 479881 359741 397095 265397 634954
13670 634954 583600 544607 268378 578425 285734 512419 518731 560957 413144 717089
13660 717089 233275 483634 440446 647850 341745 594793 711390 279157 766615 531781
13650 531781 464728 265841 577117 642240 726199 341053 746526 529828 357352 608396
$$ packed form
13722H61058k91653j15678Q9947j33534J01472r7438K90395j96471R8435L17494
13712I24027k37839j8420j37303Q3996k38888K97321q5585J60725k47086A74842
13701H16759k50826K53200l79869L71259C83291K74720K1950p0292l0586p0737
13691E08346K87723k94004m2040L57057k20807k3741k73711L24661P8814C42922
13680F21655L3550l1466J50629C39868K38210r8197j20140L7354j31698L69557
13670F34954n1354l8993B68378L10047B85734K26685O312M2226j47813L03945
13660G17089B33275K50359m3188K07404l06105K53048J16597B79157M87458k34834
13650E31781o7053j98887L11276O5123Q3959C41053M05473k16698j72476K51044
$$ plain form
13640 608396 381425 307314 273438 587627 371193 243342 596560 317844 656528 472459
13630 472459 619756 967414 288636 670761 327908 470753 651800 571212 268495 477181
13620 477181 486289 544325 585656 443066 300401 344972 410276 487928 236408 563632 303238
13609 303238 784616 260068 177914 -22693 705161 453972 113277 641923 159058 270706
13599 270706 67522 161828 48596 198064 409394 472444 283443 468787 102355 297982
13589 297982 661639 205768 249542 554912 242847 343528 480296 227990 124898 163219
13579 163219 747122 316822 485842 495417 202473 571248 168457 578606 371894 347353
13569 347353 40124 28605 589783 320406 227823 451281 344506 207618 572728 383442
$$ packed form
13640F08396k26971p4111l3876L14189k16434j27851L53218k78716L38684j84069
13630D72459J47297L47658B88636L82125C27908J42845J81047q0588B68495K08686
13620D77181R108N8036M1331j42590j42665M4571O5304P7652B36408L27224k60394
13609C03238M81378B60068q2154b2693G05161k51189A13277N28646A59058J11648
13599B70706F7522R4306D8596J49468K11330O3050j89001J85344A02355J95627
13589B97982L63657B05768M3774L05370B42847J00681J36768B27990j03092L8321
13579A63219N83903C16822J69020R575B02473L68775A68457M10149k06712k4541
13569C47353D0124j1519N61178k69377r2583K23458j06775j36888L65110j89286
$$ plain form
13559 383442 528688 421995 -139036 411994 349374 511134 378452 231770 531804 206505
13548 358599 342332 483906 224299 211897 424830 323904 428962 268089 399756 318036
13538 318036 197153 128813 469779 340510 297469 178321 367503 546201 475143 444590
13528 444590 267291 236053 128117 415696 1820 476800 278418 406106 247124 39077
13517 270854 243596 51719 231189 300568 309225 207216 173010 192417 353974 441974 275030
13506 275030 500818 246017 216506 313040 426607 259080 259818 415709 276615 101959
13495 133629 233253 393830 554864 130720 368842 92379 -108208 390676 608722 238812
13484 121956 527608 212364 260234 387001 440615 218058 96146 254579 489227 333033
$$ packed form
13559C83442J45246j06693a39036D11994o2620J61760j32682j46682L00034B06505
13548C58599j6267J41574B24299j2402K12933j00926J05058j60873J31667q1720
13538C18036j20883o8340L40966j29269m3041j19148J89182J78698p1058l0553
13528D44590j77299l1238j07936K87579A820M74980j98382J27688j58982C9077
13517B70854k7258E1719J79470O9379Q657j02009l4206J9407J61557Q8000j66944
13506B75030K25788B46017k9511R6534J13567j67527P38J55891j39094A01959
13495A33629R9624J60577J61034A30720K38122I2379a08208C90676K18046B38812
13484A21956M05652B12364M7870J26767N3614B18058I6146J58433K34648j56194
$$ plain form
13474 333033 275015 151517 283203 430521 73403 345121 277854 238515 322820 287953 245104
13463 245104 37675 181540 373121 207714 397749 523080 402625 -164568 173318 47011
13452 363455 249924 101549 571730 425541 96278 385866 545395 409928 214987 326627
13442 326627 131104 -37438 318876 283881 205931 109233 232601 426579 188365 385769
13432 385769 183534 535456 493919 549254 -61968 285846 255251 -16357 169590 454372
13422 454372 577689 294695 255464 304755 322848 243691 165909 144217 389626 139366 227112
13411 227112 576150 93399 318265 348856 393647 221459 233498 207386 252296 190150 220942
13400 220942 192745 155321 95384 379764 31685 348571 82128 803018 153908 130430 129461
$$ packed form
13474C33033n8018j23498J31686J47318G3403K71718o7267l9339Q4305l4867m2849
13463B45104C7675J43865J91581j65407J90035J25331j20455a64568A73318D7011
13452C63455j13531A01549M70181j46189I6278K89588J59529j35467j94941J11640
13442C26627A31104c7438C18876l4995p7950r6698J23368J93978A88365J97404
13432C85769A83534L51922m1537N5335f1968B85846l0595a6357A69590K84782
13422D54372J23317k82994l9231M9291J8093p9157p7782k1692K45409A39366Q7746
13411B27112L49038I3399K24866L0591M4791j72188J2039k6112M4910o2146L0792
13400B20942k8197l7424n9937K84380C1685L16886H2128P20890A53908k3478r69
$$ plain form
13389 129461 522650 281263 251773 41533 73856 192358 100893 101819 127674 -28520 487542
13377 58872 550014 -44228 44497 341185 541371 -178908 73475 594348 412055 137407
13366 -131326 232071 166509 366748 587983 203003 196938 166466 447946 117367 322686
13356 322686 47586 162712 324336 403602 287545 22738 212898 192297 543422 128941
13345 442769 196380 392485 106409 524162 313755 409273 462910 243267 139488 714379
13335 714379 183381 588931 -99307 524616 397475 566631 434735 215110 262719 497989
13325 497989 -53962 111802 184363 62700 241538 334117 276880 176844 172758 579724 288987
13313 319011 201745 -115075 646727 152380 284818 403163 -228839 314181 -95420 502873
$$ packed form
13389A29461L93189k41387k9490D1533L2323J18502r1465R26K5855b8520D87542
13377E8872M91142d4228D4497K96688K00186a78908G3475N20873j82293A37407
13366a31326B32071o5562K00239K21235B03003o065l0472K81480A17367K05319
13356C22686D7586J15126J61624P9266j16057B2738J90160k0601L51125A28941
13345D42769A96380J96105A06409M17753k10407R5518N3637k19643j03779N74891
13335G14379A83381M05550i9307E24616j27141J69156j31896B15110M7609K35270
13325D97989e3962A11802P2561F2700J78838R2579n7237j00036m086M06966B88987
13313C19011j17266a15075F46727A52380J32438J18345b28839C14181i5420E02873
$$ plain form
13302 125671 222847 99803 98138 206504 320135 203525 261822 273143 -229743 358133 180853
13291 180853 237534 -118770 23910 -1976 -61259 72954 229031 511446 -114224 319940 -376306
13279 106959 374143 -130951 437875 340302 317002 323423 249238 -86570 294622 198625 206947
13268 206947 410451 -245672 218579 506306 102709 -79446 -133914 144815 13651 -56666
13257 379166 93844 205526 -152771 -116367 295903 113582 385469 -97394 48200 -284612
13246 384142 105258 -52558 69329 398404 98636 270124 52066 63104 412535 419003 -263048
13234 116271 191760 242632 141783 523426 297246 -44630 224372 327537 415587 16274
13223 342739 80918 399474 -356037 119469 184038 395056 62630 156860 201903 -164885
$$ packed form
13302A25671R7176I9803j665J08366J13631j16610N8297J1321b29743C58133j77280
13291A80853N6681a18770B3910a976n9283G2954J56077K82415a14224C19940c76306
13279A06959K67184a30951D37875r7573k3300O421p4185h6570B94622r5997Q322
13268B06947K03504b45672B18579K87727A02709g9446n4468A44815A3651e6666
13257C79166I3844J11682a52771L6404B95903A13582K71887i7394D8200b84612
13246C84142A05258e2558F9329L29075I8636J71488E2066J1038L49431O468b63048
13234A16271P5489N0872j00849L81643k26180d4630B24372J03165Q8050A6274
13223C42739H0918L18556c56037A19469O4569K11018F2630R4230M5043a64885
$$ plain form
13212 93769 6853 190002 25836 -28721 356006 236223 105763 -12777 153706 66578 213984
13201 213984 -70744 -2468 89912 138346 223828 52047 13571 153955 -203826 154679 170915
13190 170915 292350 75453 263484 187629 390499 285825 61453 -121126 348625 236861
13180 236861 -23180 322608 190050 203178 72514 292677 364651 272758 183675 245527 326547
13169 326547 339264 -115994 383385 203303 -11298 -93115 -203995 206648 -26658 56507
13158 73934 268457 12250 139734 -175220 61368 162953 -73021 155825 291444 66599
13147 -182722 57018 215955 -125655 255100 -74197 41514 124755 276724 106947 78226
13137 78226 -182278 -189048 -9638 303716 -253693 -74475 189704 -361820 -77862 -283852 -139350
$$ packed form
13212I3769F853J83149B5836b8721C56006j19783A05763a2777A53706F6578J47406
13201B13984g0744b468H9912M8434Q5482E2047A3571J40384b03826A54679J6236
13190A70915J21435G5453J88031p5855K02870j04674F1453a21126C48625j11764
13180B36861b3180C22608j32558J3128G2514K20163P1974r1893q9083O1852Q1020
13169C26547J2717a15994C83385j80082a1298q1817j10880B06648b6658E6507
13158G3934J94523A2250J27484a75220F1368J01585g3021A55825J35619F6599
13147a82722E7018J58937a25655B55100g4197D1514Q3241J51969A06947k8721
13137G8226a82278o770i638C03716b53693g4475A89704c61820g7862k05990a39350
$$ plain form
13125 -42108 106103 67961 15250 292842 -105064 548 161207 148373 -218537 134561 114632
13114 114632 258490 47117 -162010 262326 17007 136528 -29419 210556 -47898 184368
13103 146558 207583 76788 -126458 119559 228794 307668 98069 -40288 10843 -134525 369584
13091 19457 -53674 -13465 -90777 506081 181182 -77641 -24871 108235 -88262 95286 165692
13080 165692 337959 66165 52665 249027 60563 197366 4423 131473 294136 -117877
13069 -120446 197490 -80674 79822 241436 -105551 39437 163470 51849 125873 97831 129691
13058 129691 -161783 -129791 23757 228861 429427 28649 404200 -86508 475693 183052
13047 617958 -100056 167847 12737 357304 251300 33021 -223184 185585 -274388 -8522
$$ packed form
13125d2108A06103l8142A5250K77592a05064E48J60659j2834b18537A34561j9929
13114A14632J43858D7117a62010B62326A7007J19521b9419B10556d7898A84368
13103A46558O1025G6788a26458A19559J09235P8874I8069d0288A0843a34525C69584
13091A9457e3674a3465p7312E06081A81182g7641b4871A08235h8262I5286P0406
13080A65692J72267F6165j3500J96362F0563J36803D423J27050J62663a17877
13069a20446A97490h0674G9822J61614a05551C9437J24033E1849P4024k8042L1860
13058A29691a61783L1992B3757K05104K00566B8649L75551h6508D75693A83052
13047F17958a00056A67847A2737L44567j06004C3021b23184A85585b74388h522
$$ plain form
13036 189633 342186 76488 288162 128688 87603 -1310 69985 153238 141202 -14205 249816
13024 210716 353151 51853 223073 151353 211876 -24724 40628 415886 -301070 202415
13013 421327 -172795 134415 -159219 247762 29715 361101 385908 216825 468188 4044
13002 408729 101617 234582 329001 -4185 244278 -98136 327724 -135277 -96767 87610 139663
12991 139663 238186 -50523 -204447 206079 199259 90879 148944 652639 88920 173747 -105912
12979 -1704 88223 134651 137645 176676 65022 -33330 203547 7815 82217 248736 -26581 16947
12966 363670 26868 -5559 265976 -175161 270365 105592 220790 109230 54977 20792
12955 31462 -110833 -95934 83895 259104 -97825 224966 658735 206102 60493 39209 264422
$$ packed form
13036A89633J52553G6488K11674A28688m1085a310F9985Q3253j2036a4205B49816
13024B10716J42435E1853J71220p1720O0523b4724D0628L75258c01070B02415
13013D21327a72795A34415a59219B47762B9715L31386K4807j69083K51363D044
13002D08729A01617J32965R4419d185B44278i8136C27724a35277L8510H7610N2053
12991A39663R8523e0523j53924B06079o820I0879N8065N03695H8920Q4827a05912
12979a704H8223M6428K994L9031F5022c3330B03547G815P4402J66519b6581A6947
12966C63670B6868e559B65976a75161B70365A05592J15198A09230n4253B0792
12955C1462a10833J4899H3895J75209i7825B24966M33769B06102F0493k1284K25213
$$ plain form
12944 264422 -192919 73404 350291 -134117 33736 -233479 53908 -41758 121169 88041
12934 88041 77657 39390 201401 -68197 -160175 271151 -40132 -17069 101837 273486 14
12922 26599 170114 322172 -54716 139109 -102356 -55231 -87655 133255 92380 368292
12912 368292 345768 -270616 233986 -227668 270235 -68539 -16053 401677 155754 -211366
12901 -201629 -54954 350665 393138 -239703 -103727 -84611 348904 -135170 -57766 253118
12890 213810 -113822 225391 271821 269249 142562 302713 -44721 22463 -111772 247632
12879 67338 26505 -31844 104360 427833 -88900 -266901 290028 10321 -54409 -170491 122874
12867 -80414 118417 -10567 -69501 278214 199788 100531 37065 58484 90153 -107230 193204
$$ packed form
12944B64422a92919G3404K76887a34117C3736b33479E3908d1758A21169l3128
12934H8041j0384l8267J62011f8197r1978B71151d0132a7069A01837J71649A4
12922B6599J43515J52058e4716A39109a02356M7125l2424A33255m0875K75912
12912C68292k2524b70616B33986b27668B70235f8539a6053D01677A55754b11366
12901b01629e4954C50665M2473b39703a03727J9116C48904a35170e7766B53118
12890B13810a13822B25391M6430k572j26687J60151d4721B2463a11772B47632
12879F7338B6505c1844A04360L23473h8900j78001B90028A0321e4409j16082A22874
12867h0414A18417a0567n8934B78214p8426r9257C7065K1419L1669a07230A93204
$$ plain form
12855 -140554 -91551 151728 -268707 -65564 -295703 119829 88401 -42169 -85873 -146949 -140443
12844 -140443 264636 227346 177388 192810 298494 104190 81251 -172751 167864 233609
12834 233609 -7597 210175 -43577 7374 -16672 240923 202318 9318 156126 224594 261673
12823 261673 -130171 -113746 -164802 19324 -156623 124165 148939 185295 -26456 232785 212753
12812 212753 -131024 8358 202098 -328370 -243299 318242 105185 -95499 382820 49372
12801 -344352 -81905 23636 103203 -177724 -117099 199290 89912 231353 135444 199417 78936
12789 34329 -11647 423271 -32401 -66885 -118647 262522 111215 -88150 69408 217650 4267
12777 -70345 -229068 -275424 513062 -86149 187791 -29467 77247 -148623 156396 -66411 85133
$$ packed form
12855a40554M9003A51728b68707f5564k30139A19829l1428d2169m3704o1076O506
12844a40443B64636l7290m9958J5422J05684A04190k2939a72751A67864O5745
12834B33609g597B10175d3577G374a6672B40923l8605I318J46808O8468L7079
12823B61673a30171J6425n1056A9324a56623A24165K4774L6356b6456B32785k0032
12812B12753a31024H358J93740c28370Q5071C18242A05185i5499C82820D9372
12801c44352h1905B3636P9567a77724O0625A99290H9912J41441r5909O3973G8936
12789C4329a1647D23271c2401l4484n1762B62522A11215h8150F9408J48242D267
12777g0345j58723m6356E13062h6149A87791b9467G7247a48623A56396f6411H5133
$$ plain form
12765 171027 421061 24654 360621 100750 -160119 272730 51245 219263 166222 -50875
12754 51534 260037 122596 -33757 -350266 82257 -129149 -2623 15466 158894 29093 243318
12743 243318 81709 -63803 82336 241862 -35445 159749 166662 175276 374096 16498 -237364
12731 187717 246808 336563 -99241 12861 -139473 -276672 60013 -17169 -171986 84054 -44611
12719 -4255 -69810 105776 -5905 237750 51465 129607 73257 -59677 127740 -101588 161673
12707 255670 141412 120702 294147 188284 168631 -44121 18405 -75219 79581 77906 -116107
12695 -230464 -11964 139488 -2476 403298 159062 142443 -412436 -218045 7329 190320 149042
12684 149042 -14438 -213130 21147 -34950 -84196 278149 -49719 36182 151915 363950 -58818
$$ packed form
12765A71027K50034B4654L35967A00750a60119B72730E1245J68018n3041e0875
12754E1534K08503A22596c3757l16509H2257a29149b623A5466J43428B9093K14225
12743B43318H1709f3803H2336J59526c5445A59749O913Q614J98820A6498b37364
12731A87717N9091Q9755i9241A2861a39473j37199F0013a7169j54817H4054d4611
12719d255o5555A05776e905B37750E1465P8142n6350e9677A27740a01588A61673
12707B55670j14258k0710J73445j05863j9653d4121A8405g5219G9581j675a16107
12695b30464a1964A39488b476D03298A59062j6619d12436J94391G329J82991m1278
12684A49042a4438j98692B1147c4950m9246B78149d9719C6182J15733K12035e8818
$$ plain form
12672 330265 224999 202367 27764 167930 25224 63723 322354 207380 344119 163510
12661 556124 239564 -107681 29375 265724 376812 228073 108911 81368 105302 -93641
12650 37344 193166 -11629 209110 94388 -131353 58177 24245 -91084 -146899 -14488 133132
12638 -127169 5796 98323 110502 73647 81658 178657 434923 38633 343046 -52874 302006
12626 79119 370494 -24858 -238788 410627 171632 24819 -27154 216849 -414376 550303
12615 144287 -199635 137353 143573 247625 363539 155171 55246 -72700 26239 -58916 66800
12603 -68200 229556 123321 313617 154152 80875 229180 401809 308260 135701 -77020
12592 114266 435018 250570 274337 170743 311781 219408 -191714 102656 -19295 65401
$$ packed form
12672C30265j05266k2632B7764J40166B5224L8499K58631j14974J36739A63510
12661E56124B39564a07681B9375K36349J11088j48739A08911k7543K3934i3641
12650C7344J55822a1629B09110I4388a31353E8177B4245i1084n5815a4488A33132
12638a27169E796R2527J2179l6855Q011R6999K56266C8633L04413e2874C02006
12626G9119K91375b4858k13930D10627A71632B4819b7154B16849d14376E50303
12615A44287a99635A37353O220J04052J15914A55171E5246g2700B6239e8916F6800
12603f8200B29556j06235J90296A54152p3277J48305J72629r3549A35701g7020
12592A14266L20752j84448K3767j03594J41038r2373a91714A02656a9295F5401
$$ plain form
12581 687 -148464 166363 111362 32980 -179006 -193836 158548 -130572 195779 -149128 311377
12569 135910 192651 -227152 -192541 -112300 417043 171307 -24686 -38296 -91201 -126643 467581
12557 161591 154391 -59745 2143 -66963 -172132 151097 -29644 -118506 14321 101120 -58802
12545 98276 114697 -18087 -129045 170899 50895 23199 398652 272216 137474 -29202 -88647
12534 -88647 -252950 44642 -192033 35648 220368 29773 139987 -135340 228194 -164109
12523 82070 154579 -81677 253372 107110 68082 137778 47474 458885 179463 50113 327491
12512 327491 -51755 273697 438858 -92982 150883 33565 -332612 18924 26695 354854 -2240
12500 9538 -36636 -113484 203463 141471 -68506 -108874 -13823 -195735 141800 196561 -381220
$$ packed form
12581F87a48464A66363n5001C2980a79006j4830A58548a30572A95779a49128C11377
12569A35910N6741b27152L4611Q0241D17043A71307b4686j3610n2905l5442D67581
12557A61591p200e9745B143f6963j05169A51097b9644q8862A4321Q6799e8802
12545I8276J6421a8087j10958A70899E0895B3199L75453j26436j34742b9202n9445
12534h8647j64303D4642a92033C5648J84720B9773J10214a35340B28194a64109
12523H2070P2509h1677B53372A07110l9028O9696D7474M11411A79463E0113K77378
12512C27491e1755B73697J65161i2982A50883C3565c32612A8924P771L28159b240
12500I538c6636p6848B03463o1992f8506m0368a3823j81912A41800N4761c81220
$$ plain form
12488 306072 39234 22421 302715 21846 -63035 -58265 263953 110818 110194 6150 47407 -91274
12475 199223 95332 -67354 -68471 -181211 32042 -113203 65871 109076 111553 50787 -32958
12463 88654 68363 285202 -179541 2025 93119 -268552 9335 -208613 295200 39140 318402
12452 318402 52248 162764 -48597 -131382 40930 92094 -74041 -369533 111141 44028 207764
12441 207764 -131539 290261 46564 74246 -112670 -54512 -196939 -466604 228532 149427
12431 149427 102780 -210906 124673 -84868 -261824 -199288 -38980 -46757 -27141 325660 -109390
12419 90768 226992 -83445 114746 -221904 160494 1228 49906 -84307 275906 270029 -162402
12407 250475 -126150 -143717 -201679 -141869 119306 -141571 -221863 -89688 205428 356383
$$ packed form
12488C06072C9234j6813K80294B1846f3035M770B63953A10818o24F150M1257i1274
12475A99223I5332f7354j117j12740C2042a13203F5871M3205K477E0787c2958
12463H8654k0291K16839a79541B025R1094b68552I335b08613B95200C9140K79262
12452C18402E2248J10516d8597q2785D0930N1164g4041k95492A11141D4028J63736
12441B07764a31539B90261D6564K7682a12670e4512j42427k69665B28532p9105
12431A49427m6647b10906A24673h4868j76956O2536c8980p777J9616C25660a09390
12419I0768J36224h3445A14746b21904A60494A228M8678h4307B75906n877a62402
12407B50475a26150j7567n7962N9810A19306a41571q0292h9688B05428J50955
$$ plain form
12397 356383 -29959 71364 -204493 -219727 101038 202164 -468658 198344 88418 -4838 13442
12385 201722 156890 162504 182323 -119272 289048 -197037 -152889 -81337 219808 -164774 -44345
12373 360190 15958 -88831 143760 32731 -150764 -308808 -248905 86099 -176489 150359
12362 6739 333083 77748 13088 179178 12637 165886 -318442 -155944 -41438 209282 -242727
12350 158707 -21584 -159194 363358 -266543 10383 -8041 29173 222624 -113281 -32211 -163587
12339 -163587 -33101 163175 24361 -310934 52902 -33213 -291382 -41559 366212 -320990
12328 151476 -76723 253168 -78130 34257 -119133 -319538 97684 185215 303915 -65001 308283
12316 71317 113378 109248 205758 241238 -41456 -131457 -17308 -160502 157362 -86598 403532
$$ packed form
12397C56383b9959G1364b04493j5234A01038J01126d68658A98344H8418d838A3442
12385B01722m4832N614J9819a19272B89048a97037M4148P1552B19808a64774d4345
12373C60190A5958h8831A43760C2731a50764j58044N9903H6099a76489A50359
12362F739L26344G7748A3088J66090A2637J53249c18442a55944d1438B09282b42727
12350A58707b1584j37610C63358b66543A0383h041B9173J93451a13281c2211j31376
12339a63587c3101A63175B4361c10934E2902c3213k58169d1559C66212c20990
12328A51476g6723B53168g8130C4257a19133k00405I7684Q7531J18700f5001C08283
12316G1317M2061m130R6510L5480d1456r0001a7308j43194A57362h6598D03532
$$ plain form
12304 -194013 177192 -107666 -57895 -70285 -172074 -60129 84614 -88837 -96151 -139093 88408
12292 109994 401542 75899 118513 150100 65816 -90400 54426 -148881 223623 -137372 131878
12280 -274846 -70108 55827 140466 11038 275971 128472 309335 252620 105372 249694
12270 249694 329507 277243 385427 177789 -82063 -59886 34008 -93169 3816 -105877 20308
12258 128437 521744 -57348 -58863 168224 -20345 6288 138426 -48207 52211 187920 183506
12247 183506 -37181 -18086 41700 -130811 -141931 -2778 13664 73192 -2084 -12692 62869 -74967
12234 -364992 13204 6453 1919 -158653 122872 162183 -118958 208376 259442 268547 279465
12223 279465 75568 -8377 -40723 468882 7369 -33463 425285 476700 -16296 205309 133633
$$ packed form
12304a94013A77192a07666M9771j2390j01789f0129H4614h8837p314m2942H8408
12292A09994K91548G5899M2614L1587F5816i0400E4426a48881B23623a37372A31878
12280b74846g0108E5827Q4639A1038K64933A28472J80863n6715A05372J44322
12270B49694P9813n2264J08184A77789h2063K2177C4008i3169C816a05877B0308
12258A28437L93307e7348j515A68224b0345F288J32138d8207E2211J35709m414
12247A83506c7181a8086D1700a30811j1120b778A3664N9528b084j0608F2869g4967
12234c64992A3204F453A919a58653A22872L9311a18958B08376N1066R105J0918
12223B79465G5568h377l2346D68882G369c3463D25285N1415a6296B05309p1676
$$ plain form
12212 133633 166701 231537 66680 291977 -40917 238051 183004 4863 407332 451684 195979
12200 508655 1579 108979 56219 435065 288033 326823 139632 158801 310278 284047 254604
12189 254604 396476 392160 7833 115187 111051 200663 107118 157582 38015 102875 73136 37646
12177 37646 224389 285394 -126887 195273 67524 283946 -146716 52362 -62124 278053
12166 -12033 451590 -149737 257278 70269 198753 303448 206492 112419 284149 -74162
12155 -39480 70303 -29039 -43367 162213 234177 169877 157862 241189 -25671 -31136 191232
12143 222320 -77550 282587 173786 -83322 -219207 420278 77529 -265253 346412 91600
12132 -158504 45012 329911 -398580 -208948 68530 268059 59911 -103185 135225 127336
$$ packed form
12212A33633L3068O4836F6680K25297d0917B38051n5047D863M02469M4352A95979
12200E08655A579J07400n2760L78846j47032L8790A39632J9169J51477k6231k9443
12189B54604J41872m316G833J07354m136Q9612r3545N0464C8015O4860k9739l5490
12177C7646J86743O1005a26887A95273F7524K16422a46716E2362f2124B78053
12166a2033D51590a49737B57278G0269J28484J04695r6956r4073J71730g4162
12155c9480G0303b9039j4328A62213P1964o4300j2015Q3327b5671n465A91232
12143B22320g7550B82587j08801h3322j35885D20278G7529b65253C46412I1600
12132a58504D5012K84899c98580J89632F8530J99529E9911a03185A35225p889
$$ plain form
12122 127336 471378 -3462 72498 3738 404358 235060 -67347 236300 -172224 292219 -1328
12110 -102558 -67165 80742 -11449 34083 279480 155379 -267154 32935 -204112 76768 310241
12099 310241 14642 -16452 55220 -9964 363272 232999 -121530 -164659 94164 117795 214053
12088 214053 -58537 249887 214380 -32450 56461 -245969 90220 -19288 51383 239884 -86309
12076 24354 -33948 149105 -293558 293053 -109297 -108443 -24532 -2299 -4121 166536 -65433
12064 98067 216781 152661 17308 18867 119504 -247002 47041 -153832 -138897 244395 468819
12053 468819 14369 1331664 864062 465430 447278 4576 71679 -180696 -47355 -40087 34955
12041 -252925 63579 214721 -149331 99321 87726 -206122 506106 -23792 -253172 90978
$$ packed form
12122A27336L44042c462G2498C738M00620j69298f7347B36300a72224B92219a328
12110a02558L5393H0742a1449C4083K45397j24101b67154C2935b04112G6768K33473
12099C10241A4642a6452E5220i964C63272j30273a21530m3129I4164K3631R6258
12088B14053e8537B49887l5507c2450E6461b45969I0220a9288E1383J88501h6309
12076B4354c3948A49105b93558B93053a09297Q54b4532b299j822A66536f5433
12064I8067J18714o4120A7308J559J00637b47002D7041a53832J4935B44395K24424
12053D68819A4369J317295m67602l98632j8152D576O7103a80696d7355P268C4955
12041b52925F3579J51142a49331I9321j1595b06122E06106b3792k29380I0978
$$ plain form
12030 -166951 92015 -46363 -327870 -95485 -185805 -353539 -223211 -182226 99374 150707 88198
12019 88198 57819 -3865 161991 -19599 313658 102629 -50964 71591 -64288 -108511 84594
12007 -253964 -51646 56215 147663 69130 -38428 131508 137485 -96027 108186 153120 414123
11996 414123 171897 318218 10250 53289 180098 -41774 278488 -36773 -64153 -12876 -87762
11985 -87762 2112 -229813 -8314 -223052 136243 257575 129297 -59129 362419 -121708 133103
11973 152305 1683 106512 125392 147164 159017 -158685 -160430 -81353 198075 -24203 46127
11961 -18088 -158272 -27471 187922 70882 253728 -68069 56507 -26511 -21647 -75739 -58267
11950 -58267 -269538 -131675 85984 -134318 -333292 145772 -285310 143534 120470 -184356
$$ packed form
12030a66951I2015d6363k81507i5485r0320j67734J30328M0985I9374N1333o2509
12019H8198l0379c865A61991a9599C13658A02629e0964G1591f4288m4223H4594
12007b53964e1646E6215R1448F9130c8428A31508N977i6027A08186M4934K61003
11996D14123A71897J46321A0250M3039J26809d1774B78488c6773k7380a2876p4886
11985h7762B112b29813h314k14738A36243J21332j28278e9129C62419a21708A33103
11973A52305A683J04829J8880K1772J1853a58685j745P9077A98075b4203D6127
11961a8088j40184b7471A87922G0882J82846f8069E6507b6511M864n4092J7472
11950e8267k11271a31675H5984a34318j98974A45772b85310A43534k3064a84356
$$ plain form
11939 -300888 -87880 124103 -47275 -120397 -131516 -58019 161401 -295063 -211140 158364 -49901
11927 -43704 185626 49688 -173435 177917 -8217 -119314 25462 -85111 -161276 73519 -48659
11915 -303432 38045 164179 24516 11410 -11253 128032 -188273 39790 -36079 -246167 295266
11903 -292143 -62854 27851 -246655 105290 -20855 25518 -190323 -203337 -206943 -49271 -189138
11892 -189138 78136 -148731 56896 -28459 -198827 144958 254731 -92427 326971 -29254
11881 27065 59593 2937 72067 88640 4760 99869 -301665 414113 -407109 86821 253442
11870 253442 -87310 -79736 -64768 327128 -321810 -219158 36800 92200 -3458 215406 -217782
11858 -172044 45707 -221035 524467 211642 -144509 -25012 -41798 -34794 -216527 -9690 69767
$$ packed form
11939c00888h7880A24103d7275p3122j1119e8019A61401b95063Q3923A58364d9901
11927d3704A85626D9688a73435A77917h217j11097B5462h5111p6165G3519d8659
11915c03432C8045J26134B4516A1410a1253A28032a88273C9790c6079k10088B95266
11903b92143f2854B7851b46655A05290b0855B5518a90323j3014l606d9271j39867
11892a89138G8136a48731E6896b8459j70368A44958J09773i2427C26971b9254
11881B7065L2528B937O9130J6573D760R5109c01665D14113d07109H6821J66621
11870B53442h7310P574J4968C27128c21810J02652C6800N5400c458B15406b17782
11858a72044D5707b21035E24467B11642a44509b5012j6786P004j81733i690F9767
$$ plain form
11846 -83678 -276306 -159313 -255317 -2519 -234722 183135 102558 -17562 194984 11576 -51871
11834 146656 -143133 159197 -66485 -249 249810 -156509 -65541 77039 229990 -142372 63473
11822 -93658 29731 396537 -154542 -45861 -34200 -111039 -359651 31770 -198543 252171 17873
11810 90303 -393340 -20862 -97551 1200 109803 -102487 -319221 367666 8643 -185373 -238252
11799 -238252 -97430 -116109 67234 159271 21259 -30906 345467 -288528 -373046 -108890 89194
11787 -272465 95236 37865 48060 -162897 -286420 9898 1569 194107 -41425 107991 75712
11776 75712 352462 400801 168828 166039 -101157 -171352 21427 20641 -226016 248614 -261286
11764 -27686 -196293 138629 118446 -241177 -21481 -233478 -219885 115712 -18873 -197785
$$ packed form
11846h3678j92628J16993r6004b519k32203A83135q0577a7562A94984A1576e1871
11834A46656a43133A59197f6485b49B49810a56509f5541G7039J52951a42372F3473
11822i3658B9731L66806a54542d5861J1661p6839k48612C1770a98543B52171A7873
11810I0303c93340b0862p6689A200J08603a02487k16734C67666H643a85373n2879
11799b38252i7430j8679F7234R2037B1259c0906C45467b88528q4518a08890H9194
11787b72465I5236C7865J0195a62897j23523I898A569J92538d1425A07991l2279
11776G5712K76750M8339A68828k789a01157p0195B1427p86b26016B48614b61286
11764b7686j68607A38629k0183b41177b1481k11997J3593A15712a8873j78912
$$ plain form
11754 -197785 99820 119690 99161 -97572 397418 300224 -137409 123432 -236033 -123816
11744 -123816 111516 62713 -10258 30595 -287558 133993 634 -125479 40391 -295252 -29144
11732 -76150 49727 178668 -221619 -24663 -235186 22535 -91953 -356042 -37673 -149215 69885
11720 57551 110927 160125 -56628 83152 123661 13016 60616 -127846 95016 -1796 104802
11708 222564 -236931 65222 224315 126355 19382 5352 53161 172118 -492248 87424 34976
11696 202027 52256 -218663 48681 187744 -174669 213522 -6507 157235 -113459 242495
11685 -54675 143527 202778 195993 -412779 24223 -199416 -149784 326179 159795 27027 297968
11674 297968 -139430 -34123 75594 -117160 297912 127859 -52247 129504 -128225 -292455
$$ packed form
11754a97785I9820J9870k0529i7572C97418r7194a37409A23432b36033J12217
11744a23816A11516m8803a0258C0595b87558A33993F34a25479D0391b95252b9144
11732g6150D9727J28941b21619b4663k10523B2535i1953k64089c7673j11542F9885
11720E7551N3376M9198e6628H3152M0509A3016M7600a27846I5016a796A04802
11708B22564b36931F5222J59093r7960A9382E352M7809J18957d92248H7424C4976
11696B02027E2256b18663D8681J39063a74669B13522f507A57235a13459B42495
11685e4675A43527N9251o785d12779B4223a99416M9632C26179A59795B7027K70941
11674B97968a39430c4123G5594a17160B97912A27859e2247A29504a28225j64230
$$ plain form
11664 -292455 119717 144245 132423 -64971 155623 230419 4638 342626 -22499 11742 78562
11653 78562 -247862 247861 55951 -210052 263923 5139 -49293 75120 21266 -66794 131806
11641 -17778 98544 210303 130294 -268469 -121163 182283 551 -49838 225265 112603 63645
11630 63645 -26531 140720 -87786 -224687 91461 161376 217681 200899 180692 111538 136814
11619 136814 121888 -16198 -15871 109966 29028 85544 256986 -253823 -102293 -30085 89701
11607 117987 -166128 -37552 40216 12612 -147671 31875 262858 82249 -434976 307977
11596 -206544 -171150 122323 -48510 117344 -91960 -76171 -223695 -225547 -159096 -133064 -167222
11585 -167222 122829 128700 38574 -209567 40296 195556 -95094 -9926 138819 121993 -257648
$$ packed form
11664b92455A19717K4528j1822f4971A55623P4796D638L37988b2499A1742O6820
11653G8562b47862B47861E5951b10052B63923E139d9293G5120B1266f6794A31806
11641a7778I8544J11759q0009b68469a21163A82283E51d9838B25265A12603m8958
11630F3645b6531A40720h7786j36901I1461O9915N6305j6782k0207o9154K5276
11619A36814j4926a6198L27A09966B9028N6516J71442b53823a02293c0085H9701
11607A17987a66128c7552D0216A2612a47671C1875K30983H2249d34976C07977
11596b06544L5394A22323d8510A17344i1960J5789j47524j852O6451K6032l4158
11585a67222A22829N871C8574b09567D0296J55260i5094i926A38819j6826b57648
$$ plain form
11573 39932 29059 143411 119795 83265 10743 174106 -84149 -168049 -81187 39240 7230
11561 -298619 88940 417061 210632 33681 223521 -276390 213850 -232427 8612 203519
11551 203519 169482 -414668 90210 195067 12627 243517 151467 72163 -195840 350075
11540 182426 -21444 -98639 -114337 177598 279714 166004 16083 157205 210962 129190 331906
11529 331906 -5856 8661 100610 83649 99991 338739 -16356 -192949 139729 155101 111116
11518 111116 283898 398633 89119 102840 -51581 -140852 -18837 -84471 288000 63063 195753
11507 195753 100679 129067 546278 295094 -22084 -8178 234618 59785 -166158 215751 24659
11495 451768 63481 568261 184430 -32595 96903 54616 206567 163603 210838 122264 251926
$$ packed form
11573C9932j0873J14352k3616l6530A0743J63363h4149q3900h1187C9240G230
11561b98619H8940L28121k06429C3681J89840b76390B13850b32427H612J94907
11551B03519l4037d14668I0210J04857A2627K30890r2050G2163a95840C50075
11540A82426b1444p7195j5698A77598J02116j13710A6083J41122N3757q1772K02716
11529C31906e856H661R1949j6961J6342K38748a6356j76593A39729J5372m3985
11518A11116J72782J14735H9119J3721e1581q9271a8837o5634B88000F3063J32690
11507A95753r5074K8388M17211k51184b2084h178B34618E9785a66158B15751B4659
11495D51768F3481N04780A84430c2595I6903m2287J51951m2964M7235q8574J29662
$$ plain form
11484 251926 289931 480892 268272 127483 47974 165715 97175 157846 204652 -27373 368246
11472 -75455 257134 -7460 45282 256825 314893 280501 394032 -8067 173609 161383 -71973
11460 376391 47958 318762 -15770 -112193 84033 176680 169133 -47647 131389 428997 103513
11448 -96335 -35836 261797 174665 178449 33357 154586 188777 -59652 34020 306762 196857
11437 196857 -287466 -156375 -78883 -37856 227425 -23357 -138508 68214 260226 54676
11426 91166 184817 136172 -104684 -66365 -141582 131108 98245 -67443 -58098 -186306 -201228
11415 -201228 139666 166588 46244 21681 168856 -363084 119635 -119421 -139952 -58881
11404 246159 223291 102078 158550 9601 -68895 -1258 268706 132023 -105127 -111104 311983
$$ packed form
11484B51926L8005J90961k12620A27483D7974J17741o8540O0671M6806b7373C68246
11472g5455B57134g460D5282K11543N8068l4392J13531h067A73609j2226g1973
11460C76391D7958K70804a5770r6423H4033R2647p547d7647A31389K97608A03513
11448i6335c5836B61797q7132L784C3357J21229L4191e9652C4020K72742j09905
11437A96857b87466J31091P7492c7856B27425b3357j15151F8214J92012E4676
11426I1166R3651m8645a04684L8319p5217A31108l2863f7443R345j28208j4922
11415b01228A39666K6922D6244B1681J47175c63084A19635a19421k0531e8881
11404B46159k2868A02078N6472I601f8895a258B68706A32023a05127n977C11983
$$ plain form
11392 223320 127116 326538 -18250 9974 -90400 -89117 74545 -183436 167577 -169309 -23038
11380 -115648 102896 143431 127180 228010 145777 -94673 -321397 83991 35571 -22908 166573
11368 44400 -46724 -200419 -147356 174753 -242573 38121 -245818 -279759 140795 125009 218141
11357 218141 19238 204696 -314392 119183 200465 -37260 -297531 -202157 -33778 -91399 25986
11345 115099 120806 -329319 46188 -180654 -60970 -51603 50266 -321130 -37346 14774 -74827
11333 -308017 42618 -29121 286131 -104577 -212069 230615 63086 -112559 365610 -126407
11322 -66439 240882 -155948 242683 89183 -29222 313893 21003 -276969 -213962 32842 245490
11311 245490 -35534 -293137 -80510 -147828 -64924 2193 -37398 -217800 90413 -100913 -121934
$$ packed form
11392B23320r6204J99422a8250I974i0400J283G4545a83436A67577a69309b3038
11380a15648A02896M0535j6251J00830q2233i4673k26724H3991C5571b2908A66573
11368D4400d6724j53695N3063A74753b42573C8121b45818l3941A40795j5786R3132
11357B18141A9238J85458c14392A19183Q1282c7260k60271R5374c3778n7621B5986
11345A15099N707c29319D6188a80654f0970R367E0266c21130c7346A4774g4827
11333c08017D2618b9121B86131a04577j07492B30615F3086a12559C65610a26407
11322f6439B40882a55948B42683H9183b9222C13893B1003b76969O3007C2842K12648
11311B45490c5534k57603h0510o7318f4924B193c7398j80402I0413a00913k1021
$$ plain form
11300 -121934 -184241 -251618 3325 35048 117120 103293 162577 -246913 58896 125629 79769
11289 79769 -88703 -224115 -12043 280501 96516 -161206 -37473 -116283 122426 -226631 -356990
11278 -356990 -102782 128355 -173147 122414 119273 -105927 -88012 -94056 -43253 52394 -110646
11266 -16261 32021 -63451 -130807 -79357 -376153 55806 -423405 164246 -94295 -66184 91549
11254 -143506 106455 72081 -392087 118017 229546 2289 202388 48790 -195988 333755
11243 -185983 -146668 270987 143211 -411409 -240181 188385 -131730 265501 -377626 -331807
11233 -331807 -6078 192799 -430401 -138481 -140928 -166671 -481374 14388 -142041 41833 -50742
11221 55768 -114479 5592 196812 -258977 22851 57191 -97446 96100 -151825 -120444 14626
$$ packed form
11300a21934o2307o7377C325L1723Q2072j3827N9284b46913E8896O6733m5860
11289G9769h8703j35412a2043B80501I6516a61206c7473p8810A22426b26631j30359
11278c56990a02782A28355a73147A22414l141a05927J7915o044d3253E2394a10646
11266a6261C2021f3451o7356N1450k96796E5806d23405A64246i4295K8111I1549
11254a43506A06455l4374c92087A18017J11529B289K00099D8790a95988C33755
11243a85983L9315B70987j27776d11409J71228A88385a31730B65501c77626M5819
11233c31807f078A92799d30401a38481k447k5743l14703A4388a42041D1833e0742
11221E5768a14479E592J91220b58977B2851L4340i7446I6100a51825L1381A4626
$$ plain form
11209 -14391 197733 -142597 -184711 335099 -189009 167645 -52792 -140151 -81857 -52888 113640
11197 -21190 458187 17310 -249421 -213511 313055 -129708 -83723 18645 95194 172416 -151745
11185 24273 -187786 17909 186125 -55018 -62252 -98320 -35764 -307280 -7118 -135299 -3482
11173 178173 -83634 225439 -77761 -214656 13485 67019 210684 45290 -91466 182928 -108069
11161 -304956 -168107 189125 -49609 65804 193247 33713 116099 90368 -220100 -6042 59453
11149 213633 -15700 38558 -146412 125842 -130767 -68101 -73710 134143 -175598 53089 166188
11138 166188 -334938 106703 -300541 234989 224886 276620 -132455 -6336 31544 -33473 303846
11126 299049 41477 -12346 35033 -133575 -10582 180433 102840 76123 -221656 158236 41190
$$ packed form
11209a4391A97733a42597m2114C35099a89009A67645e2792q7359N8294K8969A13640
11197b1190D58187A7310b49421L5910C13055a29708M5985A8645P6549P7222a51745
11185B4273a87786A7909J68216e5018p234l6068c5764k71516g118j28181c482
11173A78173h3634B25439g7761j36895A3485N3534J43665D5290i1466A82928a08069
11161c04956J36849A89125d9609F5804J27443C3713Q2386k5731b20100f042E9453
11149B13633a5700C8558a46412A25842a30767O2666n609A34143a75598E3089J13099
11138A66188c34938A06703c00541B34989j0103N1734a32455f336C1544c3473C03846
11126B99049D1477a2346C5033a33575a0582A80433p7593k6717b21656A58236D1190
$$ plain form
11114 290452 31883 477999 -136215 53467 -157307 -231787 416347 216741 -96382 482443
11103 232764 -10540 -166682 392170 494402 339835 442378 313689 384969 149926 -120755
11092 -149213 295718 181935 547434 89637 30406 96486 175589 415888 10460 193848
11082 193848 179097 629991 425764 396572 306970 236868 410296 531587 236984 172883
11072 172883 212306 520890 307176 675949 6845 166191 332118 537230 528872 331917
11062 331917 438822 634269 754699 467366 550080 345848 617430 384637 645244 646499
11052 646499 530939 922769 1055795 810335 1023034 996544 1046645 806870 928116 1021207
11042 1021207 941381 1197039 660049 891966 937053 610382 1017865 848295 496392 819244
$$ packed form
11114B90452C1883M46116a36215E3467a57307p4480D16347j99606i6382D82443
11103B32764a0540j56142C92170J02232j54567J02543j28689P1280A49926a20755
11092a49213B95718j13783L65499H9637C0406O6080P9103K40299A0460J83388
11082A93848j4751M50894k04227k9192q9602p0102J73428J21291B36984o4101
11072A72883L9423L08584k13714L68773F845J59346J65927K05112q358j96955
11062C31917J06905J95447J20430k87333Q2714k04232K71582k32793K60607J255
11052F46499j15560L91830J33026k45460K12699k6490N0101k39775J21246R3091
11042A021207p9826K55658n36990K31917M5087l26671M07483j69570l51903L22852
$$ plain form
11032 819244 996164 677182 686035 974417 908044 984328 653651 1026254 925042 1006319
11022 1006319 1063279 1022145 734746 812491 533659 493436 651325 520322 429260 855160
11012 855160 696895 1154630 892752 815950 556113 954628 954055 714915 869526 636789
11002 636789 566398 836516 782546 619665 772955 788675 829560 925032 1164813 892664
10992 892664 804249 675313 898503 1011027 712246 973235 1247918 926764 1167220 1180629
10982 1180629 1153380 999747 1016040 1532930 1259036 1788432 2086763 2351534 2684154 3064946
10972 3064946 3290172 3556854 3843380 3854543 3850249 3843818 3443702 3218724 2237505 1978518
10962 1978518 1844443 1843682 1416574 1390169 1504052 1725569 1257453 1316300 1375223 870962
$$ packed form
11032H19244J76920l18982Q853K88382o6373P6284l30677L72603j01212Q1277
11022A006319N6960m1134k87399P7745k78832m0223J57889j31003r1062M25900
11012H55160j58265M57735k61878p6802k59837L98515n73k39140J54611k32737
11002F36789p0391K70118n3970j62881J53290J5720M0885R5472K39781k72149
10992H92664q8415j28936K23190J12524k98781K60989K74683l21154K40456J3409
10982A180629k7249j53633J6293N16890k73894N29396K98331K64771L32620L80792
10972C064946K25226K66682K86526J1163m294o431m00116k24978r81219k58987
10962A978518j34075p61m27108k6405J13883K21517m68116N8847N8923n04261
$$ plain form
10952 870962 816001 1049343 879067 727019 741067 526156 448688 283830 253234 387049
10942 387049 120160 217674 20312 454101 137111 164499 -149581 228227 362250 8833
10931 228391 -171548 65977 14310 -67384 167330 113957 129601 298642 262219 280887 57907
10919 -147031 115983 -125886 498169 -46986 362409 254598 -182426 128123 46136 -225979
10908 -228061 127766 236629 -50537 -357187 77609 243194 -34090 -25710 -1461 88576 -83939
10896 -77600 45151 18251 77883 91313 -163989 231709 83626 54662 -71643 -267936 -185614
10885 -185614 -149471 -275502 358765 192569 -28439 -32365 -69856 -209650 321990 5721 -59779
10873 -148228 81351 -245806 -333609 -282692 -268167 -1875 25636 3876 33765 -64301 -154302 -242353
$$ packed form
10952H70962n4961K33342j70276j52048J4048k14911p7468j64858l0596J33815
10942C87049A20160R7514B0312M33789A37111K7388a49581B28227J34023H833
10931B28391a71548F5977A4310f7384A67330n3373J5644J69041l6423J8668E7907
10919a47031A15983a25886D98169d6986C62409j07811a82426A28123D6136b25979
10908b28061A27766J08863e0537l06650G7609J65585c4090Q380a461H8576h3939
10896g7600D5151A8251N9632J3430a63989B31709H3626k8964g1643j96293Q2322
10885a85614L6143j26031C58765j66196b8439l926l7491j39794C21990E721e9779
10873a48228H1351b45806q7803N0917J4525a875B5636C876K9889f4301r0001q8051
$$ plain form
10861 -242353 298813 88627 93781 203607 2415 58366 265855 -339397 65076 82699 -26448
10849 33130 212536 160823 185253 -111577 -229744 83402 -63808 -20893 -180979 -113569 304293
10837 -226272 -155869 191421 -22772 202663 -338224 13610 99343 -281736 89701 -78747 14134
10825 49504 20929 464248 -34554 -14220 -188712 -214401 217244 -5412 95640 37824 98636
10814 98636 73331 -175833 -276382 -104808 341919 122978 -497586 -203164 312759 -171655
10803 181389 51768 -190790 -54242 186221 206197 -153679 -57957 76574 -13305 -202888 -66109
10791 116729 -167737 -223952 87673 -47848 14191 -207468 -296817 -42330 155839 134091 -53070
10779 44643 146068 -314072 75606 -19698 244601 79305 68086 3090 11707 35762 -307799
$$ packed form
10861b42353B98813H8627N154J09826B415N5951K07489c39397F5076J7623b6448
10849C3130J79406n1713K4430a11577j18167H3402f3808b0893j60086O7410C04293
10837b26272P0403A91421b2772B02663c38224A3610Q5733b81736H9701g8747A4134
10825D9504B0929M43319c4554a4220j74492k5689B17244e412I5640C7824O0812
10814I8636k5305a75833j00549a04808C41919A22978d97586b03164C12759a71655
10803A81389E1768a90790e4242A86221J9976a53679e7957G6574a3305j89583f6109
10791A16729a67737n6215H7673d7848A4191b07468q9349d2330A55839k1748e3070
10779D4643J01425c14072G5606a9698B44601G9305j1219C090Q617K4055c07799
$$ plain form
10767 -352182 -187224 -60793 -16082 154896 97466 -68734 334890 -109411 55975 161916
10757 161916 146324 -409071 -224090 -321854 -265449 -295094 -297425 -40079 -67494 -240500 -85376
10745 116992 151646 -83086 -50802 -319176 15081 148131 9421 -90359 -115232 -109317 -27669
10733 33177 119973 -60092 -149257 -126534 -164719 -60627 -113366 71213 73702 55692 54090 -91491
10720 66427 192041 -290883 36488 155896 -141422 294751 -310023 -162251 -179974 15505
10709 -103024 256402 -64186 216303 -207612 350642 188186 103121 227023 129767 242411
10699 242411 -58860 -7536 289174 -219602 166892 -27326 29133 -408434 -211494 59559 155075
10688 155075 -178307 68211 -496600 -98417 -206990 502500 89781 -62 -18092 -36062 340852
$$ packed form
10767c52182J64958f0793a6082A54896n7430f8734C34890a09411E5975J05941
10757A61916j5592d09071J84981r7764N6405k9645k331d0079k7415j73006h5376
10745A16992L4654h3086L2284k68374A5081J33050I421i0359k4873N915b7669
10733C3177Q6796f0092q9165K2723l8185f0627n2739G1213K489j8010j602i1491
10720F6427J25614b90883C6488J19408a41422B94751c10023J47772j7723A5505
10709a03024B56402f4186B16303b07612C50642j62456q5065J23902r7256J12644
10699B42411e8860g536B89174b19602A66892b7326B9133d08434J96940E9559R5516
10688A55075a78307F8211d96600i8417j08573E02500H9781f2j8030j7970C40852
$$ plain form
10676 -12754 -91768 267368 -111332 154042 26670 18904 -8422 -41619 -307852 -91526 58767
10664 285765 168672 -11484 51705 -231098 235628 112057 -61405 -295957 -165102 -78021
10653 -334656 29794 149548 60497 68038 -244157 -304038 -253663 -88984 231820 135113 -130677
10641 67064 167336 -163935 -155124 -65502 347151 -103155 4603 -208688 -15913 215776 57273
10629 138414 -66118 -129675 -204364 -470963 298843 99680 -68682 -92158 -161391 -140918 -56123
10617 19816 -114126 -39841 -195230 -61101 -68102 140526 -170174 230432 173023 399739 179901
10605 65941 -71667 -80927 -292342 146216 -139774 135664 -399729 -69938 -189976 -255717 -103104
10593 342013 -70532 124594 94290 174007 6007 362340 -28769 -55331 42622 197852 -53530
$$ packed form
10676a2754p9014B67368a11332A54042B6670p766h422l3197k66233i1526E8767
10664B85765j17093a1484E1705b31098B35628A12057f1405k34552J30855g8021
10653c34656B9794J19754F0497P541b44157n9881N0375h8984B31820r6707a30677
10641F7064J00272a63935Q811f5502C47151a03155D603b08688a5913B15776E7273
10629A38414f6118o3557p4689k66599B98843I9680f8682k3476o9233K0473e6123
10617A9816a14126c9841j55389f1101p001A40526a70174B30432n7409K26716A79901
10605F5941g1667r260k11415A46216a39774A35664c99729f9938j20038o5741a03104
10593C42013g0532A24594l0304P9717F007L56333b8769k6562D2622J55230e3530
$$ plain form
10581 4898 353003 18889 -41222 240290 -117046 -263221 196996 147554 26696 -74535 -209614
10570 -209614 -78096 -229218 293743 -236207 45215 -29000 -80754 -78551 -282705 305663 197958
10559 197958 47 22109 13333 19613 410136 -160057 425668 3225 22423 225823 -153145 232210
10546 -123433 -6689 -49899 -277419 -158932 60742 205060 -329101 -415213 -241028 43664 -101711
10534 383648 -142733 -315803 -306859 -86029 -130799 -172146 -33324 -363971 -83746 -6681 -39388
10523 -39388 121220 121283 -160551 -5725 -5953 -59535 -41196 144401 76284 -86010 -234005 28092
10510 19166 43401 164191 -210492 -146988 -189466 -49080 107015 -264743 89336 35180 -266244
10498 241759 5226 -129313 -54530 54620 -75400 162333 -149449 196455 61188 -309525 1615
$$ packed form
10581D898L48105A8889d1222B40290a17046j46175A96996m9442B6696g4535j35079
10570b09614g8096j51122B93743b36207D5215b9000n1754K203k04154C05663j07705
10559A97958D7K2062q776O280L90523a60057D25668C225J9198K03400a53145B32210
10546a23433f689m3210k27520J18487F0742J44318c29101q6112J74185D3664a01711
10534C83648a42733j73070Q944h6029m4770m1347c3324l30647h3746f681l2707
10523c9388A21220O3a60551e725k28n3582J8339A44401o8117h6010j47995B8092
10510A9166K4235J20790b10492O3504m2478d9080A07015b64743H9336C5180b66244
10498B41759E226a29313e4530E4620g5400A62333a49449A96455F1188c09525A615
$$ plain form
10486 -39276 103310 -71250 -76956 -188092 406214 -112108 138778 200167 412408 355191 470410
10475 470410 -123802 30559 68845 -156988 97446 -91715 168817 175563 -109264 -96212 99706
10463 69426 57371 219789 -67473 -180247 -237665 2601 96491 -299945 -470155 -97619 98127
10451 -35271 72856 141790 -241496 157335 95299 -240844 -28453 171234 270010 145293 -63786
10439 172667 -2972 172069 79207 -103499 -236671 -89987 44244 66789 -421333 64187 -254952
10427 289690 -30726 16318 -95560 -90701 -116573 -90619 -15326 -45267 177487 -64995 27926
10415 -258950 165074 -131002 77760 78885 -90768 -79658 107229 -119193 142192 -240136
10404 -95471 79368 136621 -116553 -201022 110641 70934 -340429 102491 113051 228985 420032
$$ packed form
10486c9276A03310g1250n706j11136D06214a12108A38778O1389K12241n7217J15219
10475D70410a23802C0559L8286a56988I7446i1715A68817O746a09264J3052I9706
10463F9426j2055J62418f7473j12774n7418B601R3890b99945j70210i7619I8127
10451c5271G2856O8934b41496A57335o2036b40844b8453A71234R8776j24717f3786
10439A72667b972A72069G9207a03499j33172h9987D4244K2545d21333F4187b54952
10427B89690c0726A6318i5560M859k5872K5954a5326k9941A77487f4995B7926
10415b58950A65074a31002G7760J125i0768J1110A07229a19193A42192b40136
10404i5471G9368N7253a16553q4469A10641l9707c40429A02491J0560J15934J91047
$$ plain form
10393 420032 35179 -151598 457280 373880 -17563 249495 279423 164201 2930 -105624 135866
10381 -235228 382303 -31435 200525 380342 70911 293596 655623 248073 380537 421758
10371 421758 508368 148594 128605 461904 316373 441052 658150 614771 596198 327939
10361 327939 150907 136116 703700 375481 253413 97168 345512 452971 253012 450787
10351 450787 189724 784775 638280 356435 202797 -14111 486156 390350 520532 602502
10341 602502 178204 583538 4197 213848 226440 314228 202205 465273 -122187 72382
10330 422001 408039 108671 50749 387345 35834 1242 236507 126858 -2885 304850 420776
10319 420776 248800 40150 -262346 -14816 260182 -57204 -112923 61695 -118422 -154068 65464
$$ packed form
10393D20032C5179a51598D57280q3400a7563B49495K9928j15222B930a05624A35866
10381b35228C82303c1435B00525J79817G0911K22685L62027B48073J32464M1221
10371D21758Q6610A48594j9989L33299j45531J24679K17098m3379j8573k68259
10361C27939A50907j4791N67584l28219j22068I7168K48344J07459j99959J97775
10351D50787A89724N95051j46495k81845j53638a4111D86156r5806J30182Q1970
10341F02502A78204M05334D197K09651J2592Q7788j12023K63068a22187G2382
10330D22001j3962A08671E0749L36596C5834A242K35265j09649b885C04850J15926
10319D20776j71976D0150b62346a4816B60182e7204n5719F1695a18422l5646F5464
$$ plain form
10307 83064 -27059 71683 -145569 36358 124124 86254 -65060 -28968 35214 -102779 159981
10295 74901 9915 -65595 417870 11036 177673 -16544 124090 123519 -216385 48849 74015
10284 74015 10623 -201528 311128 -67655 -110985 -214342 -120923 -187665 -298801 4338 -349005
10272 -33865 -27125 -142968 170475 178545 144978 276103 99860 -99103 148122 -87267 -174644
10261 -174644 257279 91463 69975 59362 325805 239009 287530 105749 92879 153360 -84728
10249 16616 8846 140900 -186367 126414 -56869 81493 119159 -7653 -64161 -57476 -99775 55107
10236 152212 -36691 51807 64811 48594 -215031 -74580 -274468 144697 -476919 -141512
10225 47329 68255 118694 -101792 -4422 16656 -393453 125970 103022 -351295 52736 -323385
$$ packed form
10307H3064b7059G1683a45569C6358Q7766l7870f5060b8968C5214a02779A59981
10295G4901I915f5595D17870A1036J66637a6544A24090n71b16385D8849K5166
10284G4015A0623b01528C11128f7655m3330j03357R3419o6742j11136D338c49005
10272c3865O740j15843A70475Q070l3567J31125I9860i9103A48122h7267q7377
10261a74644B57279I1463k1488j0613K66443q6796M8521A05749j2870O0481h4728
10249A6616p770J32054a86367A26414e6869H1493L7666g653n6508O685m2299E5107
10236A52212c6691E1807J3004j6217b15031g4580j99888A44697d76919a41512
10225D7329K0926N0439a01792d422A6656c93453A25970k2948c51295E2736c23385
$$ plain form
10213 -181943 -262743 -111118 -176 -446136 -97855 213953 -134396 -208035 48298 304447 249913
10202 249913 -254895 141113 -103353 43125 -104290 -75326 -69265 -104717 -336640 305709
10191 89162 -68197 -158310 102800 15422 27667 -359652 27994 -34552 -20964 58644 -186518
10179 325585 -52525 -83004 -44608 -92150 -145318 -6331 -154010 -44093 -32140 7880 -30677 -129634
10167 -129634 -228783 308461 -241671 -110008 66328 27513 -138728 -221411 -152855 111135
10156 150745 -97542 -137801 105918 -60243 -34587 -45194 -66374 -21077 -74999 -50771 194565
10144 -28620 -241898 -195253 -62802 62209 -6654 -303971 -405465 183230 209449 59873 -40944
10132 -206580 -70480 -158521 -102084 -196676 -77186 23663 -236277 128485 -59946 -72666 -9516
$$ packed form
10213a81943q0800a11118a76m45960i7855B13953a34396p3639D8298K56149n4534
10202B49913b54895A41113a03353D3125a04290K8964O061l5452k31923C05709
10191H9162f8197r0113A02800A5422J2245c59652B7994c4552J3588E8644a86518
10179C25585e2525l0479L8396m7542n3168f331j47679d4093J1953G880c0677r8957
10167a29634r9149C08461b41671a10008F6328B7513a38728q2683O8556A11135
10156A50745i7542m0259A05918f0243K5656j0607k1180b1077n3922K4228A94565
10144b8620k13278M6645f2802F2209f654k97317j01494A83230K6219E9873d0944
10132b06580g0480q8041N6437r4592g7186B3663b36277A28485e9946j2720i516
$$ plain form
10120 -309998 -203085 -55629 -273267 -60244 -109269 -109852 -394923 -98081 -296935 -28034 -27374
10109 -27374 -70554 -268509 7968 44544 316555 -130750 -228420 55164 180054 -93426 -161410
10098 -161410 96970 23156 240216 -52551 44172 -75102 -110515 -171376 115279 188381 132103
10087 132103 334380 -157817 38352 33778 -73118 356996 -97424 -325136 -49255 -135748 -44485
10075 -23062 190971 -70012 123612 -17347 -224692 42342 -323747 119934 -118428 -144174
10065 -144174 100870 -227534 -78470 -213194 -119128 -103770 -52976 -265307 -328538 33962 184408
10054 184408 20885 -116401 -60695 -58437 -66705 -53552 67348 -11704 -178188 -260400 -118144
10042 -402101 -222820 235601 -327418 -160670 -358349 133695 -172304 35697 198376 -53767
$$ packed form
10120c09998J06913e5629k17638f0244m9025n83k85071i8081j98854b8034O60
10109b7374m3180j97955G968L6576K72011a30750r7670E5164J24890i3426o7984
10098a61410I6970B3156K17060e2551D4172g5102l5413o0861A15279P3102n6278
10087A32103K02277a57817C8352m574g3118C56996i7424k27712d9255q6493d4485
10075b3062A90971g0012A23612a7347k07345D2342c23747A19934a18428k5746
10065a44174A00870b27534g8470j34724R4066J5358N0794k12331o3231C3962J50446
10054A84408B0885a16401N5706K258q268J3153F7348a1704j66484q2212a18144
10042d02101J79281B35601c27418a60670j97679A33695a72304C5697J62679e3767
$$ plain form
10031 161289 -11406 376209 193955 -213258 -556184 -20418 314367 100123 -202879 -93744
10020 -103522 -190462 -62259 10356 -179579 -206638 195501 46893 204776 40259 39093 91976
10009 91976 -174960 -182532 -359867 42095 39760 67749 104724 -269146 19029 22661 86935 334191
9997 334191 -8696 -117489 -99933 187687 -139588 -122699 -345602 58839 -513322 29154 4475
9985 -248649 -139258 -147168 85779 71528 -72484 -6144 -336006 167023 -143840 -254506 -41720
9973 -76616 20083 -270793 -197752 -50179 -4272 -48378 -224002 45823 208378 -287851 -118591
9961 -33491 -217772 -70303 -399038 -116237 -298861 217050 -260162 -27828 74195 -39113 -180600
9950 -180600 -25131 -58773 -106602 -189013 -373556 -271791 -101644 -129651 -302683 -55599 -464668
$$ packed form
10031A61289a1406C76209j82254b13258l42926b0418C14367A00123b02879i3744
10020a03522q6940f2259A0356a79579k7059A95501D6893J57883D0259j166N2883
10009I1976a74960p572j77335D2095k335K7989L6975b69146A9029L632O4274K47256
9997C34191h696j08793J7556A87687a39588J6889k22903E8839e13322B9154D475
9985b48649J09391p910H5779j4251g2484f144l29862A67023a43840j10666d1720
9973g6616B0083b70793P3041e0179d272m4106j75624D5823J62555b87851a18591
9961c3491j84281g0303l28735a16237j82624B17050b60162b7828G4195c9113j41487
9950a80600b5131l3642m7829q2411j84543J01765a01644k8007j73032e5599m09069
$$ plain form
9939 -464668 -201855 80734 68062 -139855 77022 -62189 59725 42596 -5225 -325571 75477
9927 33210 217421 -36501 -49315 -26624 -16574 78674 -101244 225084 -35148 -248625 -22190
9915 -340369 52557 -143994 118773 -61003 1079 -97927 148875 -243181 69073 182829 101508
9904 101508 -393767 -58932 10747 -165686 170567 -470493 -9824 -264487 -132968 -302976
9894 -302976 22224 -261561 -275390 -62500 -83329 116067 -258229 -243541 84393 -16943 -257294
9883 -257294 30298 245303 171254 147179 26179 21295 -243956 -162860 -95655 -100116 -464292
9872 -464292 8872 -78729 -206464 -85795 115018 -314284 19683 -308444 93671 187064 -19411
9860 152830 -36641 -340414 -296571 152865 -35452 50159 -283086 -46977 -15830 250786 -105540
$$ packed form
9939d64668b01855H0734j2672a39855G7022f2189E9725j7129e225l20346G5477
9927C3210J84211c6501j2814K2691J0050G8674a01244B25084c5148k13477b2190
9915c40369E2557a43994A18773f1003A079i7927A48875b43181F9073J13756q1321
9904A01508c93767e8932A0747a65686A70567d70493i824k54663J31519j70008
9894c02976B2224b61561j3829f2500k0829A16067b58229J4688H4393a6943k40351
9883b57294C0298K15005p4049k4075B6179m884b43956Q1096O7205m461l64176
9872d64292H872g8729j27735h5795A15018c14284A9683c08444I3671R3393a9411
9860A52830c6641l03773M3843A52865c5452E0159b83086d6977a5830B50786a05540
$$ plain form
9848 -245398 -63649 -160971 -135577 -135425 -248045 66991 237149 4730 -363208 -229177 -445078
9837 -445078 -43301 -77525 -230093 328407 -8713 -259569 302220 97741 -184982 -156923 -21668
9825 130227 -118225 220949 -361428 -70928 -60719 93848 -299560 -430848 -256634 172756
9814 -47206 -356290 -6609 -96618 139033 -199168 -155434 53768 298545 75542 -166302 4511
9802 -55383 314980 2018 -60144 60798 62726 -92712 -87006 25784 57700 133920 -392201 -239428
9790 -239428 -21735 -140348 244327 248244 -93433 -98691 34785 -191146 -283226 141257 182861
9779 182861 -222969 -81414 156932 198108 -72621 -356221 -220473 -121561 -128987 -109097 -230808
9768 -230808 -222143 149374 -7729 -307962 11195 -97029 31179 -398145 -148639 40259 125255
$$ packed form
9848b45398f3649r7322K5394J52j12620F6991J70158D730c63208J34031k15901
9837d45078d3301l4224j52568C28407h713k50856C02220I7741a84982K8059b1668
9825A30227a18225B20949c61428g0928J0209I3848b99560j31288J74214A72756
9814d7206l09084f609r0009A39033a99168M3734E3768K44777G5542a66302D511
9802e5383C14980B018f0144F0798J928i2712N706B5784L1916P6220c92201J52773
9790b39428b1735j18613B44327L917i3433n258C4785a91146r2080A41257M1604
9779A82861b22969h1414A56932M1176g2621k83600J35748R8912p426J9890j21711
9768b30808Q665A49374g729l00233A1195i7029C1179c98145a48639D0259Q4996
$$ plain form
9757 125255 -246494 180492 115241 -23623 -67903 -125632 -21682 -5562 177676 217592 -52477
9745 -143149 -10286 204402 19928 -81393 -256942 -119349 -60700 -162719 -117271 222045 41562
9733 -215543 -250493 -173594 -379342 -274124 20997 344493 192962 -51562 -257927 -134026
9723 -134026 7132 -308729 -28422 -113473 145944 -70779 -577426 180642 120243 -340659 126937
9711 66083 -50644 -74236 140272 -40235 12092 -35004 -85761 -48827 -201554 -121970 -163479
9700 -163479 -145640 -287308 -167846 211170 -225732 -129698 208286 -109731 -26769 -290077
9690 -290077 93761 -244030 -267808 67392 -374903 -131178 -44468 -93191 203966 -85116 75498
9678 -139287 83735 105465 119537 45220 -1452 -59778 -190663 156559 174989 220322 -223927
$$ packed form
9757A25255b46494A80492o5251b3623m4280n7729b1682e562A77676L9916e2477
9745a43149a0286B04402A9928h1393j75549a19349N8649j02019M5448B22045D1562
9733b15543l4950P6899k05748J05218B0997L23496j51531e1562k06365J23901
9723a34026G132c08729b8422q5051A45944g0779n06647A80642o0399c40659A26937
9711F6083e0644k3592A40272d0235A2092c5004n0757L6934j52727P9584m1509
9700a63479J7839j41668J19462B11170b25732R6034B08286a09731b6769k63308
9690b90077I3761b44030k3778F7392c74903a31178d4468m8723B03966h5116G5498
9678a39287H3735K1730J4072D5220a452n8326j30885A56559J8430M5333b23927
$$ plain form
9666 -28169 -189378 -28168 -48000 -256858 -253795 -108965 -209329 -44212 -330887 220829 -87717
9654 103294 -258906 -367494 49311 59511 -352246 -161697 182889 -94272 -64110 -316010
9644 -316010 -209928 -151006 27251 -47324 -166916 -158121 127998 163854 -165001 -215964 -71872
9632 284309 -172026 -333533 99412 98151 -226114 -242976 -192627 -71581 -106159 -23729 129518
9620 -77474 -215935 8107 -151 49834 -285483 -168432 -222544 -88656 -292249 43172 -195921
9608 -277947 -475031 -188144 -196191 78600 -199904 250418 -35553 77399 -23083 306704 150462
9596 60576 -51764 -2217 -78623 -85010 -166954 -106906 -134376 77108 22934 36405 -309634 303483
9583 -7000 -175732 -72267 -269700 -11997 134048 -63280 10550 27722 -380505 103558 -123759
$$ packed form
9666b8169j61209b8168j9832k08858L063a08965j00364d4212k86675B20829h7717
9654A03294b58906j08588D9311J0200c52246a61697A82889i4272L0162k51900
9644c16010J06082N8922B7251d7324j19592Q795A27998L5856a65001n0963g1872
9632B84309a72026j61507I9412j261b26114j6862N0349g1581l4578b3729A29518
9620g7474j38461H107a51D9834b85483J17051n4112h8656k03593D3172a95921
9608b77947j97084a88144q047G8600a99904B50418c5553G7399b3083C06704A50462
9596F0576e1764b217p6406o387q1944O0048k7470G7108B2934J3471c09634C03483
9583g000j68732g2267j97433a1997A34048f3280A0550J7172c80505A03558a23759
$$ plain form
9571 -34810 -184033 -143086 270528 159940 -287238 -145499 64073 -175128 -60279 -557954
9561 -557954 57430 -298567 -473178 23128 -185926 260181 -30397 -188066 5408 158198 343311
9550 343311 -98890 -51104 182433 174224 -248543 -12777 111229 -108322 15949 -192655 -78675
9538 168030 -271903 -253169 200385 157738 -31876 -76380 -226779 -14705 62452 -176530 -273323
9527 -273323 61254 -3412 -429506 -186726 34120 -283228 -443481 66749 -453064 96593 -297794
9515 -378895 -255883 103344 -44418 -313927 53498 -68768 -8748 -113968 82136 128786 -361438
9503 82615 9921 -157951 -191972 -29648 -363835 189759 -131015 87061 -147641 -184633 -93419
9492 -93419 -111743 115178 -183716 -78821 -278333 118594 458570 -77726 -133239 60704 324516
$$ packed form
9571c4810j49223M0947B70528j10588b87238J41739F4073a75128f0279m97675
9561e57954E7430b98567j74611B3128a85926B60181c0397j57669E408J52790J85113
9550C43311i8890M7786A82433q209b48543a2777A11229a08322A5949a92655g8675
9538A68030b71903J8734B00385m2647c1876m4504j50399a4705F2452a76530r6793
9527b73323F1254c412m26094a86726C4120b83228j60253F6749d53064I6593b97794
9515c78895J23012A03344d4418k69509E3498f8768h748j05220H2136M6650c61438
9503H2615I921a57951l4021b9648l34187A89759a31015H7061a47641l6992R1214
9492i3419j8324A15178a83716g8821j99512A18594L39976g7726n5513F0704K63812
$$ plain form
9481 324516 153260 48199 -22032 -70377 -143145 77593 40403 -247884 -110817 -61712 178749
9469 -317509 287529 18627 106837 -98064 -46554 -885 -315076 -84931 36663 -345823 -379549
9458 -379549 247939 -208487 69707 -128072 -177126 -40319 -256734 -8106 115365 43740 -34541
9446 -47164 -182904 4819 32566 -416427 138851 -11065 -48673 -320604 -313303 25386 -117262
9434 -35897 252622 -253079 -267251 -90568 -102969 -49426 266778 -92946 224651 -191684 24861
9422 -60938 78140 -65058 144467 71874 -74408 47814 -110610 -117899 -54975 -112597 8587 34475
9410 34475 -88674 -527825 -226313 -106946 -44764 410713 -46431 314696 118707 -124062
9399 300625 88754 225194 -175612 100158 -100729 -222204 111463 -144658 242951 -180584
$$ packed form
9481C24516A53260D8199b2032m8345p2768G7593l7190b47884a10817M9105A78749
9469c17509B87529A8627Q8210i8064d6554h85l14191h4931C6663c45823l3726
9458c79549B47939b08487F9707a28072m9054d0319k16415h106A15365D3740c4541
9446d7164j35740D819K7747d16427A38851a1065l7608k71931P301B5386a17262
9434c5897B52622b53079j4172i0568j2401d9426B66778i2946B24651a91684B4861
9422f0938G8140f5058A44467G1874g4408D7814a10610p289e4975n7622H587K5888
9410C4475h8674m39151b26313a06946d4764D10713d6431C14696A18707a24062
9399C00625H8754J36440a75612A00158a00729j21475A11463a44658B42951a80584
$$ plain form
9388 118235 115382 -66811 -15525 -85469 -43092 -42285 204625 -133480 97621 -225604 1804 -35349
9375 185204 -173743 -156985 -139910 166957 -56860 -111955 -393657 -159086 -338942 75269 115778
9364 115778 -106175 -109558 -117390 -379650 76002 -20573 -161520 103577 -44609 -126865 6491
9352 -35972 61536 -270252 -77775 435830 -20142 80798 -106338 6699 -244831 -34650 -369806
9341 -369806 104529 16843 -99842 84783 -60717 -293806 171821 60909 -34384 -47321 90827
9329 -24893 38856 -109728 119598 -53634 -386453 -153654 25429 30757 -92749 -39728 265449
9317 20616 -36969 -8667 30791 -145284 -460425 -160146 -112136 132235 -110643 179409 -142684
9305 -46637 -45751 -196567 -70335 -48628 -103028 70587 94727 89065 107429 17833 -232480 -108402
$$ packed form
9388A18235k853f6811a5525o9944M2377Q07B04625a33480I7621b25604A804c5349
9375A85204a73743J6758J7075A66957e6860n5095k81702a59086j79856G5269M0509
9364A15778a06175l383p832k62260G6002b0573j40947A03577d4609q2256F491
9352c5972F1536b70252g7775D35830b0142H0798a06338F699b44831c4650l35156
9341c69806A04529A6843i9842H4783f0717k33089A71821F0909c4384j2937I0827
9329b4893C8856a09728A19598e3634l32819a53654B5429N328i2749c9728B65449
9317B0616c6969h667C0791a45284l15141a60146M8010A32235a10643A79409a42684
9305d6637Q86j50816g0335K1707n4400G0587K4140n662J8364A7833b32480a08402
$$ plain form
9292 -31515 55717 -108171 -237296 -54534 8970 -34115 60281 -140160 212104 -42367 -171475
9281 -171475 -166317 -20760 66292 -1536 -68385 51259 10166 -193950 -74891 -283376 76233 -25094
9268 -338403 105288 -67969 -279556 61098 -347996 -121539 105753 -100431 116847 -125548
9257 -18285 155638 -33583 -27387 58162 -246473 12342 74546 -252234 -18222 -154150 226803
9245 -99459 -49444 -343074 -107225 -57210 -28921 -132548 -145560 -308307 -130481 177429 -115471
9233 165464 -21579 51695 183056 158936 -83291 -190223 100686 -255951 -188956 -95274 -102104
9222 -102104 -42924 -227034 -312999 -98401 -344248 -197545 -108407 -171258 -289349 178430 -86751
9210 52772 -23442 -87908 -108865 -320521 -61540 -153314 -174361 -2205 -100513 -108906 -104984 167534
$$ packed form
9292c1515E5717a08171j29125e4534H970c4115F0281a40160B12104d2367j29108
9281a71475N158b0760F6292a536o6849E1259A0166a93950g4891k08485G6233b5094
9268c38403A05288f7969k11587F1098c47996a21539A05753a00431A16847a25548
9257a8285A55638c3583O196E8162b46473A2342O2204b52234a8222j35928B26803
9245i9459d9444k93630a07225N0015K8289j03627j3012j62747a30481A77429a15471
9233A65464b1579E1695J31361k4120h3291j06932A00686b55951O6995R3682o830
9222a02104d2924j84110q5965i8401k45847J46703Q9138o2851j18091A78430h6751
9210E2772b3442o4466k0957k11656f1540r1774k1047b205r8308q393L922A67534
$$ plain form
9197 -305135 157224 -264864 169110 -144451 129829 -88890 -246742 -80205 -118482 -308763
9187 -308763 -203081 175014 291763 -139621 306360 -131272 -237992 -65543 -47405 9536
9176 179501 -129849 40144 42829 -14012 -23961 -108149 -210109 160646 -96007 -26016 -198228
9165 -198228 -354811 -30624 -62253 -82368 133475 177024 -87632 197046 235064 76917 -169281
9153 -36079 207184 241006 -29826 71579 -267548 -309153 -169862 208767 -148738 47508 -354274
9141 -209054 241374 99150 33176 -92288 -199128 -352397 -163928 37876 -68156 10395 91549
9130 91549 -105161 -202738 -78368 -27035 -109265 -150337 73416 -70513 -114242 -185396 -10598 -70283
9118 -70283 -310310 -137499 -229988 20910 -86010 -58902 -23142 -41261 368733 271829 -63270
$$ packed form
9197c05135A57224b64864A69110a44451A29829h8890j57852h0205l8277j90281
9187c08763J05682A75014J16749a39621C06360a31272j06720f5543J8138I536
9176A79501a29849D0144K685a4012r949q4188j01960A60646i6007b6016j72212
9165a98228j56583c0624l1629k0115A33475M3549h7632A97046L8018G6917a69281
9153c6079B07184L3822b9826G1579b67548m1605J39291B08767a48738D7508c54274
9141b09054B41374I9150C3176i2288j06840j53269a63928C7876f8156A0395Q1154
9130I1549a05161r7577g8368b7035q2230m1072G3416g0513m3729p1154a0598n9685
9118g0283k40027a37499r2489B0910h6010K7108b3142j8119C68733r6904f3270
$$ plain form
9106 -214328 140087 -356313 -334567 -192008 -150944 -215821 -135561 207623 132009 -146459 -108892
9095 -108892 -243159 -158660 341568 -100045 -227680 -85511 14268 769 144544 -4294 -101442
9084 -101442 47979 -425028 -11813 115679 -229501 -203308 -74027 -316995 -60545 44969 -199083
9072 -77341 -137353 -363175 47571 -130064 -99716 -181506 141828 185069 -15716 118108 -270199
9060 -169290 -85894 417680 -306191 -182594 -146352 353875 -194555 -21251 -115395 7857 255905
9049 255905 -153167 -131535 -164630 272641 97629 -386867 38762 -309412 -39553 7683 118698
9038 118698 -123440 -198942 -80542 164096 -97580 -104018 -237324 -263449 -35186 -124378 -272979
9027 -272979 -92184 14183 -269306 -113425 108595 -450542 -118876 16733 -130395 95180
$$ packed form
9106b14328A40087c56313K1746J42559M1064o4877Q0260B07623p5614a46459L7567
9095a08892j34267Q4499C41568a00045j27635h5511A4268G69J43775d294r7148
9084a01442D7979d25028a1813A15679b29501K6193g4027k42968f0545D4969a99083
9072g7341o0012k25822D7571a30064L0348q1790A41828M3241a5716A18108b70199
9060a69290Q3396D17680c06191J23597L6242C53875a94555b1251r4144G857K48048
9049B55905a53167K1632l3095B72641I7629c86867C8762c09412c9553G683J11015
9038A18698a23440p5502h0542A64096i7580o438j33306k6125c5186q9192j48601
9027b72979i2184A4183b69306a13425A08595d50542a18876A6733a30395I5180
$$ plain form
9016 -214318 -158217 -63805 209457 5080 -6955 -202353 -86421 -312478 -63146 103603 -176959
9004 -192405 13705 56497 -30521 -87054 -334235 -61572 191059 -27930 49085 -22263 -70183
8993 -70183 -31096 -35506 -94222 -277514 297741 12313 -291771 -375149 35862 -35679 62627
8981 48560 -292467 77691 176828 -175105 -286787 -349870 160341 14083 -11910 186090 -465486
8969 -469271 87048 -23544 -340866 46393 -275908 -13986 56634 -252510 -151478 305739 -93609
8957 -163246 134520 -90198 41876 -204101 246374 90423 -43245 -9378 103409 -156326 323556
8945 -87913 -29565 -232312 -233195 -148478 184907 -226326 90378 -70473 -150718 -78984 199808
8933 314634 86955 157950 152107 44598 70559 -112438 -293996 92427 862426 1134398 2785456
$$ packed form
9016b14318N6101f3805B09457E080f955j95398h6421k26057f3146A03603a76959
9004a92405A3705M2792c0521n6533k47181f1572A91059b7930D9085b2263m7920
8993g0183c1096m410n8716j83292B97741A2313b91771q3378C5862c5679F2627
8981D8560b92467G7691R9137a75105j11682o3083A60341A4083a1910A86090d65486
8969d69271H7048b3544l17322D6393b75908a3986E6634b52510J01032C05739i3609
8957a63246A34520i0198D1876b04101B46374I0423d3245i378A03409a56326C23556
8945h7913b9565k02747q83Q4717A84907b26326I0378g0473q0245P1734A99808
8933C14634H6955P0995n843D4598K5961a12438j81558I2427P69999K71972J651058
$$ plain form
8922 2785456 8249460 15252611 6926068 2167839 881132 169202 491275 202833 -65030
8912 132225 -129830 13707 74084 187873 241550 170085 317285 -83668 37595 -58932 -58490
8901 -58490 -50119 -364994 -198009 -402719 -140675 -58092 -146375 91926 123046 -144370 -209073
8890 -209073 -206210 46903 -241106 -57572 -83813 -179559 -182831 -73809 -148037 -92677 -150381 46516
8877 -200365 -102617 86292 27932 -430587 33882 48618 229033 -180010 96713 93012 -50443
$$ packed form
8922B785456N464004P003151F926068B167839H81132A69202L22073B02833f5030
8912A32225a29830A3707O0377J13789N3677p1465J47200h3668C7595e8932M42
8901e8490Q371l14875J66985k04710a40675e8092q8283I1926L1120a44370o4703
8890b09073K863D6903b41106e7572k6241r5746l272g3809p4228N5360n7704D6516
8877b00365R7748H6292B7932d30587C3882J4736J80415a80010I6713l701e0443
$$ [...]
##END NTUPLES=NMR SPECTRUM
##END=
