
##TITLE=AC1399_2357uv_7519954_JKoHcfTaAp
##JCAMPDX= 6.0         $$ Bruker NMR JCAMP-DX V2.0
##DATA TYPE= NMR SPECTRUM
##DATA CLASS= NTUPLES
##ORIGIN= BRUKER
##OWNER= Administrator
$$ 1.72 TOPSPIN		Version 2.1
$$ 2013-02-19 17:41:32.301 -0500  Administrator@X
$$ Compression mode = diff/dup
##.OBSERVE FREQUENCY= 400.02188249412
##.OBSERVE NUCLEUS= ^1H
##.ACQUISITION MODE= SIMULTANEOUS (DQD)
##.ACQUISITION SCHEME= undefined
##.AVERAGES= 64
##.DIGITISER RES= 22
##SPECTROMETER/DATA SYSTEM= spect
##.PULSE SEQUENCE= noesygpps1d.comp
##.SOLVENT NAME= COFFEE_meoh
##.SHIFT REFERENCE= INTERNAL, COFFEE_meoh, 1, 14.96113
##AUDIT TRAIL= $$ (NUMBER, WHEN, WHO, WHERE, PROCESS, VERSION, WHAT)
$$ ##TITLE= Audit trail, TOPSPIN		Version 2.1
$$ ##JCAMPDX= 5.01
$$ ##ORIGIN= Bruker BioSpin GmbH
$$ ##OWNER= Administrator
$$ $$ E:\/data/COFFEE/nmr/AC1399_2357uv_7519954_JKoHcfTaAp/12/pdata/1/auditp.txt
$$ ##AUDIT TRAIL=  $$ (NUMBER, WHEN, WHO, WHERE, PROCESS, VERSION, WHAT)
(   1,<2013-02-19 17:41:25.942 -0500>,<Administrator>,<X>,<go>,<TOPSPIN 2.1>,
      <created by zg
	started at 2013-02-19 17:29:56.003 -0500,
	POWCHK enabled, PULCHK disabled,
       configuration hash MD5:
       86 BA 57 50 F2 9D 5C 9B 26 00 A9 28 5F 66 2E 89
       data hash MD5: 64K
       5F 02 82 CA A5 74 FA D4 11 11 38 0F 08 FD 4B 2E>)
(   2,<2013-02-19 17:41:28.989 -0500>,<Administrator>,<X>,<proc1d>,<TOPSPIN 2.1>,
      <Start of raw data processing
       efp LB = 0.3 FT_mod = 6 PKNL = 1 PHC0 = 0 PHC1 = 0 SI = 128K 
       data hash MD5: 128K
       81 6B 04 06 B5 B4 D4 16 4F 66 9B 4B 74 55 44 6A>)
(   3,<2013-02-19 17:41:30.176 -0500>,<Administrator>,<X>,<proc1d>,<TOPSPIN 2.1>,
      <pk PHC0 = 253.515 PHC1 = 0 
       data hash MD5: 128K
       BB 11 84 94 FC EB A7 16 D4 FC 21 34 8D E4 BF EC>)
(   4,<2013-02-19 17:41:31.208 -0500>,<Administrator>,<X>,<proc1d>,<TOPSPIN 2.1>,
      <abs ABSG = 1 
       data hash MD5: 128K
       DD C6 3F DD 26 F8 D2 CA AB C1 72 E9 16 84 AF 9A>)
(   5,<2013-02-19 17:41:31.411 -0500>,<Administrator>,<X>,<proc1d>,<TOPSPIN 2.1>,
      <abs ABSG = 2 
       data hash MD5: 128K
       EE A3 C9 A9 0E 84 70 57 1D 6F C3 DF 91 16 D9 AE>)
(   6,<2013-02-19 17:41:31.598 -0500>,<Administrator>,<X>,<proc1d>,<TOPSPIN 2.1>,
      <abs ABSG = 3 
       data hash MD5: 128K
       EA 08 FD D4 04 BA 9F 97 70 21 2E 15 3A B7 5B 5A>)
(   7,<2013-02-19 17:41:31.755 -0500>,<Administrator>,<X>,<proc1d>,<TOPSPIN 2.1>,
      <abs ABSG = 4 
       data hash MD5: 128K
       78 11 BA A4 DE 80 5B E2 9A 40 53 3F 47 76 21 EB>)
(   8,<2013-02-19 17:41:31.926 -0500>,<Administrator>,<X>,<proc1d>,<TOPSPIN 2.1>,
      <abs ABSG = 5 
       data hash MD5: 128K
       28 24 37 7D 67 F8 37 76 53 82 E6 6D 96 62 62 AF>)
$$ ##END=
$$ 
$$ $$ hash MD5
$$ $$ 77 88 69 1E 6B 14 AE FD 21 E6 07 FF 8E 7E 24 DD
##$RELAX= 
##$RELAX= 
##$RELAX= 
##$RELAX= 
##$RELAX= 
##$RELAX= 
##$RELAX= 
##$RELAX= 
$$ Bruker specific parameters
$$ --------------------------
##$DU= <E:\>
##$EXPNO= 12
$$ [...]
150 150 150 150 150 150 150 150
##$TP07= 0
##$TPNAME0= <>
##$TPNAME1= <>
##$TPNAME2= <>
##$TPNAME3= <>
##$TPNAME4= <>
##$TPNAME5= <>
##$TPNAME6= <>
##$TPNAME7= <>
##$TPOAL= (0..7)
0.5 0.5 0.5 0.5 0.5 0.5 0.5 0.5
##$TPOFFS= (0..7)
0 0 0 0 0 0 0 0
##$TUNHIN= 0
##$TUNHOUT= 0
##$TUNXOUT= 0
##$USERA1= <user>
##$USERA2= <user>
##$USERA3= <user>
##$USERA4= <user>
##$USERA5= <user>
##$V9= 5
##$VALIST= <valist>
##$VCLIST= <CCCCCCCCCCCCCCC>
##$VD= 0
##$VDLIST= <DDDDDDDDDDDDDDD>
##$VPLIST= <PPPPPPPPPPPPPPP>
##$VTLIST= <TTTTTTTTTTTTTTT>
##$WBST= 1024
##$WBSW= 4
##$XGAIN= (0..3)
0 0 0 0
##$XL= 0
##$YL= 0
##$YMAX_a= 6684837
##$YMIN_a= -11550717
##$ZGOPTNS= <>
##$ZL1= 120
##$ZL2= 120
##$ZL3= 120
##$ZL4= 120
##$ABSF1= 14.96113
##$ABSF2= -5.597052
##$ABSG= 5
##$ABSL= 3
##$ALPHA= 0
##$AQORDER= 0
##$ASSFAC= 0
##$ASSFACI= 0
##$ASSFACX= 0
##$ASSWID= 0
##$AUNMP= <proc_prof1d_extract.lims>
##$AXLEFT= 0
##$AXNAME= <>
##$AXNUC= <1H>
##$AXRIGHT= 0
##$AXTYPE= 0
##$AXUNIT= <>
##$AZFE= 0.1
##$AZFW= 0.1
##$BCFW= 0
##$BC_mod= 0
##$BYTORDP= 0
##$COROFFS= 0
##$CY= 15
##$DATMOD= 1
##$DC= 0
##$DFILT= <>
##$DTYPP= 0
##$F1P= 0
##$F2P= 0
##$FCOR= 0.5
##$FTSIZE= 131072
##$FT_mod= 6
##$GAMMA= 0
##$GB= 0
##$INTBC= 1
##$INTSCL= 1
##$ISEN= 128
##$LB= 0.3
##$LEV0= 0
##$LPBIN= 0
##$MAXI= 10000
##$MC2= 0
##$MEAN= 0
##$ME_mod= 0
##$MI= 0
##$NCOEF= 0
##$NC_proc= -2
##$NLEV= 6
##$NOISF1= 0
##$NOISF2= 0
##$NSP= 0
##$NTH_PI= 0
##$NZP= 0
##$OFFSET= 14.96113
##$PC= 1
##$PHC0= 253.515
##$PHC1= 0
##$PH_mod= 1
##$PKNL= yes
##$PPARMOD= 0
##$PPDIAG= 0
##$PPIPTYP= 0
##$PPMPNUM= 2147483647
##$PPRESOL= 1
##$PSCAL= 4
##$PSIGN= 0
##$PYNMP= <proc.py>
##$REVERSE= no
##$SF= 400.020009582815
##$SI= 131072
##$SIGF1= 0
##$SIGF2= 0
##$SINO= 400
##$SIOLD= 131072
##$SPECTYP= <>
##$SREGLST= <1H.CDCl3>
##$SSB= 0
##$STSI= 131072
##$STSR= 0
##$SW_p= 8223.68421052631
##$SYMM= 0
##$S_DEV= 0
##$TDeff= 65536
##$TDoff= 0
##$TI= <>
##$TILT= no
##$TM1= 0
##$TM2= 0
##$TOPLEV= 0
##$USERP1= <user>
##$USERP2= <user>
##$USERP3= <user>
##$USERP4= <user>
##$USERP5= <user>
##$WDW= 1
##$XDIM= 131072
##$YMAX_p= 406241399
##$YMIN_p= -16708
##$CURPLOT= <Network HP LaserJet P1505>
##$CURPRIN= <$Network HP LaserJet P1505>
##$DFORMAT= <normdp>
##$LAYOUT= <+/1D_H.xwp>
##$LFORMAT= <normlp>
##$PFORMAT= <normpl>
##$SURQMSG= 1
$$ End of Bruker specific parameters
$$ ---------------------------------
##NTUPLES= NMR SPECTRUM
##VAR_NAME=  FREQUENCY,     SPECTRUM/REAL,   SPECTRUM/IMAG
##SYMBOL=    X,             R,               I
##VAR_TYPE=  INDEPENDENT,   DEPENDENT,       DEPENDENT
##VAR_FORM=  AFFN,          ASDF,            ASDF
##VAR_DIM=   131072,        131072,          131072
##UNITS=     HZ,            ARBITRARY UNITS, ARBITRARY UNITS
##FACTOR=    0.0627417313425164, 1,          1
##FIRST=     8223.62146879497, 3841,         -66855
##LAST=      0,             6253,            -66469
##MIN=       0,             -16708,          0
##MAX=       8223.62146879497, 406241399,    0
$$ Real data points
##PAGE= N=1
##DATA TABLE= (X++(R..R)), XYDATA
$$ [...]
63779C43668l059k640k570k884l070k710k317k664l467l702l198k722k511j922
$$ 343668 340609 337969 335399 332515 329445 326735 324418 321754 318287 314585 311387 308665 306154 304232
63765C04232r06n08j260k158k041j158n01l84n79j112j932k296j564l19L07J82
$$ 304232 303326 302818 301558 299400 297359 296201 295700 295316 294737 293625 291693 289397 287833 287514 287821 288003
63749B88003Q2K95L83L09O43J394J704J174O55J064K066K719K937L427M333M846
$$ 288003 288085 288380 288763 289072 289715 291109 292813 293987 294642 295706 297772 300491 303428 306855 311188 316034
63733C16034M424L621L250L245L031K757L254M703O116O597O486O672P235P540
$$ 316034 320458 324079 327329 330574 333605 336362 339616 344319 350435 357032 363518 370190 377425 384965
63719C84965P410P316P377P066O065M740L454K077N37p61j545k196l181m382n444
$$ 384965 392375 399691 407068 414134 420199 424939 428393 430470 431007 430246 428701 426505 423324 418942 413498
63704D13498o348p151p465o893n746m738m099l527k886k320j715p18M80R93K75
$$ 413498 407150 399999 392534 385641 379895 375157 371058 367531 364645 362325 360610 359892 360372 361365 361640
63689C61640j019j625j074p7M81N18N64Q70J196J480K055K958L544L337K913L198
$$ 361640 360621 358996 357922 357845 358326 358844 359408 360278 361474 362954 365009 367967 371511 374848 377761 380959
63673C80959M140M932N412O258P569Q341P912P002O649O755O526N748M748L560
$$ 380959 385099 390031 395443 401701 409270 417611 425523 432525 439174 445929 452455 458203 462951 466511
63659D66511K028M92o39j826l968o900r275j0142r956r665r454q813p461n764
$$ 466511 468539 469031 468392 466566 462598 455698 446423 436281 426325 416660 407206 398393 390932 385168
63645C85168m408l731l342k478r86K77M69JR6J169K401K994L154L452L942M288
$$ 385168 380760 377029 373687 371209 370223 370500 370969 370970 371066 372235 374636 377630 380784 384236 388178 392466
63629C92466M371M284M179M426N501P296Q851R338R082R184J0297J2126J4019
$$ 392466 396837 401121 405300 409726 415227 422523 431374 440712 449794 458978 469275 481401 495420
63616D95420J5580J6804J7980J9481K1421K3517K5498K7438K9473L1325L2500
$$ 495420 511000 527804 545784 565265 586686 610203 635701 663139 692612 723937 756437
63605G56437L2877L2702L2035L0554K7986K4457K0282J5595J0351M645r29n307
$$ 756437 789314 822016 854051 884605 912591 937048 957330 972925 983276 987921 986992 981685
63593I81685p639q169q254r152j0900j2677j4055j5385j7005j8730k0285k1747
$$ 981685 974046 965877 957623 948471 937571 924894 910839 895454 878449 859719 839434 817687
63581H17687k3189k4228k4337k3410k1746j9629j7228j4699j2163r652p336n562
$$ 817687 794498 770270 745933 722523 700777 681148 663920 649221 637058 627406 620070 614508
63569F14508m429l505k298q50M87J738L334N458P659R190R581R009Q450R124J1290
$$ 614508 610079 606574 604276 603426 603913 605651 608985 614443 622102 631292 640873 649882 658332 667456 678746
63554F78746J3774J5332J6423J8791K3216K8558L3439L7954M3032M8699N3881
$$ 678746 692520 707852 724275 743066 766282 794840 828279 866233 909265 957964 1011845
63543A011845N7424N8434N5877M8885L7795K4237J0147k913j3601k0877k4545
$$ 1011845 1069269 1127703 1183580 1232465 1270260 1294497 1304644 1301731 1288130 1267253 1242708
63532A242708k5254k3807k0881j7424j4600j3006j2458j2821j4452j7425k0929
$$ 1242708 1217454 1193647 1172766 1155342 1140742 1127736 1115278 1102457 1088005 1070580 1049651
63521A049651k4040k6744k9506l2119l3661l3697l2850l1930l0893k9080k6302
$$ 1049651 1025611 998867 969361 937242 903581 869884 837034 805104 774211 745131 718829
63510G18829k3304k0994j9465j8050j6279j4392j2799j1455j0105q849p912p106
$$ 718829 695525 674531 655066 637016 620737 606345 593546 582091 571986 563137 555225 548119
63498E48119o089n051m532m557m588m422m363m335l687k340j281j250j566j089
$$ 548119 542030 536979 532447 527890 523302 518880 514517 510182 506495 504155 502874 501624 500058 498969
63484D98969K06J428K213K979L876M483M670M994N870O902P362O977O088N221
$$ 498969 499175 500603 502816 505795 509671 514154 518824 523818 529688 536590 543952 550929 557017 562238
63470E62238M594L844K280k61l006n003o161p040p856q303q363q507q878r010
$$ 562238 566832 570676 572956 572695 569689 564686 558525 551485 543629 535326 526963 518456 509578 500568
63456E00568q564p800o954n766m052k244q74K00J523L255N089O748Q225R609J0983
$$ 500568 492004 484204 477250 471484 467432 465188 464314 464514 466037 469292 474381 481129 489354 498963 509946
63441E09946J2465J4120J6058J8738K2853K8563L5113M1504M7299N2356N6109
$$ 509946 522411 536531 552589 571327 594180 622743 657856 699360 746659 799015 855124
63430H55124N7581N5939N0605M1263K8537J4609K287o878j3028j6655j7592j5626
$$ 855124 912705 968644 1019249 1060512 1089049 1103658 1105945 1099067 1086039 1069384 1051792 1036166
63418A036166j1288n366J752R580J6881K2293K5490K6903K6535K3878J9078J3323
$$ 1036166 1024878 1019512 1021264 1030844 1047725 1070018 1095508 1122411 1148946 1172824 1191902 1205225
63406A205225P719K501k384o563r661j1829j3311j4001j4116j4828j7241k0871
$$ 1205225 1212944 1215445 1213061 1206498 1196837 1185008 1171697 1157696 1143580 1128752 1111511 1090640
63394A090640k4081k6104k7777l0006l2361l3726l3715l2777l1285k9213k6635
$$ 1090640 1066559 1040455 1012678 982672 950311 916585 882870 850093 818808 789595 762960
63383G62960k3943k1485j9278j7123j4847j2449j0154q191o428m446k124J10J914
$$ 762960 739017 717532 698254 681131 666284 653835 643681 635490 629062 624616 622492 622602 624516
63370F24516L553N464P544R419J1166J3210J5511J7510J8969K0341K2106K4219
$$ 624516 628069 633533 641077 650496 661662 674872 690383 707893 726862 747203 769309 793528
63358G93528K6479K8966L1721L4329L6250L7434L8145L8195L6760L3201K7885
$$ 793528 820007 848973 880694 915023 951273 988707 1026852 1065047 1101807 1135008 1162893
63347A162893K1968J6365J1035N414n27n893r655j1675j2711j3559j4422j5163
$$ 1162893 1184861 1201226 1212261 1217675 1217148 1211255 1201600 1189925 1177214 1163655 1149233 1134070
63335A134070j5871j7059j9255k2368k5470k7421k7938k7797k7710k7272k5501
$$ 1134070 1118199 1101140 1081885 1059517 1034047 1006626 978688 950891 923181 895909 870408
63324H70408k2189j8087j3709q752k990K927P919J1156J1809Q854K011p312j6749
$$ 870408 848219 830132 816423 807671 804681 807608 815527 826683 838492 847346 849357 842045 825296
63311H25296k4680l0670l4491l5651l4138l0932k7334k4106k1409j9104j6827
$$ 825296 800616 769946 735455 699804 665666 634734 607400 583294 561885 542781 525954
63300E25954j4257j1675r860r097q690p876o808o071n594m876m075l993m782n498
$$ 525954 511697 500022 490162 481065 472375 464499 457691 451620 446026 441150 437075 433082 428300 422802
63286D22802n294m462l783l413k972k355j849j562j349j197j204j176p85j55J89
$$ 422802 417508 413046 409263 405850 402878 400523 398674 397112 395763 394566 393362 392186 391401 391246 391435
63271C91435N8j71j99k36n29r13j107j096r27m81J79M95L9p19q05L4R58J073M38
$$ 391435 391493 391322 391123 390887 390358 389445 388338 387242 386315 385834 386013 386508 386547 385828 385023 385057 386015 387088 387526
63252C87526j80k78j0K66N07R50J699K555L205L554L744L956M237M522M748M951
$$ 387526 387346 387068 387058 387324 387831 388781 390480 393035 396240 399794 403538 407494 411731 416253 421001 425952
63236D25952N356O280P709Q986R349Q877Q611R392J0832J1834J1944J1745J1932
$$ 425952 431308 437588 445297 454283 463632 472509 481120 490512 501344 513178 525122 536867 548799
63223E48799J2464J2781J2519J1809J1110J0968J1648J2772J3497J3316J2624
$$ 548799 561263 574044 586563 598372 609482 620450 632098 644870 658367 671683 684307
63212F84307J2230J2357J2321J1264R029O259L751J789K2k053m499o850q680j0120
$$ 684307 696537 708894 721215 732479 741508 747767 751518 753307 753329 751276 746777 739927 731247 721127
63198G21127j1693j3537j5054j5505j4816j3555j2171j0628q858p125n633m031
$$ 721127 709434 695897 680843 665338 650522 636967 624796 614168 605310 598185 592552 588521
63186E88521j827P98K989M250N065O257P988R728J1083J2273J3676J5156J6140
$$ 588521 586694 587492 590481 594731 599796 606053 614041 623769 634852 647125 660801 675957 692097
63173F92097J6273J5792J5172J4616J4151J3987J4288J4576J3900J1965R605P677
$$ 692097 708370 724162 739334 753950 768101 782088 796376 810952 824852 836817 846422 854099
63161H54099N913L449K10l127o388j0076j4179j7700j9950k1456k2999k4392k4926
$$ 854099 860012 863461 863671 860544 854156 844080 829901 812201 792251 770795 747796 723404 698478
63148F98478k4518k3710k2815k1748k0464j8955j7028j4673j2395j0577q891o989
$$ 698478 673960 650250 627435 605687 585223 566268 549240 534567 522172 511595 502704 495715
63136D95715n436n005n290n112m293l870m254m369l239j545p09j003j411j101
$$ 495715 490279 485274 479984 474872 470579 466709 462455 458086 454847 453302 452593 451590 450179 449078
63122D49078k01P54J463J809J700J231P72P14J173J931K637L045L120K925K533
$$ 449078 448877 449631 451094 452903 454603 455834 456606 457320 458493 460424 463061 466106 469226 472151 474684
63107D74684K139K080K454K799K537J765J184J207J506J590J502J622K123K813
$$ 474684 476823 478903 481357 484156 486693 488458 489642 490849 492355 493945 495447 497069 499192 502005
63093E02005L389L675L762M018M713N605O147O077N492M385K695R07j9L11J199
$$ 502005 505394 509069 512831 516849 521562 527167 533314 539391 544883 549268 551963 552870 552851 553162 554361
63078E54361J703J552R72J24p64j184r12m94n82r67r19k54N05R91J392J961K726
$$ 554361 556064 557616 558588 558712 557948 556764 555852 555358 554776 553809 552890 552636 553141 554132 555524 557485 560211
63061E60211L695M847N866O440O927Q153J0289J2520J4106J5343J6978J9076K0939
$$ 560211 563906 568753 574619 581059 587986 596139 606428 618948 633054 648397 665375 684451 705390
63048G05390K2070K2716K3437K4521K5929K7511K9076L0323L0924L0764L0058
$$ 705390 727460 750176 773613 798134 824063 851574 880650 910973 941897 972661 1002719
63037A002719K9245K8679K8533K8783K9251K9567K9348K8533K7452K6371K5083
$$ 1002719 1031964 1060643 1089176 1117959 1147210 1176777 1206125 1234658 1262110 1288481 1313564
63026A313564K3059J9950J5759J0609M628j918q617j5106k1099k6245l0205l2944
$$ 1313564 1336623 1356573 1372332 1382941 1387569 1385651 1377034 1361928 1340829 1314584 1284379 1251435
63014A251435l4745l5809l6012l5191l3431l0905k7661k3872k0080j6787j3763
$$ 1251435 1216690 1180881 1144869 1109678 1076247 1045342 1017681 993809 973729 956942 943179
63003I43179j0162n526m19M224Q130J1766J5504J9052K1758K3306K3994K4562
$$ 943179 933017 927491 927072 931296 939426 951192 966696 985748 1007506 1030812 1054806 1079368
62991A079368K5701K7456K9059K9603K9067K8357K8110K7853K6664K4362K1545
$$ 1079368 1105069 1132525 1161584 1191187 1220254 1248611 1276721 1304574 1331238 1355600 1377145
62980A377145J8558J5044J0588N290m59o399j2370j8220k3979k9790l5408m0056
$$ 1377145 1395703 1410747 1421335 1426625 1426166 1419767 1407397 1389177 1365198 1335408 1300000 1259944
62968A259944m3089m4629m5219m5074m4113m2520m0718l8753l6177l2910k9757
$$ 1259944 1216855 1172226 1127007 1081933 1037820 995300 954582 915829 879652 846742 816985
62957H16985k7642k6436k5059k2862k0465j8879j8161j7439j6211j4980j4291
$$ 816985 789343 762907 737848 714986 694521 675642 657481 640042 623831 608851 594560
62946E94560j3789j2721j1112r768r146q756p899o576n455n127n533o008n858
$$ 594560 580771 568050 556938 547170 538024 529268 521369 514793 509338 504211 498678 492670 486812
62933D86812n019m094l604l407l105k738k616k659k534k402k835l837m608m514
$$ 486812 481793 477699 474095 470688 467583 464845 462229 459570 457036 454634 451799 447962 443354 438840
62919D38840l706k654j564o28j11N6K98O28N22j4n4R84K293K707K212J630J281
$$ 438840 435134 432480 430916 430288 430177 430233 430531 431159 431681 431667 431613 432597 434890 437597 439809 441439 442720
62902D42720R61R22J700L032M001M366M775N443N633M835L682L106L184L311L121
$$ 442720 443681 444603 446303 449335 453336 457702 462477 467920 473553 478388 482070 485176 488360 491671 494792
62887D94792K694K278K159K534L163L460L225K899K798K522J632M95j70m33j159
$$ 494792 497486 499764 501923 504457 507620 511080 514305 517204 520002 522524 524156 524651 524481 524048 522889
62872E22889k827m858o281o680o313n672n158m985n074n109m878m564m469m551
$$ 522889 520062 515204 508923 502243 495930 490258 485100 480115 475041 469932 465054 460490 456021 451470
62858D51470m368l653k691j961j570j228p93m80m87p18r85j205j230q41j40L12
$$ 451470 447102 443449 440758 438797 437227 435999 435206 434726 434239 433521 432536 431331 430101 429260 429120 429432
62842D29432J43k63k62J54M06K20J0K35P44J009P64K87J01M77J162J613J591J385
$$ 429432 429575 429312 429050 429204 429610 429830 429840 430075 430819 431828 432592 432879 432980 433457 434619 436232 437823 439208
62824D39208J370J529J607J492J207P43K62J88P22J435J795J920K249K687K727
$$ 439208 440578 442107 443714 445206 446413 447156 447418 447606 448328 449763 451558 453478 455727 458414 461141
62809D61141K311J926J806J713J605J763K145K263K022J987K550L445M397N503
$$ 461141 463452 465378 467184 468897 470502 472265 474410 476673 478695 480682 483232 486677 491074 496577
62795D96577O673P402P591P881Q608R204R334R845J1557J3818J5395J6415J8095
$$ 496577 503250 510652 518243 526124 534732 543936 553270 563115 574672 588490 603885 620300 638395
62782F38395K0721K3238K5077K7069L0011L3391L6293L8717M1139M3320M4486
$$ 638395 659116 682354 707431 734500 764511 797902 834195 872912 914051 957371 1001857
62771A001857M4513M4120M3870M3500M2361M0099L6759L2516K7501K1804J5489
$$ 1001857 1046370 1090490 1134360 1177860 1220221 1260320 1297079 1329595 1357096 1378900 1394389
62760A394389Q585J067p051j5370k3051k9389l4564l9338m3961m7617m9359m9224
$$ 1394389 1402974 1404041 1396990 1381620 1358569 1329180 1294616 1255278 1211317 1163700 1114341 1065117
62748A065117m8094m6681m5003m2768l9882l6532l3069k9849k6998k4346k1764
$$ 1065117 1017023 970342 925339 882571 842689 806157 773088 743239 716241 691895 670131
62737F70131j9448j7620j6062j4296j2275j0523r431q679p601n972m233l029k648
$$ 670131 650683 633063 617001 602705 590430 579907 570476 561797 554196 548224 543991 540962 538314
62724E38314k864l150l006k210q81O12J782K237J957J451J544K803N097P623R462
$$ 538314 535450 532300 529294 527084 526203 526815 528597 530834 532791 534242 535786 538589 543686 551309 560771
62709E60771J0313J0743J1615J3104J4607J5765J7201J9697K2890K5541K7260
$$ 560771 571084 581827 593442 606546 621153 636918 654119 673816 696706 722247 749507
62698G49507K9105L2050L5539L8370M0478M2895M5978M8726N0139N0526N0793
$$ 749507 778612 810662 846201 884571 925049 967944 1013922 1062648 1112787 1163313 1214106
62687A214106N0976N0104M7449M3196L7838L1350K3404J4148M381n123j4241k3166
$$ 1214106 1265082 1315186 1362635 1405831 1443669 1475019 1498423 1512571 1516952 1511829 1497588 1474422
62675A474422l1686l9162m5269n0213n3987n5921n5511n3404n0877m8438m5634
$$ 1474422 1442736 1403574 1358305 1308092 1254105 1198184 1142673 1089269 1038392 989954 944320
62664I44320m2268l8995l6410l4208l1778k9104k6547k4084k1450j8804j6707
$$ 944320 902052 863057 826647 792439 760661 731557 705010 680926 659476 640672 623965
62653F23965j5347j4282j2992j1412r888q843q429q334q018p286o440n720m946
$$ 623965 608618 594336 581344 569932 560044 551201 542772 534438 526420 519134 512694 506974 502028
62640E02028l992l237k996k796j912n02M94O35N29Q34J342J396P79k01j207k041
$$ 502028 498036 494799 491803 489007 487095 486593 487087 487722 488251 489085 490427 491823 492602 492401 491194 489153
62624D89153k523k524k099j467r09p15r64j290j154n17K1l8m90q53j050j282j370
$$ 489153 486630 484106 482007 480540 479631 478916 477952 476662 475508 474991 475012 474974 474484 473631 472581 471299 469929
62607D69929q01M89J816K477K572K780L474M388N268O437Q352J0719J2523J3147
$$ 469929 469128 469617 471433 473910 476482 479262 482736 487124 492392 498829 507181 517900 530423 543570
62593E43570J3151J3633J5034J6899J8642K0114K1370K2347K2957K3192K2916
$$ 543570 556721 570354 585388 602287 620929 641043 662413 684760 707717 730909 753825
62582G53825K1743J9383J6032J2214Q300M325K13l918p768j1129j4060j6713j8991
$$ 753825 775568 794951 810983 823197 831497 835822 836035 832117 824349 813220 799160 782447 763456
62569G63456k0527k1127k1106k1028k1105k1012k0247j8628j6513j4587j3300
$$ 763456 742929 721802 700696 679668 658563 637551 617304 598676 582163 567576 554276
62558E54276j2452j1485j0273r242q575p736o262m656l808l769l745l252k580
$$ 554276 541824 530339 520066 510824 502249 494513 488251 483595 479787 476018 472273 469021 466441
62545D66441k039j502q67l40N1O21J367J734J474J176J398J796J743J443J629
$$ 466441 464402 462900 462033 461693 461744 462365 463732 465466 466940 468116 469514 471310 473053 474496 476125
62530D76125K326K755K517K162K342K990L694M432N496O904Q269R300J0121J1121
$$ 476125 478451 481206 483723 485885 488227 491217 494911 499343 504839 511743 520012 529312 539433 550554
62516E50554J2611J4699J7227J9715K1563K2568K3252K4471K6523K8845L0617
$$ 550554 563165 577864 595091 614806 636369 658937 682189 706660 733183 762028 792645
62505G92645L1463L1456L0749K9524K8000K6043K2979J8349J2818P678L443l96
$$ 792645 824108 855564 886313 915837 943837 969880 992859 1011208 1024026 1031704 1035147 1034751
62493A034751m173p316r269j0308j0893j0702r149o517l762j337J004L291N040
$$ 1034751 1030578 1023262 1013993 1003685 992792 982090 972941 966424 962662 961325 962329 965620 970660
62480I70660O073O886P781Q185P314N161K318q84m559q624j2614j6262j9842k3634
$$ 970660 976733 983619 991400 999585 1006899 1012060 1014378 1013494 1008935 1000311 987697 971435 951593 927959
62466I27959k7298l0107l1702l2333l2403l2037l1203k9952k8373k6488k4315
$$ 927959 900661 870554 838852 806519 774116 742079 710876 680924 652551 626063 601748
62455F01748k1910j9242j6301j3411j1098r391p698n713m144l840m459m680l786
$$ 601748 579838 560596 544295 530884 519786 510395 502697 496984 492840 489000 484541 479861 476075
62442D76075k338j189n38j94r0j41l6L56P38P96N58R2o37j361j521j101r23j578
$$ 476075 473737 472548 472010 471816 471726 471585 471549 471905 472643 473439 473997 474089 473452 472091 470570 469469 468546 466968
62424D66968k491k636j846p61J31O99O67j77j282j627r32o0J8p45j613j841j225
$$ 466968 464477 461841 459995 459234 459365 460064 460731 460554 459272 457645 456713 456653 456671 455926 454313 452472 451247
62407D51247k35L48K13j30n2L18M46L66O74J492K156K200J983K126K752L657M701
$$ 451247 451012 451360 451573 451443 451391 451709 452155 452521 453195 454687 456843 459043 461026 463152 465904 469561 474262
62390D74262N706O376O650O810O990O969O730O792P517Q449Q862Q713Q551Q725
$$ 474262 479968 486344 492994 499804 506794 513763 520493 527285 534802 543251 552113 560826 569377 578102
62376E78102R174R824J0651J1330J1469J1178J0993J1139J1341J1484J1959J3142
$$ 578102 587276 597100 607751 619081 630550 641728 652721 663860 675201 686685 698644 711786
62364G11786J4957J7237K0069K3462K6936L0014L2908L6275M0397M4934M9416
$$ 711786 726743 743980 764049 787511 814447 844461 877369 913644 954041 998975 1048391
62353A048391N3547N6941N9088N9742N9018N6928N3158M7485M0208L1911K3079
$$ 1048391 1101938 1158879 1217967 1277709 1336727 1393655 1446813 1494298 1534506 1566417 1589496
62342A589496J4114N444k632j0074j6864k2843k8051l2847l7422m1386m4255m6063
$$ 1589496 1603610 1609054 1606422 1596348 1579484 1556641 1528590 1495743 1458321 1416935 1372680 1326617
62330A326617m7054m7054m5778m3676m1726m0280l8762l6672l4323l2270l0522
$$ 1326617 1279563 1232509 1186731 1143055 1101329 1061049 1022287 985615 951292 919022 888500
62319H88500k8747k6845k4968k3211k1620k0291j9135j7754j5816j3452j1117
$$ 888500 859753 832908 807940 784729 763109 742818 723683 705929 690113 676661 665544
62308F65544r196p920p358p272p128o478n309l990k988k628k814k973k578j725
$$ 665544 656348 648428 641070 633798 626670 620192 614883 610893 607905 605277 602463 599490 596912 595187
62294E95187r34m14P6P05J463K519L965N130N021L759K712K696K912K325J323
$$ 595187 594253 593839 593915 594620 596083 598602 602567 607697 612718 616477 619189 621885 624797 627122 628445
62279F28445J041J594K048J884J499J314J224J085J089J507K510M157O215Q100
$$ 628445 629486 631080 633128 635012 636511 637825 639049 640134 641223 642730 645240 649397 655612 663712
62265F63712R573J1246J3829J7097K0213K3027K6253L0457L5486M0970M6659N2125
$$ 663712 673285 684531 698360 715457 735670 758697 784950 815407 850893 891863 938522 990647
62253I90647N6730O0124O2323O3213O2408N9717N5290M9291M1786L2988K3232
$$ 990647 1047377 1107501 1169824 1233037 1295445 1355162 1410452 1459743 1501529 1534517 1557749
62242A557749J2847K406p137j5251k2575l0114l7664m3900m8111n1004n3457n5282
$$ 1557749 1570596 1573002 1565865 1550614 1528039 1497925 1460261 1416361 1368250 1317246 1263789 1208507
62230A208507n5655n4227n1386m7799m4101m0636l7235l3547k9743k6439k3784
$$ 1208507 1152852 1098625 1047239 999440 955339 914703 877468 843921 814178 787739 763955
62219G63955k1216j8364j5713j3945j3013j2302j1402j0383r436q614p849p050
$$ 763955 742739 724375 708662 694717 681704 669402 658000 647617 638181 629567 621718 614668
62207F14668o296n857n777n511m408k516n49R95K158L002L400L510L875M787O009
$$ 614668 608372 602515 596738 591227 586819 584303 583754 584749 586907 589909 593309 596819 600694 605481 611490
62192F11490P351Q934J0638J1925J2557J3042J3903J4879J5317J5070J4591J4328
$$ 611490 618841 627775 638413 650338 662895 675937 689840 704719 720036 735106 749697 764025
62180G64025J4277J3949J2700J0348P599N526M464L815L024K354K465L739O182
$$ 764025 778302 792251 804951 815299 822898 828424 832888 836703 839727 842081 844546 848285 854467
62167H54467R616J3707J8155K2991K8240L3324L7370M0165M2112M3087M2184L8932
$$ 854467 864083 877790 895945 918936 947176 980500 1017870 1058035 1100147 1143234 1185418 1224350
62155A224350L3960K7978K1015J3250N779l56n387j0238j5218k0054k4795k9693
$$ 1224350 1258310 1286288 1307303 1320553 1326332 1325976 1320589 1310351 1295133 1275079 1250284 1220591
62143A220591l4387l7988m0022m0649m0047l8213l5337l1883k8249k4681k1309
$$ 1220591 1186204 1148216 1108194 1067545 1027498 989285 953948 922065 893816 869135 847826
62132H47826j8007j4479j0813p526m695j606K136N757Q374J0514J3493J7504K1294
$$ 847826 829819 815340 804527 797001 792306 790700 792836 798593 806967 817481 830974 848478 869772
62119H69772K3796K5187K6188K7123K7932K8546K8978K9374K9983L0604L0173
$$ 869772 893568 918755 944943 972066 999998 1028544 1057522 1086896 1116879 1147483 1177656
62108A177656K7529K2700J6874J1191O088J775j512l956o103p979q884q466p487
$$ 1177656 1205185 1227885 1244759 1255950 1262038 1263813 1262301 1258345 1252242 1244263 1235379 1226913 1219426
62095A219426p041p279p471p053o186n250m207k632l50K200M348N976P696J0145
$$ 1219426 1212385 1205106 1197635 1190582 1184396 1179146 1174939 1172307 1171957 1174157 1178505 1184481 1192177 1202322
62081A202322J3290J6522J9236K1164K2471K3817K5899K8623L1011L2326L2873
$$ 1202322 1215612 1232134 1251370 1272534 1295005 1318822 1344721 1373344 1404355 1436681 1469554
62070A469554L3238L3182L2076L0018K7652K5047K1776J8123J5174J3409J2153
$$ 1469554 1502792 1535974 1568050 1598068 1625720 1650767 1672543 1690666 1705840 1719249 1731402
62059A731402J0793R673R193Q812P694N848L883J933l96l140n815q180j0658j3706
$$ 1731402 1742195 1751868 1761061 1769873 1777567 1783415 1787298 1789231 1788835 1785695 1779880 1771700 1761042 1747336
62045A747336j7187k0695k4284k8465l3387l8330m2301m5064m7194m9105n0467
$$ 1747336 1730149 1709454 1685170 1656705 1623318 1584988 1542687 1497623 1450429 1401324 1350857
62034A350857n0818n0325m9442m8109m5860m2600l8808l5036l1602k8682k6152
$$ 1350857 1300039 1249714 1200272 1152163 1106303 1063703 1024895 989859 958257 929575 903423
62023I03423k3508k0501j7786j6322j6108j6172j5815j5187j4565j3896j3262
$$ 903423 879915 859414 841628 825306 809198 793026 777211 762024 747459 733563 720301
62012G20301j3028j3028j2379j0603q360o471m804k710j37K443M858P241R396
$$ 720301 707273 694245 681866 671263 662903 656432 651628 648918 648781 651224 656082 663323 672719
61999F72719J0861J1603J2051J2364J2150J0988Q866O053K820o04m012p140r633
$$ 672719 683580 695183 707234 719598 731748 742736 751602 757655 760475 759871 755859 748719 739086
61986G39086j1274j2403j3690j5179j5958j5276j3721j2661j2583j2684j2058
$$ 739086 727812 715409 701719 686540 670582 655306 641585 628924 616341 603657 591599
61975E91599j0673r027p429n939m591l361k241j478j432j981k390k106j342o20
$$ 591599 580926 571899 564470 558531 553940 550579 548338 546860 545428 543447 541057 538951 537609 536989
61961E36989k2O66J435K108K821L908N301O531P386Q182R181J0176J0897J1598
$$ 536989 536967 537633 539068 541176 543997 547905 553206 559737 567123 575305 584486 594662 605559 617157
61947F17157J2867J4951J7542K0189K2730K5348K8408L2150L6334M0264M3339
$$ 617157 630024 644975 662517 682706 705436 730784 759192 791342 827676 867940 911279
61936I11279M5583M7457M9105N0060M9782M8387M6671M5348M4232M2255L8569
$$ 911279 956862 1004319 1053424 1103484 1153266 1201653 1248324 1293672 1337904 1380159 1418728
61925A418728L3597K8609K4112J9183J2912O005J66l983p351j0645j3183j3904
$$ 1418728 1452325 1480934 1505046 1524229 1537141 1543146 1543312 1539329 1531978 1521333 1508150 1494246
61913A494246j2762j0349o765j693M654J1437J7941K3790K8522L1585L2769L2132
$$ 1494246 1481484 1471135 1464370 1462677 1467331 1478768 1496709 1520499 1549021 1580606 1613375 1645507
61901A645507K9568K4975J8830J1920M410m194j3830k3196l0762l6114l9976m3073
$$ 1645507 1675075 1700050 1718880 1730800 1735210 1731016 1717186 1693990 1663228 1627114 1587138 1544065
61889A544065m5433m6773m7197m7251m7255m6745m4876m1498l7572l4297l2034
$$ 1544065 1498632 1451859 1404662 1357411 1310156 1263411 1218535 1177037 1139465 1105168 1073134
61878A073134l0367k8893k7490k5953k4007k1746j9529j7312j4686j1678q972
$$ 1073134 1042767 1013874 986384 960431 936424 914678 895149 877837 863151 851473 842501
61867H42501o939n005k486L67K782M778P331J1092J5553J9770K3576K7605L2266
$$ 842501 835562 830557 828071 828438 831220 835998 843329 854421 869974 889744 913320 940925 973191
61854I73191L7285M2353M7790N4026O0646O6459P0678P3629P6097P8241P9441
$$ 973191 1010476 1052829 1100619 1154645 1215291 1281750 1352428 1426057 1502154 1580395 1659836
61843A659836P8977P6574P2355O6538N9142M9893L8625K5957J3354K261o737j3693
$$ 1659836 1738813 1815387 1887742 1954280 2013422 2063315 2101940 2127897 2141251 2143512 2136775 2123082
61831B123082j8531k0821k0217j6810j1063l669M603J3009K0745K6726K9916L0081
$$ 2123082 2104551 2083730 2063513 2046703 2035640 2031971 2036574 2049583 2070328 2097054 2126970 2157051
61819B157051K7856K3782J7605Q854k273j5022k8559m1901n3813o3549p1385p7769
$$ 2157051 2184907 2208689 2226294 2235148 2232875 2217853 2189294 2147393 2093580 2030031 1958646 1880877
61807A880877q2285q4177q3607q1536p8473p4245o8938o3172n7345n1388m5408
$$ 1880877 1798592 1714415 1630808 1549272 1470799 1396554 1327616 1264444 1207099 1155711 1110303
61796A110303l9850l4877l0294k6164k2857k0428j8571j7131j5947j4320j1660
$$ 1110303 1070453 1035576 1005282 979118 956261 935833 917262 900131 884184 869864 858204
61785H58204q629o540n584m749l642l029l181l121k209j236j009j029n44K5j07
$$ 858204 849575 843035 837451 832702 829060 826031 822850 819729 817520 816284 815275 814246 813702 813727 813620
61770H13620p33j242j872l099m340m546l751k896k439k217k411l288m143l799
$$ 813620 812887 811645 809773 806674 802334 797788 794037 791141 788702 786485 784074 780786 776643 772844
61756G72844k345j251j453k283k620k282j840j698j801j841j533r23m75n68r57
$$ 772844 770499 769248 767795 765512 762892 760610 758770 757072 755271 753430 751897 750974 750499 749931 748974
61741G48974j163j172j234j219q50l69k54l25L6Q41J504J967K828M166N169N361
$$ 748974 747811 746639 745405 744186 743336 742967 742713 742388 742424 743265 744769 746736 749564 753730 758899 764260
61725G64260N384O021P059P735P868P887Q077Q248Q119P597O795N919N004L803
$$ 764260 769644 775665 782724 790459 798327 806214 814291 822539 830658 838255 845050 850969 855973 859776
61711H59776K140L87q70j688k783m569o577q051q682q563p916p152o665o270n301
$$ 859776 861916 862303 861433 859745 856962 852393 845816 837765 829083 820520 812604 805452 798787 792517 787216
61696G87216l651k184j656j666j230o5J311K429L156L237K393J033K10M76J202
$$ 787216 783565 781381 779725 778059 776829 776764 778075 780504 783660 786897 789290 790323 790533 791009 792211
61681G92211J352P26L9j25j7k78j034j755k001k007k347l158m047m732n401o247
$$ 792211 793563 794289 794328 794203 794186 793908 792874 791119 789118 787111 784764 781606 777559 772827 767426 761179
61665G61179o991p154o650n836n017m213l434k846k513k174j582r29p17j087j496
$$ 761179 754188 747034 740384 734548 729531 725318 721884 719038 716525 714351 712769 711840 711123 710036 708540
61650G08540j259l14P46J369J544J550J584J778K346L362M464N059M835L898K519
$$ 708540 707281 706967 707713 709082 710626 712176 713760 715538 717884 721246 725710 730769 735604 739502 742021
61635G42021R63m27j361j896k432l312m550n901p025p492p025n859m638l736k826
$$ 742021 742984 742557 741196 739300 736868 733556 729006 723105 716080 708588 701563 695704 691066 687330 684504
61620F84504j377N25K120K760K540K045J681J337O65n49k257m238o206p915r254
$$ 684504 683127 683652 685772 688532 691072 693117 694798 696135 696800 696251 693994 689756 683550 675635 666381
61605F66381j0171j0587j0505j0276j0385j0756j0569r213p286o082o118o649
$$ 666381 656210 645623 635118 624842 614457 603701 593132 583919 576633 570551 564433 557784
61593E57784o738o292n753n386n196n179n215n061m779m804n183n228m492l591
$$ 557784 551046 544754 539001 533615 528419 523240 518025 512964 508185 503381 498198 492970 488478 484887
61579D84887l379l620l383k637k397l160m080m171l520k833k377j999j786j969
$$ 484887 481508 477888 474505 471868 469471 466311 462231 458060 454540 451707 449330 447331 445545 443576
61565D43576k340k395k053j768j853j985j628p45P5K34k14o64o98n23m70l20M17
$$ 443576 441236 438841 436788 435020 433167 431182 429554 428809 428884 429118 428904 428240 427542 427019 426549 426229 426646
61548D26646J584K272J899R76M80P10J137J221J068J244K132L450M383M330L607
$$ 426646 428230 430502 432401 433377 433857 434567 435704 436925 437993 439237 441369 444819 449202 453532 457139
61533D57139L143L389L754L436K422J281K19j056k512l531l712l510l617m032
$$ 457139 460282 463671 467425 470861 473283 474564 474783 473727 471215 467684 463972 460462 456845 452813
61519D52813m159l739l193k922k775k423j955j752j857j909j703j468j397j240
$$ 452813 448654 444915 441722 438800 436025 433602 431647 429895 428038 426129 424426 422958 421561 420321
61505D20321p02o9J4n46j015p68j72j35q33j398j053o8O47O48K30j70l50j62L91
$$ 420321 419619 419550 419564 419018 418003 417235 417063 416928 416095 414697 413644 413576 414223 414871 415101 414931 414581 414419 414810
61486D14810Q33M82n75j304q82L10J274J592J554J417J204J071J207J381J186
$$ 414810 415643 416125 415550 414246 413364 413674 414948 416540 418094 419511 420715 421786 422993 424374 425560
61471D25560P40N62O98N95o0q64j335j439j345j122q87p31l68N71J733K150J495
$$ 425560 426300 426862 427560 428155 428095 427231 425896 424457 423112 421990 421103 420372 420004 420575 422308 424458 425953
61454D25953N26M6N3K61P26J350J487Q16M6O7P86J485J946K448L039L587M255
$$ 425953 426479 426525 426578 426839 427565 428915 430402 431218 431264 431331 432117 433602 435548 437996 441035 444622 448877
61437D48877N151N755N519M852M727N392O195O547O358N649M526L528L236L497
$$ 448877 454028 459783 465302 470154 474881 480273 486468 493015 499373 505022 509548 513076 516312 519809
61423E19809L671L593L571L576L298L065L652M953N701M959L246J730Q87L34m62
$$ 519809 523480 527073 530644 534220 537518 540583 544235 549188 554889 559848 563094 564824 565711 566045 565583
61408E65583j702l184m409n021n249n650o382p095p485p489p013o036n017m548
$$ 565583 563881 560697 556288 551267 546018 540368 533986 526891 519406 511917 504904 498868 493851 489303
61394D89303m461m025l117k529k814l431l456k611j343k47K65J59j80l23k88k27
$$ 489303 484842 480817 477700 475171 472357 468926 465470 462859 461516 461269 461534 461693 461513 461190 460902 460675
61378D60675J47J146K174K140J046K71Q17K107K964L085K889K577K078J569J380
$$ 460675 460822 461968 464142 466282 467328 467599 468416 470523 473487 476572 479461 482038 484116 485685 487065
61363D87065J565J994K613L306L815M136M590N288N929O424P148Q239R186R661
$$ 487065 488630 490624 493237 496543 500358 504494 509084 514372 520301 526725 533873 542112 551298 560959
61349E60959J0202J1532J3556J5590J7245J8613J9819K0874K1729K2109K1566
$$ 560959 571161 582693 596249 611839 629084 647697 667516 688390 710119 732228 753794
61338G53794K0014J7865J5410J2505R126N692K491o23l559n732o987q131r794
$$ 753794 773808 791673 807083 819588 828714 834406 836897 836274 832715 826983 819996 811865 802071
61325H02071j1403j2081j1994j1874j1668j0749r196p827o978o228n347m638m287
$$ 802071 790668 778587 766593 754719 743051 732302 723106 715279 708301 702073 696726 692088 687801
61312F87801m132m174m551m883m445l216j964j139l06R64K385L526M534N800P251
$$ 687801 683669 679495 674944 670061 665616 662400 660436 659297 658991 659955 662340 665866 670400 676200 683451
61297F83451Q428Q996Q783P605N506L008P19j287l352n450o911p107o226n091
$$ 683451 691879 700875 709658 717263 722769 725777 726496 725209 721857 716407 709496 702389 696163 691072
61283F91072m295l793l325k829k231j197M37K209L500M359N325O428P073P000
$$ 691072 686777 682984 679659 676830 674599 673402 673839 676048 679548 683907 689232 695660 702733 709733
61269G09733O768P055Q023R555J1481J3286J4235J4310J4433J5316J6663J7983
$$ 709733 716501 723556 731579 741134 752615 765901 780136 794446 808879 824195 840858 858841
61257H58841J9576K1963K4809K7162K8483K8839K8271K6660K3982K0269J5465
$$ 858841 878417 900380 925189 952351 980834 1009673 1037944 1064604 1088586 1108855 1124320
61246A124320R736L574k749r309j5610k0279k2507k3189k3748k4211k3556k1572
$$ 1124320 1134056 1137630 1134881 1125572 1109962 1089683 1067176 1043987 1020239 996028 972472 950900
61234I50900j9223j7244j5523j3933j2717j1808j0590q718o578m724l379k482
$$ 950900 931677 914433 898910 884977 872260 860452 849862 841144 834566 829842 826463 823981
61222H23981j719n72J082K547L110L050L089L136K605J755J565K087K175J125
$$ 823981 822262 821690 822772 825319 828429 831479 834568 837704 840309 842064 843629 845716 847891 849016
61208H49016l78j340j499r82J15J406K309K940M080N884P525Q586R811J1920J4573
$$ 849016 848638 847298 845799 844817 844932 846338 848647 851587 855667 861551 869076 877662 887473 899393 913966
61193I13966J7154J9756K2596K5193K7053K8514L0106L1525L2035L1457L0063
$$ 913966 931120 950876 973472 998665 1025718 1054232 1084338 1115863 1147898 1179355 1209418
61182A209418K7955K5253K2482K0057J7687J5024J2452J0497Q871O885M463J936
$$ 1209418 1237373 1262626 1285108 1305165 1322852 1337876 1350328 1360825 1369696 1376581 1381044 1382980
61170A382980q04m076p594j0756j3620j6740k0095k3075k5455k7505k9178l0052
$$ 1382980 1382176 1378100 1370506 1359750 1346130 1329390 1309295 1286220 1260765 1233260 1204082 1174030
61158A174030l0185l0060k9542k7920k5259k2806k1365k0169j8006j5014j2412
$$ 1174030 1143845 1113785 1084243 1056323 1031064 1008258 986893 966724 948718 933704 921292
61147I21292j0784r393p278m364j332J192L028M164M468L813K406P97n73j655
$$ 921292 910508 901115 893837 889473 888141 889333 892361 896525 900993 904806 907212 908009 907436 905781
61133I05781k457k725k213j096L21K131M606P477J0107J2478J5380J9260K3392
$$ 905781 903324 900599 898386 897290 897611 899742 904348 911825 921932 934410 949790 969050 992442
61120I92442K6645K8715L0161L1556L3119L4931L6837L8260L8657L8243L7745
$$ 992442 1019087 1047802 1077963 1109519 1142638 1177569 1214406 1252666 1291323 1329566 1367311
61109A367311L7375L6557L4776L2163K9077K5591K1772J7971J4357J0540O199
$$ 1367311 1404686 1441243 1476019 1508182 1537259 1562850 1584622 1602593 1616950 1627490 1633689
61098A633689J794j975n288r069j3662j8375k2581k6598l0988l5441l8957m0952
$$ 1633689 1635483 1633508 1628220 1619151 1605489 1587114 1564533 1537935 1506947 1471506 1432549 1391597
61086A391597m1673m1636m1057l9930l8237l6076l3662l1250k8872k6299k3500
$$ 1391597 1349924 1308288 1267231 1227301 1189064 1152988 1119326 1088076 1059204 1032905 1009405
61075A009405k0954j9138j7779j6083j3750j1397r807r036q484p564o150m480
$$ 1009405 988451 969313 951534 935451 921701 910304 900497 891461 882977 875413 869263 864783
61063H64783k902j602n00N46J490K187K732L481M582N732O668P676R278J1453
$$ 864783 861881 860279 859779 860325 861815 864002 866734 870215 874797 880529 887197 894873 904151 915604
61049I15604J3546J5155J6739J8978K1718K4104K5768K7319K9333L1346L2453
$$ 915604 929150 944305 961044 980022 1001740 1025844 1051612 1078931 1108264 1139610 1172063
61038A172063L2589L2577L2930L3307L3236L2711L1880L0794K9745K9291K9501
$$ 1172063 1204652 1237229 1270159 1303466 1336702 1369413 1401293 1432087 1461832 1491123 1520624
61027A520624K9673K9339K9040K9641L1167L2955L4589L6177L7877L9660M1464
$$ 1520624 1550297 1579636 1608676 1638317 1669484 1702439 1737028 1773205 1811082 1850742 1892206
61016A892206M3190M4881M7140N1056N7293O5632P5877Q8513J03861J21263J40276
$$ 1892206 1935396 1980277 2027417 2078473 2135766 2201398 2277275 2365788 2469649 2590912 2731188
61005B731188J62223J89510K23537K64479L12990L71035M41101N25731O27921
$$ 2731188 2893411 3082921 3306458 3570937 3883927 4254962 4696063 5221794 5849715
60996E849715P50986Q98144J073196J280297J519029J777129K028265K236750
$$ 5849715 6600701 7498845 8572041 9852338 11371367 13148496 15176761 17413511
60988A7413511K362234K361682K198288J864423J404263R09678M82913J92074
$$ 17413511 19775745 22137427 24335715 26200138 27604401 28514079 28996992 29189066
60980B9189066N1055K8202O3211P8642n387k42910o32402j111907j587511j974219
$$ 29189066 29240121 29268323 29331534 29410176 29404789 29161879 28529477 27417570 25830059 23855840
60970B3855840k221765k317691k278364k137842j936145j708236j478490j261895
$$ 23855840 21634075 19316384 17038020 14900178 12964033 11255797 9777307 8515412
60962H515412j067029q97030p50585o25037n18914m31235l59907l02237k56355
$$ 8515412 7448383 6551353 5800768 5175731 4656817 4225582 3865675 3563438 3307083
60953C307083k20735j92986j70388j51390j35523j22187j10502j00102r0983q2876
$$ 3307083 3086348 2893362 2722974 2571584 2436061 2313874 2203372 2103270 2012287 1929411
60943A929411p5615o9875o6446o4908o3965o2933o1931o0783n8868n6161n3353
$$ 1929411 1853796 1783921 1717475 1652567 1588602 1525669 1463738 1402955 1344087 1287926 1234573
60932A234573n0722m7780m4283m0704l7457l4409l1462k8890k6755k4641k2295
$$ 1234573 1183851 1136071 1091788 1051084 1013627 979218 947756 918866 892111 867470 845175
60921H45175j9989j7964j6065j4233j2794j1915j1158r996q399o698n120l718
$$ 845175 825186 807222 791157 776924 764130 752215 741057 731061 722662 715964 710844 707126
60909G07126k418j073K71J103R40J63j82L40J004R16J02p70j323j718k229k916
$$ 707126 704708 703635 703906 705009 705949 706112 705930 706270 707274 708190 708292 707522 706199 704481 702252 699336
60893F99336l626m072m058l797l711l823l700l156k603k395k253j795j255j189
$$ 699336 695710 691638 687580 683783 680072 676249 672549 669393 666790 664395 662142 660347 659092 657903
60879F57903j654k201k605l032l503l737l717l933m734n711o127n825n317m986
$$ 657903 656249 654048 651443 648411 644908 641171 637454 633521 628787 623076 616949 611124 605807 600821
60865F00821m560l640k443j658j575j665j177P4J612K897L758M362M889N337N541
$$ 600821 596261 592621 590178 588520 586945 585280 584103 584177 585789 588686 592444 596806 601695 607032 612573
60850F12573N409N087M837M805M975N369O057O900P482P498P027O293N283L868
$$ 612573 617982 623069 627906 632711 637686 643055 649112 656012 663494 670992 678019 684312 689595 693463
60836F93463K197P26j88n67o88p65p99p34o89q98j314j464r56o1N45N42J31m88
$$ 693463 695660 696386 696198 695631 694943 694178 693379 692645 691956 691058 689744 688280 687324 687263 687808 688350 688481 687993
60818F87993j269j949k107j874k023l002m349n363n910o233o467o790p493q379
$$ 687993 686724 684775 682668 680794 678771 675769 671420 666057 660147 653914 647447 640657 633164 624785
60804F24785q581p612o205n419n338n333n210n199n103m449l443k829k801k823
$$ 624785 616204 608592 602387 596968 591630 586297 581087 575888 570785 566336 562893 560064 557263 554440
60790E54440k616k402k130j381l14K17r3m68j93M65Q67R12P41K70l23k17J120
$$ 554440 551824 549422 547292 545911 545597 545814 545721 545253 545060 545525 546392 547304 548045 548315 547992 547775 548895
60773E48895L026M298M620M641M922N408N894O361O776P136P749R034J0797J2092
$$ 548895 551921 556219 560839 565480 570402 575810 581704 588065 594841 601977 609726 618760 629557 641649
60759F41649J2033J0650Q837P539P019O774O168N083L948L150K632K188J882J886
$$ 641649 653682 664332 673169 680708 687727 694501 700669 705752 709700 712850 715482 717670 719552 721438
60745G21438K025J739O78q46k044k386k139k140k930m245n421o229o975p854q555
$$ 721438 723463 725202 725880 725034 722990 720604 718465 716325 713395 709150 703729 697500 690525 682671 674116
60730F74116q655q148p405o828o614o691o691o195n222m287l864l818l569k708
$$ 674116 665461 657313 649908 643080 636466 629775 623084 616889 611667 607380 603516 599698 596129 593421
60716E93421j390j34O69J131J747K797L958M696M959N227N819O541P094P543Q125
$$ 593421 592031 591897 592566 593697 595444 598241 602199 606895 611854 617081 622900 629441 636535 644078 652203
60701F52203Q827R433R853J0195J0567J0973J1290J1286J0746R801R002Q952R738
$$ 652203 661030 670463 680316 690511 701078 712051 723341 734627 745373 755174 764176 773128 782866
60688G82866J0770J1227J0726R641Q673Q081P564O989O868P695R089J0081J0306
$$ 782866 793636 804863 815589 825230 833903 841984 849548 856537 863405 871100 880189 890270 900576
60675I00576J0365J0934J1916J2607J2400J1252R715Q526P825O865M985K742J364
$$ 900576 910941 921875 933791 946398 958798 970050 979765 988291 996116 1002981 1007966 1010708 1012072
60662A012072J021N33r56k884m373n634p417r627j1475j2655j3442j3817j3395
$$ 1012072 1013093 1013626 1012670 1009786 1005413 999779 992362 982735 971260 958605 945163 931346 917951
60649I17951j2351j1561j1504j1630j1196j0209r272q853r009r539j0121j0399
$$ 917951 905600 894039 882535 870905 859709 849500 840228 831375 822366 812827 802706 792307
60637G92307j0261r864r321q506p317n945m768l938l215k186p71M96R30N88M06
$$ 792307 782046 772182 762861 754355 747038 741093 736325 732387 729172 726986 726215 726711 727641 728229 728635
60622G28635J108K195K498J645L87m79r62j447j989k434k849l394m024m562m975
$$ 728635 729743 731938 734436 736081 736468 735989 735027 733580 731591 729157 726308 722914 718890 714328 709353
60607G09353n291n525n909o849q333r579r807r143q403q080q011p949p898p852
$$ 709353 704062 698537 692628 685779 677446 667867 658060 648917 640514 632434 624423 616474 608576 600724
60593F00724p668p364p078o659n710m230k818k021j809j927k284k731k846k367
$$ 600724 593056 585692 578614 571955 566245 562015 559197 557176 555367 553440 551156 548425 545579 543212
60579E43212j609j042p35n34m75n72n08J0P77J523K495L946N270N610N261N582
$$ 543212 541603 540561 539826 539292 538817 538245 537737 537747 538524 540047 542542 546488 551758 557368 562629 568211
60563E68211P232R388J1053J2217J3120J3229J1886R540P380N880M517K841J059
$$ 568211 575443 584831 595884 608101 621221 634450 646336 655876 663256 669136 673653 676494 677553
60550F77553n62k131l700m888n306n022m346l327j795J92K156L566M362N088O377
$$ 677553 676991 674860 671160 666272 660966 655944 651598 648271 646476 646668 648824 652390 656752 661840 668217
60535F68217Q259J0056J0995J0800R717Q156O395M454K198k62k335l469l888m317
$$ 668217 676476 686532 697527 708327 718044 726200 732595 737049 739247 738985 736650 733181 729293 724976
60521G24976m890m964m174l063k169j185K27J428J494P28M92J491L058M258M994
$$ 724976 720086 715122 710948 707885 705716 704531 704758 706186 707680 708408 708900 710391 713449 717707 722701
60506G22701N678O381O771O629O176N991O591P926R434J0847J2714J5707J9578
$$ 722701 728379 734760 741531 748160 754336 760327 766918 774844 784278 795125 807839 823546 843124
60493H43124K3350K6577K9772L3469L7192L9631L9550L6541L1117K4108J5840
$$ 843124 866474 893051 922823 956292 993484 1033115 1072665 1109206 1140323 1164431 1180271
60482A180271O129m729j5361k4301l1260l6826m1100m3447m3578m2079l9717l6829
$$ 1180271 1186400 1181671 1166310 1142009 1110749 1073923 1032823 989376 945798 903719 864002 827173
60470H27173l3558l0114k6619k3184k0193j8008j6320j4437j2262j0404r224q406
$$ 827173 793615 763501 736882 713698 693505 675497 659177 644740 632478 622074 612850 604444
60458F04444p585o748n845m738l653l055k875k564k122k182k873l423l352l132
$$ 604444 596859 590111 584266 579528 575875 572820 569945 567381 565259 563077 560204 556781 553429 550297
60444E50297l180l022k239j434j465k203k812k885k537j818p75Q6J85m12j098
$$ 550297 547117 544095 541856 540422 538957 536754 533942 531057 528520 526702 525927 526013 526198 525786 524688
60429E24688j454j423j056n36k21k51l95o09j308k555l490l195j877m65O45J725
$$ 524688 523234 521811 520755 520219 519998 519747 519352 518743 517435 514880 511390 508195 506318 505853 506498 508223
60413E08223K808L413L244K542J732J115R06J042J077O79J85J58N28P01M91L36
$$ 508223 511031 514444 517688 520230 521962 523077 523983 525025 526102 526781 526966 527124 527652 528353 528844 529180
60397E29180N03O67M67O2j47m7J87M47P96J258J669J825J727J550J394J184J002
$$ 529180 529683 530350 530817 530879 530732 530685 530872 531319 532115 533373 535042 536867 538594 540144 541538 542722 543724
60380E43724J150J596J695J065M47Q38J852K060J096K59M60Q32K90n60l42R12
$$ 543724 544874 546470 548165 549230 549677 550515 552367 554427 555523 555782 556242 557074 557364 556804 556462 557374
60364E57374J888J929J565J271R49P41J131J954K317J830J138R09J060J310J744
$$ 557374 559262 561191 562756 564027 564976 565717 566848 568802 571119 572949 574087 574996 576056 577366 579110
60349E79110K353K658K333J806J765K395L389M409N213N634N741N808N935N900
$$ 579110 581463 584121 586454 588260 590025 592420 595809 600218 605431 611065 616806 622614 628549 634449
60335F34449N584N217M964M473L176R99j413l212m045m259m389m504m264l582
$$ 634449 640033 645250 650214 654687 657863 658862 657449 654237 650192 645933 641544 637040 632776 629194
60321F29194k907k631k579k373j996j595j017l2J150K136K982M065N404O683P887
$$ 629194 626287 623656 621077 618704 616708 615113 614096 614064 615214 617350 620332 624397 629801 636484 644371
60306F44371R343J1127J3008J5058J7731K1075K4353K6768K8165K8746K8407K6675
$$ 644371 653714 664841 677849 692907 710638 731713 756066 782834 810999 839745 868152 894827
60294H94827K3217J8148J1888M785l008j1135j8511k3614k5647k5203k3440k0972
$$ 894827 918044 936192 948080 952865 949857 938722 920211 896597 870950 845747 822307 801335
60282H01335j8027j5209j3210j1786r967p579n738n470o380p226p332p000o825
$$ 801335 783308 768099 754889 743103 733136 725557 719819 714349 707969 700743 693411 686411 679586
60269F79586p075p638q108q036p337o405n636m971m130l154k303j544o09L70P33
$$ 679586 672511 664873 656765 648729 641392 634987 629351 624380 620250 617096 614793 613249 612640 613010 613743
60254F13743J95m91l96K30K04q05j619j179j17K54OL49J449J978J248M27P69J737
$$ 613743 613938 613447 613051 613281 613485 612680 611061 609882 609765 610019 610025 610374 611823 613801 615049 615476 616245 617982
60236F17982J965J399J240K100L368M259M597M510M163L834L707L580L220K855
$$ 617982 619947 621346 622586 624686 628054 632313 636910 641420 645583 649417 653124 656704 659924 662779
60222F62779K770K673K034R44M4k91j99N6L28N94J088J997K760K400J079M35J457
$$ 662779 665549 668222 670256 671200 671244 670953 670754 670810 671138 671732 672820 674817 677577 679977 681056 681491 682948
60205F82948K951L219K470K102K291K100J562J669K280J981M33r43j153q71q47
$$ 682948 685899 689118 691588 693690 695981 698081 699643 701312 703592 705573 706006 705063 703910 703039 702192
60190G02192p20l11m64j518k342k088j668k160k851k350q10M84J144J750K190
$$ 702192 701472 701161 700697 699179 696837 694749 693081 690921 688070 685720 684910 685394 686538 688288 690478
60175F90478J648K28p46m81L54P42N95M70O76J115J652K225K666K666K053J215
$$ 690478 692126 692354 691608 691127 691481 692223 692818 693288 693964 695079 696731 698956 701622 704288 706341 707556
60159G07556J021J955L275L698K995K291K429K850K656K145K350L407M312M278
$$ 707556 708577 710532 713807 717505 720500 722791 725220 728070 730726 732871 735221 738628 742940 747218
60145G47218L618L219L638M781O049O737O649O309O430P241Q503R829J0797J1022
$$ 747218 750836 754055 757693 762474 768523 775260 781909 788218 794648 801889 810392 820221 831018 842040
60131H42040J0541R807Q981P555N067J908j096l657o078q425j0222j1007j0821
$$ 842040 852581 862388 871369 878924 883991 885899 884803 881146 875068 866643 856421 845414 834593
60118H34593j0077r155q233p303o351n446m652l929l355l257l697m009l464k442
$$ 834593 824516 815361 807128 799825 793474 788028 783376 779447 776092 772835 769138 765129 761665 759223
60104G59223k156k968l733l290j942r34q72j307j437p54P47K457L556L895M208
$$ 759223 757067 754099 750366 747076 745134 744200 743328 742021 740584 739830 740577 743034 746590 750485 754693
60089G54693N094O231P052P675Q629R947J1213J2171J2791J2888J2236J0865Q920
$$ 754693 759787 766018 773070 780745 789374 799321 810534 822705 835496 848384 860620 871485 880405
60076H80405O446L663J055j276l891p097j0228j2384j3500j3964j3661j2237j0133
$$ 880405 886851 890514 891569 890293 886402 879305 869077 856693 843193 829229 815568 803331 793198
60063G93198q422p595p226o902o750o974p397p677p606p184o704o649p089p316
$$ 793198 784776 777181 769955 763053 756303 749329 741932 734255 726649 719465 712761 706112 699023 691707
60049F91707o558m915l213k007j266p96m75m9O94J573K132K162J795J223O75M70
$$ 691707 685149 680234 677021 675014 673748 672952 672477 672428 673122 674695 676827 678989 680784 682007 682682 683152
60033F83152N84M23n35j965l077l592l835m069m292m665n434o429p153p451p603
$$ 683152 683736 684159 683624 681659 678582 674990 671155 667086 662794 658129 652695 646266 639113 631662 624059
60018F24059p767p779p551p212o819o332n812n319m588l356j938j046r59j269
$$ 624059 616292 608513 600962 593750 586931 580599 574787 569468 564880 561524 559586 558540 557581 556312
60004E56312j465j409j211r64p15m27jM86P50P21Q08J388K278L073L709M251M437
$$ 556312 554847 553438 552227 551263 550548 550121 550120 550606 551356 552077 552885 554273 556551 559624 563333 567584 572021
59987E72021M003L329L108L453L818L714L079K095J129O72P87P91P6r36j317r61
$$ 572021 576024 579353 582461 585914 589732 593446 596525 598620 599749 600421 601208 601999 602075 601139 599822 598861
59971E98861p02j090j730j966j605q65r5M03O07Q08J045Q24m0o60m1J369K031
$$ 598861 598159 597069 595339 593373 591768 590903 590808 591211 591818 592626 593671 594495 594455 593795 593754 595123 597154
59954E97154J261n6q72j154j338j497j534j601j821k002k007k005k162k435k809
$$ 597154 598415 598359 597487 596333 594995 593498 591964 590363 588542 586540 584533 582528 580366 577931 575122
59939E75122l309l626l336k608k115k040j790j013k42j20n16q34q14n92k53K02
$$ 575122 571813 568187 564851 562243 560128 558088 556298 555285 555043 554923 554407 553573 552759 552167 551914 552116
59923E52116P19J265J875K388K451J969J308Q91Q57J170J716K154K107J720J630
$$ 552116 552835 554100 555975 558363 560814 562783 564091 564982 565839 567009 568725 570879 572986 574706 576336
59908E76336K150K859L191L089K820K549K293K069J784J298P46N65R77J754K549
$$ 576336 578486 581345 584536 587625 590445 592994 595287 597356 599140 600438 601184 601749 602726 604480 607029
59893F07029L269L907M332M405M182L918M013M804O124P197P375O910O543O467
$$ 607029 610298 614205 618537 622942 627124 631042 635055 639859 645983 653180 660555 667465 674008 680475
59879F80475O294N934N763N840N686N124M577M251L583J970m54l059n274o640
$$ 680475 686769 692703 698466 704306 709992 715116 719693 723944 727527 729497 729043 725984 720710 714070
59865G14070o863o249n646n590n778n737n479n166m605l587k474j911k026k282
$$ 714070 707207 700958 695312 689722 683944 678207 672728 667562 662957 659370 656896 654985 652959 650677
59851F50677k066j253l18J18O1M14K124N047Q120J0535J2170J2915J2496J1209
$$ 650677 648611 647358 647040 647158 647219 647633 649757 654804 662924 673459 685629 698544 711040 722249
59837G22249J0007R315Q508P045N427M368L746L159K930L589M620M667L021J40
$$ 722249 732256 741571 750079 757124 762551 766919 770665 773824 776754 780343 784963 789630 792651 792791
59823G92791l240o869j0602j3911j6086j6759j6125j4837j3619j2839j2360j1893
$$ 792791 789551 782682 772080 758169 742083 725324 709199 694362 680743 667904 655544 643651
59811F43651j1186r960q058n929m481m053l862k974j516m17j37k40j98j1M7q4
$$ 643651 632465 622505 614447 608518 604037 599984 596122 593148 591632 591215 591078 590838 590640 590629 590676 590592
59795E90592k85n63j102j952k772k976k362j457r67r83j061j038j142j259q28
$$ 590592 590307 589744 588642 586690 583918 580942 578580 577123 576156 575173 574112 573074 571932 570673 569845
59780E69845J34O98K33n56n47K38P46M21j34m9P80J752K262K232K099K319K852
$$ 569845 569979 570677 570910 570354 569807 570045 570791 571212 571078 571029 571809 573561 575823 578055 580154 582473 585325
59763E85325L283L477L707L995L864L090K262K096K564L173L736M242M374L882
$$ 585325 588608 592085 595792 599787 603651 606741 609003 611099 613663 616836 620572 624814 629188 633070
59749F33070L214L062L324L290K803K445K522K603K339J965J653J047j4q55p01
$$ 633070 636284 639346 642670 645960 648763 651208 653730 656333 658672 660637 662290 663337 663323 662468 661767
59734F61767J94P99O75M44P10J067O45n59j519j448q02n96j007j240p40M7L75
$$ 661767 661961 662760 663435 663879 664589 665656 666301 665742 664223 662775 661973 661377 660370 659130 658390 658437 658812
59717F58812K04R7L84Q49J115J125J212J811K886L681L413K345J737K369L528
$$ 658812 659016 659113 659497 660346 661461 662586 663798 665609 668495 672176 675589 677934 679671 682040 685568
59702F85568L904L086J725M91m53j112j379j226p83k24J70l9r57k039k621k661
$$ 685568 689472 692558 694283 694774 694321 693209 691830 690604 689821 689597 689767 689728 688771 686732 684111 681450
59686F81450k477j999r56K58O99Q2p42q60l76k3j81o62j189j650k008k368k973
$$ 681450 678973 676974 676018 676276 676975 677057 676315 675455 675079 675056 674875 674213 673024 671374 669366 666998 664025
59669F64025l880m720n065m951m763m677m532m203l768l234k421j309l37j3l34
$$ 664025 660145 655425 650360 645409 640646 635969 631437 627234 623466 620232 617811 616502 616165 616152 615818
59654F15818p67q10l56M76J613K893L849L939L094J863R48O01M95J03p39j631
$$ 615818 615051 614241 613885 614361 615974 618867 622716 626655 629749 631612 632560 633161 633656 633759 633020 631389
59638F31389k006j750j289j006q14n33l09l21k06N87J876K711K483J603Q60M89
$$ 631389 629383 627633 626344 625338 624524 623991 623682 623361 623155 623742 625618 628329 630812 632415 633275 633764
59622F33764K07j09k77j66J40N42R64J197R90M09q5j12J85L37K46M25J280K348
$$ 633764 633971 633862 633585 633419 633559 634101 635065 636262 637252 637661 637576 637464 637649 637986 638232 638657 639937 642285
59604F42285K728K284J890K192K712K627J946J259O95m6p88r27m38j6q4l37m35
$$ 642285 645013 647297 649187 651379 654091 656718 658664 659923 660618 660572 659784 658857 658419 658403 658319 657982 657547
59587F57547m46m05j33K00J09l62n19k01k55j320k785l629l765l834m109m280
$$ 657547 657101 656696 656563 656763 656872 656510 655991 655790 655535 654215 651430 647801 644036 640202 636093 631813
59571F31813m089l575k879k224j839j575r17K23J205J544J621J934K169J747R68
$$ 631813 627724 624149 621270 619046 617207 615632 614715 614938 616143 617687 619308 621242 623411 625158 626126
59556F26126P20J212J757J796J435R66N07K78O30J516K304K411K016J981L079
$$ 626126 626846 628058 629815 631611 633046 634012 634519 634797 635427 636943 639247 641658 643674 645655 648734
59541F48734N302P888J0129J2000J3816J5494J6699J7563J8498J9089J8058J4839
$$ 648734 654036 661924 672053 684053 697869 713363 730062 747625 766123 785212 803270 818109
59529H18109J0523O710M050K473K107L082M856O608Q077R328J0029R631Q089N700
$$ 818109 828632 835342 839392 841865 843972 847054 851910 858518 866595 875923 885952 895583 903672 909372
59515I09372K547j276n188q560j1397j3875j5645j6379j6566j6860j6957j6167
$$ 909372 911919 910643 905455 896895 885498 871623 855978 839599 823033 806173 789216 773049
59503G73049j4785j3716j2893j1389r237p769p709q089p730o786o129n889n501
$$ 773049 758264 744548 731655 720266 711029 703260 695551 687462 679732 672946 666817 660928 655427
59490F55427m666l565k392j299n96m85o75o20p9P50J577K269K869L463M023M431
$$ 655427 650761 647196 644804 643505 642909 642424 641749 641129 641050 641800 643377 645646 648515 651978 656001 660432
59474F60432M744N291O183O936O943O287N575N058M387L404K582K448K948L665
$$ 660432 665176 670467 676650 683586 690529 696816 702391 707449 711836 715240 717822 720270 723218 726883
59460G26883M485N653P273Q977J0314J1439J3162J5884J8641J9822J9027J7517
$$ 726883 731368 737021 744294 753271 763585 775024 788186 804070 822711 842533 861560 879077
59448H79077J6439J5324J3146J0155P497N293K312k255p653j2486j5997j8083
$$ 879077 895516 910840 923986 934141 941638 946931 949243 946988 939335 926849 910852 892769
59436H92769j8824j8474j7490j6155j4377j2127r675p273m873k426j19J845L545
$$ 892769 873945 855471 837981 821826 807449 795322 785647 778374 773501 771075 770956 772801 776346
59423G76346N310P513J0388J3810J7311K0472K3146K5197K6294K6297K5557K4506
$$ 776346 781656 789169 799557 813367 830678 851150 874296 899493 925787 952084 977641 1002147
59411A002147K3160K1314J8797J5121R439J635o924j4400k0037k3909k5693k4727
$$ 1002147 1025307 1046621 1065418 1080539 1089978 1091613 1084689 1070289 1050252 1026343 1000650 975923
59399I75923k1252j6622j2176q694o904p477j0252j4189j8226k1615k3583k3610
$$ 975923 954671 938049 925873 917179 910275 902798 892546 878357 860131 838516 814933 791323
59387G91323k2209k0571j9237j7794j5841j3470j0753p733n011l388k722k060
$$ 791323 769114 748543 729306 711512 695671 682201 671448 663715 658704 655316 652594 650534
59375F50534j084m71o20j029j258j396j237j34J819L470M076M113M133L902L356
$$ 650534 649450 648979 648359 647330 646072 644676 643439 643305 645124 648594 652670 656783 660916 664818 668174
59360F68174L376M613O389P712Q716J0058J1650J3040J4556J6891J9816K2325
$$ 668174 671550 676163 682552 690264 698980 709038 720688 733728 748284 765175 784991 807316
59348H07316K3999K5328K6756K8141K9119K9427K8827K7244K4942K2211J8914
$$ 807316 831315 856643 883399 911540 940659 970086 998913 1026157 1051099 1073310 1092224
59337A092224J4758R712M002k072p931j2838j6638j9989k3324k6071k7496k7922
$$ 1092224 1106982 1116694 1120696 1118624 1110693 1097855 1081217 1061228 1037904 1011833 984337 956415
59325I56415k8303k8722k8159k5804k2099j8334j5592j4075j3137j1912j0125
$$ 956415 928112 899390 871231 845427 823328 804994 789402 775327 762190 750278 740153
59314G40153q253o798n716m739l875l268k786k203j553r59k79O82J727K435K729
$$ 740153 731900 725102 719386 714647 710772 707504 704718 702515 700962 700003 699724 700406 702133 704568 707297
59299G07297K963L492M394N657P418R892J3012J6155J8477J9654K0016J9646J7734
$$ 707297 710260 713752 718146 723803 731221 741113 754125 770280 788757 808411 828427 848073 865807
59286H65807J3476P439J296l706p357r647j0335r548p872n569k424J390N168Q646
$$ 865807 879283 886722 888018 884312 876955 867308 856973 847425 839553 833984 831560 832950 838118 846764
59272H46764J2172J5551J7776J8461J8525J8751J8646J7474J5446J2848R084L815
$$ 846764 858936 874487 892263 910724 929249 948000 966646 984120 999566 1012414 1021498 1025313
59260A025313j674n755q616j1733j5434j8468k0020k0686k1141k1073k0037j8357
$$ 1025313 1023639 1017884 1009268 997535 982101 963633 943613 922927 901786 880713 860676 842319
59248H42319j6574j4627j2244r678p416n489l430q93K049N059P777R949J1485
$$ 842319 825745 811118 798874 789196 781780 776291 772861 771968 774017 779076 786853 796802 808287
59235H08287J2409J2793J2682J2073J0889R012O363K993p87m275o774q426j0331
$$ 808287 820696 833489 846171 858244 869133 878145 884508 887501 886714 882439 875665 867239 856908
59222H56908j3295j6628j8851j9382j8743j7354j5176j2714j1098j0616j0183
$$ 856908 843613 826985 808134 788752 770009 752655 737479 724765 713667 703051 692868
59211F92868q925p387o476o056n500m897m662m477l644k245j132q82j340j932
$$ 692868 683943 676556 670080 664024 658524 653627 648965 644488 640844 638599 637467 636585 635245 633313
59197F33313j946q81R17K379K941L162L599L887L604L299L696M473M873M990N350
$$ 633313 631367 630486 631403 633782 636723 639885 643484 647371 650975 654274 657970 662443 667316 672306 677656
59182F77656N736N612N391O016P435Q621R095R304R559R732J0049J1082J2701
$$ 677656 683392 689004 694395 700411 707846 716467 725562 734866 744425 754157 764206 775288 787989
59169G87989J4040J4675J5022J5402J5638J5764J6196J6774J6478J4560J1413
$$ 787989 802029 816704 831726 847128 862766 878530 894726 911500 927978 942538 953951
59158I53951P977M799J890r75m137p709j1187j3789j5289j6158j6815j7158j6903
$$ 953951 961928 966727 968617 967642 963505 955796 944609 930820 915531 899373 882558 865400 848497
59145H48497j5950j4455j2898j1944j1782j1732j0960r426p675o014m506l437
$$ 848497 832547 818092 805194 793250 781468 769736 758776 749350 741675 735661 731155 727718
59133G27718l012k764k121j313q84n21O26K501M157N196O174P362Q334R056J0295
$$ 727718 724706 721942 719821 718508 717624 717103 717729 720230 724387 729583 735757 743119 751453 760509 770804
59118G70804J2386J4553J6068J7178J8312J9222J9674K0190K1187K1955K1520
$$ 770804 783190 797743 813811 830989 849301 868523 888197 908387 929574 951529 973049
59107I73049K0236J9469J9690J9814J8712J6662J4783J3461J1933R458O347L438
$$ 973049 993285 1012754 1032444 1052258 1070970 1087632 1102415 1115876 1127809 1137267 1143614 1147052
59095A147052R99j319l479m830n114n029n283n656n606n361n600o431p467q669
$$ 1147052 1148051 1146732 1143253 1138423 1133309 1128280 1122997 1117341 1111735 1106374 1100774 1094343 1086876 1078207
59081A078207j0295j2123j3620j4793j6087j7449j8335j8580j8454j7876j6525
$$ 1078207 1067912 1055789 1042169 1027376 1011289 993840 975505 956925 938471 920595 904070
59070I04070j4788j3607j3099j2377j1006r635q777p966o780n762n502n522n011
$$ 904070 889282 875675 862576 850199 839193 829558 820781 812815 806035 800273 794771 789249 784238
59057G84238m147l801m214m763m943m838m650m428m279m341m416m048l116k039
$$ 784238 780091 776290 772076 767313 762370 757532 752882 748454 744175 739834 735418 731370 728254 726215
59043G26215j311r38n57R5Q60J378J576J832K608L844N019N757O303P194Q551
$$ 726215 724904 723966 723409 723504 724364 725742 727318 729150 731758 735602 740621 746378 752681 759875 768426
59028G68426R902J0823J1586J2967J5237J7765J9827K1544K3407K5078K5506K4353
$$ 768426 778328 789151 800737 813704 828941 846706 866533 888077 911484 936562 962068 986421
59016I86421K2402K0229J7308J3110Q327M203J146j246l099m092m112l339j832
$$ 986421 1008823 1029052 1046360 1059470 1067797 1072000 1073146 1071900 1068801 1064709 1060597 1057258 1055426
59003A055426L11K613M697O831R337J1717J3050J3103J2296J0929R139P392O022
$$ 1055426 1055737 1058350 1063047 1069878 1079215 1090932 1103982 1117085 1129381 1140310 1149449 1156841 1162863
58990A162863M465J875j575m900p677j0346j3157j5746j7844j9520k0599k0622
$$ 1162863 1167328 1169203 1167628 1162728 1155051 1144705 1131548 1115802 1097958 1078438 1057839 1037217
58978A037217j9540j7726j5350j2468r609p375n430k859M08L430N601P208Q574
$$ 1037217 1017677 999951 984601 972133 962524 955149 949719 946860 947268 950698 956299 963507 972081
58965I72081R604J0415J1465J2768J3817J4457J4976J5099J3933J1199P650L858
$$ 972081 981685 992100 1003565 1016333 1030150 1044607 1059583 1074682 1088615 1099814 1107464 1111322
58953A111322m43n444j0539j5002j8580k1035k1899k1189j9654j7831j5492j2342
$$ 1111322 1110879 1105435 1094896 1079894 1061314 1040279 1018380 997191 977537 959706 944214 931872
58941I31872q634m732q27K626M933N998O324N848L676m33n205r096j1837j4077
$$ 931872 923238 918506 917679 920305 925238 931236 937560 943408 947084 946651 941446 932350 920513 906436
58927I06436j6091j7597j8363j8387j7571j5775j3142j0239p880o657o206n195
$$ 906436 890345 872748 854385 835998 818427 802652 789510 779271 771391 764734 758528 753333
58915G53333k764K00K012K274K103K383L034M062N944Q464J0400J1143J1612J2871
$$ 753333 750569 750769 752781 755055 757158 759541 762575 766637 772581 781045 791445 802588 814200 827071
58901H27071J4721J6351J7647J8936K0166K1031K1538K1828K1923K2030K2681
$$ 827071 841792 858143 875790 894726 914892 935923 957461 979289 1001212 1023242 1045923
58890A045923K4181K6363K9083L2260L5313L7390L8325L8467L7445L4236K8825
$$ 1045923 1070104 1096467 1125550 1157810 1193123 1230513 1268838 1307305 1344750 1378986 1407811
58879A407811K2509J6032Q730K73q055j4939k0813k6878l3043l8035m0941m1711
$$ 1407811 1430320 1446352 1455082 1455355 1447300 1432361 1411548 1384670 1351627 1313592 1272651 1230940
58867A230940m0634l8264l5444l2592k9391k5762k2512k0300j8652j6918j5470
$$ 1230940 1190306 1152042 1116598 1084006 1054615 1028853 1006341 986041 967389 950471 935001
58856I35001j4961j5018j4703j3904j3265j3012j2733j2165j1441j0699j0020
$$ 935001 920040 905022 890319 876415 863150 850138 837405 825240 813799 803100 793080
58845G93080r512q999q068o791n960o039o520o751o757o639o039m954m299m675
$$ 793080 783568 774569 766501 759710 753750 747711 741191 734440 727683 721044 715005 710051 705752 701077
58831G01077n222m717l311k183j867j855j549p42N50J917K529K083J409J465K076
$$ 701077 695855 691138 687827 685644 683777 681922 680373 679631 680181 682098 684627 686710 688119 689584 691660
58816F91660K451K495K621K631J836K61j133j546j107n50n49j283k284k848k818
$$ 691660 694111 696606 699227 701858 703694 703955 702822 701276 700169 699619 699070 697787 695503 692655 689837
58801F89837k652k549k141j360q13q74j088j069j160j573j660q53L51J184J774
$$ 689837 687185 684636 682495 681135 680322 679448 678360 677291 676131 674558 672898 672045 672396 673580 675354
58786F75354K650L669M327M718N314O196P142Q074Q788Q778P975O999O086M585
$$ 675354 678004 681673 686000 690718 696032 702228 709370 717444 726232 735010 742985 749984 756070 760655
58772G60655K277K77l74k81p36j929l211m463n850o786o411m971l547k622j811
$$ 760655 762932 763209 762835 762554 761818 759889 756678 752215 746365 739579 733168 728197 724650 722028 720217
58757G20217p95M14J874L490M700N127N194N384N454N147N004N534O280O691P185
$$ 720217 719422 719836 721710 725200 729900 735027 740221 745605 751059 756206 761210 766744 773024 779715 786900
58742G86900Q310R559J0200J0572J1274J1778J1340J0649J1005J2228J3096J3464
$$ 786900 795210 804769 814969 825541 836815 848593 859933 870582 881587 893815 906911 920375
58730I20375J4366J5990J7228J7301J6479J5069J3016J0638Q550O760M945L548
$$ 920375 934741 950731 967959 985260 1001739 1016808 1029824 1040462 1049012 1055772 1060717 1064265
58718A064265L406M228M730M355L797L700L923M125M042L160J162j309l316n039
$$ 1064265 1067671 1071899 1076629 1080984 1084781 1088481 1092404 1096529 1100571 1103731 1104893 1103584 1100268 1095229
58704A095229p441j0644j3755j6267j8472k0470k1971k3120k4374k5424k5360
$$ 1095229 1087788 1077144 1063389 1047122 1028650 1008180 986209 963089 938715 913291 887931
58693H87931k3981k1968j9708j7027j4165j1869j0309q904p397o183n539n378
$$ 887931 863950 841982 822274 805247 791082 779213 768904 760000 752603 746420 740881 735503
58681G35503n730o554p132o686n545m700m300l652k605j726j030K51K403M721
$$ 735503 729773 723219 716087 709401 703856 699156 694856 691204 688599 686873 685843 686094 688497 693218
58667F93218O508P831R167J0960J3441J6123J7747J7520J5980J3906J1040P026
$$ 693218 699726 707557 716724 727684 741125 757248 774995 792515 808495 822401 833441 840467
58655H40467K801m19k907n570p916q708q295q223q722q614p758p335p447o626
$$ 840467 843268 842849 839942 834372 826456 817748 809453 801230 792508 783894 776136 768801 761354 754728
58641G54728m420k345j415n55J398L741N156N579N636N281M125K371N46j028k054
$$ 754728 750308 747963 746548 745993 747391 751132 756288 761867 767503 772784 776909 779280 779826 778798 776744
58626G76744k274k093k258k519j668O46L242N086O633Q827J1728J4824J7933K1101
$$ 776744 774470 772377 770119 767600 765932 766578 769820 774906 781539 790366 802094 816918 834851 855952
58612H55952K4154K6768K8486K8521K6288K2243J7472J2398O832J228l208n869
$$ 855952 880106 906874 935360 963881 990169 1012412 1029884 1042282 1049114 1050342 1047134 1041265
58600A041265p174p599p282o722o601o775o529n996o121p047p760p575o681n056
$$ 1041265 1034091 1026492 1019210 1012488 1005887 999112 992583 986587 980466 973419 965659 958084 951403 946347
58586I46347k155J876N876R005J1332J2922J3425J2897J1873J0457Q438O322M988
$$ 946347 944192 946068 951944 960949 972281 985203 998628 1011525 1023398 1033855 1042293 1048615 1053603
58573A053603M253L179J874J510K427L779N248P501J0650J3843J6712J9714K2705
$$ 1053603 1057856 1061035 1062909 1064419 1066846 1070625 1075873 1083374 1094024 1107867 1124579 1144293 1166998
58560A166998K4809K5950K6785K6890K4948K1162J7450J4640J1487P265L171J25
$$ 1166998 1191807 1217757 1244542 1271432 1296380 1317542 1334992 1349632 1361119 1368384 1371555 1371680
58548A371680k823o647j0651j3845j6499j9016k0817k1494k1807k2323k2407k1643
$$ 1371680 1368857 1362210 1351559 1337714 1321215 1302199 1281382 1259888 1238081 1215758 1193351 1171708
58536A171708k0847k0540j9836j7994j5785j4098j2404r877o843l995j308J231
$$ 1171708 1150861 1130321 1110485 1092491 1076706 1062608 1050204 1040327 1033484 1029489 1028181 1029412
58524A029412K945L649M385N862P332P985Q385R376J0630J1387J1610J1531J1024
$$ 1029412 1032357 1036006 1040391 1046253 1053585 1061570 1069955 1079331 1089961 1101348 1112958 1124489 1135513
58511A135513J0337J0295J1021J1493J1166J0730J0539R700P695N422L598J464
$$ 1135513 1145850 1156145 1167166 1178659 1189825 1200555 1211094 1220794 1228489 1233911 1237509 1238973
58499A238973j792n640r240j2554j5487j7290j7908j8463j9391j9534j8096j6017
$$ 1238973 1237181 1231541 1222301 1209747 1194260 1176970 1159062 1140599 1121208 1101674 1083578 1067561
58487A067561j4260j2358r908p788o477m772j717J686M195O323Q882J1015J1439
$$ 1067561 1053301 1040943 1031035 1023247 1016770 1011998 1010281 1011967 1016162 1022485 1031367 1042382 1053821
58474A053821J0477R119P205M195P38k289n260q764j2008j3873j4697j5405j5718
$$ 1053821 1064298 1073417 1080622 1084817 1085555 1083266 1078006 1069242 1057234 1043361 1028664 1013259 997541
58461I97541j4751j2713j0534q452o157l708j264J253L375M009L093K134K118
$$ 997541 982790 970077 959543 951091 944934 941226 939962 941215 944590 948599 951692 953826 955944
58448I55944K219J524N48j23j123k865m287m410l734k847j245J094K763L068L479
$$ 955944 958163 959687 960235 960112 958989 956124 951837 947427 943693 940846 939601 940695 943458 946526 950005
58433I50005N231P212P886P666P586P383O921P707J0709J4227J6157J6975J8206
$$ 950005 955236 962448 970334 978000 985586 992969 999890 1007597 1018306 1032533 1048690 1065665 1083871
58420A083871J9377J8946J7116J5266J3541J1248Q751O758M635J528j770l983
$$ 1083871 1103248 1122194 1139310 1154576 1168117 1179365 1188116 1194874 1199509 1201037 1199267 1195284
58408A195284n458p183q790r549j0144j1431j2574j2488j1906j1889j1583r757
$$ 1195284 1189826 1182643 1173853 1164304 1154160 1142729 1130155 1117667 1105761 1093872 1082289 1072532
58396A072532p355o115n775n063m333m723n706o003o086p276r141j0183j0350
$$ 1072532 1065177 1059062 1053287 1048224 1043891 1039168 1033462 1027459 1021373 1014097 1004956 994773 984423
58383I84423j0637j0922j0426r454q597p114m228r15J601L917O854R289R991J0143
$$ 984423 973786 962864 952438 942984 934387 927273 923045 922130 923731 927648 934502 943791 953782 963925
58369I63925J1415J2887J2691J1419J1066J1684J1951J1910J2346J2488J1257
$$ 963925 975340 988227 1000918 1012337 1023403 1035087 1047038 1058948 1071294 1083782 1095039
58358A095039R709R424R568Q380O367N056L915J752k08m8J162R53k08J98K309
$$ 1095039 1104748 1114172 1123740 1132120 1138487 1143543 1147458 1149210 1149002 1148954 1150116 1151069 1150861 1151059 1153368
58343A153368M013M823O177Q233R823J1132J3263J5658J7003J7948J9750K1154
$$ 1153368 1157381 1162204 1168381 1176614 1186437 1197569 1210832 1226490 1243493 1261441 1281191 1302345
58331A302345K0122J7595J6050J5202J2936R560P183N620K979k20j575j034p01
$$ 1302345 1322467 1340062 1356112 1371314 1384250 1393810 1400993 1406613 1409592 1409372 1407797 1406763 1406062
58318A406062p67L92K547L890M584O162P966Q203P899R571J2538J3905J3719J4643
$$ 1406062 1405295 1405687 1408234 1412124 1416708 1422870 1430836 1439039 1446938 1456509 1469047 1482952 1496671 1511314
58304A511314J6917J8251J8502J9807K2043K2792K1803K1097K0737J9064J6900
$$ 1511314 1528231 1546482 1564984 1584791 1606834 1629626 1651429 1672526 1693263 1712327 1729227
58293A729227J6768J8107J8027J6663J6820J8476J8839J7865J8410K0666K1861
$$ 1729227 1745995 1764102 1782129 1798792 1815612 1834088 1852927 1870792 1889202 1909868 1931729
58282A931729K1719K2830K5259K6278K5907K7208L0425L2474L2845L4398L7632
$$ 1931729 1953448 1976278 2001537 2027815 2053722 2080930 2111355 2143829 2176674 2211072 2248704
58271B248704L9746M0270M1922M5103M7147M7889N0163N4027N6302N6660N8213
$$ 2248704 2288450 2328720 2370642 2415745 2462892 2510781 2560944 2614971 2671273 2727933 2786146
58260B786146O1372O3160O3280O4568O6722O6223O3206O1675O2025O0423N6496
$$ 2786146 2847518 2910678 2973958 3038526 3105248 3171471 3234677 3296352 3358377 3418800 3475296
58249C475296N4363N4961N4903N4182N7161O4381P1329P6976Q5471R7485J08224
$$ 3475296 3529659 3584620 3639523 3693705 3750866 3815247 3886576 3963552 4049023 4146508 4254732
58238D254732J16080J24986J36079J45458J52477J61602J73918J85364J95471
$$ 4254732 4370812 4495798 4631877 4777335 4929812 5091414 5265332 5450696 5646167
58229E646167K08724K25364K40465K54157K72561K96511L20010L42026L68504
$$ 5646167 5854891 6080255 6320720 6574877 6847438 7143949 7463959 7805985 8174489
58220H174489M00434M32149M64000N03722N52347O02604O54664P18719P98024
$$ 8174489 8574923 9007072 9471072 9974794 10527141 11129745 11784409 12503128 13301152
58211A3301152Q85159R79743J093284J231273J388327J567651J787119K059917
$$ 13301152 14186311 15166054 16259338 17490611 18878938 20446589 22233708 24293625
58203B4293625K389384K790363L292937L914911M653490N515706O534860P748768
$$ 24293625 26683009 29473372 32766309 36681220 41334710 46850416 53385276 61134044
58195F1134044R191455J0918892J3010195J5526991J8502030K1963174K5877200
$$ 61134044 70325499 81244391 94254586 109781577 128283607 150246781 176123981
58188A76123981K9985967L3711960L6265693L6826988L4644390K9167516K0380479
$$ 176123981 206109948 239821908 276087601 312914589 347558979 376726495 397106974
58181C97106974R134425k949752j4066881k2850027k8621934l1324567l1376189
$$ 397106974 406241399 403291647 389224766 366374739 337752805 306428238 275052049
58174B75052049k9517471k6592240k3335393k0286316j7786764j5954432j4668777
$$ 275052049 245534578 218942338 195606945 175320629 157533865 141579433 126910656
58167A26910656j3673876j2747459j1779193j0732833r607697q447299p328197
$$ 126910656 113236780 100489321 88710128 77977295 68369598 59922299 52594102
58160E2594102o307512n399094m603544l928490l368817k897387k491586k148966
$$ 52594102 46286590 40887496 36283952 32355462 28986645 26089258 23597672 21448706
58152B1448706j867080j629492j422873j248895j108202r89234q82928p93072
$$ 21448706 19581626 17952134 16529261 15280366 14172164 13182930 12300002 11506930
58144A1506930p22346o62040o04576n53349n11537m73153m33262l95995l64744
$$ 11506930 10784584 10122544 9517968 8964619 8453082 7979929 7546667 7150672 6785928
58135F785928l34736l02496k72758k49338k28512k07801j91973j83916j78316
$$ 6785928 6451192 6148696 5875938 5626600 5398088 5190287 4998314 4814398 4636082
58126D636082j70642j64090j61723j59867j55188j50581j48233j44263j35970
$$ 4636082 4465440 4301350 4139627 3979760 3824572 3673991 3525758 3381495 3245525
58117C245525j27200j20990j13819j02826r2011q5535q1023p5123o9816o7756
$$ 3245525 3118325 2997335 2883516 2780690 2688679 2603144 2522121 2446998 2377182 2309426
58107B309426o6711o4069o1792o1892o1835n9179n6148n4988n3541m9802m6267
$$ 2309426 2242715 2178646 2116854 2054962 1993127 1933948 1877800 1822812 1769271 1719469 1673202
58096A673202m5200m4058m0088l5244l2162k9411k4988k0591j8228j6358j3470
$$ 1673202 1628002 1583944 1543856 1508612 1476450 1447039 1422051 1401460 1383232 1366874 1353404
58085A353404j1721j2975j4841j4678j4026j5245j7077j7467j7504j8717j9522
$$ 1353404 1341683 1328708 1313867 1299189 1285163 1269918 1252841 1235374 1217870 1199153 1179631
58074A179631j8095j5945j5114j4662j3178j1886j2014j2040j0635r448r894j0304
$$ 1179631 1161536 1145591 1130477 1115815 1102637 1090751 1078737 1066697 1056062 1046614 1036720 1026416
58062A026416r326q865j0403j1666j0477q766r044r840q632o591o457p887q808
$$ 1026416 1017090 1008225 997822 986156 975679 966913 957869 948029 939397 932806 926349 918462 909654
58049I09654r326j0619j1729j1027r382q663q623q053p370p265o693m937l701
$$ 909654 900328 889709 877980 866953 857571 848908 840285 832232 824862 817597 810904 805967 802266
58036H02266m399n374m660l423l746n001n541o008p731r651j0066r805j0540j1408
$$ 802266 797867 792493 787833 784410 780664 775663 770122 764114 756383 746732 736666 726861 716321 704913
58022G04913j0557q674p818p885p266n946n064m408l048j567j125j268j009q43
$$ 704913 694356 685682 677864 669979 662713 656767 651703 647295 644247 642680 641555 640287 639278 638435
58008F38435j407j569l90N77k89j449l30K574M773N850P323R288J0411J0849J2112
$$ 638435 637028 635459 635069 635646 635357 633908 633578 636152 640925 646775 654098 663386 673797 684646 696758
57993F96758J4213J5583J5659J5152J3965J1265P562M479K573J240M13L95M23
$$ 696758 710971 726554 742213 757365 771330 782595 790157 794636 797209 798449 798862 799257 799680
57980G99680n40j971k608k750l745n584o919p273p434p813q087q300q802r310
$$ 799680 799140 797169 794561 791811 788066 782482 775563 768290 760856 753043 744956 736656 727854 718544
57966G18544r355r236r300q923p522n865n034m853m642m566m869m851m093l649
$$ 718544 709189 699953 690653 681730 674208 668343 663309 658456 653814 649248 644379 639528 635435 631786
57952F31786m371n252n118m699n116n519m467k564j396p59P12K814M173M850O115
$$ 631786 627415 622163 617045 612346 607230 601711 597244 594680 593284 592525 593237 596051 600224 605074 611189
57937F11189P927Q969R112R623J0922J2090J2715J3315J3842J3446J1878R693
$$ 611189 619116 628085 637197 646820 657742 669832 682547 695862 709704 723150 735028 744721
57925G44721P144M266J784M16m45j945l955n536o746q353j0192j1409j2035j2750
$$ 744721 751865 756131 757915 758331 757886 755941 751986 746450 739704 731351 721159 709750 697715 684965
57911F84965j3387j3255j2599j2236j2049j1389j0525j0179j0026r297q415q406
$$ 684965 671578 658323 645724 633488 621439 610050 599525 589346 579320 570023 561608 553202
57899E53202r115r565r590r461q630o664m819m553m997m037j625K58P42Q91J375
$$ 553202 544087 534522 524932 515471 506841 500177 495358 490805 485808 481771 480146 480404 481146 482037 483412
57884D83412J659J708K320L334L535K767K318K721L007K573K044J765J168J56
$$ 483412 485071 486779 489099 492433 495968 498735 501053 503774 506781 509354 511398 513163 514331 514487
57870E14487m52m59o91j406j769j466j315j709j811r78K69J209J693J649J053
$$ 514487 514035 513576 512885 511479 509710 508244 506929 505220 503409 502431 502700 503909 505602 507251 508304
57855E08304P89K053M451O036N859N151N348O204O681O518O016N207M125L238
$$ 508304 509093 511146 515597 521633 527492 532643 537991 544195 550876 557394 563410 568617 572742 575980
57841E75980K859K594J893P65l96j283j847k422l660n790p980r071q873q090p275
$$ 575980 578839 581433 583326 584091 583695 582412 580565 578143 574483 568693 560713 551642 542769 534679 527404
57826E27404o570o186o130n757m529k948j765o51J196L412M828N263N617O264
$$ 527404 520834 514648 508518 502761 498232 495284 493519 492868 494064 497476 502304 507567 513184 519448
57812E19448O689O671O496O047M952L604K629J543o27l449n450o443p687r566
$$ 519448 526137 532808 539304 545351 550303 553907 556536 558079 557452 554003 548553 542110 534423 524857
57798E24857j0888j0975j0733j1033j1512j1660j1683j1641j1070j0080r558r629
$$ 524857 513969 502994 492261 481228 469716 458056 446373 434732 423662 413582 404024 394395
57786C94395r265q024o856o425o024m949l724l038k594j900j157m82P43K787M755
$$ 394395 385130 377106 370250 363825 357801 352852 349128 346090 343496 341596 340439 339957 340700 343487 348242
57771C48242N816O382P182P973Q019P282O224N108M216M106M796N321M836L669
$$ 348242 354058 360440 367622 375595 383614 390896 397120 402228 406444 410550 415346 420667 425503 429172
57757D29172K611J789R27J66k70p42j764l214m586n693o538o836o304n194m081
$$ 429172 431783 433572 434499 434665 434395 433653 431889 428675 424089 418396 411858 405022 398718 393524 389443
57742C89443l327l009l114l423l628l727l959m173l800k783j955k031k736l257
$$ 389443 386116 383107 379993 376570 372942 369215 365256 361083 357283 354500 352545 350514 347778 344521
57728C44521l191k724k214j922j848j704j326j120j608k495k889k475j829j440
$$ 344521 341330 338606 336392 334470 332622 330918 329592 328472 326864 324369 321480 319005 317176 315736
57714C15736j183r91j179j712j893j328o54p38j541k270k360j976j669j787k076
$$ 315736 314553 313562 312383 310671 308778 307450 306796 306058 304517 302247 299887 297911 296242 294455 292379
57699B92379j897j053k46j88n22k36R08K048K372J923J239P85Q01J127J306J298
$$ 292379 290482 289429 289183 288995 288473 288237 289145 291193 293565 295488 296727 297512 298313 299440 300746 302044
57683C02044J871L538N501O658P328Q841J1579J4713J7942K2021K7312L3222L9561
$$ 302044 303915 307453 312954 319612 326940 335781 347360 362073 380015 402036 429348 462570 502131
57670E02131M7114N6156O5420P3279P8866Q1265P8499O8487N0740K6781n04k7462
$$ 502131 549245 605401 670821 744100 822966 904231 982730 1051217 1101957 1128738 1128234 1100772
57658A100772n0433o6942p6247p8807p5812o9205o1185n3092m5255l7975l1823
$$ 1100772 1050339 983397 907150 828343 752531 683326 622141 569049 523794 485819 453996
57647D53996k6790k2132j7544j3648j0943r005p234n590m201k966j942j414j228
$$ 453996 427206 405074 387530 373882 362939 353934 346700 341110 336909 333943 332001 330587 329359
57634C29359p79PM43J89k13k35J2K97O18P46K86n74j257j791k582l110k292m49
$$ 329359 328580 328587 329030 329219 329006 328771 328783 329080 329698 330444 330730 330156 328899 327108 324526 321416 319124 318675
57616C18675O05L9r25j083r58j357j764j413p80o75p77m41r2n23j398j711j274
$$ 318675 319280 319319 318394 317311 316353 314996 313232 311819 311039 310364 309587 309146 309054 308531 307133 305422 304148
57599C04148o52j21K79J89m99j074r52p02j136j932k192j913j791k025k298k571
$$ 304148 303496 303375 303654 303843 303344 302270 301318 300616 299480 297548 295356 293443 291652 289627 287329 284758
57583B84758k914k917k249j463j277j447j248p97q50j589k526l347l948l937l055
$$ 284758 281844 278927 276678 275215 273938 272491 271243 270446 269596 268007 265481 262134 258186 254249 251194
57568B51194j972j687k267k910l126l080k997k881k721k369j583o99p10j974l374
$$ 251194 249222 247535 245268 242358 239232 236152 233155 230274 227553 225184 223601 222902 222192 220218 216844
57553B16844l635k884k021j218j66O59M90k43k15R59K354L228L711L930L640L030
$$ 216844 213209 210325 208304 207086 206920 207579 208069 207826 207611 208570 210924 214152 217863 221793 225433 228463
57537B28463K832L305L892M201M585N374O257O767O830O604O190N696N113M143
$$ 228463 231295 234600 238492 242693 247278 252652 258909 265676 272506 279110 285300 290996 296109 300252
57523C00252K626J095K54j03r41k589m248n107n330n571o072o660p277q029q818
$$ 300252 302878 303973 304227 304124 303183 300594 296346 291239 285909 280338 274266 267606 260329 252300 243482
57508B43482r279r142q481p594o647n558m330l370l133l466l678l316k554j736
$$ 243482 234203 225061 216580 208986 202339 196781 192451 189081 185948 182482 178804 175488 172934 171198
57494A71198j035o07n19l76L09J167J179J93n78j69Q17J224R43P54J066J657K238
$$ 171198 170163 169556 169037 168661 168970 170137 171316 171509 170931 170762 171579 172803 173746 174500 175566 177223 179461
57477A79461K535K207J401R33J227J477P22p54j881k244k191j900j317q11q52
$$ 179461 181996 184203 185604 186537 187764 189241 189963 189209 187328 185084 182893 180993 179676 178865 178013
57462A78013j275j561j714j973k011j363m44j16l41k43M57J081J197J195J364
$$ 178013 176738 175177 173463 171490 169479 168116 167672 167556 167215 166972 167429 168510 169707 170902 172266
57447A72266J263N04m34o52J34J316K013J893J414J216J367J482J501J752K082
$$ 172266 173529 174033 173599 172947 173081 174397 176410 178303 179717 180933 182300 183782 185283 187035 189117
57432A89117J820R14K99N61J060J058Q78J065J271R86O81J058J725J791J302R46
$$ 189117 190937 191851 192150 192711 193771 194829 195707 196772 198043 199029 199710 200768 202493 204284 205586 206532
57416B06532P31K19k89j23M34L94m17j236j554j387o17O94J567J046k15n94K41
$$ 206532 207263 207482 207193 207070 207504 207898 207481 206245 204691 203304 202687 203381 204948 205994 205779 205185 205426
57399B05426J068J109R19J065J254J163J044J135J352J756K396K687K060J233
$$ 205426 206494 207603 208522 209587 210841 212004 213048 214183 215535 217291 219687 222374 224434 225667
57385B25667J573L041M072L829L202L155L330K932J969R07m2p31r37q09p97q65
$$ 225667 227240 230281 234353 238182 241384 244539 247869 250801 252770 253677 253635 252904 251967 251158 250361 249496
57369B49496n82j45k50p92p65P4O92L96p4K11J051J723K034K078J731J122R25
$$ 249496 248914 248769 248519 247727 246962 247036 247728 248124 248050 248261 249312 251035 253069 255147 256878 258000 258925
57352B58925J488K240K515K419K379K391K224J873J399P52R2k48k80k97k60Q4
$$ 258925 260413 262653 265168 267587 269966 272357 274581 276454 277853 278605 278697 278449 278169 277872 277612 277696
57336B77696M01N7o68p18J48Q76O88L3m12p29j165j564j938k669l601l794k878
$$ 277696 278097 278154 277486 276768 276916 277792 278480 278513 278101 277372 276207 274643 272705 270036 266435 262641 259763
57319B59763j703j091q04l68%oj29k26o82j455j671r45k78o57j553j804j249n75
$$ 259763 258060 256969 256165 255797 255797 255791 255662 255436 254754 253299 251628 250683 250405 249748 248195 246391 245142 244567
57301B44567j62k0l19j000j387j005l92l30p86j287j704j894j270K78J682J894
$$ 244567 244405 244385 244066 243066 241679 240674 240282 239952 239166 237879 236175 234281 233011 233289 234971 236865
57285B36865J399J477K433L500M219M883N731O551P044O965O197N099M425M330
$$ 236865 238264 239741 242174 245674 249893 254776 260507 267058 274102 281067 287264 292363 296788 301118
57271C01118M002K935J870J649J827J459O81M32R45J602J972J936J168l50j510
$$ 301118 305120 308055 309925 311574 313401 314860 315541 315973 316918 318520 320492 322428 323596 323246 321736
57256C21736j019Q34K431K832K510K109J647J219J325K056K734K825K565K393
$$ 321736 320717 321551 323982 326814 329324 331433 333080 334299 335624 337680 340414 343239 345804 348197
57242C48197K319K209K212K527L060L540L702L366K679K194K316K742K873K699
$$ 348197 350516 352725 354937 357464 360524 364064 367766 371132 373811 376005 378321 381063 383936 386635
57228C86635K668K779K446J426L26r3K73R62J555J943K196K381K539K783L307
$$ 386635 389303 392082 394528 395954 396280 396187 396460 397422 398977 400920 403116 405497 408036 410819 414126
57213D14126M057M460L919K636J533J114R73O79N99J271K439L396L994M680N716
$$ 414126 418183 422643 426562 429198 430731 431845 432818 433497 434096 435367 437806 441202 445196 449876 455592
57198D55592O900P957Q776R294R522R619R650R454Q997Q522Q164P785P442P539
$$ 455592 462492 470449 479225 488519 498041 507660 517310 526764 535761 544283 552447 560232 567674 575213
57184E75213Q158Q758R009R391J0460J1958J3222J4020J4371J4088J3290J2954
$$ 575213 583371 592129 601138 610529 620989 632947 646169 660189 674560 688648 701938 714892
57172G14892J4049J6248J8190J8984J8866J8451J8012J7568J7199J7192J7996
$$ 714892 728941 745189 763379 782363 801229 819680 837692 855260 872459 889651 907647
57161I07647J9878K2547K5426K8361L1621L5099L8189M0714M3221M6006M8641
$$ 907647 927525 950072 975498 1003859 1035480 1070579 1108768 1149482 1192703 1238709 1287350
57150A287350N0850N2923N4778N5607N5226N4819N5454N6825N8252N9992O2400
$$ 1287350 1338200 1391123 1445901 1501508 1556734 1611553 1667007 1723832 1782084 1842076 1904476
57139A904476O4755O6104O6502O6200O4632O1612N8664N7418N7343N6811N5887
$$ 1904476 1969231 2035335 2101837 2168037 2232669 2294281 2352945 2410363 2467706 2524517 2580404
57128B580404N6158N8123O0755O3649O7677P3248P9674Q6558R4311J02819J10954
$$ 2580404 2636562 2694685 2755440 2819089 2886766 2960014 3039688 3126246 3220557 3323376 3434330
57117C434330J17732J22864J26161J27825J29464J33395J40895J52404J68987
$$ 3434330 3552062 3674926 3801087 3928912 4058376 4191771 4332666 4485070 4654057
57108D654057J91609K18798K47245K75507L05709L41429L85933M42758N15740
$$ 4654057 4845666 5064464 5311709 5587216 5892925 6234354 6620287 7063045 7578785
57099G578785O07469P19470Q54264J015051J202643J415024J650528J908299K184076
$$ 7578785 8186254 8905724 9759988 10775039 11977682 13392706 15043234 16951533 19135609
57090A9135609K468168K748926L015380L256263L462324L631029L756984L804008
$$ 19135609 21603777 24352703 27368083 30624346 34086670 37717699 41474683 45278691
57082D5278691L691436L331433K700814J880416J017900K43882l89089r07268
$$ 45278691 48970127 52301560 55002374 56882790 57900690 58144572 57755483 56848215
57074E6848215j372950j835494k301843k736601l088706l325328l446938l475249
$$ 56848215 55475265 53639771 51337928 48601327 45512621 42187293 38740355 35265106
57066C5265106l431888l329270l175307k979000k750277k498640k234306j968696
$$ 35265106 31833218 28503948 25328641 22349641 19599364 17100724 14866418 12897722
57058A2897722j712187j472330j254778j064179r02595p67980o55738n61633m82765
$$ 12897722 11185535 9713205 8458427 7394248 6491653 5723673 5067935 4506302 4023537
57049D023537m16789l61642l15878k78247k47046k20430j97226j76794j58516
$$ 4023537 3606748 3245106 2929228 2650981 2403935 2183505 1986279 1809485 1650969
57040A650969j41898j26817j13027r9930q7444p6448o7525n9772n1802m3395l5126
$$ 1650969 1509071 1382254 1269227 1169297 1081853 1005405 937880 878108 826306 782911 747785
57029G47785k6959j8399r642j256P105J6395K6808L7878M9625O2244P4823Q5872
$$ 747785 720826 702427 692785 691529 698634 715029 741837 779715 829340 891584 966407 1052279
57017A052279R4681R9995R7475Q1387N0608J1499k6559n7479p9788r3964j00814
$$ 1052279 1146960 1246955 1344430 1425817 1476425 1487924 1461365 1403886 1324098 1230134 1129320
57006A129320j01768r8580r2354q3864p4570o6218n9429n3559m7966m2706l8048
$$ 1129320 1027552 928972 836618 752754 678184 611966 552537 498978 451012 408306 370258
56995C70258l4058l0689k7760k4839k1587j8174j5003j2083q998n424j487K309
$$ 370258 336200 305511 277751 252912 231325 213151 198148 186065 177067 171643 170156 172465
56983A72465N359P249P870P050M448J54m816r309j3151j6628j9123j9399j7436
$$ 172465 177824 185073 192943 199993 204441 204595 199779 190470 177319 160691 141568 122169 104733
56970A04733j4765j2611j0677q231n319k324P42L783O376Q636J1451J5115J8562
$$ 104733 89968 77357 66680 58449 53130 50806 51548 55331 61707 70343 81794 96909 115471
56957A15471K0732K1781K2108K1046J7597J1899N044k039q642j3854j7092j8663
$$ 115471 136203 157984 180092 201138 218735 230634 235678 233639 224997 211143 194051 175388
56945A75388j9029j8012j5458j2099q871n853k718M48L585P254J1783J6401K0282
$$ 175388 156359 138347 122889 110790 101919 96066 93348 93796 97381 104635 116418 132819 153101
56932A53101K3787K7492L0540L1299K9177K4581J7499P758l448j3756k1596k6868
$$ 153101 176888 204380 234920 266219 295396 319977 337476 345234 341786 328030 306434 279566
56920B79566k9730l0030k8157k5234k2117j9026j6173j3817j1592q898o136m476
$$ 279566 249836 219806 191649 166415 144298 125272 109099 95282 83690 74792 68656 64180
56908F4180m126l863k621o58J218K660L609L979L978M106M462M616M534M950O482
$$ 64180 60054 56191 53570 52912 54130 56790 60399 64378 68356 72462 76924 81540 86074 91024 97506
56893I7506Q879J1473J3830J5830J7636J9746K2428K4933K5922K4862K2326J8756
$$ 97506 106385 117858 131688 147518 165154 184900 207328 232261 258183 283045 305371 324127
56881C24127J3783P198j76p073j2706j6718j8812j9054j8140j6765j4948j2254
$$ 324127 337910 345108 344932 337859 325153 308435 289623 270569 252429 235664 220716 208462
56869B08462q474l799J437O926J2582J8720K5771L3586M1246M7700N2323N4687
$$ 208462 199988 196189 197626 204552 217134 235854 261625 295211 336457 384157 436480 491167
56857D91167N4052M9327L9593K4891O898j1261k6342l6460m1374m1841l9045l4328
$$ 491167 545219 594546 634139 659030 665928 654667 628325 591865 550491 508650 469605 435277
56845D35277k8623k2054j4395n863L054J2278K2050L2326M2880N3839O5294P6374
$$ 435277 406654 384600 370205 364342 367396 379674 401724 434050 476930 530769 596063 672437
56833F72437Q5363R0691R1021Q4535O9465M5959J6834j3689m1508o3152p6411
$$ 672437 757800 848491 939512 1024047 1093512 1139471 1156305 1142616 1101108 1037956 961545
56822I61545q1375q0188p5129o7268n7247m6335l5808k5823j5712n161N569J6266
$$ 961545 880170 799982 724853 657585 600338 554003 518195 492372 476660 471499 477068 493334
56810D93334K7002L7799M8347N7777O4377O5950O1019M9666L3011J2416j0266
$$ 493334 520336 558135 606482 664259 728636 794586 855605 905271 938282 950698 940432
56799I40432l2073m9590o0729o5664o6005o3205n7854n0275m1406l2669k4897
$$ 940432 908359 858769 798040 732376 666371 603166 545312 495037 453631 420962 396065
56788C96065j7827j0900m185K056Q280J5186K2371K8263L1631L2306L0236K4849
$$ 396065 378238 367338 363153 365209 373489 388675 411046 439309 470940 503246 533482 558331
56776E58331J5934M547p556j8921k8457l5280l9185m0847m0885l9075l5173l0104
$$ 558331 574265 578812 571256 552335 523878 488598 449413 408566 367681 328606 293433 263329
56764B63329k5493k2104j9418j6784j4280j2333j0943r627p927n865l950k716
$$ 263329 237836 215732 196314 179530 165250 152917 141974 132347 124420 118555 114605 111889
56752A11889k244k193k265k373k342j923j298j080j502j973j908j584j632j980
$$ 111889 109645 107452 105187 102814 100472 98549 97251 96171 94669 92696 90788 89204 87572 85592
56738H5592j917j199m62m17r75j393j046O8J358K153K190J709J069L98k50o71
$$ 85592 83675 82476 82014 81597 80622 79229 78183 78251 79609 81762 83952 85661 86730 87128 86878 86207
56722H6207o69l69j23q3o4R2K20N1l18l89J05O75M78o55j961k655k766k720k529
$$ 86207 85538 85169 85046 84963 84899 84991 85211 85262 84944 84555 84660 85335 85813 85158 83197 80542 77776 75056 72527
56703G2527j973j340j250j717k029j757j246r52p94n20k00pJ42L57M54K13k83
$$ 72527 70554 69214 67964 66247 64218 62461 61215 60263 59469 58949 58749 58742 58884 59241 59695 59908 59625
56686E9625q08j309j828k285k569k664k546k092j237j32R13J537J382M51o09r00
$$ 59625 58817 57508 55680 53395 50826 48162 45616 43524 42287 42155 43068 44605 45987 46438 45829 44929
56670D4929j36J134K187K744K896K839K869L315M204N164N726N628M933M051L605
$$ 44929 44793 45927 48114 50858 53754 56593 59462 62777 66981 72145 77871 83499 88432 92483 96088
56655I6088L926M742N516O005O109N584M491L578L502L788L418K359J539J244
$$ 96088 100014 104756 110272 116277 122386 127970 132461 136039 139541 143329 146747 149106 150645 151889
56641A51889O92m88j525j773j741k050k233j515j88P15Q15N62L08K5k06k03j74
$$ 151889 152581 152093 150568 148795 147054 145004 142771 141256 141068 141783 142598 143160 143468 143493 143287 143084 142910
56624A42910n28j168j525j358j058j047j269j379j221j017j127j658k228k337
$$ 142910 142382 141214 139689 138331 137273 136226 134957 133578 132357 131340 130213 128555 126327 123990
56610A23990j998j721j826k019j892j501j249j375j759k069j947j334o26l17m04
$$ 123990 121992 120271 118445 116426 114534 113033 111784 110409 108650 106581 104634 103300 102674 102357 101953
56595A01953m87l99l82n61p02o04l06J07N05N51J26j69L09J136J198L11n23o85
$$ 101953 101466 101067 100685 100124 99422 98818 98512 98619 99124 99675 99801 99632 99941 101077 102275 102586 102063 101378
56577A01378o43p05k26J149K427K455J490O54M04M75Q42J776L159M600N989P322
$$ 101378 100735 100030 99804 100953 103380 105835 107325 107979 108383 108858 109700 111476 114635 119235 125224 132546
56561A32546Q261Q583Q765R401J0300J0814J0753J0347R530Q100O336M806L725
$$ 132546 140807 149390 158155 167556 177856 188670 199423 209770 219300 227400 233736 238542 242267
56548B42267L017K787L080L359K974J953Q04k19j102j586j454j117j228j790k277
$$ 242267 245284 248071 251151 254510 257484 259437 260241 260022 258920 257334 255880 254763 253535 251745 249468
56533B49468k517k810l262l642l900m272m834n372n724n872n801n581n355n006
$$ 249468 246951 244141 240879 237237 233337 229065 224231 218859 213135 207263 201462 195881 190526 185520
56519A85520m151k831j782j610k033k434k697k983l165l086k947k838k332j161
$$ 185520 181369 178538 176756 175146 173113 170679 167982 164999 161834 158748 155801 152963 150631 149470
56505A49470J32R21J324J636J586J039Q03J554K472K279J256Q52J357J493M99
$$ 149470 149602 150523 151847 153483 155069 156108 156911 158465 160937 163216 164472 165324 166681 168174 168673
56490A68673p60j236j101j090j335j475j309q38j53L77K95k97o88m59N2L50M67
$$ 168673 167913 166677 165576 164486 163151 161676 160367 159529 159376 159753 160048 159751 159063 158604 158656 159006 159473
56473A59473P74J401K053K224J648O84J56M55J077J274Q89K03n57j070q32J44
$$ 159473 160247 161648 163701 165925 167573 168257 168413 168868 169945 171219 172108 172311 171754 170684 169852 169996
56457A69996R47Q68M06M00O58M79R9L87J298J846J620J149P18Mq51j051m37O9
$$ 169996 170943 171811 172217 172617 173275 173754 173853 174240 175538 177384 179004 180153 180871 180875 180024 178973 178536 178605
56439A78605k06p57q16m09RL06N86P64P28N52L28N8j47j25j0j33o10j266j922
$$ 178605 178399 177642 176826 176417 176426 176732 177318 178082 178810 179362 179690 179748 179601 179476 179466 179333 178723 177457 175535
56420A75535k370k301j710j088p23k38O01J171Q81K42O6R4l64r30o45K45N00j08
$$ 175535 173165 170864 169154 168066 167343 167105 167706 168877 169758 170000 170066 170160 169796 168866 168221 168466 168966 168858
56402A68858m67K7P60J240J793K457K593K104J859K269K593K257J793J755J665
$$ 168858 168391 168418 169178 170418 172211 174668 177261 179365 181224 183493 186086 188343 190136 191891 193556
56387A93556Q79l28j240j678j898k092k459l213m091m379l714k396p76J019K714
$$ 193556 194435 194107 192867 191189 189291 187199 184740 181527 177436 173057 169343 166947 166171 167190 169904
56372A69904L958M869N770O446O517O415O885P582P387O154M858L911K893K095
$$ 169904 173862 178731 184501 190947 197464 203879 210764 218346 225733 231887 236745 240656 243549 245644
56358B45644K644M538O166O514O350O414N959M129J504q25k647m055m542l767
$$ 245644 248288 252826 258992 265506 271856 278270 284229 288358 289862 289037 286390 282335 277793 274026
56344B74026k349j032J23J025J078L02j98K22P47O12M50J071J991K327K220K201
$$ 274026 271677 270645 270768 271793 272871 273173 272975 273197 273944 274556 275006 276077 278068 280395 282615 284816
56328B84816K067J631J577K303K789J942L67n81p63r52j270j348j486k173k894
$$ 284816 286883 288514 290091 292394 295183 297125 297492 296911 296148 295196 293926 292578 291092 288919 286025
56313B86025k789k124j753j508n92P14J192N79m9J62R73J753K067J563K75r58
$$ 286025 283236 281112 279359 277851 277259 277973 279165 279744 279695 279857 280830 282583 284650 286213 286488 285530
56297B85530j232o95j75J27P06J643K352K418J957J252N99M20Q75J544J979K213
$$ 285530 284298 283603 283428 283555 284261 285904 288256 290674 292631 293883 294482 294902 295777 297321 299300 301513
56281C01513K296J896R87L10M07Q12R60J235K128L100L436L546M238N210N596
$$ 301513 303809 305705 306692 307002 307409 308221 309181 310416 312544 315644 319080 322626 326864 332074 337670
56266C37670N550N880O410O219N423N150N634N778N020M373N013O813Q798J0325
$$ 337670 343220 349100 355510 361729 367152 372302 377936 383714 388734 393107 398120 404933 413731 424056
56252D24056J1278J1726J1853J1927J2049J2175J2507J3462J5161J7194J8878
$$ 424056 435334 447060 458913 470840 482889 495064 507571 521033 536194 553388 572266
56241E72266J9694J9658J9372J9450J9724J9484J8531J7370J6089J3981J0746
$$ 572266 591960 611618 630990 650440 670164 689648 708179 725549 741638 755619 766365
56230G66365P236M361J874r68m230p445j0325j2573j3726j3946j4331j5571j6856
$$ 766365 773601 777962 779836 778868 774638 767193 756868 744295 730569 716623 702292 686721 669865
56217F69865j6941j5778j4269j3061j2333j2236j2550j2468j1497j0109q891p676
$$ 669865 652924 637146 622877 609816 597483 585247 572697 560229 548732 538623 529732 522056
56205E22056o221m960m317l997l672l560l609l178k276j946k518k759j865q62
$$ 522056 515835 510875 506558 502561 498889 495329 491720 488542 486266 484320 481802 479043 477178 476316
56191D76316p01m71Q41K194K117J366J723L015L566L059K656K618K061J019O88
$$ 476316 475615 475144 475985 478179 480296 481662 483385 486400 489966 493025 495681 498299 500360 501379 502067
56176E02067J377K011J914J589J577J866K467L379M065M068L881M050M058L290
$$ 502067 503444 505455 507369 508958 510535 512401 514868 518247 522312 526380 530261 534311 538369 541659
56162E41659K401K331K680K657K733L671M711M751M512N414O937P487P302Q019
$$ 541659 544060 546391 549071 551728 554461 558132 562843 567594 572106 577520 584457 591944 599246 607265
56148F07265R607J0317R763R538J0610J2293J4104J6492J9496K2687K6618L2309
$$ 607265 616872 627189 636952 646490 657100 669393 683497 699989 719485 742172 768790 801099
56136H01099L9333M6487N4327O4615P7102Q9312R9841J09381J17918J23504J24675
$$ 801099 840432 886919 941246 1005861 1082963 1172275 1272116 1381497 1499415 1622919 1747594
56125A747594J21937J16029J06857R5044Q2663P1404O1548N3186M6614M0890L3887
$$ 1747594 1869531 1985560 2092417 2187461 2270124 2341528 2403076 2456262 2502876 2543766 2577653
56114B577653K4640J4220L894n866j4383k0843k5998l2135m0749n1650o4343p8317
$$ 2577653 2602293 2616513 2620407 2614541 2600158 2579315 2553317 2521182 2480433 2428783 2364440 2286123
56102B286123r1801j02328j08933j12027j11257j05819r6936q7430p8348o8518
$$ 2286123 2194322 2091994 1983061 1871034 1759777 1653958 1557022 1469592 1391244 1322726
56092A322726n7758m7878l9837l2562k5469j9648j5592j2143q643n891m097k159
$$ 1322726 1264968 1217090 1177253 1144691 1119222 1099574 1083982 1071839 1063196 1057305 1053208 1051049
56080A051049K00J816K319K789L564L768L679M844P168Q579Q458Q669J0295J2154
$$ 1051049 1051249 1053065 1055384 1058173 1061737 1065505 1069184 1074028 1081196 1089775 1098233 1106902 1117197 1129351
56066A129351J3491J5215J7351J8219J7502J7178J8050J8249J6678J5063J4906
$$ 1129351 1142842 1158057 1175408 1193627 1211129 1228307 1246357 1264606 1281284 1296347 1311253
56055A311253J5182J4779J4520J5117J5617J5535J6012J7361J8066J7641J7725
$$ 1311253 1326435 1341214 1355734 1370851 1386468 1402003 1418015 1435376 1453442 1471083 1488808
56044A488808J8989J9854J9809K0804K3594K5901K6161K6086K7387K9007K9726
$$ 1488808 1507797 1527651 1547460 1568264 1591858 1617759 1643920 1670006 1697393 1726400 1756126
56033A756126L0605L2538L4128L4258L4246L5341L6544L6804L6852L7291L7523
$$ 1756126 1786731 1819269 1853397 1887655 1921901 1957242 1993786 2030590 2067442 2104733 2142256
56022B142256L7865L9767M2719M4422M5121M7769N2578N5926N6330N6716N8634
$$ 2142256 2180121 2219888 2262607 2307029 2352150 2399919 2452497 2508423 2564753 2621469 2680103
56011B680103N9348N7401N5921N7205N8948N9326O1026O6478P3734Q0701Q8902
$$ 2680103 2739451 2796852 2852773 2909978 2968926 3028252 3089278 3155756 3229490 3310191 3399093
56000C399093R9309J09223J17162J25940J37103J47374J54731J62498J73055J83288
$$ 3399093 3498402 3607625 3724787 3850727 3987830 4135204 4289935 4452433 4625488 4808776
55990D808776J91060K00255K14020K28935K41685K55623K74455K95363L14888
$$ 4808776 4999836 5200091 5414111 5643046 5884731 6140354 6414809 6710172 7025060
55981G025060L35903L62087L91355M21631M57045N01109N50150O00961O58480
$$ 7025060 7360963 7723050 8114405 8536036 8993081 9494190 10044340 10645301 11303781
55972A1303781P28093Q07535Q94881R96949J120742J264744J428891J624995J867212
$$ 11303781 12031874 12839409 13734290 14731239 15851981 17116725 18545616 20170611 22037823
55963B2037823K161944K519168K962890L515727M183015M968136N894788P000306
$$ 22037823 24199767 26718935 29681825 33197552 37380567 42348703 48243491 55243797
55955E5243797Q321034R902961J1811674J4108554J6829103J9995331K3593368
$$ 55243797 63564831 73467792 85279466 99388020 116217123 136212454 159805822
55948A59805822K7450403L1107581L3847579L4858440L3379759K8823612K1018143
$$ 159805822 187256225 218363806 252211385 287069825 320449584 349273196 370291339
55941C70291339J0532382j258498j2591393k1962981k8537414l2151099l3119785
$$ 370291339 380823721 379565223 366973830 345010849 316473435 284322336 251202551
55934B51202551l2049268k9656947k6587749k3304190k0097210j7141467j4518812
$$ 251202551 219153283 189496336 162908587 139604397 119507187 102365720 87846908
55927H7846908j2234260j0261810q583353p181561o020737n058593m266741l623926
$$ 87846908 75612648 65350838 56767485 49585924 43565187 38506594 34239853 30615927
55919C0615927l100592k666632k306296k011581j768237j560563j382969j234668
$$ 30615927 27515335 24848703 22542407 20530826 18762589 17202026 15819057 14584389
55911A4584389j108508r95476q94668q08733p34224o65440o02969n49719n02787
$$ 14584389 13475881 12480405 11585737 10777004 10042780 9377340 8774371 8224652 7721865
55902G721865m57459m15131l79493l48791l19219k92147k70733k52753k33890
$$ 7721865 7264406 6849275 6469782 6120991 5801772 5509625 5238892 4986139 4752249
55893D752249k15001j99566j86798j73641j60775j50509j41369j30685j20018
$$ 4752249 4537248 4337682 4150884 3977243 3816468 3665959 3524590 3393905 3273887
55884C273887j12288j05923r7347q7027p7605o8177n5861m1278k7468j5020l168
$$ 3273887 3161599 3055676 2958329 2871302 2793697 2725520 2669659 2628381 2600913 2585893 2582725
55873B582725N906Q573M328n080j9276l7852n7255p3417q6004r6219j02503j02738
$$ 2582725 2588631 2597204 2601532 2596452 2577176 2539324 2482069 2408652 2322648 2226429 2123926 2021188
55861B021188r8880r4815r1043q5677p9226p3892o9245o3039n5589m9271m4362
$$ 2021188 1922308 1827493 1736450 1650773 1571547 1497655 1428410 1365371 1309782 1260511 1216149
55850A216149l9224l4024l0525k8655k6776k4852k4086k4012k3122k1717k1036
$$ 1216149 1176925 1142901 1112376 1083721 1056945 1032093 1008007 983995 960873 939156 918120
55839I18120k0377j8216j5416j4053j3766j2573j0565r545r429q415o385m984
$$ 918120 897743 879527 864111 850058 836292 823719 813154 803609 794180 785765 779380 774396
55827G74396m555m047l726m899p084q415q827r962j1939j3039j2781j2553j2880
$$ 774396 769841 765794 762068 757169 750085 741670 732843 722881 710942 697903 685122 672569 659689
55814F59689j2594j1053q971o773m258k040j200j344r12M74J819K843M335O401
$$ 659689 647095 636042 627071 620298 616040 614000 612800 611456 610544 611018 612837 615680 620015 626416
55800F26416Q142R153R663R399P876N591L330O88l131p479j0955j3377j5350j6456
$$ 626416 634558 643711 653374 662773 670649 676240 679570 680258 677127 669648 658693 645316 629966 613510
55786F13510j5844j4114j2730j1830j0552r056q376q578q895r271j0043j0516
$$ 613510 597666 583552 570822 558992 548440 539384 531008 522430 513535 504264 494221 483705
55774D83705r806q575q049p808o498m280k515j553q03n65j536k945l374l143l699
$$ 483705 473899 465324 457275 449467 442969 438689 436174 434621 433818 433253 431717 428772 425398 422255 418556
55759D18556m918n306m626m069l849l037j762j379k240l300m025m782n407n412
$$ 418556 413638 408332 403706 399637 395788 392751 390989 389610 387370 384070 380045 375263 369856 364444
55745C64444n532o821q334q025n969m343m025l675k451j225n40K30J104J158N82
$$ 364444 358912 352091 343757 335732 329763 325420 321395 317720 315269 314044 313504 313734 314838 315996 316578
55730C16578P93J728J366j058l609m488m364m641n225n386n233n034m379l184
$$ 316578 317371 319099 320465 319407 315798 311310 306946 302305 297080 291694 286461 281427 277048 273864
55716B73864k362k452k734k538k255k183j688m38P30J146J457K418L539L890L363
$$ 273864 271502 269050 266316 263778 261523 259340 257652 257214 257944 259090 260547 262965 266504 270394 273757
55701B73757K367R84p10k267l411m338n068n231m901m787n121n311m990m572m275
$$ 273757 276124 277108 276398 274131 270720 266382 261314 256083 251182 246395 241274 235963 230973 226401 222126
55686B22126l642k430j137j80O13J359J785J907K166K592K608J944R47o5q86j001
$$ 222126 218484 216054 214917 214737 215350 216709 218494 220401 222567 225159 227767 229711 230658 230593 229707 228706
55670B28706j83N92J30j046j254k14N14M0o16l80L11O78R72J860L386N258P166
$$ 228706 228523 229115 229245 228199 226945 226731 227245 227285 226669 226289 226600 227278 228250 230110 233496 238754 245920
55653B45920Q320P858O221M953M572L943K327N77n18j609l444n379o439o830p261
$$ 245920 254240 262098 268319 273272 277844 281787 284114 284691 284173 282564 279120 273741 267302 260472 253211
55638B53211p595p278o435n524m606l745l399l620l597k901k351k750l515l570
$$ 253211 245616 238338 231903 226379 221773 218028 214629 211009 207412 204511 202160 199410 195895 192325
55624A92325k938k386k049j486p63m83q27j359j625j470j018o78q48j266j157
$$ 192325 189387 187001 184952 183466 182703 182220 181393 180034 178409 176939 175921 175243 174395 173129 171972
55609A71972l87K21O8m18o23o77r17j097q59m27j96p4J52L25K87K68L75J57p70
$$ 171972 171585 171806 171874 171456 170833 170156 169239 168142 167283 166856 166660 166586 166738 167063 167350 167618 167993 168150 167380
55590A67380k065l030l229k504j035L10M58n47j415j221l85L44J005J805K279
$$ 167380 165315 162285 159056 156552 155517 155827 156285 155738 154323 153102 152717 153061 154066 155871 158150
55575A58150J979J384J219J345J124N32P9m9l5J17M78P18L51n40j300j354p25
$$ 158150 160129 161513 162732 164077 165201 165733 165812 165763 165728 165845 166323 167041 167392 166852 165552 164198 163473
55558A63473k6l7r49k035k467k434k818l721m204l695k748k028j432p42l37n24
$$ 163473 163447 163410 162461 160426 157959 155525 152707 148986 144782 141087 138339 136311 134879 134137 133800 133276
55542A33276q42o98k67j13m00r14j432j625j020L87J857K603K539K152J992K384
$$ 133276 132434 131736 131469 131356 130956 130042 128610 126985 125965 126352 128209 130812 133351 135503 137495 139879
55526A39879L166L678L521L235L512L985L779L138L214M122M578L787K438J370
$$ 139879 143045 146723 150244 153479 156991 160976 164755 167893 171107 175229 179807 183594 186032 187402
55512A87402N35k63q83j624l103m786n123l906k885l156l562k896j981k006k263
$$ 187402 187937 187674 186791 185167 182064 177278 172155 168249 165364 162208 158646 155750 153769 151763 149500
55497A49500j444q6K70l77o78j71L92O42Q56R15M80MJ31L68k04j162j233l67K03
$$ 149500 148056 147970 148240 147863 147185 147014 147406 148048 148904 149819 150299 150303 150434 150802 150598 149436 148203 147836 148039
55478A48039m8m16n03p90j308j260m09L28J93m21p80p55o26n28m51k84K55J180
$$ 148039 147991 147575 147072 146282 144974 143714 143305 143633 143826 143405 142625 141870 141244 140716 140265 139981 140236 141416
55460A41416J823J512N96kj15l88j009j383j168p82o41o14m89l48l31m65q35j399
$$ 141416 143239 144751 145347 145345 145230 144842 143833 142450 141282 140500 139859 139245 138756 138408 138077 137612 136777 135378
55442A35378j723j427q04m27k98k6L02K21k04l62j4M44O91P86P90O61N81P30Q33
$$ 135378 133655 132228 131424 130997 130699 130673 130975 131196 130992 130630 130616 131060 131751 132537 133327 133988 134569 135299 136132
55423A36132N08l6k87k45k24o8O34J603K071J920J818K085K220J719P57j83p90
$$ 136132 136640 136604 136317 136072 135848 135780 136414 138017 140088 142008 143826 145911 148131 149850 150607 150424 149634
55406A49634r50q49r52j404j592r91j72j20p05q25j08N76N35K07K89P11R38P64
$$ 149634 148684 147835 146883 145479 143887 142896 142724 142604 141899 141074 140966 141542 142077 142284 142573 143284 144222 144986
55388A44986L54o7l20l87m78o84o33n8M92K70m01l97O15J676J847J248N04j4n0
$$ 144986 145340 145273 144953 144566 144088 143404 142771 142713 143205 143475 143074 142677 143292 144968 146815 148063 148567 148553 148503
55369A48503O38J742K316J772N50n32j182j511j457q78J9P22Q84N44J3m08o35
$$ 148503 149141 150883 153199 154971 155521 154989 153807 152296 150839 149961 149980 150702 151586 152130 152143 151735 151100
55352A51100p87q98q30o05n06n86m69k6J79k91r15r41n91o83j204j253n34Q6j81
$$ 151100 150313 149415 148585 147980 147474 146888 146419 146393 146572 146281 145366 144425 143834 143151 141947 140694 140160 140246 140065
55333A40065r42j198n33N90J356J263N23r1mN98J148J271Q00l04j523j832r25
$$ 140065 139123 137925 137392 137982 139338 140601 141124 141033 141029 141627 142775 144046 144846 144542 143019 141187 140262
55316A40262J58L46M9L11J014J153O02K25L39L94K54M42R21R65N23M27Q25P39
$$ 140262 140420 140766 140815 141126 142140 143293 143895 144120 144459 144853 145107 145549 146470 147435 147958 148385 149210 149949
55298A49949k56j184j225r42j171j636j607j106o16j98L01O66P21P92J146J410
$$ 149949 149693 148509 147284 146342 145171 143535 141928 140822 140206 140008 140309 140975 141696 142488 143634 145044
55282A45044J110M15j38k85n1M00O54K91m71q74o17j47J58L45L00j80n13K37J650
$$ 145044 146154 146569 146431 146146 146095 146495 147149 147440 146969 146095 145478 145331 145489 145834 146134 145954 145441 145678 147328
55263A47328J956N12j001r08J14L30l49n60J20O14J50o49q36l34K48L89Q1k11
$$ 147328 149284 149796 148795 147887 148001 148331 147982 147422 147542 148156 148306 147657 146821 146487 146735 147124 147205 146994
55245A46994J6O48R83O48Q2k24m11o66o51j33L06J8o87j058j021r38o88L9P81
$$ 146994 147010 147658 148641 149289 149371 149147 148736 148070 147419 147286 147592 147610 146923 145865 144844 143906 143218 143257 144038
55226A44038O73k24q73o19J36O55O83M43L80Q18J415J262Q6j009q06K74P37J46
$$ 144038 144711 144487 143614 142995 143131 143786 144469 144912 145292 146110 147525 148787 148873 147864 147058 147332 148069 148215
55208A48215m48k89L7j69m76r5P72J205Q68L34J05m7o18j506j925j251J69J244
$$ 148215 147767 147478 147515 147346 146870 146775 147547 148752 149620 149954 150059 150012 149394 147888 145963 144712 144881 146125
55190A46125J256N30r7j64K22P74J197J245R42O25M83L20J2j61m6j7l64o36l23
$$ 146125 147381 147911 147814 147650 147872 148646 149843 151088 152030 152655 153138 153458 153470 153309 153263 153246 152882 152246 151923
55171A51923J85J33l58m31J25O53Q06J025J518J701J120K95jK98Q12J451K250
$$ 151923 152108 152241 151883 151452 151577 152230 153036 154061 155579 157280 158400 158695 158694 158992 159804 161255 163505
55154A63505K793K545J656Q47N03L32l5n54r64j118r56m40K21N00M9p96j298j179
$$ 163505 166298 168843 170499 171346 171849 172181 172146 171592 170628 169510 168554 168114 168335 168835 168884 168088 166790 165611
55136A65611r08j018j347j343r32o78j009j619j871j461n93K84P26N74K52M40
$$ 165611 164703 163685 162338 160995 160063 159385 158376 156757 154886 153425 152832 153116 153842 154416 154668 155108
55120A55108J222J796J448M99j41j68j06l45n97m53lL85N97P13O97M33K7k39k95
$$ 155108 156330 158126 159574 160073 159932 159764 159658 159313 158716 158263 158260 158645 159242 159955 160652 161085 161112 160873 160578
55101A60578l97p11r86q26j96N80J266J845K123J653M06q27j180p29k29l7J25
$$ 160578 160181 159470 158484 157658 157462 158042 159308 161153 163276 164929 165335 164508 163328 162599 162370 162333 162458
55084A62458L64K89k37p14p51o01n77m79r3J91j13p43j009p04j40N26J349K011
$$ 162458 162822 163111 162874 162160 161409 160808 160231 159752 159659 159850 159737 158994 157985 157281 157141 157667 159016 161027
55066A61027J965J262O68O28O36m2j258k049j809j017o16q02p81J41J524K205
$$ 161027 162992 164254 164922 165550 166186 166144 164886 162837 161028 160011 159395 158593 157812 157953 159477 161682
55050A61682J643M48m92r17j032r09m34L33J102J562J563J195P71N26L35Oj79
$$ 161682 163325 163773 163281 162364 161332 160423 159989 160322 161424 162986 164549 165744 166515 167041 167376 167382 167203
55033A67203J66P05N62l01p75j32Q26Q90J30l44m0M67N79L89K18J02q3l61o77
$$ 167203 167369 168074 168636 168335 167560 167428 168254 169144 169274 168930 168890 169357 169936 170325 170543 170645 170562 170201 169524
55014A69524q34n25K46R16R27M43O3J4K1q9j76j49r4p9j18k50l70j99K50M78J67
$$ 169524 168690 168165 168411 169327 170254 170697 170760 170774 170795 170706 170530 170381 170287 170208 170090 169840 169470 169271 169521 169999 170166
54993A70166k05QO51J025Q53M29j2l81l71J79O68L54l95l89O53J608J502P61L34
$$ 170166 169961 169969 170620 171645 172498 172927 172915 172534 172163 172342 173010 173364 172969 172580 173233 174841 176343 177104 177438
54974A77438K99O4m82q06o39m24p13j370j633r40L13J069P74M7j20L95Q62Q19
$$ 177438 177737 177801 177319 176513 175874 175450 174737 173367 171734 170794 171107 172176 172950 172997 172877 173272 174134 174953
54956A74953N90O07P86Q22O96O14P03R37J203J361J361J292J100N28l85j011q22
$$ 174953 175543 176150 176936 177758 178454 179068 179771 180708 181911 183272 184633 185925 187025 187553 187168 186157 185335
54939A85335k00R5N7L36J041J457J153O34N86J131K084L311M441M873M622M603
$$ 185335 185135 185230 185287 185623 186664 188121 189274 189908 190494 191625 193709 197020 201461 206334 210956 215559
54923B15559N582P158Q275Q480Q155P766P363O687N409L391R52j256k870m148
$$ 215559 221141 228299 236574 245054 253209 260975 268338 275025 280434 283825 284777 283521 280651 276503
54909B76503n530p012q170q614q272p486o816o512o124n062l589k636k479k277
$$ 276503 270973 263961 255791 247177 238905 231419 224603 218091 211967 206905 203316 200680 198201 195924
54895A95924j378l33O4J57Q97K194K855K311J499J614K603L422L456L127L221
$$ 195924 194546 194213 194277 194434 195331 197525 200380 202691 204190 205804 208407 211829 215285 218412 221633
54880B21633M005N194O408P426Q056Q042P306O132M870L435J417j210l782n620
$$ 221633 225638 230832 237240 244666 252722 260764 268070 274202 279072 282507 283924 282714 278932 273312
54866B73312o792p882q957r273q208o303m886m584m673m209l379l107l499l572
$$ 273312 266520 258638 249681 240408 232200 225897 221011 216427 211754 207545 204166 201059 197560 193988
54852A93988k769j857j726k031j872j331j207j492j284l62L21J05m64o79p55j146
$$ 193988 191219 189362 187636 185605 183733 182402 181195 179703 178419 178057 178378 178483 178019 177340 176585 175439
54836A75439j516j250m82K13P89J565K254K117J092J5m48n17o81r28q67l41M18
$$ 175439 173923 172673 172191 172404 173193 174758 177012 179129 180221 180236 179788 179271 178590 177662 176795 176454 176872
54819A76872J060J345J231Q87N78M80N79P44Q51Q23O47L50o7n66r36q93l79L23
$$ 176872 177932 179277 180508 181395 181973 182453 183032 183776 184627 185450 186097 186447 186380 185814 184878 183985 183606 183929
54801A83929Q68J107J046P28K75l0K6L89P86R49P82M11O4j82m86q48q50j25R64
$$ 183929 184797 185904 186950 187678 187953 187923 187949 188338 189124 190073 190855 191266 191330 191148 190662 189814 188964 188839 189803
54782A89803J550J306Q58R49J573K164K355K297K503L496N257O839P092O055N146
$$ 189803 191353 192659 193517 194466 196039 198203 200558 202855 205358 208854 214111 220950 228042 234097 239243
54767B39243N477O559P242P337P409P309O220M148K179P79r49l597o016o720o121
$$ 239243 244720 251279 258521 265858 273267 280576 286796 290944 293123 293902 292953 289356 283340 276620 270499
54752B70499o039p095p971p506o262n315m553l294j875j365j867k289j968j414
$$ 270499 264460 257365 249394 241888 235626 230311 225758 222464 220589 219224 217357 215068 213100 211686
54738B11686j143q08o3N61M59M9K23J123K198L192M230N137N540N601N896O458
$$ 211686 210543 209735 209672 210233 210692 210741 210964 212087 214285 217477 221707 226844 232384 237985 243881 250339
54722B50339O681O296N738N376N003M298L268J916J8k425m893o774p842q133p780
$$ 250339 257020 263316 269054 274430 279433 283731 286999 288915 288933 286508 281615 274841 266999 258866 251086
54707B51086p115o556o156n588m691l701k869k285k107k510l178l424k995k321
$$ 251086 243971 237415 231259 225671 220980 217279 214410 212125 210018 207508 204330 200906 197911 195590
54693A95590j803j353q29l61N8O46J248J285O65J13R0P8m39r55p46j28L0k37r6
$$ 195590 193787 192434 191605 191244 191302 191948 193196 194481 195146 195259 195349 195427 194988 194033 193287 193159 193189 192952 192856
54674A92856O21J089Q52N41P92J193R77L00N6N06P74J4j321j908j162J7L94j23
$$ 192856 193477 194566 195418 195959 196751 197944 198921 199221 199277 199783 200557 200571 199250 197342 196180 196197 196591 196468
54656A96468n67k70M38R00R47Q25P35P53Q15O41q2j161j858j619o22M78J081Q59
$$ 196468 195901 195631 196069 196969 197916 198741 199476 200229 201044 201685 201603 200442 198584 196965 196343 196821 197902 198761
54638A98761q2j101j425r15j20M80Q06P33K1r97j359o00N80J230J210Q59K47o05
$$ 198761 198679 197578 196153 195238 195118 195598 196404 197137 197158 196161 194802 194202 194782 196012 197222 198081 198328 197723
54620A97723j234j218q71p57p69l74M71J197J377J006L00l23k68N87J462J494
$$ 197723 196489 195271 194400 193643 192874 192500 192971 194168 195545 196551 196851 196528 196260 196847 198309 199803
54604A99803Q60M27M84M91N5n23p47m48K08P72O49k80j230j239l14O45J042J109
$$ 199803 200663 201090 201574 202065 202120 201597 200850 200402 200610 201382 202031 201751 200521 199282 198968 199613 200655 201764
54586B01764J185J142P48J70k42m08n46q53j214j235o23L47R49Q35M07J48j3l27
$$ 201764 202949 204091 204839 205009 204767 204359 203813 202960 201746 200511 199888 200235 201184 202019 202426 202574 202561 202234
54568B02234n71l69J43N49Q17J165J446J331R27O17M11N4l07k79R6M09O05R42
$$ 202234 201663 201294 201437 201986 202803 203968 205414 206745 207672 208289 208700 208754 208447 208168 208264 208673 209278 210220
54550B10220J263J077M26p1j62k79p06j031p90q8O29J024R79O30M39P58J290J396
$$ 210220 211483 212560 212986 212915 212753 212474 211768 210737 209947 209859 210488 211512 212491 213121 213560 214318 215608 217004
54532B17004R86N97N25M99K84O5j7j79n72r36r30n60r2K16K98L83Q07J445J578
$$ 217004 217990 218587 219112 219611 219895 219960 219943 219764 219192 218256 217326 216766 216674 216890 217188 217571 218378 219823 221401
54513B21401P98k83p80o83n99o17l43R6P9m35p85o99n32l23L64J375J847J554
$$ 221401 222199 221916 221136 220453 219854 219237 218894 218990 219069 218634 217849 217150 216618 216295 216659 218034 219881 221435
54495B21435J379J837K158J492K58n79q59j026j173j115r60q77o08J07R33J397
$$ 221435 222814 224651 226809 228301 228559 227980 227121 226095 224922 223807 222847 221970 221362 221469 222402 223799
54479B23799J615J966K324K247J768J369J300J405J471J411J190R46R24J051Q88
$$ 223799 225414 227380 229704 231951 233719 235088 236388 237793 239264 240675 241865 242811 243735 244786 245674
54464B45674K91k76m03k78j83L0M56N94n6j136j789j618q48J85J102J371P77j03
$$ 245674 245965 245689 245286 245008 244825 244855 245311 245905 245849 244713 242924 241306 240458 240643 241745 243116 243893 243790
54446B43790m23l1N10O70L56k69r05j197j071q13n77j97K34J34o25j176p15K62
$$ 243790 243367 243336 243846 244516 244872 244603 243698 242501 241430 240617 240040 239843 240077 240211 239586 238410 237695 237957
54428B37957O70M04K57M87M76j13p90j067j007p45j68O09J068R85P09N18K57j05
$$ 237957 238627 239031 239288 239775 240251 240138 239348 238281 237274 236529 236361 236970 238038 239023 239732 240250 240507 240402
54410B40402j32L24N88o7j341k122j730n64L81M41k33q39o65K04R59R81M98J80
$$ 240402 240270 240594 241182 241115 239774 237652 235922 235358 235739 236180 235947 235108 234443 234647 235606 236587 237085 237265
54392B37265L00N44N55L60K15K68M88P44Q34N65Km28l38J28M39L67J82P2k13p93
$$ 237265 237565 238109 238664 239024 239239 239507 239995 240739 241573 242138 242140 241712 241374 241502 241941 242308 242490 242562 242349 241556
54372B41556j127o34L38Q09L97k79m78j4R03J910K389J908R83O76J193J549J009
$$ 241556 240429 239795 240133 240942 241339 241060 240582 240568 241471 243381 245770 247678 248661 249337 250530 252079 253088
54355B53088N1n90r95j447j529p81K22M99M1l76m67o31r64j112j062j162j258
$$ 253088 253139 252549 251554 250107 248578 247797 248019 248518 248559 248183 247716 247085 246121 245009 243947 242785 241527
54338B41527q05L7K92m68j464j768j370p66j60M26P25N24J00m2K23N77O32J73
$$ 241527 240722 240759 241051 240583 239119 237351 235981 235215 235055 235481 236206 236730 236830 236788 237011 237588 238220 238393
54320B38393p23j662k138j869r25L81J514J831J109m4p34o83k58K98J013J641
$$ 238393 237670 236008 233870 232001 231076 231457 232971 234802 235911 235867 235133 234450 234192 234490 235503 237144
54304B37144J653J015L91K66L82L01K4k68n92r48j132j077j062j160r36j22P98
$$ 237144 238797 239812 240203 240469 240851 241152 241176 240908 240316 239368 238236 237159 236097 234937 234001 233879 234677
54287B34677J128Q96P03Q71J140J164Q84M24p0m29n46m75l05j10q0m86j238j700
$$ 234677 235805 236701 237404 238275 239415 240579 241463 241887 241817 241388 240842 240367 240062 239952 239872 239386 238148 236448
54269B36448j321l83K27l5r26j843k381k404j915j049j26M35M02jj50M53J557
$$ 236448 235127 234744 234971 234936 234010 232167 229786 227382 225467 224418 224292 224727 225129 225128 224978 225431 226988
54252B26988K270J931P69m41j196j457j281p27j45j22q50j745j962j227m3R53
$$ 226988 229258 231189 231958 231517 230321 228864 227583 226856 226711 226589 225739 223994 222032 220805 220762 221715
54236B21715J609K163K677K796K240J352Q26Q14O59k03j281j501o37K48J08p84
$$ 221715 223324 225487 228164 230960 233200 234552 235378 236192 236851 236648 235367 233866 233229 233477 233585 232801
54220B32801j282q26J10R24J521J869J617O46m39r33r08r41j200j330j160q61
$$ 232801 231519 230693 230803 231727 233248 235117 236734 237380 236941 236008 235100 234159 232959 231629 230469 229608
54204B29608n24j18K5n48j597k218j949j274p60l06L38R53J215J218J145Q65L42
$$ 229608 229084 228966 228991 228443 226846 224628 222679 221405 220645 220339 220677 221630 222845 224063 225208 226073 226415
54187B26415OJ72M97N67N55O79N42k15r77q45p1J52o39j617j847j305n33QR0k26
$$ 226415 226421 226593 227090 227657 228212 228891 229433 229218 228241 227396 227325 227477 226838 225221 223374 222069 221536 221544 221634 221408
54167B21408n02l68m3O8R7L86N82lj105j573r64j24J26K2P9K24J93J54K17N1m01
$$ 221408 220906 220538 220495 220563 220660 221046 221628 221625 220520 218947 217983 217859 217985 218007 218086 218310 218503 218657 218874 218925 218524
54146B18524m52L74J414J680J174O57M41K65R5K82Q79J465J716J652J325P86K91
$$ 218524 218072 218446 219860 221540 222714 223371 223812 224077 224172 224454 225333 226798 228514 230166 231491 232277 232568
54129B32568J74M07O90R16J260J779K237K313J845R07j14p02p21n18l85j40M29
$$ 232568 232742 233149 233839 234755 236015 237794 240031 242344 244189 245096 244982 244280 243559 243041 242656 242516 242945
54112B42945J068J376J364J311J229R76O68N13L52j20p60j079r89r23j153j462
$$ 242945 244013 245389 246753 248064 249293 250269 250937 251450 251802 251682 250922 249843 248854 247931 246778 245316
54096B45316j552j450j333j272j269j277j143p22j73J43J14QN8J26p0m97p38l98
$$ 245316 243764 242314 240981 239709 238440 237163 236020 235298 235125 235268 235382 235390 235448 235574 235504 235007 234269 233871
54078B33871L99R82Q25K35L8M91Q83N15l01o64k32N30J073J232J010M76j29n99
$$ 233871 234270 235252 236077 236312 236350 236841 237724 238239 237938 237274 237042 237572 238645 239877 240887 241363 241234 240635
54060B40635j118j938k670k504j347k01%l74j65J036K347K670J961J107Q28J014
$$ 240635 239517 237579 234909 232405 231058 230857 230857 230483 230318 231354 233701 236371 238332 239439 240267 241281
54044B41281J184J230J357J545J566J555J967K749L103K507J588J399K072K810
$$ 241281 242465 243695 245052 246597 248163 249718 251685 254434 257537 260044 261632 263031 265103 267913
54030B67913L073L157L464L838L819L236K324J568J461K096K866K922K072R40
$$ 267913 270986 274143 277607 281445 285264 288500 290824 292392 293853 295949 298815 301737 303809 304749
54016C04749K07J0J16K66J40n53j611k268j972j104n73q08j440j915k137k349
$$ 304749 304956 304966 305082 305348 305488 304935 303324 301056 299084 297980 297407 296599 295159 293244 291107 288758
54000B88758k643k746k430j899j610j638j568j130o00k81L9O51J240J270R11Q20
$$ 288758 286115 283369 280939 279040 277430 275792 274224 273094 272494 272213 272252 272903 274143 275413 276324 277144
53984B77144J008P71m6n79k37L27J68n83j092j091r76q54m13K97O69L62k45n57
$$ 277144 278152 278923 278877 278298 278061 278388 278556 277973 276881 275790 274814 273960 273547 273844 274513 274875 274630 274073
53966B74073k83N64J740K799L455M033M952N881O070N755O332Q645J1709J3914
$$ 274073 273790 274354 276094 278893 282348 286381 291333 297214 303284 309039 315371 324016 335725 349639
53952C49639J5091J6646J9708K3887K7880L0618L1568L0384K6738K0522J2130
$$ 349639 364730 381376 401084 424971 452851 483469 515037 545421 572159 592681 604811
53941F04811K523o996j5251k1445k5075k6003k4850k2883k1009j8948j5936j2156
$$ 604811 607334 600338 585087 563642 538567 512564 487714 464831 443822 424874 408938 396782
53929C96782q893p159o719o640o271n472m350l219k435j983j488q60n00n08k37
$$ 396782 387889 380730 374011 367371 361100 355628 351278 348059 345624 343641 342153 341293 340793 340285 340048
53914C40048Q24K130K731K597K516K823L030K842K683K918L164K859K000R34k14
$$ 340048 340872 343002 345733 348330 350846 353669 356699 359541 362224 365142 368306 371165 373165 374099 373885
53899C73885j441k424k673k133j362j094j713k991m187m572m066l256k686k356
$$ 373885 372444 370020 367347 365214 363852 362758 361045 358054 353867 349295 345229 341973 339287 336931
53885C36931k029j779j873k288k650k690k514k433k584k752k586k033j552j680
$$ 336931 334902 333123 331250 328962 326312 323622 321108 318675 316091 313339 310753 308720 307168 305488
53871C05488k389l059l090k391j257j59L72O5o76j048p95n35q55j490j731j395
$$ 305488 303099 300040 296950 294559 293302 293143 293515 293580 292904 291856 291061 290526 289671 288181 286450 285055
53855B85055q87n84n79q92j398j617j123k15K77P5r0N85J855K534J818K58p65
$$ 285055 284168 283584 283005 282113 280715 279098 277975 277760 278037 278112 278022 278607 280462 282996 284814 285072 284307
53838B84307n42J99K89l70p99m73j11m96j172j128m61l42j233k060j657l41O34
$$ 284307 283765 283964 284253 283883 283084 282611 282500 282004 280832 279704 279243 278901 277668 275608 273951 273610 274244
53821B74244P85P60J067J213N51n30r47l68K98J75l80l40M95J343J759K217L045
$$ 274244 275029 275789 276856 278069 278620 278090 277143 276775 277073 277248 276868 276528 277023 278366 280125 282342 285387
53804B85387L536K858J417N15P67J586K214K600K997L363L521L567L707L830L606
$$ 285387 288923 291781 293198 293713 294480 296066 298280 300880 303877 307240 310761 314328 318035 321865 325471
53789C25471L000K442K368K715K963K742K166J523Q06J3l66K47J464K075J614
$$ 325471 328471 330913 333281 335996 338959 341701 343867 345390 346196 346209 345843 346090 347554 349629 351243
53774C51243J116J748L278M695N807P232R093J0855J2480J4635J7422J9827K0781
$$ 351243 352359 354107 357385 362080 367887 375119 384212 395067 407547 422182 439604 459431 480212
53761D80212K0020J7508J2912O315j198q301j4352j9072k1885k2400k1206j9416
$$ 480212 500232 517740 530652 536967 535769 527468 513116 494044 472159 449759 428553 409137
53749D09137j7517j5284j2694j0235q242o613n258m393m064l833l219k254j394
$$ 409137 391620 376336 363642 353407 345165 338552 333294 328901 324837 321004 317785 315531 314137
53736C14137r82r56j023r09n16O9O60J127J456J733K001K160K068J734J352J085
$$ 314137 313155 312199 311176 310267 309751 309820 310480 311607 313063 314796 316797 318957 321025 322759 324111 325196
53720C25196R04P74P90J024J299J412J409J485J656J860K248L015L959M558M598
$$ 325196 326100 326874 327664 328688 329987 331399 332808 334293 335949 337809 340057 343072 347031 351589 356187
53705C56187M418M480M969N819O824P688Q260Q741R377J0054J0477J0713J0979
$$ 356187 360605 365085 370054 375873 382697 390385 398645 407386 416763 426817 437294 448007 458986
53692D58986J0948R951P971N815M026K216j48k841n152o620p169o940o360o021
$$ 458986 469934 479885 487856 493671 497697 499913 499765 496924 491772 485152 477983 471043 464683 458662
53678D58662o080o131n917n689n533n000l882k762k211j954j550j331j781k402
$$ 458662 452582 446451 440534 434845 429312 424312 420430 417668 415457 413503 411953 410622 408841 406439
53664D06439k161j005J9J66k92p99j102j096p52m45p14j495k241k751l221l435
$$ 406439 404278 403273 403292 403458 403166 402367 401265 400169 399417 398972 398258 396763 394522 391771 388550 385115
53648C85115k820j543o50o62q11k73O13R74P27M69M73N55O66Q90J008P78N01O64
$$ 385115 382295 380752 380102 379440 378629 378356 378969 379943 380670 381139 381612 382167 382833 383723 384731 385509 386010 386674
53630C86674J100J188Q77P90J188J549J464J293J536K113K697L282L859L996L435
$$ 386674 387774 388962 389839 390629 391817 393366 394830 396123 397659 399772 402469 405751 409610 413606 417041
53615D17041K847L171M246M861M396L635L605M198M548M300L837L499L212K927
$$ 417041 419888 423059 427305 432166 436562 440197 443802 448000 452548 456848 460685 464184 467396 470323
53601D70323K852L170L839M657N229N042M042K993K644K672K171J143N56P83R41
$$ 470323 473175 476345 480184 484841 490070 495112 499154 502147 504791 507463 509634 510777 511333 512116 513057
53586E13057L26m71o24l84m66p34o23m41j002k156k846k701k464k614k608k022
$$ 513057 513383 512912 512288 511904 511438 510704 510081 509640 508638 506482 503636 500935 498471 495857 493249 491227
53570D91227j465j734k659l442l678l485l037k497k164k144k049j431l77N77J000
$$ 491227 489762 488028 485369 481927 478249 474764 471727 469230 467066 464922 462873 461442 461065 461642 462642
53555D62642P85J72k29K78J705L066L262K159O74j52JO16R21P63Q92K061L818
$$ 462642 463427 463599 463370 463648 465353 468419 471681 473840 474514 474362 474363 474979 475900 476663 477555 479616 483434
53538D83434M822M533L933M127M880N238N096N236O059P137Q045Q936J0067J1355
$$ 483434 488256 492789 496722 500849 505729 510967 516063 521299 527358 534495 542540 551476 561543 572898
53524E72898J2517J3318J3624J3615J3898J4932J6387J7533J8312J9373K0983
$$ 572898 585415 598733 612357 625972 639870 654802 671189 688722 707034 726407 747390
53513G47390K2523K3340K3553K3780K4439K5602K7106K8560K9656L0658L2212
$$ 747390 769913 793253 816806 840586 865025 890627 917733 946293 975949 1006607 1038819
53502A038819L4329L5971L6085L4799L3269L2545L2909L3995L5215L6194L7055
$$ 1038819 1073148 1109119 1145204 1180003 1213272 1245817 1278726 1312721 1347936 1384130 1421185
53491A421185L8118L9235L9770L9427L8604L7532L5606L2190K7728K3416J9947
$$ 1421185 1459303 1498538 1538308 1577735 1616339 1653871 1689477 1721667 1749395 1772811 1792758
53480A792758J7267J5321J4248J3780J3328J2865J3018J3967J4815J4473J2804
$$ 1792758 1810025 1825346 1839594 1853374 1866702 1879567 1892585 1906552 1921367 1935840 1948644
53469A948644J0561Q469O714M929K490r47m916q483j1277j3767j6303j8425j9676
$$ 1948644 1959205 1967674 1974388 1979317 1981807 1980860 1975944 1967461 1956184 1942417 1926114 1907689 1888013
53456A888013k0557k1968k3910k5479k6162k6507k7413k9215l1533l3548l4353
$$ 1888013 1867456 1845488 1821578 1796099 1769937 1743430 1716017 1686802 1655269 1621721 1587368
53445A587368l3554l1848l0562l0341l0512l0012k8639k7054k5760k4530k2829
$$ 1587368 1553814 1521966 1491404 1461063 1430551 1400539 1371900 1344846 1319086 1294556 1271727
53434A271727k0489j7876j5556j3857j2592j1161q968n895k395Q60L461N499P373
$$ 1271727 1251238 1233362 1217806 1203949 1191357 1180196 1171228 1165333 1162938 1163798 1167259 1172758 1180131
53421A180131R445J1796J4285J6698J8837K0618K2204K3914K5876K7764K9128
$$ 1180131 1189576 1201372 1215657 1232355 1251192 1271810 1294014 1317928 1343804 1371568 1400696
53410A400696K9977L0887L2475L4812L7463L9938M2052M3927M5791M7871N0340
$$ 1400696 1430673 1461560 1494035 1528847 1566310 1606248 1648300 1692227 1738018 1785889 1836229
53399A836229N3306N6668O0037O2952O5254O7240O9397P2025P5013P7777P9476
$$ 1836229 1889535 1946203 2006240 2069192 2134446 2201686 2271083 2343108 2418121 2495898 2575374
53388B575374P9638P8772P8059P8154P8505P8072P6484P4153P1463O8362O4705
$$ 2575374 2655012 2733784 2811843 2889997 2968502 3046574 3123058 3197211 3268674 3337036 3401741
53377C401741O0611N6355N2205M8322M4595M0698L6557L2651K9382K6258K2213
$$ 3401741 3462352 3518707 3570912 3619234 3663829 3704527 3741084 3773735 3803117 3829375 3851588
53366C851588J6682R910K212o442j5954k5841l5756m5741n5648o4707p2080p7552
$$ 3851588 3868270 3878180 3880392 3873950 3857996 3832155 3796399 3750658 3695010 3630303 3558223 3480671
53354C480671q1435q4106q5861q6897q7107q6230q4418q2347q0542p8996p7621
$$ 3480671 3399236 3315130 3229269 3142372 3055265 2969035 2884617 2802270 2721728 2642732 2565111
53343B565111p6600p5916p5101p3907p2764p1957p0825o8497o5150o1788n8895
$$ 2565111 2488511 2412595 2337494 2263587 2190823 2118866 2048041 1979544 1914394 1852606 1793711
53332A793711n5944n2348m8221m4125m0441l7088l3645k9782k5787k2378j9809
$$ 1793711 1737767 1685419 1637198 1593073 1552632 1515544 1481899 1452117 1426330 1403952 1384143
53321A384143j7566j5318j3572j2763j2192j0858q964p503o516n009k723p27K44
$$ 1384143 1366577 1351259 1337687 1324924 1312732 1301874 1292910 1285407 1278891 1273882 1271159 1270432 1270676
53308A270676R92K641N084P320Q802R727J0478J1468J3142J5521J8011K0155K2198
$$ 1270676 1271668 1274309 1279393 1286713 1295515 1305242 1315720 1327188 1340330 1355851 1373862 1394017 1416215
53295A416215K4452K6556K8059K9312L1066L3362L5568L7301L8587L9214L8815
$$ 1416215 1440667 1467223 1495282 1524594 1555660 1589022 1624590 1661891 1700478 1739692 1778507
53284A778507L7715L6832L6426L5681L3895L1479K9278K7400K5344K2951K0569
$$ 1778507 1816222 1853054 1889480 1925161 1959056 1990535 2019813 2047213 2072557 2095508 2116077
53273B116077J8345J5966J3210J0298P436M348N70l973q822j3377j7274k0566
$$ 2116077 2134422 2150388 2163598 2173896 2181332 2185680 2186250 2182277 2173455 2160078 2142804 2122238
53261B122238k3670k7093l0975l4910l8376m1241m3705m5832m7442m8490m9109
$$ 2122238 2098568 2071475 2040500 2005590 1967214 1925973 1882268 1836436 1788994 1740504 1691395
53250A691395m9230m8550m7091m5425m4010m2695m1213l9852l9109l8945l8931
$$ 1691395 1642165 1593615 1546524 1501099 1457089 1414394 1373181 1333329 1294220 1255275 1216344
53239A216344l9012l9414l9895l9821l9074l8198l7445l6277l4223l1578k8859
$$ 1216344 1177332 1137918 1098023 1058202 1019128 980930 943485 907208 872985 841407 812548
53228H12548k6110k3292k0824j9132j7936j6662j5280j4104j3013j1590j0042
$$ 812548 786438 763146 742322 723190 705254 688592 673312 659208 646195 634605 624563
53217F24563r228r506j0174j0362r989r532r278r186r265r548r802r643q991q117
$$ 624563 615335 605829 595655 585293 575304 565772 556494 547308 538043 528495 518693 509050 500059 491942
53203D91942p239o362n605n333n658o087o092n875o062o568o389n030l546l444
$$ 491942 484703 478341 472736 467403 461745 455658 449566 443691 437629 431061 424672 419642 416096 412652
53189D12652m709n771n552m681m228m061l273j818p58q52j624k144k091j801j608
$$ 412652 407943 402172 396620 391939 387711 383650 380377 378559 377801 376949 375325 373181 371090 369289 367681
53174C67681j610j743j764j270j60R51J183M04n55q51o06n04o90o05J2N67M65
$$ 367681 366071 364328 362564 361294 361134 362085 363268 363672 363117 362266 361660 361156 360466 359861 359873 360440 360905
53157C60905Q1K37R60J457J348J216J611K167K175J598R93O88N80N69P17Q90P21
$$ 360905 360986 361223 362183 363640 364988 366204 367815 369982 372157 373755 374748 375436 376016 376585 377302 378192 378913
53140C78913Q8o48j020r49p49p13p76o18j46K44J20l18m28o2J44k59p40m77L85
$$ 378913 379001 378353 377333 376384 375635 374922 374146 373528 373382 373626 373746 373428 373000 372938 373082 372823 372083 371606 371991
53121C71991P99J10j198k153k299j880j396j144j062r18p12q09j458k238k410
$$ 371991 372790 372900 371702 369549 367250 365370 363974 362830 361768 360850 360138 359329 357871 355633 353223
53106C53223j853j285j323j698j712j240q17q04q81o25j85j1k8L53J234J763J068
$$ 353223 351370 350085 348762 347064 345352 344112 343295 342491 341610 340985 340800 340789 340761 341114 342348 344111 345179
53089C45179n61j928k242j690p90J76R42J138P79M31M79O27M68J65J42L75M94
$$ 345179 344618 342690 340448 338758 337968 338144 339086 340224 341003 341434 341913 342540 343008 343173 343315 343690 344184
53072C44184L65J13j97m63l66K28P94O39k43j191j694j760j636j584j786k063
$$ 344184 344549 344662 344465 344002 343636 343864 344658 345297 345054 343863 342169 340409 338773 337189 335403 333340
53056C33340j823q02K93N04k14j096j682k055k060j278M1Q94Q26N75R89J879K443
$$ 333340 331517 330715 331008 331512 331298 330202 328520 326465 324405 323127 323168 324062 324888 325463 326452 328331 330774
53039C30774K337J781J061M11J25K63M40L07j6k19l11m67o62p72q46r50r46p21
$$ 330774 333111 334892 335953 336364 336489 336752 337192 337499 337483 337264 336953 336486 335824 335052 334206 333256 332310 331589
53021C31589m22j68J88P28J140J060O00J88O1K01N21Q35Q46N45M05P88J331J313
$$ 331589 331167 330999 331187 331915 333055 334115 334715 334903 334964 335165 335686 336521 337367 337912 338317 339105 340436 341749
53003C41749O30q9k99r3M2j24m17n64o22r11j477j758j147R2J010J168J058J169
$$ 341749 342379 342290 341991 341898 341940 341816 341399 340835 340213 339302 337825 336067 334920 335012 336022 337190 338248 339417
52985C39417J221Q60M77O42J093J090N76K01K52L10N2k82l97l10j16J93N17O66
$$ 339417 340638 341498 341975 342617 343710 344800 345376 345577 345829 346139 346191 345909 345512 345202 345086 345279 345796 346462
52967C46462P33J001J386J436J014N19K81J91Q6Q6K90N33O33N80L36k21r38j427
$$ 346462 347195 348196 349582 351018 352032 352551 352832 353023 353109 353195 353485 354018 354651 355231 355567 355346 354408 352981
52949C52981j616j821k134k184j853j663k038k637k794k323j438l41O17Q08M3
$$ 352981 351365 349544 347410 345226 343373 341710 339672 337035 334241 331918 330480 330139 330756 331564 331607
52934C31607p94o50L14R19N42k86q80j203j337r59P4J127J380Q24J21l21o45r79
$$ 331607 330813 330163 330477 331396 331938 331652 330772 329569 328232 327273 327347 328474 329854 330678 330799 330478 329833 328854
52916C28854j076o54J52Q72J065O63M7k39q3K1l75r53r87m49k18r07j878j959
$$ 328854 327778 327124 327276 328148 329213 329876 329923 329684 329601 329622 329247 328294 327307 326858 326640 325733 323855 321896
52898C21896r30K16N32J57j26L1L32N06P17J207J822K113J798R74l6q58j159p83
$$ 321896 320966 321182 321714 321871 321745 321776 322108 322614 323331 324538 326360 328473 330271 331245 331209 330351 329192 328409
52880C28409J7O26N60k5n12n39l54l43l91p8O04J089R53M57J83K76L92K34q7k36
$$ 328409 328426 329052 329612 329587 329075 328536 328182 327839 327448 327370 327974 329063 330016 330473 330656 330932 331324 331558 331471 331235
52860C31235J1N77J069J012L26m50o44j87L46M82L49K95L28J44l68r48j235j081
$$ 331235 331246 331823 332892 333904 334230 333780 333136 332949 333295 333777 334126 334421 334749 334893 334525 333577 332342 331261
52842C31261o33k49l31r92j880k429k374j907j359q48l52M0J29j84p28j152j102
$$ 331261 330628 330379 330048 329056 327176 324747 322373 320466 319107 318259 317907 317947 318076 317892 317164 316012 314910
52825C14910m49N18J188J138N50l8l74o37q28m93O07J864K392K219K245L015M063
$$ 314910 314461 314979 316167 317305 317855 317817 317443 316806 315978 315485 316092 317956 320348 322567 324812 327827 331890
52808C31890M769N233N750N909M982L058J029o34k356m438o230o832o279n456
$$ 331890 336659 341892 347642 353551 358533 361591 362620 361986 359630 355192 348962 342130 335851 330395
52794C30395m981m677m137l419k928k865k970k777k037r08K12R75J188Q24Q2n72
$$ 330395 325414 320737 316600 313181 310253 307388 304418 301641 299604 298696 298908 299883 301071 301895 301977 301405
52778C01405p51n68n35q64j164r55k97M00Q87J182J295J176R17O73M43J78J9J35
$$ 301405 300654 300086 299551 298687 297523 296568 296271 296671 297558 298740 300035 301211 302128 302801 303244 303422 303441 303576
52760C03576L37K73k0j15J82N88Q12Q69Q16N34N6k22j8M93J025J580K072J980
$$ 303576 303913 304186 304166 304051 304233 304821 305633 306502 307318 307852 307908 307686 307668 308161 309186 310766 312838 314818
52742C14818R95k01n50k9K40m36j345j370n05L14N19M54O36J099J619K071K325
$$ 314818 315813 315612 315062 315033 315273 314837 313492 312122 311617 311931 312450 312904 313540 314639 316258 318329 320654
52725C20654K170J628J094Q07L84o95k171l026k587j356n15o66j351j732j492
$$ 320654 322824 324452 325546 326353 326737 326042 323871 320845 318258 316902 316387 315721 314370 312638 311146
52710C11146r78o37n33l77K2N27Q30Q55Q44R93J118Q74K42l92p59j000j226j099
$$ 311146 310168 309531 308998 308621 308643 309170 310000 310855 311699 312692 313810 314684 314926 314534 313775 312775 311549 310450
52692C10450k68Q58J334P82o5k50L43J069J434J464J338J115Q80P49N98J78l72
$$ 310450 310182 311040 312374 313156 313091 312841 313184 314253 315687 317151 318489 319604 320484 321233 321831 322009 321637
52675C21637n28j41K30R3j34K99J249J688J052J9m49k81p3mL47J153J882J976
$$ 321637 321109 320968 321198 321291 321157 321456 322705 324393 325445 325464 325015 324734 324661 324657 325004 326157 328039 330015
52657C30015J540J116R77R51Q27O98Q67J497K299K623K007P17n19j330k011k866
$$ 330015 331555 332671 333648 334599 335426 336124 336991 338488 340787 343410 345417 346134 345615 344285 342274 339408
52641C39408l538l413k491j479j001j004j025p49k03M14R60J475K092K768L267
$$ 339408 335870 332457 329966 328487 327486 326482 325457 324708 324505 324919 325879 327354 329446 332214 335481
52626C35481L506L694L871L592K449Q01n86j511k342l077l109k252j320j122j406
$$ 335481 338987 342681 346552 350144 352593 353394 352808 351297 348955 345878 342769 340517 339197 338075 336669
52611C36669j311o11J13L22j5o87j450j926j775j060k07M56Q77J105J167J114
$$ 336669 335358 334747 334860 335182 335167 334480 333030 331104 329329 328269 328062 328518 329395 330500 331667 332781
52595C32781J000Q36P18P91R15O82O5l22l0N06N86L35M54J043J451J318J008Q94
$$ 332781 333781 334617 335335 336126 337041 337723 337788 337466 337436 337942 338528 338863 339317 340360 341811 343129 344137 345031
52577C45031R17R98J243J474J238O06L03O54R98O08k61q31q00m40k7K25L3o14
$$ 345031 345948 346946 348189 349663 350901 351507 351810 352464 353462 354070 353809 352978 352178 351738 351711 351936 351969 351355
52559C51355j158j057m80K0K83M68N26L18J61N63J347J660J082K02j83p2j03o24
$$ 351355 350197 349140 348660 348680 348963 349431 349957 350275 350436 350999 352346 354006 355088 355290 355107 355035 354932 354308
52541C54308j238j325q09k42j25l15k96J24O24Q45O90J96m85r12o63k0K80J00
$$ 354308 353070 351745 350936 350694 350569 350254 349958 350082 350706 351551 352241 352437 351952 351040 350377 350357 350637 350737
52523C50737R8N30O99J61l34PO31N34M8M27J729K562K155J482J797K990L991M085
$$ 350737 350835 351365 352064 352225 351891 351898 352529 353063 353111 353538 355267 357829 359984 361466 363263 366253 370244 374329
52505C74329L273J946Q15O17J325J978J751P99k18r04j134p98j48J14m35j414
$$ 374329 377602 379548 380363 380980 382305 384283 386034 386833 386615 385711 384577 383779 383631 383745 383310 381896
52489C81896k248k805k982k363r73J42k6j059j650j303o85l91l15k57k81k90N9
$$ 381896 379648 376843 373861 371498 370525 370667 370641 369582 367932 366629 365944 365553 365238 364981 364700 364410 364469
52472C64469P72J420J784K012K030J597J077J300K189K460J316k88q70l37K51
$$ 364469 365241 366661 368445 370457 372487 374084 375161 376461 378650 381110 382426 382138 381268 380931 381182
52457C81182L49K77J03o49j929k836k760k123j601j279j009r57j208j353j116
$$ 381182 381531 381808 381911 381262 379333 376497 373737 371614 370013 368734 367725 366768 365560 364207 363091
52442C63091r12j149j387r74k12K0l32m56j18o8p11j269r31r1K22k66r36j122
$$ 363091 362179 361030 359643 358669 358457 358477 358145 357689 357571 357503 356792 355523 354592 354501 354723 354457 353521 352399
52424C52399n55O38J780J896Q52j15K43J498K125J579P95N70N97M63N90J504K853
$$ 352399 351844 352482 354262 356158 357010 356895 357138 358636 360761 362340 363135 363705 364302 364765 365355 366859 369712
52407C69712L901M609N518O810Q087Q957R370R472R438R308Q723P037M046M07
$$ 369712 373613 378222 383740 390550 398637 407594 416964 426436 435874 445182 453905 460942 464988 465395
52393D65395k943n563p426q405q372p619o720n922n131m313l554k766j809q86
$$ 465395 462452 456889 449463 441058 432686 425067 418347 412425 407294 402981 399427 396661 394852 393966
52379C93966m42m97n52k15L24O50O98P95J253K028K728K953K679K226J759J092
$$ 393966 393524 393027 392475 392260 392584 393234 393932 394727 395980 398008 400736 403689 406368 408594 410353 411445
52363D11445J28p45j044q57o91p31p14m62j52J28N13R09Q96L76k4L47J261J852
$$ 411445 411573 410828 409784 408927 408236 407505 406791 406329 406177 406305 406818 407727 408623 408999 408975 409322 410583 412435
52345D12435J672J136Q97J098J368J350J079R76J478K581L708M215M119M100M621
$$ 412435 414107 415243 416140 417238 418606 419956 421035 422011 423489 426070 429778 433993 438112 442212 446833
52330D46833N287N408N081N182O178P448Q093Q066P963Q079Q258Q478Q833Q918
$$ 446833 452120 457528 462609 467791 473969 481417 489510 497576 505539 513618 521876 530354 539187 548105
52316E48105Q121O735N974O423P265P606P817Q717R998J0631J0559J0872J2152
$$ 548105 556226 562961 568935 575358 582623 590229 598046 606763 616761 627392 637951 648823 660975
52303F60975J3637J4297J3925J2902J1661J0737J0620J1041J0999R966Q539P417
$$ 660975 674612 688909 702834 715736 727397 738134 748754 759795 770794 780760 789299 796716
52291G96716O430N218M215M060M364M100L112K294K145K038J298K09m92n89m01
$$ 796716 803146 808364 812579 816639 821003 825103 828215 830509 832654 834692 835990 836199 835707 835118 834717
52276H34717k07j49l64o77n01M10J355J508J206J614K968M099M160L957M729O166
$$ 834717 834510 834361 833997 833320 832819 833229 834584 836092 837298 838912 841880 845979 850139 854096 858825 864991
52260H64991O780O098N323N537O317O739O846P238P854Q131Q104Q301Q640Q406
$$ 864991 871771 877869 883192 888729 895046 901785 908631 915869 923723 931854 939958 948259 956899 965305
52246I65305P476O633O392O302N886N472N612O143O475O376O025N571N134M868
$$ 965305 972781 979414 985806 992108 997994 1003466 1009078 1015221 1021696 1028072 1034097 1039668 1044802 1049670
52232A049670M700M246L387K542J977J343M26j52J80Q07N61o14j597j642j149
$$ 1049670 1054370 1058616 1062003 1064545 1066522 1067865 1068291 1068139 1068319 1069126 1069687 1069073 1067476 1065834 1064685
52217A064685p40m94l25l70n18k41O66J728K469L000L575M132M692N545O572O983
$$ 1064685 1063945 1063451 1063126 1062756 1062238 1061997 1062663 1064391 1066860 1069860 1073435 1077567 1082259 1087804 1094376 1101359
52201A101359O333N284M717M531M183L975M752O407P707P822P238O870O953P212
$$ 1101359 1107692 1112976 1117693 1122224 1126407 1130382 1135134 1141541 1149248 1157070 1164308 1171178 1178131 1185343
52187A185343P433P459O917N532L553J544j30j456k538l415m041m387m618n070
$$ 1185343 1192776 1200235 1207152 1212684 1216237 1217781 1217651 1216195 1213657 1210242 1206201 1201814 1197196 1192126
52173A192126n845o538o703o404o016n564m830m020l651l687l479k798k242k223
$$ 1192126 1186281 1179743 1173040 1166636 1160620 1155056 1150226 1146206 1142555 1138868 1135389 1132591 1130349 1128126
52159A128126k204j502l62M10M69M3o43j395j782j477p58r9O16J800L193L914
$$ 1128126 1125922 1124420 1124058 1124468 1124937 1124980 1124337 1122942 1121160 1119683 1118925 1118826 1119442 1121242 1124435 1128349
52143A128349L526K531J669J143P02Q2p76j660k265k606l084l869m415m099l064
$$ 1128349 1131875 1134406 1136075 1137218 1137920 1138002 1137226 1135566 1133301 1130695 1127611 1123742 1119327 1115228 1112164
52128A112164j900p25P02K160L126L710M549N624O190O141O469P838R568J0588
$$ 1112164 1110264 1109539 1110241 1112401 1115527 1119237 1123786 1129410 1135600 1141741 1148210 1156048 1165616 1176204
52114A176204J0749J0496J0025R525R630J0752J2257J3175J3475J3942J5012J6367
$$ 1176204 1186953 1197449 1207474 1216999 1226629 1237381 1249638 1262813 1276288 1290230 1305242 1321609
52102A321609J7615J8591J9149J9294J9397J9727J9841J9097J7595J5891J3925
$$ 1321609 1339224 1357815 1376964 1396258 1415655 1435382 1455223 1474320 1491915 1507806 1521731
52091A521731J1083P431M013J575k64k162l943m897m776l985l007k106j520j510
$$ 1521731 1532814 1540245 1544258 1545833 1545569 1543407 1539464 1534567 1529791 1525806 1522799 1520693 1519173 1517663
52077A517663k039k678k966k914k940l267l497l045j925p35J73J015J885K376
$$ 1517663 1515624 1512946 1509980 1507066 1504126 1500859 1497362 1494317 1492392 1491657 1491830 1492845 1494730 1497106
52063A497106K362K560L606M918N353M806M339M724N689O582P005O624N259L535
$$ 1497106 1499468 1502028 1505634 1510552 1515905 1520711 1525050 1529774 1535463 1542045 1549050 1555674 1560933 1564468
52049A564468K661L051L666L218J636o1r28p42J16J006J422J425J494J787J835
$$ 1564468 1567129 1570180 1573846 1577064 1578700 1578639 1577711 1576969 1577085 1578091 1579513 1580938 1582432 1584219 1586054
$$ [...]
##END NTUPLES=NMR SPECTRUM
##END=
