##TITLE=AC1399_2357uv_7519954_JKoHcfTaAp
##JCAMPDX= 6.0         $$ Bruker NMR JCAMP-DX V2.0
##DATA TYPE= NMR SPECTRUM
##DATA CLASS= NTUPLES
##ORIGIN= BRUKER
##OWNER= Administrator
$$ 1.72 TOPSPIN		Version 2.1
$$ 2013-04-17 00:18:05.986 -0700  Administrator@X
$$ Compression mode = diff/dup
##.OBSERVE FREQUENCY= 400.02188249412
##.OBSERVE NUCLEUS= ^1H
##.ACQUISITION MODE= SIMULTANEOUS (DQD)
##.ACQUISITION SCHEME= undefined
##.AVERAGES= 64
##.DIGITISER RES= 22
##SPECTROMETER/DATA SYSTEM= spect
##.PULSE SEQUENCE= noesygpps1d.comp
##.SOLVENT NAME= COFFEE_meoh
##.SHIFT REFERENCE= INTERNAL, COFFEE_meoh, 1, 14.96111
##AUDIT TRAIL= $$ (NUMBER, WHEN, WHO, WHERE, PROCESS, VERSION, WHAT)
$$ ##TITLE= Audit trail, TOPSPIN		Version 2.1
$$ ##JCAMPDX= 5.01
$$ ##ORIGIN= Bruker BioSpin GmbH
$$ ##OWNER= Administrator
$$ $$ E:\/data/COFFEE/nmr/AC1399_2357uv_7519954_JKoHcfTaAp/22/pdata/1/auditp.txt
$$ ##AUDIT TRAIL=  $$ (NUMBER, WHEN, WHO, WHERE, PROCESS, VERSION, WHAT)
(   1,<2013-04-17 00:18:00.736 -0700>,<Administrator>,<X>,<go>,<TOPSPIN 2.1>,
      <created by zg
	started at 2013-04-17 00:06:30.765 -0700,
	POWCHK enabled, PULCHK disabled,
       configuration hash MD5:
       33 CF 6A 21 5C D3 B9 40 6C 15 AA 8D 27 A2 4F 13
       data hash MD5: 64K
       CA 60 FD EC 9D B6 64 E8 8B 2A CC 69 CC 61 AC 21>)
(   2,<2013-04-17 00:18:03.830 -0700>,<Administrator>,<X>,<proc1d>,<TOPSPIN 2.1>,
      <Start of raw data processing
       efp LB = 0.3 FT_mod = 6 PKNL = 1 PHC0 = 0 PHC1 = 0 SI = 128K 
       data hash MD5: 128K
       8C 06 96 7A 78 2F BA 52 7A 68 C6 D5 C9 A6 EB FD>)
(   3,<2013-04-17 00:18:04.861 -0700>,<Administrator>,<X>,<proc1d>,<TOPSPIN 2.1>,
      <pk PHC0 = -79.33777 PHC1 = 0 
       data hash MD5: 128K
       54 47 D8 D2 1A E9 23 81 6F 08 C1 17 2C 3C D1 1B>)
(   4,<2013-04-17 00:18:05.361 -0700>,<Administrator>,<X>,<proc1d>,<TOPSPIN 2.1>,
      <abs ABSG = 1 
       data hash MD5: 128K
       09 D0 54 77 B9 3F 60 20 F5 48 64 47 4D 73 77 D8>)
(   5,<2013-04-17 00:18:05.455 -0700>,<Administrator>,<X>,<proc1d>,<TOPSPIN 2.1>,
      <abs ABSG = 2 
       data hash MD5: 128K
       39 19 81 37 EA 9E 94 06 94 94 0A 9E B4 D2 96 13>)
(   6,<2013-04-17 00:18:05.548 -0700>,<Administrator>,<X>,<proc1d>,<TOPSPIN 2.1>,
      <abs ABSG = 3 
       data hash MD5: 128K
       A1 9C 31 89 B7 F2 AC 20 69 A6 4A 3D 46 89 F5 C8>)
(   7,<2013-04-17 00:18:05.658 -0700>,<Administrator>,<X>,<proc1d>,<TOPSPIN 2.1>,
      <abs ABSG = 4 
       data hash MD5: 128K
       D9 65 31 12 1C 48 EF 84 98 2D 3F AA 46 BE A7 1A>)
(   8,<2013-04-17 00:18:05.767 -0700>,<Administrator>,<X>,<proc1d>,<TOPSPIN 2.1>,
      <abs ABSG = 5 
       data hash MD5: 128K
       CB 13 2A E9 06 5E 62 C0 BC 38 AC A7 56 54 01 65>)
$$ ##END=
$$ 
$$ $$ hash MD5
$$ $$ DC 70 AE 41 0D AE 5E C4 92 7E D0 E3 71 DB EF F3
##$RELAX= 
##$RELAX= 
##$RELAX= 
##$RELAX= 
##$RELAX= 
##$RELAX= 
##$RELAX= 
##$RELAX= 
$$ Bruker specific parameters
$$ --------------------------
##$DU= <E:\>
##$EXPNO= 22
$$ [...]
##$TP07= 0
##$TPNAME0= <>
##$TPNAME1= <>
##$TPNAME2= <>
##$TPNAME3= <>
##$TPNAME4= <>
##$TPNAME5= <>
##$TPNAME6= <>
##$TPNAME7= <>
##$TPOAL= (0..7)
0.5 0.5 0.5 0.5 0.5 0.5 0.5 0.5
##$TPOFFS= (0..7)
0 0 0 0 0 0 0 0
##$TUNHIN= 0
##$TUNHOUT= 0
##$TUNXOUT= 0
##$USERA1= <user>
##$USERA2= <user>
##$USERA3= <user>
##$USERA4= <user>
##$USERA5= <user>
##$V9= 5
##$VALIST= <valist>
##$VCLIST= <CCCCCCCCCCCCCCC>
##$VD= 0
##$VDLIST= <DDDDDDDDDDDDDDD>
##$VPLIST= <PPPPPPPPPPPPPPP>
##$VTLIST= <TTTTTTTTTTTTTTT>
##$WBST= 2048
##$WBSW= 25
##$XGAIN= (0..3)
0 0 0 0
##$XL= 0
##$YL= 0
##$YMAX_a= 6618626
##$YMIN_a= -14876640
##$ZGOPTNS= <>
##$ZL1= 120
##$ZL2= 120
##$ZL3= 120
##$ZL4= 120
##$ABSF1= 14.96111
##$ABSF2= -5.597072
##$ABSG= 5
##$ABSL= 3
##$ALPHA= 0
##$AQORDER= 0
##$ASSFAC= 0
##$ASSFACI= 0
##$ASSFACX= 0
##$ASSWID= 0
##$AUNMP= <proc_prof1d_extract.lims>
##$AXLEFT= 0
##$AXNAME= <>
##$AXNUC= <1H>
##$AXRIGHT= 0
##$AXTYPE= 0
##$AXUNIT= <>
##$AZFE= 0.1
##$AZFW= 0.1
##$BCFW= 0
##$BC_mod= 0
##$BYTORDP= 0
##$COROFFS= 0
##$CY= 15
##$DATMOD= 1
##$DC= 0
##$DFILT= <>
##$DTYPP= 0
##$F1P= 0
##$F2P= 0
##$FCOR= 0.5
##$FTSIZE= 131072
##$FT_mod= 6
##$GAMMA= 0
##$GB= 0
##$INTBC= 1
##$INTSCL= 1
##$ISEN= 128
##$LB= 0.3
##$LEV0= 0
##$LPBIN= 0
##$MAXI= 10000
##$MC2= 0
##$MEAN= 0
##$ME_mod= 0
##$MI= 0
##$NCOEF= 0
##$NC_proc= -2
##$NLEV= 6
##$NOISF1= 0
##$NOISF2= 0
##$NSP= 0
##$NTH_PI= 0
##$NZP= 0
##$OFFSET= 14.96111
##$PC= 1
##$PHC0= -79.33777
##$PHC1= 0
##$PH_mod= 1
##$PKNL= yes
##$PPARMOD= 0
##$PPDIAG= 0
##$PPIPTYP= 0
##$PPMPNUM= 2147483647
##$PPRESOL= 1
##$PSCAL= 4
##$PSIGN= 0
##$PYNMP= <proc.py>
##$REVERSE= no
##$SF= 400.020009592129
##$SI= 131072
##$SIGF1= 0
##$SIGF2= 0
##$SINO= 400
##$SIOLD= 131072
##$SPECTYP= <>
##$SREGLST= <1H.CDCl3>
##$SSB= 0
##$STSI= 131072
##$STSR= 0
##$SW_p= 8223.68421052631
##$SYMM= 0
##$S_DEV= 0
##$TDeff= 65536
##$TDoff= 0
##$TI= <>
##$TILT= no
##$TM1= 0
##$TM2= 0
##$TOPLEV= 0
##$USERP1= <user>
##$USERP2= <user>
##$USERP3= <user>
##$USERP4= <user>
##$USERP5= <user>
##$WDW= 1
##$XDIM= 131072
##$YMAX_p= 390672158
##$YMIN_p= -10497
##$CURPLOT= <Network HP LaserJet P1505>
##$CURPRIN= <$Network HP LaserJet P1505>
##$DFORMAT= <normdp>
##$LAYOUT= <+/1D_H.xwp>
##$LFORMAT= <normlp>
##$PFORMAT= <normpl>
##$SURQMSG= 1
$$ End of Bruker specific parameters
$$ ---------------------------------
##NTUPLES= NMR SPECTRUM
##VAR_NAME=  FREQUENCY,     SPECTRUM/REAL,   SPECTRUM/IMAG
##SYMBOL=    X,             R,               I
##VAR_TYPE=  INDEPENDENT,   DEPENDENT,       DEPENDENT
##VAR_FORM=  AFFN,          ASDF,            ASDF
##VAR_DIM=   131072,        131072,          131072
##UNITS=     HZ,            ARBITRARY UNITS, ARBITRARY UNITS
##FACTOR=    0.0627417313425164, 1,          1
##FIRST=     8223.62146879497, 4964,         -64334
##LAST=      0,             5706,            -64308
##MIN=       0,             -10497,          0
##MAX=       8223.62146879497, 390672158,    0
$$ Real data points
##PAGE= N=1
##DATA TABLE= (X++(R..R)), XYDATA
$$ [...]
63678D34728N587N528N161N367O252P129P526P732Q148Q618Q699Q309P706O956
$$ 434728 440315 445843 451004 456371 462623 469752 477278 485010 493158 501776 510475 518784 526490 533446
63664E33446N839M252K416N35j362l219m740n655o103o576p369q166q325p557
$$ 533446 539285 543537 545953 546488 545126 541907 537167 531512 525409 518833 511464 503298 494973 487416
63650D87416o275n089m136l127k009j188r12p90k92M66Q51O03J80J60O38J438
$$ 487416 481141 476052 471916 468789 466780 465592 464680 463890 463598 464064 464915 465518 465698 465858 466496 467934
63634D67934K456L511M145M077L796M206N545P042P920Q358R148J0634J2358J3699
$$ 467934 470390 473901 478046 482123 485919 490125 495670 502712 510632 518990 528138 538772 551130 564829
63620E64829J4429J4744J5167J6398J8738K1555K3826K5380K7033K9204L1148
$$ 564829 579258 594002 609169 625567 644305 665860 689686 715066 742099 771303 802451
63609H02451L2076L2406L2911L3105L1523K7652K2528J7271J2010O626J709j914
$$ 802451 834527 866933 899844 932949 964472 992124 1014652 1031923 1043933 1050559 1052268 1050354
63597A050354m089n291o063o900q159r689j0978j2006j3412j5446j7408j8714
$$ 1050354 1046265 1040974 1034911 1028011 1019852 1010163 999185 987179 973767 958321 940913 922199
63585I22199j9794k1160k2222k2003k0638j9123j7804j6159j4024j1903r983p816
$$ 922199 902405 881245 859023 837020 816382 797259 779455 763296 749272 737369 727386 719570
63573G19570n304l133j818j071l94L28J099K036K935L352L413L929N306P031Q638
$$ 719570 714266 711133 709315 708244 707850 708178 709277 711313 714248 717600 721013 724942 730248 737279 745917
63558G45917J0510J3082J6010J8844K1951K5898L0388L4688L8882M3712M9218
$$ 745917 756427 769509 785519 804363 826314 852212 882600 917288 956170 999882 1049100
63547A049100N4367N7984N9250N7215N0740L9472K4566Q313o657j7948k4210k5883
$$ 1049100 1103467 1161451 1220701 1277916 1328656 1368128 1392694 1401007 1394350 1376402 1352192 1326309
63535A326309k4833k2880k0784j8627j6541j4774j3512j3146j4286j7070k0674
$$ 1326309 1301476 1278596 1257812 1239185 1222644 1207870 1194358 1181212 1166926 1149856 1129182
63524A129182k4037k6908k9684l2284l3809l3548l1968l0278k9140k8123k6478
$$ 1129182 1105145 1078237 1048553 1016269 982460 948912 916944 886666 857526 829403 802925
63513H02925k4114k1557j9182j6897j4693j2994j2083j1450j0302q636p258o644
$$ 802925 778811 757254 738072 721175 706482 693488 681405 669955 659653 651017 643759 637115
63501F37115o363n825n066m422l919l393k878k386j648o47l8l38r24o94L04Q83
$$ 637115 630752 624927 619861 615439 611520 608127 605249 602863 601215 600568 600530 600192 599268 598574 598878 599761
63485E99761N34L04J323L247M844N603N946O274O587O919P271P139N846L498J023
$$ 599761 600295 600599 601922 605169 610013 615616 621562 627836 634423 641342 648613 655752 661598 665096 666119
63470F66119r41k582m202n567o421p081q050r204r839r428q131o630n622n285
$$ 666119 665178 662596 658394 652827 646406 639325 631275 622071 612232 602804 594673 588043 582421 577136
63456E77136n116m475l307k074r52L66J982L469M597N882P864J0325J2789J5460
$$ 577136 572020 567545 564238 562164 561212 561578 563560 567029 571626 577508 585372 595697 608486 623946
63442F23946J8894K3001K7172L1348L6226M2180M8679N4899O0232O3729O3699
$$ 623946 642840 665841 693013 724361 760587 802767 851446 906345 966577 1030306 1094005
63431A094005N8550M8120L3995J8723M740o360j4040j8385j9500j7499j3066p441
$$ 1094005 1152555 1200675 1234670 1253393 1258133 1251773 1237733 1219348 1199848 1182349 1169283 1161842
63419A161842j565M404J0363J5476J8599J9360J8282J5870J2115P068J433l719
$$ 1161842 1160277 1164681 1175044 1190520 1209119 1228479 1246761 1262631 1274746 1281814 1283247 1279528
63407A279528p713j0520j2342j3240j3315j3056j3301j4652j7010j9758k2420
$$ 1279528 1271815 1261295 1248953 1235713 1222398 1209342 1196041 1181389 1164379 1144621 1122201
63396A122201k5020k7752l0387l2151l2312l0967k9108k7699k6719k5349k3197
$$ 1122201 1097181 1069429 1039042 1006891 974579 943612 914504 886805 860086 834737 811540
63385H11540k0834j8902j7088j4589j1367q305o090m515l020j376L60K160L978
$$ 811540 790706 771804 754716 740127 728760 720455 714365 709850 706830 705454 705814 707974 711952
63372G11952N762P614R671J1682J3228J4485J6197J8544K0714K2091K3325K5512
$$ 711952 717714 725328 734999 746681 759909 774394 790591 809135 829849 851940 875265 900777
63360I00777K8633L1606L3648L4854L5423L5141L3775L1361K7872K3153J7437
$$ 900777 929410 961016 994664 1029518 1064941 1100082 1133857 1165218 1193090 1216243 1233680
63349A233680J1468N896R55l059n621o713p305q487j0323j2045j3354j4869j7245
$$ 1233680 1245148 1251044 1251999 1248940 1243319 1236606 1229301 1220814 1210491 1198446 1185092 1170223 1152978
63336A152978k0289k3182k5294k6471k6800k6351k5115k3039k0123j6618j2930
$$ 1152978 1132689 1109507 1084213 1057742 1030942 1004591 979476 956437 936314 919696 906766
63325I06766r127m757M77N913J0305J2974J3960J2776P933j353j3318k4416l2088
$$ 906766 897639 892882 893359 899272 909577 922551 936511 949287 957220 955867 942549 918133 886045
63312H86045l6074l7182l5904l2783k9068k5956k3477k0893j8033j5496j3661
$$ 886045 849971 812789 776885 744102 715034 689078 665601 644708 626675 611179 597518
63301E97518j2227j0835r591q727q153p579o851o082n559n504n703n539m648l540
$$ 597518 585291 574456 564865 556138 547985 540406 533555 527473 521914 516410 510707 505168 500520 496980
63287D96980l145l684m332m111k943j747j529k375l227k912j435k8L65J48K36
$$ 496980 493835 490151 485819 481708 478765 477018 475489 473114 469887 466975 465540 465512 465877 466025 466261
63272D66261N81L91m20r32n52K02N73N95O70P34M15j98n04j53N17Q62O07J56J82
$$ 466261 466842 467233 466813 465881 465329 465531 466104 466699 467369 468103 468518 468320 467816 467663 468180 469042 469649 469805 469987
63253D69987Q33J434J283N53L3O6L58Q12J742K994L677L306K598K504K958L322
$$ 469987 470820 472254 473537 474090 474123 474189 474547 475359 477101 480095 483772 487078 489676 492180 495138 498460
63237D98460L613M460N920P249P910Q190Q616R310J0087J0737J1049J0924J0630
$$ 498460 502073 506533 512453 519702 527612 535802 544418 553728 563815 574552 585601 596525 607155
63224F07155J0660J1127J1623J1762J1615J1544J1831J2517J3304J3675J3377
$$ 607155 617815 628942 640565 652327 663942 675486 687317 699834 713138 726813 740190
63213G40190J2905J2993J3530J3449J1980R606P387N569L456N45k708n439p406
$$ 740190 753095 766088 779618 793067 805047 814653 822040 827609 831065 831610 828902 823463 816057
63200H16057r119j1042j2878j3888j3824j3351j3299j3627j3340j1638q842o077
$$ 816057 806938 795896 783018 769130 755306 741955 728656 715029 701689 690051 681209 675132
63188F75132m049k492p64J226L047M494N978P903R932J1316J1843J2087J2561
$$ 675132 671083 668591 667827 669053 672100 676594 682572 690475 700407 711723 723566 735653 748214
63175G48214J3095J3338J3489J3982J4696J5013J4678J4129J3776J3424J2605
$$ 748214 761309 774647 788136 802118 816814 831827 846505 860634 874410 887834 900439
63164I00439J1195R399P375N056K359o59l799o876r928j3158j6505j9409k1370
$$ 900439 911634 921033 928408 933464 935823 935164 931365 924489 914561 901403 884898 865489 844119
63151H44119k2570k3506k4069k3634k2143k0392j8903j7290j5269j3591j3027
$$ 844119 821549 798043 773974 750340 728197 707805 688902 671612 656343 642752 629725
63140F29725j2871j1599q971o441n291n218n157m669l921l026k063j412j336j442
$$ 629725 616854 605255 596284 589843 584552 579334 574177 569508 565587 562561 560498 559086 557750 556308
63126E56308j128m31J15L45O18J087J469J603J764K148K428K153J325L53l55n58
$$ 556308 555180 554749 554864 555209 555827 556914 558383 559986 561750 563898 566326 568479 569804 570157 569802 569244
63110E69244j94N28J141J267R42M82J25p4j18nK35N81J058J698K460L255L944
$$ 569244 569050 569578 570719 571986 572928 573410 573535 573461 573343 573338 573573 574154 575212 576910 579370 582625 586569
63093E86569M324M320M192M341M835N338N631N849N991N611M361K722J591J239
$$ 586569 590893 595213 599405 603746 608581 613919 619550 625399 631390 637001 641362 644084 645675 646914
63079F46914J094O71J78J1J29J70n9n18j129j688j761j042K02J341K037K525L237
$$ 646914 648008 648679 648857 648868 648997 649167 649108 648590 647461 645773 644012 642970 643172 644513 646550 649075 652312
63062F52312M374N795P206Q382R365J0412J1621J2746J3518J4134J5108J6677
$$ 652312 656686 662481 669687 678069 687434 697846 709467 722213 735731 749865 764973 781650
63050G81650J8592K0508K2306K3910K5094K5732K6053K6408K6895K7394K7855
$$ 781650 800242 820750 843056 866966 892060 917792 943845 970253 997148 1024542 1052397
63039A052397K8223K8240K7609K6479K5468K5109K5426K6143K6961K7435K6855
$$ 1052397 1080620 1108860 1136469 1162948 1188416 1213525 1238951 1265094 1292055 1319490 1346345
63028A346345K4664K1040J6783J2487Q056L082k472q111j3248j7630k1394k4811
$$ 1346345 1371009 1392049 1408832 1421319 1429375 1432457 1429985 1421874 1408626 1390996 1369602 1344791
63016A344791k7957l0607l2448l3401l3589l2984l1277k8330k4596k0787j7136
$$ 1344791 1316834 1286227 1253779 1220378 1186789 1153805 1122528 1094198 1069602 1048815 1031679
63005A031679j3251q762l903P12M703Q115J1128J3795J6118J8209K0249K2280
$$ 1031679 1018428 1009666 1005763 1006475 1011178 1019293 1030421 1044216 1060334 1078543 1098792 1121072
62993A121072K4099K5476K6412K7151K7805K8127K7847K7194K6745K6593K5947
$$ 1121072 1145171 1170647 1197059 1224210 1252015 1280142 1307989 1335183 1361928 1388521 1414468
62982A414468K3941K0673J7083J3737J0153N521l14o867j3657k0360k6470l1477
$$ 1414468 1438409 1459082 1476165 1489902 1500055 1505576 1505262 1498395 1484738 1464378 1437908 1406431
62970A406431l5445l8851m1615m2885m2333m1039m0342m0118l9154l7178l5324
$$ 1406431 1370986 1332135 1290520 1247635 1205302 1164263 1123921 1083803 1044649 1007471 972147
62959I72147l4263l2986l0336k6875k4156k2564k1090j9131j7265j6031j5068
$$ 972147 937884 904898 874562 847687 823531 800967 779877 760746 743481 727450 712382
62948G12382j3907j2782j2035j1390j0487r561r016q738q389p981p543o741n466
$$ 712382 698475 685693 673658 662268 651781 642220 633204 624466 616077 608096 600553 593812 588346
62935E88346m443m433n077n374n123m986n194n165m567l882l522l164k366j260
$$ 588346 583903 579470 574393 569019 563896 558910 553716 548551 543984 540102 536580 533416 531050 529790
62921E29790k54M82Q65P16J08n00p57o85k80O38J881K824L285L844M766N334M910
$$ 529790 529536 530018 530883 531599 531707 531207 530450 529765 529485 530123 532004 534828 538113 541957 546723 552057 556967
62904E56967M084L878M182M000K987J785Q79J43l53j23Q18J600J619J371J689
$$ 556967 561051 564929 569111 573111 576098 577883 578762 578905 578552 578429 579247 580847 582466 583837 585526
62889E85526K664L744M549N055N271N187M917M560M066L356K435J225l83k132
$$ 585526 588190 591934 596483 601538 606809 611996 616913 621473 625539 628895 631330 632555 632172 630040
62875F30040l412l966m262m857n661o218o383o346o150n668m934m157l444k813
$$ 630040 626628 622662 618400 613543 607882 601664 595281 588935 582785 577117 572183 568026 564582 561769
62861E61769k439k486k778k929k829k706k713k663k265j446m36L56O56N93N96
$$ 561769 559330 556844 554066 551137 548308 545602 542889 540226 537961 536515 536079 536435 537091 537684 538280
62846E38280Q47J089J091J033J156J298J179R11P67N98O6n93o27K30J303J802
$$ 538280 539127 540216 541307 542340 543496 544794 545973 546884 547651 548249 548315 547722 547095 547325 548628 550430
62830E50430J685J413J203R31N86M19N64P99Q19O73P72J382K210K729K852K943
$$ 550430 552115 553528 554731 555662 556248 556667 557231 558030 558849 559522 560294 561676 563886 566615 569467 572410
62814E72410L015K437R13o40q70M10K050K947L018K784K685L024L866M714M844
$$ 572410 575425 577862 578775 578135 577265 577675 579725 582672 585690 588474 591159 594183 598049 602763 607607
62799F07607M352M230M981N784N733N326N794P329Q926R984J1048J2695J4605
$$ 607607 611959 616189 621170 626954 632687 638013 643807 651136 660062 670046 681094 693789 708394
62786G08394J6173J7455J8881K0383K1465K1994K2478K3490K5172K7350K9805
$$ 708394 724567 742022 760903 781286 802751 824745 847223 870713 895885 923235 953040
62775I53040L2361L4883L7375L9893M2253M3854M4019M2542L9728L5968L1388
$$ 953040 985401 1020284 1057659 1097552 1139805 1183659 1227678 1270220 1309948 1345916 1377304
62764A377304K6081K0338J4354P852M14p743j5688k2584k8265l2948l6746l9725
$$ 1377304 1403385 1423723 1438077 1445929 1446343 1438600 1422912 1400328 1372063 1339115 1302369 1262644
62752A262644m2041m3660m4194m3465m2002m0571l9235l7365l4592l1366k8440
$$ 1262644 1220603 1176943 1132749 1089284 1047282 1006711 967476 930111 895519 864153 835713
62741H35713k6133k4169k2063j9567j6922j4760j3506j2885j2138j0822r197p826
$$ 835713 809580 785411 763348 743781 726859 712099 698593 685708 673570 662748 653551 645725
62729F45725o967o361n487m037k278r21l40n8O94J956L004L386L494L871M429
$$ 645725 638758 632397 626910 622873 620595 619674 619334 619276 619970 621926 624930 628316 631810 635681 640110
62714F40110M761M917N397O427P737R082J0584J2370J4189J5676J6921J8427K0460
$$ 640110 644871 649788 655185 661612 669349 678431 689015 701385 715574 731250 748171 766598 787058
62701G87058K2710K4724K6561K8758L1725L5344L9183M2755M5588M7377M8301
$$ 787058 809768 834492 861053 889811 921536 956880 996063 1038818 1084406 1131783 1180084
62690A180084M8893M9319M9043M7505M4820M1369L6892L0687K2720J3911N104
$$ 1180084 1228977 1278296 1327339 1374844 1419664 1461033 1497925 1528612 1551332 1565243 1570347
62679A570347l665j2542k1080k8638l5154m0881m5523m8356m9281m9133m8680
$$ 1570347 1566682 1554140 1533060 1504422 1469268 1428387 1382864 1334508 1285227 1236094 1187414
62668A187414m7819m6095m3672m1239l9080l6800l3993l0842k7815k5167k2974
$$ 1187414 1139595 1093500 1049828 1008589 969509 932709 898716 867874 840059 814892 791918
62657G91918k1354k0232j9087j7400j5352j3681j2735j2054j1008r525p980o708
$$ 791918 770564 750332 731245 713845 698493 684812 672077 660023 649015 639490 631510 624802
62645F24802n848n321m781l853k666j760j247n52N94J411J029j90j095j310j531
$$ 624802 618954 613633 608852 604999 602333 600573 599326 598774 599368 600779 601808 601618 600523 599213 597682
62630E97682k227k935l070k695k167j662j328j377j635j508q13j50q7m07n70m74
$$ 597682 595455 592520 589450 586755 584588 582926 581598 580221 578586 577078 576265 576115 576028 575621 575051 574577
62614E74577k99l0L43N26L62L04Q14J528J643J089O51Q98J615K364L189M459O350
$$ 574577 574278 574248 574591 575117 575479 575783 576597 578125 579768 580857 581508 582406 584021 586385 589574 594033 600383
62597F00383Q650J0891J2606J3684J4527J5645J7072J8420J9476K0447K1512K2406
$$ 600383 609033 619924 632530 646214 660741 676386 693458 711878 731354 751801 773313 795719
62585G95719K2592K1702J9771J7120J4167J1170Q118M884J447k119n768r426j2801
$$ 795719 818311 840013 859784 876904 891071 902241 910359 915243 916690 914571 908803 899377 886576
62572H86576j5454j7166j8139j8822j9537k0276k0692k0332j9011j7032j5047
$$ 886576 871122 853956 835817 816995 797458 777182 756490 736158 717147 700115 685068
62561F85068j3587j2667j1805j0519q869p435o658o373o097n571m791l774k727
$$ 685068 671481 658814 647009 636490 627621 620186 613528 607155 601058 595487 590696 586922 584195
62548E84195k212k544l056k647j212J63N80K72j09l62m57j55M76Q13O20O31J390
$$ 584195 581983 579439 576383 573736 572524 572687 573267 573539 573430 573068 572611 572456 572932 573745 574365 574996 576386
62531E76386K189K160J850K501M005N001N020N134O115P248P648P762Q672J0641
$$ 576386 578575 580735 582585 585086 589091 594092 599112 604246 610361 617609 625257 633019 641691 652332
62517F52332J3069J5397J7374J8845J9984K1422K3553K5953K7985K9607L1062
$$ 652332 665401 680798 698172 717017 737001 758423 781976 807929 835914 865521 896583
62506H96583L2102L2239L1603L0842L0112K8783K6277K2822J9183J6001J3553
$$ 896583 928685 960924 992527 1023369 1053481 1082264 1108541 1131363 1150546 1166547 1180100
62495A180100J1898J0954J0408R715Q401O586N148M999O060P210P373O287M124
$$ 1180100 1191998 1202952 1213360 1223075 1231476 1238062 1243210 1248209 1254269 1261479 1268852 1275139 1279263
62482A279263Q91l283p677j1427j4471j7554k1339k5831l0535l4739l7705l9061
$$ 1279263 1280154 1276871 1269194 1257767 1243296 1225742 1204403 1178572 1148037 1113298 1075593 1036532
62470A036532l9218l8978l8657l7848l6124l3675l1033k8394k5504k2173j8750
$$ 1036532 997314 958336 919679 881831 845707 812032 780999 752605 727101 704928 686178
62459F86178j5954j4165j2908j1307r141p104n825n002m030l090k852l136k770
$$ 686178 670224 656059 643151 631844 622703 615599 609774 604772 600742 597652 594800 591664 588894
62446E88894j151P64J606J192M04j25m11m22J13R79J328O87l22p58n26k69l44
$$ 588894 587743 588507 590113 591305 591709 591584 591173 590751 590864 591843 593171 593858 593536 592778 592252 591983 591639
62429E91639m84m70n47r33j369j473j267j018p56l97k18p25j849k723k548j525
$$ 591639 591155 590685 590138 589205 587836 586363 585096 584078 583322 582925 582707 581982 580133 577410 574862 573337
62413E73337o31n06q60r67n35Q8M15L49K50N35J262K083K570K640K563K665L071
$$ 573337 572706 572200 571340 570373 569838 569926 570341 570690 570940 571475 572737 574820 577390 580030 582593 585258 588329
62396E88329L759M706N787O686P172P487Q133R197J0129J0471J0516J0859J1478
$$ 588329 592088 596794 602581 609267 616439 623926 632059 641256 651385 661856 672372 683231 694709
62383F94709J1773J1478J0965J0553J0040R213Q320P636P022O370O086O565P485
$$ 694709 706482 717960 728925 739478 749518 758731 767051 774687 781709 788079 794165 800730 808215
62370H08215Q320R351J1379J4473J7740K0521K3127K6095K9465L3122L7252M1899
$$ 808215 816535 825886 837265 851738 869478 889999 913126 939221 968686 1001808 1039060 1080959
62358A080959M6498N0428N3763N6868N9449O0544N9394N5963N0716M4307L7407
$$ 1080959 1127457 1177885 1231648 1288516 1347965 1408509 1467903 1523866 1574582 1618889 1656296
62347A656296L0366K3064J5388P743P26n612j1677j7561k3040k8277l3824l9537
$$ 1656296 1686662 1709726 1725114 1732857 1733583 1727971 1716294 1698733 1675693 1647416 1613592 1574055
62335A574055m4159m6603m7225m7266m7257m6802m5708m4526m3597m2358m0143
$$ 1574055 1529896 1483293 1436068 1388802 1341545 1294743 1249035 1204509 1160912 1118554 1078411
62324A078411l7291l4752l2818l0840k8295k5520k3180k1380j9689j7762j5652
$$ 1078411 1041120 1006368 973550 942710 914415 888895 865715 844335 824646 806884 791232
62313G91232j3612j1823j0241q547o489m401l061k686k440j393K12J311J548J671
$$ 791232 777620 765797 755556 747009 740520 736119 733058 730372 727932 726539 726751 728062 729610 731281
62299G31281K213K659K390J898K192L309M143L813K593J343M85q9n82j070j601
$$ 731281 733494 736153 738543 740441 742633 745942 750085 753898 756491 757834 758319 758230 757648 756578 754977
62284G54977k130k391k104j441r70j009j128o34M58J313J368J224J966L788N787
$$ 754977 752847 750456 748352 746911 745941 744932 743804 743170 743628 744941 746309 747533 749499 753287 759074
62269G59074P339R023J1791J5584J9335K2319K4888K7855L1565L5859M0540M5458
$$ 759074 766413 775436 787227 802811 822146 844465 869353 897208 928773 964632 1005172 1050630
62257A050630N0222N4206N7079N9023O0244O0326N8363N3805M7018L8878K9988
$$ 1050630 1100852 1155058 1212137 1271160 1331404 1391730 1450093 1503898 1550916 1589794 1619782
62246A619782K0560J0848J351p577j5915k3627l0366l5824m0221m4113m7677n0408
$$ 1619782 1640342 1651190 1652541 1644964 1629049 1605422 1575056 1539232 1499011 1454898 1407221 1356813
62234A356813n1663n1318m9824m7694m5120m2104l8786l5416l2085k8715k5445
$$ 1356813 1305150 1253832 1204008 1156314 1111194 1069090 1030304 994888 962803 934088 908643
62223I08643k2743k0864j9410j7735j5777j4118j3156j2626j2053j1326j0592
$$ 908643 885900 865036 845626 827891 812114 797996 784840 772214 760161 748835 738243
62212G38243r805q757p423o005m653l348k094j108o83q29j071o71P46K876N074
$$ 738243 728438 719681 712258 706253 701600 698252 696158 695050 694367 693538 692467 691796 692542 695418 700492
62197G00492O912Q288R215R799J0347J1115J2001J2791J3609J4654J5566J5644
$$ 700492 707404 715692 724907 734706 745053 756168 768169 780960 794569 809223 824789 840433
62185H40433J4852J3980J3579J3263J2415J0942R005O600M020K258K066K936L791
$$ 840433 855285 869265 882844 896107 908522 919464 928469 935069 939089 941347 943413 946349 950140
62172I50140M690O901J1114J6332K0955K4543K7929L1830L5828L8856M0365M0659
$$ 950140 954830 961731 972845 989177 1010132 1034675 1062604 1094434 1130262 1169118 1209483 1250142
62160A250142M0070L8160L4120K7876K0358J2647N388q89n643r106j2611j7277
$$ 1250142 1290212 1328372 1362492 1390368 1410726 1423373 1428761 1427872 1422229 1413123 1400512 1383235
62148A383235k2537k6763k9225l0672l1907l2585l1844k9466k5988k1942j7533
$$ 1383235 1360698 1333935 1304710 1274038 1242131 1209546 1177702 1148236 1122248 1100306 1082773
62137A082773j2936q548m892k270n04J002K813M999P170Q885R915J0255J0133
$$ 1082773 1069837 1061289 1056397 1054127 1053623 1054625 1057438 1062437 1069607 1078492 1088407 1098662 1108795
62124A108795R977J0048J0150R852R083Q248P746P553P356O901O188N363M406
$$ 1108795 1118772 1128820 1138970 1148822 1157905 1166153 1173899 1181452 1188808 1195709 1201897 1207260 1211666
62111A211666K992Q88j417k914l178k897k974l437l749l837m083m443m295l213
$$ 1211666 1214658 1215546 1214129 1211215 1208037 1205140 1202166 1198729 1194980 1191143 1187060 1182617 1178322 1175109
62097A175109j216J652N292Q897J1224J1829J1551J1347J1243J0824J0209R953
$$ 1175109 1173893 1175545 1180837 1189734 1200958 1212787 1224338 1235685 1246928 1257752 1267961 1277914
62085A277914J0297J1116J2408J4323J6698J9040K1044K2962K5321K8314L1455
$$ 1277914 1288211 1299327 1311735 1326058 1342756 1361796 1382840 1405802 1431123 1459437 1490892
62074A490892L3871L5017L5082L4591L3749L2472L0838K9061K7043K4508K1618
$$ 1490892 1524763 1559780 1594862 1629453 1663202 1695674 1726512 1755573 1782616 1807124 1828742
62063A828742J8926J6538J3838J0261N907J218l397p415j0257j1948j3224j4568
$$ 1828742 1847668 1864206 1878044 1888305 1894212 1895430 1892033 1884618 1874361 1862413 1849189 1834621
62051A834621j5620j6003j6244j7285j9358k1948k4666k7557l0671l3826l6727
$$ 1834621 1819001 1802998 1786754 1769469 1750111 1728163 1703497 1675940 1645269 1611443 1574716
62040A574716l9010m0343m0869m1308m2145m2942m2937m2059m0774l9186l7022
$$ 1574716 1535706 1495363 1454494 1413186 1371041 1328099 1285162 1243103 1202329 1163143 1126121
62029A126121l4433l1974k9709k7025k3677k0397j8160j7300j7488j8159j8641
$$ 1126121 1091688 1059714 1030005 1002980 979303 958906 940746 923446 905958 887799 869158
62018H69158j8386j7462j6460j5599j4353j2262r754p584n809l910j736L36K192
$$ 869158 850772 833310 816850 801251 786898 774636 764882 757298 751489 747579 745843 746179 748371
62005G48371M320O992R717J1786J3084J3878J4008J2928J0594P836N485L401Q42
$$ 748371 752691 759683 769400 781186 794270 808148 822156 835084 845678 853514 858999 862400 863242
61992H63242k385n545p932r808j1989j4641j6880j7658j6819j5165j3618j2541
$$ 863242 860857 855312 847380 837572 825583 810942 794062 776404 759585 744420 730802 718261
61980G18261j1788j1127j0414r481q120o346m582l359k759k317j578o64q3j2k3
$$ 718261 706473 695346 684932 675451 667331 660985 656403 653044 650285 647968 646390 645726 645643 645631 645608
61965F45608L28R16J337J738K801M719O545P120O529O093O900Q772J0873J2724
$$ 645608 645936 646852 648189 649927 652728 657447 663992 671112 677641 683734 690634 699406 710279 723003
61951G23003J4325J5768J7269J9306K2104K5196K8023L0816L4261L8381M2436
$$ 723003 737328 753096 770365 789671 811775 836971 864994 895810 930071 968452 1010888
61940A010888M6010M9386N2660N5167N6215N5947N4971N3592N1758M9460M6626
$$ 1010888 1056898 1106284 1158944 1214111 1270326 1326273 1381244 1434836 1486594 1536054 1582680
61929A582680M2943L8184L2573K6446J9846J2879O183M74m294q685j2676j5336
$$ 1582680 1625623 1663807 1696380 1722826 1742672 1755551 1761734 1762208 1757914 1749229 1736553 1721217
61917A721217j5859j4479j2038q931m842N39O839J3086J8421K2538K5517K7313
$$ 1721217 1705358 1690879 1678841 1669910 1665068 1665607 1672446 1685532 1703953 1726491 1752008 1779321
61905A779321K7574K5923K2220J6545R170O57q205j6749k4633l1674l7619m2240
$$ 1779321 1806895 1832818 1855038 1871583 1880753 1881410 1873205 1856456 1831823 1800149 1762530 1720290
61893A720290m5474m7388m8095m7855m7029m5792m4031m1684l9054l6618l4619
$$ 1720290 1674816 1627428 1579333 1531478 1484449 1438657 1394626 1352942 1313888 1277270 1242651
61882A242651l2958l1378k9639k7625k5458k3373k1395j9229j6595j3538j0370
$$ 1242651 1209693 1178315 1148676 1121051 1095593 1072220 1050825 1031596 1015001 1001463 991093
61871I91093p424m834k434J67L218O537R799J2987J6231J9420K2454K5809L0173
$$ 991093 983669 978835 976401 976568 979786 986323 996122 1009109 1025340 1044760 1067214 1093023 1123196
61858A123196L5450M0825M5989N1487N7659O4046P0288P6670Q2998Q7816Q9832
$$ 1123196 1158646 1199471 1245460 1296947 1354606 1418652 1488940 1565610 1648608 1736424 1826256
61847A826256Q9529Q8301Q6345Q2581P6418O8355N8740M7246L4009K0363P886
$$ 1826256 1915785 2004086 2090431 2173012 2249430 2317785 2376525 2423771 2457780 2478143 2486029
61836B486029k604j0759j6140j8495j8138j5573j1142n306J095P335J3089J7924
$$ 2486029 2483425 2472666 2456526 2438031 2419893 2404320 2393178 2387872 2388967 2396302 2409391 2427315
61824B427315K0899K1107J8389J3115N552m098j5186k6707l7923m8618n8657o7508
$$ 2427315 2448214 2469321 2487710 2500825 2506377 2502279 2487093 2460386 2422463 2373845 2315188 2247680
61812B247680p4380p8819q1043q1611q0788p8419p4508o9597o4317n8827n3020
$$ 2247680 2173300 2094481 2013438 1931827 1851039 1772620 1698112 1628515 1564198 1505371 1452351
61801A452351m7133m1638l6594l1622k6601k1953j8170j5339j3240j1511r780
$$ 1452351 1405218 1363580 1326986 1295364 1268763 1246810 1228640 1213301 1200061 1188550 1178770
61790A178770p988o519n659n046m240l643m077n459o708p193p339p517p250o228
$$ 1178770 1170782 1164263 1158604 1153558 1149318 1145675 1141598 1136139 1129431 1122238 1114899 1107382 1100132 1093904
61776A093904n251n246n871o005n354m720m745n175n404n142m465l671l153l113
$$ 1093904 1088653 1083407 1077536 1071531 1066177 1061457 1056712 1051537 1046133 1040991 1036526 1032855 1029702 1026589
61762A026589l356l651m057m613m975m840m495m362m229l600k665k148k183k182
$$ 1026589 1023233 1019582 1015525 1010912 1005937 1001097 996602 992240 988011 984411 981746 979598 977415 975233
61748I75233j958k051k596k706j699k71L67J46M5N87J289J713K122K732L117K898
$$ 975233 973275 971224 968628 965922 964223 963952 964319 964465 964510 965097 966386 968099 970221 972953 976070 978968
61732I78968K592L005M047M787M751M475M670N368O139O776P247P404P157O786
$$ 978968 981560 984565 988612 993399 998150 1002625 1007295 1012663 1018802 1025578 1032825 1040229 1047386 1054172
61718A054172O620O462N809M569L170J921O99n67j526j862j843k022k511k779
$$ 1054172 1060792 1067254 1073063 1077632 1080802 1082723 1083422 1082855 1081329 1079467 1077624 1075602 1073091 1070312
61704A070312k300j201k37n5n55j034j056r80j436k438l350l669l492l139k796
$$ 1070312 1068012 1066811 1066574 1066519 1065964 1064930 1063874 1062894 1061458 1059020 1055670 1052001 1048509 1045370 1042574
61689A042574k607k829l568m533n379o078o837p740q651r348r590r213q328p396
$$ 1042574 1039967 1037138 1033570 1029037 1023658 1017580 1010743 1003003 994352 985004 975414 966201 957873 950477
61675I50477o884o845o867o523n850n389n568o116o353o180o331p282q347q451
$$ 950477 943593 936748 929881 923358 917508 912119 906551 900435 894082 887902 881571 874289 865942 857491
61661H57491p434n915m159k069j83N80L93N29J384J783J044N07J648L626M393
$$ 857491 850057 844142 839983 837914 837731 838311 838704 839233 840617 842400 843444 843951 845599 849225 853618
61646H53618L795L741N124O404N981M503L676L687L085R26k085m614o089o874
$$ 853618 857413 861154 866278 872682 878663 883166 886842 890529 893614 894540 892455 887841 881752 874878
61632H74878p563q399r136r352q912q140p404o612n409l823k462j890k000k218
$$ 874878 867315 858916 849780 840428 831516 823376 815972 809360 803951 800128 797666 795776 793776 791558
61618G91558k239k354k880l626m229m846n999p726r425j0748j2041j3446j4179
$$ 791558 789319 786965 784085 780459 776230 771384 765385 757659 748234 737486 725445 711999 697820
61605F97820j3438j1728j0403r940r546q597p595p230p277p005o270n506m898
$$ 697820 684382 672654 662251 652311 642765 634168 626573 619343 612066 605061 598791 593285 588387
61592E88387m227l484l091l378m180m998n352m974l985k963k545k844l324l352
$$ 588387 584160 580676 577585 574207 570027 565029 559677 554703 550718 547755 545210 542366 539042 535690
61578E35690k796k039j550j483j657j838j920j848j507q81k69p9k88m08r2L67
$$ 535690 532894 530855 529305 527822 526165 524327 522407 520559 519052 518171 517902 517823 517535 517127 517035 517402
61562E17402M40L5l92l68J83R48J446J303O00p5j91J44L71K78K51O40J202J470
$$ 517402 517842 517877 517485 517117 517300 518248 519694 520997 521597 521522 521331 521475 521846 522124 522375 523015 524217 525687
61544E25687J469J723K546L651M490M780M592M040L162K006P81j95o72o80n63
$$ 525687 527156 528879 531425 535076 539566 544346 548938 552978 556140 558146 558927 558732 558060 557380 556817
61529E56817p11j188j658j756j474j122r81j119j495k046k641l106l387l632l930
$$ 556817 556106 554918 553260 551504 550030 548908 547927 546808 545313 543267 540626 537520 534133 530501 526571
61514E26571m080l715k773j739j287j640k282k432j825r46m44m08m21k49j92o02
$$ 526571 522491 518776 516003 514264 512977 511337 509055 506623 504798 503852 503408 503000 502579 502330 502138 501536
61498E01536j234j349n52O54J291R23J19j62L52R85J002N37L46P02R82M88n42
$$ 501536 500302 498953 498401 499055 500346 501269 501388 501226 501578 502563 503565 504102 504448 505150 506132 506620 506078
61481E06078j135o38O30J849K520K709K631K287J587O70j02m44l02K44J034J682
$$ 506078 504943 504305 504935 506784 509304 512013 514644 516931 518518 519188 519086 518642 518340 518584 519618 521300
61465E21300J638P56l59q60n31O8L45K65J80L51P56J159J248Q99L68K9n8j13j11
$$ 521300 522938 523694 523335 522475 521944 522012 522357 522622 522802 523153 523909 525068 526316 527215 527583 527612 527554 527441 527330
61446E27330K93J225K329L252M047M886N680O275O702O948O760O091N413N181
$$ 527330 527623 528848 531177 534429 538476 543362 549042 555317 562019 568967 575727 581818 587231 592412
61432E92412N215N068M765M615M529M227M070M885O691Q327Q709P913O627N076
$$ 592412 597627 602695 607460 612075 616604 620831 624901 629786 636477 644804 653513 661426 668053 673129
61418F73129L167J278N2n86j451k904m271m838m908n291o074o576o493o383o720
$$ 673129 676296 677574 677626 677040 675589 672685 668414 663576 658668 653377 647303 640727 634234 627851 621131
61403F21131p144p063o582o241o111n779n129m442l716k587j146j70j59o11p28
$$ 621131 613987 606924 600342 594101 587990 582211 577082 572640 568924 566337 565191 565021 564862 564251 563523
61388E63523m07n9J49L27M02K29R1M62J290J984K149J939J669J454J365J545K077
$$ 563523 563116 563057 563206 563533 563935 564164 564255 564717 566007 567991 570140 572079 573748 575202 576567 578112 580189
61371E80189K865L689M195M023L250K592K741L543M218M388M432M849N749P043
$$ 580189 583054 586743 590938 594961 598211 600803 603544 607087 611305 615693 620125 624974 630723 637766
61357F37766Q600J0030J0814J1008J1415J2710J4663J6595J8275J9971K1785K3459
$$ 637766 646366 656396 667210 678218 689633 702343 717006 733601 751876 771847 793632 817091
61345H17091K4778K5719K6095K5432K3489K0654J7498J4060R943N129L14l785
$$ 817091 841869 867588 893683 919115 942604 963258 980756 994816 1004759 1009888 1010202 1006417
61333A006417p107r872j1892j2833j3035j3311j3816j3818j2942j1846j1147j0363
$$ 1006417 999310 989438 977546 964713 951678 938367 924551 910733 897791 885945 874798 864435
61321H64435q753o723n430n158n094m703m344m370m384l870k856j596j21J513
$$ 864435 855682 848959 843529 838371 833277 828574 824230 819860 815476 811606 808750 807154 807033 808546
61307H08546K935L896M623N457O416P411Q538R815J0835J1054J0291Q796O934
$$ 808546 811481 815377 820000 825457 831873 839284 847822 857637 868472 879526 889817 898613 905547
61294I05547M956K878N12k170m658o202o546o076n216m074k739j531o67n0M97
$$ 905547 910503 913381 913893 911723 907065 900863 894317 888241 883025 878951 876212 874681 874014 873964 874461
61279H74461J106J989L300M759N825O361O695O998P198P587Q803J0899J3154J5163
$$ 874461 875567 877556 880856 885615 891440 897801 904496 911494 918692 926279 935082 945981 959135 974298
61265I74298J7342J9945K2338K3909K5030K6424K8079K9589L0977L2258L2675
$$ 974298 991640 1011585 1033923 1057832 1082862 1109286 1137365 1166954 1197931 1230189 1262864
61254A262864L1286K8104K3712J8046J0697K297n555j1966j7386k2297k6236k8600
$$ 1262864 1294150 1322254 1345966 1364012 1374709 1377006 1371451 1359485 1342099 1319802 1293566 1264966
61242A264966k9583k9680k8903k7183k5092k3356k1762j9234j5229j0676p237
$$ 1264966 1235383 1205703 1176800 1149617 1124525 1101169 1079407 1060173 1044944 1034268 1027031
61231A027031n716n318m539k707m18J419K558L264L737M116M687N483N913N397
$$ 1027031 1021315 1015997 1011458 1008751 1008333 1009752 1012310 1015574 1019311 1023427 1028114 1033597 1039510 1044907
61217A044907M226L154K343J431N35K57O36J010J216J998L724N632O942Q059R827
$$ 1044907 1049133 1052287 1054630 1056061 1056596 1056853 1057489 1058499 1059715 1061713 1065437 1071069 1078011 1086070 1095897
61202A095897J2230J4662J7044J9729K2473K4524K5791K7019K8572K9868L0461
$$ 1095897 1108127 1122789 1139833 1159562 1182035 1206559 1232350 1259369 1287941 1317809 1348270
61191A348270L0985L2361L4368L5710L5472L3980L2008K9611K6205K1645J6674
$$ 1348270 1379255 1411616 1445984 1481694 1517166 1551146 1583154 1612765 1638970 1660615 1677289
61180A677289J2123Q056M089K64k946n540q256j1731j5689j9350k2374k5106k8057
$$ 1677289 1689412 1697468 1701557 1701821 1698875 1693335 1685079 1673348 1657659 1638309 1615935 1590829 1562772
61167A562772l1370l4701l7419l9018l9437l8874l7339l4769l1624k8820k6679
$$ 1562772 1531402 1496701 1459282 1420264 1380827 1341953 1304614 1269845 1238221 1209401 1182722
61156A182722k4473k1449j7985j5117j3171j1534r638p507n267k841l45J795L330
$$ 1182722 1158249 1136800 1118815 1103698 1090527 1078993 1069355 1061848 1056581 1053740 1053395 1055190 1058520
61143A058520M479N500O336O894P198P084O191M599L155K877M195O926J0500J4030
$$ 1058520 1062999 1068499 1074835 1081729 1088927 1096011 1102202 1106801 1109956 1112833 1117028 1123954 1134454 1148484
61129A148484J6703J8648K1070K4931K9676L3757L6334L7916L9484M1487M3678
$$ 1148484 1165187 1183835 1204905 1229836 1259512 1293269 1329603 1367519 1407003 1448490 1492168
61118A492168M5395M5867M4712M2388L9828L7542L5235L2317K8496K3924J9086
$$ 1492168 1537563 1583430 1628142 1670530 1710358 1747900 1783135 1815452 1843948 1867872 1886958
61107A886958J4526J0328N885O38n011j0061j4227j8240k2627k6916l0430l3268
$$ 1886958 1901484 1911812 1917697 1918335 1913324 1903263 1889036 1870796 1848169 1821253 1790823 1757555
61095A757555l6007l8855m1686m4437m6892m8428m8639m7926m6847m5152m2311
$$ 1757555 1721548 1682693 1641007 1596570 1549678 1501250 1452611 1404685 1357838 1312686 1270375
61084A270375l8743l5640l3440l1405k8916k6277k3870k1383j8549j5938j4166
$$ 1270375 1231632 1195992 1162552 1131147 1102231 1075954 1052084 1030701 1012152 996214 982048
61073I82048j2736j0625p876n673m665m023k601n17J083J650J968L155N313P535
$$ 982048 969312 958687 950811 945138 940473 936450 933849 933332 934415 936065 938033 941188 946501 954036
61059I54036R049R965J0894J2200J3829J5676J7769K0123K2612K5084K7441K9573
$$ 954036 963085 973050 983944 996144 1009973 1025649 1043418 1063541 1086153 1111237 1138678 1168251
61047A168251L1311L2458L2919L2860L2775L3102L3629L3527L2267L0319K8588
$$ 1168251 1199562 1232020 1264939 1297799 1330574 1363676 1397305 1430832 1463099 1493418 1522006
61036A522006K7276K5752K3506K0824J8320J6200J4260J2392J0827R821R320R063
$$ 1522006 1549282 1575034 1598540 1619364 1637684 1653884 1668144 1680536 1691363 1701184 1710504 1719567
61024A719567R036R641J1165J3234J5282J7593K1242K6669L2842L8402M3089M7470
$$ 1719567 1728603 1738244 1749409 1762643 1777925 1795518 1816760 1843429 1876271 1914673 1957762 2005232
61012B005232N1907N6743O3130P2457Q4867R9212J14512J30595J47454J65190
$$ 2005232 2057139 2113882 2177012 2249469 2334336 2433548 2548060 2678655 2826109 2991299
61002B991299J84899K08678K38667K77212L28263L97275M88824O04302P41325
$$ 2991299 3176198 3384876 3623543 3900755 4229018 4626293 5115117 5719419 6460744
60993F460744Q94483J058559J234989J435168J671511J940268K214133K453177
$$ 6460744 7355227 8413786 9648775 11083943 12755454 14695722 16909855 19363032
60985A9363032K617701K665040K543194K212087J691361J086403N49836J99506
$$ 19363032 21980733 24645773 27188967 29401054 31092415 32178818 32728654 32928160
60977C2928160O1421P8612J59060K09864J44538j05841n58413j148930j748343
$$ 32928160 32989581 33068193 33227253 33437117 33581655 33475814 32917401 31768471 30020128
60968C0020128k224734k503346k582213k506330k333400k113784j883487j662500
$$ 30020128 27795394 25292048 22709835 20203505 17870105 15756321 13872834 12210334
60960A2210334j457484j268614j095484r38378p97613o74102n69509m84088m15006
$$ 12210334 10752850 9484236 8388752 7450374 6652761 5978659 5409150 4925062 4510056
60951D510056l58189l11251k73418k43207k17860j95148j74538j56320j40380
$$ 4510056 4151867 3840616 3567198 3323991 3106131 2910983 2736445 2580125 2439745
60942B439745j26170j13297j01877r2445q5425q0442p6402p2574o9155o6364o3475
$$ 2439745 2313575 2200278 2098401 2005956 1920531 1840089 1763687 1691113 1621958 1555594 1492119
60931A492119n9501n4562m9782m5805m2157l8142l3721k9326k5333k1912j9053
$$ 1492119 1432618 1378056 1328274 1282469 1240312 1202170 1168449 1139123 1113790 1091878 1072825
60920A072825j6496j3937j1410r270p697o472n227l747k008j70J409K290K256
$$ 1072825 1056329 1042392 1030982 1021712 1014015 1007543 1002316 998569 996561 996391 997800 1000090 1002346
60907A002346J486M40l73p52j019j740l092m696o107p179p808p817p437p410q089
$$ 1002346 1003832 1004272 1003899 1003147 1002128 1000388 997296 992600 986493 979314 971506 963689 956252 948842 940753
60892I40753q809q770q315q481r428j0182j0068r533r226r061q758q529q576q440
$$ 940753 931944 923174 914859 906378 896950 886768 876700 867167 857941 848880 840122 831593 823017 814577
60878H14577p719p035p312q176q164o702m907l962l550k665j278k43J78O05J409
$$ 814577 806858 799823 792511 784335 776171 769469 764562 760600 757050 754385 753107 752864 753042 753647 755056
60863G55056K179K627L180M302N797P202Q312R001R103Q937R403J0896J2553J3254
$$ 755056 757235 759862 763042 767344 773141 780343 788655 797656 806759 815696 825099 835995 848548 861802
60849H61802J3013J2630J2328J1561J0116Q538P403O806O590O428N716M055J900
$$ 861802 874815 887445 899773 911334 921450 929988 937391 944197 950787 957215 962931 966986 968886
60836I68886P9j322k898m742o219o953p236p288o992o582o604o874o528n511n021
$$ 968886 968965 967643 964745 960003 953784 946831 939595 932307 925315 918733 912129 905255 898727 893216 888195
60821H88195n788o945p436p579q265r381j0150j0471j0777j0925j0398r381q601
$$ 888195 882407 875462 868026 860447 852182 842801 832651 822180 811403 800478 790080 780699 772098
60808G72098q235p872p398p029o592n748m803m321m024l120j759j003j133j048
$$ 772098 763863 755991 748593 741564 734972 729224 724421 720100 716076 712956 711197 710194 709061 708013
60794G08013J52J902L023L192K984L002L430M081M520M480M355M840N954O862
$$ 708013 708165 710067 713090 716282 719266 722268 725698 729779 734299 738779 743134 747974 753928 760790
60780G60790O964O629O618P196Q067Q834R242R333R493R976J0366R998R006Q278
$$ 760790 767754 774383 781001 788197 796264 805098 814340 823673 833166 843142 853508 863506 872512 880790
60766H80790Q223Q269P878P326P071O972O719O467O422O243N474M301L272K549
$$ 880790 889013 897282 905160 912486 919557 926529 933248 939715 946137 952380 957854 962155 965427 967976
60752I67976J968J570J466J383R49L48J28L36L04o09k318m104n167n224m705m302
$$ 967976 969944 971514 972980 974363 975312 975660 975788 976124 976428 975819 973501 969397 964230 959006 954301 949999
60736I49999m149l683k497r51L81J495K671L769M402M735N485P067R230J1596
$$ 949999 945850 942167 939670 938719 939100 940595 943266 947035 951437 956172 961657 968724 977954 989550
60722I89550J4078J6578J8702K0041K0585K0733K0970K1573K2507K3495K4275
$$ 989550 1003628 1020206 1038908 1058949 1079534 1100267 1121237 1142810 1165317 1188812 1213087
60711A213087K4700K4666K4124K3304K2628K2124K1198J9247J6355J3048R625
$$ 1213087 1237787 1262453 1286577 1309881 1332509 1354633 1375831 1395078 1411433 1424481 1434106
60700A434106O114K630o56l829p040j0157j3002j5725j8458k0846k2571k4108
$$ 1434106 1440220 1442850 1442194 1438365 1431325 1421168 1408166 1392441 1373983 1353137 1330566 1306458
60688A306458k6102k8029k8530k7322k5806k5270k5354k4968k3934k2821k1745
$$ 1306458 1280356 1252327 1223797 1196475 1170669 1145399 1120045 1095077 1071143 1048322 1026577
60677A026577k0433j9157j8504j8206j7249j5421j3799j3296j3423j3076j2020
$$ 1026577 1006144 986987 968483 950277 933028 917607 903808 890512 877089 864013 851993
60666H51993j0907j0184r618q854p914p024o354n946n671n166m097k519q91L50
$$ 851993 841086 830902 821284 812430 804516 797492 791138 785192 779521 774355 770258 767739 766848 767198
60652G67198J093J512J905K499L230L675L474K863K524K859L580M145M374M420
$$ 767198 768291 769803 771708 774207 777437 781112 784586 787449 789973 792832 796412 800557 804931 809351
60638H09351M373M193L975L973M317M870N359N488M996L896K688J993J791J357
$$ 809351 813724 817917 821892 825865 830182 835052 840411 845899 850895 854791 857479 859472 861263 862620
60624H62620J92j221j994k024k129k917m059m922n522o386p639q803r460r676
$$ 862620 862812 861591 859597 857573 855444 852527 848468 843546 838024 831638 823999 815196 805736 796060
60610G96060r621r171q241p208o681o884p537q134q222p518o183m943m547m999
$$ 796060 786439 777268 769027 761819 755138 748254 740717 732583 724361 716843 710660 705717 701170 696171
60596F96171n548n502m836l954l189k655k291j880j239n65l77q56j509j721j489
$$ 696171 690623 685121 680285 676331 673142 670487 668196 666316 665077 664512 664135 663279 661770 660049 658560
60581F58560j276j311j389j243p90k1R86J882K252K167K210K850L931N002N899
$$ 658560 657284 655973 654584 653341 652551 652530 653516 655398 657650 659817 662027 664877 668808 673810 679709
60566F79709O817P894R009J0011J0923J1791J2399J2340J1490J0338R574R286
$$ 679709 686526 694420 703429 713440 724363 736154 748553 760893 772383 782721 792295 801581
60554H01581Q751P234M780K054m50k614m270n021m737l939l340l146k931k125
$$ 801581 810332 817566 822346 824400 823950 821336 817066 812045 807308 803369 800029 796883 793952 791827
60540G91827n28J564L644N385O825Q161R427J0518J1416J2110J2316J1598R899
$$ 791827 791299 792863 796507 801892 808717 816878 826305 836823 848239 860349 872665 884263 894162
60527H94162P671N333K859J69k358m076m763m782m510l922k858j519m65m8pK80
$$ 894162 901833 907166 910025 910194 907836 903760 898997 894215 889705 885783 882925 881406 880941 880893 880886 881166
60511H81166J123K254L308M334N606O961P788P741P203O831O914P400Q330R898
$$ 881166 882289 884543 887851 892185 897791 904752 912540 920281 927484 934315 941229 948629 956959 966857
60497I66857J2177J5095J8642K2844K7527L2285L6733M0612M3681M5712M6521
$$ 966857 979034 994129 1012771 1035615 1063142 1095427 1132160 1172772 1216453 1262165 1308686
60486A308686M5764M2688L6478K7064J5480L244q556j9498k9344l7567m3532m7059
$$ 1308686 1354450 1397138 1433616 1460680 1476160 1479404 1470848 1451350 1422006 1384439 1340907 1293848
60474A293848m8720m9360m9226m7766m4466l9800l5086l1283k8273k5389k2445
$$ 1293848 1245128 1195768 1146542 1098776 1054310 1014510 979424 948141 919868 894479 872034
60463H72034j9833j7798j6009j4024j1916j0187r119q465p791o931o004n184m629
$$ 872034 852201 834403 818394 804370 792454 782267 773148 764683 756892 749961 743957 738773 734144
60450G34144m565n047n639n556m456k958k173k668m060n481o214n916m631k873
$$ 734144 729579 724532 718893 713337 708881 705923 703750 701082 697022 691541 685327 679411 674780 671907
60436F71907j439q25q17q74q34j025j643k297k355j644o91k24n27j219j631j488
$$ 671907 670468 669643 668826 667952 667118 666093 664450 662153 659798 658154 657463 657239 656712 655493 653862 652374
60420F52374j112r80j080q81MJ255K136K233J854J651J971K570K892K607J860
$$ 652374 651262 650282 649202 648321 648325 649580 651716 653949 655803 657454 659425 661995 664887 667494 669354
60405F69354J074M99J14j22j08K08O45R79J218J511J848K039J990J815J690J693
$$ 669354 670428 670927 671041 670919 670811 671019 671664 672643 673861 675372 677220 679259 681249 683064 684754 686447
60389F86447J775J781J569J264J265J781K423K560K058J359Q58N46L60M44Q88
$$ 686447 688222 690003 691572 692836 694101 695882 698305 700865 702923 704282 705140 705686 706046 706490 707378
60374G07378J455J761J536O87n50j435j196O6J267J520J093Q26R73J089R07P58
$$ 707378 708833 710594 712130 712817 712267 710832 709636 709702 710969 712489 713582 714408 715381 716470 717377 718135
60358G18135J072J876K780L306L293L132L420M155M605M292L776L981M986O039
$$ 718135 719207 721083 723863 727169 730462 733594 737014 741169 745774 750066 753842 757823 762809 768848
60344G68848O571O585O206N572N166N512O357O799O366N443M471L311J680l95
$$ 768848 775419 782004 788210 793782 798948 804460 810817 817616 823982 829425 833896 837207 838887 838492
60330H38492k733n100o854p213o283n235m940m911m190k757j406n42J17P96J299
$$ 838492 835759 830659 823805 816592 810309 805074 800134 795223 791033 788276 786870 786328 786445 787241 788540
60315G88540J432J354J403J926L161M943O664P946R219J1194J3820J6329J8260
$$ 788540 789972 791326 792729 794655 797816 802759 809423 817369 826588 837782 851602 867931 886191
60302H86191J9994K2087K4558K6930K8638K9143K7940K4749J9717J3402O520l60
$$ 886191 906185 928272 952830 979760 1008398 1037541 1065481 1090230 1109947 1123349 1129869 1129509
60290A129509p063j3517j9113k2639k3333k1819j9626j7754j6196j4726j3544
$$ 1129509 1122446 1108929 1089816 1067177 1043844 1022025 1002399 984645 968449 953723 940179
60279I40179j2946j2778j2572j1990j0997r874r121r067r379r261q330p035o024
$$ 940179 927233 914455 901883 889893 878896 869022 859901 850834 841455 832194 823864 816829 810805
60266H10805n405m859m226l620l082k485j757r78k57L22O30N90L51K51N52J165
$$ 810805 805400 800541 796315 792695 789613 787128 785371 784393 784136 784458 785088 785678 786029 786280 786832 787997
60250G87997J683J718J268P86P15J025J338J448J515J604J422P15k63r56j131
$$ 787997 789680 791398 792666 793452 794167 795192 796530 797978 799493 801097 802519 803234 802971 802015 800884
60235H00884r71o20K9J026K078K764K962K884K805K852L075L492M008M286L917
$$ 800884 799913 799293 799322 800348 802426 805190 808152 811036 813841 816693 819768 823260 827268 831554 835471
60220H35471K825J518P92J103K211L441M222M331L848L044K326K074K364K908
$$ 835471 838296 839814 840606 841709 843920 847361 851583 855914 859762 862806 865132 867206 869570 872478
60206H72478L296L282K825J961Q13l38j104j223p79k24q8n90j448k139k433k572
$$ 872478 875774 879056 881881 883842 884655 884317 883213 881990 881211 880987 880899 880309 878861 876722 874289 871717
60190H71717k824l029k798k103j372r39p29n52m49m97n22k71K35P56J144J380
$$ 871717 868893 865864 863066 860963 859591 858652 857923 857371 856922 856425 855903 855632 855867 856623 857767 859147
60174H59147J449J403J507K003K795L496L866L978M119M580N406O081N826M517
$$ 859147 860596 861999 863506 865509 868304 871800 875666 879644 883763 888343 893749 899830 905656 910173
60160I10173L082K448K405K054J198N00L53M40O09J246K391L291L386L092L064
$$ 910173 913255 915703 918108 920162 921360 921860 922213 922653 923262 924508 926899 930190 933576 936668 939732
60145I39732L257L378L663M424N246N476N310N536O372P345Q252R431J0964J2274
$$ 939732 942989 946367 950030 954454 959700 965176 970486 976022 982394 989739 997991 1007422 1018386 1030660
60131A030660J2679J1902R952P137M147J596o39l078n616p496q373q719q968q942
$$ 1030660 1043339 1055241 1065193 1072330 1076477 1078073 1077434 1074356 1068740 1061244 1052871 1044152 1035184 1026242
60117A026242q431p719p167o772o488o532o901p120o860o462o386o485o252n555
$$ 1026242 1017811 1010092 1002925 996153 989665 983133 976232 969112 962252 955790 949404 942919 936667 931112
60103I31112m624l627k626j731q89K43J797L333M427N330O472P589Q001P784P902
$$ 931112 926488 922861 920235 918504 917615 917858 919655 922988 927415 932745 939217 946806 954807 962591 970493
60088I70493R040J0792J2289J3204J3795J4284J4483J3995J2592J0415P830N034
$$ 970493 979533 990325 1002614 1015818 1029613 1043897 1058380 1072375 1084967 1095382 1103212 1108246
60076A108246J852j905o002r887j3203j5900j7885j8913j8941j8282j7324j6232
$$ 1108246 1110098 1108193 1102191 1092304 1079101 1063201 1045316 1026403 1007462 989180 971856 955624
60064I55624j5066j3866j2540j0883q952p253o305o103o150o008n607n107m617
$$ 955624 940558 926692 914152 903269 894317 887064 880759 874656 868506 862498 856891 851784 847167
60051H47167m123l613l129k606j759l14J465K696K661J639O68M10N58M25k78j420
$$ 847167 843044 839431 836302 833696 831937 831623 833088 835784 838445 840084 840752 841162 841720 842145 841867 840447
60035H40447k791m063m724m550m098m231n140o262p155p956q813r407r401r037
$$ 840447 837656 833593 828869 824319 820221 815990 810850 804588 797433 789477 780664 771257 761856 752819
60021G52819q800q686q245p301o204n302m563l850l270k957k708k154j328p76
$$ 752819 744019 735333 727088 719787 713583 708281 703718 699868 696598 693641 690933 688779 687451 686675
60007F86675q42j000l04J290K508K146P14j8P89K093K587K484K851L785M354M196
$$ 686675 685833 684833 684529 685819 688327 690473 691187 691169 691958 694051 696638 699122 701973 705758 710112 714308
59991G14308M007M273M568M572M758N410N729M831L111J698Q61r6j491k746l301
$$ 714308 718315 722588 727156 731728 736486 741896 747625 752456 755567 757265 758126 758030 756539 753793 750492
59976G50492l306l096k621j728o13L05P70P81N59M36N31N85L89L03Q75J919K553
$$ 750492 747186 744090 741469 739741 739128 739433 740203 740984 741543 741979 742510 743095 743484 743787 744662 746581 749134
59959G49134K284J608J210J079P62J36n34j093j611k118k561l044l733m492m867
$$ 749134 751418 753026 754236 755315 756077 756213 755679 754586 752975 750857 748296 745252 741519 737027 732160
59944G32160m585l944l510l508l594l354k911k818l256l588l031j628k47L71K72
$$ 732160 727575 723631 720121 716613 713019 709665 706754 703936 700680 697092 694061 692433 692186 692557 692829
59929F92829k8r1K71J005J764K064J754J178Q00Q25J296K260L558M682N165N057
$$ 692829 692801 692710 692981 693986 695750 697814 699568 700746 701546 702371 703667 705927 709485 714167 719332 724389
59913G24389M789M656M591M459M357M518M909N043M309K694J103O16J362K371
$$ 724389 729178 733834 738425 742884 747241 751759 756668 761711 766020 768714 769817 770433 771795 774166
59899G74166K694K367K078K192K540K972L635M585N470N900N951O039O373O783
$$ 774166 776860 779227 781305 783497 786037 789009 792644 797229 802699 808599 814550 820589 826962 833745
59885H33745P119P561Q239Q772Q512P393O165N541N369M927L801K138J80j922
$$ 833745 840864 848425 856664 865436 873948 881341 887506 893047 898416 903343 907144 909282 909462 907540
59871I07540l927n521o710p720q466q489p716o883o854p677q545q611p681o233
$$ 907540 903613 898092 891382 883662 875196 866707 858991 852108 845254 837577 829032 820421 812740 806507
59857H06507m938m080l342k234p96L65Q26R31J403K459L562M079M088M349N447
$$ 806507 801569 797489 794147 791913 791117 791482 792308 793239 794642 797101 800663 804742 808830 813179 818626
59842H18626O971P958Q205Q753J0563J3078J4766J5048J4810J4810J4452J2721
$$ 818626 825597 833555 841760 850513 861076 874154 888920 903968 918778 933588 948040 960761
59830I60761R769O804M672L208J892M81j131l221o068r561j3164j6207j8264j9248
$$ 960761 970530 977334 982006 985214 987106 987587 986456 983235 977167 967606 954442 938235 919971 900723
59816I00723j9254j8403j6984j5514j4284j2889j0796q336o561n843n298m048
$$ 900723 881469 863066 846082 830568 816284 803395 792599 784263 777702 771859 766561 762513
59804G62513k471j563j452j389j003p74j179j984k647k908k802k447k048j885
$$ 762513 760042 758479 757027 755638 754635 753861 752682 750698 748051 745143 742341 739894 737846 735961
59790G35961k081k512k922k979k380j196n5L50N8k25K6O28J056J049P31M28M93
$$ 735961 733880 731368 728446 725467 723087 721891 721836 722186 722244 722019 722045 722673 723729 724778 725509 725937 726430
59773G26430J010J590J731J509J656K631L878M332L697K830K724L372L931L903
$$ 726430 727440 729030 730761 732270 733926 736557 740435 744767 748464 751294 754018 757390 761321 765224
59759G65224L719L996M621M995M931M822M901M944M815M750M816M631L955L192
$$ 765224 768943 772939 777560 782555 787486 792308 797209 802153 806968 811718 816534 821165 825120 828312
59745H28312K774K501J993J434J222J156O46l38j202j575j587j317o70N3K09k65
$$ 828312 831086 833587 835580 837014 838236 839392 840038 839700 838498 836923 835336 834019 833349 833402 833611 833346
59729H33346o46m44o0J5K3M15R06Q99N21M97R99J389J281J124J354J602J272O01
$$ 833346 832700 832256 832196 832211 832234 832649 833555 834454 834975 835472 836471 837860 839141 840265 841619 843221 844493 845094
59711H45094M30J023J841K411K815L097K927K360K247L141M186M016K610J302
$$ 845094 845524 846547 848388 850799 853614 856711 859638 861998 864245 867386 871572 875588 878198 879500
59697H79500R28R30O04J28k00q18k063l226l379k757k290k090j522o51l66q66
$$ 879500 880428 881358 881962 882090 881890 881072 879009 875783 872404 869647 867357 865267 863745 863094 862728 861862
59681H61862j160n22M14O59K23j92l99q40j754k839l734m443n195o115p051p657
$$ 861862 860702 860180 860594 861253 861476 861284 860885 860045 858291 855452 851718 847275 842080 835965 828914 821257
59665H21257p703p367o998o649o067n216m382l631k603j073O04J915K784L378
$$ 821257 813554 806187 799189 792540 786473 781257 776875 773244 770641 769568 770172 772087 774871 778249
59651G78249L679L600L355L295L375L084K002K82j348k085j730r54o49r28j073
$$ 778249 781928 785528 788883 792178 795553 798637 800639 800921 799573 797488 795758 794804 794155 793227 792154
59636G92154n64K59Q68J337J955K446K260J533J017R89R20M73J94P76K008K990
$$ 792154 791590 791849 792717 794054 796009 798455 800715 802248 803265 804254 805174 805647 805841 806617 808625 811615
59620H11615L200K915K567K134J305M5j204j797j417l81N69Q86O91N35P34J091
$$ 811615 814815 817730 820297 822431 823736 823781 822577 820780 819363 818982 819551 820437 821128 821663 822397 823488
59604H23488J284J357J630K203K682K460J279m46j849k271j811j131p50o88p63
$$ 823488 824772 826129 827759 829962 832644 835104 836383 835937 834088 831817 830006 828875 828125 827437 826674
59589H26674r34j106r75m03J81J91l34q22j031j315j961k728l245l447l419l196
$$ 826674 825740 824634 823659 823256 823437 823628 823294 822472 821441 820126 818165 815437 812192 808745 805326 802130
59573H02130k946k953l148l100k678k276k052j472j71J241J910J917J996K331
$$ 802130 799184 796231 793083 789983 787305 785029 782977 781505 781334 782575 784485 786402 788398 790729
59559G90729K423K146K040K386K686K363J518P36M82Q24J441J819J839K117L337
$$ 790729 793152 795298 797338 799724 802410 804773 806291 807027 807509 808333 809774 811593 813432 815549 818886
59544H18886N293P083Q311R454J0989J2830J4861J7309K0071K2227K2736K1375
$$ 818886 824179 831262 839573 849027 860016 872846 887707 905016 925087 947314 970050 991425
59532I91425J8632J5137J1695R457R249J0709J2485J3404J3209J2275J0938R114
$$ 991425 1010057 1025194 1036889 1046346 1055595 1066304 1078789 1092193 1105402 1117677 1128615 1137729
59520A137729O408K639j662n460q193j0376j2931j5978j8578j9714j9290j8106
$$ 1137729 1144137 1146776 1145114 1139654 1131461 1121085 1108154 1092176 1073598 1053884 1034594 1016488
59508A016488j6983j6010j4710j2791j0640q949p948p276o521n666m937m424l976
$$ 1016488 999505 983495 968785 955994 945354 936405 928457 921181 914660 908994 904057 899633 895657
59495H95657l375k607k036k083k617k796j929k73J357K697M068N530O707P641
$$ 895657 892282 889675 887639 885556 882939 880143 878214 877941 879298 881995 886063 891593 898300 905941
59481I05941R054J1298J3651J5138J5669J5832J5923J5673J4728J2927J0340P379
$$ 905941 914995 926293 939944 955082 970751 986583 1002506 1018179 1032907 1045834 1056174 1063553
59469A063553M711K626P56j145k386j868O12M093P504J0623J3869J7542K1452
$$ 1063553 1068264 1070890 1071646 1070501 1068115 1066247 1066859 1070952 1078456 1089079 1102948 1120490 1141942
59456A141942K5068K7834K9469K9995K9552K8292K6467K4413K2243J9674J6244
$$ 1141942 1167010 1194844 1224313 1254308 1283860 1312152 1338619 1363032 1385275 1404949 1421193
59445A421193J1582N385k483j1560k0558k7875l2373l3784l2683l0236k7632k5311
$$ 1421193 1432775 1438160 1435677 1424117 1403559 1375684 1343311 1309527 1276844 1246608 1218976 1193665
59433A193665k2926k0210j7591j5593j3873j1368p365k143L325Q002J1396J3940
$$ 1193665 1170739 1150529 1132938 1117345 1103472 1092104 1084739 1082596 1085921 1093923 1105319 1119259
59421A119259J6733K0357K3984K6096K6158K5072K3910K2687K0698J7571J3454
$$ 1119259 1135992 1156349 1180333 1206429 1232587 1257659 1281569 1304256 1324954 1342525 1355979
59410A355979Q326J690o750j6288k5207l1498l3752l1781k6796k0829j5512j1246
$$ 1355979 1364305 1365995 1359245 1342957 1317750 1286252 1252500 1220719 1193923 1173094 1157582 1146336
59398A146336p751n502o029j0293j7091k3662k7863k9273k8493k6189k3069j9883
$$ 1146336 1138585 1133083 1127054 1116761 1099670 1076008 1048145 1018872 990379 964190 941121 921238
59386I21238j6911j3848j0652q053o686o115n286l746j973o73j87l88p12m58M66
$$ 921238 904327 890479 879827 871774 865088 858973 853687 849941 847968 847295 847108 846720 846008 845550 846016
59371H46016J268J254Q93J309K727M102M487M207M344N464P262R267J1440J4010
$$ 846016 847284 848538 849431 850740 853467 857569 862056 866263 870607 876071 883333 892600 904040 918050
59357I18050J7000K0132K3081K5675K7811K9473L0962L2849L5279L7429L8183
$$ 918050 935050 955182 978263 1003938 1031749 1061222 1092184 1125033 1160312 1197741 1235924
59346A235924L7313L5494L3089K9543K4306J7715J0579L385l626j0079j5768k0981
$$ 1235924 1273237 1308731 1341820 1371363 1395669 1413384 1423963 1427348 1423722 1413643 1397875 1376894
59334A376894k5990l0482l3983l6449l7859l7734l5861l3202l1051k9429k7227
$$ 1376894 1350904 1320422 1286439 1249990 1212131 1174397 1138536 1105334 1074283 1044854 1017627
59323A017627k4001k0560j7638j5026j2390j0098q567p460o212m864l754k754
$$ 1017627 993626 973066 955428 940402 928012 917914 909347 901887 895675 890811 887057 884303
59311H84303j545l94P7q7j00N14J267J435J037P49J012J666K414L325M635O295
$$ 884303 882758 882364 882441 882354 882254 882768 884035 885470 886507 887256 888268 889934 892348 895673 900308 906603
59295I06603Q012R621J1140J2478J3503J4489J6097J8596K1385K3487K4272K3497
$$ 906603 914615 924236 935376 947854 961357 975846 991943 1010539 1031924 1055411 1079683 1103180
59283A103180K1034J7056J2290P688L923J483R08K376N180Q225J1022J3659J5847
$$ 1103180 1124214 1141270 1153560 1161248 1165171 1166654 1167562 1169938 1175118 1183343 1194365 1208024 1223871
59270A223871J6686J5670J3358J0699P995M859R08l760q657j3257j7257k0557
$$ 1223871 1240557 1256227 1269585 1280284 1288279 1293138 1294046 1290286 1281629 1268372 1251115 1230558
59258A230558k2988k4245k4313k3787k3348k2942k1924j9994j7565j5069j2432
$$ 1230558 1207570 1183325 1159012 1135225 1111877 1088935 1067011 1047017 1029452 1014383 1001951
59247A001951r453o319l430r25J357L698O395R593J2937J5573J6805J6528J4956
$$ 1001951 992498 986179 982749 981824 983181 986879 993274 1002867 1015804 1031377 1048182 1064710 1079666
59234A079666J2228Q581M670J185j847n066q923j3106j6881j9818k1899k3082
$$ 1079666 1091894 1100475 1105145 1106330 1104483 1099417 1090494 1077388 1060507 1040689 1018790 995708
59222I95708k3066k1675j9310j6795j4707j3002j1291r399p582o319n854n897
$$ 995708 972642 950967 931657 914862 900155 887153 875862 866463 858881 852562 846708 840811
59210H40811n816n265m496l861l199k146q88n3K23L89N70L10l31k51J350L619
$$ 840811 834995 829730 825234 821373 818174 816028 815140 815087 815310 815699 816269 816579 816248 815997 817347 820966
59194H20966M993N114M968N217N475N301N050N321O159P178Q006Q380Q214P813
$$ 820966 825959 831073 836041 841258 846733 852034 857084 862405 868564 875742 883748 892128 900342 908155
59180I08155P727Q185Q902R600J0361J1387J2735J4381J6272J8163J9761K1129
$$ 908155 915882 924067 932969 942569 952930 964317 977052 991433 1007705 1025868 1045629 1066758
59168A066758K2572K3945K4356K2950J9824J5986J2399R147N598J319l350p756
$$ 1066758 1089330 1113275 1137631 1160581 1180405 1196391 1208790 1217937 1223535 1224854 1221504 1213748
59156A213748j1713j5316j8141j9416j9283j8995j9320j9561j8921j8054j8012
$$ 1213748 1202035 1186719 1168578 1149162 1129879 1110884 1091564 1072003 1053082 1035028 1017016
59145A017016j8288j7331j4896j2425j0980j0136r220q300p423o117m346k913
$$ 1017016 998728 981397 966501 954076 943096 932960 923740 915440 908017 901900 897554 894641
59133H94641k171j337J35J454J802J887L012N158P187Q589R880J1423J3051J4843
$$ 894641 892470 891133 891268 892722 894524 896411 899423 904581 911768 920357 930237 941660 954711 969554
59119I69554J7194J9879K2007K3188K4013K5064K6135K6805K7179K7498K7407
$$ 969554 986748 1006627 1028634 1051822 1075835 1100899 1127034 1153839 1181018 1208516 1235923
59108A235923K6249K3897K0923J8027J5613J3746J2084R835O296J721k643n677
$$ 1235923 1262172 1286069 1306992 1325019 1340632 1354378 1366462 1376297 1382593 1384314 1381671 1375994
59096A375994p463q829j0017j0355r398p803o678o419o705p268q135r256j0602
$$ 1375994 1368531 1359702 1349685 1339330 1329932 1322129 1315451 1309032 1302327 1295059 1286924 1277668 1267066
59083A267066j2489j5141j7960j9858k0510k0549k0356j9464j7548j5319j3767
$$ 1267066 1254577 1239436 1221476 1201618 1181108 1160559 1140203 1120739 1103191 1087872 1074105
59072A074105j2910j1995j0694r506q934q800q552p934p169o564o135n696n225
$$ 1074105 1061195 1049200 1038506 1029000 1020066 1011266 1002714 994780 987611 981047 974912 969216 963991
59059I63991m921m812m590m103l665l631l847l976m045m173m064l403k580k209
$$ 963991 959070 954258 949668 945565 941900 938269 934422 930446 926401 922228 918164 914761 912181 909972
59045I09972k057j334oJ147J874K847M336N609O118O433P248Q289R034R923J1896
$$ 909972 907915 906581 906575 907722 909596 912443 916779 922388 928506 934939 942187 950476 959510 969433 981329
59030I81329J5017J8272K0662K2021K2924K4058K5482K6365K5797K3972K1858
$$ 981329 996346 1014618 1035280 1057301 1080225 1104283 1129765 1156130 1181927 1205899 1227757
59019A227757J9694J6641J2380P964M438J566j170l189l655l054k606k420j501
$$ 1227757 1247451 1264092 1276472 1284436 1288874 1290440 1289270 1286081 1282426 1279372 1276766 1274346 1272845
59006A272845M95K752M700O755R312J1826J3424J3841J3444J2678J1778J0680
$$ 1272845 1273340 1276092 1280792 1287547 1296859 1308685 1322109 1335950 1349394 1362072 1373850 1384530
58994A384530R094O871M255J441j895o119j0796j4876j7750j9662k1057k1991
$$ 1384530 1393624 1400495 1404750 1406191 1404296 1398177 1387381 1372505 1354755 1335093 1314036 1292045
58982A292045k2213k1434j9511j6769j4040j1929j0078p639m437j096J935M920
$$ 1292045 1269832 1248398 1228887 1212118 1198078 1186149 1176071 1168432 1163995 1162899 1164834 1169754
58970A169754Q189J1528J4475J6924J9102K1146K2847K3773K3590K2327K0237
$$ 1169754 1177943 1189471 1203946 1220870 1239972 1261118 1283965 1307738 1331328 1353655 1373892
58959A373892J7290J3023P117o9p678j4839k0723k4622k6507k7269k7794k7884
$$ 1373892 1391182 1404205 1411322 1411253 1403575 1388736 1368013 1343391 1316884 1289615 1261821 1233937
58947A233937k6568k3479j9296j4890j0567o289k211J221L441M017K958P94j887
$$ 1233937 1207369 1183890 1164594 1149704 1139137 1132848 1130637 1131858 1135299 1139316 1142274 1143068 1141181
58934A141181m890q204j1512j4326j6498j8084j8857j8407j6830j4791j2754j0610
$$ 1141181 1136291 1128087 1116575 1102249 1085751 1067667 1048810 1030403 1013573 998782 986028 975418
58922I75418q232n981m363l381k560j505k25J075K333L652N044O343P395Q283
$$ 975418 967186 961205 956842 953461 950901 949396 949171 950246 952579 956231 961275 967618 975013 983296
58908I83296R181J0201J1516J3450J6054J8741K0842K2453K4155K6004K7469K8530
$$ 983296 992477 1002678 1014194 1027644 1043698 1062439 1083281 1105734 1129889 1155893 1183362 1211892
58896A211892K9939L2054L4172L5672L7087L9371M2476M5429M7457M8295M7604
$$ 1211892 1241831 1273885 1308057 1343729 1380816 1420187 1462663 1508092 1555549 1603844 1651448
58885A651448M4813L9628L2360K3749J4653N689l167j2305k1621l0265l7473m3106
$$ 1651448 1696261 1735889 1768249 1791998 1806651 1812340 1809173 1796868 1775247 1744982 1707509 1664403
58873A664403m7087m8913m8290m5742m2117l8004l4008l0895k8780k6790k4286
$$ 1664403 1617316 1568403 1520113 1474371 1432254 1394250 1360242 1329347 1300567 1273777 1249491
58862A249491k1877k0432j9731j8983j8179j7855j7855j7385j6190j4798j3708
$$ 1249491 1227614 1207182 1187451 1168468 1150289 1132434 1114579 1097194 1081004 1066206 1052498
58851A052498j3081j3029j3422j3705j3644j3883j4920j5929j5622j3969j2019
$$ 1052498 1039417 1026388 1012966 999261 985617 971734 956814 940885 925263 911294 899275
58840H99275j0313q617p016n999n444m638l478k588k145j627q34j23N20J603L054
$$ 899275 888962 880345 873329 867330 861886 857248 853770 851182 849037 847410 846576 846453 846973 848576 851630
58825H51630L996M006L703L762M000L828L048J973J088O44J93j104l153m488m078
$$ 851630 855626 859632 863335 867097 871097 874925 877973 879946 881034 881678 881871 880767 877614 873126 869048
58810H69048k991k997l965m206l177k121j844j638r75n59r11j256q35j67o0k21
$$ 869048 866057 863060 859095 854889 851712 849591 847747 846109 845134 844575 843664 842408 841573 841406 841346 841125
58794H41125J99J360K759L937M599M669M729N675P481R014R518R462R501R520
$$ 841125 841324 842684 845443 849380 853979 858648 863377 869052 876533 885547 895065 904527 914028 923548
58780I23548R227Q836Q469P755O605N695N435N235M361K906J264n59k463l843
$$ 923548 932775 941611 950080 957835 964440 970135 975570 980805 985166 988072 989336 988777 986314 982471
58766I82471m324m260l878k775r24O44J094J003J400K166K409J994J723K156L113
$$ 982471 978147 973887 970009 967234 966310 966954 968048 969051 970451 972617 975026 977020 978743 980899 984012
58751I84012M193N161N894O451P027P584P851P989Q733J0400J2329J3785J4940
$$ 984012 988205 993366 999260 1005711 1012738 1020322 1028173 1036162 1044895 1055295 1067624 1081409 1096349
58738A096349J6394J8265K0252K2089K3417K3769K3238K2617K2273K1445J9327
$$ 1096349 1112743 1131008 1151260 1173349 1196766 1220535 1243773 1266390 1288663 1310108 1329435
58727A329435J6296J3347J0773Q303O119M831M513M462M010L036J751L51j154
$$ 1329435 1345731 1359078 1369851 1378154 1384273 1389104 1393617 1398079 1402089 1405125 1406876 1407227 1406073
58714A406073k957n193p569r615j1294j2978j4754j6369j7939k0015k2652k5227
$$ 1406073 1403116 1397923 1390354 1380739 1369445 1356467 1341713 1325344 1307405 1287390 1264738 1239511
58702A239511k7316k9043l0303l0580k9897k8933k7740k5472k1993j8633j6470
$$ 1239511 1212195 1183152 1152849 1122269 1092372 1063439 1035699 1010227 988234 969601 953131
58691I53131j4917j2962j0895r608q991q225p151o133n063l631k250j624j539
$$ 953131 938214 925252 914357 904749 895758 887533 880382 874249 869186 865555 863305 861681 860142
58678H60142j022M18K465M592O365P426Q031R183J1621J4887J8004K0541K2377
$$ 860142 859120 859538 862003 866595 872960 880386 888417 897600 909221 924108 942112 962653 985030
58665I85030K3114K2528K1056J8944J5492J0120L649k454p631j2054j5442j7203
$$ 985030 1008144 1030672 1051728 1070672 1086164 1096284 1099933 1097479 1089848 1077794 1062352 1045149
58653A045149j7451j6786j5366j3199j0977r453q309o729m812l269k025m20J310
$$ 1045149 1027698 1010912 995546 982347 971370 961917 953608 946879 942067 938798 936773 936353 937663
58640I37663K152J932J522J321P06o77k185l111l421l300k812k308k291k530k020
$$ 937663 939815 941747 943269 944590 945296 944619 942434 939323 935902 932602 929790 927482 925191 922661 920641
58625I20641j32K814O328J0311J4635J8786K2398K5609K8549L0856L1939L1505
$$ 920641 920509 923323 929651 939962 954597 973383 995781 1021390 1049939 1080795 1112734 1144239
58613A144239K9735K7139K4076K0167J4476O884j021p083j0563j2477j4073j5676
$$ 1144239 1173974 1201113 1225189 1245356 1259832 1266716 1265695 1258612 1248049 1235572 1221499 1205823
58601A205823j6913j7362j6781j5292j3414j1596r699p283m333j302J478M099
$$ 1205823 1188910 1171548 1154767 1139475 1126061 1114465 1104766 1097483 1093150 1091848 1093326 1097425
58589A097425O920J0242J3974J7318J9273J9666J9245J8496J7052J4668J1913
$$ 1097425 1104345 1114587 1128561 1145879 1165152 1184818 1204063 1222559 1239611 1254279 1266192
58578A266192R310O571L575J263N70J134K186M145P971J3311J8557K2674K5874
$$ 1266192 1275502 1282073 1285648 1286911 1287481 1288615 1290801 1294946 1302917 1316228 1334785 1357459 1383333
58565A383333K8574L0726L2211L2906L2348L0129K6676K2833J8782J4080Q643
$$ 1383333 1411907 1442633 1474844 1507750 1540098 1570227 1596903 1619736 1638518 1652598 1661241
58554A661241K980k397p134j0905j3803j6507j9318k1492k2325k2301k2295k2219
$$ 1661241 1664221 1661824 1654690 1643785 1629982 1613475 1594157 1572665 1550340 1528039 1505744 1483525
58542A483525k1612k0906k0798k0729j9456j6946j4449j2800j1882j1445j1188
$$ 1483525 1461913 1441007 1420209 1399480 1380024 1363078 1348629 1335829 1323947 1312502 1301314
58531A301314j0205p781m657k188l90J854M804P610J0021J2705J5656J7821J8669
$$ 1301314 1291109 1283328 1278671 1276483 1276093 1277947 1282751 1290361 1300382 1313087 1328743 1346564 1365233
58518A365233J8791J8597J7753J6276J4861J3694J2185J0287Q837Q143P387N968
$$ 1365233 1384024 1402621 1420374 1436650 1451511 1465205 1477390 1487677 1496514 1504657 1512044 1518012
58506A518012M260K493k8l958q890j3901j8306k1615k3513k4226k4261k3657k2244
$$ 1518012 1522272 1524765 1524737 1520779 1511889 1497988 1479682 1458067 1434554 1410328 1386067 1362410 1340166
58493A340166k0502j9136j7858j5758j2906j0349q270n637j980J787M841P504
$$ 1340166 1319664 1300528 1282670 1266912 1254006 1243657 1235387 1229750 1227770 1229557 1234398 1241902
58481A241902J0205J2437J3446J3060J1387Q411M418R2m145q238j1894j4726j7047
$$ 1241902 1252107 1264544 1277990 1291050 1302437 1310848 1315266 1315358 1311213 1302975 1291081 1276355 1259308
58468A259308j9426k1383k1699k0242j8289j6643j4694j1795q446n499l134j179
$$ 1259308 1239882 1218499 1196800 1176558 1158269 1141626 1126932 1115137 1106691 1101192 1098058 1096879
58456A096879L83J725L227M818N831N792M724K725N3k390l633l713l328k638j370
$$ 1096879 1097262 1098987 1102214 1107032 1112863 1118655 1123379 1126104 1126157 1123767 1120134 1116421 1113093 1110455 1109085
58441A109085J50J378K693M759O888P683P299P362Q452R431R617R921J1202J3044
$$ 1109085 1109235 1110613 1113306 1118065 1124953 1132636 1139935 1147297 1155749 1165180 1174797 1184718 1195920 1208964
58427A208964J4767J6283J7371J7428J6524J5456J4413J2784J0694R240Q842Q684
$$ 1208964 1223731 1240014 1257385 1274813 1291337 1306793 1321206 1333990 1344684 1353924 1362766 1371450
58415A371450Q101P182N709L086l75l620o542r864j3220j5186j5559j5648j5884
$$ 1371450 1379551 1386733 1392442 1395528 1395153 1391533 1384991 1375127 1361907 1346721 1331162 1315514 1299630
58402A299630j5204j3320j1493j0375r259q146q255r553j0149r291q729r766j1190
$$ 1299630 1284426 1271106 1259613 1249238 1239979 1231833 1223578 1214025 1203876 1194585 1185856 1176090 1164900
58389A164900j1651j1861j2683j3075j1892j0048q894p964o246m303l161k244
$$ 1164900 1153249 1141388 1128705 1115630 1103738 1093690 1084796 1076832 1070586 1066283 1063122 1060878
58377A060878k86K579N334P708R797J1015J0924J0355J0365J0877J1440J2300
$$ 1060878 1060592 1063171 1068505 1076213 1086010 1097025 1107949 1118304 1128669 1139546 1150986 1163286
58365A163286J3620J4639J4829J4806J5081J4920J3484J0996P936M411J041r59
$$ 1163286 1176906 1191545 1206374 1221180 1236261 1251181 1264665 1275661 1283597 1288008 1289049 1288090
58353A288090j572k210l312l525k213p99k54O94L334O791R819J2789J6208J8932
$$ 1288090 1286518 1284308 1280996 1277471 1275258 1274459 1274205 1274899 1278233 1285024 1294843 1307632 1323840 1342772
58339A342772J9853J9823K0041J9969J8625J6490J4429J2107R203O598M768K631
$$ 1342772 1362625 1382448 1402489 1422458 1441083 1457573 1472002 1484109 1493312 1499910 1504678 1507309
58327A507309k94k348k196j060n60j48J204K606K893L045M577O866Q431R440J0711
$$ 1507309 1507015 1504667 1502471 1501411 1500851 1500703 1501907 1504513 1507406 1510451 1515028 1521894 1530325 1539765 1550476
58312A550476J1666J1645J1861J3596J5713J6341J5908J6101J6990J7477J7549
$$ 1550476 1562142 1573787 1585648 1599244 1614957 1631298 1647206 1663307 1680297 1697774 1715323
58301A715323J7826J7823J6808J5397J4417J3389J1878J0939J1314J1844J1545
$$ 1715323 1733149 1750972 1767780 1783177 1797594 1810983 1822861 1833800 1845114 1856958 1868503
58290A868503J1519J2750J3946J3854J3729J5092J6963J7856J8508K0019K1339
$$ 1868503 1880022 1892772 1906718 1920572 1934301 1949393 1966356 1984212 2002720 2022739 2044078
58279B044078K1462K2029K4751K8130K9871L0706L2690L5609L8238M1319M5926
$$ 2044078 2065540 2087569 2112320 2140450 2170321 2201027 2233717 2269326 2307564 2348883 2394809
58268B394809N0609N3510N5647N8761O1686O2204O0776N9090N6850N3363N0308
$$ 2394809 2445418 2498928 2554575 2613336 2675022 2737226 2798002 2857092 2913942 2967305 3017613
58257C017613M9247M8487M6105M4067M5396M9279N2906N6134O0393O5060O9048
$$ 3017613 3066860 3115347 3161452 3205519 3250915 3300194 3353100 3409234 3469627 3534687 3603735
58246C603735P3873Q0994Q8307R3409R7919J04295J11084J15944J20604J27873
$$ 3603735 3677608 3758602 3846909 3940318 4038237 4142532 4253616 4369560 4490164 4618037
58236D618037J36492J43952J51615J61804J72937J82885J93948K08788K24966
$$ 4618037 4754529 4898481 5050096 5211900 5384837 5567722 5761670 5970458 6195424
58227F195424K39584K55470K76137K98708L19100L40303L67633L99677M32300
$$ 6195424 6435008 6690478 6966615 7265323 7584423 7924726 8292359 8692036 9124336
58218I124336M67661N10369N58602O08471O63528P30219Q07791Q92897R90092
$$ 9124336 9591997 10102366 10660968 11269439 11932967 12663186 13470977 14363874 15353966
58209A5353966J107016J243862J399504J583715J811136K088835K424343K841810
$$ 15353966 16460982 17704844 19104348 20688063 22499199 24588034 27012377 29854187
58201B9854187L377375M068345M967134O155697P708206R617543J1767510J3999354
$$ 29854187 33231562 37299907 42267041 48422738 56130944 65748487 77515997 91515351
58193I1515351J6237981J8588946K1297798K4521811K8054194L1283132L3464921
$$ 91515351 107753332 126342278 147640076 172161887 200216081 231499213 264964134
58186B64964134L3986163L2288034K7679838J9608309Q408492m252324j5927223
$$ 264964134 298950297 331238331 358918169 378526478 386934970 382682646 366755423
58179C66755423k4594925k9492417l1030247l0165034k7862352k4866887k1656935
$$ 366755423 342160498 312668081 281637834 251472800 223610448 198743561 177086626
58172A77086626j8486573j5488409j2761792j0392140q457837p066639o338761
$$ 177086626 158600053 143111644 130349852 119957712 111499875 104433236 98094475
58165I8094475o280979o680087p175158p457560p400347p033449o456264n780437
$$ 98094475 91813496 85133409 77958251 70500691 63100344 56066895 49610631 43830194
58157D3830194n100050m469020l901544l396410k952054k561825k214441j906002
$$ 43830194 38730144 34261124 30359580 26963170 24011116 21449291 19234850 17328848
58149A7328848j640530j416558j224590j059070r21288q09007p14233o32865n66479
$$ 17328848 15688318 14271760 13047170 11988100 11066812 10257805 9543572 8910707 8344228
58140H344228n13362m67309m26302l92988l65727l38191l08829k81949k58626
$$ 8344228 7830866 7363557 6937255 6544267 6178540 5840349 5531520 5249571 4990945
58131D990945k35101k10988j90576j74740j59661j44842j34569j29949j26851
$$ 4990945 4755844 4544856 4354280 4179540 4019879 3875037 3740468 3610519 3483668
58122C483668j23219j21228j20726j17627j10729j03644r8195r2010q4322p7993
$$ 3483668 3360449 3239221 3118495 3000868 2890139 2786495 2688300 2596290 2511968 2433975
58112B433975p4039o9822o4509o0777n9375n7352n3523n0556m9774m8777m6128
$$ 2433975 2359936 2290114 2225605 2164828 2105453 2048101 1994578 1944022 1894248 1845471 1799343
58101A799343m3729m2618m0847l7386l4085l2045k9868k6985k4824k3439k0898
$$ 1799343 1755614 1712996 1672149 1634763 1600678 1568633 1538765 1511780 1486956 1463517 1442619
58090A442619j7275j5247j5428j5141j3297j2446j4263j6850j8419k0003k2559
$$ 1442619 1425344 1410097 1394669 1379528 1366231 1353785 1339522 1322672 1304253 1284250 1261691
58079A261691k4649k5100k5019k5363k5136k3735k2473k2187k1687j9989j7859
$$ 1261691 1237042 1211942 1186923 1161560 1136424 1112689 1090216 1068029 1046342 1026353 1008494
58068A008494j6002j3994j1938j0860j0600r614p663o252n887n418m653m884o082
$$ 1008494 992492 978498 966560 955700 945100 935486 927823 921571 915684 910266 905613 900729 894647
58055H94647o475n709n548o554o980o029n340n905o304n424m501m892n978o639
$$ 894647 888172 882463 876915 870361 863381 857352 852012 846107 839803 834379 829878 824986 819008 812369
58041H12369o905p028o753o442p013q053q046o998o658p540q155p826p753q456
$$ 812369 805464 798436 791683 785241 778228 770175 762129 755131 748473 740933 732778 724952 717199 708743
58027G08743q706p930p262p209o726n568n053n469n260l942l209l814l894k041
$$ 708743 700037 692107 684845 677636 670910 665342 660289 654820 649560 645618 642409 638595 634701 632660
58013F32660L47J443J623K022K436K373K470L301M242M858N829P363Q433Q710
$$ 632660 633007 634450 636073 638095 640531 642904 645374 648675 652917 657775 663604 670967 679400 688110
57999F88110R439J1227J2776J3061J2926J3256J3456J3058J2938J3402J2932J0418
$$ 688110 697549 708776 721552 734613 747539 760795 774251 787309 800247 813649 826581 836999
57987H36999P050M410K309K1j930k874l543m876o343o890o501n637m285k708j905
$$ 836999 844049 848459 850768 850789 848859 845985 842442 837566 831223 824333 817832 812195 807910 805202 803297
57972H03297k190k538k176j596j214o92l59j398l511m441l222j981k859n016o423
$$ 803297 801107 798569 796393 794797 793583 792891 792532 791134 787623 783182 779960 777979 775120 770104 763681
57957G63681o884p339p647p311p103p915q849q408o794n303m184k786j138K62
$$ 763681 756797 749458 741811 734500 727397 719482 710633 702225 695431 690128 685944 683158 682020 682282
57943F82282J617L341N011O043O821P937R075R814J0665J2202J3955J5270J6316
$$ 682282 683899 687240 692251 698294 705115 713052 722127 731941 742606 754808 768763 784033 800349
57930H00349J7129J6819J4949J2601J0789Q919O231L525J904Q49q01k930m833
$$ 800349 817478 834297 849246 861847 872636 881555 887786 891311 893215 894064 893263 890333 885500
57917H85500o857r561j2086j3181j3277j3813j4960j5657j5471j4905j4232j3456
$$ 885500 878643 869082 856996 843815 830538 816725 801765 786108 770637 755732 741500 728044
57905G28044j3036j3348j3730j3380j2700j2589j2926j2968j2609j2011j0748
$$ 728044 715008 701660 687930 674550 661850 649261 636335 623367 610758 598747 587999
57894E87999q671o838o161n791m434k538j487j315r28j66J85J57N57J343J690
$$ 587999 579328 572490 566329 560538 556104 553566 552079 550764 549836 549670 549855 550012 550569 551912 553602
57879E53602J609J880K396K132Q70n16j599k857m437n687o135n859m876l176j353
$$ 553602 555211 557091 559487 561619 562489 561973 560374 557517 553080 547393 541258 535399 530523 527347 525994
57864E25994k22J99M19N39N89J361L598O585Q800R883J0681J1508J1793J1481
$$ 525994 525772 525971 526390 526929 527518 528879 532477 539062 547862 557745 568426 579934 591727 603208
57850F03208J1393J1901J2357J2119J1262J0059Q642P200N825M167J957l44k180
$$ 603208 614601 626502 638859 650978 662240 672299 680941 688141 693966 698133 700090 699746 697566
57837F97566l760n479o946p656q160r267j0515j0687r698q580p824p108o510o477
$$ 697566 693806 688327 681381 673725 665565 656298 645783 635096 625398 616818 608994 601886 595376 588899
57823E88899o552n592l504j418qJ117K140K520K171J851K013K260K366K736L455
$$ 588899 582347 576755 573251 571833 571825 572942 575082 577602 579773 581624 583637 585897 588263 590999 594454
57808E94454L902L783L640L833L762K606K43k738n395o793o750o248o392p020
$$ 594454 598356 602139 605779 609612 613374 615980 616223 613485 608090 601297 594547 588299 581907 574887
57794E74887p132o545o061o079o187o174o322o463n910m672l683l487l593l429
$$ 574887 567755 561210 555149 549070 542883 536709 530387 523924 518014 513342 509659 506172 502579 499150
57780D99150k966k197r82K97R16R71J339K225K795K682K592K942K942J885L66
$$ 499150 496184 493987 493005 493302 494218 495189 496528 498753 501548 504230 506822 509764 512706 514591 514957
57765E14957o54j238k142l649n511p471r108r690q917p599o936p280q030q469
$$ 514957 514303 513065 510923 507274 501763 494292 485184 475494 466577 458978 452042 444762 436732 428263
57751D28263q257p405o220n135m301l482k555j898k030k999m280n137n124m380
$$ 428263 420006 412601 406381 401246 396945 393463 390908 389010 386980 383981 379701 374564 369440 365060
57737C65060l440k646j947j411j411j923k123j397l87j41n51n72J19P68Q77Q69
$$ 365060 361620 358974 357027 355616 354205 352282 350159 348762 348375 348234 347683 347111 347230 347998 348875 349744
57721C49744J135J353J154P37M25J96p5l93q01j306j562j253p55p69j254j475
$$ 349744 350879 352232 353386 354123 354548 354744 354669 354276 353475 352169 350607 349354 348599 347830 346576 345101
57705C45101j144p27n04k23J52J95j35k50J38N57N79M40N06P33R61J168J268J200
$$ 345101 343957 343230 342726 342503 342655 342850 342715 342465 342603 343160 343739 344179 344685 345418 346379 347547 348815 350015
57687C50015J383K361L870N051N757O868R002J1753J4626J7962K2532K8743L6531
$$ 350015 351398 353759 357629 362680 368437 375305 384307 396060 410686 428648 451180 479923 516454
57674E16454M5380N4279O2496P0612P9914R0249R9268J04029J02402R2607P2885
$$ 516454 561834 616113 678609 749221 829135 919384 1018652 1122681 1225083 1317690 1390575
57663A390575M3216P035k9676o1099q3508r5731r8970r5938q9322q0797p1515
$$ 1390575 1433791 1440826 1411150 1350051 1266543 1170812 1071842 975904 886582 805785 734270
57652G34270o2681n5005m8133m1436l5125k9912k5871k2314j8750j5365j2531
$$ 734270 671589 616584 568451 527015 491890 461978 436107 413793 395043 379678 367147
57641C67147j0343q694p472o571n877n300m742m129l468k796k143j645j550j853
$$ 367147 356804 348110 340638 334067 328190 322890 318148 314019 310551 307755 305612 303967 302417 300564
57627C00564k132k129k171k569k888k563j973j986k521k552j718r51j107j847
$$ 300564 298432 296303 294132 291563 288675 286112 284139 282153 279632 277080 275362 274411 273304 271457
57613B71457k333k300j994j651j427j360j046L3J560K387J888P42jo2K29O12R39
$$ 271457 269124 266824 264830 263179 261752 260392 259346 259379 260939 263326 265214 265956 265955 265893 266122 266734 267673
57596B67673R80O70K17k62q60j536k052k383k580k322j351l55m20j439k069j636
$$ 267673 268653 269323 269540 269278 268418 266882 264830 262447 259867 257545 256194 255839 255419 253980 251911 250275
57580B50275j018j190j849k180k080j866j509q88k71O3J57n0p89j659j625m35
$$ 250275 249257 248067 246218 244038 241958 240092 238583 237695 237424 237487 237644 237594 236805 235146 233521 233086
57564B33086P82R69M60J66K76N33J021J702J817P55q41j711j429n84J69N72P36
$$ 233086 233868 234837 235297 235463 235739 236272 237293 238995 240812 241567 240726 239015 237586 237002 237171 237743 238479
57547B38479J076J865K472J787r0j500j269j69M37M38L97J12r08k207l013l548
$$ 238479 239555 241420 243892 245679 245589 244089 242820 242651 243088 243526 243923 244035 243127 240920 237907 234359
57531B34359m434n149m637l220k406k736l254l279l333l870m222l497j808q4R50
$$ 234359 229925 224776 220139 216919 214513 211777 208523 205244 201911 198041 193819 190322 188514 188430 189380
57516A89380J214J087J017J148J334J588K198L075L561L339L016L158L313K859
$$ 189380 190594 191681 192698 193846 195180 196768 198966 202041 205602 208941 211957 215115 218428 221287
57502B21287K225K185K404J905P77J48M49R20R40P11L77l28j200j384o52Nl11
$$ 221287 223512 225697 228101 230006 230783 230931 231380 232300 233240 233951 234328 234000 232800 231416 230764 230769 230458
57485B30458j232j780j646j170o22q8K10P0l17n17l88j98k43n49r01j104j147
$$ 230458 229226 227446 225800 224630 224008 223920 224130 224200 223883 223366 222978 222780 222537 221988 221087 219983 218836
57468B18836j068p90l16l0l22q53p47J80J030J019M76J14j5j47M0Q84J843K031
$$ 218836 217768 216978 216662 216632 216310 215457 214710 214890 215920 216939 217415 217529 217514 217367 217407 218291 220134 222165
57450B22165J504J061J002R89R66J204J475J219N48K12M49Q24J187J778K269J821
$$ 222165 223669 224730 225732 226721 227687 228891 230366 231585 232133 232345 232794 233618 234805 236583 238852 240673
57434B40673N04m24k30K16k05j149j333l63Q17J232R28N99N79N48J27n48j053
$$ 240673 241177 240753 240523 240739 240534 239385 238052 237689 238506 239738 240666 241265 241844 242392 242519 241971 240918
57417B40918j334j672k001j828j120n98o56o44O2Q99R46M55L91P52N83l09r36
$$ 240918 239584 237912 235911 234083 232963 232365 231709 231065 231127 232026 232972 233427 233818 234570 235153 234844 233908
57400B33908p10k29o5J90J041K048K441K160J703J280P83K95Q5K10M26N35N91
$$ 233908 233198 232969 232904 233094 234135 236183 238624 240784 242487 243767 244550 244845 244930 245140 245566 246101 246692
57383B46692Q37J390J993K165J739J066M55j33o12m61M94J464J612J187R50Q73
$$ 246692 247529 248919 250912 253077 254816 255882 256337 256204 255592 255131 255625 257089 258701 259888 260838 261711
57367B61711M40q9R9Q97J276R27O86J017J255R09O31J162K109K572K370J981J701
$$ 261711 262151 262062 262161 263058 264334 265261 265947 266964 268219 269128 269759 270921 273030 275602 277972 279953 281654
57350B81654J510J437J545J786K107K442K480J890R28L06K87N22Q22J414K148
$$ 281654 283164 284601 286146 287932 290039 292481 294961 296851 297779 298085 298372 298894 299716 301130 303278
57335C03278K250J334J24l36K29J285K168K421K045J606J708K139K078J366Q94
$$ 303278 305528 306862 306986 306650 306879 308164 310332 312753 314798 316404 318112 320251 322329 323695 324589
57320C24589J394K407K883K373J262K90J02Q42J929K584K770L109L802M274M075
$$ 324589 325983 328390 331273 333646 334908 335198 335300 336142 338071 340655 343425 346534 350336 354610 358685
57305C58685L449K790K158J692J793K506L288L741M033M376M622M687M722M679
$$ 358685 362134 364924 367082 368774 370567 373073 376361 380102 384135 388511 393133 397820 402542 407221
57291D07221M333L971M297N278O013O070O171O996Q155Q887R097R103R044R118
$$ 407221 411554 415525 419822 425100 431113 437183 443354 450350 458505 467392 476489 485592 494636 503754
57277E03754R667J0476J0669R958R280R490J0146J0390J0303J0486J0882J0917
$$ 503754 513421 523897 534566 544524 553804 563294 573440 583830 594133 604619 615501 626418
57265F26418J0508R985R391Q630Q035P980Q182Q089P713P385P032O455O132O827
$$ 626418 636926 646911 656302 664932 672967 680947 689129 697218 704931 712316 719348 725803 731935 738762
57251G38762Q455J0023J0733J0703J0589J0948J1911J3121J4007J4361J4475J4662
$$ 738762 747217 757240 767973 778676 789265 800213 812124 825245 839252 853613 868088 882750
57239H82750J4936J5338J5998J6727J7017J6786J6526J6459J6244J5817J5719
$$ 882750 897686 913024 929022 945749 962766 979552 996078 1012537 1028781 1044598 1060317
57228A060317J6130J6453J6460J6991J8732K1001K2647K3445K3806K3789K3426
$$ 1060317 1076447 1092900 1109360 1126351 1145083 1166084 1188731 1212176 1235982 1259771 1283197
57217A283197K3278K3656K3795K3023K2174K2559K3973K5085K5655K6826K9168
$$ 1283197 1306475 1330131 1353926 1376949 1399123 1421682 1445655 1470740 1496395 1523221 1552389
57206A552389L1787L3819L5580L7653L9726M1051M1513M1633M1667M1248L9889
$$ 1552389 1584176 1617995 1653575 1691228 1730954 1772005 1813518 1855151 1896818 1938066 1977955
57195A977955L7689L5336L3295L1229K8680K6199K4946K5043K5323K5220K5773
$$ 1977955 2015644 2050980 2084275 2115504 2144184 2170383 2195329 2220372 2245695 2270915 2296688
57184B296688K7930L0895L3347L5479L8432M2216M5700M8430N0955N3381N4933
$$ 2296688 2324618 2355513 2388860 2424339 2462771 2504987 2550687 2599117 2650072 2703453 2758386
57173B758386N5253N5027N4968N5090N5226N5497N5996N6621N7329N7980N8018
$$ 2758386 2813639 2868666 2923634 2978724 3033950 3089447 3145443 3202064 3259393 3317373 3375391
57162C375391N6965N5175N3447N2052N0852N0062M9990N0268N0299N0362N1233
$$ 3375391 3432356 3487531 3540978 3593030 3643882 3693944 3743934 3794202 3844501 3894863 3946096
57151C946096N2783N3954N4148N3696N2869N1513M9675M7723M5619M2970L9878
$$ 3946096 3998879 4052833 4106981 4160677 4213546 4265059 4314734 4362457 4408076 4451046 4490924
57140D490924L6967L4458L2000K9398K6668K3488J9517J5239J1536Q507N669L257
$$ 4490924 4527891 4562349 4594349 4623747 4650415 4673903 4693420 4708659 4720195 4728702 4734371 4737628
57128D737628K254L135N666R843J5851K3121L0689L8588M7601N7467O6510P3236
$$ 4737628 4739882 4743017 4748683 4758526 4774377 4797498 4828187 4866775 4914376 4971843 5038353 5111589
57116E111589P7177P8237P6733P4294P3337P5260Q0424Q9856J05201J26660J52782
$$ 5111589 5188766 5267003 5343736 5418030 5491367 5566627 5647051 5736907 5842108 5968768 6121550
57105F121550J83046K19248K63880L18851L86626M71200N77192P09110Q71604
$$ 6121550 6304596 6523844 6787724 7106575 7493201 7964401 8541593 9250703 10122307
57096A0122307J068594J301117J566301J856075K151997K420742K622040K730945
$$ 10122307 11190901 12492018 14058319 15914394 18066391 20487133 23109173 25840118
57088B5840118K758303K750593K765277K833073K927223K963802K845994K529268
$$ 25840118 28598421 31349014 34114291 36947364 39874587 42838389 45684383 48213651
57080D8213651K054804J519181J008488N55840J48162k42507o36706j040945j447228
$$ 48213651 50268455 51787636 52796124 53351964 53500126 53257619 52620913 51579968 50132740
57071E0132740j835257k179206k456129k652305k768274k821218k837748k837073
$$ 50132740 48297483 46118277 43662148 41009843 38241569 35420351 32582603 29745530
57063B9745530k818736k767548k669641k523049k336812k125357j904089j685851
$$ 29745530 26926794 24159246 21489605 18966556 16629744 14504387 12600298 10914447
57055A0914447j478362j284975j107782r48797q08728o86675n81595m92739m18475
$$ 10914447 9436085 8151110 7043328 6094531 5285803 4599128 4017533 3524794 3106319
57046C106319l56170l03624k59572k22668j91357j64938j43428j25973j10742
$$ 3106319 2750149 2446525 2186953 1964285 1772928 1607990 1464562 1338589 1227847
57037A227847r6767q4640p4724o6044n7682n0136m4270l9708l5267l0367k5101
$$ 1227847 1131080 1046440 971716 905672 847990 797854 753584 713876 678609 648242 623141
57026F23141j9483j3485p468j747M029J0479J7797K6113L6035M7897O0620P1998
$$ 623141 603658 590173 582705 580958 584987 595466 613263 639376 675411 723308 783928 855926
57014H55926Q0194Q4434Q4433P9600O8649M9776K1997j2471m7426p5576r2932
$$ 855926 936120 1020554 1104987 1184587 1253236 1303012 1325009 1312538 1265112 1189536 1096604
57003A096604j00171j00194r5478q7843p9142p0830o3112n5333m7244l9428l2607
$$ 1096604 996433 896239 800761 712918 633776 562946 499834 444501 397257 357829 325222
56992C25222k6887k1766j6739j1858p569l944l97L418O711Q264P971O831N320
$$ 325222 298335 276569 259830 247972 240403 236459 236062 239480 246191 254455 262426 269257 274577
56979B74577K724j523o590j1035j4150j5927j6333j5411j3743j1993j0169p969
$$ 274577 277301 275778 269188 258153 244003 228076 211743 196332 182589 170596 160427 152458
56967A52458n555l334j178J359M228O991R677J2778J6240J9212K0929K1378K0787
$$ 152458 146903 143569 142391 143750 147978 154969 164646 177424 193664 212876 233805 255183 275970
56954B75970J8901J4991Q551N7q785j5781j9693k0842k0184j8224j5277j2125
$$ 275970 294871 309862 318413 318470 309685 293904 274211 253369 233185 214961 199684 187559
56942A87559r447o820l305J040N057Q063J0642J3691J7467K1786K6293L0173L2177
$$ 187559 178112 171292 167987 169027 174084 182147 192789 206480 223947 245733 272026 302199 334376
56929C34376L1343K7287J9772Q916l831j5691k4299k9167l1186l1273k9898k7380
$$ 334376 365719 393006 412778 421694 417863 402172 377873 348706 317520 286247 256349 228969
56917B28969k4090k0551j7529j5619j4519j3268j1493r803q656p565n970m165
$$ 228969 204879 184328 166799 151180 136661 123393 111900 102097 93441 85876 79906 75741
56905G5741k690j309N92K916M953O303P092P537P941Q875J0662J2797J4559J6103
$$ 75741 73051 71742 72334 75250 80203 86506 93598 101135 109076 117951 128613 141410 155969 172072
56891A72072J8195K0977K3681K5710K7168K8177K8329K7068K4157J9307J2063
$$ 172072 190267 211244 234925 260635 287803 315980 344309 371377 395534 414841 426904
56880D26904K689p064j4819j9350k1233k1655k0993j8768j4699r342l654J823
$$ 426904 429593 422529 407710 388360 367127 345472 324479 305711 291012 281670 278016 279839
56868B79839P203J2892J9118K5733L2308L8508M4428N0346N5947N9877O0316N5830
$$ 279839 287042 299934 319052 344785 377093 415601 460029 510375 566322 626199 686515 742345
56856G42345M5717L0139J0655r522k6663l8358m4284m5399m2901l7858l1131k3187
$$ 742345 788062 818201 828856 819334 792671 754313 710029 664630 621729 583871 552740 529553
56844E29553j4189m382N869J6334K6882L7313M7687N8648P0640Q2628R2269R7542
$$ 529553 515364 510982 516851 533185 560067 597380 645067 703715 774355 856983 949252 1046794
56832A046794R7419R0737P5460N0228J6791j9579n2173p5705q8236r1235q7920
$$ 1046794 1144213 1234950 1310410 1360638 1377429 1357850 1305677 1229972 1141736 1050501 962581
56821I62581q1084p2225o2176n1659m0897k9449j7078m518P145J7679K7914L8728
$$ 962581 881497 809272 747096 695437 654540 625091 608013 603495 610640 628319 656233 694961
56809F94961M9991O0267O7435O9732O6208N6157L8756J4305j4060m0904o1383
$$ 694961 744952 805219 872654 942386 1008594 1064751 1103507 1117812 1103752 1062848 1001465
56798A001465p3490p7788p6021p0375o2959n4993m6685l8199l0107k2537j4775
$$ 1001465 927975 850187 774166 703791 640832 585839 539154 500955 470848 448311 433536
56787D33536o362K020R452J5910K1836K7099L1166L3631L3775L0095K1385Q213
$$ 433536 427174 429194 438646 454556 476392 503491 534657 568288 602063 632158 653543 661756
56775F61756p255k2541l5496m4350m8371m8462m6304m2979l8871l4444l0213k6172
$$ 661756 654501 631960 596464 552114 503743 455281 408977 365998 327127 292683 262470 236298
56763B36298k2093j8294j5369j3281j1481r742q176o699n224m176l935m018l679
$$ 236298 214205 195911 180542 167261 155780 146038 137862 131163 125939 121763 117828 113810 110131
56750A10131l157l254l814l764k776j802j597j753j602j191q53m97M9M57K87l76
$$ 110131 106974 103720 99906 96142 93366 91564 89967 88214 86612 85421 84568 84071 84120 84577 84864 84488
56734H4488j055j431j465j220p57j43N42J116J285J013P10P19P82M63q7l19j11
$$ 84488 83433 82002 80537 79317 78560 78417 78959 80075 81360 82373 83083 83802 84584 85047 84960 84641 84530
56717H4530J52K78M61P31Q53Q21R25J187J246R16M13p7n84j077j402j566j616
$$ 84530 84682 84960 85421 86152 87005 87826 88751 89938 91184 92100 92513 92436 91852 90775 89373 87807 86191
56700H6191j300m23M69M67m67j231r45kN41K68k93m48l3N40P23L35l23q51j080
$$ 86191 84891 84468 84937 85404 84937 83706 82761 82759 83300 83568 83275 82827 82794 83334 84057 84392 84069 83218 82138
56681H2138r33k10J088K418L053K736J781O64j98n38m84m85o45m95K12R23J101
$$ 82138 81205 80995 82083 84501 87554 90290 92071 92735 92537 91999 91515 91030 90385 89890 90102 91025 92126
56664I2126J128J616K160J755M10p36r64p88r55j456j843j890j551p79K29J018
$$ 92126 93254 94870 97030 98785 99195 98459 97495 96707 95752 94296 92453 90563 89012 88233 88462 89480
56648H9480J294J169Q51M48J13L4K26O02J178J934K618L014L218L280K958K281
$$ 89480 90774 91943 92794 93242 93355 93389 93615 94217 95395 97329 99947 102961 106179 109459 112417 114698
56632A14698J953K460L180L162K510K124K287K541K768L309M044M397M322M284
$$ 114698 116651 119111 122291 125453 127963 130087 132374 134915 137683 140992 145036 149433 153755 158039
56618A58039M130L209J751R60J256J576J005N5l04o0K11L99P66J243J459J211
$$ 158039 162169 165378 167129 168089 169345 170921 171926 171981 171677 171617 171828 172227 172993 174236 175695 176906
56602A76906N17l82q49k79R63J619R76l34j327j783j949j774j180o49q49j789
$$ 176906 177423 177041 176192 175913 176876 178495 179471 179137 177810 176027 174078 172304 171124 170475 169626 167837
56586A67837k817l276k897j786l78Q14J565J946J936J457P19J34j60k53l2N98
$$ 167837 165020 161744 158847 157061 156683 157497 159062 161008 162944 164401 165120 165254 165094 164841 164809 165407
56570A65407J180J192J081J894L727N433O198O494P127Q137R140J0019J0686J0873
$$ 165407 166587 167779 168860 170754 174481 179914 186112 192606 199733 207870 217010 227029 237715 248588
56556B48588J0600J0244R772Q661P031O014O243O771O299M924L748L195K675J750
$$ 248588 259188 269432 279204 287865 294896 300910 307153 313924 320223 325147 328895 332090 334765 336515
56542C36515P56J69j06n74j598l062m443n302n747o192o732p096p194p203p094
$$ 336515 337271 337440 337334 336760 335162 332100 327657 322355 316608 310416 303684 296588 289394 282191 275097
56527B75097o560n601m641l970l502l186l070k970k624k243k316k794l182l395
$$ 275097 268537 262936 258295 254325 250823 247637 244567 241597 238973 236730 234414 231620 228438 225043
56513B25043l705l867l263k095j409j644k092k067j708j336j014j056j882k966
$$ 225043 221338 217471 214208 212113 210704 209060 206968 204901 203193 201857 200843 199787 197905 194939
56499A94939l091k108j256j172r00L53J719J994J404Q81N23n7n82n48k66l49o09
$$ 194939 191848 189740 188484 187312 186412 186765 188484 190478 191882 192763 193286 193229 192647 192099 191833 191484 190875
56482A90875m80j20q5k74j31L07N03L05N9k3O0L69Q59J210J265J246J206Q08N6
$$ 190875 190395 190275 190190 189916 189785 190092 190595 190900 190959 190936 190996 191365 192224 193434 194699 195945 197151 197959 198015
56463A98015l60L7Q64J503J732J420N01l37o9J074J513N57m85l07N24P94N76N89
$$ 198015 197655 197692 198556 200059 201791 203211 203712 203375 203306 204380 205893 206450 205965 205658 206182 206976 207552 208141
56445B08141O53J77m85o34m78n67n93n6N59N54L34N46O69l8q30m22P86J215N33
$$ 208141 208794 208971 208486 207852 207374 206807 206214 206158 206717 207271 207605 208151 208820 208782 207952 207530 208316 209531 210064
56426B10064j30k28l42o33m72J88N45L54L25Q64J589K274K999L271K270L39j029
$$ 210064 209934 209706 209364 208731 208259 208447 208992 209346 209671 210535 212124 214398 217397 220668 222938 223277 222248
56409B22248j013l05J83L53L43j1o45r86o90m4N38Q64P93L22r3J9M48O69P37J029
$$ 222248 221235 220930 221113 221466 221809 221798 221153 220167 219477 219433 219971 220835 221628 221950 221857 221876 222324 222993 223730 224759
56389B24759J375J304R82J002J314J356J107J079J391J759K222K839K955J916
$$ 224759 226134 227438 228420 229422 230736 232092 233199 234278 235669 237428 239650 242489 245444 247360
56375B47360M26q1N72J210J220J254J810K398K542K521K546K177J046m63j651
$$ 247360 247786 247705 248277 249487 250707 251961 253771 256169 258711 261232 263778 265955 267001 266538 264887
56360B64887k035j417j6J352J871J554R36K02o42j084o12L03P43O77P38R49Q32
$$ 264887 262852 261435 261419 262771 264642 266196 267132 267334 266692 265608 264996 265299 266042 266719 267457 268406 269238
56343B69238O01R19J546J597J157J245K026K517K295K094K298K283J782J542J964
$$ 269238 269839 270758 272304 273901 275058 276303 278329 280846 283141 285235 287533 289816 291598 293140 295104
56328B95104K221J545M36j29O1O16J239J656J518Q32R2l44n58o28m56q3L63R30
$$ 295104 297325 298870 299306 299177 299238 299854 301093 302749 304267 305099 305191 304847 304289 303661 303205 303122 303485 304415
56310C04415J481J379M25k20P75K994M671M930M400L725K892K160K153K673K727
$$ 304415 305896 307275 307700 307480 308255 311249 315920 320850 325250 328975 331867 334027 336180 338853 341580
56295C41580K104J684J745J389J59r66r65j17O60R73R22P14P15J225J926K257
$$ 341580 343684 345368 347113 348502 348661 347695 346730 346613 347273 348246 349168 349882 350597 351822 353748 356005
56279C56005K403K958L667L653K993K785L412M065M249M533N282N927O060O122
$$ 356005 358408 361366 365033 368686 371679 374464 377876 381941 386190 390723 396005 401932 407992 414114
56265D14114O495O922P304P998Q898R329R253R445J0097J0389R971R670J0167
$$ 414114 420609 427531 434835 442833 451731 461060 470313 479758 489855 500244 510215 519885 530052
56252E30052J1021J1613J2109J2919J4076J5549J7389J9216K0441K1118K1708
$$ 530052 541073 552686 564795 577714 591790 607339 624728 643944 664385 685503 707211
56241G07211K2020K1555K0689K0161J9422J7183J3676J0598Q466N948K285j509
$$ 707211 729231 750786 771475 791636 811058 828241 841917 852515 860981 866929 869214 867705
56229H67705m592p567j0910j3837j5768j7282j8698j9213j8545j7864j7950j7860
$$ 867705 863113 855546 844636 830799 815031 797749 779051 759838 741293 723429 705479 687619
56217F87619j6659j5088j4252j3830j2920j1649j0659r900q993q058p273o425
$$ 687619 670960 655872 641620 627790 614870 603221 592562 582662 573669 565611 558338 551913
56205E51913n587n326n538n196l920k692k250j984j191j50P27J620K412K424J805
$$ 551913 546326 541000 535462 530266 526346 523654 521404 519420 518229 518079 518806 520426 522838 525262 527067
56190E27067J768K636L103K328J235Q00N86Q4m8O35J209Q83M10P15J378J662J810
$$ 527067 528835 531471 534574 536902 538137 538937 539523 539607 539559 540194 541403 542286 542696 543411 544789 546451 548261
56173E48261K131K111J575J448K166K679K276J986K839M091M624M829N622O749
$$ 548261 550392 552503 554078 555526 557692 560371 562647 564633 567472 571563 576187 581016 586638 593387
56159E93387P513Q140R070R947J0480J1241J2456J3271J3290J3515J4570J5498
$$ 593387 600900 609040 618110 628057 638537 649778 662234 675505 688795 702310 716880 732378
56147G32378J5589J5843J7182J8736J9539K0431K2683K6074K9990L5118M2379
$$ 732378 747967 763810 780992 799728 819267 839698 862381 888455 918445 953563 995942
56136I95942N1362O1357P2679Q5487R8654J11322J24139J37241J48398J54922
$$ 995942 1047304 1108661 1181340 1266827 1365481 1476803 1600942 1738183 1886581 2041503
56126B041503J56144J52514J43882J30690J15575J01654R0040Q0359P2318O5032
$$ 2041503 2197647 2350161 2494043 2624733 2740308 2841962 2932002 3012361 3084679 3149711
56116C149711N6288M4431L0084J4719r42j5754k7524l5634m2733n1840o3392p6774
$$ 3149711 3205999 3250430 3280514 3295233 3294291 3278537 3251013 3215379 3172646 3120806 3057414 2980640
56104B980640r2480j10211j26720j38342j44361j45718j42218j33667j22173j10403
$$ 2980640 2888160 2777949 2651229 2512887 2368526 2222808 2080590 1946923 1824750 1714347
56094A714347r8702q6352p4198o3475n3531m3462l4554k8373k3868j9157j4724
$$ 1714347 1615645 1529293 1455095 1391620 1338089 1294627 1260073 1231700 1207832 1188675 1173951
56083A173951j1866r529n868j635J198L010N484Q189R545J0169J1806J3834J4264
$$ 1173951 1162085 1152556 1146688 1145053 1146251 1149261 1154745 1162934 1172479 1182648 1194454 1208288 1222552
56070A222552J3485J3565J4373J3812J1545R300P742O049M400L928M467M803M836
$$ 1222552 1236037 1249602 1263975 1277787 1289332 1298632 1306374 1312423 1316823 1320751 1325218 1330021 1334857
56057A334857N167N381N074N455P484R720J0642J1448J3754J6244J6842J6419
$$ 1334857 1340024 1345405 1350479 1355934 1363418 1373138 1383780 1395228 1408982 1425226 1442068 1458487
56045A458487J6960J7825J7535J7384J9291K1765K2245K1770K2977K5058K5419
$$ 1458487 1475447 1493272 1510807 1528191 1547482 1569247 1591492 1613262 1636239 1661297 1686716
56034A686716K4880K6338K9360L1213L2188L4786L8331L9769L9339M0229M2864
$$ 1686716 1711596 1737934 1767294 1798507 1830695 1865481 1903812 1943581 1982920 2023149 2066013
56023B066013M4577M4843M5798M7686M8735M9364N1688N5050N6940N7956O0895
$$ 2066013 2110590 2155433 2201231 2248917 2297652 2347016 2398704 2453754 2510694 2568650 2629545
56012B629545O5342O8412P0326P3941P9105Q2986Q5671Q9887R5408R9420J02146
$$ 2629545 2694887 2763299 2833625 2907566 2986671 3069657 3155328 3245215 3340623 3440043 3542189
56001C542189J06536J12702J18295J23750J31407J40138J46982J53153J62098
$$ 3542189 3648725 3761427 3879722 4003472 4134879 4275017 4421999 4575152 4737250
55992D737250J72815J81831J90561K03269K19052K33562K47455K64856K84935
$$ 4737250 4910065 5091896 5282457 5485726 5704778 5938340 6185795 6450651 6735586
55983F735586L03830L23659L50003L81578M12464M43743M82209N28402N77264
$$ 6735586 7039416 7363075 7713078 8094656 8507120 8950863 9433072 9961474 10538738
55974A0538738O30195O94326P69984Q51697R41838J050175J179621J326711J497016
$$ 10538738 11168933 11863259 12633243 13484940 14426778 15476953 16656574 17983285 19480301
55965A9480301J705597J962141K272266K655454L146240L780168M601828N687743
$$ 19480301 21185898 23148039 25420305 28075759 31221999 35002167 39603995 45291738
55957D5291738P126567Q946258J1060759J3304574J5550052J7839483K0416738
$$ 45291738 52418305 61364563 72425322 85729896 101279948 119119431 139536169
55950A39536169K3548138K7194556L0835793L3673620L4987413L4188086L0581992
$$ 139536169 163084307 190278863 221114656 254788276 289775689 323963775 354545767
55943C54545767K3438823J2687568l78617j3319403k3716091l0297756l3156211
$$ 354545767 377984590 390672158 390293541 376974138 353258047 322960291 289804080
55936B89804080l3178585l1406714k8720650k5748041k2840831k0122811j7607008
$$ 289804080 256625495 225218781 196498131 170750090 147909259 127786448 110179440
55929A10179440j5289902j3172731j1258786r560918q093974o850286n798786
$$ 110179440 94889538 81716807 70458021 60897103 52803129 45952843 40154057
55922D0154057m910709m168772l551687l031216k589057k219872j914665j656779
$$ 40154057 35243348 31074576 27522889 24491673 21902616 19682744 17768079 16111300
55914A6111300j436464j253812j104400r76092q62601p66821o87993o18167n53950
$$ 16111300 14674836 13421024 12316624 11340532 10477931 9711110 9023117 8404950 7851000
55905G851000m99656m55829m15828l76689l42802l15907k91273k66640k45570
$$ 7851000 7351344 6895515 6479687 6102998 5760196 5444289 5153016 4886376 4640806
55896D640806k29198k13345j96471j82120j71125j59429j45915j34533j26389
$$ 4640806 4411608 4198263 4001792 3819672 3648547 3489118 3343203 3208670 3082281
55887C082281j17383j05981r5868q8448q0038o8998n8682n0663m1738l0400j9935
$$ 3082281 2964898 2858917 2763049 2674601 2594563 2525565 2466883 2416220 2374482 2344082 2324147
55876B324147j2281m807L860J0384J1917R697N004l550j6249l0366m4176n8508
$$ 2324147 2311866 2307059 2310919 2321303 2333220 2342917 2347921 2344371 2328122 2297756 2253580 2195072
55864B195072p2513q2520q6972q8243q7956q4985p9546p4518p0860o6112n9233
$$ 2195072 2122559 2040039 1953067 1864824 1776868 1691883 1612337 1537819 1466959 1400847 1341614
55853A341614n2618m7727m3147l8601l6300l6424l5689l2510k9380k8197k7334
$$ 1341614 1288996 1241269 1198122 1159521 1123221 1086797 1051108 1018598 989218 961021 933687
55842I33687k5400k3802k3410k2542k0411j8884j8751j7984j5652j3858j3715
$$ 933687 908287 884485 861075 838533 818122 799238 780487 762503 746851 732993 719278
55831G19278j3123j0792q746q544q537p236n981n853n320l455k308l365m674m100
$$ 719278 706155 695363 686617 678073 669536 662300 656319 650466 645146 641691 639383 636018 631344 627244
55817F27244k694k155j583M62L079M755N906P400Q591Q968R573J0762J0754Q447
$$ 627244 624550 622395 620812 621274 624353 629108 635014 642414 651005 659973 669546 680308 691062 699509
55803F99509N417L087L15m017q364j0934j2597j4933j7257j8105j7877j7709j7251
$$ 699509 704926 708013 708328 704311 695947 685013 672416 657483 640226 622121 604244 586535 569284
55790E69284j5841j4350j3673j2770j0352p119m404k081K55J568R24n29j172j208
$$ 569284 553443 539093 525420 512650 502298 495179 490775 488694 488949 490517 491441 490912 489740 488532
55776D88532j517j536l94J089J525J120Q68N65n64k240l846n885q997j2367j4661
$$ 488532 487015 485479 485085 486174 487699 488819 489687 490252 489688 487448 483602 477717 468720 456353 441692
55761D41692j5724j5952j5000j2621r912q113o980n612m051k822j909j369j882
$$ 441692 425968 410016 395016 382395 372483 364370 357390 351778 347727 344905 342996 341627 339745
55748C39745l381m346l857l112l480m329m377l953l995l904k538n48L44K6l2O61
$$ 339745 336364 332018 328161 325049 321569 317240 312863 308910 304915 301011 298473 297925 298269 298295 298263 298924
55732B98924R60J26j051j505j196q11r65j832l065m042m449m378l840k771j708
$$ 298924 299884 300010 298959 297454 296258 295447 294482 292650 289585 285543 281094 276716 272876 270105 268397
55717B68397j532k172k491j779m65R62K506L766L874K990K530L087L461K561R61
$$ 268397 266865 264693 262202 260423 259958 260920 263426 267192 271066 274056 276586 279673 283134 285695 286656
55702B86656l75j598l100m355m826m960n263n325m781m207m075l856l041k061
$$ 286656 286281 284683 281583 277228 272402 267442 262179 256854 252073 247866 243791 239935 236894 234833
55688B34833j347n50M27R05P62R94K024K832K805K895L747M280L538K419J977
$$ 234833 233486 232936 233363 234268 235030 236024 238048 240880 243685 246580 250327 254607 258145 260564 262541
55673B62541J527J33j311j376l88M37J076K089K879K602K052K735M571O271P401
$$ 262541 264068 264201 262890 261514 261126 261563 262639 264728 267607 270209 272261 274996 279567 285838 293239
55658B93239Q234Q227O506L569P81j454l513n119n791o193p266q426q457p722
$$ 293239 301473 309700 316206 319775 320556 319102 315589 310470 304679 298486 291220 282794 274337 266615
55644B66615p583p951p515o258n626n997o056n105m109l880l825l229k390j776
$$ 266615 259032 251081 243566 237308 231682 225685 219629 214524 210415 206535 202710 199481 197091 195315
55630A95315j243p38p41j389k064k341k489k680k525j858j178q47n74p7L50L63
$$ 195315 194072 193334 192593 191204 189140 186799 184310 181630 179105 177247 176069 175222 174648 174571 174921 175284
55614A75284J41J09M14Q73J169R93L16m89j039j318j382j082m51k2j97o20p07
$$ 175284 175425 175534 175948 176821 177990 178983 179299 178810 177771 176453 175071 173989 173538 173516 173319 172699 171992
55597A71992m88m02n73q43j201j601j733j444j068q09l25N23J112R55O03Q09J303
$$ 171992 171504 171102 170529 169686 168485 166884 165151 163707 162639 161830 161505 162028 163140 164095 164698 165507 166810
55580A66810J312Q99P97J180J510J463J264J162J204J462J949K460K828L067L056
$$ 166810 168122 169021 169818 170998 172508 173971 175235 176397 177601 179063 181012 183472 186300 189367 192423
55565A92423K616K139K327K916K673J198k95p96r58j727k643k768k406k467k841
$$ 192423 195039 197178 199505 202421 205094 206292 205997 205201 204243 202516 199873 197105 194699 192232 189391
55550A89391k834k621k774k841j940m72K42p9m35j93K63N49P73R71R92Q85O83
$$ 189391 186557 183936 181162 178321 176381 175909 176151 176072 175637 175444 175707 176256 177029 178000 178992 179877 180560
55533A80560J6j188k145k187j856k016k443k390k002j870j800j301p92q52q47
$$ 180560 180576 179388 177243 175056 173200 171184 168741 166351 164349 162479 160679 159378 158586 157734 156887
55518A56887J30J397J471M62j23K08N18M51P76J697K340K342K284K202J278n07
$$ 156887 157017 158414 159885 160347 160224 160432 160950 161401 162177 163874 166214 168556 170840 173042 174320 173813
55502A73813j900k146j908j875j790j377r72o67kR25J202N14k76m31j84J18N69
$$ 173813 171913 169767 167859 165984 164194 162817 161845 161178 161176 162101 163303 163817 163541 163110 162926 163044 163613
55485A63613R05M15p99j599j433j100j309j614j513j427j736j810j019J22P23
$$ 163613 164518 164933 164134 162535 161102 160002 158693 157079 155566 154139 152403 150593 149574 149696 150419
55470A50419Q10R22R91N15m80j368j682j438q88k84K93R65J693K003J595R83Q60
$$ 150419 151229 152151 153142 153657 153177 151809 150127 148689 147801 147517 147810 148775 150468 152471 154066 155049 155909
55453A55909R88O08j39l46J23M00Q4k44k23k45m26l13o2n51j724k139j042L65
$$ 155909 156897 157505 157366 157020 157143 157543 157627 157383 157160 156915 156489 156176 156114 155563 153839 151700 150658 151023
55435A51023O86K69K12M47K08l24k46M40P78L14l62o56o20m52l2P80J740K368
$$ 151023 151709 151978 152190 152637 152845 152521 152275 152715 153493 153807 153445 152789 152169 151717 151685 152465 154205 156573
55417A56573K404K098K042K523L073K990K303J729J705J904J816J265K96q68j694
$$ 156573 158977 161075 163117 165640 168713 171703 174006 175735 177440 179344 181160 182425 182721 181853 180159
55402A80159j763j437j416j675j645j416j720k558k934k389j652j312r55k60J27
$$ 180159 178396 176959 175543 173868 172223 170807 169087 166529 163595 161206 159554 158242 157287 157027 157154
55387A57154k67o48j42O97O70j64n72jO95M72o34j735k148k009j884j951j715
$$ 157154 156887 156239 156097 156794 157464 157300 156728 156727 157422 157894 157260 155525 153377 151368 149484 147533 145818
55370A45818q16K23O29N25O83J157J198O55L83Q03J091M54o23j150r71o03l34
$$ 145818 145002 145225 145854 146379 147062 148219 149417 150072 150455 151258 152349 152803 152180 151030 150059 149456 149122
55353A49122j29rJ01M47R32J056O85K98R2l22r04q16J79R77O51n4J29R97J260
$$ 149122 148993 148984 149085 149532 150464 151520 152205 152503 152595 152273 151369 150553 150732 151709 152360 152306 152435 153432 154692
55334A54692N14l31m93r6L56M79j8j040j838j688q48k05j39k91l19j58L17J176
$$ 154692 155206 154875 154382 154286 154642 155121 155103 154063 152225 150537 149689 149484 149345 149054 148735 148577 148894 150070
55316A50070J967J956J018j91r63j098p27n4O69J178J299J017N16K11M08Q61J017
$$ 150070 152037 153993 155011 154820 153857 152759 152032 151978 152647 153825 155124 156141 156657 156868 157276 158137 159154
55299A59154Q07P15R42J059Q00N29N49N68L38K47O54J150J118N65j00p22j224
$$ 159154 159961 160676 161618 162677 163477 164006 164555 165123 165461 165708 166362 167512 168630 169195 169095 168373 167149
55282A67149j220n34K21K40n26j479k091k070j258K9R36R54N74N47Q49R88Q96
$$ 167149 165929 165395 165616 165856 165330 163851 161760 159690 158432 158461 159397 160351 160925 161472 162321 163309 164205
55265A64205Q46Q46P96R11J333J601J214M97J83M12P18Q09P21L94k02p59r47q57
$$ 164205 165051 165897 166693 167604 168937 170538 171752 172249 172432 172844 173562 174371 175092 175486 175284 174525 173578 172721
55247A72721o74l48n8l92j378j959j346l37k16q26r51k93K37J91J78O27J091J101
$$ 172721 172047 171699 171641 171249 169871 167912 166566 166229 166013 165187 164236 163943 164180 164371 164549 165176 166267 167368
55229A67368P58K27n02j075r46k97M7j35k14K3j27r83j680j323k57N42P85Q16
$$ 167368 168126 168353 167851 166776 165830 165533 165580 165445 165231 165254 165127 164144 162464 161141 160884 161426 162211 163027
55211A63027Q06P03O49P87Q24M11j54j89L77Q27N83p2m15j96J15m6o58j179j224
$$ 163027 163833 164536 165185 165972 166796 167207 167053 166864 167241 168068 168651 168579 168164 167968 168083 168037 167379 166200 164976
55192A64976q77l48L50J140J585J290M79j61k52K8L14L46J1n64q77n04L22R27
$$ 164976 164099 163751 164101 165241 166826 168116 168595 168434 168182 168210 168524 168870 168881 168317 167440 166936 167258 168185
55174A68185J040J028J178J158N21m82r90m35P96J774J985J713J465J325J123
$$ 168185 169225 170253 171431 172589 173110 172628 171638 171203 171999 173773 175758 177471 178936 180261 181384
55159A81384R73J096J226Q42Q1l01p6R6j75k85K94R40O94l21j174j393j199p54
$$ 181384 182357 183453 184679 185521 185602 185301 185225 185321 185146 184861 185155 186095 186789 186468 185294 183901 182702 181948
55141A81948j12K91M6m53n32m06q08j555j593o88J05N8k04Q8N43L48l41o97m94
$$ 181948 181836 182127 182173 181720 181188 180782 179974 178419 176826 176138 176243 176301 176097 176185 176728 177076 176735 176038 175544
55122A75544k94m13n53m32j69J04N30J150J582J443Q64L66J93J13o5q4L76J084
$$ 175544 175250 174837 174284 173852 173683 173787 174317 175467 177049 178492 179356 179722 179915 180028 179963 179879 180255 181339
55104A81339J457J312J033R28Q28N33K06M8k6j50k38k30k67m01m74n06p14r46
$$ 181339 182796 184108 185141 186069 186897 187430 187636 187684 187658 187508 187270 187040 186773 186372 185898 185392 184678 183732
55086A83732p18q4J75k52o24l66p5l98p32k06P08Q65L65L07Q17Q57J56k47J64
$$ 183732 183014 182930 183105 182853 182229 181863 181788 181390 180658 180452 181160 182025 182390 182697 183514 184371 184527 184280 184444
55067A84444M60j21r11r79o00n42o91l74L86R20Q76M09l13j066j345q55j08J08
$$ 184444 184904 184783 183872 182893 182293 181751 181060 180686 181072 181992 182868 183277 182964 181898 180553 179698 179590 179698
55049A79698k09k89L29J217J667J511J202J209J459J415P86j2l13k8L79O35Q82
$$ 179698 179489 179200 179529 180746 182413 183924 185126 186335 187794 189209 189995 189983 189670 189642 190021 190656 191538
55032A91538J077P78q0p79o22R6M66J28l98m69r7K04Q6k41k97M9L86K49l25r26
$$ 191538 192615 193393 193313 192534 191912 192008 192474 192602 192204 191735 191638 191842 191928 191687 191390 191439 191825 192074 191749 190823
55012A90823j264j286r63l77J57M36O72J066J173M21p84j226l73R41J636J597
$$ 190823 189559 188273 187310 186933 187090 187526 188198 189264 190437 190858 190074 188848 188475 189416 191052 192649
54996A92649J347J137Q58N33L12J84J12K46O33Q83N96qk82K8N12O48L34j82n95
$$ 192649 193996 195133 195991 196524 196836 197020 197132 197378 198011 198894 199490 199482 199200 199228 199740 200388 200722 200540 199945
54977A99945o57k32N17J048Q14r2q41o91J40P09M83r1l06J8O65J474K180K273
$$ 199945 199288 199056 199573 200621 201435 201343 200502 199811 199951 200660 201143 201052 200746 200764 201429 202903 205083 207356
54959B07356J661J136J453K187K242J423O22M38M48J75m8L10J083J605J541J189
$$ 207356 209017 210153 211606 213793 216035 217458 218080 218518 218966 219141 219093 219403 220486 222091 223632 224821
54943B24821R93J093J230J102Q98J324K753M600N938O559O938P375P864Q623R864
$$ 224821 225814 226907 228137 229239 230137 231461 234214 238814 244752 251311 258249 265624 273488 282111 291975
54928B91975J1048J1220J0279R091Q120O784M515J616j298l987o297p918q862
$$ 291975 303023 314243 324522 333613 341733 348517 353032 354648 353350 349363 343066 335148 326286
54915C26286r535r919r474q290p409p377p315o331n086m784n211n031l839k644
$$ 326286 316751 306832 297358 289068 281659 274282 266967 260636 255550 250766 245555 240524 236685 234041
54901B34041k152j720n26J114K208K404K268K455L036L704M376N324O721Q249
$$ 234041 231889 230169 229643 230757 232965 235369 237637 240092 243128 246832 251208 256532 263253 271502
54887B71502R383R962J0160R994R301Q229P207O179M465J742j371m115o491q776
$$ 271502 280885 290847 301007 311001 320302 328531 335738 341917 346382 348124 346753 342638 336147 327371
54873C27371j0588j1159j0402r071p903p144o831o895o914o287m950l579k890
$$ 327371 316783 305624 295222 286151 278248 271104 264273 257378 250464 244177 239227 235648 232758
54860B32758k945l255l323k923k071j073n00p49j492j743q69M90R74J06j096j425
$$ 232758 229813 226558 223235 220312 218241 217168 216668 215919 214427 212684 211815 212305 213279 213385 212289 210864
54844B10864r13m46m02m58n25r14j549j826j476q76k95L40Q36O98R5o4N45J076
$$ 210864 209951 209505 209103 208645 208120 207206 205657 203831 202355 201479 201184 201524 202360 203058 203153 203089 203634 204710
54826B04710Q44L86M70Q02O59K41L75J113J660J566J210J029R63Q02N44L10K53
$$ 204710 205554 205940 206410 207212 207871 208112 208487 209600 211260 212826 214036 215065 216028 216830 217374 217684 217937
54809B17937N02R19J058O80J00k74m37m57p3Q21J645J690J081N77N31O56P14Q25
$$ 217937 218439 219358 220416 221096 221196 220922 220485 220028 219955 220776 222421 224111 225192 225769 226300 226956 227670 228495
54791B28495J064J225J130Q32M86L28O49J514K589L537M403N318O104O613P197
$$ 228495 229559 230784 231914 232746 233232 233560 234209 235723 238312 241849 246252 251570 257674 264287 271484
54776B71484Q303R712J0734J1105J1176J1162J0634Q960O021K439p89k993m353
$$ 271484 279787 289499 300233 311338 322514 333676 344310 353270 359291 361730 360941 357948 353595
54763C53595n618p188q661r347q962p693o084m986n073n988o453n707m385l527
$$ 353595 347977 340789 332128 322781 313819 306126 300042 295056 289983 283995 277542 271835 267450 263923
54749B63923l206k826k238j829j687j474r88k74O68J735K513K808L178M268N814
$$ 263923 260717 257891 255653 253824 252137 250663 249675 249401 250069 251804 254317 257125 260303 264571 270385
54734B70385O975P508P922Q573R305R831R886R029P066M585K415N60j617m210
$$ 270385 277360 284868 292790 301363 310668 320499 330385 339414 346480 351065 353480 354040 352423 348213
54720C48213o497p950q803r384r566r151q319p453o819o474o215n630m658l870
$$ 348213 341716 333766 324963 315579 306013 296862 288543 281090 274271 267797 261582 255952 251294 247424
54706B47424l761l886l358k126j043o30n08k23K0k07q57j449j587j297r41q55
$$ 247424 243663 239777 236419 234293 233250 232620 232112 231889 231909 231702 230845 229396 227809 226512 225571 224716
54690B24716r22p12j47L64O76J165J759J506m3j658j796o98N4j35l63k0L69L27
$$ 224716 223794 223082 222935 223299 223975 225140 226899 228405 228362 226704 224908 224210 224264 224129 223766 223746 224115 224442
54672B24442K20L70M57K70J34J68nm35o13m36l89m68j2R36J284N80j26N7M69J86
$$ 224442 224662 225032 225489 225759 225893 226061 226056 225621 225008 224572 224183 223715 223703 224639 225923 226503 226377 226434 226903 227089
54652B27089l53k11L31L32r8m6M89N54j12o10k80M23P71O38L19M3j8J94L97J86
$$ 227089 226736 226525 226856 227188 227090 227044 227533 228087 227975 227365 227085 227508 228279 228917 229236 229279 229261 229455 229852 230038
54632B30038l68p90q37p11o43p15j055j658k030j520k25R53J284R21M87L41M79
$$ 230038 229670 228880 228043 227332 226689 225974 224919 223261 221231 219711 219486 220439 221723 222644 223131 223472 223951
54615B23951P99J134J267J141R77R94J113J061P51L70J24K0q6k42l04j58O7J41
$$ 223951 224750 225884 227151 228292 229269 230263 231376 232437 233188 233558 233682 233702 233616 233374 233070 232912 232979 233120
54597B33120O6P6K89N31O12N67M84K42l42j113j510j076k2Q00O91j30p48o46k41
$$ 233120 233186 233262 233551 234082 234694 235261 235745 235987 235645 234532 233022 231946 231924 232724 233415 233285 232537 231891 231650
54578B31650j40k50l4N50J002J075J006R49P43M12L24O12R01R41J021J430J843
$$ 231650 231510 231260 231226 231776 232778 233853 234859 235808 236551 236963 237287 237899 238800 239741 240762 242192 244035
54561B44035J644P00m93j263j277p68l98o34j128j086k84N72P11J32n37o46P2
$$ 244035 245679 246379 245886 244623 243346 242578 242180 241546 240418 239332 239048 239620 240331 240463 239926 239280 239352
54544B39352J309K221K161J471J092J240J152M52j17J26N63J39r67j459o22Q97
$$ 239352 240661 242882 245043 246514 247606 248846 249998 250450 250333 250459 251022 251161 250194 248735 248113 249010
54528B49010K032K366K079J426O03j52n98o23l25qK4k10l58j84J16J95nk74m36
$$ 249010 251042 253408 255487 256913 257516 257364 256766 256143 255818 255810 255834 255624 255266 255082 255198 255393 255388 255114 254678
54509B54678m61l94l08k52j47N9K02R0j06l3K70M27L75L87L74j73j256k075k063
$$ 254678 254217 253823 253515 253263 253116 253175 253377 253467 253361 253328 253598 254025 254400 254787 255161 254988 253732 251657 249594
54490B49594j595j153n16N56J420J333O60M66J011J614J864K102K507K560J816
$$ 249594 247999 246846 246330 246886 248306 249639 250299 250765 251776 253390 255254 257356 259863 262423 264239
54475B64239O71m4N6O26J049J062R96J336J961K119J391L88k2K08M33L46K19K06
$$ 264239 264910 264866 264922 265548 266597 267659 268655 269991 271952 274071 275462 275850 275828 276036 276469 276815 277034 277240
54457B77240P1k98o24o42l83j1K47O4o47j384j448p97r4J34mj46j41k8P1p3n58
$$ 277240 277311 277013 276389 275747 275364 275353 275600 275664 275017 273633 272185 271388 271294 271428 271424 271278 271137 271109 271180 271107 270549
54436B70549j035r52k42N61R06O84J18n06q23n68J18P06P08N0q91j435j066p9
$$ 270549 269514 268562 268320 268881 269787 270471 270589 270083 269260 268692 268810 269516 270224 270274 269383 267948 266882 266803
54418B66803N37K19l93l22L60P18L24k86o10p57q76p45l01O5J30J59L02K25k45
$$ 266803 267340 267559 267166 266844 267204 267922 268246 267960 267350 266593 265717 264972 264671 264736 264866 265025 265327 265552 265307
54399B65307o36n22j50R8M11J059J575J237J98m96j46R57J991K334J775N84n87
$$ 265307 264671 264149 263999 264097 264508 265567 267142 268379 268577 268081 267935 268892 270883 273217 274992 275576 274989
54382B74989j223j411j481j318n67N07J037O92J60K08O90R66Q97Q57R75R48N58
$$ 274989 273766 272355 270874 269556 268989 269496 270533 271225 271385 271593 272283 273249 274146 275003 275978 276926 277484
54365B77484l5n93r87j093r18p38p72p04p7Q10J069N09N0M15J054J005L54m9p
$$ 277484 277449 276856 275869 274776 273858 273120 272348 271644 271567 272377 273446 273955 274005 274420 275474 276479 276833 276784 276777
54346B76777j36o00p11m3Q45J228J074O56o3j084j886j923j395r64q84q86p97
$$ 276777 276641 276041 275330 275287 276132 277360 278434 279090 279027 277943 276057 274134 272739 271775 270891 270005 269208
54329B69208p42p69p11m70j62P2J68P9j87n36q57j048r21k88O64J365J464J280
$$ 269208 268466 267697 266986 266516 266354 266426 266594 266673 266486 265950 265093 264045 263124 262836 263500 264865 266329 267609
54311B67609J328J644J867J799J611J488J401J095K97r19j878j787o94M36Q59
$$ 267609 268937 270581 272448 274247 275858 277346 278747 279842 280139 279220 277342 275555 274861 275297 276156
54296B76156Q35Q78P92Q8r78j528j144k28O49J160J032J61r91j639j499j015o40
$$ 276156 276991 277869 278661 278749 277771 276243 275099 274871 275520 276680 277712 277873 276882 275243 273744 272729 272089
54279B72089l57ML50M48K30j23k69J8N10O36J65m54p58r23j224j334q31j68j99
$$ 272089 271732 271736 272086 272534 272764 272641 272372 272390 272900 273536 273701 273247 272489 271566 270342 269008 268177 268009 267810
54260B67810q25j036m52J05p4n88o78k71K48P04J009Q75K10m84o62l98r3J59M48
$$ 267810 266985 265949 265497 265602 265528 264940 264262 263991 264239 264943 265952 266827 267037 266553 265891 265493 265400 265559 266007
54241B66007O39N10J72n8r8k8J41L02J18m66q77n24L59J043J246J219J057N77
$$ 266007 266646 267156 267328 267270 267172 267144 267285 267587 267705 267239 266362 265838 266197 267240 268486 269705 270762 271339
54223B71339k4j06N26J275J556J522J518J345O57k24n89m37n72j445k448k729
$$ 271339 271315 271209 271735 273010 274566 276088 277606 278951 279608 279384 278795 278358 277786 276341 273893 271164
54207B71164k206j419p27j37K68L54K61K55K21j62p80j110r48o10k82K44R81J448
$$ 271164 268958 267539 266812 266675 266943 267297 267558 267813 268034 267872 267092 265982 265034 264424 264142 264386 265367 266815
54189B66815J277O84kp35j351j356o56k6k31r99j494j489j417j489j426j008k94
$$ 266815 268092 268776 268774 268039 266688 265332 264676 264650 264419 263420 261926 260437 259020 257531 256105 255097 254803
54172B54803N75J299J367O95O4K71R63J052K42o69r99r10q51r07j000j059r13
$$ 254803 255378 256677 258044 258739 258803 259074 260037 261089 261331 260662 259663 258753 257902 256995 255995 254936 254023
54155B54023m96k03m63r51r28m11j05j15K96J341K093J851J258J329J972K332
$$ 254023 253527 253324 252861 251910 250982 250571 250466 250351 250647 251988 254081 255932 257190 258519 260491 262823
54139B62823K142J886J864J860J708J538J422J249J043J032J300J604J629J298
$$ 262823 264965 266851 268715 270575 272283 273821 275243 276492 277535 278567 279867 281471 283100 284398
54125B84398P60J45n35j176j335o08O63J443J174N28M66R11J025N59Km83j190
$$ 284398 285158 285303 284768 283592 282257 281649 282312 283755 284929 285457 285923 286834 287859 288418 288420 287937 286747
54108B86747j859j651m91N33O19K02q3l81q66r43j78O04K84q86j620j403r23p98
$$ 286747 284888 283237 282746 283279 283898 284100 284017 283636 282770 281827 281649 282253 282537 281651 280031 278628 277705 276907
54090B76907p61l71K44O39N79R1o71j412j759j480o16M91J265J284P55M12O87
$$ 276907 276146 275775 276019 276658 277237 277328 276657 275245 273486 272006 271390 271881 273146 274430 275185 275597 276284
54073B76284J205J324Q58J06n64q72p14l16o0N5L32O72N37j27o08n36n78j345
$$ 276284 277489 278813 279671 279777 279213 278341 277627 277311 277251 277306 277638 278310 278847 278720 278112 277576 276998 275653
54055B75653k242k204j213j42O03J354K179K573K277J715J346J154R68Q80J096
$$ 275653 273411 271207 269994 269852 270455 271809 273988 276561 278838 280553 281899 283053 284021 284901 285997
54040B85997J650K386L070L476L566L476L292K959K608K568K869L115L105L149
$$ 285997 287647 290033 293103 296579 300145 303621 306913 309872 312480 315048 317917 321032 324137 327286
54026C27286L354L170K238J201R19J227J314J115J372K306L076K849J815Q46N38
$$ 327286 330640 333810 336048 337249 338168 339395 340709 341824 343196 345502 348578 351427 353242 354088 354626
54011C54626Q49J296J391J010L78l46j183j893j904j070j56R6n0J54P99J467K223
$$ 354626 355475 356771 358162 359172 359550 359204 358021 356128 354224 353154 352998 353094 353044 353198 353997 355464 357687
53994C57687L559N430P259Q966J1079J3755J6507J9152K2198K5966K9952L3417
$$ 357687 361246 366676 373935 382901 393980 407735 424242 443394 465592 491558 521510 554927
53982E54927L5936L6954L5427L0499K2272J1611m18j2594k3331l1090l5179l6086
$$ 554927 590863 627817 663244 693743 716015 727626 727208 714614 691283 660193 625014 588928
53970E88928l5043l3200l0979k8172k4700k1038j7693j4549j1317q399o662o269
$$ 588928 553885 520685 489706 461534 436834 415796 398103 383554 372237 363838 357176 350907
53958C50907o304n807m732l673k948k299j392l60K51J96K1M57J294J455N30l99
$$ 350907 344603 338796 334064 330391 327443 325144 323752 323392 323643 323839 323860 324317 325611 327066 327596 327197
53942C27197q6J253K370K692K734L031L511L892L960L533K788K421K776L040K179
$$ 327197 327111 328364 330734 333426 336160 339191 342702 346594 350554 354087 356875 359296 362072 365112 367291
53927C67291N27n71n70k13j66k53j95j16l9K54O24P27Q17J439K250K277J599J464
$$ 367291 367818 367247 366677 366464 366298 366045 365850 365734 365695 365949 366573 367300 368117 369556 371806 374083 375682 377146
53909C77146K356L251L340L241L693M239M179L741L345K610J146m38j408k057
$$ 377146 379502 382753 386093 389334 393027 397266 401445 405186 408531 411141 412287 411849 410441 408384
53895D08384k945l657l441k579j992j895j924k167k898l589l396k582k298k939
$$ 408384 405439 401782 398341 395762 393770 391875 389951 387784 384886 381297 377901 375319 373021 370082
53881C70082l686l777l356k937k768k869l069k923k144j127n05l21k66m04r59
$$ 370082 366396 362619 359263 356326 353558 350689 347620 344697 342553 341426 340921 340600 340334 339930 338971
53866C38971j533j428p53m16q90j701k213k232j790r94k45nj92l43l94o45r63
$$ 338971 337438 336010 335257 334841 333951 332250 330037 327805 326015 325021 324776 324771 324579 324236 323842 323197 322234
53849C22234p75OP55J034J096J162R34K31m34m05K61R13J073Q44O27N97M81r0
$$ 322234 321459 321465 322220 323254 324350 325512 326446 326677 326243 325838 326099 327012 328085 328929 329556 330153 330634 330544
53831C30544r44j354r64l26q4M3P00J568J607O20k89j57P05J416J686J772J810
$$ 330544 329600 328246 327282 326956 326872 326915 327615 329183 330790 331410 331121 330964 331669 333085 334771 336543 338353
53814C38353J699J458J317J636K814M873P105Q639R560J0903J3332J6458J9696
$$ 338353 340052 341510 342827 344463 347277 352150 359255 367894 377454 388357 401689 418147 437843
53801D37843K3017K6264K8481K8838K7809K6406K4211J9343J0789K75q813j4197
$$ 437843 460860 487124 515605 544443 572252 598658 622869 642212 653001 653276 644463 630266
53789F30266j6117j6188j5520j4150j1936r302o941n180m013l494l673m244m751
$$ 630266 614149 597961 582441 568291 556355 547053 540112 534932 530919 527425 523752 519508 514757
53776E14757n150n785o848q200r703j1192j2124j1857j0549r224q610q347p718
$$ 514757 509607 503822 496974 488774 479071 467879 455755 443898 433349 424125 415515 407168 399450
53763C99450o749o093n996n937n312m149l053k607k813l107k945k342j717j387
$$ 399450 392701 386608 380612 374675 369363 365214 362161 359554 356741 353634 350689 348347 346630 345243
53749C45243j441j927k639k858j987n24K75ol88J05J100J587J400J169J191J101
$$ 345243 343802 341875 339236 336378 334391 333867 334142 334136 333748 333853 334953 336540 337940 339109 340300 341401
53733C41401O90K82J98L47M29K78p6l35j5J079K508L614M115L997L145J696N54
$$ 341401 342091 342373 342571 342918 343347 343625 343549 343214 343199 344278 346786 350400 354515 358512 361657 363353 363907
53716C63907P00J903K779K493J761J785K761L937M776N370N844N962N451M363
$$ 363907 364607 366510 369289 371782 373543 375328 378089 382026 386802 392172 398016 403978 409429 413792
53702D13792K953J508L55j78p0L63Q30J383K136K822K976K636K447K834L287K920
$$ 413792 416745 418253 418608 418430 418360 418723 419553 420936 423072 425894 428870 431506 433953 436787 440074 442994
53686D42994J692N66K93N00L45k34m29K68J296J619R06j29n36j19M64N44J53j98
$$ 442994 444686 445252 445545 446045 446390 446156 445727 445995 447291 448910 449816 449687 449151 449032 449496 450040 450193 449995
53668D49995l07m67q77j272j348j199j081j050j108j354j657j567j003p02j307
$$ 449995 449688 449221 448344 447072 445724 444525 443444 442394 441286 439932 438275 436708 435705 435003 433696
53653D33696k202k151j006K7P5l53m20k22l37p20r24j032j449j871j456j38J012
$$ 433696 431494 429343 428337 428364 428439 428086 427666 427444 427107 426387 425463 424431 422982 421111 419655 419517 420529
53636D20529J085L81k55m90m26Q0J263K739L590L329K365J389O96L15L63R40J817
$$ 420529 421614 421995 421740 421250 420824 420904 422167 424906 428496 431825 434190 435579 436275 436590 436953 437893 439710
53619D39710K620L283L994M699M980M581L847L386L416L653L805L930M203M523
$$ 439710 442330 445613 449607 454306 459286 463867 467714 471100 474516 478169 481974 485904 490107 494630
53605D94630M556M125L458L009L085L581M079M173L810L330L125L218L278L039
$$ 494630 499186 503311 506769 509778 512863 516444 520523 524696 528506 531836 534961 538179 541457 544496
53591E44496K637K403K399K346J991J358N64l21j106j450j345j374k016k783k718
$$ 544496 547133 549536 551935 554281 556272 557630 558194 557873 556767 555317 553972 552598 550582 547799 545081
53576E45081j812j243j835k870l052k185j214q96j178j746k345k533j995j295
$$ 545081 543269 542026 540191 537321 534269 532084 530870 529974 528796 527050 524705 522172 520177 518882
53562E18882j401k204k345j145K15K73o50r60m3J138J622J505J249Q98M68M21
$$ 518882 517481 515277 512932 511787 512002 512275 511625 510665 510622 511760 513382 514887 516136 517034 517502 517923
53546E17923J080J958K229J742J180J310K240L391M036L979L723L904M610N491
$$ 517923 519003 520961 523190 524932 526112 527422 529662 533053 537089 541068 544791 548695 553305 558796
53532E58796O312P087P748Q202Q702R614J0725J1355J1295J1160J1623J2751J4219
$$ 558796 565108 572195 579943 588145 596847 606461 617186 628541 639836 650996 662619 675370 689589
53519F89589J5697J6809J7325J7612J8383J9773K1281K2777K4748K7254K9595
$$ 689589 705286 722095 739420 757032 775415 795188 816469 839246 863994 891248 920843
53508I20843L1520L3767L6562L8656L8964L8318L8206L8399L7398L4913L2168
$$ 920843 952363 986130 1022692 1061348 1100312 1138630 1176836 1215235 1252633 1287546 1319714
53497A319714K9861K7483K5001K3516K3570K4220K4620K5206K6432K7445K7229
$$ 1319714 1349575 1377058 1402059 1425575 1449145 1473365 1497985 1523191 1549623 1577068 1604297
53486A604297K6250K5729K5773K5406K4181K2690K1584K0985K0902K1373K2101
$$ 1604297 1630547 1656276 1682049 1707455 1731636 1754326 1775910 1796895 1817797 1839170 1861271
53475A861271K2475K2120K1103J9705J8292J7203J6307J4854J2267Q946N839L349
$$ 1861271 1883746 1905866 1926969 1946674 1964966 1982169 1998476 2013330 2025597 2034543 2040382 2043731
53463B043731R97j865n430r325j2847j5447j7253j8901k0644k2039k2837k3629
$$ 2043731 2044728 2042863 2037433 2028108 2015261 1999814 1982561 1963660 1943016 1920977 1898140 1874511
53451A874511k5081k6981k8708l0220l1788l3056l3269l2410l1332l0694l0426
$$ 1874511 1849430 1822449 1793741 1763521 1731733 1698677 1665408 1632998 1601666 1570972 1540546
53440A540546l0285l0196k9969k9268k8005k6266k3922k0883j7757j5502j4289
$$ 1540546 1510261 1480065 1450096 1420828 1392823 1366557 1342635 1321752 1303995 1288493 1274204
53429A274204j3266j1577r145o362l623j216Q92L235O218R366J1816J3583J5512
$$ 1274204 1260938 1249361 1240216 1233854 1230231 1229015 1229907 1233142 1239360 1248726 1260542 1274125 1289637
53416A289637J7945K0379K2547K4828K7176K8770K9377L0174L2238L4964L6899
$$ 1289637 1307582 1327961 1350508 1375336 1402512 1431282 1460659 1490833 1523071 1558035 1594934
53405A594934L7740L8526M0132M2468M5091M7840N0765N3967N7491O1067O4075
$$ 1594934 1632674 1671200 1711332 1753800 1798891 1846731 1897496 1951463 2008954 2070021 2134096
53394B134096O6186O7828O9616P1520P3132P4422P5712P6990P7865P8161P8044
$$ 2134096 2200282 2268110 2337726 2409246 2482378 2556800 2632512 2709502 2787367 2865528 2943572
53383B943572P7611P6835P5823P4608P2708O9499O5148O0668N6910N3835N0852
$$ 2943572 3021183 3098018 3173841 3248449 3321157 3390656 3455804 3516472 3573382 3627217 3678069
53372C678069M7492M3650L9543L5564L1928K8320K4112J8927J2773N756k137j0987
$$ 3678069 3725561 3769211 3808754 3844318 3876246 3904566 3928678 3947605 3960378 3966134 3963997 3953010
53360C953010k0993l2303m4354n5570o4358p0542p5306p9636q3324q5670q6538
$$ 3953010 3932017 3899714 3855360 3799790 3735432 3664890 3589584 3509948 3426624 3340954 3254416
53349C254416q6436q5907q5196q4281q2976q1263p9580p8460p7807p6966p5668
$$ 3254416 3167980 3082073 2996877 2912596 2829620 2748357 2668777 2590317 2512510 2435544 2359876
53338B359876p4407p3543p2533p0567o7575o4097o0466n6696n2994m9687m6570
$$ 2359876 2285469 2211926 2139393 2068826 2001251 1937154 1876688 1819992 1766998 1717311 1670741
53327A670741m2929l8441l3678k9560k6551k4477k2781k0830j8350j5710j3564
$$ 1670741 1627812 1589371 1555693 1526133 1499582 1475105 1452324 1431494 1413144 1397434 1383870
53316A383870j1972j0279q080n939m684m219l506j806N48K706M258N449O672Q060
$$ 1383870 1371898 1361619 1353539 1347600 1342916 1338697 1335191 1333385 1333933 1336639 1340897 1346346 1353018 1361078
53302A361078R476J0783J2049J3561J5468J7483J9177K0672K2616K5286K8017
$$ 1361078 1370554 1381337 1393386 1406947 1422415 1439898 1459075 1479747 1502363 1527649 1555666
53291A555666K9972L1225L2563L4312L5958L7042L7800L8577L9084L8706L7359
$$ 1555666 1585638 1616863 1649426 1683738 1719696 1756738 1794538 1833115 1872199 1910905 1948264
53280A948264L5553L3717L1895L0056K8365K6927K5493K3615K1104J8260J5539
$$ 1948264 1983817 2017534 2049429 2079485 2107850 2134777 2160270 2183885 2204989 2223249 2238788
53269B238788J2958R941N992J447k826o521j0210j4412j8793k2775k6488l0441
$$ 2238788 2251746 2261687 2267679 2269126 2266300 2259779 2249569 2235157 2216364 2193589 2167101 2136660
53257B136660l4447l7627l9631m1237m3421m6263m8998n0804n1312n0643m9269
$$ 2136660 2102213 2064586 2024955 1983718 1940297 1894034 1845036 1794232 1742920 1692277 1643008
53246A643008m7692m6074m4346m2661m1443m0807m0339l9689l9113l9055l9477
$$ 1643008 1595316 1549242 1504896 1462235 1420792 1379985 1339646 1299957 1260844 1221789 1182312
53235A182312l9946m0112l9767l8680l6848l4752l2876l1010k8584k5688k3137
$$ 1182312 1142366 1102254 1062487 1023807 986959 952207 919331 888321 859737 834049 810912
53224H10912k1387j9919j8022j5730j3606j1970j0780j0022r674r494r265r218
$$ 810912 789525 769606 751584 735854 722248 710278 699498 689476 679802 670308 661043 651825
53212F51825r660j0261j0239r395q450q129q325q533q622q759q819q477p800p237
$$ 651825 642165 631904 621665 612270 603820 595691 587366 578833 570211 561452 552633 544156 536356 529119
53198E29119p003o856o604o367o211n912n330m722m439m473m584m627m538m191
$$ 529119 522116 515260 508656 502289 496078 490166 484836 480114 475675 471202 466618 461991 457453 453262
53184D53262l612l183l219l443l317k859k650k916l079k538j497o11l8N80J335
$$ 453262 449650 446467 443248 439805 436488 433629 430979 428063 424984 422446 420949 420338 420300 420880 422215
53169D22215J768J515Q03P5n16r53j095q39l85M8N48J164J466J010J51j60M29
$$ 422215 423983 425498 426301 426376 425860 424907 423812 422973 422588 422636 423184 424348 425814 426824 426975 426815 427244
53152D27244J249J551J342R98N24k47j109j605j574j131m36J77J40o59j393j177
$$ 427244 428493 430044 431386 432384 432908 432661 431552 429947 428373 427242 426806 426983 427123 426464 425071 423894
53136D23894l35m5p48j688k090j949j465n74M71Q44J14j024j629j639j550j370
$$ 423894 423559 423514 422766 421078 418988 417039 415574 415000 415471 416315 416429 415405 413776 412137 410587 409217
53120D09217p26K27Q13P66N47O32R37J069P39p9j143k059k593k810k735k209j352
$$ 409217 408491 408718 409531 410297 410844 411476 412413 413482 414221 414142 412999 410940 408347 405537 402802 400593 399241
53103C99241p85q83j151r11l87l17p50j024q76o34k57P68K221K893K128Q27J65
$$ 399241 398456 397573 396422 395511 395124 394807 394057 393033 392157 391523 391266 392034 394255 397148 399276 400103 400268
53086D00268O5k86r03j106q23p28j044j129n29L04P49Q67J049J214R46K39l81
$$ 400268 400333 400047 399144 398038 397215 396487 395443 394314 393785 394089 394838 395705 396754 397968 398914 399153 398772
53069C98772n34m03l97o23q75j048j281j630j817j459n73L25P08N17J40rJ62M06
$$ 398772 398238 397835 397438 396815 395940 394892 393611 391981 390164 388705 388132 388457 389165 389682 389822 389813 389975 390381
53051C90381M03J19j04M6M44O61O01O53J074J483J291M86l12o09n25m67n24m81
$$ 390381 390784 390903 390799 390845 391289 391950 392551 393204 394278 395761 397052 397538 397226 396617 396092 395625 395101 394620
53033C94620k45m8j03k63k04Q3K44M7k90m27l91n01q89j360j671j720j502j156
$$ 394620 394375 394327 394224 393961 393757 393840 394084 394131 393841 393414 393023 392522 391633 390273 388602 386882 385380 384224
53015C84224j015j302j708j643r76k33N1j09l41l34M8P07J163Q89O7l88J20J111
$$ 384224 383209 381907 380199 378556 377580 377347 377398 377289 376948 376614 376662 377369 378532 379421 379488 379100 379220 380331
52997C80331J691J653J461J412J329R98N12J44K15Q48J589J575N64m68m14M93
$$ 380331 382022 383675 385136 386548 387877 388875 389387 389531 389746 390594 392183 393758 394322 393854 393440 393933
52981C93933R87N48jJ24N55N19J36J99Q98J465J168K96j22M75J446J645Q45Q4
$$ 393933 394920 395468 395467 395591 396146 396665 396801 397000 397898 399363 400531 400827 400705 401180 402626 404271 405116 405200
52963D05200K59Q72Q26J53p7M32O04k76j286j147j29L58k91j340j933j989j855
$$ 405200 405459 406331 407157 407310 407233 407665 408269 407993 406707 405560 405431 405789 405498 404158 402225 400236 398381
52946C98381j824k109k664k902k209q54J77L59R1j08k80n95r02j031j079j071
$$ 398381 396557 394448 391784 388882 386673 385819 385996 386355 386446 386338 386058 385463 384561 383530 382451 381380
52930C81380q16l54o6JL61J137J432M14j317k213j595k73O19Q09O85N45L89K06
$$ 381380 380564 380210 380144 380145 380506 381643 383075 383489 382172 379959 378364 378091 378710 379519 380204 380749 381138 381344
52912C81344R3J04J81J74J8j35o4R0j54r28j569j255k2J341K239K664K687K144
$$ 381344 381437 381541 381722 381896 381914 381779 381715 381805 381651 380723 379154 377899 377877 379218 381457 384121 386808 388952
52894C88952J084Qo21q58j027j275j536j658j452q46j41J82P5n7j0l4j54R8Q42
$$ 388952 390036 390044 389423 388565 387538 386263 384727 383069 381617 380771 380630 380812 380887 380830 380820 380786 380632 380730 381572
52875C81572J295O88n45j227q94j81J86P0l41p85q06q5R16J245O30j77m77m82
$$ 381572 382867 383555 383010 381783 380889 380708 380894 380964 380623 379838 379032 378947 379863 381108 381738 381561 381084 380602
52857C80602p05j054j137r71q05n05J95R46J009K42o43r66p48l29J83Q67J620
$$ 380602 379897 378843 377706 376735 375930 375425 375620 376566 377575 377817 377174 376208 375460 375131 375314 376181 377801
52840C77801K088J865Q29n43j295q63J24M09l99j383j542r01q3N96J059R64P3
$$ 377801 379889 381754 382583 382040 380745 379882 380006 380415 380016 378633 377091 376190 376107 376703 377762 378726 378799
52823C78799j079j635j510j298j110l11J351L153M369N169O041O865P204P127
$$ 378799 377720 376085 374575 373277 372167 371856 373207 376360 380729 385898 391939 398804 406008 413135
52809D13135O973O454M747J558k342n750p851q488q088p365o752o125n343m778
$$ 413135 420108 426562 431309 432867 430525 424775 416924 408436 400348 392983 386231 380106 374763 369985
52795C69985m824n043m539l232k008j477j287r46n78m04j88K53N11K89J16O23
$$ 369985 365161 360118 355579 352347 350339 348862 347575 346629 346051 345647 345459 345712 346223 346512 346628 347251
52779C47251J446J664J131N72M21L99L34N89J344K117K333J962J262L98m13p22
$$ 347251 348697 350361 351492 352064 352485 352884 353218 353807 355151 357268 359601 361563 362825 363223 362810 362088
52763C62088l47L29Q10J054J231J184O29k06o12j98N47P39L7r51j216l10J267
$$ 362088 361741 362070 362880 363934 365165 366349 366978 366772 366160 365962 366509 367248 367285 366334 365118 364808 366075
52746C66075K553K921K372J309K97j78r1m1n63j338j477p67j1N0k70j23O74J546
$$ 366075 368628 371549 373921 375230 375527 375349 375258 375217 374654 373316 371839 371072 371061 371111 370841 370718 371392 372938
52728C72938K006K072J881J372N84j45m47l20j20k00n57p60l34O40J439J450Q89
$$ 372938 374944 377016 378897 380269 380853 380708 380261 379941 379821 379621 379064 378304 377970 378610 380049 381499 382388
52711C82388M80M96N15J92j22J29Q55J328J024J82n26o84l76J7J04l52j244k107
$$ 382388 382868 383364 383879 384071 383949 384078 384933 386261 387285 387467 386941 386257 385881 385898 386002 385650 384406 382299
52693C82299k418k105j615j371j258q10J28J167J831K008J907J695J381R38L94
$$ 382299 379881 377776 376161 374790 373532 372722 372850 374017 375848 377856 379763 381458 382839 383777 384171
52678C84171j18l42m4O88J371J531J191Q23P79Q93P60K57l20o14n29j64M30J174
$$ 384171 384053 383711 383667 384355 385726 387257 388448 389271 390050 390943 391703 391960 391640 391026 390497 390333 390763 391937
52660C91937J710J537N59o02j085n45O38J758K320K333K164K073J820R43m80j688
$$ 391937 393647 395184 395743 395141 394056 393511 394149 395907 398227 400560 402724 404797 406617 407560 407080 405392
52644D05392k117k070k059j830p92P65J674J363N99M02Q53J424J914K448K880
$$ 405392 403275 401205 399146 397316 396524 397289 398963 400326 400925 401327 402180 403604 405518 407966 410846
52629D10846K868K434J872J192K20q01j282j164j186j978l153l707l150k009j145
$$ 410846 413714 416148 418020 419212 419432 418631 417349 416185 414999 413021 409868 406161 403011 401002 399857
52614C99857q60q80r55j148j393j211l12O96Q40mr12j120q07m31O8Q86J697J991
$$ 399857 398997 398117 397162 396014 394621 393410 393098 393794 394634 394630 393718 392598 391791 391360 391428 392314 394011 396002
52596C96002J803J452Q54j91j189j254l17O41Q44N33L30L48L71M30O94J042J162
$$ 396002 397805 399257 400111 399920 398731 397477 397160 397801 398645 399178 399508 399856 400227 400657 401351 402393 403555
52579D03555J019Q87R94J289J565J629J399R53M45j3l73n63n95o54r28j317j563
$$ 403555 404574 405461 406455 407744 409309 410938 412337 413290 413735 413722 413349 412786 412191 411537 410609 409292 407729
52562D07729j597j490j103j82J054J824J584O56k16o88r00r41o68p5M42M10j87
$$ 407729 406132 404642 403539 403357 404411 406235 407819 408475 408259 407571 406671 405730 405062 404987 405429 405839 405652
52545D05652q35r35m23J60J98l44r57j170r16l31N40J598K415K409J433O2q68
$$ 405652 404817 403882 403459 403619 403817 403473 402516 401346 400430 400099 400639 402237 404652 407061 408494 408556 407688
52528D07688j025p80o14n40l34p6nJ54J022K483L394K951J854J407J788K080J817
$$ 407688 406663 405883 405269 404729 404395 404319 404314 404468 405490 407973 411367 414318 416172 417579 419367 421447 423264
52511D23264J535J679J904J779J355P01l92j727k446k121j558j745k510k856k384
$$ 423264 424799 426478 428382 430161 431516 432217 431825 430098 427652 425531 423973 422228 419718 416862 414478
52496D14478j567q55l21n5k28n99o11j44K79J71l60p86o17K93J501K136J770J065
$$ 414478 412911 412056 411735 411680 411452 410853 410242 410098 410377 410548 410188 409402 408785 409078 410579 412715 414485 415550
52478D15550J057J865K579K505J939J542J509J587J558J377J142J131J535K097
$$ 415550 416607 418472 421051 423556 425495 427037 428546 430133 431691 433068 434210 435341 436876 438973
52464D38973K270J809R16k24j538k606k766k022j294j413k193k918l254l194k571
$$ 438973 441243 443052 443968 443744 442206 439600 436834 434812 433518 432105 429912 426994 423740 420546 417975
52449D17975j322qN63K00o13j345j677j331l60N45O33R2k25LK55J57m3k12p03
$$ 417975 416653 416645 417208 417408 416795 415450 413773 412442 412082 412627 413260 413352 413127 413130 413385 413542 413499 413287 412584
52430D12584j504j746q87K16K48p67j524j218m24l6j48k81j96K1K57L75K34Q1
$$ 412584 411080 409334 408447 408663 408911 408144 406620 405402 404978 404942 404794 404513 404317 404338 404595 404970 405204 405285
52412D05285N84K056L877N129N624N914O386O964P629Q637R974J1023J1137J0241
$$ 405285 405869 407925 411802 416931 422555 428469 434855 441819 449448 458085 468059 479082 490219 500460
52398E00460Q578O234L301K98k147l965n616p334q775r450r142p834n702l418
$$ 500460 509038 515272 518573 518871 516724 512759 507143 499809 491034 481584 472442 464608 458906 455488
52384D55488j962j614j493o06Q12J626J341O63L34J88j94n36k82M39R04P83L91
$$ 455488 453526 451912 450419 449813 450625 452251 453592 454255 454589 454777 454583 454047 453765 454204 455108 455891 456282
52367D56282j6m94r13q48k94R5j42n65m75Q3M29K18j32nP50J725K287K114J532
$$ 456282 456266 455772 454859 454011 453717 453812 453670 453105 452630 452713 453142 453360 453228 453223 453973 455698 457985 460099 461631
52348D61631J201J319J408J097P61R36J362J283O24K08O86J760K706L239L617
$$ 461631 462832 464151 465559 466656 467417 468353 469715 470998 471622 471830 472516 474276 476982 480221 483838
52333D83838M201N121O143O769O740O472O605P036O964N976M641L709L368L542
$$ 483838 488039 493160 499303 506072 512812 519284 525889 532925 539889 545865 550506 554215 557583 561125
52319E61125M354N604O420O131N305N148O003P138P900Q273Q326P958P471P633
$$ 561125 565479 571083 577503 583634 588939 594087 600090 607228 615128 623401 631727 639685 647156 654789
52305F54789Q739J0063J0734J0731J0571J0407R969R211Q498Q106P860P369O514
$$ 654789 663528 673591 684325 695056 705627 716034 726003 735214 743712 751818 759678 767047 773561
52292G73561N618N238N615O308O571O135N479N200N439N977O564O904O676N983
$$ 773561 779179 784417 790032 796340 802911 809046 814525 819725 825164 831141 837705 844609 851285 857268
52278H57268N430N437N645N482M998M644M444M076L680L818M414M562L723K567
$$ 857268 862698 868135 873780 879262 884260 888904 893348 897424 901104 904922 909336 913898 917621 920188
52264I20188K128K630L609M691N630N861M896L107J466M66r7k99J57J215K194
$$ 920188 922316 924946 928555 933246 938876 944737 949633 952740 954206 954672 954575 954276 954433 955648 957842
52249I57842K664K988L469L591K870K046K503M512O789Q009Q083P777P751Q267
$$ 957842 960506 963494 966963 970554 973424 975470 977973 982485 989274 997283 1005366 1013143 1020894 1029161
52235A029161R279J0301J0623J0064R219Q587P895O806N798N589N950O006N621
$$ 1029161 1038440 1048741 1059364 1069428 1078647 1087234 1095129 1101935 1107733 1113322 1119272 1125278 1130899
52222A130899N540N956N973M948L574K880K798K528J857J260R65Q16R55J650K404
$$ 1130899 1136439 1142395 1148368 1153316 1156890 1159770 1162568 1165096 1166953 1168213 1169178 1169994 1170949 1172599 1175003
52207A175003K244J194N50J152K158K295J682J544K429L605M169M016L634L519
$$ 1175003 1177247 1178441 1178991 1180143 1182301 1184596 1186278 1187822 1190251 1193856 1198025 1202041 1205675 1209194
52193A209194L912M594M882M263L113K335K247K371K314K192K015J368K04p07
$$ 1209194 1213106 1217700 1222582 1226845 1229958 1232293 1234540 1236911 1239225 1241417 1243432 1244800 1245004 1244297
52179A244297o97j82j19p74j658k415l091l618l728l407k941k433j813j379j734
$$ 1244297 1243600 1243418 1243299 1242525 1240867 1238452 1235361 1231743 1228015 1224608 1221667 1219234 1217421 1216042 1214308
52164A214308k917m155m698m578m284m094m036m084m057l572k526j373n57J19
$$ 1214308 1211391 1207236 1202538 1197960 1193676 1189582 1185546 1181462 1177405 1173833 1171307 1169934 1169377 1169496
52150A169496J159K524L627M045L878L402K774K204J972K037J889J012n01j990
$$ 1169496 1170655 1173179 1176806 1180851 1184729 1188131 1190905 1193109 1195081 1197118 1199007 1200019 1199518 1197528
52136A197528k761k605j842r67j94O26J663K819L900M867N631N793N030L753K857
$$ 1197528 1194767 1192162 1190320 1189353 1189159 1189785 1191448 1194267 1198167 1203034 1208665 1214458 1219488 1223241 1226098
52121A226098K630K399J567O14M95J307K161K395K392K899M063N412O591P725
$$ 1226098 1228728 1231127 1232694 1233308 1233803 1235110 1237271 1239666 1242058 1244957 1249020 1254432 1261023 1268748
52107A268748R130J0956J3136J5499J7783J9584K0375J9694J7534J4565J1764
$$ 1268748 1277878 1288834 1301970 1317469 1335252 1354836 1375211 1394905 1412439 1427004 1438768
52096A438768R727Q363P346O596O230O302O833P872R209J0200J0313R834R563
$$ 1438768 1448495 1456858 1464204 1470800 1477030 1483332 1490165 1498037 1507246 1517446 1527759 1537593 1547156
52083A547156R735R652Q593O730M870L506K490J455K54j037k223l039l269k944
$$ 1547156 1556891 1566543 1575136 1581866 1586736 1590242 1592732 1594187 1594441 1593404 1591181 1588142 1584873 1581929
$$ [...]
##END NTUPLES=NMR SPECTRUM
##END=
