##TITLE=AC1399_2357uv_7519954_JKoHcfTaAp
##JCAMPDX= 6.0         $$ Bruker NMR JCAMP-DX V2.0
##DATA TYPE= NMR SPECTRUM
##DATA CLASS= NTUPLES
##ORIGIN= BRUKER
##OWNER= Administrator
$$ 1.72 TOPSPIN		Version 2.1
$$ 2013-04-17 01:57:27.747 -0700  Administrator@X
$$ Compression mode = diff/dup
##.OBSERVE FREQUENCY= 400.02188249412
##.OBSERVE NUCLEUS= ^1H
##.ACQUISITION MODE= SIMULTANEOUS (DQD)
##.ACQUISITION SCHEME= undefined
##.AVERAGES= 64
##.DIGITISER RES= 22
##SPECTROMETER/DATA SYSTEM= spect
##.PULSE SEQUENCE= noesygpps1d.comp
##.SOLVENT NAME= COFFEE_meoh
##.SHIFT REFERENCE= INTERNAL, COFFEE_meoh, 1, 14.96118
##AUDIT TRAIL= $$ (NUMBER, WHEN, WHO, WHERE, PROCESS, VERSION, WHAT)
$$ ##TITLE= Audit trail, TOPSPIN		Version 2.1
$$ ##JCAMPDX= 5.01
$$ ##ORIGIN= Bruker BioSpin GmbH
$$ ##OWNER= Administrator
$$ $$ E:\/data/COFFEE/nmr/AC1399_2357uv_7519954_JKoHcfTaAp/12/pdata/1/auditp.txt
$$ ##AUDIT TRAIL=  $$ (NUMBER, WHEN, WHO, WHERE, PROCESS, VERSION, WHAT)
(   1,<2013-04-17 01:57:22.591 -0700>,<Administrator>,<X>,<go>,<TOPSPIN 2.1>,
      <created by zg
	started at 2013-04-17 01:45:52.917 -0700,
	POWCHK enabled, PULCHK disabled,
       configuration hash MD5:
       33 CF 6A 21 5C D3 B9 40 6C 15 AA 8D 27 A2 4F 13
       data hash MD5: 64K
       FB 6C AE 3C 6E 04 04 7B C9 92 2B BC 50 BA 5F EA>)
(   2,<2013-04-17 01:57:25.591 -0700>,<Administrator>,<X>,<proc1d>,<TOPSPIN 2.1>,
      <Start of raw data processing
       efp LB = 0.3 FT_mod = 6 PKNL = 1 PHC0 = 0 PHC1 = 0 SI = 128K 
       data hash MD5: 128K
       3E BD 5B 94 E5 D1 CD BA 69 63 F8 1A FC 09 27 3D>)
(   3,<2013-04-17 01:57:26.575 -0700>,<Administrator>,<X>,<proc1d>,<TOPSPIN 2.1>,
      <pk PHC0 = -79.65637 PHC1 = 0 
       data hash MD5: 128K
       DE F6 D2 46 4F 7F 13 CC A1 00 B8 84 93 C2 60 38>)
(   4,<2013-04-17 01:57:27.091 -0700>,<Administrator>,<X>,<proc1d>,<TOPSPIN 2.1>,
      <abs ABSG = 1 
       data hash MD5: 128K
       CD B4 2D 2A F4 01 9E 32 D0 3C 1E BE F9 F3 C4 74>)
(   5,<2013-04-17 01:57:27.216 -0700>,<Administrator>,<X>,<proc1d>,<TOPSPIN 2.1>,
      <abs ABSG = 2 
       data hash MD5: 128K
       F2 B9 69 26 AC 93 AE DC 7C CA EF 05 D4 26 08 C2>)
(   6,<2013-04-17 01:57:27.325 -0700>,<Administrator>,<X>,<proc1d>,<TOPSPIN 2.1>,
      <abs ABSG = 3 
       data hash MD5: 128K
       60 67 F4 24 3A E9 2B B4 A1 93 0C E3 FE 6B 56 4A>)
(   7,<2013-04-17 01:57:27.450 -0700>,<Administrator>,<X>,<proc1d>,<TOPSPIN 2.1>,
      <abs ABSG = 4 
       data hash MD5: 128K
       51 1A D6 B9 A9 1E EA 8B 33 B5 7B A5 A2 66 4C 14>)
(   8,<2013-04-17 01:57:27.544 -0700>,<Administrator>,<X>,<proc1d>,<TOPSPIN 2.1>,
      <abs ABSG = 5 
       data hash MD5: 128K
       42 92 33 8A 9F 2B 1D 0C 6B 77 21 70 4F 4C 31 B1>)
$$ ##END=
$$ 
$$ $$ hash MD5
$$ $$ 0E DE 49 3D 6A 96 06 EC DA A3 52 C7 80 A6 BB B8
##$RELAX= 
##$RELAX= 
##$RELAX= 
##$RELAX= 
##$RELAX= 
##$RELAX= 
##$RELAX= 
##$RELAX= 
$$ Bruker specific parameters
$$ --------------------------
##$DU= <E:\>
##$EXPNO= 12
$$ [...]
##$TP07= 0
##$TPNAME0= <>
##$TPNAME1= <>
##$TPNAME2= <>
##$TPNAME3= <>
##$TPNAME4= <>
##$TPNAME5= <>
##$TPNAME6= <>
##$TPNAME7= <>
##$TPOAL= (0..7)
0.5 0.5 0.5 0.5 0.5 0.5 0.5 0.5
##$TPOFFS= (0..7)
0 0 0 0 0 0 0 0
##$TUNHIN= 0
##$TUNHOUT= 0
##$TUNXOUT= 0
##$USERA1= <user>
##$USERA2= <user>
##$USERA3= <user>
##$USERA4= <user>
##$USERA5= <user>
##$V9= 5
##$VALIST= <valist>
##$VCLIST= <CCCCCCCCCCCCCCC>
##$VD= 0
##$VDLIST= <DDDDDDDDDDDDDDD>
##$VPLIST= <PPPPPPPPPPPPPPP>
##$VTLIST= <TTTTTTTTTTTTTTT>
##$WBST= 2048
##$WBSW= 25
##$XGAIN= (0..3)
0 0 0 0
##$XL= 0
##$YL= 0
##$YMAX_a= 8271249
##$YMIN_a= -10765323
##$ZGOPTNS= <>
##$ZL1= 120
##$ZL2= 120
##$ZL3= 120
##$ZL4= 120
##$ABSF1= 14.96118
##$ABSF2= -5.597002
##$ABSG= 5
##$ABSL= 3
##$ALPHA= 0
##$AQORDER= 0
##$ASSFAC= 0
##$ASSFACI= 0
##$ASSFACX= 0
##$ASSWID= 0
##$AUNMP= <proc_prof1d_extract.lims>
##$AXLEFT= 0
##$AXNAME= <>
##$AXNUC= <1H>
##$AXRIGHT= 0
##$AXTYPE= 0
##$AXUNIT= <>
##$AZFE= 0.1
##$AZFW= 0.1
##$BCFW= 0
##$BC_mod= 0
##$BYTORDP= 0
##$COROFFS= 0
##$CY= 15
##$DATMOD= 1
##$DC= 0
##$DFILT= <>
##$DTYPP= 0
##$F1P= 0
##$F2P= 0
##$FCOR= 0.5
##$FTSIZE= 131072
##$FT_mod= 6
##$GAMMA= 0
##$GB= 0
##$INTBC= 1
##$INTSCL= 1
##$ISEN= 128
##$LB= 0.3
##$LEV0= 0
##$LPBIN= 0
##$MAXI= 10000
##$MC2= 0
##$MEAN= 0
##$ME_mod= 0
##$MI= 0
##$NCOEF= 0
##$NC_proc= -2
##$NLEV= 6
##$NOISF1= 0
##$NOISF2= 0
##$NSP= 0
##$NTH_PI= 0
##$NZP= 0
##$OFFSET= 14.96118
##$PC= 1
##$PHC0= -79.65637
##$PHC1= 0
##$PH_mod= 1
##$PKNL= yes
##$PPARMOD= 0
##$PPDIAG= 0
##$PPIPTYP= 0
##$PPMPNUM= 2147483647
##$PPRESOL= 1
##$PSCAL= 4
##$PSIGN= 0
##$PYNMP= <proc.py>
##$REVERSE= no
##$SF= 400.020009564679
##$SI= 131072
##$SIGF1= 0
##$SIGF2= 0
##$SINO= 400
##$SIOLD= 131072
##$SPECTYP= <>
##$SREGLST= <1H.CDCl3>
##$SSB= 0
##$STSI= 131072
##$STSR= 0
##$SW_p= 8223.68421052631
##$SYMM= 0
##$S_DEV= 0
##$TDeff= 65536
##$TDoff= 0
##$TI= <>
##$TILT= no
##$TM1= 0
##$TM2= 0
##$TOPLEV= 0
##$USERP1= <user>
##$USERP2= <user>
##$USERP3= <user>
##$USERP4= <user>
##$USERP5= <user>
##$WDW= 1
##$XDIM= 131072
##$YMAX_p= 330878044
##$YMIN_p= -390286388
##$CURPLOT= <Network HP LaserJet P1505>
##$CURPRIN= <$Network HP LaserJet P1505>
##$DFORMAT= <normdp>
##$LAYOUT= <+/1D_H.xwp>
##$LFORMAT= <normlp>
##$PFORMAT= <normpl>
##$SURQMSG= 1
$$ End of Bruker specific parameters
$$ ---------------------------------
##NTUPLES= NMR SPECTRUM
##VAR_NAME=  FREQUENCY,     SPECTRUM/REAL,   SPECTRUM/IMAG
##SYMBOL=    X,             R,               I
##VAR_TYPE=  INDEPENDENT,   DEPENDENT,       DEPENDENT
##VAR_FORM=  AFFN,          ASDF,            ASDF
##VAR_DIM=   131072,        131072,          131072
##UNITS=     HZ,            ARBITRARY UNITS, ARBITRARY UNITS
##FACTOR=    0.0627417313425164, 1,          1
##FIRST=     8223.62146879497, 2144,         -52339
##LAST=      0,             2405,            -53208
##MIN=       0,             -390286388,      0
##MAX=       8223.62146879497, 330878044,    0
$$ Real data points
##PAGE= N=1
##DATA TABLE= (X++(R..R)), XYDATA
$$ [...]
62635E86655p74j084j213j407j765j951j847j867k137k073j404r70j584k604k659
$$ 586655 585881 584797 583584 582177 580412 578461 576614 574747 572610 570537 569133 568163 566579 563975 561316
62620E61316j534l21K40M43N72K84m85j012p42j67q5m99p55n47j49J47M20R00
$$ 561316 559782 559461 559701 560144 560716 561000 560515 559503 558761 558594 558509 558010 557255 556708 556559 556706 557126 558026
62602E58026J686K663L620M501N536O954Q610J0104J1302J2441J3701J4995J6311
$$ 558026 559712 562375 565995 570496 576032 582986 591596 601700 613002 625443 639144 654139 670450
62589F70450J7886J9826K1723K2931K3193K2900K2620K2282K0863J7318J2029
$$ 670450 688336 708162 729885 752816 776009 798909 821529 843811 864674 881992 894021
62578H94021O926L620J651q42m834r458j3298j5867j7553j8779j9678k0205k0192
$$ 894021 900947 904567 906218 905376 900542 891084 877786 861919 844366 825587 805909 785704 765512
62565G65512j9503j8358j7240j6276j5082j3474j1951j1077j0679j0080q983p772
$$ 765512 746009 727651 710411 694135 679053 665579 653628 642551 631872 621792 612809 605037
62553F05037o959o594o282n587m499l485l007k871k366j131L74J447J931K097
$$ 605037 598078 591484 585202 579615 575116 571631 568624 565753 563387 562256 562630 564077 566008 568105
62539E68105J971J266k3j254j654j109k96ol73p48m15O64J877K720L299M082N305
$$ 568105 570076 571342 571319 570065 568411 567302 567006 567000 566627 565879 565464 566128 568005 570725 574024 578106 583411
62522E83411O798Q283R637J0838J1838J2609J3369J4559J6417J8601K0479K1874
$$ 583411 590209 598492 608129 618967 630805 643414 656783 671342 687759 706360 726839 748713
62510G48713K3252K5080K7260K9404L1339L2975L3907L3721L2613L1197K9715
$$ 748713 771965 797045 824305 853709 885048 918023 951930 985651 1018264 1049461 1079176
62499A079176K7852K5427K2676J9718J6378J2899J0251R093Q756P937O477N723
$$ 1079176 1107028 1132455 1155131 1174849 1191227 1204126 1214377 1223470 1232226 1240163 1246640 1252363
62487A252363O860R184J0463Q940M859K9l887o666r349j3089j8251k4327l0361
$$ 1252363 1259223 1268407 1278870 1287810 1292669 1292698 1288811 1282145 1272796 1259707 1241456 1217129 1186768
62474A186768l5333l8523l9910m0190m0159l9988l9271l7802l5974l4196l2165
$$ 1186768 1151435 1112912 1073002 1032812 992653 952665 913394 875592 839618 805422 773257
62463G73257k9259k5616k2259j9862j7808j5069j1753r133q013p766p215o004
$$ 773257 743998 718382 696123 676261 658453 643384 631631 622498 614485 606719 599504 593500
62451E93500m645l580k751k004j497j520k084k693k534j127R84K502K563J561
$$ 593500 588855 585275 582524 580520 579023 577503 575419 572726 570192 569065 570049 572551 575114 576675
62437E76675N42J7k68n76p61o44l80j63J08N84J021Q87J7j002j344q61k99m44
$$ 576675 577217 577234 576966 576390 575629 574985 574605 574442 574550 575134 576155 577042 577059 576057 574713 573852 573553 573109
62419E73109j262k140k755l224l524l303k438j361n73k24k76o09p92l22O03J145
$$ 573109 571847 569707 566952 563728 560204 556901 554463 553102 552529 552305 552029 551420 550628 550306 550909 552054
62403E52054R49O79J008J700K267K863L845M906N541O001O948Q322R409R878J0030
$$ 552054 553003 553682 554690 556390 558657 561520 565365 570271 575812 581813 588761 597083 606492 616370 626400
62388F26400J0111J0151J0390J1076J1796J1830J1093J0199R481Q731P879P143
$$ 626400 636511 646662 657052 668128 679924 691754 702847 713046 722527 731258 739137 746280
62376G46280O535N864N331N347N767O090O429P400Q988J0565J2169J4666J8267
$$ 746280 752815 758679 764010 769357 775124 781214 787643 795043 804031 814596 826765 841431 859698
62363H59698K2003K5214K8561L2808L7575M2095M6454N1036N5396N8725O1010
$$ 859698 881701 906915 935476 968284 1005859 1047954 1094408 1145444 1200840 1259565 1320575
62352A320575O2608O2846O0214N4198M6125L7797K9959K2338J4738P502R80n000
$$ 1320575 1383183 1446029 1506243 1560441 1606566 1644363 1674322 1696660 1711398 1718900 1719880 1714880
62340A714880j0970j7210k3610l0026l6414m2324m6811m9348n0569n1377n1566
$$ 1714880 1703910 1686700 1663090 1633064 1596650 1554326 1507515 1458167 1407598 1356221 1304655
62329A304655n0280m7704m5205m3454m1574l8706l5468l2986l1225k9189k6333
$$ 1304655 1254375 1206671 1161466 1118012 1076438 1037732 1002264 969278 938053 908864 882531
62318H82531k3001j9804j7303j5905j5318j4487j2749j0731r303q139o326m127
$$ 882531 859530 839726 822423 806518 791200 776713 763964 753233 743930 735791 729465 725338
62306G25338k848k861k903j816KJ408K098K579L114L433L414L338L360L153K393
$$ 725338 722490 719629 716726 714910 714912 716320 718418 720997 724111 727544 730958 734296 737656 740809 743202
62291G43202J364P89J016J592J765J215J00j318k771l787l940l384k757k438k313
$$ 743202 744566 745355 746371 747963 749728 750943 751043 749725 746954 743167 739227 735843 733086 730648 728335
62276G28335k255k227j832m55J726L640M674N539P148R293J1251J3202J5994J9786
$$ 728335 726080 723853 722021 721566 723292 726932 731606 737145 744293 753586 764837 778039 794033 813819
62262H13819K3908K7979L2209L6539M0489M4119M8253N3257N8285O2112O4190
$$ 813819 837727 865706 897915 934454 974943 1019062 1067315 1120572 1178857 1240969 1305159
62251A305159O4383O2201N6999M8802L8555K7630J7204P888m22q241j5914k3380
$$ 1305159 1369542 1431743 1488742 1537544 1576099 1603729 1620933 1628821 1628399 1620158 1604244 1580864
62239A580864l0474l7075m2826m7145m9812n1333n2228n2253n0769m7774m4090
$$ 1580864 1550390 1513315 1470489 1423344 1373532 1322199 1269971 1217718 1166949 1119175 1075085
62228A075085m0458l6972l3547l0444k7850k5360k2512j9676j7704j6600j5386
$$ 1075085 1034627 997655 964108 933664 905814 880454 857942 838266 820562 803962 788576
62217G88576j3594j2103j1800j1997j1223r248p264o106n325m341l419l006k925
$$ 788576 774982 762879 751079 739082 727859 718611 711347 705241 699916 695575 692156 689150 686225
62204F86225k832k765k569j501P88L363M931N376N620O363P656R408J1367J2844
$$ 686225 683393 680628 678059 676558 677346 680709 685640 691016 696636 702999 710655 720063 731430 744274
62190G44274J3362J3487J4139J5150J5507J5001J4573J4742J4757J3750J1882
$$ 744274 757636 771123 785262 800412 815919 830920 845493 860235 874992 888742 900624
62179I00624R741P368M688K295R58O21O65J047K461N371R483J4254J9384K4599
$$ 900624 910365 917733 922421 924716 925674 926295 926960 928007 930468 935839 945322 959576 978960 1003559
62165A003559K9432L3619L7385M0931M3674M4464M2626L8578L3237K7082K0138
$$ 1003559 1032991 1066610 1103995 1144926 1188600 1233064 1275690 1314268 1347505 1374587 1394725
62154A394725J2737N780Pm696r091j3804j8850k3748k7832l0660l2287l3035l2944
$$ 1394725 1407462 1413242 1413249 1408553 1399462 1385658 1366808 1343060 1315228 1284568 1252281 1219246 1186302
62141A186302l1650k8946k5218k1150j7163j3338r604n832j985J620M420O216
$$ 1186302 1154652 1125706 1100488 1079338 1062175 1048837 1039233 1033401 1031416 1033036 1037456 1043672
62129A043672P367Q202Q624Q656Q844R642J0617J0902J0272R241Q322P579O923
$$ 1043672 1051039 1059241 1067865 1076521 1085365 1095007 1105624 1116526 1126798 1136039 1144361 1151940 1158863
62116A158863O288N620M900M121L032J318o64j915k016j815k120k408j779q31
$$ 1158863 1165151 1170771 1175671 1179792 1182824 1184142 1183478 1181563 1179547 1177732 1175612 1173204 1171425 1170594
62102A170594j215l368n830o967o272l817L70N748J0979J4849J6960J7287J5842
$$ 1170594 1169379 1166011 1160181 1153214 1146942 1143125 1143495 1149243 1160222 1175071 1192031 1209318 1225160
62089A225160J3172J0452Q523P462P361Q608J0954J3179J4454J5360J6893J9131
$$ 1225160 1238332 1248784 1257307 1264769 1272130 1280738 1291692 1304871 1319325 1334685 1351578 1370709
62077A370709K1660K4541K7924L1217L3581L4907L5480L5099L3475L1158K9014
$$ 1370709 1392369 1416910 1444834 1476051 1509632 1544539 1580019 1615118 1648593 1679751 1708765
62066A708765K6985K4392K1314J8580J6362J3881J0702P286L976M03l647p560
$$ 1708765 1735750 1760142 1781456 1800036 1816398 1830279 1840981 1848267 1852243 1852646 1848999 1841439
62054A841439j0645j2824j4158j4395j3699j3179j3968j6025j8468k0802k3271
$$ 1841439 1830794 1817970 1803812 1789417 1775718 1762539 1748571 1732546 1714078 1693276 1670005
62043A670005k6178k9427l2696l5628l7946l9728m1399m3142m4471m4829m4299
$$ 1670005 1643827 1614400 1581704 1546076 1508130 1468402 1427003 1383861 1339390 1294561 1250262
62032A250262m3298m1762l9312l6080l2701k9438k6044k2633j9983j8586j7950
$$ 1250262 1206964 1165202 1125890 1089810 1057109 1027671 1001627 978994 959011 940425 922475
62021I22475j7331j6759j6766j7392j7971j7853j6954j5598j4180j2866j1398
$$ 922475 905144 888385 871619 854227 836256 818403 801449 785851 771671 758805 747407
62010G47407r205o115k803k24J452K963N073P806J0551J2609J3588J3565J2948
$$ 747407 738202 732087 729284 729060 730512 733475 738548 746354 756905 769514 783102 796667 809615
61997H09615J2019J0681Q825O666M345J440k444o737j0205j2380j3913j5378j6445
$$ 809615 821634 832315 841140 847806 852151 853591 851147 844410 834205 821825 807912 792534 776089
61984G76089j6668j6375j6102j5660j4450j2482j0405q707p376o257n199l975
$$ 776089 759421 743046 726944 711284 696834 684352 673947 665240 657864 651607 646408 642433
61972F42433k557j386r39j072j209j074p89l82L18J269K168K891L589M326N035
$$ 642433 639876 638490 637551 636479 635270 634196 633407 633025 633343 634612 636780 639671 643260 647586 652621
61957F52621N790O757P856Q849R778J0910J2231J3398J4351J5569J7623K0687
$$ 652621 658411 665168 673024 681873 691651 702561 714792 728190 742541 758110 775733 796420
61945G96420K4519K8640L2542L6060L9554M3439M7550N1276N4301N6632N8011
$$ 796420 820939 849579 882121 918181 957735 1001174 1048724 1100000 1154301 1210933 1268944
61934A268944N7926N6465N4632N3245N1851M9100M4230L7861L1313K5280J9234
$$ 1268944 1326870 1383335 1437967 1491212 1543063 1592163 1636393 1674254 1705567 1730847 1750081
61923A750081J2222M191l680j0103j4805j8229k0421k0805j8972j5185j0001l870
$$ 1750081 1762303 1766494 1762814 1752711 1737906 1719677 1699256 1678451 1659479 1644294 1634293 1630423
61911A630423K823R723J6579K3027K8346L1853L3433L3186L0614K4960J6524O856
$$ 1630423 1633246 1642969 1659548 1682575 1710921 1742774 1776207 1809393 1840007 1864967 1881491 1888347
61899A888347k714j2070k1366k9839l6376m0880m4250m7133m9316n0394n0332
$$ 1888347 1885633 1873563 1852197 1822358 1785982 1745102 1700852 1653719 1604403 1554009 1503677
61888A503677m9219m7012m3865m0456l7552l5337l3334l1101k8782k6839k5387
$$ 1503677 1454458 1407446 1363581 1323125 1285573 1250236 1216902 1185801 1157019 1130180 1104793
61877A104793k4026k2381k0458j8331j5799j2707r477o743m533k159R54M614Q119
$$ 1104793 1080767 1058386 1037928 1019597 1003798 991091 981614 974871 970338 968179 969133 973747 981866
61864I81866J0922J3021J4958J7494K1051K5434L0234L5379M1051M7242N3741
$$ 981866 992788 1005809 1020767 1038261 1059312 1084746 1114980 1150359 1191410 1238652 1292393
61853A292393O0451O7299P3950Q0010Q5403R0084R3503R4937R4277R1826Q7376
$$ 1292393 1352844 1420143 1494093 1574103 1659506 1749590 1843093 1938030 2032307 2124133 2211509
61842B211509Q0202P0074N7562M3266K7653J1962j686j1809j8604k2930k4796
$$ 2211509 2291711 2361785 2419347 2462613 2490266 2502228 2500542 2488733 2470129 2447199 2422403
61831B422403k3578j9291j2887n430K385R966J6601K1620K4492K4770K2136J6504
$$ 2422403 2398825 2379534 2366647 2361217 2363602 2373568 2390169 2411789 2436281 2461051 2483187 2499691
61819B499691P995l063j5955k9660m3123n5409o5677p3462p8955q2521q3988q2942
$$ 2499691 2507686 2504623 2488668 2459008 2415885 2360476 2294799 2221337 2142382 2059861 1975873 1892931
61807A892931p9774p5638p1165o5986n9902n3634m7905m2433l6682l1021k6301
$$ 1892931 1813157 1737519 1666354 1600368 1540466 1486832 1438927 1396494 1359812 1328791 1302490
61796A302490k2622j9325j6064j3145j0891r240p974o922o003n329n113n182n009
$$ 1302490 1279868 1260543 1244479 1231334 1220443 1211203 1203229 1196307 1190304 1184975 1179862 1174680 1169671
61783A169671m584m744n969p388p773p252p033p616q225q171p834p947q544r046
$$ 1169671 1165087 1160343 1154374 1146986 1139213 1131961 1124928 1117312 1109087 1100916 1093082 1085135 1076591 1067545
61769A067545q978q263p140o024n182m424l461k604k671l896n364n910n343m447
$$ 1067545 1058567 1050304 1043164 1037140 1031958 1027534 1024073 1021469 1018798 1014902 1009538 1003628 998285 993838
61755I93838l919l729l502l165k892k692k393k039j963k257k537k447k158j936
$$ 993838 989919 986190 982688 979523 976631 973939 971546 969507 967544 965287 962750 960303 958145 956209
61741I56209j570p01L99J054J139J153J325J355J169J174J474J668J760K438L941
$$ 956209 954639 953938 954337 955391 956530 957683 959008 960363 961532 962706 964180 965848 967608 970046 973987
61726I73987N414O135O581P520Q664R146Q894Q503Q045P051N569M283L541K977
$$ 973987 979401 985536 992117 999637 1008301 1017447 1026341 1034844 1042889 1049940 1055509 1059792 1063333 1066310
61712A066310K182J101k18j578k401k219j409q45p96q28o72n51n93o33o60q82
$$ 1066310 1068492 1069593 1069375 1067797 1065396 1063177 1061768 1060923 1060127 1059299 1058627 1058076 1057483 1056850 1056190 1055308
61696A055308j231j433j590k056k743l207l522m308n681o949p655q260r300j0417
$$ 1055308 1054077 1052644 1051054 1048998 1046255 1043048 1039526 1035218 1029537 1022588 1014933 1006673 997373 986956
61682I86956j0755j0069q984q332q440q900q922q123p063o657p045p436p216o780
$$ 986956 976201 966132 957148 948816 940376 931476 922554 914431 907368 900711 893666 886230 879014 872234
61668H72234o967p926q882q963q031o702n624m817l840k546j325m61K90J132J734
$$ 872234 865267 857341 848459 839496 831465 824763 819139 814322 810482 807936 806611 806150 806440 807572 809306
61653H09306J777J645J856K174K033J629J800K836M210N480O560P087O458M854
$$ 809306 811083 812728 814584 816758 818791 820420 822220 825056 829266 834746 841306 848393 854851 859705
61639H59705L296K282J147q18l319n653p651r331j0287j0271j0004j0485j1491
$$ 859705 863001 865283 866430 865612 862293 856640 848989 839658 829371 819100 809096 798611 787120
61626G87120j1584r813o878m372l139k721k242j486r53j019j438j837k427l761
$$ 787120 775536 765723 758845 754473 751334 748613 746371 744885 743932 742913 741475 739638 737211 733450
61612G33450n880q127r820j0792j1241j1428j1648j2074j2501j2407j1505j0019
$$ 733450 727570 719443 709623 698831 687590 676162 664514 652440 639939 627532 616027 606008
61600F06008q455p198o336n596m577l315k496k670l400l717l382l111l440l973
$$ 606008 597553 590355 584019 578423 573846 570531 568035 565365 561965 558248 554866 551755 548315 544342
61586E44342m033l582l169l154l303l072k217j257j143k150l238l032j439K14
$$ 544342 540309 536727 533558 530404 527101 524029 521812 520555 519412 517262 514024 510992 509553 509767
61572E09767O67j04j236j933j873j208m46j02k37n78r79j360j346n83N48J144
$$ 509767 510434 510330 509094 507161 505288 504080 503634 503532 503295 502717 501738 500378 499032 498449 498997 500141
61556E00141R31N74O71R76R26M05k63p04o43k9P78J336J659K095K643L014L310
$$ 500141 501072 501646 502317 503293 504219 504624 504361 503657 503014 502985 503763 505099 506758 508853 511496 514510 517820
61539E17820L949M784N153M892M536M174L138J298k54o33m89j082k524l838m353
$$ 517820 521769 526553 531706 536598 541134 545308 548446 549744 549490 548857 548368 547286 544762 540924 536571
61524E36571m181l588k768k145k158k649l016k982k801k677k539k335k178k114
$$ 536571 532390 528802 526034 523889 521731 519082 516066 513084 510283 507606 505067 502732 500554 498440
61510D98440k068k026k038k051j933j666j311q63k70M53J105J331Q61o3o69m60
$$ 498440 496372 494346 492308 490257 488324 486658 485347 484484 484214 484667 485772 487103 487964 487901 487232 486772
61494D86772P5N7n06p30j70N42O37J74k67k87K27J119J784J576P18K13N60J213
$$ 486772 486847 486904 486398 485668 485498 486040 486677 486851 486584 486297 486524 487643 489427 491003 491721 491934 492494 493707
61476D93707J650K010K268J675k7j629j731m92Q25J585K063K353K136J479Q76
$$ 493707 495357 497367 499635 501310 501283 499654 497923 497431 498256 499841 501904 504257 506393 507872 508748
61461E08748M39j23o90p14j18M56N12K60J68M22Q82J211J043L87j98j89L62J137
$$ 508748 509187 509064 508374 507660 507542 507998 508510 508770 508938 509360 510242 511453 512496 512883 512685 512496 512858 513995
61443E13995K085L182M106M768N779P536R132R151P525N702M904N044N449N716
$$ 513995 516080 519262 523368 528136 533915 541451 550583 559734 567259 572961 577865 582909 588358 594074
61429E94074N614M915L866L232L491M347N250N983O504O697O537O081N158L453
$$ 594074 599688 604603 608469 611701 615192 619539 624789 630772 637276 643973 650510 656591 661749 665202
61415F65202J118j139k740l715m381m938n554o351p098p334p035o786p064p600
$$ 665202 666320 665181 662441 658726 654345 649407 643853 637502 630404 623070 616035 609249 602185 594585
61401E94585p732p108n887m463l240k478k161k072k021j887j549j029n82l67j76
$$ 594585 586853 579745 573858 569395 566155 563677 561516 559444 557423 555536 553987 552958 552376 552009 551833
61386E51833J79L82O7l28R6J429K648K835K154J357Q80Q11J194J888K435K570
$$ 551833 552012 552394 552461 552133 552229 553658 556306 559141 561295 562652 563532 564343 565537 567425 569860 572430
61370E72430K616L027L697M131M100L780L424L279L667M710N975O803O991O920
$$ 572430 575046 578073 581770 585901 590001 593781 597205 600484 604151 608861 614836 621639 628630 635550
61356F35550P040P593Q778J0732J3149J5291J6712J7807J9243K1019K2480K3316
$$ 635550 642590 650183 658961 669693 682842 698133 714845 732652 751895 772914 795394 818710
61344H18710K4016K5107K6254K6549K5471K3087J9435J4378Q226J999l294p375
$$ 818710 842726 867833 894087 920636 946107 969194 988629 1003007 1011233 1013232 1009938 1002563
61332A002563j0496j2844j4506j5677j6409j6364j5211j3254j1246r610q181o767
$$ 1002563 992067 979223 964717 949040 932631 916267 901056 887802 876556 866946 858765 851998
61320H51998n587m987m899m900m747m716n195n957o100m981l024j196J72J491
$$ 851998 846411 841424 836525 831625 826878 822162 816967 811010 804910 799929 796905 795709 795881 797372
61306G97372K946M119M835N668P124Q858J0235J1164J1882J2294J2096J1259R773
$$ 797372 800318 804437 809272 814940 822064 830922 841157 852321 864203 876497 888593 899852 909625
61293I09625P310L781o5l250n533p143p923p530o327n103l954k328k83J194J537
$$ 909625 916935 920716 920651 917401 911868 904725 896802 889272 882945 877842 873888 871560 871277 872471 874008
61278H74008J424J840K799L553L707L681M171N458P210Q869J0246J1659J3374
$$ 874008 875432 877272 880071 883624 887331 891012 895183 900641 907851 916720 926966 938625 951999
61265I51999J5210J7004J9130K1975K5115K7607K9155L0342L1724L3154L4019
$$ 951999 967209 984213 1003343 1025318 1050433 1078040 1107195 1137537 1169261 1202415 1236434
61254A236434L3641L1409K7075K1124J4404P327j38p726j4781k0927k6193l0290
$$ 1236434 1270075 1301484 1328559 1349683 1364087 1371414 1371276 1363550 1348769 1327842 1301649 1271359
61242A271359l2481l2478l0893k8574k5950k3326k1097j9177j6755j3279r454
$$ 1271359 1238878 1206400 1175507 1146933 1120983 1097657 1076560 1057383 1040628 1027349 1017895
61231A017895o585n016l731j647J084L261M042L922M081M915N614N373M541M031
$$ 1017895 1011310 1006294 1002563 1000916 1002000 1005261 1009303 1013225 1017306 1022221 1027835 1033208 1037749 1041780
61217A041780L984L717K793J466K6j450k597k666j376P40L029N335P652R744J1507
$$ 1041780 1045764 1049481 1052274 1053740 1053766 1052316 1049719 1047053 1045677 1046417 1049446 1054781 1062433 1072177 1083684
61202A083684J3266J5275J7237J8703J9702K0705K2135K4135K6608K9168L1291
$$ 1083684 1096950 1112225 1129462 1148165 1167867 1188572 1210707 1234842 1261450 1290618 1321909
61191A321909L2681L3456L3920L4380L5053L5811L5914L4322L0552K5032J8671
$$ 1321909 1354590 1388046 1421966 1456346 1491399 1527210 1563124 1597446 1627998 1653030 1671701
61180A671701J2383O972K943J96j898m033o653r875j3366j6522j9182k2097k6081
$$ 1671701 1684084 1691056 1693999 1694195 1692297 1688264 1681611 1671736 1658370 1641848 1622666 1600569 1574488
61167A574488l0850l5214l8328m0162m0865m0461l9177l7360l4981l1886k8573
$$ 1574488 1543638 1508424 1470096 1429934 1389069 1348608 1309431 1272071 1237090 1205204 1176631
61156A176631k5845k3630k1072j7967j5148j3130j1347r209o961m955k903n58
$$ 1176631 1150786 1127156 1106084 1088117 1072969 1059839 1048492 1039283 1032322 1027367 1024464 1023906
61144A023906J704L672N933Q796J1186J1656J0172Q049O282M879L727L335M397
$$ 1023906 1025610 1029282 1035215 1044011 1055197 1066853 1077025 1085074 1091356 1096235 1099962 1103297 1107694
61131A107694P038J0661J4411J7865K1301K5145K9161L2553L4939L6761L8611
$$ 1107694 1114732 1125393 1139804 1157669 1178970 1204115 1233276 1265829 1300768 1337529 1376140
61120A376140M0677M2905M5051M6341M5897M3900M1619L9748L7428L3587K8567
$$ 1376140 1416817 1459722 1504773 1551114 1597011 1640911 1682530 1722278 1759706 1793293 1821860
61109A821860K3664J9488J5576J1326O646J745l108p712j2118j6529k0833k4622
$$ 1821860 1845524 1865012 1880588 1891914 1898560 1900305 1897197 1889485 1877367 1860838 1840005 1815383
61097A815383k7828l0900l4102l7276m0437m3813m6966m8827m9028m8422m7653
$$ 1815383 1787555 1756655 1722553 1685277 1644840 1601027 1554061 1505234 1456206 1407784 1360131
61086A360131m6192m3569m0450l7631l4781l1430k8299k6355k5071k3046j9936
$$ 1360131 1313939 1270370 1229920 1192289 1157508 1126078 1097779 1071424 1046353 1023307 1003371
61075A003371j6521j3208r875o973n368m914m457l381k123j060K8J285K540L867
$$ 1003371 986850 973642 963767 956794 951426 946512 942055 938674 936551 935491 935519 936804 939344 943211
61061I43211N437O786P246P254Q182J0611J3660J6265J8276K0036K1752K3618
$$ 943211 948648 955434 962680 969934 978116 988727 1002387 1018652 1036928 1056964 1078716 1102334
61049A102334K5779K7905K9434L0467L1656L3122L4213L4531L4397L4034L3137
$$ 1102334 1128113 1156018 1185452 1215919 1247575 1280697 1314910 1349441 1383838 1417872 1451009
61038A451009L1581K9793K8094K6229K3946K1441J8997J6645J4405J2417J0676
$$ 1451009 1482590 1512383 1540477 1566706 1590652 1612093 1631090 1647735 1662140 1674557 1685233
61027A685233R097P796O827N868M837M591O103R095J2460J5902K0097K5227L0597
$$ 1685233 1694330 1702126 1708953 1714821 1719658 1724249 1730352 1739447 1751907 1767809 1787906 1813133 1843730
61014A843730L5798M1009M6032N0430N4927O1315P0342Q1024R2555J05575J20695
$$ 1843730 1879528 1920537 1966569 2016999 2071926 2133241 2203583 2284607 2377162 2482737 2603432
61003B603432J37032J53187J68924J85361K04719K30555K66815L15760L77859
$$ 2603432 2740464 2893651 3062575 3247936 3452655 3683210 3950025 4265785 4643644
60994D643644M54244N47713O60951P96731R61898J168729J429314J748822K121759
$$ 4643644 5097888 5645601 6306552 7103283 8065181 9233910 10663224 12412046 14533805
60985A4533805K522357K884164L091612L017766K603020J914978J130959M52086
$$ 14533805 17056162 19940326 23031938 26049704 28652724 30567702 31698661 32150747
60977C2150747J7951j24393p975K68011N45552O41194M20933j25604q74885j636874
$$ 32150747 32168698 32044305 32036330 32304341 32849893 33491087 33912020 33786416 32911531 31274657
60967C1274657k247815k624879k764831k713127k533237k286055k017807j756264
$$ 31274657 29026842 26401963 23637132 20924005 18390768 16104713 14086906 12330642
60959A2330642j514441j296861j103855r34167p87004o62522n60255m77940m12335
$$ 12330642 10816201 9519340 8415485 7481318 6694314 6031792 5471537 4993597 4581262
60950D581262l60263l18469k83633k53542k27657k05751j86651j68885j51893
$$ 4581262 4220999 3902530 3618897 3365355 3137698 2931947 2745296 2576411 2424518
60941B424518j35710j20271j05943r4178q6334q1928p8965p5938p2673o9345o5635
$$ 2424518 2288808 2168537 2062594 1968416 1882082 1800154 1721189 1645251 1572578 1503233 1437598
60930A437598o1155n6000n0510m4952l9635l4984l1223k8178k5465k2710j9627
$$ 1437598 1376443 1320443 1269933 1224981 1185346 1150362 1119139 1090961 1065496 1042786 1023159
60919A023159j6227j2941j0241q096o069l956j946j85J343K417K486J417k3p45
$$ 1023159 1006932 993991 983750 975654 969585 965629 963683 963498 964841 967258 969744 971161 971138 970393
60905I70393n16k36r72k828m899o259o855p344q220r308j0090j0235r798r151
$$ 970393 969877 969641 968669 965841 960942 954683 947828 940484 932264 922956 912866 902631 892833 883682
60891H83682q873r353j0305j0852j0441r530r049r315r735r533q479o997n844
$$ 883682 874809 865456 855151 844299 833858 824328 815279 805964 796229 786696 778217 771220 765376
60878G65376n670o476p437p517o362m562l060k437k571k727k112p27N43R48Q62
$$ 765376 759706 753230 745793 738276 731914 727352 724292 721855 719284 716557 714445 713718 714261 715209 716071
60863G16071J314K646M263N600O745P919R028R945J0730J1275J1316J1056J1201
$$ 716071 717385 720031 724294 729894 736639 744558 753586 763531 774261 785536 796852 807908 819109
60850H19109J1993J2752J2785J2208J1355J0048Q189O560O128O720P202O845N754
$$ 819109 831102 843854 856639 868847 880202 890250 898439 904999 911127 917847 925049 931894 937648
60837I37648M052J593j392m144o113p366q075q190p756p085o481o174o500p512
$$ 937648 941700 943293 941901 937757 931644 924278 916203 908013 900257 893172 886691 880517 874017 866505
60823H66505q523q720q255q069q543r135r476r901j0545j0891j0628j0212r984
$$ 866505 857982 849262 841007 832938 824395 815260 805784 795883 785338 774447 763819 753607 743623
60810G43623r529q516p397o561n607m237l158l078l411l081k133j448j161n96
$$ 743623 734094 725578 718181 711620 706013 701776 698618 695540 692129 689048 686915 685467 684306 683710
60796F83710L80J159J552K043K665K813K469K547L572M890N729O230O833P342
$$ 683710 684090 685249 686801 688844 691509 694322 696791 699338 702910 707800 713529 719759 726592 733934
60782G33934P325O956O842P213P826Q406Q749Q674Q252P894P872P988P947P804
$$ 733934 741259 748215 755057 762270 770096 778502 787251 795925 804177 812071 819943 827931 835878 843682
60768H43682P724P650P569P704Q085Q217P726P054O950P337P312O333M900L856
$$ 843682 851406 859056 866625 874329 882414 890631 898357 905411 912361 919698 927010 933343 938243 942099
60754I42099L428L275L169L191L307L172K566J833J547J737J773J141O8q82j583
$$ 942099 945527 948802 951971 955162 958469 961641 964207 966040 967587 969324 971097 972238 972306 971424 969841
60739I69841k351l202l543k782r99J135K932M158N015N830O748P789R134J1077
$$ 969841 967490 964288 960745 957963 956964 958099 961031 965189 970204 976034 982782 990571 999705 1010782
60725A010782J3512J5749J7205J8094J8995J9962K0561K0709K0854K1230K1474
$$ 1010782 1024294 1040043 1057248 1075342 1094337 1114299 1134860 1155569 1176423 1197653 1219127
60714A219127K1184K0446J9554J8606J7563J6328J4629J2177R176O269L758J274
$$ 1219127 1240311 1260757 1280311 1298917 1316480 1332808 1347437 1359614 1368790 1375059 1378817 1380091
60702A380091j592m760q005j1332j4616j7298j9001k0150k1501k3135k4430k4912
$$ 1380091 1378499 1373739 1365734 1354402 1339786 1322488 1303487 1283337 1261836 1238701 1214271 1189359
60690A189359k4773k4534k4512k4628k4514k3820k2608k1361k0460j9854j9361
$$ 1189359 1164586 1140052 1115540 1090912 1066398 1042578 1019970 998609 978149 958295 938934
60679I38934j8973j8614j7886j6505j4825j3453j2466j1455j0302r418r045q781
$$ 938934 919961 901347 883461 866956 852131 838678 826212 814757 804455 795037 785992 777211
60667G77211q124p145o330n847n376m625l766l169k843k480j965j563j444j298
$$ 777211 769087 761942 755612 749765 744389 739764 735998 732829 729986 727506 725541 723978 722534 721236
60653G21236p47R4Q65J612K738M257N557O073N765M848L565K423K095K682L475
$$ 721236 720489 720583 721448 723060 725798 730055 735612 741685 747450 752298 755863 758286 760381 763063 766538
60638G66538L880M227N110O232O617N866M634L798L588L631L441K707J443Pj174
$$ 766538 770418 774645 779755 785987 792604 798470 803104 806902 810490 814121 817562 820269 821712 821719 820545
60623H20545j963k443k669k768l162m203n539o383o533o703p479q413q599p956
$$ 820545 818582 816139 813470 810702 807540 803337 797798 791415 784882 778179 770700 762287 753688 745732
60609G45732p364p499q083q452q489q502q422p719o291m934m501m808m869m205
$$ 745732 738368 730869 722786 714334 705845 697343 688921 681202 674911 669977 665476 660668 655799 651594
60595F51594l426l280l636l744l264k522j886j338q33o25r49j560j847j475o82
$$ 651594 648168 644888 641252 637508 634244 631722 629836 628498 627665 627040 626091 624531 622684 621209 620527
60580F20527M9M85P15R11J173J563K057K430K390J990J732K098L036M099M971
$$ 620527 620576 621061 621776 622687 623860 625423 627480 629910 632300 634290 636022 638120 641156 645255 650226
60565F50226N699O447P319Q423R883J1651J3377J4520J4630J3695J2237J0834
$$ 650226 655925 662372 669691 678114 687997 699648 713025 727545 742175 755870 768107 778941
60553G78941R408P346M492J584o76k561m637o516p220o680n897n367m338k173
$$ 778941 788349 795695 800187 801771 801095 798534 793897 787381 780161 773481 767584 762217 757879 755706
60539G55706M30K279L241M157N531P070Q431R825J1660J3857J5556J5551J3321
$$ 755706 756136 758415 761656 765813 771344 778414 786845 796670 808330 822187 837743 853294 866615
60526H66615R704O118L000k94l837o237o297m797l598l272k833j702o44l85m31
$$ 866615 876319 882437 885437 885143 881306 875069 868772 863975 860377 857105 854272 852570 851926 851541 851110
60511H51110O3J008J732K188K998M491O237P570Q094P741O750N757N496O251P687
$$ 851110 851173 852181 853913 856101 859099 863590 869827 877397 885491 893232 899982 905739 911235 917486 925173
60496I25173R394J1509J4613J9081K4654L0674L6611M2199M7182N1080N3251N2996
$$ 925173 934567 946076 960689 979770 1004424 1035098 1071709 1113908 1161090 1212170 1265421 1318417
60484A318417M9666M3024L3551K2154R422m449j8793l1932m2082m8712n2594n4531
$$ 1318417 1368083 1411107 1444658 1466812 1476234 1471785 1452992 1421060 1378978 1330266 1277672 1223141
60472A223141n4508n2232m8120m3332l8892l4959l1081k7056k3423k0896j9426
$$ 1223141 1168633 1116401 1068281 1024949 986057 951098 920017 892961 869538 848642 829216
60461H29216j8123j6225j3872j1730j0210r294q851q668q294p423o355n650n354
$$ 829216 811093 794868 780996 769266 759056 749762 740911 732243 723949 716526 710171 704521 699167
60448F99167n018m484m153m287m557m581m443m355m139l547k846k591k846l058
$$ 699167 694149 689665 685512 681225 676668 672087 667644 663289 659150 655603 652757 650166 647320 644262
60434F44262k857k493k356k315j893r53P6O55O15J54m51j031j497j762j683j153
$$ 644262 641405 638912 636556 634241 632348 631395 631471 632126 632741 632895 632444 631413 629916 628154 626471 625318
60418F25318l18M36Q16R82J334J910K286K215J988J926J766J054K0m60O8J072
$$ 625318 625000 625436 626252 627234 628568 630478 632764 634979 636967 638893 640659 641713 641733 641273 641341 642413
60402F42413J667J545J021N11K47L66R32J739K242J936R03kJ96J609L250M001
$$ 642413 644080 645625 646646 647157 647404 647770 648702 650441 652683 654619 655522 655520 655716 657325 660575 664576
60386F64576L634K684J612N26m28r32q80n08l6M87R90J370J600J624J188K67m93
$$ 664576 668210 670894 672506 673032 672604 671672 670792 670284 670248 670735 671725 673095 674695 676319 677507 677774 677281
60369F77281l60M64J053R96Q01Q82R78P87N24M72O09J020J949L066L450K839K260
$$ 677281 676921 677385 678438 679434 680235 681117 682095 682882 683406 683878 684487 685507 687456 690522 693972 696811 699071
60352F99071K681L678M169L989L914M412N126N486N245M582M138M615N928P103
$$ 699071 701752 705430 709599 713588 717502 721914 727040 732526 737771 742353 746491 751106 757034 764137
60338G64137P534P726Q172Q111O436L436N65j308k503l475m231m819n437n885
$$ 764137 771671 779397 787569 795680 802116 805552 806117 804809 802306 798831 794600 789781 784344 778459
60324G78459n703m940m136l420k476j371o22k73K17J018J706K198K949L919M321
$$ 778459 772756 767816 763680 760260 757784 756413 755791 755518 755735 756753 758459 760657 763606 767525 771846
60309G71846L986M052N499P687R273J0102J1344J3973J7887K2428K6951L0695
$$ 771846 775832 779884 785383 793070 802343 812445 823789 837762 855649 878077 905028 935723
60297I35723L2730L2448L0010K6060K1054J4947P585o86q817j5594k0300k2886
$$ 935723 968453 1000901 1030911 1056971 1078025 1092972 1100557 1099871 1091054 1075460 1055160 1032274
60285A032274k3698k3246k1973j9977j7122j3803j1269j0627j1502j2299j1924
$$ 1032274 1008576 985330 963357 943380 926258 912455 901186 890559 879057 866758 854834
60274H54834j0685r452q557p898p570p748q068p704o276m416l265l341m003m126
$$ 854834 844149 834697 826140 818242 810672 802924 794856 787152 780876 776460 773195 769854 765851 761725
60260G61725l242j852o31K63R32J231R88M27j3j11J92R57J946K489K284J947K073
$$ 761725 758483 756631 756000 756263 757195 758426 759414 759841 759828 759717 759909 760866 762812 765301 767585 769532 771605
60243G71605K121J151n17j472j142m82m46p59p19k68L42J269K594L637L559K483
$$ 771605 773726 774877 774360 772888 771746 771264 770818 770059 769340 769072 769414 770683 773277 776914 780473 782956
60227G82956J336P51O64R01J528K483L255L253K439J486J211J800K688L263L478
$$ 782956 784292 785043 785707 786608 788136 790619 793874 797127 799566 801052 802263 804063 806751 810014 813492
60212H13492L596L550L082K394K112K458K903K868K398K018K047K183J742L60
$$ 813492 817088 820638 823720 826114 828226 830684 833587 836455 838853 840871 842918 845101 846843 847203
60198H47203j399k454k447k177k407k756k458j739j398j383r18l8L11j07k69M50
$$ 847203 845804 843350 840903 838726 836319 833563 831105 829366 827968 826585 825667 825629 825940 825833 825564 826014
60182H26014J276J304Q14N03K47m22j151j052R7J660K913L520L530L437L940N128
$$ 826014 827290 828594 829408 829911 830158 829736 828585 827533 827630 829290 832203 835723 839253 842690 846630 851758
60166H51758O208O398N779M812L619K236J125O80O37N82O55J127J556J272M90
$$ 851758 857966 864364 870143 874955 878574 880810 881935 882615 883252 883834 884489 885616 887172 888444 888934
60151H88934J16N45J361K228L257M376N046M920M352L955L960M205M437M501M468
$$ 888934 889050 889595 890956 893184 896441 900817 905863 910783 915135 919090 923050 927255 931692 936193 940661
60136I40661M682N551P133R111J1109J2811J3762J3332J1216P887M330J149j917
$$ 940661 945343 950894 958027 967138 978247 991058 1004820 1018152 1029368 1037255 1041585 1042734 1040817
60123A040817n316q590j0509j0546r689r135q646p214n149m244n425p333q028
$$ 1040817 1035501 1026911 1016402 1005856 996167 987032 978386 971172 966023 961779 956354 949021 940993
60110I40993p314o543o597p065p187o743n957n110m359l560k304m63J420K689
$$ 940993 933679 927136 920539 913474 906287 899544 893587 888477 884118 880558 878254 877791 879211 881900
60096H81900L386M112N108N943O166N984O069O853Q130R368J0381J1478J2853
$$ 881900 885286 889398 894506 900449 906615 912599 918668 925521 933651 943019 953400 964878 977731
60083I77731J4118J4817J5095J5308J5059J3362R936N611J204l310q182j3082
$$ 977731 991849 1006666 1021761 1037069 1052128 1065490 1075426 1081037 1082241 1078931 1070749 1057667
60071A057667j7281k0196k1418k0839j9127j7427j6213j4974j3334j1766j0696
$$ 1057667 1040386 1020190 998772 977933 958806 941379 925166 910192 896858 885092 874396
60060H74396r692q268o828o047n826n619n324n149n000m772m719m870m508l081
$$ 874396 864704 856436 849608 843561 837735 832116 826792 821643 816643 811871 807152 802282 797774 794693
60046G94693j220O1P63J573K463K730K203J429O43m59j875l063l701m004m215
$$ 794693 793473 793534 794297 795870 798333 801063 803266 804695 805338 804879 803004 799941 796240 792236 788021
60031G88021m377m625n092n581n892o305p086p772p778p481p771q577q864q141
$$ 788021 783644 779019 773927 768346 762454 756149 749063 741291 733513 726032 718261 709684 700820 692679
60017F92679p011o076n248m398l762l361k816k086j595j342o93M55J141O27m26
$$ 692679 685668 679592 674344 669946 666184 662823 660007 657921 656326 654984 654291 654746 655887 656514 656088
60002F56088q05k71M86J029J534K082K328K122J925K305L169L796L694L271L373
$$ 656088 655283 655012 655498 656527 658061 660143 662471 664593 666518 668823 671992 675788 679482 682753 686126
59987F86126M235N139N276M582L516K333J004l62j536k450l082l175k494j313
$$ 686126 690361 695500 700776 705358 708874 711207 712211 711849 710313 707863 704781 701606 699112 697799
59973F97799k21M23N46J44n51q99m28N61J412J941K290K316J913J677K292L298
$$ 697799 697578 698001 698547 698691 698140 697241 696813 697374 698786 700727 703017 705333 707246 708923 711215 714513
59957G14513L405K233P99mn02j366k404k968l007l013l131l006k523k199k617
$$ 714513 717918 720151 720950 720946 720444 719078 716674 713706 710699 707686 704555 701549 699026 696827 694210
59942F94210l611m322m174l626l608m184m353l424k013j132r04q08p45r83j269
$$ 694210 690599 686277 682103 678477 674869 670685 666332 662908 660895 659763 658859 658051 657306 656323 655054
59927F55054j005j79O72J419K335L211L417K938K490K426K451K480K868L542L943
$$ 655054 654049 653870 654542 655961 658296 661507 664924 667862 670352 672778 675229 677709 680577 684119 688062
59912F88062M095M658N538N601M377L031K791L307L445K994K507K141J725J574
$$ 688062 692157 696815 702353 707954 712331 715362 718153 721460 724905 727899 730406 732547 734272 735846
59898G35846K085K696K392J319Q87J965L834N261N960O433O891P006O685O489
$$ 735846 737931 740627 743019 744338 745225 747190 751024 756285 762245 768678 775569 782575 789260 795749
59884G95749P040Q191R121R235Q720Q183P899P591O758N038K462l98k728m193
$$ 795749 802789 810980 820101 829336 838056 846239 854138 861729 868487 873525 875987 875589 872861 868668
59870H68668n234o360p511q418r234j0146j0652j0048q553p219o587o227n676
$$ 868668 863434 857074 849563 841145 831911 821765 811113 801065 792512 785293 778706 772479 766803
59857G66803n111m735m253l319k027o79N30J374J676J749K224L185M037M435M733
$$ 766803 761692 756957 752704 749385 747358 746679 747209 748583 750259 752008 754232 757417 761454 765889 770622
59842G70622N192N465N372N514O553Q365J0476J2926J5908J8786K0134J8929J5425
$$ 770622 775814 781279 786651 792165 798718 807083 817559 830485 846393 865179 885313 904242 919667
59829I19667J0942O942M199K564J503P09q0j634m827r494j4238j7731j9714k0507
$$ 919667 930609 937551 941750 944314 945817 946526 946446 944812 939985 930491 916253 898522 878808 858301
59815H58301k0215j8922j7187j5611j4164j2431j0393q500p059n890m525k611
$$ 858301 838086 819164 801977 786366 772202 759771 749378 740878 733819 727929 723404 720793
59803G20793l05J644K407J855N49j016k706m268n139n090m541l943l260k407j688
$$ 720793 720488 722132 724539 726394 726943 725927 723221 718953 713814 708724 704183 700240 696980 694573 692885
59788F92885j396j348j263j209j317j362j070n41rN48J187J724J986K087K160
$$ 692885 691489 690141 688878 687669 686352 684990 683920 683379 683370 683918 685105 686829 688815 690902 693062
59773F93062K076J761J451J354J338J292J379J717K129K524L085L749M010L688
$$ 693062 695138 696899 698350 699704 701042 702334 703713 705430 707559 710083 713168 716917 720927 724615
59759G24615L426L874M732N198N089M945N167N549N629N141M206L436L586M659
$$ 724615 728041 731915 736647 741845 746934 751879 757046 762595 768224 773365 777571 781007 784593 789252
59745G89252N562N057L081Q04n35o50j54K09K19J68K33O0o74j509j579q34k54
$$ 789252 794814 799871 802952 803756 803221 802571 802417 802626 802845 803013 803246 803306 802632 801123 799544 798710 798456
59728G98456o03j499k011j706p93K92J044J107P13N81J065J806K360K749L056
$$ 798456 797853 796354 794343 792637 791844 792136 793180 794287 795000 795581 796646 798452 800812 803561 806617
59713H06617L088K739K265J828J281P33P18J412K224K630K823L079L086K506J630
$$ 806617 809705 812444 814709 816537 817818 818551 819269 820681 822905 825535 828358 831437 834523 837029 838659
59698H38659R44N32M46J031K245L139K794J330n32k427m138n093m866l876k781
$$ 838659 839603 840135 840581 841612 843857 846996 849790 851120 850588 848161 844023 838930 834064 830188 827407
59683H27407j627l29M82J05r49j360o28M46R11N32m42j701l020m340n730o914
$$ 827407 825780 825451 825933 826038 825089 823729 823101 823547 824458 824990 824548 822847 819827 815487 809757 802843
59667H02843p308o865o453o730p179o952o137n391m764l913k985k272j317M14
$$ 802843 795535 788670 782217 775487 768308 761356 755219 749828 745064 741151 738166 735894 734577 734991
59653G34991K222K803K248K109L197M532M825L995K670J180l56j635k497l174
$$ 734991 737213 740016 742264 744373 747570 752102 756927 760922 763592 764772 764416 762781 760284 757110
59639G57110l686l497k217l74J039J559J553J602J875K046J762J170Q04Q35Q09
$$ 757110 753424 749927 747710 747336 748375 749934 751487 753089 754964 757010 758772 759942 760746 761581 762390
59624G62390M30J94P39J862K749K963K633J913Q79j42q16j241j609j614q96J47
$$ 762390 762820 763014 763753 765615 768364 771327 773960 775873 776752 776610 775794 774553 772944 771330 770434 770581
59608G70581Q60J381K331L495L880L196K264J674J040N9p15p20l58l79p67r25
$$ 770581 771441 772822 775153 778648 782528 785724 787988 789662 790702 790761 790046 789326 788968 788589 787822 786897
59592G86897o28k18k6r5m19r91j562j624q42M85J496J489N89m64j295k234l547
$$ 786897 786269 786051 786025 785930 785511 784520 782958 781334 780492 780977 782473 783962 784551 784087 782792 780558 777011
59575G77011m748n209m989m573m085l361k562k010j544p11M47J416J931K138K152
$$ 777011 772263 767054 762065 757492 753407 750046 747484 745474 743930 743219 743666 745082 747013 749151 751303
59560G51303K017K000K300K583K434K042J779J361L36p88r43o4P59Q74Q12J231
$$ 751303 753320 755320 757620 760203 762637 764679 766458 767819 768155 767367 766424 766360 767119 767993 768805 770036
59544G70036K030K909M026N624P611R848J2334J4926J7436J9974K2440K3601K1846
$$ 770036 772066 774975 779001 784625 792236 802084 814418 829344 846780 866754 889194 912795 934641
59531I34641J7324J2486R824R704J0874J2316J3759J4959J5346J4407J2008Q494
$$ 934641 951965 964451 974275 983979 994853 1007169 1020928 1035887 1051233 1065640 1077648 1086142
59519A086142M660J279j672m937q909j2928j5945j7551j8115j8189j8056j7617
$$ 1086142 1090802 1092081 1090409 1085472 1076563 1063635 1047690 1030139 1012024 993835 975779 958162
59507I58162j6587j4969j3267j1938j0760r211p337n604m104k632j581j689k717
$$ 958162 941575 926606 913339 901401 890641 881430 874093 868489 864385 861753 860172 858483 855766
59494H55766l359k880k022j746j869j532m37J014K352L357M125N147O895R025
$$ 855766 852407 849527 847505 845759 843890 842358 841921 842935 845287 848644 852769 857916 864811 873836
59480H73836J0663J1721J3201J5631J8016J9060J8793J8066J6916J4432J0196
$$ 873836 884499 896220 909421 925052 943068 962128 980921 998987 1015903 1030335 1040531
59469A040531N000R0l684n889o325n167l018m55K519O429J1538J7120K1828K5069
$$ 1040531 1045531 1045621 1041937 1036048 1029723 1024556 1021538 1021083 1023602 1030031 1041569 1058689 1080517 1105586
59455A105586K7548L0010L1850L1848L0151K8411K7786K7733K7023K4894K0695
$$ 1105586 1133134 1163144 1194994 1226842 1256993 1285404 1313190 1340923 1367946 1392840 1413535
59444A413535J3537L342q282j9034k7551l3513l6769l7260l5528l2537k9027k5501
$$ 1413535 1427072 1430414 1422132 1403098 1375547 1342034 1305265 1268005 1232477 1199940 1170913 1145412
59432A145412k2539k0509j9004j7128j4396j0986p255l335Q35N350J0132J4739
$$ 1145412 1122873 1102364 1083360 1066232 1051836 1040850 1033595 1030260 1031095 1036445 1046577 1061316
59420A061316J8598K1500K3605K4859K4841K3490K1590K0169J9506J8698J5878
$$ 1061316 1079914 1101414 1125019 1149878 1174719 1198209 1219799 1239968 1259474 1278172 1294050
59409A294050R067k240j5840k7739l4905l6890l4879l0016k3183j5514q190k142
$$ 1294050 1303117 1300877 1285037 1257298 1222393 1185503 1150624 1120608 1097425 1081911 1073721 1071579
59397A071579J458R62m472j3350k2319k8360l0382k9184k6432k3494k0729j7767
$$ 1071579 1073037 1073999 1069527 1056177 1033858 1005498 975116 945932 919500 896006 875277 857510
59385H57510j4544j1629r372p329n045k918j621j045n32J70P20Q45N75J3n97p91
$$ 857510 842966 831337 821965 814636 809591 806673 805052 804007 803475 803645 804365 805210 805785 805798 805201 804410
59369H04410l76J85L93N30J273K675M131N274O342P697R488J1753J4346J6854
$$ 804410 804034 804219 804612 805142 806415 809090 813221 818495 824837 832534 842022 853775 868121 884975
59355H84975J8983K1114K3891K7297L0533L2893L4338L5195L5646L5598L4787
$$ 884975 903958 925072 948963 976260 1006793 1039686 1074024 1109219 1144865 1180463 1215250
59344A215250L2893K9776K5569K0453J4403P430p0p435j4207k0227k5427k9759
$$ 1215250 1248143 1277919 1303488 1323941 1338344 1345774 1345704 1338269 1324062 1303835 1278408 1248649
59332A248649l3274l5962l7517l7548l6040l3514l0643k7763k4715k1257j7622
$$ 1248649 1215375 1179413 1141896 1104348 1068308 1034794 1004151 976388 951673 930416 912794
59321I12794j4582j2652j1401r957q122o513n546m853l913k726j570n75J38L24
$$ 912794 898212 885560 874159 864202 856080 849567 844021 839168 835255 832529 830959 830384 830522 830846
59307H30846J7k68j22K20L56L98P58J469K100K395K652L400M773O266P214P595
$$ 830846 830863 830595 830473 830693 831049 831447 832205 833674 835774 838169 840821 844221 848994 855260 862474 870069
59291H70069Q175R637J1847J4366J7345K1217K5608K9191L0559K8755K3424J5474
$$ 870069 878244 887881 899728 914094 931439 952656 978264 1007455 1038014 1066769 1090193 1105667
59279A105667P428J867o29j127q6L065P889J2240J4465J5003J4918J4138J2227
$$ 1105667 1113095 1114962 1114333 1113206 1113120 1116185 1124074 1136314 1150779 1165782 1180700 1194838 1207065
59266A207065R618O747K908k569q647j3550j6889j9513k1694k2916k3234k3468
$$ 1207065 1216683 1223430 1226338 1223769 1215122 1201572 1184683 1165170 1143476 1120560 1097326 1073858
59254A073858k3975k4279k3958k2896k0792j7420j3376r677o639l928j473O06
$$ 1073858 1049883 1025604 1001646 978750 957958 940538 927162 917485 910846 906918 905445 906051
59242I06051K807N800R248J2085J4027J5675J7020J7009J4978J1570P797L980
$$ 906051 908858 914658 923906 935991 950018 965693 982713 999722 1014700 1026270 1034067 1038047
59230A038047J7m022q033j2029j5752j8626k0392k1355k1735k1313j9968j8072
$$ 1038047 1038064 1034042 1026009 1013980 998228 979602 959210 937855 916120 894807 874839 856767
59218H56767j6014j3783j1385r325q147p637o874n162k832j012n60j210j955k141
$$ 856767 840753 826970 815585 806260 798113 790476 783602 778440 775608 774596 774036 772826 770871 768730
59204G68730j937j676j267n59K11P08R69J219J500J778K112K446K635K876L568
$$ 768730 766793 765117 763850 763291 763502 764210 765179 766398 767898 769676 771788 774234 776869 779745 783313
59189G83313M497M919M817N252O715Q025P884O855O580P511Q639R296R856J0663
$$ 783313 787810 792729 797546 802798 809513 817538 825422 832277 838857 846368 855007 864303 874159 884822
59175H84822J1427J1988J2785J4190J6004J7850J9470K0612K1167K1420K1569
$$ 884822 896249 908237 921022 935212 951216 969066 988536 1009148 1030315 1051735 1073304
59164A073304K1092J9225J5965J2037P911L565r49n393r696j3699j6735j8225
$$ 1073304 1094396 1113621 1129586 1141623 1149534 1153099 1152150 1146757 1137061 1123362 1106627 1088402
59152A088402j8675j9150j9876k0197j9846j9217j8340j6649j4167j1957j0941
$$ 1088402 1069727 1050577 1030701 1010504 990658 971441 953101 936452 922285 910328 899387
59141H99387j0904j0977j0505r165p062n074m370n025n628m757k512j63J409K443
$$ 899387 888483 877506 867001 857836 850774 845700 841330 836305 830677 825920 823408 823245 824654 827097
59127H27097L713N509P321Q370Q561Q713R748J1796J4375J7146K0023K2685K4521
$$ 827097 830810 836319 843640 852010 860571 869284 879032 890828 905203 922349 942372 965057 989578
59114I89578K5271K5365K5522K6065K6575K6238K4735K2818K1504K0717J9380
$$ 989578 1014849 1040214 1065736 1091801 1118376 1144614 1169349 1192167 1213671 1234388 1253768
59103A253768J7007J4292J1682Q371L623j707n981q538r749r857q955p654o667
$$ 1253768 1270775 1285067 1296749 1305120 1308743 1307036 1301055 1292517 1282768 1272911 1263956 1256302 1249635
59090A249635n913n015m361m726o095p907j0100j2858j5635j7632j8939k0078
$$ 1249635 1243722 1238707 1234346 1229620 1223525 1215618 1205518 1192660 1177025 1159393 1140454 1120376
59078A120376k0713k0068j8487j7194j6541j5753j4445j3103j2050j1159j0555
$$ 1120376 1099663 1079595 1061108 1043914 1027373 1011620 997175 984072 972022 960863 950308
59067I50308j0386r959q454o446n278m919m109k742k316l516n073n727n771n794
$$ 950308 939922 929963 921509 915063 909785 904866 900757 898015 895699 892183 887110 881383 875612 869818
59053H69818n434m358l295k963k962k607k048j644j156l92J07ok4R10K509L739
$$ 869818 864384 860026 856731 853768 850806 848199 846151 844507 843351 842959 843066 843060 843036 843946 846455 850194
59037H50194M140M147M514N813Q073J0600J2592J4138J5997J8331K0438K1861
$$ 850194 854334 858481 862995 868808 876881 887481 900073 914211 930208 948539 968977 990838
59025I90838K2892K3759K4259K4402K4368K3585K0956J6533J1831P970M562J084
$$ 990838 1013730 1037489 1061748 1086150 1110518 1134103 1155059 1171592 1183423 1191393 1195955 1197039
59013A197039j849l352l603l446l321l132k579j117J650N153Q185J0323J2176
$$ 1197039 1195190 1191838 1188235 1184789 1181468 1178336 1175757 1174640 1176290 1181443 1189628 1199951 1212127
59000A212127J4016J5245J5567J5380J4675J2834J0062P621N934L825L76l863
$$ 1212127 1226143 1241388 1256955 1272335 1287010 1299844 1309906 1317527 1323461 1327286 1327662 1323799
58988A323799q378j3652j9473k3860k5312k4856k4242k3265k0718j7102j4255
$$ 1323799 1315421 1301769 1282296 1258436 1233124 1208268 1184026 1160761 1140043 1122941 1108686
58977A108686j2657j1004q371n222k262L90K711M683O793R707J3317J6907K0104
$$ 1108686 1096029 1085025 1076654 1071432 1069170 1069560 1072271 1076954 1083747 1093454 1106771 1123678 1143782
58964A143782K2942K5190K6399K6438K5186K2085J6770R944K759m377j1623j8618
$$ 1143782 1166724 1191914 1218313 1244751 1269937 1292022 1308792 1318736 1321495 1317118 1305495 1286877
58952A286877k4454k8554l0898l1609l0932k9349k7016k3495j8690j3518q912
$$ 1286877 1262423 1233869 1202971 1171362 1140430 1111081 1084065 1060570 1041880 1028362 1019450
58941A019450m715n11L112N174N729N505M359J386l452q882j3619j7182j9402
$$ 1019450 1014735 1014224 1017336 1022510 1028239 1033744 1038103 1039489 1036037 1027155 1013536 996354 976952
58928I76952k0049j9297j7823j6182j4429j2412j0054p444m918k927j458j2J556
$$ 976952 956903 937606 919783 903601 889172 876760 866706 859262 854344 851417 849959 849947 851503
58915H51503K685L087L470M605O207P478Q318R177J0133J0932J1677J2683J3984
$$ 851503 854188 857275 860745 865350 871557 879035 887353 896530 906663 917595 929272 941955 955939
58902I55939J5620J7975K1092K4079K6007K6966K7530K7824K8031K9209L2274
$$ 955939 971559 989534 1010626 1034705 1060712 1087678 1115208 1143032 1171063 1200272 1232546
58891A232546L6487M0249M3163M6051M8941N0370M8947M4549L7750K9117J9452
$$ 1232546 1269033 1309282 1352445 1398496 1447437 1497807 1546754 1591303 1629053 1658170 1677622
58880A677622R816P42q133j7304k6649l5400m2498m6986m8643m8247m6675m3959
$$ 1677622 1687438 1688180 1680047 1662743 1636094 1600694 1558196 1511210 1462567 1414320 1367645 1323686
58868A323686l9806l4873l0650k7965k6299k4725k2957k1255j9860j8822j8086
$$ 1323686 1283880 1249007 1218357 1190392 1164093 1139368 1116411 1095156 1075296 1056474 1038388
58857A038388j7506j6912j6181j5119j3566j1826j0685j0650j1367j2121j2625
$$ 1038388 1020882 1003970 987789 972670 959104 947278 936593 925943 914576 902455 889830
58846H89830j2983j3191j3152j2908j2459j1638j0484r436q749q117p162n916
$$ 889830 876847 863656 850504 837596 825137 813499 803015 793579 784830 776713 769551 763635
58834G63635m442k588n53Q50J167J027J306J982K491K730L016L324L340L028K616
$$ 763635 759193 756605 756052 756902 758069 759096 760402 762384 764875 767605 770621 773945 777285 780313 782929
58819G82929K193J700J131L74o74j701k186k302k834l847m351l831l148l142l316
$$ 782929 785122 786822 787953 788327 787653 785952 783766 781464 778630 774783 770432 766601 763453 760311 756995
58804G56995k798j760q68j07P42J143N53l77n42M5M54L21J14L20J176K919N295
$$ 756995 754197 752437 751569 751462 752204 753347 753900 753523 752981 753026 753480 753801 753915 754235 755411 758330 763625
58787G63625P259Q021P942P714P326O709O540P171P546O598N167N009O244P260
$$ 763625 770884 778905 786847 794561 801887 808596 815136 822307 829853 836451 841618 846627 852871 860131
58773H60131O988N792M183K060n38l061n045o294o508n519l824k097m54J121K038
$$ 860131 867119 872911 877094 879154 878616 875555 870510 864216 857708 852189 848365 846268 845814 846935 848973
58758H48973J801R53M40M04N79J245K626L934M299M276N054O511P445P497P456
$$ 848973 850774 851727 852167 852571 853150 854395 857021 860955 865254 869530 874584 881095 888540 896037 903493
58743I03493P872Q594R559J0822J2016J2960J4468J7246K0358K2138K2425K2451
$$ 903493 911365 919959 929518 940340 952356 965316 979784 997030 1017388 1039526 1061951 1084402
58731A084402K2783K2786K1946K0238J7368J3186Q812N860M537L816L347L587
$$ 1084402 1107185 1129971 1151917 1172155 1189523 1202709 1211521 1217381 1221918 1225734 1229081 1232668
58719A232668M194M006K739J207l00k344m868o948q261r456j0879j2240j3684
$$ 1232668 1236862 1240868 1243607 1244814 1244514 1242170 1237302 1230354 1222093 1212637 1201758 1189518 1175834
58706A175834j5794j8437k0858k3028k5513k8055k9660l0023k9478k7793k4687
$$ 1175834 1160040 1141603 1120745 1097717 1072204 1044149 1014489 984466 954988 927195 902508
58695I02508k1321j9318j8270j6292j3136j0624r642q894p428o187o091o416o156
$$ 902508 881187 861869 843599 827307 814171 803547 793905 785011 777583 771396 765305 758889 752733
58682G52733n465m685l469j811n64L1R98K914M813N786O376P513R236J1395J4390
$$ 752733 747268 742583 739114 737303 736739 736770 737768 740682 745495 751281 757657 765170 774406 785801 800191
58667H00191J8222K1749K3869K4525K3831K1241J6453J0299L903k290q084j2865
$$ 800191 818413 840162 864031 888556 912387 933628 950081 960380 964283 961993 953909 941044
58655I41044j6052j7537j7391j5890j3980j2610j1468r514o925n067m330l495
$$ 941044 924992 907455 890064 874174 860194 847584 836116 826602 819677 814610 810280 806785
58643H06785j813p9J029K060L407M160L484J919L87j100k742l921l961l222k575
$$ 806785 804972 804893 805922 807982 811389 815549 819033 820952 821339 820239 817497 813576 809615 806393 803818
58628H03818k277j927r89R38L854P118J0042J2748J5692J8691K1411K4415K8218
$$ 803818 801541 799614 798625 799563 803417 810535 820577 833325 849017 867708 889119 913534 941752
58615I41752L1669L2937L1929K9868K6624K0794J2600M398k291q001j2949j5966
$$ 941752 973421 1006358 1038287 1068155 1094779 1115573 1128173 1132571 1130280 1122279 1109330 1093364
58603A093364j6769j6989j7556j7257j5271j3127j2443j2457j1483r363o842l994
$$ 1093364 1076595 1059606 1042050 1024793 1009522 996395 983952 971495 960012 950649 943807 939813
58591I39813p70K136M463P242J1052J4729J7076J8530J9744J9920J8190J5340
$$ 939813 939043 941179 945642 952884 963936 978665 995741 1014271 1034015 1053935 1072125 1087465
58579A087465J2572R639N831J831j004k312k253l95L405P913J1865J5613K0018
$$ 1087465 1100037 1109676 1115507 1117338 1116334 1114022 1111769 1111374 1114779 1122692 1134557 1150170 1170188
58566A170188K4552K7954L0011L1250L1532L0435K8351K5831K2381J7291J1219
$$ 1170188 1194740 1222694 1252705 1283955 1315487 1345922 1374273 1400104 1422485 1439776 1450995
58555A450995N721J453k085n513r102j2862j6288j8524j9484k0098k0976k1533
$$ 1450995 1456716 1458169 1456084 1450571 1441469 1428607 1412319 1393795 1374311 1354213 1333237 1311704
58543A311704k1126k0032j8742j7303j5979j5407j5406j4838j3369j2091j1661
$$ 1311704 1290578 1270546 1251804 1234501 1218522 1203115 1187709 1172871 1159502 1147411 1135750
58532A135750j1207r928q267o579m186q70K250M490O806R968J3084J5164J6701
$$ 1135750 1124543 1114615 1106348 1099769 1095583 1094713 1096963 1101453 1108259 1118227 1131311 1146475 1163176
58519A163176J8250J8997J8273J7089J6540J5921J4136J1773J0188R530R097Q639
$$ 1163176 1181426 1200423 1218696 1235785 1252325 1268246 1282382 1294155 1304343 1313873 1322970 1331609
58507A331609P879N841K172k007n753r679j4330j8605k1237k2604k3563k3831
$$ 1331609 1339488 1345329 1347501 1345494 1339741 1330062 1315732 1297127 1275890 1253286 1229723 1205892
58495A205892k3047k2068k1578k0666j8419j5737j3808j2080r404o031k794N11
$$ 1205892 1182845 1160777 1139199 1118533 1100114 1084377 1070569 1058489 1049085 1043054 1040260 1040771
58483A040771M296P855J0460J2531J4240J4318J1948Q391N070J469l269q226j2126
$$ 1040771 1045067 1052922 1063382 1075913 1090153 1104471 1116419 1124810 1129880 1131349 1128080 1119854 1107728
58470A107728j5374j8643k0912k1041j9980j9206j8293j6141j3328j0996q728
$$ 1107728 1092354 1073711 1052799 1031758 1011778 992572 974279 958138 944810 933814 925086
58459I25086n757k980j427p6K390M944N767N200M630L695J299j703l570m471n544
$$ 925086 919329 916349 914922 914846 917236 922180 927947 933147 937777 941472 942771 941068 937498 933027 927483
58444I27483o090m596j740L95J526K941M612N250M793M430M552M851N805P853
$$ 927483 921393 916797 915057 915452 916978 919919 924531 929781 934574 939004 943556 948407 954212 962065
58430I62065R852J0639J1260J3288J5943J7254J7106J6564J5380J2880J0256R065
$$ 962065 971917 982556 993816 1007104 1023047 1040301 1057407 1073971 1089351 1102231 1112487 1121552
58418A121552Q414O623M665M731O215O408M597K229m39m409q996j2195j3909j5747
$$ 1121552 1129966 1136589 1141254 1145985 1152200 1158608 1163205 1165434 1164995 1160586 1151590 1139395 1125486 1109739
58404A109739j7694j8075j6693j5044j3447j0910p849o002n673n711o060p565
$$ 1109739 1092045 1073970 1057277 1042233 1028786 1017876 1010027 1004025 998352 992641 986581 979016
58392I79016r554j0480j0659j1582j2889j2966j2028j1522j0930q553n144l251
$$ 979016 969462 958982 948323 936741 923852 910886 898858 887336 876406 867853 862709 859458
58380H59458l039k199m1J710K355L053M039M207L754M185N458O144O453P950J0272
$$ 859458 856419 854220 854179 855889 858244 861297 865336 869543 873297 877482 882940 889084 895537 903487 913759
58365I13759J1349J0990J1087J2118J2554J1819J0720R046N923K427N37l11k290
$$ 913759 925108 936098 947185 959303 971857 983676 994396 1003442 1009365 1011792 1012329 1012018 1009728
58352A009728n093o310n603m842m219k204P83K624L533N848R652J2615J4326J6674
$$ 1009728 1004635 998325 992722 987880 983661 981457 982240 984864 988397 994245 1003897 1016512 1030838 1047512
58338A047512J9596K0686J9406J7691J6016J3017R244O925N672K849j269l365
$$ 1047512 1067108 1087794 1107200 1124891 1140907 1153924 1163168 1170093 1175765 1178614 1177345 1173980
58326A173980k743k403l638m183k869j464p58P58L083M008L388L762N607O435
$$ 1173980 1171237 1168834 1165196 1161013 1158144 1156680 1155922 1156680 1159763 1163771 1167159 1170921 1176528 1182963
58312A182963N739O232Q855J1071J1505J1920J3244J3995J3886J4606J5844J5048
$$ 1182963 1188702 1194934 1203789 1214860 1226365 1238285 1251529 1265524 1279410 1294016 1309860 1324908
58300A324908J2263J0586J0770J0133P928O708P215O963N342M975O627P806P759
$$ 1324908 1337171 1347757 1358527 1368660 1376588 1383296 1390511 1397474 1402816 1407791 1414418 1422224 1429983
58287A429983Q647J0530J0711R397J0236J3730J6000J5655J5960J8396K0239K0501
$$ 1429983 1438630 1449160 1459871 1469268 1479504 1493234 1509234 1524889 1540849 1559245 1579484 1599985
58275A599985K2052K5623K7868K7670K8309L1258L3859L5168L7739M1675M3573
$$ 1599985 1622037 1647660 1675528 1703198 1731507 1762765 1796624 1831792 1869531 1911206 1954779
58264A954779M3209M4304M6789M5820M0625L6389L4979L2136K6658K3725K5698
$$ 1954779 1997988 2042292 2089081 2134901 2175526 2211915 2246894 2279030 2305688 2329413 2355111
58253B355111K8242K9159L2252L8594M3049M3823M6361N3220N9178O1122O3428
$$ 2355111 2383353 2412512 2444764 2483358 2526407 2570230 2616591 2669811 2728989 2790111 2853539
58242B853539O8644P2472P3240P6460Q4328R0809R2950R6812J05872J14322J18488
$$ 2853539 2922183 2994655 3067895 3144355 3228683 3319492 3412442 3509254 3615126 3729448 3847936
58231C847936J23972J34403J44273J50439J59205J74188J88883J99457K12654
$$ 3847936 3971908 4106311 4250584 4401023 4560228 4734416 4923299 5122756 5335410
58222E335410K32480K51841K66608K84720L11451L39479L63837L92491M31124
$$ 5335410 5567890 5819731 6086339 6371059 6682510 7021989 7385826 7778317 8209441
58213H209441M72561N12814N61579O24859O94417P67486Q58196R75551J110824
$$ 8209441 8682002 9194816 9756395 10381254 11075671 11843157 12701353 13676904 14787728
58204A4787728J262507J451356J693847J986590K337482K784512L360163M067426
$$ 14787728 16050235 17501591 19195438 21182028 23519510 26304022 29664185 33731611
58196C3731611M917306N956619P232265Q775900J0667804J3069406J6137376J9928613
$$ 33731611 38648917 44605536 51837801 60613701 71281505 84350911 100488287 120416900
58188A20416900K4354723K8986863L2665907L3462451K9565159K0667322Q543618
$$ 120416900 144771623 173758486 206424393 239886844 269452003 290119325 298662943
58181B98662943l876565j4109422k1016012k4612285k5480182k4408121k2221920
$$ 298662943 294786378 280676956 259660944 235048659 209568477 185160356 162938436
58174A62938436j9590096j6885861j4247146j1721011r321492p047415m970942
$$ 162938436 143348340 126462479 112215333 100494322 91172830 84125415 79154473
58167G9154473l315185k364605k252077k832779l754580m638964n231050n449038
$$ 79154473 75839288 73474683 71222606 68389827 64635247 59996283 54765233 49316195
58159D9316195n341370n006715m540197m023235l521591l070133k669590k310707
$$ 49316195 43974825 38968110 34427913 30404678 26883087 23812954 21143364 18832657
58151A8832657j994277j722916j489189j284566j109793r65769q43904p35568
$$ 18832657 16838380 15115464 13626275 12341709 11231916 10266147 9422243 8686675
58143H686675o42190n66685n03780m47917m02080l69438l44079l18776k94541
$$ 8686675 8044485 7477800 6974020 6526103 6124023 5754585 5410506 5091730 4797189
58134D797189k74157k53826k29766k06091j87654j71348j52527j33893j20219
$$ 4797189 4523032 4269206 4039440 3833349 3645695 3474347 3321820 3187927 3067708
58125C067708j10079j00473r3968r3565r5449r4283r1110q9260q7129q1806p5414
$$ 3067708 2957629 2857156 2763188 2669623 2574174 2479891 2388781 2299521 2212392 2130586 2055172
58114B055172p1251o7641o1843n6021n3301n1820m8559m5214m4560m4692m2498
$$ 2055172 1983921 1916280 1854437 1798416 1745115 1693295 1644736 1599522 1554962 1510270 1467772
58103A467772l9350l7946l7056l4493l1815l0997l0030k6748k3434k2668k2203
$$ 1467772 1428422 1390476 1353420 1318927 1287112 1256115 1226085 1199337 1175903 1153235 1131032
58092A131032j9032j4975j3086j2039r306o525o417p458o923o369q744j2738j5189
$$ 1131032 1112000 1097025 1083939 1071900 1062594 1056069 1049652 1042194 1035271 1028902 1020158 1007420 992231
58079I92231j6613j9181k1592k1154j8983j8172j8556j7905j6504j6004j5481
$$ 992231 975618 956437 934845 913691 894708 876536 857980 840075 823571 807567 792086
58068G92086j3138j0260r251r332q297o791o716p171o151m689n060o399o249n075
$$ 792086 778948 768688 759437 750105 741808 735017 728301 721130 714979 710290 705230 698831 692582 687507
58054F87507n120n963n365l512k578k878l055l167m181n314n165m564n170o263
$$ 687507 682387 676424 671059 667547 664969 662091 659036 655869 651688 646374 641209 636645 631475 625212
58040F25212o037m955m727n155m970m648n335o217n973n525o383p510o980n483
$$ 625212 619175 614220 609493 604338 599368 594720 589385 583168 577195 571670 565287 557777 550797 545314
58026E45314n045n501n303m685m836n109m164k865k933l749l488k348j679j045
$$ 545314 540269 534768 529465 524780 519944 514835 510671 507806 504873 501124 497636 495288 493609 492564
58012D92564P54K774L209K601K775L485L224K399K628L668M110M244N240O359
$$ 492564 493318 496092 499301 501902 504677 508162 511386 513785 516413 520081 524191 528435 533675 540034
57998E40034O084N258N919P675Q381P880Q008R225J0201J0336R981Q606N583K280
$$ 540034 546118 551376 557295 564970 573351 581231 589239 598464 608665 619001 628982 637588 643171 645451
57984F45451O46K32p38k093k363j908k331l303l064j670q08o65m3Q45O88r8J02
$$ 645451 646097 646329 645591 643498 641135 639227 636896 633593 630529 628859 628051 627386 627343 628188 628876 628778 628880
57967F28880R81P63m00n97L19M90n90j478j805k864m771n944n904n962o657o986
$$ 628880 629861 630624 630224 629627 629946 630436 629846 628368 626563 623699 618928 612984 607080 601118 594461 587475
57951E87475o641o527o669n998m577l667l302k152j22J347J842K395L170L193
$$ 587475 580834 574307 567638 561640 557063 553396 550094 547942 547820 549167 551009 553404 556574 559767
57937E59767K821L814O404Q692R611J0149J0998J1318J0590R598Q862Q006P180
$$ 559767 562588 566402 572806 581498 591109 601258 612256 623574 634164 643762 652624 660630 667810
57924F67810P092P213O027L502J207l02j940l679m289m053n093p995j0648j1485
$$ 667810 674902 682115 688142 691644 692851 692549 690609 686930 682641 678588 673495 665500 654852 643367
57910F43367j1574j2278j3120j3327j3501j4113j4184j2975j1507j0998j1062
$$ 643367 631793 619515 606395 593068 579567 565454 551270 538295 526788 515790 504728
57899E04728j0775j0214r788r235q447q126q538q696p763o322n310m634l766k788
$$ 504728 493953 483739 473951 464716 456269 448143 439605 430909 423146 416824 411514 406880 403114 400326
57885D00326k005j293n14J31O89J543K542K916K422J634Q41k76j588k307k215
$$ 400326 398321 397028 396514 396645 397334 398877 401419 404335 406757 408391 409232 408956 407368 405061 402846
57870D02846k043k261k561k740k983l030k307j219r31j507j546k08J692L042L759
$$ 402846 400803 398542 395981 393241 390258 387228 384921 383702 382771 381264 379718 379510 381202 384244 388003
57855C88003M257M768N614P142Q951J0161J0664J1072J1354J0853R711Q846Q353
$$ 388003 392260 397028 402642 409784 418735 428896 439560 450632 461986 472839 482550 491396 499749
57842D99749P453O277N887O135N289K602m48k385l681n413p374q730r423r786
$$ 499749 507202 513479 519366 525501 530790 533392 532944 530559 526878 521465 514091 505361 495938 486152
57828D86152r608q719p754p393p410p131o364n282m035k883k098j472o04K23L53
$$ 486152 476544 467825 460071 452678 445268 438137 431773 426491 422456 419573 417475 416003 415399 415622 415975
57813D15975K0K69J369K482L092L578M038L895L165K798L124L158K071L11j376
$$ 415975 415995 416264 417633 420115 423207 426785 430823 434718 437883 440681 443805 446963 449034 449345 447969
57798D47969k869m084m549m303m200m669n024m681m052l714l547l360l414l823
$$ 447969 445100 441016 436467 432164 427964 423295 418271 413590 409538 405824 402277 398917 395503 391680
57784C91680m246m606n233n941n940n141m445m341m160l250j869n20O04J153P54
$$ 391680 387434 382828 377595 371654 365714 360573 356128 351787 347627 344377 342508 341988 342592 343745 344499
57769C44499J7J71J228J707P41q29k025l088m494n864o786p646q724r377q910
$$ 344499 344516 344687 345915 347622 348363 347534 345509 342421 337927 332063 325277 317631 308907 299530 290620
57754B90620p556n978m630l998m458n445n721m969m065l504k863k135k114k841
$$ 290620 283064 277086 272456 268458 264000 258555 252834 247865 243800 240296 237433 235298 233184 230343
57740B30343l209k801k562k919k898k030j501k178l079l069k618k494k174j058
$$ 230343 227134 224333 221771 218852 215954 213924 212423 210245 207166 204097 201479 198985 196811 195753
57726A95753K6J38j53K9K04k95o28J93J241R55l11r83q79j118j813j955j478j427
$$ 195753 195779 195917 195764 195793 195997 195702 195074 195267 196508 197463 197152 196169 195290 194172 192359 190404 188926 187499
57708A87499j960j992j198o38q87j067l88N08N77j44p74p68l08J69M21N20O31
$$ 187499 185539 183547 182349 181711 180824 179757 179369 179877 180454 180310 179536 178768 178460 178629 179050 179570 180201
57691A80201O63L92PJ03P69J275J093P61J112K193L526N000O818Q975J1489J4749
$$ 180201 180864 181256 181263 181366 182135 183410 184503 185264 186376 188569 192095 197095 203913 212888 224377 239126
57675B39126J8942K3589K8346L3870M1196N0606O1615P3439Q4473R1647R1250
$$ 239126 258068 281657 310003 343873 385069 435675 497290 570729 655202 746849 838099
57664H38099Q0653N9340K9273m812l6349n9721p2796p6784p4313o8232o1182n4801
$$ 838099 918752 978092 1007365 1002553 966204 906483 833687 756903 682590 614358 553176 498375
57652D98375m9069m3174l6968l1154k6397k2870k0328j8097j5396j2327j0025
$$ 498375 449306 406132 369164 338010 311613 288743 268415 250318 234922 222595 212570
57641B12570r148q801p765o233n285n068m684l744k906k754l015l109k825k279
$$ 212570 203422 194621 186856 180623 175338 170270 165586 161842 158936 156182 153167 150058 147233 144954
57627A44954j665j218j092j247j596k062k419k359j924j439r85m56k34r61k423
$$ 144954 143289 142071 140979 139732 138136 136074 133655 131296 129372 127933 126948 126492 126258 125297 122874
57612A22874l536l761l584l270k339q26J72P5k40O4M93M83P30J858K928K748J788
$$ 122874 119338 115577 111993 108723 106384 105558 105730 105805 105565 105629 106122 106605 107335 109193 112121 114869 116657
57595A16657J224R32P2r82j170p45r59j893k397k061j663j629j587j546k020k819
$$ 116657 117881 118813 118885 117903 116733 115988 115029 113136 110739 108678 107015 105386 103799 102253 100233 97414
57579I7414l047k494j852j461j128j142k049l276l481k505j685j837k327k437
$$ 97414 94367 91873 90021 88560 87432 86290 84241 80965 77484 74979 73294 71457 69130 66693
57565F6693k327k115j314J05J149J053L40J3M21J275K069K180J285j4o28l33R3
$$ 66693 64366 62251 60937 61042 62191 63244 63584 63597 64018 65293 67362 69542 70827 70813 70185 69852 69945
57548F9945J13J3P5J18P2R5k6o83j449j323k04Q53J110Q08J46j117k578l037k116
$$ 69945 70058 70071 70146 70264 70336 70431 70405 69722 68273 66950 66746 67599 68709 69517 69663 68546 65968 62931 60815
57529F0815r72o42o64j92N69R01P26K41q01k442l735l744k924k545k965l369l068
$$ 60815 59843 59201 58537 58345 58914 59815 60541 60782 59981 57539 53804 50060 47136 44591 41626 38257 35189
57512C5189k266j570j352j591j876j688r75k58R1K88N57O44M62O04J538K593K610
$$ 35189 32923 31353 30001 28410 26534 24846 23871 23613 23704 23992 24549 25193 25655 26259 27797 30390 33000
57495C3000J461J78l98m45n10o63n86j46L75N78L48M6J79P91J323J205N13j53
$$ 33000 34461 34639 34241 33796 33286 32623 32037 31891 32266 32844 33192 33238 33417 34208 35531 36736 37249 37096
57477C7096k94J18Q57J701K472K903K661J654L83l45k42N3k28j004j555j578j469
$$ 37096 36802 36920 37777 39478 41950 44853 47514 49168 49551 49206 48964 49017 48789 47785 46230 44652 43183
57460D3183j512j423r65m36j58O1N61J181J432J171P34M25J86k38r08j558j748
$$ 43183 41671 40248 39283 38847 38689 38750 39311 40492 41924 43095 43829 44254 44440 44202 43294 41736 39988
57443C9988j298n49m5J4r9j03m2q1k16l28m05n33p58j005j163j171j102j070j052
$$ 39988 38690 38141 38096 38110 38011 37908 37866 37785 37569 37241 36836 36303 35545 34540 33377 32206 31104 30034 28982
57424B8982r39p66p27q03p04l80k17m36n91k23K97K33l19m26L27J171J172M34
$$ 28982 28043 27277 26550 25747 25043 24663 24446 24010 23419 23196 23493 23726 23407 22981 23308 24479 25651 26085
57406B6085j88k44m1j0j21n6L12P75J012Q80N04J99K74P76J350J535J298J124
$$ 26085 25897 25653 25612 25602 25481 25425 25737 26512 27524 28404 28908 29107 29381 30157 31507 33042 34340 35464
57388C5464J326J544J250O00K47L85O54R37J497K175K245J496P30O53R81J103
$$ 35464 36790 38334 39584 40184 40431 40816 41470 42407 43904 46079 48324 49820 50550 51203 52184 53287
57372E3287J006Q96N77l5k96M01J614K386K451K191J788J165N51K70K43L40R04
$$ 53287 54293 55189 55766 55731 55435 55836 57450 59836 62287 64478 66266 67431 67982 68252 68495 68835 69739
57355F9739K048K916K596J530R84J316J835K179K639L109K957K206J729J942K238
$$ 69739 71787 74703 77299 78829 79813 81129 82964 85143 87782 90891 93848 96054 97783 99725 101963
57340A01963K116J906J979K077J889J606J396J031M34K9J29N02Q47J200J551J626
$$ 101963 104079 105985 107964 110041 111930 113536 114932 115963 116397 116426 116555 117057 117904 119104 120655 122281
57324A22281J387J196J206J095P21N04P81J277J575J671J694J548J195R64J152
$$ 122281 123668 124864 126070 127165 127886 128390 129171 130448 132023 133694 135388 136936 138131 139095 140247
57309A40247J636K068K268K229J983J734J781K218K879L543L988M003L707L687
$$ 140247 141883 143951 146219 148448 150431 152165 153946 156164 159043 162586 166574 170577 174284 177971
57295A77971M319N053N042M303L604L229K715J992J737K268K833K569J624P38
$$ 177971 182290 187343 192385 196688 200292 203521 206236 208228 209965 212233 215066 217635 219259 219997
57281B19997K06l00j115k269l544m604n203n516n990o791p643q357r058r729r913
$$ 219997 220203 219903 218788 216519 212975 208371 203168 197652 191662 184871 177228 168871 159813 150084 140171
57266A40171r117p337n075l020j716j146o05N82K192L335L656L808M567N813O683
$$ 140171 131054 123717 118642 115622 113906 112760 112155 112737 114929 118264 121920 125728 130295 136108 142791
57251A42791O513N429M139L252K812K473K132K067K302K274J493K33q58j536j871
$$ 142791 149304 154733 158872 162124 164936 167409 169541 171608 173910 176184 177677 177910 177052 175516 173645
57236A73645j784j264p68p23p95l44N07R97Q76P54J199K037K678K725K229J610
$$ 173645 171861 170597 169829 169106 168311 167967 168474 169471 170347 171101 172300 174337 177015 179740 181969 183579
57220A83579J272J079M68o71j751k489l549n516p742r064r239q904q459p872p294
$$ 183579 184851 185930 186398 185727 183976 181487 177938 172422 164680 155616 146377 137473 129014 121142 113848
57205A13848o967o632n835m585l105j321O91K149K388J877J580J745K130K820
$$ 113848 106881 100249 94414 89829 86724 85403 86094 88243 90631 92508 94088 95833 97963 100783
57191A00783L762M019K777P65n49q95j177j831k468k917l398l848m183n016o866
$$ 100783 104545 108564 111341 112106 111557 110662 109485 107654 105186 102269 98871 95023 90840 85824 78958
57176G8958q962j0065j0205j0432j1201j2280B082a3511j7002j7185j7064j8068
$$ 78958 69996 59931 49726 39294 28093 15813 2082 -13511 -30513 -47698 -64762 -82830
57164h2830j9810k0714k0683k1214k2931k5057k7376l0803l5591m0819m5985n1547
$$ -82830 -102640 -123354 -144037 -165251 -188182 -213239 -240615 -271418 -307009 -347828 -393813 -445360
57152d45360n7592o3472o9115p5184q1820q8560r5488j03041j10843j18285j26003
$$ -445360 -502952 -566424 -635539 -710723 -792543 -881103 -976591 -1079632 -1190475 -1308760 -1434763
57141a434763j35037j44833j53877j62033j70230j78238j84927j90557j96421
$$ -1434763 -1569800 -1714633 -1868510 -2030543 -2200773 -2379011 -2563938 -2754495 -2950916
57132b950916k02358k06913k10066k13531k18372k24509k32490k43292k56475
$$ -2950916 -3153274 -3360187 -3570253 -3783784 -4002156 -4226665 -4459155 -4702447 -4958922
57123d958922k71003k87734l08560l33296l60174l89092m21473m57195m94828
$$ -4958922 -5229925 -5517659 -5826219 -6159515 -6519689 -6908781 -7330254 -7787449 -8282277
57114h282277n34976n80342o32683o92856p63505q48237r48513j064973j201479
$$ -8282277 -8817253 -9397595 -10030278 -10723134 -11486639 -12334876 -13283389 -14348362 -15549841
57105a5549841j364409j559300j793025k078893k435357k881199l437507m132694
$$ -15549841 -16914250 -18473550 -20266575 -22345468 -24780825 -27662024 -31099531 -35232225
57097c5232225m997929o055530p313242q761059j0359148j2029588j3677739j5234518
$$ -35232225 -40230154 -46285684 -53598926 -62359985 -72719133 -84748721 -98426460 -113660978
57089a13660978j6678228j8020067j9281073k0479976k1616067k2638666k3429193
$$ -113660978 -130339206 -148359273 -167640346 -188120322 -209736389 -232375055 -255804248
57082b55804248k3815368k3602045k2602920k0677522j7760107j3847660q967843
$$ -255804248 -279619616 -303221661 -325824581 -346502103 -364262210 -378109870 -387077713
57075c87077713l208675L174582R699544J5763169K0850664K4666096K7115562
$$ -387077713 -390286388 -387111806 -377412262 -361649093 -340798429 -316132333 -289016771
57068b89016771K8240566K8191913K7213062K5579548K3528283K1238907J8856573
$$ -289016771 -260776205 -232584292 -205371230 -179791682 -156263399 -135024492 -116167919
57061a16167919J6502564J4264832J2198923J0341950Q715745P319662O134799
$$ -116167919 -99665355 -85400523 -73201600 -62859650 -54143905 -46824243 -40689444
57054d0689444N138998M312115L630535L068088K604003K223408J910736J649799
$$ -40689444 -35550446 -31238331 -27607796 -24539708 -21935705 -19712297 -17801561 -16151762
57046a6151762J429907J245269J088748R52218Q32397P30251O44696N72100N11173
$$ -16151762 -14721855 -13476586 -12387838 -11435620 -10603223 -9872972 -9228276 -8656176 -8145003
57037h145003M62697M24612L92380L63924L39545L17660K95531K73882K55956
$$ -8145003 -7682306 -7257694 -6865314 -6501390 -6161845 -5844185 -5548654 -5274772 -5018816
57028e018816K42086K29552K17394K06922J97708J87679J77293J69332J64335
$$ -5018816 -4776730 -4547178 -4329784 -4122862 -3925154 -3737475 -3560182 -3390850 -3226515
57019c226515J60276J56944J56681J60363J66471J74558J85753J98657K07475
$$ -3226515 -3066239 -2909295 -2752614 -2592251 -2425780 -2251222 -2065469 -1866812 -1659337
57010a659337K05121J86694J51202J03427N3934J3561j3134k7619l2289k8980
$$ -1659337 -1454216 -1267522 -1116320 -1012893 -958959 -945398 -958532 -986151 -1018440 -1047420
57000a047420k1329j3832p845j760M647R366J1878J4133J7169J9808K1432K3068
$$ -1047420 -1068749 -1082581 -1090426 -1092186 -1087539 -1078173 -1066295 -1052162 -1034993 -1015185 -993753 -970685
56988i70685K5091K6613K7724K9698L2322L3658L2941L1182K8526K3794J7255
$$ -970685 -945594 -918981 -891257 -861559 -829237 -795579 -762638 -731456 -702930 -679136 -661881
56977f61881J1239P254M755L330L584N219O685P481Q696J0683J2392J3468J4789
$$ -661881 -650642 -643388 -638633 -635303 -631719 -626500 -619815 -612334 -603638 -592955 -580563 -567095 -552306
56964e52306J6447J7460J8012J9705K2976K6515K9645L2935L5737L5618L1249
$$ -552306 -535859 -518399 -500387 -480682 -457706 -431191 -401546 -368611 -332874 -297256 -266007
56953b66007K3900J5386O624j122n921p361p191o862n979l985j565M67K168L678
$$ -266007 -242107 -226721 -220097 -221219 -227140 -234501 -241692 -248554 -254533 -258518 -260083 -259616 -257448 -253770
56939b53770M922O495R241J2673J5497J7923K1504K6435L1055L4147L5406e040
$$ -253770 -248848 -242353 -233112 -220439 -204942 -187019 -165515 -139080 -108025 -73878 -38472 -5040
56926B1149J4519K585o387j2733A478a8996k0263j8007j5373j2714r892p583o217
$$ 21149 35668 38253 31866 19133 1478 -18996 -39259 -57266 -72639 -85353 -95245 -102828 -109045
56913a09045m946l140j691j509j873j572o89%M08P99R67Q04Q54J449K066K249
$$ -109045 -113991 -117131 -118822 -120331 -122204 -123776 -124465 -124465 -124057 -123258 -122291 -121487 -120633 -119184 -117118 -114869
56897a14869K268K320K235K437L937O683R270J0959J2648J5061J7417a0757I080
$$ -114869 -112601 -110281 -108046 -105609 -101672 -94989 -85719 -74760 -62112 -47051 -29634 -10757 9080
56883B9697K0043J6873J1688O333K047r26k648l332l441l225k548j486l68R37
$$ 29697 49740 66613 78301 84634 86681 85755 83107 79775 76334 73109 70561 69075 68707 69644
56869F9644K901N314P467R502J2358J6123J9844K3279K7372L2368L6799L8887
$$ 69644 72545 77859 85326 94828 107186 123309 143153 166432 193804 226172 262971 301858
56857C01858L7638L2227K2092Q631m644j4762k1201k4665k5428k3770k0701j7182
$$ 301858 339496 371723 393815 402446 397802 383040 361839 337174 311746 287976 267275 250093
56845B50093j3438r590n919k020L053R217J5272K0874K7151L4815M3182N1464
$$ 250093 236655 227065 221146 219126 222179 231396 246668 267542 294693 329508 372690 424154
56833D24154N9126O4068O2565N2602L5998J6306l802k2107l5937m3753m6567m6296
$$ 424154 483280 547348 609913 662515 698513 714819 711017 688910 652973 609220 562653 516357
56821E16357m3696l9079l3642k8462k3194j7324j1620o899k335L385J0088J6892
$$ 516357 472661 433582 399940 371478 348284 330960 319340 312441 310106 313491 323579 340471
56809C40471K4064L2342M0740M6502M7070M1275K9326J3045m277j9394l0546l7205
$$ 340471 364535 396877 437617 484119 531189 572464 601790 614835 610558 591164 560618 523413
56797E23413l9401l8139l5399l2533k9307k5226k0858j6926j3137r032n038j602
$$ 523413 484012 445873 410474 377941 348634 323408 302550 285624 272487 263455 258417 256815
56785B56815J882O087J0633J4982J9372K3573K5576K3111J6035O262m057j3207
$$ 256815 258697 264784 275417 290399 309771 333344 358920 382031 398066 404328 400271 387064
56773C87064j9783k3343k4813k5210k4466k2259j9178j6090j3154j0443q616p931
$$ 387064 367281 343938 319125 293915 269449 247190 228012 211922 198768 188325 179709 171778
56761A71778p479o476n430m950m473l390k402k407k951l113k996l019k676j533
$$ 171778 164299 157823 152393 147443 142970 139580 137178 134771 131820 128707 125711 122692 120016 118483
56747A18483n10o03j119q11qM1o27q84m63j07m1K27P85J245J518J647J312N12
$$ 118483 117973 117370 116251 115440 115432 115473 114846 113962 113499 113392 113351 113578 114363 115608 117126 118773 120085 120597
56729A20597P1M81J034J137J369K028J949M35q46L7K244L372K963K531K636K343
$$ 120597 120668 121149 122183 123320 124689 126717 128666 129101 128255 128292 130536 133908 136871 139402 142038 144381
56713A44381J481J100J522J873J820K001K549K824K828L205L760L486K292J224
$$ 144381 145862 146962 148484 150357 152177 154178 156727 159551 162379 165584 169344 172830 175122 176346
56699A76346Q26O79N89Q19J093Q02K14R2J99l62j388j781j448j376j756j756j222
$$ 176346 177172 177851 178440 179259 180352 181154 181368 181460 181659 181297 179909 178128 176680 175304 173548 171792 170570
56682A70570r62j163j130q71j184j892j692k80J059J494J632J968J900J152O83
$$ 170570 169608 168445 167315 166444 165260 163368 161676 161396 162455 163949 165581 167549 169449 170601 171284
56667A71284J250K227K689K674K613K418J948J519J375J264J029R10J005J079
$$ 171284 172534 174761 177450 180124 182737 185155 187103 188622 189997 191261 192290 193200 194205 195284
56653A95284J118J231R70k93k220l721m528n398o559p158o651n634m733l796k673
$$ 195284 196402 197633 198603 198310 196090 192369 187841 182443 175884 168726 162075 156441 151708 147912 145239
56638A45239j860j655j566j129o64n84o76n60m04n80j007j268j140p84n34n10
$$ 145239 143379 141724 140158 139029 138365 137781 137105 136545 136141 135561 134554 133286 132146 131362 130828 130318
56622A30318l72L42J394J919J719J783K855M144M400L654K847K336J924J874K460
$$ 130318 129946 130288 131682 133601 135320 137103 139958 144102 148502 152156 155003 157339 159263 161137 163597
56607A63597K923K257R15K77O23J036J184J634K331K297J187j09p24o16o3N94
$$ 163597 166520 168777 169692 169969 170592 171628 172812 174446 176777 179074 180261 180152 179428 178812 178749 179343
56591A79343O73j86j157j153n07m20r64j118o78n22q75r32m47r4l4L62J094J365
$$ 179343 180016 179830 178673 177520 177013 176593 175629 174511 173833 173311 172436 171504 171057 170963 170929 171291 172385 173750
56573A73750J108J182J704J773J220J077J796K512K658K871L687M750N805P149
$$ 173750 174858 176040 177744 179517 180737 181814 183610 186122 188780 191651 195338 200088 205893 213042
56559B13042Q549R108Q671Q061P558O645N549N295N700N269L793L106M173N291
$$ 213042 221591 230699 239370 247431 254989 261634 267183 272478 278178 283447 287240 290346 294519 299810
56545B99810M632K920J983J901J337j05j456j868j377n43j83r36k419l411l475
$$ 299810 304442 307362 309345 311246 312583 312478 311022 309154 307777 307234 307051 306115 303696 300285 296810
56530B96810l597m645o040o718o526n946n223m516m133l940l322k334j991k723
$$ 296810 293213 288568 282528 275810 269284 263338 258115 253599 249466 245526 242204 239870 237879 235156
56516B35156l462l128k123j562j671j850j749j505j284j251j562k021k180k017
$$ 235156 231694 228566 226443 224881 223210 221360 219611 218106 216822 215571 214009 211988 209808 207791
56502B07791j955k079k076j995k247k660k560j905j331r29j53Q98J310Q43K94
$$ 207791 205836 203757 201681 199686 197439 194779 192219 190314 188983 188054 187901 188799 190109 190952 191246
56487A91246R4j84n77m30K03K69n45j178r33m77m14k88J88K81m26j008m60R22
$$ 191246 191340 191156 190579 190149 190352 190621 190076 188898 187965 187488 187074 186786 186974 187255 186829 185821 185361 186283
56469A86283K175K778K549J539N48N89J362J471N22l47m60m49n86l3J375K366
$$ 186283 188458 191236 193785 195324 195872 196461 197823 199294 199816 199469 199009 198560 197974 197941 199316 201682
56453B01682K181J719J694J368K81m97j33M65L62K39Q69J357O18o08q26R6J289
$$ 201682 203863 205582 207276 208644 208925 208428 208295 208760 209122 209361 210230 211587 212205 211597 210771 210867 212156
56436B12156K362L157L045J838N57M7j50n13l68O97J575J307P87J237K056J920
$$ 212156 214518 217675 220720 222558 223115 223162 223012 222499 222131 222828 224403 225710 226497 227734 229790 231710
56420B31710J023N60P39R37J125J579J878J571J162J134Q50k13j118q19j9kn25
$$ 231710 232733 233293 234032 234969 236094 237673 239551 241122 242284 243418 244268 244055 242937 242118 242099 242097 241572
56403B41572n03o4j42o38o84l21k87n41m48n1J93M81J122J459P82k11k87M52R20
$$ 241572 241069 241005 240863 240225 239541 239220 238933 238392 237944 237893 238086 238567 239689 241148 241930 241719 241432 241884 242804
56384B42804Q32O99N15j08q05q24k47L30R98K107L099L040K116J407J326J323
$$ 242804 243636 244335 244850 244742 243937 243113 242866 243196 244194 246301 249400 252440 254556 255963 257289 258612
56368B58612Q85lj130j975j799n67P06J173J027O39j71j289j803j280n00r8L61
$$ 258612 259497 259494 258364 256389 254590 254023 254729 255902 256929 257568 257397 256108 254305 253025 252525 252427 252788
56351B52788J094J311P46N07J103J217j09j546j491n62k87n08j18P28J152J363
$$ 252788 253882 255193 255939 256446 257549 258766 258657 257111 255620 255058 254771 254263 254145 254873 256025 257388
56335B57388J985K477K140J744K250K796K055P29N35J422J905J709J835K415K520
$$ 257388 259373 261850 263990 265734 267984 270780 272835 273564 274099 275521 277426 279135 280970 283385 285905
56320B85905J953J382R60M64L80J145J791J102l41r12l63K07K61J89K27N32J707
$$ 285905 287858 289240 290200 290664 291044 292189 293980 295082 294741 293829 293466 293673 293934 294123 294350 294882 296589
56303B96589L738N210N073M304M247M393L547K086J083L38o96j094O5J469J211
$$ 296589 300327 305537 310610 314914 319161 323554 327101 329187 330270 330608 329912 328818 328883 330352 331563
56288C31563j68o48J11R33J617K700L483K937J934K041K750K460J487J360J797
$$ 331563 331395 330747 330858 331791 333408 336108 339591 342528 344462 346503 349253 351713 353200 354560 356357
56273C56357J377O29J368L222M001L456L550M898N956O070O359P183P497P230
$$ 356357 357734 358363 359731 362953 366954 370410 373960 378858 384814 390884 397243 404426 411923 419153
56259D19153P646Q809R242Q624Q411R286J0249J0669J1044J1425J1283J1112J2021
$$ 419153 426799 435608 444850 453474 461885 471171 481420 492089 503133 514558 525841 536953 548974
56246E48974J3626J4612J5230J6862J9215K0584K0874K1547K2498K1885J9399
$$ 548974 562600 577212 592442 609304 628519 649103 669977 691524 714022 735907 755306
56235G55306J6771J4619J1598P340L457Q38j545m404p109r448j2101j4818j6418
$$ 755306 772077 786696 798294 805634 809091 809929 808384 803980 796871 787423 775322 760504 744086
56222G44086j6966j7698j8555j8223j6818j5898j5656j4747j3100j2090j1688
$$ 744086 727120 709422 690867 672644 655826 639928 624272 609525 596425 584335 572647
56211E72647j0438q604q205r408r916q703p294o678n982m967m753n144m295k007
$$ 572647 562209 553605 545400 535992 526076 517373 510079 503401 497419 492452 487699 482555 478260 476253
56197D76253m10l42j25J065J696R91N23J270J929J519J003R71L94r40j405k87
$$ 476253 475843 475501 475376 476441 478137 479128 479651 480921 482850 484369 485372 486343 486737 485797 484392 484105
56181D84105Q70R70Q76J191J059L70M84J565J838O66k18J93O02J68J78J502K888
$$ 484105 484975 485945 486821 488012 489071 489441 489925 491490 493328 493994 493776 493969 494571 494739 494917 496419 499307
56164D99307L278L496M333N169N624O367P381P645P326P809R089R643R449J0155
$$ 499307 502585 506081 510414 515583 521207 527574 534955 542600 549926 557735 566824 576467 585916 596071
56150E96071J1845J2709J2491J2937J4197J4395J3466J3749J5756J7258J7662
$$ 596071 607916 620625 633116 646053 660250 674645 688111 701860 717616 734874 752536
56139G52536J9394K3548K8069L1888L6866M3937N1220N7939O6463P8297R1608
$$ 752536 771930 795478 823547 855435 892301 936238 987458 1045397 1111860 1190157 1281765
56128A281765J04552J17390J29155J36023J35436J28811J18346J04636Q9284P6063
$$ 1281765 1386317 1503707 1632862 1768885 1904321 2033132 2151478 2256114 2345398 2421461
56118B421461O7045O0602N4893M9808M4001L4296K0387O350m638j3363k0771k5737
$$ 2421461 2488506 2549108 2604001 2653809 2697810 2732106 2752493 2758843 2754205 2740842 2720071 2694334
56106B694334k9078l5260m7236o3156q0368r8255j14896j25773j28913j27167
$$ 2694334 2665256 2629996 2582760 2519604 2439236 2340981 2226085 2100312 1971399 1844232
56096A844232j22763j14177j01185q7947p7501o7807n6781m6608l9462l3443k6664
$$ 1844232 1721469 1607292 1506107 1418160 1340659 1272852 1216071 1169463 1130001 1096558 1069894
56085A069894k0965j7800j4820j0364o842n785m204j9L606L806L273N306Q098
$$ 1069894 1048929 1031129 1016309 1005945 999103 993318 989114 989095 992701 996507 999780 1005086 1013184
56072A013184Q744Q664J0086J1276J0163Q773R188R106O185K872K109K280J170
$$ 1013184 1021928 1030592 1040678 1051954 1062117 1070890 1080078 1089184 1095369 1098241 1100350 1102630 1103800
56059A103800O61K577M233L184K148M037O511O700O739R194J1585J1173J0616
$$ 1103800 1104461 1107038 1111271 1114455 1116603 1120640 1127151 1133851 1140590 1149784 1161369 1172542 1183158
56046A183158J2980J5681J5350J4204J5498J7227J6585J6073J8659K1505K1103
$$ 1183158 1196138 1211819 1227169 1241373 1256871 1274098 1290683 1306756 1325415 1346920 1368023
56035A368023K0126K2392K5634K6071K5558K7305K9158K8190K7229K9652L2583
$$ 1368023 1388149 1410541 1436175 1462246 1487804 1515109 1544267 1572457 1599686 1629338 1661921
56024A661921L2398L1892L4515L6902L5083L2654L4540L8109L8880L9400M3685
$$ 1661921 1694319 1726211 1760726 1797628 1832711 1865365 1899905 1938014 1976894 2016294 2059979
56013B059979M8584M9832N0831N6026O1529O2240O2061O6735P2731P4087P3958
$$ 2059979 2108563 2158395 2209226 2265252 2326781 2389021 2451082 2517817 2590548 2664635 2738593
56002B738593P8194Q3759Q5370Q7013R4563J03488J06832J08820J16937J27245
$$ 2738593 2816787 2900546 2985916 3072929 3167492 3270980 3377812 3486632 3603569 3730814
55992C730814J31893J34607J43639J55852J63447J70080J83897K00896K12202
$$ 3730814 3862707 3997314 4140953 4296805 4460252 4630332 4814229 5015125 5227327
55983E227327K21585K38337K59210K75681K92359L18953L50894L78042M05447
$$ 5227327 5448912 5687249 5946459 6222140 6514499 6833452 7184346 7562388 7967835
55974G967835M44366M90452N33521N80737O45852P23943Q03018Q91814J007995
$$ 7967835 8412201 8902653 9436174 10016911 10662763 11386706 12189724 13081538 14089533
55965A4089533J148601J303188J486454J724553K020636K371949K809595L379213
$$ 14089533 15238134 16541322 18027776 19752329 21772965 24144914 26954509 30333722
55957C0333722M094152M954540N999322P288400Q856167J0757377J3150268J6255333
$$ 30333722 34427874 39382414 45381736 52670136 61526303 72283680 85433948 101689281
55949A01689281K0223203K5053770L0452402L5433850L8040632L5949080K7978817
$$ 101689281 121912484 146966254 177418656 212852506 250893138 286842218 314821035
55942C14821035J5257197P99812j2182247k1729383k7372981k9572037k9181132
$$ 314821035 330078232 330878044 318695797 296966414 269593433 240021396 210840264
55935B10840264k7177796k4438624k1544146j8770366j6228271j3959919j1954198
$$ 210840264 183662468 159223844 137679698 118909332 102681061 88721142 76766944
55928G6766944j0180081q635720p334001o252474n340732m568386l926667l392733
$$ 76766944 66586863 57951143 50617142 44364668 39023936 34455550 30528883 27136150
55920B7136150k932430k533555k201523j926078j683533j467487j287421j139808
$$ 27136150 24203720 21670165 19468642 17542564 15859031 14391544 13104123 11964315
55912A1964315j008030q88241p89316p09026o34325n63803n07185m63476m20705
$$ 11964315 10956285 10068044 9278728 8569702 7935377 7371574 6864389 6400913 5980208
55903E980208l76590l39730l10921k82004k52679k30645k15395j98517j79669
$$ 5980208 5603618 5263888 4952967 4670963 4418284 4187639 3972244 3773727 3594058
55894C594058j66314j58183j47415j33599j23715j17687j08566r6697q9424q6713
$$ 3594058 3427744 3269561 3122146 2988547 2864832 2747145 2638579 2541882 2452458 2365745
55884B365745q0776p0243o1548n5965m7989l7019k8381k2151j2744k22R197J4244
$$ 2365745 2284969 2214726 2153178 2097213 2049224 2012205 1983824 1961673 1948929 1948707 1957904 1972148
55872A972148J9217K3407K1081J2401L430n304j9348l8585n5546o6776p5761q3338
$$ 1972148 1991365 2014772 2035853 2048254 2051684 2046380 2027032 1988447 1932901 1866125 1790364 1707026
55860A707026q5269q1169p6423p3212o8221o0801n4780n0722m4814l7008l2028
$$ 1707026 1621757 1540588 1464165 1390953 1322732 1261931 1207151 1156429 1111615 1074607 1042579
55849A042579l0845k9107k5527k3870k5078k5217k2951k1523k1778k0514j7346
$$ 1042579 1011734 982627 957100 933230 908152 882935 859984 838461 816683 796169 778823
55838G78823j5944j6833j6182j3319j2246j3891j4013j0893q254q298q317o556
$$ 778823 762879 746046 729864 716545 704299 690408 676395 665502 657248 648950 640633 634077
55826F34077n217n375m768k844k376m088n016m065l742m660l840l33K790L875
$$ 634077 628860 623485 618717 615873 613497 609409 604393 600328 596586 591926 588086 587753 590543 594418
55812E94418M947O965P979P666Q544J0965J1843J0037Q037O817M101o44m574o562
$$ 594418 599365 606330 614309 621975 630519 641484 653327 663364 671401 678218 682319 681675 677101 670539
55798F70539r000j2807j5540j6208j7151j9215j9887j8120j6351j5753j4119j0442
$$ 670539 661539 648732 633192 616984 599833 580618 560731 542611 526260 510507 496388 485946
55786D85946p106n419l375J06K887L594L778M234L319Q48m85M33J208M23k4J057
$$ 485946 478840 473421 470046 470152 473039 476633 480411 484645 487964 488812 488327 488760 489968 490391 490367 491424
55770D91424J775Q90Kj26j560n341r215j1366j2911j4698j5178j3555j1679j0800
$$ 491424 493199 494089 494091 493965 492405 487064 477849 466483 453572 438874 423696 410141 398462 387662
55756C87662r683p746o631o901o573m780l460l708l904l213l297m732n395m343
$$ 387662 377979 370233 363602 356701 350128 345348 341888 338180 334276 331063 327766 323034 317639 313296
55742C13296l625m237m061k027m83r20j163N37K173J707P73J495K604J931K15
$$ 313296 309671 305434 301373 299346 298863 297943 296780 297317 299490 301197 301970 303465 306069 308000 308215
55727C08215p09j131k084k852k606k442l310l895k963j727j602j739r98l51q85
$$ 308215 307506 306375 304291 301439 298833 296391 293081 289186 286223 284496 282894 281155 280157 279806 278921
55712B78921j399l49J583K953L842M734M858L667K271J605Q71o24j963k509l286
$$ 278921 277522 277173 278756 281709 285551 290285 295143 298810 301081 302686 303557 302933 300970 298461 295175
55697B95175m915o172o177n870n794m848k804j601k191k561j021R26J246O61R50
$$ 295175 290260 284088 277911 272041 266247 261399 258595 256994 254803 252242 251221 252147 253393 254054 255004
55682B55004J946K535K918L622L983L534L250L588L144J089r31j287p92p49n64
$$ 255004 256950 259485 262403 266025 270008 273542 276792 280380 283524 284613 283682 282395 281603 280854 280290
55667B80290N51J528J368J319K868N154O521P090P703P832O632M697K870P63j865
$$ 280290 280841 282369 283737 285056 287924 293078 299599 306689 314392 322224 328856 333553 336423 337186 335321
55652C35321l836m481n119o818q383q432p693p414p213o396n608n350m674l228
$$ 335321 331485 327004 321885 315067 306684 298252 290559 283145 275932 269536 263928 258578 253904 250676
55638B50676k581l538m235l127j744k081l219l142k081j448j150n58m71j591k582
$$ 250676 248095 244557 240322 237195 235451 233370 230151 227009 224928 223480 222330 221772 221301 219710 217128
55623B17128k241j878k891l825k702n98J92O4Q26J927J399l69j266j103j327j720
$$ 217128 214887 213009 210118 206293 203591 202993 203185 203249 204075 206002 207401 207032 205766 204663 203336 201616
55607B01616p75R20J058n97j851j668j258j376j299q52r17j433j162P4R47P73
$$ 201616 200841 201761 202819 202222 200371 198703 197445 196069 194770 193918 193001 191568 190406 190480 191427 192200
55591A92200K41j70p52j300j135m91k83m40j12N89P05K26O6L53L98K51O22J301
$$ 192200 192441 192271 191519 190219 189084 188593 188310 187870 187758 188347 189052 189278 189344 189697 190095 190346 190968 192269
55573A92269J353P65M26N72P36R87J686K311K123J683K056K803K507J121O8M1
$$ 192269 193622 194387 194813 195385 196121 197108 198794 201105 203228 204911 206967 209770 212277 213398 213466 213507
55557B13507L83N67O76M38n85j790k029j345q61r80j053p76n60m94k08K44M23
$$ 213507 213890 214457 215133 215571 214986 213196 211167 209822 208961 207981 206928 206152 205592 205098 204890 205134 205557
55540B05557K87j7p25j763k130j160J52M16k43q09j156j696k013j586j114j481
$$ 205557 205844 205827 205102 203339 201209 200049 200201 200617 200374 199565 198409 196713 194700 193114 192000 190519
55524A90519j975j398k94j51r02j226r26r56j333j113k81K05K27M80P97L94l61
$$ 190519 188544 187146 186852 186701 185799 184573 183647 182691 181358 180245 179964 180169 180396 180876 181673 182067 181706
55507A81706l69J35p8q43p36L43Q12N5p05o03l44n52o40p2O79J050J106R40M97
$$ 181706 181337 181472 181394 180551 179815 180158 180970 181025 180320 179717 179373 178821 178181 178109 178788 179838 180944 181884 182381
55488A82381J45K80L70k86j060p40L77Q46M11J23J97k34r59n40J008J547j62k490
$$ 182381 182526 182806 183176 182890 181830 181090 181467 182313 182724 182847 183044 182810 181851 181311 182319 183866 183704 181214
55470A81214l175k144r63n48n26j65Q67K189K785K043P45J91M39M82J28K44R87
$$ 181214 178039 175895 174932 174384 173858 173693 174560 176749 179534 181577 182322 182513 182952 183434 183562 183806 184793
55453A84793J297O58m4OL83L47j12o40j061j114n42K21L53j12l10L6J79l21q99
$$ 184793 186090 186748 186704 186710 187093 187440 187328 186688 185627 184513 183971 184192 184545 184433 184123 184159 184338 184017 183118
55434A83118r22m75P6M97M60j81q00n25M92J189R84L01k82m74j1J041J842J621
$$ 183118 182196 181721 181797 182294 182754 182573 181773 181248 181740 182929 183913 184214 183932 183458 183447 184488 186330 187951
55416A87951Q66O93J281J946K455K987L169K472J429J047J181R21K70r4m95j825
$$ 187951 188817 189510 190791 192737 195192 198179 201348 203820 205249 206296 207477 208398 208668 208574 208079 206254
55400B06254l516l834k455j031q14j318j656j604j022J55J086O68o17j118m94
$$ 206254 202738 198904 196449 195418 194604 193286 191630 190026 189004 189159 190245 190913 190296 189178 188684
55385A88684m5m06p72q18j320k215k090n36Q22O44l71j027j297j446j105k93L9
$$ 188684 188639 188233 187461 186643 185323 183108 181018 180482 181304 181948 181577 180550 179253 177807 176702 176409 176448
55368A76448l69l65O71J586J246L23J9L11N69Q18J111Q09l26j258j111m45j02
$$ 176448 176079 175714 176385 177971 179217 179540 179559 179870 180439 181257 182368 183177 182851 181593 180482 180037 179935
55351A79935J60O88P88r0r79o59M37J005Q39O26L82m33j489j725q73K66J011J314
$$ 179935 180095 180783 181571 181481 180502 179843 180280 181285 182124 182750 183132 182699 181210 179485 178612 178878 179889 181203
55333A81203J245Q27M26N26J022J233O88m28j456j681q85L20R86Q51M70K65O4
$$ 181203 182448 183275 183701 184227 185249 186482 187170 186742 185286 183605 182720 183040 184026 184877 185347 185612 185676
55316A85676l29p40j028j269j338r72l66k7L5J89L30Pn28n64k22l58r98j170m97
$$ 185676 185347 184607 183579 182310 180972 180000 179634 179607 179642 179831 180161 180168 179640 179076 178854 178496 177498 176328 175831
55297A75831K77P35J288J872J636N36k08M0M01J62k8M12P75L61k78m38m65o88
$$ 175831 176108 176843 178131 180003 181639 182175 181967 182007 182408 182570 182542 182954 183729 184090 183812 183374 182909 182221
55279A82221l89Q93K086J969J019N21N91L87k79p59o66k13K84M94K26j01K52J099
$$ 182221 181832 182725 184811 186780 187799 188320 188911 189298 189019 188260 187594 187381 187665 188159 188385 188284 188536 189635
55261A89635J367Q64O89J229J193k43j734j617l34M96M70K94J75j16j40O02J453
$$ 189635 191002 191866 192555 193784 194977 194734 193000 191383 191049 191545 192015 192309 192484 192368 192228 192830 194283
55244A94283J406P17L58L64O6m68o24n07o63q54n00K4j71r71j476j531j674j801
$$ 194283 195689 196406 196764 197128 197194 196726 196102 195595 194932 194078 193578 193602 193431 192460 190984 189453 187779 185978
55226A85978j267k44L69M42P53J500J915J535Q39L84J86R9P1o0l27l00L09R52
$$ 185978 184711 184467 184836 185278 186031 187531 189446 190981 191820 192204 192390 192489 192560 192500 192173 191873 192182 193134
55208A93134R24M61K77K64k35j063j304o97J5K34R8j31l69l84L1N23O08N42Q90
$$ 193134 194058 194519 194796 195060 194825 193762 192458 191761 191776 192010 192108 191977 191608 191224 191255 191778 192386 192928 193818
55189A93818J338R55l04j337j318n97K2J35k65r64j413j144l71K30L69K62L6k92
$$ 193818 195156 196111 195807 194470 193152 192555 192577 192712 192447 191483 190070 188926 188555 188785 189154 189416 189452 189160
55171A89160m15J8P58J233J420J770K317K600K477K304K205J906J381J046J100
$$ 189160 188745 188763 189521 190754 192174 193944 196261 198861 201338 203642 205847 207753 209134 210180 211280
55156B11280J252J234J086Q92N95K28j17n05j041j552j768j757j744j691j364
$$ 211280 212532 213766 214852 215744 216339 216567 216450 215945 214904 213352 211584 209827 208083 206392 205028
55141B05028p59j30K36Q6o92j672k040j532q06n00m25j50J72J73K9N8R0j84n21
$$ 205028 204269 204139 204375 204461 203769 202097 200057 198525 197719 197219 196794 196644 196816 196989 197018 197076 197166 196982 196461
55122A96461n32l76l41j60M82J182J283Q30L32k0j91J31R93J700J713J534J732
$$ 196461 195929 195553 195212 195052 195534 196716 197999 198829 199161 199141 198950 199081 200074 201774 203487 205021 206753
55105B06753J746P60p26j496j385j169r40r0J130J593R51J19k15l11m11k15K96
$$ 206753 208499 209259 208533 207037 205652 204483 203543 203453 204583 206176 207127 207246 207031 206720 206309 206094 206390
55088B06390N12J57l17n79q16j050r33m96k66k85RO94J002N40k6o0O6l10j033
$$ 206390 206902 207059 206742 206163 205347 204297 203364 202868 202602 202317 202326 203020 204022 204562 204536 204476 204542 204232 203199
55069B03199j382j086m90j5K00K26K68M76P71R64R58O91N7p17r53k67P12R38J68
$$ 203199 201817 200731 200241 200226 200426 200652 200920 201396 202167 203131 204089 204780 204837 204120 203167 202900 203612 204550 204718
55050B04718r24j640j752j346p38l51j54M80J668K314J443j93r02k69N99Q88Q99
$$ 204718 203794 202154 200402 199056 198318 197967 197813 198293 199961 202275 203718 203525 202623 202354 202953 203841 204740
55033B04740J044J171J186J277J267P50O7R2P62R17j0j220j873k090k046j316
$$ 204740 205784 206955 208141 209418 210685 211435 211502 211594 212356 213273 213263 212043 210170 208080 206034 204718
55017B04718J32J172Q62r9k25P77J798J830R73l2n91n91l47l42p64j287j396q92
$$ 204718 204850 206022 206884 206785 206560 207337 209135 210965 211938 211906 211315 210724 210377 210035 209271 207984 206588 205696
54999B05696k2P56J172J361J627J873J592O81j44j36N50J188J412J270P27j57
$$ 205696 205674 206430 207602 208963 210590 212463 214055 214736 214592 214456 215006 216194 217606 218876 219603 219446
54983B19446q34q11l93j70j46o6k48j032j748j382j57P44R74J274J899K167J825
$$ 219446 218612 217801 217408 217238 217092 217026 216778 215746 213998 212616 212459 213203 214177 215451 217350 219517 221342
54966B21342J559J701J689J254J011J237J215M97j43J07Q31J109Q51O50Q40J361
$$ 221342 222901 224602 226291 227545 228556 229793 231008 231505 231362 231469 232300 233409 234260 234910 235750 237111
54950B37111K030K432K030Q58k93q25q68o50kJ060J942K252K387K877L668M467
$$ 237111 239141 241573 243603 244461 244168 243343 242475 241825 241823 242883 244825 247077 249464 252341 256009 260476
54934B60476N206N866O359O960Q161R799J1079J1719J2216J2514J1496Q519M575
$$ 260476 265682 271548 277907 284867 293028 302827 313906 325625 337841 350355 361851 370370 374945
54921C74945J076j770m515p109q993j0064j0578j0469r558q297p471p259p125
$$ 374945 376021 374251 369736 362627 353634 343570 332992 322523 312965 304668 297197 289938 282813
54908B82813o499n209l527k218k042k777l189k442j090j42K44N47R27J252J614
$$ 282813 276314 271105 267578 265360 263318 260541 257352 254910 253820 253678 253922 254469 255396 256648 258262
54893B58262K135K608L024L994N844P778Q787R076R660J0768J1600J1546J0665
$$ 258262 260397 263005 266029 270023 275867 283645 292432 301508 311168 321936 333536 345082 355747
54880C55747Q969O202K630q14l541n914q413j0648j1664j1098r637q380p842p670
$$ 355747 364716 370918 373548 372734 369193 363279 354866 344218 332554 321456 311819 303439 295597 287927
54866B87927p276o592o055n856n602m844l680k606j961j641j263n17L57O09j95
$$ 287927 280651 274059 268004 262148 256546 251702 248022 245416 243455 241814 240551 240034 240391 241000 240805
54851B40805j384j806j261o58o20o76k09M91O57M0r90j952k387k025j194p18r37
$$ 240805 239421 237615 236354 235696 235076 234400 234191 234682 235339 235379 234389 232437 230050 228025 226831 226113 225176
54834B25176j308j259r39o61k86K92O02L42J02N47J281J441J073J016J489J805
$$ 225176 223868 222609 221670 221009 220723 221015 221617 221959 222061 222608 223889 225330 226403 227419 228908 230713
54818B30713J495R13N34L37J55N0R8J69J68J80K76L94N37P70J023J058P62K97
$$ 230713 232208 233121 233655 233992 234147 234197 234295 234464 234632 234812 235088 235482 236019 236789 237812 238870 239632 239929
54800B39929o1j36O4L66O24Q52J030Q84K36m17k31Q51J848J974J641J770K493
$$ 239929 239868 239732 239796 240162 240786 241638 242668 243552 243788 243371 243140 243991 245839 247813 249454 251224 253717
54783B53717L166L398L431L615M054M860O217Q081J0010J1482J2304J2613J2584
$$ 253717 256883 260281 263712 267327 271381 276241 282458 290539 300549 312031 324335 336948 349532
54770C49532J2068J0654Q169M987J630j734m976p424q319p921p429p555p852p657
$$ 349532 361600 372254 380423 385410 387040 385306 380330 372906 364587 356666 349237 341682 333830 326173
54756C26173p040o356n605m761m206m205m373m206l807l519l221k533j514n74
$$ 326173 319133 312777 307172 302411 298205 294000 289627 285421 281614 278095 274874 272341 270827 270253
54742B70253J12O98J326K044K889L743M367M798N422O467P764R146J0536J1466
$$ 270253 270365 271063 272389 274433 277322 281065 285432 290230 295652 302119 309883 319029 329565 341031
54728C41031J1280J0084Q779P649N710K187k150n884q550j0469j1558j1503j0779
$$ 341031 352311 362395 371174 378823 384533 386720 384570 378686 370136 359667 348109 336606 325827
54715C25827j0351j0329r839q349o411m946m373m490m708m351l267k135j816k345
$$ 325827 315476 305147 295308 286959 280548 275602 271229 266739 262031 257680 254413 252278 250462 248117
54701B48117k960k942k164r72Q5N54M57K19M0l08q30r28j89R26J630J631J036
$$ 248117 245157 242215 240051 239079 239164 239718 240175 240394 240434 240126 239296 238368 238179 239105 240735 242366 243402
54684B43402m2j207j631r51J49P68Q29O59J73p03j289q23M09J424J674J148r2
$$ 243402 243360 242153 240522 239571 239720 240488 241317 241976 242149 241446 240157 239334 239743 241167 242841 243989 243897
54667B43897j511j847m86J241J497M17j71N34J371J170J99p43j403j647j130q5
$$ 243897 242386 240539 240053 241294 242791 243208 243037 243571 244942 246112 246311 245568 244165 242518 241388 241303
54651B41303M49kn12n4J004J500J094M84K62L13L21K95M16O33O46K65k34l41j
$$ 241303 241752 241750 241238 241184 242188 243688 244782 245266 245528 245841 246162 246457 246873 247506 248152 248417 248183 247842 247841
54632B47841J59m25j484k279k436k106j447n84J73O19J015J596J869J172j74j033
$$ 247841 248000 247575 246091 243812 241376 239270 237823 237239 237412 238031 239046 240642 242511 243683 243509 242476
54616B42476q79k68J65M19O45P24O49O97Q83P80K50j65j3L82L83n8m06k67J75
$$ 242476 241597 241329 241494 241913 242558 243282 243931 244628 245511 246291 246541 246376 246363 246745 247128 247070 246664 246397 246572
54597B46572M72M50M18P63J298J302M35o75j125q27m03k36j37R0K91K31j40o58
$$ 246572 247044 247494 247912 248675 249973 251275 251710 251035 249910 249083 248680 248444 248307 248397 248688 248919 248779 248121
54579B48121q79l20Q50J662J435O91L12K65l6m09j08P04R18J69m90p2J005J625
$$ 248121 247242 246922 247772 249434 250869 251560 251872 252137 252101 251692 251584 252288 253206 253375 252885 252813 253818 255443
54561B55443J323M76l93r05p88j7J083J992K217J583N49J9L10O21J05q68j334
$$ 255443 256766 257242 256849 255944 255156 255139 256222 258214 260431 262014 262563 262582 262892 263513 263618 262750 261416
54544B61416j274j425j753j358j08R35J106J000J190J218N66k35l83%K50K82N26
$$ 261416 260142 258717 256964 255606 255498 256433 257539 258539 259729 260947 261513 261278 260895 260895 261145 261427 261953
54527B61953J087J627J867J745J325Q66O77O78M45q3m77n89p84j133j087m29J45
$$ 261953 263040 264667 266534 268279 269604 270470 271147 271825 272270 272187 271710 271121 270337 269204 268117 267688 267833
54510B67833k2n98q73p37m93k02J14Q8m26p85k93P03J159O74j45n56l82R8N33
$$ 267833 267811 267213 266340 265603 265110 264908 265022 265110 264684 263899 263606 264309 265468 266142 265997 265441 265059 265157 265690
54491B65690O69N11K75J12jN7N24J271J734J669J509J593J499P26l14o31O6J035
$$ 265690 266359 266870 267145 267257 267256 267313 267837 269108 270842 272511 274020 275613 277112 277838 277524 276893 276959 277994
54473B77994J416J107O36N18Q43J322J616J596J254N82k00n85l60p7l37p68n12
$$ 277994 279410 280517 281153 281671 282514 283836 285452 287048 288302 288884 288684 288099 287739 287662 287325 286557 286045
54456B86045K69M14m90j367j221m84o2J09N89J133R59L0r02j406j696j921j911
$$ 286045 286314 286728 286238 284871 283650 283166 283104 283213 283802 284935 285894 285924 285022 283616 281920 279999 278088
54439B78088j623j188n32M07J137R80M5p36p06j25L99O54P61Q03P76P12O41N85
$$ 278088 276465 275277 274745 275152 276289 277269 277314 276578 275872 275747 276146 276800 277561 278364 279140 279852 280493 281078
54421B81078O22Q62J282J676J763J349N14l46q16r17j028j285j379j070n16P9
$$ 281078 281700 282562 283844 285520 287283 288632 289146 288800 287984 287067 286039 284754 283375 282305 281789 281868
54405B81868P61J455J682J063j13j215j853j904j319l18N13Q11Q31R19Q95N22
$$ 281868 282629 284084 285766 286829 286716 285501 283648 281744 280425 280107 280620 281431 282262 283181 284076 284598
54389B84598K07N69J437J956J702J022L46k88q54j137j159j286j652j822j357
$$ 284598 284805 285374 286811 288767 290469 291491 291837 291549 290695 289558 288399 287113 285461 283639 282282
54374B82282m12M55Q57P87M71K21K76N32N80J95k71k14N46J560K206K216J693
$$ 282282 281870 282325 283182 283969 284440 284661 284937 285469 286049 286244 285973 285759 286305 287865 290071 292287 293980
54357B93980Q66M6l66j32M52P08K87m75j026j209j188j022o75k96r8k9O2O9k06
$$ 293980 294846 294892 294526 294394 294846 295554 295841 295366 294340 293131 291943 290921 290246 289950 289852 289823 289885 289954 289748
54338B89748n71o15l59k53n13q27q30m81N4M95M85m7n66m86o3r9p60j304j176
$$ 289748 289177 288562 288203 287950 287437 286610 285780 285299 285353 285848 286333 286286 285720 285234 285171 285072 284312 283008 281832
54319B81832o93m17m46n75o07k46P04J812K265J945J576J573J430P51R8K19R90
$$ 281832 281139 280722 280276 279701 279094 278848 279552 281364 283629 285574 287150 288723 290153 290904 291002 291221 292211
54302B92211J715J958J568N23p07j161n01L76M83J0k83l91q70j695k240k258k007
$$ 292211 293926 295884 297452 297975 297268 296107 295606 295982 296465 296475 296192 295801 294931 293236 290996 288738 286731
54285B86731j551q19k02k21n42k62O41R90k1j593k210j371k9N99K40l91n12o8
$$ 286731 285180 284361 284159 283938 283396 283134 283775 284765 284744 283151 280941 279570 279541 280140 280380 279989 279477 279409
54267B79409M07M56Q9m19p41n70O1N27J96n69o31M11J575J757J048L00j05l52
$$ 279409 279816 280272 280361 279942 279201 278631 278692 279219 279415 278846 278215 278626 280201 281958 283006 283306 283201 282849
54249B82849n09m89m09m25m07k77l63q88j429j496j296j251j164o08Q9J50l58
$$ 282849 282340 281851 281442 281017 280610 280333 279970 279082 277653 276157 274861 273610 272446 271838 271927 272077 271719
54232B71719m30M94J747K279J820R82N32P64J306J560J335R40O00J95j82m1P06
$$ 271719 271289 271783 273530 275809 277629 278611 279143 279907 281213 282773 284108 285048 285648 285843 285661 285620 286326
54215B86326J234Q25j22p49j019j476j962j681m87P16J047M66n55j519j939j578
$$ 286326 287560 288385 288263 287514 286495 285019 283057 281376 280889 281605 282652 283118 282563 281044 279105 277527
54199B77527q74o06r22j174p98M2P89J102J004P36N06K08m34j244j488q32JJ76
$$ 277527 276653 276047 275125 273951 273153 273195 273984 275086 276090 276826 277332 277540 277106 275862 274374 273542 273543 273719
54181B73719o8O3M76K46q62j890j938j145j71N98R99Q67L30l4K65J044J597J310
$$ 273719 273651 273714 274190 274436 273574 271684 269746 268601 268430 269028 270027 270894 271224 271190 271455 272499 274096 275406
54163B75406J82j090j602j089k07K69K79J63j03p47j511j694r82K53J341J710
$$ 275406 275588 274498 272896 271807 271600 271869 272148 272311 272208 271461 269950 268256 267274 267527 268868 270578
54147B70578J096j23j004r59m17r8l0J68M46N97R66K013L281L800L398K797K486
$$ 270578 271674 271551 270547 269588 269171 269073 269043 269211 269657 270254 271220 273233 276514 280314 283712 286509 288995
54130B88995K409K585L052L212K272M76j092j931k340k235j034R21K189K026J321
$$ 288995 291404 293989 297041 300253 302525 303001 301909 299978 297638 295403 294369 295290 297479 299505 300826
54115C00826J082J037N22j75l31J8K33P4k15m95p16o99m43l46o24q26m69J52L22
$$ 300826 301908 302945 303467 303292 302961 302979 303212 303286 303071 302576 301860 301161 300718 300372 299748 298922 298453 298605 298927
54096B98927j32o98r08p83o42o76p28m52J54M79k9r97j397p92K19Q81J009P30
$$ 298927 298795 298097 297189 296406 295764 295088 294360 293908 294062 294541 294512 293515 292118 291326 291545 292426 293435 294165
54078B94165J48m29n17o8M04N49N97P49P09J64o70j351j704j774j561j131o14
$$ 294165 294313 293884 293367 293299 293703 294252 294849 295598 296307 296471 295801 294450 292746 290972 289411 288280 287666
54061B87666l4O08J036R14M49K23M50P65Q76Q05N41J6m60m47j8M30R65J862K598
$$ 287666 287632 288240 289276 290190 290639 290862 291312 292077 292953 293758 294299 294315 293855 293408 293390 293820 294785 296647 299245
54042B99245K213Q85J2L75J182J483J427J560J842K070K470L110L524L572L842
$$ 299245 301458 302343 302355 302730 303912 305395 306822 308382 310224 312294 314764 317874 321398 324970 328812
54027C28812M503M630L587K270J883K183K068J413J120J569K172K398K319K157
$$ 328812 333315 337945 341532 343802 345685 347868 349936 351349 352469 354038 356210 358608 360927 363084
54013C63084J963J799J616J113K79k66r2K36j03r26j370j274j249j479j332m21
$$ 363084 365047 366846 368462 369575 369854 369588 369496 369732 369629 368703 367333 366059 364810 363331 361999 361578
53997C61578P62J550J941K400L245M458N889P465R299J1671J4779J8668K3370
$$ 361578 362340 363890 365831 368231 371476 375934 381823 389288 398587 410258 425037 443705 467075
53984D67075K8893L4869M0505M4858M6736M4334L5898K1560M138j2454k5529l4299
$$ 467075 495968 530837 571342 616200 662936 707270 743168 764728 768866 756412 730883 696584
53972F96584l9019m0241l8748l5475l1331k7217k3789k1037j8431j5836j3724
$$ 696584 657565 617324 578576 543101 511770 484553 460764 439727 421296 405460 391736
53961C91736j2231j0631q323n737l715k512j915j807j897j519m24O19P83K85k02
$$ 391736 379505 368874 360551 354814 351099 348587 346672 344865 342968 341449 341025 341644 342427 342712 342510
53946C42510o34j233j563r85K28J236J830K392K948L196L346L844M450M488L963
$$ 342510 341876 340643 339080 338095 338323 339559 341389 343781 346729 349925 353271 357115 361565 366053 370016
53931C70016L456K998K112R19J65J6k08q36j329j197o55j25K71M81M93O14J153
$$ 370016 373472 376470 378582 379501 379666 379682 379474 378638 377309 376112 375457 375332 375603 376084 376577 377191 378344
53914C78344J770J914J874K467L597M167L678K955K860L221L475L541L433K836
$$ 378344 380114 382028 383902 386369 389966 394133 397811 400766 403626 406847 410322 413863 417296 420132
53900D20132J735Q68Q23J069N88q13k359l221l135k343j423j046j503k475l368
$$ 420132 421867 422735 423558 424627 425215 424402 422043 418822 415687 413344 411921 410875 409372 406897 403529
53885D03529l790l671l234k966l236l809m018l543k726k044j657j622k019k600
$$ 403529 399739 396068 392834 389868 386632 382823 378805 375262 372536 370492 368835 367213 365194 362594
53871C62594k747k147j288r38j265j799k042j881j502j120q65q22j044j437j681
$$ 362594 359847 357700 356412 355474 354209 352410 350368 348487 346985 345865 345000 344178 343134 341697 340016
53856C40016j493j000n81l47j55k06r00j795j554L27K432K994K098J205R34O43
$$ 340016 338523 337523 336942 336595 336440 336234 335334 333539 331985 332312 334744 337738 339836 341041 341975 342618
53840C42618O9j06L62O47J76n08p66q31j048j048m66J95K58p2l4O17J435J868
$$ 342618 342687 342581 342943 343590 343766 343258 342492 341661 340613 339565 339099 339294 339552 339480 339446 340063 341498 343366
53822C43366J555N26n44o80K27J196J449J382J639J967J856J725K379L543M160
$$ 343366 344921 345447 344903 344223 344450 345646 347095 348477 350116 352083 353939 355664 358043 361586 365746
53807C65746M124M645O565R258J1686J3879J6764K0886K5905L1098L5704L8588
$$ 365746 369870 374515 381080 390338 402024 415903 432667 453553 479458 510556 546260 584848
53795E84848L8084L2766K2698R836k867j2901j8987k1057j9999j7319j4396j1701
$$ 584848 622932 655698 678396 688232 685365 672464 653477 632420 612421 595102 580706 569005
53783E69005q879n708k700p10k89j504l959o819r191j0850j2221j3422j3857j3122
$$ 569005 560126 554418 551718 551008 550719 549215 545256 538437 529246 518396 506175 492753 478896 465774
53769D65774j1818j0898j0441r780q637p440o508n559m373l421l435m414n387
$$ 465774 453956 443058 432617 422837 414200 406760 400252 394693 390320 386899 383464 379050 373663
53756C73663n202l620j619n41p91j497j612j133r41j523k288k277j231K72J457
$$ 373663 368461 364841 363222 362681 361890 360393 358781 357648 356707 355184 352896 350619 349388 349660 351117
53741C51117J892J554P29j39o92r02r57r03n57R7O95Q47O71N96P81R99J110J264
$$ 351117 353009 354563 355292 355153 354461 353559 352602 351699 351142 351239 351934 352781 353452 354048 354829 355828 356938 358202
53723C58202J546J780J876J999K192K189J911J708J754J643J095O95J217K478
$$ 358202 359748 361528 363404 365403 367595 369784 371695 373403 375157 376800 377895 378590 379807 382285
53709C82285L564M106M566N289N984O273O050N161L452J449K08J48N63O81O83
$$ 382285 385849 389955 394521 399810 405794 412067 418117 423278 426730 428179 428387 428535 429098 429779 430462
53694D30462J124J870K272K102J729J454J229R76Q01P54P22O27O05R13J626K417
$$ 430462 431586 433456 435728 437830 439559 441013 442242 443218 444019 444773 445495 446122 446727 447640 449266 451683
53678D51683K669K061J020L20K09K61J38J7J01J33j92o45p52m90l19n45r53j143
$$ 451683 454352 456413 457433 457753 457962 458223 458361 458378 458479 458612 458420 457775 457023 456533 456214 455669 454716 453573
53660D53573j023q94j047j404j641j600j374r45j28Q68J210M17q11j328j072r94
$$ 453573 452550 451656 450609 449205 447564 445964 444590 443645 443517 444385 445595 446012 445201 443873 442801 441807
53644D41807j564k171k245k059j983j744r91o8M79P08R89J223J001L98L3L53J181
$$ 441807 440243 438072 435827 433768 431785 430041 429050 428982 429461 430169 431158 432381 433382 433780 433813 434166 435347
53627D35347J879J824R61R4K68J565K868L165K699K441K816L445L824L744L268
$$ 435347 437226 439050 440011 440105 440373 441938 444806 447971 450670 453111 455927 459372 463196 466940 470208
53612D70208K756K743L319L870L811L382L231L511L892M234M623M919M884M629
$$ 470208 472964 475707 479026 482896 486707 490089 493320 496831 500723 504957 509580 514499 519383 524012
53598E24012M465M318L889L301L027L168L351L313L060K464J323J5o39l38K78
$$ 524012 528477 532795 536684 539985 543012 546180 549531 552844 555904 558368 559691 559706 559067 558729 559007
53583E59007N02L74L12L28O2n91j325j847k151k349k432k290j943j669j784k267
$$ 559007 559509 559883 560195 560523 560585 559994 558669 556822 554671 552322 549890 547600 545657 543988 542204 539937
53567E39937k672k568j986j330r59r92j398j997k357k023r69K72J056J183R61
$$ 539937 537265 534697 532711 531381 530422 529430 528032 526035 523678 521655 520686 520958 522014 523197 524158
53552E24158Q13Q07P11M48L65P64J327J480J307J562K567L592L803L453L486M208
$$ 524158 524971 525778 526489 526937 527302 528066 529393 530873 532180 533742 536309 539901 543704 547157 550643 554851
53536E54851M950N060M661M307M312M601M995N457O159P283Q607R483R512R206
$$ 554851 559801 564861 569522 573829 578141 582742 587737 593194 599353 606636 615243 624726 634238 643444
53522F43444R610J1149J3149J4580J5025J4910J5004J5819J7304J8945K0275K1385
$$ 643444 653054 664203 677352 691932 706957 721867 736871 752690 769994 788939 809214 830599
53510H30599K2887K5323K8552L1739L3988L5157L6041L7497L9398M0707M0599
$$ 830599 853486 878809 907361 939100 973088 1008245 1044286 1081783 1121181 1161888 1202487
53499A202487L9142L6819L3918L0799K8170K6450K5171K3755K2635K2810K4214
$$ 1202487 1241629 1278448 1312366 1343165 1371335 1397785 1422956 1446711 1469346 1492156 1516370
53488A516370K5505K5712K5335K5350K5732K5684K4941K4024K3307K2496K1278
$$ 1516370 1541875 1567587 1592922 1618272 1644004 1669688 1694629 1718653 1741960 1764456 1785734
53477A785734J9974J9215J9205J9649K0178K0564K0550J9849J8425J6556J4483
$$ 1785734 1805708 1824923 1844128 1863777 1883955 1904519 1925069 1944918 1963343 1979899 1994382
53466A994382J2155R521O819M298J739j331m970q644j1830j4425j6544j8272j9752
$$ 1994382 2006537 2016058 2022877 2027175 2028914 2027583 2022613 2013969 2002139 1987714 1971170 1952898 1933146
53453A933146k1210k2682k4002k5228k6734k8625l0389l1480l1938l2128l2124
$$ 1933146 1911936 1889254 1865252 1840024 1813290 1784665 1754276 1722796 1690858 1658730 1626606
53442A626606l1834l1451l1226l0912l0016k8643k7471k6758k5846k4048k1610
$$ 1626606 1594772 1563321 1532095 1501183 1471167 1442524 1415053 1388295 1362449 1338401 1316791
53431A316791j9389j7644j5652j2722r281o581n205m239k256J015M501P266R602
$$ 1316791 1297402 1279758 1264106 1251384 1242103 1235522 1230317 1226078 1223822 1224837 1229338 1236604 1246206
53418A246206J2299J5334J7890J9490K0543K1699K3168K4773K6335K7750K8975
$$ 1246206 1258505 1273839 1291729 1311219 1331762 1353461 1376629 1401402 1427737 1455487 1484462
53407A484462L0204L1838L4054L6445L8368L9673M0925M2754M5218M8018N1120
$$ 1484462 1514666 1546504 1580558 1617003 1655371 1695044 1735969 1778723 1823941 1871959 1923079
53396A923079N4684N8357O1291O3238O5112O7801P0835P2941P3837P4519P5808
$$ 1923079 1977763 2036120 2097411 2160649 2225761 2293562 2364397 2437338 2511175 2585694 2661502
53385B661502P7398P8617P9256P9251P8314P6361P3811P0946O7556O3609N9735
$$ 2661502 2738900 2817517 2896773 2976024 3054338 3130699 3204510 3275456 3343012 3406621 3466356
53374C466356N6498N3698N0821M7696M4254M0322L6220L2914L0694K8349K4360
$$ 3466356 3522854 3576552 3627373 3675069 3719323 3759645 3795865 3828779 3859473 3887822 3912182
53363C912182J8497J1244K348q815k1667l4523m6335n7133o6721p4089p8695q1310
$$ 3912182 3930679 3941923 3944271 3935456 3913789 3879266 3832931 3775798 3709077 3634988 3556293 3474983
53351C474983q3021q4095q4318q3823q3024q2129q1153q0161p9190p8216p7450
$$ 3474983 3391962 3307867 3223549 3139726 3056702 2974573 2893420 2813259 2734069 2655853 2578403
53340B578403p7225p7444p7392p6421p4551p2289p0025o7722o4989o1470n7330
$$ 2578403 2501178 2423734 2346342 2269921 2195370 2123081 2053056 1985334 1920345 1858875 1801545
53329A801545n3188m9329m5380m1080l7021l3822l0957k7381k3261j9980j8195
$$ 1801545 1748357 1699028 1653648 1612568 1575547 1541725 1510768 1483387 1460126 1440146 1421951
53318A421951j6964j5252j3296j1784j0505q785o706m966l717k393o92R85K248
$$ 1421951 1404987 1389735 1376439 1364655 1354150 1345365 1338659 1333693 1329976 1327583 1326891 1327876 1330124
53305A330124L306M551N894O874P346P814Q960J0964J3430J5947J8433K0910K3260
$$ 1330124 1333430 1337981 1343875 1350749 1358095 1365909 1374869 1385833 1399263 1415210 1433643 1454553 1477813
53292A477813K5462K7675K9857L1627L2904L4297L6241L8157L9131L9171L8953
$$ 1477813 1503275 1530950 1560807 1592434 1625338 1659635 1695876 1734033 1773164 1812335 1851288
53281A851288L8515L7219L5072L3031L1690L0512K8810K6712K4696K2875K1144
$$ 1851288 1889803 1927022 1962094 1995125 2026815 2057327 2086137 2112849 2137545 2160420 2181564
53270B181564J9447J7423J4406J0347O167K664n03m201q619j3263j7816k2355
$$ 2181564 2201011 2218434 2232840 2243187 2249354 2252018 2251515 2247314 2238695 2225432 2207616 2185261
53258B185261k6928l1393l5499l8849m1049m2308m3546m5443m7623m9192m9809
$$ 2185261 2158333 2126940 2091441 2052592 2011543 1969235 1925689 1880246 1832623 1783431 1733622
53247A733622m9730m9073m7669m5634m3536m1839m0521l9331l8293l7787l8149
$$ 1733622 1683892 1634819 1587150 1541516 1497980 1456141 1415620 1376289 1337996 1300209 1262060
53236A262060l9201m0194m0414l9755l8581l7240l6005l5158l4515l3057k9887
$$ 1262060 1222859 1182665 1142251 1102496 1063915 1026675 990670 955512 920997 887940 858053
53225H58053k5567k1671j8958j6862j4987j3819j3481j2958j1533j0046r647j0025
$$ 858053 832486 810815 791857 774995 760008 746189 732708 719750 708217 698171 688524 678499
53213F78499j0087r797j0004j0787j1280j1130j0818j0462r542q131p243p403
$$ 678499 668412 658615 648611 637824 626544 615414 604596 594134 584592 576461 569218 561815
53201E61815p827p635p074o822o703o020m862m180m542n375n728n304m588m129
$$ 561815 553988 546353 539279 532457 525754 519734 514872 510692 506150 500775 495047 489743 485155 481026
53187D81026m054m170m285m320m267m232m365m550m285l297k163j769k093k141
$$ 481026 476972 472802 468517 464197 459930 455698 451333 446783 442498 439201 437038 435269 433176 431035
53173D31035j416p04q79j508j462n84J94L10K52O32J304J717J662J347J055R53
$$ 431035 429619 428915 428036 426528 425066 424482 424676 424986 425238 425870 427174 428891 430553 431900 432955 433908
53157D33908R82Q02J54o73j046p14l2N99J093J414J346P93K5n93r42j115j212
$$ 433908 434890 435692 435846 435173 434127 433413 433381 433980 435073 436487 437833 438626 438651 438058 437116 436001 434789
53140D34789j265j267j164r99r94j259j495j263o54k81n40j182j719j947j898
$$ 434789 433524 432257 431093 430094 429100 427841 426346 425083 424429 424148 423608 422426 420707 418760 416862
53125D16862j623j250r81q49o39k86o4j40j51L99J376K039J863J079K89k06n26
$$ 416862 415239 413989 413008 412159 411520 411234 411170 411030 410879 411278 412654 414693 416556 417635 417924 417718 417192
53108D17192q22j036j123j226j536j976k206j984j387p48l84l55m19k64N6J06
$$ 417192 416370 415334 414211 412985 411449 409473 407267 405283 403896 403148 402764 402409 401990 401726 401782 401888
53092D01888l02o39j89R11J725J703J328J284J422J048pj194j985k276k094j383
$$ 401888 401586 400947 400758 401669 403394 405097 406425 407709 409131 410179 410172 408978 406993 404717 402623 401240
53076D01240l40M80O59L43n2l59o80r77r69n43jK81L40M46M95N5p84j113m11M78
$$ 401240 400900 401380 402039 402382 402330 401971 401291 400314 399345 398802 398801 399082 399422 399868 400363 400418 399634 398521 398110 398588
53056C98588K64r08j492o28P13J124N14j61l14p4L59Q67J159J035Q61J111J585
$$ 398588 398852 397944 396452 395824 396537 397661 398175 398014 397700 397626 397985 398852 400011 401046 401907 403018 404603
53039D04603J658J228P97N64J60o50j480j769j386o88k45m25r67j082l90L96L26
$$ 404603 406261 407489 408286 408850 409010 408360 406880 405111 403725 403037 402792 402367 401400 400318 399928 400324 400650
53022D00650m71r78p78n37q22j217j026l48R5j49q61j479j526q97LO09P42O68
$$ 400650 400179 399201 398423 397886 397064 395847 394821 394473 394568 394419 393558 392079 390553 389656 389659 390268 391010 391678
53004C91678O28O45P67J075J346J137M19k58m26j78J80N28P08L99l77r95p99J76
$$ 391678 392306 392951 393718 394793 396139 397276 397695 397437 397011 396833 397013 397541 398249 398648 398271 397276 396477 396653
52986C96653J386K350K757K396J402L74k07n00q60j089p20L4L17j73o48k09R78
$$ 396653 398039 400389 403146 405542 406944 407318 407111 406611 405751 404662 403942 403976 404293 404120 403472 403263 404241
52969D04241J921K029J605J199R66Q03P33P73O38K6q09j162o90J47O94P83N92
$$ 404241 406162 408191 409796 410995 411961 412764 413497 414270 414908 414934 414125 412963 412273 412420 413114 413897 414489
52952D14489J30o89j533j819j425q71n97n09m08n05j051j739j918j464r19p30
$$ 414489 414619 413930 412397 410578 409153 408282 407685 407176 406768 406263 405212 403473 401555 400091 399172 398442
52936C98442o80m17j52m03j091j485j150n10j89j69q3J0j86m76l05K77N35J24
$$ 398442 397762 397345 397193 396790 395699 394214 393064 392554 392365 392196 392113 392123 391937 391461 391156 391433 391968 392092
52918C92092l54k74J67L97K97Q0j79l94k63K39N78L68j5j09k28q15j392j123j75
$$ 392092 391738 391464 391631 392028 392325 392405 392226 391832 391569 391808 392386 392754 392739 392630 392402 391587 390195 389072 388897
52899C88897M60M43L69N24M41K1K8R60K184K727K387J529L40j057k194k575k269
$$ 388897 389357 389800 390169 390693 391134 391155 391183 392143 394327 397054 399441 400970 401310 400253 398059 395484 393215
52882C93215j779j411j003k38R33J991K072Q78p11j458j181p71p83q16n05k02
$$ 393215 391436 390025 389022 388784 389717 391708 393780 394658 393947 392489 391308 390537 389754 388938 388433 388231
52866C88231k35k54K6J46k77o52j59R28J553J284O76K67ll71q33j308j757k052
$$ 388231 387996 387742 387768 387914 387637 386985 386826 387754 389307 390591 391267 391534 391531 391160 390327 389019 387262 385210
52848C85210k053j806j426q69j40M68O99Q11J258J966K362K035J126R5n38m59
$$ 385210 383157 381351 379925 379056 378916 379384 380083 380894 382152 384118 386480 388515 389641 389736 389198 388739
52832C88739L0J27m93j029n25O16R47j27j544j964j334o11m24n58n22o0Q25J969
$$ 388739 388769 388896 388403 387374 386849 387465 388412 388285 386741 384777 383443 382832 382408 381850 381328 381268 382093 384062
52814C84062L148M268N543P210R075J0422J0411Q573N102Q26l125n902p350p894
$$ 384062 387210 391478 397021 404231 413306 423728 434139 442712 447814 448640 445515 439613 432263 424369
52800D24369q017p919p638p295o935o247m821k900j484j315j913k130j593r56
$$ 424369 416352 408433 400795 393500 386565 380318 375497 372597 371113 369798 367885 365755 364162 363206
52786C63206p20n02J24O99N42q4k35L15P29L09n50j004q52n73m43j59O39J743
$$ 363206 362486 361984 362108 362807 363349 363265 363030 363345 364074 364383 363833 362829 361977 361404 360961 360802 361441 363184
52768C63184K484K453J907J420J213J049P11L36J37P5L1M4J72K10l4l72m21j12
$$ 363184 365668 368121 370028 371448 372661 373710 374421 374757 374894 374969 375000 375044 375216 375426 375392 375020 374599 374487
52750C74487K93O93J267J996K432K168J360N91K73L07L16R0j91k27k5J15O2N0
$$ 374487 374780 375473 376740 378736 381168 383336 384696 385287 385560 385867 386183 386273 386082 385855 385830 385945 386007 386057
52732C86057K17K74J2r0O60K039K907K549J595J151J365J405P10k95p91m31N33
$$ 386057 386274 386548 386560 386470 387130 389169 392076 394625 396220 397371 398736 400141 400851 400556 399765 399334 399867
52715C99867J570K110J761P05l01o77o75j021j922k817l143k970k731k625k537
$$ 399867 401437 403547 405308 406013 405712 405035 404360 403339 401417 398600 395457 392487 389756 387131 384594
52700C84594k288j729q38R1N48L70L4P1M25O65N50P8p10j452j366j20J382J939
$$ 384594 382306 380577 379739 379830 380378 380748 380782 380853 381278 381943 382493 382571 381861 380409 379043 378923 380305 382244
52682C82244J672J788K643L120K368J083L24l9o79j263p76P68K037K027J135M03
$$ 382244 383916 385704 388347 391467 393835 394918 395242 395203 394524 393261 392485 393253 395290 397317 398452 398855
52666C98855L25O99J131J274R53L28k36n62p57q63o79l9R49J997K795L094K877
$$ 398855 399180 399879 401010 402284 403237 403565 403329 402767 402010 401147 400468 400429 401378 403375 406170 409264 412141
52649D12141K427K029J638J080N24L42N20N47L9p61j284j272r65p74p93o82q8
$$ 412141 414568 416597 418235 419315 419839 420181 420701 421248 421287 420526 419242 417970 417005 416231 415438 414756 414668
52632D14668Q03J405J511J571J963K341K145J427N92m12j911l551m367l952k881
$$ 414668 415471 416876 418387 419958 421921 424262 426407 427834 428426 428014 426103 422552 418185 414233 411352
52617D11352j815q49p0O8n33j090q70k41j15o11j028j056j161j547j541n02J072
$$ 411352 409537 408688 408618 408686 408153 407063 406193 405952 405837 405226 404198 403142 401981 400434 398893 398391 399463
52600C99463J917J414K22n02k59N27J120J125O67J73J5K48O12Q19R09J143J536
$$ 399463 401380 402794 403016 402514 402255 402782 403902 405027 405694 405867 405882 406130 406742 407561 408470 409613 411149
52583D11149J733J428Q23L77K57K65K56L50O76J132J466J510J204N99j91j006
$$ 411149 412882 414310 415133 415510 415767 416032 416288 416638 417314 418446 419912 421422 422626 423225 423034 422028
52567D22028j645j804j262l18K05k11j067j378q67j37L80R10J593J884J264J10
$$ 422028 420383 418579 417317 416999 417204 416993 415926 414548 413681 413544 413924 414834 416427 418311 419575 419685
52551D19685p43j068j246j396j192n73L4L94P65J236J298N88l58o47j97K02jm97
$$ 419685 418942 417874 416628 415232 414040 413467 413501 413895 414660 415896 417194 417782 417424 416777 416580 416782 416781 416284
52533D16284p21n66k22K92R44J321R88J77k37L26J494K330K172J105j34o54j25
$$ 416284 415563 414997 414775 415067 416011 417332 418320 418497 418260 418586 420080 422410 424582 425687 425553 424899 424774
52516D24774Q85J467J475J676K611L654L647K289M29r89j743k085k159j972j632
$$ 424774 425659 427126 428601 430277 432888 436542 440189 442478 442907 441918 440175 438090 435931 433959 432327
52501D32327j316j119j131j477k060k405k049j092k11jm29r23q86j60Q96J720
$$ 432327 431011 429892 428761 427284 425224 422819 420770 419678 419467 419466 419037 418114 417228 417068 417964 419684
52485D19684J944J655J242J025J030J113J229J457J773J924J658J047N07M66J028
$$ 419684 421628 423283 424525 425550 426580 427693 428922 430379 432152 434076 435734 436781 437288 437754 438782
52470D38782J877K448K388J937J770K257K912K860J833M61n18j017j478k200l008
$$ 438782 440659 443107 445495 447432 449202 451459 454371 457231 459064 459525 459007 457990 456512 454312 451304
52455D51304l492l401k835k169j738j599j624j750j942k020j756j172n02J15O23
$$ 451304 447812 444411 441576 439407 437669 436070 434446 432696 430754 428734 426978 425806 425304 425419 426042
52440D26042Q05M42k47p64r76j153j321j181q65r90j601j754p65O82J417J271
$$ 426042 426847 427289 427042 426278 425302 424149 422828 421647 420782 419792 418191 416437 415672 416354 417771 419042
52424D19042R32P48N40L27K82O7p71j719j651m79M92L51j48K68J679L033L593
$$ 419042 419974 420722 421262 421589 421871 421938 421167 419448 417797 417318 417810 418161 418013 418281 419960 422993 426586
52407D26586L631L878M786O336Q161R882J1425J2837J3740J3331J1130P515L316
$$ 426586 430217 434095 438881 445217 453378 463260 474685 487522 501262 514593 525723 533238 536554
52394E36554q76m749p953j0067j0848j0379r060p517o240n221m144k922j773p40
$$ 536554 535678 530929 522976 512909 502061 491682 482622 475105 468865 463644 459500 456578 454805 454065
52380D54065L88J507K069J798J188R36J211J760K327K613K210J115M2k95o4j4
$$ 454065 454453 455960 458029 459827 461015 461951 463162 464922 467249 469862 472072 473187 473229 472934 472870 472856
52364D72856m24r02j148j321j490j305m76O80J569J956K030J893J396N61j34k06
$$ 472856 472432 471530 470382 469061 467571 466266 465790 466470 468039 469995 472025 473918 475314 475875 475741 475535
52348D75535J85L67L4l85m07j53P6N49J726L271M160L978L392L110L016K810K874
$$ 475535 475720 476087 476121 475736 475329 475176 475252 475801 477527 480798 484958 488936 492328 495438 498454 501264 504138
52331E04138L775N225O302O622O697P073P579P624O924N791M801M211L725L002
$$ 504138 507913 513138 519440 526062 532759 539832 547411 555035 561959 567750 572551 576762 580487 583489
52317E83489K344K440L343M222M538M856N862P065P367O756O462P263Q499R128
$$ 583489 585833 588273 591616 595838 600376 605232 611094 618159 625526 632282 638744 646007 654506 663634
52303F63634R114R195R768J0532J1050J1145J0782R956Q761P485O552O300O650
$$ 663634 672748 681943 691711 702243 713293 724438 735220 745176 753937 761422 767974 774274 780924
52290G80924P023O876O354O139O590P304P684P579P216O775O369O196O304O360
$$ 780924 787947 794823 801177 807316 813906 821210 828894 836473 843689 850464 856833 863029 869333 875693
52276H75693N994N381N076N265N483N224M563M025L979M308M589M468L989L573
$$ 875693 881687 887068 892144 897409 902892 908116 912679 916704 920683 924991 929580 934048 938037 941610
52262I41610L556L709L478K808K424K919L825M116L509K621J773N01j256k276
$$ 941610 945166 948875 952353 955161 957585 960504 964329 968445 971954 974575 976348 976849 975593 973317
52248I73317j326J029K905L320L064L184L707M292N170O554P819Q214Q065Q296
$$ 973317 971991 973020 975925 979245 982309 985493 989200 993492 998662 1005216 1013035 1021249 1029314 1037610
52234A037610Q967R233Q758Q246Q336Q789R104R262R395R319Q867Q281P817P354
$$ 1037610 1046577 1055810 1064568 1072814 1081150 1089939 1099043 1108305 1117700 1127019 1135886 1144167 1151984 1159338
52220A159338O759O189N602M485K687J176J028J887K312J663P73M84N24L46L13
$$ 1159338 1166097 1172286 1177888 1182373 1185060 1186236 1187264 1189151 1191463 1193126 1193899 1194383 1194907 1195253 1195566
52205A195566J139K539L351K962J960J276J246J661K243K775L114L376L828M461
$$ 1195566 1196705 1199244 1202595 1205557 1207517 1208793 1210039 1211700 1213943 1216718 1219832 1223208 1227036 1231497
52191A231497M874M735M194L627L242L006K816K493J856R75J38n02r92j189p25
$$ 1231497 1236371 1241106 1245300 1248927 1252169 1255175 1257991 1260484 1262340 1263315 1263453 1262951 1261959 1260770 1260045
52176A260045K89R41M67p43j663j983k340l164l949l963l213k381k057k299k805
$$ 1260045 1260334 1261275 1261742 1260999 1259336 1257353 1255013 1251849 1247900 1243937 1240724 1238343 1236286 1233987 1231182
52161A231182l231l460l657m011m463m816m992m942m414l210j698n47J41R73K400
$$ 1231182 1227951 1224491 1220834 1216823 1212360 1207544 1202552 1197610 1193196 1189986 1188288 1187741 1187882 1188855 1191255
52146A191255M109N515O347O463N600L815J894O88J62l79j219j874j881j455j080
$$ 1191255 1195364 1200879 1207226 1213689 1219289 1223104 1224998 1225686 1225848 1225469 1224250 1222376 1220495 1219040 1217960
52131A217960q12k63Q54K371L802M683M815M384L892L818M150M265L558K211J067
$$ 1217960 1217148 1216885 1217739 1220110 1223912 1228595 1233410 1237794 1241686 1245504 1249654 1253919 1257477 1259688 1260755
52116A260755N55J34q46j998k237j068J001L350N838Q376J0698J2866J5340J8031
$$ 1260755 1261310 1261444 1260598 1258600 1256363 1255295 1256296 1259646 1265484 1273860 1284558 1297424 1312764 1330795
52102A330795J9917K0202J9402J8522J7531J5482J2132Q601O269N494N665O076
$$ 1330795 1350712 1370914 1390316 1408838 1426369 1441851 1453983 1462584 1468853 1474347 1480012 1486088
52090A486088O535P316Q710J0530J2111J2898J2908J2411J1412R796P833O061
$$ 1486088 1492623 1499939 1508649 1519179 1531290 1544188 1557096 1569507 1580919 1590715 1598548 1604609
52078A604609M722L665K787K136J565P35m30j588k444l013l392l510l330k997
$$ 1604609 1609331 1612996 1615783 1617919 1619484 1620219 1619789 1618201 1615757 1612744 1609352 1605842 1602512 1599515
52064A599515k657k284j770j042m0J166K171K425J825R71N68O78P25K43n17q76
$$ 1599515 1596858 1594574 1592804 1591762 1591722 1592888 1595059 1597484 1599309 1600280 1600848 1601526 1602251 1602494 1601977 1601101
52048A601101m92L08J134K119L572N146N957N750N350N565O079N970M997L724
$$ 1601101 1600609 1600917 1602051 1604170 1607742 1612888 1618845 1624595 1629945 1635510 1641589 1647559 1652556 1656280
52034A656280K552J399L25k56k06K5Q2K06Q38K014L436M911O371P658Q579R215
$$ 1656280 1658832 1660231 1660556 1660300 1660094 1660119 1660201 1660407 1661245 1663259 1666695 1671606 1677977 1685635 1694214 1703429
52018A703429R921J1002J2395J3669J4392J4484J4094J3044J0672O473P66n496
$$ 1703429 1713350 1724352 1736747 1750416 1764808 1779292 1793386 1806430 1817102 1823575 1824341 1818845
52006A818845j1427j6429k0071k2278k3498k4218k4339k3528k2171k1300k1447
$$ 1818845 1807418 1790989 1770918 1748640 1725142 1700924 1676585 1653057 1630886 1609586 1588139
51995A588139k2130k2666k3024k3562k4339k5034k5279k4870k3907k2880k2357
$$ 1588139 1566009 1543343 1520319 1496757 1472418 1447384 1422105 1397235 1373328 1350448 1328091
51984A328091k2397k2627k2938k3646k4721k5396k4909k3322k1248j9072j6838
$$ 1328091 1305694 1283067 1260129 1236483 1211762 1186366 1161457 1138135 1116887 1097815 1080977
51973A080977j4567j2201r473o254k950j30K063L772M799M609K889j72m108q322
$$ 1080977 1066410 1054209 1044736 1038482 1035532 1035402 1037465 1041237 1046036 1050645 1053534 1053362 1049254 1040932
51959A040932j2040j4593j5925j6558j6942j6963j6137j4131j1074p485l943p25
$$ 1040932 1028892 1014299 998374 981816 964874 947911 931774 917643 906569 899084 895141 894416
51947H94416K230M946P167Q670R605J0221J0316R337P091M126J292q63k226k928
$$ 894416 896646 901592 908759 917429 927034 937255 947571 956908 963999 968125 969417 968554 966328 963400
51933I63400l254l584m144m768n085n007m947n486o784q411r765j0546j0807j0688
$$ 963400 960146 956562 952418 947650 942565 937558 932611 927125 920341 911930 902165 891619 880812 870124
51919H70124j0231r454q411p182n850m477k904p66K056M994P244Q695J0007J1483
$$ 870124 859893 850439 842028 834846 828996 824519 821615 820849 822905 827899 835143 843838 853845 865328
51905H65328J2291J1240Q144L985k04m112p766j0916j3192j4551j5287j5601j5482
$$ 865328 877619 888859 897003 900988 900784 896672 888906 877990 864798 850247 834960 819359 803877
51892H03877j4960j4142j2917j0910p983m657j653R50L782P257J0980J4371J7558
$$ 803877 788917 774775 761858 750948 742965 738308 736655 737605 741387 748644 759624 773995 791553
51879G91553K1052K4596K6838K6472K3269J7864J0947L163m486j0839j5320j8103
$$ 791553 812605 837201 864039 890511 913780 931644 942591 945754 941268 930429 915109 897006
51867H97006j9417j9078j6989j3817j0743q478o823n263l646k011q2K556N691
$$ 897006 877589 858511 841522 827705 816962 808484 801661 796398 792752 790741 790659 793215 798906
51854G98906Q368R887J0600J1368J2399J3102J3078J2822J3280J4958J7603K0421
$$ 798906 807274 817161 827761 839129 851528 864630 877708 890530 903810 918768 936371 956792
51842I56792K2366K2443K0035J5168Q446R18o117j1558j5046j6972j7919j8182
$$ 956792 979158 1001601 1021636 1036804 1045250 1046168 1040051 1028493 1013447 996475 978556 960374
51830I60374j7965j7678j7736j8070j8095j7263j5516j3181j0586p866n136k699
$$ 960374 942409 924731 906995 888925 870830 853567 838051 824870 814284 806418 801282 798583
51818G98583q76K80Q99Q36m03k957o097q737j0400j1256j1386j0649r342q289
$$ 798583 797707 797987 798886 799722 799319 796362 790265 781528 771128 759872 748486 737837 728495 720206
51804G20206p876p491o428m880l536k564j616o54k1K76P51J702K794L564L873
$$ 720206 712330 704839 698411 693531 689995 687431 685815 685161 685140 685416 686167 687869 690663 694227 698100
51789F98100L660K764J304j68j299k337l466m109l548k092q40k01O59K577N222
$$ 698100 701760 704524 705828 705660 704361 702024 698558 694449 690901 688809 687969 687768 688427 691004 696226
51774F96226P692R722J1512J2644J2104R601O134K866j40l490p163j0183j1590
$$ 696226 703918 713640 725152 737796 749900 759501 765635 768501 768361 764871 757708 747525 735935
51761G35935j1399j0438r515q768p834o507n138m203l609k817j653n80J6L08N85
$$ 735935 724536 714098 704583 695815 687981 681474 676336 672133 668524 665707 664054 663474 663490 663798 664383
51746F64383Q44J218K296M329O479P537P336O772O623O965P609Q333Q573P752
$$ 664383 665227 666445 668741 673070 679549 687086 694422 701194 707817 714782 722391 730724 739297 747049
51732G47049O123M566L319J683o35k654l182k130j42K531N856Q964J0265Q842
$$ 747049 753172 757738 761057 762740 762105 759451 756269 754139 753997 756528 762384 771348 781613 790455
51718G90455N294J088k494m728n315m391k522n02J075K022K486K689K900L642
$$ 790455 795749 796837 794343 789615 784300 779909 777387 776885 777960 779982 782468 785157 788057 791699
51704G91699N601Q805J1836J2466R604M538r3k485k700j685J85L302P688J1988
$$ 791699 797300 806105 817941 830407 840011 844549 844456 841971 839271 837586 837771 841073 848761 860749
51690H60749J3965J2062O549p89p725j2433j3999j2874j0660q945q225q220q833
$$ 860749 874714 886776 893325 892536 884811 872378 858379 845505 834845 825900 817675 809455 800622
51677H00622j0032j1086j0912r497q029p248o443m596j853Q47L127N475Q404J1852
$$ 800622 790590 779504 768592 759095 751066 743818 737375 732779 730926 731773 734900 740375 748779 760631
51663G60631J5275J7921J9118J8582J6342J2311O524m5n608r041j0794j1850j2374
$$ 760631 775906 793827 812945 831527 847869 860180 866704 866659 861051 852010 841216 829366 816992
51650H16992j2007j0954r875q906p556n571l292j349n40j641m658q360j1302j3164
$$ 816992 804985 794031 784156 775250 767694 762123 758831 757482 756942 755301 750643 742283 730981 717817
51636G17817j4434j5033j4212j1873r106p007n607m226k469n63R08J502J375J261
$$ 717817 703383 688350 674138 662265 653159 646152 640545 636319 633850 633287 634195 635697 637072 638333
51622F38333J639K055J673L96j042k041k623l000l270l598m128m603m546l898
$$ 638333 639972 642027 643700 644096 643054 641013 638390 635390 632120 628522 624394 619791 615245 611347
51608F11347l062k308j642j142q68m79L31J152J334J181J791L600N972Q387J0984
$$ 611347 608285 605977 604335 603193 602325 601846 602177 603329 604663 605844 607635 611235 617207 625594 636578
51593F36578J3629J5550J6504J7179J7668J6578J2866P828L967K285J905K187
$$ 636578 650207 665757 682261 699440 717108 733686 746552 754380 758347 760632 762537 764724
51581G64724L786P306J2230J7753K3812L0490L6978M1974M5057M7102M9316N2217
$$ 764724 768510 775816 788046 805799 829611 860101 897079 939053 984110 1031212 1080528 1132745
51569A132745N5487N8343N9831N9186N6532N3450N2443N5309O1897P0528P9449
$$ 1132745 1188232 1246575 1306406 1365592 1422124 1475574 1528017 1583326 1645223 1715751 1795200
51558A795200Q7475R3242R4582Q9319P6660N7603L4200Q742j6625m0154o0750
$$ 1795200 1882675 1975917 2070499 2159818 2236478 2294081 2328281 2337023 2320398 2280244 2219494
51547B219494p7913r1388j01030j06868j09133j08095j04161r8058r0684q2622
$$ 2219494 2141581 2050193 1949163 1842295 1733162 1625067 1520906 1422848 1332164 1249542
51537A249542p3957o4788n5748m7763m1285l5943l1095k6544k2605j9554j7286
$$ 1249542 1175585 1110797 1055049 1007286 966001 930058 898963 872419 849814 830260 812974
51526H12974j5479j3836j2104j0197q373p032o124n130l922l207l540m175l711
$$ 812974 797495 783659 771555 761358 752985 745953 739829 734699 730777 727570 724030 719855 716144
51513G16144j900j67L2j160k426k858k725k828l570m607n205m962m282l980m323
$$ 716144 714244 714077 714109 712949 710523 707665 704940 702112 698542 693935 688730 683768 679486 675506 671183
51498F71183m721m477l632k820k494k531k483j998j063p3L84Or58j964k604k792
$$ 671183 666462 661985 658353 655533 653039 650508 648025 646027 644964 644891 645275 645281 644323 642359 639755 636963
51482F36963k710k619k587k330j616p79n52j186k126k735k961l013k805k138j219
$$ 636963 634253 631634 629047 626717 625101 624322 623770 622584 620458 617723 614762 611749 608944 606806 605587
51467F05587m16L34J356K551L384L643L662L747L812L864M296N311O404O892O869
$$ 605587 605171 605505 606861 609412 612796 616439 620101 623848 627660 631524 635820 641131 647535 654427 661296
51452F61296P065P834Q741R439J0432J2505J5596J8761K1336K3607K5922K7483
$$ 661296 668361 676195 684936 694375 704807 717312 732908 751669 773005 796612 822534 850017
51440H50017K6623K2366J5456P853J538k124k589l83K699M283K774j706p636j3195
$$ 850017 876640 899006 914462 922315 923853 921729 919140 918757 921456 925739 928513 926807 919171 905976
51426I05976j7198j9305j9796j9209j8075j6692j5026j2861j0131p129m440k558
$$ 905976 888778 869473 849677 830468 812393 795701 780675 767814 757683 750554 746114 743556
51414G43556j529q88q6R61J799K050J912J844J874J637J135J014J863L560N514
$$ 743556 742027 741139 741053 742014 743813 745863 747775 749619 751493 753130 754265 755279 757142 760702 766216
51399G66216P293Q767R876J0653J1273J1888J2502J3292J4754J7234K0556K4454
$$ 766216 773509 782276 792152 802805 814078 825966 838468 851760 866514 883748 904304 928758
51387I28758K9176L5258M2876N1785O1713P2315Q2941R2973J02296J10932J18230
$$ 928758 957934 993192 1036068 1087853 1149566 1221881 1304822 1397795 1500091 1611023 1729253
51376A729253J22930J23950J20635J12297R8268P8605N4305K6747k542l1537n7898
$$ 1729253 1852183 1976133 2096768 2209065 2307333 2385938 2440243 2466990 2464448 2432911 2375013
51365B375013p9919r7041j09342j17055j20657j20746j17545j10957j01516r0686
$$ 2375013 2295094 2198053 2088711 1971656 1850999 1730253 1612708 1501751 1400235 1309549
51355A309549p9896o9633n9873n0899m3277l7313l2894k9654k7101k4935k3350
$$ 1309549 1229653 1160020 1100147 1049248 1005971 968658 935764 906110 879009 854074 830724
51344H30724k2605k2123k0725j8114j5447j3809j2749j1085q700o677n827n905
$$ 830724 808119 785996 765271 747157 731710 717901 705152 694067 685367 678690 672863 666958
51332F66958o169o033n123l454j678o62o00r32j139j290j648k135k315j753l61
$$ 666958 660789 654756 649633 646179 644501 643839 643239 642307 641168 639878 638230 636095 633780 632027 631666
51317F31666J421K916L853M579N428O132O273N974N670N372M771L983L473L231
$$ 631666 633087 636003 639856 644435 649863 655995 662268 668242 673912 679284 684055 688038 691511 694742
51303F94742K683J669P65L65n2j136k613l629l946m224n067o282p264p734p807
$$ 694742 697425 699094 699859 700224 700172 699036 696423 692794 688848 684624 679557 673275 666011 658277 650470
51288F50470p534o782n576m256l156k262j379m87L47J269K620M389O010O852O802
$$ 650470 642936 636154 630578 626322 623166 620904 619525 619038 619385 620654 623274 627663 633673 640525 647327
51273F47327O275N696N156M508L688K903K520K780L606M729N911O992P870Q534
$$ 647327 653602 659298 664454 668962 672650 675553 678073 680853 684459 689188 695099 702091 709961 718495
51259G18495R029R222Q799P634N969M022J677j066l732n858p599r269j0508j0692
$$ 718495 727524 736746 745545 753179 759148 763170 764847 763781 760049 754191 746592 737323 726815 716123
51245G16123j0034r453r291q964q040o777n427l826k092r16o32o89m90j20J85
$$ 716123 706089 696636 687345 678381 670341 663564 658137 654311 652219 651303 650671 649982 649492 649372 649557
51230F49557N96J175J536J511J449J365O07q63j798j225J06Q18Q14R92J647K386
$$ 649557 650153 651328 652864 654375 655824 657189 657796 656933 655135 653910 654016 654834 655648 656640 658287 660673
51214F60673L137L964M252L414K220K005K629K715J905J431K058K979L314L506
$$ 660673 663810 667774 672026 675440 677660 679665 682294 685009 686914 688345 690403 693382 696696 700202
51200G00202M367N745O956P752Q187Q174P815P611P742P639O768N340L820K333
$$ 700202 704569 710314 717270 725022 733209 741383 749198 756809 764551 772190 778958 784298 788118 790451
51186G90451J033L58K83n6j334l021m144m629n186o135p095p718q074q234p978
$$ 790451 791484 791842 792125 792069 790735 787714 783570 778941 773755 767620 760525 752807 744733 736499 728521
51171G28521p126n892m833m426m619m767m271l185j872j48K465N483P334P005
$$ 728521 721395 715503 710670 706244 701625 696858 692587 689402 687530 687382 689847 695330 702664 709669
51157G09669N195L218J341r62l597n627o431o299n809n280m952n026n328n330
$$ 709669 714864 718082 719423 718461 714864 709237 702806 696507 690698 685418 680466 675440 670112 664782
51143F64782m834m234l958l841l377k379j233m51r5K78J060K002K430K116J689
$$ 664782 659948 655714 651756 647915 644538 642159 640926 640475 640380 640658 641718 643720 646150 648266 649955
51128F49955J951L014M369N677P050Q552R807J0336J0025R015P240M481R87k249
$$ 649955 651906 654920 659289 664966 672016 680568 690375 700711 710736 719751 726991 731472 732459 730210
51114G30210m213m837m870m791m272k997j481m93L8Q32K063L108L595L985M718
$$ 730210 725997 721160 716290 711499 707227 704230 702749 702256 702294 703126 705189 708297 711892 715877 720595
51099G20595N321M900L274J200m29j361k072l232m975o658p492p340o634n616
$$ 720595 725916 730816 734090 735290 734861 733500 731428 728196 723221 716563 709071 701731 695097 689481
51085F89481m233k745j780j512j439j175r25p88k76R24K258L053L523M242M947
$$ 689481 685248 682503 680723 679211 677772 676597 675672 674884 674608 675532 677790 680843 684366 688608 693555
51070F93555M792L769L032L558N119O803Q014Q663Q735Q210P241O155N232M573
$$ 693555 698347 702116 705148 708706 713825 720628 728642 737305 746040 754250 761491 767646 772878 777451
51056G77451M112L662K925J593l95k533l812l450j679M93K432M465P057R831J1946
$$ 777451 781563 785225 788150 789743 789348 786815 783003 779553 777874 778367 780799 785264 792321 802152 814098
51041H14098J3288J4588J6229J7399J6875J4460J1287Q752P366O604N567L540
$$ 814098 827386 841974 858203 875602 892477 906937 918224 926976 934342 940946 946513 950053
51029I50053J71m376r229j3108j5268j6023j6173j6031j5315j3753j1334q071
$$ 950053 950224 945848 936619 923511 908243 892220 876047 860016 844701 830948 819614 811543
51017H11543m097o6L139N261O757P991Q852R398J0226J1699J3259J4011J3750
$$ 811543 807446 807380 810519 815780 822537 830528 839380 848778 859004 870703 883962 897973 911723
51004I11723J2998J2272J1625J0738R173O791M134K116J013J90r57k127k546j865
$$ 911723 924721 936993 948618 959356 968529 975320 979454 981570 982583 982773 981816 979689 977143 975278
50990I75278j64K497N957R629J2875J5603J8094K0433K2465K4076K5123K5423
$$ 975278 975114 977611 983568 993197 1006072 1021675 1039769 1060202 1082667 1106743 1131866 1157289
50978A157289K5190K5091K5400K5462K4711K3684K3191K2753K0967J7373J3031
$$ 1157289 1182479 1207570 1232970 1258432 1283143 1306827 1330018 1352771 1373738 1391111 1404142
$$ [...]
##END NTUPLES=NMR SPECTRUM
##END=
