##TITLE=AC1399_2357uv_7519954_JKoHcfTaAp
##JCAMPDX= 6.0         $$ Bruker NMR JCAMP-DX V2.0
##DATA TYPE= NMR SPECTRUM
##DATA CLASS= NTUPLES
##ORIGIN= BRUKER
##OWNER= Administrator
$$ 1.72 TOPSPIN		Version 2.1
$$ 2013-04-17 01:44:28.792 -0700  Administrator@X
$$ Compression mode = diff/dup
##.OBSERVE FREQUENCY= 400.02188249412
##.OBSERVE NUCLEUS= ^1H
##.ACQUISITION MODE= SIMULTANEOUS (DQD)
##.ACQUISITION SCHEME= undefined
##.AVERAGES= 8
##.DIGITISER RES= 22
##SPECTROMETER/DATA SYSTEM= spect
##.PULSE SEQUENCE= zg30
##.SOLVENT NAME= COFFEE_meoh
##.SHIFT REFERENCE= INTERNAL, COFFEE_meoh, 1, 14.98509
##AUDIT TRAIL= $$ (NUMBER, WHEN, WHO, WHERE, PROCESS, VERSION, WHAT)
$$ ##TITLE= Audit trail, TOPSPIN		Version 2.1
$$ ##JCAMPDX= 5.01
$$ ##ORIGIN= Bruker BioSpin GmbH
$$ ##OWNER= Administrator
$$ $$ E:\/data/COFFEE/nmr/AC1399_2357uv_7519954_JKoHcfTaAp/10/pdata/1/auditp.txt
$$ ##AUDIT TRAIL=  $$ (NUMBER, WHEN, WHO, WHERE, PROCESS, VERSION, WHAT)
(   1,<2013-04-17 01:44:21.933 -0700>,<Administrator>,<X>,<go>,<TOPSPIN 2.1>,
      <created by zg
	started at 2013-04-17 01:43:16.167 -0700,
	POWCHK enabled, PULCHK disabled,
       configuration hash MD5:
       33 CF 6A 21 5C D3 B9 40 6C 15 AA 8D 27 A2 4F 13
       data hash MD5: 64K
       17 26 39 05 61 B8 3A 65 A5 F5 43 65 95 E2 05 97>)
(   2,<2013-04-17 01:44:24.808 -0700>,<Administrator>,<X>,<proc1d>,<TOPSPIN 2.1>,
      <Start of raw data processing
       efp LB = 0 FT_mod = 6 PKNL = 1 PHC0 = 0 PHC1 = 0 SI = 32K 
       data hash MD5: 32K
       FD 3F B5 13 5D EB 65 7D 78 41 7A 8F A1 49 B0 EC>)
(   3,<2013-04-17 01:44:25.136 -0700>,<Administrator>,<X>,<proc1d>,<TOPSPIN 2.1>,
      <pk PHC0 = 98.23425 PHC1 = 0 
       data hash MD5: 32K
       58 20 83 06 40 C9 12 57 2A 86 65 FE DD B6 D8 5D>)
(   4,<2013-04-17 01:44:25.245 -0700>,<Administrator>,<X>,<proc1d>,<TOPSPIN 2.1>,
      <abs ABSG = 1 
       data hash MD5: 32K
       6F 41 A8 D4 0F A3 7F EA F1 F9 1C 30 37 F4 C6 C6>)
(   5,<2013-04-17 01:44:25.323 -0700>,<Administrator>,<X>,<proc1d>,<TOPSPIN 2.1>,
      <abs ABSG = 2 
       data hash MD5: 32K
       BC EA 60 DB 5C 0B 00 A6 29 5E 81 05 A2 52 62 0F>)
(   6,<2013-04-17 01:44:25.370 -0700>,<Administrator>,<X>,<proc1d>,<TOPSPIN 2.1>,
      <abs ABSG = 3 
       data hash MD5: 32K
       4F D7 21 2B AD 07 D6 C1 F0 DC 4D 6A 1B AA 52 04>)
(   7,<2013-04-17 01:44:25.448 -0700>,<Administrator>,<X>,<proc1d>,<TOPSPIN 2.1>,
      <abs ABSG = 4 
       data hash MD5: 32K
       31 6E 81 17 11 15 0A A4 50 85 E0 68 03 1F BE 34>)
(   8,<2013-04-17 01:44:25.511 -0700>,<Administrator>,<X>,<proc1d>,<TOPSPIN 2.1>,
      <abs ABSG = 5 
       data hash MD5: 32K
       92 FB 8F AB 6D 6C 29 16 E6 E7 E6 CB B8 3A 82 B6>)
$$ ##END=
$$ 
$$ $$ hash MD5
$$ $$ A0 7B 1A F7 A4 4B 29 37 94 A7 26 9F 7E 01 50 87
##$RELAX= 
##$RELAX= 
##$RELAX= 
##$RELAX= 
##$RELAX= 
##$RELAX= 
##$RELAX= 
$$ Bruker specific parameters
$$ --------------------------
##$DU= <E:\>
##$EXPNO= 10
##$NAME= <AC1399_2357uv_7519954_JKoHcfTaAp>
##$PROCNO= 1
$$ [...]
150 150 150 150 150 150 150 150
##$TP07= 0
##$TPNAME0= <>
##$TPNAME1= <>
##$TPNAME2= <>
##$TPNAME3= <>
##$TPNAME4= <>
##$TPNAME5= <>
##$TPNAME6= <>
##$TPNAME7= <>
##$TPOAL= (0..7)
0.5 0.5 0.5 0.5 0.5 0.5 0.5 0.5
##$TPOFFS= (0..7)
0 0 0 0 0 0 0 0
##$TUNHIN= 0
##$TUNHOUT= 0
##$TUNXOUT= 0
##$USERA1= <user>
##$USERA2= <user>
##$USERA3= <user>
##$USERA4= <user>
##$USERA5= <user>
##$V9= 5
##$VALIST= <valist>
##$VCLIST= <CCCCCCCCCCCCCCC>
##$VD= 0
##$VDLIST= <DDDDDDDDDDDDDDD>
##$VPLIST= <PPPPPPPPPPPPPPP>
##$VTLIST= <TTTTTTTTTTTTTTT>
##$WBST= 2048
##$WBSW= 25
##$XGAIN= (0..3)
0 0 0 0
##$XL= 0
##$YL= 0
##$YMAX_a= 654205
##$YMIN_a= -555087
##$ZGOPTNS= <>
##$ZL1= 120
##$ZL2= 120
##$ZL3= 120
##$ZL4= 120
##$ABSF1= 14.98509
##$ABSF2= -5.573092
##$ABSG= 5
##$ABSL= 3
##$ALPHA= 0
##$AQORDER= 0
##$ASSFAC= 0
##$ASSFACI= 0
##$ASSFACX= 0
##$ASSWID= 0
##$AUNMP= <proc_prof1d_extract_pilot.lims>
##$AXLEFT= 0
##$AXNAME= <>
##$AXNUC= <1H>
##$AXRIGHT= 0
##$AXTYPE= 0
##$AXUNIT= <>
##$AZFE= 0.1
##$AZFW= 0.1
##$BCFW= 0
##$BC_mod= 0
##$BYTORDP= 0
##$COROFFS= 0
##$CY= 15
##$DATMOD= 1
##$DC= 0
##$DFILT= <>
##$DTYPP= 0
##$F1P= 0
##$F2P= 0
##$FCOR= 0.5
##$FTSIZE= 32768
##$FT_mod= 6
##$GAMMA= 0
##$GB= 0
##$INTBC= 1
##$INTSCL= 1
##$ISEN= 128
##$LB= 0
##$LEV0= 0
##$LPBIN= 0
##$MAXI= 10000
##$MC2= 0
##$MEAN= 0
##$ME_mod= 0
##$MI= 0
##$NCOEF= 0
##$NC_proc= -8
##$NLEV= 6
##$NOISF1= 0
##$NOISF2= 0
##$NSP= 0
##$NTH_PI= 0
##$NZP= 0
##$OFFSET= 14.98509
##$PC= 1
##$PHC0= 98.23425
##$PHC1= 0
##$PH_mod= 1
##$PKNL= yes
##$PPARMOD= 0
##$PPDIAG= 0
##$PPIPTYP= 0
##$PPMPNUM= 2147483647
##$PPRESOL= 1
##$PSCAL= 4
##$PSIGN= 0
##$PYNMP= <proc.py>
##$REVERSE= no
##$SF= 400.02
##$SI= 32768
##$SIGF1= 0
##$SIGF2= 0
##$SINO= 400
##$SIOLD= 32768
##$SPECTYP= <>
##$SREGLST= <1H.CDCl3>
##$SSB= 0
##$STSI= 32768
##$STSR= 0
##$SW_p= 8223.68421052631
##$SYMM= 0
##$S_DEV= 0
##$TDeff= 65536
##$TDoff= 0
##$TI= <>
##$TILT= no
##$TM1= 0
##$TM2= 0
##$TOPLEV= 0
##$USERP1= <user>
##$USERP2= <user>
##$USERP3= <user>
##$USERP4= <user>
##$USERP5= <user>
##$WDW= 1
##$XDIM= 32768
##$YMAX_p= 473358856
##$YMIN_p= -658123
##$CURPLOT= <Network HP LaserJet P1505>
##$CURPRIN= <$Network HP LaserJet P1505>
##$DFORMAT= <normdp>
##$LAYOUT= <+/1D_H.xwp>
##$LFORMAT= <normlp>
##$PFORMAT= <normpl>
##$SURQMSG= 1
$$ End of Bruker specific parameters
$$ ---------------------------------
##NTUPLES= NMR SPECTRUM
##VAR_NAME=  FREQUENCY,     SPECTRUM/REAL,   SPECTRUM/IMAG
##SYMBOL=    X,             R,               I
##VAR_TYPE=  INDEPENDENT,   DEPENDENT,       DEPENDENT
##VAR_FORM=  AFFN,          ASDF,            ASDF
##VAR_DIM=   32768,         32768,           32768
##UNITS=     HZ,            ARBITRARY UNITS, ARBITRARY UNITS
##FACTOR=    0.250966925370066, 1,           1
##FIRST=     8223.43324360094, -56686,       -52585
##LAST=      0,             14680,           -265435
##MIN=       0,             -658123,         0
##MAX=       8223.43324360094, 473358856,    0
$$ Real data points
##PAGE= N=1
##DATA TABLE= (X++(R..R)), XYDATA
$$ [...]
19548a70421J0166A71957d992k34863C02636J7809c00596B04397a63109B1718
19537A81980a62270j5867C2743J94502b08027p2053E686a7747k33012n2427R5041
19526b08145b3434B64825f6199j77446E8004J37379b18731B6122c1169m7105A73927
19514G9484c66031a25792l02306d6814j04910e3581F755Q0898C1986L3348i8583
19502A7902a77594j10099a4203j90111G0133b64135A64422c9424j52615A993g5054
19490c70131a84020c21j08268h785j15533M5319E8290a03561K5109I5885c38948
19478a83547A23061Q0259c44099A10534n1300c36525J43565C16664h2350c3990
19467B74045o5471e054m05592B13007a76532L5147L9001B7284e6868p9654H3938
$$ plain form
19548 -170421 -160255 171957 -4992 -239855 302636 320445 -300596 204397 -163109 21718
19537 181980 -162270 -178137 32743 227245 -208027 -280080 5686 -17747 -250759 -303186 -208145
19526 -208145 -23434 264825 -66199 -243645 58004 195383 -218731 26122 -31169 -78274 173927
19514 79484 -366031 -125792 -428098 -46814 -151724 -53581 6755 87653 31986 65334 -98583
19502 17902 -177594 -287693 -14203 -204314 70133 -264135 164422 -39424 -192039 1993 -75054
19490 -370131 -184020 -321 -108589 -8785 -124318 -78999 58290 -103561 -78452 95885 -338948
19478 -183547 123061 203320 -344099 110534 59234 -336525 -192960 316664 -82350 -33990
19467 274045 208574 -5054 -410646 213007 -176532 -141385 -102384 27284 -56868 -136522 83938
19455A66748a2627B95212a77511A6692h6367B3391b7064o1701k0901F5328M7688
19444A13016O4461a49654A77366g9858j57037a9356k81003A96019b23688a794
19433E7843b13385D1525K12870A05108L8449A1434b9228k6196j49990D29812b49725
19421b08170b5453j78530A45338E0548b35624B67281j20000a15944j79677A26616
19410B77298r2866p3655O7930b1256B9019M72616c06893A37548o8734a29332m8840
19399a78172B9501g1417L245k7725a7064l3009H0863Q6464m6653c54392b3140
19387i9566q2472A07692B9934f8844A6948a5873j0456j18282A51643b29896A25269
19375e8347B24551b9633k38418I773f7938l35961P1656B44314a50726A59532g7981
$$ plain form
19455 166748 -12627 295212 -177511 16692 -86367 23391 -27064 -88765 -109666 65328 113016
19444 113016 177477 -149654 177366 -79858 -236895 -19356 -300359 196019 -223688 -1794
19433 57843 -213385 41525 254395 105108 143557 11434 -29228 -55424 -205414 429812 -249725
19421 -208170 -25453 -203983 145338 50548 -235624 267281 147281 -115944 -295621 126616
19410 277298 184432 110777 178707 -21256 29019 501635 -306893 137548 68814 -129332 -178172
19399 -178172 29501 -71417 -68172 -95897 -17064 -50073 80863 167327 120674 -354392 -23140
19387 -99566 -182038 107692 29934 -68844 16948 -15873 -26329 -144611 151643 -229896 125269
19375 -58347 224551 -29633 -268051 9773 -67938 -403899 -332243 244314 -150726 159532 -77981
19363b13957j1599a3414l17469A30136G457b34118J2395M0362f6203c2490l49434
19352c81924C94739a41176A52993o4852l4544a94315j9078e6954j51585o5999
19342b74538C36787A6385b51800j25962B60058a87703A3749a14612B0879b84990
19331A0207R2728c11031P6954h3290A32703b66327C648d92122K30343B41376B1739
19319A13472a62068j7101A62549i736j27984O2477j88114J02761o664A23970J28516
19308B52486e161q0014B18808P1669b3559n8117a3131j11952A45458d1570j22112
19297a63682f0824k57936C3597a34250A29048a73780m2304a3019k10101I9157
19286H6544a3425F8326c6854G7923o488M7575d2837G0959c5273k86531B81577
$$ plain form
19363 -213957 -225556 -13414 -330883 130136 7457 -234118 -221723 -181361 -66203 -32490 -381924
19352 -381924 394739 -141176 152993 88141 53597 -194315 -213393 -56954 -208539 -274538
19342 -274538 336787 16385 -251800 -377762 260058 -187703 13749 -114612 20879 -284990
19331 10207 102935 -311031 -234077 -83290 132703 -266327 3648 -492122 -261779 241376 21739
19319 113472 -162068 -179169 162549 -9736 -137720 -75243 -263357 -160596 -167260 123970 252486
19308 252486 -5161 -85175 218808 290477 -23559 -81676 -13131 -125083 145458 -41570 -163682
19297 -163682 -60824 -318760 33597 -134250 129048 -173780 -216084 -13019 -223120 99157
19286 86544 -13425 68326 -36854 77923 71435 119010 -42837 70959 -35273 -321804 281577
19274A40422e0533j66814D2182h6249A2332J70394a88970B49425b94135F2105
19263b76899A44183c97395a2398n471B50225a04233l1534C01008A1951J07636
19253A19587b46785h2831E6738a83778c362A65752a09416f809I7557J91326G6441
19241B290Q9036K18605a96532A23823O2587f3510B55755b7478j77857m1823J21653
19230a25505e9771B95944b34045L1955Q015C7208a50164e8423a5189A52870J43953
19219B96823l7111d09064d0931a6939j34611F8756J2018a09637A1504a18632q8081
19208b06713a2505C25624b31051R1929a4814B42258b35313R8819D7738a80694
19197b30164I9712D5588i1003a5892B7540J23487c26623g0711j85004D66026a90305
$$ plain form
19274 140422 -50533 -217347 42182 -86249 12332 182726 -188970 249425 -294135 62105
19263 -276899 144183 -397395 -12398 -17869 250225 -104233 -135767 301008 11951 119587
19253 119587 -246785 -82831 56738 -183778 -3362 165752 -109416 -6809 97557 288883 76441
19241 2290 91326 309931 -196532 123823 186410 -63510 255755 -27478 -205335 -247158 -125505
19230 -125505 -59771 295944 -234045 -202090 -194075 37208 -150164 -58423 -15189 152870 296823
19219 296823 259712 -409064 -40931 -16939 -151550 68756 80774 -109637 11504 -118632 -206713
19208 -206713 -12505 325624 -231051 -139122 -14814 242258 -235313 -136494 47738 -180694
19197 -230164 99712 45588 -91003 -15892 27540 151027 -326623 -70711 -255715 466026 -190305
19185E2924J3385d2854B10061c04219K0825a29350B4257K27680a45838q6942R8677
19174a34103L4425E5910k3020b27549A13495l8772c278k90006H5067c00614A67169
19162b377o1871o0389E6905K9627l3355Q046b57801J213Q2590r7140a16598k78979
19150c95577J37053G2928a77486c9323D9714J83885d439A2690b55782L2686P5595
19139a47501q1929D961e519j71137O9995M418a9655k32551a0626k54627A25753
19127b10561B398a21305I213a64403f2400j63217e0107I2953A0068c7480A5669
19115a33801j69252a11629K4578k00929Q0792B848a25085D9330f3108j6782b608
19103a77437j29584A01246a62556I2717j1694c11068i057l07069G2401d45910
$$ plain form
19185 52924 66309 -42854 210061 -304219 -283394 -129350 24257 251937 -145838 -232780 -134103
19174 -134103 -99678 55910 32890 -227549 113495 74723 -3278 -293284 85067 -300614 167169
19162 -2377 -64248 -124637 56905 86532 53177 61223 -257801 -256588 -173998 -271138 -116598 -395577
19150 -395577 -258524 72928 -177486 -39323 49714 233599 -4439 12690 -255782 -223096 -147501
19139 -147501 -229430 4961 -5519 -176656 -106661 -102243 -19655 -252206 -10626 -265253 125753
19127 -210561 2398 -121305 9213 -164403 -62400 -225617 -50107 92953 10068 -37480 15669
19115 -133801 -303053 -111629 -87051 -287980 -207188 2848 -125085 49330 -63108 -79890 -2608
19103 -177437 -307021 101246 -162556 92717 81023 -311068 -9057 -316126 72401 -445910
19092b1878r7703e5553I7580a08257j45208B30123c38204m5635C0563J58936h9646
19080a00806b2834G2234a66443j8643H3456K57436D8545b15263F6724g1237E1366
19068b4887j44115K6574A11724b04380A4900i2479A4774b27453j3928I8512R0596
19057A89108J15182j11805c5187H0855c8696A03410i6735j87304k2899a19174
19046A94626i5210A70184a4084k13065C7535a06379C08248I0029a8307A71966
19035i6342j33109A47611a04175Q194D6730M5077b55743B25597B3983K6443M24007
19024D74433H6121b09412e6463B22045E3086J24050b25132E7600B2065K99563
19014C21628a87636A50063d3226B42096A20129K375d931A12235c01816o59a42409
$$ plain form
19092 -21878 -119581 -55553 97580 -108257 -253465 230123 -338204 -383839 30563 189499 -89646
19080 -100806 -22834 72234 -166443 -185086 83456 340892 48545 -215263 66724 -71237 51366
19068 -24887 -169002 -142428 111724 -204380 14900 -92479 14774 -227453 -241381 98512 189108
19057 189108 304290 192485 -35187 80855 -38696 103410 -96735 -284039 -306938 -119174
19046 194626 -95210 170184 -14084 -227149 37535 -106379 308248 90029 -18307 171966
19035 -96342 -229451 147611 -104175 -95981 46730 91807 -255743 225597 23983 50426 474433
19024 474433 86121 -209412 -56463 222045 53086 177136 -225132 57600 22065 321628
19014 321628 -187636 150063 -43226 242096 120129 122504 -4931 112235 -301816 -302475 -142409
19002b81479c659k83279J37775f1406E0507b22357I3891h6750k09651e9655k2344
18991h1999A33783b3168D23678e1149o5360H7258N0742m5662P8479a49855f1861
18979a57400A95971a55406E10680A63135G4443M0577b91395b1148k63077g6080
18968a50103k49408a38236J3973H3009j9431l444b06999j59457B31808J11099
18958C42907a58566A65718a82555j92826e3944A69378a72759A24279d8573A742
18947a59471B3159b01288j405e0875F8980B7818e7864B91899a99317k63057A4806
18935b42507H0950A2534K81804a052A43830a32424c8530j07025n3317j65673a27136
18923C8100b55938A0342b08614C6767a8271E3953f8163j0019r7130d938I5193
$$ plain form
19002 -281479 -3659 -286938 -149163 -61406 50507 -222357 93891 -86750 -296401 -59655 -81999
18991 -81999 133783 -23168 423678 -51149 -116509 87258 138000 92338 170817 -149855 -61861
18979 -157400 195971 -155406 510680 163135 74443 115020 -291395 -21148 -284225 -76080
18968 -150103 -399511 -138236 -124263 83009 63578 60134 -206999 -366456 231808 342907
18958 342907 -158566 165718 -182555 -375381 -53944 169378 -172759 124279 -48573 1742
18947 -159471 23159 -201288 -202693 -50875 68980 27818 -57864 291899 -199317 -462374 14806
18935 -242507 80950 12534 294338 -1052 143830 -132424 -38530 -145555 -198872 -364545 -127136
18923 38100 -255938 10342 -208614 36767 -18271 53953 -68163 -78182 -175312 -4938 95193
18911c48278A85836o5254d3849A30771h9914a2594C86193a61021N2339r0869G5842
18899a01756c290A00105O3894K57296a06328A5140J27891a08440J1230j42694
18889b39904A07472d9153o9846A27686K39326b3934A24465a06273l13118J88281
18879b31110d4679p7386E3802b3215j31187j68816i7603j05572o1844B1439i4666
18867b62926g4838A73443J6825c19966A59635r360C4104K21379d05295b4609B09360
18855b25091A12275c15813j9592A55045n7127d17385g5129A49328J72471a08309
18844A27428d0982G2426b39320f4091l58265a97258N7032j93682a07434j69690
18834b77124A66670a74446M0025k85782a55726D7731d2327B46624h9511o8137
$$ plain form
18911 -348278 185836 120582 -43849 130771 -89914 -12594 386193 -161021 -108682 -199551 75842
18899 -101756 -3290 100105 163999 421295 -106328 15140 143031 -108440 -97210 -239904
18889 -239904 107472 -49153 -118999 127686 367012 -23934 124465 -106273 -419391 -231110
18879 -231110 -44679 -122065 53802 -23215 -154402 -323218 -97603 -203175 -265019 21439 -94666
18867 -262926 -74838 173443 190268 -319966 159635 150275 34104 255483 -405295 -24609 209360
18855 -225091 112275 -315813 -335405 155045 97918 -417385 -75129 149328 321799 -108309
18844 127428 -40982 72426 -239320 -64091 -422356 -197258 -140226 -333908 -107434 -277124
18834 -277124 166670 -174446 -134421 -420203 -155726 47731 -42327 246624 -89511 -157648
18824a57648B15784m7962m9933a94500B58022a20814C41905c8725j59465D4482
18813a9964k04417R5734c3536B11865a43049C91154A54056a2409A11666Q401a17555
18801c3617B13701o5723o4380c27573a09619A19184i9904I2542l5776b3529o5661
18790h9190n958G2362b93320B41491i3846J4932k46507a40091A05141K7773a14536
18778A70315B8628f3866G633J53279e7929a5895j47413D19a06990I5659a68060
18766a44421r1186i2120F475e0384j1795m05637b15679f0365G3838K49921b55820
18754e8824o996j41048A2614b21364R2993n4519D8335h461j10487D5310a18719
18742b39572Q5908o6797R8417A01444f7928D2522M7520I45b2878m00545E3521
$$ plain form
18824 -157648 215784 167822 117889 -194500 258022 -120814 341905 -38725 -198190 44482
18813 -19964 -224381 -128647 -33536 211865 -143049 391154 154056 -12409 111666 120067 -117555
18801 -33617 213701 147978 83598 -327573 -109619 119184 -99904 92542 56766 -23529 -89190
18790 -89190 -95148 72362 -293320 241491 -93846 -78914 -325421 -140091 105141 132914 -114536
18778 170315 28628 -63866 7633 160912 -57929 -15895 -163308 419 -106990 95659 -168060
18766 -144421 -235607 -92120 6475 -50384 -62179 -467816 -215679 -60365 73838 323759 -255820
18754 -58824 -65820 -206868 12614 -221364 -128371 -182890 48335 -8461 -118948 45310 -118719
18742 -239572 -153664 -220461 -122044 101444 -67928 42522 90042 945 -22878 -423423 53521
18730A00816A9149J72300i2908b8662C4036a80376g1180I9177i4845q3356j87753
18719c65954g860A26410i2900B37058F5156b10343e7391j0546j07406e5040j35864
18708a90904Q0647m4856f188q6867A4677i4029d1785k17976k70856F8977c8352
18696b82162G3767b98484B57644c76081e6749A09674D9862R9637a4013k39784
18686b53797O6608k4834C34661f9031o3181M1424K7968n36144B85604j26744B9232
18674A87067b143j38763J8650A61133G7135M6753h5373C04468d9761j62812N7040
18663a55533g2326j56664B45064b37109B46672p9693a62354K9828i659k80306
18653b89965J06203b3706k22770f2071m5214q3413c8829F5404c5688k10649e643
$$ plain form
18730 100816 19149 191449 -92908 -28662 34036 -180376 -71180 99177 -94845 -178201 -365954
18719 -365954 -7860 126410 -92900 237058 65156 -210343 -57391 -67937 -175343 -55040 -190904
18708 -190904 -110257 -155113 -6188 -93055 14677 -94029 -41785 -259761 -530617 68977 -38352
18696 -282162 73767 -298484 257644 -376081 -56749 109674 49862 149499 -14013 -253797
18686 -253797 -187189 -212023 334661 -69031 -132212 -90788 -62820 -598964 285604 158860 29232
18674 187067 -2143 -140906 -122256 161133 77135 123888 -85373 304468 -49761 -212573 -155533
18663 -155533 -72326 -228990 245064 -237109 246672 166979 -162354 -132526 -9659 -289965
18653 -289965 -183762 -23706 -246476 -62071 -107285 -190698 -38829 65404 -35688 -246337 -5643
18641A71119E2248a35811K0285C00933g7063q7019A31212n6829h1744j06634N9804
18630a28574l62619H6396a58835n0043I5812c97764c8837A9786K71170b61304
18619D5693d6060A38505l5912c18501h0841H9300e4299j447A29654n1836a7577
18607c94646J91432B54720r992e2563G1410d2975l36900c4274I3834a86624A4618
18595I437h750B45351a62868K012C602h4166p6691j56481c5301I7402c55657A9351
18582D7214e19714H1377b2228G1181b24677O4235I0568J11328d29950c7930o4597
18571a02527r4782j6505h8797k62206g8504M409A9079a09013A1728b24629f9281
18559c0521A56236a42265B8059J3104a71997B60351b1453A6676k950J76874b59063
$$ plain form
18641 171119 52248 -135811 -115526 300933 -77063 -164082 131212 74383 -81744 -188378 -128574
18630 -128574 -491193 86396 -158835 -208878 95812 -397764 -38837 19786 290956 -261304
18619 45693 -46060 138505 102593 -318501 -80841 89300 -54299 -55746 129654 77818 -17577
18607 -394646 -203214 254720 244728 -52563 71410 -42975 -379875 -34274 93834 -186624 14618
18595 9437 -8750 245351 -162868 -160856 3602 -84166 -160857 -317338 -35301 97402 -355657 19351
18582 47214 -519714 81377 -22228 71181 -224677 -160442 90568 201896 -429950 -37930 -102527
18571 -102527 -197309 -213814 -88797 -351003 -78504 -74095 19079 -109013 11728 -224629 -69281
18559 -30521 156236 -142265 28059 41163 -171997 260351 -21453 16676 13726 190600 -259063
18547E6646K64366i5407J6985a5950B95295a47744d2781l50712D80934a75390
18536B8790i5497J3117j43418j01198D9451J27765c00067A78082o8194a61704
18525e6464N537A29624d2924c885j6875B60158g4808I559J7461g3579B99083A896
18512d5823j54728q9713M8970j5329A30052b46965B22403b25736e377j56204O5701
18501i5880K3168l3644I328N7569J6263N0738a56593G849b86965J02470q5689
18490b70184L4470d0840I701b99229B20169b5319n2932f00m9059A44454C104f4997
18477F4413B131J72148a18608I7656l9116g0265l655A06047a29173o127M3876
18466i1424C5608e7203a896G383c3614J1068o6902c2448j11405e2761H6280C0692
$$ plain form
18547 56646 321012 -95407 -78422 -15950 295295 -147744 -42781 -393493 480934 -175390
18536 28790 -95497 -82380 -225798 -326996 49451 177216 -300067 178082 109888 -161704
18525 -56464 -50927 129624 -42924 -3885 -20760 260158 -74808 9559 27020 -73579 299083 1896
18512 -45823 -200551 -290264 -241294 -256623 130052 -246965 222403 -225736 -5377 -161581 -95880
18501 -95880 -72712 -106356 9328 66897 83160 133898 -156593 7849 -286965 -184495 -270184
18490 -270184 -235714 -40840 9701 -299229 220169 -25319 -78251 -600 -49659 144454 3104 -64997
18477 64413 2131 174279 -118608 97656 58540 -70265 -73920 106047 -129173 -135300 -91424
18466 -91424 35608 -57203 -1896 7383 -33614 -22546 -89448 -32448 -143853 -52761 86280 30692
18453C832L7767M5540C682L7232c19322B3231i6391D19971j87312F8906a0767
18441a59986P4832K6758G0662a94481N5202B16359a94700A4144b77643B31665
18430e8550B22266D4696Q3389a10798r5416e1157A43030F922R6369L5807b33517
18418A76002a46594c715A11487a8927F6365b46852f8503A5318c30426r3301e2094
18406a2827B02846a86697K1447A66435b38720c1696A80459a91831M344C6357L32538
18395C68895A77337b79834B15072b37097f7732i322l7079k4890c1938D738J781
18384F519K23974b25223a12251p7537b6136j66162b1515j30657H9545a34382N2094
18373h2288k35205D7994a94812c0199j76544A28430D0138J10738J47273F9976
$$ plain form
18453 3832 41599 87139 3682 40914 -319322 23231 -96391 419971 232659 68906 -10767
18441 -159986 -85154 -58396 70662 -194481 -139279 216359 -194700 14144 -277643 231665
18430 -58550 222266 44696 128085 -110798 -206214 -51157 143030 6922 103291 139098 -233517
18418 176002 -146594 -3715 111487 -18927 66365 -246852 -68503 15318 -330426 -423727 -52094
18406 -12827 202846 -186697 -165250 166435 -238720 -31696 180459 -191831 -187487 36357 368895
18395 368895 177337 -279834 215072 -237097 -67732 -9322 -46401 -71291 -31938 4738 6519
18384 6519 230493 -225223 -112251 -189788 -26136 -192298 -21515 -152172 89545 -134382 -82288
18373 -82288 -317493 47994 -194812 -30199 -206743 128430 40138 150876 298149 69976
18362E8881b00048a2553D2307b77990A77650a01339j26033B64554j04903F7982
18351a77900N000e2834k1203G3972O453c04099a08252C8051P5665a47076k55779
18340d02855B3871a73285L0092D8190j1888e2332P056l11691a12327n7896i685
18328a51944p4058g8889H7366l6113R7083P3455g3782H3136b71682I6243c53287
18316b17871A48115a02041d2422B43456A16157c40068a2552A49645b6475r1164
18306a17639j72486J0727H1765B1137b03156I0862d42297A15084K71991j05556
18296B81519c0260l01890C4057a00060n2186C8951a0224n7307o322G6679d8694
18284I0937J22575g6217h980A21681d47500a45779b1012m5749l16967A03920a33817
$$ plain form
18362 58881 -200048 -12553 42307 -277990 177650 -101339 -227372 264554 159651 67982
18351 -177900 -172900 -52834 -74037 73972 80425 -304099 -108252 38051 113716 -147076 -402855
18340 -402855 23871 -173285 -143193 48190 36302 -52332 -45276 -356967 -112327 -170223 -9685
18328 -151944 -226002 -78889 87366 51253 148336 221791 -73782 83136 -271682 96243 -353287
18316 -217871 148115 -102041 -42422 243456 116157 -340068 -12552 149645 -26475 -117639
18306 -117639 -290125 -279398 81765 21137 -203156 90862 -442297 115084 387075 281519
18296 281519 -30260 -332150 34057 -100060 -152246 38951 -10224 -67531 -73853 76679 -48694
18284 90937 213512 -76217 -8980 121681 -447500 -145779 -21012 -66761 -383728 103920 -133817
18272H5791K60584a19903J1278F202g8263A253J52049o9692A2875J08932i7075
18260b0994j1684q0523k21277A84258E3097b4611j47717I866a6236C9627e1985
18248a63972C4978c482A81397N8275E5981k2007J51151D8708c67070d9869C28655
18236c79331J71441L5718h4566k74315J05569C00122G0449a07018b7849B45045
18225a67479M5909n1728h3378a6600E2499K11326f2399E2760B5485J55548b90620
18213e7971A98128g9261A03276m626a67412E3618K1440b1845k62778A70684d31628
18201D1798i7282A18566b7199j70794c5537E2958h9544B7525a08689j8343a756
18189f3889B56202D7277O6599J39772D2778a39474B54236a47928J1107m54960
$$ plain form
18272 85791 346375 -119903 -108625 6202 -78263 1253 153302 83610 12875 121807 -97075
18260 -20994 -32678 -113201 -334478 184258 53097 -24611 -172328 9866 -16236 39627 -51985
18248 -163972 34978 -3482 181397 239672 55981 33974 185125 48708 -367070 -49869 328655
18236 -379331 -207890 -172172 -84566 -358881 -253312 300122 70449 -107018 -27849 245045
18225 -167479 -121570 -173298 -83378 -16600 52499 263825 -62399 52760 25485 181033 -290620
18213 -57971 198128 -79261 103276 98650 -167412 53618 75058 -21845 -284623 170684 -431628
18201 41798 -97282 118566 -27199 -197993 -35537 52958 -89544 27525 -108689 -127032 -1756
18189 -63889 256202 47277 113876 253648 42778 -139474 254236 -147928 -136821 -591781
18179e91781g6243L7237h634j00426k17296J61706A75642a61868H8594a40015
18168a27997m1811B55493d616G0406g6054j85238C69875A4598J19564j7808D7395
18156B31892C9244b65731H0565b07843Q2637D20540a37030N5209A80139J14338
18146B94477d9614G1019A911c41209B64231d7768b1103j7586B09188c3955l27133
18135c61088d0013A42594a93413F5756a05275l3324d9442C41896b58231e5334
18124a86757A53680i4172A16946a89674r6352I4147B136J96658a17202a6738B2552
18112a85824K65B20286g5712b9016A088a37290C1028b51958c7801A18671a26423
18100g1745o6425A37165a40120j21024A3400a63236p1475R3337A09268K72443
$$ plain form
18179 -591781 -76243 -39006 -8634 -109060 -326356 -164650 175642 -161868 88594 -140015
18168 -127997 -169808 255493 -4616 70406 -76054 -261292 369875 14598 134162 116354 47395
18156 231892 39244 -265731 80565 -207843 -125206 420540 -137030 -81821 180139 294477
18146 294477 -49614 71019 1911 -341209 264231 -47768 -21103 -38689 209188 -33955 -361088
18135 -361088 -40013 142594 -193413 65756 -105275 -138599 -49442 341896 -258231 -55334
18124 -186757 153680 -94172 116946 -189674 -286026 94147 2136 198794 -117202 -16738 22552
18112 -185824 -185559 220286 -75712 -29016 1088 -137290 31028 -251958 -37801 118671 -126423
18100 -71745 -138170 137165 -140120 -261144 13400 -163236 -234711 -141374 109268 381711
18090C81711A11163g2264a336A39805j7448a06202b543n1547B0820h2245A50627
18078A30123P7490a02784F7752N8146B1786a56982M7564J4216j4565d6400j16731
18067a63131C3295m331K10528a65949A7939J76965M7293j13787Q357B9711J8958
18056D8669a40833A26431M4303K619c43613a15414A75830b14702j513H7712c08212
18044d47230C66275c65931J09671B44854c30566f1670A95018J1663d5062A45036
18033F9242b56990B73877q8293F7965J32063J31738c44543A51489c49923F6466
18022f8438j58386B55332p7675b1041q7833a4106k30129o547a19040A29455F4301
18010A070i3655F6577a32525f3107j46785H6125c479B36036e75801b7360B16612
$$ plain form
18090 381711 111163 -72264 -1336 139805 122357 -106202 -2543 -54090 20820 -82245 150627
18078 130123 207613 -102784 67752 125898 21786 -156982 -109418 -95202 -109767 -46400 -163131
18067 -163131 33295 28964 239492 -165949 17939 194904 242197 128410 136767 29711 48669
18056 48669 -140833 126431 170734 173353 -343613 -115414 175830 -214702 -216215 87712 -308212
18044 -447230 366275 -365931 -256260 244854 -330566 -61670 195018 206681 -45062 145036
18033 69242 -256990 273877 185584 67965 200028 331766 -344543 151489 -349923 66466
18022 -68438 -226824 255332 177657 -21041 -108874 -14106 -244235 -250782 -119040 129455 64301
18010 1070 -93655 66577 -132525 -63107 -209892 86125 -3479 236036 -575801 -27360 216612
17998c49813f9906k91323e9331k64733a8869j98062d5175E6200a05674E6246a33723
17986f4350n881A23243f3295A59090c4591k0873A68493l8237a50361d2615r134
17975e1749j91239C36820b60702B53180a15147m8160D8036b43123q284i4916C5974
17963A75656b20692A03108a21619A40225E4398A1894i0637D3423J01130b79647
17952A6806J16662M0182N0438I1011I382a2345j12822k26889a40133A36717b09305
17940f2380P581B32039b84656j64678a18426H738a57649K0181d566A25558K01913
17929C27471b8410j48064B27937a56985A3113K77148a60541B8904c7601k4071
17919f1672j10520A5436K03641l7160J7352E9030j7101a53067A1270J1687J0246
$$ plain form
17998 -349813 -69906 -361229 -59331 -324064 -18869 -216931 -45175 56200 -105674 56246 -133723
17986 -64350 -70231 123243 -63295 159090 -34591 -55464 168493 130256 -150361 -42615 -51749
17975 -51749 -242988 336820 -260702 253180 -115147 -163307 48036 -243123 -251407 -94916 35974
17963 175656 -220692 103108 -121619 140225 54398 11894 -90637 43423 144553 -279647
17952 16806 133468 173650 224088 91011 9382 -12345 -125167 -352056 -140133 136717 -209305
17940 -62380 -54799 232039 -284656 -449334 -118426 8738 -157649 -137468 -4566 125558 327471
17929 327471 -28410 -176474 227937 -156985 13113 290261 -160541 28904 -37601 -61672
17919 -61672 -172192 15436 219077 181917 199269 59030 41929 -153067 11270 22957 33203
17908C3203R7886B0870a54366A35078B0870P4920b62557R4460b2969C28859A13987
17896B74630c1152l8659o70B41516J5221D8011k0738a31059G5636L2867c7393
17884a7321A51253D1253N3486a5853l4559j31303O1475I8468j1228J05581r2754
17873A00067h0579c1945a1905A84806p3173l5339a46525k6085P2977A63251g8909
17861B7204i2725F7840K73425B8175b5526n9348c0244k2873A86589l7227a6833
17849B3011J69526g348r128B35828b48465A07328J38215L421E630h9915k0812
17838a10727D05292B104P7861c7186k65286f9757j48044I2886i3064A10330m0492
17827F9838I707a91584k14256a114A90915k522D6776K07542b4036G1222b29578
$$ plain form
17908 33203 131089 20870 -154366 135078 20870 95790 -262557 -168097 -22969 328859 113987
17896 274630 -31152 -69811 -70481 241516 256737 48011 27273 -131059 75636 108503 -37393
17884 -17321 151253 41253 94739 -15853 -50412 -181715 -120240 98468 87240 192821 100067
17873 100067 -80579 -31945 -11905 184806 111633 76294 -146525 -172610 -99633 163251 -78909
17861 27204 -92725 67840 341265 28175 -25526 -84874 -30244 -53117 186589 149362 -16833
17849 23011 192537 -7348 -16476 235828 -248465 107328 245543 248964 5630 -89915 -110727
17838 -110727 405292 2104 79965 -37186 -302472 -69757 -217801 92886 -93064 110330 69838
17827 69838 9707 -191584 -405840 -1114 190915 188393 46776 254318 -24036 71222 -229578
17815E70371e1638m1666A66828J64810c03394P7375f4361J8653m0908c24A05658
17803a21700G2735b05248c8883l52319A04590h1398B61182L880g2663J6653B30409
17791c8763j2337a859E0888i3199k97881i5445A65985E2581K69628a04276B22288
17779C61705a20949B9774N4050J95044I0161J73193b27791c0702j03736j6642
17769a51080E4289k2556b67712B5337c21628A71164F9810b0152A97527L0574e2243
17757A09530L9123c21394A71376G2994d19290f81F9864J56059E8268b29967R3709
17746a36258k92462H6466K01281r1355b5835j84711B40920a04851d6442k79528
17736c25970c3552k08603B03980a9632B77092a10982E1075a37471N7759k3420
$$ plain form
17815 570371 -51638 -93304 166828 331638 -303394 -226019 -64361 -45708 -86616 -324 105658
17803 -121700 72735 -205248 -38883 -391202 104590 -81398 261182 265062 -72663 -56010 230409
17791 -38763 -51100 -1859 50888 -93199 -391080 -95445 165985 52581 322209 -104276 222288
17779 361705 -120949 29774 83824 278868 90161 263354 -227791 -30702 -134438 -151080
17769 -151080 54289 31733 -267712 25337 -321628 171164 69810 -20152 197527 228101 -52243
17757 109530 148653 -321394 171376 72994 -419290 -681 69864 225923 58268 -229967 -136258
17746 -136258 -428720 86466 287747 196392 -25835 -210546 240920 -104851 -46442 -325970
17736 -325970 -33552 -242155 203980 -19632 277092 -110982 51075 -137471 -79712 -103132
17726a03132n0792A10023A4794a46050O7860j12077A0187a50346l18848h7347
17715C3611b17830G5848K9777c3995m77719I1467a7681k65068g2029l4327A19539
17703g7780A99495N3615a46409a7622A56908o8759o096b25027b3310l76j809A43488
17690A77567d3805a0495j51531D73451C3881d6954A01775A7807J65543i1503B24
17678c05666B34431c74751a79066C12741I7512q059b2425A5250J1123J10420M0286
17667A77079a07355A27549P8587J20333d8798p5971I1268J42602i3568j6744b8487
17655a57204A77620b95793d4503A96826C6166h701j08013B14883a46707A71228
17644A30428b04968h2571j79754C8278b45611j29595G3896b4835B03089f7304
$$ plain form
17726 -103132 -153924 110023 14794 -146050 -78190 -190267 10187 -150346 -469194 -87347
17715 33611 -217830 75848 105625 -33995 -511714 91467 -17681 -282749 -72029 -106356 119539
17703 -77780 199495 253110 -146409 -17622 156908 88149 82053 -225027 -23310 -23686 -25495 143488
17690 177567 -43805 -10495 -162026 473451 33881 -46954 101775 17807 183350 -91503 224
17678 -305666 234431 -374751 -179066 312741 97512 89453 -22425 15250 26373 136793 177079
17667 177079 -107355 127549 206136 326469 -48798 -124769 91268 233870 -93568 -110312 -28487
17655 -157204 177620 -295793 -44503 196826 36166 -8701 -116714 214883 -146707 171228
17644 130428 -204968 -82571 -262325 38278 -245611 -375206 73896 -24835 203089 -67304
17633h8237A67176J94434A55519m1411N9062G0563A546a00127G2939a29690q9998
17622b19688C53951a22970e903k51141J21700A07507a29136B01962d6256D85328
17611B00973B6971Q3420q474r192e3937A43424a61130n6225J3920D47674h9472
17599B87226o0797j1773J33684A08522a53708A26192l7713J562i2941a4190A77024
17587a12997B16211d2306A1801J92228I3420R0482k8235c53843A94307m0184E3969
17575a58480A80055G7687L2860a48181I3918m3587A0360a47547A47930P6886a9607
17563C13604A31641d3644j35824b8401k01554B70909A1075J38218E4319g2703
17552D88363O7696d118C65954E0527E38g5305C11881A47430e0643B03269b62007
$$ plain form
17633 -88237 167176 361610 155519 114108 173170 70563 1546 -100127 72939 -129690 -219688
17622 -219688 353951 -122970 -5903 -257044 -135344 107507 -129136 201962 -46256 485328
17611 200973 26971 110391 101917 92725 -53937 143424 -161130 -217355 -203435 447674 -89472
17599 287226 226429 214656 348340 108522 -153708 126192 88479 90041 -92941 -14190 177024
17587 -112997 216211 -42306 11801 204029 93420 183902 155667 -353843 194307 154123 53969
17575 -158480 180055 77687 110547 -148181 93918 50331 10360 -147547 147930 224816 -19607
17563 313604 131641 -43644 -179468 -28401 -229955 270909 11075 149293 54319 -72703
17552 488363 556059 -4118 365954 50527 538 -75305 311881 147430 -50643 203269 -262007
17540a47677A5397L63066A06134D8872g014A39723a9253j21348J5807D4124i6907
17528A11839L4249h532A45896e7831B3663a05907B3714o773J12388k3086k0988
17517H5255a93582C40532e1227B50363k5275G1212d03658A77180n6618M06942
17507E27504a89647c2789A01895d0353C05251d1378n9705I5315K81154I8410g8056
17495A29692J79412A15331L025k5660a37087F4656N8043J86478P0915H7365O36
17484H8001K43748p8725K0898a8976G3104J59578D5790Q5045k6796K16873l8583
17473B82329F4803J70692M1931J15059j13401J49181A44063C3934K93489A52779
17462F2265B6809g1068C76850a13493n099I9564O8231c2291G7923L74262A73411
$$ plain form
17540 -147677 15397 378463 106134 48872 -7014 139723 -19253 -140601 -124794 44124 -96907
17528 111839 146088 -8532 145896 -57831 23663 -105907 23714 16941 129329 106243 85255
17517 85255 -193582 340532 -51227 250363 225088 71212 -403658 177180 120562 527504
17507 527504 -189647 -32789 101895 -40353 305251 -41378 -101083 95315 376469 98410 -78056
17495 129692 309104 115331 118356 92696 -137087 64656 122699 309177 380092 87365 88001
17484 88001 331749 253024 273922 -18976 73104 232682 45790 130835 104039 320912 282329
17473 282329 64803 235495 277426 392485 279084 428265 144063 33934 327423 152779
17462 62265 26809 -71068 376850 -113493 -118592 99564 167795 -32291 77923 452185 173411
17450a7478B22190K01935J23428o5008A68054K28493A91255H7862J35817p5291
17440A48388k3793B1056K14759K38769j93177F7171J52945R0964H5505J30531
17430B16036K41649A04012K75585A68669G9143K63531R984J09403J61438C142
17419D44053j03713j47629K87289B08855O7234L9635J33449l935j20408A41196
17408C06107G0216P8380a3411k8889A21773a44254A7668N2982N03342a07770B05061
17396C3923a06464C24695j1124r1126i7700B19697J29474M3427k9216j27657H1471
17384B04305j8238K369d4081B08111j8361n0633a78329C07541j26616i6957B89123
17372B99587A27340b2145D50370E1001a01005B54763N7983F3992L85400a18709
$$ plain form
17450 -17478 222190 424125 547553 482545 168054 396547 191255 87862 223679 148388
17440 148388 124595 21056 235815 474584 281407 67171 220116 311080 85505 216036
17430 216036 457685 104012 379597 168669 79143 342674 352658 462061 623499 3142
17419 444053 340340 192711 480000 208855 276089 315724 449173 445238 324830 141196
17408 306107 70216 148596 -13411 -42300 121773 -144254 17668 70650 573992 -107770 205061
17396 33923 -106464 324695 313571 222445 -97700 219697 349171 392598 363382 235725 81471
17384 204305 186067 188436 -44081 208111 189750 139117 -178329 307541 180925 -96957 289123
17372 299587 127340 -22145 450370 51001 -101005 254763 312746 63992 449392 -118709
17361I2318J14782L32156j95349j39743O1335e5431D52477J05184f5944H2627
17350C07250O1018F3864K31420A4488a8675B87837p1379R0678j45725J71220d9234
17338B53515A07841k6150B2843J98799j665q5596k4331J4938m7126P2501m7506
17327A02857f618E15655A01484J45747F8981g1091A66478F1896p354f6282j4710
17316h0992B60496J65156A49494c9039C34842A12771J50136N5174I5184b58445
17305B5568J78342L16907A20132J54623N2474a33359C19396l6252j7194A12701
17294i368B49829Q7258j20978g7920B09348p6799J64136p1685Q618E1038K09685
17283B60723M0173i3037G3742J07934J43529d9272F65181C3785J24690K36347
$$ plain form
17361 92318 207100 539256 343907 204164 265499 -55431 452477 557661 -65944 82627
17350 307250 368268 63864 295284 14488 -18675 287837 216458 307136 161411 332631 -49234
17338 253515 107841 81691 22843 221642 219977 134381 110050 124988 77862 150363 102857
17327 102857 -6618 515655 101484 247231 68981 -71091 166478 61896 54542 -66282 -80992
17316 -80992 260496 425652 149494 -39039 334842 112771 262907 318081 95184 -258445
17305 25568 203910 520817 120132 274755 327229 -133359 319396 283144 265950 112701
17294 -9368 249829 337087 216109 -77920 209348 132549 296685 225000 233618 51038 260723
17283 260723 300896 -93037 73742 181676 325205 -49272 665181 33785 158475 394822
17273C94822n8032L7792H9021K1827k1823J78305j438l9714k1762J25279r1204
17262B38491R12k3047a05352A28566i4215M6647B21039j02610N5751K726L87744
17251E64650k07502j52814q5193L04421k02696J57102n4392G7714j320j584K4265
17240I9075L36973l9321A74947o1893Q2637M5740j11332B140J11882K05981p0302
17229B49701i176B34538J38517i7713B59945K1291K4173J1896L6221Q4501k13037
17218B24990K52939A53232K47366j13062K03856n9195k08137J73113N9505A89464
17207B68947J36994K4040k04670A10199K4101R7309L1173l5298J9905K5451J17018
17196C89858A75279J91312q1904a9092D31346J8700O8177A99435K48518J29069
$$ plain form
17273 394822 336790 374582 89021 110848 89025 267330 265892 226178 204416 329695 238491
17262 238491 239403 216356 -105352 128566 -94215 -47568 221039 118429 174180 176906 564650
17251 564650 357148 204334 119141 423562 220866 377968 323576 77714 76394 74810 99075
17240 99075 436048 396727 174947 113054 195691 241431 130099 2140 114022 320003 249701
17229 249701 -9176 234538 373055 -97713 259945 281236 305409 317305 353526 438027 224990
17218 224990 477929 153232 400598 287536 491392 432197 224060 397173 456678 189464
17207 268947 405941 429981 225311 110199 134300 231609 262782 227484 247389 272840 389858
17196 389858 175279 366591 284687 -19092 431346 450046 518223 199435 447953 577022
17186E77022B71589j0120K39724A64661O0201M88786B21351B8551O20559B66911
17175D48831j91981J51599N8079j74265K31797j91495r8201a7512A95179J50102
17165C45281h630D48643q6154j02366L10830B32258J23255n923j68860K13373
17155C94103A51901O36096H1255M17012J84664k96154q4450K47349k55362K51995
17145E46309B20373K27961A73663J88892j79580J62203A57171K26162A83270K23887
17135D07157q5973O1891q5151J12307l8429L3401l4978n2807P1715A23740L29926
17124D53666q4836J9933j47951K53544J62094B38131L15109k18978j23630j4379
17114A96253L55356K6768a17206D52210k0528k6800j95121M28400k12131j32945
$$ plain form
17186 577022 271589 261469 501193 164661 224862 713648 221351 28551 649110 266911
17175 448831 256850 408449 466528 292263 524060 332565 234364 -17512 195179 345281
17165 345281 -8630 448643 362489 260123 570953 232258 355513 349590 180730 394103
17155 394103 151901 787997 81255 498267 682931 386777 302327 549676 294314 546309
17145 546309 220373 448334 173663 362555 182975 345178 157171 383333 183270 407157
17135 407157 321184 383075 297924 410231 371802 405203 370225 317418 389133 123740 453666
17124 453666 368830 388763 240812 494356 656450 238131 553240 334262 210632 196253
17114 196253 551609 578377 -117206 452210 431682 404882 209761 638161 426030 293085
17104B93085M92396B91159K84807k55424J01301G5939N22989j06078j60570p3356
17094B58924H1599N51704l10122M02468O1633B81259k7483M00174A50288K72888
17084D23176J52068B72109K81800k4400K57250j60363m4352J56730l05471K73147
17074G06450j46665n3464J35603l8920J23772r5677j73739j4159R5775L67552
17064I06528k30305k22433M27391C39924J0068J77355p3122R7688j57890J79843
17054E73866K8981n9538n0161q3471M62484l78259R7248j56224K95786N4219k52096
17043E32835p529J08864j89983j08898J18061j6867K26242m8628N9209l5989j17824
17032E19493K82488r083j09752j73511K04321P3857K34217m14626J72141l02543
$$ plain form
17104 293085 785481 291159 575966 320542 421843 75939 598928 492850 332280 258924
17094 258924 81599 633303 323181 725649 787282 281259 253776 653950 150288 423176
17084 423176 575244 272109 553909 529509 786759 626396 582044 738774 433303 706450
17074 706450 559785 506321 641924 603004 726776 631099 457360 443201 538976 906528
17064 906528 676223 453790 881181 339924 349992 527347 454225 551913 394023 573866
17054 573866 602847 543309 493148 409677 872161 493902 591150 434926 730712 784931 532835
17043 532835 525306 634170 444187 335289 453350 436483 662725 614097 673306 637317 519493
17032 519493 801981 792898 683146 509635 713956 787813 1022030 607404 779545 477002
17022D77002L28629N3434j4452l8429L595L9059k10522J32413j27258J39680R446
17011G92597n5198j34715j03106L00332J10769O8553k73637L6249l1187L50296
17001A060953k55677m9768J3502M2353n9725L4069j57444J74682K2384L09302
16991A134631l3276k70647j70397L30557K98364m72048K96420m92071M68186q5817
16981A003902j56637k4221J11506J07332j24306J8484J30017j77955L68623j47336
16971A109409p9385o593o4948L29347k73842J19465j44979J28116L49770o17043
16961H49317M09221q3993J48205k16838l39578M69114r5941K39745j89899K7402
16951A216755j3014L0465J97916j18504o8943j79612N0635K44795l52149R6822
$$ plain form
17022 477002 805631 859065 844613 806184 809779 848838 638316 770729 643471 783151 792597
17011 792597 737399 602684 499578 799910 910679 979232 705595 741844 710657 1060953
17001 1060953 805276 755508 769010 811363 751638 785707 628263 802945 825329 1134631
16991 1134631 1101355 830708 660311 990868 1289232 817184 1113604 621533 1089719 1003902
16981 1003902 847265 823044 934550 1041882 917576 936060 1066077 888122 1256745 1109409
16971 1109409 1030024 1023431 958483 1287830 1013988 1133453 988474 1116590 1466360 849317
16961 849317 1258538 1174545 1322750 1105912 766334 1235448 1139507 1379252 1189353 1216755
16951 1216755 1203741 1234206 1432122 1313618 1244675 1065063 1115698 1360493 1008344 1105166
16941A105166K06097K71315n40591M93972k26444K04914K2801m52204J1700r256
16931A087470N32837J27227j13527r0000M8053j7487j33210L98599k92509J87696
16921A735149k95958P9633O5346L67748m73614K70335l27034N8203r5827K58586
16911A642567j28240K33956M0893J26153o2382J91392q2784k46328K36108o7319
16901A884016L7561j60065M21525j59493j22351K45945l33156M10455r5333p0795
16891B058309L49771m20678K32541P7505o6404K74807j38126J23014J8452n62732
16881A946459L40148K18641k5452L67125k11114J29577j86260k07736L0040K97300
16871B698728k77231L66667J1911j37096K07376N4667Q2880J64570l38254M93058
$$ plain form
16941 1105166 1311263 1582578 1041987 1535959 1309515 1514429 1537230 1085026 1096726 1087470
16931 1087470 1620307 1747534 1634007 1544007 1592060 1574573 1441363 1839962 1547453 1735149
16921 1735149 1439191 1518824 1584170 1951918 1478304 1748639 1421605 1479808 1383981 1642567
16911 1642567 1514327 1748283 1789176 1915329 1852947 2044339 1961555 1715227 1951335 1884016
16901 1884016 1921577 1761512 2183037 2023544 1901193 2147138 1813982 2224437 2129104 2058309
16891 2058309 2408080 1987402 2219943 2297448 2231044 2505851 2367725 2490739 2509191 1946459
16881 1946459 2286607 2505248 2479796 2846921 2635807 2765384 2579124 2371388 2401428 2698728
16871 2698728 2421497 2788164 2800075 2662979 2870355 2925022 3007902 3172472 2834218 3327276
16861C327276m62586L38991O7398J02147n6202j2627K02101o6070j75075L90060
16851C655413J99699m2146r0648J24579J83529k71590J47370j36786N46815k85615
16841D030620O6872j28139L36513K26957L1094j74276K24718m3500K29120p259
16831D792720Q2385J47713j45605J81666L32368J24305j27667Q7550P174j6123
16821E466486L63249m0390K06928J87793L46370K36075m35840P30560n40511K74404
16811F795124J53162L75669n25851N92329L41292j04339M36850j17381K07292
16802H154147L84375K95129N454K37624L00465K65970J76525m2835L53939L12215
16792A0443008M20660m3330M43747M3284L03112M78468M26562O7097M65309O9836
$$ plain form
16861 3327276 2864690 3203681 3271079 3373226 3317024 3304397 3506498 3440428 3265353 3655413
16851 3655413 3855112 3812966 3722318 3846897 4030426 3758836 3906206 3769420 4316235 4030620
16841 4030620 4097492 3969353 4305866 4532823 4563917 4389641 4614359 4570859 4799979 4792720
16831 4792720 4875105 5022818 4877213 5058879 5391247 5515552 5387885 5475435 5482609 5466486
16821 5466486 5829735 5789345 5996273 6184066 6530436 6766511 6330671 7061231 6520720 6795124
16811 6795124 6948286 7323955 6798104 7390433 7731725 7627386 8064236 7946855 8154147
16802 8154147 8538522 8833651 8839105 9076729 9377194 9643164 9819689 9776854 10130793 10443008
16792 10443008 10863668 10820338 11264085 11307369 11610481 12088949 12515511 12582608 13047917 13117753
16782A3117753P18358L09426N74083K81814M68785K27702O37732L66086P07560
16773A7409299L25325O73408N64087Q14709O09360P37545Q35537M76553J319119
16764B3764942M30295J356612O67250Q63677J191322Q46603J213806R27355J637958
16755C2899820J398606R06449J909075J432264J771565K128892J794908J888182
16747D6129761K182119K550150K301249K547026K799982L253047K773888L735042
16739F8272264L283043M010381M144771M145752M360392M453631N113417N238102
16731A03021753N291478N955186N940473O066796N934964N800911O097303N949972
16723A50058836N340102N436080M347090M247502L080881K535214J771648O01059
$$ plain form
16782 13117753 13836111 14145537 14719620 15001434 15470219 15697921 16335653 16701739 17409299
16773 17409299 17734624 18408032 18972119 19786828 20396188 21133733 21969270 22445823 23764942
16764 23764942 24195237 25551849 26219099 27082776 28274098 29120701 30334507 31261862 32899820
16755 32899820 34298426 35204875 37113950 38546214 40317779 42446671 44241579 46129761
16747 46129761 48311880 50862030 53163279 55710305 58510287 61763334 64537222 68272264
16739 68272264 71555307 75565688 79710459 83856211 88216603 92670234 97783651 103021753
16731 103021753 108313231 114268417 120208890 126275686 132210650 138011561 144108864 150058836
16723 150058836 155398938 160835018 165182108 169429610 172510491 175045705 176817353 177418412
16715A77418412n99578j516814k362473k831968m004549m376588n219186n717111
16707A50790145o093323n790395o446758o190302o079701o064095n873974n384098
16699A02867499n129727n700621m834328m662603m647836l772601l903286l608880
16691F6607617l652179l117748l129835k666691k882470k331444k366270k250977
16683D4210003k109667j532055k385675j623673j472284j648851j536140j046436
16675C0855222j146482j467564q93684j136538r91412j192614j176149n85858
16667B2264921m56924r66131p41772r20820k12818p52747p46942p42893k17096
16658A6506778p57380m84251o15966k13224m81610l23519p85434j66171k07183
$$ plain form
16715 177418412 176818834 175302020 172939547 170107579 166103030 161726442 156507256 150790145
16707 150790145 144696822 138906427 132459669 126269367 120189666 114125571 108251597 102867499
16699 102867499 97737772 92037151 87202823 82540220 77892384 74119783 70216497 66607617
16691 66607617 62955438 59837690 56707855 54041164 51158694 48827250 46460980 44210003
16683 44210003 42100336 40568281 38182606 36558933 35086649 33437798 31901658 30855222
16675 30855222 29708740 28241176 27347492 26210954 25219542 24026928 22850779 22264921
16667 22264921 21807997 20841866 20100094 19179274 18966456 18213709 17466767 16723874 16506778
16658 16506778 15749398 15265147 14649181 14435957 13954347 13630828 12845394 12679223 12472040
16649A2472040n50826k00473l06473m55209p3619m34228o00108r0096k73669j75745
16639I311594K2199q52257K30823j67337j39856J58190q25175L8673j1253m45947
16629G319654j5020q4438j95643m62426L428j75842k61529m28958K30460J01860
16619F031546p50973M92114k18220q9017j53474l69970j35568L2611M1101q2147
16609D798003p1847m87158J15866J95289l27248l82k77021O9722k90593J53077
16599C877708J66955k64356k48745J23922o9942l3582j96921J34921k69260K82423
16589C503123k34597P3116J43590l10181o4666m17177N05737p7295m6544k34477
16579B840629k30585K13063k21460M50159m77175j9788j51555k13265L47481k0712
$$ plain form
16649 12472040 11921214 11720741 11414268 10959059 10885440 10451212 9851104 9761008 9487339 9311594
16639 9311594 9333793 8481536 8712359 8545022 8405166 8563356 7738181 7776854 7765601 7319654
16629 7319654 7304634 7220196 7024553 6562127 6565555 6389713 6128184 5699226 5929686 6031546
16619 6031546 5280573 5772687 5554467 5465450 5311976 4942006 4806438 4839049 4880150 4798003
16609 4798003 4726156 4238998 4354864 4550153 4222905 4222523 3945502 4015224 3724631 3877708
16599 3877708 4044663 3780307 3531562 3655484 3585542 3551960 3355039 3489960 3220700 3503123
16589 3503123 3268526 3341642 3485232 3175051 3110385 2693208 3198945 3121650 3075106 2840629
16579 2840629 2610044 2823107 2601647 3051806 2574631 2554843 2403288 2190023 2537504 2516792
16569B516792K3107j55387J39282j29741p606o1142j80007n5545J86321m4253
16559B231821l33040K38244l9110j51539J24463N4863o02358M75104k24609J7263
16549A791102O879J51650l17919r9621K16443J62473j83009m1482R57k43692K77105
16538A720886j80153k36195L29279P129k22745k4978K15234k98351k36786N12069
16528A585389j50977k82437J24400K000l79275P49090l80473j93667J18665L54490
16518A547205j50612P5872k54506J66265k55235J55892m2605O543q4921J29564
16508A293462k67248q7991K95168M7882r248j64935l7424k52725O5187K48940
16498A131068k56715K51449Q2653m05010L85352k36703J2099R571K04906n57458
$$ plain form
16569 2516792 2539899 2384512 2523794 2394053 2386447 2325305 2145298 2089753 2276074 2231821
16559 2231821 1898781 2137025 2097915 1946376 2070839 2125702 1523344 1998448 1773839 1791102
16549 1791102 1797981 1949631 1631712 1532091 1748534 1911007 1727998 1686516 1687473 1443781 1720886
16538 1720886 1540733 1304538 1633817 1640946 1418201 1393223 1608457 1310106 1073320 1585389
16528 1585389 1434412 1151975 1276375 1278375 899100 1648190 1267717 1074050 1192715 1547205
16518 1547205 1396593 1472465 1217959 1384224 1128989 1284881 1242276 1248819 1163898 1293462
16508 1293462 1026214 938223 1233391 1281273 1272025 1107090 1069666 816941 882128 1131068
16498 1131068 874353 1125802 1208455 803445 1188797 952094 964193 973764 1178670 621212
16488F21212L71683j21089k65509L78376p3471N4978j86273j35617O4932L45013
16478A054235l48016K32652J02984C27997O18454q190j24189l19805M22952J52078
16468A069297J7475k64930Q0499M8127C77925M32968k46399K25587j32696J06960
16458G64345L7348j40532k12108J55443j05032q7429J94490Q7280R6460K49218
16448A039483K4145l97503p8546l5518J86693C67056L76151A56351K44650M9253
16438D50254J58465j86700J06554k03868J45542j22376l975L53580l47883K86365
16428F35958j57821A57922K35522J95781J38344j49815L2682j28649k6770Q3382
16418E38399j94844O2312j06342J74951J13154K28024p7936j97699j76628P8556
$$ plain form
16488 621212 992895 871806 606297 984673 911202 966180 779907 644290 709222 1054235
16478 1054235 706219 938871 1041855 327997 946451 938261 814072 494267 917219 1069297
16468 1069297 1086772 821842 902341 950468 377925 810893 564494 790081 657385 764345
16458 764345 801693 661161 449053 604496 499464 412035 606525 693805 790265 1039483
16448 1039483 1063628 666125 587579 552061 738754 367056 743207 156351 401001 450254
16438 450254 608719 422019 528573 324705 470247 347871 343896 697476 349593 635958
16428 635958 478137 157922 393444 589225 727569 577754 610436 481787 455017 538399
16418 538399 343555 405867 299525 474476 587630 815654 737718 540019 363391 441947
16408D41947J55991k76933j32641J90164n3941J10591B8308N29821k03444p0011
16398B84674L74461j80370M6199J33805a31688B75474L58681H7223L36817A69075
16387D02287J94704k88198A47778K19623N0932J08533B15637N4091J27426G2469
16376C98690g9778E91111k58709N7624J8567J07216j46437L45294H8408K36080
16366C24488A3374J60721J99872I3764J61172O9000A23392J99409A20251a16942
16355B12073L50240B47625P753j2786o313K98887k21566K03097A60644K09704
16345C70348J04080J03751A53993M408J65411j826O658R3637A23926J59026H5421
16333E31794A60104J69760J75783A65235J04445J37423j31274A37022K11939j01149
$$ plain form
16408 441947 597938 321005 188364 378528 324587 435178 28308 558129 354685 284674
16398 284674 659135 478765 524964 658769 -131688 275474 634155 87223 424040 169075
16387 402287 596991 308793 147778 367401 418333 526866 215637 269728 397154 72469
16376 398690 -79778 591111 332402 390026 408593 515809 369372 714666 88408 324488
16366 324488 13374 174095 373967 93764 254936 323936 123392 322801 120251 -116942
16355 212073 562313 247625 255378 242592 236279 535166 313600 516697 160644 370348
16345 370348 474428 578179 153993 158401 323812 321986 328644 422281 123926 282952 85421
16333 531794 160104 329864 505647 165235 269680 407103 275829 137022 348961 247812
16323B47812k1195K10971A10973d3538B11302J35773E5260M0303P1221K935J21009
16312B90728A41016R8375r2765n858N3117J86870O4133P0626A78642Q604Q726
16301A95972j7891L40209B03484m4290K03742a12476B5455j1269J74343H6748
16290e6715C79231r8114l811A15983j1006P9429q797K07721A3204K31031L1976
16279B76211I3699k0614N9209m0388J71546A03057J29302R885J09983P4105E8743
16267A1265J18781i5538A34194n3469O5333h7005A98052L51465A98148n2689J97874
16256C43333b3587C61821j17254b60362A0114i6217j9124q549A12127a08162B60119
16244c53010C50376A31237E5981O7919M6860l7367f8965n5252k0042B7252K61559
$$ plain form
16323 247812 226617 437588 110973 -43538 211302 347075 55260 95563 166784 169719 290728
16312 290728 141016 239391 146626 140768 193885 380755 444888 515514 178642 187246 195972
16301 195972 178081 518290 203484 159194 362936 -112476 25455 14186 188529 86748
16290 -56715 379231 281117 277306 115983 104977 184406 175609 383330 13204 244235 276211
16279 276211 93699 73085 132294 91906 263452 103057 232359 242244 352227 426332 58743
16267 11265 130046 -95538 134194 80725 146058 -87005 198052 549517 198148 145459 343333
16256 343333 -23587 361821 244567 -260362 10114 -96217 -115341 -123890 112127 -108162 260119
16244 -353010 350376 131237 55981 123900 170760 133393 -68965 -124217 -144259 27252 288811
16233B88811f1243C59714p931A51262L12384D8707a18886A76712q3141a28078
16222B66847d101C7390i3645D3312K12514a82007C99695f1549c713j01923B832
16210a08840A40278N3058a81550A50141L9809J0795K7593I4401K34729b2680C45046
16198A72532G1789L2207a81274q2602B8367b727A011h9658l22850B3468Q6965
16187A10433r046O5781E0964K22561q9554L50807B47065p0210a9608n8566A56713
16175A09229a23712C2769N7145P7865c34992P6752b6946B23113q5603e16063A89502
16163H8190K35750K13459D0355Q3458m0489d4312A03896K34154j50277J39557
16153C27330A10019m3975L4221k4853a8139k9572H9102K05021E1634K75023G7409
$$ plain form
16233 288811 -61243 359714 351783 151262 463646 48707 -118886 176712 93571 -128078
16222 266847 -4101 37390 -93645 43312 255826 -182007 399695 -61549 -3713 -105636 2832
16210 -108840 140278 193336 -181550 150141 189950 200745 228338 94401 329130 -22680 345046
16198 172532 71789 103996 -181274 -263876 28367 -2727 1011 -89658 -412508 23468 110433
16187 110433 101387 167168 50964 273525 183971 534778 247065 176855 -19608 -78174 156713
16175 109229 -123712 32769 89914 167779 -334992 -258240 -26946 223113 137510 -516063 189502
16163 88190 323940 537399 40355 123813 83324 -44312 103896 338050 187773 327330
16153 327330 110019 66044 100265 75412 -18139 -47711 89102 294123 51634 326657 77409
16141C5763b25686E354O8339K31128a65445I781a20739A79895i284A28732c28797
16129G181J01079J14805J5835j17138n7305b848p9158A0367K08522g672F000c26321
16116A3053R6763N2168A737a7762m0035j50611A52732O05a08328A94039e345k45365
16104b50710F875M479d968D51233j72202J09703J33265f408j88244A9774N6755
16093G6529J72367h8328l6342n7162c9416j19460E1894J24726i7225B16703p0827
16082A45876J21644b8878A22448l3798a32640A72730E8503b0937C2726J72413
16072B05139A01445i5463j66292d4152J4017I3489K3989K6793i6851F7161i8626
16060C0739e5672l04361A84137a0856k34415A34978h9549r3779l3733b4674n5317
$$ plain form
16141 35763 -225686 5354 73693 304821 -165445 9781 -120739 179895 -9284 128732 -328797
16129 7181 108260 223065 238900 121762 64457 -2848 -82006 10367 218889 -7672 6000 -326321
16116 13053 109816 161984 1737 -17762 -57797 -208408 152732 153337 -108328 194039 -5345 -250710
16104 -250710 6875 11354 -4968 451233 279031 388734 521999 -6408 -194652 19774 76529
16093 76529 248896 -88328 -124670 -181832 -39416 -158876 51894 176620 -97225 216703 145876
16082 145876 267520 -28878 122448 88650 -132640 172730 58503 -20937 32726 205139
16072 205139 101445 -95463 -261755 -44152 -30135 93489 117478 144271 -96851 67161 -98626
16060 30739 -55672 -360033 184137 -10856 -245271 134978 -89549 -183328 -217061 -24674 -79991
16049g9991A9780K27207a99462p4259G5650R0607D4325O1362A6904b78266A56819
16037a38837O3585C9533a73951q2574A6067J33583I126f2227J5670B66665f3579
16025H5855O0715b72936M9330a03099c4715k20364j98154J81459k8813j4291j5200
16014c30078B1966J42355a7427B46100p3743i5782D6833a95730f1138n883A17943
16002H2162b29908A9967J44033J66879h4488j08634g8696F0268f642k5434A01357
15990b07794A33855D2177b69713J24276A81445J20309j07853B4786e8151D13448
15979G3030J24183C7491d9180A97492m7652N0118C9809g4941k60985D0924b60260
15967b38136C2707M0889B4566a95017A62805a24966j16859g5980B66001h4592
$$ plain form
16049 -79991 19780 246987 -199462 -273721 75650 166257 44325 105687 16904 -278266 156819
16037 -138837 -75252 39533 -173951 -256525 16067 149650 9126 -62227 -46557 266665 -63579
16025 85855 146570 -272936 -223606 -103099 -34715 -255079 -453233 -271774 -300587 -314878 -330078
16014 -330078 21966 164321 -17427 246100 172357 -95782 46833 -195730 -61138 -67021 117943
16002 82162 -229908 19967 164000 330879 -84488 -193122 -78696 60268 -6642 -32076 101357
15990 -207794 133855 42177 -269713 -145437 181445 301754 193901 24786 -58151 413448
15979 73030 197213 37491 -49180 197492 149840 199958 39809 -74941 -335926 40924 -260260
15967 -238136 32707 73596 24566 -195017 162805 -124966 -241825 -75980 266001 -84592
15956E69625G8447j001Q3639L884i0130j48235a01158k7493B39570G6700a05370
15944b86696J04744F4603a16984F5758J11510D0886e0339m4448A16544J3572G425
15932A77530P3423b77343i769A63976R4470c188A61196c16632h393k67905G2645
15920a28498a6844j8996E0702L8936i2812B09714b120B15700b80709a19668G9668
15908A78106d5995A2705L05936b41208b2768A5066f1559l675k5976K2920j31648
15897a99938G2773b13682H7669a68525C84835o3343A3328d13716A73563F0813
15886A88705a12940A82231a15900O863M2983A7922a14288C30670j12919O5420
15876B83171m4966a41936F7106g1963I244b1604m8718A52001H639g5885A16876
$$ plain form
15956 569625 78447 77446 161085 164969 -90130 -238365 -101158 -128651 239570 76700 -105370
15944 -286696 -181952 64603 -116984 65758 177268 40886 -50339 -94787 116544 130116 7425
15932 177530 250953 -277343 -9769 163976 258446 -3188 161196 -316632 -8393 -276298 72645
15920 -128498 -16844 -35840 50702 89638 -92812 209714 -2120 215700 -280709 -119668 79668
15908 178106 -45995 12705 318641 -241208 -22768 15066 -61559 -65234 -91210 -68290 -199938
15897 -199938 72773 -213682 87669 -168525 384835 321492 13328 -413716 173563 60813
15886 188705 -112940 182231 -115900 -109037 -66054 17922 -114288 330670 217751 283171
15876 283171 238205 -141936 67106 -71963 9244 -21604 -70322 152001 8639 -75885 116876
15864C47164j33872G8890g1230d860m9957j06778c0241r1478j42461a24095j25231
15853b49326k7329f7681o3042K9008D8129J52446L8484a37751r4164j9816L5811
15842b15920l9059A5767n848a68757p5918N246d6682D1866e3103j30379D5398
15830a87801G7989N7777f2299K0733k3488A78939f356j12090j42989E8843Q436
15819F7279J06278a65886A63545D7125p052M9786K18588c13459a11023k04237
15809c15260D12375b10039p6462f3549n2226G1805b18891j5410C24997a7553B63030
15797a44698d9298G6761a01273k1120C61101e5315i157l10409B31365k5915K8090
15786B33540l4851J01600j46749i3879D279b36089b7859A35575A4809M0293b29484
$$ plain form
15864 347164 213292 78890 -71230 -4860 -54817 -161595 -30241 -121719 -264180 -124095 -249326
15853 -249326 -276655 -67681 -130723 -101715 48129 200575 239059 -137751 -231915 -251731 -215920
15842 -215920 -254979 15767 9919 -168757 -244675 -239429 -46682 41866 -53103 -183482 45398
15830 -187801 77989 135766 -62299 -41566 -65054 178939 -6356 -118446 -261435 58843 67279
15819 67279 173557 -165886 163545 47125 40073 89859 308447 -313459 -111023 -315260
15809 -315260 412375 -210039 -286501 -63549 -115775 71805 -218891 -234301 324997 -17553 263030
15797 -144698 -49298 76761 -101273 -122393 361101 -55315 -9157 -319566 231365 205450 233540
15786 233540 198689 300289 153540 -93879 4279 -236089 -27859 135575 14809 55102 -229484
15774G0866b47305J8417e5891j57925H7611j7773c04101i4257n7503I9016f4735
15762G001a09074j35952R4057O2230E149Q9657a77547h8338m2276A29599B351
15750B1486L63347b8577j5506b1770j0169k40597A67914a24188j12439G0223M5531
15739A15754b69371A97498o4587k8327b56414C8325d1659A19471e6102A8043J37537
15728A55580a08653M1301A4501a53266B6360Q4819b61714a02473D1422b06127
15717a9916I8708j7984c31414k7491B22324n6290a77870B24459b03753j95397
15707c99150H9443J14243b67135i3731B6155c3545j09174A92000n230n1939g6874
15695a17748k55461J9225b3294A22004a17803N0320K799A60160A8019M184e6837
$$ plain form
15774 70866 -247305 -228888 -55891 -213816 87611 69838 -304101 -94257 -151760 99016 -64735
15762 7001 -109074 -245026 -150969 -88739 5149 94806 -177547 -88338 -130614 129599 2351
15750 21486 384833 -28577 -44083 -21770 -31939 -272536 167914 -124188 -236627 70223 115754
15739 115754 -269371 197498 132911 104584 -256414 38325 -41659 119471 -56102 18043 155580
15728 155580 -108653 -67352 14501 -153266 26360 111179 -261714 -102473 41422 -206127
15717 -19916 98708 80724 -331414 -358905 222324 166034 -177870 224459 -203753 -399150
15707 -399150 89443 203686 -267135 -93731 26155 -33545 -142719 192000 186770 134831 -76874
15695 -117748 -373209 -353984 -23294 122004 -117803 -67483 -64684 160160 18019 22203 -56837
15683A20203C6267h0454B3452d88550D22535a47031g2033I1962a00447c3308C5252
15671a13526I290L28142a29719K6283J4030B22510m0801b74608D3771J66411r6631
15660A13551g4747l5379l9696g007j23994e7479G2143B1665a04280K533j03848
15649b05595a3401j7148C9541K12410e339C48082A1845g2067r4571c8194B1352
15637a85349j22139A84548J0323f0745j35496b9522n8376k81579a74248D2944
15626d4206j82753c1196D4693K45388o7393a17891A00914R9534c8085m2891j77004
15615b57980C31839d64290G3384J3465J4408a03304j91534e4892A6000L0531G81
15603I148J82624J10200f4302A44594a90138c375a093A07106b59808i4662r6514
$$ plain form
15683 120203 36267 -80454 23452 -488550 422535 -147031 -72033 91962 -100447 -33308 35252
15671 -113526 9290 337432 -129719 -103436 -89406 222510 181709 -274608 43771 210182 113551
15660 113551 -74747 -110126 -149822 -7007 -131001 -57479 72143 21665 -104280 -101747 -205595
15649 -205595 -13401 -30549 39541 251951 -5339 348082 11845 -72067 -166638 -38194 21352
15637 -185349 -307488 184548 194871 -60745 -196241 -29522 -87898 -369477 -174248 42944
15626 -44206 -226959 -31196 44693 290081 222688 -117891 100914 200448 -38085 -80976 -257980
15615 -257980 331839 -464290 73384 86849 101257 -103304 -294838 -54892 16000 46531 781
15603 9148 191772 301972 -64302 144594 -190138 -3375 -1093 107106 -259808 -94662 -191176
15592a91176k929C03334A24757J45268i1256q8324A14594j3050b18066A13617
15581a09066B7514g2524K138m1852j12113a9032A41773a506m7889M349A61096
15569C30591J4202F9335a61306A45613b39519j8911A96652J50239P301C7045J42453
15558A79498a22450G8444c50958h5237l3427D5490p915a78302o4502g6303j30439
15547b06742B8411M9733K44514H578K47424a28518b6187l9423c525k32879D11702
15535b56883B98105c08305J49022O5321J7416q2859J1975I1745J84477A37161
15524e3644j5849A40289b8915j11372j54270A49369k0750b37238J15209e5461
15513i6674b1024j8393A27295a44216F32b96607A5394c114B7266J5663Q7081d7217
$$ plain form
15592 -191176 -194105 303334 124757 270025 -91256 -179580 114594 101544 -218066 113617
15581 -109066 27514 -72524 -70386 -112238 -224351 -19032 141773 -1506 -49395 -45046 161096
15569 330591 344793 69335 -161306 145613 -239519 -258430 196652 346891 354192 37045 179498
15558 179498 -122450 78444 -350958 -85237 -118664 45490 37575 -178302 -242804 -76303 -206742
15547 -206742 28411 78144 322658 8578 256002 -128518 -26187 -65610 -3525 -236404 411702
15535 -256883 298105 -308305 -159283 -93962 -76546 -159405 -147430 91745 276222 137161
15524 -53644 -69493 140289 -28915 -140287 -294557 149369 128619 -237238 -122029 -55461
15513 -96674 -21024 -39417 127295 -144216 632 -296607 15394 -3114 27266 42929 130010 -47217
15500d974A17389i0974H8022J51984a34408k04401a15393F1036b32356A48490
15489h6387r3682B53834a00331r2968F8383d6294k69906E9382a69634L0715A06581
15477A47790n3858b26754B73046j11687j6954A9770N354a35472E1125J32690a4832
15465g4060F07941A18642d9604F3248g6984B23697J7682b45717q1409a1786B50364
15453c48303C38925C5241N8597C0117N18323b65654A01862n030a42650A01539
15442A7993a9397F3271A6210K3470O5823c01441K8659A73531a99964P5965A9876
15430A19675K0312A469M55676a51550A62541m5694m4967h3454j79691A41097C9994
15418A21732J70867A01977e337p24H8664b05683A54675K1129a6220n0804C02693
$$ plain form
15500 -4974 117389 -90974 88022 240006 -134408 -338809 -115393 61036 -232356 148490
15489 -86387 -180069 253834 -100331 -193299 68383 -46294 -316200 59382 -169634 -138919 106581
15477 147790 93932 -226754 273046 161359 144405 19770 25124 -135472 51125 183815 -14832
15465 -74060 607941 118642 -49604 63248 -76984 223697 241379 -245717 -327126 -11786 250364
15453 -348303 338925 35241 93838 30117 548440 -265654 101862 96832 -142650 101539
15442 17993 -19397 63271 16210 39680 105503 -301441 -272782 173531 -199964 -123999 19876
15430 119675 139987 1469 457145 -151550 162541 116847 71880 -83454 -263145 141097 39994
15418 121732 292599 101977 -5337 -6061 88664 -205683 154675 175804 -16220 -67024 302693
15406A75688L8872A5788g5389m8726a28B14830A7275P4109J68634a93279A39164
15394e1427A3810O3565M3681J8532a03228H6160b48177q2304a33196A47129K2351
15383A69480N1210A2507a88851I534c9460l69579F8140d3637A06390K78941C7639
15371D59018E6114L16814h6275J9184n591j47724c538H7662a67956B01955A4140
15359B01623m8035c9258n240B84376b44912C55158d40085A15656K89757m6008
15349C59405j10587a29686D4687R2525b36377i040C90470D0701J98096A08016
15338B66565G8078a2638H0147d6486G7107I475J72358H7438J01215i8352m7348
15327a45700B15661G5448J05057b2773m953F4262n34a39458B37954j13481a24193
$$ plain form
15406 175688 214560 15788 -75389 -124115 -128 214830 17275 91384 260018 -193279 139164
15394 -51427 13810 77375 121056 139588 -103228 86160 -248177 -330481 -133196 147129 169480
15383 169480 220690 12507 -188851 9534 -39460 -409039 68140 -43637 106390 385331 37639
15371 459018 56114 372928 -86275 -67091 -72682 -220406 -3538 87662 -167956 201955 14140
15359 201623 153588 -39258 -44498 284376 -244912 355158 -440085 115656 405413 359405
15349 359405 248818 -129686 44687 137212 -236377 -9040 390470 40701 238797 108016
15338 266565 78078 -12638 80147 -46486 77107 9475 181833 87438 188653 -98352 -145700
15327 -145700 215661 75448 180505 -22773 -27726 64262 63728 -139458 237954 124473 -124193
15315A39728n6684J22032a08710j32199A21695J74688h2041C00272b1742E9333
15304c20617a57228N2147A92419H2270b9646j41437j05018a12885d6405A34655
15293B05924o8233J2365b8137o8981B32670I3975i750j0548k68261J0659a08037
15281A89466a65108C38582a30172I1416i5848I7166K03653B890K40090a55596
15270B8471M740a74176G2861R6236a1169F0574J06487M9211G711K57962E2634
15258A43686F0892L89227j64146A13259q793c284F2483L34734r7629K28469j52437
15247C75620r6610O56170J117988l42758N8009N04844j039064D14194D0012L64820
15237D04832q5987c485B13687f186B13746a73590B83463J20587b22995B68891
$$ plain form
15315 139728 83044 205076 -108710 -240909 121695 296383 -82041 300272 -21742 59333
15304 -320617 -157228 -105081 192419 82270 -29646 -171083 -276101 -112885 -46405 134655
15293 205924 137691 150056 -28137 -97118 232670 93975 -9750 -20298 -288559 -277900 -108037
15281 189466 -165108 338582 -130172 91416 -95848 97166 300819 2890 242980 -155596
15270 28471 33211 -174176 72861 169097 -11169 60574 167061 216272 7711 265673 52634
15258 143686 60892 450119 285973 113259 104466 -3284 62483 397217 299588 528057 375620
15247 375620 279010 935180 2053168 1710410 1768419 2273263 1234199 414194 40012 404832
15237 404832 318845 -3485 213687 -6186 213746 -173590 283463 404050 -222995 268891
15226a0694B5716K16736E6142J46587l5679n2246K034J95470d0702j37148H7551
15214b1693F6410a14681G3633N4509b21966A40494J23288f8053H7187q574a7914
15202C08624A47309b35475b0294B72957r7352J05014A12691b8785B35534a94652
15191B32952A7311N8398J77218m5820G0791a19112B59433A24781A9266R2817P5461
15180A87544j2076J0351A6512A985J01178J1748e6637E11308A07938J61481I9259
15168A63917b7320F2537c0012E9087J336e5836a055B85253K8763A14762K71423
15157C86185f4107o1967B37118F9678a9711c54I5759D0730a44854B98891j47593
15146A51298J43775d7766b2244A75923j0461L3773o827J8385k703j02128k5168
$$ plain form
15226 -10694 25716 242452 56142 202729 167050 114804 116838 312308 -40702 -177850 87551
15214 -21693 66410 -114681 73633 128142 -221966 140494 263782 -68053 87187 78613 -17914
15202 308624 147309 -235475 -20294 272957 175605 280619 112691 -28785 235534 -194652
15191 232952 17311 75709 252927 207107 70791 -119112 259433 124781 19266 112083 187544
15180 187544 175468 185819 16512 1985 103163 114911 -56637 511308 107938 269419 99259
15168 163917 -27320 62537 -30012 59087 60423 -55836 -1055 285253 314016 114762 386185
15157 386185 -64107 -126074 237118 69678 -19711 -354 95759 40730 -144854 298891 151298
15146 151298 295073 -47766 -22244 175923 165462 199235 192408 210793 208090 105962 80794
15135H0794A0193J00908d4454A63859C8713a30069B03083L33005j11937A74414
15124A19279J1378F3829e990A28937L012J70137A8926P3972L72745k12275J2427
15113B65795G8056R0383J71540r1419Q7385b6367B60582a5153j03383A55986b0095
15101E0639M13897B08367h806A35311K2467G984d3648I1895J78179M3943c3760
15089a68633A6530J11294J35609P583A26836K8292h3221a8434j3842D26764b0793
15077C7426Q8011Q5078a37649K7409E44790k70332R2171A38612Q1923P6986k9105
15066B68416k4645Q1959a26504I1531K37017a3157B14113C5319M75291B26345
15055B69144m394j03643i2693B69912A03121B7031L68673q4702p5012j820m6580
$$ plain form
15135 80794 10193 111101 -44454 163859 38713 -130069 203083 536088 424151 174414
15124 119279 130657 63829 -5990 128937 131949 302086 18926 92898 465643 253368 265795
15113 265795 78056 168439 339979 248560 335945 -26367 260582 -15153 -118536 155986 -20095
15101 50639 464536 208367 -8806 135311 157778 7984 -43648 91895 270074 314017 -33760
15089 -168633 16530 127824 263433 271016 126836 155128 -83221 -18434 -32276 426764 -20793
15077 37426 125437 210515 -137649 -110240 544790 274458 366629 138612 220535 297521 268416
15066 268416 243771 325730 -126504 91531 328548 -13157 214113 35319 510610 226345
15055 269144 264750 161107 -92693 269912 103121 27031 395704 311002 235990 234170 187590
15044A87590a7322A10383L807K34918r5686a8865k4147B24666G7535k8539J91145
15033B40141A03171L10723A27340q599K69368j05878E2719N4276R3444b78480
15022A02432L09673K01766B19281K39762i202d064B22042H3352K510K2352B4700
15010C73512n9214q5578L17429C6479J97286E6247I443J6469J21417P3064K69423
14999D89816k29224F4724N4645J04531K16438H9066c1269B41566A06890L87055
14989D93945A89989D7561J3780K56562k528j15407Q4066O2361G5899K55210A60591
14977b58127B19873K31319k22777D5943J42810J36415L06072o2821j24908j37438
14967C06073j30244K44178j86290m405n7756K00461j66821I1693J96535R9965
$$ plain form
15044 187590 -17322 110383 114190 349108 253422 -18865 -43012 224666 77535 48996 240141
15033 240141 103171 413894 127340 118741 388109 282231 52719 106995 200439 -278480
15022 102432 412105 613871 219281 459043 -9202 -4064 222042 83352 85862 108214 24700
15010 373512 314298 228720 546149 36479 233765 56247 9443 25912 147329 220393 489816
14999 489816 260592 64724 119369 223900 440338 89066 -31269 241566 106890 493945
14989 493945 189989 47561 61341 317903 315375 199968 284034 346395 75899 331109 160591
14977 -258127 219873 451192 228415 45943 188753 325168 631240 568419 443511 306073
14967 306073 175829 420007 233717 229312 171556 372017 205196 91693 288228 388193
14957C88193j0018b5717A34993J86555r1934j5177n8453M5336n1G3849M4646L08801
14945D27296B09819K42764B11980J30528R9942K08440m1748k54791r3080M5003
14935C06274P4216A74561M1809J40338A22775L58983Q9898B84396P5885j4932
14925C45349K76627C2289K20955a50915E05000o9429m4045A48507f5714F66441
14914C51709q0842M1111e2489C77424k086j46235K74483P935A32645L109m9027
14903H6727M34683B44502r2405K68328E4803K5485k6396K59142j18186K06449
14893D01297B5220J73310K39670R3700j36357j27931J19960A62088K79823a36371
14882G32153C58384j00552P3569M1002Q3325F7614J71811Q2475A39792o7219L17675
$$ plain form
14957 388193 378175 -25717 134993 321548 229614 214437 155984 201320 201269 73849 118495 427296
14945 427296 209819 452583 211980 342508 442450 650890 609142 354351 261271 306274
14935 306274 380490 174561 216370 356708 122775 481758 571656 284396 360281 345349
14925 345349 621976 32289 253244 -150915 505000 435571 391526 148507 -65714 666441
14914 351709 270867 311978 -52489 377424 375338 229103 503586 511521 132645 135754 86727
14903 86727 521410 244502 152097 420425 54803 80288 53892 313034 194848 401297
14893 401297 25220 198530 438200 531900 395543 267612 387572 162088 441911 -136371
14882 732153 358384 257832 331401 372403 455728 67614 239425 321900 139792 72573 390248
14871C90248n1709j02597J37897J69149p3809m9461j98478K53625J76225l20963
14861C30127M80382A33727K87546A40445M18041j16071l7669J57712k942J08295
14851F67811B30529K3346K90396O0486B52951E181K28330K68938l8769m8034m32
14840D15214j27066J02424P9832J29667o5964j01390A46572L40876p3151J19362
14830E33659J566j85831J52058j33087K35043j79216J91115J8528J09045l22247
14820D20633l7195J66554J73563n1375l03902M49614j22325k80536J55281J5513
14810E85825O1995k4555q6774L7127B21917N96244k65917K0203j36468K21264
14800F57243l20405N1529L43415j76473J27829k21320j04412K03112k17015N11192
$$ plain form
14871 390248 338539 235942 373839 542988 469179 419718 221240 474865 651090 330127
14861 330127 810509 133727 421273 140445 558486 442415 404746 562458 559516 667811
14851 667811 230529 253875 544271 604757 252951 5181 233511 502449 463680 415646 415214
14840 415214 288148 390572 470404 600071 534107 432717 146572 487448 414297 533659
14830 533659 535225 349394 501452 368365 603408 424192 615307 633835 742880 420633
14820 420633 383438 549992 723555 672180 368278 817892 695567 415031 570312 585825
14810 585825 647820 623265 536491 573618 221917 818161 552244 572447 435979 657243
14800 657243 336838 388367 731782 555309 683138 461818 357406 560518 343503 854695
14790H54695n5253C60130l6335L33076o549A73734K09016J17643J73567Q6366
14780G60326j82753Q5617j33370B56353M77617j28153K52195j89363M1786K2893
14770G33328R743K5340A55310M44576J39898C29351N23716m18478O4235j00336
14760C98488M51161k55393o9085A60017M93610k42168K68565L26704j39731k19431
14750F47566B31332O58401l72997R4876J87716J69520m6091o5189B88330K84128
14740E72458K16201K49513l82491J87613k97694K09908j88410K33183L7699J49621
14730I87601k20416j24375L55106k44172p3746l6426L04674k43643M67085n05692
14720F65996J14811j79001K16842j96288K67457j31677J57422k64637N2726J57023
$$ plain form
14790 854695 799442 360130 323795 656871 650322 173734 382750 500393 673960 760326
14780 760326 577573 663190 529820 256353 733970 605817 858012 668649 710435 733328
14770 733328 743071 768411 155310 599886 739784 329351 853067 434589 498824 398488
14760 398488 849649 594256 525171 160017 653627 411459 680024 1006728 866997 647566
14750 647566 231332 889733 516736 611612 799328 968848 922757 857568 288330 572458
14740 572458 788659 1038172 655681 843294 545600 755508 567098 800281 837980 987601
14730 987601 767185 642810 997916 753744 679998 643572 948246 704603 1171688 665996
14720 665996 780807 601806 818648 622360 889817 758140 915562 650925 703651 860674
14710H60674k34715K59761N6478K7641j66094j42135j97551N78899K21241m29198
14700H35001j28859Q8286k94596L76930M04768m00968Q3154k79110Q07617n93200
14690H99023J4241k09760K21059R0433l7569O1009J62233r8807l04987M5643J47232
14679I89750l14648K09292K84778j76654k31625r7204L93385j82349M10020k7205
14669A257540n09429L67180j8366j1759N1519K49982l66891K41346j38872k93605
14659H28645K66019J05444l95383K33960J15298j1060l4462L26342r0794j85521
14649A158488R6210j68907r8557Q026M48625l2431k53901M29311l16864k62164
14639A007836M88682N657J409n4035j6385Q8886k30312o3432n1417P1652J26067
$$ plain form
14710 860674 625959 885720 942198 969839 803745 661610 464059 1042958 1264199 835001
14700 835001 706142 794428 499832 876762 1281530 880562 963716 684606 1492223 899023
14690 899023 913264 703504 924563 1014996 977427 1038436 1200669 1101862 796875 842518 989750
14679 989750 675102 884394 1169172 992518 760893 663689 1057074 874725 1284745 1257540
14669 1257540 748111 1115291 1096925 1085166 1136685 1386667 1019776 1261122 1122250 828645
14659 828645 1094664 1200108 804725 1038685 1153983 1142923 1108461 1434803 1344009 1158488
14649 1158488 1254698 1085791 987234 995260 1443885 1411454 1157553 1586864 1270000 1007836
14639 1007836 1496518 1502175 1503584 1449549 1433164 1522050 1291738 1228306 1176889 1248541 1374608
14628A374608p8337N41746m26111j68252L28972n2326j75612K04498j94175J16032
14618A471043M6041l7200P0028j47362J91820J42444P4866j23941l31055J76514
14608A533198j86056K66936J88609J5595K3971j07966K90818k30284P3269l04368
14598A563722J48198J98801l53024K16384j31106r4517J00929j15062M14370O2025
14588B010720j50655k58997M97488N4835j07513j16723K1419m4616k49028J3637
14578A670567N71870k21503k37495K58422N1360J23137j19421L26477o8943j29024
14568B225447n9133j21905N03266j95445J61352J13288k54321L34968j98239M88477
14558B997755j87317K79807J30169O8809K56256p8616N99853N08146Q31961J021917
$$ plain form
14628 1374608 1296271 1838017 1411906 1243654 1572626 1520300 1344688 1549186 1355011 1471043
14618 1471043 1517084 1479884 1549912 1402550 1594370 1736814 1811680 1687739 1356684 1533198
14608 1533198 1347142 1614078 1802687 1818282 1842253 1734287 2025105 1794821 1868090 1563722
14598 1563722 1711920 1910721 1557697 1774081 1642975 1548458 1649387 1534325 1948695 2010720
14588 2010720 1860065 1601068 2098556 2153391 2045878 1929155 1950574 1905958 1656930 1670567
14578 1670567 2242437 2020934 1783439 2041861 2093221 2216358 2096937 2423414 2354471 2225447
14568 2225447 2166314 2044409 2547675 2352230 2513582 2626870 2372549 2707517 2509278 2997755
14558 2997755 2810438 3090245 3220414 3289223 3545479 3466863 4066716 4574862 5406823 6428740
14548F428740L707671R967920K1892220J234994B0992379A0443931l350213J49968
14540G243686k173302k130756o40531l19606o4887j66529J25922j11872J66609
14531A928734P6395R0506j82151M41908p9214j5956j75732O4979j45964K17887
14521B221392K72132j31497J07176J24230j98025K48269k47625K67338q3991K67355
14511B846754n1616k21465J92210L12442l20771R1897J18103J7279Q8066r1646
14501B981253J39901k84614N97474k02319n6126K89944k24379m26760O79865P2204
14491C566443l16917M5907L95069R950j07815J73981k29826j95903M00462J52310
14481C893661K1871K37194k7836J74746j55715J42611m27600J18039O0672J12453
$$ plain form
14548 6428740 10136411 20104331 41996551 43231545 20992379 10443931 7093718 7243686
14540 7243686 5070384 2939628 2299097 1979491 1914604 1748075 1873997 1762125 1928734
14531 1928734 2005129 2095635 1913484 2355392 2276178 2260222 2084490 2149469 2003505 2221392
14521 2221392 2493524 2362027 2469203 2593433 2395408 2643677 2396052 2663390 2579399 2846754
14511 2846754 2795138 2573673 2765883 3078325 2757554 2849451 2967554 2984833 3072899 2981253
14501 2981253 3121154 2836540 3434014 3231695 3175569 3465513 3241134 2814374 3494239 3566443
14491 3566443 3249526 3295433 3690502 3700452 3592637 3766618 3536792 3340889 3741351 3893661
14481 3893661 3915532 4152726 4124890 4299636 4143921 4286532 3858932 3976971 4037643 4150096
14471D150096L66844n51574K59699K46428j66737L0171J70553l6029J587j40915
14461D330123M76496m27290O34499J22118j29387K05924j44707l0009J08313l2387
14451E113693J22501K13686j2193j00517K38222l7108K32844L53409j90106N9501
14441E993932K4444k10418L49589k79484K84399o7791L91948K32391P7722j32956
14431F663776r2138M18656j5149k30627N59276j85826J45812p2203N46818l19145
14421G419250J56277O36639j61311j08443J20540L71009q1475L93118j40598M57058
14411I062064j39644N66545P8742l82777L69430K54852k72590M24003R4027J09041
14401A0163693L59621n1215L35987m562j1090L31549N09481k92L23655l1906L21976
$$ plain form
14471 4150096 4516940 3965366 4225065 4471493 4304756 4334927 4505480 4469451 4471038 4330123
14461 4330123 4806619 4379329 5013828 5135946 5006559 5212483 5067776 5037767 5146080 5113693
14451 5113693 5236194 5449880 5437687 5337170 5575392 5538284 5771128 6124537 5934431 5993932
14441 5993932 6018376 5807958 6157547 5878063 6162462 6094671 6486619 6719010 6796732 6663776
14431 6663776 6571638 6990294 6975145 6744518 7303794 7117968 7263780 7191577 7738395 7419250
14421 7419250 7575527 8212166 8050855 7942412 8062952 8433961 8352486 8745604 8605006 9062064
14411 9062064 8922420 9488965 9567707 9184930 9554360 9809212 9536622 9960625 10054652 10163693
14401 10163693 10523314 10472099 10808086 10803524 10792434 11123983 11633464 11633172 11956827 11924921 12246897
14390A2246897M2854K61147M58138m0451J48694M25765j37413N44298N54093K9340
14380A4533362J4211O65716J10052P0121M27285P2910M23316N40522L71459J98418
14370A7427372O6645N33774O05378m10744J315504k40356O28149L58336O67862
14361B0951920M0558L24499J117541j540O78181K41345Q05928M00518Q34989L27275
14351B5721214Q29626L13464P91865J002267N30580Q34335Q02881O33272Q23801
14342C2283305J091147O90094Q67622J280054J111045L98457J425565J224076
14334D0371365R28595J259264J591181J144355J445340J676951J407289J636144
14326E1460484J604568J387709K174880J944663J609388K285797K487773K079373
$$ plain form
14390 12246897 12289751 12550898 13009036 12968585 13117279 13543044 13405631 13949929 14504022 14533362
14380 14533362 14547573 15213289 15323341 15393462 15820747 15893657 16316973 16857495 17228954 17427372
14370 17427372 17494017 18027791 18633169 18222425 19537929 19297573 19925722 20284058 20951920
14361 20951920 20992478 21316977 22434518 22432978 23111159 23352504 24158432 24558950 25393939 25721214
14351 25721214 26550840 26864304 27656169 28658436 29189016 30023351 30826232 31459504 32283305
14342 32283305 33374452 34064546 34932168 36212222 37323267 37721724 39147289 40371365
14334 40371365 41299960 42559224 44150405 45294760 46740100 48417051 49824340 51460484
14326 51460484 53065052 54452761 56627641 58572304 60181692 62467489 64955262 67034635
14318F7034635K248343K722157K921671K586409K973838L403823L353109L406769
14310I0650754L601879M162511M171811L990395M948255M796822N353369N838898
14302A27514694N436531O695607O322754P337931P118440Q277761Q298562Q694305
14294A85696585R678435J0009190J0630637J1011939J1968968J2142217J3145706
14287B64283677J3651215J4002780J4583536J5227062J5368411J5533125J5659740
14280C68309546J5800907J5481449J5025733J4210359J3044038J1842421R951342
14273D63665795O723448K521822M47791l958014k399089l971324m243423n879954
14265D52907052p639191q607491j1295946j3195963j5286635j5276625j5954084
$$ plain form
14318 67034635 69282978 72005135 74926806 77513215 80487053 83890876 87243985 90650754
14310 90650754 94252633 98415144 102586955 106577350 111525605 116322427 121675796 127514694
14302 127514694 132951225 139646832 145969586 153307517 160425957 168703718 177002280 185696585
14294 185696585 195375020 205384210 216014847 227026786 238995754 251137971 264283677
14287 264283677 277934892 291937672 306521208 321748270 337116681 352649806 368309546
14280 368309546 384110453 399591902 414617635 428827994 441872032 453714453 463665795
14273 463665795 470389243 472911065 473358856 469400842 467001753 463030429 458787006 452907052
14265 452907052 445267861 436660370 425364424 412168461 396881826 381605201 365651117
14258C65651117j6559093j6455581j6322044j5551371j5123040j4807341j3195997
14251B57636650j2028135j2676565j1752907j1489620j0489588j0255588r206449
14244A79737798q273815q614931p452779p874734o862017o268341o062531n278218
14236A23050432n769548n184662m804248m580592m440255k897186m327838l816123
14228H7229980l492361l301555k912563l047992k710087k849907k332788k195670
14220F4387057j982206k058648k308662k145286j972690j527852j357085j208844
14212D9825784j642213j722868j336215j203966j332856r63952j150181j160554
14204C9312979j417045p42181j477230l44153r04552r60125j119277p92083j122666
$$ plain form
14258 365651117 349092024 332636443 316314399 300763028 285639988 270832647 257636650
14251 257636650 245608515 232931950 221179043 209689423 199199835 188944247 179737798
14244 179737798 171463983 162849052 155396273 147521539 140659522 134391181 128328650 123050432
14236 123050432 117280884 112096222 107291974 102711382 98271127 95373941 91046103 87229980
14228 87229980 83737619 80436064 77523501 74475509 71765422 68915515 66582727 64387057
14220 64387057 62404851 60346203 58037541 55892255 53919565 52391713 51034628 49825784
14212 49825784 48183571 46460703 45124488 43920522 42587666 41623714 40473533 39312979
14204 39312979 37895934 37153753 35676523 35332370 34427818 33467693 32348416 31556333 30433667
14195C0433667n47911n40477o69236p66361p93912m43377q50771o19867n42156
14186B4659599p13159o12082k87611o23360o34976j76468o94992n86701j06758
14177B0223492n14544k01129o43337m17884k11478n79493k01019l96710n3222
14168A7004676r51882j00402J12431n31704k24821n71504j25593j25712j33646
14159A4351843p08490M0504l69449m74680K21788n39139k8612k66503l30114J22928
14149A2020076l04845m10891K48916n92246j86861J26116k94144O8969o22978
14140A0052112K07034Q8209l65032j87220N3834m41487m1007m4323L828l00347
14130I025601K14350l57677m56641n2839o003k97902R3243l14973n5578k41201
$$ plain form
14195 30433667 29885756 29345279 28676043 27909682 27115770 26672393 25821622 25201755 24659599
14186 24659599 23946440 23334358 23046747 22423387 21788411 21611943 20916951 20330250 20223492
14177 20223492 19708948 19507819 18864482 18446598 18235120 17655627 17454608 17057898 17004676
14168 17004676 16052794 15952392 16064823 15533119 15308298 14736794 14611201 14485489 14351843
14159 14351843 13643353 13683857 13314408 12839728 13061516 12522377 12493765 12227262 11897148 12020076
14149 12020076 11715231 11304340 11553256 10961010 10774149 10900265 10606121 10675090 10052112
14140 10052112 10259146 10347355 9982323 9795103 9848937 9407450 9366443 9322120 9325948 9025601
14130 9025601 9239951 8882274 8425633 8372794 8366791 8068889 8162132 7847159 7791581 7550380
14120G550380K96236k68986l90362N35159m36610m40416K32038J33690j89326
14111G021803j77489l76246P9846J67238O886n53590Q650J23184q2423l96484
14101E821375L80854m78875N89069l01169j84940r2317J39608l77652M9616L7656
14091E583225j54883r7465r2117K89539o7007m94394L45909l14338q1042l21736
14081D595691J50573j82273L16354j86919k35408K7034J21387J30485m17468j71358
14071D148098J60662J03580m1955q9171k69236l8891J04022j28482J52628l22276
14061C778979K43204k3477m01387O34922o37700K09614q2595o2911n9949M0816
14051C639516j34777J04289j22701L7128k45188L22827L0643j59286k33440J59106
$$ plain form
14120 7550380 7846616 7577630 7187268 7722427 7285817 6845401 7077439 7211129 7021803
14111 7021803 6844314 6468068 6547914 6715152 6722038 6168448 6177098 6300282 6217859 5821375
14101 5821375 6202229 5723354 6312423 6011254 5826314 5733997 5873605 5495953 5545569 5583225
14091 5583225 5428342 5330877 5238760 5528299 5461292 4966898 5312807 4998469 4917427 4595691
14081 4595691 4746264 4563991 4880345 4693426 4458018 4485052 4606439 4736924 4319456 4148098
14071 4148098 4308760 4412340 4370385 4281214 4011978 3973087 4077109 3948627 4101255 3778979
14061 3778979 4022183 3998706 3597319 4232241 3594541 3804155 3721560 3658649 3598700 3639516
14051 3639516 3504739 3609028 3486327 3523455 3278267 3601094 3631737 3472451 3239011 3398117
14041C398117m26831P34219p7613o62416K28401k78409K02853r9265L19687m79860
14031B858883r1119J41122K02871j86885j75645J08049k38924j8647N28581l75347
14021B752939j75094k38256K38449O4992k4457M0027k54953j47043M54244k95851
14011B414997n3712M3431k73261p3419J99871K14487k94118j60558K85442l15844
14001A987316K54488j36980K1865n5110K79952l57934K18622j43188j27522j1074
13991A930435R8500M21777N81158J857472P213491K1626595J2372093j8654499
13983B7447022j2533055n406989k843615j755307q21942o46439k97466j14108
13975C028101p5089m25889K11628m10088M55498l89110j86847K81546k27353j02439
$$ plain form
14041 3398117 2971286 3705505 3627892 2965476 3193877 2915468 3118321 3019056 3338743 2858883
14031 2858883 2767764 2908886 3111757 2924872 2749227 2857276 2618352 2599705 3128286 2752939
14021 2752939 2577845 2339589 2578038 2643030 2618573 2658600 2403647 2256604 2710848 2414997
14011 2414997 2361285 2404716 2131455 2058036 2257907 2472394 2178276 2017718 2303160 1987316
14001 1987316 2241804 2104824 2126689 2071579 2351531 1993597 2212219 2069031 1941509 1930435
13991 1930435 2028935 2450712 3031870 4889342 12102833 33729428 46101521 27447022
13983 27447022 14913967 9506978 6663363 4908056 4086114 3439675 3142209 3028101
13975 3028101 2953012 2527123 2738751 2328663 2784161 2395051 2208204 2489750 2262397 2159958
13965B159958n8647k597M1640j3299p2093K73571k01802J3846k65478M95605o54333
13954A716371J67360n1464J41902r1125r0410J48913M2488q634m71310R2534L0781
13943A627406L35997n39217N99661j34114j33674P8980l58275k3165J69894k93526
13933A329967L28819K43498p8255k63277k27586M55955j36462L72147n84804K88279
13923A728281m20004P7894P1200M3189M09462m34762K44622n11295J85102j25009
13913A268680l589M55240k64246j88056L2450N0858K64861j19466k62453p9096
13903A155183J99278J83705j63092j07934N9674j77449R6581K29152n28273M00130
13893A346955j36061o257J77987p5303O8995L4192l31280K57229m9466K2958r1844
$$ plain form
13965 2159958 2101311 2098714 2140354 2127055 2054962 2328533 2126731 2140577 1875099 2370704 1716371
13954 1716371 1883731 1832267 1974169 1883044 1792634 1941547 1984035 1975401 1504091 1596625 1627406
13943 1627406 1963403 1424186 2023847 1889733 1756059 1835039 1476764 1453599 1623493 1329967
13933 1329967 1658786 1902284 1824029 1560752 1333166 1789121 1652659 2024806 1440002 1728281
13923 1728281 1308277 1386171 1457371 1500560 1910022 1475260 1719882 1208587 1393689 1268680
13913 1268680 1265091 1720331 1456085 1268029 1300479 1351337 1616198 1496732 1234279 1155183
13903 1155183 1354461 1538166 1375074 1267140 1326814 1149365 1245946 1475098 946825 1346955
13893 1346955 1210894 1204637 1382624 1307321 1376316 1410508 1079228 1336457 1286991 1309949 1218105
13882A218105j84371K6954J36552m54432J87172J61076q5987P5733L5389O8749
13872A184940L05981m05298l950J17847k06052K59804m71410L70929k34953J82964
13862A100802L1609N2167k95465J00190J11978O1975l07105J58933K65958j80263
13852A100779K11771l33750p4661M5824j17557K71699j61604r6425L35849m58855
13842G23070L28533L0612K4549q4923o8545J16798l69499L67806k10091p4513
13832G83797j15770K75983L09531j54245l19393L31299m13212J70168j6842p005
13822H44311l13005J17098K70460q8902k48888M4028J83170J22651j14015j35029
13812F81879n8128J77485J11149k2442k16247k8832j48949N5962N89623l50771
$$ plain form
13882 1218105 1033734 1060688 1197240 742808 929980 1091056 1005069 1080802 1116191 1184940
13872 1184940 1490921 1085623 1081673 1199520 993468 1253272 781862 1152791 917838 1100802
13862 1100802 1132411 1184578 889113 989303 1101281 1163256 856151 1015084 1281042 1100779
13852 1100779 1312550 978800 904139 949963 832406 1104105 942501 846076 1181925 723070
13842 723070 1051603 1082215 1106764 1021841 953296 1070094 700595 1068401 858310 783797
13832 783797 668027 944010 1253541 1099296 779903 1111202 697990 868158 851316 844311
13822 844311 531306 648404 918864 829962 581074 625102 808272 930923 816908 681879
13812 681879 623751 801236 912385 889943 673696 644864 495915 551877 1141500 790729
13802G90729J94458l81126L15057j94630n7317L33787k13786j16380J88049o0743
13792G98098M7335J42633l50806J2723l4803j0666O8406p28J49700j75324L6780
13781F83348R2963J68153j84324l25810K43643K06162l14371J29651P3675k06602
13771E66488O759L72592j96345l124k45877L15519j97216j17575R7651J2574j56510
13760D54936K39689l29398M25978k04741q41o2579L46690k71153k27052M71686
13750H43215j97663k50147M18650j9009m889k15509k25119L19883j21499P0569
13740F18482J7205C17021L44622k79626k1463j67922O0528P87465B33048J74586
13730D07634J90607K75130m06280q986M5843j93549L0898J82710j83882J86815
$$ plain form
13802 790729 985187 604061 919118 724488 667171 1000958 787172 670792 858841 798098
13792 798098 845433 988066 637260 649983 615180 604514 672920 672192 821892 646568 683348
13781 683348 776311 944464 760140 434330 677973 884135 569764 699415 773090 566488
13771 566488 573247 945839 749494 746370 500493 816012 618796 501221 598872 611446 454936
13760 454936 694625 365227 791205 586464 585623 523044 869734 598581 371529 843215
13750 843215 645552 395405 814055 795046 790157 574648 349529 669412 547913 618482
13740 618482 635687 317021 661643 382017 360554 192632 253160 1040625 233048 407634
13730 407634 598241 873371 467091 458105 503948 310399 341297 524007 340125 526940
13720E26940K98046B42060M38841o7278k57444n7199K46713K03347l20595J35103
13710E63548r2063J28139L0444r9673K37133p789C05303K53075j95693J29021
13700D91706J79599J965J79934o9981k92875L22220C67121n995J34612A40812
13689E41653P5900L6034j65955J93802k04784R2937r25j60404K01097B96711M05687
13678G02398M4337C70638L81681j44647k59327A22008L21149K39349j52146A63769
13667E50176A64712J40021m0326L21280K24154B63337L69167j11627o5838J48666
13657F03705j91689L7021Q3292G4112P5006K39695J04964A07461O53144k41377
13647E19228N2431J15699F8052L53516J7674l9838k0691o444N06469D20872K80328
$$ plain form
13720 526940 824986 242060 680901 613623 356179 298980 545693 749040 428445 563548
13710 563548 471485 599624 630068 530395 767528 759739 305303 558378 362685 491706
13700 491706 671305 673270 853204 783223 490348 812568 367121 361126 495738 140812
13689 541653 617553 653587 487632 681434 476650 569587 568662 408258 609355 296711 702398
13678 702398 746735 370638 752319 607672 348345 122008 443157 682506 530360 163769
13667 550176 164712 304733 264407 585687 809841 263337 632504 520877 455039 603705
13657 603705 412016 449037 532329 74112 149118 388813 493777 107461 760605 519228
13647 519228 571659 687358 68052 421568 439242 399404 378713 372269 878738 420872 701200
13636G01200j71658A15984N9336H1320M49665A64567n3234O418J23021K30749
13626D71521p3787J71909j11067j93563K43292j98188A04027K87178m9198R8424
13616D40431j20945m3975r8246L0541O08223k75901j35042J45268j54857J2017
13606D07514A08088K46439J50461j03975K08007j29386R1066A40122j3062K22006
13596C49066K3326a80728E06675A45945B049J88955K3873K09194C4890K27725
13586B62615N3845J37748a9726C39342K40566F4063J48441K02083N9416j37014
13576C36989K68841j90776H6671M19332r0384o8577J00202M1441k29674k8735
13566B30276K10939j10523M8134A21385c258o5671D38343A78588J95849C9245
$$ plain form
13636 701200 529542 115984 175320 81320 530985 164567 111333 117751 240772 471521
13626 471521 397734 569643 458576 265013 508305 310117 104027 391205 342007 440431
13616 440431 319486 275511 177265 207806 816029 540128 405086 550354 395497 407514
13606 407514 108088 354527 504988 401013 609020 479634 570700 140122 127060 349066
13596 349066 372392 -180728 506675 145945 2049 191004 214877 424071 34890 262615
13586 262615 316460 454208 -19726 339342 579908 64063 212504 414587 474003 336989
13576 336989 605830 415054 86671 506003 415619 347042 447244 488685 259011 230276
13566 230276 441215 330692 378826 121385 -3258 -68929 438343 178588 374437 39245
13555C28876J42605k27325C9065J22911m3476L18550J0086j22247J76603B22989
13544G4282L06894P7617n1298A52372g3108D63532C6856K67751J98174A52932
13533E0496J83177A1399J19302N8657m464J26250j22394P7591A15395J58528k4787
13522B49136G9300b15648C73150A06327K30061j34452n4748K61719o6458m3929
13512B98520J5196d1305D22594o0874F7553l1142K98648m8820j2120J37487j76257
13501B35349A07418A7769O9811O6291K38917D1859K8631J06850N6568K58094b0501
13489B68819j0663L61201A40147O3542l2579n117K42746E4829L74684j55868R9042
13478C72687P2144j36165K03553A49791K1792K57683k02063q5548q16Q6537f7866
$$ plain form
13555 328876 471481 244156 39065 161976 118500 437050 447136 324889 501492 222989
13544 74282 381176 458793 407495 152372 -73108 463532 36856 304607 502781 152932
13533 50496 233673 11399 130701 189358 184894 311144 188750 266341 115395 273923 249136
13522 249136 79300 -215648 373150 106327 336388 201936 147188 408907 342449 298520
13512 298520 313716 -41305 422594 361720 67553 36411 335059 286239 274119 411606 235349
13501 235349 107418 17769 87580 153871 392788 41859 70490 177340 233908 492002 -20501
13489 268819 258156 619357 140147 203689 171110 165993 408739 54829 429513 273645 372687
13478 372687 444831 308666 512219 149791 171583 429266 227203 141655 140839 227376 -67866
13466A758J74307m455a11885A24324P2663f3407E98265A92670J03438b7441J2855
13455a4586D27055j97757C8357a41077B81670K06478k20735h3391B07040I8567
13444A47118Q0761L5608J03083A39885N9719k4377J26477L002j51651J24749d8690
13432C68393A41376a34674D33009A98823O0164G5650C2343K19471j22337d6909
13421A73963o001J14208J12024j54512J24291j21114j08692K47834H4024J5523
13411I9547K81069J52173k50888A9923a46267q8148c9626A00626K32233K37984
13401E70843e1400O883I0498i6260n8083B72841J5763j36345m5094K56355d9047
13389C58711a16446A18841k2324A7742K91861I6582f243D41373A54769J63714
$$ plain form
13466 1758 176065 171610 -111885 124324 196987 -63407 598265 192670 296108 -27441 -14586
13455 -14586 427055 229298 38357 -141077 281670 488148 267413 -83391 207040 98567
13444 147118 227879 263487 366570 139885 199604 175227 301704 304706 153055 277804 -48690
13432 368393 141376 -134674 433009 198823 258987 75650 32343 251814 129477 -46909
13421 173963 167962 282170 394194 239682 363973 242859 134167 382001 84024 99547
13411 99547 380616 532789 281901 19923 -146267 -234415 -39626 100626 332859 570843
13401 570843 -51400 -44517 90498 -96260 -154343 272841 288604 152259 107165 363520 -49047
13389 358711 -116446 118841 96517 17742 309603 96582 -6243 441373 154769 318483
13379C18483j17466L0894j6649I6627b3558D8074a29006E98328F3521K57415J89823
13368E10759k20579J6957M9419J98556k08920K08318k70817E6155J75700E9030
13357H02269l91453O6332j71210j09654J82143I8298J29999K79503j02528H1184
13346C32929E0587a86313B40712J37744L3552H5849L05134p0754n6375C2973P57224
13335G90197k55281B51070F0149K29096Q5317H2903L22472q1554M5525j19095
13325B50251m1687L8763I8764D5422L43042J8859A70658J7635j3343J31277K30187
13314E36414j64783e8890D35478O6358b3382A72483D4876N01054A71623D6477
13303B56323J57068A33445b18064C29273g1576A27262J5347E2607J08820b733
$$ plain form
13379 318483 201017 231911 215262 96627 -23558 48074 -129006 598328 63521 320936 510759
13368 510759 290180 307137 356556 555112 346192 554510 283693 56155 231855 59030
13357 802269 410816 477148 305938 196284 378427 98298 228297 507800 405272 81184
13346 332929 50587 -186313 240712 378456 412008 85849 390983 320229 263854 32973 790197
13335 790197 534916 251070 60149 289245 374562 82903 405375 323821 369346 250251
13325 250251 208564 247327 98764 45422 388464 407323 170658 188293 174950 306227 536414
13314 536414 371631 -58890 435478 501836 -23382 172483 44876 545930 171623 46477
13303 256323 413391 133445 -218064 329273 -71576 127262 142609 52607 161427 -2733
13292B30717J85880j90757g0624A2678L93570f3997D5429b38171A55398p7520
13282G7878c0196G2316M862k3840f1508A9953K02136E5836b06455B8276J74925
13271B03201m3101L10205j63370C7154a98487e5243j91983A29344J61221d1811
13260e4829I1528L2618J67404O467E5257i1329B62795E1756L39378c8144B98014
13248A14232f0001C11981M9168A66897E9894J6141a7453H0571h0265E1213J91895
13237B43108j08535a87399C39776o0444j25431b9140I5019b38215B38102m8038
13227A90064c06300D0763L0749e4127A84302f7901H051M2123M2890e4793l2486
13216h7279n4774d1882A4896J18209M4613E1659K40112e5293J5350C37578a38814
$$ plain form
13292 230717 416597 225840 -70624 12678 406248 -63997 45429 -238171 155398 77878
13282 77878 -30196 72316 77178 53338 -61508 19953 222089 55836 -206455 28276 203201
13271 203201 160100 470305 306935 37154 -198487 -55243 -247226 129344 290565 -41811
13260 -54829 91528 124146 291550 298017 55257 -91329 262795 51756 391134 -38144 298014
13248 114232 -60001 311981 361149 166897 59894 76035 -17453 80571 -80265 51213 243108
13237 243108 134573 -187399 339776 279332 153901 -29140 95019 -238215 238102 190064
13227 190064 -306300 40763 71512 -54127 184302 -67901 8051 50174 93064 -54793 -87279
13216 -87279 -142053 -41882 14896 133105 177718 51659 291771 -55293 -39943 337578 -138814
13204A22753i4647Q709E3377J78476J14753b44362A58195D2267Q6675d9183B64219
13192b68751h4105C12994q8206o4765G4004a3973q2975B83347b2303I9773K64309
13181C64082j01278r4522c78289A51836m5365c8111j37807P5750f073I9110J49197
13170B48307a9242A53926a16397B66271A29517O3532c3173A55873a09738F1344
13159D0329e399A85113q0918o155J02745c21195A45922g7253r6225j2039r0873
13148b76390P8941J6214e7740K6422j29184g5463B21661Q1581A35027a10531B93252
13136A91185b2346B60944A9250K34526B4254J40804a80264l8776J9300B4286d5316
13124C75508A76370a36872B63552A02680a34627B27068a54466F5533R2992B0050
$$ plain form
13204 122753 -94647 -85938 53377 231853 346606 -244362 158195 42267 128942 -49183 264219
13192 -268751 -84105 312994 224788 160023 74004 -13973 -96948 283347 -22303 99773 364082
13181 364082 262804 168282 -378289 151836 106471 -38111 -175918 -100168 -6073 99110 248307
13170 248307 -19242 153926 -116397 266271 129517 193049 -33173 155873 -109738 61344
13159 40329 -5399 185113 104195 98040 200785 -321195 145922 -77253 -173478 -185517 -276390
13148 -276390 -197449 -181235 -57740 -31318 -160502 -75463 221661 303242 135027 -110531 293252
13136 191185 -22346 260944 19250 253776 24254 165058 -180264 -219040 -199740 24286 -45316
13124 375508 176370 -136872 263552 102680 -134627 227068 -154466 65533 158525 20050
13113a63472B03729J70051A55893F4632b68095A68823k8169B6960P6206J22605
13103B25771q4108J54847k1993p9459m1828J20289C6110f2224A67492P1459G4789
13091e128m4015B13357b1846k09613a076A30023c7512H2658K0207b1358L939m0403
13079e7822C11917g0137A51803i411L078B65318H2130a35862D1502L17013b4796
13067A5469d0837l12778A77275K4410J27729a27B30840H4457P8963R757a73416
13055C86105j70463O5179A20135J77492M5637D5430j0438b0220I7505J676h28
13043B40480a15683F2270J79090F9181J4811j9359N12812e2773j63810g6801p0307
13032a47108B62954A12115B5762R8931J53182j9615a16097A06447a70580A40575
$$ plain form
13113 -163472 203729 373780 155893 64632 -268095 168823 140654 26960 103166 225771
13103 225771 141663 296510 274517 195058 153230 273519 36110 -62224 167492 238951 74789
13091 -5128 -49143 213357 -21846 -231459 -1076 130023 -37512 82658 102865 -21358 -17419 -57822
13079 -57822 311917 -70137 151803 -9411 -6333 265318 82130 -135862 41502 358515 -24796
13067 15469 -40837 -353615 177275 201685 329414 -127 230840 84457 163420 173177 -173416
13055 386105 215642 280821 120135 297627 343264 45430 34992 -20220 97505 99181 -828
13043 240480 -115683 62270 241360 69181 83992 64633 577445 -52773 -216583 -76801 -147108
13032 -147108 262954 112115 25762 124693 277875 258260 -116097 106447 -170580 140575
13021h2767B0619L11541j16425D6018K95468a2949B02089J73002d2528A35654
13010i8706B24946j3924J06362e401B07042h9673A93527b1787A88609N5462c8715
12998a53244A07105O5223K2502B2224c31380H9134J51807i7398A17787P4843Q7453
12987B80083c1186C8324p552c41419E37663B8645Q0949J97699A46096b100j41529
12976a43629A8901c6330C21143A04637b74417C9657j6636b49759L8372B36444
12965c2338F5502J45071Q7627d3414Q605a917A94604O1552e7302l3336R236j1579
12953i2981G3334i6860E1392B1389J08827b24653P859D0718c09188A00044b52013
12941B58004O3641i6200l7560p7636N3344C75320j2608j56788c4360j55496I4005
$$ plain form
13021 -82767 20619 332160 215735 46018 341486 -12949 202089 375091 -42528 135654
13010 -98706 224946 211022 317384 -5401 207042 -89673 193527 -21787 188609 244071 -38715
12998 -153244 107105 172328 194830 22224 -331380 89134 240941 -97398 117787 192630 280083
12987 280083 -31186 38324 30772 -341419 537663 28645 109594 307293 146096 -2100 -143629
12976 -143629 18901 -36330 321143 104637 -274417 39657 23021 -249759 -211387 236444
12965 -32338 65502 210573 298200 -43414 -34809 -1917 194604 256156 -57302 -90638 -81402 -92981
12953 -92981 73334 -96860 51392 21389 130216 -224653 -216794 40718 -309188 100044 -252013
12941 258004 321645 -96200 -133760 -211396 -158052 375320 362712 205924 -34360 -189856 94005
12929B41524a80497p4115H7456a18943B14150C2872d23863A89779a38932E521
12918a88181B25390a25432a0944A24556A0655L40447a44543B49886J90659A31561
12907A90851a6962l4120R13B01792H7090a51329C5215J78887P8774d3304C14582
12895i2388B02247I7031i2384m8598n8774d8947A86200J5631J46639D5889b91643
12883c04304a31339B53498B8067J27386b31425C93986I0776e14909H3912a97717
12872G0629a64382F3267J09713p1282L3405n8272c22802i7106j26846A8515a25145
12860I3920a7952D6949c12546D2050J50191a68736c5838k73649E15594A34194
12849b82195H1190a1920F0934b79801g7891o1740E8888b25823A68760a38911D7028
$$ plain form
12929 241524 -180497 -254612 87456 -118943 214150 32872 -423863 189779 -138932 5521
12918 -188181 225390 -125432 -10944 124556 10655 351102 -144543 249886 440545 131561
12907 190851 -16962 -51082 -50169 201792 87090 -151329 35215 214102 292876 -43304 314582
12895 -92388 202247 97031 -92384 -140982 -199756 -48947 186200 201831 348470 45889 -291643
12883 -304304 -131339 253498 28067 155453 -231425 393986 90776 -514909 83912 -197717
12872 70629 -164382 63267 172980 101698 135103 76831 -322802 -97106 -223952 18515 -125145
12860 93920 -17952 46949 -312546 42050 192241 -168736 -35838 -309487 515594 134194
12849 -282195 81190 -11920 60934 -279801 -77891 -139631 58888 -225823 168760 -138911 47028
12837b97376C07367a85277g3009k75788C50835b44958d7955E003K7102e6522A42546
12825a04304l47354A15956D4172b03815j699A79870r962J13622b37121A71300
12814B2003J20512a58030A32546b49294J02582a790A54976a72848A48882J99294
12804C48176b07068A06785b27640I0393Q8052R7694a68140B36726h1685o9553
12794a51238d0286n0662o6664D0755N3526J44869B3286d3651B23832a22868C1656
12782a56581d6079o5693B57791D1478M1902c7901B37482j06275m2660J95081E6974
12770b47085g4193A31540M6213C1905a08665A02185a79890I636b24515C4120f7157
12758C18121e2625K1848l17876B44911A2015a17691q5664a842A0902h6278B38930
$$ plain form
12837 -297376 307367 -185277 -73009 -348797 350835 -244958 -47955 5003 32105 -56522 142546
12825 -104304 -451658 115956 44172 -203815 -205514 179870 169908 283530 -237121 171300
12814 22003 142515 -158030 132546 -249294 -146712 -1790 154976 -172848 148882 348176
12804 348176 -207068 106785 -227640 90393 178445 276139 -168140 236726 -81685 -151238
12794 -151238 -40286 -90948 -157612 40755 94281 239150 23286 -43651 223832 -122868 31656
12782 -156581 -46079 -111772 257791 41478 83380 -37901 237482 131207 88547 283628 56974
12770 -247085 -74193 131540 177753 31905 -108665 102185 -179890 9636 -224515 34120 -67157
12758 318121 -52625 -30777 -348653 244911 12015 -117691 -203355 -1842 10902 -86278 238930
12746I5141K67288A71449n650b07342B11774A02198n0068l887f4787E57839A64510
12734H4482J86136j06923p4265c2143A23024a98919C0611J42657c0165C25287
12723a84C29412m5797n3918j13203R179m3628J26394a81426G5641b38127o472
12712b44599L2177g4747J7860j72185B02972r3042K5855J39457k0666j03756j7502
12701A33318D593M347i4404A18512a79173C8395N7788L55984F9401b8146j81241
12690b09387f73B27026a33207q1952e8580f15F6495K09722g6894C96663b8525
12678A25862K43776A44706i6540A03086J52462L4026E4557K12206a6640F7769
12667C78980J73163A52140O3332Q0598F9165L20131H8820c8257C86915j87026
$$ plain form
12746 95141 362429 171449 165799 -207342 211774 102198 52130 48243 -64787 557839 164510
12734 84482 270618 163695 89430 -32143 123024 -198919 30611 173268 -30165 325287
12723 -184 329412 283615 229697 116494 125673 82045 208439 -181426 75641 -238127 -244599
12712 -244599 -212422 -74747 -56887 -229072 202972 109930 135785 275242 254576 150820 133318
12701 133318 4593 8940 -94404 118512 -179173 38395 96183 452167 69401 -28146 -209387
12690 -209387 -673 227026 -133207 -215159 -58580 -615 66495 276217 -76894 396663 -28525
12678 125862 369638 144706 -96540 103086 255548 289574 54557 266763 -16640 67769
12667 378980 552143 152140 215472 296070 69165 389296 88820 -38257 386915 199889
12657A99889k7938m3862l9931O6515K40684D6440J93343j16397e9725F1530b10137
12645C43042e09195a59784O5782q4631j2904B51014Q7613A08368J24028p9683
12635A52713Q7218c21765A92286a73173B50456j8594q3275J8847a0687D12080
12624A31415a8038C95401b8229A01710K6354J1162b29766k4816A66925a84843
12613A24114b56563G3749K39395A1199L17414d5943l0912a5608B23213J58291
12603C81504c03525C3064K48686F3429J16440K49422a56220N3681G2533a21808
12592b92398B30545a05286K2034B57358a02708B32751d7064E5369K28176I9453
12581a25584B69050D5763e5322A64281h1052k30030D28438b1129A03147K49819
$$ plain form
12657 199889 171951 128089 88158 154673 395357 46440 239783 123386 -59725 61530 -210137
12645 343042 -509195 -159784 -94002 -178633 -191537 251014 338627 108368 232396 152713
12635 152713 239931 -321765 192286 -173173 250456 231862 148587 167434 -10687 412080
12624 131415 -18038 395401 -28229 101710 128064 139226 -229766 -254582 166925 -184843
12613 124114 -256563 73749 313144 11199 328613 -45943 -76855 -15608 223213 381504
12603 381504 -303525 33064 281750 63429 179869 429291 -156220 -102539 72533 -121808
12592 -292398 230545 -105286 -83252 257358 -102708 232751 -47064 55369 283545 99453
12581 -125584 269050 45763 -55322 164281 -81052 -311082 428438 -21129 103147 352966
12571C52966b06451e4090C31206A34405r481a36199B11785D9893J64789j0374
12561B04308J0259o2699O4908D4942L8352l1890R5416E4486b33534a12668D6096
12549B48616a59591A8327K32745A14689J52135J13069m9841h6600B30609b76896
12538A31996m41D7736a77669B68475B1985J26836b21630l8587A9558i4490j23990
12527b18480l1589D6399h3504B64638a58781E7578J35708j4367K7364e003k12922
12516b17925F83051G5972e2644B34928a2138C9787J12484m5406B4670f2469n8998
12505a21467B00209a25567B12513d15851h2709E5660a22500A69040i2303A8360
12494c33164C57554j48027a12690j278A78554J46542j11752C1232J9783L6613
$$ plain form
12571 352966 -206451 -54090 331206 134405 124924 -136199 211785 49893 214682 204308
12561 204308 214567 151868 216776 44942 83294 51404 146820 54486 -233534 -112668 46096
12549 248616 -159591 18327 251072 114689 266824 379893 330052 -86600 230609 -276896
12538 131996 131555 47736 -177669 268475 21985 148821 -221630 -260217 19558 -94490 -218480
12527 -218480 -250069 46399 -83504 264638 -158781 57578 193286 178919 206283 -5003 -217925
12516 -217925 683051 75972 -52644 234928 -12138 39787 152271 106865 24670 -62469 -121467
12505 -121467 200209 -125567 212513 -415851 -82709 55660 -122500 169040 -92303 18360
12494 -333164 357554 209527 -112690 -113968 178554 325096 213344 31232 51015 87628
12484H7628P3403K43520c06711H0675P0133M3071d9490G9440h6478k56449A19425
12472A48787J24525J32107b22205R4750B2244I260i3468k24409a31259q5141B71274
12460H5950L5790A3049L90143d9567m8660D4063a80442Q5257D22005D0232a32766
12448a74508J4999b2649A47392c7619e343A38735n2078K24976Q0390j2359I6458
12436A17072L9619E3486b27455A6091M16126a82860J1872n4131A80473k0618d4086
12424e3240C37800k7385g6601b4267o64j41655B54944o8293b11789j2808g6080
12412f7537p0702I9523a48010B15037a67017F548c1039o0513A14188h2009C3169
12400A1789h610C0156a73290E8053a93067h1845A78365G0028c23836B59633H0214
$$ plain form
12484 87628 161031 404551 -306711 80675 150808 193879 -49490 79440 -86478 -342927 119425
12472 148787 273312 405419 -222205 -127455 22244 9260 -93468 -317877 -131259 -216400 271274
12460 85950 121740 13049 403192 -49567 -98227 44063 -180442 -95185 422005 40232 -132766
12448 -174508 -159509 -22649 147392 -37619 -5343 138735 86657 311633 392023 379664 96458
12436 117072 156691 53486 -227455 16091 432217 -182860 -170988 -225119 180473 159855 -44086
12424 -53240 337800 310415 -76601 -24267 -24931 -166586 254944 186651 -211789 -224597 -76080
12412 -67537 -138239 99523 -148010 215037 -167017 6548 -31039 -91552 114188 -82009 33169
12400 11789 -8610 30156 -173290 58053 -193067 -81845 178365 70028 -323836 259633 80214
12388a12551b7084n6890A76376p5648b5871C2328R1778b57039i1309l5606q6452
12377b13367b7216j73520A63370M6787d08250a87380M4716A30408e4832k02478
12367b57310h5487H23i8345b0780q7625m7411H7003a05552j18059B28504M3310
12356B71814I2416a36725C7720a08040B0659c6073E0380e8521b3145A61111D6086
12344C44993D0662b65124H0913b0403B30089K2738d60833a33283B19751a14780
12333a3370C5947A539K47816C4499c9055k38065A81029D4353d2665j52014E6495
12321f3810A61324C4837b0751A49281b32055a05658F6475h542C925J95164B4953
12309A8216BL22410A16265a32934I2581O5409c11718J32332N5481D0544j7919
$$ plain form
12388 -112551 -27084 -83974 176376 100728 -25871 32328 124106 -257039 -91309 -126915 -213367
12377 -213367 -27216 -200736 163370 210157 -408250 -187380 -142664 130408 -54832 -257310
12367 -257310 -85487 823 -98345 -20780 -108405 -155816 87003 -105552 -223611 228504 271814
12356 271814 92416 -136725 37720 -108040 20659 -36073 50380 -58521 -23145 161111 46086
12344 344993 40662 -265124 80913 -20403 230089 252827 -460833 -133283 219751 -114780
12333 -13370 35947 1539 249355 34499 -39055 -277120 181029 44353 -42665 -194679 56495
12321 -63810 161324 34837 -20751 149281 -232055 -105658 66475 -8542 3925 199089 24953
12309 18216 2 322412 116265 -132934 92581 157990 -311718 -179386 -123905 40544 22625
12298B2625b76656d5715I7611P9197G0950J83720r8000A8305J77633J83901B4266
12286B04741k2980q0754b47357C29313b9784D2205J2182a09854E1161e9583C9155
12274A49994J14098b4995r0951A19714a21218E2352j752M36036b46916C17874
12263f8557j89693J26321j22153A02663h8300A82905M2982q9181N9725E7542d8248
12251A93898a4791A71844j7498J75503j56633B5705G815N8295R5427l4186j4700
12240A12651J64790A12246l8131l1533J4856J33862k4666M1760J10440A1744K21836
12229B33580l3938K22774A72538a44106M2913A10421J07329M624J98018J85319
12219F05711m1725a07810A01121c6780j49454C69491g8840b9204H6534J09477
$$ plain form
12298 22625 -276656 -45715 97611 176808 70950 254670 156670 18305 195938 379839 24266
12286 204741 181761 101007 -247357 329313 -29784 42205 54387 -109854 51161 -59583 39155
12274 149994 264092 -24995 -115946 119714 -121218 52352 50600 486636 -246916 317874
12263 -68557 -258250 -131929 -254082 102663 -88300 182905 225887 136706 196431 57542 -48248
12251 193898 -14791 171844 154346 329849 173216 25705 7815 66110 161537 127351 112651
12240 112651 277441 112246 74115 42582 57438 191300 166634 208394 318834 11744 233580
12229 233580 199642 422416 172538 -144106 -101193 110421 217750 222374 420392 605711
12219 605711 563986 -107810 101121 -36780 -186234 369491 -78840 -29204 86534 196011
12209A96011b95200B47366r9681b085C10002M3973o9334M9136p1635j8746n831
12198B37565Q0420L3440j26894N578r0518l500m2001J79971J3939F7640b12192
12186C53569a58854E69413b45060i6126r9170C80226a57747B06040Q4048n8837
12176B31251r0613b58430C87455j60948K0378A04672L40194j52122j46129f4906
12165g6448D33581J20372A94318j1474J96040F195g614A36156b011B54265f0643
12153a79563A33909b35515I9531J94935A4110K21624a27096A91896e3186A72699
12142B59009b50055A63902K46095A79797n7457g6017p2796B03441p6169J69049
12132B96321A6795h6258E8929K75129A29708g0939h808k24891B52637a15913E26860
$$ plain form
12209 196011 -295200 247366 147685 -2085 310002 353975 284641 333777 262142 243396 237565
12198 237565 317985 351425 224531 230109 139591 136091 94090 274061 288000 67640 -212192
12186 353569 -158854 569413 -245060 -96126 -195296 380226 -157747 206040 290088 231251
12176 231251 140638 -258430 387455 226507 246885 104672 444866 292744 146615 -64906
12165 -76448 433581 553953 194318 182844 378884 6195 -7614 136156 -2011 254265 -60643
12153 -179563 133909 -235515 99531 294466 14110 235734 -127096 191896 -53186 172699
12142 259009 -250055 163902 409997 179797 122340 -76017 -148813 203441 127272 296321
12132 296321 16795 -86258 58929 334058 129708 -70939 -8808 -233699 252637 -115913 526860
12120A40972b8326A5900J97294D6691P0457m6677J19685C9766P5002O564j3260
12109A08072b24780f8798A4043J01770I651a70812P108B56243B8513R8010E7257
12097a66489Q2206j36328A77217c4556A80309J37731A12948D2483b95746B15895
12086D14838A33870b06201E8173a22778m0042N9923A49474B0851J22509b07403
12075a96773A37498f8353G0952R4915d65504h4285c6954I9076L3864a29522N5194
12064g4328B85502g0740b4141j09048E1242e5244b6249n573F90364R77748p85530
12053H82582l09786A72535P6680A4418J64490b15906e7317j73480m2362k8329
12043c01488F7565b4601m6776j81888D30803a25544j8490F3132c38001B20238
$$ plain form
12120 140972 -28326 15900 213194 46691 117148 70471 190156 39766 114768 121332 108072
12109 108072 -224780 -68798 14043 115813 9651 -170812 -163704 256243 28513 126523 57257
12097 -166489 -84283 -220611 177217 -34556 180309 318040 112948 42483 -295746 215895
12086 414838 133870 -206201 58173 -122778 -162820 -102897 149474 20851 143360 -207403
12075 -196773 137498 -68353 70952 165867 -465504 -84285 -36954 99076 132940 -129522 -74328
12064 -74328 285502 -70740 -24141 -133189 51242 -55244 -26249 -31822 690364 1668112 882582
12053 882582 572796 172535 249215 14418 178908 -215906 -57317 -230797 -273159 -301488
12043 -301488 67565 -24601 -71377 -253265 430803 -125544 -144034 63132 -338001 220238
12032A91749p592C4782O2101a56699D0184K5093a62284F5847R0443E5663e6779
12020H9985K9728a55406j06168B65133J47313o5033a35543C0003M7464j4709J04991
12009A67749D1046i8228G0099P4262L6166B6990a22019q5657f3937A5860K03764
11998B19624k4409b57523E8558a65633j1809A7610J4254e7976k36098C01174a03465
11986H707b4791K916C9742a37395l0623f488l3935d691j16597g063A23965c53820
11973b78188A06603c99842g9906A38111b0471C12389g7762c4289r4587A06195
11962d16185a77170a8375j73407I1272c95299J76360r7260A13497H117R56J09083
11951A18156f0550A67778E4017K4838d6370p9701I539b8405B38810C7167R2794
$$ plain form
12032 191749 184157 34782 96883 -156699 40184 65277 -162284 65847 156290 55663 -56779
12020 89985 119713 -155406 -261574 265133 412446 347413 -135543 30003 77467 62758 167749
12009 167749 41046 -98228 70099 144361 180527 26990 -122019 -207676 -63937 15860 219624
11998 219624 195215 -257523 58558 -165633 -177442 17610 31864 -57976 -294074 301174 -103465
11986 8707 -24791 -21875 39742 -137395 -168018 -6488 -40423 -4691 -121288 -7063 123965 -353820
11973 -278188 106603 -399842 -79906 138111 -20471 312389 -77762 -34289 -128876 106195
11962 -416185 -177170 -18375 -191782 91272 -395299 -218939 -316199 113497 8117 9073 118156
11951 118156 -60550 167778 54017 78855 -46370 -126071 9539 -28405 238810 37167 129961
11940A29961b7729j7111H3585b4037B12244G1413J1342a05782f539A29793b54402
11928A50647G5272c48873H6227e2336m966o7040J8559d6820A9490c50755A66501
11916A72922N8293I8699Q0687P7507c2097A72537H5157b23542j9685I5012J67040
11905B62052j10355F6504K24197K1114C4084a97808A30051J72039b18610E8336
11894A36546h8475D5671h7402A20938B2030a75051A6310N8223J3401i0345G0083
11882a20901m4675B79105j0746E707a87522q742e7179B12777h6829K9713D0133
11870a13430a9846j07623D5628M6441a19629n0286a3721B01798a33354K3789d9770
11858C9089b7120j08680j56921B99647A30440i0706a9294B8322r996e6646O189
$$ plain form
11940 129961 -27729 -44840 83585 -24037 212244 71413 82755 -105782 -6539 129793 -254402
11928 150647 75272 -348873 86227 -52336 -57302 -124342 -105783 -46820 19490 -350755 166501
11916 172922 231215 98699 179386 256893 -32097 172537 85157 -223542 -243227 95012 262052
11905 262052 151697 66504 290701 311815 34084 -197808 130051 302090 -218610 58336
11894 136546 -88475 45671 -87402 120938 22030 -175051 16310 74533 87934 -90345 70083
11882 -120901 -165576 279105 268359 5707 -187522 -196264 -57179 212777 -86829 -57116 40133
11870 -113430 -19846 -127469 45628 92069 -119629 -169915 -13721 201798 -133354 -109565 -49770
11858 39089 -27120 -135800 -292721 299647 130440 -90706 -19294 28322 18326 -56646 -50457
11847e0457l2165n5202A97349b94518A3413Q6431a21188A26624h5896k58110k5912
11836c69918G7262b6522k349k6250n4479A20082a86323E5762J18193c9502j37156
11825a76658e6649j63588B26699c98113H564K65572d14739m5728e627m02913b360
11813d1254r1935m0649c6187n29456b55024P3567B2129P3311b02886K8776q6260
11802b60370Q7092A00025a660m2365A77022a37679A91649e6634A79907n1548J9292
11791A47651c9944B42357b6385k37371E5525d0573m8152D17648G1132M47607D9881
11779b01855B73556J48328b32768r5981A82748d1000A54692i1562d785m13094
11769d17879a75610d7666l6614a095H3410g5424r0159L725J374e0286j71754d6865
$$ plain form
11847 -50457 -82622 -137824 197349 -294518 13413 99844 -121188 126624 -85896 -344006 -369918
11836 -369918 77262 -26522 -28871 -55121 -109600 120082 -186323 55762 173955 -39502 -176658
11825 -176658 -56649 -220237 226699 -398113 8564 274136 -414739 -460467 -5627 -408540 -2360
11813 -41254 -133189 -173838 -36187 -565643 -255024 -181457 22129 95440 -202886 -174110 -260370
11802 -260370 -173278 100025 -1660 -44025 177022 -137679 191649 -56634 179907 128359 147651
11791 147651 -39944 242357 -26385 -263756 55525 -40573 -88725 417648 71132 518739 49881
11779 -201855 273556 421884 -232768 -328749 182748 -41000 154692 -91562 -4785 -417879
11769 -417879 -175610 -47666 -84280 -1095 83410 -75424 -165583 -161858 -160484 -50286 -222040 -46865
11756G1648J72790b4497k22096a03380b2554A3936L7597d9169i354A23960a2882
11744h266A37762c2170k79650E2242L0812a85596P68A64a49456j5828P0090m139
11732i9333A52615b6457k03669E1029N7751a83996d8403k93697A78406O0976c6365
11720C46783F8727L00296j21961b41598a04589M9568D20019j94602E1933h1655
11709c05757I7963a3580L108d277n9802j27424E1153M9881J25914a15272b7192
11697A78275b08248e7349K5522B60226g1597C18293B557Q1544b33896b7810C7241
11685A61451m7825k3418J14800c1062I3545a71589B13352A7448f2594A3697b03208
11673A71608o1221b31422c0859A9012J01796a40024d9024B07803a45034J2313
$$ plain form
11756 71648 244438 -24497 -246593 -103380 -22554 13936 51533 -49169 -9354 123960 -12882
11744 -8266 137762 -32170 -311820 52242 83054 -185596 -184828 164 -149456 -165284 -95194 -99333
11732 -99333 152615 -26457 -230126 51029 108780 -183996 -48403 -342100 178406 239382 -36365
11720 346783 68727 369023 247062 -241598 -104589 -55021 420019 225417 51933 -81655
11709 -305757 97963 -13580 -10472 -4277 -64079 -191503 51153 101034 226948 -115272 -27192
11697 178275 -208248 -57349 -31827 260226 -71597 318293 2557 84101 -233896 -27810 37241
11685 161451 113626 90208 205008 -31062 93545 -171589 213352 17448 -62594 13697 -203208
11673 171608 110387 -231422 -30859 19012 120808 -140024 -49024 207803 -145034 -132721
11663a32721l4564g41A01764a064k4523A5872K78931c7876k19616A89922c42450
11651b8584p2105B46961K3065a70691A76449B4257d04648A25338g8903C43992
11640A1926a04593L8607A46947a90317F0913B8650J65959a53357G9979J23567
11630B03546a26719c0225m3497k8017A06491a31700B43285I6063j6920a6924j16129
11619a33053e4107r7609b4085A1401a7724K214I9910a81460j2725B24396I9792
11607A4545P4176g0630B30413m0717a63633B68502J42045H8247a27847A7986f1129
11595B5848c08251J32106A32205J11749j07578F1252i3375B16764b0750A67831
11584B00815o392F1512K75424K9734j60518b05977A67232F2706j3409J56697J589
$$ plain form
11663 -132721 -167285 -741 101764 -1064 -25587 15872 294803 -37876 -257492 189922 -342450
11651 -28584 -100689 246961 270026 -170691 176449 24257 -404648 125338 -78903 343992
11640 11926 -104593 -65986 146947 -190317 60913 28650 194609 -153357 79979 203546
11630 203546 -126719 -30225 -73722 -101739 106491 -131700 243285 96063 79143 -16924 -133053
11619 -133053 -54107 -151716 -24085 11401 -17724 -15510 99910 -181460 -194185 224396 99792
11607 14545 88721 -70630 230413 189696 -163633 268502 410547 88247 -127847 17986 -61129
11595 25848 -308251 -176145 132205 243954 136376 61252 -93375 216764 -20750 167831
11584 200815 194423 61512 336936 366670 206152 -205977 167232 62706 49297 205994 207583
11573B07583j00804c9086L066j7321J7980F2025Q5213D7054K94239A27410e456
11561g0217j53563A03362P5256b27165k1062B16108o9314b78164d6935A25588
11550h7392j9197N979r4899B6919M6391K03297a02443B05848L0901f2464D2358
11538a26472N4464D30036A21796E2026P7168c1913r8992B99096A32792L89775
11528E22567B35059A15797N0851K49918j33610J6511C4630J37855A2441a6544
11517C12331j29486J30077C4325J70810b6566k52164B97957A39185K7930f5479
11506C22307c8313A78267A6950M20953a45883I7982J06273c0654A83502G4911
11495A9247M0062L55400A57329a09987k3962C40889a87092A27417J69678j25760
$$ plain form
11573 207583 106779 -39086 -36020 -53341 -35361 62025 147238 47054 341293 127410 -5456
11561 -70217 -223780 103362 178618 -227165 -248227 216108 146794 -278164 -46935 125588
11550 -87392 -106589 -100610 -195509 26919 73310 276607 -102443 205848 236749 -62464 42358
11538 -126472 -72008 430036 121796 52026 129194 -31913 -130905 299096 132792 522567
11528 522567 235059 115797 166648 416566 282956 299467 34630 172485 12441 -16544
11517 312331 182845 312922 34325 205135 -26566 -278730 297957 139185 167115 -65479
11506 322307 -38313 178267 16950 437903 -145883 97982 204255 -30654 183502 74911
11495 19247 59309 414709 157329 -109987 -133949 340889 -187092 127417 297095 171335
11485A71335A4408R7246J40528H2889K38776f0186C96073I5399k9456M02249I3566
11473a1547D19259C8197N8515J74409a40831A60080G6921K02943K42500A77858
11462b2126B10668R1358o3236a9267a679B43502F1313i1371B18358Q0007d0173
11450C03020D325M87047H0654K08982K7002A21450K2891L74182A59392e451A00423
11438A36677n2072J71140G7774K17755G6815a46413A27091R9773O3194G4783b57936
11426h7917A54972a61884A74065J9974a1316B13474n7582E1321M34812d07803
11415E1119J62829E6742c4371F2707f5834k21750L3785h6918H6827R4893b27800
11403G286a40930A21857O1864a8519j81911m7846P6920g8730K1207A87241b8A46613
$$ plain form
11485 171335 14408 111654 252182 82889 321665 -60186 396073 95399 65943 468192 93566
11473 -11547 419259 38197 96712 271121 -140831 160080 76921 279864 522364 177858
11462 -22126 210668 302026 238790 -19267 -1679 243502 61313 -91371 218358 298365 -40173
11450 303020 4325 491372 80654 289636 316638 121450 144341 518523 159392 -5451 100423
11438 136677 84605 255745 77774 295529 76815 -146413 127091 226864 290058 74783 -257936
11426 -87917 154972 -161884 174065 194039 -11316 213474 155892 51321 486133 -407803
11415 51119 213948 56742 -34371 62707 -65834 -287584 -253799 -86918 86827 181720 -227800
11403 7286 -140930 121857 183721 -18519 -200430 -248276 -171356 -78730 -57523 187241 -28 146613
11390g7225I6664i6811I7705C9975b32557R3635j22272C75126b12654b5014C4978
11378F1385c1725I4261e7448A15826l6087a33748F8720g1287A19612J826c05482
11366a89383G2956a38415f3097b7957B4497f7058A93127K4938M3128j28389A0196
11354a41677I1305a09815H9228a6134B10792K39585E928i3344j1271l11719A30857
11342h0801G6602P6599f106B56797j22502a53797M471C7413a83661A5293a62169
11330A55419A5482d6056J5790B49a96060c46I3247f7092J315k822k48023C4356
11317C4252b09474j65012a03070C6389a8181I0220K19093b23809j71687B3073
11306C8493a96084C20113C8528c45435a27168r7967O9623A55396m2672a37262
$$ plain form
11390 -77225 96664 -96811 97705 39975 -232557 -138922 -261194 375126 -212654 -25014 34978
11378 61385 -31725 94261 -57448 115826 79739 -133748 68720 -71287 119612 121438 -305482
11366 -189383 72956 -138415 -63097 -27957 24497 -67058 193127 218065 261193 132804 10196
11354 -141677 91305 -109815 89228 -16134 210792 450377 5928 -93344 -104615 -416334 130857
11342 -80801 76602 153201 -6106 256797 134295 -153797 -149326 37413 -183661 15293 -162169
11330 155419 15482 -46056 -30266 249 -196060 -346 93247 -67092 -65777 -68599 -316622 34356
11317 34252 -209474 -374486 -103070 36389 -18181 90220 309313 -223809 -395496 23073
11306 38493 -196084 320113 38528 -345435 -127168 -225135 -155512 155396 112724 -137262
11295i1356j48799e032k3181j09069E3528a0095A19385J77244e1294j88608h8606
11283B17723Q747c70805B2449a366m6065l65932A39810O4204A4612c939k15234
11272b19173b7096M036m7711q7249c8004j369a622B5135f2798B2931J36977L7676
11260A97584N7988G9164J58924j18537L6205d3928j35932l5915h5492a0295o4364
11249g4659L2478E35J94686F3224B6038b33949a14093A88351G9652O6238J19179
11238B65069i1590B6946J56734n5982g8786A83489c3494A22690d2169k6143k8357
11227i6669j15789D4076K92930d44154g7751c0444A57850g8667L0840G3857l2682
11216D1175Q342i046A50825F1810Q2115l4578J75978b21922a6720l12104b3046
$$ plain form
11295 -91356 -240155 -5032 -28213 -137282 53528 -10095 119385 296629 -51294 -239902 -88606
11283 217723 226470 -370805 22449 -1366 -47431 -413363 139810 204014 14612 -3939 -219173
11272 -219173 -27096 -23060 -70771 -158020 -38004 -39373 -1622 25135 -62798 22931 159908 197584
11260 197584 255572 79164 238088 119551 155756 -43928 -179860 -215775 -85492 -10295 -74659
11249 -74659 -42181 535 195221 63224 26038 -233949 -114093 188351 79652 145890 265069
11238 265069 -91590 26946 183680 127698 -78786 183489 -33494 122690 -42169 -68312 -96669
11227 -96669 -212458 44076 337006 -444154 -77751 -30444 157850 -78667 -47827 73857 41175
11216 41175 49517 -9046 150825 61810 143925 109347 285325 -221922 -16720 -328824 -23046
11204g7062k20379L098G1522a22337D3210i2766d5107B13019H4845k7473N1684
11193A09056l6345h9742a4962k73391A19846g7657l05353e7067k96224F4404K9045
11182I3449q110Q8259L4974E7189P4730N7954B4774a57134A09482a00041E8969
11170b4150B13404a58466B49226a2853C00611a91147C0025a64702l376H9517c07761
11158B92406n5733i5971m3288l1792j97538I0088C5088g9079A7793J05672b7046
11146a58514k41205F3902J49694b52667A26709b19953B8554a12764A87230q9271
11136I7959a32312n3645A21180i107E0034A7174L37658d06540A30304j9078J55614
11125B66840F3263K47339H7778K4655L7148Q1135c9784m7304C30487C6501K94084
$$ plain form
11204 -77062 -297441 -294343 71522 -122337 43210 -92766 -45107 213019 84845 57372 109056
11193 109056 72711 -89742 -14962 -288353 119846 -77657 -383010 -57067 -353291 64404 93449
11182 93449 85339 173598 208572 57189 131919 189873 24774 -157134 109482 -100041 58969
11170 -24150 213404 -158466 249226 -12853 300611 -191147 30025 -164702 -168078 89517 -307761
11158 292406 236673 -95971 -139259 -171051 -368589 90088 35088 -79079 17793 123465 -27046
11146 -158514 -399719 63902 213596 -252667 126709 -219953 28554 -112764 187230 97959
11136 97959 -132312 -185957 121180 -9107 50034 17174 354832 -406540 130304 111226 266840
11125 266840 63263 310602 87778 112433 149581 230716 -39784 -87088 330487 36501 330585
11114C30585F7482b8986n5764l9609A46171J09393a3535n8844b824B20741r3650
11103A27091a73566I956M2649J1503P9063J41217e1623E6461M42629a65828D03144
11091B5307A1029P492b45485A3567J94350r0610K7739J1454M9194K10928j83373
11080B33249q8935j7281L5308K87169A85696J93125r1251L65508k04072L2263
11070D81269j38955J33369A46805O3881M17742O0730k60023j76868K11820K32530
11060F96617j59562L6003j00952J94441K85148m15492j46878P17428m06683K41251
11050I41321k61922K69604N2182J27291j96569J85880j77648M529K9847l7496
11040I37019M8640n6009J7209j3228l00723M8548N37585m23785K1254j83255q8183
$$ plain form
11114 330585 67482 -28986 -84750 -124359 146171 255564 -13535 -72379 -2824 220741 127091
11103 127091 -173566 9956 52605 64108 143171 284388 -51623 56461 499090 -165828 403144
11091 25307 11029 18521 -245485 13567 207917 117307 145046 156500 205694 416622 233249
11080 233249 144314 127033 162341 449510 185696 378821 287570 653078 449006 481269
11070 481269 342314 475683 146805 210686 628428 689158 429135 252267 464087 696617
11060 696617 537055 573058 472106 666547 951695 536203 389325 1106753 700070 941321
11050 941321 679399 949003 1001185 1128476 931907 1117787 940139 944668 974515 937019
11040 937019 985659 929650 946859 933631 632908 681456 1219041 795256 816510 633255 545072
11029E45072J96730K55036k64852o6819L68008J68528N1711l12577l10949M23459
11019A053347k49248k56338K14355J44978j87389K53794j42151k12709j91791
11010D26848K92998l54J26593l0238K46478k33461J31137j86842k55660M18495
11000I35994k79234J27626O515k30923J05592J53209j22156J64461M0813k95268
10990F06629K78524k87362K32467o6189J92892J01786K74956j66884k27020K43383
10980A183182J0044J34038K12454J10457L95889l9320O31936P8830N12807j24921
10970C105396L41855N33416j87004J68543L2447n95708l81505q54776k82917J47528
10960B027275m77089J13341N5444j50251n5583l49224L49382j26585m83941l5170
$$ plain form
11029 545072 741802 996838 731986 665167 1033175 1201703 1253414 940837 629888 1053347
11019 1053347 804099 547761 762116 907094 719705 973499 831348 618639 426848
11010 426848 719846 719492 846085 815847 1062325 828864 960001 773159 517499 935994
11000 935994 656760 784386 790901 559978 665570 818779 696623 861084 901897 606629
10990 606629 885153 597791 830258 764069 956961 1058747 1333703 1166819 939799 1183182
10980 1183182 1193226 1327264 1539718 1650175 2046064 2006744 2638680 2717510 3230317 3105396
10970 3105396 3447251 3980667 3793663 3962206 3994653 3398945 3017440 2162664 1879747 2027275
10960 2027275 1550186 1663527 1718971 1568720 1513137 1163913 1513295 1386710 902769 867599
10950H67599K31354l29817k1032C51912r9929J78382l6482m0841L36199k71804
10940D17437c04497A89603J91257j35971L48016j59780a3764j5035A50521J11176
10930B61697I8875a61670H0348K02355d9314B48582r5511J03779c3729C01416
10919f5692o7663C50913a252j54398D51868d16342G7404b56476i513A61191e8735
10907I1032a67862C25834j48790l9322i0389j35876h4206r575A84047d5995q215
10896e4210O027A1869g727j0895j13005q8633B92613I6122c29362a02271j92586
10885b94857a1865k04006c2325G1529J27814n4617a86574d802F8471L16340A54253
10873C1528d45487a02606c2565C1607b36333g3689A90888b15123Q0518e1229B33408
$$ plain form
10950 867599 1098953 769136 748104 351912 251983 430365 393883 353042 689241 417437
10940 417437 -304497 189603 380860 244889 592905 433125 -13764 -28799 150521 261697
10930 261697 98875 -161670 80348 282703 -49314 248582 153071 256850 -33729 301416
10919 -65692 -133355 350913 -1252 -155650 451868 -416342 77404 -256476 -9513 161191 -58735
10907 91032 -167862 325834 177044 137722 -90389 -226265 -84206 -93781 184047 -45995 -54210
10896 -54210 -48183 11869 -7727 -18622 -131627 -220260 292613 96122 -329362 -102271 -294857
10885 -294857 -11865 -215871 -32325 71529 199343 144726 -186574 -4802 68471 384811 154253
10873 31528 -445487 -102606 -32565 31607 -236333 -73689 190888 -215123 -134605 -51229 233408
10861a76113j08669l26756g8138c897j92215B80822a07871A48480a1330j363j50334
10850a63027A16925J71742d2806q7924K880D3212g7160j7094G834a48500o5043
10839b13543g5288p3760c3608q7585M247c9226F1095c09936o8821a7577k32042
10828b49619k6544A37236M6169D7130e8429C67921c6848l66429a33627j77562
10818c11189P9419o0359B22268i3506L916m239A05396b77173a09242A20027A2503
10806C37797A56718e140k82352J30333F4909a91158i0031C3236g7627A0791g614
10794i9388F0857b70127F7153b00649j75604b9498C64991g8750A6793Q7108E224
10782H3953a35599l11151C04172a84729j5496P0426a0212j52648B34223a98336
$$ plain form
10861 -176113 -284782 -611538 -78138 -3897 -196112 280822 -107871 148480 -11330 -12693 -163027
10850 -163027 116925 288667 -42806 -130730 -127850 43212 -77160 -94254 7834 -148500 -213543
10839 -213543 -75288 -149048 -33608 -121193 -116946 -39226 61095 -309936 -378757 -17577 -249619
10828 -249619 -276163 137236 183405 47130 -58429 367921 -36848 -403277 -133627 -311189
10818 -311189 -231770 -292129 222268 -93506 -89590 -93829 105396 -277173 -109242 120027 12503
10806 337797 156718 -5140 -287492 -157159 64909 -191158 -90031 33236 -77627 10791 -7614
10794 -99388 60857 -270127 67153 -200649 -376253 -29498 364991 -78750 16793 103901 5224
10782 83953 -135599 -446750 304172 -184729 -200225 -129799 -10212 -162860 234223 -198336
10771C3141b37951B83535b11173k6416J01796A81256A5881L36829a41465a6301
10760A17658P228e7732A14365E6597L8888c6648F4104a10694k9482n2953d3429
10748a14950L7222l2197c6904j2547j04684N6499G1408K21884e7229D23181j84155
10737B39026f428l1296G0948d48532f5299A04337h4863a1063A6130a80107g7589
10725b21947P8424A8000J86024a01237d2202B66157a22976B71785b56484f6080
10714E0099J46355a49595M445A25496b74026a08900o9296C8573a17404N2435p2177
10703a37146A86033D0170J56609i3330j69414q8982h1566k8251B83436o7235c65284
10691a3241q2625C9888a14940j28664K6655N8296A4692i1463A68549b36021A78548
$$ plain form
10771 33141 -237951 283535 -211173 -237589 -135793 181256 15881 352710 -141465 -16301
10760 117658 124886 -57732 114365 56597 95485 -36648 64104 -110694 -140176 -193129 -43429
10748 -114950 -77728 -109925 -36904 -49451 -154135 -97636 71408 293292 -57229 423181 239026
10737 239026 -6428 -37724 70948 -448532 -65299 104337 -84863 -11063 16130 -180107 -77589
10725 -221947 -143523 18000 204024 -101237 -42202 266157 -122976 271785 -256484 -66080
10714 50099 196454 -149595 -145150 125496 -274026 -108900 -178196 38573 -117404 -64969 -137146
10703 -137146 186033 40170 196779 -93330 -262744 -351726 -81566 -109817 283436 216201 -365284
10691 -13241 -95866 39888 -114940 -243604 -216949 -158653 14692 -91463 168549 -236021 178548
10679e0567A32999I450c6913A57051c79793A30819h3793r7858N6738H7122b3454
10667A81460d7702B32284c801F7000b74646A3422M207J12351C3813a93059A16040
10655b05022i6624k3211H4255B7658O426b61798I0426i3608A52920i7867K1377
10644g6490K6693r0154a3579q3913k46231f5848m45090b28441A47706e2953l3635
10633h6588B02428b38446C18692i6163r1782d499j15006A45186e5768j39272b6644
10621d658l25485P1538D1639m502a30928p2926B23924f1491D1781c13020K4615
10610b88405f1583n1026B24501d7639o4065A71199a29909k15959R6366h8508j14392
10599b02900e9328q1367m4570b8131p7436c1511j6449j58384c3851j21959P1195
$$ plain form
10679 -50567 132999 9450 -36913 157051 -379793 130819 -83793 -181651 -124913 87122 -23454
10667 181460 -47702 232284 -3801 67000 -274646 13422 17629 129980 33813 -193059 116040
10655 -205022 -96624 -119835 84255 27658 34084 -261798 90426 -93608 152920 -97867 -76490
10644 -76490 -49797 -139951 -13579 -97492 -343723 -65848 -510938 -228441 147706 -52953 -86588
10633 -86588 202428 -238446 318692 -96163 -187945 -4499 -119505 145186 -55768 -195040 -26644
10621 -4658 -330143 -258605 41639 37137 -130928 -203854 223924 -61491 41781 -313020 -288405
10610 -288405 -61583 -112609 224501 -47639 -111704 171199 -129909 -345868 -249502 -88508 -202900
10599 -202900 -59328 -140695 -185265 -28131 -105567 -31511 -47960 -206344 -33851 -155810 -84615
10588h4615L2905k45569B14501G5464L9655a43166L1671B62088a82237C7227J75926
10577B13153i9836B52480a0608A59045c02896f9262A41299D6620c28304a15087
10566I2816a67260A79939a94346A37761i9456r2268O6956j51657J35691E6603
10555d1948A29585b77030j12596c6520k40165A72373J06891A8145J58297f1310
10544B18396a1216A11053a74459B52947G9141a03119k64358a20570b5375l4130
10534e9505G3602e6716k83365J58671Q8697C57067A14890b1935E4075K06202A6499
10522b45649D5448c4541A92142B8352i6178j1481k23374J58718B9690Q428K15876
10511B53994R684b672H4642a42780c6827m5302c9093i074m8247B06500D7617a08190
$$ plain form
10588 -84615 -51710 -297279 214501 75464 115119 -143166 -111495 262088 -182237 37227 213153
10577 213153 -99836 252480 -10608 159045 -302896 -69262 141299 46620 -328304 -115087
10566 92816 -167260 179939 -194346 137761 -99456 -191724 -124768 -276425 -140734 56603
10555 -41948 129585 -277030 -389626 -36520 -276685 172373 279264 18145 176442 -61310
10544 218396 -11216 111053 -174459 252947 79141 -103119 -367477 -120570 -25375 -59505
10534 -59505 73602 -56716 -340081 -181410 -92713 357067 114890 -21935 54075 260277 16499
10522 -245649 45448 -34541 192142 28352 -96178 -107659 -331033 -172315 29690 38118 253994
10511 253994 263678 -2672 84642 -142780 -36827 -82129 -39093 -9074 -57321 206500 47617 -108190
10498h9167H2088b51472G1787J29101i6683j52802D4947g3493j13485k6189j99669
10487d12836B78585c00258C2928h9707B58778e4849G7058A7013J34904K02885
10477C54802j48011L6045j2354j14462a61545B93461d046H9475J59501A11418
10466A25250M3219B4630b33264B16933G1519a14993M9885k23022b8005A89872
10455A15873i000j20054n8743K0303M8581j30223P7311m1287K5530f7399m0547
10444a07946d4285a06j12607p572E9029K60075D9311J13072l7990C0452f3894
10432D08659A43349a0154G6125i8613j12591A69633n745b11747A21517c37450
10421F5444h3041a6012r7761H6612d2773E5962i9408o0356a9004j72456C63645
$$ plain form
10498 -89167 82088 -251472 71787 200888 -96683 -249485 44947 -73493 -186978 -213167 -412836
10487 -412836 278585 -300258 32928 -89707 258778 -54849 77058 17013 151917 354802
10477 354802 206791 242836 230482 116020 -161545 293461 -4046 89475 248976 111418
10466 125250 168469 24630 -233264 216933 71519 -114993 -65108 -288130 -28005 189872
10455 115873 -9000 -129054 -187797 -167494 -118913 -249136 -171825 -213112 -187582 -67399 -107946
10444 -107946 -44285 -106 -112713 -120285 59029 319104 49311 162383 124393 30452 -63894
10432 408659 143349 -10154 76125 -98613 -211204 169633 163888 -211747 121517 -337450
10421 65444 -83041 -16012 -113773 86612 -42773 55962 -99408 -159764 -19004 -191460 363645
10409A68560Q3402a11942B79783d6055D0262a27299G9750a25996B46514i2023
10398A0151P8932A2543a3913p0641B51578c2157B14988l5509b71151N7938A55388
10386g4418D9967K38676C6300k443K09908O0045A31115K66337j97413H6220J91313
10375B77533j17369J39712p9861Q5662J70708B06487K24386j92645M62370k94160
10365D06438J5014M6450j46005K4239J0462A67517K13426A62404e0368k43695
10355b94063B35210K20398C414f2638G70041J10834L0334k20258j73809A30472
10344D52981J14117j36201k7318r7335E5420L44740j93523l629K02733A76577
10333B80007k0301J84062j65988c7407p9326b0871B85175q3159K7209O9372O6419
$$ plain form
10409 168560 251962 -111942 279783 -46055 40262 -127299 79750 -125996 246514 -92023
10398 10151 89083 12543 -13913 -84554 251578 -32157 214988 179479 -271151 -213213 155388
10386 -74418 49967 288643 36300 33857 243765 303810 131115 397452 200039 86220 277533
10375 277533 160164 299876 220015 305677 476385 206487 430873 238228 700598 406438
10365 406438 421452 467902 321897 346136 356598 167517 380943 162404 -50368 -294063
10355 -294063 235210 455608 3414 -62638 770041 880875 911209 690951 517142 130472
10344 452981 567098 430897 403579 306244 55420 400160 206637 203008 405741 176577
10333 280007 259706 443768 277780 -37407 -116733 -20871 285175 202016 229225 298597 365016
10322C65016J5410o022A79724d1451B29202c2323j144r2193A31971E1292Q1808
10311A33100L3350F9596a70426A96898H036R7574b01046b4193H5975a0374r1680
10300a02054A23821a94247A08192M6468K8447E4063P9799J44334d7783B21190
10289B27997o5215C7217a39877c5787r077j05606A84102J32407e0713G9028J2275
10278I1303c8926p9362l3164d8742j37901E4995a65756l0636Q0976k4161G6973
10266b55714e8023A12964a00615d3106p5888C18236C6340L4429M0326J2647n3598
10255G0144K60804c7823B3562O0309L34186a73374A75803a9822A5941G652c1366
10243A55657O7001F9241J31930b1356C98470r1656J3916A29074l1621b51331N2918
$$ plain form
10322 365016 380426 374404 179724 -41451 229202 -32323 -33467 -125660 131971 51292 133100
10311 133100 166450 69596 -170426 196898 8036 105610 -201046 -24193 85975 -10374 -102054
10300 -102054 123821 -194247 108192 154660 183107 54063 133862 278196 -47783 221190
10289 227997 162782 37217 -139877 -35787 -44864 -150470 184102 316509 -50713 79028 91303
10278 91303 -38926 -118288 -151452 -48742 -186643 54995 -165756 -196392 -115416 -139577 76973
10266 -255714 -58023 112964 -100615 -43106 -118994 318236 36340 70769 111095 123742 70144
10255 70144 330948 -37823 23562 83871 418057 -173374 175803 -19822 15941 7652 -31366
10243 155657 222658 69241 201171 -21356 398470 306814 320730 129074 97453 -251331 -198413
10232a98413q5058K2662D9456b87555A84604c09383R4972n4682c8641A8221O1283
10221G9504K26185h6057A38821a42630k32650P4404A01332a13980j62615h2986
10210G1071Q332a70683k0334O954M0445j31647o3729j23145A41740i2994J6410
10199g6584j721k7358B02866Q7242a11362p117A85933i4517D422i4277H4592A0493
10186B02256c97183a61885B60582d4391B15360b44372A68536c18068a22811C53827
10175a9736l77468a78634A32013k6604a32555l0383D00415c37859e3196m274B62119
10163d6072B56882i2109q1738j2684E1398e651A0940K6461R9229p449a09909A01728
10150b60050B9184b84677a30153O147B2695R9932i9259e61j42260D19885A8705
$$ plain form
10232 -198413 -283471 -260809 49456 -287555 184604 -309383 -214411 -269093 -38641 18221 79504
10221 79504 305689 -86057 138821 -142630 -375280 -300876 101332 -113980 -276595 -82986
10210 71071 79403 -170683 -191017 -184063 -143618 -275265 -338994 -462139 141740 -92994 -76584
10199 -76584 -78305 -105663 202866 290108 -111362 -118479 185933 -94517 4422 -94277 84592 10493
10186 202256 -397183 -161885 260582 -44391 215360 -244372 168536 -318068 -122811 353827
10175 -19736 -397204 -178634 132013 105409 -132555 -162938 400415 -337859 -53196 -57470 262119
10163 -46072 256882 -92109 -173847 -186531 51398 -5651 10940 37401 136630 129181 -109909 101728
10150 -260050 29184 -284677 -130153 -124006 22695 122627 -99259 -561 -142821 419885 18705
10138A5544a17048o7069f9139j30680M5693j58178b7444J1456A91599p9534N7198
10127A69263a45185o2277N3489E6489a37667K1993L1950n9689K6707j15202e9528
10115b73426d4671C69759a64068p6744b5022A07295a65981A82761b27438R5390
10105a32048j84997J30368b4406D8748L21163a2609l8241k47136j37729a58947
10094a96646n0221b7222C6877P806a90686Q3275B36762c2366A21977j8252g6957
10082d2918j81913A27662j3834d07971b8288j87284A40996d49034B3739K0617
10072D4356K41510b02457F3824a05524l31660J84143j17286a54875A62259J69183
10062C31442a55586E761b56248K7067c0732M448B42962A0033b9410l3155j21987
$$ plain form
10138 15544 -117048 -184117 -69139 -199819 -154126 -312304 -27444 -15988 191599 112065 169263
10127 169263 -145185 -207462 -153973 56489 -137667 -115674 -83724 -143413 -116706 -231908 -59528
10115 -273426 -44671 369759 -164068 -240812 -25022 107295 -165981 182761 -227438 -132048
10105 -132048 -317045 -186677 -24406 48748 369911 -12609 -50850 -297986 -435715 -158947
10094 -196646 -246867 -27222 36877 44683 -190686 -107411 236762 -32366 121977 103725 -76957
10082 -42918 -224831 127662 113828 -407971 -28288 -215572 140996 -449034 23739 44356
10072 44356 285866 -202457 63824 -105524 -437184 -253041 -370327 -154875 162259 331442
10062 331442 -155586 5761 -256248 -229181 -30732 -26284 242962 10033 -29410 -62565 -184552
10051a84552c0130l45463a39183D3341c04j58172f4883j41344j62161a10908R788
10040a01120A57129o1311J52271F3935b15961B8394M9593a12274G5980J04172
10030A80152a19451a1325A60927m2339b77152a20277j36726a1529k81414E4066
10019A6866a70154K4941M6007j40352M8737j6581l21715A22440a49400a0028k9342
10008c9370l6252B1663e55212A61088b652l86486A08470a39034j93527J50922
9998a81639g3042k2052J8611A83798a7973l15518G7973b33419C90501i95B21282
9986g2170a2592A28489b78448p9054c022j64939N8186j83105i7254j05622Q9619
9975a13257L9028P765B25168d62293J42700a36723l48619K35591j5787E6145d2147
$$ plain form
10051 -184552 -30130 -375593 -139183 43341 -304 -158476 -64883 -206227 -368388 -110908 -101120
10040 -101120 157129 95818 248089 63935 -215961 28394 77987 -112274 75980 180152
10030 180152 -119451 -11325 160927 118588 -277152 -120277 -257003 -11529 -292943 54066
10019 16866 -170154 -145213 -99206 -239558 -190821 -207402 -529117 122440 -149400 -10028 -39370
10008 -39370 -75622 21663 -555212 161088 -2652 -389138 108470 -139034 -332561 -181639
9998 -181639 -73042 -95094 -76483 183798 -17973 -333491 77973 -233419 390501 -995 221282
9986 -72170 -12592 128489 -278448 -357502 -3022 -167961 -109775 -292880 -97254 -202876 -113257
9975 -113257 -74229 -66464 225168 -462293 -319593 -136723 -485342 -249751 -265538 56145 -42147
9963a24409k10234J30748c3996q6460l4160A4853c44634d9411j11298G2354a53535
9951c41664I564e5739j55428A00841e6103k60494Q8772b5436m68837a26403j7533
9940a43936j82052B5501b09434g012A33453e3336j33003O3031A811a03890B27906
9928a95611j7030a05234c2408n6151j2409o15m6666a7035j38830A46266H558J05330
9916A13888P6679a48002d2189l3206l02906F2398j7705b3442H8542a66399A64593
9904b61700J09576F4328a30862k5794D15715D1905b0072B23321b0834l08867i9582
9892a2319j98130M8220j68113B25631d4232j02179B1855h4918l2483D0650a25409
9880A00249B978a23457j5489q1916j1285m9329B5728J97435f9380A7206c47347
$$ plain form
9963 -124409 -334643 -203895 -33996 -120456 -154616 14853 -344634 -49411 -160709 72354 -153535
9951 -341664 9564 -55739 -211167 100841 -56103 -316597 -227825 -25436 -494273 -126403 -143936
9940 -143936 -325988 25501 -209434 -7012 133453 -53336 -186339 -123308 1811 -103890 227906
9928 -195611 -212641 -105234 -32408 -88559 -100968 -101583 -148249 -17035 -155865 146266 8558 113888
9916 113888 190567 -148002 -42189 -75395 -378301 62398 44693 -23442 88542 -166399 164593
9904 -261700 -152124 64328 -130862 -156656 415715 41905 -20072 223321 -20834 -329701 -99582
9892 -12319 -210449 -162229 -330342 225631 -44232 -146411 21855 -84918 -117401 40650 -125409
9880 100249 2978 -123457 -138946 -220862 -232147 -281476 25728 223163 -69380 17206 -347347
9868a96572k640C3598b83279C3225P6274B7589c15249I3090e4170P981k38305
9857b84494f8832a6098B45737j13387J9453d0396j56302C54108e2262G3546e7366
9845A37196a04419k25901J49354l8840j23494B27064h8905j02040i2838j87079
9835b79917A06378c60678F1599i0714k97216J51958M944G3319a37340l16850A0812
9823E8990J84864a22686j40791e8579B68779b56409D33959F2086c07574B12080
9812G2701b60039B20075L15616C9893c53146A3199L66106p2463a31572G2818a45812
9800a73887f8083l39225A83804G9006J56152D83i7881J9202A06980b74827h9279
9788a57521e7515a7440m0365a3338q1001D21107a81984M1934D08d2125a3623m3079
$$ plain form
9868 -196572 -199212 33598 -283279 33225 109499 27589 -315249 93090 -54170 -46189 -284494
9857 -284494 -68832 -16098 245737 132350 151803 -40396 -196698 354108 -52262 73546 -57366
9845 137196 -104419 -330320 -180966 -219806 -343300 227064 -88905 -190945 -92838 -279917
9835 -279917 106378 -360678 61599 -90714 -387930 -235972 -231028 73319 -137340 -454190 10812
9823 58990 243854 -122686 -263477 -58579 268779 -256409 433959 62086 -307574 212080
9812 72701 -260039 220075 535691 39893 -353146 13199 379305 306842 -131572 72818 -145812
9800 -173887 -68083 -407308 183804 79006 235158 483 -97881 -78679 106980 -274827 -89279
9788 -157521 -57515 -17440 -57805 -13338 -94339 421107 -181984 -140050 408 -42125 -13623 -56702
9776e6702a1000D49793a87180N4711C23204D5061M4200f8387j33532j65454Q2398
9765b84975D640a33526k36869J07826j04315a28864j3185q4182h954k9106D2867
9753b7235G3949l2359a17260K7798j26952H1096d51572g3136l46917A5020d6022
9741A44870d60384J25154Q2628C1026Q958a9595j06967j28681J20125k84172a04721
9729a61803B8095a30308k47013J71729J6944l7280J6204A56655d9141j34483n0716
9718b34340f2419C9806c9585B49285B0819J21720d0873j48525d7258h532m11104
9707d19636J48494J17278C3606J35571c68570I7350l7094b10272K2412Q5392J1436
9696i1032E799b69149e125A29724b04912c4349j3538A46273D3700e174E4327a40086
$$ plain form
9776 -56702 -11000 449793 -187180 -132469 323204 45061 89261 -68387 -201919 -367373 -284975
9765 -284975 4640 -133526 -370395 -262569 -366884 -128864 -142049 -226231 -8954 -38060 42867
9753 -27235 73949 41590 -117260 -89462 -216414 81096 -451572 -73136 -420053 15020 -46022
9741 144870 -460384 -335230 -252602 31026 39984 -19595 -126562 -255243 -135118 -419290 -104721
9729 -161803 28095 -130308 -377321 -205592 -188648 -225928 -209724 156655 -49141 -183624 -234340
9718 -234340 -62419 39806 -39585 249285 20819 142539 -40873 -189398 -47258 -8532 -419636
9707 -419636 -271142 -153864 33606 169177 -368570 97350 60256 -210272 -187860 -102468 -91032
9696 -91032 5799 -269149 -5125 129724 -204912 -34349 -47887 146273 43700 -5174 54327 -140086
9683I6410g5979j53601a849B998a60551P752O3235A79460q3638d11924F7696b57733
9670D6950J8398f9118A09785B9128a77915Q1700E5561K0656a69612a3105p9827
9659i2932q5985m0339g075I5391a10565C0338P2954c51895J53303q2791c4773
9647E9831c46030k2234j17259K34238K1662O02A93975I1217a66562a9669j10727
9636a30396N0207I4220a67779l9059A01253c6665j04567N1575B55464A22714i9648
9624F1271a53110B53955I9859J31979B2779b38716a03056A42252n6547b35334
9613d402G9998a45319k9887n9467a2179q7694q6186b7819n4244j21782M0667A37316
9600d02277J94005e1664A38676a96866A02208g0585E5144b15517l4133B95962
$$ plain form
9683 96410 -75979 -229580 -1849 2998 -160551 -152799 -89564 179460 95822 -411924 67696 -257733
9670 46950 65348 -69118 109785 29128 -177915 -96215 55561 76217 -169612 -13105 -92932
9659 -92932 -178917 -219256 -7075 95391 -110565 30338 103292 -351895 -198592 -281383 -34773
9647 59831 -346030 -368264 -485523 -251285 -229623 -229021 193975 91217 -166562 -19669 -130396
9636 -130396 -80189 94220 -167779 -206838 101253 -36665 -141232 -89657 255464 122714 -99648
9624 61271 -153110 253955 99859 231838 22779 -238716 -103056 142252 85705 -235334
9613 -4402 79998 -145319 -175206 -234673 -12179 -99873 -186059 -27819 -82063 -203845 -163178 137316
9600 -402277 -208272 -51664 138676 -196866 102208 -70585 55144 -215517 -249650 295962
9589b47379a10727o3482D1323K7005a17433N4150a4158r435k35247O3616A24169
9577i1267I0082c965j36399A12544d8937m3981r0563L1086j45632B2262a20086
9565b418H9252O84N3510a02433a2309k6115l6397n8042k15752J27703j10183A13030
9552C3859a6590F5320a40229K2035j17597R8004A04619J7321h4884b9176j04611
9541a33787O1803l52186e5928O403j49668r3321j3182g1482K3804k00822a7942
9529a63712e7525j46458A70109a54555q716c9692j44404B71300C3267J62649b38622
9517a84946D0166g0703n7296k73696J38609A73325b47528H5696J15033b10990
9506A37255b04759O5346D2807b11887A08382D8430J63429c50051c0949l27243
$$ plain form
9589 -247379 -110727 -174209 41323 68328 -117433 -63283 -14158 -23593 -258840 -195224 124169
9577 -91267 90082 -3965 -140364 112544 -48937 -92918 -183481 -152395 -298027 22262 -120086
9565 -2418 89252 89936 143446 -102433 -12309 -38424 -74821 -132863 -348615 -220912 -331095 113030
9552 33859 -16590 65320 -140229 -118194 -235791 -137787 104619 121940 -84884 -29176 -133787
9541 -133787 -71984 -424170 -55928 -49525 -199193 -292514 -305696 -71482 -47678 -248500 -17942
9529 -163712 -57525 -203983 170109 -154555 -163271 -39692 -184096 271300 33267 195916 -238622
9517 -184946 40166 -70703 -127999 -401695 -263086 173325 -247528 85696 200729 -210990
9506 137255 -204759 -139413 42807 -211887 108382 48430 211859 -350051 -30949 -358192
9496c58192q7201C9495a8678j10228r1132h4150e450j75269a5702m6340b9886
9484F7894b32689b5855j85411M0265A39920G067d9294k66749J38220c2479k21395
9473b53874e3629j49078c5019A31645b03240A53381D1345K062A5542d5472a7036
9461c4823C4413D799J80204N2950d72152G6579c22894a14185j2217A56676D7442
9449d40363g3721B04454E6377a5535A8599b46666a05854j93212A6310b00363r4775
9438b95138a39902N5141A14471D5993J67005q2959b87747r937a20992L4155h21
9426E2369J05810d5160l1817k83835b1481E4818c6227a7328k76756R8721B4570
9414B71803b24708g6051H3298h0850l22781J82221A07921a94519o7945E1594K998
$$ plain form
9496 -358192 -445393 39495 -18678 -128906 -220038 -84150 -5450 -180719 -15702 -62042 -29886
9484 67894 -232689 -25855 -211266 -171001 139920 7067 -49294 -316043 -177823 -32479 -253874
9473 -253874 -53629 -202707 -35019 131645 -203240 153381 41345 43407 15542 -45472 -17036
9461 -34823 34413 4799 185003 237953 -472152 76579 -322894 -114185 -126402 156676 47442
9449 -440363 -73721 204454 56377 -15535 18599 -246666 -105854 -299066 16310 -200363 -295138
9438 -295138 -139902 -84761 114471 45993 212998 130039 -287747 -297684 -120992 -86837 -821
9426 52369 158179 -45160 -76977 -360812 -21481 54818 -36227 -17328 -294084 -195363 24570
9414 271803 -224708 -76051 83298 -80850 -403631 -221410 107921 -194519 -262464 51594 54592
9403E4592g4984F823b01413R0335g600j99066a03155j14594J03247c689o5718
9392f9407n5951D2957a15615j05516j7805k22001i4668o5032B2964e9573J3089
9381d6484H4285b2827k48179M7783c5814j0561A84716d7998C30490a83504f9553
9369I8406B2408c549G062R5612K4506b49494R5807B2184F642a81026C85217b3244
9356c54842G3771c12032A0354b875l04143F9901b04945C70689e3517k6752k91776
9345c72045A60926b2870A62270G6764J1408d30307J56749a22805e0241k598C0562
9333G5051b11448R3830L3676k29579E18678a59487G4532a62852C47968j66332
9323A81636a8541j83487A71790b30667R3376k68017b270k59683N1429A15263D0751
$$ plain form
9403 54592 -74984 6823 -201413 -111078 -7600 -206666 -103155 -217749 -114502 -3689 -69407
9392 -69407 -125358 42957 -115615 -221131 -238936 -460937 -94668 -159700 22964 -59573 -46484
9381 -46484 84285 -22827 -271006 -223223 -35814 -46375 184716 -47998 330490 -183504 -69553
9369 98406 22408 -3549 7062 102674 127180 -249494 -153687 22184 6642 -181026 385217 -23244
9356 -354842 73771 -312032 10354 -2875 -307018 69901 -204945 370689 -53517 -80269 -372045
9345 -372045 160926 -22870 162270 76764 88172 -430307 -273558 -122805 -50241 -52839 30562
9333 75051 -211448 -117618 -83942 -313521 518678 -159487 74532 -162852 347968 181636
9323 181636 -18541 -202028 171790 -230667 -137291 -405308 -2270 -261953 -210524 115263 40751
9311D27907a00023E33c51472J16470a0117k033k81321E0600f6393k3195A17382
9299a5840k29255E5971a39366J1825A88194c43392J22704E5056M6358b23006H2599
9287g4425k93170b4523A10343b68166F5144a63470B35532b32950Q5041j56619
9277c04528d1793A98167i3515a6050j11235a5297A45226g7951k39864N3334h4048
9265A6107Q8078a41265j62216J44263n9384E3541a15713l90956b5604B15914Q718
9254B24632a08448C3388a45632J1060J7119K812B09182b52245J02245p5544e0411
9242B61523b52155a6120n2319a1889l6891k54844P5620b9181F7705k999b32830
9230B79077I9411A4262b3577H5198a52411f3392K7692B5239c68653e8273j13075
$$ plain form
9311 427907 -100023 533 -351472 -235002 -10117 -12150 -293471 50600 -66393 -89588 117382
9299 -15840 -245095 55971 -139366 -127541 188194 -343392 -220688 55056 101414 -223006 82599
9287 -74425 -367595 -24523 110343 -268166 65144 -163470 235532 -232950 -147909 -304528
9277 -304528 -41793 198167 -93515 -16050 -127285 -15297 145226 -77951 -317815 -264481 -84048
9265 16107 104185 -141265 -303481 -159218 -218602 53541 -115713 -506669 -25604 215914 224632
9254 224632 -108448 33388 -145632 -134572 -117453 -114641 209182 -252245 -150000 -225544 -50411
9242 261523 -252155 -16120 -68439 -11889 -48780 -303624 -228004 -29181 67705 64706 -232830
9230 279077 99411 14262 -23577 85198 -152411 -63392 -35700 25239 -368653 -58273 -171348
9219a71348p0014B15610b15077j93882a28947K9173p9444N64n2590C21247j06750
9208B14497D2436c9507m7753k37315A2696b07534k7605e5158B38421E0236c47826
9196b94525i1997C1000g0064n81978I8111d06248J20866J04284h2899C984a83330
9184D13707F4158c98077C7356J36296f04679b9362j1210k61383e5115B82560A06850
9172E6765A7743N7692c55105B2918O1869l3294L230a54439o518o3495f2351b0543
9159b46332O8612A5241a07684m6511A88054f2876m2656c4042A77182b06472a03154
9147d1449P725r2084A6930b68759a0873k04200e1616B84241f2404H7724a77132
9135B2437a57982P1888j74852a00662j66894g8625D0091R1094c2716k35592f3232
$$ plain form
9219 -171348 -241362 215610 -215077 -408959 -128947 -99774 -179218 -178654 -231244 321247 214497
9208 214497 42436 -39507 -87260 -324575 12696 -207534 -235139 -55158 238421 50236 -347826
9196 -294525 -91997 31000 -70064 -652042 98111 -406248 -285382 -181098 -82899 3984 -183330
9184 413707 64158 -398077 37356 173652 -604679 -29362 -40572 -301955 -55115 282560 106850
9172 56765 17743 75435 -355105 22918 84787 51493 54723 -154439 -160957 -224452 -62351 -20543
9159 -246332 -177720 15241 -107684 -154195 188054 -62876 -105532 -34042 177182 -206472 -103154
9147 -41449 -33724 -125808 16930 -268759 -10873 -215073 -51616 284241 -62404 87724 -177132
9135 22437 -157982 -86094 -260946 -100662 -267556 -78625 40091 131185 -32716 -268308 -63232
9123c53841B8867f4304m2418a216A46481l6089a12565j93222J23615G8886a26302
9111e18371b45617F4455c0466r0616A22464c548n32A0643J34466c47829C4422
9099I485a20417G4162K6543J48557a81190Q8062b6891A87523a35112L3324k8095
9088a29883B03500a06348n0590E9265A542a43184c4000l52686J59557c0408B46593
9076c05799b2946k30518h3865l6069k01811D1851a67279k45382b4022o40q8349
9065a13011A67467G0411Q3965a24337A57486E7170j5444a1812I5619c89929h066
9053a60024n2893a00232h019o50104a84411J6992g3037C32525b71941Q7191K8763
9042a55987j87705a1849l5927j10076N1492G1906a13752B1019L17577a08124L2334
$$ plain form
9123 -353841 28867 -64304 -106722 -1216 146481 110392 -112565 -305787 -182172 78886 -126302
9111 -518371 -245617 64455 -30466 -121082 122464 -3548 -4080 10643 145109 -347829 34422
9099 9485 -120417 74162 100705 249262 -181190 -93128 -26891 187523 -135112 -101788 -129883
9088 -129883 203500 -106348 -156938 59265 1542 -143184 -34000 -386686 -227129 -30408 246593
9076 -305799 -22946 -253464 -83865 -119934 -321745 41851 -167279 -412661 -24022 -24662 -113011
9065 -113011 167467 70411 154376 -124337 157486 57170 41726 -11812 95619 -389929 -8066
9053 -160024 -212917 -100232 -8019 -658123 -184411 -167419 -73037 332525 -271941 -184750 -155987
9042 -155987 -343692 -11849 -47776 -157852 -106360 71906 -113752 21019 338596 -108124 -75790
9031g5790b3897k70957A2620J51406i1680j65955R0516B62628e5209B06087e3071
9019i0342A7616e3487k46170g3886l69181J96530A52441i9560A0226h8712j13031
9008b01743R8166e0665A99227g5559f894G7730K3987c1229k31433L6281A13849
8996f3527D6315a54330n8637A9181a45084A43691E0601j2505L36472b10754j73654
8985c84408b8586D71563c64555C6533a95899c7750j40333e6488A3398N3160L6075
8974A02633c08754J33199M6612H08a25270J7287m7898a3351M872k80992a44261
8962a73382j187E354a44251I1774C9883K4732a35039k95126H6308d1251i890B67988
8949b2551H0797e1397M524D7861c4573a1296o1652C5954j2442d27695H6911b54994
$$ plain form
9031 -75790 -23897 -294854 12620 164026 -91680 -257635 -167119 262628 -55209 206087 -53071
9019 -90342 17616 -53487 -299657 -73886 -443067 -246537 152441 -99560 10226 -88712 -201743
9008 -201743 -103577 -50665 199227 -75559 -6894 77730 101717 -31229 -262662 -226381 113849
8996 -63527 46315 -154330 -212967 19181 -145084 143691 50601 38096 374568 -210754 -384408
8985 -384408 -28586 471563 -364555 36533 -195899 -37750 -178083 -56488 13398 66558 102633
8974 102633 -308754 -175555 -128943 808 -125270 -107983 -155881 -13351 -8479 -289471 -144261
8962 -173382 -174569 5354 -144251 91774 39883 64615 -135039 -430165 86308 -41251 -9890 267988
8949 -22551 80797 -51397 -46873 47861 -34573 -11296 -72948 35954 23512 -427695 86911 -254994
8936B46615g5484D4027d19531A38060m0915b49291J7500h0014C596g9784a1661
8924A29969O720f9422H02298J493221r36810D90068A63352d6808C69658i2355
8913f0324C29545a84371G0719A3857b66649C1431J68950a75402H1107J57700c03005
8901a65407f5107A2139e7619H0404a74645M1911e6346n0270C6881n555f32748
8889d1321B28377a4830E2032b17782c4791d155A96248D114M3229a62586k33130
8878c95716A55226h4224c0704p4300b3473j81464p8859g9912L7432j45309o3645
$$ plain form
8936 246615 -75484 44027 -419531 138060 97145 -249291 -231791 -80014 3596 -79784 -11661
8924 129969 136689 -69422 802298 2295519 1358709 490068 163352 -46808 369658 -92355
8913 -60324 329545 -184371 70719 13857 -266649 31431 200381 -175402 81107 238807 -303005
8901 -165407 -65107 12139 -57619 80404 -174645 -132734 -56346 -106616 36881 31326 -632748
8889 -41321 228377 -14830 52032 -217782 -34791 -4155 196248 4114 47343 -162586 -395716
8878 -395716 155226 -84224 -30704 -105004 -23473 -204937 -283796 -79912 -42480 -187789 -251434
$$ [...]
##END NTUPLES=NMR SPECTRUM
##END=
