
##TITLE=AC1401_BRAH12210_7653281_WSfRedx4O0
##JCAMPDX= 6.0         $$ Bruker NMR JCAMP-DX V2.0
##DATA TYPE= NMR SPECTRUM
##DATA CLASS= NTUPLES
##ORIGIN= BRUKER
##OWNER= Administrator
$$ 1.72 TOPSPIN		Version 2.1
$$ 2013-03-19 20:15:27.666 -0500  Administrator@X
$$ Compression mode = diff/dup
##.OBSERVE FREQUENCY= 400.02188249412
##.OBSERVE NUCLEUS= ^1H
##.ACQUISITION MODE= SIMULTANEOUS (DQD)
##.ACQUISITION SCHEME= undefined
##.AVERAGES= 8
##.DIGITISER RES= 22
##SPECTROMETER/DATA SYSTEM= spect
##.PULSE SEQUENCE= zg30
##.SOLVENT NAME= COFFEE_meoh
##.SHIFT REFERENCE= INTERNAL, COFFEE_meoh, 1, 14.98509
##AUDIT TRAIL= $$ (NUMBER, WHEN, WHO, WHERE, PROCESS, VERSION, WHAT)
$$ ##TITLE= Audit trail, TOPSPIN		Version 2.1
$$ ##JCAMPDX= 5.01
$$ ##ORIGIN= Bruker BioSpin GmbH
$$ ##OWNER= Administrator
$$ $$ E:\/data/COFFEE/nmr/AC1401_BRAH12210_7653281_WSfRedx4O0/10/pdata/1/auditp.txt
$$ ##AUDIT TRAIL=  $$ (NUMBER, WHEN, WHO, WHERE, PROCESS, VERSION, WHAT)
(   1,<2013-03-19 20:15:19.385 -0500>,<Administrator>,<X>,<go>,<TOPSPIN 2.1>,
      <created by zg
	started at 2013-03-19 20:14:13.693 -0500,
	POWCHK enabled, PULCHK disabled,
       configuration hash MD5:
       86 BA 57 50 F2 9D 5C 9B 26 00 A9 28 5F 66 2E 89
       data hash MD5: 64K
       3B B0 87 37 FB 73 BA 9D 66 1C 48 B9 D0 4C D0 B4>)
(   2,<2013-03-19 20:15:22.479 -0500>,<Administrator>,<X>,<proc1d>,<TOPSPIN 2.1>,
      <Start of raw data processing
       efp LB = 0 FT_mod = 6 PKNL = 1 PHC0 = 0 PHC1 = 0 SI = 32K 
       data hash MD5: 32K
       7F B5 65 CB 3F 17 CE DC C7 F3 3A FD C4 66 5C 46>)
(   3,<2013-03-19 20:15:22.932 -0500>,<Administrator>,<X>,<proc1d>,<TOPSPIN 2.1>,
      <pk PHC0 = 102.5134 PHC1 = 0 
       data hash MD5: 32K
       47 A0 DF 7D 0A 69 87 2D BE 7C 58 4C 22 D3 DF 58>)
(   4,<2013-03-19 20:15:23.197 -0500>,<Administrator>,<X>,<proc1d>,<TOPSPIN 2.1>,
      <abs ABSG = 1 
       data hash MD5: 32K
       F8 43 32 B0 18 7C ED BD 8D 7D C8 00 58 AF 71 FE>)
(   5,<2013-03-19 20:15:23.338 -0500>,<Administrator>,<X>,<proc1d>,<TOPSPIN 2.1>,
      <abs ABSG = 2 
       data hash MD5: 32K
       13 B7 76 F5 1A 1F A3 DC 9E D2 89 78 45 B7 DB BD>)
(   6,<2013-03-19 20:15:23.479 -0500>,<Administrator>,<X>,<proc1d>,<TOPSPIN 2.1>,
      <abs ABSG = 3 
       data hash MD5: 32K
       35 1C 9A 9C 61 B7 C8 AF D6 FE EC 27 58 E9 52 CE>)
(   7,<2013-03-19 20:15:23.635 -0500>,<Administrator>,<X>,<proc1d>,<TOPSPIN 2.1>,
      <abs ABSG = 4 
       data hash MD5: 32K
       62 B8 53 EF C8 3A 87 CF 66 78 6A 20 E0 69 5A 51>)
(   8,<2013-03-19 20:15:23.775 -0500>,<Administrator>,<X>,<proc1d>,<TOPSPIN 2.1>,
      <abs ABSG = 5 
       data hash MD5: 32K
       77 D4 C8 F3 FD 7C 82 D3 E4 09 21 0C CF 1E 26 8B>)
$$ ##END=
$$ 
$$ $$ hash MD5
$$ $$ 50 C2 FE EB D4 4D 66 0A 83 6C 0C F1 3E 1D 19 BC
##$RELAX= 
##$RELAX= 
##$RELAX= 
##$RELAX= 
##$RELAX= 
##$RELAX= 
##$RELAX= 
$$ Bruker specific parameters
$$ --------------------------
##$DU= <E:\>
##$EXPNO= 10
##$NAME= <AC1401_BRAH12210_7653281_WSfRedx4O0>
$$ [...]
150 150 150 150 150 150 150 150
##$TP07= 0
##$TPNAME0= <>
##$TPNAME1= <>
##$TPNAME2= <>
##$TPNAME3= <>
##$TPNAME4= <>
##$TPNAME5= <>
##$TPNAME6= <>
##$TPNAME7= <>
##$TPOAL= (0..7)
0.5 0.5 0.5 0.5 0.5 0.5 0.5 0.5
##$TPOFFS= (0..7)
0 0 0 0 0 0 0 0
##$TUNHIN= 0
##$TUNHOUT= 0
##$TUNXOUT= 0
##$USERA1= <user>
##$USERA2= <user>
##$USERA3= <user>
##$USERA4= <user>
##$USERA5= <user>
##$V9= 5
##$VALIST= <valist>
##$VCLIST= <CCCCCCCCCCCCCCC>
##$VD= 0
##$VDLIST= <DDDDDDDDDDDDDDD>
##$VPLIST= <PPPPPPPPPPPPPPP>
##$VTLIST= <TTTTTTTTTTTTTTT>
##$WBST= 2048
##$WBSW= 25
##$XGAIN= (0..3)
0 0 0 0
##$XL= 0
##$YL= 0
##$YMAX_a= 609130
##$YMIN_a= -521820
##$ZGOPTNS= <>
##$ZL1= 120
##$ZL2= 120
##$ZL3= 120
##$ZL4= 120
##$ABSF1= 14.98509
##$ABSF2= -5.573092
##$ABSG= 5
##$ABSL= 3
##$ALPHA= 0
##$AQORDER= 0
##$ASSFAC= 0
##$ASSFACI= 0
##$ASSFACX= 0
##$ASSWID= 0
##$AUNMP= <proc_prof1d_extract_pilot.lims>
##$AXLEFT= 0
##$AXNAME= <>
##$AXNUC= <1H>
##$AXRIGHT= 0
##$AXTYPE= 0
##$AXUNIT= <>
##$AZFE= 0.1
##$AZFW= 0.1
##$BCFW= 0
##$BC_mod= 0
##$BYTORDP= 0
##$COROFFS= 0
##$CY= 15
##$DATMOD= 1
##$DC= 0
##$DFILT= <>
##$DTYPP= 0
##$F1P= 0
##$F2P= 0
##$FCOR= 0.5
##$FTSIZE= 32768
##$FT_mod= 6
##$GAMMA= 0
##$GB= 0
##$INTBC= 1
##$INTSCL= 1
##$ISEN= 128
##$LB= 0
##$LEV0= 0
##$LPBIN= 0
##$MAXI= 10000
##$MC2= 0
##$MEAN= 0
##$ME_mod= 0
##$MI= 0
##$NCOEF= 0
##$NC_proc= -8
##$NLEV= 6
##$NOISF1= 0
##$NOISF2= 0
##$NSP= 0
##$NTH_PI= 0
##$NZP= 0
##$OFFSET= 14.98509
##$PC= 1
##$PHC0= 102.5134
##$PHC1= 0
##$PH_mod= 1
##$PKNL= yes
##$PPARMOD= 0
##$PPDIAG= 0
##$PPIPTYP= 0
##$PPMPNUM= 2147483647
##$PPRESOL= 1
##$PSCAL= 4
##$PSIGN= 0
##$PYNMP= <proc.py>
##$REVERSE= no
##$SF= 400.02
##$SI= 32768
##$SIGF1= 0
##$SIGF2= 0
##$SINO= 400
##$SIOLD= 32768
##$SPECTYP= <>
##$SREGLST= <1H.CDCl3>
##$SSB= 0
##$STSI= 32768
##$STSR= 0
##$SW_p= 8223.68421052631
##$SYMM= 0
##$S_DEV= 0
##$TDeff= 65536
##$TDoff= 0
##$TI= <>
##$TILT= no
##$TM1= 0
##$TM2= 0
##$TOPLEV= 0
##$USERP1= <user>
##$USERP2= <user>
##$USERP3= <user>
##$USERP4= <user>
##$USERP5= <user>
##$WDW= 1
##$XDIM= 32768
##$YMAX_p= 464002286
##$YMIN_p= -741247
##$CURPLOT= <Network HP LaserJet P1505>
##$CURPRIN= <$Network HP LaserJet P1505>
##$DFORMAT= <normdp>
##$LAYOUT= <+/1D_H.xwp>
##$LFORMAT= <normlp>
##$PFORMAT= <normpl>
##$SURQMSG= 1
$$ End of Bruker specific parameters
$$ ---------------------------------
##NTUPLES= NMR SPECTRUM
##VAR_NAME=  FREQUENCY,     SPECTRUM/REAL,   SPECTRUM/IMAG
##SYMBOL=    X,             R,               I
##VAR_TYPE=  INDEPENDENT,   DEPENDENT,       DEPENDENT
##VAR_FORM=  AFFN,          ASDF,            ASDF
##VAR_DIM=   32768,         32768,           32768
##UNITS=     HZ,            ARBITRARY UNITS, ARBITRARY UNITS
##FACTOR=    0.250966925370066, 1,           1
##FIRST=     8223.43324360094, -49986,       -244927
##LAST=      0,             -52277,          -45815
##MIN=       0,             -741247,         0
##MAX=       8223.43324360094, 464002286,    0
$$ Real data points
##PAGE= N=1
##DATA TABLE= (X++(R..R)), XYDATA
$$ [...]
19564h2062k71222h4188a0481k83773i4325P623k12525d6021l2496B33129A7446
19552A02135a46845O933A1568i0564K7349A56542O2841a20956b004B14954L9022
19541B53976d6465j61887J7291K1593Q4291j14945M3278A59473a54065L9751l40372
19530d54686a47469L8231I9545b18082R9003e7582j65949N8484k74338a19587
19519c27336H6038f7388k63819E9480j2644P9055l1342H856f2864l2791L7933
19508e7722H8294a9011A23043a42102j51997i9438C20151c55720a31561A27622
19497E0263b41477c1996j24568j21600k14738K24138D48791E6448f3835D2537
19486b56843A15972a99979i578k32084A83881a19963L2384A45311p1763J45767
$$ plain form
19564 -82062 -353284 -84188 -10481 -294254 -94325 -86702 -299227 -46021 -78517 233129 17446
19552 102135 -146845 -139912 11568 -90564 -63215 156542 219383 -120956 -2004 214954 253976
19541 253976 -46465 -208352 -191061 -169468 -85177 -200122 -156844 159473 -154065 -114314 -454686
19530 -454686 -147469 -109238 99545 -218082 -119079 -57582 -223531 -165047 -439385 -119587
19519 -327336 86038 -67388 -331207 59480 46836 125891 94549 8856 -62864 -95655 -57722
19508 -57722 88294 -19011 123043 -142102 -294099 -99438 320151 -355720 -131561 127622
19497 50263 -241477 -31996 -156564 -278164 -492902 -268764 448791 56448 -63835 42537
19486 -256843 115972 -199979 -9578 -241662 183881 -119963 -87579 145311 73548 219315
19476B19315a28035A657b6344l1905j51439n5990J0777F96J24584b16593b7046
19464b245C49860c9764n7470m89099i7673D13215b2222j19576D5304c6471q379
19453d4850j63130Q9552j44715f8926j3600j6388j14005A16639m0341k2641c65094
19441d22011A09580b5275A57852a21720A17530m6256a3889C4797b3714k8172C9841
19429a46232B16323a58226j13569a0006p0271l8503C3509B077c5362p5230c8870
19417a80347j39806Q4471A19269p073h7631n875L3778C16836G4648K19657I7689
19405d8378A22273d1506A51660a9231l0637A3093f370j20083H245a92621K3468
19394a69153A01436a06940D97b6699A38067a73477j25825L3595f0969r8663e5790
$$ plain form
19476 219315 -128035 1657 -26344 -58249 -209688 -265678 -254901 696 125280 -216593 -27046
19464 -2245 349860 -39764 -97234 -586333 -97673 413215 -22222 -141798 45304 -36471 -44850
19453 -44850 -207980 -118428 -263143 -68926 -82526 -98914 -212919 116639 76298 53657 -365094
19441 -422011 109580 -25275 157852 -121720 117530 71274 -13889 34797 -23714 -51886 39841
19429 -146232 216323 -158226 -271795 -10006 -80277 -118780 33509 2077 -35362 -110592 -38870
19417 -180347 -320153 -235682 119269 112196 -87631 -93506 -59728 316836 74648 294305 97689
19405 -48378 122273 -41506 151660 -19231 -49868 13093 -6370 -126453 8245 -192621 -169153
19394 -169153 101436 -106940 497 -26699 138067 -173477 -299302 -265707 -60969 -159632 -55790
19382e6418j23844g2683G4447k1557A5333c69341a32118d1397p0571A05336e3172
19370A07587C5700K8804h031A21524c194C5241i9852A44188a54149k87511e9514
19358E9868K7429a23363j37112E6499b37591o1884B1388J30499b3081j07706L7857
19347i2930m2350I7302O3907b26583e5037C00567b06871E5632Q1104h2742J2216
19336g0526a5487k92409i6629k6150C01992A39053C306h884I3456D0029J8149
19325E8178a8272B1460b13687C89585F1157L4998g5230j51228C035a58946A0357
19313a20012l9345M6032M3851B31635F1218f5582o861E8743L9099a58361d1895
19301A11129J3042e9066C3193H974a64889G472c53351h8463q9853a0318C55753
$$ plain form
19382 -56418 -180262 -72683 74447 52890 15333 -369341 -132118 -41397 -111968 105336 -53172
19370 107587 35700 64504 -8031 121524 -3194 35241 -99852 144188 -154149 -441660 -59514
19358 59868 87297 -123363 -260475 56499 -237591 -299475 21388 151887 -23081 -130787 -92930
19347 -92930 -135280 97302 161209 -226583 -55037 300567 -206871 55632 136736 -82742 -70526
19336 -70526 -15487 -307896 -96629 -122779 301992 139053 3306 -8884 93456 40029 58178
19325 58178 -18272 21460 -213687 389585 61157 96155 -75230 -226458 3035 -158946 10357
19313 -120012 -159357 -113325 -69474 231635 61218 -65582 -72443 58743 97842 -158361 -41895
19301 111129 124171 -59066 33193 8974 -164889 7472 -353351 -88463 -178316 -10318 355753
19289c8432A7696d6796A86910b38454h0199B045i9286k7268G0852b30277J09947
19278a20330o9274E1581J20670c3207J536A64225b07657A23683c08311a7099j87717
19267b04816J0523P4695B47075a04063M251b8539o0937A24886C6075b43149P0228
19256a72921D6368g4941J2611j84861A12667M3716a63978M626A54635a67830j59335
19245c27165j14491f6892j0477k8461K1292B62022e7163j30020A18831B8362a20227
19233I4447R077D0863J159b79072A20156j7150K31194a43867A34206h5322M0080
19222d5242A03291J94791E8466b20376P3375J6033L1178J5937H4209b1086j32368
19211a53454j32146d9745m8194d4617k28242e9678c67o3178n8863B62608D8126
$$ plain form
19289 -38432 17696 -46796 186910 -238454 -80199 2045 -99286 -126554 70852 -230277 -120330
19278 -120330 -189604 51581 172251 -33207 -31671 164225 -207657 123683 -308311 -17099 -204816
19267 -204816 -194293 -119598 247075 -104063 -99812 -28539 -89476 124886 36075 -243149 -172921
19256 -172921 46368 -74941 -62330 -247191 112667 156383 -163978 -159352 154635 -167830 -327165
19245 -327165 -441656 -66892 -77369 -105830 -84538 262022 -57163 -187183 118831 28362 -120227
19233 94447 103524 40863 42022 -279072 120156 103006 334200 -143867 134206 -85322 -45242
19222 -45242 103291 298082 58466 -220376 -147001 -130968 -99790 -83853 84209 -21086 -153454
19211 -153454 -285600 -49745 -97939 -44617 -272859 -59678 -367 -63545 -122408 262608 48126
19199a15133M2306j96564K8661J10776A13858a28796j9246j18280C611c80422
19188h2228K6725k11517a14452n2374M9142A03362A7509i1521c8057k28467A66460
19176c30175I2139a47496C9306J50209c06391A1071d3092j55200B18616e99633
19165d6868J5635m3663b0032A79433d4235j93118E9940b41781a5703A54859b16344
19153b6768D347a31437B57458o7768b41589A87813r3419K50448b22955f6857A1124
19141A84232a84533N9448B83324J76639b0938l8599j15453L4168m4917A11268
19130A14407c9801l7080I1234J2996L8367J63119a57814A96528f8755j60610c1263
19118A46252d0420j64413i3084B7642g4570H0674d9968i036A4810K6376a29147
$$ plain form
19199 -115133 -72827 -269391 -240730 -129954 113858 -128796 -148042 -266322 3611 -380422
19188 -82228 -55503 -267020 -114452 -166826 -117684 103362 17509 -91521 -38057 -266524 166460
19176 -330175 92139 -147496 39306 189515 -306391 11071 -43092 -198292 218616 -599633
19165 -46868 -31233 -74896 -20032 179433 -44235 -237353 59940 -241781 -15703 154859 -216344
19153 -26768 4347 -131437 257458 189690 -241589 187813 94394 344842 -222955 -66857 11124
19141 184232 -184533 -125085 283324 459963 -20938 -59537 -174990 -140822 -185739 111268
19130 114407 -39801 -76881 91234 104230 142597 305716 -157814 196528 -68755 -229365 -31263
19118 146252 -40420 -204833 -93084 27642 -74570 80674 -49968 -9036 14810 41186 -129147
19106a2770G1897B8506a21850C23N5650a59856f1331j51267H9304d3519b257j41223
19094a43480d1294D008G86a46810A04721b06178K0793H4604b98635a22587A6659
19082B31248a81332L8496c1022K863j84911a05428p8732j99905a10650E1385d8902
19070a09328b2853A06207n799a9440o1039B49796h958A80583d0743r4006C15829
19058B49293b20551M7536I4584P1719a57197k6959j41960b539p1596j22344Q0163
19047a16316l42627J21439G4745J65876a15001k3732k09393b5991B29277J04457
19037C33734q3448b78771B23622i6188B6716c5737A89303F1552c0724B95387b4982
19025b20562i9448K8570E07507i8606b9742C7262a10151q56L2994F6299K26922
$$ plain form
19106 -12770 71897 28506 -121850 323 55973 -159856 -61331 -212598 89304 -43519 -2257 -143480
19094 -143480 -41294 4008 786 -146810 104721 -206178 -185385 84604 -298635 -122587 16659
19082 231248 -181332 -142836 -31022 -28159 -213070 -105428 -184160 -384065 -110650 51385 -48902
19070 -109328 -22853 106207 100408 -19440 -80479 249796 -8958 180583 -40743 -134749 315829
19058 249293 -220551 -173015 94584 166303 -157197 -184156 -326116 -2539 -74135 -196479 -116316
19047 -116316 -458943 -337504 74745 240621 -115001 -138733 -348126 -25991 229277 333734
19037 333734 250286 -278771 223622 -96188 26716 -35737 189303 61552 -30724 295387 -24982
19025 -220562 -99448 -70878 507507 -98606 -29742 37262 -110151 -111007 -78013 66299 293221
19014B93221j35851g3568H1108b13293l4102M3264K8065C9542a09718E924i455
19002b9333D86037A5426a26191O1945B57014n1019F8826a98226A66890a13094
18991a32703q3658j86816G0332i8465A88524b47356a2885A4317b76030B62638
18980b21174a9906k35501R7993j0579m6980J04789E4656a35612m9808B44147b1210
18968H9141a9225F674d0126H7872l9585b39478O2301b6196a158j78157P6549a2505
18955I2006J30245f8334b0639D4401f4289B96405E6308h5496b6352A5781a27866
18943d6643m7507A79790B9726c23763J35169G3343J2816J54823A5384M7048M868
18932F7300a88516i3665k58477A57375C2665f3210p2256A53305a45026M1055a1665
$$ plain form
19014 293221 157370 -73568 81108 -213293 -247395 -204131 -176066 39542 -109718 5924 -9455
19002 -29333 486037 15426 -126191 -64246 257014 205995 68826 -198226 166890 -113094
18991 -132703 -216361 -403177 70332 -98465 188524 -247356 -12885 14317 -276030 262638
18980 -221174 -19906 -255407 -157414 -167993 -214973 -110184 54656 -135612 -185420 244147 -21210
18968 89141 -19225 6674 -40126 87872 48287 -239478 -177177 -26196 -1158 -179315 -102766 -12505
18955 92006 222251 -68334 -20639 44401 -64289 296405 56308 -85496 -26352 15781 -127866
18943 -46643 -94150 179790 29726 -323763 -188594 73343 86159 240982 15384 62432 67300
18932 67300 -188516 -93665 -352142 157375 32665 -63210 -135466 153305 -145026 -103971 -11665
18920C0338h1665A78660a61695G1216c1153k3389J9721A09333D0430b49615A36441
18908a78617f7159A2614P0672b72634a31165j36466A59049c65179C4001b75463
18897D41366c84058E6605O0523b63323L7930q9659H2434e5318F0464g6670B88279
18885c36663J47934Q4536j35292a09959E071Q474b19167g3348a1990G228A368
18873b01799B25885j03066j141E0973a0873A65340a38846l6249e1361k19268A89074
18861A0545d3936j43814k34825g4073G2287k9133e9613j58754i8251j28587A47985
18849c45126d7657a7326I6691h232D29a28540G5022b58119E7083b51649l7612
18838b89261B96521A6276d15332c3405l6946j52674A0992b11656a01905M4734
$$ plain form
18920 30338 -81665 178660 -161695 71216 -31153 -54542 -34821 109333 40430 -249615 136441
18908 -178617 -67159 12614 83286 -272634 -131165 -267631 159049 -365179 34001 -275463
18897 441366 -384058 56605 117128 -263323 -225393 -315052 82434 -55318 60464 -76670 288279
18885 -336663 -188729 -104193 -239485 -109959 5071 13545 -219167 -73348 -11990 7228 1368
18873 -201799 225885 122819 121678 50973 -10873 165340 -138846 -175095 -51361 -270629 189074
18861 10545 -43936 -187750 -422575 -74073 72287 43154 -59613 -218367 -98251 -226838 147985
18849 -345126 -47657 -17326 96691 -8232 429 -128540 75022 -258119 57083 -251649 -289261
18838 -289261 296521 16276 -415332 -33405 -70351 -223025 10992 -211656 -101905 -57171
18828e7171K6404k77217c1373j781j41585j3787A98632J09075A24380l9255K54222
18817C39347j67560l0794f9838B8159K4477R8930J7323g7838B50309n3567G331
18805A22447b81777B51843a61199j58841J37973j88764a31663k62648c2393j62597
18795a94990h5971a8783k34870h6622k30600f663l18470a49077B9577F205b7299
18783G7888Q3456G2584j8637K007a51601A44203b22350B60723o1724C7667i8130
18771c0834l44B0244o894c60011c6020l01475d311l67494a6956n6164B43564a25236
18758A8611P55c8140Q265C2009J47723K1228c40146D6545b87156I528c21112a40689
18745e7074p0957C76912a95509b9122j88231C65908a18973N7297q4228B0686b84072
$$ plain form
18828 -57171 -30767 -307984 -31373 -33154 -174739 -188526 198632 307707 124380 85125 339347
18817 339347 171787 140993 -69838 28159 52636 151566 168889 -77838 250309 196742 7331
18805 122447 -281777 251843 -161199 -320040 -182067 -370831 -131663 -394311 -32393 -194990
18795 -194990 -85971 -18783 -253653 -86622 -317222 -6663 -325133 -149077 29577 6205 -27299
18783 77888 161344 72584 53947 55954 -151601 144203 -222350 260723 198999 37667 -98130
18771 -30834 -31178 20244 13350 -360011 -36020 -337495 -4311 -371805 -16956 -73120 243564 -125236
18758 18611 19366 -38140 -29875 32009 179732 200960 -340146 46545 -287156 9528 -321112 -140689
18745 -57074 -128031 376912 -195509 -29122 -217353 365908 -118973 -61676 -145904 20686 -284072
18733A15741G905K57120G1632c24950A9089J58707J7247l9843o8749b71439a04612
18721B36451j0780A9813a02868n0815k01903i3688l4603G3653b95151C0237b70816
18709b9042k3542A90494G8936M4027f7057j24610m919g2636r1695N2354b0865
18697G3767a90494A30712J17459d3426F2431N1372A0665b33876A79089b89805
18686B58940b1546k0158A06726b95256Q8593I640b59595a9268l0189o9861K574
18675a16744M8438D6750J6108J0615j9576a5900q1921D7064a5722p7588A2207
18663h5664F8167o466f1403k4896A43584R5511a3418A1685Q0476f85B73240b02131
18650a50564R778e5322j58630F984J67253F8314f3811j36151N7806j03456g1446
$$ plain form
18733 115741 7905 265025 71632 -324950 19089 177796 195043 155200 86451 -271439 -104612
18721 236451 225671 19813 -102868 -153683 -355586 -93688 -128291 73653 -295151 30237 -270816
18709 -29042 -52584 190494 78936 122963 -67057 -191667 -196586 -72636 -164331 -111977 -20865
18697 73767 -190494 130712 248171 -43426 62431 113803 10665 -233876 179089 -289805
18686 258940 -21546 -41704 106726 -295256 -206663 9640 -259595 -19268 -49457 -119318 -116744
18675 -116744 -68306 46750 62858 73473 53897 -15900 -97821 47064 -15722 -93310 12207
18663 -85664 68167 61701 -61403 -86299 143584 239095 -13418 11685 92161 -685 273240 -202131
18650 -150564 -140786 -55322 -213952 6984 174237 68314 -63811 -199962 -142156 -245612 -71446
18638c82049h2904j36758A70002h2252j15371Q5037A12440a34311b023A7160f5270
18626c15623B9589P6709b36644K1177j6783K3107h5216A32999d13803C5009E894
18614b21038l2204N7875j82898L2202c0084A37014i1661D371a92640A33987b43363
18602a35004o0560Q8017B38134D2378i0878A52954h5274j05312j17358R0378g7787
18590C0827g3232j97507g3105l9710j31023c0997m3519j5668G3177Q1755c3326
18578b08360e8373G5023a11089H8233j3806K287K64685n2575a28369j65129f219
18566a05598E2365a09565j20620M103e6717A81563P3179E3549a6564H614R9530
18555A08144c36921B73579n0332a39241L2275F8314h5024A17702i0134L7914B9068
$$ plain form
18638 -382049 -82904 -219662 170002 -82252 -197623 -112586 112440 -134311 -2023 17160 -65270
18626 -315623 29589 106298 -236644 -215467 -232250 -209143 -85216 132999 -413803 35009 5894
18614 -221038 -253242 -195367 -378265 -346063 -30084 137014 -91661 4371 -192640 133987 -243363
18602 -135004 -195564 -107547 238134 42378 -90878 152954 -85274 -190586 -307944 -217566 -77787
18590 30827 -73232 -270739 -73105 -112815 -243838 -30997 -74516 -90184 73177 154932 -33326
18578 -208360 -58373 75023 -111089 88233 74427 76714 341399 288824 -128369 -293498 -6219
18566 -105598 52365 -109565 -230185 -226082 -56717 181563 254742 53549 -16564 8614 108144
18555 108144 -336921 273579 223247 -139241 -106966 68314 -85024 117702 -90134 -52220 29068
18543a83659Q0230C5895f3999A36059b73148D2034b18843J05842n3734f4281A02399
18531f1360p4965I2560c65166P8418g4867N077j19459H3013b49613p5816c5485
18519A87279a53348C6855a10947c1431j19469E38J56434a09128A45407A7122i2468
18507H3207b50367a6192l4259a5684l0210n5865J9954j34201b786j65427d1535
18495e51031b34804B25938k1081g7886A73068h9776O835C5740b55004d2157l18112
18484c60269b3614A83242C8481g1045j23454J3811K3395f2082B346L59422F49
18472H357a28623r4847g8006c3286k2935C1017d8923k77147J42341D7146a63737
18460b46094F2276L73266c0088F2630a24014C0455K26239q6593n1599a00177D1293
$$ plain form
18543 -183659 -103429 35895 -63999 136059 -273148 42034 -218843 -113001 -166735 -64281 102399
18531 -61360 -136325 92560 -365166 -286748 -74867 -69790 -189249 83013 -249613 -325429 -35485
18519 187279 -153348 36855 -110947 -31431 -150900 538 156972 -109128 145407 17122 -92468
18507 83207 -250367 -16192 -50451 -15684 -45894 -101759 -81805 -216006 -2786 -168213 -41535
18495 -551031 -234804 225938 204857 -77886 173068 -89776 -82941 35740 -255004 -42157 -360269
18484 -360269 -23614 183242 38481 -71045 -194499 -180688 -157293 -62082 2346 361768 649
18472 8357 -128623 -223470 -78006 -33286 -56221 31017 -48923 -326070 -183729 47146 -163737
18460 -246094 62276 435542 -30088 62630 -124014 30455 256694 170101 118502 -100177 41293
18448a73910r3936P5851A16670d0310J4254j46271Q3530j10363E05126a45238
18437A50046N2454a31353d9249j58018B49807m1569a24528N0876n8307B37818
18426b41275g5468j7188B07591b64428h0138j45625h2302J8832q2747d014E9853
18414B44884c7064B64002B8908N8102N3327D8606a6000A16290b84217B02434o7782
18403A34652B8046j1199J67844b74140B25550b09332l5158A17762c25491e2607
18392a49087L7959j9658O2231j75850I8812a4012k32816a5442l4856k0769A0290
18380E6774J41569c53876A5616K26933a54387k2011I6785b25689i9536k687k2765
18369a24988b8229E1792a04731j44351a06432j20228A80146B3957d7319q5239
$$ plain form
18448 -173910 -267846 -191995 116670 -40310 -26056 -172327 -88797 -199160 505126 -145238
18437 150046 202500 -131353 -49249 -207267 249807 208238 -124528 -73652 -131959 237818
18426 -241275 -75468 -92656 207591 -264428 -80138 -225763 -82302 -63470 -146217 -4014 59853
18414 244884 -37064 264002 28908 87010 140337 48606 -16000 116290 -284217 202434 134652
18403 134652 28046 16847 184691 -274140 225550 -209332 -244490 117762 -325491 -52607
18392 -149087 -111128 -130786 -68555 -244405 98812 -14012 -246828 -15442 -50298 -71067 10290
18380 56774 198343 -353876 15616 242549 -154387 -176398 96785 -225689 -99536 -102223 -124988
18369 -124988 -28229 51792 -104731 -249082 -106432 -226660 180146 23957 -47319 -132558
18359a32558K4332C51891A12052D341i2897r7716N7214A60691c5324I396b0856
18347e1134l3232k0865K0769A00347a05895A25744l6913J39338b4713C1542q008
18336B3534b9319o3350M2326D8875P9421b26397R2375b0678j71178D0518J03495
18325A44013a61338j70873h1657A09791g0869E2086a42347F7602b0430q9201D7524
18313i5116j14655o749A51145D4888a79416d5035j29185h3112a4618o9167C7287
18301a94088N0937A33210a1778j49904c3550j4236A96247C3526a70029D6103M5377
18290I1480A8642c21410B73599a76581B21480b19507c3142A00120J04067a84321
18279c41352J47419N8860B98633b70083d1669C6519c04367a03451k856B7270b83885
$$ plain form
18359 -132558 -108226 351891 112052 4341 -92897 -190613 -133399 160691 -35324 9396 -20856
18347 -51134 -84366 -105231 -84462 100347 -105895 125744 88831 228169 -24713 31542 23534
18336 23534 -29319 -92669 -50343 48875 128296 -226397 -134022 -20678 -191856 40518 144013
18325 144013 -161338 -332211 -81657 109791 -70869 52086 -142347 67602 -20430 -109631 47524
18313 -95116 -209771 -216520 151145 44888 -179416 -45035 -174220 -83112 -14618 -83785 37287
18301 -194088 -143151 133210 -11778 -161682 -33550 -47786 196247 33526 -170029 46103 91480
18290 91480 18642 -321410 273599 -176581 221480 -219507 -33142 100120 204187 -184321
18279 -341352 -193933 -135073 298633 -270083 -41669 36519 -304367 -103451 -106307 27270 -283885
18267a76923f8542r288B58765e9180k56840B16448n1450b30517A662K56442I7649
18255a10935m3448r0717a3030E2473c33544Q9808C33415a17671e840A78254A6363
18243c76853e1205m3960l3867k25620Q0612H3140b1632l55482A0872b5745j80050
18232b05795f299o8915j16954A18254m3494J42708j06152a16049A50166k7974
18222A22192b87844B4859a98389A4036J7779a89077e0900j4653C77384g8326k02942
18211b81268C38354a18407d5349p349D1889a42477O38G9876c011j99835B43626
18199e2649A77735a5771l61271d8602H637a83833H470K34815b9466B80430a38867
18187b08733N0789B8463i6990C25219o602b19104j3113k8904d0646j55544R852
$$ plain form
18267 -176923 -68542 -77830 258765 -59180 -316020 216448 164998 -230517 1662 258104 97649
18255 -110935 -154383 -245100 -13030 52473 -333544 -243736 333415 -117671 -5840 178254 16363
18243 -376853 -51205 -95165 -129032 -354652 -274040 83140 -21632 -377114 10872 -25745 -205795
18232 -205795 -6299 -75214 -192168 118254 74760 217468 111316 -116049 150166 122192
18222 122192 -287844 24859 -198389 14036 31815 -189077 -50900 -65553 377384 -78326 -281268
18211 -281268 338354 -118407 -45349 -52698 41889 -142477 -141839 79876 -3011 -202846 243626
18199 -52649 177735 -15771 -377042 -48602 8637 -183833 8470 243285 -29466 280430 -138867
18187 -208733 -157944 28463 -96990 325219 318617 -219104 -232217 -261121 -40646 -196190 -186338
18176a86338j7145O0962A38259c3677j77904P8376q686f6927k864j27950N1537
18165a46204A31166a72385B06016a77725h4231E200K75553i605C41557b00781
18154g6159c5384C0281e733l55984E9712a98657q1477C6409J74837M9846a47745
18142B28880r8934E4385i543A89563P5931Q2312b42736B12935c3113m8065n1860
18131a33038n8884B67599c87759l711J93772P7292j38118J5441k0599O4587Q7596
18120a11499j4360k44476h9549j21612B3915K24452a66246d2685D85185k10340
18110B74845b95000C79134a68770N1779J023A07739b06661A47784n4892c73985
18099b77201J14234A78493a15704M181q2108A64125K06188f8465l3264A96584
$$ plain form
18176 -186338 -203483 -142521 138259 -33677 -211581 -133205 -141891 -66927 -69791 -197741 -146204
18165 -146204 131166 -172385 206016 -177725 -84231 5200 280753 -9605 341557 -200781
18154 -76159 -35384 30281 -5733 -361717 59712 -198657 -280134 36409 211246 261092 -147745
18142 228880 129946 54385 -9543 189563 265494 347806 -242736 212935 -33113 -81178 -133038
18131 -133038 -191922 267599 -387759 -391470 -197698 -120406 -258524 -243083 -263682 -199095 -111499
18120 -111499 -125859 -370335 -89549 -211161 23915 248367 -166246 -42685 485185 274845
18110 274845 -295000 379134 -168770 -116991 -115968 107739 -206661 147784 92892 -373985
18099 -277201 -162967 178493 -115704 -111523 -193631 164125 370313 -68465 -101729 196584
18088a10105f855j1122j18355H1711h4861B6776a35182A47464b13069Q0801j55861
18077b88129C01831I2018c4798I4316K69750H9559d4787F6615i6317L583d0125
18065a36562e2348l8279K5229r4497m4853M3776b9278E593g7247K3065C3540a58213
18052d3038A0708e4384j29955A43118i1089M4332j07183D4778b42597b109A53874
18040h2819C1201J5937a04192B31938e9769C91944a59494j2707a7128m6137l19094
18029c82359D1131L8775a3698j32544B28478i967o1303j24911k19700J79812G2152
18017b6334A48181J48663l7450a34593L7106C1674R751a66491o4959d4223B5992
18005D0638c6959p4462C3898M8973a63249N0899M0405r133j4132E2259d281H9094
$$ plain form
18088 -110105 -6855 -17977 -136332 81711 -84861 26776 -135182 147464 -213069 -132268 -288129
18077 -288129 301831 92018 -34798 94316 364066 89559 -44787 66615 -96317 -92734 -40125
18065 -136562 -52348 -90627 -65398 -159895 -204748 -160972 -29278 5593 -77247 -54182 33540 -158213
18052 -43038 10708 -54384 -184339 143118 -91089 -46757 -153940 44778 -242597 -2109 153874
18040 -82819 31201 47138 -104192 231938 -59769 391944 -159494 -172201 -17128 -63265 -382359
18029 -382359 41131 79906 -13698 -146242 228478 -9967 -71270 -196181 -415881 -236069 72152
18017 -26334 148181 296844 259394 -134593 -97487 31674 41425 -166491 -231450 -44223 25992
18005 40638 -36959 -111421 33898 82871 -163249 -112350 -71945 -81078 -95210 52259 -4281 89094
17992A99933r2606i2413a4008l0974D86659D1131J90151b9549C2852J9106i407
17980A45945J42171A7478K02823a18126H0677Q1936p0015b71291m627h28j64190
17969a65018L8080L4562K1590A03302e14535A48367g2870o0525E8016K7432h5584
17957A53969E5651I719c3087j55090C4828J67523a92321j0113p91H9265g4758
17945h7270A04236a9903r2091A09701L2013c42927J02352D0669b64889O5385F1843
17933a22097A17598D6223b09851B87075j36258a97224G8168I074b6069A65982
17922a94431E0918O272Q6748a5831B44483D0446a46536B30773C9926i6179d3291
17910b28824A50297b2277H0671O19J35914J63065g1635A23143K70972j57524j10986
$$ plain form
17992 199933 107327 -92413 -14008 -44982 486659 41131 231282 -29549 32852 51958 -9407
17980 145945 288116 17478 220301 -118126 80677 162613 92598 -271291 -275918 -828 -165018
17969 -165018 -126938 -92376 -70786 103302 -514535 148367 -72870 -133395 58016 85448 -85584
17957 153969 55651 9719 -33087 -188177 34828 202351 -192321 -202434 -203225 89265 -74758
17945 -87270 104236 -19903 -111994 109701 141714 -342927 -240575 40669 -264889 -199504 61843
17933 -122097 117598 46223 -209851 287075 150817 -197224 78168 9074 -26069 165982
17922 -194431 50918 57190 143938 -15831 244483 40446 -146536 230773 39926 -96179 -43291
17910 -228824 150297 -22277 80671 81290 217204 380269 -71635 123143 394115 236591 125605
17899A25605e5065k26464e8252B48568E550e6663H1206J45575f3990l18251c2401
17887a02030b0621J0239c336k41119e6613C49723G0127N8368n5693d46601a37910
17875f6872b5923E7871K05085b74192a01011n6778H9906J98691a6968k22222R8628
17864a40562D6266a26175n9100P1254A8292J0614a4014N382G7382j1033c9338
17852a68567e375C6623a69655A5057K42905b07747A40444i8545j68972B51620
17841A74869b06033K3208C3255J45747M3464d1568k22635J3607E4393i7394d4091
17829i3457k9998H378J30957c05560h6709j88942C18316b7181A67295b19754I0853
17817b31149B79071c9364C15373c88568A61969d23491A61190i8555d2029j94383
$$ plain form
17899 125605 -55065 -281529 -58252 248568 5550 -56663 81206 226781 -63990 -382241 -32401
17887 -102030 -20621 -10382 -3336 -244455 -56613 349723 70127 128495 72802 -446601 -137910
17875 -66872 -25923 57871 262956 -274192 -101011 -157789 89906 288597 -16968 -239190 -140562
17864 -140562 46266 -126175 -185275 -114021 18292 28906 -14014 -8632 77382 66349 -39338
17852 -168567 -5375 36623 -169655 15057 257962 -207747 140444 -98545 -267517 251620
17841 174869 -206033 -182825 33255 179002 222466 -41568 -264203 -250596 54393 -97394 -44091
17829 -93457 -123455 8378 139335 -305560 -86709 -275651 318316 -27181 167295 -219754 90853
17817 -231149 279071 -39364 315373 -388568 161969 -423491 161190 -98555 -42029 -236412
17807b36412A85753B7499a41922B44603g9161L4300k4039b7796p9942k3997A96998
17795A49419D8122j9724J78493C1248J69131E5476J24954K63200b93553J45266
17785a48287o1592I567N0418c9723k4670j08693a2794A36551e9925F7627b1318
17773a51526A95256c460n77j61625B43269a44735A31675b28918d0152k59133A50354
17761A85770a62894A10262b2095h854C9803J45058J07699A2721K42610H5027a28406
17749f74k43737a0856B5521f7721F6262g284j03166c2680A62368a7143l71738
17738c88881q5072a60861I6461c74264a65684b0180B02261a21111C1055a66025
17727a35229B0077c18035f3170j19623C42080B092i8324a3644E768J0033K8076
$$ plain form
17807 -236412 185753 27499 -141922 244603 -79161 -44861 -68900 -27796 -107738 -131735 196998
17795 149419 48122 28398 206891 31248 200379 55476 180430 443630 -293553 -148287
17785 -148287 -209879 9567 59985 -39723 -64393 -173086 -12794 136551 -59925 67627 -21318
17773 -151526 195256 -3460 -4037 -165662 243269 -144735 131675 -228918 -40152 -299285 150354
17761 185770 -162894 110262 -22095 -8854 39803 184861 292560 12721 255331 85027 -128406
17749 -674 -244411 -10856 25521 -67721 66262 -7284 -110450 -32680 162368 -17143 -388881
17738 -388881 -473953 -160861 96461 -374264 -165684 -20180 202261 -121111 31055 -166025
17727 -135229 20077 -318035 -63170 -182793 342080 2092 -98324 -13644 5768 15801 43877
17716D3877a14A66482a03920A77519E9032B5202g0978A90848o6390i4045j0792
17705a04837G9392b32668a08814A40776J49546n9892g1624L1855B21667A10737
17694E7416J7822C4773J38578f4910A24924F2361L6085c1569A35516P6135n9379
17683A52272c04549h2947F5722e4807j6607j30724D4852K61633A5092F679L19560
17672C26239A10792L2635l0472b83823A64387E4427D679J2802K05942o5488F7754
17660A32518d8178A7044b29976B43073a17923A60747a43186j25363B18721F0254
17649B2252J16827A3294a03883b3166j12119B3546e2408a3178A16989M0040J57229
17638C14258j02167b7293A24508b02000n0562E0582c6747B49666H4280l7594g0567
$$ plain form
17716 43877 -114 166482 -103920 177519 59032 25202 -70978 190848 124458 -94045 -104837
17705 -104837 79392 -232668 -108814 140776 290322 230430 -71624 -39769 221667 110737
17694 57416 75238 34773 173351 -64910 124924 62361 98446 -31569 135516 211651 152272
17683 152272 -304549 -82947 65722 -54807 -71414 -202138 44852 306485 15092 6679 326239
17672 326239 110792 143427 112955 -283823 164387 54427 4679 17481 223423 157935 67754
17660 132518 -48178 17044 -229976 243073 -117923 160747 -143186 -268549 218721 60254
17649 22252 139079 13294 -103883 -23166 -135285 23546 -52408 -13178 116989 157029 314258
17638 314258 212091 -27293 124508 -202000 -252562 50582 -36747 249666 84280 46686 -70567
17626b6002A89226d992k19807D1093N9328a26475f2464j45270C82841b89480A30664
17614b723A4083e7836B57416L0655E6835a32503G47K5055H265h9644A34606a32608
17601A07370b5752A505a78599h5440k29855C7269b26998A34356a36384N2699A31617
17589A5907e2785j6479p1395r2403k3129J13015o7962E301L05151a70855h4637
17577d2429j12276B707O2734f4744E4704J11764K20111A76157a75292q0415A65740
17565E9233a7876l2093a9205B84J67224a01317q3342B81591f4379B07765I6334
17553B43120I0450f6206B86784b02330J4072C41840D1156d2145A16765d50949
17542a10410m1085g127l15901C7897L0264J5361J03204B8389e5761j09842F9647
$$ plain form
17626 -26002 189226 -4992 -224799 41093 100421 -126475 -62464 -207734 382841 -289480 130664
17614 -2723 14083 -57836 257416 288071 56835 -132503 747 25802 8265 -89644 134606 -132608
17601 107370 -25752 1505 -178599 -85440 -315295 37269 -226998 134356 -136384 -83685 131617
17589 15907 -52785 -69264 -140659 -233062 -256191 -143176 -211138 5301 310452 -170855 -84637
17577 -42429 -154705 2707 65441 -64744 54704 166468 386579 176157 -175292 -255707 165740
17565 59233 -17876 -49969 -19205 284 167508 -101317 -184659 281591 -64379 207765 96334
17553 243120 90450 -66206 286784 -202330 -188258 341840 41156 -42145 116765 -450949
17542 -110410 -151495 -7127 -323028 37897 68161 83522 186726 28389 -55761 -165603 69647
17530g7866l8636L1409A57038c2433B65243h6517E5328K55112A20370C9766J57821
17519A97587j2876k808q1611m5937B0529E360J01625J0647c10844A57781K29961
17508C87742A67838E7894d4560j9718A22396g9461B88529b8887B27961a13182
17497B31581f0892A81895A5226c3736B27399a82116A57158j6025K86656A31878
17486E8555K81400A19154K6544p1814C0650J59238F0967j8038d8876A79912L00272
17475D80184a67940A7792J28847B0653K34330I9102C021K27532E2563K35632I0343
17463A88599M4780r9815b07523I4748a4073E6538J27799O8777n6422G200J34368
17452A41568C9975J64949P546b61805D60598k13761P0028E1892J41594J3543p1847
$$ plain form
17530 -77866 -116502 -85093 157038 -32433 265243 -86517 55328 310440 120370 39766 197587
17519 197587 184711 181903 100292 54355 20529 5360 106985 117632 -310844 157781 387742
17508 387742 167838 57894 -44560 -64278 122396 -79461 288529 -28887 227961 -113182
17497 231581 -60892 181895 15226 -33736 227399 -182116 157158 141133 427789 131878
17486 58555 339955 119154 145698 73884 30650 189888 60967 42929 -48876 179912 480184
17475 480184 -167940 17792 146639 20653 254983 99102 3021 230553 52563 288195 90343
17463 188599 233379 133564 -207523 94748 -14073 56538 184337 253114 196692 7200 141568
17452 141568 39975 204924 212470 -261805 460598 246837 316865 51892 193486 207029 135182
17441A35182a88609E4427J06623m9703J22962L34109j74426j91499E8267J37681
17431A95948K12340j48431a96044A41826g0885B89571j4458f6494A36671M05775
17421E42446B1605P48025E8274K1718l6596P0196m551O6217G6385L15234B9336
17409H2642R6302B5718M15325A26777J4933B672J57783J07951a90932d9722j60793
17398b10515j77627A94564J468J47216H5513M7580J40802J17970j84971D5135
17387B21577G3114M3089J67921O0624j05233D6813J17713k5550P6048g5513A14206
17375I5061a79495G0808b56989B18243K7263r048b82814A14853B4233a4909m02583
17364d17492H5644b14885K5443I7699J60950j22017J25513a16190k39274c0862
$$ plain form
17441 135182 -188609 54427 161050 111347 234309 568418 393992 202493 58267 195948
17431 195948 408288 259857 -196044 141826 -70885 289571 275113 -66494 136671 542446
17421 542446 21605 769630 58274 79992 43396 113592 109041 175258 76385 391619 29336
17409 82642 178944 25718 441043 126777 141710 2672 160455 268406 -190932 -49722 -210515
17398 -210515 -388142 194564 196032 343248 85513 133093 273895 391865 206894 45135
17387 221577 73114 116203 284124 344748 239515 46813 164526 138976 215024 -75513 114206
17375 95061 -179495 70808 -256989 218243 245506 236458 -282814 114853 24233 -14909 -417492
17364 -417492 85644 -214885 -189442 97699 258649 136632 262145 -116190 -355464 -30862
17353A90554a8389B21611K88853m9530A4835K58863p3558R8660q3100f2888B73580
17341C27854H1757K38167c00196c630j363B11085g7907E8333N1271L03236A47865
17329B05180J64505A36948L36277A44949b34514I1158f2573j41549F6597b88572
17318a71099F82111l21217l8894j11103m9628e7759D00295m2606A39770E8901
17307B11929L93798D9333N6256l3072a43601C24106j06783G0112C1915j5651M89368
17296E05632A01227B5540J00801m4537g0028b1429E5340Q9311d8004A74982o7711
17285A07271e3880A72951M8813G3446J1452J87115B0267D6J18084K13758L0920
17274C62808a5197H1408J61731B0664K41132m679b4832B71112m7731O8431j02513
$$ plain form
17353 190554 -18389 221611 510464 460934 14835 273698 200140 298800 215700 -62888 273580
17341 327854 81757 319924 -300196 -3630 -4993 211085 -77907 58333 109604 412840 147865
17329 205180 369685 136948 473225 144949 -234514 91158 -62573 -204122 66597 -288572
17318 -171099 682111 360894 322000 210897 161269 -57759 400295 357689 139770 58901
17307 211929 605727 49333 105589 72517 -143601 324106 217323 70112 31915 16264 505632
17296 505632 101227 25540 126341 81804 -70028 -21429 55340 144651 -48004 174982 107271
17285 107271 -53880 172951 221764 73446 84898 272013 20267 46 118130 331888 362808
17274 362808 -15197 81408 243139 20664 261796 257117 -24832 271112 223381 291812 189299
17263A89299I2334b31055A42124C0418R6817D6158J44528A0067b67490D2678J65624
17252B08302n5700M3934j8832H5360l4586a9370A79649J6066F960J12674M0027
17241A59661K2747J2236n4023R8645A9763K69236C9155Q5808b35203B36478p0712
17230A65766i9801G2671K21450q6968a9453C5606a73416A20001K73292E8020f6720
17218g907C63345j9175j43088a86A11829O3433K86882k21322o8635E1054M17025
17207D68079j97413q9749h5966B98023K08731k03478j40266g9787D15543A46632
17196C73115B2205J23262L9351L17063o1926B13850i821B05018K0063K52977A35599
17184B18331p5451A2015N9233K27351r0427A02108j3359d5552B87123a73925A39042
$$ plain form
17263 189299 92334 -231055 142124 30418 127235 46158 190686 10067 -267490 42678 208302
17252 208302 152602 196536 177704 85360 50774 -19370 179649 195715 6960 119634 159661
17241 159661 182408 194644 140621 239266 19763 288999 39155 124963 -235203 236478 165766
17230 165766 -99801 72671 294121 207153 -19453 35606 -173416 120001 393293 58020 -66720
17218 -7907 363345 344170 201082 -186 111829 175262 462144 240822 172187 51054 468079
17207 468079 270666 180917 -85966 298023 506754 303276 163010 -79787 415543 146632
17196 373115 22205 145467 184818 501881 439955 213850 -9821 205018 225081 478058 135599
17184 218331 142880 12015 71248 298599 208172 102108 88749 -45552 287123 -173925 139042
17172g3733F8161b83580a36517B57237K2588J08824k4198L5183j55627J6103K35722
17161D95832L7279A48762J03978l9130k958p4933L81026k51744K05147A95977
17150B19785J8038R0289A06595J51772R5202n6151j31750q0080K52163Q6763A84580
17138B11973k9340K73001D4535L94557A67715J96672A03188J5041e5269H4163
17127C19765A47462m1648j9530K91731J8915A89247Q1339j3219N8186k8242R5141
17116C82452c6228B09378M0933C9242K24936K52096J07146H6068J76339J72837
17106D35244P7277B52713G7232L33340o5753J00687R6417j92150P6890N9732j51020
17095C35375n343J56600B0542J06120L38473B7540J93738J39103A29028M94094
$$ plain form
17172 -73733 68161 -283580 -136517 257237 279825 388649 364451 399634 244007 260110 495832
17161 495832 533111 148762 252740 213610 210652 135719 516745 265001 470148 195977
17150 219785 237823 328112 106595 258367 353569 297418 165668 85588 337751 424514 184580
17138 211973 182633 455634 44535 439092 167715 364387 103188 118229 -55269 84163
17127 319765 147462 105814 86284 378015 396930 189247 270586 257367 315553 287311 382452
17116 382452 -36228 209378 250311 39242 264178 516274 623420 86068 262407 435244
17106 435244 512521 252713 77232 410572 344819 445506 541923 349773 426663 486395 335375
17095 335375 330032 486632 20542 126662 465135 27540 221278 360381 129028 623122
17085F23122k70153j62832M42351k31199K12750k23577o9893P7187J93115Q4392
17075F75263B99694L07253B84047N3991P2077K08788J27464B02167J22791J6283
17065C41241K21924j28588j17145O0045L38676B58216L6732F6322K52053m6743
17055B71632R6438L83172k58037A96469L11023J21091j92837k7093M14820k89611
17045E33862J26830M9603C06196J80519L78754k52513j965j19770P9995k44561
17035C26655P5203L71396l13099n9278k3984Q6189K28810j95648r0649K66335
17025F71930C34600L23024j52397o6149K49615J1392j58693B23684J06505K77549
17015F07738J39614L5243l45454k3777J50997j26606K27726k30292L6311q2257
$$ plain form
17085 623122 352969 190137 632488 401289 614039 390462 320569 397756 590871 675263
17075 675263 299694 606947 284047 338038 410115 618903 746367 202167 324958 341241
17065 341241 563165 434577 317432 377477 716153 258216 294948 66322 318375 271632
17055 271632 368070 751242 493205 196469 507492 628583 435746 408653 823473 533862
17045 533862 660692 710295 306196 486715 865469 612956 610991 491221 571216 326655
17035 326655 401858 773254 460155 400877 376893 463082 691892 496244 405595 671930
17025 671930 334600 657624 505227 439078 688693 700085 541392 223684 330189 607738
17015 607738 747352 782595 437141 413364 564361 437755 665481 435189 471500 389243
17005C89243L42975k22333j45097J21393j04233K05508o6928M26164l22860J97142
16995H20974k70858M0258P2365J58012N4884J725k64897M43511l69133l5235J4800
16984F66406j6767J0194J86041j90532O998o018p1169J31696k53090N67650j67515
16973H63894j42279J69994l7444k59949M27965l86941R9809J16199K7425k19196
16963F59477K91057j43875j66893J0189J28568K05183j04550q4463L73207k05917
16953I61983l72669K08157K99015l3935J46480j39616k0002r9947j3174J39904
16943A076196k14103Q0028J61983K2860k34048K88239m21040K82827J14840j21613
16933A036169J42415l01505J48792K24052l36490R3654K83170l15032J82824q8517
$$ plain form
17005 389243 732218 509885 364788 486181 381948 587456 520528 946692 623832 820974
16995 820974 550116 590374 662739 820751 875635 877360 612463 1055974 686841 651606 666406
16984 666406 649639 659833 845874 655342 662340 656322 585153 716849 463759 1031409 863894
16973 863894 721615 891609 854165 594216 1022181 635240 735049 851248 878673 659477
16963 659477 950534 806659 639766 649955 778523 983706 879156 794693 1167900 961983
16953 961983 589314 797471 1096486 1062551 1209031 1069415 1049413 949466 936292 1076196
16943 1076196 862093 942121 1104104 1126964 892916 1181155 760115 1042942 1157782 1036169
16933 1036169 1178584 877079 1025871 1249923 913433 1007087 1290257 975225 1158049 1069532
16923A069532J05238k33896N28079j25370n2692q5956k35480L42862J16794J17202
16913A546313j72287J64160j90283K455m2974q0489K1866J12991J44663N8630
16903A565045N6672k1503K84640m84106K48352j44643M49408n99876j44751M66085
16893A675323L29638m90421l5011J36652k14519L96073N5018r3022K48013j56370
16883A851374P2452M3544j93503J44849J72913p0617j49538K65139N2889K17338
16873B406840k42243k35166J36071L65407j61414K50638j94355K18170k20868
16864B323080J34020o7973R041J13946o2435J92837l35669O65376l05023L01681
16854B968881l40917J81412M4005r6570L23507m3428P2067r9423K00649l10056
$$ plain form
16923 1069532 1174770 940874 1468953 1343583 1290891 1204935 969455 1312317 1429111 1546313
16913 1546313 1374026 1538186 1347903 1350358 1307384 1226895 1248761 1361752 1506415 1565045
16903 1565045 1621717 1600214 1884854 1400748 1649100 1504457 1953865 1353989 1209238 1675323
16893 1675323 2004961 1514540 1479529 1616181 1401662 1797735 1852753 1759731 2007744 1851374
16883 1851374 1923826 1967370 1773867 1918716 2091629 2021012 1871474 2136613 2189502 2406840
16873 2406840 2164597 1929431 2065502 2430909 2269495 2520133 2325778 2543948 2323080
16864 2323080 2457100 2389127 2398168 2512114 2449679 2642516 2306847 2972223 2667200 2968881
16854 2968881 2627964 2809376 2853381 2756811 3080318 3036890 3108957 3009534 3210183 2900127
16844B900127J38775K19296l560J38962j67523K90211l4893O2335L42893r3487
16834C793136k42535J45614K25191N6357k9982J18706R8599J24765k03764L62558
16824D448645J83471M7823K517K18647J34075N9527k80679J74701k27964K72307
16814E033070M34269K94097r518k12375l497N28417K87898M632J82935Q33k5035
16803F515726M89620k35538N77168j01060L99480j92949K65611L92092J12507
16794H222657K10083k2944P13282j77789M86183L61566K62450K17574J46999J02413
16784A0522474N34037L39608L87698N46906j8697K06087Q16077M73325L85500
16775A4193015M57490J76027P52756M09411O88428N68318P22563O38845M20820
$$ plain form
16844 2900127 3038902 3258198 3254638 3393600 3226077 3516288 3481395 3543730 3886623 3793136
16834 3793136 3550601 3696215 3921406 3977763 3947781 4066487 4165086 4289851 4086087 4448645
16824 4448645 4632116 4679939 4682456 4901103 5035178 5094705 4814026 4988727 4760763 5033070
16814 5033070 5467339 5761436 5751918 5539543 5536046 6064463 6352361 6356993 6539928 6540761 6515726
16803 6515726 7005346 6769808 7346976 7245916 7645396 7452447 7718058 8110150 8222657
16794 8222657 8432740 8409796 9123078 8945289 9431472 9793038 10055488 10273062 10420061 10522474
16784 10522474 11056511 11396119 11783817 12330723 12312026 12518113 13334190 13807515 14193015
16775 14193015 14650505 14826532 15579288 15988699 16677127 17245445 17968008 18606853 19027673
16766A9027673N99383J180692L72792J104107R56613P31728J016995J203722Q20658
16757B7014363J130273J737488J298609J150403J575524J820109J654793J991484
16749C9373046K309393J748098K151343K668826K493840K602406L461382L134639
16741E9942973L495481L484936M529272L910592M565182N089677N219305N742998
16733I5980416N822105O338894O547174O822145P039993P288640O958950O807016
16725A49605333P307919O393121N518436N528106L997635L030358K150375O34082
16717A84165365j056366j715086l160776l879748n452588n951418o370833p099231
16709A49479319p172695p440123p096983p082675p059400o116950o472598o109802
$$ plain form
16766 19027673 19627056 20807748 21180540 22284647 23241260 23972988 24989983 26193705 27014363
16757 27014363 28144636 29882124 31180733 32331136 33906660 35726769 37381562 39373046
16749 39373046 41682439 43430537 45581880 48250706 50744546 53346952 56808334 59942973
16741 59942973 63438454 66923390 71452662 75363254 79928436 85018113 90237418 95980416
16733 95980416 101802521 108141415 114688589 121510734 128550727 135839367 142798317 149605333
16725 149605333 156913252 163306373 168824809 174352915 178350550 181380908 183531283 184165365
16717 184165365 183108999 181393913 178233137 174353389 168900801 162949383 156578550 149479319
16709 149479319 142306624 134866501 127769518 120686843 113627443 107510493 101037895 94928093
16701I4928093n807124n245028m941155m755051m155355l665918m191414l216928
16693E8950120l662583k613058k893627k974319k235277k221686j779741k283500
16685C8286329k111404j926522j118944j770929q90343j773107j291076j289619
16677B6114385q93796j006278j086929r51324j061273o86856o81501j051516q01325
16668A7893587l42063q31911k61336n18518n68293q85372j44968n76624m67603
16659A3296899m47220k67129m98413K15899p15602l42472n59484k92274l07082
16650A0083122j64278k59130k87908k89569n0745l84402k72631j9443n36090j21325
16640G697601k97348k60754k4424k61232N00930n78402j88117m61658J45524l94452
$$ plain form
16701 94928093 89120969 83875941 78934786 74179735 70024380 66358462 62167048 58950120
16693 58950120 55287537 52674479 49780852 46806533 44571256 42349570 40569829 38286329
16685 38286329 36174925 34248403 33129459 31358530 30468187 28695080 27404004 26114385
16677 26114385 25220589 24214311 23127382 22176058 21114785 20427929 19746428 18694912 17893587
16668 17893587 17551524 16719613 16458277 15939759 15371466 14486094 14341126 13764502 13296899
16659 13296899 12849679 12582550 12084137 12300036 11584434 11241962 10682478 10390204 10083122
16650 10083122 9918844 9659714 9371806 9082237 9031492 8647090 8374459 8355016 7818926 7697601
16640 7697601 7400253 7139499 7115075 6853843 7354773 6776371 6588254 6126596 6272120 5877668
16630E877668K0038m14316J13428K1499n24704J22183N9134k6396m79997m200
16620D764337j8006q1270R03j92148j17498l53187L71114m3143o02209K13375
16610C942268j65511K07443l38684j13495J86984n36351K22417k78176K81378
16601C408273j16962j27215j9715j09910p2809L44606m74145J38715j10892k16863
16591B643083q5950k3383K15758l04313K67746k23544K59107n30496J67444K32529
16581B617981k34749K16453m03912o1951J48164j80504J97740l27365O7263N9334
16571B098454j36359J67878n6804j50684o4167Q6782j47904M09945o04829K92070
16561A894382k694l94159L88063l09707P7220J9803r411k40832K36611l4283K1776
$$ plain form
16630 5877668 5897706 5483390 5596818 5618317 5093613 5215796 5274930 5248534 4768537 4764337
16620 4764337 4746331 4665061 4665964 4473816 4356318 4003131 4374245 4331102 3728893 3942268
16610 3942268 3776757 3984200 3645516 3532021 3719005 3182654 3405071 3126895 3408273
16601 3408273 3291311 3164096 3144381 3034471 2961662 3306268 2832123 2970838 2859946 2643083
16591 2643083 2557133 2533750 2749508 2445195 2712941 2489397 2748504 2218008 2385452 2617981
16581 2617981 2383232 2599685 2195773 2133822 2281986 2101482 2299222 1971857 2039120 2098454
16571 2098454 1962095 2129973 2073169 1922485 1858318 1945100 1797196 2207141 1602312 1894382
16561 1894382 1891688 1497529 1885592 1575885 1653105 1672908 1663497 1422665 1659276 1624993 1646769
16550A646769k55994K32501j97983j38595L53103k26860m716N4083j34475J07772
16540A435605n8266K40279j14749n65902J60871J46633K0830L7342k03968J57264
16530A255939N8524N1721k88371R3084O7202j64259j89488J32115K65031j3037
16520A268461L7726J05379m98447J65890r5003k0108R1340Q2620n02082K07138
16510H42914K39367o5474r5344n4089l9224J54125k52312M01080k57973j0065
16500H63005J12619n5357K20632l33718K01565l43361L01227m14415L58903l07716
16490F03384L21224l57769N04127k52407M606j96879K79835l24944Q4678K03368
16480H69223N3107n9360j56061j26221k11430K96613O0223r318J89467j53155
$$ plain form
16550 1646769 1390775 1623276 1425293 1286698 1639801 1412941 1408225 1462308 1327833 1435605
16540 1435605 1377339 1617618 1502869 936967 1097838 1244471 1265301 1302643 1098675 1255939
16530 1255939 1314463 1366184 1077813 1170897 1238099 1073840 884352 1016467 1281498 1268461
16520 1268461 1306187 1411566 913119 1079009 984006 963898 1055238 1137858 635776 842914
16510 842914 1082281 1016807 921463 867374 828150 982275 729963 1131043 873070 863005
16500 863005 975624 920267 1140899 807181 1008746 665385 966612 552197 911100 603384
16490 603384 924608 566839 1070966 818559 823165 626286 906121 581177 665855 869223
16480 869223 922330 862970 706909 580688 369258 665871 726094 716776 906243 753088
16470G53088L3474r6575K8875o889C25526O97051l56047O4286j03549L81740m87763
16459E21244J14421I8468M32710L66896m49020J25408m5958j48927J54196J71210
16449G04983l34773p1816K38807J19411j53068L95029B36789N15307k13079j54197
16439C84820j60620J21457l4539N4527j27257M49800B94113K93461k68457L98520
16429G17637k54186q5039J2908K6914J23165j6688k54002M00864A93785J97964
16419C91749K59958B27724N3766I4527N63541k20922J34198K5478j45806A48288
16408E67443k29366j0740M18396C61441J33489k04826L39159A71101o163J99427
16398C64365K57557k1596k40578B7529K72644N7451B4958L61945M073r5135o4088
$$ plain form
16470 753088 786562 689987 718862 711973 325526 1022577 666530 730816 627267 1009007 521244
16459 521244 635665 98468 531178 898074 449054 574462 528504 379577 533773 704983
16449 704983 370210 298394 537201 656612 503544 898573 236789 752096 539017 384820
16439 384820 224200 345657 311118 365645 238388 688188 294113 587574 319117 717637
16429 717637 463451 378412 391320 418234 541399 524711 270709 671573 193785 391749
16419 391749 651707 227724 281490 94527 658068 437146 571344 596822 451016 148288
16408 567443 338077 327337 745733 361441 494930 290104 629263 171101 164938 364365
16398 364365 621922 600326 359748 27529 300173 357624 24958 386903 390976 295841 231753
16387B31753K07717A97087J03355J80483b15054C81431r2944J93416J50142B71580
16376A20217M05801j81324J34641G4854L76044m8425p2723q2133J27989A65006
16365B62698j23279L41818a7402D57731K3946j30514q4912j07786C8484J62640
16355B01124J32025j41056m8685K38798j75194J32818o8894J0793L06758B29305
16344F9130J64176J23315j09849M9615l697B4210L62560j76877P1840J27059J87215
16333E96007A00970L49930k1649J13026B71103j11094F5423K22599j17730L45216
16323E15508D2864K70052J47468j69681j5624D7132O4890K11246j2120A36584
16312A76244q5277l393k0329h9609H5277l4452d474k4073C86819A695K04881C494
$$ plain form
16387 231753 439470 197087 300442 480925 -215054 381431 288487 481903 632045 271580
16376 120217 526018 344694 479335 74854 450898 402473 329750 247617 375606 165006
16365 262698 139419 481237 -17402 457731 481677 351163 266251 158465 38484 201124
16355 201124 333149 192093 143408 382206 207012 339830 270936 281729 588487 229305
16344 69130 233306 356621 246772 296387 292690 24210 386770 209893 281733 408792 596007
16333 596007 100970 450900 429251 542277 271103 160009 65423 288022 170292 515508
16323 515508 42864 312916 460384 290703 275079 47132 112022 323268 311148 136584
16312 176244 90967 87574 67245 -89609 85277 50825 -4474 -28547 386819 1695 206576 3494
16299h3494K7728A15589K13242d6119A97258o1431m1560L12193A55830J6258L64068
16288E36156A51159k0413J48987A21482c4371B23987L8423J25674r1839A05900
16277A73493K5654J9856j02457L27592p2443A05314h0915B89892A32906K2442
16267A55348c2988C17197j51174M6483A4776b464D00931j00729p9877L187P342
16256B30854j09838N068d5340C25762R1157a30476C51869A74559f8225B62654
16245A02372L72741k29187K08107p7084j3431C9107f4034B34922i7245h589I2255
16233I2182K89597A19486f0320l3698E18125g3167A90936r0823P909J00589G1837
16221b3049q3321D9580k609J59879a05841G4549h1551I6155d1580C09231D2913
$$ plain form
16299 -83494 -55766 115589 328831 -46119 197258 135827 94267 406460 155830 172088 536156
16288 536156 151159 130746 279733 121482 -34371 223987 262410 388084 296245 105900
16277 173493 199147 219003 116546 444138 371695 105314 -80915 289892 132906 155348
16267 155348 -32988 317197 166023 212506 14776 -2464 400931 300202 220325 223512 230854
16256 230854 121016 126084 -45340 325762 416919 -130476 351869 174559 -68225 262654
16245 102372 475113 245926 454033 376949 363518 39107 -64034 234922 -97245 -8589 92255
16233 92182 381779 119486 -60320 -94018 518125 -73167 190936 100113 108022 208611 71837
16221 -23049 -106370 49580 46971 206850 -105841 74549 -81551 96155 -41580 309231 42913
16209A31608c2082l0255A71120n2653b9056B9041c7299A91375b5348B71733A04493
16197B32575a10853j9445B95396b8363i812A16261E6069a34225k9650A08464P5969
16186A84433D7176K7414K23905A08451C5077M3489K54843A1799a85455A56948
16175E6126f0921l24979B73367F2569k4476a89042g2608r6106H6710C1958M7342
16164G9300J33776i2698n1557r2937F7814J54890A1762c83613b1818p7373j8962
16153a18153c7209r288F9111C3909M92b24249f3001l20171C7452K45659j01348
16142A81763A9196L62232p9633A7452L1155d3474k0724E8519L1532L7719l1479
16131I6291L83997d0412A37083a84475n804r9211K2197A16317b49979B10281a27529
$$ plain form
16209 131608 -32082 -62337 171120 118467 -29056 29041 -37299 191375 -25348 271733 104493
16197 232575 -110853 -130298 295396 -28363 -9812 116261 56069 -134225 -163875 108464 184433
16186 184433 47176 74590 298495 108451 35077 78566 333409 11799 -185455 156948
16175 56126 -60921 -385900 273367 62569 38093 -189042 -72608 -168714 86710 31958 79300
16164 79300 213076 -92698 -144255 -237192 67814 222704 11762 -383613 -21818 -99191 -118153
16153 -118153 -37209 -46497 69111 33909 34401 -224249 -63001 -383172 37452 283111 181763
16142 181763 19196 381428 301795 17452 48607 -43474 -64198 58519 90051 127770 96291
16131 96291 480288 -40412 137083 -184475 -190279 -289490 -267293 116317 -249979 210281 -127529
16119D859R4649d0014j2805A3549R6493f0123A09028a95502d4391A02542B6645
16107a98437D60014A27841C4308K23676a32704A89616J39707j09710f396A20069
16096A49014i9308A54498a05539N2448A21352a31053A89967b4260B13189J50294
16086C63483G7290J0079c37546a15125A09612M1278m1368A9186a10221j00698
16076b10919c7669C68478b16801Q4076j7680j77160a00039G9167g6074m11200
16066d87274f5804E5391a8217D2300a62576b1221A51377g668G9791c91662f8295
16054B71009a00213A42228n3661a10367d4637n5309A05223i8609n8766o5291M5002
16043a77664I5084D0501R9246i3736D50423e71419a09705K1174C24957b7150A07786
$$ plain form
16119 4859 99508 -40014 -52819 13549 110042 -60123 109028 -195502 -44391 102542 26645
16107 -198437 460014 127841 34308 257984 -132704 189616 329323 219613 -6396 120069
16096 149014 -99308 154498 -105539 -53091 121352 -131053 189967 -24260 213189 363483
16086 363483 77290 87369 -337546 -115125 109612 150890 109522 19186 -110221 -210919
16076 -210919 -37669 368478 -216801 -132725 -150405 -327565 -100039 79167 -76074 -487274
16066 -487274 -65804 55391 -18217 42300 -162576 -21221 151377 -7668 79791 -391662 -68295
16054 271009 -100213 142228 88567 -110367 -44637 -99946 105223 -98609 -157375 -222666 -177664
16043 -177664 95084 40501 139747 -93736 450423 -571419 -109705 -88531 324957 -27150 107786
16031B29510h2472j00445n0206O999A13746m8998H38L25059a95383G7589J23592
16020B01181a33811G3461a80888M9093K448C04251c68478a00949d0612D26908
16009B16941a16614L3266N16A35199l3631a79612O1641D144a57723b6438j63556
15998a89994A84520L28572B52810A4938b35464B41745R7178h5672k16413C10183
15987a08759B0922K40177b7844p8795C73455j08649K2290m6421K9350a35939i230
15975B44990a87749L6226I9622a8642q3888F6573b5709l48219D7960a04966p2614
15964a77580r837B35641A03807R0571a39148O988m0440B5249K3582b8215j75755
15953b03970A70725i592q4842F8750c47623d2782q82j03964J0476j83006J10518
$$ plain form
16031 229510 -82472 -182917 -233123 -226124 113746 64748 838 325897 -195383 77589 201181
16020 201181 -133811 73461 -180888 -131795 -129347 304251 -368478 -100949 -40612 426908
16009 216941 -116614 -83348 -82832 135199 101568 -179612 -117971 4144 -157723 -26438 -189994
15998 -189994 184520 513092 252810 14938 -235464 241745 338923 -85672 -302085 310183
15987 -108759 20922 261099 -27844 -106639 373455 264806 287096 240675 270025 -135939 -9230
15975 244990 -187749 -151523 99622 -18642 -102530 66573 -25709 -373928 47960 -104966 -177580
15964 -177580 -187417 235641 103807 194378 -139148 -132160 -172600 25249 48831 -28215 -203970
15953 -203970 170725 -9592 -94434 68750 -347623 -42782 -43664 -147628 -137152 -320158 -209640
15942b09640A1259a07217j30704B53537C3354k752P8630b51218D4479n867a32863
15930A58912M540K3927a28578G5680b05962n6458e9770H8347a97858h74C2411
15918e9408j14016C7471i8903q9310g978A92034a11717F3435b23446B40197g2739
15906c0971H017L489a76649j93624c2174H2924a26981C06247H0028Q0207O3528
15895B23763J26128h7931p9459l10705M4738B08884A01782K0774K9965l3775b31891
15883a92519o294j59686B32279c55080a49259C88006b57481A61443F5745e7286
15872B1478a31110M732h954k53126A06428J36739c6145k00408j5978E7188K27119
15861B84307j41947b51529C5023J72697a33978B3577L51194A38513b6652k0033
$$ plain form
15942 -209640 11259 -107217 -237921 253537 33354 30602 109232 -251218 44479 38612 -132863
15930 158912 163452 187379 -128578 75680 -205962 -262420 -59770 88347 -197858 -874 32411
15918 -59408 -173424 37471 -98903 -188213 -7978 192034 -111717 63435 -223446 240197 -72739
15906 -30971 8017 11506 -176649 -370273 -32174 82924 -126981 306247 80028 160235 223763
15895 223763 349891 -87931 -167390 -478095 -433357 208884 101782 122556 152521 118746 -231891
15883 -192519 -198813 -358499 232279 -355080 -149259 388006 -257481 161443 65745 -57286
15872 21478 -131110 -126378 -8954 -262080 106428 243167 -36145 -236553 -252531 57188 284307
15861 284307 142360 -251529 35023 207720 -133978 23577 374771 138513 -26652 -46685
15851d6685A45857c07679A40705b02781Q0536H31b49711B18654d9163b1355A9211
15839a82172K7493c5678A28303a49855J2473E3976K8060a75366q9080D7000i4753
15827e471H7989p611j1712a45577B9364c2256k14447G7758e7996A04244d7622
15815G9977d46827B76881b83043B37851G8853d1495n28192g9920m682o1915G9996
15803a29434k2085j10243B2982c70310J83394k9471K8667I615a53021k8732a5970
15791B93666a44704D24217f2171A31040e6750k02230K1559a5080j76318O258k77798
15780d62938i9552k93614J69163j59438A21810B0016a51400j93125A50882a8764
15769a39122L8357A08364a41235j34453a32166B28354g7184C0102e7582A24322
$$ plain form
15851 -46685 145857 -307679 140705 -202781 -122245 831 -249711 218654 -49163 -21355 19211
15839 -182172 -154679 -35678 128303 -149855 -137382 53976 82036 -175366 -264446 47000 -94753
15827 -5471 87989 80378 68666 -145577 29364 -32256 -246703 77758 -57996 104244 -47622
15815 79977 -446827 276881 -283043 237851 78853 -41495 -569687 -79920 -84602 -146517 79996
15803 -129434 -151519 -261762 22982 -370310 -186916 -216387 -187720 9615 -153021 -181753 -15970
15791 293666 -144704 424217 -62171 131040 -56750 -258980 -237421 -15080 -191398 -185140 -462938
15780 -462938 -99552 -393166 -224003 -383441 121810 20016 -151400 -344525 150882 -18764
15769 -139122 -100765 108364 -141235 -275688 -132166 228354 -77184 30102 -57582 124322
15758C4152a7918E2356K31638c51125b5258A96676b06269E7325a47273j87965
15748c35238J27641A06268a57771K7032D2975a18084G0451l4614a56946N206m5775
15737a97515i4311A03123i2536m9634B28205g8068J1886K0431j62122M7223A90563
15725c48011I8198a26238C697b54730R9699B31207h1165k0352A28522b26204a00432
15713c75110g8281r710k50162a67235B35040j7536B3657a69620e5749m1413j94952
15702b92114j64539H2057K32711f9704E252d0028A74006b68105J02337h2511L0649
15691e1862J0165j06911G8599e3507C3948a59160A6394J02610b5196q5990k51086
15680c62272A72657K0506n6409a92195C9609Q7867L10026j82229c19002f9105
$$ plain form
15758 34152 -17918 52356 283994 -351125 -25258 196676 -206269 57325 -147273 -335238
15748 -335238 -207597 106268 -157771 -130739 42975 -118084 70451 35837 -156946 -151740 -197515
15737 -197515 -94311 103123 -92536 -142170 228205 -78068 -66182 -45751 -207873 -160650 190563
15725 -348011 98198 -126238 3697 -254730 -155031 231207 -81165 -101517 128522 -226204 -100432
15713 -375110 -78281 -87991 -338153 -167235 235040 217504 23657 -169620 -55749 -97162 -292114
15702 -292114 -456653 82057 314768 -69704 5252 -40028 174006 -268105 -165768 -82511 -51862
15691 -51862 -41697 -148608 78599 -53507 33948 -159160 16394 119004 -25196 -111186 -362272
15680 -362272 172657 193163 136754 -192195 39609 127476 437502 255273 -319002 -69105
15669B51854D9979a14227k168B39820b162q934l31966F2845H754Q1633g8769l88565
15657d67334J50724b9536I9245a55870r6417K9358b3954a1107A2580b02594A40847
15645d5594A52378b2004E3434N0501d057j17454e0948l4022B51462A1520b71508
15633B33621c51540B85726a27859B35670h8883a0994n04520a20287e8443A06786
15622C59747b47353a3248A32698A9341e4226G1938i4005m135Q186k01846d0422
15610e9723j84129c735j29302a4454A52082a47612r2225A1867M0439a87855J8271
15599a69584j02353c6144j69535h0051B15659K8918j02359e8950B77945c06900
15588a682j25553E7113g0552c3373r3376B26298f3483j74009m191A36385A5836
$$ plain form
15669 251854 49979 -114227 -116395 239820 -2162 -11096 -343062 62845 8754 90387 -78769 -467334
15657 -467334 -316610 -29536 99245 -155870 -252287 -222929 -23954 -11107 12580 -202594 140847
15645 -45594 152378 -22004 53434 103935 -4057 -121511 -50948 -84970 251462 11520 -271508
15633 233621 -351540 285726 -127859 235670 -88883 -10994 -515514 -120287 -58443 106786
15622 359747 -247353 -13248 132698 19341 -54226 71938 -94005 -98140 -89954 -291800 -40422
15610 -59723 -243852 -3735 -133037 -14454 152082 -147612 -239837 11867 52306 -187855 -169584
15599 -169584 -271937 -36144 -205679 -80051 215659 244577 142218 -58950 277945 -306900
15588 -1682 -127235 57113 -70552 -33373 -126749 226298 -63483 -237492 -241683 136385 15836
15576G6744b28604F955g4298B56492A25074K8592D30c43214A62038M0902j6917
15565A86023g3333A04095b15413k4688R8483e6350A7649a03360E2258f5538a1582
15553I0916a23470a3075o8742C7926d8750j68400g2755C58585A53702n9198c57964
15541A64526L8655b09010i0455E01119B8278b4143k11887f2149c0713H0551c0105
15529d6364j41510g3495B61871f0543a326k37427c1423A25128c02728g1857B8834
15517A43954a0956k89K727l01258i1400a3592C88421g0222n5850j16035J08050
15506a34057A90563K9893a23325j1154D7077b96117A07716d3504L408l0261B3620
15494g8835J2422j44397A25132b94983A66036k084D0253O7424g3791k2651k55705
$$ plain form
15576 76744 -228604 6955 -74298 256492 125074 153666 430 -343214 162038 202940 186023
15565 186023 -73333 104095 -215413 -240101 -141618 -56350 17649 -103360 52258 -65538 -11582
15553 90916 -123470 -13075 -81817 37926 -48750 -217150 -72755 358585 153702 94504 -357964
15541 164526 203181 -209010 -90455 501119 28278 -24143 -236030 -62149 -30713 80551 -30105
15529 -46364 -187874 -73495 261871 -60543 -1326 -238753 -31423 125128 -302728 -71857 28834
15517 143954 -10956 -11245 -8518 -309776 -91400 -13592 388421 -70222 -126072 -242107 -134057
15506 -134057 190563 220456 -123325 -134479 47077 -296117 107716 -43504 -40096 -70357 23620
15494 -78835 -66413 -210810 125132 -294983 166036 163952 40253 107677 -73791 -96442 -352147
15483c52147h9121j36837e1928A30154O1606a89148N2044A01089L29766g2849
15472H6873B1470b33255E5928J68694a39863k31080a15979E3049b70690h3203
15461C06313k5046E2994b31134A21028J75927G6717J55438m7314E6791e2659j82732
15450b35391b3540n5916J6351A4979J31106a54122c0265A16133f51166A38461
15439A5372J3557K95486r8437f3129A16109a98121h5624q0040j25490D69229b92522
15427i1257j73941b3656Q178A47293B1025J82260i8639o3718A03019O8697N5674
15416B27390e272A46746Q3640i1905A3594J07935K41650b10778B57289b3811A19811
15404B6036h1345l27458a09941A67902a06346B11294d5665q5777M3255j20466
$$ plain form
15483 -352147 -89121 -225958 -51928 130154 191760 -189148 -137104 101089 430855 -72849
15472 86873 21470 -233255 55928 224622 -139863 -370943 -115979 53049 -270690 -83203
15461 306313 281267 52994 -231134 121028 296955 76717 232155 184841 56791 -52659 -235391
15450 -235391 -23540 -79456 -63105 14979 146085 -154122 -30265 116133 -651166 138461
15439 15372 28929 324415 225978 -63129 116109 -198121 -85624 -165664 -291154 469229 -292522
15427 -91257 -265198 -23656 -15478 147293 21025 203285 -98639 -162357 103019 171716 227390
15416 227390 -5272 146746 230386 -91905 13594 121529 363179 -210778 257289 -23811 119811
15404 26036 -81345 -408803 -109941 167902 -106346 211294 -45665 -131442 -88187 -208653
15394b08653j69417J85659d4779C7207K34579b92389A59980b06159O8504C82087
15383A8389L8449J53723k0048o1124D1251b63764C77212a1222j03297e4524B88655
15371c49062a65172F6065c09617a7083k94551B98578A03586a16968j30221B3172
15360c09299J43025E3513L53190A7055K4910e8574n0405k02720B19603a6718j32068
15349a48786e5237A42041q922D1805h8830K3292E9063Q1505Q3952k071G4880a76696
15336a8297k07742A83535J32154j32542n7866b4408j66340A28507a8068l7265
15326e5333R355a6747j98304N5863M6685q6736B08453F2054J47321D1896J74484
15315B16380a44199j51460D1389a51028A32922a73431C364b36350D7111J38132
$$ plain form
15394 -208653 -378070 -192411 -44779 37207 271786 -292389 159980 -206159 -137655 382087
15383 18389 56838 210561 190513 129389 41251 -263764 377212 -11222 -114519 -54524 288655
15371 -349062 -165172 66065 -309617 -17083 -311634 298578 103586 -116968 -247189 23172
15360 -309299 -166274 53513 406703 17055 41965 -58574 -108979 -311699 219603 -16718 -148786
15349 -148786 -55237 142041 133119 41805 -88830 -65538 59063 140568 224520 222449 74880 -176696
15336 -18297 -226039 183535 315689 183147 125281 -24408 -190748 128507 -18068 -55333
15326 -55333 -45978 -16747 -215051 -159188 -112503 -199239 208453 62054 209375 41896 216380
15315 216380 -144199 -295659 41389 -151028 132922 -173431 3364 -236350 47111 185243
15305A85243O1471J59091D8292a39756k16540b6775C00074f8r6617B37381j15214
15294A22167J11738j11582b19135B30569A07642b47414A11661a80780A43520c69714
15283a8332E06359i9019A13019a57665g7486B51324A10311O5020N5947F8066a44708
15271B88235B9848c57379i3649L9492n9962p7320A2121c8464j24797E3446i5432
15259B09370D334J16111a00339d5872I82J21675n974N3417E7594K44860F5939
15247A094737R54033r79933N21670j81624B74778r7186J55673d0275A96447b77704
15236E9706P1135l7020d3267j28540e065k68356I0715J48922m9057h1076A1962
15224G6484L8248n7171P4184l1515K4074E1703a35323e8939A72264j4346c65404
$$ plain form
15305 185243 246714 405805 48292 -139756 -356296 -26775 300074 -68 -96685 237381 122167
15294 122167 233905 122323 -219135 230569 107642 -247414 111661 -180780 143520 -369714
15283 -18332 506359 -99019 113019 -157665 -77486 251324 110311 175331 231278 68066 -144708
15271 288235 29848 -357379 -93649 -54157 -114119 -191439 12121 -38464 -163261 53446 -95432
15259 209370 4334 120445 -100339 -45872 982 122657 116683 170100 57594 302454 65939
15247 1094737 2048770 1068837 1590507 1408883 274778 177592 333265 -40275 196447 -277704
15236 59706 130841 93821 -43267 -171807 -5065 -273421 90715 239637 190580 -81076 11962
15224 76484 114732 57561 131745 100230 124304 51703 -135323 -58939 172264 157918 -365404
15212B22517D2193g177A54360b88n8175j04050d1257A43442a65034C90400E6287
15200I2867J12402K71q9353b98307D15702A87992K90513b29882A5245P8110e6495
15188B6868L16968a33219B1874K02345F6083c95142A31796e4490A03501m324i667
15176C01490R6916A92300A9124J03346L3022n0237b3750A40672n1195J57951j00660
15165A46768b21031A00788a19580B29696f122C0793a22091c1951A6024b7513F8924
15153A815J43539L6461H6279a6741B87588j600M2392a09537a4984A01253j1563
15142H9690h5795B82536j16252J9001o1100J0910J14795I4511J68729m8293a72234
15130B57909A3425J01171K285a35732c9998o7118A19737R5605N1442O6933d9356
$$ plain form
15212 222517 42193 -7177 154360 -288 -58463 -162513 -41257 143442 -165034 390400 56287
15200 92867 205269 205540 116187 -298307 415702 187992 478505 -229882 15245 93355 -56495
15188 26868 343836 -133219 21874 224219 66083 -395142 131796 -54490 103501 99177 -9667
15176 301490 398406 192300 19124 122470 155492 105255 -23750 140672 89477 247428 146768
15165 146768 -221031 100788 -119580 229696 -6122 30793 -122091 -31951 16024 -27513 68924
15153 1815 145354 181815 86279 -16741 287588 285988 328380 -109537 -14984 101253 89690
15142 89690 -85795 282536 166284 185285 124185 135095 249890 94511 263240 214947 -172234
15130 257909 13425 114596 116881 -135732 -39998 -107116 119737 215342 266784 333717 -49356
15118A03695a0315j91477m1675D0950L27888A60500p7657f3949I8726J31488a49488
15106A80345a0882j0744d039j81193A47185J14005c2936A89079b0268k15656D1118
15094F0804M3326J095O3360J85731j68667K1800r1831m3638e6666A14214b00995
15082A97121J31360a20740B37003a70843A90632Q4727c7535A90323L3519f0650
15071D5625K63928A42486L1132a57978F3625K07729h4704G1162J21084M3338M6932
15060B82516O7345j64509P9873E1292J72327O4354k4958a20683C21871C1876J00946
15049A32822J811R2845k4408I683J52851O3342J3721d4901B06587F4254j378L54254
15037D17130r8174j46606k7352J11182H4901j0331J43661l0914p5771n5706g1799
$$ plain form
15118 103695 -10315 -201792 -243467 40950 368838 160500 82843 -63949 98726 230214 -149488
15106 180345 -10882 -21626 -4039 -185232 147185 261190 -32936 189079 -20268 -235924 41118
15094 60804 104130 105225 168585 354316 185649 207449 115618 71980 -56666 114214 -200995
15082 197121 328481 -120740 237003 -170843 190632 275359 -37535 190323 223842 -60650
15071 45625 309553 142486 173618 -157978 63625 271354 -84704 71162 192246 235584 282516
15060 282516 349861 185352 265225 51292 223619 287973 263015 -120683 321871 31876 132822
15049 132822 134633 227478 203070 9683 162534 225876 239597 -44901 206587 64254 62876 417130
15037 417130 318956 172350 144998 256180 84901 74570 218231 187317 111546 55840 -71799
15025E9543Q3807N0096q7656P465Q142J62122o304b29360E12966A00504J90974
15014B91478j40933d2081A43735l7256F831a42519Q499B42386r2607n7873C8107
15002E77839B47749J9038j29088K91857A76547P0709j03170d4149l6188A46163
14991A81257j2403n1514O5775P6289L2785l7847b02367I0292K72994q2879l7044
14980B43363a66254L9768B68275J13719D125N6037e8440E32363q6305j78058k3333
14969B44667M6048Q1164O6777H4355M3296P5342F4723J70915A13260J24401j07436
14958A30225d6376A81764a40017O334C9065N8809K12374A30464J69667C2551E878
14946D22706j75800L7105j7849R2905B7288L33098r6002N4542j13025r6612K29024
$$ plain form
15025 59543 143350 193446 105790 113255 121397 283519 277215 -229360 512966 100504 291478
15014 291478 150545 -42081 143735 106479 6831 -142519 -134020 242386 149779 91906 38107
15002 577839 247749 266787 137699 429556 176547 247256 144086 -44149 -80337 146163
14991 181257 168854 117340 183115 259404 292189 254342 -202367 90292 363286 280407 243363
14980 243363 -166254 -126486 268275 381994 4125 60162 -58440 532363 446058 268000 244667
14969 244667 290715 371879 438656 84355 127651 202993 64723 235638 113260 237661 130225
14958 130225 -46376 181764 -140017 -133683 39065 97874 310248 130464 300131 32551 5878
14946 422706 246906 284011 266162 359067 27288 360386 264384 318926 205901 109289 338313
14935C38313E7991L44511A45110M33060B04001O1005A07486J53742J6333A2715
14924H6031J47642C6763K64973j14113p826K53272H0166N9368N5479h493D38160
14912C53015L0459K0948j43197K66662j83155K953j17141J62700r372j51689F9857
14900C89210C5770K67766E586L12687O6667o7581I9098a30723F37612j91512k22107
14889B23993m1931J84324A52570K35511r6408J17894k1215B4484M11358j60131
14879B75711L29194d3967C37599o1131J68395j23731q8960K94610a34459a6534
14868C36937J82871k47442K30955j62625l9968Q4440A86266L8215P8868j16292
14858A87057h1499B24889J28100P8290k07074K50600j87647j00623K10683J31870
$$ plain form
14935 338313 57991 402502 145110 578170 204001 265006 107486 261228 277561 12715
14924 86031 233673 36763 301736 187623 179797 433069 80166 139534 195013 -8493 438160
14912 353015 383474 404422 261225 527887 344732 347685 230544 393244 383872 232183 69857
14900 389210 35770 303536 5586 318273 384940 317359 99098 -130723 637612 446100 223993
14889 223993 182062 366386 152570 388081 291673 409567 388352 24484 435842 275711
14879 275711 604905 -43967 337599 276468 444863 321132 232172 526782 -134459 -16534
14868 336937 519808 272366 503321 340696 300728 385168 186266 224481 303349 187057
14858 187057 -81499 224889 352989 431279 224205 474805 287158 186535 397218 529088
14848E29088k45073K49697A44009M2939M40180k79011A3597J47097P2641l3792
14838A99543J14245R4320N7417N2875B16567L2849M01593k12492K77297k13002
14828E02812J22758J28525B43230J71482n7336K10698j76529q7361L25553C12071
14817D85148j92641Q6163J20955k23952J55495H0692K68626P1931A85188M17195
14807F02383j14937j32334J1787n1525J7977J28843B397O33808J84353k80520
14797E40038p3889j27014J6111J20890A89107K42269J30429j10194j94664K10751
14787D67698P3874J48024k06536K47259B09142J29154K17063B22656K98462k29715
14777B91403K53292K2214M9893B16468M13982j79769k04859K13420J91982B88070
$$ plain form
14848 529088 284015 533712 144009 186948 627128 348117 13597 160694 233335 199543
14838 199543 313788 408108 465525 518400 216567 249416 651009 438517 715814 502812
14828 502812 625570 754095 243230 414712 357376 568074 391545 304184 629737 312071
14817 485148 292507 378670 499625 275673 431168 80692 349318 421249 185188 602383
14807 602383 487446 355112 366899 315374 333351 462194 2397 636205 820558 540038
14797 540038 466149 339135 355246 476136 189107 431376 561805 451611 256947 467698
14787 467698 541572 689596 483060 730319 209142 338296 555359 222656 521118 291403
14777 291403 544695 566909 616802 216468 630450 450681 245822 459242 651224 288070
14766E86229J22775l17467K68779j83517J23631B01043K58657j63688J35993K47980
14756F79985J30615j71798j78580A34974N83758k6575k20233K11458m6075r4101
14746E43206L5873A59278K41000K66628k84354K71311R7363P8581l16135j42460
14736C71212K75765k53368K38810L930k20259J93821J6408L0508n1636J01993
14726G07184C21978R3709L19871l38781Q4132L97301k93064K51740R9034p0271
14716H65649p7939l9082L9451l5744k2352j86153k65496M87374k6321J03725O3935
14705I07047k79941m1515M87800m67878P1795k04288M78950n4270k1136j64444
14695G12120J68174M0312j82075J39616k34324k16035L69255k74904K19409J13163
$$ plain form
14766 586229 709004 391537 660316 476799 600430 201043 459700 296012 432005 679985
14756 679985 810600 638802 460222 134974 718732 692157 471924 683382 637307 543206
14746 543206 579079 159278 400278 666906 382552 653863 751226 829807 513672 371212
14736 371212 646977 393609 632419 636349 416090 609911 626319 656827 605191 707184
14726 707184 321978 415687 735558 396777 480909 878210 585146 836886 935920 865649
14716 865649 787710 748628 788079 752335 729983 543830 278334 765708 739387 843112 907047
14705 907047 627106 585591 1073391 605513 677308 473020 951970 897700 876564 712120
14695 712120 880294 920606 738531 878147 643823 427788 797043 522139 741548 854711
14685H54711o2361R4504j48001J03156j95243k6697L08990N1832k98230J41595
14675H24256o1366J34920R6160P8058E18447L83092j64153K53193j74408K7538
14665H43709R9050k73460M15312l3854L3777k60999L75564k15961j82201N7645
14655H58582p294j69777K99749K25805k02973J01869j13330m1854j1810R9634
14645A038601E08771O28409J09594k9419k76853M15265j10107l48090k31869M17556
14635A083257m711J30921J5958l61561J73678K88602k81979K31094N4942k03124
14625A127077K10013j81225j70622n5854L77928l54755K70729J2635J42701j90836
14615A187791N5030k00118J44362J66024j63357K85519p0010N2526k15126n9872
$$ plain form
14685 854711 792350 886854 738853 842009 646766 620069 929059 980891 682661 824256
14675 824256 762890 897810 993970 1072028 518447 901539 737386 990579 816171 843709
14665 843709 942759 669299 1084611 1050757 1084534 823535 1199099 983138 800937 858582
14655 858582 851288 681511 981260 1207065 1004092 1105961 992631 950777 938967 1038601
14645 1038601 508771 1137180 1246774 1217355 940502 1355767 1245660 897570 665701 1083257
14635 1083257 1078546 1209467 1225425 863864 1037542 1326144 1044165 1275259 1330201 1127077
14625 1127077 1337090 1155865 985243 929389 1307317 952562 1223291 1235926 1378627 1187791
14615 1187791 1242821 1042703 1187065 1353089 1189732 1475251 1405241 1457767 1242641 1182769
14605A182769J37310L48685J9150m54949K34458k53794M30361k97551k6589J69280
14595A489130R3257J88440l61462K15541j50123K03401l10313N00771l52429K41448
14585A757661o89378M51919J77952J07933j14642J1726J50823n1262M3515j43043
14575A703204j01661J34057J286k25165L15650p5300L39091m1716j87097M60599
14565B322948n36722P34093n04739K06427o8501J6647K41215p9306M37011k89415
14555B479658m7481P09052j24437M99459K80809J105479J594760L730570Q197850
14546A8425719K0830865O087879A9313666r499875D143566j733729k99343j66442
14538A944052K9976l49106K43775N4459N1902k6979k59598M9561J22775K47444
$$ plain form
14605 1182769 1320079 1668764 1687914 1232965 1467423 1213629 1643990 1346439 1319850 1489130
14595 1489130 1582387 1770827 1409365 1624906 1474783 1678184 1367871 1868642 1516213 1757661
14585 1757661 1068283 1520202 1698154 1806087 1691445 1703171 1853994 1802732 1846247 1703204
14575 1703204 1601543 1735600 1736886 1511721 1827371 1752071 2091162 2049446 1862349 2322948
14565 2322948 1786226 2520319 2015580 2222007 2153506 2170153 2411368 2332062 2769073 2479658
14555 2479658 2432177 3141229 3016792 3516251 3797060 4902539 6497299 10227869 18425719
14546 18425719 39256584 45344463 19313666 9813791 4143566 2409837 2110494 1944052
14538 1944052 1974028 1624922 1868697 1923156 1975058 1948079 1688481 1738042 1860817 2108261
14528B108261j35731N0419k15101J61292J73188k44948N9007K33472k05596Q1332
14518B065595j33584L65738L47938l20502p2357Q9033l1068n0661L16078j13468
14508B462742l06897J59277J58684m21564J00784M89944k30879J53773K00903
14499B766767o6163k16401J74629j50330L47356P7138J3392j06928L91613m62218
14489B768855L6142J44170L48379j31995J8347m63494L82056L10965p0491j20339
14479C222595J46521J32026k92954L93828o4200l8889J81956J46247m36284J54944
14469C545790K48362J1396J90412o6772J05755m0631K91462m16546O72L14776
14459D184676N07017l09226K7766J92386P3978n12888L36191N1512P8454K2497
$$ plain form
14528 2108261 1972530 2022949 1807848 1969140 2142328 1897380 1956387 2189859 1984263 2065595
14518 2065595 1932011 2297749 2645687 2325185 2252828 2341861 2310793 2260132 2576210 2462742
14508 2462742 2155845 2315122 2473806 2052242 2153026 2642970 2412091 2565864 2766767
14499 2766767 2700604 2484203 2658832 2508502 2855858 2932996 2946388 2839460 3231073 2768855
14489 2768855 2804997 2949167 3297546 3165551 3183898 2720404 3102460 3413425 3342934 3222595
14479 3222595 3369116 3501142 3208188 3602016 3537816 3498927 3680883 3827130 3390846 3545790
14469 3545790 3794152 3805548 3995960 3929188 4034943 3994312 4285774 3869228 3869900 4184676
14459 4184676 4691693 4382467 4410233 4602619 4676597 4163709 4499900 4551412 4629866 4652363
14449D652363K68094j97269M16006o41414O22799k56384K66001j5277K93384J24371
14439E532674l03033K34918K12648k78252J24170J91591l55477N87097j19743
14430E826593J12139L79888j16163k14617K31253J67599R4224K16224r1221M04669
14420G010588k64299M22429j76244j21121M95150K58798j13577n7349L16120n0538
14410G719957J42365K9587R6743N56095R5436j5562p3251K04305J30300J85222
14400I071197J38413K10893J0060K09122k85270N66631K38446J56230J17858K40459
14390A0674039J5377p0500M74138O0835L61027L87317J9054p8153M93482L31575
14380A2668191j84083K98648M43031K28901J13419K37712J31583O38181j44390
$$ plain form
14449 4652363 4920457 4723188 5139194 4497780 5120579 4864195 5130196 5114919 5408303 5532674
14439 5532674 5229641 5464559 5677207 5398955 5523125 5714716 5359239 5946336 5826593
14430 5826593 5938732 6318620 6202457 5987840 6219093 6386692 6480916 6697140 6605919 7010588
14420 7010588 6746289 7168718 6992474 6871353 7366503 7625301 7511724 7454375 7770495 7719957
14410 7719957 7862322 7891909 7988652 8544747 8640183 8624621 8551370 8755675 8885975 9071197
14400 9071197 9209610 9420503 9430563 9639685 9354415 9921046 10159492 10315722 10433580 10674039
14390 10674039 10689416 10618916 11093054 11153889 11514916 11902233 11921287 11843134 12336616 12668191
14380 12668191 12484108 12782756 13225787 13454688 13568107 13805819 13937402 14575583 14431193
14371A4431193L41292Q5675O78030L4686M52887L95309K33965L68337L91400L60552
14361A7773326L55167M74798L90706M16558O41443J59159K87981Q68714M73513
14352B1841365M97740L52312O86383M91623Q08714N57180O76723M66852Q35644
14343B7214536P74454P09398O95690M67706Q72690P53656J253520Q19524Q06617
14334C4367791J096797J288999J071197R52766J812095J118826J321689J101221
14326D4131381J719672J257364J790233J462561K045315J811939J910217K247107
14318E8375789J657240K577418K415742K221050L108796K483262K982814K847679
14310G8669790L676063L391577L791689L753652M251888M439148M744670M833709
$$ plain form
14371 14431193 14772485 14858160 15536190 15570876 16023763 16419072 16653037 17021374 17412774 17773326
14361 17773326 18128493 18603291 18993997 19410555 20051998 20211157 20499138 21367852 21841365
14352 21841365 22339105 22691417 23377800 23869423 24678137 25235317 25912040 26378892 27214536
14343 27214536 27988990 28698388 29394078 29861784 30734474 31488130 32741650 33561174 34367791
14334 34367791 35464588 36753587 37824784 38777550 40589645 41708471 43030160 44131381
14326 44131381 45851053 47108417 48898650 50361211 52406526 54218465 56128682 58375789
14318 58375789 60033029 62610447 65026189 67247239 70356035 72839297 75822111 78669790
14310 78669790 82345853 85737430 89529119 93282771 97534659 101973807 106718477 111552186
14302A11552186N348807N676194O132175O456916O391471P505978P777043Q337118
14294A65177888Q669329R286340J0405722J0579236J1413089J1492943J3321395
14287B40345942J2941328J4299526J4395552J5794039J5898078J5789254J6621512
14280C46085231J6666795J6274446J5721653J4982019J4147991J2778194J0983951
14273D47640280Q194186M132985K354800J318619L61416j277965k224611o913413
14265D53586297r987654j1498946j3988339j5230620j5844231j6218038j6694786
14258C54123683j7005314j6343496j6257832j5951522j3845012j4160984j3561309
14251B46998214j3552394j2017759j1739055j1267023j0251368r738833r197060
$$ plain form
14302 111552186 116900993 122577187 128709362 135166278 141557749 149063727 156840770 165177888
14294 165177888 173847217 183133557 193539279 204118515 215531604 227024547 240345942
14287 240345942 253287270 267586796 281982348 297776387 313674465 329463719 346085231
14280 346085231 362752026 379026472 394748125 409730144 423878135 436656329 447640280
14273 447640280 455834466 459967451 462322251 463640870 464002286 462724321 460499710 453586297
14265 453586297 443598643 432099697 418111358 402880738 387036507 370818469 354123683
14258 354123683 337118369 320774873 304517041 288565519 274720507 260559523 246998214
14251 246998214 233445820 221428061 209689006 198421983 188170615 178431782 169234722
14244A69234722q094153q115264p878629o909038o713508n985006n598901n412336
14236A14527887n209529n109331m696240m310007l682460l409576l603582m006177
14228H0500985k891966k963349l298350k819644k494996k125810k401586k359132
14220E9146152j865205k014862j992051j825154j586120j691280j214632j343469
14212D5613379j588273j164936j761264j220125r19939m09156j121731j762368
14204C5665587o31433j235757p07010r15945q42495p73627j034461q95577n32593
14195B8096689o43233n59783o14585r34299n87137n89796m74715l15268r77205
14186B2400668l18007p78081k85691l48128m79098q65736J68512j085602j65486
$$ plain form
14244 169234722 161140569 153025305 145146676 138237638 131524130 125539124 119940223 114527887
14236 114527887 109318358 104209027 99512787 95202780 91520320 88110744 84507162 80500985
14228 80500985 77609019 74645670 71347320 68527676 66032680 63906870 61505284 59146152
14220 59146152 57280947 55266085 53274034 51448880 49862760 48171480 46956848 45613379
14212 45613379 44025106 42860170 41098906 39878781 38958842 38549686 37427955 35665587
14204 35665587 35034154 33798397 33091387 32175442 31332947 30559320 29524859 28629282 28096689
14195 28096689 27453456 26893673 26279088 25344789 24757652 24167856 23693141 23377873 22400668
14186 22400668 22082661 21304580 21018889 20670761 20191663 19325927 19494439 18408837 18243351
14177A8243351m23007j97255m25891k72608l47320k03847m71740n09392j02610
14168A5289681n82068K35825l57972m76982k98506j47245k59586l62292k44337
14159A2796518j93072n05550J56470k95344j19100m11548m10846L3724l59460
14150A0691792K34783m37513j37402J56902l87457k73207l04002M76464o58572
14141I361788o1200k21362J5299n0394k19733j60744k65163L22233m69734k78160
14131G972830k17798L28914p1213n06630o2969k24637J18743o5345m67335J02003
14121F906563j53321j3014J16257j81512j8358k81732K58051o13883M00265m73808
14111E945508J22098k00549M5141j75194R190P1333j88194k7284J6922j23669
$$ plain form
14177 18243351 17820344 17623089 17197198 16924590 16577270 16373423 15901683 15392291 15289681
14168 15289681 14707613 14943438 14585466 14108484 13809978 13662733 13403147 13040855 12796518
14159 12796518 12603446 12097896 12254366 11959022 11839922 11428374 11017528 11051252 10691792
14150 10691792 10926575 10489062 10351660 10508562 10121105 9847898 9543896 10020360 9361788
14141 9361788 9300588 9079226 9094525 9044131 8824398 8663654 8398491 8720724 8250990 7972830
14131 7972830 7755032 8083946 8012733 7506103 7443134 7218497 7337240 7271895 6804560 6906563
14121 6906563 6753242 6740228 6856485 6674973 6656615 6374883 6632934 6019051 6419316 5945508
14111 5945508 6067606 5867057 5912198 5737004 5746194 5817527 5629333 5602049 5618971 5495302
14101E495302Q2112k25112l54565K36191j51227J79125j50078k08382K61824k90386
14091D874804j99495m68k13478q7275L10344j93341p1710L67380m40118J76914
14081D523557Q593k38112l58763L41556l00031J07178n2766J47408m26602l0737
14071C721281j17110K52644k07770l3958K45648k36306j08477O3599k21716L89357
14061C747192J2029m28726L28990J6342m23883K97788m37551J62197k18168k39878
14051B816332L12543n2454J18589K9002N4253l39797O7557q7010K29675l53454
14041B795236j66384j7183L8777K26216k52418R3328J5157r8009J15888N8275
14031B808883J1710m2718m15549K51709O0970k65705J10313o2198J96949m40312
$$ plain form
14101 5495302 5577414 5352302 4997737 5233928 5082701 5261826 5111748 4903366 5165190 4874804
14091 4874804 4675309 4674841 4461363 4374088 4684432 4491091 4419381 4786761 4346643 4523557
14081 4523557 4532150 4294038 3935275 4276831 3976800 4083978 4031212 4178620 3752018 3721281
14071 3721281 3604171 3856815 3649045 3615087 3860735 3624429 3515952 3579551 3357835 3747192
14061 3747192 3759221 3330495 3659485 3675827 3251944 3549732 3112181 3274378 3056210 2816332
14051 2816332 3128875 3076421 3195010 3224012 3278265 2938468 3006025 2919015 3148690 2795236
14041 2795236 2628852 2611669 2650446 2876662 2624244 2717572 2732729 2634720 2750608 2808883
14031 2808883 2820593 2777875 2362326 2614035 2675005 2409300 2519613 2457415 2654364 2214052
14021B214052M64095J358l79236j87642J91634j08403N30323k34133k92469K8814
14011B228393j94126J12479J70645j84567J66772k21527m73657M24828o7767R5754
14001B057227k16729J69700M8178k14191q3185K067k85090J70467J36158L063
13991A787665J65465P0664P78314K564842O702661J9645259J6658269k3753553
13983B4619586A1497099m685422j961928r41908l19317l16480j04984p35965J4444
13974B445539M41454o67942J90834m267P7597l64483N0349k58810K061j64585
13964A747747N34152n26019K83189q6826J35628k07835j60128j8974K97688m29503
13954A569119L37454l11367J73614J28874m00465M73487k06516J7061O9488O9195
$$ plain form
14021 2214052 2678147 2679505 2300269 2112627 2304261 2195858 2726181 2492048 2199579 2228393
14011 2228393 2034267 2146746 2317391 2132824 2299596 2078069 1604412 2029240 1961473 2057227
14001 2057227 1840498 2010198 2058376 1844185 1761000 1763067 1477977 1648444 1784602 1787665
13991 1787665 1953130 2023794 2802108 5366950 12069611 31714870 48373139 24619586
13983 24619586 11497099 6811677 4849749 3907841 3588524 3272044 3167060 2431095 2445539
13974 2445539 2886993 2219051 2409885 2405618 2483215 2118732 2169081 1910271 1912332 1747747
13964 1747747 2281899 1755880 2039069 1952243 2087871 1880036 1719908 1700934 1998622 1569119
13954 1569119 1906573 1595206 1768820 1897694 1497229 1970716 1764200 1781261 1850749 1919944
13944A919944l88911J52203J73451n61594K63231L49530k41599m57424M19632
13935A628463l44597P14J56168r8807K65693L855m37520O89321n13987k3949L60637
13924A685991k15213k12768J49647J17196j46167O0481j24868p6069j64809K59617
13914A333038k64428N1306K58283l7939k76875J24793m4965l6081K49880j25806
13904A231206K34536k52392k76948L34318l02451l12201O39613k32246K09590
13895A273025j42771J17261j01321K6246k58984j3295K57826j10208J39540k12517
13885I74802L2761Q9579l16233J74994K50867l82502R7756K24319j07756j93127
13875H45460n6669J66388J4714J55135l15816M12962j68104J36743L9047l43916
$$ plain form
13944 1919944 1531033 1683236 1856687 1295093 1558324 1907854 1666255 1208831 1628463
13935 1628463 1283866 1284580 1440748 1341941 1607634 1611489 1173969 1863290 1349303 1325354 1685991
13924 1685991 1470778 1258010 1407657 1524853 1378686 1439167 1314299 1238230 1073421 1333038
13914 1333038 1068610 1119916 1378199 1340260 1063385 1188178 1143213 1107132 1357012 1231206
13904 1231206 1465742 1213350 936402 1270720 968269 656068 1295681 1063435 1273025
13895 1273025 1130254 1247515 1146194 1172440 913456 900161 1157987 1047779 1187319 974802
13885 974802 1007563 1097142 780909 955903 1206770 824268 922024 1146343 1038587 845460
13875 845460 788791 955179 969893 1125028 809212 1222174 1054070 1190813 1229860 885944
13865H85944r2165j28887J64225j06022K60507j09843m9357J55842K94280k85826
13855I88698k46261L39629l01902L8214J02223n592P8613q3793m0196r9549k4335
13844G45749M63362j37268m25419O07955m29232K80245l50947j77827J71453L33130
13834A081201k31590n553K26235k58045j54265J45719R9433k5792n662k20990
13824F50691K77976l09796N29304j64958k81259j41922P4195K20322l1162r0403
13814G32988J49643l83075J15135o6526K4311J23673q2184l2053K31240j77237
13804F35915k0642L8178j31589O06023E17223M37693j04454k08479B53055M82768
13794G35823L3957j06306j93261K6228J4813K93178j49271N05K26844C96420L06278
$$ plain form
13865 885944 793779 664892 829117 723095 983602 873759 824402 980244 1274524 988698
13855 988698 742437 1082066 780164 818378 920601 915009 993622 909829 869633 770084 745749
13844 745749 1209111 1071843 646424 1254379 825147 1105392 754445 576618 748071 1081201
13834 1081201 849611 844058 1070293 812248 657983 803702 903135 877343 871681 650691
13824 650691 928667 618871 1148175 983217 701958 560036 634231 854553 823391 732988
13814 732988 882631 499556 614691 548165 572476 696149 613965 581912 813152 635915
13804 635915 615273 653451 521862 1127885 517223 954916 850462 641983 253055 735823
13794 735823 769780 663474 470213 496441 511254 804432 655161 655666 882510 396420 702698
13783G02698K1937j49465K02041C78324L46195j63132K49706j87016B76194L74754
13773F50948R7908j39980n9090J20176m4446K58626l98952J89943l2519A99771
13762H07052k27735P0742j20535r5534A68305M05632M2584A65825N46812n2243
13752F60394J49240j45154m1121P016B64411M52446k90121J6225K08335j10473
13742E40823m4434K18679C56376L86525l8094l35442O9870M1609r2595J44339
13732E32588r415j78223K16189B12596M04433J17350j88770M10158D53601J57210
13722F10811k62543M00878C53671J01658K5451n9088j60297K14096J9893k42499
13712B52885Q1101R0241P2458j2141B32966J87523l1050j4348K0451M0386J89851
$$ plain form
13783 702698 724635 575170 777211 378324 724519 561387 811093 624077 276194 650948
13773 650948 748856 608876 549786 669962 625516 884142 485190 675133 642614 199771
13762 807052 579317 650059 529524 433990 168305 573937 616521 165825 712637 660394
13752 660394 809634 664480 623359 630375 264411 716857 426736 442961 651296 540823
13742 540823 496389 715068 356376 742901 704807 369365 439235 480844 388249 532588
13732 532588 523173 344950 561139 212596 617029 734379 545609 955767 453601 610811
13722 610811 348268 749146 353671 455329 480780 421692 261395 475491 495384 252885
13712 252885 333986 424227 496685 484544 232966 420489 389439 375091 395542 435928 625779
13701F25779k52273j56964N3585M10554j80040k8234j56498J82260n5404j17887
13691C24878J87111A90418R3010L25547k91381K71376A85484J00295M4219L80082
13681G10080j7636j47126o504k24751j9980l3842J70376j57650J85529j59466
13671B99030K32990B11241O239J18675Q2797P5129j23590N2926j19308K60966
13661E65075q3304P9668B70934k5557L43577B33088K41942A62365J32360N8705
13651C53430M3262k5161j16798J14166J12611K03992k18353A98629k5838L2674
13641B05465N91102B44548K32750j26190K19319k71960J42451O1838j14653r823
13631C78280b3635D38520p2215A00327J61699J87225L3626D1931L56223O2060
$$ plain form
13701 625779 373506 216542 270127 680681 500641 472407 315909 498169 442765 324878
13691 324878 511989 190418 283428 608975 317594 588970 185484 285779 329998 710080
13681 710080 692444 545318 538814 314063 294083 260241 430617 272967 458496 299030
13671 299030 532020 211241 217480 336155 418952 494081 370491 423417 304109 565075
13661 565075 481771 561439 270934 245377 588954 233088 475030 162365 294725 353430
13651 353430 396692 371531 254733 368899 481510 685502 467149 198629 172791 205465
13641 205465 796567 244548 477298 351108 570427 298467 440918 502756 388103 378280
13631 378280 -23635 438520 366305 100327 262026 449251 482877 41931 398154 460214
13621D60214G4876K31681R2r1799a13947E35266k10488A23544K99134j6434B5496
13609D70379A26383L53144B35043l2345J4448J28607n1702j1453K88481j03471
13599D67608j40723q1186K86835j96694O2261M8089k01981r8360Q5249r6619K37765
13588C72244J1248j06202M9227j12149n8613m7964K96635O6928k06669o9560d1140
13576C71386A36045L18642I0958J58131M7581B4567n603N09765B39079l1408K4535
13565B32206J44282j84190K76103A61446K48334g4936B59705p64r6439L66930
13555E29432q0641I1561L33136j17986n3386N3741j7025O6868j33029L1076J89917
13544D44873D057N32079l66M9186k43507A40002F3031O7184J17829J42008f6469
$$ plain form
13621 460214 74876 306557 306649 214850 -113947 535266 324778 123544 422678 406244 25496
13609 470379 126383 479527 235043 202698 217146 345753 294051 282598 571079 467608
13599 467608 326885 245699 532534 335840 398101 446190 244209 145849 231098 134479 372244
13588 372244 383492 277290 326517 214368 155755 107791 404426 471354 264685 195125 -41140
13576 371386 136045 454687 90958 249089 296670 24567 18964 528729 239079 207671 232206
13565 232206 376488 192298 468401 161446 409780 -74936 259705 258941 162502 529432
13555 529432 448791 91561 424697 306711 253325 307066 290041 356909 223880 254956 444873
13544 444873 4057 536136 535770 584956 341449 140002 63031 130215 248044 390052 -66469
13532B27860k4667R9444n4925K2558J26956a7585o4940A6697J90714O4575m9949
13521B22037O4735j2873o483o9659J13369m654J86260j43032B498L50885J33441
13510D86824A83711D1709N46947j01981k30962A0857K88068A4360M12396j53215
13500B73541j9023N7924J44943o9409j65676o789P0973A32701m2282o657K72441
13489C56203R281A46974M80977E8797J12619a00406B46752q2238N1841m0148m6333
13478A29874d9226D22245o9935j24980J01405k9679A29152P1301q3477L28071
13468D45047I5527K00541d5110D00815j53916C2807K50387K902c1375A23149J56087
13457B79236a55932C51759J0701j10206k0971K0682J61883q1308E9440N13948
$$ plain form
13532 227860 203193 302637 247712 270270 397226 -17585 -82525 16697 207411 271986 222037
13521 222037 286772 273899 267416 197757 311126 306472 492732 349700 2498 353383 486824
13510 486824 183711 41709 588656 486675 255713 10857 298925 14360 426756 273541
13500 273541 254518 312442 457385 387976 222300 215511 286484 132701 90419 83762 356203
13489 356203 365484 146974 627951 58797 171416 -100406 246752 164514 216355 176207 129874
13478 129874 -49226 422245 352310 227330 328735 299056 129152 200453 116976 445047
13468 445047 95527 296068 -45110 400815 246899 32807 283194 286096 -31375 123149 279236
13457 279236 -155932 351759 362460 252254 231283 251965 413848 332540 59440 573388
13447E73388H6232K50890A09937J31924l8708J6082K71587k14795L93642a9982
13436B3623L2503d5309C91198j19225p13A00806a99485A92720h1548B05865C7022
13424G538L19522a37469B87734q3665g8185H9022K26510B0841K80953g1200G8387
13412A3335M00963L3570j27098G9941L9218B3375J85800p2552N5206L8970M0034
13401B70833A12027d5303l2084C31891I6343J51928H7901f059E02665E8087P5840
13390A33927I255i6499A80391i7054B70172A33326L50313A35234J98738a30192
13379A900J64823E3930J98667q9601E1191K61317r6773r4782J90824j33069l5800
13368A42908c0430E0364R5820f0858F4067J20079K68782A39930B2537J57097F8098
$$ plain form
13447 573388 86232 337122 109937 241861 203153 219235 490822 276027 669669 -19982
13436 23623 56126 -45309 391198 271973 271260 100806 -199485 192720 -81548 205865 37022
13424 7538 327060 -137469 287734 204069 -78185 89022 315532 20841 301794 -71200 78387
13412 13335 414298 447868 320770 79941 119159 23375 209175 136623 191829 230799 270833
13401 270833 112027 -45303 -77387 331891 96343 248271 87901 -6059 502665 58087 133927
13390 133927 9255 -96499 180391 -97054 270172 133326 483639 135234 333972 -130192
13379 1900 166723 53930 252597 162996 51191 312508 215735 120953 311777 178708 142908
13368 142908 -30430 50364 146184 -60858 64067 184146 452928 139930 22537 179634 68098
13356C7516O31306B78572b5811B90780K00555A00715J06785r0139L70163J52946
13346F40470B66711L9303J4035l2812j04262K01331J81438k59125G9673L03073
13336C82746M456p0575g022F9354K24948o4865J44690A02043M42689A69293M1316
13325B10609J34022A26618D7151J48158a17519A06605O9325K77709A42791b32404
13314B24298o5767J68269Q6057j95418m6398b0725j05118M993A8125c96227A09998
13302A11314B6250i4293A76574l7537R0563q3882a6145A09177L17893j87069A18242
13290B84763B2143L18070m7186F8760k7775M16101A2886M21883A84484m3487g9995
13278c07360Q2448A46770i4581G2047o378b27706i8502r2805H2655J39272m8741
$$ plain form
13356 37516 668822 278572 -25811 290780 491335 100715 207500 117361 487524 640470
13346 640470 266711 306014 320049 287237 182975 384306 565744 306619 79673 382746
13336 382746 387202 316627 -7022 69354 294302 229437 374127 102043 544732 169293 210609
13325 210609 344631 126618 47151 195309 -117519 106605 175930 453639 142791 -232404
13314 224298 158531 326800 412857 217439 171041 -20725 -125843 -120850 18125 -396227 109998
13302 111314 26250 -94293 176574 139037 229600 145718 -16145 109177 427070 240001 118242
13290 284763 22143 340213 293027 68760 40985 457086 12886 434769 184484 140997 -79995
13278 -307360 -224912 146770 -94581 72047 65669 -227706 -98502 -191307 82655 221927 173186
13267A73186h9744A37520c09299B5079J84168q4825m6197M770a11668D5390N9168
13256A04558L18460A23391c4323B56521o1267k9301i7639B13940q6973b70646
13245B17723d0926l18085B21275J05973G9024B3680a00048A05432a44115e1692
13234e032B44070M1255j14938o7689J70070b62383A37187a5362D3939J40098M6946
13223B30983C3653b60604g3650D8588K76992j59129L9996O0897p7712F6145J05790
13212A71935f5427A84857K43915G274K07104K5654q1955J17361d1472A33177l0839
13201A02338R5635E3356R5841o8570K26706A18488K25310H3895d4744g355C73539
13189B51901l3425j02529R0438K6913b7579c460B96271R0723H2339b63442B23232
$$ plain form
13267 173186 -89744 137520 -309299 25079 209247 124422 78225 82995 -111668 45390 104558
13256 104558 423018 123391 -34323 256521 195254 165953 -97639 213940 126967 -270646
13245 217723 -40926 -359011 221275 327248 79024 23680 -100048 105432 -144115 -51692
13234 -5032 244070 285325 170387 102698 272768 -262383 137187 -15362 43939 184037 230983
13223 230983 33653 -260604 -73650 48588 325580 166451 206447 267344 189632 66145 171935
13212 171935 -65427 184857 428772 7274 214378 240032 158077 275438 -41472 133177 102338
13201 102338 197973 53356 149197 80627 307333 118488 343798 83895 -44744 -7355 373539
13189 251901 218476 115947 206385 233298 -27579 -3460 296271 386994 82339 -263442 223232
13177E2934c7382A01367a06968C59905d6194j09830D16420A959J19934J08308
13167B30201b9553q4506C93418j16475J7718I8181K04611d01493B043d2307O105
13156c6202B78558E6083a77245N0225C23253A01178C3066Q6633b09399C4992M6092
13145H1084a31615j45277A81451p6558B3098a519l20049B54630j03984k9012K51431
13134C73065A8532d2946C74139f1672H0740a30672B04201l8376C6804P7898a6881
13122A65959a05535A52856a32221B04510P3659A19707e5701H6440j0555K73823
13112C49708c8510b824A91116k7995f4240B18007G7105a70102O7963a8873m2452
13101f1325k49070a28503A40736a42399D0196K33373j14479Q0963a91074A78701
$$ plain form
13177 52934 -37382 101367 -106968 359905 -46194 -156024 416420 1959 121893 230201
13167 230201 -29553 -114059 393418 276943 294661 98181 302792 -401493 2043 -42307 -36202
13156 -36202 278558 56083 -177245 -127020 323253 101178 33066 119699 -209399 34992 81084
13145 81084 -131615 -276892 181451 104893 23098 -1519 -321568 254630 150646 121634 373065
13134 373065 18532 -42946 374139 -61672 80740 -130672 204201 165825 36804 114702 -16881
13122 165959 -105535 152856 -132221 204510 278169 119707 -55701 86440 75885 349708
13112 349708 -38510 -2824 191116 163121 -64240 218007 77105 -170102 -102139 -18873 -61325
13101 -61325 -310395 -128503 140736 -142399 40196 273569 159090 240053 -191074 178701
13090c2332C78302C6449J59417a6633B40469D2178R9845E77M747P2663h1945B4026
13077a14576A2001a3500C44283c7064A3499i7944E25920D4147O6974g9867D8958
13065B44110a36912e4735C5604R8012a57849n4560F7463J7104J8953i920A30417
13053c37882A99842G7700J83157C7532J26837F5473J02570R2232P736H4405b66100
13041d3475b0530F2079A6421J68266f2450A5702L31773j21438A2250K41008b26770
13029b2452o4714q0451I3364j4945i0003B43656m910C3779J90440H5846K75059
13018C60905A29601n604m0492g8996A56076J19941j20939O9664A8226R736b96803
13006b6770B83324A05781b13224A28228a30951q6267A52506J84324n3826j09817
$$ plain form
13090 -32332 378302 36449 195866 -16633 240469 42178 142023 577 5324 77987 -81945 24026
13077 -114576 12001 -13500 344283 -37064 13499 -97944 525920 44147 111121 -79867 48958
13065 244110 -136912 -54735 35604 133616 -157849 -212409 67463 84567 103520 -9920 130417
13053 -337882 199842 77700 260857 37532 164369 65473 168043 260275 268011 84405 -266100
13041 -43475 -20530 62079 16421 184687 -62450 15702 347475 226037 12250 253258 -226770
13029 -22452 -87166 -167617 93364 78419 -90003 243656 238746 33779 224219 85846 360905
13018 360905 129601 123997 83505 -78996 156076 276017 155078 224742 18226 27962 -296803
13006 -26770 283324 105781 -213224 128228 -130951 -217218 152506 336830 283004 173187
12996A73187m7823b6207j1126A01464K67616H5380j9205C3038R9312a8169B78271
12984E17731a258A39234J8047n9202J22671e9807j8856A16656D5574J10318a19969
12972B81372j00987a74639B01069q2827a09552j0510B76683c5352j33085A96288
12961C8820j4052J83609r4115f7048j2962C36173a37968k2620B33485a39494B59442
12949G6250a42503j26862G2833M2638n7674c46187e3151D27772f1418A62664i2622
12937g4506I5910b04478g2751B18227b16418L8880A8599a01602k7107A7011K14427
12926B31438b40523e7610q73C26764A20048i4468A64999a85550D4988L8516K2659
12915A06163l3046A8882J06823Q5858N2605a05234j7286B14331g4096j66841E468
$$ plain form
12996 173187 125364 -26207 -37333 101464 369080 85380 66175 33038 132350 -18169 278271
12984 517731 -1258 139234 157281 98079 220750 -59807 -78663 116656 45574 155892 -119969
12972 281372 180385 -174639 201069 118242 -109552 -120062 276683 -35352 -168437 196288
12961 38820 24768 208377 114262 -67048 -80010 336173 -137968 -160588 233485 -139494 259442
12949 76250 -142503 -269365 72833 115471 57797 -346187 -53151 427772 -61418 162664 -92622
12937 -74506 95910 -204478 -72751 218227 -216418 -177538 18599 -101602 -128709 17011 231438
12926 231438 -240523 -57610 -58483 326764 120048 -94468 164999 -185550 44988 83504 106163
12915 106163 73117 18882 125705 211563 264168 -105234 -122520 214331 -74096 -240937 5468
12903A1789A19J31581a4987B55679k0161F1798L00190f450n60761a39804f8012
12891G4291j887a74800G1507A3243K96337c25450A7790O1906g2621L2194J3844
12880b6583B56940F8189b33167B8427e6288G7406j4042i9671E6985b52210A44788
12868b4568A16428n0963B0738L90888A02221R7361f0056E7540a06027A11701n4101
12857E7600a95174A32933J04530a9615o2524B9318J10755Q2701H5716K0988J22960
12846B29664a47312C72614a29708E3828L3159e1663p6245D57558A84928H8404
12835G180e9081D5539c6846I7086a58303C72857b15031A10404J08679b74304a35599
12823D2261b87983d8919j9969m7711A7961J53512i4380I4613i5556C88824A02052
$$ plain form
12903 11789 119 131700 -14987 255679 235518 61798 361988 -6450 -567211 -139804 -68012
12891 74291 72404 -174800 71507 13243 309580 -325450 17790 79696 -72621 -40427 -26583
12880 -26583 256940 68189 -233167 28427 -56288 77406 63364 -99671 56985 -252210 144788
12868 -24568 116428 65465 20738 411626 102221 199582 -60056 57540 -106027 111701 57600
12857 57600 -195174 132933 237463 -19615 -82139 29318 140073 222774 85716 106704 229664
12846 229664 -147312 372614 -129708 53828 86987 -51663 -127908 457558 184928 88404
12835 7180 -59081 45539 -36846 97086 -158303 372857 -215031 110404 219083 -274304 -135599
12823 42261 -287983 -48919 -68888 -116599 17961 171473 -94380 94613 -95556 388824 102052
12811b15124e202o4102r6404A10198O372n3532J16114a15907j51471E7847K9991
12800H7838K3297J87093A0897K14519N9150j1534a31839B89885A14516g485j04128
12789a11613A72935c165j9124F6464a92082N0276O8985B14313a33938N7217j2528
12778h9249A04157D326e3442A15079k1367c17661a57970N9274A49749E7842J42567
12767B00409p1333O4899B0613J8787Q8918a61922B89721c57554B43102c0852B14838
12755b21531B31878p9126B9278g2649j07520I1068l7288c61488q7064a7606l4626
12744e2232D9597a23719C23674A07037J33667Q6367b01873d8786G749a57767A46934
12732A41288k6931O3401a23690q0037O3750M5675j71734l7260E4093J07854P7958
$$ plain form
12811 -215124 -5202 -69304 -165708 110198 116570 63038 179152 -115907 -267378 57847 87838
12800 87838 111135 298228 10897 225416 284566 273032 -131839 289885 114516 -7485 -111613
12789 -111613 172935 -3165 -22289 66464 -192082 -141806 -72821 214313 -133938 -76721 -89249
12778 -89249 104157 4326 -53442 115079 93712 -317661 -157970 -98696 149749 57842 200409
12767 200409 129076 193975 20613 39400 128318 -161922 289721 -357554 243102 -30852 214838
12755 -221531 231878 152752 29278 -72649 -180169 91068 53780 -361488 -448552 -17606 -52232
12744 -52232 49597 -123719 323674 107037 240704 327071 -201873 -48786 7749 -157767 146934
12732 141288 114357 177758 -123690 -203727 -139977 -94302 -266036 -303296 54093 161947 239905
12721B39905a86178A5317K02988G3131e3133A27789h030C9803L6031L01222p5259
12710C01797G5531M58441B19637R6871g1568A50676O1009J41217p4028G0494i2878
12698a40885A64610J19756F3609a8496F2690Q7616g2878A10469J8463J58524h5098
12686H1155l8599K369M6366h8070B02456r8622a47964D17134j88085A992J1148
12675A3140M1467L42425G1081f8675B02253r3436A0154b44081A01654O2058i9038
12663A19962L1068P8876g6275a1587B36998F9977a18263H3106K3947J8865j3155
12652A12763A3792J27265h5146B33650H3109e8076F9114B0569N5975a3987j6902
12641c0889l923m6261E0856P7926J14127a62905H2924J2415L15964r0777E2051
$$ plain form
12721 239905 -186178 15317 218305 73131 -53133 127789 -8030 39803 75834 377056 301797
12710 301797 75531 533972 219637 316508 -71568 150676 211685 352902 278874 70494 -92878
12698 -140885 164610 284366 63609 -18496 62690 150306 -72878 110469 128932 287456 -85098
12686 81155 42556 44925 91291 -88070 202456 103834 -147964 417134 229049 1992 13140
12675 13140 54607 397032 71081 -68675 202253 108817 10154 -244081 101654 163712 -99038
12663 119962 151030 229906 -76275 -11587 236998 69977 -118263 83106 107053 125918 112763
12652 112763 13792 141057 -85146 233650 83109 -58076 69114 20569 76544 -13987 -30889
12641 -30889 -34812 -81073 50856 128782 242909 -162905 82924 95339 411303 320526 52051
12629e9846B90514j40430a5604j70917B04204J54272b9822A9458c5695B60210
12618H5024N4868b3844E2497j6980j1040a08997k52336J31459J10108q588M9976
12607g8378j75400A22963a20410E6113J54492a63393G4229a07420A69653M4672
12597B14325H1077i7397B05966b96235G8970e3863K4093E1316P1633L1286B6367
12585b95673B8436J08253J40255b3453I4794a69792M3697B94950D9979c24371
12574c0556A94407r0247b4575Q741D4927c0055A50099D1672Q2164A9202K68123
12563B87325B4986b75070e0084j33017j56364C00019a11758A6116J46210J65681
12553C28007d43002A82980e6812n4005k36384F3265i9344A84429c40691g9051
$$ plain form
12629 -59846 290514 150084 -15604 -186521 204204 358476 -29822 19458 -35695 260210
12618 85024 139892 -23844 52497 35517 24477 -108997 -361333 -229874 -119766 -128354 -78378
12607 -78378 -253778 122963 -120410 56113 210605 -163393 74229 -107420 169653 214325
12597 214325 81077 -97397 205966 -296235 78970 -53863 -29770 51316 122949 154235 26367
12585 -295673 28436 136689 276944 -23453 94794 -169792 -126095 294950 49979 -324371
12574 -30556 194407 104160 -24575 -15834 44927 -30055 150099 41672 123836 19202 287325
12563 287325 24986 -275070 -50084 -183101 -339465 300019 -111758 16116 162326 328007
12553 328007 -443002 182980 -56812 -110817 -347201 63265 -99344 184429 -340691 -79051
12542F2590K3704a9215A51979K70589F4544K019J70347b4199R247B5265a39153
12530b66155H550c3786I7082j1415E58M8337Q6277B2187g2053H6756a19882K90
12518a19592A26038D5205L5978f6062A59046m3975a39325d8325k33537R0985l6389
12507b27266A95685b9970l3468C02727E1532N1334J09628k8465b662A81794B564
12495G1062b4982B8306a05580C0L39567a73584a1767o8271d440k31110a07388
12483A51523a11100A397N5278A5651b13417m5336R2123j5065N3432C0275a5929
12471a59985e7545I1230a05599l644L4958E0129b84959l1303d3241A08518a77117
12459B23885E4902b22040A29801c02442C87717b12525M5366A09306K6032d18909
$$ plain form
12542 62590 86294 -19215 151979 422568 64544 66563 236910 -24199 -14952 25265 -139153
12530 -266155 8550 -33786 97082 85667 558 48895 135172 22187 -72053 86756 -119882 -119592
12518 -119592 126038 45205 81183 -66062 159046 115071 -139325 -48325 -281862 -190877 -227266
12507 -227266 195685 -29970 -63438 302727 51532 102866 212494 184029 -2662 181794 2564
12495 71062 -24982 28306 -105580 30 339597 -173584 -11767 -80038 -4440 -235550 -107388
12483 151523 -111100 1397 56675 15651 -213417 -258753 -166630 -181695 -128263 30275 -15929
12471 -159985 -57545 91230 -105599 -109243 -74285 50129 -284959 -316262 -43241 108518 -177117
12459 223885 54902 -222040 129801 -302442 387717 -212525 -167159 109306 135338 -418909
12448A19364j4549b13700D7634J08022M6405I0763K39774d12611h6306A40154
12437a41898a6819B24670d234A92743a62182c4o7402q5413A52385g5891K2p782
12425h3651o3544j71132J57366B07811N0731c7283e562n2412j66559A35904Q4238
12414B20142a33952A2998J11554J7089c35289J31426O3991K0067n3093G2721a82788
12402a06678D8301g6870k34198A13105a45899B3812c27031B4054P8097J02844
12392B04995a85823f3293P219A04913O1255j5554J11052j16737b64597J06284
12382a58313d90m3299J6611j80192p1663D2042a07595q8913G6353a22374B13921
12370A17972R3380b1412j94456B9171L6713b97401C255K73304a05668K6402G3666
$$ plain form
12448 119364 104815 -213700 47634 155656 202061 90763 330537 -412611 -86306 140154
12437 -141898 -16819 224670 -4234 192743 -162182 -34 -67436 -152849 152385 -75891 -75869 -83651
12425 -83651 -147195 -318327 -160961 207811 258542 -37283 -5562 -57974 -224533 135904 220142
12414 220142 -133952 12998 124552 141641 -335289 -203863 -139872 -119805 -172898 72721 -182788
12402 -106678 48301 -76870 -311068 113105 -145899 23812 -327031 24054 102151 204995
12392 204995 -185823 -63293 -56074 104913 166168 150614 261666 144929 -264597 -158313
12382 -158313 -490 -43789 -27178 -207370 -279033 42042 -107595 -196508 76353 -122374 213921
12370 117972 211352 -21412 -215868 29171 65884 -297401 3255 276559 -105668 -79266 73666
12358a57175e0662k83296J38213h1947B82713a12248C4702a09370a071m03679
12348d04750E9892a01490A9491c53008a1761B12684q995b95483F2236J47660a35175
12336a41057i805E9005a45781E1340P5123a981A3660L82168A3563a14495G3840
12324a3191C1369d9578A80474N7070b50345R0153B44050J36903h8648B10573D0922
12312G8070a49758A93522c99863J61823C20470h5179M0782D26117A93857h6074
12301A75701R4293d00836B65858a56947B8222R2516a87490h0543c2955j9046o6227
12290a18228F5698b01538D7436K22294c02474A07283j7371J29240Q6501a14032
12279b05860A91210a85107F1233L01806a16141C82533F5600K12212p9005a16135
$$ plain form
12358 -157175 -50662 -333958 -195745 -81947 282713 -112248 34702 -109370 -1071 -404750
12348 -404750 59892 -101490 19491 -353008 -11761 212684 203689 -295483 62236 209896 -135175
12336 -141057 -9805 59005 -145781 51340 126463 -1981 13660 395828 13563 -114495 73840
12324 -13191 31369 -49578 180474 237544 -250345 -160192 244050 380953 -88648 210573 40922
12312 78070 -149758 193522 -399863 -238040 320470 -85179 -44397 426117 193857 -86074
12301 175701 269994 -400836 265858 -156947 28222 120738 -187490 -80543 -32955 -52001 -118228
12290 -118228 65698 -201538 47436 269730 -302474 107283 89912 219152 305653 -114032
12279 -205860 191210 -185107 61233 363039 -116141 382533 65600 277812 198807 -116135
12268b5482D83848j88429K32606C4577a1206D21256b15887A7135L4529M42449
12258D94113a40885B64237a85279A60188j8425g0093f13j21907A96959b5464C3661
12246A02251j5302o940d0231j24319C44575A17874Q2670a06527C25519a8217k5582
12235d3799l39993I1937J90077I5889b4309B44778g1479A24082D0939J96520j06150
12224A31309E946K81467p4156j633J48041K06211h0556A79810p484M6642a49025
12212B98627a11432A84752A684R2085I263L5730L32609j22010P7586j0483J24288
12201D46983b7730F0295Q1783J00319p687K79862B32066p5606P5620J7931I1940
12189B33224P6409b4502F2524o495J06387n1510j1899L99324b2332C70934B9275
$$ plain form
12268 -25482 483848 295419 528025 34577 -11206 421256 -215887 17135 51664 494113
12258 494113 -140885 264237 -185279 160188 141763 -70093 -613 -122520 196959 -25464 33661
12246 102251 86949 80009 -40231 -164550 344575 117874 200544 -106527 325519 -18217 -43799
12235 -43799 -383792 91937 282014 95889 -24309 244778 -71479 124082 40939 237459 131309
12224 131309 5946 287413 213257 211624 359665 565876 -80556 179810 172326 218968 -149025
12212 298627 -111432 184752 1684 93769 9263 44993 377602 255592 333178 322695 446983
12201 446983 -27730 60295 142078 242397 234710 514572 232066 156460 232080 250011 91940
12189 233224 309633 -24502 62524 56029 162416 110906 99007 498331 -22332 370934 29275
12177B21220i4870i978k06187H4329k3054A1733a42358H6026J09037B5181K66691
12166B91872H9951J87104o0675b87715k8398B06376l4560P1487q2893J25703b26989
12154e8906G8673a86232C08108A11169K44456c08327e743A10744a04420D09165
12143a86911G0368a34377F6285F4a80894A2513c4486H5501a8072E1449Q4940a27682
12130i8155a9481r3597d4209o8300B74026m0934b589G1293b41355A54590e3135
12118a99726K8330a1371n547A05301m3493j0592K03593a49666g3092A41787n3126
12107H8661A72J67372L8409c74845B04239n6173J0908b31498f0223J8247M0C20824
12094B10418k0714h313B82146a83374l1338B2489b41895b1740p9407I4879Q6289
$$ plain form
12177 221220 -94870 -9978 -216165 84329 61275 11733 -142358 86026 195063 25181 291872
12166 291872 89951 277055 216380 -287715 -316113 206376 171816 243303 160410 286113 -226989
12154 -58906 78673 -186232 308108 111169 355625 -308327 -5743 110744 -104420 409165
12143 -186911 70368 -134377 66285 64 -180894 12513 -34486 85501 -18072 51449 136389 -127682
12130 -98155 -19481 -113078 -44209 -112509 274026 233092 -2589 71293 -241355 154590 -53135
12118 -199726 -171396 -11371 -16918 105301 61808 51216 254809 -149666 -73092 141787 88661
12107 88661 172 167544 205953 -374845 204239 148066 158974 -231498 -60223 -41976 -41936 320824
12094 210418 189704 -8313 282146 -183374 -214712 22489 -241895 -21740 -101147 94879 181168
12083A81168l3982f3215A07999b7811F7446Q7078b68235d0264R490q4109b3080
12071i3901L0600B19698A5803K02659J05213Q28661P69962I00858B22223q6464
12061A35759K042R358K1875J09777f6097B54440j16190a98300A00690B2558J12199
12050A34757a06860A65354a1869n5283A69563J67779D1614i8679B70538G0066
12039b30274G6431J03864g8047a6682j3398A23069r093b22598A34579b84903H8899
12027f8646p2978E7098a96416j1404e9191C1442K30962g0599C55346a24915c0361
12015b90205h6426D75319b73865k0219j7461B7931b75705F2529a0449C445L03553
12004C06998b49038A3499a56457j47743C09794d46107E771O2640b06411A91103
$$ plain form
12083 181168 147186 -63215 107999 -27811 67446 154524 -268235 -40264 -30774 -114883 -23080
12071 -93901 -63301 219698 15803 218462 323675 1152336 1922298 900858 222223 135759
12061 135759 137801 147159 169034 278811 -66097 254440 138250 -198300 100690 22558 134757
12050 134757 -106860 165354 -11869 -67152 169563 337342 41614 -98679 270538 70066
12039 -230274 76431 180295 -78047 -16682 -30080 123069 113976 -222598 134579 -284903 88899
12027 -68646 -141624 57098 -196416 -207820 -59191 31442 262404 -70599 355346 -124915 -30361
12015 -290205 -86426 475319 -273865 -294084 -311545 27931 -275705 62529 -10449 3445 306998
12004 306998 -249038 13499 -156457 -304200 309794 -446107 5771 68411 -206411 191103
11993D3648Q5943i4052k83400c2243j9590B00898a01375M3019K5126q0368m3641
11982a57239N1411A02689a85854B84195c15677f9840l39305a64062e6131A15479
11971a23090C07779j46170m3610D3048R1003F4402J5514P1722A9635M1588C738
11959D2627e0044J3393A42336J937e5296o23655c27365J07359E4978a33399m38467
11948e71866A58158f8434A18897M777c23849A22077l1190j621O39L8667C8384
11936B60626K0371L4291A22904E5143h9838D5407a9919G8955e7274n2308A15744
11924a21598j17168f0905E7949b17489h3874E8946J91228I1464a23813C38864
11913h3618q957J412r2229e8794A36984E0597M7865f9259B70444q2913c19080
$$ plain form
11993 43648 129591 -94052 -377452 -32243 -51833 200898 -101375 -58356 -33230 -113598 -157239
11982 -157239 -105828 102689 -185854 284195 -315677 -69840 -409145 -164062 -56131 115479
11971 -123090 307779 161609 117999 43048 134051 64402 79916 151638 19635 61223 3738
11959 42627 -50044 -36651 142336 144273 -55296 -678951 -327365 -220006 54978 -133399 -571866
11948 -571866 158158 -68434 118897 123674 -323849 122077 90887 89266 89905 128572 38384
11936 260626 280997 315288 122904 55143 -89838 45407 -19919 78955 -57274 -109582 115744
11924 -121598 -238766 -60905 57949 -217489 -83874 58946 250174 91464 -123813 338864
11913 -83618 -92575 -91163 -183392 -58794 136984 50597 98462 -69259 270444 187531 -319080
11901h1134a0418p2350J4241j12492K4862f9898k19861R6033B6232a23782B30335
11889b58193f4600B88743a63748A51586o7729Q5599C3378L7619a9139A10141E1946
11877c532q8951k36027a22272B6983N5776A5302R916K6292a39303c3278k04119
11866b37397G354J93031b4855k67602b723k6273j29648I5028a43833k6090j08802
11855b78725a950B85511k5071e3784A27244J40924q5940c0881C84016e7431B80098
11843C61916A10758a29339c0470C39056A12907b32811d414j88577e7932I04e7502
11831F7163h2556j1551k40680k736B02547J09738i477H8769R2344c20393B3779
11819a84332d476A13501j5922J7235J3803a1058A2179O4870C974J1549J9523J31242
$$ plain form
11901 -81134 -10418 -82768 -68527 -181019 -156157 -69898 -289759 -193726 26232 -123782 230335
11889 -258193 -64600 288743 -163748 151586 83857 169456 33378 70997 -19139 110141 51946
11877 -3532 -92483 -328510 -122272 26983 82759 15302 25218 51510 -139303 -33278 -237397
11866 -237397 7354 200385 -24855 -292457 -2723 -28996 -158644 95028 -143833 -169923 -278725
11855 -278725 -1950 285511 260440 -53784 127244 268168 182228 -30881 384016 -57431 280098
11843 361916 110758 -129339 -30470 339056 112907 -232811 -4414 -192991 -57932 904 -57502
11831 67163 -82556 -94107 -334787 -337523 202547 312285 -9477 88769 181113 -320393 23779
11819 -184332 -4476 113501 97579 114814 128617 -11058 12179 77049 3974 15523 35046 166288
11807A66288i2144j02281O6106A09534J9270a47364B06879c67569F6676c44059
11796b54204i9411J7287D73268a54416b0667C89791A39725J48255b47396R8570
11786a48826F9670c14602A62613L840F119K88044J11483G2083J4056a61176c7781
11774D9597L2086b10655Q0161j97762G565a5051p9364E8489K10583a67740D4277
11762a4225B3249a72312A05858a2810l11016a60388B6165M8393B2167d9384k92565
11751c41949A60213b20952A98095a03596m4819N8826B45356a40013B9488a48381
11740h817k68486M3032F2359k941a46173d9135A15938J18558A14023P3975q550
11729A79448K3668l2920Q6350e3762G1635a07646b2292p3562A39081m1228a4521
$$ plain form
11807 166288 -92144 -194425 -128319 109534 128804 -147364 206879 -367569 66676 -344059
11796 -254204 -99411 -82124 473268 -154416 -20667 389791 139725 287980 -247396 -148826
11786 -148826 69670 -314602 162613 166453 6119 294163 405646 72083 86139 -161176 -37781
11774 49597 81683 -210655 -130494 -328256 7565 -15051 -94415 58489 269072 -167740 44277
11762 -14225 23249 -172312 105858 -12810 -323826 -160388 26165 74558 22167 -49384 -341949
11751 -341949 160213 -220952 198095 -103596 -148415 -89589 245356 -140013 29488 -148381
11740 -8817 -277303 -234271 62359 59418 -146173 -49135 115938 234496 114023 187998 179448
11729 179448 203116 170196 256546 -53762 71635 -107646 -22292 -95854 139081 97853 -14521
11717a64516K9528B12995L1940b50418c6031l08726H3610b3012A63391G045e9093
11705A09459b18028P8882c7935B46386q9319J61217j01011j00573c235B55501
11694b89873b8963A02134b84929A81066a18258I7728j1919l4807J55385m9634
11684A56753a68535A9973K82977E3379e7411B64995n6163a5525H4820B0727J38109
11673A58836i5173N916A36295B5659a2164k6437j12008B7456K00374N7b749j85784
11661a88533A05193N2198j1122a13672o5258B42697I1347b11481B24213J54501
11651C78714F7521K00699c61395a810k45353I7985a65359B39467c72244G8015
11640a77554Q715A86649b40107P5760D8065P4044J32154e3516K1958A54492J24916
$$ plain form
11717 -164516 -134988 212995 244935 -250418 -36031 -344757 83610 -23012 163391 7045 -59093
11705 109459 -218028 -139146 -37935 246386 157067 318284 217273 116700 -3235 255501
11694 -289873 -28963 102134 -284929 181066 -118258 97728 85809 51002 206387 156753
11684 156753 -168535 19973 302950 53379 -57411 264995 208832 -15525 84820 20727 158836
11673 158836 -95173 -89257 136295 25659 -12164 -38601 -150609 27456 227830 227887 -2749 -188533
11661 -188533 105193 157391 146269 -113672 -178930 242697 91347 -211481 224213 378714
11651 378714 67521 268220 -361395 -1810 -247163 97985 -165359 239467 -372244 78015
11640 -177554 -168839 186649 -240107 -164347 48065 122109 254263 -53516 -31558 154492 279408
11629B79408j16618k8012a42502C27787a1823B0826a7549C66371d358B96938a66761
11617A0738L4806g4827R77A25011m7552N4554d7949B74411a1619l4339j21352
11606a67310g7559C9509L61408a44953E24084E5102K8909a40507e6504q9960A98276
11594A60750F8979j917K4414d5998B1538a46981O0141A94713m7885O1445q7776
11583A20497O9099b8991r4600d0894A8399d2857B15554a47675j6798C074Q2439
11572H5513a74770A92989a57315g4490A99643j5468C4721a11114D64356k25033
11562B39323I0238L53480b79681h8362H1367N750p495f9538m9735H7250J45726
11551B32976B163J30904e1057B44269I4928a36456B38103G0475a3094B17820h2863
$$ plain form
11629 279408 162790 134778 -142502 327787 -11823 20826 -17549 366371 -4358 296938 -166761
11617 10738 45544 -74827 -73850 125011 77459 132013 -47949 274411 -11619 -45958 -167310
11606 -167310 -77559 39509 400917 -144953 524084 55102 84011 -140507 -56504 -146464 198276
11594 160750 68979 67062 91476 -45998 21538 -146981 -86840 194713 146828 208273 120497
11583 120497 189596 -28991 -123591 -40894 18399 -42857 215554 -147675 -164473 3074 85513
11572 85513 -174770 192989 -157315 -74490 199643 184175 34721 -111114 464356 239323
11562 239323 90238 443718 -279681 -88362 81367 87117 79622 -69538 -119273 87250 232976
11551 232976 2163 133067 -51057 244269 94928 -136456 238103 70475 -13094 217820 -82863
11539E0259L2996h894H3717C1832M0754k0421a48417B62853b27059D20994r3050
11528C27944a69204j5204h0934j45174G7043J99972j34436L01243A71103J20357
11518B91460j23690N2230J97029E6911J29606a72427A86358a09728H6427a25321
11507A74132F9659R9279J37268k722F2385R0945e5372A64345Q0846P3283m489
11496C13985A06074k9737J10436P8499a41309B71497J2146l2290b85422a35509
11485C12251A54628d8751B24724J03861a03552C9192J89550K2464l2273K7313
11475B46246G5216J62331K36517H7535Q2723e866C6986J00545a60733B23909H4271
11463F5810K46647l1619l9295g358C64605j25918J8781O7665a39275A2774Q3974
$$ plain form
11539 50259 83255 -8894 83717 31832 72586 52165 -148417 262853 -227059 420994 327944
11528 327944 -169204 -184408 -80934 -226108 77043 277015 142579 443822 171103 291460
11518 291460 167770 220000 417029 56911 186517 -172427 186358 -109728 86427 -125321
11507 174132 69659 168938 306206 303484 62385 153330 -55372 164345 245191 318474 313985
11496 313985 106074 76337 186773 265272 -141309 271497 283643 251353 -285422 -135509
11485 312251 154628 -48751 224724 328585 -103552 39192 228742 251206 218933 246246
11475 246246 75216 237547 474064 87535 170258 -5866 36986 137531 -160733 223909 84271
11463 65810 312457 280838 241543 -7358 364605 238687 257468 325133 -139275 12774 96748
11452I6748A4499L6445N9448a15954B37892C7454a36342b6062B56920k1896b800
11440D30311C2104L07669j44780C1518h0759B92983r0087H3283a27612D4445K37955
11429B82400N6110A8128R3912a43863A99072G0954Q5517P2503h0835C62447A29200
11417i8874j16932J04352n8073j13224D105J70095f3935A14381n776g3522B66273
11405A40056a28427H253J92490P8546a5833F654J66756L2132i5290H8489R1289
11394A79778e8814a176H9725J44569E3887K61946j36530g1299D5626b76410a24244
11382D5770L6445a56686B3155J12644a9439l76456A9135c577C64162a1065j6159
11371b7224D4500J81901j9766b25410M6381D6310N03459c91174A22124f9344B36620
$$ plain form
11452 96748 14499 50944 110392 -115954 237892 37454 -136342 -26062 256920 235024 -2800
11440 430311 32104 339773 194993 31518 -80759 292983 202896 83283 -127612 44445 282400
11429 282400 338510 18128 112040 -143863 199072 70954 156471 228974 -80835 362447 129200
11417 -98874 -215806 -111454 -169527 -282751 4105 174200 -63935 114381 108605 -73522 266273
11405 140056 -128427 8253 200743 279289 -15833 6654 173410 205542 -95290 88489 179778
11394 179778 -58814 -1176 89725 234294 53887 315833 179303 -71299 45626 -276410 -124244
11382 45770 82215 -156686 23155 135799 -19439 -395895 19135 -3577 364162 -11065 -27224
11371 -27224 44500 226401 206635 -225410 -179029 46310 549769 -391174 122124 -69344 236620
11359b51761e0693G892d4623o5330m9215O5985A83573b60827A68571c8812E7002
11347A24425o955d6654j83544B76075a76393K5221r6849a19894k60054b464r5957
11336i8421A03442b08640A41312b216k07636e4637G1394k0624J12791m3253J27581
11325B47889b36977h8014a8832n0860K1875j36284A21425a09569J0950B88828
11314f2334j03516a7674n1990F2130a34825B71948b18638D4600J49389o6050d1150
11302a812o1580k09242A7614Q2496K827b23676A45a16689Q40A23881a02600j05799
11290b08399j9786g012j03942L6152E6239A7292a44749p5050j20073A1019c0180
11278A21283g6732j32066B52687a87725A9968J4195a31747p3238F2493a01360
$$ plain form
11359 -251761 -50693 7892 -44623 -109953 -159168 -93183 183573 -260827 168571 -38812 57002
11347 124425 117470 -46654 -230198 276075 -176393 -151172 -248021 -119894 -379948 -2464 -98421
11336 -98421 103442 -208640 141312 -2216 -209852 -54637 71394 50770 163561 120308 247889
11325 247889 -236977 -88014 -18832 -69692 -47817 -184101 121425 -109569 -98619 288828
11314 -62334 -165850 -17674 -69664 62130 -134825 271948 -218638 44600 193989 127939 -41150
11302 -1812 -63392 -272634 17614 100110 102937 -223676 145 -116689 -115849 123881 -102600 -208399
11290 -208399 -228185 -7012 -110954 -74802 56239 17292 -144749 -219799 -339872 11019 -30180
11278 121283 -76732 -208798 252687 -187725 19968 34163 -131747 -204985 62493 -101360
11267A25185a38280E3706a13684I8306M7445e3050L080C09290a37611n3146e5088
11255a78461c9299F0385k22a00138M3488p786A0059J72105e5972A9101e0165K3064
11243b7101k3519k3911j31905e4302j00634b1400j03749l10079A53334k7338a69532
11231A64107a19895N4308j1228p3108A1325K4787J9305b75248a9562k69751d7891
11219A53055Q5116a60431B09102a81113E821a29700D8785e7565k20691g676l23424
11208c31100A66511a60329A65662c0688A06526M467f0434A72439D7138j1602a3784
11196a13917j28859E6258a03971C16785h2369j51007i5068A75193f2421q6341
11186a48762K0804E2008e8384j3298l1805j40248K1532F3157a24363l20931b3605
$$ plain form
11267 125185 -138280 53706 -113684 98306 145751 -53050 -49970 309290 -137611 -190757 -55088
11255 -178461 -39299 60385 60163 -100138 -56650 -64436 10059 182164 -55972 19101 -50165 -27101
11243 -27101 -50620 -74531 -206436 -54302 -154936 -21400 -125149 -435228 153334 125996 -169532
11231 164107 -119895 -65587 -76815 -149923 11325 36112 55417 -275248 -19562 -289313 -47891
11219 153055 238171 -160431 209102 -181113 5821 -129700 48785 -57565 -278256 -7676 -331100
11208 -331100 166511 -160329 165662 -30688 106526 110993 -60434 172439 47138 35536 -13784
11196 -113917 -242776 56258 -103971 316785 -82369 -233376 -95068 175193 -62421 -148762
11186 -148762 -127958 52008 -58384 -71682 -103487 -243735 -222203 63157 -124363 -445294 -23605
11174c9125q0982A7278a21277A21874f8546m8463H9623h4945F4645i8529C4138
11162f7395c1396n7884K1051j08436O5865B22659b40720D8968K32396I3999L5223
11151A29222e42103a7000A2621M4193j3003J74716B7320f4120A5219c22291F6604
11139b36382H6718m3145K42603G5645K5777N0138J55121P7984m0523f4564B48991
11127B40432a09777A17471J13348E2814N26984b203C96054a02391B76729q7295
11117A89434l1880g5291l2070j12836d456n5299A56432a45591a8526A99934p2696
11106A27238C4295a27875A75824J19502c08180E92821c1229D93675B407J75297
11096A77704R9807a28723E43562b4438B31136G2320J132J0884L503K749a36583
$$ plain form
11174 -39125 -120107 17278 -121277 121874 -68546 -117009 89623 -84945 64645 -98529 34138
11162 -67395 -31396 -89280 -68229 -176665 -110800 222659 -240720 48968 281364 93999 129222
11151 129222 -542103 -17000 12621 56814 43811 218527 27320 -64120 15219 -322291 66604
11139 -236382 86718 43573 286176 75645 101422 151560 306681 384665 344142 -64564 248991
11127 240432 -109777 117471 230819 52814 579798 -2203 396054 -102391 276729 189434
11117 189434 157554 -75291 -107361 -220197 -4456 -59755 156432 -145591 -18526 199934 127238
11106 127238 34295 -127875 175824 295326 -308180 592821 -31229 493675 2407 177704
11096 177704 277511 -128723 543562 -24438 231136 72320 73452 84336 87839 90588 -136583
11084B36514k3607k208J59360F9419J95555J02046j16733J41983D2604L19393
11074C61997E8266J83231R7365d548D42017J72492A87934M85118d113A45670J99296
11063C44966H7173K54692L09236J06122j53102K07309j73313J18288k34295J31719
11053F53829J84249k6035K5326j45082K956j23845J68001Q8284j77010R5518r4468
11042F51723K77j68343J97487P7185j21187L14263N7085k80365R5688k15363J50695
11031G59145L36579E27149L00663j13335m3223J21198N1570J1568K97270k73704
11021H79156D32725K12945J25268j11345J06528j64320J09849l7410J18170C25772
11010E88814K39014Q3151r3810k92106J51139j96893K64798C33240M43241j12165
$$ plain form
11084 236514 212907 210699 370059 69419 264974 367020 250287 392270 42604 361997
11074 361997 58266 241497 338862 -4548 442017 614509 187934 673052 -4113 145670 344966
11063 344966 87173 341865 651101 757223 604121 811430 638117 756405 522110 653829
11053 653829 838078 812043 837369 692287 695243 571398 739399 827683 650673 746191 651723
11042 651723 652000 483657 681144 758329 637142 951405 1008490 728125 823813 608450 759145
11031 759145 1095724 527149 827812 714477 671254 792452 844022 855590 1152860 879156
11021 879156 432725 645670 770938 659593 766121 601801 711650 674240 792410 325772
11010 588814 827828 910979 817169 525063 676202 479309 744107 333240 776481 664316
11000F64316J50281m4331j55113J382L64457l43257J91424J40904D42356L56442
10990G98798j65757n0525J65153J6749J93553J73022j71525J26722j47840K81203
10980A219553r4965J97177l18869M07242N02338j14770P18726P7078K29319O7716
10970B890545Q2557j936j60326j14899o40860J83680m98845l6363O6287m8002
10960A721838K47789n6779j79209L61484j41595J0168l50531L22253l69957j77651
10950A387810k18874N6345E91041K73248l18860M0751j74706j1236A78399q5784
10940I2615B5867J74186E0643i4081A91447a20684B13500l5387k5939p5381J54034
10929B30827B9627q997h1833D75027F3076M9309b64247A1743L37785H2862a43134
$$ plain form
11000 664316 814597 770266 615153 616535 980992 637735 829159 970063 442356 798798
10990 798798 633041 582516 747669 764418 957971 1130993 959468 1086190 938350 1219553
10980 1219553 1124588 1321765 1002896 1410138 1912476 1797706 2516432 2593510 2822829 2890545
10970 2890545 2973102 2971166 2810840 2695941 2055081 2238761 1739916 1703553 1769840 1721838
10960 1721838 1969627 1912848 1733639 2095123 1953528 1963696 1613165 1935418 1565461 1387810
10950 1387810 1168936 1225281 591041 864289 545429 586180 411474 400238 178399 92615
10940 92615 25867 200053 50643 -94081 191447 -120684 213500 178113 152174 76793 230827
10929 230827 29627 20630 -81833 475027 63076 112385 -264247 11743 349528 82862 -143134
10917B54234A16837J40021b20179K8554h8614c4823J3805A32413d7748J6157O663
10906b4928A1051O6881Q1076b04526c0211E5564r222j0633K24523E224a208D4380
10893A18166d2413k4786j02416N391b5302r9373j43121i1825B2875a4518l9473
10882e3991J0339a2015m08513a3619H4507N1655i8903l37179e426A03944f24384
10870a43543j51113d2707A59708a11809A26858J51952b00486I4233b23853M6607
10860a77246l1755A34091K49316c8626j6723l97422E2369N7687i2771d3967A49526
10848d4223B30171e1809j2998j27236E7728g8022j5711d2003B63742a77543i948
10836b3710D075L01712r0805E9749d57075A44977J11412O8514A10691m6640a92403
$$ plain form
10917 254234 116837 256858 -220179 -191625 -88614 -34823 -21018 132413 -47748 -31591 -24928
10906 -24928 11051 77932 159008 -204526 -30211 55564 46342 35709 260232 5224 -1208 44380
10893 118166 -42413 -67199 -169615 -164224 -25302 -124675 -267796 -91825 22875 -14518 -53991
10882 -53991 -43652 -12015 -420528 -13619 84507 136162 -98903 -436082 -5426 103944 -624384
10870 -143543 -294656 -42707 159708 -111809 126858 278810 -200486 94233 -223853 -177246
10860 -177246 -209001 134091 383407 -38626 -55349 -452771 52369 110056 -92771 -43967 149526
10848 -44223 230171 -51809 -64807 -192043 57728 -78022 -93733 -42003 263742 -177543 -9948
10836 -23710 4075 305787 214982 59749 -457075 144977 256389 324903 110691 64051 -192403
10824B53794H3955b40803A4216L47167a87865k58267B28261e5397B13688a29658
10813C1148a6111n2778k42322a25258o2297g9070C77895b02815C5475Q4872J34473
10802B54820c600O67A44789K51563F6628a3168k14349b8567q6117C9816K4914
10791F4730J80130i1726j7219j68143M6541I0271a31072K7989r8680D8102M425
10780E2527a36132B4431a11485A98181l2405A1294a08632A01459M9303B5624J0912
10769C6536L1723P7615e95085H2568a72121f8295k0951R601p5532B60351a24080
10757A4084b19710c2353j15161r6734H5486J66551E7300c21180D5516d20986a20143
10745g132k88477J17684h4603M1629k65680D9021a16375q6994h6590K9617E1248
$$ plain form
10824 253794 83955 -240803 14216 361383 -187865 -446132 228261 -55397 213688 -129658
10813 31148 -16111 -68889 -311211 -125258 -187555 -79070 377895 -202815 35475 120347 254820
10802 254820 -3600 -2933 144789 396352 66628 -13168 -227517 -28567 -114684 39816 64730
10791 64730 244860 -91726 -108945 -277088 -230547 90271 -131072 -103083 -201763 48102 52527
10780 52527 -136132 24431 -111485 198181 165776 11294 -108632 101459 150762 25624 36536
10769 36536 68259 145874 -595085 82568 -172121 -68295 -89246 -79645 -155177 260351 -124080
10757 14084 -219710 -32353 -147514 -244248 85486 252037 57300 -321180 45516 -420986 -120143
10745 -7132 -295609 -177925 -84603 -42974 -308654 49021 -116375 -203369 -86590 -56973 51248
10733c77110d7026H4097c34933A67180J6434d1111C4712R4614E7462L9951c67082
10721a94208h2386n160D353b31553E9146b3772q817E5627b12725C0748K52453
10710B83201a7353L686B4309e7072p5157K0579I9169J25845k606a04745p4369
10699a79114q1759l558l0042A97635b53936i6675j50227h1902l09382H1125E73
10687a54227N6167B64510b54844j6834c7541n6013C09113a93161O698Q9497A25496
10675b6262d571p6940K2873j91798G5315b06501J1970j4317F5800a76293F4157
10663E6024a17507e1595A68936J9013a86560F1852b66741B6819J63068p8180n3048
10652E8659b4881B21551E4564c52643A20044A1436d02607a49509I9704a47097
$$ plain form
10733 -377110 -47026 84097 -334933 167180 183614 -41111 34712 129326 57462 97413 -367082
10721 -194208 -82386 -87546 4353 -231553 59146 -23772 -32589 55627 -212725 30748 283201
10710 283201 -17353 -13667 24309 -57072 -132229 -111650 99169 225014 222408 -104745 -179114
10699 -179114 -260873 -264431 -294473 197635 -253936 -96675 -246902 -81902 -391284 81125 573
10687 -154227 -98060 264510 -254844 -271678 -37541 -93554 309113 -193161 -186463 -96966 125496
10675 -26262 -4571 -81511 -58638 -250436 75315 -206501 -194531 -208848 65800 -176293 64157
10663 56024 -117507 -51595 168936 187949 -186560 61852 -266741 26819 189887 111707 58659
10652 58659 -24881 221551 54564 -352643 120044 11436 -402607 -149509 99704 -147097
10641a68689C2899b42678C7261M4931b74236O6851A23006a06826D7105N874O1253
10630A14232b60602g3499j71376b3510A7868g3253h800B56067D21a8655k82772
10619c01427a1653k12625B54404o875a07489A48852l9194R7658D3240a43634h84
10607b01141B37881g7497B53667e61514C5755a71269A21258a14945E5875i3776
10596i9374n3250A60006d45063B16424I8756a68702H0810O6890e6232I3033b20200
10584b52718B09867G7112c3371m0696B02123B5652J20244h6279B5605g0711A13480
10572A3173D687a14313H9650b71951i5124I6374a35464A30480b71506C9714K73710
10561C13424c42058g639I7996K06062H7861L00576e8694m4742A58103F4409K7710
$$ plain form
10641 -168689 32899 -242678 37261 82192 -274236 -207385 123006 -106826 47105 52979 114232
10630 114232 -260602 -73499 -244875 -23510 17868 -73253 -8800 256067 421 -18655 -301427
10619 -301427 -11653 -224278 254404 247529 -107489 148852 109658 207316 43240 -143634 -884
10607 -201141 237881 -77497 253667 -561514 35755 -171269 121258 -114945 55875 -93776
10596 -99374 -152624 160006 -445063 216424 98756 -168702 80810 147700 -56232 93033 -220200
10584 -252718 209867 77112 -33371 -74067 202123 25652 145896 -86279 25605 -70711 113480
10572 13173 4687 -114313 89650 -271951 -95124 96374 -135464 130480 -271506 39714 313424
10561 313424 -342058 -7639 97996 304058 87861 388437 -58694 -103436 158103 64409 92119
10550I2119c04110B19254o6921M5322J23143e2883A54166a3484r8721c9145j56642
10539a95787c023k12655A24256C6608e6093D6003J97459b09094N2887R67B17083
10527a45304I5899L08049a655C74766i6367B01191a47814M271j65416g0492A26350
10515a20600j350j75704B35455c77996a57224N4823a6851m8392o4175C6407P5907
10504A12314a717j77336j17004k8202b0445j5296j67858O4880I1360K00509A44586
10492g1234a4862j92812i197j7217r0244k62502g0718j57906C21988J25978A24383
10480B59481K13986K28993k15446B4936F123O0207J8336d7344A05327M3160e5050
10468A02488c625A05807K20670i8259m6A3393J97832b67280L3166l0157J12201
$$ plain form
10550 92119 -304110 219254 152333 197655 320798 -52883 154166 -13484 -112205 -39145 -195787
10539 -195787 -3023 -215678 124256 36608 -56093 46003 243462 -209094 -156207 -155240 217083
10527 -145304 95899 403948 -1655 374766 -96367 201191 -147814 -143543 -308959 -70492 126350
10515 -120600 -121950 -297654 235455 -377996 -157224 -102401 -16851 -65243 -129418 36407 112314
10504 112314 -1717 -179053 -296057 -324259 -20445 -35741 -203599 -138719 91360 291869 144586
10492 -71234 -14862 -207674 -9197 -26414 -116658 -379160 -70718 -228624 321988 447966 124383
10480 259481 473467 702460 487014 24936 6123 66330 84666 -47344 105327 148487 -55050
10468 102488 -3625 105807 326477 -98259 -98305 13393 211225 -267280 -234114 -264271 -152070
10457a52070O1178j2413j57677j0417Q1482B01761E0750a37095A32986k707b37773
10445H0602A6491d9368j66198b8100A21445a18322j39237A48782J31879c8392
10434B42301c47731e9279k46801f1093l14955G5140h9926j48936L8915h1203A25075
10422a3824A90365q5383o721a5059j66786j9482i2810o8109A06728L5474b18056
10410i7713G2J13866E3619a68696c112o7570B16014b69266C1187f7964k7668j30378
10398b26010A12520a9009l1471A601M16022h5156A20230N617N0956p2722h4809
10386B0090N6785e4116F3270J24658H3273f572A20968J4177K39418p1108c04774
10374E14034A45848k5473d3782G0008L48240j68668K19324G0989M10366j10346
$$ plain form
10457 -152070 -90892 -103305 -260982 -271399 -189917 201761 50750 -137095 132986 130279 -237773
10445 80602 16491 -49368 -215566 -28100 121445 -118322 -257559 148782 280661 -38392
10434 242301 -347731 -59279 -306080 -61093 -376048 75140 -89926 -238862 -199947 -81203 125075
10422 -13824 190365 104982 98261 -15059 -181845 -201327 -92810 -160919 106728 142202 -218056
10410 -97713 72 113938 53619 -168696 -3112 -70682 216014 -269266 31187 -67964 -95632 -226010
10398 -226010 112520 -19009 -50480 1601 417623 -85156 120230 125847 176803 104081 -84809
10386 20090 76875 -54116 63270 187928 83273 -6572 120968 135145 374563 303455 -304774
10374 514034 145848 120375 -43782 70008 418248 249580 468904 70989 481355 371009
10364C71009A3768K58419l1316j9638K99797k01377A37257a14171E1738L35315
10354C87053B210J46769K83518k15214L71710M5069B39187J32434k9643A19935
10343C65105N92960C23712Q587J01062A38547J43569m9046O1022j15957C2698
10332A60085j2176a75084B54138o0058g237A52955L2116g6961b745E1292N13009
10321E64301B79804Q9151D0213K43833Q0583I9485J91353A01439J72072g0642
10310C75650A6756K10059j7255D2929Q9791K1021g608A5744c5388l81003c7667
10298I686a24800D3420R5569L2751G1471b958B14665k1820e9976k06381C73507
10286c3913R379H303g8833r9326q4323E7240b01806B20123H908e7633j00602A13668
$$ plain form
10364 371009 13768 272187 240871 221233 521030 319653 137257 -114171 51738 387053
10354 387053 2210 148979 432497 217283 588993 634062 239187 371621 341978 119935
10343 365105 958065 323712 332299 433361 138547 282116 233070 294092 178135 32698
10332 160085 147909 -175084 254138 194080 -7237 152955 185071 -76961 -2745 51292 564301
10321 564301 279804 368955 40213 284046 364629 99485 290838 101439 273511 -70642
10310 375650 16756 226815 209560 42929 132720 153741 -7608 15744 -35388 -416391 -37667
10298 9686 -124800 43420 138989 171740 71471 -2958 214665 192845 -59976 -266357 373507
10286 -33913 -24534 8303 -78833 -178159 -262482 57240 -201806 220123 8908 -57633 -158235 113668
10273G7910a85032Q4469l13823J74532D6790a79195B23896J30863C8223g0170
10262a84436f7295j12297C03126A25080K82925k9079A45886K38582e616o8223
10252g3839j98720E4549P1184H427b07861h3214K4120E8105a36960B2631b88606
10240D7038J03974a09958A50849i209I5136b10395b1965H1438l4175a40304d1605
10228A31881g0721j50081Q2389j15640Q8723A02721b31797b1452A740a02510l5456
10217a37966E8207a18618F8451b00302a3627A33010J20836B6840a32736N8067
10207g4669H9187J525a90296A02371M4034b38758a03980J6223A43591a65936D8009
10195B9281c762B8377c4021A3546d7279D142c17858J15113h3842A56698a70644
$$ plain form
10273 77910 -185032 -100563 -414386 -239854 46790 -179195 223896 354759 38223 -70170
10262 -184436 -67295 -179592 303126 125080 408005 378926 145886 384468 -5616 -73839
10252 -73839 -272559 54549 125733 8427 -207861 -83214 -59094 58105 -136960 22631 -288606
10240 47038 151012 -109958 150849 -9209 95136 -210395 -21965 81438 47263 -140304 -41605
10228 131881 -70721 -220802 -138413 -254053 -165330 102721 -231797 -21452 1740 -102510 -137966
10217 -137966 58207 -118618 68451 -200302 -13627 133010 253846 26840 -132736 -74669
10207 -74669 89187 90712 -190296 102371 146405 -238758 -103980 -87757 143591 -165936 48009
10195 29281 -3762 28377 -34021 13546 -47279 4142 -317858 -202745 -83842 156698 -170644
10183b54672A83789a91218Q6546j10456F7793R7431a19464B34950a3476r4143
10173a07619o2156O3652F6095L0633h8122A7666b61399D8944d2667j47213M2838
10162a47042c7566q0357G6263a92874k1519F5509J16112c23570A27189a1478C3355
10150i6506l18938i2505j94920I2854b24190M1101j73433a19804M3945m071E5986
10138A34973a56039O8637A72024M4241b68254A05340b01738C68421c73754N0432
10128c23322a05518r5629e3586B28446c81369B22487c52174a0594j42774k6941
10118a80309c9092C6126Q9993a89896o399E4441L9521K1697A7714a62668I2289
10106e07380J98130G3511a0199k42894a13642q3558c4037j11167c7565n1421k52814
$$ plain form
10183 -254672 183789 -191218 -104672 -215128 67793 165224 -119464 234950 -13476 -107619
10173 -107619 -169775 -106123 66095 96728 -88122 17666 -261399 48944 -42667 -189880 -147042
10162 -147042 -37566 -117923 76263 -192874 -214393 65509 181621 -323570 127189 -11478 33355
10150 -96506 -415444 -92505 -287425 92854 -224190 -183089 -356522 -119804 -75859 -79930 55986
10138 134973 -156039 -87402 172024 216265 -268254 105340 -201738 368421 -373754 -323322
10128 -323322 -105518 -201147 -53586 228446 -381369 222487 -352174 -10594 -153368 -180309
10118 -180309 -39092 36126 126119 -189896 -196295 54441 93962 115659 17714 -162668 92289
10106 -507380 -309250 73511 -10199 -253093 -113642 -197200 -34037 -145204 -37565 -88986 -341800
10095c41800a39840B98253o7104B0986b93170i6832a0827o1735p8987k06582h9002
10083B8108b69381c0736j3925j09928K6456M5828A51254C6298f6404k56803i7102
10071A05053J31888B9189J07955j3663a1628n1078b7976n0043C469K53392A15514
10059A66603b78387J30059L9158n947J779k39474d7976A10440J07130e583G011
10047b3194A52938m8240b20492k62846e1685j65906Q7110b0036l00635i1763j54161
10036b45924E2759i7620r924P429b9275I5296A1068a64228E451M2260i0587L6654
10024e3933k30808A68314p4727g4744G2831a16964k959A33897g2021A71600E910
10012e9131k8922r9383P6839j09498n7620A2090Q5637j6606L4523l2823a50597
$$ plain form
10095 -341800 -139840 298253 231149 20986 -293170 -96832 -10827 -72562 -151549 -358131 -89002
10083 28108 -269381 -30736 -44661 -154589 -128133 -82305 151254 36298 -66404 -323207 -97102
10071 105053 236941 29189 137144 123481 -11628 -62706 -27976 -78019 3469 256861 115514
10059 166603 -278387 -148328 -109170 -115117 -113338 -352812 -47976 110440 217570 -5583 7011
10047 -23194 152938 104698 -220492 -483338 -51685 -217591 -130481 -20036 -320671 -91763 -245924
10036 -245924 52759 -97620 -107544 -100115 -29275 95296 11068 -164228 5451 47711 -90587 -53933
10024 -53933 -284741 168314 93587 -74744 72831 -116964 -119923 133897 -72021 171600 5910
10012 -59131 -88053 -187436 -110597 -220095 -277715 12090 97727 81121 115644 82821 -150597
10000B5976b42438J09343j22397J01524K0137c7620j81829P8813j66881I3593
9989A21448C6651a28382N6443l16829d3182A12574a07662C14778b44991f2234
9978A80428j9996B8176P4386d7659A10305c67853g2419O730q3048B39417B2282
9966A31685d4720A3756J23483J03787b26306F880b1006B83001j29262b70217h2360
9954A9054J46758b90385c8174j29429C00007c9784o4892H7669h8797m9017B61043
9942B04855q8940F940a29407J5637j07626a0021l1754j86244A23999J640b07223
9930b53796A26502a24655e4618B6110c88989i4475C16835E9010a80605M1703B38138
9918b03025c6720E5896c57584A4881J9645b0010B46750c99409J11929a20617A46947
$$ plain form
10000 25976 -242438 -133095 -255492 -153968 -133831 -37620 -219449 -140636 -307517 93593
9989 121448 36651 -128382 -71939 -388768 -43182 112574 -107662 314778 -244991 -62234
9978 180428 160432 28176 102562 -47659 110305 -367853 -72419 -65689 -148737 239417 22282
9966 131685 -44720 13756 137239 241026 -226306 6880 -21006 283001 153739 -270217 -82360
9954 19054 165812 -290385 -38174 -167603 300007 -39784 -104676 87669 -88797 -137814 261043
9942 204855 115915 6940 -129407 -113770 -221396 -10021 -41775 -228019 123999 125639 -207223
9930 -253796 126502 -124655 -54618 26110 -388989 -94475 316835 59010 -180605 -138902 238138
9918 -203025 -36720 55896 -357584 14881 34526 -20010 246750 -399409 -287480 -120617 146947
9906a05464d2304j72328M9697A44195E7734i4334b7317c595j35098k64275b9008
9894b31064R6857K6225a2499A4303c51862a36547b6137j05560A83530H0215C3535
9882b43957B34734j02554a84461a2615j05935c8364B7505M5496j9926e2514l35523
9871c88037b2903R152A87069e0403L668p750H380Q8266b21748R7592d0585k2768
9859f3353B25737E5791d8760j0936j94237j570J1795i1241l3675B50796c92924
9847d7843E3358b01630e3890q318j80642M8751q480h8387k29961j34047B2425
9835C85560d1996j04383L7447j03981N1130c4309j99291C33856b14828i4098B94358
9823D62781b60293D3857b31051o8598g1693j19124f0190l3803C4118g5514r7727
$$ plain form
9906 -105464 -42304 -214632 -164935 144195 57734 -94334 -27317 -3595 -138693 -402968 -29008
9894 -231064 -134207 -107982 -12499 14303 -351862 -136547 -26137 -131697 183530 80215 33535
9882 -243957 234734 132180 -184461 -12615 -118550 -38364 27505 73001 53075 -52514 -388037
9871 -388037 -22903 -13751 187069 -50403 -46735 -54485 8380 96646 -221748 -124156 -40585 -63353
9859 -63353 225737 55791 -48760 -59696 -253933 -255503 -243708 -91241 -124916 250796 -392924
9847 -47843 53358 -201630 -53890 -62208 -242850 -194099 -202579 -88387 -318348 -452395 22425
9835 385560 -41996 -146379 -108932 -212913 -161783 -34309 -233600 333856 -214828 -94098 294358
9823 462781 -260293 43857 -231051 -299649 -71693 -190817 -60190 -93993 34118 -75514 -173241
9812a73241j77979K8448H0207a57754e1271l09146a27391M2105F1558g4692r5047
9801a69739F9395b16689f9569p3420B9635b0409A65265b78106a3609B43308i3415
9789A19522b0265B47338h8441b6169j65130B2174J0485a21172e4491D43768A17693
9777C09603a68280l041q0532B44391a52161F7483J47618i3193r0451G8778b93036
9765a23276L5047F2877a30952J2918b7688l05174B1252b27544P4418j97423g7484
9753a91584I9902h4892C83905d33734H773a61732l9892O9277A59073a86276j8132
9742b04408j38858h7277p9737c4626k14408C7986a62301e9772B6620a79690R154
9731a70536A12205c33811P3974B15414a06773n7962A01778a32502A23432a08823
$$ plain form
9812 -173241 -351220 -322772 80207 -157754 -51271 -360417 -127391 -85286 61558 -74692 -169739
9801 -169739 69395 -216689 -69569 -142989 29635 -20409 165265 -278106 -13609 243308 -93415
9789 119522 -20265 247338 -88441 -26169 -191299 22174 32659 -121172 -54491 443768 117693
9777 309603 -168280 -171321 -251853 244391 -152161 67483 215101 -93193 -183644 78778 -293036
9765 -123276 -88229 62877 -130952 -118034 -27688 -332862 21252 -227544 -153126 -350549 -77484
9753 -191584 99902 -84892 383905 -433734 8773 -161732 -201624 -132347 159073 -186276 -204408
9742 -204408 -343266 -87277 -167014 -34626 -249034 37986 -162301 -59772 26620 -179690 -170536
9731 -170536 112205 -333811 -259837 215414 -106773 -164735 101778 -132502 123432 -108823
9720h2058c5159k26701B42644a34485l1534i481D30766a09116C64370h180n2732
9709f0912l26320J91189p7630i4756m5100j9379A08588K0952g4533I198a01102
9697f5010j15900P1614D1004a66874j49628k78447b43542A46152c0305k99791
9687c30096A41069n7663b55592B49725I1301Q7718a38800m5695l6215r006A80898
9675A41608B5451a37858Q22A43149J4120J29275g8349l62007d6183C61745a73643
9663H7655l184a32358r3188j14641J03979N3020L0327j10625d5075A59483i2441
9651E7718f1940R929k35496a06317A17777A9420a65528k33691a89503b9363j26726
9640a56089j7268M3317Q589F1748Q2761J03346a29002e9210A08903a86783j17642
$$ plain form
9720 -82058 -35159 -261860 242644 -134485 -166019 -9481 430766 -109116 364370 -8180 -60912
9709 -60912 -387232 -196043 -273673 -94756 -139856 -159235 108588 129540 -74533 9198 -101102
9697 -65010 -180910 -109296 41004 -166874 -316502 -594949 -243542 146152 -30305 -330096
9687 -330096 141069 83406 -255592 249725 91301 179019 -138800 -184495 -220710 -229716 180898
9675 141608 25451 -137858 -137036 143149 157269 286544 -78349 -440356 -46183 361745 -173643
9663 87655 84471 -132358 -225546 -340187 -236208 -183188 -152861 -263486 -45075 159483 -92441
9651 57718 -61940 -52011 -287507 -106317 117777 19420 -165528 -399219 -189503 -29363 -156089
9640 -156089 -173357 -130040 -121451 61748 144509 247855 -129002 -59210 108903 -186783 -304425
9629c04425d6233k07523R5455A51344c87264a2088G2474B9194J58108b82592m5587
9618c28179R7744B04493q5361h7639C1482d9672n68640F5507f7276k23905A21524
9606I3981a82390n9076A05983A9035b27995P5771r4743j04132E1625J08137a01398
9594b17925a02157l06808a49837I0037a5393J702n2832J1443E754a45777k35354
9583c81131f8806B2215a25376j19423B8402K28685b77502D0141d3574k71937D1437
9571f9636q3404j8766B4809b22853J10072m7379p5459J3437A51827f1997E2178
9559A49520e6535l10883B476h9331d1196j05758G3430K51402d4550l74226A29594
9547A51802a46426A76151p5320a8569k2126k5762q9354c5889A120J19378a80790
$$ plain form
9629 -304425 -46233 -253756 -158301 151344 -387264 -12088 72474 29194 187302 -282592 -328179
9618 -328179 -230435 204493 119132 -87639 31482 -49672 -618312 65507 -67276 -291181 121524
9606 93981 -182390 -241466 105983 19035 -227995 -152224 -246967 -351099 51625 159762 -101398
9594 -217925 -102157 -408965 -149837 90037 -15393 -13691 -66523 -55080 5754 -145777 -381131
9583 -381131 -68806 22215 -125376 -244799 28402 257087 -277502 40141 -43574 -315511 41437
9571 -69636 -153040 -171806 24809 -222853 -112781 -160160 -235619 -222182 151827 -61997 52178
9559 149520 -56535 -367418 2476 -89331 -41196 -146954 73430 324832 -44550 -418776 129594
9547 151802 -146426 176151 100831 -18569 -40695 -66457 -155811 -35889 1120 120498 -180790
9535a74586p2490A28297a29934r1682a01953E9704K11438o6642I943b09165J03188
9524a05977C9543b12582H6824a26797l4714O3827A98180f2752k03369g5004q6290
9513a61294A22277R792f3393K6282D1076a88148d7770m8576j4298M339a4779D9755
9500b91292I2242P3796C812K27262A034b87490m3706i6381C452b01010H2639J2020
9488I4659c17586J39352q7996k42437J79974i9630B46209a06079k73959a48123
9477F4739M9150n6120k2245b744l7101p8114A18462a51474E5981h5909k95451
9466c81360a26096K9558c2319j96105A95214p7217a70676A07978b5638C46928
9455a95826Q8531q5289B7850R5357k5827k9593e2712A14275Q144a0891H4858a50691
$$ plain form
9535 -174586 -247076 128297 -129934 -221616 -101953 59704 271142 204500 9943 -209165 -105977
9524 -105977 39543 -212582 86824 -126797 -161511 -97684 198180 -62752 -266121 -75004 -161294
9513 -161294 122277 132069 -63393 -37111 41076 -188148 -47770 -96346 -110644 -106305 -14779 49755
9500 -291292 92242 166038 3812 231074 1034 -287490 -331196 -96381 3452 -201010 82639 94659
9488 94659 -317586 -178234 -266230 -508667 -328693 -99630 246209 -106079 -380038 -148123
9477 64739 113889 57769 35524 -2744 -39845 -117959 118462 -151474 55981 -85909 -381360
9466 -381360 -126096 -96538 -32319 -228424 195214 117997 -170676 107978 -25638 346928
9455 -195826 -107295 -192584 27850 123207 97380 67787 -52712 114275 122419 -10891 84858 -150691
9442b13078O2439l070N0270B03423a99994K9770f0258l0577k12373P8145A56704
9430b1146j39447C36151C0811I585f515k48800a3537F9492Q5603n3893L2380b78200
9417i4308G9034J01989C8974c85649a42876j49954R2190Q3844B71821k3292a57756
9405b62238l7573C5392A4548b47994B00330I481O8998l7217b88609k1044a01186
9393h3008E6970i5838j52960K6312R8278K9357I1717a22180o8903j030d0049j43249
9381a83298b7297l0908A91538a58827e9830A60210A5933P8618b61641A57703e5949
9369A74711a78493E6627e0029B64608F7869i2186n1639j61174J50195k0656k84759
9358d60219f4618j07502M2335f0696I7438j3331b4712D6062M0185e7100B53871
$$ plain form
9442 -213078 -150639 -153709 -103439 203423 -199994 -170224 -60258 -90835 -303208 -225063 156704
9430 -21146 -160593 336151 30811 9585 -6515 -255315 -13537 69492 155095 101202 133582 -278200
9417 -94308 79034 181023 38974 -385649 -142876 -292830 -200640 -116796 271821 248529 -157756
9405 -262238 -299811 35392 14548 -247994 200330 9481 78479 41262 -288609 -309653 -101186
9393 -83008 56970 -95838 -248798 -222486 -124208 -94851 91717 -122180 -191083 -192113 -40049 -183298
9381 -183298 -27297 -58205 191538 -158827 -59830 160210 15933 94551 -261641 157703 -55949
9369 174711 -178493 56627 -50029 264608 67869 -92186 -143825 -304999 -154804 -175460 -460219
9358 -460219 -64618 -172120 -129785 -60696 97438 84107 -24712 46062 86247 -57100 253871
9346b04794d407l3915q8656A08061d9323j02793A10703m3023c51270B45706F7589
9334c27853H9455c41236g6604j830j60665j96493I6240g1657C151a93551B62707
9322A14712a86970O6205j12940J145A45479E7669J85638e07054C5479b07812N7741
9311a50071j93990A4626M0180c6671j94205f4484j62223j06935d466k08362M3873
9300a68955J8542C1983b65756A27880c445I263J11817m9958J07711q8724N6863
9289A46972K0118a37582C63593B3675K05407a63624f0665e89C0569a92921A33491
9277a49408E2301K0638f1176j5289q4070C2107F21Q7452K20539a13584c6426j04188
9265a40614k0973A34236f3405j6410l24938H3999b06083q8988B47528K4021h7128
$$ plain form
9346 -204794 -4407 -38322 -126978 108061 -49323 -152116 110703 67680 -351270 245706 67589
9334 -327853 89455 -341236 -76604 -78434 -239099 -435592 96240 -71657 3151 -193551 262707
9322 114712 -186970 -120765 -233705 -232560 145479 57669 243307 -507054 35479 -207812 -150071
9311 -150071 -344061 14626 54806 -36671 -230876 -64484 -226707 -333642 -4466 -212828 -168955
9300 -168955 -150413 31983 -265756 127880 -3445 9263 121080 71122 178833 90109 146972
9289 146972 167090 -137582 363593 23675 229082 -163624 -60665 -589 30569 -192921 133491
9277 -149408 52301 72939 -61176 -76465 -160535 32107 621 88073 308612 -113584 -36426 -140614
9265 -140614 -161587 134236 -63405 -79815 -404753 83999 -206083 -295071 247528 271549 -87128
9253c3383F5445L1055K7479f2850B27948b22767K046d5763q7180A42090b65016
9241E0911h0061G4189J18560b43827g4916l47516b04579G3835d16439d9561m6689
9230i6250B39825i4429j81809J35011a3117j13933l18427N2079N1570b0563k60417
9219b80980B67811f9766F1715a98895g3833H8301c8380o7860A53052m8227M8211
9208A53036g5161A47374A3175e8695B0574b73051c0163j75269P2055d6955j48407
9197a95362D0806O2596a79123e9313j87331B33359B960R1234f7049k36493A64388
9185b30527E002f0562b9192l24487a25569I3570J36694a03852D5438a15328j6437
9174a31765A25334E5962L3179a93562j8720A2541b30330l0981a2412p3185C09676
$$ plain form
9253 -33383 65445 96500 123979 -62850 227948 -222767 -220721 -45763 -132943 142090 -265016
9241 50911 -80061 74189 192749 -243827 -74916 -422432 -204579 73835 -416439 -49561 -96250
9230 -96250 239825 -94429 -276238 -141227 -13117 -127050 -445477 -393398 -341828 -20563 -280980
9219 -280980 267811 -69766 61715 -198895 -73833 88301 -38380 -106240 153052 104825 153036
9208 153036 -75161 147374 13175 -58695 20574 -273051 -30163 -205432 -133377 -46955 -195362
9197 -195362 40806 103402 -179123 -59313 -246644 233359 2960 94194 -67049 -303542 164388
9185 -230527 5002 -60562 -29192 -353679 -125569 93570 230264 -103852 45438 -115328 -131765
9174 -131765 125334 55962 89141 -193562 -212282 12541 -230330 -261311 -12412 -85597 309676
9162c72595J35709h759k79576J42999I6479b9812k24307H2248J3335h5394D1441
9150B04104r3821b64982I7883a37083n1709j40992E0867d0781F870R3209J29059
9139B29138e1593C2469g7130k1507q0935c8155A26293d21694a41354j05598L6238
9128b10714I9217E760b9329k36577B43338H3061a90273j26510E290a88495B1043
9116F8552a34870a5693A05418p196h5501p4484M7103j06220J8844o0274B65716
9104E7975L9870a90063A1463J00205N4684i4132H1175Q082J36926m3557b27474
9092a75193B1303a87349P5202j65475g8074A18654C8233b9946j49215B19246p4715
9081A44531a38213f4134l1743k6184N5392B30670a78971m7616D6418K44184a18851
$$ plain form
9162 -372595 -236886 -8759 -288335 -145336 96479 -29812 -254119 82248 95583 -85394 41441
9150 204104 110283 -264982 97883 -137083 -188792 -329784 50867 -40781 6870 100079 229138
9139 229138 -51593 32469 -77130 -98637 -179572 -38155 126293 -421694 -141354 -246952 -210714
9128 -210714 99217 5760 -29329 -265906 243338 83061 -190273 -316783 5290 -188495 21043
9116 68552 -134870 -15693 105418 98222 -85501 -159985 -112882 -219102 -200258 -260532 265716
9104 57975 97845 -190063 11463 111668 166352 -94132 81175 89257 226183 182626 -227474
9092 -175193 21303 -187349 -112147 -277622 -78074 118654 38233 -29946 -179161 219246 144531
9081 144531 -138213 -64134 -95877 -122061 -66669 230670 -178971 -226587 46418 290602 -118851
9069d3040F9277c93875B8426e9242j30038c2452j43855A40257b49854H9694b1469
9057b17464m2433B49545G544K52641k7532E739f0128j46639M6513j02191C26598
9045H5760B4536b80172e3166l5190k10853R6256j9339B1171a85032L0409A799
9033A56967c2704A2245b78276B81481C1593J9437P4019E3990E700d828A9631R3795
9021A13426i5415A30659a59126d2281B11586g4775J8430F4404b6461b198j32112
9010a34310A01905a1140H934c29368J61940A35887a47066j95397A79144a5570
8999a98534p2829a06052a6890o4166l8336B3379N9308K59932f2648b3943j67119
8988a91062B30606q6291g695n541j33227j85844K1652a8080k42783b08l1860A97514
$$ plain form
9069 -43040 69277 -393875 28426 -59242 -189280 -32452 -176307 140257 -249854 89694 -21469
9057 -217464 -259897 249545 7544 260185 232653 5739 -60128 -206767 -160254 -262445 326598
9045 85760 24536 -280172 -53166 -88356 -299209 -202953 -222292 21171 -185032 -154623 1799
9033 156967 -32704 12245 -278276 281481 31593 51030 125049 53990 5700 -4828 19631 113426
9021 113426 -95415 130659 -159126 -42281 211586 -74775 -56345 64404 -26461 -2198 -134310
9010 -134310 101905 -11140 8934 -329368 -167428 135887 -147066 -342463 179144 -15570
8999 -198534 -271363 -106052 -16890 -81056 -119392 23379 82687 342619 -62648 -23943 -191062
8988 -191062 230606 144315 -7695 -13236 -146463 -332307 -310655 -18080 -260863 -208 -32068 197514
8975A20871a23796B99098f3979l73336a39351A35527b06133A50948g1116A11543
8964b69222j76465H6817a1241j81579D9760c3071G4194J75970a34253C10982j07571
8953B03411k2436a41874J6037B6697a38403a0633B336e9405A63021b33469f3292
8941b52195o4694J48230L5490k5265f7382I2490C4106q932d2919l58048F7509
8929c1322I0501d2164A39967P9943l2966j0347Q48267N544036M341898B510758
8918C19773A24252K6212J25733a30872M3330k07554b6924B9480b0657B26991K53275
8907D80266G329J11788L9202a34807N5242m4556d5778G6616d67441f9813j00632
8896a70445B0238a3227n8129B9744c4311E8292J94809c3425m303q3402j85738
$$ plain form
8975 120871 -123796 299098 -63979 -437315 -139351 135527 -206133 150948 -71116 111543
8964 -269222 -445687 86817 -11241 -192820 49760 -33071 74194 250164 -134253 310982 203411
8953 203411 180975 -141874 -125837 26697 -138403 -10633 2336 -59405 163021 -233469 -63292
8941 -252195 -316889 -168659 -133169 -158434 -67382 92490 34106 25174 -42919 -400967 67509
8929 -31322 90501 -42164 139967 219910 186944 176597 1024864 6568900 10910798 2510758
8918 319773 124252 150464 276197 -130872 -87542 -295096 -26924 29480 -20657 226991 480266
8907 480266 7329 119117 158319 -134807 -79565 -124121 -45778 76616 -467441 -69813 -170445
8896 -170445 20238 -13227 -71356 29744 -34311 58292 253101 -33425 -37728 -121130 -306868
8885c06868c5476a1761o8508l59189g5574m35195a95774P6493p1059j70555a3833
8873i5926j05417A08448C4492a71608P8037L8808a3671j08128k18717c8409l06857
8862c45266A61029P5732F5688R5084D204J10024a60678d760k15025B7750K93734
$$ plain form
8885 -306868 -35476 -11761 -80269 -439458 -75574 -510769 -195774 -119281 -190340 -360895 -13833
8873 -95926 -201343 108448 34492 -171608 -93571 -54763 -13671 -121799 -340516 -38409 -345266
8862 -345266 161029 236761 65688 160772 4204 114228 -160678 -4760 -219785 27750 321484
$$ [...]
##END NTUPLES=NMR SPECTRUM
##END=
