
##TITLE=AC1401_BRAH12210_7653281_WSfRedx4O0
##JCAMPDX= 6.0         $$ Bruker NMR JCAMP-DX V2.0
##DATA TYPE= NMR SPECTRUM
##DATA CLASS= NTUPLES
##ORIGIN= BRUKER
##OWNER= Administrator
$$ 1.72 TOPSPIN		Version 2.1
$$ 2013-03-19 20:28:29.947 -0500  Administrator@X
$$ Compression mode = diff/dup
##.OBSERVE FREQUENCY= 400.02188249412
##.OBSERVE NUCLEUS= ^1H
##.ACQUISITION MODE= SIMULTANEOUS (DQD)
##.ACQUISITION SCHEME= undefined
##.AVERAGES= 64
##.DIGITISER RES= 22
##SPECTROMETER/DATA SYSTEM= spect
##.PULSE SEQUENCE= noesygpps1d.comp
##.SOLVENT NAME= COFFEE_meoh
##.SHIFT REFERENCE= INTERNAL, COFFEE_meoh, 1, 14.96097
##AUDIT TRAIL= $$ (NUMBER, WHEN, WHO, WHERE, PROCESS, VERSION, WHAT)
$$ ##TITLE= Audit trail, TOPSPIN		Version 2.1
$$ ##JCAMPDX= 5.01
$$ ##ORIGIN= Bruker BioSpin GmbH
$$ ##OWNER= Administrator
$$ $$ E:\/data/COFFEE/nmr/AC1401_BRAH12210_7653281_WSfRedx4O0/12/pdata/1/auditp.txt
$$ ##AUDIT TRAIL=  $$ (NUMBER, WHEN, WHO, WHERE, PROCESS, VERSION, WHAT)
(   1,<2013-03-19 20:28:24.072 -0500>,<Administrator>,<X>,<go>,<TOPSPIN 2.1>,
      <created by zg
	started at 2013-03-19 20:16:54.213 -0500,
	POWCHK enabled, PULCHK disabled,
       configuration hash MD5:
       86 BA 57 50 F2 9D 5C 9B 26 00 A9 28 5F 66 2E 89
       data hash MD5: 64K
       6E F5 CF D4 75 2A 21 C0 BA EB E6 0D D2 10 D5 E8>)
(   2,<2013-03-19 20:28:27.182 -0500>,<Administrator>,<X>,<proc1d>,<TOPSPIN 2.1>,
      <Start of raw data processing
       efp LB = 0.3 FT_mod = 6 PKNL = 1 PHC0 = 0 PHC1 = 0 SI = 128K 
       data hash MD5: 128K
       67 79 1C 89 8B 30 DB 34 CE E0 B0 47 12 90 C7 DA>)
(   3,<2013-03-19 20:28:28.244 -0500>,<Administrator>,<X>,<proc1d>,<TOPSPIN 2.1>,
      <pk PHC0 = -75.42114 PHC1 = 0 
       data hash MD5: 128K
       73 A0 DB 2D D4 99 44 70 88 0F 90 99 65 9D A1 EE>)
(   4,<2013-03-19 20:28:28.885 -0500>,<Administrator>,<X>,<proc1d>,<TOPSPIN 2.1>,
      <abs ABSG = 1 
       data hash MD5: 128K
       07 CF B3 19 87 0C DA 93 FB CD 0C EE 9D 55 03 0A>)
(   5,<2013-03-19 20:28:29.072 -0500>,<Administrator>,<X>,<proc1d>,<TOPSPIN 2.1>,
      <abs ABSG = 2 
       data hash MD5: 128K
       7E 83 67 30 F3 7C 42 51 65 CF F5 CE 11 F4 82 55>)
(   6,<2013-03-19 20:28:29.229 -0500>,<Administrator>,<X>,<proc1d>,<TOPSPIN 2.1>,
      <abs ABSG = 3 
       data hash MD5: 128K
       F7 2C 22 0A 55 9E B4 AB 58 E8 8B 3A C9 8A 29 E2>)
(   7,<2013-03-19 20:28:29.400 -0500>,<Administrator>,<X>,<proc1d>,<TOPSPIN 2.1>,
      <abs ABSG = 4 
       data hash MD5: 128K
       A6 2D 6E 92 B1 37 BF 07 71 D1 F5 1B D7 01 3F E5>)
(   8,<2013-03-19 20:28:29.588 -0500>,<Administrator>,<X>,<proc1d>,<TOPSPIN 2.1>,
      <abs ABSG = 5 
       data hash MD5: 128K
       6F 19 24 A8 11 6B 0D B4 35 60 21 3D 41 D3 98 EA>)
$$ ##END=
$$ 
$$ $$ hash MD5
$$ $$ D1 CF 40 3C C4 BC CC 29 26 A6 EC A7 F1 44 14 96
##$RELAX= 
##$RELAX= 
##$RELAX= 
##$RELAX= 
##$RELAX= 
##$RELAX= 
##$RELAX= 
##$RELAX= 
$$ Bruker specific parameters
$$ --------------------------
##$DU= <E:\>
##$EXPNO= 12
$$ [...]
##$TP07= 0
##$TPNAME0= <>
##$TPNAME1= <>
##$TPNAME2= <>
##$TPNAME3= <>
##$TPNAME4= <>
##$TPNAME5= <>
##$TPNAME6= <>
##$TPNAME7= <>
##$TPOAL= (0..7)
0.5 0.5 0.5 0.5 0.5 0.5 0.5 0.5
##$TPOFFS= (0..7)
0 0 0 0 0 0 0 0
##$TUNHIN= 0
##$TUNHOUT= 0
##$TUNXOUT= 0
##$USERA1= <user>
##$USERA2= <user>
##$USERA3= <user>
##$USERA4= <user>
##$USERA5= <user>
##$V9= 5
##$VALIST= <valist>
##$VCLIST= <CCCCCCCCCCCCCCC>
##$VD= 0
##$VDLIST= <DDDDDDDDDDDDDDD>
##$VPLIST= <PPPPPPPPPPPPPPP>
##$VTLIST= <TTTTTTTTTTTTTTT>
##$WBST= 2048
##$WBSW= 25
##$XGAIN= (0..3)
0 0 0 0
##$XL= 0
##$YL= 0
##$YMAX_a= 5993874
##$YMIN_a= -13017382
##$ZGOPTNS= <>
##$ZL1= 120
##$ZL2= 120
##$ZL3= 120
##$ZL4= 120
##$ABSF1= 14.96097
##$ABSF2= -5.597212
##$ABSG= 5
##$ABSL= 3
##$ALPHA= 0
##$AQORDER= 0
##$ASSFAC= 0
##$ASSFACI= 0
##$ASSFACX= 0
##$ASSWID= 0
##$AUNMP= <proc_prof1d_extract.lims>
##$AXLEFT= 0
##$AXNAME= <>
##$AXNUC= <1H>
##$AXRIGHT= 0
##$AXTYPE= 0
##$AXUNIT= <>
##$AZFE= 0.1
##$AZFW= 0.1
##$BCFW= 0
##$BC_mod= 0
##$BYTORDP= 0
##$COROFFS= 0
##$CY= 15
##$DATMOD= 1
##$DC= 0
##$DFILT= <>
##$DTYPP= 0
##$F1P= 0
##$F2P= 0
##$FCOR= 0.5
##$FTSIZE= 131072
##$FT_mod= 6
##$GAMMA= 0
##$GB= 0
##$INTBC= 1
##$INTSCL= 1
##$ISEN= 128
##$LB= 0.3
##$LEV0= 0
##$LPBIN= 0
##$MAXI= 10000
##$MC2= 0
##$MEAN= 0
##$ME_mod= 0
##$MI= 0
##$NCOEF= 0
##$NC_proc= -2
##$NLEV= 6
##$NOISF1= 0
##$NOISF2= 0
##$NSP= 0
##$NTH_PI= 0
##$NZP= 0
##$OFFSET= 14.96097
##$PC= 1
##$PHC0= -75.42114
##$PHC1= 0
##$PH_mod= 1
##$PKNL= yes
##$PPARMOD= 0
##$PPDIAG= 0
##$PPIPTYP= 0
##$PPMPNUM= 2147483647
##$PPRESOL= 1
##$PSCAL= 4
##$PSIGN= 0
##$PYNMP= <proc.py>
##$REVERSE= no
##$SF= 400.020009648008
##$SI= 131072
##$SIGF1= 0
##$SIGF2= 0
##$SINO= 400
##$SIOLD= 131072
##$SPECTYP= <>
##$SREGLST= <1H.CDCl3>
##$SSB= 0
##$STSI= 131072
##$STSR= 0
##$SW_p= 8223.68421052631
##$SYMM= 0
##$S_DEV= 0
##$TDeff= 65536
##$TDoff= 0
##$TI= <>
##$TILT= no
##$TM1= 0
##$TM2= 0
##$TOPLEV= 0
##$USERP1= <user>
##$USERP2= <user>
##$USERP3= <user>
##$USERP4= <user>
##$USERP5= <user>
##$WDW= 1
##$XDIM= 131072
##$YMAX_p= 424092655
##$YMIN_p= -12813
##$CURPLOT= <Network HP LaserJet P1505>
##$CURPRIN= <$Network HP LaserJet P1505>
##$DFORMAT= <normdp>
##$LAYOUT= <+/1D_H.xwp>
##$LFORMAT= <normlp>
##$PFORMAT= <normpl>
##$SURQMSG= 1
$$ End of Bruker specific parameters
$$ ---------------------------------
##NTUPLES= NMR SPECTRUM
##VAR_NAME=  FREQUENCY,     SPECTRUM/REAL,   SPECTRUM/IMAG
##SYMBOL=    X,             R,               I
##VAR_TYPE=  INDEPENDENT,   DEPENDENT,       DEPENDENT
##VAR_FORM=  AFFN,          ASDF,            ASDF
##VAR_DIM=   131072,        131072,          131072
##UNITS=     HZ,            ARBITRARY UNITS, ARBITRARY UNITS
##FACTOR=    0.0627417313425164, 1,          1
##FIRST=     8223.62146879497, -950,         -63899
##LAST=      0,             2428,            -63545
##MIN=       0,             -12813,          0
##MAX=       8223.62146879497, 424092655,    0
$$ Real data points
##PAGE= N=1
##DATA TABLE= (X++(R..R)), XYDATA
$$ [...]
61708E14837j97j096j859k786l694m093m054m237m864n305n087m606m329l924
61694D64706k929j907j954l109m052l672k399j549j758k405k572k232k211k974
61680D28983l796l583k357j334j348j847j807j086k86K56O65Q83O14r6q12j243
61664D11806j387j148l58P47J489J430Q07K14J20O69J598K322K421K126K082K540
61648D27478L050L079K653K222K061K008J825J619J757K352L016L249K960K376
61634D61705J584N13p66k093l465m707n128m213k711k102k715l300k882k048j722
61619D25950j660j160n13m86q52o40K86J018R23K16p99k041l235m020m597n434
61603D02956o318o584o272o073o089n613m417l256k749k658k698l155m129m913
$$ plain form
61708 514837 514640 513544 511685 508899 505205 501112 497058 492821 487957 482652 477565 472959 468630 464706
61694 464706 461777 459870 457916 454807 450755 447083 444684 443135 441377 438972 436400 434168 431957 428983
61680 428983 425187 421604 419247 417913 416565 414718 412911 411825 411539 411795 412460 413343 413957 413861 413049 411806
61664 411806 410419 409271 408913 409660 411149 412579 413386 413600 413720 414389 415987 418309 420730 422856 424938 427478
61648 427478 430528 433607 436260 438482 440543 442551 444376 445995 447752 450104 453120 456369 459329 461705
61634 461705 463289 463802 463036 460943 457478 452771 447643 443430 440719 438617 435902 432602 429720 427672 425950
61619 425950 424290 423130 422617 422131 421279 420639 420925 421943 422866 423082 422283 420242 417007 412987 408390 402956
61603 402956 396638 390054 383782 377709 371620 366007 361590 358334 355585 352927 350229 347074 342945 338032
61589C38032m755l758k574j705j435j908k756l182k853k352k287k442k290j893
61575C01842j793k147k543k551k134j562j107p98m93k02k24o50r87p33j78j6l47
61558B83377o96r10j239j492j060O2J056J436J543J692J632J286J140J406J541
61543B90774J162P07O52P72P55Q78J422K029K296K468K861L168K990K550K184
61528C17668J647O17n39j257j635k092k608k948l186l367l117k301j579j519j653
61513B92131j282p17p16j143j255j045j122j465j409q40l08O8O27J160J001L49
61497B84034K51R67J514J286J019J435J966J680P24o2m31p69j187j391j285j023
61481B88728n62L00J437K402K829K604J726M10p24r62j42J118J913J738Q65R3
$$ plain form
61589 338032 333277 329519 326945 325240 323805 321897 319141 315959 313106 310754 308467 306025 303735 301842
61575 301842 300049 297902 295359 292808 290674 289112 288005 287207 286714 286512 286288 285638 284651 283918 283740 283724 283377
61558 283377 282681 281771 280532 279040 277980 278042 279098 280534 282077 283769 285401 286687 287827 289233 290774
61543 290774 291936 292643 293295 294067 294822 295700 297122 299151 301447 303915 306776 309944 312934 315484 317668
61528 317668 319315 319932 319393 318136 316501 314409 311801 308853 305667 302300 299183 296882 295303 293784 292131
61513 292131 290849 290132 289416 288273 287018 285973 284851 283386 281977 281137 280829 280897 281524 282684 283685 284034
61497 284034 284285 285252 286766 288052 289071 290506 292472 294152 294876 294814 294383 293614 292427 291036 289751 288728
61481 288728 288166 288466 289903 292305 295134 297738 299464 299874 299150 298188 298046 299164 301077 302815 303680 303773
61465C03773o8P1j71q68j360j179o75m72o30p62p15p19r39j155r43r0J155K166
61447B96419K400J847R54J61l21l36K16J142J964K404K577K666K707K809L219
61432C20828L903M349M134L448K768K217J549O67j86o30m01M67J517K096J978
61417C48704J600J452J479J406J326J453J469P95m81j512j823j923k463l237l456
61402C44789k808j744q58m06m67j087k089k904k917k051q88q3K66N96J126J436
61386C29911J038K39j00L24R06J092J168J631K312K723K976L532M175M121L233
61371C59281K352K133K278K278K256K440K476J940J169Q82J157J463J572J733
61357C85410K044K288K476K950L795M657N303N903O647P404P843P563O223L979
$$ plain form
61465 303773 303705 303776 303605 302737 301377 300198 299523 299051 298421 297659 296944 296225 295286 294131 293188 293098 294253 296419
61447 296419 298819 300666 301620 301781 301460 301124 301340 302482 304446 306850 309427 312093 314800 317609 320828
61432 320828 324731 329080 333214 336662 339430 341647 343196 343863 343677 343047 342646 343113 344630 346726 348704
61417 348704 350304 351756 353235 354641 355967 357420 358889 359684 359203 357691 355868 353945 351482 348245 344789
61402 344789 341981 340237 339379 338973 338506 337419 335330 332426 329509 327458 326570 326487 326753 327349 328475 329911
61386 329911 330949 331188 331088 331412 332318 333410 334578 336209 338521 341244 344220 347752 351927 356048 359281
61371 359281 361633 363766 366044 368322 370578 373018 375494 377434 378603 379485 380642 382105 383677 385410
61357 385410 387454 389742 392218 395168 398963 403620 408923 414826 421473 428877 436720 444283 450506 454485
61343D54485J849R68J378K032K170K107K444L098L558L613L355K816J999J093
61329D86965K27p01j718k531k976l325l769l913l312k282j605j453j246n40M06
61314D58227J155J725K446L470M692N940P118Q230R433J0962J2804J4465J5187
61301E55854J4477J2433R554O347L158K43k183m062n513o610p239p284o832o074
61287E56269n211m558m468m895n270n111m552l852k840j349N3O62Q68J865L927
61272E21538N877O664O608O471O131N047L581K759K862L113K976L025M169O405
61258E87226Q671R747R156P342N183L339J965R42K41l2R0K71L5p66j717k266k430
61241F26997k796l649m536n010n324n787n934n218m229m114m742m665l153j194
$$ plain form
61343 454485 456334 457302 458680 460712 462882 464989 467433 470531 474089 477702 481057 483873 485872 486965
61329 486965 487192 486491 484773 482242 479266 475941 472172 468259 464947 462665 461060 459607 458361 457821 458227
61314 458227 459382 461107 463553 467023 471715 477655 484773 493003 502436 513398 526202 540667 555854
61301 555854 570331 582764 592318 598665 601823 602066 599883 595821 590308 583698 576459 569175 562343 556269
61287 556269 551058 546500 542032 537137 531867 526756 522204 518352 515512 514163 514216 514878 515746 517611 521538
61272 521538 527415 534079 540687 547158 553289 558336 561917 564676 567538 570651 573627 576652 580821 587226
61258 587226 595897 605644 614800 622142 627325 630664 632629 633571 633812 633780 633870 634141 634176 633410 631693 629427 626997
61241 626997 624201 620552 616016 611006 605682 599895 593961 588743 584514 580400 575658 570993 567840 566646
61227E66646N7O60J126J286R22O46J115J967K506K916L748M728N206N479O389
61212F05397P727Q209P216N470L810K286Q49m0o8L82R11J851L730O333Q813J0637
61196F73513J2017J3521J5464J7670J9561K0394J9538J6811J2798Q771N832L971
61184H39861K318N11o96o03J56J92j021k743m115n062n977p015p886q148p660
61169G92112o909o660p131p882q646r744j1161j1980j1589j0956j1533j3073j3768
61156F61080j2705j0982r952r382q100n756l069p06J218K576K796J378j461m822
61142F02113p824j0078j1524j1962j1184r579q010o866n632l849j984p98j24Q80
61128E13579K455M021N185O218P319Q248Q976J0083J2007J4277J5983J6875J7608
$$ plain form
61227 566646 566703 567363 568489 569775 570697 571343 572458 574425 576931 579847 583595 588323 593529 599008 605397
61212 605397 613124 621333 628549 634019 637829 640115 640964 640924 640856 641238 642149 644000 647730 654063 662876 673513
61196 673513 685530 699051 714515 732185 751746 772140 791678 808489 821287 830058 835890 839861
61184 839861 842179 842690 841994 841391 841547 841739 840718 837975 833860 828798 822821 815806 807920 799772 792112
61169 792112 785203 778543 771412 763530 754884 745140 733979 721999 710410 699454 687921 674848 661080
61156 661080 648375 637393 627441 618059 609959 604203 601134 600428 601646 604222 607018 608396 606935 602113
61142 602113 594289 584211 572687 560725 549541 539962 531952 525086 519454 515605 513621 512823 512699 513579
61128 513579 516034 520055 525240 531458 538777 547025 556001 566084 578091 592368 608351 625226 642834
61115F42834J8974K1063K3186K4604K5237K5532K5722K5497K4649K3538K2630
61104I03466K1840K0728J9023J6555J3042Q469L481j177n336r085j2150j4304
61092I64552j6024j7976j9987k1314k1850k2181k2553k2617k2252k1796k1363
61081G34639k0657j9583j8342j6890j5090j3458j2771j2757j2087j0092p619n744
61069E69549m464l309k430k225k333j862n93P02J240J094J003J502K410L227L883
61054E67394M810O151P341P886Q154Q874J0094J1317J2510J4165J6320J8304J9615
61041G12935K0500K1425K2489K3596K4727K5849K6816K7471K7692K7469K7176
61030I88145K7532K8981L1283L4078L7272M0566M3093M4199M4099M3294M2050
$$ plain form
61115 642834 661808 682871 706057 730661 755898 781430 807152 832649 857298 880836 903466
61104 903466 925306 946034 965057 981612 994654 1003123 1006604 1005427 1000091 991006 978856 964552
61092 964552 948528 930552 910565 889251 867401 845220 822667 800050 777798 756002 734639
61081 734639 713982 694399 676057 659167 644077 630619 617848 605091 593004 582912 575293 569549
61069 569549 565085 561776 559346 557121 554788 552926 552333 553035 554275 555369 556372 557874 560284 563511 567394
61054 567394 572204 578355 585696 593582 601736 610610 620704 632021 644531 658696 675016 693320 712935
61041 712935 733435 754860 777349 800945 825672 851521 878337 905808 933500 960969 988145
61030 988145 1015677 1044658 1075941 1110019 1147291 1187857 1230950 1275149 1319248 1362542 1404592
61019A404592M1093M1976M5716N1847N9703O9578Q1296R2760J01916J09589J18754
61008B218820J31841J50714J78265K17264K67907L28968M00983M86036N86284
60999D967082P07328Q63362J074893J360364J728402K162548K587529K845639
60991A8297147K744590K186226J278487L09056m18012p41146o69066l04470K12691
60982B2895503O94026R05599O64704k5928r47841j793742k345654k557375k505969
60973A4983323k297145k012188j705307j412820j154491r35488p54170o07561
60965D104153m90854l97341l21797k62170k17122j83876j59173j40496j25712
60956A805612j13043j01907r2480q4049p5151o5437n5979m7544m0031l3819l0133
$$ plain form
61019 1404592 1445685 1487661 1533377 1585224 1644927 1714505 1795801 1888561 1990477 2100066 2218820
61008 2218820 2350661 2501375 2679640 2896904 3164811 3493779 3894762 4380798 4967082
60999 4967082 5674410 6537772 7612665 8973029 10701431 12863979 15451508 18297147
60991 18297147 21041737 23227963 24506450 24815506 24397494 23656348 22987282 22682812 22895503
60982 22895503 23589529 24495128 25159832 25133904 24186063 22392321 20046667 17489292 14983323
60973 14983323 12686178 10673990 8968683 7555863 6401372 5465884 4711714 4104153
60965 4104153 3613299 3215958 2894161 2631991 2414869 2230993 2071820 1931324 1805612
60956 1805612 1692569 1590662 1498182 1414133 1338982 1273545 1217566 1170022 1129991 1096172 1066039
60945A066039k9472l0811l2774l4468l5112l4063l1731k9325k7375k5386k3163
60934G32359k1233j9774j8284j6637j5378j4592j3618j2254j1182j0696j0098
60923E68613q859p457o509n901n340n015n125n401n484n294m752l839l012k866
60909D93759l183l076k250j301o67k05l1o40j839k567k300j810j920k415k717
60894D66838k846l039l085k751k330k140j936j338m65K82P09P66L79l30j014j510
60878D46190j895k051j670q38m4N09J025J503J707J848K539L816M988N661O138
60863D69426O527O388N710N353N942O999P744Q161Q637R014Q675P317N353L760
60849E65006L510M682O076O407N867N690O135O018M596K730J526Q67J35m62l00
$$ plain form
60945 1066039 1036567 1005756 972982 938514 903402 869339 837608 808283 780908 755522 732359
60934 732359 711126 691352 673068 656431 641053 626461 612843 600589 589407 578711 568613
60923 568613 559754 552297 545788 539887 534547 529532 524407 519006 513522 508228 503476 499637 496625 493759
60909 493759 490576 487500 485250 483949 483282 483077 483046 482406 480567 478000 475700 473890 471970 469555 466838
60894 466838 463992 460953 457868 455117 452787 450647 448711 447373 446908 447190 447899 448665 449044 448714 447700 446190
60878 446190 444295 442244 440574 439736 439692 440201 441226 442729 444436 446284 448823 452639 457627 463288 469426
60863 469426 475953 482341 488051 493404 499346 506345 514089 522250 530887 539901 548576 555893 561246 565006
60849 565006 568516 573198 579274 585681 591548 597238 603373 609391 613987 616717 618243 619110 619245 618783 618483
60834F18483N21J356J999K737L707M836O151P577Q793R662J0483J1440J2277J2842
60820G12864J3340J3670J3267J2170J1398J1458J1234R408O371L704K045O27j245
60807H20311l355n254o863q147q885r128r336r875j0631j1266j1627j1785j1926
60794G02233j2168j2345j2129j1460j0670r989r230q271p534p585q367r207r478
60781E73800r026q077p006o164n726n687n938o221o219n932n854o259o550n931
60767D83210m673l902m081m530m596m456m416m371m361m778n406n214l750k049
60753D22627j420j974l031m165n036m916l569k018j442j538j105J05J095J070
60739C94683J65j215k816m140m523l882k843k016j540j321j198r20l63K91Q76
$$ plain form
60834 618483 619004 620360 622359 625096 628803 633639 639790 647367 656160 665822 676305 687745 700022 712864
60820 712864 726204 739874 753141 765311 776709 788167 799401 808809 815180 818884 820929 821556 820311
60807 820311 816956 811702 804839 796692 787807 778679 769343 759468 748837 737571 725944 714159 702233
60794 702233 690065 677720 665591 654131 643461 633472 624242 615971 608437 600852 592485 583278 573800
60781 573800 564774 556697 549691 543527 537801 532114 526176 519955 513736 507804 501950 495691 489141 483210
60767 483210 478537 474635 470554 466024 461428 456972 452556 448185 443824 439046 433640 428426 424676 422627
60753 422627 421207 419233 416202 412037 407001 402085 398516 396498 395056 393518 392413 392518 393613 394683
60739 394683 394848 393633 390817 386677 382154 378272 375429 373413 371873 370552 369354 368434 368071 368362 369238
60724C69238J520K122K044R35m36j002q47r57j657k224k149j896k073k582l025
60709C57011l416l996m658m941m564l766l069k749k570k161j590j240j171j038
60695C16082p99q36j092q54N3O10qj050j107q7Q52J074J075J286J418J298J390
60678C19305K033K860L299L167K496J394L60K01J201K744L985M575M513L825K728
60663C58686J768J327J165P59M5m46k21N69J291J616J898K599L516M054M207M579
60647C87412N246N367M425L114K301J629J61j990l664m267m415m855n523n906
60633C79035n775n326m971m987n058m367k637q81l79j103j842j765j104l82J39
60618C38597J75m66j270j303m67L32M48K12Q9o1m63q30q29n81l11mK91L14J53
$$ plain form
60724 369238 370758 372880 374924 375859 375423 374421 373574 372617 370960 368736 366587 364691 362618 360036 357011
60709 357011 353595 349599 344941 340000 335436 331670 328601 325852 323282 321121 319531 318291 317120 316082
60695 316082 315283 314447 313355 312501 312554 313164 313156 312106 310999 310912 311764 312838 313913 315199 316617 317915 319305
60678 319305 321338 324198 327497 330664 333160 334554 334914 335115 336316 339060 343045 347620 352133 355958 358686
60663 358686 360454 361781 362946 363705 363750 363304 363083 363652 364943 366559 368457 371056 374572 378626 382833 387412
60647 387412 392658 398025 402450 405564 407865 409494 409655 407665 404001 399734 395319 390464 384941 379035
60633 379035 373260 367934 362963 357976 352918 348551 345914 345033 344654 343551 341709 339944 338840 338458 338597
60618 338597 338772 338306 337036 335733 335266 335598 336046 336258 336347 336286 335823 334993 334164 333583 333272 333268 333559 333873 334026
60599C34026L69J086J564J143J50n55o20k16M77J310J929K031J745J406J214J241
60583C48300J481J621J172K36l67r6N67Q76Q71J124J795K614L501M554N507N934
60567C79690O001O396P520R175J1052J2901J4151J4047J2465J0152P855N524K717
60554D99646n04l467n584o835p543p813p344n758l201m63J600K843L838N155O906
60539D71476Q971J1353J4014J6609J8683K0008K0449J9627J7182J3375Q980M533
60527F45260N5m330q014j0429j1540j1565j0603r031p762p377p291o544n270m496
60513E41063m491m263l053j433l47K08R46K205L694N073O235P307Q737J1079J4345
60498E87305J7938K1586K5846L1199L7120M2645M7427N1583N4857N6661N6721
$$ plain form
60599 334026 334395 335481 337045 338188 338338 337783 337163 336947 337424 338734 340663 342694 344439 345845 347059 348300
60583 348300 349781 351402 352574 352810 352443 352347 352914 353790 354661 355785 357580 360194 363695 368249 373756 379690
60567 379690 385691 392087 399607 408782 419834 432735 446886 460933 473398 483550 491405 496929 499646
60554 499646 499142 495675 490091 483256 475713 467900 460556 454798 451597 451134 452734 455577 459415 464570 471476
60539 471476 480447 491800 505814 522423 541106 561114 581563 601190 618372 631747 640727 645260
60527 645260 645315 640985 632971 622542 611002 599437 588834 579803 572041 564664 557373 550829 545559 541063
60513 541063 536572 532309 529256 527823 527476 527684 528630 530835 534529 539602 545837 553144 561881 572960 587305
60498 587305 605243 626829 652675 683874 720994 763639 811066 862649 917506 974167 1030888
60487A030888N4945N0941M4366L5471K4630J1561l978k0777l6348m8680n7256
60476A085763o2359o4260o3283n9967n4890m8747m2630l7539l3555k9985k6377
60465E62171k2841j9453j6160j3396j1849j1355j0721r108o928n094l994l575
60453D27697l809m431m774m440l929m050m858n543n347m260k954k110j796j460
60439C73936o71L09Q95R36O69J49o63j399j558j319j340j663j577p78O1L17K29
60422C66533K86M14L10J42K88O97R86J001Q93Q15Q31R40J006Q64O37O56J010J467
60404C79776J860K140K043J275J22o53o86k01O44J855K915K968K121J677K453
60389D00309L598L764K868J914J607J904K514L090L141K456J477P66L98K96P01
$$ plain form
60487 1030888 1085833 1136774 1181140 1216611 1241241 1252802 1248824 1228047 1191699 1143019 1085763
60476 1085763 1023404 959144 895861 835894 781004 732257 689627 652088 618533 588548 562171
60465 562171 539330 519877 503717 490321 478472 467117 456396 447288 440360 435266 431272 427697
60453 427697 423888 419457 414683 410243 406314 402264 397406 391863 386516 382256 379302 377192 375396 373936
60439 373936 373265 373574 374469 375405 376074 376223 375560 374161 372603 371284 369944 368281 366704 365926 365987 366304 366533
60422 366533 366819 367233 367543 367685 367973 368670 369656 370657 371550 372365 373196 374136 375142 376006 376643 377299 378309 379776
60404 379776 381636 383776 385819 387094 387216 386563 385877 385676 386320 388175 391090 394058 396179 397856 400309
60389 400309 403907 407671 410539 412453 414060 415964 418478 421568 424709 427165 428642 429408 429806 430102 430803
60374D30803J673K504K438J739J296J336J295Q15J80l09o84r37q80n51k99l24
60358D40095m38l94r2M98J277J892J985J667J461J750K496L470M489N458O299
60343D71913O867O871O102M863L802L066K024J13k308m364n597o109o073n644
60329D75526n155m862m620m221l857l808l852l592l168l047l167k963k230j366
60315D25618o98j65J91J50o6L00J604L212M349N078O002P213Q262R133J0660J3565
60299D94408J7323K0286K1038J9461J6496J3053R280M770p47o815j2226j5702
60287E80625j6855j6482j5654j4595j2853j0422q133o684n890n230m668m487m583
60274D54089m527m158l731l532l655m075m604m897m776m430m042l442k412j248
$$ plain form
60374 430803 432476 434980 437418 439157 440453 441789 443084 443899 444079 443770 443086 442149 441269 440718 440419 440095
60358 440095 439657 439263 439171 439669 440946 442838 444823 446490 447951 449701 452197 455667 460156 465614 471913
60343 471913 478780 485651 491753 496616 500418 503484 505508 505621 503313 498949 493352 487243 481170 475526
60329 475526 470371 465509 460889 456668 452811 449003 445151 441559 438391 435344 432177 429214 426984 425618
60315 425618 424920 424755 424946 425096 425030 425330 426934 430146 434495 439573 445575 452788 461050 470183 480843 494408
60299 494408 511731 532017 553055 572516 589012 602065 611345 616115 615368 608553 596327 580625
60287 580625 563770 547288 531634 517039 504186 493764 485631 478947 473057 467827 463159 458672 454089
60274 454089 449562 445404 441673 438141 434486 430411 425807 420910 416134 411704 407662 404220 401808 400560
60260D00560n63n87r19j014o95k80l09j012j864j900p74P00J365R55J71k40j59
60243C93435J18K91K40L2j22q0J08L64O72R30R35P41Q00J461K544L650M638N482
60225D16239N910N650M998M626M778M941M489L457K591K622L503M378M514M116
60211D76812M000M555N466O395P274P827P539O520N713N688N868N491M828M617
60197E58593M794M696M237L865L477K382N36j032j428r85p45j303k399l356l674
60182E67658l411l075l051l220l367l722m571n499n561m366k529r97k78l47q91
60167E22773j457j761j946k284k693k829k637k417k306k116j748j306p75L4R84
60152D97516J521J316P81O92J344K278K766K578K232K467L373M216M250L470K491
$$ plain form
60260 400560 399997 399410 398491 397477 396782 396502 396193 395181 393317 391417 390643 391343 392708 393663 393834 393594 393435
60243 393435 393553 393844 394084 394116 393994 393914 394022 394386 395058 395988 396923 397664 398464 399925 402469 406119 410757 416239
60225 416239 422149 427799 432797 437423 442201 447142 451631 455088 457679 460301 463804 468182 472696 476812
60211 476812 480812 485367 490833 497228 504502 512329 519868 526388 532101 537789 543657 549148 553976 558593
60197 558593 563387 568083 572320 576185 579662 582044 582580 581548 580120 579135 578390 577087 574688 571332 567658
60182 567658 564247 561172 558121 554901 551534 547812 543241 537742 532181 527815 525286 524289 524011 523664 522773
60167 522773 521316 519555 517609 515325 512632 509803 507166 504749 502443 500327 498579 497273 496498 496532 497516
60152 497516 499037 500353 501134 501826 503170 505448 508214 510792 513024 515491 518864 523080 527330 530800 533291
60137E33291J907J969K604L383L737L602L574M097M728M671L821K779J997J420
60123E77580Q81L91K1q4K78J031J666J840J878K163K417K205J851K001K443K283
60107F00845J345M15j16q54k254l624l986l387k719k578k836l151l384l479l302
60092E66935k731j849r27j46O11J498K198K100J199L37J91M06K93o0j36q3n57
60075E69279j554k402k857l345l924m092l907m316n777p346p745o841n480m392
60061E05301l844l945m635n472n867n512m420k867j517j135j789k560k425j270
60047D58043K54J654K960M285N279N290M155K822K728M249O072O622N805M713
60033E14931L922K994J584Q1j156k286l393m180m611n137n896o407o459o588p167
$$ plain form
60137 533291 535198 537167 539771 543154 546891 550493 554067 558164 562892 567563 571384 574163 576160 577580
60123 577580 578461 578852 578873 578789 579067 580098 581764 583604 585482 587645 590062 592267 594118 596119 598562 600845
60107 600845 602190 602605 602489 601635 599381 595757 591771 588384 585665 583087 580251 577100 573716 570237 566935
60092 566935 564204 562355 561428 561282 561893 563391 565589 567689 568888 569225 569416 569822 570115 570055 569919 569836 569279
60075 569279 567725 565323 562466 559121 555197 551105 547198 542882 537105 529759 522014 515173 509693 505301
60061 505301 501457 497512 492877 487405 481538 476026 471606 468739 467222 466087 464298 461738 459313 458043
60047 458043 458297 459951 462911 467196 472475 477765 481920 484742 487470 491719 497791 504413 510218 514931
60033 514931 518853 521847 523431 523512 522356 520070 516677 512497 507886 502749 496853 490446 483987 477399 470232
60018D70232p773p938p865p756p201n905m483l723l526l261k715j935o62J165
60004D06654K681K838J782O46O0l26q48j206r96k61P06J612K117K069J914K397
59988D21839L642M890N372N180N082N599O429O738O037M675L332K103N58j255
59974D80221k502k634k231k201k558k627k132j372n34M29J294J697J818K292L267
59959D72227M149M439M282L966L456K681J860J188N15l16j086j461j416j161q51
59944D92472n92n65q41j227j509j799k356l065l425l160k674k654l258l872l712
59929D57763k613j150j56q8o94j118n97P48J985K441K534L135M363N494N986N989
59913D84022N855N815O216P273Q355Q279O923N762O069P122P087N295K764N94
$$ plain form
60018 470232 462459 454521 446656 438900 431699 425794 421311 417588 414062 410801 408086 406151 405489 406654
60004 406654 409335 412173 413955 414601 414661 414335 413487 412281 411285 411024 411730 413342 415459 417528 419442 421839
59988 421839 425481 430371 435743 440923 446005 451604 458033 464771 470808 475483 478815 480918 481476 480221
59974 480221 477719 475085 472854 470653 468095 465468 463336 461964 461430 461859 463153 464850 466668 468960 472227
59959 472227 476376 480815 485097 489063 492519 495200 497060 498248 498763 498447 497361 495900 494484 493323 492472
59944 492472 491880 491315 490474 489247 487738 485939 483583 480518 477093 473933 471259 468605 465347 461475 457763
59929 457763 455150 454000 453844 453756 453062 451944 451347 452095 454080 456521 459055 462190 466553 472047 478033 484022
59913 484022 489877 495692 501908 509181 517536 525815 532738 538500 544569 551691 558778 564073 566837 567431
59899E67431j082k519l655m398m935n367n492n228m806m237l100j275N27J523
59885E23387J883K389L222L717L461L046L320M253N014N067M701M416M248L932
59871E76056L366K559J334m69k508m050m639m431l884l355l037k939k878k715
59857E48410k652k973l439l357k391r79K24J020J573K023K533L499N313P892J0556
59842E67252J2284J2059R367M747k48l916n391m820k816l2K765M438L851Q05l350
59827E96995o612q100q619r189r610r115p884o818o072m975l568k858l156l310
59813E07109k379j014l43k87p6K85K13j63j39L05M75J95R1L98M36m05j809l031
59795D99861l800m365n002n671o019n698m900m372m553m861m387l141k024j571
$$ plain form
59899 567431 566349 563830 560175 555777 550842 545475 539983 534755 529949 525712 522612 521337 521864 523387
59885 523387 525270 527659 530881 534598 538059 541105 544425 548678 553692 558759 563460 567876 572124 576056
59871 576056 579422 581981 583315 582846 580338 576288 571649 567218 563334 559979 556942 554003 551125 548410
59857 548410 545758 542785 539346 535989 533598 532619 532843 533863 535436 537459 539992 543491 548804 556696 567252
59842 567252 579536 591595 600962 605709 605461 601545 596154 591334 588518 588486 591251 595689 599540 600345 596995
59827 596995 590383 582283 573664 564475 554865 545750 537866 531048 524976 520001 516433 513575 510419 507109
59813 507109 504730 503716 503373 503086 503010 503295 503508 503345 503206 503511 503986 504181 504272 504670 505106 504701 502892 499861
59795 499861 496061 491696 486694 481023 475004 469306 464406 460034 455481 450620 446233 443092 441068 439497
59781D39497j358q79l41k20m55n30k20J47J14l21o33l00N51J206J195R39J260
59764D39652K400L752M548M506L882L184K822K878L171L594M244N035N561N591
59750D94820N519N904O735P472P678P227O075M334K509J264Q71J079J498J849
59736E54834J931J734J481J343J183Q87O90Q34J051Q93M12J19L26Q91J496J766
59720E71871J354L94k98m5P75J233J160J185J573J837J725J746K298K969L239
59705E93016L329L749M381M689M673M939N782O661O846O205N211M378L967M073
59691F61899M630N171M903L351R31j337k688l023k611j765r35n94q13j267j849
59676F64003k917m625o370p377p577p500p477p333o764n686m344l258k855k942
$$ plain form
59781 439497 438139 437260 436919 436699 436244 435714 435494 435641 435755 435434 434801 434501 435052 436258 437453 438392 439652
59764 439652 442052 445804 450352 454858 458740 461924 464746 467624 470795 474389 478633 483668 489229 494820
59750 494820 500339 506243 512978 520450 528128 535355 541430 545764 548273 549537 550408 551487 552985 554834
59736 554834 556765 558499 559980 561323 562506 563393 564083 564917 565968 566861 567273 567392 567718 568609 570105 571871
59720 571871 573225 573619 573321 573276 574051 575284 576444 577629 579202 581039 582764 584510 586808 589777 593016
59705 593016 596345 600094 604475 609164 613837 618776 624558 631219 638065 644270 649481 653859 657826 661899
59691 661899 666529 671700 676603 679954 680885 679548 676860 673837 671226 669461 668526 667932 667119 665852 664003
59676 664003 661086 656461 650091 642714 635137 627637 620160 612827 606063 600377 596033 592775 589920 586978
59662E86978k803k068j072j63Q49K077L035L324L402L959M847N445N695N932N949
59647F25386N168L601J734m09l064n622o957p117p535r003j0458j0498r291q090
59633E57845p427o754n682m606l963l520k784j822j354j930l194m142m243m031
59619E02393m359n245n884n714n070m689m857n153m852l606j869n36LK44P64J404
59603D52974J603J214N25j32m12M1R64J339O14l61m87q0k01p37n24O20J481J316
59585D59757P48L28l20j230j428n12K20n48k175l099l100l222l831m182l839l286
59569D30281k919k518j948j583j615j605j137m61j42l30o62o43o4P44J056M57
59553D16911m89o71K85J463J708J055O76J470L077M454N088N187N024M728M777
$$ plain form
59662 586978 584175 582107 581035 580872 581721 583798 586833 590157 593559 597518 602365 607810 613505 619437 625386
59647 625386 630554 634155 635889 635480 632416 626794 619837 612720 605185 596182 585724 575226 565935 557845
59633 557845 550418 543664 537982 533376 529413 525893 523109 521287 519933 518003 514809 510667 506424 502393
59619 502393 498034 492789 486905 481191 476121 471432 466575 461422 456570 452964 451095 450559 450562 450806 451570 452974
59603 452974 454577 455791 456316 456184 455772 455813 456777 458116 458730 458369 457882 457802 457601 456864 456340 456960 458441 459757
59585 459757 460505 460833 460513 459283 457855 457343 457563 457015 454840 451741 448641 445419 441588 437406 433567 430281
59569 430281 427362 424844 422896 421313 419698 418093 416956 416495 416353 416023 415361 414718 414654 415398 416454 416911
59553 416911 416422 415751 416036 417499 419207 420262 420938 422408 425485 429939 435027 440214 445238 449966 454743
59538D54743O007Q688J2207J6060K0412K4803K6841K3646J4963M107m670r266
59526E98541j0219r074o942m217j080J931L872M218L562K937K474J332q89l425
59512E83021n352o698q047r514j0625j0970j0580r753q817p950p147o406n844
59499D75318n418m778l833l211l393l716l054j511m32n21r62p60R2J188K490L844
59483D51343M562M299L708L495L447L141K957L510M460M830M317L486K825K243
59469E02623J490N30m68j160j219q02n57q74j353j319n03R28K612M009M782N400
59453E14119O707Q585R802R643Q863Q452Q357Q092P729P279N943L047p32m137
59439F01749o776q843j0026r957r332r186r261q340o212m100l041k960l294l488
$$ plain form
59538 454743 460750 469438 481645 497705 518117 542920 569761 593407 608370 612477 607807 598541
59526 598541 588322 579248 572306 568089 567009 568940 572812 577030 580592 583529 586003 587335 586446 583021
59512 583021 577669 570971 562924 553410 542785 531815 521235 511482 502665 494715 487568 481162 475318
59499 475318 469900 465122 461289 458078 454685 450969 447915 446404 445972 445451 444489 443729 443821 445009 447499 451343
59483 451343 455905 460204 463912 467407 470854 473995 476952 480462 484922 489752 494069 497555 500380 502623
59469 502623 504113 504643 504175 503015 501796 500994 500437 499563 498210 496891 496388 497316 499928 503937 508719 514119
59453 514119 520826 529411 539213 548856 557719 566171 574528 582620 590349 597628 603571 606618 605886 601749
59439 601749 594973 586130 576104 566147 556815 547629 538368 530028 523816 519716 516675 513715 510421 506933
59425E06933k835r53J354K796L349M272O241Q503J0198J1462J2802J4269J5737
59412E94128J7392J9549K2408K5839K8402K6936J8767N024r410j9920k5228k6198
59400F77689k3415j7275r142p34P126J3580J6097J1796R49j2138k2358k7413k8108
59387E86654k6234k2963j8788j4154r861o814n288m543l543k071p50L1O70J582
59373D73928K466K755K517K346K498K676K650K659K936L267L337L313L668M469
59359E15485N233N577N685O016O725P603Q426R163R952J1058J2749J4959J7147
59346F35778J8710J9540K0026K0514K0983K1242K1174K0620J9308J7126J4405
59335H49426J1666R073O338L241K4k917n542q053j0345j2004j2902j3479j4120
$$ plain form
59425 506933 504098 503145 504499 507295 510644 514916 521157 529660 539858 551320 564122 578391 594128
59412 594128 611520 631069 653477 679316 707718 734654 753421 758445 749035 729115 703887 677689
59400 677689 654274 636999 627857 627123 634249 647829 663926 675722 676671 664533 642175 614762 586654
59387 586654 560420 537457 518669 504515 494654 487840 482552 478009 474466 472395 471645 471676 472346 473928
59373 473928 476394 479149 481666 484012 486510 489186 491836 494495 497431 500698 504035 507348 511016 515485
59359 515485 520718 526295 531980 537996 544721 552324 560750 569913 579865 590923 603672 618631 635778
59346 635778 654488 674028 694054 714568 735551 756793 777967 798587 817895 835021 849426
59335 849426 861092 870165 876503 879744 879768 876851 871309 863256 852911 840907 828005 814526 800406
59322H00406j4651j4691j4258j3600j2739j1711j0983j1007j1372j1087r875q565
59310F55867q059q278q419p791o201l993j939o76j8R21K667M840O848Q722J1092
59295F45583J4541J9000K3187K4646K1211J2987K583o883j3644j7226j7725j5828
59283F92432j2815r707o656l657j242J89J187K495L913M811N427O701Q791J0762
59269G02631J1808J2065J1975J1494J0293Q378O176M176K527Q94j254m056p056
59256G70051r697j1789j3339j4243j4403j3926j3019j1944j1168j1023j1045j0238
59244F24217q411o581n578m932l728j996n14L25P33J051J600K569L471L297J911
59229F07434N33Q1k70j733l855n174n428n711o561p404p825q073q098p426o279
$$ plain form
59322 800406 785755 771064 756806 743206 730467 718756 707773 696766 685394 674307 664432 655867
59310 655867 647808 639530 631111 623320 617119 613126 611187 610511 610493 611414 614081 618921 625769 634491 645583
59295 645583 660124 679124 702311 726957 748168 761155 763738 756855 743211 725985 708260 692432
59283 692432 679617 669910 663254 659597 658355 658544 659731 662226 666139 670950 676377 683078 691869 702631
59269 702631 714439 726504 738479 749973 760266 768644 774820 778996 781523 782417 781163 777107 770051
59256 770051 760354 748565 735226 720983 706580 692654 679635 667691 656523 645500 634455 624217
59244 624217 615806 609225 603647 598715 594987 592991 592477 592802 593535 594586 596186 598755 602226 605523 607434
59229 607434 607967 608048 607778 606045 602190 597016 591588 585877 579316 571912 564087 556014 547916 540490 534211
59214E34211n582n551n290m161k599j207o2P67J030J015J466K328K532J641P50
59199E21288J125K563L875M415M488M621N003N405N391M837M365M800O096P343
59185E85615P935Q069Q003P626P046O779O916O812O045N046M331L760L067K497
59171F69547K335K297K005J701J921K738L719M420M639M466M304M516M804M422
59157G17834L188J796P78k74k080m634p192q973r573r130q365q100q343q236p168
59142F41528n614m525m194m176m006l612l061k333j427o00l05o15q41j51J164
59127F07232J776J166O32J586L502M783N249O173P922R263R466R481J0222J1088
59113F89541J1159J0765J0693J0760J0293R466Q916Q545P702O362N103M142L126
$$ plain form
59214 534211 528629 523078 517788 513627 511028 509821 509759 510526 511556 512571 514037 516365 518897 520538 521288
59199 521288 522413 524976 528851 533266 537754 542375 547378 552783 558174 563011 567376 572176 578272 585615
59185 585615 593550 601619 609622 617248 624294 631073 637989 644801 650846 655892 660223 663983 667050 669547
59171 669547 671882 674179 676184 677885 679806 682544 686263 690683 695322 699788 704092 708608 713412 717834
59157 717834 721022 722818 723596 723322 721242 716608 709416 700443 690870 681740 673375 665275 656932 648696 641528
59142 641528 635914 631389 627195 623019 619013 615401 612340 610007 608580 607980 607675 607060 606219 606068 607232
59127 607232 609008 610174 610806 612392 615894 620677 625926 632099 640021 649284 658750 668231 678453 689541
59113 689541 700700 711465 722158 732918 743211 752677 761593 770138 777840 784202 789305 793447 796573
59100G96573J878N91o30j869l110m293n530o847p842q057p523o685n932n420n025
59085G30279m298k909j406j017k285m373o179p587r059j0474j1161j0847r911
59072F48773q777p617o637o176o339o773o883o330n405m829m913n156n033m874
59058E63031n303n980n863m739l537k957k798k876l431m157m015k755j576j457
59044E11587j739j329l58M06R24J523J785J193L84M60J266J610J166Q98J543K659
59028E23978L529M088M667N455O562Q149J0213J2414J4247J5240J5281J4827J4464
59015F53114J4011J2616J0001O990M295J566j595m436n826n799n228m330k687
59002F72692n34J171K110L008M388N764O346N900M669L048J480K25r06k166l281
$$ plain form
59100 796573 798451 799042 798412 796543 793433 789140 783610 776763 768921 760864 753341 746656 740724 735304 730279
59085 730279 725981 723072 721666 720649 718364 713991 707812 700225 691166 680692 669531 658684 648773
59072 648773 639996 632379 625742 619566 613227 606454 599571 593241 587836 583007 578094 572938 567905 563031
59058 563031 557728 551748 545885 541146 537609 534652 531854 528978 525547 521390 517375 514620 513044 511587
59044 511587 509848 508519 508161 508567 509491 511014 512799 513992 514376 514836 516102 517712 518878 519776 521319 523978
59028 523978 527507 531595 536262 541717 548279 556428 566641 579055 593302 608542 623823 638650 653114
59015 653114 667125 679741 689742 696732 701027 702593 700998 696562 690736 684937 679709 675379 672692
59002 672692 672158 673329 675439 678447 682835 688599 694945 700845 705514 708562 710042 710267 709361 707195 703914
58987G03914l799l931m456n698p154q136q248p334n564l632k195j059M88K516
58973F45712M292N410O374P733R256J0355J0892J1101J1008J0452R639R241R705
58960G61170J0574J0777R653P609N495L485R69k487o462j0111j2795j4235j4545
58947G49097j4333j4284j4409j4138j3320j2384j1408r851p671n748m544l284
58935F23723j380K53M31l80p13l03k36j052j970k237k116k202k615l181l733l958
58919E98331l595k960k682k796k658j933j056n56m29l85k58M4O02J338K081K833
58903E85921L759N002O728R147J2008J4325J5138J4523J3440J2704J2513J2768
58891G17976J3269J3651J3705J3832J4789J6888J9542K1557K1777J9893J6816
$$ plain form
58987 703914 700115 696184 691728 686030 678876 670740 662492 655158 649594 645962 643767 642708 643196 645712
58973 645712 650004 655414 661788 669521 678777 689132 700024 711125 722133 732585 742224 751465 761170
58960 761170 771744 782521 792174 799783 805278 808763 809732 807245 800783 790672 777877 763642 749097
58947 749097 734764 720480 706071 691933 678613 666229 654821 644970 637299 631551 627007 623723
58935 623723 622343 622596 623027 622647 621934 621631 621395 620343 618373 616136 614020 611818 609203 606022 602289 598331
58919 598331 594736 591776 589094 586298 583640 581707 580651 580095 579666 579281 579023 579067 579669 581007 583088 585921
58903 585921 589680 594682 601410 610557 622565 636890 652028 666551 679991 692695 705208 717976
58891 717976 731245 744896 758601 772433 787222 804110 823652 845209 866986 886879 903695
58880I03695J3837J1219Q188M483R96j660m267p746j1577j4536j6307j7234j7128
58867H51963j5744j3981j3061j2653j1321q863o737n967o058o330o897p753q170
58854G28428p802p367p475p608p065o141n604n555n577n594n843o255o474o417
58840F37651o384o671p279p883q054p691p271p245p278o566m963l262k158j563
58826E53383j130q57p73m63M99J818K653K595K255K593L767M820M758L744K778
58811E82440K328J902J128L81n3n84j382j671q64J89K00p43j532j862k501l753
58795E73623m888n262m988m370l570l024l185l605l172j594J44J185J870K966
58781E42130M499N839O556O810P065P663Q437Q769Q153O572M151R01k731n605
$$ plain form
58880 903695 917532 928751 936939 941422 942418 940758 936491 928745 917168 902632 886325 869091 851963
58867 851963 836219 822238 809177 796524 785203 776340 769603 763636 757578 751248 744351 736598 728428
58854 728428 720626 713259 705784 698176 691111 684970 679366 673811 668234 662640 656797 650542 644068 637651
58840 637651 631267 624596 617317 609434 601380 593689 586418 579173 571895 565329 560366 557104 554946 553383
58826 553383 552253 551396 550623 550160 550659 552477 555130 557725 559980 562573 566340 571160 575918 579662 582440
58811 582440 584768 586670 587798 588179 588126 587542 586160 584489 583625 583814 584014 583271 581739 579877 577376 573623
58795 573623 568735 563473 558485 554115 550545 547521 544336 540731 537559 535965 536109 537294 539164 542130
58781 542130 546629 552468 559024 565834 572899 580562 588999 597768 605921 612493 616644 617545 614814 609209
58767F09209o994p571q450r584r998r393q428p516o470n324m434l616k245m50
58753E18736P78R69P94R50J288J395J355J486J914K651L705M846N794O651P655
58738E60967Q564Q901Q790Q876R405R990J0260J0208R934R639R667R868R242O981
58724F91292L659N59j874m103o266p925q797q844p818n676l197j223K92J610K209
58709F43898J747J249J787K409J308j331l550m561n419o714p841q883j0875j3522
58695E89702j4777j3801j2427j2471j3188j2726j0728q275o270n082m814m968
58683D70175m627l720l238l644m116l956l501l092k388j421r95j197q53O28K167
58668D36222K758L063M195O065Q018J0047J2150J3461J3136J1405Q853N540J703
$$ plain form
58767 609209 602215 594644 586194 576610 566612 557219 548791 541275 534805 529481 525047 521431 519186 518736
58753 518736 519514 520483 521277 522227 523515 524910 526265 527751 529665 532316 536021 540867 546661 553312 560967
58738 560967 569531 578432 587222 596098 605503 615493 625753 635961 645895 655534 665201 675069 684311 691292
58724 691292 694951 695510 693636 689533 683267 675342 666545 657701 649883 644207 641010 639787 640079 641689 643898
58709 643898 645645 646894 648681 651090 652398 651067 647517 642956 637537 630823 622982 614099 603224 589702
58695 589702 574925 561124 548697 536226 523038 510312 499584 491309 485039 479957 475143 470175
58683 470175 465548 461828 458590 454946 450830 446874 443373 440281 437893 436472 435477 434280 433427 434055 436222
58668 436222 438980 442043 446238 452303 460321 470368 482518 495979 509115 520520 529373 534913 536616
58655E36616j661l846n258o372o850o488n931n552m828l720l422m589n919n873
58641D66307m775l890l410k725j892j469j347j037n45L4J109K705L688L078J557
58626D57388N70M93O71O91N75K58r6K06J509L197M626N927P159P724P524P622
58610E06044Q649R511Q916P222N544L958K034L63o7M67P61M01j43o80j408k187
58594E49385k699l012l128k557j186Q2N67J005K522N022P611R895J1829J3064
58580E88400J3465J3584J3667J2964J1072Q937P484O234M540L100K825L232L524
58567F93028M302O488R369J1538J3222J5811J9537K3238K6137K8205K9106K8407
58555I08388K6478K3810J9895J4335Q557M598K459L97k326m713o051o914p985
$$ plain form
58655 536616 534955 531109 525851 519479 512629 506141 500210 494658 489830 486110 482688 478099 472180 466307
58641 466307 461532 457642 454232 451507 449615 448146 446799 445762 445217 445251 446360 449065 452753 455831 457388
58626 457388 457958 458451 459122 459813 460388 460646 460550 460756 462265 465462 470088 476015 483174 490898 498422 506044
58610 506044 514693 524204 533120 540342 545886 549844 551878 552241 552174 552641 553402 553803 553660 552980 551572 549385
58594 549385 546686 543674 540546 537989 536803 536885 537452 538457 540979 546001 553612 563507 575336 588400
58580 588400 601865 615449 629116 642080 653152 662089 669573 675807 680347 683447 686272 689504 693028
58567 693028 697330 703818 713187 724725 737947 753758 773295 796533 822670 850875 879981 908388
58555 908388 934866 958676 978571 992906 1001463 1006061 1008520 1008917 1006591 1001878 995827 988913 980928
58542I80928r308j0959j3186j5725j8052k0316k2948k5516k7036k7324k6903k5772
58530G37883k3423k0002j6350j3033j0244q357p491o854n607m020k819j895q08
58517F16980Mj12o31n12R1J79k80l81J08M58L34J98L14L51m0q96j981k605k064
58498F09515q53n44j604k551k210j484j514j517k43J611K491K625L419M982O294
58483F18417P364R157J1695J4128J6354J8762K0838K1756K1925K2056K1316J8335
58471H22103J3550Q563L652j874p352j1138j3109j4534j5545j4961j2669r970
58459G46716p452m518j199J574L648N780Q065R908J1433J3036J3671J1714P450
58446H19826K782j405n663r861j2869j4404j5149j4974j3134j0245p985o690n178
$$ plain form
58542 980928 971620 960661 947475 931750 913698 893382 870434 844918 817882 790558 763655 737883
58530 737883 714460 694458 678108 665075 654831 646474 638983 632129 626522 622502 619683 617788 616980
58517 616980 616984 616872 616241 615729 615820 615999 615719 615338 615446 615904 616238 616436 616750 617101 617061 616165 614184 611579 609515
58498 609515 608662 608118 606514 603963 601753 600269 598755 597238 596995 598606 601097 603722 607141 612123 618417
58483 618417 625781 634938 646633 660761 677115 695877 716715 738471 760396 782452 803768 822103
58471 822103 835653 844216 847868 845994 838642 827504 814395 799861 784316 769355 756686 746716
58459 746716 739264 734746 733547 735121 738769 744549 752614 762522 773955 786991 800662 812376 819826
58446 819826 822608 821203 815540 805679 792810 778406 763257 748283 735149 724904 716919 710229 705051
58433G05051l044j171O2J095J841K055K786N322Q811J1186J2226J3399J4834J5037
58419G89490J3525J1182Q051L494j434m601o067p858j0224j1175j0213r476j0096
58406G54598j0432r047o963n635m959m382l922l184j359J014K339K522L126M499
58392G18215N188M713M339M415L547J368m35r13j210k127k692k268j762j615q11
58377G27952J054K806L859N228P425R339J0201J0687J1274J1459J1264J1514J2051
58364H36113J1799J1017J1225J2518J3390J3558J4227J5149J4434J1904R665Q485
58352I83484O622L225p8k052l361m212l443j165O27J239K315M551O346O870P519
58337A008487R090J0417J1027J2168J4002J4849J4431J4716J6270J6979J5688
$$ plain form
58433 705051 702007 700836 700898 701993 703834 705889 708675 713997 722808 733994 746220 759619 774453 789490
58419 789490 803015 814197 822248 825742 824308 819707 813640 805782 795558 784383 774170 764694 754598
58406 754598 744166 735119 728156 722521 717562 713180 709258 706074 704715 705729 708068 710590 713716 718215
58392 718215 723403 728116 732455 736870 740417 741785 741350 740437 739227 737100 734408 732140 730378 728763 727952
58377 727952 729006 731812 735671 740899 748324 757663 767864 778551 789825 801284 812548 824062 836113
58364 836113 847912 858929 870154 882672 896062 909620 923847 938996 953430 965334 974999 983484
58352 983484 990106 993331 993253 991201 987840 983628 980185 979020 979647 980886 983201 987752 994098 1000968 1008487
58337 1008487 1017577 1027994 1039021 1051189 1065191 1080040 1094471 1109187 1125457 1142436 1158124
58326A158124J3864J2366R946O420L815K810J462q98k104j105N5J13P56L064N269
58311A213957O151P123R011J0236J0181J0732J2513J3360J2594J2794J5080J6709
58299A350441J5898J5035J6234J7629J7057J5791J5651J5878J5670J6375J8405
58288A530064J9573J9066J9495K2276K4852K5096K4641K5141K5331K4506K4666
58277A784707K6342K6727K4979K4707K8009L1753L3244L4691L8325M1924M3292
58266B138700M4538M7755N0935N2312N4207N8415O2335O3729O4569O6156O5526
58255B769177O1087N6594N5052N3988N1362N0551N4312N9502O2993O7261P4625
58244C416504Q1804Q6013R0638R8872J07574J13487J19521J28581J37373J42998
$$ plain form
58326 1158124 1171988 1184354 1194300 1200720 1204535 1207345 1208807 1207909 1205805 1204700 1204755 1204868 1205624 1208688 1213957
58311 1213957 1220108 1227231 1236242 1246478 1256659 1267391 1279904 1293264 1305858 1318652 1333732 1350441
58299 1350441 1366339 1381374 1397608 1415237 1432294 1448085 1463736 1479614 1495284 1511659 1530064
58288 1530064 1549637 1568703 1588198 1610474 1635326 1660422 1685063 1710204 1735535 1760041 1784707
58277 1784707 1811049 1837776 1862755 1887462 1915471 1947224 1980468 2015159 2053484 2095408 2138700
58266 2138700 2183238 2230993 2281928 2334240 2388447 2446862 2509197 2572926 2637495 2703651 2769177
58255 2769177 2830264 2886858 2941910 2995898 3047260 3097811 3152123 3211625 3274618 3341879 3416504
58244 3416504 3498308 3584321 3674959 3773831 3881405 3994892 4114413 4242994 4380367 4523365
58234D523365J49320J59941J71300J79801J89080K02904K17731K30069K44081
58225F267592K63823K85238L04228L25171L52678L82843M11785M44706M86759
58216I524823N33361N79620O30692O92592P62122Q36739R24216J031132J152777
58207A6668074J286711J444687J638487J867486K134798K461896K872270L376300
58199C3750709L988625M742290N667018O774194Q086749R666788J1599467J3986908
58191I8262748J6991613K0844978K5734021L1601798L7902947M3309582M5598042
58184C20245729M2249052L1900009J5718094k668036j8917743l0065546l5418706
58177C23042853l6053835l3805864l0474274k7315196k4777600k2637899k0491169
$$ plain form
58234 4523365 4672685 4832626 5003926 5183727 5372807 5575711 5793442 6023511 6267592
58225 6267592 6531415 6816653 7120881 7446052 7798730 8181573 8593358 9038064 9524823
58216 9524823 10058184 10637804 11268496 11961088 12723210 13559949 14484165 15515297 16668074
58207 16668074 17954785 19399472 21037959 22905445 25040243 27502139 30374409 33750709
58199 33750709 37739334 42481624 48148642 54922836 63009585 72676373 84275840 98262748
58191 98262748 115254361 136099339 161833360 193435158 231338105 274647687 320245729
58184 320245729 362494781 394394790 410112884 407444848 388527105 358461559 323042853
58177 323042853 286989018 253183154 222708880 195393684 170616084 147978185 127487016
58170A27487016j8173774j5790668j3502104j1400148r533601p933128o592486
58163D4561107n477099m560339l824431l235715k752121k350998k024737j756608
58155A8579059j525165j325628j164055j035134r24981q29953p54256o93850o39363
58146I686674n89970n49126n11694m69870m26857l90872l60339l28055k95056
58137E764835k67507k44474k21356k01259j90661j87228j83180j77360j73306
58128C918504j69008j59582j47174j37844j31113j22114j11467j03679r8274r1500
58118B646749q4428q0800p9158p5401p0664o8606o7462o2964n6706n3480n2543
58107A894537m9535m5034m3182m3579m2361l9830l9449m0554l9451l6652l5962
$$ plain form
58170 127487016 109313242 93522574 80020470 68620322 59086721 51153593 44561107
58163 44561107 39084008 34523669 30699238 27463523 24711402 22360404 20335667 18579059
58155 18579059 17053894 15728266 14564211 13529077 12604096 11774143 11019887 10326037 9686674
58146 9686674 9096704 8547578 8035884 7566014 7139157 6748285 6387946 6059891 5764835
58137 5764835 5497328 5252854 5031498 4830239 4639578 4452350 4269170 4091810 3918504
58128 3918504 3749496 3589914 3442740 3304896 3173783 3051669 2940202 2836523 2738249 2646749
58118 2646749 2562321 2481521 2402363 2326962 2256298 2187692 2120230 2057266 2000560 1947080 1894537
58107 1894537 1845002 1799968 1756786 1713207 1670846 1631016 1591567 1551013 1511562 1474910 1438948
58096A438948l7280l7022l4792l3152l1841k8587k4700k3542k4279k3082j9699
58085A120972j6961j4936j1596q296q441j1406j3518j4376j6513j9496k0239j8715
58073I46479j7791j7778j6622j4925j5287j6985j6781j4745j3981j4692j3975
58062G72917j1467r935r991r289p385o484p032p168o887q191j0707j1588j0233
58049F56560q878q270p024n429n524o974p145n715n097n857n892m708m379n490
58035E70178o096n522n438o336o605n957o280q098r436r095q097p254o220n424
58021D74320o017p401p644o613n900n652m569l013k829l805l721k272j612k511
58007D10761l146k431j434r09l03J99m31j586j228Q40K592L055L354M163M839
$$ plain form
58096 1438948 1401668 1364646 1329854 1296702 1264861 1236274 1211574 1188032 1163753 1140671 1120972
58085 1120972 1104011 1089075 1077479 1069183 1060742 1049336 1035818 1021442 1004929 985433 965194 946479
58073 946479 928688 910910 894288 879363 864076 847091 830310 815565 801584 786892 772917
58062 772917 761450 751515 741524 732235 724850 718366 711334 704166 697279 689088 678381 666793 656560
58049 656560 647682 639412 632388 626959 621435 614461 607316 601601 596504 590647 584755 580047 575668 570178
58035 570178 564082 558560 553122 546786 540181 534224 527944 519846 510410 501315 493218 485964 479744 474320
58021 474320 468303 460902 453258 446645 440745 435093 430524 427511 424682 420877 417156 414884 413272 410761
58007 410761 407615 405184 403750 402841 402538 402737 402306 400720 399492 400332 402924 405979 409333 413496 418335
57992D18335N346O335P108O200M153K888K404J069r24j709j471k440m728n792
57978D36774m771l873m475n181m931m834n518n639m412l001k191j176K24O85r0
57963C87591m36N16J497J537J383J487R71l39j093o84k36m30m96j08k6j12Q71
57946C91893K792L837L591L894N752P771Q764R449J0439J0878J0278R575R301
57933D88214Q713P638O957O390M142j88m630p675r828j1524j2057j1633j1869
57920D52650j3018j3215j1753j0522j0741j0864r384p248n737m259k201o58l86
57907C52664n4J403K628K077O92K36N46M54M7Q6L75M80R07K008K960L241L744
57890C74494M996N752M940L473K570J725O3j769k869l806n277o377o098n387n727
$$ plain form
57992 418335 423681 430016 437124 443324 447477 450365 452769 453838 452914 451205 449734 447294 442566 436774
57978 436774 432003 428130 423655 418474 413543 408709 403191 397552 393140 390139 387948 386772 386996 387681 387591
57963 387591 387155 387671 389168 390705 392088 393575 394546 394207 393114 392430 392194 391764 391268 391160 391134 391022 391893
57946 391893 394685 398522 402113 406007 411759 419530 428294 437743 448182 459060 469338 478913 488214
57933 488214 496927 504565 511522 517912 522054 521866 517236 509561 499733 488209 476152 464519 452650
57920 452650 439632 426417 414664 404142 393401 382537 373153 365905 360168 355909 353708 353050 352664
57907 352664 352610 354013 356641 358718 359410 359646 360192 360646 360693 360779 361154 361634 362541 364549 367509 370750 374494
57890 374494 379490 385242 390182 393655 396225 397950 398013 396244 393375 389569 384292 377915 371817 366430 360703
57875C60703o677o783o064n657n730n553n064m652l842j883P25K678L529L745
57861C19475L596L160K937L353M021M371M434M362L913L160K754K747K168O21
57847C65072q71j487j875k757l542l563l386l640l679k822j821j593j556o75O87
57832C32492J515J893K478L058L122L205L987M702M050K315J095J043J386J420
57818C67761J337J427J538J376P13m39j496j603p91k05o84j905l426n416p631
57803C50556q838q345p126o420o098n471m661m081l416k325j329q77m35M38J089
57788B92661J081J402K948M765N370N060N279O307P215P645P927P762O463M424
57774C66309K952K461K003P23j152k785l533l397l245m150n961p170o893o166
$$ plain form
57875 360703 354026 347243 341179 335522 329792 324239 319175 314523 310681 308798 309523 312201 315730 319475
57861 319475 323071 326231 329168 332521 336542 340913 345347 349709 353622 356782 359536 362283 364451 365072
57847 365072 364201 362714 360839 358082 354540 350977 347591 343951 340272 337450 335629 334036 332480 331805 332492
57832 332492 334007 335900 338378 341436 344558 347763 351750 356452 360502 362817 363912 364955 366341 367761
57818 367761 369098 370525 372063 373439 374152 373713 372217 370614 369823 369618 368934 367029 363603 358187 350556
57803 350556 341718 333373 326247 319827 313729 308258 303597 299516 296100 293775 292446 291569 291134 291572 292661
57788 292661 293742 295144 298092 302857 308227 313287 318566 324873 332088 339733 347660 355422 361885 366309
57774 366309 369261 371722 373725 374448 373296 370511 366978 363581 360336 356186 350225 343055 336162 329996
57760C29996o315o984o921n999n120m600l988l207k636k296j933j696j792j773
57746B74736j095kR47J778K672L134K523J063m30j453j785j243j72M51J88l03
57730B81009m34m62m15M87K373L837L799L092K924K990K556K157K446K467J038
57715C09864r80j901j839k077k405j593j18O1j373k584k542k381l108l954l845
57700B79225k959j993j077k33K12K48L16M00q8j179k045k183j968j814j632j363
57684B61867j150p84K03J679L004M005N091O461Q129J0588J4352J8880K3169K7481
57670C82975L3347M1788N2735O6268Q2477R9036J09874J07643Q7978N2193P314
57659A123628l6338o9497q8061r3699r0666q2489p1356n9118m7556l7783l0010
$$ plain form
57760 329996 323681 316697 309776 303777 298657 294057 290069 286862 284226 281930 279997 278301 276509 274736
57746 274736 273641 273639 274586 276364 279036 282170 284693 285756 285326 283873 282088 280845 280673 281124 281312 281009
57730 281009 280575 280113 279698 280185 282558 286395 290194 293286 296210 299200 301756 303913 306359 308826 309864
57715 309864 308884 306983 305144 303067 300662 299069 298951 299012 297639 295055 292513 290132 287024 283070 279225
57700 279225 276266 274273 273196 272963 273175 273423 273739 274139 274051 272872 270827 268644 266676 264862 263230 261867
57684 261867 260717 259933 260136 261815 264819 268824 273915 280376 288505 299093 313445 332325 355494 382975
57670 382975 416322 458110 510845 577113 659590 758626 868500 976143 1064121 1116314 1123628
57659 1123628 1087290 1017793 929732 836033 745367 662878 591522 532404 484848 447065 417055
57648D17055k3957j9308j5848j3314j1173q889o588n063m654m585l908k727j769
57635B95272j203o48j33p4l67l81J22P14R61Q82O70N05M58K59n42j745k352j874
57617B90524j187j346k052k192j473n13K65R03J245J028L99l17j103j858k034
57602B80289j557j369k090k793k349j345j258k180k910l000l090l354l223k758
57588B47013k782l377l599l020k335k123k119j936j571j047m30k51r39j888k169
57573B17427k010k412l378l876l542l098k925k587j991j776k167k560k528k246
57559A80331j819j180p43r82j434j241n88l10k06O80K087K602J959J563K199K921
57543A85839K735J941J053n5j172j310j97R79J111M54l06j056j701j698r66k73
$$ plain form
57648 417055 393098 373790 357942 344628 333455 324566 317978 312915 308261 303676 299768 297041 295272
57635 295272 294069 293421 293288 293214 292847 292466 292588 293302 294263 295145 295815 296320 296778 297037 296495 294750 292398 290524
57617 290524 289337 287991 285939 283747 282274 281761 282026 282929 284174 285202 285601 285284 284181 282323 280289
57602 280289 278732 277363 275273 272480 270131 268786 267528 265348 262438 259438 256348 252994 249771 247013
57588 247013 244231 240854 237255 234235 231900 229777 227658 225722 224151 223104 222674 222423 221484 219596 217427
57573 217427 215417 213005 209627 205751 202209 199111 196186 193599 191608 189832 187665 185105 182577 180331
57559 180331 178512 177332 176589 175607 174173 172932 172344 172034 171828 172508 174595 177197 179156 180719 182918 185839
57543 185839 188574 190515 191568 191513 190341 189031 188834 189813 190924 191378 191072 190016 188315 186617 185651 185378
57527A85378n1K13Q11J171R89Q72J197J432J326J564K473L253L389L663M760N914
57511B18354N982N079M073L325K812K735L015K937K150J368J226J196N30m59r98
57496B53325j088j252j588j890k233k643k714k216j608j346j240j042j000j216
57482B30249j201o74j46m0n7rl88j333j928j448n59l55r06j619k367l261l922
57465B10036l981l794l721l265j851r0P53L15o50j294j247n11M62Q91M24m13r31
57448A91133r79o22J64J018J195O19J73L62N95M06M06J115J786J547Q36N96P11
57431B01061M97J26L23J012J453J460J375J205P72L94M93P60O69L98L18N0q90
57414B11476j950k199j760j430j266p78k01k38o35m54K35K93o26j468j317n17
$$ plain form
57527 185378 185327 185540 186351 187522 188511 189383 190580 192012 193338 194902 197375 200628 204017 207680 212440 218354
57511 218354 224336 229415 233488 236813 239625 242360 245375 248312 250462 251830 253056 254252 254782 254323 253325
57496 253325 252237 250985 249397 247507 245274 242631 239917 237701 236093 234747 233507 232465 231465 230249
57482 230249 229048 228374 228228 228188 228131 228122 227734 226401 224473 223025 222466 222111 221205 219586 217219 213958 210036
57465 210036 206055 202261 198540 195275 193424 193334 194087 194402 193752 192458 191211 190700 191162 192053 192477 192064 191133
57448 191133 190154 189532 189696 190714 191909 192528 192701 193063 193658 194064 194470 195585 197371 198918 199754 200350 201061
57431 201061 201558 201684 202007 203019 204472 205932 207307 208512 209284 209678 210171 210931 211600 211998 212316 212366 211476
57414 211476 209526 207327 205567 204137 202871 202093 201892 201654 201019 200565 200800 201093 200467 198999 197682 197165
57398A97165J62N09O03M84M15P28J154J059N70O27J550K456K531K156K195K752
57382B17116L236L235K789K067J274P21N88O73O34L91J37j8k87j006k144l064
57366B26342k973j778k79O14O55K11k30k77K69J153J738J651J165P56N78N84Q18
57349B30997J206J434J386J337J411J199M16m83q30o12l29j86j2J80J22k07l68
57332B36661J01J189K284K544J666K79o32p52m77q8M89J140J477J522J718K070
57316B51191K025J460R43O89J37r24j718j609j039o76l85K57J079J628J793J564
57300B56415Q38K1KR27J819J999J922J937J438K16n53L1R33O80l39o28LM60L78
57281B68499M53Q90J057P66N90Q29J271J912K798L300K727J598J167J710K369
$$ plain form
57398 197165 197327 197836 198439 198923 199338 200066 201220 202279 202849 203476 205026 207482 210013 212169 214364 217116
57382 217116 220352 223587 226376 228443 229717 230438 231026 231699 232333 232724 232861 232843 232556 231550 229406 226342
57366 226342 223369 221591 221312 221926 222581 222792 222562 222285 222554 223707 225445 227096 228261 229017 229595 230179 230997
57349 230997 232203 233637 235023 236360 237771 238970 239386 238903 238073 237461 237132 236946 236934 237114 237236 237029 236661
57332 236661 236762 237951 240235 242779 244445 244724 244092 243340 242863 242775 243264 244404 245881 247403 249121 251191
57316 251191 253216 254676 255619 256308 256445 255521 253803 252194 251155 250479 250094 250351 251430 253058 254851 256415
57300 256415 257253 257274 257276 258203 260022 262021 263943 265880 267318 267534 266981 267012 267945 268625 268286 267658 267661 268121 268499
57281 268499 268952 269842 270899 271665 272255 273084 274355 276267 279065 282365 285092 286690 287857 289567 291936
57266B91936K654K892L202L214K909K694K542K076J579J823K753L337K900J812
57252C28323Q11M39J066K503L666L598K715K055J611O25o04p99K98J440J798J946
57236C51491K477K915K764K494K699L086L040K544J999J652J692K321L334M129
57222C88637M404M416M377M224M100M355M885N115M862M558M458M344M142M179
57208D51056M561M987N294N553N579N076M393M357N200O283P053P483P551P124
57194E31550O565O633P487Q460Q998R185R237R213R311R701R958R478Q551Q174
57180F52501Q674R348R623R696R779R626R118Q615Q394Q415Q708R327R848R779
57166G81451R555J0199J1846J3493J4416J4921J5501J6179J6889J7717J8472J8853
$$ plain form
57266 291936 294590 297482 300684 303898 306807 309501 312043 314119 315698 317521 320274 323611 326511 328323
57252 328323 329134 329573 330639 333142 336808 340406 343121 345176 346787 347412 346808 346009 346307 347747 349545 351491
57236 351491 353968 356883 359647 362141 364840 367926 370966 373510 375509 377161 378853 381174 384508 388637
57222 388637 393041 397457 401834 406058 410158 414513 419398 424513 429375 433933 438391 442735 446877 451056
57208 451056 455617 460604 465898 471451 477030 482106 486499 490856 496056 502339 509392 516875 524426 531550
57194 531550 538115 544748 552235 560695 569693 578878 588115 597328 606639 616340 626298 635776 644327 652501
57180 652501 661175 670523 680146 689842 699621 709247 718365 726980 735374 743789 752497 761824 771672 781451
57166 781451 791006 801205 813051 826544 840960 855881 871382 887561 904450 922167 940639 959492
57154I59492J9119J9779K0630K1026K1070K1460K2142K2395K2384K3213K5116
57143A197826K6933K7866K8439K9234K9936L0286L0743L1482L1956L2170L3259
57132A530130L5902L9083M1249M1876M1339M0274L9779M1132M4606M9497N6102
57121B000969O6402Q1535R9314J15297J25876J29998J29042J26241J25413J28989
57111C129076J37181J49250J64711J82985K03247K25662K51991K84164L23154
57102E051421L70131M27721M99273N87938O97576Q33461J000795J203030J442332
57093A2113678J720014K034753K380992K750354L133127L516109L879373M197139
57085C5725539M441889M587567M612795M507498M277877L939130L497088K936905
$$ plain form
57154 959492 978611 998390 1019020 1040046 1061116 1082576 1104718 1127113 1149497 1172710 1197826
57143 1197826 1224759 1252625 1281064 1310298 1340234 1370520 1401263 1432745 1464701 1496871 1530130
57132 1530130 1566032 1605115 1646364 1688240 1729579 1769853 1809632 1850764 1895370 1944867 2000969
57121 2000969 2067371 2148906 2248220 2363517 2489393 2619391 2748433 2874674 3000087 3129076
57111 3129076 3266257 3415507 3580218 3763203 3966450 4192112 4444103 4728267 5051421
57102 5051421 5421552 5849273 6348546 6936484 7634060 8467521 9468316 10671346 12113678
57093 12113678 13833692 15868445 18249437 20999791 24132918 27649027 31528400 35725539
57085 35725539 40167428 44754995 49367790 53875288 58153165 62092295 65589383 68526288
57077F8526288K234910J385951M20966o01252j618240k580363l448164m181255
57069F0138841m736750n081463n205930n127842m884578m522741m089765l627830
57061B2861942l169873k738431k346610j999631j696816j434586j209286j017948
57053G248761q57430p23914o13326n21760m45714l82460l30133k87015k51026
57044B835983k20265j93680j70787j51141j34435j20672j09570j00215r1719q3709
57034A459790p5837o7481n8543m9771m1579l3208k3804j3460k197J1373K9222
57023A134505N2159P9278J07209J27792J28131R7638L7934l4913r9620j41949
57013A488164j59543j58071j45111j26812j07415q9497p4115o1248n0672m2482
$$ plain form
57077 68526288 70761198 72147149 72568115 71966863 70348623 67768260 64320096 60138841
57069 60138841 55402091 50320628 45114698 39986856 35102278 30579537 26489772 22861942
57061 22861942 19692069 16953638 14607028 12607397 10910581 9475995 8266709 7248761
57053 7248761 6391331 5667417 5054091 4532331 4086617 3704157 3374024 3087009 2835983
57044 2835983 2615718 2422038 2251251 2100110 1965675 1845003 1735433 1635218 1543499 1459790
57034 1459790 1383953 1316472 1257929 1208158 1166579 1133371 1109567 1096107 1093910 1105283 1134505
57023 1134505 1186664 1265942 1373151 1500943 1629074 1726712 1764646 1729733 1630113 1488164
57013 1488164 1328621 1170550 1025439 898627 791212 701715 627600 566352 515680 473198
57003D73198l6654l2290k8005k3275j8872j5712j3733j2298j1071r987q879p756
56991B54666p056o880o345m359q66L241P191J0761J3876J6187J6870J4583Q376
56978C20245q09j0121j6941k0688k2023k1348j8966j5941j3411j1260q643n545
56966A54549k787o62J399L812O518R604J3352J7655K2133K6651L0734L2582K9748
56953C45288K1261Q650n079j6973k5052k8789k9042k7069k3650j9350j5092j1535
56941A73568q331m790j047K281N242Q413J1932J5708K0232K6057L2499L7773M0100
56928C59637L7812K9177J4054m189k0267l1096l7197l9954l9415l5558l0007k4900
56916A78097k0845j7178j3688j0938r200q092p207o446n659m629l429k428j823
$$ plain form
57003 473198 436544 404254 376249 352974 334102 318390 304657 292359 281288 271301 262422 254666
56991 254666 247610 240730 234385 230026 229160 232401 239592 250353 264229 280416 297286 311869 320245
56978 320245 319436 309315 292374 271686 249663 228315 209349 193408 179997 168737 160094 154549
56966 154549 151762 151100 152499 156311 162829 172433 185785 203440 225573 252224 282958 315540 345288
56953 345288 366549 375199 370120 353147 328095 299306 270264 243195 219545 200195 185103 173568
56941 173568 165237 160447 159400 161681 166923 175336 187268 202976 223208 249265 281764 319537 359637
56928 359637 397449 426626 440680 436491 416224 385128 347931 307977 268562 233004 202997 178097
56916 178097 157252 140074 126386 115448 106248 98156 90949 84503 78844 74215 70786 68358 66535
56903F6535j360o00N39J613K080J971J919K342K994L544M227N539P587J0242J3517
56888A22689J7303K1074K4437K7468K9707K9351K4552J5596M949m749j2058j6490
56876B83829j8093j7528j5734j3211j0161p032m114q24L599Q735J3338J7168K1392
56863B61364K7041L4122M2416N1866O1317O7586O6632N5860L5703R966j5373l4923
56851F63577m6484n1052n0548m6236l9160l0736k2162j3836n839J554Q278J4907
56839C82263K2230L0687M0495N2034O5766Q1609R7803J09921J11506R7240O6563
56828A158117K4660j9797n7986q3771r5570r6179r0058q0344o8514n5963m4296
56817D90299l3982k4082j3883l888N185J3503K1824L0837M1208N3372O6399P7145
$$ plain form
56903 66535 65175 64575 65114 66727 68807 70778 72697 75039 78033 81577 85804 91343 98930 109172 122689
56888 122689 139992 161066 185503 212971 242678 272029 296581 312177 317126 312377 300319 283829
56876 283829 265736 248208 232474 219263 209102 202070 197956 197132 200731 209466 222804 239972 261364
56863 261364 288405 322527 364943 416809 478126 545712 612344 668204 703907 713873 698500 663577
56851 663577 617093 566041 515493 469257 430097 399361 377199 363363 357524 359078 367356 382263
56839 382263 404493 435180 475675 527709 593475 675084 772887 882808 994314 1091554 1158117
56828 1158117 1182777 1162980 1104994 1021223 925653 829474 739416 659072 590558 534595 490299
56817 490299 456317 432235 418352 414464 419649 433152 454976 485813 527021 580393 646792 723937
56805G23937Q0924P3419N3011K2409j1850m2454o4586p6773p9767p5688o7548
56794E35034n8008m8203l8392k9315k1833j5674r893m400L66N105J1315J9111
56782C45213K6918L3526L8760M1643L9556L0417J4869m021k2332l6475m4434m6797
56770D16843m5774m2898l8473l3096k8025k3689j9415j5160j2056j0589r790q885
56758A28993q193p641o189l725j919j886k456k112j307j344k071k357k018j679
56744H4096j383p76j91k63p32q01l35J59M21M37Q3n11p42l75J3lm1J68J71j54
56724G9241L6J182K342K563K288K329K453K134J758J801J683P82k13l34N4O5p
56707A00157O77J800K314K137J948J758J178P05J134J983K010J202O92Q54Q70
$$ plain form
56805 723937 804861 878280 931291 953700 941850 899396 834810 758037 678270 602582 535034
56794 535034 477026 428823 390431 361116 339283 323609 313716 309316 309682 314787 326102 345213
56782 345213 372131 405657 444417 486060 525616 556033 570902 566881 544549 508074 463640 416843
56770 416843 371069 328171 289698 256602 228577 204888 185473 170313 158257 147668 137878 128993
56758 128993 120800 113159 106970 103245 101326 99440 96984 94872 93565 92221 90150 87793 85775 84096
56744 84096 82713 81937 81746 81483 80751 79950 79615 79774 80195 80632 80715 80204 79462 79087 79100 79097 79056 79224 79395 79241
56724 79241 79277 80459 82801 85364 87652 89981 92434 94568 96326 98127 99810 100592 100379 100045 100099 100164 100157
56707 100157 100834 102634 104948 107085 109033 110791 111969 112674 113808 115791 117801 119003 119695 120549 121419
56692A21419L16k78n50p90j089j151j042j060q50K25J731K339J566L63k01N2P30
56675A21730J391J599J228P56N98L49m98j389j276j52R70J530J846K201K541L000
56659A36424L669L898L014J714J524K630L487K946J698J155J731K768L380L014
56645A73052J735L68j72R5L05o1o05p68o04n52q73j428j777j528q76n01o54q01
56627A64355n66m78j070j821j929j667j890k569k918k799k813l121l264l182l334
56612A30934l682l560k663j370j0J258J932J532N69J51N28R69J102J321J739J795
56596A32545J263O67L89K44J82M70R50R87N11K28M58O22L25K9K04N73P15P54Q94
56577A43010R16O36L59M18O80Q88J054J230J305J376J826K723L538L811L813M242
$$ plain form
56692 121419 121735 121457 120907 120117 119028 117877 116835 115775 114925 115150 116881 119220 120786 121149 120948 121000 121730
56675 121730 123121 124720 125948 126704 127302 127651 127153 125764 124488 124336 125306 126836 128682 130883 133424 136424
56659 136424 140093 143991 147005 148719 150243 152873 156360 159306 161004 162159 163890 166658 170038 173052
56645 173052 174787 175155 174983 175078 175383 175322 174717 173949 173345 172793 171920 170492 168715 167187 166311 165810 165156 164355
56627 164355 163789 163311 162241 160420 158491 156824 154934 152365 149447 146648 143835 140714 137450 134268 130934
56612 130934 127252 123692 121029 119659 119649 120907 122839 124371 124940 125091 125619 126588 127690 129011 130750 132545
56596 132545 133808 134475 134864 135108 135290 135760 136710 137697 138208 138436 138894 139516 139841 139870 140074 140647 141362 142116 143010
56577 143010 143926 144562 144921 145339 146019 146907 147961 149191 150496 151872 153698 156421 159959 163770 167583 171825
56561A71825N500P352R195J0510J1263J1754J1901J0913Q177M305P65j471k479
56548B59510k744k589k268k033j977k116k501k986l163k930k722k724k358j313
56534B25086n31j140k711l748l792l824m454m917m340l109k312k399k840k822
56520A82147k037r64m18o25r17o43p2R1k93p60r78q81m45K5j70j222k200k195
56502A67443j576j294j360j075m28r1k44n17q34j282j345n17N20O10q3k68M44
56485A58103J053Q63L58J17L9l4M1J44qp9O14J815K413J992J270Q52O08M97Q30
56466A71488J428J579J162Q28Q28O84L01K42N89N73j63r19r77n34j31N9J01N1
56448A77189K4m3n14j304j410k29J107J026j73p65j43O65R28R15O64j62r76o61
$$ plain form
56561 171825 177325 184677 193872 204382 215645 227399 239300 250213 258390 262695 263460 261989 259510
56548 259510 256766 254177 251909 249876 247899 245783 243282 240296 237133 234203 231481 228757 226399 225086
56534 225086 224555 223415 220704 216956 213164 209340 204886 199969 195629 192520 190208 187809 184969 182147
56520 182147 180110 179146 178728 178103 177186 176543 176471 176562 176269 175509 174531 173650 173205 173230 173060 171838 169638 167443
56502 167443 165867 164573 163213 162138 161710 161619 161375 160858 160024 158742 157397 156880 157400 158010 157927 157659 158103
56485 158103 159156 160019 160377 160494 160533 160499 160540 160684 160676 160597 161211 163026 165439 167431 168701 169553 170161 170658 171488
56466 171488 172916 174495 175657 176485 177313 177997 178298 178540 179129 179702 179539 178620 177643 177109 176978 177037 177138 177189
56448 177189 177213 177170 176656 175352 173942 173713 174820 175846 175673 174908 174765 175430 176358 177273 177937 177775 176799 176138
56430A76138L89N36m32p97K67J390J381R47R66Q39j14j129j213o82k24K97J074
56413A79633J510J250R13P84R4j311j948p49J087J796J520J547J917J524J78j016
56397A88729j214o41L2L41K36K07Q47J971K698K765K805L021K712J677R04J060
56381B08150J487J509J531J882J823Q75n1PN39O84P98J533K298K065J091M37L19
56364B26977K66K91P27J232J269J119J389J848J789J146L54m84j348j695j063
56349B33817O0Q20J032R87P46L53J88M01O00P01J267K288K584J460O8M2J424K958
56331B51796L826M034L706L072K735L020L453L504L304L018K313J176L77L26L58
56316B90018p4m18j48J80o5m05j86K65M18N56R67J125P60P71J834L134L673L874
$$ plain form
56430 176138 176527 177063 176631 175834 176101 177491 178872 179819 180785 181624 181510 180381 179168 178486 178262 178559 179633
56413 179633 181143 182393 183306 184090 184184 182873 180925 180176 181263 183059 184579 186126 188043 189567 189745 188729
56397 188729 187515 186874 186906 187247 187483 187690 188537 190508 193206 195971 198776 201797 204509 206186 207090 208150
56381 208150 209637 211146 212677 214559 216382 217257 217206 217213 217752 218436 219234 220767 223065 225130 226221 226658 226977
56364 226977 227243 227534 228261 229493 230762 231881 233270 235118 236907 238053 238407 237923 236575 234880 233817
56349 233817 233877 234697 235729 236716 237462 237815 238003 238404 239004 239705 240972 243260 245844 247304 247372 247414 248838 251796
56331 251796 255622 259656 263362 266434 269169 272189 275642 279146 282450 285468 287781 288957 289334 289660 290018
56316 290018 289944 289526 289378 289558 289493 289088 288902 289167 289585 290141 291108 292233 292993 293764 295598 298732 302405 306279
56298C06279M485M960M470L658L752M513M663L919L115K715K504K456K789L374
56284C57652M018M845N729O068N877O159P267Q077P813P530Q398R744J0251J0050
56270D59478J0089J0377J0504J0964J2397J4203J5433J6250J7209J8073J8818
56259F13795K0681K4532K9222L3283L7204M2257M8135N3814N9772O7164P5545
56248A105404Q3568R1224R9332J07315J13729J18435J22147J24265J23252J18809
56238B207480J11765J02124Q9149P3009N4505L3849J1542j0206k9157m5601o1119
56227B537340p5427q6683r4366r9455j02192j02168j00301r8240r5955r2239q7426
56216A502888q3092p9218p4228o7930o1978n7285n3201m9387m6171m3015l8973
$$ plain form
56298 306279 310764 315724 320194 323852 327604 332117 336780 340699 343814 346529 349033 351489 354278 357652
56284 357652 361670 366515 372244 378312 384189 390348 397615 405692 413505 421035 429433 439177 449428 459478
56270 459478 469567 479944 490448 501412 513809 528012 543445 559695 576904 594977 613795
56259 613795 634476 659008 688230 721513 758717 800974 849109 902923 962695 1029859 1105404
56248 1105404 1188972 1280196 1379528 1486843 1600572 1719007 1841154 1965419 2088671 2207480
56238 2207480 2319245 2421369 2510518 2583527 2638032 2671881 2683423 2673217 2644060 2598459 2537340
56227 2537340 2461913 2375230 2280864 2181409 2079217 1977049 1876748 1778508 1682553 1590314 1502888
56216 1502888 1419796 1340578 1266350 1198420 1136442 1079157 1025956 976569 930398 887383 848410
56205H48410l4724l1832k9954k7240k3500k0405j8407j6225j3668j2207j2085
56194F08163j1484r480p387o386n975n569n477n567m894l410k243j796j366q84
56180E36245r85j256o00M93M24n27l65J242K431K536L126M844O047N719N150N432
56164E69956N827N824O463Q192R621R792R760J0621J1874J2936J4328J6288J8103
56151G09585J9871K2963K7660L2342L6223M0949M8328N8449P1021Q6456J04134
56140A257981J21376J35328J44208J45988J38367J21822J00888Q0847O4494N3027
56130B364326M7574M7598M9166M6984L8048K2961N105j0674k0262k2957k1745
56119B546124k0839k3823l3594n1493p5408j00289j21330j35685j41644j38663
$$ plain form
56205 848410 813686 781854 751900 724660 701160 680755 662348 646123 632455 620248 608163
56194 608163 596679 587199 579812 573426 567451 561882 556405 550838 545944 542534 540291 538495 537129 536245
56180 536245 535260 534004 533404 533897 534321 533794 533429 534671 537102 539638 542764 547608 553655 559374 564524 569956
56164 569956 575783 581607 588070 596262 605883 615675 625435 636056 647930 660866 675194 691482 709585
56151 709585 729456 752419 780079 812421 848644 889593 937921 996370 1067391 1153847 1257981
56140 1257981 1379357 1514685 1658893 1804881 1943248 2065070 2165958 2246805 2311299 2364326
56130 2364326 2411900 2459498 2508664 2555648 2593696 2616657 2621762 2611088 2590826 2567869 2546124
56119 2546124 2525285 2501462 2467868 2416375 2340967 2240678 2119348 1983663 1842019 1703356
56109A703356j28662j15093j00065q4098o8511n5407m4972l5584k7004k0768j6893
56098A006299j3237q905n405l477j793K26J282J000Q84J357R40m32n42J285K691
56083I82173K206J550K299L396L825M677O548P848P728P818R138J0141R835R916
56069A069098J1611J3346J3735J4070J5579J6992J7129J7171J8105J8677J8100
56058A243613J8056J9640K1044K0592J9328J8412J6862J4300J2885J3946J5556
56047A434234J5959J6471J8392K0129K0242K0294K1827K3329K3146K2617K3333
56036A659973K4125K3736K3751K5795K8457K9988L1460L4318L7423L9298M0766
56025A999090M2711M3966M3960M4497M6457M7899M7909M8769N1758N4505N5343
$$ plain form
56109 1703356 1574694 1459601 1359536 1275438 1206927 1151520 1106548 1070964 1043960 1023192 1006299
56098 1006299 993062 984157 978752 975275 973482 973708 974990 975990 976874 978231 979171 978739 978197 979482 982173
56083 982173 984379 985929 988228 991624 995449 1000126 1006674 1014522 1022250 1030068 1039206 1049347 1059182 1069098
56069 1069098 1080709 1094055 1107790 1121860 1137439 1154431 1171560 1188731 1206836 1225513 1243613
56058 1243613 1261669 1281309 1302353 1322945 1342273 1360685 1377547 1391847 1404732 1418678 1434234
56047 1434234 1450193 1466664 1485056 1505185 1525427 1545721 1567548 1590877 1614023 1636640 1659973
56036 1659973 1684098 1707834 1731585 1757380 1785837 1815825 1847285 1881603 1919026 1958324 1999090
56025 1999090 2041801 2085767 2129727 2174224 2220681 2268580 2316489 2365258 2417016 2471521 2526864
56014B526864N6414N9543O3027O5497O8798P3912P8458Q1401Q5594R2247R7795
56003C349550J00046J02351J07631J13526J17766J22998J31555J40631J47626
55994D433680J55021J65089J75242J83613J93630K07778K22733K35949K50874
55985F223609K70081K90016L08398L29689L56976L86096M14473M47603M89412
55976I516353N34880N80320O31854O95001P65373Q39445R24674J028614J148417
55967A6664931J282172J439792J630912J854418K113662K429963K827466L319012
55959C3562328L922177M672516N602237O723377Q053926R645852J1574082J3933600
55951I7690095J6884322K0668300K5514074L1453954L8080641M4209260M7641993
$$ plain form
56014 2526864 2583278 2642821 2705848 2771345 2840143 2914055 2992513 3073914 3159508 3251755 3349550
56003 3349550 3449596 3551947 3659578 3773104 3890870 4013868 4145423 4286054 4433680
55994 4433680 4588701 4753790 4929032 5112645 5306275 5514053 5736786 5972735 6223609
55985 6223609 6493690 6783706 7092104 7421793 7778769 8164865 8579338 9026941 9516353
55976 9516353 10051233 10631553 11263407 11958408 12723781 13563226 14487900 15516514 16664931
55967 16664931 17947103 19386895 21017807 22872225 24985887 27415850 30243316 33562328
55959 33562328 37484505 42157021 47759258 54482635 62536561 72182413 83756495 97690095
55951 97690095 114574417 135242717 160756791 192210745 230291386 274500646 322142639
55944C22142639M5609048L6191371J9939869K09728j8388930l2282974m0206173
55937C33214578m2838505m1671219l8170024l3503381k8521967k3769567j9535650
55930A05204265j5942992j3003033j0642658q753108p242698o042189n083028
55923C8494559m301544l658759l133496k700858k334797k023964j766053j550940
55915A7024148j364271j201921j066093r51872q50675p62084o89591o29068n73112
55906H935461n22390m81533m47894m15018l83379l57331l35010l11160k86760
55897E394986k66454k49222k30624k11647j96672j84973j72382j59278j49200
55888C574534j41471j32479j22566j14748j08358j00400r1395q3783p6443o7004
$$ plain form
55944 322142639 367751687 403943058 423882927 424092655 405703725 373420751 333214578
55937 333214578 290376073 248704854 210534830 177031449 148509482 124739915 105204265
55930 105204265 89261273 76258240 65615582 56862474 49619776 43577587 38494559
55923 38494559 34193015 30534256 27400760 24699902 22365105 20341141 18575088 17024148
55915 17024148 15659877 14457956 13391863 12439991 11589316 10827232 10137641 9508573 8935461
55906 8935461 8413071 7931538 7483644 7068626 6685247 6327916 5992906 5681746 5394986
55897 5394986 5128532 4879310 4648686 4437039 4240367 4055394 3883012 3723734 3574534
55888 3574534 3433063 3300584 3178018 3063270 2954912 2854512 2763117 2679334 2602891 2535887
55878B535887n7753n3345n4200n7477o2440o9244p4720p5384p3064p1989p1883
55867A814388o9414o4650o0444n6825n1665m5851m2283m0573l7826l3974l1507
55856A279376l0693k9680k8633k9163l0318k9611k7452k6458k6958k7159k6888
55845I66363k7194k7107k4884k1700k0110j9700j8196j5983j5338j5888j5143
55834G45120j3145j2389j3226j3345j1825j0079q704o909n165n054o389p487q162
55821F23241r512j1038j1175j0370j0559j1655j1638j0074q528p629o538n279
55809E09246m807m813m063k783k182j956q14J000K270L312N209P063O979N326
55795E18987M043L090O73l154o179p419q035q744r045r003r210q979p026l976
$$ plain form
55878 2535887 2478134 2424789 2370589 2313112 2250672 2181428 2106708 2031324 1958260 1886271 1814388
55867 1814388 1744974 1680324 1619880 1563055 1511390 1465539 1423256 1382683 1344857 1310883 1279376
55856 1279376 1248683 1219003 1190370 1161207 1130889 1101278 1073826 1047368 1020410 993251 966363
55845 966363 939169 912062 887178 865478 845368 825668 807472 791489 776151 760263 745120
55834 745120 731975 719586 706360 693015 681190 671111 662407 655498 650333 645279 638890 631403 623241
55821 623241 613729 602691 591516 581146 570587 558932 547294 537220 528692 521063 514525 509246
55809 509246 504439 499626 495563 492780 490598 488642 487828 488828 491098 494410 499619 506682 513661 518987
55795 518987 523030 526120 526793 523639 517460 510041 502006 493262 484217 475214 466004 457025 449999 446023
55781D46023j775r95j146k975p334j2151j3924j2379j0538r867q604n346j151
55768C57838K716O206Q701Q597N799K373k13k459m701n957n747n094m731m179
55754C59149l230k566k319j766j049j412l169n134o506p659q766r303r251r111
55740B87908q570o951m998m278m693m594l560k864k949k668j541o37n79p50r68
55725B37308j978l660m707m745m794n119m666l247k229k243k143j119L7O61J345
55710A98701K470L317L544L866M437M244L032K050J915J367p10l531n729p024
55696B11949p578p091n667m369l904l728l255k761k414j675l84P04J216J730K476
55681A75249K810K656L025M326N502N692N373M964L808J528q21k149k714l104
$$ plain form
55781 446023 444248 443253 442107 439132 431798 419647 405723 393344 382806 372939 364335 358989 357838
55768 357838 360554 366760 375461 384058 389857 392230 392017 389558 384857 378900 373153 368059 363328 359149
55754 359149 355919 353353 351034 349268 348219 346807 343638 338504 331998 324339 315573 306270 297019 287908
55740 287908 279338 272387 267389 263111 258418 253824 250264 247400 244451 241783 240242 239605 239026 238276 237308
55725 237308 235330 231670 226963 222218 217424 212305 207639 204392 202163 199920 197777 196658 196695 197356 198701
55710 198701 201171 204488 208032 211898 216335 220579 223611 225661 227576 228943 228233 224702 218973 211949
55696 211949 204371 197280 191613 187244 183340 179612 176357 173596 171182 169507 169123 169827 171043 172773 175249
55681 175249 178059 180715 183740 188066 193568 199260 204633 209597 213405 214933 214112 211963 209249 206145
55667B06145k997k048j033q82j284j231l75Q87K050K571K075J003M38Q06J535
55652B07660K159K692K754J644k98j742k301k955m032m423l639l098m067n695
55638A84659o382o020n598n450n172m609l943l289k939l281l856l490k014p65
55624A27851o03o57K4P30L23q72j662j782j766j756j585j543j922k224j842j044
55608A09670n02k83k48p31j868k800k575j504p08o49r38j162j160q26l61l55r50
55591I2050j421j187o43l42k1P15J408J409R93Q70R91P87K83M0J94M10N94R31
55573I8061J335J569J775K284L014L573L803L821L673L338K877K255J254j35j552
55558A30945k626l211l183k606k131k457l258l401k512j441r40q14p55r09j111
$$ plain form
55667 206145 203148 201100 200067 199185 197901 196670 196295 197182 199232 201803 203878 204881 205319 206125 207660
55652 207660 209819 212511 215265 216909 216611 214869 212568 209613 205581 201158 197519 194421 190354 184659
55638 184659 178277 172257 166659 161209 156037 151428 147485 144196 141257 137976 134120 130630 128616 127851
55624 127851 127248 126591 126615 127345 127668 126796 125134 123352 121586 119830 118245 116702 114780 112556 110714 109670
55608 109670 109168 108885 108637 107906 106038 103238 100663 99159 98451 97802 96864 95702 94542 93716 93355 93000 92050
55591 92050 90629 89442 88799 88457 88436 89151 90559 91968 92961 93831 94822 95609 95892 95932 96126 96536 97130 98061
55573 98061 99396 100965 102740 105024 108038 111611 115414 119235 122908 126246 129123 131378 132632 132497 130945
55558 130945 128319 125108 121925 119319 117188 114731 111473 108072 105560 104119 103179 102365 101610 100701 99590
55543I9590o56M34J004M70j35K71J195J578J513J720K058J877J344J132J106N54
55527A15055n02j339j747k223l018l862m516m923m905m416l861l507k922j698
55513G1616l73J91N0j02j51n79j346j761j492r34m57MN46J038J421J786K106K236
55495G3799K112J703R51J04k55R0N77N76K49J43L10M12M44P41J349J922K133J869
55477H9229J172L36j99l26l74m87l58L3N2p46j849k449k447k210j789j025j63
55460G6400L47M76N31O18O17M63J55k80n49k77L22M99M6l19j04J40k23q78j181
55441G6803j207j426j752j772j492j158p38j46L91Q21J549K575K939J935L10o25
55425G7007o11k85O1N37Q66O37J62N3K06J01j07J36O00N22J2L7Q03J231M50r85
$$ plain form
55543 99590 98934 99368 100372 100842 100707 100978 102173 103751 105264 106984 109042 110919 112263 113395 114501 115055
55527 115055 114553 113214 111467 109244 106226 102364 97848 92925 88020 83604 79743 76236 73314 71616
55513 71616 71243 71434 71484 71382 71231 70652 69306 67545 66053 65119 64662 64666 65212 66250 67671 69457 71563 73799
55495 73799 75911 77614 78565 78669 78414 78504 79081 79657 79906 80049 80359 80771 81215 81956 83305 85227 87360 89229
55477 89229 90401 90737 90538 90212 89838 89351 88993 89026 89078 88332 86483 84034 81587 79377 77588 76563 76400
55460 76400 76747 77223 77754 78372 78989 79452 79607 79327 78778 78501 78823 79322 79368 79049 78945 79085 78862 77984 76803
55441 76803 75596 74170 72418 70646 69154 67996 67258 67112 67503 68324 69873 72448 75387 77322 77632 77007
55425 77007 76396 76111 76172 76709 77575 78212 78374 78427 78633 78734 78627 78763 79363 79885 79897 79934 80737 81968 82418 81433
55405H1433j848j682j020n74n51o69o45o26r15j323j210l59O35J167J263J147
55389G4223P39J10k68k11j60k84k6Q12J343Q68J06J27O54O73J69J1M41R05J248
55370H1480J849K577K720J984P25p47k231l226l327k923k649k369j607o73k97
55355G1286l96k37L06P29R38J196J255O87q6k87j86p00j648j809q53J49L61P1
55337G0776l45j000j617j319P4J510J968J459M84n79j210q53J94Q75O87J67j77
55320G1094m69p38o12j18J48lo9J01j5n51q51n99l39l68j26O95J385J277P02K32
55300G0776k12p69r62l60O04J233J443J449J161N39N5J83P52J255J390J040K15
55283G9792o52r11n25r2J30N00J044J149N93M0m5k5j90q8N21R35N81L6J20O30
$$ plain form
55405 81433 79585 77903 76883 76309 75758 75089 74444 73818 72903 71580 70370 70011 70646 71813 73076 74223
55389 74223 74962 75072 74804 74593 74433 74149 74123 74935 76278 77146 77252 77379 78033 78706 78875 78886 79327 80232 81480
55370 81480 83329 85906 88626 90610 91335 90588 88357 85131 81804 78881 76232 73863 72256 71583 71286
55355 71286 70890 70653 70959 71688 72626 73822 75077 75764 75678 75391 75205 74505 72857 71048 70195 70344 70705 70776
55337 70776 70431 69431 67814 66495 66569 68079 70047 71506 71990 71411 70201 69348 69542 70417 71104 71271 71094
55320 71094 70625 69887 69275 69157 69305 69302 69233 69334 69319 68768 67917 67318 66979 66611 66485 67180 68565 69842 70544 70776
55300 70776 70564 69795 68833 68473 69077 70310 71753 73202 74363 74902 74957 75140 75892 77147 78537 79577 79792
55283 79792 79140 78229 77704 77612 77742 78242 79286 80435 81028 81068 81023 80998 80808 80720 81241 82176 82757 82793 82913 83543
55263H3543Q59Q00Q61Q84L48o36j364j399q87k47Lm72j277j475p94j14j74n26
55245G7933l89P8K46J42K38M50L69J60L47Q20Q88L09m04p65p88p39q37j152j417
55226G5489j178m13K88M93M87O19O88M58K64M51O13K02n37r20q34o82n77l53j04
55207G4454k2R5M69P30L88l03o20l47J76O94J037Q48Q5m84j58N95Q08M81L66M80
55187G9772J30o02p06J02P74M94j96m43l07j94J12R40J788J816J093N05N11O47
55169H6236L64k34o29n57j80J84L35K00k27q37j283j157m54K44L61n1m55n54n02
55150H0804m36k22J80M51K14n04j268j539j026N8R92J059K65n57n22M26J470J790
55132H1635J366Q47O52M47k42j146j436q73k16k21o31n97J90J210J779J619Q90
$$ plain form
55263 83543 84402 85202 86063 86947 87295 86659 85295 83896 83009 82762 82765 82293 81016 79541 78747 78633 78459 77933
55245 77933 77544 77622 77868 78010 78248 78698 79067 79227 79574 80394 81282 81591 81187 80422 79634 78895 78058 76906 75489
55226 75489 74311 73898 74186 74679 75166 75785 76473 76931 77195 77646 78259 78461 77924 77004 76170 75488 74911 74558 74454
55207 74454 74432 74527 74996 75726 76114 75811 75191 74844 75020 75714 76751 77599 77684 77200 77042 77637 78445 78926 79292 79772
55187 79772 79902 79300 78594 78696 79470 79964 79768 79325 79018 78824 78936 79876 81664 83480 84573 85078 85589 86236
55169 86236 86600 86366 85737 85180 85000 85184 85519 85719 85492 84655 83372 82215 81761 82005 82366 82315 81860 81306 80804
55150 80804 80368 80146 80326 80777 80991 80487 79219 77680 76654 76712 77704 78763 79028 78471 77949 78375 79845 81635
55132 81635 83001 83848 84500 84947 84705 83559 82123 81250 81034 80813 80182 79585 79775 80985 82764 84383 85273
55115H5273O2l02kN21O46K81o8M6N20Q48N86j98q67p67RO68O84M09M18O36N84
55094H9987K16n3n6p3k75m64m63l91l93l68q1N20J177J408R17J4n92n55k19L2
55074I0288L20Q54J318J255P86L48n8p07j387j483q83j74K12M36O69P16M41J39
55056I3090O4N2j02k21r7N9j11n48p65m51K29Q52J101Q76K74m34p79l57O60J353
55036I4745Q84m12j196p58N5%r21j678j752j523j217n46L70O78N0n45p1J054J477
55017H8694P46j99l86O4L87K50m0j75k24l36l20J66R88J447J114N21N75J303J775
54998I6350J351M87q9m11q99j301q48N15J786K028J393O60K40Jk37m93q06j189
54980I8538j347q45K87J378J693J106J62l73m7R32J783J755Q79m5k95O2M23L71
$$ plain form
55115 85273 85335 85033 85031 85552 86198 86479 86411 86457 86977 87825 88411 88213 87346 86579 86588 87256 87940 88349 88767 89403 89987
55094 89987 90203 90150 90094 90021 89746 89282 88819 88428 88035 87667 87586 88106 89283 90691 91608 91622 91030 90475 90256 90288
55074 90288 90608 91462 92780 94035 94821 95169 95111 94404 93017 91534 90651 90477 90689 91125 91794 92510 92951 93090
55056 93090 93154 93206 93104 92883 92786 92845 92734 92186 91421 90970 91199 92051 93152 94028 94302 93868 93089 92732 93392 94745
55036 94745 95629 95217 94021 93263 93318 93318 92397 90719 88967 87444 86227 85681 86051 86729 86779 86234 86163 87217 88694
55017 88694 89440 89241 88855 88919 89306 89556 89516 89341 89117 88781 88461 88627 89615 91062 92176 92697 93272 94575 96350
54998 96350 97701 98188 98099 97688 96789 95488 94640 95155 96941 98969 100362 101022 101262 101263 101026 100533 99727 98538
54980 98538 97191 96346 96633 98011 99704 100810 100972 100599 100552 101484 103267 105022 105901 105856 105561 105623 106046 106417
54962A06417m2n20p77o18q2N46J008J266J376J280R95P58P01N41k5p80j241j341
54944A09462j362j316r14k60N5k56p18p23k57K25L86K69J80M73J140J687J718
54927A09789J640K262L573M576M576M051L904M390N312O696Q574J0337J0990J0079
54913A90749P958N236K334m95l105n477p539r014r615r361q578p665o886o194
54899A32348n248l800k156r07k42R7K15Ok51M6Q83J465J332R88R58R79P34O90
54881A28137J425K634L666M553N710O947P719Q081Q473Q700Q042O405M469K670
54867B07631P60j497l923o251q247r403r206p941o648o102o163o218n769m675
54853A26348l235k147j887k142k233j997j783j718j624j519j642j886j839j394
$$ plain form
54962 106417 106375 105855 105078 104460 104378 104924 105932 107198 108574 109854 110849 111607 112308 112849 112824 112044 110803 109462
54944 109462 108100 106784 105870 105610 105665 105409 104691 103968 103711 103936 104322 104591 104771 105244 106384 108071 109789
54927 109789 111429 113691 117264 121840 126416 130467 134371 138761 144073 150769 159343 169680 180670 190749
54913 190749 198707 203943 206277 205782 202677 197200 189661 180647 171032 161671 153093 145428 138542 132348
54899 132348 127100 123300 121144 120237 119995 120092 120307 120313 120062 120108 120991 122456 123788 124776 125734 126713 127447 128137
54881 128137 129562 132196 135862 140415 146125 153072 160791 168872 177345 186045 194087 200492 204961 207631
54867 207631 208391 206894 202971 196720 188473 179070 169864 161923 155275 149173 143010 136792 131023 126348
54853 126348 123113 120966 119079 116937 114704 112707 110924 109206 107582 106063 104421 102535 100696 99302
54839I9302q42l67R0M65O20O96Q95J006O68M5m02o56r87j184p57J74R20J195J247
54820A02128J069L95m62p32l81j92m29l33N58J517J608R10J78j76k63l36n86r47
54802A03526q87j4J055J212M35lO43J514J518Q36L22P7l64r23j020m89K94J020
54784A08752J529J460O15m28p52k08M73P24Q27J330K196K825K853K621K766L432
54768A31015M162M624N072N848O835P850R125J0688J1585J0685Q135N134K257
54755B23015q96m361p310r247j0531j1251j0722q797o613n205m254l060j910j484
54741A37374j661j895k155k476k226r73M28P90K90Q0N16R39J027J157J472J673
54725A34360J913K817M413N883O635O935P254P688Q100Q147P130M537R71k213
$$ plain form
54839 99302 98460 98093 98183 98648 99268 99964 100859 101865 102533 102578 102176 101520 100533 99349 98592 98766 99686 100881 102128
54820 102128 103197 103592 103130 102398 102017 101825 101396 101063 101621 103138 104746 105656 105834 105658 105395 105059 104473 103526
54802 103526 102639 102625 103680 104892 105327 105324 105967 107481 108999 109835 110157 110234 109870 108947 107927 107438 107732 108752
54784 108752 110281 111741 112356 111928 111176 110968 111441 112165 112992 114322 116518 119343 122196 124817 127583 131015
54768 131015 135177 139801 144873 150721 157556 165406 174531 185219 196804 207489 215624 220758 223015
54755 223015 222119 217758 210448 201201 190670 179419 168697 159900 153287 148082 143828 140768 138858 137374
54741 137374 135713 133818 131663 129187 126961 125988 126416 127206 127496 127576 128092 129031 130058 131215 132687 134360
54725 134360 136273 139090 143503 149386 156021 162956 170210 177898 185998 194145 201275 205812 206783 204570
54711B04570m339n856p218q099q080p430o781o408o171n798m995l647k164j289
54697A26295j296j690j839j634j373j228j043n48K67R70J014M08j67k40j96o14
54681A17086j234j254n20K27L36q9o24j017j099p68l07k26n25n45J30R81J131
54664A11683M41l59o04m65n72j016j078k35Q27Q07m59j563j205K25J302J294N89
54647A09612k14q10r66n65R4N86Q37Q93N53j29l78L62J296J155P6n35j14L65P9
54628A12197m39m47k67n34r83q97k92K02L53M36N47M51P8l18m73l33J2L72N81
54609A10246O98Q57Q85M41k68m41K61J099J091J63r14j471j414r88n63m62o37
54592A08583o23j10N95R63R03P66P55P12M48K4k59j03M45Q35N29k54o62k58L87
$$ plain form
54711 204570 200231 194375 187157 179058 170978 163548 156767 150359 144188 138390 133395 129748 127584 126295
54697 126295 124999 123309 121470 119836 118463 117235 116192 115644 115911 116881 117895 118303 118136 117896 117700 117086
54681 117086 115852 114598 114078 114305 114641 114552 113928 112911 111812 111044 110737 110511 109986 109441 109571 110552 111683
54664 111683 112124 111765 111161 110696 110124 109108 108030 107795 108622 109429 108970 107407 106202 106427 107729 109023 109612
54647 109612 109398 108588 107622 107057 107151 107737 108574 109467 110020 109891 109513 109875 111171 112326 112402 111867 111753 112118 112197
54628 112197 111758 111311 111044 110510 109527 108630 108338 108540 108893 109329 109876 110327 110405 110087 109614 109281 109293 109665 110246
54609 110246 110944 111801 112686 113127 112859 112418 112679 113778 114869 115032 114118 112647 111233 110245 109682 109220 108583
54592 108583 107960 107850 108445 109408 110311 111077 111832 112544 112992 113016 112757 112654 113099 113934 114463 114209 113547 113289 113676
54573A13676M91N2l37l69j98Q2N64J072J076L33o24r70m43L92Q24P25N04L99K36
54554A17485o8j83Q1L35J91J5M17J172J480J198J007J162J080N24K52Q97J894
54537A28939K312K122J944J952J860J640J521J391R47K82l12r09j683k250j980
54522A37776r62J7M59M83K49k76q83j130j016j067j526j949j805j087j92M33M20
54505A27944k35q84p79p9K20l93j202j315p98l32l5M87J160J231L22q27j107k87
54487A23091P76J161Q43M76M26L47j61q15q77j46P27J025Q12P16J059J423J240
54470A32123N31m5R7Q55J590J796J504J021N72L26M70R89J474J482R61J94n86
54453A45354j188j291p52o9J0n14p55n9J126J776J405M18m08n80k54j00n96j296
$$ plain form
54573 113676 114167 114219 113882 113513 113315 113397 113961 115033 116109 116442 115818 114848 114405 114797 115621 116346 116850 117249 117485
54554 117485 117417 117234 117315 117650 117841 117856 118273 119445 120925 122123 123130 124292 125372 125896 126148 127045 128939
54537 128939 131251 133373 135317 137269 139129 140769 142290 143681 144628 144910 144598 143689 142006 139756 137776
54522 137776 136814 136831 137290 137773 138022 137746 136863 135733 134717 133650 132124 130175 128370 127283 127091 127524 127944
54505 127944 127709 126825 126046 125967 126187 125794 124592 123277 122479 122147 122112 122599 123759 124990 125312 124485 123378 123091
54487 123091 123867 125028 125871 126347 126773 127120 126959 126144 125267 125121 125848 126873 127685 128401 129460 130883 132123
54470 132123 132654 132609 132706 133561 135151 136947 138451 139472 140044 140370 140840 141829 143303 144785 145746 145940 145354
54453 145354 144166 142875 142123 142054 142064 141550 140795 140736 141862 143638 145043 145461 145053 144473 144219 144119 143523 142227
54435A42227j266m47Rp31j870j948q05L19N72L93M16M76J99r8J08O18Q07O31O47
54416A40257R88J036L08q17j513j393p02R6O81R19P61K22n22j063r70k08P77J539
54398A40396K079K538K710K238J304O17N88Q75R43P21N25N72Q17J038Q81R1j067
54381A57866j832j766j290j107j252j172p02m22q54j639j880j208k03L31L09L65
54365A43544R36J649J846J468J059R72J063J190J474J817J649O30o98j425j278
54350A55896p36k80K4L01N58O90N03j20q93j121l93Q15J582J524J053P55Q88J368
54332A62414J893K076J772J233O69j51j461k820l441l150k525k051j626j021l20
54317A51491K12L65j1p98j399j262o20k95o14j081j262j320j419j190l54O28J033
$$ plain form
54435 142227 140961 140514 140523 139792 137922 135974 135169 135488 136060 136453 136869 137345 137544 137446 137554 138172 138979 139610 140257
54416 140257 141245 142281 142589 141772 140259 138866 138164 138260 138941 139860 140621 140843 140321 139258 138288 138080 138857 140396
54398 140396 142475 145013 147723 149961 151265 151882 152470 153345 154288 155009 155534 156106 156923 157961 158842 158933 157866
54381 157866 156034 154268 152978 151871 150619 149447 148745 148323 147469 145830 143950 142742 142539 142870 143179 143544
54365 143544 144480 146129 147975 149443 150502 151474 152537 153727 155201 157018 158667 159297 158599 157174 155896
54350 155896 155160 154880 154904 155205 155763 156453 156956 156836 155943 154822 154429 155244 156826 158350 159403 160158 161046 162414
54332 162414 164307 166383 168155 169388 170057 169906 168445 165625 162184 159034 156509 154458 152832 151811 151491
54317 151491 151703 152068 152057 151259 149860 148598 147978 147683 147069 145988 144726 143406 141987 140797 140443 141071 142104
54300A42104P71L98L58O17Q80Q60M80k1l06l89o09r99j033k74R30J768J814J294
54282A48643O72K28k1j58j90l5K77M82M13K66K08k2o09j008n12N11Q75K54l12
54263A49962q2K45k76j176j221k38P18R15P80J015J580J875J551Q95M55M73O58
54246A58129O51N00L29j99j430k673k644j223R9J16o50j110j250j583j779j187
54230A44096k14J60j7P9L55j52j387j929r93M60J239J418J551J478P73k14p70
54213A45933r17j240j824k100j666q16j32J13J76N42J303J877J630P41Qk27l26
54196A43075n12m59k9L19L09L87Q82J199O10n71j339j349j151j204j327j233r60
54179A36647o56l09R9N04R36J479J939J882J190L32j63l60o93j189j247n05L84
$$ plain form
54300 142104 142875 143273 143631 144248 145128 145988 146468 146447 146141 145752 145143 144144 143111 142837 143767 145535 147349 148643
54282 148643 149315 149543 149522 149364 149174 149139 149416 149898 150311 150577 150785 150763 150154 149146 148634 149145 150020 150274 149962
54263 149962 149880 150125 149849 148673 147452 147214 147932 148847 149627 150642 152222 154097 155648 156543 156998 157471 158129
54246 158129 158780 159280 159609 159410 157980 155307 152663 151440 151539 151655 151005 149895 148645 147062 145283 144096
54230 144096 143882 144042 144025 144104 144459 144307 142920 140991 139998 140458 141697 143115 144666 146144 146917 146703 145933
54213 145933 145016 143776 141952 139852 138186 137370 137238 137351 137527 138069 139372 141249 142879 143620 143628 143401 143075
54196 143075 142563 142104 142075 142394 142703 143090 143972 145171 145781 145210 143871 142522 141371 140167 138840 137607 136647
54179 136647 135991 135682 135781 136285 137221 138700 140639 142521 143711 144043 143880 143520 142827 141638 140391 139886 140270
54162A40270L64o44j493j216j78N50N54K04j64m22k24O59J585J547O13p5K9K10
54144A42169j22m23q7L99L75K21O11J125Q73J14o0M29N31q5m46N0N18k8j120j536
54124A43508r77j49M44R44J489J889K026K045J973J578P62j34n50j25J007K189
54108A57919K614J957P04l78r88j377j712j769j321n85n0K4k41n43n93k23M80
54091A53918J065J044M06k79m71k42r8k52l65%P82J486J709J469J043O27L04K30
54073A62376O08J340J842J564P30J87M02Q77R13O11N68Q29Q03L65K18P37J122
54056A76092M02j066j847j146M01J764K698L607M624N348N392M887M412M567N642
54041B15777P498R714J1782J3154J3258J1725Q784N363K593J095P29R67J433J969
$$ plain form
54162 140270 140634 139990 138497 137281 137103 137653 138207 138411 138247 137825 137601 138260 139845 141392 142005 141930 141959 142169
54144 142169 142047 141624 141537 141936 142311 142532 143143 144268 145141 145255 145195 145624 146155 146070 145624 145674 146192 146164 145044 143508
54124 143508 142531 142382 142826 143770 145259 147148 149174 151219 153192 154770 155532 155398 154848 154723 155730 157919
54108 157919 160533 162490 163194 162816 161828 160451 158739 156970 155649 155064 155014 155038 154797 154254 153661 153438 153918
54091 153918 154983 156027 156433 156154 155683 155441 155343 155091 154726 154726 155508 156994 158703 160172 161215 161842 162146 162376
54073 162376 162984 164324 166166 167730 168460 168647 169049 169926 170839 171450 172018 172847 173650 174015 174233 174970 176092
54056 176092 176494 175428 173581 172435 172836 174600 177298 180905 185529 190877 196269 201156 205568 210135 215777
54041 215777 223275 232989 244771 257925 271183 282908 291692 297055 299648 300743 301472 302439 303872 305841
54027C05841K361K276J651R63Q05J227J750K009K103K185K089J538N90m49j424
54012C25515k373l280l998m498m944n480o086o629o976p034o757o229n685n423
53998B50123n505n497m748l166j588j050j643k499k923l002l017k851k380j916
53984B08338j683j277k85Q00J055L87l77p16r91j606k271k391j805q50m4J02n84
53967A95802j561j873j136M7Q35R39N59Pk96O0R13J484J313R12J007J551K011
53950B02574K308K666K829K285J358J190K287L794M543M433M276M694N586O461
53936B51284O911O822O380N856N341M796M403M398M531M170L197K390K492L309
53922C16280M158M849N635O492P162P811Q932J0514J1899J2586J2659J2316J1567
$$ plain form
54027 305841 308202 310478 312129 313092 313897 315124 316874 318883 320986 323171 325260 326798 327388 326939 325515
54012 325515 323142 319862 315864 311366 306422 300942 294856 288227 281251 274217 267460 261231 255546 250123
53998 250123 244618 239121 234373 231207 229619 228569 226926 224427 221504 218502 215485 212634 210254 208338
53984 208338 206655 205378 205093 205893 206948 207335 206958 206242 205251 203645 201374 198983 197178 196328 196284 196386 195802
53967 195802 194241 192368 191232 191279 192114 193053 193612 193619 193323 193383 194296 195780 197093 198005 199012 200563 202574
53950 202574 204882 207548 210377 212662 214020 215210 217497 221291 225834 230267 234543 239237 244823 251284
53936 251284 258195 265017 271397 277253 282594 287390 291793 296191 300722 304892 308089 310479 312971 316280
53922 316280 320438 325287 330922 337414 344576 352387 361319 371833 383732 396318 408977 421293 432860
53909D32860J0539R541Q507P015N127L586K698J627m65l013m590m721m317m294
53895D60100m441l951k620j159n16j060k247k980k454o51J852M248N493M430N75
53880D54619n251j1464j6668j9854k0303j8223j5277j3360j2676j1882j0237q481
53868B90943p354o443n251m350m417m899m770m108l718l593k996k013j727k539
53854B32765l445l408k643k036k003k377k880l108k536j105M77J344J257M48p90
53839B09960k019k513j848n72J79j42r50j202m99N45R94O34K52O38J547K026J682
53822B08712R91L69l54j162j306k62J279K116K007J693J652J612J344J154J334
53807B21179J740K175K722L388L892M098M336M895N617O267P001P908Q402P703
$$ plain form
53909 432860 443399 452940 461447 468462 473589 477175 479873 481500 481035 478022 473432 468711 464394 460100
53895 460100 455659 451708 449088 447929 447413 446353 444106 441126 438672 438021 439873 444121 449614 454044 454619
53880 454619 449368 437904 421236 401382 381079 362856 347579 334219 321543 309661 299424 290943
53868 290943 283589 277146 271895 267545 263128 258229 253459 249351 245633 242040 239044 237031 235304 232765
53854 232765 229320 225912 223269 221233 219230 216853 213973 210865 208329 207224 207701 209045 210302 210750 209960
53839 209960 207941 205428 203580 203008 203187 203045 202095 200893 200394 200939 201933 202567 202819 203457 205004 207030 208712
53822 208712 209703 210072 209718 208556 207250 206988 208267 210383 212390 214083 215735 217347 218691 219845 221179
53807 221179 222919 225094 227816 231204 235096 239194 243530 248425 254042 260309 267310 275218 283620 291323
53793B91323N975M335L647L719L924M070M262M236L527K288J401J477K009J813
53779C38006K69k103m206n324n572n641o065o742p056o610n731n170n282n662
53765B67111n617m888l877l170k906k622j883r80o84j222j859j901j680j930k471
53750B29421k392j560r90j335j887j781j414j748k641k987k374j570j190q65j00
53735B04587Q33J327J244P76jq98j341q96N7O93O75L63J62J28J88M67J168K262
53717B11794L305L681L178K317J808J700J452R49P98J354K009K021J630J637K152
53702B41785K481K173J472Q00M64Q38K110L706M657M707M474M329L878K873J887
53687B82634J547J705J793J563R75m3j186j657j176n99p85j325j275p26n89r95
$$ plain form
53793 291323 297298 301633 305280 308999 312923 316993 321255 325491 329018 331306 332707 334184 336193 338006
53779 338006 338275 336172 331966 326642 321070 315429 309364 302622 295566 288956 283225 278055 272773 267111
53765 267111 261494 256606 252729 249559 246653 244031 242148 241168 240484 239262 237403 235502 233822 231892 229421
53750 229421 227029 225469 224479 223144 221257 219476 218062 216314 213673 210686 208312 206742 205552 204687 204587
53735 204587 205420 206747 207991 208767 208766 207868 206527 205631 205688 206381 207056 207419 207581 207709 207897 208364 209532 211794
53717 211794 215099 218780 221958 224275 226083 227783 229235 230184 230982 232336 234345 236366 237996 239633 241785
53702 241785 244266 246439 247911 248711 249175 250013 252123 255829 260486 265193 269667 273996 277874 280747 282634
53687 282634 284181 285886 287679 289242 290217 290174 288988 287331 286155 285556 284771 283446 282171 281445 280856 279861
53671B79861j107o43l41o03o99mQ52Q76J57l50j72K31K01m90j583k471k521j670
53653B69524n88N3K50L54M69N23O09P42N23l20j274j512r48j63N05J142J565J305
53635B72759N96M84J481K656K698J494J53l12J61J007J659J878J757J541J396
53620B91408J382J644K315L113L446L174K936L337M166M838N298N886O489O505
53606C45937N752M767M079L698L484L450L443L004K018J117J048J802K665K898
53592C89162K155O37q29j236m86K77k6r62j205m27L21K75L4M45J215J446J064
53575C91860P94Q40M81q22k560l845m421m615m569m048l017j990j574j773j926
53560C58815j423l79M96P43O92R17J390J445O95l65q61m88L34J052J486J690J641
$$ plain form
53671 279861 278754 278111 277770 277167 276468 276464 277316 278192 278349 277999 277827 278058 278259 277769 276186 273715 271194 269524
53653 269524 268936 268989 269239 269593 270062 270585 271194 271936 272459 272139 270865 269353 268405 268242 268747 269889 271454 272759
53635 272759 273355 273839 275320 277976 280674 282168 282321 282009 282170 283177 284836 286714 288471 290012 291408
53620 291408 292790 294434 296749 299862 303308 306482 309418 312755 316921 321759 327057 332943 339432 345937
53606 345937 351689 356456 360535 364233 367717 371167 374610 377614 379632 380749 381797 383599 386264 389162
53592 389162 391317 391954 391125 389889 389403 389680 389654 388692 387487 387060 387381 387656 387690 388135 389350 390796 391860
53575 391860 392654 393494 393975 393153 390593 386748 382327 377712 373143 369095 366078 364088 362514 360741 358815
53560 358815 357392 357013 357509 358252 358944 359861 361251 362696 363391 363026 362165 361677 362011 363063 364549 366239 367880
53543C67880J254O98M57R42K053L186L778L850L910M381N180N948O502O935P360
53528D24314P775Q209Q829R752J0851J1846J2562J3016J3300J3516J3798J4247
53516E62015J4813J5413J6127J7102J8258J9363K0459K1906K3783K5541K6566
53505G81346K6810K6622K6218K5768K5631K5914K5998K5217K3887K2858K2177
53494A058446K1141J9794J9220J9812K0450K0133J9468J9509J9992J9921J9279
53483A277165J8786J8424J7702J7137J7784J9222J9642J8423J6956J6266J5335
53472A472842J2913R678P186N525L515P25k116m597p174j0048j2592j4208j5077
53459A446572j5747j6383j6703j6370j5497j4949j5822j8243k1032k3002k4067
$$ plain form
53543 367880 369134 369832 370289 371231 373284 376470 380248 384098 388008 392389 397569 403517 410019 416954 424314
53528 424314 432089 440298 449127 458879 469730 481576 494138 507154 520454 533970 547768 562015
53516 562015 576828 592241 608368 625470 643728 663091 683550 705456 729239 754780 781346
53505 781346 808156 834778 860996 886764 912395 938309 964307 989524 1013411 1036269 1058446
53494 1058446 1079587 1099381 1118601 1138413 1158863 1178996 1198464 1217973 1237965 1257886 1277165
53483 1277165 1295951 1314375 1332077 1349214 1366998 1386220 1405862 1424285 1441241 1457507 1472842
53472 1472842 1485755 1495433 1502619 1508144 1511659 1512384 1510268 1505671 1498497 1488449 1475857 1461649 1446572
53459 1446572 1430825 1414442 1397739 1381369 1365872 1350923 1335101 1316858 1295826 1272824 1248757
53448A248757k4579k4267k2844k1178k0543k0801k0557j9203j7547j6145j4385
53437A026708j1819r260p612o553n329m122l513l119k000k25J167J886K915M934
53423I84058P127Q211Q159Q165R201J1188J3510J5716J7509J8627J9158J9805
53411A140434K1350K3755K6110K7673K8704L0036L1955L3917L5363L6416L7673
53400A473386L9556M2066M4985M8023N0791N2846N4006N4620N5413N6832N8516
53389B031040N9583N9622N9168N9026N9254N9038N7591N4911N1728M8878M6723
53378B646562M4920M2715L9537L5379L0612K5693K1057J7049J3610J0234O474
53367B933842K198k918r713j8639k8747l8182m5735n1328n5154n7152n7618n7539
$$ plain form
53448 1248757 1224178 1199911 1177067 1155889 1135346 1114545 1093988 1074785 1057238 1041093 1026708
53437 1026708 1014889 1005629 998017 991464 986135 982013 978500 975381 973381 973156 974323 976209 979124 984058
53423 984058 991185 999396 1007555 1015720 1024921 1036109 1049619 1065335 1082844 1101471 1120629 1140434
53411 1140434 1161784 1185539 1211649 1239322 1268026 1298062 1330017 1363934 1399297 1435713 1473386
53400 1473386 1512942 1555008 1599993 1648016 1698807 1751653 1805659 1860279 1915692 1972524 2031040
53389 2031040 2090623 2150245 2209413 2268439 2327693 2386731 2444322 2499233 2550961 2599839 2646562
53378 2646562 2691482 2734197 2773734 2809113 2839725 2865418 2886475 2903524 2917134 2927368 2933842
53367 2933842 2936040 2933122 2923409 2904770 2876023 2837841 2792106 2740778 2685624 2628472 2570854 2513315
53355B513315n7797n8386n8772n8538n7416n5122n1717m7972m4916m3058m2235
53344A937386m2113m2592m3717m5229m6226m5550m2876l9263l6123l3747l1429
53333A488521k8941k6908k5519k3777k0763j6946j3630j1567j0768j1185j2729
53322A285788j4812j6561j7425j7209j5883j3858j2115j1293j0896j0012q589
53311A137135p272o226n026l600k354j279R6J721K910L642M981P592J0590J2629
53297A155539J3673J4826J6756J9097K1309K3303K5063K6367K7219K8106K9399
53286A400657L0705L1161L0311K8478K6326K4241K2223K0138J7923J5581J3113
53275A660857J0464P451L814m22m617p787r529j0597j2262j5043j8239k0793k2385
$$ plain form
53355 2513315 2455518 2397132 2338360 2279822 2222406 2167284 2115567 2067595 2022679 1979621 1937386
53344 1937386 1895273 1852681 1808964 1763735 1717509 1671959 1629083 1589820 1553697 1519950 1488521
53333 1488521 1459580 1432672 1407153 1383376 1362613 1345667 1332037 1320470 1309702 1298517 1285788
53322 1285788 1270976 1254415 1236990 1219781 1203898 1190040 1177925 1166632 1155736 1145724 1137135
53311 1137135 1129863 1123637 1118611 1115011 1112657 1111378 1111474 1113195 1116105 1119747 1124728 1132320 1142910 1155539
53297 1155539 1169212 1184038 1200794 1219891 1241200 1264503 1289566 1315933 1343152 1371258 1400657
53286 1400657 1431362 1462523 1492834 1521312 1547638 1571879 1594102 1614240 1632163 1647744 1660857
53275 1660857 1671321 1678772 1682586 1682164 1677547 1669760 1660231 1649634 1637372 1622329 1604090 1583297 1560912
53262A560912k3572k4969k6609k8082k9036k9449k9489k9379k9380k9646k9984
53251A251317k9938k9257k8162k6977k5742k4436k3371k2940k3068k3341k3684
53240I70401k4356k5206k5540k5012k4090k3278k2411k1175j9802j8605j7166
53229G23760j4758j1536q615o928o500o874p663q542r204r628j0123j0921j2003
53216F00465j3297j4712j5922j6484j6352j5876j5247j4302j3042j1903j1230
53205D42098j0808j0223r434q651p890p055o348o186o642p260p570p598p664p813
53191C30956p640o806n518m395l844l766l838l885l897l857l716l436k974k409
53177B70975k061k170k352j853o17L83L73j38j29L68L69m71j351j606j631k032
$$ plain form
53262 1560912 1537340 1512371 1485762 1457680 1428644 1399195 1369706 1340327 1310947 1281301 1251317
53251 1251317 1221379 1192122 1163960 1136983 1111241 1086805 1063434 1040494 1017426 994085 970401
53240 970401 946045 920839 895299 870287 846197 822919 800508 779333 759531 740926 723760
53229 723760 709002 697466 688851 681923 675423 668549 660886 652344 643140 633512 623389 612468 600465
53216 600465 587168 572456 556534 540050 523698 507822 492575 478273 465231 453328 442098
53205 442098 431290 421067 411633 402982 395092 388037 381689 375503 368861 361601 354031 346433 338769 330956
53191 330956 323316 316510 310992 306597 302753 298987 295149 291264 287367 283510 279794 276358 273384 270975
53177 270975 268914 266744 264392 262539 261922 262305 262678 262540 262411 262779 263148 262677 261326 259720 258089 256057
53161B56057k534k421j662r74q75j225j617j846j917j848j513p31L62J088P54
53146B39098m35j416j509j194j240j510j211k11O87Q27N20M59P17P63K70l93n56
53129B33666J8Q83J353J172O49K25M6L2J55L91M73M3q78j702j719p51O27J494
53111B36177J263J48r62j240o47J09L47J9m73r19j398j790j636p69J86L88k08
53094B28595q68j067q94m71L71J382J594N21p84p98M09J131K42j392k124j517
53078B24330n36j97o32j246j337o31M33J059R57P12R79J571J673Q92k93j116j208
53061B25410q07m65n45q10n95L32J272J310M57l35l03L65J002J257J177R15O73
53044B30310P19J099J352R25j42j217j827k095k312k349j877r93k26O9O6O9J67
$$ plain form
53161 256057 253523 251102 249440 248466 247591 246366 244749 242903 240986 239138 237625 236894 237256 238344 239098
53146 239098 238663 237247 235738 234544 233304 231794 230583 230372 231059 231886 232406 232865 233582 234345 234615 234222 233666
53129 233666 233684 234567 235920 237092 237741 237966 238012 238044 238199 238590 239063 239106 238228 236526 234807 234056 234683 236177
53111 236177 237440 237588 236626 235386 234739 234848 235195 235214 234741 233822 232424 230634 228998 228229 228415 228803 228595
53094 228595 227727 226660 225766 225295 225666 227048 228642 229163 228379 227581 227990 229121 229363 227971 225847 224330
53078 224330 223794 223597 222965 221719 220382 219751 220184 221243 222200 222912 223891 225462 227135 228027 227734 226618 225410
53061 225410 224603 224138 223593 222783 222188 222520 223792 225102 225559 225224 224921 225286 226288 227545 228722 229637 230310
53044 230310 231029 232128 233480 234405 234263 233046 231219 229124 226812 224463 222586 221593 221367 221436 221502 221571 221738
53027B21738L75P60J223J363R27J83m21p56q79o79j69J92Kl19m3O23O69j26n74
53008B24089L35J974K871K575J864J385R34K14n37r16r08o89k73L39Q77J034Q60
52991B36028P31Q79J094R32K24o33r43l71O86J462J548J211J025J275J721J924
52975B48793J789J679J941K382K502K136J688J587J833K155K358K328K008J620
52961B76799J624K051K156J167o69k242k767k414j764j132o78o93j417k580l498
52946B63943l624k946j924j099p42p54r21j134j346j319p94M0M97J07p30j125
52930B46129p65k64l03o85o67n9M45K17l72m04L43J054Q80l3p57p30l14j76l19
52911B43220r4P93J654J583O78o2j13j32q68j937k316j800j200j146j353j222
$$ plain form
53027 221738 222113 222873 224096 225459 226386 226569 226148 225392 224513 223834 223665 223857 223859 223540 223497 224120 224789 224663 224089
53008 224089 224424 226398 229269 231844 233708 235093 236027 236241 235704 234788 233880 233191 232918 233257 234134 235168 236028
52991 236028 236759 237638 238732 239664 239888 239255 238312 237941 238627 240089 241637 242848 243873 245148 246869 248793
52975 248793 250582 252261 254202 256584 259086 261222 262910 264497 266330 268485 270843 273171 275179 276799
52961 276799 278423 280474 282630 283797 283128 280886 278119 275705 273941 272809 272131 271438 270021 267441 263943
52946 263943 260319 257373 255449 254350 253608 252854 251933 250799 249453 248134 247340 247380 247877 247984 247254 246129
52930 246129 245364 245100 244797 244112 243445 243386 243831 244048 243676 243272 243615 244669 245549 245516 244759 244029 243715 243539 243220
52911 243220 243126 243919 245573 247156 247834 247772 247659 247527 246659 244722 242406 240606 239406 238260 236907 235685
52895B35685o14J78P25O14k20j094j065p7Q11O80j87q50q92o47n18n66o08m24
52877B30931P6P20J239J601J931K050J633R15O58J109J622J746J936K610L119
52862B53896K580J354O85R46J202O00n81j517j826j663j324j076j119j423j758
52847B48976j938j945j898k007k447l022l221k866k406k259k140j601r21q28j422
52832B18055k028k060j481n20N05J151J231J228J656K122J763N97l93o91q59j325
52816B18951j517p94K92N52l19j385j571o85O96J969K988L852M352L903K214j27
52800B33371k117l240l607l442k943k519k436k257j332Q4Q91N84r5k28J53M02
52784B11269J88k80o24n76j73J10j33n65m03N29J570K124K178J822J074L52K20
$$ plain form
52895 235685 235071 235249 235974 236588 236368 235274 234209 234132 234943 235623 235436 234586 233694 233047 232529 231963 231355 230931
52877 230931 231007 231727 232966 234567 236498 238548 240181 241096 241754 242863 244485 246231 248167 250777 253896
52862 253896 256476 257830 258515 259461 260663 261263 260682 259165 257339 255676 254352 253276 252157 250734 248976
52847 248976 247038 245093 243195 241188 238741 235719 232498 229632 227226 224967 222827 221226 220305 219477 218055
52832 218055 216027 213967 212486 211966 212471 213622 214853 216081 217737 219859 221622 222219 221826 221135 220276 218951
52816 218951 217434 216640 216932 217484 217165 215780 214209 213524 214220 216189 219177 223029 227381 231284 233498 233371
52800 233371 231254 228014 224407 220965 218022 215503 213067 210810 209478 209562 210453 211037 210942 210714 210867 211269
52784 211269 211457 211177 210553 209977 209804 209914 209781 209216 208813 209342 210912 213036 215214 217036 218110 218462 218682
52767B18682M36J17p32j006l30R1p11j839j893j045m57l28J0N00L81l29p38n71
52749B10238m23m30N1J073J676J335P99Q81J319J486J489J823K440K830K716K179
52733B31482J349M46j55k39P0O32J440K296K714K471J858J167L11o69j250j069
52717B42854n58m54q54j216j163q54n68l40j28j4j55n05p95p27l75j90m85r99
52699B32474j235j139j074j137j002m68K67J026J795K330K131J214L85L29Q25
52684B36721J238J347J253Q95L48K02Q63J661J441J03j205j570j296j177j417
52669B39407j666j714j651j563j448j285r77m25J95M49J85j69p7N38J409K342
52653B33550L178L606L462L127L123L311K906J484m73k086k920l031k600j847
$$ plain form
52767 218682 219118 219235 218503 217497 217167 217258 216547 214708 212815 211770 211313 210985 210995 211495 211876 211547 210809 210238
52749 210238 209815 209385 209436 210509 212185 213520 214319 215200 216519 218005 219494 221317 223757 226587 229303 231482
52733 231482 232831 233277 233122 232883 232953 233585 235025 237321 240035 242506 244364 245531 245842 245173 243923 242854
52717 242854 242296 241842 240988 239772 238609 237755 237187 236847 236719 236705 236550 236045 235250 234523 234148 233958 233473 232474
52699 232474 231239 230100 229026 227889 226887 226419 226686 227712 229507 231837 233968 235182 235567 235896 236721
52684 236721 237959 239306 240559 241454 241802 242004 242867 244528 245969 246072 244867 243297 242001 240824 239407
52669 239407 237741 236027 234376 232813 231365 230080 229103 228678 228873 229322 229507 229338 229261 229799 231208 233550
52653 233550 236728 240334 243796 246923 250046 253357 256263 257747 257274 255188 252268 249237 246637 244790
52639B44790j123p36o57n92l35O8M07M04o9o88q26k01O91J190J321J600K028J924
52621B49196R43k78q77q33p90j019j120p36j31J69J2k77k92K2L18K14k20m13O3
52602B43951Q71J202P16l3l16o7K20L16N19J020J357R52N2l44L15J375J760J311
52584B55177Q07P91R67Q64N71M52N42O67Q31J065J091O46ql86n19q13j252j347
52566B60146j023q73j231j582j351q88r19j422j670j412j196j327j254m78M47
52551B43967M65n65j643j803r82K93J498K044J385k71j692j755p13K85P18R91
52535B42222J220P39o97k081k301j618j124j021m31J103K732L320K715J647P99
52520B47224M19N26R58J284J074L80k05q6P99J984K927L433L638L687L563L253
$$ plain form
52639 244790 243667 242931 242274 241682 241347 241415 241822 242226 242157 241469 240643 240442 241133 242323 243644 245244 247272 249196
52621 249196 250139 249861 248984 248151 247361 246342 245222 244486 244355 244524 244536 244259 243967 243989 244307 244521 244301 243888 243951
52602 243951 244822 246024 246740 246707 246391 246324 246544 246860 247379 248399 249756 250708 250760 250416 250731 252106 253866 255177
52584 255177 255984 256775 257742 258606 259177 259629 260171 260838 261669 262734 263825 264471 264463 264077 263558 262745 261493 260146
52566 260146 259123 258250 257019 255437 254086 253198 252279 250857 249187 247775 246579 245252 243998 243520 243967
52551 243967 244432 243867 242224 240421 239439 239732 241230 243274 244659 244388 242696 240941 240228 240513 241231 242222
52535 242222 243442 244181 243484 241403 239102 237484 236360 235339 234908 236011 238743 242063 244778 246425 247224
52520 247224 247643 248169 249127 250411 251485 251865 251660 251574 252373 254357 257284 260717 264355 268042 271605 274858
52504B74858K809K150R85q03k773m232m842m713m010k906j870j543k048k664k456
52489B45942j201M00J351J182L04m38o19n78p44q33r6J589L297L939L266J912
52473B58673P01J41K54N92O34M09N79J627L084L952L837L286K986K961K753K116
52457B88585J157j06j864l910n249m852k953j148q39j837k859l182l212l423l428
52442B50880k588j161k09l68j069j247n92J91L54lk22o3qm21q85o69K95J323J706
52423B45244J255K82n74n63N53J996K509J663L60j43M69J390J618R51J90L75J709
52406B59284L349M442N172O358Q232J0076J1081J0859R182N903J547k631n570
52393C27284p085p460o980o090n426n137m630l500k211j381q30pJ031J738J895
$$ plain form
52504 274858 277667 279817 280802 279999 277226 272994 268152 263439 259429 256523 254653 253110 251062 248398 245942
52489 245942 244741 245141 246492 247674 247978 247540 246921 246343 245599 244766 244670 246259 249556 253495 256761 258673
52473 258673 259374 259515 259769 260361 260995 261404 261983 263610 266694 270646 274483 277769 280755 283716 286469 288585
52457 288585 289742 289636 287772 283862 278613 273761 270808 269660 268821 266984 264125 260943 257731 254308 250880
52442 250880 248292 247131 246922 246554 245485 244238 243646 243837 244191 244188 243966 243903 243895 243474 242589 241920 242215 243538 245244
52423 245244 246499 246781 246207 245644 246197 248193 250702 252365 252725 252582 253051 254441 256059 257010 257200 257575 259284
52406 259284 262633 267075 272247 278605 286837 296913 307994 318853 328035 333938 335485 332854 327284
52393 327284 320199 312739 305759 299669 294243 289106 284476 280976 278765 277384 276554 276547 277578 279316 281211
52378B81211J680J145M15J51J002K588L807M238M477M977N383N355N198N210M986
52363C31823L998K487J124O6j031k163k760k494j794j298j033n34L71J261J700
52348C29723J806J974K234K276K064K003K331K768K974L056L280L574L751L993
52334C67807M678N776O821P463P743P933Q398R540J1443J3564J5166J6086J6772
52321D99190J7651J8691J9568J9856J9242J7900J6673J6430J7270J8629J9965
52310G01065K0894K0988K0242J9622K0241K1782K2623K1894K0503J9745J9687
52299I29286J9650J9475J9350J8835J7133J4265J1115Q168M988J191k713n725
52287A055018p349p905q087q373q746q918q784q618q590q380p494n913m104k411
$$ plain form
52378 281211 282891 284036 284451 284602 285604 288192 291999 296237 300714 305691 311074 316429 321627 326837 331823
52363 331823 335821 338308 339432 339498 338467 336304 333544 331050 329256 327958 326925 326391 326762 328023 329723
52348 329723 331529 333503 335737 338013 340077 342080 344411 347179 350153 353209 356489 360063 363814 367807
52334 367807 372485 378261 385082 392545 400288 408221 416619 426159 437602 451166 466332 482418 499190
52321 499190 516841 535532 555100 574956 594198 612098 628771 645201 662471 681100 701065
52310 701065 721959 742947 763189 782811 803052 824834 847457 869351 889854 909599 929286
52299 929286 948936 968411 987761 1006596 1023729 1037994 1049109 1057277 1062265 1063456 1060743 1055018
52287 1055018 1047669 1039764 1031677 1023304 1014558 1005640 996856 988238 979648 971268 963774 957861 953757 951346
52273I51346q10P60K162L299M372N701P398R234J0880J2217J3436J4685J5662
52260A050342J5849J5323J4896J5237J5998J6362J6187J6159J6764J7682J8212
52249A229011J7919J6683J4455J1295P525L665K74k260l920n142o431p873r151
52236A266050r996j0426j0594j0732j1195j2142j3124j3343j2551j1370j0545
52225A140032j0166r846r382q891q473q030p454o727n816m612l015j136N86J592
52211A058662J763J752K389L734N002N603N812O188O722O999O874O523N999N264
52197A129286M647M758N754P034P794P705P045O408O335O894P547P550O601M936
52183A220294K862N32j810l848n597p441r474j1089j1599j1104j0361r874r449
$$ plain form
52273 951346 950536 951296 953458 956757 961129 966830 974228 983462 994342 1006559 1019995 1034680 1050342
52260 1050342 1066191 1081514 1096410 1111647 1127645 1144007 1160194 1176353 1193117 1210799 1229011
52249 1229011 1246930 1263613 1278068 1289363 1296888 1300553 1300827 1298567 1294647 1289505 1283074 1275201 1266050
52236 1266050 1256054 1245628 1235034 1224302 1213107 1200965 1187841 1174498 1161947 1150577 1140032
52225 1140032 1129866 1120020 1110638 1101747 1093274 1085244 1077790 1071063 1065247 1060635 1057620 1056484 1057070 1058662
52211 1058662 1060425 1062177 1064566 1068300 1073302 1078905 1084717 1090905 1097627 1104626 1111500 1118023 1124022 1129286
52197 1129286 1133933 1138691 1144445 1151479 1159273 1166978 1174023 1180431 1186766 1193660 1201207 1208757 1215358 1220294
52183 1220294 1223156 1223688 1221878 1218030 1212433 1204992 1195518 1184429 1172830 1161726 1151365 1141491 1132042
52170A132042q715p777p049o621n984m588k508m09J186K279K983L142K799K615
52156A103395L122L609K660R5k394l158k484j834j697j283j88Q08R47O30P20J272
52140A104220J578J209M62j37l77m22n76q99r60j71J520L497N210O774Q642J0937
52124A140507J3507J6267J9138K1749K3785K5478K7308K9166L0316L0321K9586
52113A407128K8778K8070K7215K6043K4582K2765K0422J7610J4828J2756J1809
52102A642006J1853J2312J2589J2456J2053J1472J0372Q209M927J334j529l557
52090A734497n944r879j4973j9407k1805k2423k2288k1766k0625j9012j7522j6243
52078A522610j4581j2198r597p420n724m154k437m44J887M367O697Q958J1534
$$ plain form
52170 1132042 1123327 1115550 1108501 1101880 1095896 1091308 1088800 1088391 1089577 1091856 1094839 1097981 1100780 1103395
52156 1103395 1106517 1110126 1112786 1112881 1110487 1107329 1104845 1103011 1101314 1100031 1099843 1100651 1101598 1102228 1102948 1104220
52140 1104220 1105798 1107007 1107469 1107332 1106955 1106533 1105957 1105058 1104098 1103927 1105447 1108944 1114154 1120928 1129570 1140507
52124 1140507 1154014 1170281 1189419 1211168 1234953 1260431 1287739 1316905 1347221 1377542 1407128
52113 1407128 1435906 1463976 1491191 1517234 1541816 1564581 1585003 1602613 1617441 1630197 1642006
52102 1642006 1653859 1666171 1678760 1691216 1703269 1714741 1725113 1733322 1738249 1739583 1738054 1734497
52090 1734497 1728553 1718674 1703701 1684294 1662489 1640066 1617778 1596012 1575387 1556375 1538853 1522610
52078 1522610 1508029 1495831 1486234 1478814 1473090 1468936 1466499 1466055 1467942 1472309 1479006 1487964 1499498
52065A499498J4290J6382J7313J7691J8291J8817J8409J7107J5957J5630J5723
52054A685108J5622J5262J4731J3734J1939R493O709L538j86m184p869j0986j3736
52041A739175j6276j8434j9952k0853k1406k1839k2184k2297k2087k1648k1086
52030A511113k0237j8777j6814j5130j4506j4803j5009j4273j2813j1689j1697
52019A345365j2562j3177j2723j1485j0500j0367j0624j0427r529q372p512p369
52007A220718q365j0698j3848j6781j8916k0508k1973k3232k4034k4416k4435
51996A013512k3802k2439k1050k0370j9997j8841j6820j5184j4795j5021j4932
51985H10261j4795j5380j6367j6616j5881j5089j4827j4628j4173j4128j5058
$$ plain form
52065 1499498 1513788 1530170 1547483 1565174 1583465 1602282 1620691 1637798 1653755 1669385 1685108
52054 1685108 1700730 1715992 1730723 1744457 1756396 1765889 1772598 1776136 1775950 1771766 1763897 1752911 1739175
52041 1739175 1722899 1704465 1684513 1663660 1642254 1620415 1598231 1575934 1553847 1532199 1511113
52030 1511113 1490876 1472099 1455285 1440155 1425649 1410846 1395837 1381564 1368751 1357062 1345365
52019 1345365 1332803 1319626 1306903 1295418 1284918 1274551 1263927 1253500 1243971 1235599 1228087 1220718
52007 1220718 1212353 1201655 1187807 1171026 1152110 1131602 1109629 1086397 1062363 1037947 1013512
51996 1013512 989710 967271 946221 925851 905854 887013 870193 855009 840214 825193 810261
51985 810261 795466 780086 763719 747103 731222 716133 701306 686678 672505 658377 643319
51974F43319j6253j6440j5309j3527j1644r651p507n263k780j9K449L942M701
51961E56018N669P041P830P256N825M478L218J317j403m202o224p148p087o383
51947E66205n556m950m307l023r05J583L936O106Q248J0284J1937J3031J3598
51934F16187J3745J3567J3083J2191J0732Q565N521J499l211p769j1438j4314
51922F58358j7016j9554k1076k0993j9801j8361j6830j4940j2949j1537j0734
51911D74567r763q122o166m380k712r52O99K037L370N065O795P874Q191Q218Q111
51896D92832P417N859L823J816j40k171l968m908m608l080m85K887O492R577J1369
51881E22712J1144Q462L797j270m972o601o629n658l826j322J043K234J841K56
$$ plain form
51974 643319 627066 610626 595317 581790 570146 560495 552988 547725 544945 544926 547375 551317 556018
51961 556018 561687 568728 576558 583814 589639 594117 597335 598652 597249 593047 586823 579675 572588 566205
51947 566205 560649 555699 551392 548369 547464 549047 552983 559089 567337 577621 589558 602589 616187
51934 616187 629932 643499 656582 668773 679505 688070 693591 695090 691879 684110 672672 658358
51922 658358 641342 621788 600712 579719 559918 541557 524727 509787 496838 485301 474567
51911 474567 464804 456682 450516 446136 443424 442472 443171 445208 448578 453643 460438 468312 476503 484721 492832
51896 492832 500249 506108 509931 511747 511607 509436 505468 500560 495952 492872 492387 495274 501766 511343 522712
51881 522712 533856 542318 546115 544845 539873 533272 526643 520985 517159 515837 516880 519114 520955 521211
51867E21211j775l577m789n525o223p087p750p704o914n760m534l301k156j199
51853D52917k72Q70K046K675K436J612O17m74j811l431n207o854p823p608o428
51838D23265n239m701m453l796k711j664p29M50J831K913L523M002M387M060K640
51823D23778O63r84j992k582k911l000k976k906k551j739q55m58n01l42L68J256
51807D02268J734J587J013L23k30o09j002j493j765j397m68N19J289J985K491
51792D06245K132M16k112m191m980m652l933l299k691j849q20p3n2o29j183j232
51776C77097q14k34K73N39M98M80J251L232N814P812Q671Q878R139R519R607R143
51760D50905Q112O388L723K63l212n791p215q012q784r458r390q227o501n190
$$ plain form
51867 521211 519436 515859 511070 505545 499322 492235 484485 476781 469867 464107 459573 456272 454116 452917
51853 452917 452645 453515 455561 458236 460672 462284 462901 462427 460616 457185 451978 445124 437301 429693 423265
51838 423265 418026 413325 408872 405076 402365 400701 399972 400422 402253 405166 408689 412691 417078 421138 423778
51823 423778 424441 423457 421465 418883 415972 412972 409996 407090 404539 402800 401945 401487 400986 400644 401012 402268
51807 402268 404002 405589 406602 406925 406695 406086 405084 403591 401826 400429 399961 400480 401769 403754 406245
51792 406245 408377 408793 406681 402490 397510 392858 388925 385626 382935 381086 380266 380193 380141 379512 378329 377097
51776 377097 376283 376049 376322 376861 377359 377839 379090 382322 388136 395948 404619 413497 422636 432155 441762 450905
51760 450905 459017 465405 469128 469391 466179 460388 453173 445161 436377 426919 417529 409302 402801 397611
51746C97611m697m526m043l297k766k474j789j99K027M171N852P202Q488R846
51732D11406J1280J2512J2810J1427Q426M863J968M20M56K162N154Q137R417Q018
51718E08456M217q37n697r071j0241r328p062m373k281j789l198n525p177p382
51704D38712o529n140l175o75J644K922K931J869j31k662m666n203m456l259j795
51689D10387L79K872M116L009K59k516m534o009p013p131o268n035l953k840j350
51674C74373L52J849L035L951M307L786K833K521L525N681Q645J2292J5997J8207
51660D61354J7544J4084Q930K781m177j0995j5664j6806j5042j2132r130n935
51648D14812k284J475M575O271O086M053P99k850o312r152j0808j0893r686p999
$$ plain form
51746 397611 392914 388388 384345 381048 378282 375808 374019 373820 375847 380018 385870 393072 401560 411406
51732 411406 422686 435198 448008 459435 467861 472724 474692 475112 475568 477730 482884 491021 500438 508456
51718 508456 512673 511836 506139 497068 486827 477499 470437 466064 463783 461994 458796 453271 446094 438712
51704 438712 432183 427043 423868 423193 424837 427759 430690 432559 432428 429766 425100 419897 415441 412182 410387
51689 410387 410766 413638 417754 420763 421022 418506 413972 407963 400950 393819 387551 382516 378563 375723 374373
51674 374373 374725 376574 379609 383560 387867 391653 394486 397007 400532 406213 414858 427150 443147 461354
51660 461354 478898 492982 501912 504693 500516 489521 473857 457051 442009 429877 420747 414812
51648 414812 412528 414003 418578 424849 430935 434988 435787 432937 426625 417473 406665 395772 386086 378087
51634C78087o467n257m281l365k345j391j105j696k237j450O32K548L218L118
51620C58009L250L616L489K698J792J062K63o78j402j738k008k413k689k669k723
51605C57859l138l436k886j527j29Q07J447K045K519K896L619N046O932Q838J0768
51590C91660J2855J4535J4544J1956P077J360l344n716n761m762m010l516k373
51577D24505k37K226M548P184J0484J3613J5291J5269J4440J3765J3781J4819
51565E49688J6742J8408J8334J6256J3599J2265J3353J6960K2400K8366L3485
51554G59856L7161L9364L9437L5825K7696J6323M288o503j5629k3408l0088l5639
51542H48683l9747m1927m2026m0614l8513l5981l2718k8656k4277k0172j6573
$$ plain form
51634 378087 371620 366363 362082 358717 356372 354981 353876 352180 349943 348493 349125 351673 354891 358009
51620 358009 361259 364875 368364 371062 372854 373916 374179 373501 372099 370361 368353 365940 363251 360582 357859
51605 357859 354721 351285 348399 346872 346743 347550 348997 351042 353561 356457 360076 365122 372054 380892 391660
51590 391660 404515 419050 433594 445550 452627 453987 450643 444927 439166 434404 430394 426878 424505
51577 424505 424268 426494 431042 438226 448710 462323 477614 492883 507323 521088 534869 549688
51565 549688 566430 584838 603172 619428 633027 645292 658645 675605 698005 726371 759856
51554 759856 797017 836381 875818 911643 939339 955662 959950 953447 937818 914410 884322 848683
51542 848683 808936 767009 724983 684369 645856 609875 577157 548501 524224 504052 487479
51531D87479j3500j1025r211p964p052o219n277m194l188k557k442k694k989k996
51517D06171k601k052j757j850k034j995j843j931k352k795k860k428j764j361
51503C76548j524k049k336k028j299n52OL18L88L81N42Q11Q48P09J064K307L814
51486C77948M627M615M420M417M353L932L064J643l05k169l182l417l687m332
51472C91927m829m866n027n880o967p297o498m986l429k480k586l478m095l676
51458C25833k653j950j660j157l44Q5k26o56l93O02J792K815L687M483N182N881
51442C41321O989R076J2341J6034J8550J8491J5687J1122O064J591j334k133j271
51429D52528j59l4j152l169n785q569j0641j1158j0168q533p010n771m766m074
$$ plain form
51531 487479 473979 462954 453743 445779 438727 432508 427231 423037 419849 417292 414850 412156 409167 406171
51517 406171 403570 401518 399761 397911 395877 393882 392039 390108 387756 384961 382101 379673 377909 376548
51503 376548 375024 372975 370639 368611 367312 366760 366766 367084 367472 367853 368395 369206 370054 370763 371827 374134 377948
51486 377948 382575 387190 391610 396027 400380 404312 407376 409019 408714 406545 403363 399946 396259 391927
51472 391927 387098 382232 377205 371325 364358 357061 350563 345577 342148 339668 337082 333604 329509 325833
51458 325833 323180 321230 319570 318413 318069 318154 317928 317272 316879 317481 319273 322088 325775 330258 335440 341321
51442 341321 348310 357386 369727 385761 404311 422802 438489 449611 455675 457266 455932 453799 452528
51429 452528 452369 452335 451183 448014 442229 433660 423019 411861 401693 393160 386150 380379 375613 371539
51415C71539l724l502l209k889k605k162j283m7J107J807K042J998J790J469J153
51400C63484J047J313J979K860L524L547L011K598K912L773M520N054O016P753
51386D13391R600J0756J1620J3538J7262K2116K6886L1047L4896L8848M2940M6919
51374G19819N0508N3511N5448N5150N1018M2328L0225J6981M168q051j9816l0596
51362A020693l9620m6603n1475n3880n3712n1807m9356m6651m3122l8541l3577
51351E12349k8991k4910k1102j7453j3983j0733p920n908m822m435m476m731m799
51338C58086m226l120k188j907j942j713j142n54j31R4jm31q25p90m81l95o10
51321C37724o82l33J37K26j72q09j414j875k195k399k464k206j345J34J678K388
$$ plain form
51415 371539 367815 364313 361104 358215 355610 353448 352165 352118 353225 355032 357074 359072 360862 362331 363484
51400 363484 364531 365844 367823 370683 374207 377754 380765 383363 386275 390048 394568 399622 405638 413391
51386 413391 422991 433747 445367 458905 476167 498283 525169 556216 591112 629960 672900 719819
51374 719819 770327 823838 879286 934436 985454 1027782 1058007 1074988 1079156 1071105 1051289 1020693
51362 1020693 981073 934470 882995 829115 775403 723596 674240 627589 584467 545926 512349
51351 512349 483358 458448 437346 419893 405910 395177 387257 381349 376527 372092 367616 362885 358086
51338 358086 353860 350740 348552 346645 344703 342990 341848 341294 341163 341257 341256 340825 340000 339210 338729 338334 337724
51321 337724 337042 336709 336846 337072 336900 336091 334677 332802 330607 328208 325744 323538 322193 322327 324005 326393
51305C26393J819N63k11J9N68M89j85o10m35k94p87j614k127k202k056j623p66
51288C16941K40J048J928L344M942N726N389M684M347M317M380M733N288N078
51274C72385L240L93j851k720k940l458m199m428l816k687j434j65J083K170K916
51259C54489L174K794J719J56j453k735l593m070m125l659k795j972j616j685
51245C34629j642j026q2L93l2q13r93l16N60R21P19L11m5j50J68O64O35j77r70
51226C32754q64k09k3k58J90J555K525K107J097P53R34P02J52K14Q92J140N83
51209C44244J14L93R51J196J400J952K507K582K430K526K725K611K310K240K274
51194C72455J899J031N1q55j762k420k341j556p79n66p16o52j19O61J245J237
$$ plain form
51305 326393 328212 328775 328564 328583 329151 329640 329455 328845 328410 328116 327329 325715 323588 321386 319330 317707 316941
51288 316941 317181 318229 320157 323501 328443 334169 339558 344242 348589 352906 357286 362019 367307 372385
51274 372385 375625 376018 374167 371447 368507 365049 360850 356422 352606 349919 348485 348320 349403 351573 354489
51259 354489 357663 360457 362176 362332 360879 358144 354551 350481 346356 342697 339902 337930 336314 334629
51245 334629 332987 331961 331879 332272 332240 331427 330434 330118 330678 331599 332318 332629 332584 332434 332602 333266 333901 333724 332754
51226 332754 331890 331681 331658 331400 331590 333145 335670 337777 338874 339627 340561 341263 341415 341629 342521 343661 344244
51209 344244 344358 344751 345702 346898 348298 350250 352757 355339 357769 360295 363020 365631 367941 370181 372455
51194 372455 374354 375385 375436 374581 372819 370399 368058 366502 365723 365157 364441 363789 363670 364331 365576 366813
51178C66813N58m26j172j456j480j493j500j465j528j820k228k496k538k417k079
51163C43273j296l9J292K228K810L518M500N202N018M090L129K486J841Q59k81
51148C78630j074j222p95j88O6l29j123j783k118k351k608k742k693k589k353
51133C54728j713p00K51R47J624K263K333J707J231J791L088L969L758K711J436
51118C79424L79j78k35j52k49l79k26J74N31P30P79O09L75O02J537K605L115L211
51100C92652L443L681L312K399J750J711J731J397J059J131J412J536J538J620
51086D20372J746J826J880J799J329N02l06r19j513k048k137j737j440j649j967
51071D15738j798j155m03M21J492K620L323L420L204L081L312M053N468P715J0739
$$ plain form
51178 366813 367371 366945 365773 364317 362837 361344 359844 358379 356851 355031 352803 350307 347769 345352 343273
51163 343273 341977 341938 343230 345458 348268 351786 356286 361488 366506 370596 373725 376211 378052 378911 378630
51148 378630 377556 376334 375539 375351 375417 375088 373965 372182 370064 367713 365105 362363 359670 357081 354728
51133 354728 353015 352315 352566 353513 355137 357400 359733 361440 362671 364462 367550 371519 375277 377988 379424
51118 379424 379803 379625 379390 379238 378989 378610 378384 378558 379089 379819 380598 381207 381582 382184 383721 386326 389441 392652
51100 392652 396095 399776 403088 405487 407237 408948 410679 412076 413135 414266 415678 417214 418752 420372
51086 420372 422118 423944 425824 427623 428952 429454 429148 428229 426716 424668 422531 420794 419354 417705 415738
51071 415738 413940 412785 412382 412803 414295 416915 420238 423658 426862 429943 433255 437308 442776 450491 461230
51056D61230J3775J5271J3891R939N368K170J145K220N135R243J3190J5606J6095
51043E84278J5246J3856J2373J0707Q180M144q50m891o280n128l033j594j766
51030F25242m098q496j3732j7979k0110k0115j8432j5483j1867q317n245k664
51018D78704o03Q63J833K489K822K931L336M355N357N508N142N400O415O972O423
51003E37947N846O457P782Q404Q004P616P997Q829R524J0070J0792J1823J3061
50990F54152J4252J4983J4935J4279J3505J2869J2303J1806J1530J1473J1539
50979G97626J1959J3123J4852J6278J6744J6345J5335J3665J1717J1018J3259
50968I51921J8498K5010L1063L6309M1378M6788N2594N8574O4211O8840P2284
$$ plain form
51056 461230 475005 490276 504167 514106 519474 521644 522789 525009 530144 539387 552577 568183 584278
51043 584278 599524 613380 625753 636460 644640 648784 647934 643043 636763 631635 628602 627008 625242
51030 625242 621144 612648 598916 580937 560827 540712 522280 506797 494930 486613 481368 478704
51018 478704 478101 478964 480797 483286 486108 489039 492375 496730 502087 507595 512737 518137 524552 531524 537947
51003 537947 543793 550250 558032 566436 574440 582056 590053 598882 608406 618476 629268 641091 654152
50990 654152 668404 683387 698322 712601 726106 738975 751278 763084 774614 786087 797626
50979 797626 809585 822708 837560 853838 870582 886927 902262 915927 927644 938662 951921
50968 951921 970419 995429 1026492 1062801 1104179 1150967 1203561 1262135 1326346 1395186 1467470
50957A467470P5139P7923Q0115Q0533P8477P4084O7755N9963N1554M3521L6112
50946B192646K8765K1193J4025Q112L665O24o73N6K019L418K723k28m304p987
50932B264054j0344j1599j2822j4950j8128k2083k6753l2133l7833m3325m8620
50921A985464n4159n9954o5271o9257p1488p1905p0632o8050o4672o0752n6247
50910A273077n1281m6331m1832l7824l4131l0572k7007k3495k0457j8350j7027
50899I24770j5880j4711j3888j3431j2573j0710q333o392n116m067l092k446k043
50886H12088j459p23l82n21l31R04K796M321M976N094N267N893P120Q759J0262
50871H64064J1170J1601J2082J2903J3973J5221J6716J8304J9626K0730K2292
$$ plain form
50957 1467470 1542609 1620532 1700647 1781180 1859657 1933741 2001496 2061459 2113013 2156534 2192646
50946 2192646 2221411 2242604 2256629 2264741 2268406 2269030 2268357 2268413 2270432 2273850 2276573 2276345 2272041 2264054
50932 2264054 2253710 2242111 2229289 2214339 2196211 2174128 2147375 2115242 2077409 2034084 1985464
50921 1985464 1931305 1871351 1806080 1736823 1665335 1593430 1522798 1454748 1390076 1329324 1273077
50910 1273077 1221796 1175465 1133633 1095809 1061678 1031106 1004099 980604 960147 941797 924770
50899 924770 908890 894179 880291 866860 854287 843577 835244 828852 823736 819669 816577 814131 812088
50886 812088 810629 809906 809524 809003 808672 809576 812372 816693 821669 826763 832030 837923 845043 853802 864064
50871 864064 875234 886835 898917 911820 925793 941014 957730 976034 995660 1016390 1038682
50860A038682K4806K7901L0947L4124L8223M3385M8766N3885N9686O7546P7539
50849A545490Q8404R9164J09952J21040J31894J41842J51059J60161J68939J76308
50839B894253J81454J84167J83873J79183J68978J53550J34056J11405Q6379O0539
50829D337837L5960J3818o043k3842l8726m9305n4780n5068n0198m0445k7062
50818D042146j2359J232J1969J8750K0694J7051P509p353k5899m6006o6254q6484
50806C874996j06899j26739j44355j58478j68803j75142j76758j73162j65154
50797B479506j54373j41957j28232j13609r9103q5622p3265o1716n0989m1409
50787A529231l2965k5202j7858j1304o167k663n15O36R65N61m70k045m014n969
$$ plain form
50860 1038682 1063488 1091389 1122336 1156460 1194683 1238068 1286834 1340719 1400405 1467951 1545490
50849 1545490 1633894 1733058 1843010 1964050 2095944 2237786 2388845 2549006 2717945 2894253
50839 2894253 3075707 3259874 3443747 3622930 3791908 3945458 4079514 4190919 4277298 4337837
50829 4337837 4373797 4387615 4381572 4357730 4319004 4269699 4214919 4159851 4109653 4069208 4042146
50818 4042146 4029787 4031019 4042988 4061738 4082432 4099483 4106992 4099639 4073740 4027734 3961480 3874996
50806 3874996 3768097 3641358 3497003 3338525 3169722 2994580 2817822 2644660 2479506
50797 2479506 2325133 2183176 2054944 1941335 1842232 1756610 1683345 1621629 1570640 1529231
50787 1529231 1496266 1471064 1453206 1441902 1435735 1433072 1432557 1433193 1434158 1434719 1434249 1432204 1428190 1422221
50773A422221p420q322r213j0614j2532j4693j6943j9099k0741k1704k2542k3895
50761A234503k5430k6130k5646k4654k3703k2475k0541j8182j5784j3113r864
50750A008981o503l766j592O96L294N849Q352J1250J4562J7720K0582K3862K8128
50737A131415L3009L7909M2923M8497N4485O0279O5734P1380P7637Q4174R0077
50726A797519R4398R6582R6785R5851R4697R3529R1752Q8634Q3765P6713O6610
50715B776835N2561L4615J4220o351k4995m0280n1327n7653n9265n6703n0770
50704B530887m2173l1557j9841q324J801J0013J6371K0678K1858J8440R802l193
50692B524762j8849l5654n2480o8125q1291r1089r7286r9923r9045r4884q8014
$$ plain form
50773 1422221 1414801 1406479 1397266 1386652 1374120 1359427 1342484 1323385 1302644 1280940 1258398 1234503
50761 1234503 1209073 1182943 1157297 1132643 1108940 1086465 1065924 1047742 1031958 1018845 1008981
50750 1008981 1002478 998712 997120 997816 1001110 1006959 1015311 1026561 1041123 1058843 1079425 1103287 1131415
50737 1131415 1164424 1202333 1245256 1293753 1348238 1408517 1474251 1545631 1623268 1707442 1797519
50726 1797519 1891917 1988499 2085284 2181135 2275832 2369361 2461113 2549747 2633512 2710225 2776835
50715 2776835 2829396 2864011 2878231 2871880 2846885 2806605 2755278 2697625 2638360 2581657 2530887
50704 2530887 2488714 2457157 2437316 2428992 2430793 2440806 2457177 2477855 2499713 2518153 2527955 2524762
50692 2524762 2505913 2470259 2417779 2349654 2268363 2177274 2079988 1980065 1881020 1786136 1698122
50681A698122p9220o9404n9543n0194m1017l1311k1238j1943m115K944J0273J7806
50669A361160K4684L0522L5516L9430M1398M0886L8209L4058K9072K4030J9753
50658A718718J6495J3834J1435R580Q738Q877R371R376Q341O472M755M167M859
50645A835018O400Q612J1657J5361J9225K3231K7913L3463L9347M5002N0161N4218
50633B169608N6154N5669N3661N1003M7499M2898L8338L5732L5757L7139L7510
50622B660968L4063K3839N251j9577m4716o3685p3235p4129o9033o0296m9367
50611B270083l7400k5618j5038o042J540P835J2444J4642J3942J0289L873n032
50599B245518j5968k8180m0645n2234o1995o9457p4607p7493p7984p6177p2784
$$ plain form
50681 1698122 1618902 1549498 1489955 1439761 1398744 1367433 1346195 1334252 1330137 1333081 1343354 1361160
50669 1361160 1385844 1416366 1451882 1491312 1532710 1573596 1611805 1645863 1674935 1698965 1718718
50658 1718718 1735213 1749047 1760482 1770062 1778800 1787677 1797048 1806424 1814765 1821237 1825992 1830159 1835018
50645 1835018 1841418 1850030 1861687 1877048 1896273 1919504 1947417 1980880 2020227 2065229 2115390 2169608
50633 2169608 2225762 2281431 2335092 2386095 2433594 2476492 2514830 2550562 2586319 2623458 2660968
50622 2660968 2695031 2718870 2724121 2704544 2659828 2596143 2522908 2448779 2379746 2319450 2270083
50611 2270083 2232683 2207065 2192027 2185985 2187525 2195360 2207804 2222446 2236388 2246677 2250550 2245518
50599 2245518 2229550 2201370 2160725 2108491 2046496 1977039 1902432 1824939 1746955 1670778 1597994
50588A597994o8728o4410n9665n4518m9440m4776m0214l5208k9731k4343j9577
50577A107384j5576j2222r398p010m986l385k330j708j011K47K007L663M683N124
50563A065482N527O417P997J0156J2651J5302J8112K1133K4290K7476L0855L4706
50551A280104L8840M2417M4624M5263M4454M2107L8212L3458K9008K5612K3434
50540A687533K2624K3494K5998K9592L3802L8525M3656M8887N4121N9559O5196
50529B132987P0679P5978Q1730Q8512R6172J04240J12543J20911J28530J34211
50519C146493J37270J37743J35827J31452J24302J13928R9888Q2165O1421L8727
50509D209216J5042q893l2458n5138p6536r6050j12707j25418j33304j35787j32711
$$ plain form
50588 1597994 1529266 1464856 1405191 1350673 1301233 1256457 1216243 1181035 1151304 1126961 1107384
50577 1107384 1091808 1079586 1070188 1063178 1058192 1054807 1052477 1050769 1049758 1050005 1052012 1055675 1060358 1065482
50563 1065482 1071009 1077426 1085423 1095579 1108230 1123532 1141644 1162777 1187067 1214543 1245398 1280104
50551 1280104 1318944 1361361 1405985 1451248 1495702 1537809 1576021 1609479 1638487 1664099 1687533
50540 1687533 1710157 1733651 1759649 1789241 1823043 1861568 1905224 1954111 2008232 2067791 2132987
50529 2132987 2203666 2279644 2361374 2449886 2546058 2650298 2762841 2883752 3012282 3146493
50519 3146493 3283763 3421506 3557333 3688785 3813087 3927015 4026903 4109068 4170489 4209216
50509 4209216 4224258 4215365 4182907 4127769 4051233 3955183 3842476 3717058 3583754 3447967 3315256
50498C315256j24630j12583r7331p9138n8575l7045j5986M029K2937M0094N4145
50487B911173O3636O7200O3397N1253L1339N897k2169n0224p6066r7959j14885
50476B832592j26542j33031j34810j32813j28235j22015j14810j07307j00066
50467A732963r2982q5359p6833o7967n9755n2715m6587m0831l5217l0002k5473
50456A119242k1458j7447j3250r237n779k789j39J886K986L482M035M919O005
50443A072456P332R127J1282J3373J5185J6760J7871J7909J6537J4149J1557R395
50431A232933P783O384M885L622L464M764O739Q320R362J0521J2107J3810J5433
50418A340127J7319J9921K3408K7625L2115L6324M0392M5326N1708N8415O3625
$$ plain form
50498 3315256 3190626 3078043 2980712 2901574 2842999 2805954 2789968 2793997 2816934 2857028 2911173
50487 2911173 2974809 3042009 3105406 3156659 3187998 3193895 3171726 3121502 3045436 2947477 2832592
50476 2832592 2706050 2573019 2438209 2305396 2177161 2055146 1940336 1833029 1732963
50467 1732963 1639981 1554622 1477789 1409822 1350067 1297352 1250765 1209934 1174717 1144715 1119242
50456 1119242 1097784 1080337 1067087 1057850 1052071 1049282 1049143 1051029 1054015 1057497 1061532 1066451 1072456
50443 1072456 1079788 1088915 1100197 1113570 1128755 1145515 1163386 1181295 1197832 1211981 1223538 1232933
50431 1232933 1240716 1247100 1251985 1255607 1259071 1263835 1270574 1278894 1288256 1298777 1310884 1324694 1340127
50418 1340127 1357446 1377367 1400775 1428400 1460515 1496839 1537231 1582557 1634265 1692680 1756305
50407A756305O6928O9506P2092P3915P4005P2422O9686O5764O0419N3882M6540
50396B481464L8356K9176J9170Q398l653j7482l2653m7851o1695p3252q2025q7770
50384B170183r0253q9184q4654p7450o8511n8121m6285l3712k1544j0113R87J1380
50372A602723J9682K5217K8652L0148K8148K1313J0773q86j2353k3986l5879m6825
50360A646727n5303o0370o1766o0067n6829n3542n0433m6980m3472m1001l9870
50349A077094l9039l7464l5063l2128k8654k4764k1017j7771j4744j1713r094
50338H05643p343o195m966l424j940q75j16P75K063L478M395M546M381M515M991
50323H09928N554O382P903R938J1728J3024J4551J7015K0108K2789K4199K3955
$$ plain form
50407 1756305 1823233 1892739 1964831 2038746 2112751 2185173 2254859 2320623 2381042 2434924 2481464
50396 2481464 2519820 2548996 2568166 2576564 2572911 2555429 2522776 2474925 2413230 2339978 2257953 2170183
50384 2170183 2079930 1990746 1906092 1828642 1760131 1702010 1655725 1622013 1600469 1590356 1591343 1602723
50372 1602723 1622405 1647622 1676274 1706422 1734570 1755883 1766656 1765770 1753417 1729431 1693552 1646727
50360 1646727 1591424 1531054 1469288 1409221 1352392 1298850 1248417 1201437 1157965 1116964 1077094
50349 1077094 1038055 1000591 965528 933400 904746 879982 858965 841194 826450 814737 805643
50338 805643 798300 792105 787139 783715 781775 780900 780784 781559 783622 787100 791495 796041 800422 804937 809928
50323 809928 815482 821864 829767 839705 851433 864457 879008 896023 916131 938920 963119 987074
50311I87074K1834J7683J1712M788j653o207q260q218o876m847k725j325j038
50298A001942j239r84k05N39J271K645M694O510P481P923Q173Q053P900R152J3035
50283A076890J9359K7392L6806M6165N0982M5586K8250L922j8926l4066m0344
50272A242016m0108l6160l0294k3681j7459j2530r036o498m646l794m206n363
50260A048241o268o326n658m559l102j363K51J122Q92k14j538k498l040l452l717
50245A008771l355k073l63R62J644K144K970M270O035Q246J0648J2719J4131J5129
50231A081878J6280J7874J9696K1342K2828K4858K8272L2935L7251L9215L8071
50220A380500L4769L0761K6705K2474J8102J4308J2092J1930J3311J4966J5552
$$ plain form
50311 987074 1008908 1026591 1038303 1043091 1041438 1035231 1026971 1018753 1011877 1007030 1004305 1002980 1001942
50298 1001942 1000703 999719 999514 1000053 1001324 1003969 1008663 1015173 1022654 1030577 1038750 1046803 1054703 1063855 1076890
50283 1076890 1096249 1123641 1160447 1206612 1257594 1303180 1331430 1335352 1316426 1282360 1242016
50272 1242016 1201908 1165748 1135454 1111773 1094314 1081784 1072748 1066250 1061604 1057810 1053604 1048241
50260 1048241 1041973 1035647 1029989 1025430 1022328 1020965 1021216 1022338 1023230 1023016 1021478 1018980 1015940 1012488 1008771
50245 1008771 1005416 1003343 1002980 1003942 1005586 1007730 1010700 1014970 1021005 1029251 1039899 1052618 1066749 1081878
50231 1081878 1098158 1116032 1135728 1157070 1179898 1204756 1233028 1265963 1303214 1342429 1380500
50220 1380500 1415269 1446030 1472735 1495209 1513311 1527619 1539711 1551641 1564952 1579918 1595470
50209A595470J4259J0698M462m723j6276k8534l9647m8558n4868n8170n8066n4894
50197A261153m9811m3878l7379l0275k3018j6650j2236j0460j1581j5252k0321
50186I90292k5137k8375k9648k9304k7807k5460k2553j9543j6907j4866j3362
50175G37330j2221j1275j0301r112p798o755o227n938n418m690m329m661n179
50162F43426n014l864k300j166q36r66q71j33J108K531M195O391Q872J0668J1016
50147F73057J0170Q937P653O073M157K330R49m6q01j288j487j434r71K51K240
50132G09790M504O468P848Q516Q455Q023P824Q063Q375Q605R324J1117J3633J5883
50118H36428J7406J8741K0703K3593K7189L1228L5664M0552M5862N1600N8049
$$ plain form
50209 1595470 1609729 1620427 1624889 1620166 1603890 1575356 1535709 1487151 1432283 1374113 1316047 1261153
50197 1261153 1211342 1167464 1130085 1099810 1076792 1060142 1047906 1037446 1025865 1010613 990292
50186 990292 965155 936780 907132 877828 850021 824561 802008 782465 765558 750692 737330
50175 737330 725109 713834 703533 694421 686623 679868 673641 667703 662285 657595 653266 648605 643426
50162 643426 638412 634548 632248 631082 630246 629280 628409 628276 629384 631915 636110 642501 651373 662041 673057
50147 673057 683227 692164 699817 705890 710047 712377 713326 713280 712479 711191 709704 708270 707299 707550 709790
50132 709790 714294 720762 728610 737126 745581 753604 761428 769491 777866 786471 795795 806912 820545 836428
50118 836428 853834 872575 893278 916871 944060 975288 1010952 1051504 1097366 1148966 1207015
50107A207015O5526P3543Q0428Q4306Q4488Q1491P6005O8725O1293N6191N4808
50096A993819N6076N7634N7824N5876N0926M2034K9138J3134m898k3799m1803
50085B285961n7006o8616p7046q2633q5052q4213q0918p6249p0813o4927n8834
50074A479654n2368m5026l6919k9228k3243j9293j6985j6010j6182j6970j7613
50063A189817j7669j7168j6393j5749j5577j5717j5537j4725j3805j3420j3427
50052A020630j3188j2578j2009j1575j0839r631q416p523o508m748k364n1J956
50039I23156M081O483Q468R321R400R808J0945J2042J2270J1779J1203J0650R780
50026A049386Q586P338N869L647P23k069m061n400o519p470q173q786r533j0489
$$ plain form
50107 1207015 1272541 1346084 1426512 1510818 1595306 1676797 1752802 1821527 1882820 1939011 1993819
50096 1993819 2049895 2107529 2165353 2221229 2272155 2314189 2343327 2356461 2351563 2327764 2285961
50085 2285961 2228955 2160339 2083293 2000660 1915608 1831395 1750477 1674228 1603415 1538488 1479654
50074 1479654 1427286 1382260 1345341 1316113 1292870 1273577 1256592 1240582 1224400 1207430 1189817
50063 1189817 1172148 1154980 1138587 1122838 1107261 1091544 1076007 1061282 1047477 1034057 1020630
50052 1020630 1007442 994864 982855 971280 960441 950810 942394 934871 928363 923615 921251 921200 923156
50039 923156 927237 933720 942188 951509 960909 970717 981662 993704 1005974 1017753 1028956 1039606 1049386
50026 1049386 1057972 1065310 1071179 1074826 1075549 1073480 1069419 1064019 1057500 1050030 1041857 1033071 1023538 1013049
50012A013049j1762j3416j4920j5238j4013j2169j0797r880q739p310o104n005
50000H83696l134J2M011Q332J2974J7891K2445K5962K8512L0650L2672L4617L6789
49987A135429L9595M2770M5226M5938M4672M1646L6819L0137K2462J5787J1986
49976A512467J1483J3259J5908J8285J9159J7044J0855O97j2262k6514m0627n3229
49964A486525o3093o9424p1960p0918o7018o1384n5037m8376m1417l4508k8416
49953H74974k3566j9475j5229j0470n721j837O71J861K053J499L25j193k478k978
49939G98436k701k268k300k880l788n164p496j0821j4232j6589j7668j8172j8555
49926F75802j8276j6590j3793j1107r289p903o199m289k946k377j799m92J152
$$ plain form
50012 1013049 1001287 987871 972951 957713 943700 931531 920734 910854 902115 894805 888701 883696
50000 883696 880562 880574 884585 892917 905891 923782 946227 972189 1000701 1031351 1064023 1098640 1135429
49987 1135429 1175024 1217794 1263020 1308958 1353630 1395276 1432095 1462232 1484694 1500481 1512467
49976 1512467 1523950 1537209 1553117 1571402 1590561 1607605 1618460 1619157 1606895 1580381 1539754 1486525
49964 1486525 1423432 1354008 1282048 1211130 1144112 1082728 1027691 979315 937898 903390 874974
49953 874974 851408 831933 816704 806234 800513 798676 799347 801208 803261 804760 805085 803892 801414 798436
49939 798436 795735 793467 791167 788287 784499 779335 771839 761018 746786 730197 712529 694357 675802
49926 675802 657526 640936 627143 616036 606747 598844 592645 588356 585410 583033 581234 580742 581894
49913E81894K033J751J056Q41J098J290J415K111L606N272O428P204Q112R262
49899F33373J0467J1849J3578J5036J4992J2861R477O311M201K958J802m8k873
49886G33984o137q843j0446j1340j2225j3175j3627j3299j2696j2538j2800j2669
$$ plain form
49913 581894 583927 585678 586734 587575 588673 589963 591378 593489 597095 602367 608795 615999 624111 633373
49899 633373 643840 655689 669267 684303 699295 712156 721633 727944 732145 735103 736905 736857 733984
49886 733984 727847 719004 708558 697218 684993 671818 658191 644892 632196 619658 606858 594189
$$ [...]
##END NTUPLES=NMR SPECTRUM
##END=
