
##TITLE=AC1401_BRAH12210_7653281_WSfRedx4O0
##JCAMPDX= 6.0         $$ Bruker NMR JCAMP-DX V2.0
##DATA TYPE= nD NMR SPECTRUM
##DATA CLASS= NTUPLES
##NUM DIM= 2
##ORIGIN= BRUKER
##OWNER= Administrator
$$ 1.72 TOPSPIN		Version 2.1
$$ 2013-03-19 20:43:10.229 -0500  Administrator@X
$$ Compression mode = diff/dup
##.OBSERVE FREQUENCY= 400.02188249412
##.OBSERVE NUCLEUS= ^1H
##.ACQUISITION MODE= SIMULTANEOUS (DQD)
##.ACQUISITION SCHEME= NOT PHASE SENSITIVE
##.AVERAGES= 4
##.DIGITISER RES= 22
##SPECTROMETER/DATA SYSTEM= spect
##.PULSE SEQUENCE= jresgppsqf.2
##.SOLVENT NAME= COFFEE_meoh
##.SHIFT REFERENCE= INTERNAL, COFFEE_meoh, 1, 14.96097
##AUDIT TRAIL= $$ (NUMBER, WHEN, WHO, WHERE, PROCESS, VERSION, WHAT)
$$ ##TITLE= Audit trail, TOPSPIN		Version 2.1
$$ ##JCAMPDX= 5.01
$$ ##ORIGIN= Bruker BioSpin GmbH
$$ ##OWNER= Administrator
$$ $$ E:\/data/COFFEE/nmr/AC1401_BRAH12210_7653281_WSfRedx4O0/13/pdata/1/auditp.txt
$$ ##AUDIT TRAIL=  $$ (NUMBER, WHEN, WHO, WHERE, PROCESS, VERSION, WHAT)
(   1,<2013-03-19 20:43:01.088 -0500>,<Administrator>,<X>,<go>,<TOPSPIN 2.1>,
      <created by zg
	started at 2013-03-19 20:28:37.729 -0500,
	POWCHK enabled, PULCHK disabled,
       configuration hash MD5:
       86 BA 57 50 F2 9D 5C 9B 26 00 A9 28 5F 66 2E 89
       data hash MD5: 8K * 40
       41 CA 1C 3E D3 E1 F3 A6 2B 21 D2 46 86 10 37 AF>)
(   2,<2013-03-19 20:43:05.479 -0500>,<Administrator>,<X>,<proc2d>,<TOPSPIN 2.1>,
      <Start of raw data processing
       xfb same F2: SI = 16K WDW = 3 SSB = 0 FT_mod = 6 PKNL = 1 F1: SI = 512 WDW = 3 SSB = 0 FT_mod = 6 PH_mod = 2
       data hash MD5: 16K * 512
       34 94 4C 43 C3 4E 94 E2 D9 E2 3E C1 89 3D FB 2A>)
(   3,<2013-03-19 20:43:06.494 -0500>,<Administrator>,<X>,<proc2d>,<TOPSPIN 2.1>,
      <abs2 F2: ABSG = 5 ABSF1 = 10.00086 ABSF2 = 0.0003250621
       data hash MD5: 16K * 512
       D9 4A 29 2F 8C 41 9A 0A A9 97 C3 89 AC 5F 07 BF>)
(   4,<2013-03-19 20:43:07.166 -0500>,<Administrator>,<X>,<proc2d>,<TOPSPIN 2.1>,
      <tilt
       data hash MD5: 16K * 512
       FC 64 72 C7 F0 A9 C1 4B 55 2E 62 25 7D 5F C2 05>)
(   5,<2013-03-19 20:43:08.588 -0500>,<Administrator>,<X>,<proc2d>,<TOPSPIN 2.1>,
      <abs1 F1: ABSG = 5 ABSF1 = 0.06497851 ABSF2 = -0.06497862
       data hash MD5: 16K * 512
       8F 5C 54 A8 F3 39 A1 3A E5 26 0C 1B 18 6D F4 43>)
(   6,<2013-03-19 20:43:09.807 -0500>,<Administrator>,<X>,<proc2d>,<TOPSPIN 2.1>,
      <symj
       data hash MD5: 16K * 512
       78 C5 1F 27 0E 99 0B 32 89 F1 63 DE 3C A9 20 CF>)
$$ ##END=
$$ 
$$ $$ hash MD5
$$ $$ 47 DC A8 12 3B 50 42 90 4B E3 6E 6E D4 DA 0B 8A
##$RELAX= 
##$RELAX= 
##$RELAX= 
##$RELAX= 
##$RELAX= 
##$RELAX= 
##$RELAX= 
$$ Bruker specific parameters
$$ --------------------------
##$DU= <E:\>
##$EXPNO= 13
##$NAME= <AC1401_BRAH12210_7653281_WSfRedx4O0>
##$PROCNO= 1
##$TYPE= <nmr>
##$USER= <COFFEE>
##$ACQT0= 1000000
##$AMP= (0..31)
100 100 100 100 100 100 100 100 100 100 100 100 100 100 100 100 100 100
100 100 100 100 100 100 100 100 100 100 100 100 100 100
$$ [...]
##$TD0= 1
##$TE= 300
##$TE2= 300
##$TE3= 300
##$TEG= 300
##$TL= (0..7)
0 120 120 120 120 120 120 120
##$TP= (0..7)
150 150 150 150 150 150 150 150
##$TP07= 0
##$TPNAME0= <>
##$TPNAME1= <>
##$TPNAME2= <>
##$TPNAME3= <>
##$TPNAME4= <>
##$TPNAME5= <>
##$TPNAME6= <>
##$TPNAME7= <>
##$TPOAL= (0..7)
0.5 0.5 0.5 0.5 0.5 0.5 0.5 0.5
##$TPOFFS= (0..7)
0 0 0 0 0 0 0 0
##$TUNHIN= 0
##$TUNHOUT= 0
##$TUNXOUT= 0
##$USERA1= <user>
##$USERA2= <user>
##$USERA3= <user>
##$USERA4= <user>
##$USERA5= <user>
##$V9= 5
##$VALIST= <valist>
##$VCLIST= <CCCCCCCCCCCCCCC>
##$VD= 0
##$VDLIST= <DDDDDDDDDDDDDDD>
##$VPLIST= <PPPPPPPPPPPPPPP>
##$VTLIST= <TTTTTTTTTTTTTTT>
##$WBST= 2048
##$WBSW= 25
##$XGAIN= (0..3)
0 0 0 0
##$XL= 0
##$YL= 0
##$YMAX_a= 65752
##$YMIN_a= -121424
##$ZGOPTNS= <>
##$ZL1= 120
##$ZL2= 120
##$ZL3= 120
##$ZL4= 120
##$ABSF1= 0.06497851
##$ABSF2= -0.06497862
##$ABSG= 5
##$ABSL= 0
##$ALPHA= 0
##$AQORDER= 0
##$ASSFAC= 0
##$ASSFACI= 0
##$ASSFACX= 0
##$ASSWID= 0
##$AUNMP= <>
##$AXLEFT= 0
##$AXNAME= <F1>
##$AXNUC= <1H>
##$AXRIGHT= 0
##$AXTYPE= 0
##$AXUNIT= <>
##$AZFE= 0.1
##$AZFW= 0.5
##$BCFW= 0
##$BC_mod= 0
##$BYTORDP= 0
##$COROFFS= 0
##$CY= 15
##$DATMOD= 1
##$DC= 0
##$DFILT= <>
##$DTYPP= 0
##$F1P= 0
##$F2P= 0
##$FCOR= 0.5
##$FTSIZE= 512
##$FT_mod= 6
##$GAMMA= 0
##$GB= 0
##$INTBC= 1
##$INTSCL= 1
##$ISEN= 128
##$LB= 0
##$LEV0= 0
##$LPBIN= 0
##$MAXI= 10000
##$MC2= 0
##$MEAN= 0
##$ME_mod= 0
##$MI= 1
##$NCOEF= 0
##$NC_proc= -5
##$NLEV= 6
##$NOISF1= 0
##$NOISF2= 0
##$NSP= 0
##$NTH_PI= 0
##$NZP= 0
##$OFFSET= 0.06497851
##$PC= 4
##$PHC0= 0
##$PHC1= 0
##$PH_mod= 2
##$PKNL= no
##$PPARMOD= 1
##$PPDIAG= 0
##$PPIPTYP= 0
##$PPMPNUM= 2147483647
##$PPRESOL= 1
##$PSCAL= 1
##$PSIGN= 0
##$PYNMP= <proc.py>
##$REVERSE= no
##$SF= 400.021882494141
##$SI= 512
##$SIGF1= 0.06497851
##$SIGF2= -0.06497862
##$SINO= 16
##$SIOLD= 512
##$SPECTYP= <>
##$SREGLST= <1H.MeOD>
##$SSB= 0
##$STSI= 512
##$STSR= 0
##$SW_p= 51.9856959427865
##$SYMM= 3
##$S_DEV= 2730
##$TDeff= 40
##$TDoff= 0
##$TI= <>
##$TILT= yes
##$TM1= 0
##$TM2= 0
##$TOPLEV= 0
##$USERP1= <user>
##$USERP2= <user>
##$USERP3= <user>
##$USERP4= <user>
##$USERP5= <user>
##$WDW= 3
##$XDIM= 16
##$YMAX_p= 311510561
##$YMIN_p= 0
$$ End of Bruker specific parameters
$$ ---------------------------------
##NTUPLES= nD NMR SPECTRUM
##VAR_NAME=  FREQUENCY1,    FREQUENCY2,      SPECTRUM
##SYMBOL=    F1,            F2,              Y
##.NUCLEUS=  1H,            1H
##VAR_TYPE=  INDEPENDENT,   INDEPENDENT,     DEPENDENT
##VAR_FORM=  AFFN,          AFFN,            ASDF
##VAR_DIM=   512,           16384,           16384
##UNITS=     HZ,            HZ,              ARBITRARY UNITS
##FACTOR=    0.101534562388255, 0.501933850740131, 1
##FIRST=     25.9928259484165, 8223.18227667557, 2085
##LAST=      -25.8913354319817, 0,           1121
##MIN=       -25.8913354319817, 0,           0
##MAX=       25.9928259484165, 8223.18227667557, 311510561
##PAGE= F1=25.99282594842
##FIRST=     25.9928259484165, 8223.18227667557, 2085
##DATA TABLE= (F2++(Y..Y)), PROFILE
$$ [...]
##PAGE= F1=0.1015125394115
##FIRST=     25.9928259484165, 8223.18227667557, -2767
##DATA TABLE= (F2++(Y..Y)), PROFILE
3651 -4267 -2976 -1184 1 62 -106 215 805 550 -6 -837 -2663 -5007 -3857 -2934 -2858 -3057 -1436 877 2186
3632 2186 2212 972 -921 -3182 -2714 -883 492 935 1446 1503 710 -1119 -3767 -4512 -2358 -770 538 1016 1367
3613 1367 1270 1171 1032 393 -142 322 1786 3745 4440 4038 2713 849 -771 -2005 -2403 -1754 -396 825 1649
3594 1649 1790 1824 1655 1303 785 673 -239 -1560 -3028 -4518 -3431 -2289 -1402 -948 -802 -1230 -1420 -652
3575 947 1912 1717 1611 922 -531 -2062 -2569 -1910 -1413 -1406 -2336 -3964 -4145 -1969 521 2876 4574 5121 4024
3556 4024 1677 -1282 -4107 -4401 -3153 -2151 -1603 -1342 -1391 -1392 -1597 -1066 -49 1161 1725 1842 1173 43 -1386
3536 -2814 -4365 -2839 -1609 -898 78 1053 2245 2926 3105 3089 2662 2325 2130 2067 1920 1601 1067 246 -844
3516 -2096 -3116 -3436 -3632 -2816 -1842 -1661 -2304 -2793 -2594 -1042 -806 -1190 -1448 -908 261 1493 2850 4764
3498 4764 6896 8327 9368 9247 8302 6820 6135 7154 9474 10831 11399 10985 9340 6736 3719 1051
3481 231 1348 2461 2835 2671 2097 1149 47 -825 -935 -1311 -1612 -1351 -426 1541 3954 6347 7247 6956 5936
3462 5936 4749 4403 5071 6365 6995 6280 4026 695 -2321 -3529 -3472 -3396 -3485 -3082 -2440 -1285 -211 867 1442
3443 1442 1692 1455 964 -310 -1463 -1353 -915 -609 -682 -835 -714 -184 727 1329 621 -720 -2439 -4176 -4110
3424 -4110 -3418 -2718 -1444 145 1882 3757 5494 6195 5694 4114 2544 868 -780 -2392 -3841 -2943 -2274
3407 -2274 -1633 -1643 -2103 -1490 -205 857 985 76 -1385 -2795 -1888 -295 1278 1958 2644 3165 3514 3586 3775 4276
3387 4276 4686 5040 5184 5181 4707 3280 1723 -320 -2137 -3329 -3609 -3065 -1936 -1184 -1203 -1672 -2003 -1738 -1828
3368 -1828 -1581 -653 -195 -782 -1174 -1348 -890 -413 -563 -1379 -14 2378 4287 4975 4392 2729 585 -2072 -3146
3349 -3146 -1119 265 628 601 -83 -969 -1579 -1891 -1812 -1918 -1572 -987 -526 -890 -1184 -949 -394 -664 -1736 -2453
3329 -2453 -1756 120 1685 2056 1728 1255 563 -377 -1755 -2292 -319 2320 4678 6226 6181 4636 3006 944
3310 -522 -941 -532 97 1035 2367 3589 4365 4243 2793 852 -1574 -3763 -4504 -4366 -4468 -4325 -2545 -1229
3291 -823 -1677 -4003 -2171 27 1741 3627 4015 3394 2574 1979 1699 1718 1524 1367 762 -197 -761 -406 231
3271 466 38 -512 -1459 -2430 -2335 -1295 -574 -495 -790 -1317 -2002 -2989 -3726 -3644 -2571 -1296 269 1638 2185 1853
3251 1853 618 -1114 -2122 -1976 -1484 -1236 -1104 -723 -338 426 1462 2624 3859 3815 2864 2936 3112 2684 1656
3232 1656 562 -30 -762 -1145 -1767 -1948 -2259 -3153 -3356 -3390 -3423 -2828 -2224 -2030 -1639 -425 904 2278 2856 2248
3212 2248 817 -688 -1665 -1803 -1565 -1287 -1039 -645 151 1125 1589 2198 3692 5092 5871 5971 5116 3331 811
3192 -956 -829 513 2344 4935 7419 9144 9843 9598 8593 6325 4055 1906 178 -1180 -2938 -3100 -1356
3174 621 1986 2663 2581 1761 272 -466 -1022 -1498 -2316 -3352 -3699 -3081 -2455 -1410 -677 -478 -1094 -2095 -3275
3155 -3275 -4176 -3435 -1249 1161 3460 5017 5392 5196 4098 2359 1282 244 -901 -1829 -2581 -2313 -1517
3138 -1517 -768 -515 -477 -55 -23 -431 -968 -1094 -1002 -288 328 839 1058 1097 1533 1821 1436 742 480 636 1176
3117 1176 1728 2054 2157 1116 -298 -2216 -3882 -2336 148 1708 2822 2618 1182 -713 -2313 -1073 1450
3099 3483 4493 3917 2461 86 -2847 -5577 -3197 -165 1608 1361 610 357 567 533 497 99 -123 -266 6 326
3079 326 1009 1623 1540 1072 292 -412 -907 -970 -1423 -2813 -4350 -2962 -1203 360 1343 1418 715 -907 -2216
3060 -2216 -1260 -583 1862 3358 3923 2860 182 -2359 -1227 177 1146 1056 108 -1217 -3050 -4444 -3614
3043 -3614 -2086 -966 -180 1096 1842 2634 2793 2207 492 -765 -880 403 2048 3313 4342 5230 5762 5427
3025 5427 3886 2232 1122 1406 2021 2489 2473 1958 796 -597 -1730 -2071 -2508 -2852 -2206 -752 696 1834
3007 1834 2658 2510 1899 1242 297 -773 -2499 -3020 -1766 -1237 -1307 -2004 -2429 -2042 -689 145 676 347 -12 504
2986 614 126 -404 -299 792 2815 3601 3197 2575 1542 -1 -1390 -2763 -1599 -234 1245 2443 2580 2268
2968 2268 1032 -983 -3332 -5381 -5167 -3844 -2169 -471 941 1632 1483 2224 3259 4307 5087 4817 3136
2951 3136 1125 -836 -2593 -4125 -5082 -4346 -3434 -3515 -3565 -3005 -2317 -1867 -1797 -2151 -1583 -258 1713 3439 4007
2932 4007 2714 702 -1608 -2916 -3486 -3964 -4083 -3577 -3147 -3104 -3535 -4027 -4026 -3310 -2478 -1033 147 656 357
2913 357 -1127 -3007 -3696 -2788 -2255 -1842 -1020 -155 164 939 1777 2431 3192 3658 3629 2481 736 -1034 -2617
2894 -2617 -3113 -2574 -2287 -1247 -549 -25 -5 -450 -1411 -2311 -3371 -2732 -1275 -147 -214 -1156 -2793 -2820 -562 1886
2873 3607 4561 4575 3129 1966 714 92 131 535 2412 5048 7442 9057 10144 10041 8965 7287 5256
2856 5256 3025 781 -1521 -3545 -2584 -1241 -561 -290 -765 -1939 -2377 -1397 -737 -439 -1017 -2079 -2554 -2423
2838 -2423 -2227 -2489 -3006 -3340 -3193 -2890 -2666 -2631 -1995 -692 -231 58 175 357 736 861 365 1505 2219 2328
2818 2328 2606 3282 3944 3974 3394 1520 -1055 -3221 -4705 -5259 -4720 -2934 -114 1651 2526 2250 1491 498
2799 -407 -1107 -1814 -2698 -4071 -4843 -4094 -2727 -981 292 1129 1958 2497 2255 928 -906 -2860 -2691 -229 1664
2779 2712 2461 1882 581 -797 -2519 -3349 -2686 -1661 -26 1419 2039 2189 2123 1954 1458 1188 1167 406 66 -1 -22
2758 -22 -260 -1317 -2224 -1611 -636 33 661 1128 1799 2324 2539 2663 2487 1721 329 -1218 -2920 -3704 -4959
2739 -4959 -4739 -4765 -5014 -4762 -4306 -3508 -1634 72 1534 1975 1483 793 701 1052 1316 1063 366 -550 -1590 -3028
2719 -3028 -3926 -2071 843 3943 6784 8741 9997 9414 7886 6260 5026 4294 3656 2013 108 -1060
2702 -281 991 2328 2856 2522 1653 749 270 381 621 425 -279 -491 -577 -672 -883 -900 -1578 -2252 -2277 -1059 -328
2680 445 618 259 607 1262 2326 3084 3190 2264 586 -1976 -3734 -4775 -5627 -6048 -4430 -2689 -1741 -1641
2662 -1641 -2188 -2585 -1790 -1124 -1546 -2896 -3688 -1665 187 1620 2646 3479 3920 3695 2660 1162 -198 -2146
2644 -2146 -3479 -3824 -2985 -2618 -3268 -3794 -2536 -389 1828 3767 5149 5405 4526 2837 1267 -348 -2021
2627 -2021 -3134 -3499 -3149 -2695 -2514 -2180 -1125 355 1680 2496 2504 1666 360 -1592 -3417 -2178 -923 -221
2608 162 233 -101 -881 -2235 -3673 -2445 -1385 376 2306 4663 6456 7065 6390 4936 3112 1580 763
2590 198 -209 -291 -69 207 582 865 710 27 -976 -1899 -2743 -2212 -1245 -616 -278 328 178 405 860 1351 1439
2569 1439 564 -871 -1765 -2122 -1212 -381 313 857 1549 2339 3722 5397 6089 5910 4571 2829 746 -1346
2550 -3257 -3164 -2119 -1700 -1853 -2253 -2922 -2834 -2063 -795 837 2235 2875 2645 1956 1702 2900 5006 6280 5700
2531 5700 3302 -1 -3144 -1828 1004 2987 3962 3861 3395 2958 3222 3504 3821 3649 2657 1073 -434 -934
2513 -934 -488 -292 -738 -1923 -4244 -2821 -1475 -636 -420 -824 -1321 -1586 -2167 -2739 -2337 -1489 -699 -608 -1161
2494 -1161 -1481 -538 1197 2046 2399 2878 2931 2541 1629 308 -1173 -2258 -2170 -1430 -492 218 891 1211 1009
2475 1009 842 879 1233 1578 1773 1912 1906 1440 449 -1298 -2541 -2878 -2494 -1897 -1306 -815 -478 -378 -240 219
2454 497 660 492 103 -570 -1331 -2423 -3506 -3130 -2252 -1407 -1978 -2698 -3774 -3956 -4163 -4042 -4035 -3548 -3551 -2136
2434 -2136 -381 1025 2304 4146 6110 7049 7060 6317 4998 3421 2279 1900 1982 2567 2838 3148 2868 2268
2416 2268 1130 420 15 -72 325 1382 3027 4323 5049 5081 4145 2684 897 -1272 -2626 -3244 -2202 -1050
2397 528 1426 1914 1860 966 -797 -2729 -2662 -1067 -50 218 296 384 237 177 342 684 91 62 -860 -1615 -1715 -1229
2375 -1229 -1314 -1514 -1230 -1113 -1534 -2429 -583 1875 3375 4415 4935 4663 3838 2627 942 -458 -1105 -1012 -437
2355 333 657 397 -384 -1637 -3514 -4283 -2799 -1869 -508 1231 2342 3253 3660 3419 2373 432 -1564 -3390
2337 -3390 -3465 -1418 154 1025 1134 469 -617 -1891 -2933 -3193 -2484 -1194 -45 930 1492 1663 1695 1559 1048
2318 1048 146 -894 -1610 -2320 -2229 -1824 -1814 -2218 -3389 -4326 -2896 -2080 -1427 -724 -214 160 -120 -845 -2090
2299 -2090 -3284 -3450 -2867 -3131 -4354 -3138 -959 986 1608 1013 -1359 -3643 -3871 -1810 432 1855 2223
2282 2223 2035 1245 315 -203 305 1214 1529 618 -916 -1567 -584 866 1854 1935 1178 -233 -2410 -2746 -568 397
2261 492 592 128 355 1754 2601 2684 1158 -855 -1695 -608 708 1723 2609 2684 2956 2949 3254 3182 2155 1449
2241 1449 998 1050 1240 1718 2002 1940 2128 2400 2551 2225 1504 1287 1889 2396 2641 2446 1987 1026 -367 -1282
2221 -1282 -2240 -2198 -1354 -120 1240 2225 2630 1769 195 -2273 -4536 -5371 -5341 -5465 -4905 -2874 -1002 109 -4
2201 -896 -2279 -4411 -5103 -3157 -1657 -481 -275 -906 -1890 -2232 -2476 -2624 -2492 -1976 -722 -141 0 -1070 -2640
2182 -2640 -2850 -1783 -676 -246 -607 -1423 -2289 -2765 -1566 209 1675 2003 1070 -664 -2139 -2474 -807 963
2163 1189 402 -1018 -1614 -57 1567 2455 2298 1770 651 -610 -2009 -2389 -1690 -1770 -2312 -2758 -2803 -2984 -3082 -3434
2143 -3434 -3362 -2535 -972 -443 -23 -133 -922 -1036 -1194 -738 64 1207 2302 3188 3565 3081 2182 613 -747 -1343
2123 -1343 -1593 -1141 -1321 -1963 -2427 -3512 -3598 -4165 -3079 -1330 787 2639 3674 3921 3722 3767 5896 8396
2105 8396 9528 9090 7356 4718 1299 -1951 -2802 -190 1365 1988 1196 -10 -1909 -2397 -2452 -2645 -2614 -1563
2087 -1563 -27 1553 2827 3728 4777 4884 5157 5468 5494 4426 2937 1175 -277 189 713 828 -131 -1352
2069 -1352 -1685 -255 1423 2353 2818 2908 1992 885 252 -568 -1626 -3151 -2116 -1600 -1197 -1256 -2535 -3925
2051 -3925 -3176 -2443 -1277 -375 489 955 1208 1275 877 42 -704 -864 -706 -514 -49 533 1488 2265 2882 2679
2031 2679 2845 2570 1945 1282 1274 1774 2354 2471 1867 678 -1502 -3333 -3513 -1525 808 2197 2349 977 -1399
2011 -2867 -2433 -1282 51 801 315 -593 -1520 -1800 -1804 -2362 -1565 -82 1606 3785 5059 5142 4314 3371 2445 944
1990 -737 -1663 -1516 -218 1051 1578 1789 2317 3194 3963 3728 3254 1751 388 -733 -1589 -2278 -2906 -3578 -3573 -3355
1970 -3355 -2707 -1727 -1164 -1712 -2541 -3108 -2610 -726 1802 3629 4334 4092 2617 1014 -1204 -3000 -3496 -1744
1951 -200 1112 1476 1235 244 -566 45 1198 1952 1633 858 808 1407 1764 1793 1267 -299 -2530 -4036 -2857
1932 -2857 -2320 -2254 -2070 -803 806 2829 4096 4604 4633 4886 4992 5008 4380 2976 1097 -419 -1358 -1484 -1513 -2204
1912 -2204 -3469 -4100 -3286 -2393 -701 398 1039 1312 1348 979 -145 -1636 -3484 -3670 -2356 -2129 -2136 -1888 -908
1892 745 1917 1877 620 -1285 -2738 -3299 -3086 -2054 -796 168 368 1 -890 -2049 -2831 -2783 -1858 -478 1694
1872 3937 5448 5375 3460 369 -2480 -3147 -2723 -2056 -1845 -1844 -2224 -2485 -2374 -2634 -3137 -3273 -3276 -2940 -2345 -1812
1852 -1812 -869 315 1531 2856 3928 4542 4387 2932 1535 -149 -2160 -3967 -4393 -3569 -2730 -2132 -1792
1835 -1792 -1485 -598 736 2270 3820 4880 4757 2862 -193 -1719 295 2998 4657 4462 3503 1383 -1206
1817 -3491 -5097 -5163 -4760 -3637 -2915 -2211 -1293 -255 1120 2061 2273 1689 335 -912 -1055 351 1219 984 208
1797 -273 245 1292 1696 1206 369 -309 -574 -1086 -1734 -2750 -3799 -1772 585 2251 3302 3768 3252 2927
1779 2927 2046 884 -604 -2150 -2631 -2152 -2690 -3539 -3515 -2086 -299 366 291 156 -1213 -2980 -3983 -4163 -4532
1760 -4532 -4413 -3944 -2760 -893 836 1829 2078 1838 1318 545 -128 -927 -1558 -2105 -2438 -2803 -3061 -3423 -3952
1741 -3952 -3466 -2232 -522 531 1315 1166 359 -802 -2187 -3207 -1358 677 2476 3999 4525 3326 1513
1723 -534 -3053 -3819 -2068 -52 766 453 -393 -1074 -1562 -1710 -2500 -2589 -621 1660 3010 3327 2305 718 -763
1703 -507 728 2309 3782 4752 5484 5603 4571 2784 774 -491 -868 -1114 -1421 -1737 -2066 -1356 -298 580 684
1684 684 296 -355 -1367 -2859 -4756 -3676 -1249 426 1942 2640 2212 1086 -76 -368 586 2178 3424
1667 3424 3861 3575 2378 899 -8 -583 -44 1363 2752 3962 4225 3630 2813 2085 421 -1364 -2629 -2768 -2939
1648 -2939 -3637 -3451 -2341 -422 1618 3327 4346 4274 3515 2463 1997 2066 2388 3168 4416 5918 7295 7694
1630 7694 6972 4735 2620 1447 923 665 -209 -476 -270 -417 -921 -1414 -2021 -2496 -2457 -1988 -1592 -1241 -1002
1611 -1002 -786 -777 -337 396 1501 2693 3726 4200 4295 3798 3459 1399 -1759 -3614 -2110 -105 1217 2164
1593 2164 2399 1387 -379 -2130 -1941 -983 -677 -1307 -1433 -1394 -1061 -993 -804 -534 -94 173 300 555 930 1492
1573 1492 1899 1699 1065 -353 -1719 -2388 -2077 -1307 -911 -426 19 451 1246 2029 2249 1686 657 -523 -1307 -1417
1553 -1417 -1187 -1007 -873 -700 -248 138 176 -360 -1819 -3645 -3275 -1342 324 904 1089 1236 1722 2476 3125
1534 3125 3963 5056 5855 5445 4933 3831 2775 1295 -541 -2452 -3186 -2067 -1107 -990 -1901 -3171 -3475
1517 -3475 -3474 -2436 -1954 -1567 -1765 -2329 -2779 -3357 -2866 -1729 -790 -649 -1178 -2160 -3001 -3086 -2626 -2191 -2069 -2195
1497 -2195 -2696 -3443 -3835 -3100 -1636 -202 657 1425 2339 2730 3055 3704 3708 3553 3579 3731 3779 3403 2828 2093 1315
1476 1315 54 -1596 -1650 -634 6 426 537 698 798 1390 2459 3073 2653 1544 720 406 562 861 815 -52 -1276
1455 -1276 -2628 -3487 -3097 -2058 -1522 -1462 -2004 -2897 -3809 -3765 -2732 -811 1513 3105 4164 4136 2973 766
1436 -1776 -3350 -3131 -2701 -2969 -3230 -3088 -2435 -1211 -544 -1167 -2163 -1686 -909 -673 -1202 -2496 -2799 -307 2212
1416 3657 4118 3762 3393 3398 3311 3576 3433 2895 2153 1605 1171 1030 673 -248 -1936 -4204 -4533 -2964 -1399
1396 -414 37 216 44 3 -315 -927 -947 10 771 574 -424 -1848 850 2418 2699 1997 836 -800 -2147 -3024 -3265
1375 -3265 -3204 -3660 -3971 -3610 -3454 -3287 -2441 -2126 -2382 -3172 -4023 -2712 -2019 -2397 -3831 -5529 -2298 527 3147
1356 3147 5487 6139 5914 3964 1727 -383 -1908 -2504 -3492 -3423 -2554 -1132 456 2028 2398 1479 -16 -1721
1338 -1721 -2948 -2533 -1189 -327 -454 -1673 -3056 -2306 -783 659 1444 1650 1047 183 -629 -482 -330 -69 527
1318 1140 1469 1564 1363 1097 777 1215 1612 2331 2289 2245 1961 1643 1014 -96 -949 -1248 -1025 -850 -1080 -1399 -1651
1297 -1651 -1646 -1285 -1431 -1318 -1557 -1173 -223 330 -226 -1420 -2216 -1363 -242 320 -305 -1384 -2825 -2463 -135
1277 1873 2526 1862 1044 -325 -1300 -1857 -1779 -2346 -2794 -3150 -3233 -3238 -2648 -2236 -1561 -1048 -1137 -1065 -1229 -614 -14 89
1254 149 -279 -793 -438 221 551 1337 1818 2239 2649 2568 1904 804 -179 -1552 -3322 -3749 -2822 -2438 -2389 -2971
1234 -2971 -3287 -2796 -2336 -2191 -2515 -2194 -1714 -553 44 -12 15 1 176 -38 120 282 1126 1460 1321 404 -1373
1212 -2840 -1316 1390 3922 5134 4688 2892 1198 94 363 2038 4210 6249 7508 8077 7499 6710 5012
1195 5012 3769 2993 2586 2337 1825 1339 305 -1397 -3287 -1806 754 2996 4096 3847 2515 890 -1119
1177 -2195 -2191 -2128 -2761 -2918 -1095 652 2020 2902 3254 3073 2127 395 -1303 -2640 -962 1305 2522 2737 2040
1158 2040 1028 193 -494 -686 -762 -737 -792 -1168 -894 -98 629 1628 2176 3229 3842 3859 3671 3548 3331 3414 3146
1137 3146 2310 1316 420 -226 -1459 -2548 -2132 -1908 -1865 -2360 -2909 -3318 -3591 -3195 -2181 -1193 -596 -505 -190
1117 -392 -2020 -3235 -1448 1618 4924 7172 7978 6917 4703 2165 -236 -2377 -3026 -1907 -325 1676
1100 2846 2803 1440 227 -150 402 934 819 -243 -1053 -750 260 1115 1438 2001 2333 2544 3177 3505 2838 1241
1079 -1027 -2977 -2756 -1265 135 1242 1842 2516 3238 3319 2967 1650 -482 -2868 -4602 -4705 -3756 -3145 -2994
1061 -2994 -2753 -1994 -1277 -783 -950 -1614 -1302 -349 721 1117 819 -212 -1475 -2497 -2276 -1544 -1538 -1544 -1045 -458
1040 -365 -643 -689 -1292 -2036 -2612 -3006 -3127 -2608 -1331 -392 -73 -47 -670 -1759 -2888 -2989 -3173 -3556 -4364 -2949
1020 -2949 -656 1112 2189 1983 251 -2833 -4041 -1535 553 1582 1193 -137 -2021 -2400 -460 680 798
1003 798 425 -776 -1757 -1800 -1378 -553 -213 -79 -492 -973 -1549 -1859 -1961 -924 905 2737 4326 5213 4778 3619
983 3619 2176 849 594 1797 2489 3250 3706 3491 2709 1863 1012 625 513 516 565 391 28 -445 -523 -308 192
961 529 903 779 473 703 1589 1936 1597 862 614 955 1009 1232 1663 2097 2747 2338 1686 119 -1253 -1903
941 -1903 -3258 -3731 -3085 -3051 -2260 -1331 33 1541 2758 2931 2116 1392 295 -1201 -2779 -2439 -451 892 2141
922 2141 3388 3871 3378 2012 136 -463 437 1922 2990 3105 1214 -1919 -2259 376 2750 4784 6052
905 6052 6725 7180 7085 6461 5455 4463 3463 2232 1389 1036 1190 1825 2069 2068 1966 1444 971 393 -345 -1077
885 -1077 -963 -571 10 429 188 -463 -1603 -2453 -2839 -2473 -1661 -818 328 989 1544 1702 1252 1166 1196 1105 965
864 965 1251 1822 2366 2558 1598 459 -301 -767 -1311 -2003 -2519 -1329 -144 175 301 221 -71 331 1451 1917
844 1917 1951 1085 -465 -2089 -3255 -3176 -3127 -2295 -1133 11 630 379 -170 -985 -2102 -2504 -1917 -1183 -880 -906
824 -906 -937 -716 -852 50 926 397 15 -550 -1577 -2531 -3884 -3295 -2008 -1626 -1422 -772 887 3138 5277 7169
804 7169 8497 8009 7180 6332 5276 5081 4844 4740 3526 1584 -439 -2593 -2710 -2308 -2200 -2130 -1522 -992 -788
785 -788 -1693 -2467 -2413 -1587 -862 -45 645 999 998 881 624 268 -429 -1471 -2210 -2865 -2877 -2520 -1561 -853 -1438 -2645
763 -2645 -2830 -1170 871 2492 3006 2021 999 -437 -1717 -2977 -3965 -4886 -4845 -4442 -4427 -3167 -1429 428 2002
744 2002 3674 4748 5031 3679 1756 -224 -952 -530 -324 -582 -1139 -1227 -76 1627 2726 2829 1874 437 -1074
724 -2246 -3576 -3332 -1504 443 1606 2048 1838 715 -119 -281 939 2454 3852 4634 4617 3710 2104 1056
706 1056 1458 2948 4092 4931 5224 4843 3389 1851 176 -1518 -2861 -3495 -3280 -2319 -888 752 1988 1640
688 1640 116 -2160 -3484 -4711 -3386 -1264 220 1123 969 -271 -559 1390 4077 6513 7747 7425 5770
671 5770 2725 -16 -2445 -4161 -2559 -488 1927 4445 6288 6836 6251 4344 1528 -1355 -4578 -2671
655 -2671 592 2849 3806 3871 3272 1497 -389 -2364 -3571 -1879 -306 1107 2377 3335 3940 3409 2116 145
636 -2332 -4091 -2609 173 1891 2761 3159 2843 1567 -637 -3081 -3046 -1955 -1773 -1745 -2111 -2641 -3644 -3054
618 -3054 -2310 -402 2368 5501 8246 9528 9010 7859 6259 3999 1761 -586 -1880 -2765 -2797 -2420 -2218
601 -2218 -1581 -486 597 1466 1725 1017 501 9 848 2320 3804 4186 3418 1912 386 -713 -1092 -846 -656 -304
580 43 154 45 -591 -1363 -2298 -2944 -3410 -4043 -4568 -4827 -4102 -4085 -1786 -238 84 -523 -1329 -1459 -403 959 1604
559 1604 1831 893 -608 -1862 -2186 -1740 -1906 -2640 -3779 -3867 -2466 -587 739 1233 369 -1863 -2472 194 3012
540 3012 5056 6596 6695 5403 4198 2701 1350 882 840 911 1012 687 174 4 896 1888 2577 2248 1411 271
519 -444 -761 -1265 -2028 -3191 -4736 -5252 -3613 -2417 -2086 -2406 -2557 -2106 -838 -155 289 258 -123 -628 -1174
500 -1174 -996 -488 -432 -1513 -2714 -3375 -2591 -1308 -746 -1366 -3122 -4409 -2681 -1656 -1835 -2809 -3411 -2426
482 -2426 -430 763 1140 608 -408 -1713 -2096 -1695 -1498 -1579 -1796 -2292 -2849 -2838 -2033 -1018 -308 166 534 261
461 -647 -1682 -2246 -2243 -2320 -2759 -2197 -1574 -731 885 2461 3933 4060 5386 6374 6529 5632 4124 2545 627
441 -764 -1488 -1275 -394 679 1881 2256 1860 1074 558 455 902 1234 1447 1746 1969 1001 -477 -1422 -2660 -2231
421 -2231 -1427 -1655 -1705 -437 1585 4035 5856 7012 6684 5330 3239 1087 -682 -1888 -282 846 1335 1114
403 1114 1294 1549 1274 341 -525 -1375 -2143 -2720 -2587 -2035 -1111 127 1274 1599 1564 915 -60 -963 -1740 -2431
383 -2431 -3036 -3550 -2635 -600 980 2206 3198 3756 3549 2606 1186 -632 -2362 -3815 -2387 -1092 -568 -991
365 -991 -1272 -1030 -120 1549 3666 4944 5014 4809 4329 3657 3084 1714 391 -879 -1372 -1235 -1412 -498 -262
346 -262 -575 -1142 -2030 -2928 -3298 -3532 -3984 -4186 -4011 -4407 -4245 -3205 -1504 -202 648 1406 1791 1647 1473 763
326 763 -361 -1450 -2228 -2906 -2958 -1627 311 1752 2377 1974 1600 740 -129 -529 -128 867 1427 552 -1487
306 -4179 -2372 -164 -468 -3222 -4858 -1173 2476 4369 4517 3836 2542 880 -393 -467 141 1445 2589
289 2589 4060 5945 7168 7850 7632 6825 6101 5390 3708 3455 3397 3818 4097 3994 2972 1830 927 436
270 510 832 1493 1910 1834 1112 -157 -1289 -1804 -779 41 -394 -1316 -2144 -2246 -1329 -363 475 401 -269 -1169 -1241
249 -1241 -186 667 757 -221 -2365 -3851 -2802 -1656 -1226 -1880 -2791 -2844 -2482 -2474 -3071 -2920 -2183 -1099 0 517
228 817 641 -101 -644 -1119 -1760 -2147 -2020 -1240 507 2669 4539 5770 6490 6747 5998 4114 1684 -436 -1240
209 -1240 -386 308 -177 -1346 -2421 -3240 -1739 -783 -5 56 -175 -647 -1147 -1376 -930 -307 510 1413 2102 1967
189 1967 1725 1504 1800 2404 3936 5805 7496 8612 8231 6297 3645 1474 1016 2859 4415 4287 2680
172 2680 655 -930 -2090 -2517 -1828 -1043 -479 -145 41 850 2597 4713 6300 6870 6090 4374 2044 39 -1470
152 -1398 -835 -604 -1745 -4014 -3636 -1902 -1216 -1521 -1953 -508 1655 2758 2903 2151 1708 1783 2379 3322 4228
133 4228 4825 4776 4069 2642 1613 497 -39 590 1814 2325 2852 2097 1275 -175 -999 -484 166 957 1820 2008
113 2008 1131 -693 -2570 440 2530 2625 930 -2311 -3762 -2114 -1386 -2112 -3370 -2355 -1270 -666 -826 -1170
95 -1170 -1712 -2358 -2217 -212 2196 4639 6306 6930 6637 5516 3870 2184 991 635 611 -173 -1181 -1261 373
75 1690 2083 1941 2165 2238 1717 613 -919 -2353 -3416 -4121 -2488 -455 1721 3129 3807 3629 2829 1954 2042
56 2042 2594 3304 3044 2124 1784 2868 3694 3833 2703 833 -766 -1571 -1389 -65 1327 2065 1585 -304 -2644
37 -2644 -3306 -771 608 1314 1561 1644 740 -1266 -1750 47 1514 2289 1654 369 -1171 -2146 -1943 -556 1772 3739
17 3739 4626 4034 2050 -623 -2921 -213 1985 2432 1798 1169 1418 1737 1318 54 -1554 -2754 -2945
0 -2945
##PAGE= F1=-2.202297678447e-005
##FIRST=     25.9928259484165, 8223.18227667557, -2506
##DATA TABLE= (F2++(Y..Y)), PROFILE
16383 -2506 -2283 -2053 -2288 -2430 -1137 -210 215 850 1938 2902 3320 3103 1972 1455 1457 2256 2083 983 -837
16363 -2433 -218 1198 943 325 948 1972 2378 1518 -165 -1697 -381 1581 2281 1807 544 -1060 -1906 -887
16344 -518 -57 428 748 358 -781 -2862 -2025 -779 -404 -1261 -2766 -2588 -851 -47 -571 -1918 -2642 -2063 -1770
16325 -1770 -2347 -1265 636 2033 2797 2645 2051 669 -413 -267 556 957 957 633 830 769 -258 -2379 -2346 260
16304 1384 1085 -733 -2727 -1019 -84 -1075 -2868 -2890 -1381 -708 -1028 -1476 -1694 -2040 -2628 -3559 -3127 -1894
16286 -1894 -762 -334 -828 -1428 -834 492 1683 2182 1615 -20 -1562 -2043 -1710 -1348 -1802 -3088 -2189 -692 -625
16267 -625 -1746 -2167 -188 1256 1078 -172 -2041 -1786 -800 -684 -728 -58 1007 1685 1731 874 -258 -1337 -761
16248 -761 1261 2788 3183 2529 1257 178 260 1198 2053 2412 2103 1488 795 389 726 1023 724 -446 -2660
16229 -2660 -3475 -2338 -1534 -1207 -1504 -2049 -2328 -1520 -227 792 1226 1258 1118 332 -905 -2206 -2600 -1647 -1073
16210 -1073 -1464 -2619 -3489 -2837 -1711 -367 754 1857 2572 2788 2560 2164 1654 1058 102 -918 -1698 -2000
16192 -2000 -1450 -542 648 1722 2100 1756 983 97 -671 -1554 -2847 -3658 -1818 148 1469 1641 1250 1502
16174 1502 2207 3309 4267 3975 2443 -58 -1924 -2197 -1950 -2343 -2302 -1741 -1091 -430 -53 138 376 306 577 844
16154 844 180 -994 -1844 -1835 -1733 -2445 -3894 -4826 -3479 -1965 -618 78 207 -135 -305 -271 -249 -360 -474 -837
16134 -837 -1830 -2773 -2866 -1560 303 1733 2910 3704 4178 3560 2192 83 -1646 -1393 -218 382 258 -538 -1199
16115 -1199 -1210 -749 73 1298 2398 3384 3666 3441 2945 1792 499 -1177 -2646 -1285 -328 447 909 1166
16097 1166 1029 511 3 -669 -1345 -1979 -2336 -1975 -1041 277 1763 3119 4016 3729 2263 -24 -2237 -3691 -4490
16078 -4490 -3628 -1674 518 2074 2727 2391 1335 -55 -348 148 352 -339 -1901 -3445 -3046 -1490 -174 455
16059 654 197 -1167 -2146 -1575 -197 707 1284 1415 1333 1093 713 -118 -1731 -3589 -1523 566 2328 2751
16041 2751 2009 -598 -3139 -2437 -331 499 240 -905 -2262 -3310 -3624 -3153 -2316 -1475 -463 62 176 -320 -731
16022 -731 -803 -247 -63 -728 -1501 -482 947 2064 2703 2640 1891 673 -654 -1596 -2349 -2545 -2449 -2392 -2395 -2213 -1701 -1053
16000 -1053 -470 170 304 -639 -1622 -718 1717 4292 6014 6139 5004 3635 2052 615 -244 -640 356
15982 2470 4507 6216 7425 7969 7821 7529 6802 5915 4462 3368 2028 1228 1944 4412 7060 8619
15966 8619 8556 7014 4696 2230 488 -746 -1213 -570 331 975 1187 893 343 -397 -1174 -1748 -2237 -2828 -3757
15947 -3757 -4692 -4334 -2757 -1414 -1462 -2151 -3250 -3961 -2029 -404 483 394 -396 -872 -1177 -1140 -769 -247 343
15927 617 804 -653 -2834 -3093 -1276 143 1128 2241 2423 2150 1140 -189 -1206 -2220 -2428 -2009 -1108 89
15908 998 1132 1196 1507 1713 1821 1909 1554 653 -160 -223 460 1630 3189 4754 6554 7785 8145 7349 5504
15889 5504 3645 1943 180 -916 -1757 -2924 -4701 -4539 -2129 142 2180 3576 4457 4415 3494 2381 742
15871 -850 -2648 -1196 813 2335 3309 3709 3674 3067 2028 800 -839 -1568 -189 1473 2683 3678 4809 5366
15853 5366 5060 3776 1892 -212 -2732 -3717 -1575 556 1903 1922 775 -1087 -1688 -633 147 288 -120 -583
15835 -583 -881 -409 145 872 1350 1370 393 -679 -1796 -2607 -1630 -858 -524 323 924 1833 2169 1821 671 -957
15814 -2493 -3227 -2928 -2640 -2189 -1599 -1384 -1318 -1432 -1564 -1327 -800 -831 -1282 -2055 -2911 -3562 -4428 -2980 -1734
15795 -1734 -767 284 1114 1701 1913 1708 1043 356 185 272 -116 -1152 -2465 -3246 -3522 -3024 -2271 -1762 -1474
15776 -1474 -1348 -898 341 1226 2207 2637 2332 1914 1154 251 -895 -1430 -1196 -348 306 361 -124 -854 -1621 -1760
15756 -1760 -1127 -34 936 1768 2480 2965 2850 2159 1046 154 -583 -1159 -2090 -2879 -3547 -3668 -3447 -3428 -3384 -3470
15736 -3470 -4038 -3267 -1375 732 2535 3548 4015 4028 3326 2767 2262 1959 1947 2038 2014 1716 1763 1816 1649 1326
15716 1326 598 -860 -2042 -2892 -2876 -1529 810 3409 5424 6391 6140 5264 3869 2274 678 -625 -1374 -1279
15698 -1279 -362 1216 3187 4431 5185 4463 2712 481 -1675 -3445 -4419 -4572 -4414 -3320 -1888 -474 351
15680 415 173 199 -45 -247 -366 145 527 -66 -1137 -2271 -1512 -321 418 192 -831 -2573 -1844 933 3186
15661 3186 4567 5021 4618 4124 3765 3670 3420 2589 1150 -1359 -4564 -1618 604 1608 1909 1732 1561 1388
15643 1388 1521 1630 1566 1115 433 -634 -1500 -2036 -2942 -3094 -2607 -2469 -2500 -2718 -2663 -241 1699 3207 3633 2668
15623 2668 459 -2176 -1329 1569 3774 4326 4548 4153 2711 1077 252 673 1872 2273 1064 -851 -2642
15606 -2642 -3546 -2851 -2317 -1953 -1920 -1395 -975 -629 -689 -1140 -1764 -2078 -899 377 930 1231 1177 921 444 238
15586 238 -62 -89 181 723 860 1512 2173 2108 1667 948 -367 -2008 -3917 -3415 -2058 -995 -1135 -2390 -1383
15567 -1383 324 1554 1910 1522 671 -521 -1772 -2502 -2976 -1484 22 1396 2112 2104 1366 432 68 1092 2050
15548 2050 2322 1624 322 -1084 -1824 -1568 -964 -428 -218 -903 -2093 -3774 -4542 -3920 -2887 -1820 -1366 -2022
15530 -2022 -3030 -1148 1077 3361 4887 5232 4980 3865 2288 -21 -1735 -2827 -2442 -1291 -27 332 -492
15512 -1623 -2379 -1041 370 1455 2011 1411 72 -500 -5 746 960 209 -1431 -2917 -4347 -2890 -1499 -558
15493 -344 -461 -937 -1040 -620 -207 -721 -2114 -3815 -3808 -1630 406 1772 1356 -654 -3465 -2693 -768 1017
15474 2632 3751 4205 3671 2171 -47 -1550 -2031 -1279 -627 62 811 1659 2648 3673 4315 4837 4482 3455
15456 3455 2041 -1067 -4354 -2258 -336 270 -263 -1767 -3609 -2851 -949 452 1077 1222 1426 2069 3067
15439 3067 3533 3418 2671 751 -1766 -4619 -1618 2223 5313 6730 6030 3701 477 -3012 -1550 1288
15422 2747 2862 2007 1093 224 -444 -1263 -2353 -3267 -4259 -4457 -3605 -2482 -1351 -158 864 1720 2417 2726
15404 2726 2747 2570 2238 1672 1776 2292 2993 3847 3878 3553 2857 2658 3288 4080 4382 4062 3415 1934 275 -1615
15383 -1004 906 2958 4124 4974 4987 4204 3268 2709 2211 1685 944 108 -854 -2247 -3239 -2262 -887 386 1459
15364 1459 2324 2515 1923 759 -507 -724 60 857 1030 1159 866 -44 -1579 -2766 -2718 -1882 -999 -372 351 1121
15344 1121 1865 1604 458 -1550 -2092 -1186 -631 -717 -1540 -2511 -2585 -1666 -605 547 1710 2642 2874 2675 1726
15325 1726 -216 -2958 -2989 465 2995 4255 3974 2542 716 -1104 -2329 -2878 -2534 -1936 -1564 -1633 -2312 -3302
15307 -3302 -4006 -3581 -2827 -1978 -1057 -240 673 1690 2840 3682 4007 3657 2603 1286 -115 -319 632 1255
15289 1255 1852 2008 1591 430 -864 -1906 -2361 -2678 -2265 -1230 -91 781 1339 1937 2832 3831 4334 4388 3716
15270 3716 2408 142 -2971 -3750 -488 2076 3790 3745 2509 955 -413 -1051 -1364 -1479 -807 714 2307 3484
15252 3484 3903 3549 2581 1125 204 150 1251 2540 3691 4158 3326 1497 -535 -1309 -827 -609 -1277 -2922
15234 -2922 -4220 -2764 -1659 -1365 -1616 -1615 -1500 -1882 -3449 -4285 -777 2251 4820 5390 3648 986 -2338
15216 -2721 308 2247 2454 1132 -1230 -2397 -651 863 1693 1567 616 -548 -660 320 1154 1382 1056 529
15198 529 19 9 194 -406 -1213 -1411 -706 288 534 912 570 212 -49 -202 73 684 1596 2210 2673 2949 3300
15177 3300 2721 1345 -84 -738 -777 -775 -982 -2495 -3755 -3048 -1633 -700 17 326 1 -206 938 2281 3473 3898
15157 3898 4459 5330 6464 7556 8830 9626 9890 8838 6396 3125 -721 -3464 -2407 -163 1217 1841
15141 1841 1988 1600 661 -951 -2621 -3565 -3703 -3647 -1963 -125 1359 1840 973 -174 -777 477 3081 4748
15123 4748 4642 3138 617 -2079 -4102 -3451 -2829 -2406 -1949 -1670 -1064 -775 -522 103 948 1630 1611 1120 306
15103 -1164 -2656 -1899 -729 283 839 641 -186 -374 439 1972 4164 5795 6347 5910 5157 3873 2502
15086 2502 1099 418 802 1985 3008 3284 2410 1670 1482 1739 1946 1858 1244 501 -223 -617 -852 -1128 -1159
15067 -1159 -280 982 1869 2267 2118 1187 830 62 -1180 -2654 -3007 -549 1549 2789 2170 578 -1200 -2355
15049 -2355 -2551 -2452 -2215 -2143 -1939 -1647 -739 176 1099 2014 2637 2997 2446 1787 762 -427 -1479 -2064 -2277 -2137
15029 -2137 -1186 -29 2674 4502 5582 5046 3519 1205 -981 -2122 -2626 -2697 -2647 -2327 -1645 -525 954 2414
15011 2414 3378 3774 3361 1901 -488 -2593 -1610 282 1566 2061 1939 879 -128 -627 -520 336 1838 3278
14993 3278 4237 4516 4110 3422 1992 1148 -34 -1326 -2562 -3392 -3345 -3265 -3226 -3142 -2626 -1974 -1583 -2098 -3416 -4849
14973 -4849 -3198 -1270 127 522 131 -584 -1543 -2236 -2687 -2632 -2129 -1682 -1572 -2036 -2631 -2929 -2515 -2129 -2228
14954 -2228 -2777 -3242 -2550 -1158 296 1470 2453 3303 3833 3756 3507 2421 1281 1061 1801 3201 4709 5529
14936 5529 5461 4140 1483 -1853 -5069 -6183 -4212 -2200 -137 1894 3422 3981 3453 2217 553 -936
14919 -1517 -1172 -1503 -1971 -2448 -2723 -2303 -1844 -1747 -1772 -2142 -1638 -980 -515 -572 -1234 -2367 -3218 -1960 -891 -454
14899 -454 -877 -1231 -883 -89 1398 2783 3970 4423 4649 3872 2256 440 -528 -1271 -1340 -1057 -1032 -931 204
14879 2334 4787 6669 6693 4976 2952 734 -819 -898 -214 571 1263 1226 470 239 -381 -1348 -1670 -1590 -1491 -1258
14859 -1258 -942 -203 428 1039 1482 1360 786 -6 -575 -847 -928 -614 150 800 894 229 -1342 -2924 -1315 476
14838 1137 903 -34 -1758 -3597 -4378 -2515 -1648 -1208 -123 1027 1706 2223 2052 2210 3177 4380 4866 4161
14820 4161 3080 1143 -1134 -2296 -1686 -1318 -1466 -1940 -2185 -1961 -1535 -1467 -1553 -2038 -2895 -3155 -2955 -2664 -2400
14801 -2400 -2127 -1483 -617 -116 -455 -1020 -736 685 2032 2805 2840 2551 1989 1198 946 1098 1011 1119 1640 2046
14781 2046 1927 1101 -1123 -3892 -2610 1183 4385 6706 8569 9402 8616 6435 4281 1557 -432 -1189
14765 -1189 -243 2270 4641 6588 6523 4784 2334 -322 -2420 -2453 -1865 -2352 -3382 -4898 -3054 -1521 -140
14747 417 1071 1672 1964 1915 1061 -368 -1444 -1818 -1213 313 2217 3865 4719 4095 2376 -414 -3038 -4419
14729 -4419 -3833 -4137 -4195 -3542 -2856 -2479 -1127 -323 144 605 1496 1857 1851 1422 555 295 -86 -58 200 929 1134
14708 1134 774 -23 -651 -1310 -1920 -2945 -1609 40 1160 1476 1643 1039 -40 -1380 -2780 -4083 -4790 -4111
14690 -4111 -3220 -2273 -1772 -1404 -1392 -1392 -931 -307 621 1162 1360 929 -571 -2506 -3379 -2491 -1835 -422 -507 -1354
14670 -1354 -1657 -2040 -2507 -2662 -2063 -1354 -797 -198 -127 -564 -810 -1297 -1521 -1631 -1899 -2616 -3748 -4830 -3511
14651 -3511 -363 2490 5129 8110 9721 9734 7767 4814 1331 -2191 -3758 -1801 -124 1525 3093 4108
14635 4108 4286 3273 1269 -1063 -2646 -2459 -2423 -2717 -1890 267 2797 5275 6519 6196 4434 1611 -1317
14617 -1807 535 1775 1173 -622 -3393 -2756 -94 1562 2284 1950 570 -1310 -3022 -3128 -1475 -100 528 933
14599 933 1516 1712 1488 1830 2765 4198 6146 7486 7870 7075 5600 4301 4088 4390 4896 4828 4505 3778
14581 3778 2411 1306 305 -722 -1304 -1721 -1668 -1561 -1657 -1917 -2345 -2769 -2931 -2145 -1006 722 2290 3399
14563 3399 2883 2139 1266 176 -718 -1222 -1797 -2582 -2982 -2733 -2142 -2044 -2043 -1496 -317 997 2052 2987 3663 3549
14543 3549 2346 377 -1636 -348 2749 4979 5905 5281 3778 1434 -1585 -3937 -4678 -3245 -1247 563
14526 2592 3909 5217 5548 5580 4863 3602 1912 -254 -2324 -4967 -5694 -5144 -3525 -1204 939 2323 2646
14509 2646 2281 1755 1065 860 967 898 591 -188 -787 -460 674 2170 3430 4121 3938 2946 1135 -696 -1955
14490 -1955 -1805 -898 -534 -1118 -2632 -4129 -4346 -2211 -315 830 1814 2768 2985 2833 2026 827 -809 -2473
14472 -2473 -3932 -4723 -4620 -3985 -3569 -3507 -2858 -1947 -1292 -450 1051 2671 3608 3684 2999 1431 82 30 539
14453 539 1243 1166 233 -1025 -1933 -2133 -1664 -878 -797 -1154 -1884 -2250 -2561 -2380 -1483 -981 -1476 -3163 -4621
14434 -4621 -4903 -3637 -2731 -2175 -2431 -2029 -142 1804 3241 3592 2910 1636 -181 -2303 -1891 -606 355 810
14416 810 400 43 -125 -13 -110 -350 -872 -1513 -2202 -2625 -3110 -3113 -2631 -2154 -1666 -1174 -782 -135 862 1854 3274
14395 3274 4356 5275 5561 5026 4619 3544 2664 1492 173 -1750 -2537 -1366 -836 -1569 -2700 -3540 -4349
14378 -4349 -3952 -3237 -2717 -2380 -1774 -1477 -1253 -569 271 1252 2283 2905 3239 3260 3091 3188 3396 3313 2842 1991
14358 1991 881 -584 -2101 -3795 -4942 -4536 -3993 -3048 -2055 -1244 -395 312 1116 1891 2451 2611 2211 1923
14340 1923 1562 1261 893 256 -254 -616 -603 -776 -1079 -1561 -2152 -2893 -3349 -2968 -2074 -1367 -659 -254 85 301
14320 301 552 1470 1472 1275 628 -555 -148 618 789 292 163 67 382 668 472 208 -417 -320 -5 391 377 -296
14297 -1645 -2115 -1351 -270 -321 -353 -899 -2020 -3198 -4150 -4208 -3642 -3673 -4175 -4579 -3608 -1241 1591 4847 7203
14278 7203 8636 8585 7514 6118 4616 3429 2240 894 -631 -2429 -4358 -1803 887 3370 4919 6422
14262 6422 6762 6038 4993 3683 2471 1582 1521 1879 2332 2734 2538 2086 957 -1021 -2654 -2785 -1442 -474
14243 199 13 -515 -1274 -1407 -780 -629 -1108 -1681 -1313 -1115 -1219 -1096 -1261 -1844 -2274 -2561 -2744 -3048 -3955 -2889
14223 -2889 -1371 -453 221 388 -130 -1537 -2513 -2456 -1994 -1269 -1070 -1156 -1378 -1473 -2033 -2993 -3841 -2985 -2183 -1598
14203 -1598 -1587 -1757 -1433 -1228 -863 14 550 886 861 817 597 359 -87 -1295 -2233 -2300 -1883 -1781 -2119 -2511 -2878
14182 -2878 -2756 -2273 -1997 -2067 -2504 -2677 -2718 -2013 -2152 -2850 -3619 -4207 -4503 -3710 -2148 -6 2167 3469 3396 2692
14162 2692 2131 1462 -288 -2344 -3190 -2794 -2976 -3213 -3636 -3973 -4214 -4287 -4405 -4858 -3805 -2288 -785 514 1173
14143 1173 1068 526 247 386 439 523 731 -247 -1553 -1913 -882 294 1089 1296 1332 720 -96 -976 -1845 -2592
14123 -2592 -3209 -3470 -3131 -2518 -1423 -563 -219 -334 -1176 -1623 -595 831 2378 2509 1571 275 263 1764 3841
14104 3841 6310 7238 6755 5137 3489 1885 512 -81 19 825 1972 3124 3715 3743 3050 2150 964 -197
14085 -359 174 813 1779 3091 3989 4455 4425 4231 3692 2917 1665 15 -981 -566 853 1726 1898 1895 1326 835
14065 835 471 465 581 517 121 -470 -1605 -1013 407 1275 1682 1786 1935 1771 1146 -2 -1527 -3015 -3726 -1697
14044 -959 -1299 -1365 -1391 -1002 -240 724 1827 2637 2548 1675 411 221 788 1284 855 71 -1548 -3248 -2978 -1975
14024 -1975 -1360 -1443 -1827 -2536 -3191 -3755 -4199 -4492 -4593 -4353 -4018 -3601 -3227 -3102 -2755 -1389 -322 439 439 141
14003 -119 -647 -1093 -1050 -816 -965 -1355 -1728 -2101 -2331 -2468 -3057 -4301 -4947 -3827 -2992 -2323 -2233 -2486 -2749 -2240
13983 -2240 -1036 479 1484 1956 1810 1683 1592 1906 1837 1776 915 -326 -1831 -2043 -656 251 347 113 -119 90
13962 562 670 552 282 -266 -1271 -2324 -3048 -3376 -2958 -2347 -1359 -307 658 1182 1213 338 -1579 -2730 -711
13942 1516 2966 3611 3360 1792 -228 -2614 -2306 1228 4788 7831 9087 8658 6319 3133 549 -814
13925 -1413 -1883 -2185 -2695 -2306 -661 676 1460 1465 1360 1538 1345 626 -944 -2243 -3033 -2427 -1468 -637 -210 146
13904 397 187 -887 -2449 -2487 -1569 -309 825 1985 1990 1248 -539 -2647 -2853 -2048 -1179 -205 168 234 -161 -774
13884 -774 -1396 -976 -866 -684 -365 -226 -1175 -2998 -3885 -3223 -2186 -1052 -1592 -3024 -3819 -2194 -344 947
13865 1166 94 -2083 -4248 -3849 -2064 -1331 -1778 -2778 -2614 -1987 -1777 -1937 -2036 -2059 -1436 -687 73 545 808
13846 808 738 430 181 -308 -478 -539 -597 -610 -266 219 89 103 -637 -1892 -2483 -1144 1109 3916 5220 4217
13826 4217 2138 -424 -2327 -3347 -3952 -3654 -2670 -1628 -792 -573 -1225 -2688 -3897 -3636 -2993 -3204 -3410
13809 -3410 -2753 -1193 364 2226 3337 3859 3971 3962 4109 4424 4021 3171 1813 561 -164 -1010 -2144 -2502
13791 -2502 -1101 770 2342 3613 4171 3715 2434 404 -1418 -2174 -1949 -1010 579 1885 2467 2553 1803 945
13773 945 -33 -1400 -2312 -2540 -2595 -1887 -650 448 1265 1347 426 -1557 -2824 -2855 -2040 -1166 -822 -739 -125 1414
13752 3290 5307 6776 6978 6281 5159 3645 1751 809 685 1452 2561 4117 5902 7228 7686 7599 6688
13735 6688 5473 4510 3374 2200 918 -362 -1493 -2477 -3320 -3239 -2203 -1085 -200 427 564 71 -736 -1595
13717 -1595 -2653 -3316 -2822 -2419 -1772 -1031 -265 -16 -69 -516 -1838 -3932 -3276 -1434 104 1081 1235 931 786
13698 786 932 1100 1655 2653 2935 3066 2235 998 -814 -2811 -2794 -2233 -2913 -3037 -2043 -1328 -1280 -2033 -2835 -1698
13678 -1698 32 1468 2298 2877 3259 3582 3446 2909 2333 990 -83 -1338 -2162 -2374 -1909 -1002 -133 297 -476
13658 -1852 -2740 -1139 1179 2202 2118 1146 -221 -1847 -2395 -1029 105 698 957 1389 2207 3350 4483
13641 4483 4804 4240 3276 1345 -206 -639 -624 -859 -1081 -209 1121 1988 1791 666 -1453 -2903 -1265 -5 421
13621 -288 -1675 -2777 -2316 -2389 -2537 -2196 -1647 -1759 -2543 -2959 -1067 538 1765 1980 1386 340 -1054 -2168
13603 -2168 -2936 -2365 -1649 -1332 -1275 -1163 -880 -468 -94 145 623 1221 1282 1406 1656 1761 1530 886 -53 -1544
13583 -1544 -2406 -2888 -3037 -2437 -1649 -1159 -781 -277 -249 -668 -1275 -1635 -1845 -1727 -1266 -1527 -1527 -1762 -1800 -2060 -2031
13562 -2031 -1650 -1429 -1139 -1129 -1454 -1279 -316 838 2035 2789 2623 2747 2630 2535 2103 1405 818 195 562 1397
13542 1397 2428 3130 3157 2853 2308 1482 1239 1346 1126 450 -748 -2167 -3598 -2907 -2207 -2173 -2130 -1700 -1244
13523 -1244 -990 -1033 -1161 -1115 -330 681 939 -233 -2356 -4767 -3565 183 3369 5736 7013 7415 6032 3850
13505 3850 1777 55 -568 -498 -1009 -1743 -2331 -1641 -296 808 1444 1830 1679 1081 440 -145 -834 -1343 -2434
13486 -2434 -1923 -143 1940 3822 5621 7371 9232 10188 10959 10056 8302 5447 2741 420 -710 -1398 -1592
13469 -1592 -1678 -1451 -422 1192 2794 4197 4778 4484 3364 1741 -291 -2580 -5466 -4810 -2236 689 3247
13452 3247 5421 6921 7304 6922 5507 3884 3182 2952 2852 2929 2395 1533 661 54 -969 -1953 -2416 -1941 -1023
13433 -1023 105 1217 2504 4143 5510 5748 4693 3042 979 -1051 -2034 -1717 -1346 -1421 -1350 -743 -148 171
13414 -129 -1065 -2154 -2890 -1990 -724 334 186 -696 -2335 -3312 -2203 295 2200 3107 2987 2810 3142 3325
13396 3325 3241 2845 1541 -267 -1880 -1887 -663 420 1330 2655 3649 4290 4452 3897 2695 1062 -968 -3232
13378 -3232 -4065 -1611 669 2932 4702 6022 6753 6917 6969 7055 7209 6821 5583 3986 2449 812 -16 -1226
13360 -1226 -2092 -2396 -2487 -2500 -2519 -1973 -1762 -2155 -2628 -3211 -3936 -4067 -3516 -2883 -2399 -2166 -1627 -376 1151 2669
13340 2669 4458 6412 8028 8534 8002 6223 3527 839 -900 -546 -161 29 -379 -1224 -1591 -320 1721 3492
13322 3492 5176 5494 4475 3488 3120 3235 3040 2435 2080 1905 1905 1403 490 -1579 -3702 -2981 -1230 -137
13303 435 572 473 541 641 416 -422 -1294 -962 197 1572 2500 3070 3397 3212 3004 1156 -961 -2799 -4453
13284 -4453 -4856 -4045 -3123 -2390 -1939 -1401 -1139 -919 -370 135 328 -20 -729 -1550 -2703 -3701 -3300 -2414 -1210
13265 -1210 -325 -20 393 572 550 402 -399 -1570 -3350 -4405 -3595 -2766 -2208 -1864 -1665 -1559 -1541 -1585 -1860 -1450
13245 -1450 -1237 -1093 -1552 -2888 -4454 -3261 -1646 -470 56 -345 -1006 -1104 -1001 -419 824 1765 2220 2027 1450
13226 1450 328 -1216 -2615 -3766 -4747 -4274 -2744 -350 1126 1946 1809 470 -1236 -1625 780 2979 4764
13209 4764 5087 4338 2698 617 -1572 -2600 -2590 -1857 -555 978 2140 2741 2648 1587 74 -2052 -3297 -3603
13191 -3603 -3089 -2109 -830 -204 240 281 -223 -1032 -1932 -2442 -1489 -751 -347 -744 -1391 -1506 -1161 -757 -576 -634
13171 -634 614 1772 2805 3263 3062 1549 -922 -3218 -3801 -3286 -2472 -1967 -1620 -1385 -723 -291 -20 -74 -181
13152 -181 -509 -943 -1457 -1389 -740 150 1135 971 630 362 112 232 466 812 931 1088 2167 3506 4866
13133 4866 5737 5494 3997 1529 -1608 -2903 -445 1744 2584 2452 1594 756 -569 -1958 -2664 -2545 -2533 -2884
13115 -2884 -2565 -1332 -89 277 -718 -2420 -1645 1559 4556 5861 5357 3671 1267 -629 -1732 -1439 -2196
13098 -2196 -3156 -3159 -2007 -499 940 2024 3219 3992 3958 2753 1190 -241 -1134 -1720 -2067 -2188 -2042 -2475 -3313
13079 -3313 -4269 -4719 -3546 -2210 -1067 -424 424 782 632 193 -458 -1093 -1994 -3284 -4618 -4531 -2840 -654
13060 965 1827 2455 2648 1770 220 -1290 -2781 -2258 154 2509 3368 2717 1049 -894 -3175 -4107 -2468 -1685
13042 -1685 -1049 -1026 -1336 -1513 -1080 -111 769 1357 1537 2075 1764 1353 915 630 1090 2340 3253 3410 2723
13023 2723 953 -463 -353 1181 3050 5051 6482 6846 5748 4291 2149 -438 -2799 -3346 -1954 139
13006 2395 4300 5509 6732 7397 8443 9755 11258 12051 11937 10860 8538 5381 2357 617 33 -842
12989 -2279 -4091 -2928 -848 797 2133 2735 2351 720 -1207 -3762 -3562 -1382 309 1762 3065 3357 2953
12972 2953 1881 405 -2001 -3443 -2756 -2257 -2297 -2623 -2518 -1738 -1178 -875 -1183 -1633 -2180 -2788 -2954 -2787 -2074
12953 -2074 -1009 466 1776 2458 2668 2533 1899 774 -416 -1371 -1347 -563 362 1314 1868 2121 2281 1619 391
12933 -697 -1593 -1825 -1167 -973 -1256 -1954 -2731 -2075 118 3567 6376 7334 6615 5047 2380 -247 -1761 -1231
12915 -1231 -337 202 68 -42 -364 -1113 -2096 -2146 -312 1950 3342 3255 2318 489 -1575 -3503 -3618 -2905 -2388
12896 -2388 -2592 -3248 -3960 -4646 -5084 -4925 -4111 -2574 -1197 -281 385 -39 -701 -1575 -1612 -193 652 1416 1915
12877 1915 2917 4411 6223 7832 8504 7720 5630 2235 -1384 -2493 -239 932 646 -1002 -3294 -3566
12861 -3566 -2114 -1516 -1995 -2933 -3116 -1074 553 1297 1509 927 129 -315 -69 918 2765 4584 5898 5522
12843 5522 3277 852 -442 240 1083 1363 846 79 -437 -323 -99 338 456 359 179 -144 -513 -416 109 971
12823 971 1522 2263 2937 2927 2243 1453 560 -62 -420 -1432 -2242 -3476 -3652 -2670 -1887 -1429 -1100 -585 -87 62
12802 -211 -523 -673 -865 -1457 -1694 -1265 -1197 -1948 -2778 -3101 -2238 -1815 -1713 -1992 -2617 -3140 -3275 -2919 -2380 -1482
12782 -1482 -249 1203 2196 2425 2448 3595 5596 6736 7088 5264 2785 111 -2052 -3071 -2331 -1420 -587
12764 405 1236 1490 1039 103 -789 -1325 -1702 -1623 -1288 -1141 -601 339 1188 1517 601 -375 -1572 -1740 -1028 -460
12743 615 1517 1544 930 -653 -2473 -4146 -4636 -4007 -3293 -2877 -2647 -2657 -3028 -3542 -3618 -2654 -2418 -2296 -1659 -1715
12723 -1715 -2629 -3898 -4810 -4134 -3643 -2507 -1196 362 1837 2734 3215 3444 2895 1966 835 -494 -1837 -1260
12705 -1260 -918 -1535 -2969 -4336 -4210 -2499 -1413 -647 23 1480 2588 3212 3286 2836 1830 966 223 -76
12686 -344 -568 -539 -634 -328 -7 -228 -1167 -2397 -2052 -190 1383 2181 1790 420 -1106 -2747 -3295 -2655 -2378 -3237
12666 -3237 -4328 -4859 -3277 -1587 -370 443 500 -433 -1770 -1333 812 3208 4438 4626 4053 3208 2084
12649 2084 874 -704 -2397 -3388 -1959 -1006 -549 -138 98 482 814 1023 1336 1480 1980 2465 2352 1461 -473
12629 -2743 -2772 -260 2245 3457 3391 2033 -66 -2198 -3224 -3302 -2635 -1482 -127 1155 2263 2790 2426 1655
12611 1655 53 -1793 -3339 -3818 -2720 -1620 -524 360 1395 2028 2385 1886 670 -957 -2329 -3231 -1577
12593 -408 -129 -131 579 1916 3429 4978 6565 8353 9687 9838 8924 6883 3486 -265 -3101 -5172 -4131
12576 -4131 -3904 -4203 -2468 -612 986 2147 2843 3080 3291 2953 1848 688 -527 -963 -926 -1052 -935 -1190 -1711
12557 -1711 -3020 -4426 -2889 -680 813 1340 1246 291 -763 -1735 -2719 -3835 -4149 -3320 -2194 -1510 -1560 -1701
12539 -1701 -1350 -1364 -1930 -2631 -2049 124 1948 3058 3130 1886 -18 -1918 -1491 803 2168 2709 1832 678 -976
12519 -2029 -1874 -1396 -1033 -681 -114 533 1128 1145 689 -108 -755 -352 468 1669 2624 4260 5593 6794
12501 6794 7168 6601 4811 3382 2268 2353 3107 3800 3645 3195 3202 3870 4586 4502 3584 1749 -345 -892 274
12481 1797 2668 2858 2104 636 -725 -215 1922 3989 5435 6229 5049 2595 495 -945 114 1400 2075
12464 2075 2572 3408 3763 3689 2307 488 -489 -855 -282 1421 2644 3078 2490 1138 -437 -1494 -1022 945
12445 2483 3034 2833 2037 661 -654 -2112 -2586 -1618 -79 1094 1858 2652 3763 4354 822 2109 2876 2899 2647
12426 2647 2751 545 -1535 -4093 -6431 -4821 -4175 -5366 -5435 -1976 2716 6547 8931 9447 8037 5152
12410 5152 2306 951 1784 3309 3834 3071 1048 -1754 -3581 -2253 -625 747 1463 1138 1044 1244 1733 1469
12392 1469 852 -283 -1223 -2046 -2364 -2008 -1811 -1019 -117 723 1769 2527 3111 3355 2749 2456 1913 1217 -112
12372 -1710 -3142 -3896 -3643 -2590 -1361 -295 1159 2625 3486 3556 2441 191 -2053 -3307 -2466 -1338 -113
12354 1414 3376 5493 6936 8229 8301 6729 3672 522 -2879 -2234 -993 -1090 -983 -303 437 932 725 -208
12335 -839 -1614 -1868 -1671 -1227 -649 -631 -1089 -1472 -1335 -1444 -1545 -762 935 2536 3284 3768 3679 2346 285 -1449
12314 -2897 -3393 -2958 -2666 -3144 -3308 -3157 -2235 -1667 -1648 -2651 -4261 -3340 -2143 -1295 -1037 -1536 -2289 -2811 -2156
12295 -2156 -983 467 1610 2608 3216 3310 2774 1771 13 -1903 -3893 -4992 -3503 -1658 -365 848 1428 1531
12277 1531 1112 1 -2078 -3057 -2730 -2672 -3115 -4539 -3175 -1734 -565 -693 -1733 -3633 -5257 -4679 -3513 -2829
12259 -2829 -2174 -1455 -789 -347 162 266 42 1023 1725 2268 2332 1959 850 180 -781 -1514 -1467 -401 1248 2897
12239 2897 4467 5262 3742 2444 718 -291 577 2173 3220 3400 2689 1370 -1008 -2988 -3754 -2589
12223 -2589 -909 277 866 629 -286 -1712 -2821 -2580 -686 1380 2875 3216 2596 1242 -282 -1127 -779 481
12204 1795 2111 1559 314 -1091 -1965 -2144 -2161 -2096 -1787 -700 193 875 1064 660 -81 -438 -347 48 346 316 222
12183 222 223 363 988 2313 4201 6529 7960 8294 7472 5537 3372 708 -1975 -1927 460 1755 2419 2290
12165 2290 1150 88 -1211 -1778 -1851 -1257 -428 194 597 969 915 388 -244 -920 -1267 -543 438 1122 1326 1143
12145 1143 836 620 501 366 -321 -1754 -4004 -2369 290 2105 3093 3475 3731 3901 3719 2880 1257 -354
12126 -307 1701 4053 5536 6115 5753 4529 1930 -1884 -4591 131 4264 6712 6655 3974 -511 -1811
12110 -1811 1884 3766 4195 3005 1623 1516 3720 6107 7067 6991 5801 5298 4905 4214 2791 796 -1071
12092 -1698 -2086 -3067 -3314 -1143 954 1773 806 -1536 -2535 -177 1207 1659 1575 1239 434 -277 -1060 -1877 -2586
12073 -2586 -3834 -5688 -4848 -901 2668 4229 3087 1056 3213 8699 11644 8063 8867 30856 61145
12058 61145 92223 116791 130096 127887 110768 82727 50530 20957 4557 8477 10301 6577 1185
12044 -361 2772 5565 7043 5854 2666 -1026 -3528 -3175 -1105 258 1016 904 70 -713 -830 -141 476
12026 836 279 -896 -2396 -3366 -1335 -38 -383 -1138 -2082 -2377 -1755 -850 -662 -1841 -3775 -5644 -5555 -4467
12008 -4467 -3748 -3312 -2768 -2322 -2199 -2636 -3195 -3602 -3262 -2849 -2621 -2888 -3060 -2762 -2224 -1149 -710 -423 -274
11989 -274 -215 -579 -1985 -4378 -2665 576 2885 3504 1321 -3774 3036 13290 22892 30521 34409 33936
11973 33936 29945 24354 18331 13374 9088 4721 1604 -1062 -2171 -1585 -734 -232 -241 -534 -1283 -1958 -2926
11956 -2926 -3251 -2355 -1443 -708 137 1015 2587 4432 5706 6276 5755 4706 2684 233 -3057 -3409 -930
11938 1066 2224 2472 1662 28 -1421 -2316 -2425 -2110 -1733 -949 -114 129 -658 -2059 -3318 -2728 -1539 -821
11920 -821 -1356 -2736 -1665 672 1807 1458 14 -1385 -2100 -1833 -1251 -543 382 1016 1667 2506 3499 4230 3558
11901 3558 2100 730 317 896 1180 539 17 -205 -261 -279 -850 -1469 -1922 -2212 -1825 -1364 -746 -280 27 -351
11880 -1246 -2609 -4534 -3472 -1747 -509 129 334 170 -383 -1221 -1834 -2541 -3735 -4131 -2104 -150 1207
11862 1880 2083 2047 2025 2783 3745 4560 4534 4142 3062 2631 1926 843 -411 -1002 -363 342 128 -997 -2786 -4683
11842 -4683 -5423 -4464 -3635 -3111 -2902 -2936 -2251 -1315 -564 327 1000 1171 901 722 1224 1405 1476 1330 691 11
11821 -1504 -3235 -3572 -1346 -245 -745 -1964 -2512 -1938 -631 -192 -1034 -1987 -824 40 -1095 -629 5145 12019
11803 12019 17282 19144 17063 11190 6275 12555 27148 45073 63864 78841 86498 84223 71929
11790 71929 52410 29729 11766 9592 15461 17520 14002 7595 3828 3572 3804 3182 1054 -1493
11775 -1245 453 1746 2088 1296 757 486 250 -1152 -2605 -2937 -1929 -1033 -692 -1240 -1547 -1142 646 2696
11757 2696 3765 4148 4352 4456 4405 3636 1543 -1864 -3763 -553 1490 1949 1221 -258 -1650 -1888 -1445 -852
11739 -852 -309 288 569 808 531 -560 -1931 -2751 -2592 -2830 -3892 -4203 -1854 508 2307 3548 3007 1110
11720 -797 -2015 -2157 -1293 -126 977 1782 2237 2314 1799 938 -114 -1493 -1845 -495 940 1834 2566 3205 3714
11701 3714 4085 4593 3969 3259 2271 1097 -256 -1620 -2385 -1214 1621 4463 6700 7853 8506 8019 6749
11684 6749 4014 1303 -1375 -3335 -4654 -4278 -3247 -1915 -578 730 1481 2443 3067 3334 3079 1995 460
11666 -1798 -3577 -4336 -4889 -5228 -4088 -2940 -1380 96 851 1115 1348 1250 1554 1788 1410 536 -346 -991 -1162
11647 -1162 -816 -1312 -2832 -2296 173 2586 4429 5408 5337 3976 2226 539 -514 -1027 -1375 -1388 -351 708
11628 1353 1162 -24 -1468 -3387 -4286 -3246 -2240 -1757 -1170 -828 -684 -326 -685 -877 -929 -691 -222 531 1021
11609 1021 934 437 64 -578 -1222 -2003 -2508 -3015 -3113 -2816 -2429 -2003 -2147 -2902 -3251 -2045 -997 -533 -780 -2343
11589 -2343 -3764 -2552 -1205 -308 231 685 737 185 -171 13 301 622 1155 1646 1474 827 -283 -967 -1107
11570 -1107 -337 -649 -999 -3019 -5025 -3046 -698 541 3386 4151 3357 734 966 476 2163 4222 8123
11553 8123 9295 13393 10838 7995 2024 -1767 -5796 -6401 -2212 -81 149 121 -1489 -3294 -2772 -1020
11536 272 251 -1396 -3862 -3549 -97 1530 1022 -1364 -2613 -3268 -3914 -6156 -1931 4992 13447 18383 19505
11519 19505 15173 6670 -1592 6826 15115 16825 13710 7201 539 -973 3648 6449 4775 1621 -1779
11503 1070 6027 7901 6833 3586 -510 -4848 -5531 -3861 -3389 -3579 -3924 -3733 -3054 -2906 -2791 -2920 -3459
11486 -3459 -4568 -4850 -3129 -902 763 1058 -320 -1918 -1752 -469 1649 2792 2811 1819 57 -1748 -2562 -2835
11468 -2835 -3120 -4025 -3474 -2976 -2296 -1928 -2004 -1386 267 1553 2489 2162 803 -984 -2822 -2539 -1055 -350 -76
11448 -454 -1235 -2696 -4619 -3352 -437 1561 1890 769 -1766 -2968 -4391 -5043 -4993 -3930 -3206 -2076 -113
11430 1823 3471 4631 5299 4455 2457 -300 -2923 -4461 -3516 -2280 -1579 -1368 -1319 -1123 -1422 -1656 -1932 -1484
11412 -1484 -719 -433 -428 -733 -673 6 1267 2173 2346 1530 222 -1838 -3982 -2789 -1548 -1578 -2488 -3516 -4335
11393 -4335 -5121 -5349 -3417 -695 906 1573 1145 399 -924 -2252 -2367 -1497 -681 -363 -177 -432 -833 -1448 -1256
11374 -1256 -426 180 932 1756 2451 2812 2626 2401 1775 1027 -418 -1822 -2841 -3290 -3941 -3508 -2385 -1094
11355 -470 87 301 190 -97 -150 -351 -950 -1872 -3202 -2856 -292 1786 2896 2799 847 -3245 -1087 5884 13177
11336 13177 19518 23068 23450 20162 13936 6993 268 -2154 -61 1633 2145 1732 1195 1264 1773 3146 4110
11319 4110 5192 5808 5356 4290 2463 1405 1186 2013 3258 4180 4835 4384 2824 151 -3698 -1585 1121
11301 2545 2835 2387 1725 2563 3455 4340 4153 3218 1968 1170 1259 2376 2558 1747 85 -2508 -5146 -5580 -3397
11282 -3397 -2379 -2330 -2271 -2401 -2595 -3029 -3314 -2641 -2374 -2383 -2622 -3826 -4690 -4806 -4578 -4568 -4534 -3952 -3099 -2677 -3123
11261 -3123 -3828 -2825 -1621 292 1538 2565 2607 2543 2658 2349 1591 -244 -2454 -4101 -3529 -2672 -2770 -2533
11243 -2533 -2297 -2909 -2736 -612 3105 6088 7328 6843 5129 3526 2591 2576 2484 1806 1018 1703 2756 2711
11225 2711 117 -2866 1009 3751 3156 -248 -1293 1611 2559 10 -4776 572 3868 4649 3701 1579 -1782
11207 2052 10941 17004 14206 6646 12580 25293 28450 19744 27670 59109 78029 70848 109075 257744
11193 257744 470338 698084 891678 1007253 1016347 916860 733099 505641 287317 125896
11182 71721 80864 66593 32568 16855 29947 29550 18506 10284 13104 13345 6017 -4861 3913 8027
11168 8027 5831 1835 3170 7019 8029 7061 5033 3320 1979 1065 583 -88 -1215 -1130 22 1353 2266
11151 2266 3593 4712 5714 5176 3601 2611 3506 4665 5259 5211 5020 4830 4755 3992 2407 802 -534 -1239
11133 -1239 -536 135 221 400 1378 2394 3113 3465 3778 4513 5265 6074 5852 4760 2733 264 -2089 -3637
11115 -3637 -4873 -3926 -2439 -1732 -2822 -3524 -3270 -2746 -2755 -3453 -5135 -4341 -2677 -1710 -930 -142 367 365 -277
11095 -1946 -3956 -2880 -87 1926 2553 1324 -1263 -1645 1443 4642 6458 6379 4268 1557 -1632 -1873
11079 -1873 1605 4908 6439 5996 4015 1568 -726 -2413 -1999 -1209 -841 -1163 -1574 -2364 -3731 -2481 -648
11061 1551 3920 5667 6153 5359 3621 1885 864 -441 -1944 -3470 -4565 -3613 -2237 -1164 -1285 -1406
11045 -1406 -1353 -604 529 1453 2136 2022 763 -1347 -4886 -4409 -1050 1648 3044 3364 3100 2072 270 -1503
11026 -2732 -3141 -2928 -2341 -1923 -2266 -2468 -2276 -1869 -1183 -1186 -2220 -3370 -2985 -1636 -822 536 2000 2818 3205
11007 3205 2882 2322 1232 -895 -3838 -453 3392 5863 5991 3837 288 -825 1145 2622 2347 944 -639
10989 -1788 -2415 -3309 -4170 -1933 875 2580 3457 3479 4393 6266 8314 9759 10082 9600 8013 6125 4227
10972 4227 2498 1006 -39 -182 818 2521 4376 6355 7856 8972 8840 7348 4465 1472 -309 -80 398
10954 142 -683 -1556 -2440 -2944 -1315 718 1617 1290 -564 -2075 -2175 -1152 -987 -1557 -2452 -1667 62 1253 1646
10935 1646 1577 2926 3512 4014 4151 4065 3804 3555 3860 4479 5014 5102 4288 3066 780 -1351 -2696 -2344 -1481
10916 -1481 -1357 -1677 -1224 -12 745 909 897 1130 1765 2642 2712 1936 -514 -1084 1969 4792 7109 7577 5532
10897 5532 1492 -3416 -3517 85 3074 3612 3148 1440 -311 -1229 -1361 477 2869 5968 10130 15397 18810
10880 18810 19531 18781 14014 10448 6143 3646 2186 1046 -689 -1859 -4359 -5860 -277 3856 6190
10865 6190 6328 4648 1002 -2491 -4032 -1398 130 658 935 2049 3429 4236 4165 3122 1650 900 1317
10848 1317 2315 3063 3911 4252 3617 1847 -688 -2428 -3045 -2688 -3841 -4617 -2082 343 1600 1207 58 -3951
10829 -2744 3111 7859 12069 13748 13187 10686 5207 670 -2599 -1398 446 748 -211 -1747 -2412 -2998
10813 -2998 -3658 -3335 -2139 -954 402 1470 1139 -836 -4083 -4426 -2402 141 1438 2665 3051 3346 4324
10796 4324 4703 3667 1259 -1826 -4403 -2350 -1143 -2433 -4979 -5026 -1181 1233 1489 -170 -2342 -2298
10780 -2298 -1393 -642 -1052 -992 -347 -220 92 967 3593 4756 4202 2315 -732 -804 1879 3600 3869 2404
10762 2404 219 -3107 -6099 -2608 -295 -314 -144 2705 5720 6090 2944 -3130 -2968 4122 9334 10579
10746 10579 9134 4570 -22 2661 10949 17533 20474 18236 15140 16653 21581 26522 28521 32693 34819
10731 34819 36125 42071 60144 84388 106909 134421 188223 280670 403485 539395 668848
10720 668848 776001 848299 875505 851652 775866 655425 506688 355603 230659 154770
10710 154770 125789 108896 85939 62013 47430 39740 29644 21875 21107 25648 26456 20829 12655
10697 12655 9155 11020 12922 11526 6263 758 4232 11512 14714 12816 7012 977 1716 3696 1813
10681 -3069 -2245 1703 4171 4899 4269 3031 1215 -1607 -1283 1628 3180 2784 1385 1187 3952 7221
10665 7221 8887 7745 3988 -683 -3161 -236 1032 802 -445 -1294 -872 -541 -815 -1157 -1601 -1634 -1537 -1652
10647 -1652 -1666 -1048 702 2045 2497 1863 557 516 2206 4860 7493 9329 10249 9685 7902 4934 2190
10629 674 807 1564 1842 1056 -809 -2758 -2940 -1382 -25 760 796 737 214 -978 -2586 -3373 -2698 -1581 -360
10609 487 1058 986 -80 -1817 -4116 -5421 -2600 -690 -705 -2082 -3380 -2758 -1509 -238 344 265 -13 -371 -2867
10590 -2867 -2165 -1322 647 1737 2044 1963 1123 -519 -694 1233 3955 6530 7511 6176 2810 -1180 -3959
10573 -3959 -5631 -5044 -2498 -604 989 1540 701 -1828 -3832 -1746 489 1990 2187 871 -1529 -3982 -2656
10556 -2656 -241 1957 3590 4633 4594 3351 2448 1440 906 930 1469 1991 2044 1411 64 -1680 -1883 40 2004
10537 2004 3391 4364 3847 1889 -1012 -5933 -2033 944 1979 1526 265 -804 -281 390 192 -906 -2455
10520 -2455 -3951 -5552 -6685 -6287 -4452 -3727 -2809 -3069 -3622 -3888 -3192 -2702 -2650 -2683 -3307 -4412 -7008 -4221
10502 -4221 -1130 1284 2308 1935 640 -1545 -3809 -2554 -1255 -1490 -3884 -2434 -1228 -850 -2539 -4512
10486 -4512 -3440 -852 -17 333 251 -149 -920 -1618 -2710 -3882 -3509 -2495 -1829 -1490 -1787 -1320 -597 988 1997
10467 1997 3366 4907 6490 6611 5254 2940 314 -1526 -2174 -1662 -1886 -1847 -954 21 102 -982 -2635 -4204
10449 -4204 -3351 -1729 111 1221 1310 208 -1439 -2959 -2182 -852 -165 155 32 30 619 869 1113 1631 1899
10430 1899 1430 233 -1235 -2090 -992 -176 -492 -1810 -3430 -3101 -1026 995 2488 3211 3377 2880 1703
10413 1703 -85 -1307 -1386 -511 210 834 2360 4629 6630 7420 6126 3290 -689 -5107 -3093 -1295 -733
10396 -733 -660 -472 -103 3030 14019 31645 53355 74487 90544 98669 96429 84747 65853 43863
10382 43863 22089 5178 -2279 1692 3354 3152 1291 -973 -3711 -3430 -1501 -342 -369 -1734 -3268 -3657
10366 -3657 -2633 -1122 -888 -1732 -2713 -1941 -271 1176 2114 3199 4041 4673 4417 3448 1592 -1062 -4541
10349 -4541 -3599 -2433 -1021 140 1390 2572 4366 5303 5754 5703 5019 4721 5522 5703 5100 3542 1834
10332 1834 -941 -2882 -2153 242 1127 355 -1247 -3024 -1136 1506 2895 2922 1224 -1717 -3886 -1340
10315 -421 -1713 -2960 887 4695 6003 4000 471 -3819 -5259 -3108 1154 5723 6512 8442 19629
10300 19629 32692 34219 46031 128765 276122 470470 687951 890615 1043140 1112961 1087411
10289 1087411 971538 788586 574004 365371 192923 76411 31154 31476 26366 17471 11698
10278 11698 7035 -317 -4392 -619 307 -2106 -2006 428 932 115 -579 399 1656 1789 1247 -275 -1985
10261 -1985 -3267 -3020 -2645 -2804 -2542 -2295 -2316 -2728 -3248 -2641 -1090 1051 1927 1024 -888 -2776 -3970 -4881
10243 -4881 -3934 4760 16471 31889 41945 44283 43026 49294 67082 92301 116596 135735 146504
10230 146504 148703 148224 149796 156650 162137 157047 138418 107060 67518 29376 994 8098 15691 11767
10216 11767 2443 -2994 463 2108 -784 -4637 -5724 -3241 -2449 -2014 -1672 -523 3167 7673 11306 12912
10200 12912 12217 9495 5674 2112 -655 -2267 -1729 529 3446 6634 9592 11552 12916 15566 19924
10185 19924 24747 27939 27874 25688 20992 15976 9434 5206 2058 -131 -2038 -3499 -5560 -2865 -612
10169 939 1854 2649 2624 2482 1939 1633 2627 3856 4122 2164 1561 -465 -1910 -2116 -269 1643 3409 3654
10151 3654 2689 1071 -1124 -2154 -948 348 1303 2789 3320 1697 -333 -1546 -2878 -4445 -5354 -4508 -2763
10134 -2763 -914 1022 2168 2175 1508 414 -199 -11 544 1323 1598 1475 1586 1030 -749 -3827 -3994 -3174 -2122
10115 -2122 -1378 -1265 -2140 -3655 -4909 -5472 -4793 -4372 -3363 -2230 -793 813 906 234 -1400 -4129 -3317 5842
10096 19742 33910 46362 54983 57314 58040 54808 56159 64775 74380 86274 93581 94114 87691 76257
10082 76257 61623 50044 51634 65174 82588 92482 87439 60532 11259 43923 123730 201378
10070 201378 265919 305247 313096 292038 245792 185920 123027 71728 38583 27568 23584 17747
10058 17747 8657 1204 -1716 -213 1223 1852 2187 1285 -98 -2068 -3451 -4432 -5693 -5487 -4415 -2848
10042 -2848 -1404 535 2510 4460 6610 6775 6503 4446 3873 2725 2766 2231 1897 1421 2719 4548 5298
10025 5298 2988 -1637 -7647 -11567 -10547 -6049 -5439 -6432 -7924 -5935 -2612 -923 -356 -405 -1255 -1991 -4826
10008 -4826 -4929 -4111 -2358 -1614 -1871 -3645 -8404 -6906 -5226 -1179 -5141 -4162 -3812 1295 3172 1722
9992 1722 3575 2064 -15622 -17476 -17500 -11313 -5747 5666 6983 17087 28710 46411 69127 89382
9978 89382 102011 104977 98266 85212 66401 46331 29098 15827 8660 3461 -1528 -4806 -3538
9965 -3538 -1381 -62 1471 605 -52 -1413 -3275 -4366 -3607 -2125 -1525 -2350 -2900 -4237 -4789 -4159 -2920 -2568
9947 -2568 -2380 -2102 -1108 569 2857 4875 6425 6552 5303 3774 2236 556 517 588 1217 923 489 -295
9928 -698 -1013 -1391 -1950 -2396 -1849 -1373 -1230 -2243 -3736 -4065 -2085 -113 1431 2350 2259 607 -1819 -2633 -863
9908 464 914 442 -962 -1951 -1821 -1835 -2380 -3654 -4673 -3074 -1380 -578 -784 -1836 -1844 -562 404 -175 -1039
9889 -1039 -2002 -3215 -3953 -4260 -4697 -4730 -3419 -2463 -1141 -402 713 1451 2418 3109 3225 1205 -3729 813
9870 8869 15842 20297 22067 19493 14503 10569 12146 16306 20958 19879 16168 8890 2877 -491 -160
9854 1682 2240 1869 174 94 932 1172 741 -10 -1789 -3249 -3132 -3637 -4852 -3348 643 5946 10134 13006
9836 13006 12909 10811 8288 5108 598 -2117 -3731 -4383 -3572 -3838 -5620 -7779 -4604 -1788 635 2129
9820 2129 2989 3670 4468 4114 4245 3525 2799 1258 508 341 -2 -345 -440 -106 466 1275 2181 3175 2982 1439
9799 -381 -1992 -3090 -1614 -136 -458 1871 8540 18515 29231 38976 44679 45086 40345 31531 20358
9784 20358 7876 -2399 -479 3633 4453 3183 979 -1620 -3473 -1430 1826 4134 4362 3125 1132 1239
9768 1239 3124 3840 3818 4227 1864 -2382 -7551 -4061 -751 -165 180 81 612 3084 5158 5115 3711 -96
9749 -4198 -3236 448 3810 6041 7723 8489 8535 7645 5554 2550 -634 -2840 -3808 -3807 -3411 -2473 1701 9650
9731 9650 18395 25829 31124 32478 28419 21265 10766 -1733 3071 10149 13593 13898 11981 8454 4751
9716 4751 1733 -41 -1113 -1870 -2583 -2469 -343 2324 4722 6932 7253 4904 1337 -1306 1719 6118 8405
9699 8405 8103 7603 6427 4446 2572 1070 -290 -1392 -2508 -3079 -4015 -4151 -3543 -3239 -3539 -4102 -4781 -5951
9681 -5951 -5075 -3086 -1114 356 2042 3599 4289 4316 4352 3902 3553 2974 2576 1670 1203 2063 3734 4756
9663 4756 4473 3488 1687 259 -734 -1306 -1627 -1765 -1997 -2475 -2908 -3206 -2467 -1570 -1522 -1294 -854 75 1069 1949
9643 1949 2470 2372 1838 1155 562 533 1112 2703 4840 7109 8449 8946 8175 6859 5567 5381 6888 8448
9625 8448 9346 9325 7648 5116 2223 164 -1014 -1573 -1628 -1611 -2070 -3240 -3407 -1185 1019 2500 2910 2806
9607 2806 3057 3835 4631 4400 2649 -231 -1400 -55 1508 1132 -1134 -2148 -77 3599 6879 9165 9406 8617
9589 8617 6444 3805 878 -1594 -2456 -557 1515 1879 1534 401 824 2936 4556 4202 1381 -2357 -2922
9572 -2922 -578 1281 1345 663 548 1242 2006 1847 1173 830 598 205 -50 -661 -1742 -3208 -4031 -4078 -3742 -2908
9552 -2908 -957 2593 8056 11303 12602 10010 8549 4158 -182 -4067 -5293 -3851 -2255 -1137 -449 -205
9535 -88 -798 -1384 -1106 -868 -2101 -4817 -2535 3111 7644 7677 -49 -1587 13473 31645 42699 42051 27040
9518 27040 10476 37030 100218 155925 205504 241991 261904 260818 242624 210596 171963 129286
9506 129286 88751 55545 31744 17497 8997 2566 -5856 -6879 -2069 1065 159 -2952 -5176 -4217
9492 -4217 -3239 -1766 -1797 -1445 -531 -2513 -339 2773 5139 9401 15898 18462 18072 15499 8722 867 -1156
9474 1179 6915 8927 10064 11302 12453 15167 13429 17078 23871 29125 33218 34304 31562 22005 14264
9459 14264 7040 771 -211 -599 1707 3387 5956 5824 6027 13730 24807 36106 45257 48636 45722
9444 45722 37511 25526 12726 2175 -3178 -2045 -687 -360 -1393 -3203 -4742 -7947 -6895 -2866 3574
9428 10380 15164 16261 11918 3781 -2634 -9101 -6429 2292 5682 4495 3156 13869 27533 38587
9414 38587 66343 142232 256971 429078 627990 805017 940468 1007404 993344 900330 747355
9403 747355 562316 376921 218486 104440 45350 32442 25844 13096 -370 -5316 -582 -449
9391 -449 175 -277 -2116 -5499 -7305 -4719 -4100 -4522 -4950 -4606 -3895 -3072 -3171 -3656 -4871 -6604 -6091 -4101
9373 -4101 -2553 -1609 -1253 -1684 -2300 -3548 -3807 -4007 -3650 -3383 -2578 -1536 -661 755 1185 1014 427 -1064
9354 -2745 -3097 -2666 -2597 -4111 -5479 -5831 -6180 -5755 -3345 -382 2530 4652 5322 4424 2641 -575 -3490 -5253
9336 -5253 -6189 -5934 -4638 -3336 -1743 -559 -404 -1204 -3083 -4229 -2734 -532 1161 2890 4318 5333
9320 5333 6177 5974 4531 2318 30 -1928 -3160 -2667 -1885 -1512 -1707 -2727 -3454 -2696 -1059 675 1870 2703
9302 2703 2436 1497 -343 -3010 -4825 -1874 268 1449 1985 2169 2238 2161 2153 1647 619 -1211 -3005 -1213 558
9282 1579 1413 234 -1974 -3639 -2709 -1568 -1572 -2176 -2263 -1045 433 1079 925 573 -16 -519 -1211 -1694 -1666 -1092
9262 -1092 -637 -665 -1125 -2114 -3611 -4489 -4078 -2356 -974 -165 -307 -268 394 1059 1051 309 -80 -255 -17 898 2544
9241 2544 3954 4296 3892 2968 1712 -338 -3122 -2914 -386 1479 2219 1962 462 -1717 -4010 -3061 -817 597
9222 787 108 -866 -1709 -1896 -1822 -1126 612 2002 2230 671 -1880 -3606 -580 1955 3923 3865 1162 -560 -1619
9203 -1619 -1994 -399 60 1308 -371 -19373 -2858 -356 -292 -988 -2323 -3927 -5542 -5181 -4268 -3634 -3301 -2308
9185 -2308 -1652 -1620 -5575 -10284 -9752 -8308 -6618 -4683 -4157 -3801 -3849 -3136 -2741 -2551 -2712 -2039 -1721 -842 -1042
9166 -1042 -994 -890 -696 -312 753 2000 3395 4515 4821 3986 1458 -2257 -4657 -2696 -1922 -2420 -3300 -4077
9148 -4077 -3866 -3685 -3045 -2412 -829 516 1216 1208 833 -451 -2526 -4027 -2884 -1255 20 562 744 418 -446
9128 -1640 -2536 -2337 -1394 -116 -7 -1188 -3099 -3508 -1717 -24 546 1154 1660 1751 1006 -492 -2609 -5110 -4646
9109 -4646 -3424 -2457 -2134 -2019 -1709 -881 23 838 1717 2412 2773 2631 703 -2134 -4427 -3349 -792 1151
9090 2136 2626 2701 2571 1894 815 -88 -895 -792 -740 -297 -142 1071 3124 5591 7649 8618 7985 6021 2951
9070 -648 -3072 -2688 -1718 -1362 -1444 -1114 -449 -1028 -1045 -246 1118 3076 4704 4994 3878 2248 1201 686
9052 686 524 725 1108 1105 1196 1360 1450 1870 1682 949 334 584 2086 3051 3131 2238 1016 86 -988 -2055 -3090
9031 -3090 -2745 -1152 382 1139 1612 1940 1840 1169 -219 -2039 -2841 -1732 359 2289 3931 5237 5578 4843
9013 4843 3152 1401 -78 -1607 -2235 -3329 -4076 -3933 -3752 -3456 -3071 -2722 -3857 -6010 -6641 -5322 -4244
8996 -4244 -4909 -6660 -3686 -979 551 113 -1908 -3576 -3067 -2238 -2569 -4080 -2178 1842 5227 7226 7052
8979 7052 3754 -1568 -4286 486 6814 11688 14521 15235 14179 11648 8600 5610 3507 2076 904 356
8962 405 822 1176 683 -130 -1496 -2603 -3251 -2378 -1540 -1023 -956 -975 -610 -539 -928 -1229 -1089 -795 -687 -909
8942 -909 -1701 -2067 -1699 -1028 -658 -291 -13 -103 -961 -1771 -2731 -735 1487 2517 2439 1079 -494 -1015 -318 1243
8921 1820 2307 2916 3355 3283 2387 1514 834 831 1124 1363 966 526 57 -395 -875 -1718 -2024 -1464 -1253 -1852 -3156
8900 -3156 -3712 -2250 -710 29 547 1042 1271 1194 753 -32 -687 -924 -1614 -1635 -94 1236 1960 1440 499 -358 -1073
8879 -1073 -2429 -5242 -3138 -329 1992 3173 3134 1844 482 305 1456 2267 3027 3109 2006 621 -526 -683
8861 -683 -383 -167 264 -460 -1991 -3537 -2909 -1353 115 720 647 75 -669 -1198 -1606 -2404 -4071 -5819 -3642
8842 -3642 -718 2495 4705 5363 4407 3226 2088 1171 1305 2431 4322 5403 4785 2626 930 -1022 -2992
8825 -2992 -3696 -3517 -3714 -3782 -3608 -2808 -1812 -980 -248 -230 -900 -1983 -3195 -2962 -2430 -2755 -3893 -4351 -3463
8806 -3463 -2834 -3048 -3426 -2552 -1721 -1422 -1431 -1520 -1492 -1958 -1803 -170 2044 2972 2457 1005 -671 -1017 -1188 -1084
8786 -1084 -718 -469 -1088 -2436 -2493 -1545 -1051 -1614 -2847 -2308 538 3519 5996 7789 8974 9267 9674 8221
8768 8221 6432 4854 3602 2875 2048 481 188 2891 6688 10078 10264 6643 1545 -2676 -2587 -1036 -874
8751 -874 -4591 -5844 -6335 -4414 -1305 619 -1610 -7197 -18117 -21886 -13881 -3747 -462 730 -7668 -11034
8735 -11034 13318 39857 51625 53201 39593 15707 5948 26398 54424 87502 95917 107491
8723 107491 122695 93662 55971 101985 146243 161120 179777 187795 201235 203729 203600 180543
8711 180543 149082 112934 96994 60890 43368 3019 -15468 11775 25725 35648 36707 30663
8699 30663 30514 23584 11342 23006 6893 8338 5563 3529 427 -7127 -7430 -7231 -3504 -1219 -217
8683 1555 2637 4246 3122 540 -1382 -2312 328 3816 5526 4551 394 -6140 -3167 699 2138 2768 7220
8666 7220 12797 15925 18421 31839 67150 113578 160027 186714 191798 187996 171347 135587 86638
8653 86638 46416 23370 19936 19503 12892 1546 -756 2454 2900 746 434 2295 1942 -1320 -5781 -7071
8637 -7071 -6197 -2554 -117 3938 7110 8393 7376 4431 606 -2742 -3417 -2837 -2059 -1496 -1489 -1968 -2603 -1345
8619 -1345 1289 3659 4437 3888 2009 756 703 1453 1150 -261 -3235 -3428 -796 582 421 -789 -1582 426 1902
8600 1902 2483 1709 659 -141 1260 3373 5777 6773 5529 2360 -2397 -4860 -2315 1630 4793 6071
8584 6071 6130 5274 3768 1444 -1160 -2241 -1259 67 1315 1250 623 -182 -1028 -1277 -1159 -913 -653 -398 -983
8565 -983 -2684 -4914 -5347 -4072 -3797 -4764 -6628 -4502 -2552 -1259 -1136 -1378 -1828 -1908 -1870 -1913 -1551 -1197 -950
8546 -950 -450 -739 -1488 -1993 -62 2254 3788 3671 2004 -618 -3472 -4372 -4145 -4346 -3836 -2321 -382 826 239
8526 -1270 -2141 -1385 -758 -682 -287 873 1460 1061 -1815 -5452 -736 4407 7944 8242 4192 1016 -4784 -7241
8508 -7241 -6890 -5186 -2594 -345 1181 2045 2025 864 -649 -1068 342 1980 3780 4294 3689 2089 -483 -3204
8490 -3204 -2417 72 1290 1384 1210 1461 2729 5199 8688 12628 15073 15716 13702 10204 5695 2039 -39
8472 -87 363 1079 305 -619 -1077 -2146 -3757 -4817 -4744 -4778 -3361 -1116 1103 2275 1982 318 -2457 -5489
8454 -5489 -4634 -2584 -384 1404 2070 1482 -730 -3737 -6675 -3295 -1518 -1059 -1501 -2909 -4054 -5265 -5288
8437 -5288 -4300 -3134 -2383 -2062 -2513 -2962 -1339 875 2222 2349 1160 -1358 -3039 -2089 -1133 -1799 -3910
8420 -3910 -4515 -2253 103 1572 2416 2146 981 -1025 -3083 -5044 -3378 -1999 -525 899 -335 -2147 -3913
8403 -3913 -3474 -2796 -3969 -6930 -2441 1398 3375 2990 -250 -1539 2518 4903 3560 -883 -6299 670
8386 7880 12405 12839 8232 -640 -7154 2126 6813 7402 3221 1732 5776 8740 21635 28466 33325
8371 33325 36647 38334 43739 53464 68234 85227 102610 122708 145805 170791 193259 207644 210747
8358 210747 202442 186329 166993 146916 125902 103430 80794 63554 51769 44063 37690 32232
8346 32232 29666 28038 26794 25976 22644 18486 11679 5564 4194 2958 4200 3150 2569 2271 235 -4635
8329 -3452 2451 5985 5950 4160 2881 2418 567 -1806 -2443 -1761 -1098 -1709 -969 -418 -1041 -760 1773 4222
8311 4222 4322 1726 -2258 -3648 -1659 -2138 -3611 -2482 838 2813 2647 944 -959 -1996 -2863 -5123 -6147
8294 -6147 -1499 1500 1960 30 -2145 -1191 494 123 -1473 -3947 -4137 -3432 -2807 -1607 44 575 -704 -2329
8276 -2329 -1694 276 2082 2520 1841 -255 -2786 -5353 -6306 -5664 -4654 -3297 -2688 -2982 -2520 -557 2491 3889
8258 3889 2968 177 -3323 -5603 -4405 -2793 -227 2907 5164 5200 2746 -1987 -4675 524 5900 9861
8242 9861 11059 8494 4889 1081 -1402 -1264 17 1532 2494 3457 4973 6762 7131 5395 951 -5611 1180
8224 15057 28543 39819 48078 51658 51270 45628 37054 25840 13127 -137 -5627 4483 13118 20236
8210 20236 22638 19504 17017 15276 18212 23328 28758 31840 31456 27531 21054 13979 6252 79 -515 3957
8193 8959 11548 10316 8033 5440 3915 2802 678 -2546 -3712 -1031 -473 -1799 -1753 357 -630 -2325
8177 -2325 -7095 -6417 -891 6466 14905 22825 30456 35392 37536 36513 32506 26316 18420 9272 675 -1847
8160 1667 3654 3467 2902 2558 2101 1264 -1355 -4755 -2634 1459 5617 8542 10452 13343 19203 28003
8144 28003 37355 45498 51252 54081 54015 50562 43538 33826 21347 8268 -3272 279 8844 13276 13364 10657
8128 10657 5195 233 208 3194 4406 4317 3016 2200 2881 4685 6575 6993 6568 6037 5941 5962 6264 5996 5505
8109 5505 4817 4877 5354 7925 9938 10693 10351 8612 4907 -91 -350 6127 14406 23327 31383 33795 36487
8092 36487 37179 30658 22720 16533 11923 4330 242 7208 20072 30422 36740 39243 38850 37138 33332
8077 33332 27009 19577 10158 455 -6393 -1799 -2050 -1252 6228 13876 17013 15883 14238 17321 19925
8062 19925 15183 11558 28482 52033 73533 91811 125236 194030 292121 397340 487892 543590
8050 543590 551993 511385 431498 329382 225498 141387 91321 69568 55683 35298 13554
8038 7813 16515 21823 20858 18720 17987 18525 18728 17268 13600 10936 16264 31598 48529 60759 67116
8023 67116 67865 67968 69031 66453 58159 44909 32743 29541 31687 29819 20268 14311 17936 25533 35896
8008 35896 49105 60217 63215 62560 68237 84339 99800 119889 156273 202005 251401 340945 534899
7995 534899 842139 1211446 1565375 1826386 1949601 1890908 1671057 1344254 978940 642501
7985 642501 378790 191445 56130 55525 140999 192577 201317 174814 133935 103560 88827 76566
7973 76566 59903 44006 35730 34279 33786 32513 29681 23763 14995 8686 7343 4875 2206 4922
7959 4922 11729 16469 13362 6624 -158 -2176 -1947 527 3646 3926 370 -7237 -5812 3445 11135 11986
7943 11986 6228 3403 2241 10327 1798 -1280 1788 6479 6648 10113 28113 54429 81327 103446
7929 103446 117685 122014 87057 79848 62955 33781 10287 -715 3944 4341 -2557 -10608 -7390 -1749
7914 209 2005 4225 4660 2375 -265 1089 4384 6198 4707 2689 -2047 -4194 -4352 -8042 -15238 -8403
7898 -8403 2855 9271 8295 2501 -4712 -2919 1165 4040 3740 4450 4546 6093 8961 12851 17753 23898
7882 23898 30834 39795 48478 53219 49394 38161 18723 -2875 -11801 602 13453 19872 19514 13232
7868 13232 8802 5898 6548 8908 8297 5189 526 -2699 -6890 -4961 -1196 -259 4670 3183 -4162 -4961
7852 -4961 3880 12146 20367 26628 31942 39276 43482 43472 38798 30733 23226 19372 34836 32155 31783
7837 31783 31419 32551 31345 29206 20329 17922 20089 13514 9129 7731 8200 9158 7594 3950 -3654
7821 -411 6720 14695 18141 19634 24085 28792 39699 60472 102142 154236 204675 243726 261986
7808 261986 255928 226725 180622 125584 74657 39315 26929 26979 24216 16877 13026 17393 26909
7795 26909 35491 40236 38267 33908 31298 29355 28462 26174 20176 8636 84 -7826 -8769 -7716 -2834 5341
7778 14264 12755 8783 16054 12667 32148 32437 31967 32197 35229 37494 24659 21945 27387 27514 19821
7763 19821 7482 -1990 7392 32878 62499 84240 88676 80299 60640 32350 13590 4048 -10344
7749 -14722 -16067 -9937 -4051 -742 -1445 -7997 -16684 -7487 2750 8951 16571 21614 20633 14807 6502
7733 -4804 -9116 4197 17654 25335 27113 22836 14207 4775 -2015 -5124 489 3260 4436 5344 5544
7718 5544 3888 947 279 3590 5999 2999 -2462 1948 10019 12915 9921 3567 4719 11691 15596
7703 15596 14408 8493 -1592 -7674 4240 13280 17357 17788 15234 11837 4925 -5276 940 14669 22863
7688 22863 21747 14426 5897 7054 17616 27305 32668 31263 24212 17327 18893 22101 21297 20458 24030
7673 24030 28784 29594 27488 26111 27044 28825 36035 46547 51691 49940 47853 51517 57265 57203 43216
7658 43216 35910 22567 2776 -3901 21862 46398 66291 88007 111410 117811 92931 70058 101252
7645 101252 140738 152652 153229 195571 239571 241768 199474 210311 290689 336545 344830 481151
7633 481151 733784 915541 947993 1193691 2217604 3886662 5879974 7881324 9589898
7624 9589898 10756027 11212372 10891367 9834941 8190400 6199411 4164672 2408768 1266594
7615 1266594 957035 949582 790044 534275 383132 384474 366436 283225 216285 220751 225985
7604 225985 183495 117977 69063 60306 69654 95633 124251 133129 116805 88127 68462 61439
7592 61439 60103 66746 80015 88547 85129 75266 65610 52316 34978 26121 44004 63066 69022
7579 69022 64891 63362 66584 66375 66255 80833 104329 116694 108080 90491 91940 110377 107470 59044
7565 59044 53501 199847 374655 539120 659650 713451 689449 593519 448522 289822 155697
7554 155697 88393 82467 75023 56053 46758 48623 45775 37940 40184 47810 43554 20313 -3045 40146
7539 79317 107539 123408 131848 137499 138592 128617 103499 69325 44136 41679 41821 29581 5243
7525 -4 18232 25796 26166 26017 27039 25575 22916 18829 9409 -5098 6653 25248 35065 32674 24560 20937
7509 20937 24387 28824 33720 37944 35397 22819 3285 2875 12578 18224 23384 29348 30917 21752 2614
7493 5185 23217 29077 24208 20067 16874 9210 -2634 15688 36586 45072 41842 33470 27580 23438
7479 23438 21451 27016 34165 33210 23976 22312 32248 36918 30448 22207 23866 24296 12582 246 11856
7464 11856 15740 3175 -1107 21499 34697 35195 37415 49200 54910 44003 19680 6890 17493
7451 17493 16880 13820 24294 29809 23833 35854 69836 93069 93654 72594 53252 57855 66177 62935
7437 62935 55831 51229 40746 20505 21252 41267 45954 28136 -556 11145 27880 39794 54993
7424 54993 64154 50771 20813 34347 66483 76801 56557 22633 23602 53091 62650 56980 49260
7411 49260 56939 87278 121227 138665 122430 73648 24530 49539 71939 57831 24093 39625
7399 39625 61666 53267 35308 58268 79557 63717 34402 68256 105848 100507 56521 35358
7387 35358 70425 84551 76992 88732 107041 91109 46214 55410 99128 97814 44532 40304 102763
7374 102763 115723 75243 56445 105369 117474 71509 34306 100299 131575 106165 83548 112142
7362 112142 118331 53418 10430 101924 135846 89790 62319 153270 194835 144380 68354 138060
7350 138060 194556 153117 73967 156599 231702 204725 116508 151611 216910 171290 16395 132183
7338 132183 239636 211309 120751 219857 328207 288777 121913 193408 353782 338248 170589
7327 170589 219988 408756 415549 219535 211306 444666 473934 263880 245555 533142 594889
7316 594889 358974 265582 606497 698649 425829 314548 766849 929631 622806 365105
7306 365105 901904 1155035 809453 429528 1133640 1521710 1137085 602351 1506048 2099223
7296 2099223 1651646 783803 2088618 3113709 2644130 1278559 3000210 4779928 4308611
7287 4308611 2073614 4910084 8499652 8340249 4325308 9801589 19131125 21437869
7279 21437869 12908277 32306876 85005390 152183452 220883156 276616677 306721210
7272 306721210 304128183 269483565 210933776 141672902 76128547 26949748 14421738
7265 14421738 21569327 17736239 8193138 4832223 8583372 8011454 4181947 2357819
7257 2357819 4521003 4566043 2578106 1344301 2768570 2991472 1827782 854994 1795370
7248 1795370 2050514 1319117 525157 1221810 1501717 1028501 426502 892042 1141759 836611
7238 836611 338751 650321 896456 702208 294749 447238 644819 496354 184214 397416
7228 397416 600022 505911 202417 250233 458978 429064 222898 234221 394958 378730 191810
7217 191810 151891 330668 351542 207966 178137 457686 706254 854726 914998 905002 848494
7206 848494 770256 676041 563507 401642 198602 79158 171296 207286 151304 80898 137816
7195 137816 187250 169962 148694 176079 193689 126482 13995 86891 159338 133071 97520 155811
7183 155811 200930 165693 127533 230813 306057 255236 186899 307803 409216 357595 278164
7172 278164 417323 560491 486608 277693 382250 588081 543928 338912 527276 815523
7162 815523 768175 513108 812469 1271804 1236941 826514 1039181 1707234 1840297 1314132
7152 1314132 1508334 2606841 2899629 2055640 2382833 4451192 5263954 3844734 3921432
7143 3921432 8322360 10632174 8192539 17457540 45617756 84233313 126391832 163708703
7135 163708703 188163125 194171044 180418487 150144989 110229400 69138615 34696876
7128 34696876 13435876 10080591 10288384 7553534 6022614 6654479 6116081 3889547
7120 3889547 2176561 3016162 3354386 2366014 1090822 1622818 2168572 1898593 1456322
7111 1456322 1600926 1760687 1420658 903231 978807 1266050 1168269 693854 157765 162854
7101 162854 177351 -32208 170960 258483 119382 239816 573996 737706 653956 467815
7091 467815 452962 522461 422156 209251 282021 464403 445283 279514 213045 299673 263123
7080 263123 111675 213054 356145 323269 151350 213145 382011 390779 258011 212876 296212
7069 296212 262142 71388 117474 279683 268428 130691 236602 399686 386540 203047 157847
7058 157847 328867 330781 151290 183437 382483 388156 192595 215264 447434 471224 266113
7047 266113 236068 493895 535748 307571 259693 566758 631738 374726 305047 700707 837683
7036 837683 593492 531021 1127797 1610310 1700632 1447009 1124269 1005279 1207925 1665861
7026 1665861 2052999 1987948 1347434 888599 1664794 2268998 2137903 1638602 1733340 2023269
7016 2023269 1701753 1689726 2932149 3725964 3060259 1854422 3555069 5231894 4527778
7007 4527778 2032365 5216557 8897261 8507972 3968057 10189743 19858633 21834297
6999 21834297 11990056 33237038 88029146 156906023 226654247 282417256 311510561
6992 311510561 307040421 270098756 209379002 138505814 72140284 22842554 14386792
6985 14386792 22034686 17418363 7203437 4911019 9019538 8147652 3932271 2345247
6977 2345247 4763398 4683226 2483639 1214006 2816982 2978956 1680229 778114 1917988
6968 1917988 2140847 1298274 512936 1342853 1608892 1043065 374721 969716 1231524 859605
6958 859605 298115 713693 958472 702840 248312 562759 796353 613086 218606 422498
6948 422498 650550 530109 179052 305645 525466 458633 202073 271621 452077 401290
6938 401290 165192 199797 382875 366188 173311 153881 320506 322877 170465 135195 274032
6927 274032 279433 141134 98355 240914 260333 144355 77966 207141 236964 144635 68777
6915 182630 221700 143249 54201 148043 192433 131918 43159 127796 177736 131188 51882 113853
6903 113853 160362 122105 41860 96629 145572 115456 33922 74580 127205 107248 40794 76973
6891 76973 128173 112414 49305 60087 111587 105421 48736 47680 95018 92257 40449 38393 89390
6878 89390 91803 48965 41354 84840 89994 48333 24019 68320 77268 40781 15744 64226 77543
6865 77543 47220 17304 55901 70889 47845 26985 57543 69974 46633 13523 47825 67905
6853 67905 50579 16014 37189 52926 44013 14021 29445 47349 35441 5616 36036 59802
6841 59802 51558 19463 21421 44183 39349 10251 20098 46548 45306 21870 20440 40109 39741
6828 39741 18509 15472 36364 37743 20416 25374 46736 47937 23032 -604 25649 33828 17701
6815 17701 4341 28952 36734 21490 3534 24871 35102 25935 14942 25269 31520 18254 2539
6801 23826 36528 29707 14202 15963 23079 16178 10983 27795 37244 26852 3075 11820 26856
6788 26856 23371 11293 15693 26293 22102 7724 12650 25084 22607 8830 9230 22263 22370 7173
6773 1052 17442 20346 8614 4008 17971 22153 14703 12969 21959 23379 14881 14208 22854 24871 20134
6758 20134 27695 43902 51927 45631 35239 35071 38592 33647 24678 23178 27930 25690 18737 25963
6744 25963 41533 50895 50766 44771 38505 31941 35432 47224 65771 85932 99836 101910 88635
6731 88635 62539 29687 10547 16248 17224 12561 16628 23643 21980 11548 5686 10657 10104 -1628
6716 3123 17239 22632 18684 13057 10465 4095 -7877 8117 22705 27231 18914 4740 5693 13019 12563
6701 12563 11573 16311 18154 12156 3734 7058 13467 13954 11929 12890 11458 2091 229 18076 32010
6686 32010 35979 35959 40082 44239 44968 41125 34765 50096 52923 55205 66992 108494 158228 188949
6672 188949 204865 204671 190825 165601 115847 68330 43682 49791 54893 65301 53983 44338 50617
6659 50617 55058 50094 35123 16446 9231 6256 1319 -417 4674 4839 984 -755 3481 4230 -201 1981
6642 11626 15439 11530 1695 -1328 4257 5060 3416 3587 3728 852 -104 4740 7091 3430 -2318 -1408
6626 -1408 1569 1255 4658 12364 15806 11389 736 -8244 1558 3945 2130 2606 6098 6030 3592 7926
6610 7926 14268 15733 10745 4442 6631 12548 14676 13414 10819 8251 8343 11595 15152 15274 11122 7928
6594 7928 8858 8743 3181 -4875 1880 9935 11830 9264 7717 9443 11287 10404 6550 2038 -808 849
6577 2470 778 -3200 1038 7526 9245 5577 -1023 -2223 76 -1174 -852 4133 8007 8188 7180 7738
6561 7738 8716 5200 -1202 -1604 2865 -108 -7305 9361 27605 41988 49027 49972 47604 43690 38827
6546 38827 32481 24637 14045 2331 -1562 5752 13434 20889 27352 32058 33401 29793 21261 12005
6532 12005 4418 2272 4189 4333 -127 -9486 -17489 -25302 -23469 -22658 -18829 -10543 -5814 -1495 -2558
6517 -2558 -3605 -648 2897 8236 11078 12854 9411 2927 -520 1747 5443 8113 12689 20950 28642
6502 28642 34725 38246 41973 38228 46724 57783 60990 60680 53231 47301 39778 29906 19528 22920
6488 22920 40948 61631 74963 79002 74585 64460 52800 40290 26113 12699 1669 -6161 -10499
6475 -10499 -7179 -1919 3317 7548 10038 11412 13509 16763 18274 16238 10898 9646 20013 37222
6461 37222 57744 77812 93355 101542 102395 96634 86687 74423 63113 55905 53342 54086 54114 50166
6447 50166 42457 34186 26284 18796 10225 -1319 -5874 3346 19201 29954 28263 19849 5273 -427
6432 11328 20359 20732 11400 -391 2690 17287 31975 45382 54607 60298 61784 61524 62712 62288 57672
6417 57672 47023 32338 16474 6005 3330 5363 4550 92 -7953 -5485 2225 6937 9376 13816 19130
6402 19130 21867 17992 9860 7883 14928 19155 15363 4604 -5188 4396 15225 19045 19147 22279 31117
6387 31117 36420 36306 29958 32370 45712 55331 52774 39537 29311 42992 72058 99491 115786
6374 115786 110628 86355 51559 47856 73018 84126 62787 7168 30829 103982 163737 198575
6362 198575 212468 225012 312893 495160 778390 1111141 1435358 1697943 1861741 1913015
6352 1913015 1859554 1720320 1514530 1259654 978245 698386 451215 287555 221117 221562
6342 221562 223288 194626 168658 153579 169752 224958 310609 398947 453012 450001 392693 286202
6330 286202 163045 87711 126132 196678 260237 308058 338022 356292 361175 360531 379535 525462
6318 525462 808985 1130115 1399116 1540347 1509546 1338634 1130851 1025632 1055416 1096473
6308 1096473 1039637 847358 591821 310792 78689 -2425 62200 101482 158276 195881 202967
6297 202967 164249 101475 58724 61871 76324 75258 69599 81706 120105 162274 193816 214356
6285 214356 222645 224024 217688 191906 147620 85087 28185 25707 41954 41790 41654 50019 54022 44801
6271 44801 49123 72746 92269 99264 161569 300903 506528 712822 889444 997650 1015688
6260 1015688 936401 781621 583863 391174 237755 144505 94257 56523 14100 -6341 29965
6248 43283 36975 16949 6966 16019 21445 15284 -150 -3385 13952 25605 32138 31715 23161 11428
6233 -3076 -7180 -2464 3272 7283 12580 15512 19163 19493 13562 7805 46 222 2525 940 -1475 9095
6216 19595 22557 16287 2709 192 15496 27552 37377 46371 52507 54765 53308 52702 54310 54538 48911
6201 48911 36076 21506 18219 27000 33375 34144 35897 50844 79495 112094 140720 160240 168302
6188 168302 164494 150934 129807 103273 70799 35070 -2908 11716 44921 70633 85906 90107
6176 90107 83883 69617 49937 27829 6973 -2577 3543 6810 7907 5693 4673 6534 20076 34809
6162 34809 47301 46045 32589 22022 46403 80369 107858 121644 118883 99674 72190 60670
6150 60670 91635 137191 167707 183619 177442 164898 165032 191274 249413 345965 474557 615569
6138 615569 734586 801939 796679 717166 580917 416846 257998 126705 30354 -24147 4239
6126 30708 45680 36983 19407 3709 -13102 -29717 -10687 12177 29920 36839 52895 56668 50035
6113 50035 38522 16513 -1710 1845 21531 40132 45050 38343 20019 11328 19911 27427 23556
6100 23556 6856 -5333 -13973 -17800 -13498 -4192 -3529 -11168 -12473 3386 14468 11621 -3796 18034
6085 54118 81523 101029 107884 114050 116610 115356 111942 106071 87712 56648 28256 25209 28686
6072 28686 20652 -5926 -1792 12405 6439 41976 99026 148932 184337 206805 213556 191187 129029
6059 129029 50842 70402 108426 82584 17292 101449 166340 141758 45439 137870 247791
6048 247791 225817 74179 231596 444781 450448 212503 474472 993349 1128981 497549
6037 1422656 4302341 7946982 11696481 14772394 16475650 16407921 14586441 11442645 7683291
6028 7683291 4086868 1291907 496407 1067726 897577 387713 253613 475626 438949
6019 438949 205392 91748 232421 235853 122403 43123 140754 157316 96608 39824 91386
6008 91386 107547 64302 8040 52808 72521 50254 30741 55331 63688 39847 13375 42003
5996 42003 57420 43815 12213 11370 26813 19048 -4113 9384 23635 16548 2670 20001 32776
5983 32776 27120 5602 -8623 -6273 -14402 -22932 -7607 6041 5627 -6305 -19607 -16394 -8123 -8014 -9813
5968 -9813 -4760 -887 -338 5766 12256 11495 1319 9109 28385 37593 32875 32426 60408 106397 152735
5953 152735 190543 214890 223727 215801 191858 153901 106409 57843 18250 7615 13516 12791 9444
5940 9444 11219 13572 10292 4466 2491 2899 1014 -309 2637 4191 1379 -4503 -3741 577 1232 963
5924 963 2777 4399 3398 1313 1882 227 -8389 -18683 -8655 -4211 -3329 -4946 -14968 -23343 -26503
5909 -26503 -24183 1508 20630 46578 66670 77080 82194 77278 65469 48062 28703 10205 -4043
5895 -3638 2223 4766 5981 8242 8491 5850 587 -5749 -5098 -1431 -41 -355 -426 711 757 -1908 -6036 -4639
5877 -4639 1044 4898 6656 5715 1273 -5224 -15226 -13915 -722 13879 33555 54496 69722 77497
5863 77497 75533 62067 41609 19353 6995 10032 13613 10148 969 -9193 -15686 -8342 -2848 -2405
5849 -2405 -2509 -3987 -4405 -12354 -13491 -18379 -24089 -22642 -14680 -10417 -8048 -7678 -9074 -12236 -15037 -16391
5833 -16391 -20784 -24460 -22764 -14728 -8140 -3076 -4463 -7549 -9768 -7681 -7118 -6966 -13370 -8914 -4041
5817 -1571 -2509 -5465 -10782 -14584 -9462 -5745 -3337 -2013 278 230 -76 1481 808 -3038 -5607 -8800 3636
5799 -15682 -10528 -12737 -22701 -24872 -15564 919 12814 17882 9271 -12452 -39121 -40820 -18766 -5913
5784 25578 7013 -8894 -9595 2285 11028 11830 7284 -1283 -3403 3501 13622 22527 34106 45137
5770 45137 57165 63950 66083 64054 58648 51720 43037 33077 20707 7359 -2693 -1982 6405 14648
5756 14648 19545 21273 20039 18369 17437 18492 20340 17749 13279 3474 -9575 -4796 4134 11066 12864
5741 12864 11280 6234 -1234 -5700 -9335 -11880 -15704 -12747 -7218 -701 6397 14543 22361 29779 33900
5726 33900 33286 27802 19660 8771 2326 3206 6317 5448 753 -3970 -3110 470 1537 1245 579 -689 -2790
5709 -2790 -3847 -1462 542 -1648 -6281 -9844 -2735 1165 552 -2981 -6237 -7196 -6823 -4754 616 6488
5693 6488 8713 7257 390 -2720 -94 4166 4208 1531 -3102 -3058 -3275 -2749 -6117 -7882 5008 21256 39423
5676 39423 52164 56956 54775 52249 42614 28399 13029 2919 -3694 -153 5083 6295 5775 2985
5662 2985 2868 3959 6863 8048 5140 1488 1181 2423 1467 -1477 -1214 4470 8379 6158 -543 -5506
5646 -5506 1434 6264 5682 1734 3993 12138 16728 15178 7982 -2531 -5949 2182 8891 13264 16170
5631 16170 15891 11629 3213 -7283 -2412 4592 7788 7266 4646 4860 9666 15656 18979 16756 7891
5615 -4049 4269 16793 23331 21886 15942 15276 23966 32415 34302 27181 13334 6494 14496 22351 23968
5600 23968 20637 17927 20316 22977 22433 17970 11943 7879 5314 5109 8635 14397 19599 20910 18555
5585 18555 13793 12938 18558 24111 25975 26515 30295 36671 40063 34311 20961 8133 10110 20890 29734
5570 29734 36830 40835 35371 19127 -2475 11641 33664 45847 46915 49366 53830 55899 47095 28223
5556 28223 12259 20131 31490 32283 19884 17467 35646 48554 55325 39979 16220 25946 61171
5543 61171 90920 105122 92180 65861 54009 81984 117503 135635 142776 154192 181840 210798
5531 210798 221807 213956 211588 238841 283169 296822 272044 208093 128549 34539 2558 55715
5519 55715 130801 189402 236842 276644 295901 308569 289152 255551 222977 248071 325936 400993
5507 400993 432657 404640 415176 532386 659659 716873 650357 540002 558880 794283 1094991
5496 1094991 1350912 1581431 1838975 2188151 2760212 3741079 5230691 7132135 9159839
5487 9159839 10942838 12083377 12263053 11299656 9213418 6220420 2750590 1136028 4001617
5478 4001617 6166715 7277056 7353766 6631328 5474280 4265537 3273896 2567172 2054148
5469 2054148 1644076 1326065 1110735 968151 854441 756842 678429 595869 528469 469065
5459 469065 396429 364575 336701 317309 297185 274330 251097 232670 217406 205881 193635 177756
5447 177756 164771 158125 152312 143834 137469 134286 129930 124964 116702 109057 102870 99292 99800 104793
5433 104793 111209 110470 106463 112103 123216 128651 119438 109213 112342 132604 146272 141330 117880
5420 117880 88338 70026 66179 68634 65963 59340 52249 50759 55122 60098 60193 55900 46314 32662
5406 32662 17749 27925 58757 85818 98308 93288 73217 45117 18677 655 14018 41111
5394 41111 67848 86226 87767 75099 60277 55357 55341 46719 26850 7480 15303 24994 20288 3218
5379 -1535 22527 39978 49604 48648 39093 21708 330 8449 27797 39079 40280 32645 21735 9703
5364 1527 2956 8322 9847 7125 2306 3532 11024 16363 19338 20692 23720 25534 22790 17255 13155
5349 13155 15741 17190 16526 17126 25014 33563 28178 13430 24429 67540 112180 148894 173913 187066
5335 187066 186162 168426 134071 87164 39460 12160 20605 24330 17813 13547 17343 20787 18119
5322 18119 13962 13448 16280 18679 19300 17155 14001 13141 17302 19949 20792 24673 31701 33824 25411 8032
5305 3745 21145 29652 24765 9526 -3295 6323 11192 7866 2808 12360 27232 37187 36776 27248 13083
5289 17371 36342 54572 66770 73124 73499 70664 68567 73510 77819 74159 58067 39136 43407 65976
5275 65976 87003 101244 110324 120355 132093 140995 140782 125651 101128 85295 86828 80547 38523
5261 19067 113038 200381 252373 263301 249743 248819 277049 316818 339996 322508 264807 246250
5249 246250 369632 524850 596400 661995 1087233 1969829 3092338 4201002 5048110 5433232
5239 5433232 5264352 4578455 3536738 2379346 1376098 789120 664731 619205 480932
5230 480932 333720 282015 275913 231095 171715 161456 172248 148216 105481 97017 116406 114111
5218 114111 79631 36469 16071 26651 54401 96361 125074 122419 89293 55474 55210 63254
5206 63254 63452 82116 109353 112106 85353 75500 110969 131503 110239 96085 135575 166906 160391
5193 160391 196872 315007 414321 416350 398586 709404 1295928 1936609 2466751 2777425 2815263
5182 2815263 2601450 2245097 2004313 2210359 2828125 3516651 3968339 4047695 3798255 3390975
5172 3390975 3077232 2962706 2850310 2545274 1996031 1307920 703199 471565 529800 497258
5162 497258 344567 210422 237832 261444 201828 104471 125529 197665 212116 171895 130192
5151 130192 108785 121625 131816 134579 115552 94181 114507 161968 201621 208529 199782 204347
5139 204347 230236 256671 281652 347591 503210 733600 1005638 1278910 1519766 1695933
5129 1695933 1783884 1771423 1657349 1457152 1203052 926333 669524 472033 355293 290926
5119 290926 231782 141514 38979 44905 112964 135406 122202 96795 75527 76735 78517 71906
5107 71906 55450 31822 2584 4503 32497 50008 53611 47256 39960 37129 37668 39875 42755 41735
5093 41735 34086 18317 3944 14228 27850 32152 28448 20387 13304 12084 15115 17784 16373 13545
5079 13545 11795 10462 7144 2309 5090 13859 19916 20346 15847 9848 8055 9903 11214 8687 5076
5064 5076 7748 16352 23978 25915 21861 13257 4539 2961 10465 21928 35586 47339 55975 63032
5050 63032 72760 88166 106425 122055 131251 131783 122293 104452 81556 60006 49666 52195 59382
5037 59382 67474 85689 119167 164711 212033 249747 270538 267874 241847 198035 145556 95997
5025 95997 60729 42734 33890 24845 14376 7577 7703 10601 12192 12063 10328 9897 11380 13131 13867
5010 13867 13465 12470 10832 7219 2153 -2267 -3414 -2318 -287 2678 4278 3902 2612 2002 2863 3196
4994 3196 1888 277 310 -438 -4462 -7102 -532 4953 8058 7466 4575 1986 -1575 -4315 -1566 1153
4977 952 -2483 -6953 -2205 354 -18 -2214 -4208 -2069 1966 4132 3763 1935 -1419 -4844 -7756 -5436
4961 -5436 -1749 2068 4740 3900 -255 -5037 -483 3385 3471 1554 1246 3723 5020 3551 -896 -2936 -1608
4944 -1608 -1268 -2417 -4698 -5307 -1561 1627 2880 3550 3225 2830 2310 665 -1751 -3835 -5025 -4362 -1386
4926 2573 4492 3625 -44 -4383 -3025 -2133 -3270 -6325 -5833 -2260 1299 4944 8126 9688 9172 7185
4910 7185 5057 3208 2718 2371 2052 1590 1574 2429 3220 2425 118 -1430 -158 -403 -3313 -5851 -1926 1556
4891 1300 -1807 -4469 -2247 337 1627 1316 87 -2509 -5422 -7297 -5856 -2875 768 2332 1329 -2510
4874 -5913 -149 3891 5158 3693 823 -422 429 770 220 242 1576 3052 3627 3266 1870 -683 -4046 -6695
4856 -6695 -5666 -3068 -164 2387 3838 3620 1889 1424 3063 4848 4886 3376 -1257 -7032 -2023 2631
4839 4223 2559 -1780 -6089 -6518 -4667 -1585 3132 6421 7116 4909 1105 -2491 -3943 -2829 -2178 -2671
4823 -2671 -4674 -6806 -5555 -4694 -5750 -5585 -1660 1145 817 -2229 -6582 -1989 1101 971 -1864 -3645
4807 -3645 -26 2399 2952 1338 -1572 -5920 -4018 -1577 -1921 -4379 -2171 3531 6646 6372 2235 -2597
4790 -1252 1208 827 -2361 -6867 -4607 -1047 1759 2642 565 -2720 -3261 -815 -485 -2270 -3696 -3555 -3978
4773 -3978 -5692 -6230 -4346 -3831 -1941 304 1195 -768 -5883 -2300 2517 4126 2110 -1277 -1793 -349 314
4755 1030 2245 2949 1646 -137 321 1891 2807 4023 5481 5962 4148 563 -1061 -475 -1172 -3876 -6093
4738 -6093 -3663 -4129 -5030 -2752 -801 -1101 -861 -417 -267 -1464 -5891 -1668 1806 2075 865 514 1578
4721 1578 634 -2589 -2470 461 519 -2370 -5690 -2404 -1603 -2112 1013 5738 7744 5394 771 -2098 -2340
4704 -2340 -3305 -1848 2498 5289 4965 2628 365 -2003 -5285 -608 3993 5787 3980 -587 -4451 -4333
4688 -4333 -3512 -391 3723 5253 3048 -2148 -2169 750 296 -3516 307 3821 4076 2672 689 -1154 -5003
4671 -5003 -1341 5143 8851 6370 -849 -3516 2806 4589 1247 -5187 -2381 -2152 -4813 1261 6689
4656 6689 8680 4570 -1724 783 3443 799 -3813 -550 3771 4171 4464 6628 6077 656 -5292 3829 8344
4639 8344 6190 -1753 -3653 1538 1469 320 5332 8842 6532 1245 1201 3634 697 -7251 104 5442 4132
4622 4132 -432 3935 8836 5924 -2971 2910 10897 9515 505 3377 13593 15953 8856 -2242 5206
4606 8209 2472 -424 7872 9610 5275 6148 13351 14150 5382 -4440 11048 17550 13168 3645 6094
4591 6094 10698 9107 13474 25683 32212 26625 13945 12177 28351 52244 87551 131944 176075
4578 176075 209294 221402 210083 176457 127907 76636 42336 36562 33782 22752 20718 27634
4566 27634 23295 7671 17339 35011 35180 16050 1427 19111 23563 14085 18080 34344 35978 16295
4551 3671 29080 35803 21279 18721 43484 51845 35553 14213 35716 56067 61442 66338 82198
4538 82198 96182 102705 112379 123666 117785 84168 42944 51570 68206 49165 10405 51474 78795
4525 78795 62188 18183 53654 88842 74508 22252 56168 100582 91121 28763 52840 110512
4513 110512 106186 40319 57315 124942 122679 46844 67964 155319 163243 82430 73376 176948
4501 176948 192471 95888 75795 215342 247779 140370 80628 258685 314803 191809 83944
4489 313999 407670 272052 111535 424617 579486 418960 147695 578102 842722 655335
4479 655335 214372 846824 1330253 1134846 411216 1374647 2396190 2369210 1438049 2792809
4469 2792809 5017777 5057381 796256 9038571 24174458 42637782 61073977 75584336
4461 75584336 82876332 81220668 71024749 54683076 35832358 18293198 4982777 2748124
4453 2748124 5249443 4162518 1853468 1783293 2551878 2110414 889518 659414 1307088
4444 1307088 1220852 577260 334707 781449 786107 402478 193979 517055 554513 298929
4434 298929 110020 367823 422362 256527 73202 255473 311561 198291 48797 198737
4424 198737 258692 178381 42474 141115 196075 138746 26695 115401 169645 130002 33506 81365
4412 81365 130688 104208 32783 83399 130144 110033 36463 46181 97729 90855 41074 43183
4400 43183 80847 74767 27311 30784 70484 66517 24043 26621 64610 65653 30673 10345 46153
4387 46153 52424 27222 15063 45231 49555 25041 14806 45912 54585 34828 10044 30375
4375 30375 39032 22316 1807 31021 41696 28086 5300 22108 33339 24634 8824 24378 35340
4362 35340 26283 927 18688 33017 27081 7294 15387 29969 27077 11970 19679 38172 40317 22911
4348 22911 13510 51195 93372 131581 164203 190532 207799 211320 197917 164555 116586 65254
4336 65254 27580 22047 21125 10080 11182 22797 23268 11369 3473 15111 17929 9342 6454 17328
4322 17328 21489 14517 2962 8052 12912 8078 -3511 5269 9200 3304 813 13644 19738 15370 4917
4306 3737 9539 8188 1540 4012 8967 7176 -486 87 4784 2575 -1374 8624 14913 13483 6193 3562
4290 3562 9389 10390 5174 -860 1868 2379 -1784 -1607 2768 2843 -1746 -1649 2683 3936 3518 6879 11158
4273 11158 10627 4363 -2188 5296 8524 6067 3068 6016 8384 5539 -713 -3368 372 -169 -94 5220
4256 8538 7917 3609 -452 391 -1207 -1814 2618 4773 3234 -577 -1147 -490 -3133 575 8133 12158 12927
4239 12927 10166 6528 3811 1450 235 3688 6744 6398 3246 -515 -3252 -2394 1717 7000 10498 10533
4223 10533 7322 3411 2772 3294 2113 1183 2224 2090 756 191 1777 1728 -238 284 4214 5748 3781
4206 3781 -429 -4521 -2394 -1797 -1281 464 915 364 3763 8515 10953 9086 4158 -1785 -3486 -2728 -4359
4189 -4359 -1182 1505 1785 -418 -2981 -3376 -3146 -1757 612 2054 2035 2272 4349 5860 4679 831 -3165
4171 -1733 -551 -2186 -824 2376 3203 1280 -2348 -4437 -3631 -3533 -4090 -4037 -3128 -626 2980 5691 6287 5403
4153 5403 5698 7799 8809 6705 3392 1273 984 434 -1307 -2204 -726 -614 -891 -383 -235 -1587 -3652
4136 -3652 -2125 586 2033 1804 611 -814 -1102 1498 5381 7480 7262 4228 649 -3345 -2837 -1813 -1281
4119 -1281 -1075 -747 -366 84 808 1647 1966 1660 470 -855 715 3401 4362 2814 -192 -2604 -1022 -259 -899
4100 -899 420 3284 4109 2403 -1211 -1902 947 2028 794 -1458 -3394 -4185 -4482 -5451 -3964 -685 2470
4082 4568 5030 4182 3053 3021 3550 3276 1940 403 -713 -1531 -2406 -2692 -1921 -1324 -927 -742 -1020 -678 1034
4062 4283 6943 8049 7571 5326 3177 2194 3691 5782 6973 6477 4080 1391 -1007 -2040 -1279 734
4045 2680 2947 1468 -1080 -3116 -1558 -1552 -2788 -3592 -3601 -4079 -4358 -2977 -1328 -528 -306 -95 -381 -1968 -2820
4026 -2820 -1514 9 1057 841 -295 -2095 -3522 -3741 -2869 -2338 -1079 299 1469 2218 1962 492 -1255 -3063
4008 -3063 -4058 -2685 -649 1593 3556 5197 6254 6146 5410 3457 1067 6 -149 110 206 298 402 1042 1880
3989 1880 2232 1747 74 -1849 -1880 -1011 -684 -1381 -2053 -3308 -3913 -3370 -2683 -1704 -533 654 1856 2419 2085
3970 2085 758 -1339 -3666 -2415 628 3102 3854 3535 1182 -1275 -2937 -3108 -1830 -188 1519 2523
3954 2523 2987 2794 2799 3071 3374 3218 2671 2126 1637 857 -405 -966 622 3084 4923 5235 4234 2145 -134
3934 -1631 -2923 -4635 -3062 -1636 -1066 -1216 -1651 -1752 -1132 268 2149 3515 3885 2851 1331 794 1281
3917 1281 1915 1657 984 551 293 259 182 -46 -345 -254 340 1005 1419 1340 184 -1397 -3443 -4045 -2031 -543
3896 96 -298 -1402 -2815 -838 796 1017 259 -1247 -2981 -3569 -2837 -1200 362 1926 1827 1117 611 736 546
3877 546 -742 -2169 -2063 -1324 -1314 -2409 -2057 -1202 -1486 -2709 -2438 -376 1620 3312 4431 4889 4502 3245
3859 3245 2218 1631 1585 1553 2095 3156 4307 5579 6750 7159 6600 4507 1603 -1034 -1997 -986 -254 -728
3841 -728 -854 -1547 -2511 -2481 -668 1850 3856 5286 5032 3607 457 -2602 -2830 -811 31 -489 -1298 -2502 -3880
3822 -3880 -2885 -1319 15 1008 1911 2168 1424 242 -741 -1010 -1595 -2304 -2232 -1667 -1479 -1936 -2679 -3028 -3098 -3257
3802 -3257 -3030 -2197 -1343 -988 -1154 -1666 -2570 -3756 -3241 -1967 -902 -258 344 1124 2125 3200 4058 4101 2522
3783 2522 1055 279 -217 -1067 -1724 -639 650 765 -165 -2285 -1835 924 2575 3595 3690 3333 2690 1490
3765 1490 666 -8 -276 114 995 2287 3211 4305 5207 5838 5475 4952 4095 3579 3177 2939 2876 2466 1597 173
3744 -1784 -3893 -1591 296 1155 1171 423 -512 -321 1219 2452 3081 3123 2237 -28 -1784 121 2077 1919 -402
3724 -3338 -1476 1469 3152 2881 1136 -1258 -1190 215 633 176 -496 -967 -1192 -1196 -1027 -937 -893 -925 -1743 -2705
3704 -2705 -3433 -2763 -1565 -623 177 1406 2363 2564 2216 1749 1559 1005 -219 -1779 -2790 -2938 -2847 -1796
3686 -1796 -706 531 1348 1808 1766 1746 1255 460 -728 -1943 -2917 -2908 -2585 -2462 -2353 -1882 -1316 -1066 -1676 -2562 -3064
3665 -3064 -3358 -2720 -1403 569 2359 2605 1585 -445 -2856 -2982 -1894 -1624 -2518 -4133 -2078 -283 810
3647 733 450 728 1322 1067 482 -397 -2279 -4555 -3883 -2941 -2840 -3028 -1380 975 2279 2266 1116 -673 -2856
3628 -2856 -2421 -548 784 1147 1582 1577 750 -1087 -3730 -4432 -2313 -717 577 1040 1423 1333 1223 1077 462 -33
3607 421 1808 3907 4688 4285 2871 875 -841 -2053 -2414 -1671 -158 1111 1912 2011 1990 1713 1489 1107 1059
3588 1059 105 -1347 -2976 -4282 -3172 -2054 -1180 -709 -542 -1016 -1403 -535 1025 1942 1727 1617 1008 -318
3569 -1719 -2429 -1678 -1292 -1400 -2359 -3951 -4089 -1914 675 3098 4823 5367 4242 1866 -1075 -3684 -3824
3552 -3824 -2701 -1757 -1257 -1055 -1226 -1388 -1388 -798 82 1190 2032 2301 1640 405 -1165 -2694 -4154 -2788 -1455
3533 -1455 -665 343 1256 2262 3145 3657 3942 3699 3372 3036 2748 2355 1814 1132 284 -805 -2070 -3107 -3461
3514 -3461 -3345 -2372 -1445 -1358 -2104 -2649 -2431 -981 -789 -1177 -1330 -567 738 1982 3247 5005 6966 8552
3496 8552 9704 9675 8823 7420 6709 7487 9582 11189 11888 11494 9774 7019 3804 1215 351 1410 2670
3479 2670 3128 2996 2411 1420 254 -702 -920 -1250 -1458 -1005 148 2230 4635 6939 7710 7284 6136 4834
3461 4834 4402 5099 6427 7093 6429 4251 1012 -1931 -3202 -3262 -3214 -3306 -2940 -2386 -1241 -70 1058 1657 1941
3442 1941 1764 1374 242 -957 -1254 -782 -335 -396 -673 -600 164 1157 1751 1005 -388 -2172 -4028 -4090 -3384 -2520
3422 -2520 -1068 710 2625 4654 6502 7250 6725 5049 3315 1422 -478 -2340 -3693 -2724 -2114 -1646 -1453
3405 -1453 -1663 -1105 77 1088 1168 174 -1397 -2728 -1633 250 1983 2694 3276 3572 3604 3901 4387 5041 5450
3386 5450 5676 5592 5296 4909 3680 2225 177 -1727 -3106 -3612 -2882 -1643 -790 -706 -1136 -1654 -1698 -1426 -1099
3367 -1099 -299 -18 -741 -1157 -1245 -710 -214 -427 -1386 106 2702 4781 5572 5017 3303 1056 -1704 -3100
3349 -3100 -1048 387 829 883 263 -608 -1278 -1729 -1829 -1786 -1335 -712 -239 -579 -886 -763 -342 -677 -1696 -2195
3329 -2195 -1396 357 1768 2146 1906 1441 668 -350 -1422 -1657 275 2807 5045 6448 6233 4838 3310
3312 3310 1296 -149 -609 -256 339 1243 2574 3846 4688 4599 3113 1052 -1555 -3587 -4359 -4308 -4666 -3686
3294 -3686 -1834 -569 -297 -1314 -3693 -2160 94 1816 3675 4101 3511 2692 2084 1783 1777 1557 1449 898 -22
3274 -594 -321 322 647 293 -220 -1193 -2266 -2248 -1067 -158 62 -181 -782 -1649 -2870 -3820 -3529 -2428 -1215
3255 -1215 359 1888 2617 2469 1403 -215 -1327 -1622 -1528 -1195 -986 -554 -85 767 1842 3001 4218 4136 3119
3236 3119 3059 3174 2891 1961 853 76 -713 -881 -1476 -1788 -2294 -2923 -2845 -2758 -2907 -2520 -2101 -2026 -1578 -306 1066
3214 2488 3135 2612 1277 -153 -1145 -1413 -1337 -1209 -987 -524 248 1145 1730 2475 4084 5543 6300 6283 5231
3195 5231 3410 1043 -716 -798 615 2619 5318 7866 9591 10222 9857 8706 6472 4250 2092 311 -1145
3177 -2863 -3027 -1182 901 2298 2922 2699 1832 542 -81 -653 -1222 -2122 -3193 -3547 -3049 -2444 -1317 -577 -448
3158 -448 -1071 -1937 -3077 -4194 -2832 -772 1419 3522 5337 5887 5759 4609 2717 1434 443 -634 -1795
3141 -1795 -2536 -2252 -1576 -873 -440 -303 124 97 -398 -919 -1012 -911 -228 407 1088 1483 1655 2148 2402 1900
3121 1900 1053 713 930 1515 2000 2161 2273 1384 -21 -2020 -3314 -1577 933 2501 3564 3258 1664 -518
3102 -2063 -650 1758 3610 4577 4169 2813 450 -2531 -5210 -3009 135 2024 1791 858 595 1144 1374
3085 1374 1449 948 385 -216 173 494 1026 1778 1804 1427 742 137 -288 -352 -915 -2572 -4352 -2935 -1116
3065 480 1392 1435 820 -674 -1597 -691 -109 2308 3826 4478 3541 979 -1766 -1256 429 1380 1194 170 -1191
3045 -2914 -3868 -2785 -1091 79 785 1879 2406 2989 2936 2328 891 -239 -651 520 2395 3719 4696 5481 5896
3026 5896 5474 4011 2380 1231 1468 2081 2579 2591 2055 891 -280 -1121 -1353 -1834 -2330 -2059 -715 739 1872
3007 1872 2697 2587 1998 1331 335 -768 -2372 -2659 -1221 -549 -520 -1193 -1755 -1685 -558 226 767 443 299 977
2987 977 1130 572 -226 -69 1426 3425 4025 3356 2793 2027 638 -962 -2133 -712 668 2127 3271 3325 2917
2968 2917 1592 -488 -2878 -5077 -4914 -3616 -2071 -345 1244 2033 1856 2478 3377 4364 5168 4959 3311
2951 3311 1278 -724 -2473 -3900 -4983 -4179 -3477 -3059 -2704 -2209 -1758 -1488 -1471 -1769 -1165 96 2039 3784
2933 3784 4379 3089 1045 -1307 -2642 -3264 -3865 -4089 -3542 -3108 -3054 -3472 -4010 -3806 -2751 -1696 -264 745
2914 1016 506 -1098 -2964 -3566 -2775 -2147 -1730 -966 -149 127 897 1821 2562 3362 3791 3651 2720 1215 -329
2894 -1753 -2801 -2525 -1542 -682 -208 93 113 -176 -1051 -1942 -3435 -2409 -988 79 -63 -1087 -2779 -2747 -450 2085
2873 3891 4891 4888 3345 2023 879 477 695 1144 2946 5462 7748 9290 10355 10257 9199 7550 5556
2856 5556 3358 1136 -1166 -3435 -2275 -1026 -467 -275 -776 -1786 -1752 -848 -279 -20 -601 -1644 -2133 -2084
2838 -2084 -1984 -2297 -2799 -3020 -2641 -2069 -1643 -1517 -885 360 732 900 857 872 1070 982 610 1978 2881 3139
2818 3139 3505 4191 4783 4683 3952 1943 -724 -2950 -4563 -5240 -4399 -2609 150 1803 2660 2558 1945 1045
2800 1045 147 -646 -1519 -2562 -4002 -4734 -4009 -2695 -1004 216 1106 2019 2627 2374 1005 -520 -2173 -2337
2782 -2337 -176 2126 3340 3085 2398 942 -604 -2470 -3352 -2634 -1636 9 1498 2118 2266 2237 2159 1786 1634 1694
2762 1694 953 570 393 209 -222 -1147 -1981 -1528 -388 300 880 1276 1864 2388 2688 2877 2739 2007 667 -819
2741 -2631 -3882 -4137 -4073 -4342 -4782 -4494 -3907 -3197 -1462 142 1573 2063 1610 942 845 1197 1519 1388 862
2722 862 90 -932 -2431 -3562 -1987 915 4028 6866 8799 10061 9534 8026 6357 5118 4474 3866 2198
2705 2198 270 -817 33 1314 2635 3131 2762 1868 955 470 535 670 565 80 32 20 -88 -436 -741 -1485 -1895
2684 -1895 -2011 -986 27 735 653 538 1150 1946 3005 3675 3641 2527 565 -1715 -3113 -4070 -5023 -5900 -4400
2665 -4400 -2676 -1642 -1480 -1990 -2411 -1721 -1064 -1489 -2826 -3609 -1600 329 1808 2863 3731 4212 4020 2971
2647 2971 1377 -96 -1910 -3184 -3586 -2880 -2549 -3102 -3740 -2214 -44 2106 3927 5184 5513 4667 2951 1324
2628 -356 -2031 -3098 -3286 -2794 -2266 -2061 -1779 -854 521 1799 2601 2591 1705 326 -1402 -2762 -2016 -692 260
2608 747 796 345 -587 -2063 -3504 -2463 -1251 642 2639 4972 6649 7145 6645 5309 3521 1951 1069
2591 1069 469 66 -10 177 389 663 1002 956 332 -704 -1758 -2744 -2070 -933 -227 90 616 405 671 1234 1826
2570 1826 1959 1056 -493 -1693 -1808 -985 -242 430 1021 1819 2741 4241 5995 6720 6525 5135 3318 1136
2551 -1064 -3132 -3094 -2059 -1654 -1776 -2108 -2714 -2675 -2051 -603 1130 2557 3158 2840 2067 1847 3203 5421
2533 5421 6681 5953 3401 352 -2701 -1026 1911 3892 4768 4505 3861 3290 3488 3747 4040 3816 2756
2516 2756 1124 -365 -754 -217 23 -390 -1508 -3559 -2801 -1209 -299 -76 -518 -1062 -1347 -1913 -2537 -2305 -1490
2497 -1490 -624 -403 -809 -1066 -274 1258 2233 2759 3341 3420 2975 1948 481 -1141 -2111 -2081 -1352 -281 534
2477 1293 1671 1500 1353 1418 1808 2163 2312 2344 2194 1574 553 -1072 -2219 -2630 -2372 -1756 -1108 -590 -268 -203
2457 -203 -118 287 534 755 609 212 -504 -1308 -2326 -3286 -2915 -2117 -1316 -1943 -2640 -3679 -3603 -3471 -3311 -3617
2437 -3617 -4226 -3460 -1835 -285 1030 2617 4639 6680 7642 7673 6975 5738 4261 3204 2840 2841 3259 3332
2419 3332 3439 3004 2319 1184 559 301 361 863 1972 3624 4890 5566 5549 4588 3124 1333 -977 -2487
2401 -2487 -2432 -1352 -431 862 1534 1935 1921 1129 -627 -2596 -1744 -169 733 845 775 765 569 472 598 909 342
2379 429 -300 -898 -1167 -1226 -988 -882 -607 -745 -1496 -1923 -196 1955 3521 4735 5363 5149 4345 3138 1442
2359 26 -613 -479 121 873 1150 822 -29 -1343 -3261 -3960 -2429 -1457 -89 1616 2665 3500 3829 3510 2404
2340 2404 519 -1479 -3290 -2878 -977 458 1156 1245 829 -31 -1156 -2185 -2669 -2278 -967 371 1519 2152 2267
2321 2267 2147 1807 1095 228 -813 -1555 -2021 -1833 -1472 -1584 -2207 -3323 -3888 -2851 -1818 -890 -14 589 1013
2302 1013 752 5 -1329 -2747 -3315 -2905 -3093 -4138 -2895 -606 1349 1892 1128 -1262 -3483 -3400 -931 1424
2283 2762 2905 2462 1473 415 -154 350 1257 1543 693 -657 -1149 -284 950 1913 2152 1455 -5 -2333 -2593 -526
2262 527 689 884 551 859 2201 2866 2690 1337 -455 -1293 -368 859 1883 2839 3015 3380 3409 3670 3487
2243 3487 2322 1512 1049 1147 1377 1828 2070 2023 2276 2601 2738 2307 1620 1436 1919 2636 3031 2891 2419 1418
2223 1418 -5 -936 -1922 -1950 -1218 -108 1307 2343 2757 1864 231 -2292 -4527 -5211 -5231 -5527 -5001 -2762 -785
2203 379 273 -661 -2166 -4251 -4689 -2741 -1314 -246 -174 -864 -1812 -2196 -2466 -2500 -2271 -1705 -424 185 358
2184 358 -672 -2221 -2840 -1428 -295 88 -350 -1237 -2104 -2411 -1104 613 1949 2097 1268 -298 -1927 -1867 423
2164 2296 2490 1572 -84 -1400 -5 1630 2643 2549 2016 835 -511 -1937 -2200 -1598 -1687 -2019 -2299 -2356 -2697 -3062
2144 -3062 -3221 -2716 -1842 -329 109 424 206 -680 -896 -1146 -726 115 1289 2353 3274 3707 3227 2261 660
2124 -592 -1109 -1294 -744 -819 -1392 -1869 -3079 -3324 -3495 -2313 -464 1753 3629 4550 4468 3710 4296 6682 9163
2105 9163 10183 9620 7783 5064 1580 -1745 -2576 0 1527 2133 1342 155 -1736 -2327 -2316 -2380 -2409 -1525 53
2085 1614 2865 3781 4890 5083 5425 5772 5817 4772 3313 1570 -3 320 1153 1385 425 -903 -1484 -191 1539
2065 2501 3044 3249 2449 1406 732 -284 -1562 -2716 -2147 -1252 -551 -442 -1681 -3275 -3714 -2282 -1095
2047 -312 554 1097 1338 1312 1028 283 -470 -707 -612 -434 68 701 1684 2451 3027 2801 2989 2791 2283 1744 1833
2026 1833 2385 2982 3088 2466 1260 -935 -2830 -3563 -1230 1132 2451 2463 1052 -1114 -2628 -2207 -722
2008 767 1534 931 -202 -1402 -1809 -1760 -2365 -1321 115 1684 3920 5305 5447 4624 3646 2666 1124 -527
1989 -1299 -1028 72 1133 1969 2351 2928 3770 4484 4209 3719 2210 831 -325 -1239 -1999 -2696 -3449 -3506 -3295 -2624
1969 -2624 -1545 -904 -1397 -2250 -3048 -2443 -549 1895 3668 4504 4387 3008 1444 -812 -2682 -3240 -1520
1951 34 1299 1555 1382 597 132 1006 2222 2996 2628 1662 1227 1416 1947 2108 1626 40 -2282 -3758 -2654
1932 -2654 -2227 -2241 -1974 -561 1098 3072 4198 4771 5016 5438 5621 5610 4851 3237 1101 -181 -994 -1216 -1544
1913 -1544 -2088 -2918 -3416 -3135 -2102 -129 1104 1718 1826 1660 1143 -43 -1530 -3334 -3619 -2163 -1878 -1902 -1774
1894 -1774 -898 784 2026 2200 1161 -581 -1963 -2567 -2508 -1688 -594 266 400 80 -783 -1925 -2757 -2511 -1551
1875 -1551 -290 1774 3990 5557 5604 3843 889 -1956 -3079 -2369 -1602 -1489 -1691 -2276 -2448 -2344 -2552 -2821
1857 -2821 -2738 -2577 -2149 -1535 -1048 -212 823 1895 3161 4291 5028 4995 3610 2206 450 -1648 -3483 -4092
1839 -4092 -3476 -2709 -2029 -1462 -1051 -127 1216 2733 4252 5284 5134 3191 -20 -1439 760 3425 4995
1822 4995 4658 3537 1623 -784 -2992 -4773 -5282 -4640 -3448 -2719 -2066 -1247 -265 1141 2155 2422 1839
1805 1839 429 -888 -995 371 1219 1007 335 32 639 1609 1835 1387 665 -100 -594 -847 -1343 -2357 -3670
1786 -3670 -1532 706 2599 3818 4382 3885 3521 2563 1324 -208 -1771 -2358 -1957 -2442 -3092 -2890 -1556 86
1767 627 435 188 -1101 -2769 -3790 -4165 -4407 -4514 -3857 -2566 -757 901 1875 2174 2048 1675 1039 450 -343
1747 -1065 -1774 -2291 -2813 -3028 -3301 -3648 -3101 -1939 -227 828 1594 1394 500 -766 -2180 -2822 -1002 1088
1728 2940 4515 5089 3929 2134 78 -2509 -3761 -1783 150 877 673 -223 -911 -1171 -1293 -2187 -2552 -532
1709 1814 3291 3781 2927 1420 -227 -460 828 2396 3818 4821 5489 5739 4886 3261 1282 -221 -729
1692 -729 -718 -1001 -1637 -1755 -859 100 770 722 617 159 -816 -2443 -4803 -3614 -1155 658 2234 2927 2462
1673 2462 1313 190 -16 937 2428 3519 3959 3804 2697 1248 305 -378 11 1419 2832 4015 4469 4091
1655 4091 3463 2844 1172 -757 -2274 -2666 -2949 -3616 -3470 -2105 94 2379 4250 5317 5176 4260 3016 2377
1637 2377 2328 2596 3381 4682 6266 7734 8212 7535 5299 3119 1789 1028 763 -13 -300 -247 -281 -628 -1068
1618 -1068 -1688 -2065 -1789 -1268 -994 -843 -789 -645 -526 130 972 2026 3071 3958 4365 4490 4084 3829 1802
1598 -1387 -3407 -1969 143 1555 2531 2728 1621 -271 -2100 -1818 -852 -537 -1188 -1394 -1277 -841 -736 -595
1580 -595 -444 -35 424 744 1144 1570 2067 2313 1901 1054 -235 -1499 -2220 -2009 -1264 -858 -371 35 540 1434
1560 1434 2291 2540 1964 892 -332 -1112 -1132 -764 -476 -343 -292 8 276 252 -281 -1638 -3191 -2839 -1202 387
1539 1194 1522 1738 2296 3180 3958 4837 5864 6529 5961 5290 4032 2818 1434 -249 -2138 -2931 -1310 -180
1520 57 -839 -2572 -3553 -2358 -1342 -1043 -888 -1323 -2096 -2729 -3208 -2646 -1613 -760 -507 -944 -1867 -2687 -2804
1501 -2804 -2390 -1978 -1855 -1937 -2364 -3169 -3490 -2859 -1553 -255 775 1670 2639 2989 3206 3713 3871 3853 3994 4241
1481 4241 4351 3979 3338 2463 1481 222 -1183 -1428 -528 313 885 1113 1345 1402 1799 2597 3178 2883 1765
1462 1765 820 446 676 996 997 224 -867 -2087 -2844 -3141 -2148 -1335 -979 -1305 -2074 -2940 -3059 -2215 -384 1878
1441 3421 4452 4426 3293 1132 -1375 -3201 -2741 -2242 -2580 -3069 -3015 -2045 -752 -201 -1030 -2120 -1385 -426
1422 -106 -620 -1862 -2293 -66 2404 3790 4157 3890 3549 3484 3408 3777 3679 3124 2333 1733 1262 1088 759 -88 -1699
1401 -1699 -4023 -4034 -2342 -688 305 652 608 171 112 -99 -610 -544 410 1089 746 -399 -1855 1240 2998 3388
1381 3388 2726 1530 -206 -1698 -2734 -3088 -2953 -3093 -3462 -3962 -3556 -2748 -1967 -1812 -2245 -3288 -3772 -2489
1363 -2489 -1751 -2072 -3471 -5229 -1860 947 3537 5867 6549 6389 4506 2281 79 -1633 -2485 -3277 -2994
1346 -2994 -2021 -602 860 2209 2579 1917 620 -969 -2259 -2468 -1105 -132 -233 -1411 -2760 -2313 -603 984
1327 1857 2086 1401 291 -383 -119 120 575 1407 2151 2440 2364 1929 1424 887 1321 1857 2689 2733 2728 2397 1902
1306 1902 1027 327 -345 -854 -907 -832 -975 -1306 -1634 -1364 -976 -1119 -1016 -1464 -996 73 612 29 -1130 -1859 -1181
1285 -1181 -123 679 215 -821 -2585 -2197 55 1945 2790 2246 1471 86 -925 -1520 -1464 -1926 -2070 -2091 -2022 -2152 -1927
1264 -1927 -1936 -1508 -1035 -1121 -1040 -1040 -296 306 397 506 223 -101 307 841 1049 1820 2370 2872 3318 3210 2465 1237
1242 1237 72 -1514 -3107 -3426 -2423 -2112 -2261 -3131 -3443 -2388 -1771 -1592 -2019 -2212 -1666 -535 151 192 250
1223 250 176 253 228 567 813 1609 1783 1423 471 -1367 -2377 -536 2000 4293 5285 4788 3036 1314 241
1203 680 2540 4822 6888 8112 8616 7966 7118 5363 4052 3199 2713 2386 1957 1557 584 -1103 -3067
1186 -3067 -1784 896 3262 4435 4192 2808 1104 -982 -2120 -2144 -2064 -2552 -2456 -762 931 2265 3110 3416
1168 3416 3198 2244 567 -915 -1926 -603 1370 2761 3058 2354 1274 351 -404 -624 -722 -652 -519 -583 -124
1148 507 957 1675 2440 3719 4486 4583 4412 4242 3881 3700 3213 2656 1774 788 -108 -1245 -2225 -2229 -1500 -1150
1128 -1150 -1554 -2178 -2775 -3256 -2983 -1990 -984 -380 -287 41 -113 -1681 -3105 -1195 2129 5570 7868 8632
1110 8632 7448 5041 2285 -133 -2209 -2934 -1916 -316 1684 2880 2911 1675 613 301 806 1218 961
1093 961 -188 -945 -476 673 1564 1793 2130 2373 2870 3706 4155 3561 1999 -293 -2493 -2668 -954 346 1297
1074 1297 1895 2551 3336 3519 3194 1808 -486 -2759 -4580 -4681 -3476 -2946 -2924 -2690 -1789 -889 -245 -341 -1183
1055 -1183 -1190 54 1149 1536 1246 240 -1000 -2116 -2142 -1541 -1484 -1411 -812 -150 -21 -318 -422 -1109 -1948 -2604 -3005
1034 -3005 -3042 -2452 -1183 -295 -48 31 -514 -1522 -2633 -2847 -3117 -3490 -4139 -2867 -629 1170 2296 2123 397
1014 -2697 -3892 -1341 762 1790 1368 -34 -1969 -2254 -473 773 996 708 -442 -1469 -1762 -1202 -123 429
995 726 401 -133 -935 -1467 -1597 -564 1140 2825 4394 5288 4850 3798 2438 1110 760 1834 2536 3355
977 3355 3849 3673 2927 2101 1243 836 722 757 870 756 408 -118 -281 -115 441 933 1531 1635 1515 1818
957 1818 2629 2822 2358 1571 1357 1759 1880 2145 2560 2886 3325 2627 1735 360 -1009 -1953 -2955 -3229 -3169 -2731
937 -2731 -1972 -1142 155 1622 2820 2990 2192 1505 463 -970 -2463 -2392 -455 925 2234 3552 4066 3536 2072
918 2072 203 -327 957 2678 3810 3857 1821 -1492 -2263 469 2845 4888 6147 6787 7222 7137 6548 5682
900 5682 4848 3970 2786 1892 1402 1386 1861 2254 2384 2370 1865 1321 588 -371 -917 -676 -256 291 631 289
879 -464 -1531 -2310 -2659 -2284 -1475 -613 573 1273 1852 2002 1503 1321 1271 1341 1334 1674 2195 2592 2611 1892 877 -7
856 -734 -1306 -2033 -2264 -1165 -67 424 635 565 233 587 1708 2215 2312 1524 39 -1569 -2878 -3231 -2750 -1886
836 -1886 -975 123 870 691 179 -640 -1835 -2356 -1752 -909 -521 -553 -720 -735 -660 253 954 551 374 -63 -1081
815 -1081 -2148 -3694 -3262 -1779 -1212 -896 -299 1150 3189 5457 7438 8768 8198 7220 6546 5691 5667 5539
797 5539 5480 4259 2291 242 -1869 -2838 -2086 -1898 -1792 -1141 -572 -315 -1160 -1952 -2193 -1538 -664 93 686 1202
777 1202 1307 1208 877 363 -288 -1114 -1658 -2151 -2102 -1863 -1128 -643 -1372 -2521 -2462 -824 1135 2663 3112 2119
757 2119 1171 -81 -1075 -2001 -2790 -3915 -4661 -4801 -3515 -2235 -702 956 2360 3903 4897 5143 3793 1894
738 -69 -889 -466 -166 -362 -971 -1067 409 2233 3382 3500 2537 1063 -609 -2144 -3359 -3078 -1043 911 1961
719 1961 2194 1938 1120 600 677 1977 3477 4829 5527 5394 4373 2699 1644 2022 3409 4413 5099 5283
701 5283 5037 3696 2245 607 -1115 -2580 -3433 -3312 -2162 -675 919 2080 1667 167 -2111 -3467 -4680
684 -4680 -3212 -1047 486 1446 1370 191 -262 1443 4153 6616 8022 7870 6325 3269 356 -2431 -3805
667 -3805 -2503 -304 2183 4792 6745 7402 6899 5021 2172 -777 -4018 -2693 611 3060 4198 4386 3827
650 3827 1990 -112 -2437 -2650 -1095 371 1701 2863 3672 4094 3515 2369 483 -2002 -4088 -2175 547
632 2224 3068 3388 2902 1756 -100 -2188 -2721 -1780 -1183 -1018 -1408 -2036 -3127 -3138 -2186 -203 2572 5652 8293
613 8293 9709 9293 8131 6354 4260 2396 336 -925 -2101 -2557 -2395 -2035 -1133 65 1191 2082 2325 1539
595 1539 847 102 990 2521 3995 4365 3598 2107 589 -565 -1132 -708 -329 20 206 300 480 96 -484 -1305
575 -1305 -1907 -2370 -3003 -3557 -4073 -4745 -3004 -878 478 631 -138 -1188 -1224 93 1593 2300 2527 1510 -179
555 -1756 -2105 -1688 -1865 -2409 -3369 -3878 -1836 -26 1174 1552 625 -1571 -2446 452 3402 5540 7156 7308
537 7308 6067 4906 3458 2167 1770 1791 1880 1919 1404 491 167 1308 2253 2803 2336 1454 284 -221 -323
518 -323 -803 -1696 -3097 -4534 -5375 -2811 -1372 -921 -1292 -1727 -1725 -836 -22 605 686 348 -179 -789 -669 -176
497 -70 -987 -1909 -2529 -1987 -971 -643 -1331 -2910 -4142 -2534 -1423 -1507 -2280 -2680 -1814 30 1131 1434 806 -368
476 -1545 -1832 -1556 -1449 -1488 -1549 -1915 -2513 -2693 -2024 -977 -236 256 598 259 -448 -1199 -1633 -1805 -2073 -2304 -1743
455 -1743 -1196 -517 885 2682 4314 4469 5700 6503 6673 5975 4600 3069 1114 -385 -1272 -1257 -117 1211
436 2627 3157 2844 2075 1500 1262 1525 1666 1740 1993 2277 1403 -81 -1376 -2011 -1469 -769 -926 -852 225 1869
416 1869 4161 6224 7503 7192 5774 3574 1290 -624 -1819 -253 938 1477 1319 1586 1925 1697 735 -241
397 -1239 -2132 -2717 -2491 -1832 -795 521 1676 1939 1791 1010 25 -670 -1297 -2072 -2999 -3284 -2385 -484 1508 3061
377 3061 4218 4766 4416 3274 1658 -312 -2137 -3456 -2171 -856 -303 -729 -1058 -916 -96 1604 3762 5092
359 5092 5229 5097 4667 4007 3402 1968 569 -772 -1314 -1200 -1354 -346 18 -160 -628 -1497 -2516 -3266 -3278 -3458
339 -3458 -3827 -3895 -4230 -3912 -2893 -1333 -182 761 1632 2087 1960 1763 1004 -177 -1337 -2208 -2793 -2928 -1550
320 -1550 454 1924 2569 2175 1783 839 -48 -105 567 1658 2180 1132 -1328 -3651 -1961 -120 -266 -2840
302 -2840 -4379 -532 3070 4841 4843 4018 2599 952 -292 -361 287 1699 2986 4591 6564 7812 8463 8170
284 8170 7251 6379 5478 3892 3805 3826 4190 4280 4119 3357 2385 1507 914 850 1105 1797 2323 2375 1716 353 -1208
262 -1453 -538 100 -128 -935 -1785 -2057 -1277 -333 525 458 -213 -1139 -1085 50 956 1102 185 -1896 -3459 -2725
242 -2725 -1380 -900 -1535 -2334 -2740 -2404 -2328 -2866 -2916 -1909 -724 357 769 911 764 188 -234 -665 -1335 -1781
222 -1781 -1656 -778 1120 3415 5369 6620 7300 7471 6597 4572 1992 -318 -1066 -55 719 278 -927 -2336
204 -2336 -2651 -1375 -564 142 206 -1 -492 -1088 -1216 -645 41 862 1728 2368 2185 1863 1603 2056 2789 4381 6218
183 6218 7801 8762 8334 6496 3840 1497 1218 3028 4443 4421 2856 776 -964 -1920 -2051 -1078 -149 422
164 650 609 1067 2669 4922 6588 7213 6467 4769 2453 524 -802 -660 -225 -164 -1477 -3873 -3480 -1652
145 -914 -1276 -1916 -310 1774 2924 3265 2677 2341 2469 3076 3998 4845 5362 5217 4390 2808 1617 663 308
125 1066 2259 2581 2936 2455 1813 398 -562 -211 391 1161 1991 2147 1230 -657 -2495 673 2914 3148 1543
105 -1673 -3582 -1677 -1106 -2079 -3131 -2359 -1120 -454 -623 -988 -1546 -2405 -1897 84 2402 4744 6352 6993
87 6993 6799 5792 4210 2510 1296 1010 1109 393 -807 -936 998 2231 2505 2236 2364 2391 1857 757 -783
67 -2263 -3387 -4000 -2358 -343 1814 3200 3846 3672 2918 2084 2213 2823 3582 3309 2254 1924 3084 3851
49 3851 3874 2758 918 -695 -1412 -1043 313 1671 2344 1799 -134 -2496 -3116 -474 1060 1904 2171 2149 1115
30 1115 -1047 -1583 407 1972 2791 2099 597 -1151 -1852 -1687 -389 1865 3825 4857 4397 2472 -289 -2592
12 -2592 106 2114 2524 1982 1311 1449 1770 1356 97 -1471 -2630 -2752
0 -2752
##PAGE= F1=-0.101556585365
##FIRST=     25.9928259484165, 8223.18227667557, -2767
##DATA TABLE= (F2++(Y..Y)), PROFILE
16383 -2767 -2419 -2020 -2417 -2424 -1320 -340 193 794 1815 2547 2773 2461 1335 935 1056 1894 1757 727 -989
16363 -2521 -305 1073 842 276 818 1679 1930 957 -802 -2385 -543 1435 2089 1613 403 -1122 -1953 -943
16344 -530 -201 183 488 170 -839 -3010 -2161 -1061 -792 -1724 -3071 -2993 -1479 -581 -857 -1916 -3189 -2116
16326 -2116 -1742 -2364 -1510 486 1933 2701 2529 1933 595 -447 -357 446 933 673 136 466 727 -440 -2405
16307 -2405 -3107 -374 841 657 -994 -2910 -1275 -272 -1233 -3125 -3100 -1503 -808 -1134 -1582 -1738 -2026 -2611
16289 -2611 -3539 -3166 -2083 -1109 -799 -1313 -1598 -1007 -62 865 1160 458 -1157 -2375 -2213 -1870 -1641 -2062 -3339
16270 -3339 -2214 -774 -886 -2218 -2182 -614 762 595 -632 -2401 -2137 -1296 -1074 -778 -313 567 1292 1494 811
16251 811 -339 -1426 -781 1241 2681 3011 2322 1048 11 186 1126 1906 2262 2012 1468 736 298 605 896
16232 896 655 -511 -2881 -3528 -2713 -1954 -1566 -1772 -2249 -2446 -1587 -418 517 931 1008 937 189 -1068 -2410
16213 -2410 -2588 -1948 -1484 -1890 -2971 -3464 -2881 -1810 -534 580 1731 2539 2636 2244 1700 1116 542 -324 -1246
16194 -1246 -1976 -2295 -1753 -779 555 1609 1842 1480 875 -118 -1167 -2232 -3571 -3473 -2407 -536 734 826
16176 826 345 605 1451 2724 3829 3669 2283 -34 -2088 -2512 -2248 -2595 -2438 -1735 -1096 -497 -130 103 284
16157 284 153 444 781 118 -1015 -1964 -2016 -1721 -2620 -4170 -5184 -4053 -2569 -1229 -539 -420 -765 -917
16139 -917 -831 -713 -701 -712 -1050 -2163 -3409 -2696 -1940 -151 1333 2606 3507 4094 3496 2067 -81 -1737 -1727
16120 -1727 -750 -217 -334 -1021 -1471 -1323 -909 -228 950 2142 3301 3515 3119 2500 1279 -36 -1680 -2186
16102 -2186 -1798 -966 -181 364 749 753 369 -12 -797 -1585 -2333 -2361 -2173 -1286 120 1700 2914 3725 3423 1999
16082 1999 -218 -2366 -3604 -4338 -3576 -1880 163 1658 2332 2090 1173 -51 -420 -15 116 -593 -2055 -3513
16064 -3513 -3499 -1666 -320 172 377 75 -1286 -2593 -1921 -381 610 1235 1396 1293 1016 628 -161 -1782 -3739
16045 -3739 -1645 355 2091 2551 1900 -681 -3350 -2703 -755 -52 -441 -1714 -3136 -3966 -3497 -3651 -2778 -1878
16027 -1878 -906 -458 -382 -799 -948 -975 -588 -288 -788 -1636 -907 428 1541 2237 2277 1645 520 -767 -1716 -2477
16007 -2477 -2618 -2439 -2378 -2437 -2413 -2080 -1590 -1132 -572 -452 -1296 -1869 -992 1132 3560 5185 5242 4072 2729
15988 2729 1242 -41 -791 -1231 -249 1961 4057 5743 6850 7257 6992 6664 6023 5320 4119 3285 1918
15971 1918 907 1545 3963 6527 8006 7915 6432 4268 2045 294 -1226 -1758 -781 320 699 831 625
15954 625 261 -533 -1404 -1947 -2342 -2851 -3755 -4766 -4434 -2746 -1480 -1595 -2320 -3417 -4139 -2198 -581 272
15935 126 -744 -1322 -1753 -1807 -1427 -759 60 554 695 -828 -2953 -3110 -1377 -112 755 1814 2027 1875 1061
15916 1061 -332 -1530 -2613 -2749 -2178 -1169 -215 454 394 331 606 865 1086 1306 1080 293 -414 -404 276
15896 1387 2881 4421 6254 7559 8007 7282 5390 3505 1747 -138 -1392 -2282 -3366 -4942 -4701 -2250
15879 29 2018 3322 4091 3947 2953 1805 181 -1347 -3059 -1411 685 2258 3242 3642 3628 2991 1878 583
15860 -1091 -1683 -218 1325 2362 3186 4184 4677 4408 3269 1633 -208 -3038 -3821 -1793 227 1589 1665
15843 1665 563 -1314 -1887 -689 131 231 -159 -600 -954 -538 -44 612 1021 975 -42 -1117 -2081 -2518 -2316 -1179
15823 -1179 -606 143 780 1431 1547 1091 -13 -1426 -2587 -3468 -3184 -2711 -2188 -1625 -1454 -1384 -1454 -1679 -1485 -923
15803 -923 -924 -1409 -2279 -3262 -4017 -4047 -3228 -2089 -995 218 1101 1643 1890 1648 856 34 -183 29 -147 -1349 -2798
15782 -2798 -3478 -3460 -3164 -2512 -2016 -1682 -1494 -1033 158 1000 1973 2438 2189 1808 1049 106 -1111 -1720 -1493
15763 -1493 -587 132 253 -176 -866 -1641 -1779 -1188 -219 659 1458 2207 2776 2773 2080 882 -38 -717 -1226 -2308
15743 -2308 -3193 -3725 -3667 -3425 -3799 -3320 -3327 -3762 -3224 -1409 465 2034 2845 3173 3120 2425 1931 1530 1346 1452
15723 1452 1665 1777 1611 1706 1723 1609 1281 416 -1215 -2587 -3532 -3195 -1590 467 2965 4993 6035 5875
15705 5875 5077 3729 2153 560 -736 -1464 -1345 -417 1148 3088 4292 4999 4238 2469 259 -1817 -3453
15688 -3453 -4619 -4869 -4525 -3347 -2083 -782 -51 -69 -348 -290 -409 -412 -491 -113 246 -227 -1175 -2827 -2073 -628
15667 350 0 -1113 -2796 -1947 784 3128 4416 4696 4150 3588 3220 3144 2919 2122 727 -1727 -4447 -1891
15648 315 1276 1507 1264 1087 1036 1399 1557 1294 719 11 -995 -1747 -2183 -3032 -3154 -2628 -2445 -2491 -2678 -2749 -315
15626 1632 3142 3574 2626 429 -2346 -1779 1061 3249 3864 4228 4018 2605 1011 -76 6 1151 1705 704
15607 -1056 -2802 -3683 -2819 -2287 -2083 -2265 -1787 -1323 -935 -986 -1443 -2036 -2127 -1002 236 778 1030 868 463
15588 463 -157 -449 -739 -648 -165 645 581 974 1441 1276 834 194 -999 -2519 -4290 -3441 -2182 -1117 -1221
15569 -1221 -2416 -1406 218 1378 1673 1230 325 -909 -2156 -2741 -3289 -1581 -92 1152 1795 1763 1054 233
15550 69 914 1919 2300 1456 -34 -1672 -2268 -1554 -994 -679 -605 -1318 -2399 -3846 -4661 -4244 -3302 -2296 -1887
15531 -1887 -2528 -3204 -1506 852 3307 4689 4897 4584 3490 2000 -197 -1808 -2906 -2764 -1973 -1001 -816
15514 -816 -1708 -2836 -2433 -1251 31 1134 1720 1153 -129 -633 -133 560 721 -24 -1582 -2945 -4568 -3066
15496 -3066 -1820 -908 -623 -598 -938 -1149 -699 -183 -819 -2302 -3934 -4277 -2083 -26 1400 1076 -818 -3477
15478 -3477 -2781 -792 984 2559 3642 4072 3546 2084 -78 -1589 -2261 -1793 -1398 -879 -133 886 2111 3365
15460 3365 4225 4667 4118 2947 1443 -1670 -4340 -2629 -616 131 -245 -1872 -3982 -3165 -1177 226 843
15443 843 995 1200 1794 2680 3006 2764 1963 80 -2329 -5403 -1743 1947 4928 6331 5710 3516 420 -3077
15424 -1702 1206 2745 2787 1868 942 121 -462 -1278 -2407 -3312 -4272 -4527 -3672 -2531 -1405 -278 677 1476
15406 1476 2140 2467 2584 2466 1918 1171 1236 1875 2751 3719 3757 3359 2574 2354 3037 3887 4236 3972 3349 1806
15386 1806 129 -1630 -1177 784 2943 3998 4777 4792 4084 3263 2643 2053 1471 716 -89 -957 -2353 -3504
15368 -3504 -2263 -1031 127 1165 2068 2356 1862 535 -888 -1126 -187 696 887 1011 713 -204 -1790 -3151
15350 -3151 -3228 -2408 -1479 -746 112 1000 1812 1568 399 -1628 -2283 -1375 -752 -766 -1669 -2666 -2634 -1683 -670 401
15329 1478 2346 2575 2459 1662 -368 -3237 -3458 -93 2407 3691 3481 2152 460 -1239 -2401 -3001 -2775 -2280
15311 -2280 -1989 -2127 -2872 -3951 -4814 -4114 -3295 -2486 -1553 -626 436 1587 2809 3553 3858 3605 2392 773
15292 -821 -608 416 469 764 844 507 -504 -1670 -2645 -3049 -3172 -2342 -1472 -398 681 1104 1524 2481 3676 4276
15272 4276 4157 3410 2119 -57 -3041 -3745 -605 1874 3530 3477 2319 954 -802 -1859 -1828 -1495 -884 724
15253 2164 3253 3668 3391 2560 1015 -28 -52 1150 2241 3256 3597 2616 616 -1470 -1775 -869 -644 -1340
15235 -1340 -2841 -4747 -2938 -1697 -1436 -1930 -1994 -1706 -1913 -3534 -4650 -1231 1820 4476 5180 3598
15219 3598 849 -2522 -3059 -66 1902 2171 942 -1209 -2970 -1265 162 889 696 -212 -1102 -646 -10 700
15200 960 720 267 -246 -390 -397 -1149 -1893 -1621 -660 118 374 891 355 -202 -615 -842 -557 123 1141 1871
15180 1871 2450 2832 3265 2635 1188 -293 -954 -876 -986 -1374 -2600 -4347 -3797 -2252 -1187 -362 21 -226
15161 -295 823 2001 3114 3531 4091 4903 5913 6883 8115 8986 9419 8566 6301 3075 -827 -3620 -2459
15144 -2459 -232 1028 1485 1465 979 64 -1408 -2884 -3718 -3780 -3858 -2206 -276 1332 1747 781 -454 -1175 84
15124 2774 4516 4485 3051 574 -2130 -4088 -3799 -3338 -2884 -2229 -1802 -1144 -823 -653 -214 472 1112 1142 742
15105 742 7 -1392 -2754 -2369 -1216 -205 389 276 -413 -409 280 1705 3846 5468 6054 5698 5072 3722 2111
15086 2111 430 -428 118 1644 2944 3249 2314 1602 1463 1726 1877 1675 891 -67 -1028 -1633 -2016 -2329 -2240
15067 -2240 -1075 586 1830 1852 1432 358 -45 -765 -1854 -2920 -3584 -782 1560 2621 1805 111 -1592 -2456
15049 -2456 -2852 -2868 -2504 -2242 -1913 -1605 -713 187 1089 1976 2596 2918 2237 1404 213 -1094 -2202 -2781 -2908
15030 -2908 -2594 -1469 -250 2431 4167 5151 4563 3061 868 -1108 -2285 -2969 -3088 -2889 -2474 -1858 -904
15012 385 1716 2677 3200 3012 1834 -719 -2734 -2169 -519 749 1367 1459 638 -169 -747 -698 140 1643 3085
14993 3085 4034 4286 3848 3144 1731 946 -152 -1356 -2677 -3814 -3543 -3284 -3124 -3143 -2780 -2230 -1904 -2461
14975 -2461 -3823 -5012 -3294 -1390 34 441 10 -809 -1928 -2798 -3355 -3236 -2626 -2013 -1695 -2093 -2741 -2983
14957 -2983 -2727 -2242 -2290 -3119 -3672 -2716 -1189 166 1270 2223 3101 3737 3699 3297 2128 1027 961 1625 2795
14938 2795 4145 4918 4926 3798 1413 -1975 -5341 -6623 -4804 -2704 -514 1618 3207 3785 3229 1908
14922 1908 92 -1586 -1668 -1638 -2285 -2500 -2534 -2843 -2759 -2375 -2100 -1877 -2277 -1919 -1341 -903 -946 -1568 -2648 -3399 -1990
14901 -1990 -971 -584 -1025 -1356 -964 -149 1311 2611 3679 4019 4197 3479 2061 358 -980 -1948 -1720 -1110
14883 -1110 -1244 -1189 66 2304 4718 6563 6551 4775 2649 244 -1538 -1477 -579 338 1140 1159 256 -134 -903
14864 -903 -1973 -2316 -2137 -1835 -1379 -997 -391 196 819 1300 1223 690 -64 -626 -1023 -1232 -908 -28 772 776 64
14842 -1451 -3167 -1585 313 1069 897 -78 -1818 -3645 -4336 -2646 -1762 -1242 -365 673 1348 1957 1946 2077
14824 2077 3098 4233 4557 3755 2662 791 -1419 -2757 -2153 -1872 -2114 -2688 -3064 -2917 -2195 -1685 -1429 -1899
14806 -1899 -3065 -3881 -3552 -3168 -2769 -2329 -1521 -663 -274 -602 -1125 -1100 311 1723 2582 2723 2520 1825 904
14786 548 641 534 621 1101 1492 1409 680 -1399 -4010 -2668 1005 4147 6485 8430 9367 8450 6150 3909
14768 3909 1125 -880 -1529 -415 2156 4537 6484 6423 4713 2304 -387 -2451 -2674 -2298 -2858 -3798 -4662
14751 -4662 -3082 -1628 -573 -259 290 919 1325 1438 772 -479 -1473 -1951 -1442 139 2121 3803 4633 3945
14733 3945 2150 -705 -3380 -4619 -3800 -4121 -4178 -3551 -2844 -2742 -1296 -415 86 448 1235 1496 1397 900 -3 -241
14713 -241 -546 -407 -47 734 933 550 -214 -710 -1485 -2304 -3448 -1970 -563 530 908 1183 701 -271 -1535
14694 -1535 -2889 -4086 -5034 -4507 -3692 -2769 -2230 -1766 -1624 -1472 -1018 -600 124 507 650 319 -915 -2546
14676 -2546 -3538 -2665 -2270 -931 -945 -1624 -1697 -2185 -2924 -2971 -2200 -1693 -1191 -556 -389 -723 -909 -1464 -1843 -1986
14656 -1986 -2143 -2592 -4124 -5252 -3667 -1055 1591 4251 7380 9198 9417 7627 4763 1233 -2264
14640 -3891 -1838 -202 1351 2875 3901 4128 3158 1146 -1306 -3086 -2657 -2495 -3052 -2488 -230 2445 5060
14623 5060 6414 6157 4397 1593 -1330 -1863 446 1553 798 -1159 -4136 -3375 -977 645 1440 1276 150
14605 -1387 -3345 -3753 -1705 -159 546 877 1264 1216 776 999 1919 3403 5433 6884 7399 6759 5458 4197
14587 4197 3858 4134 4706 4784 4274 3268 1591 251 -804 -1713 -2097 -2311 -2081 -1831 -1813 -1992 -2381 -2790 -2982
14568 -2982 -2262 -1169 569 2211 3299 2613 1719 794 -163 -776 -1266 -1941 -2767 -3391 -3514 -2936 -2571 -2153
14550 -2153 -1515 -607 636 1704 2674 3382 3288 2085 93 -1900 -449 2585 4845 5840 5175 3600 1205 -1884
14531 -4370 -5230 -3821 -1810 37 2124 3505 4873 5261 5354 4716 3548 1766 -483 -2602 -5240 -5968 -5536
14514 -5536 -3809 -1355 897 2288 2525 2100 1554 843 614 717 683 454 -239 -1009 -679 592 2145 3397
14496 3397 4036 3796 2775 984 -737 -2196 -2027 -981 -623 -1330 -2930 -4441 -4631 -2474 -470 802 1719 2619
14478 2619 2858 2792 1929 597 -1141 -2829 -4183 -4673 -4627 -4308 -4040 -3879 -3052 -1965 -1411 -858 445 2022
14460 2022 3021 3228 2704 1296 -13 -146 365 1110 1092 165 -1229 -2300 -2602 -2140 -1296 -1098 -1292 -1896 -2466
14441 -2466 -2857 -2326 -1527 -969 -1647 -3603 -5364 -4714 -3744 -3163 -2903 -3428 -2645 -466 1560 2997 3319 2597
14423 2597 1284 -584 -2754 -2081 -734 196 606 177 -91 -168 -238 -497 -879 -1518 -2219 -2883 -3182 -3485 -3314 -2710
14403 -2710 -2175 -1717 -1362 -1128 -508 619 1811 2928 3716 4416 4607 4125 3917 3156 2585 1078 -509 -2622
14385 -2622 -2808 -1296 -908 -1655 -2783 -3613 -4380 -4080 -3476 -3052 -2790 -2240 -1967 -1688 -826 206 944 1862 2511
14366 2511 2926 2974 2724 2660 2707 2543 2118 1432 562 -646 -2337 -4172 -5071 -4807 -4005 -3362 -2666 -2001 -1240 -514
14345 412 1349 2064 2328 1980 1711 1356 1062 705 69 -477 -911 -954 -1119 -1368 -1763 -2228 -2949 -3582 -3138 -2155
14325 -2155 -1686 -1151 -817 -416 -75 277 1230 1194 913 142 -1167 -817 38 425 150 150 31 367 629 332 -86
14303 -864 -805 -377 169 247 -427 -1919 -2493 -1475 -361 -601 -778 -1393 -2510 -3665 -4669 -4589 -3691 -3684 -4448 -5251
14283 -5251 -4080 -1399 1395 4416 6662 8121 8207 7333 6043 4436 3220 2062 771 -720 -2523 -4451
14267 -4451 -2025 595 3006 4488 5945 6288 5630 4723 3582 2287 1306 1164 1414 1751 2085 1902 1534
14250 1534 531 -1339 -3000 -3171 -1803 -828 -142 -322 -888 -1738 -1975 -1412 -1235 -1499 -1626 -1763 -1582 -1576 -1331
14231 -1331 -1342 -1913 -2632 -3148 -3397 -3636 -3726 -3301 -1658 -650 71 249 -267 -1646 -2590 -2591 -2138 -1280 -1047 -1163
14211 -1163 -1426 -1735 -2536 -3688 -3396 -3295 -2825 -2194 -2090 -2171 -1745 -1418 -930 -9 486 781 678 507 125 -288
14190 -926 -2299 -2930 -2365 -2067 -2069 -2327 -2582 -3178 -3194 -2679 -2320 -2287 -2587 -2784 -3332 -2706 -2794 -3397 -3901 -4178 -4419
14169 -4419 -3710 -2146 -203 1762 2905 2726 1965 1376 702 -992 -2475 -3101 -3330 -3353 -3292 -3505 -4256 -4821 -5065
14150 -5065 -5002 -4513 -4624 -3198 -1609 -167 655 715 344 170 100 -33 -65 115 -789 -1860 -1928 -940 245 957
14130 957 1086 1050 376 -465 -1317 -2120 -2822 -3495 -3922 -3672 -3034 -1834 -799 -229 -529 -1597 -1935 -662 633
14110 2155 2289 1336 13 40 1575 3609 5982 6791 6206 4544 2946 1472 258 -205 -54 717 1763 2769
14092 2769 3188 3054 2258 1339 221 -811 -824 -127 693 1749 2979 3859 4347 4353 4141 3628 2832 1505 -262
14072 -1331 -793 788 1610 1700 1663 1107 662 350 402 548 450 10 -661 -2045 -1499 125 1115 1609 1674 1801 1640
14051 1640 1006 -193 -1803 -3379 -3801 -1996 -1195 -1389 -1490 -1737 -1554 -927 8 1191 2166 2298 1662 192 -103
14031 502 1066 720 -25 -1800 -3445 -3191 -2390 -1853 -1953 -2320 -2970 -3409 -3384 -4122 -4357 -4250 -4460 -4265 -3875 -3520
14011 -3520 -3464 -2927 -1456 -482 263 297 69 -161 -742 -1203 -1140 -899 -1090 -1592 -2154 -2743 -3143 -3384 -4001 -5086
13991 -5086 -5006 -4244 -3227 -2356 -2298 -2435 -3024 -2912 -1756 -17 1300 1815 1461 1235 1135 1511 1555 1643 845 -431
13970 -1904 -2859 -1215 -77 212 93 -182 -117 245 335 281 146 -283 -1484 -2756 -3331 -3142 -3250 -2445 -1348 -351
13949 640 1129 1122 224 -1699 -2765 -830 1413 2889 3543 3299 1686 -422 -2972 -2308 945 4399 7433 8766
13931 8766 8495 6203 2823 120 -1216 -1708 -2145 -2494 -2987 -2331 -1102 148 997 1135 1161 1403 1169 295
13912 -1522 -3107 -3801 -2570 -1598 -984 -719 -568 -567 -939 -1751 -2410 -2994 -1949 -343 526 1486 1410 676 -1056
13892 -3001 -2857 -2182 -1344 -386 -33 9 -411 -1046 -1677 -1245 -1087 -803 -399 -440 -1561 -3484 -4252 -3793 -2712 -1472
13872 -1472 -1851 -3069 -3904 -2323 -640 533 686 -400 -2552 -4714 -3958 -2232 -1489 -1914 -2808 -2813 -2300 -2106
13854 -2106 -2181 -2090 -2209 -1592 -708 -151 159 304 146 -232 -525 -989 -1063 -1039 -1057 -1024 -576 82 -97 -314 -1247 -2484
13832 -2484 -2419 -1725 52 2773 4205 3467 1721 -497 -2493 -3674 -4270 -3789 -2606 -1718 -966 -773 -1423 -2926
13814 -2926 -4418 -3994 -3094 -3104 -3681 -3398 -1925 -306 1705 3018 3739 3803 3745 3905 4243 3866 3054 1750 498
13794 -209 -1082 -2370 -2970 -1457 470 2034 3318 3940 3605 2360 230 -1589 -2192 -2132 -1072 364 1426
13777 1426 1802 1764 991 209 -621 -1835 -2671 -2890 -2850 -1891 -677 5 487 445 -355 -2018 -2879 -3064 -2230 -1334
13757 -1334 -1037 -1045 -541 903 2738 4813 6451 6900 5895 4485 2747 744 -101 28 1001 2284 3974 5813
13739 5813 7090 7418 7170 6125 4858 3930 2877 1777 524 -771 -1915 -2871 -3626 -3351 -2258 -1131 -214
13721 437 555 1 -872 -1703 -2455 -3585 -3446 -2795 -1918 -1020 -331 -89 -89 -494 -1885 -4049 -3275 -1455 53 1032
13701 1032 1237 878 638 694 788 1278 2212 2427 2499 1618 357 -1420 -3091 -3022 -2397 -2902 -3079 -2147 -1551 -1552 -2305
13680 -2305 -2988 -1690 -2 1398 2167 2658 2943 3195 3026 2491 1951 671 -318 -1471 -2184 -2475 -2083 -1206 -322
13660 175 -482 -1956 -2963 -1153 1031 2031 1995 1110 -291 -1861 -2644 -1244 5 656 804 1184 2007 3173
13642 3173 4315 4631 4053 3075 1138 -355 -655 -820 -1154 -1323 -263 1062 1864 1642 511 -1597 -2976 -1291
13623 -94 276 -416 -1597 -2911 -2294 -2620 -2762 -2225 -1798 -1974 -2714 -3181 -1313 277 1483 1698 1151 209 -1113
13603 -2385 -3284 -2495 -2074 -1852 -1755 -1506 -1070 -513 -207 -41 447 1130 1258 1274 1419 1419 1089 358 -650 -2197 -3114
13582 -3114 -3660 -3844 -3255 -2431 -1822 -1276 -614 -485 -869 -1481 -1833 -1998 -1824 -1319 -1531 -1546 -1787 -1764 -2094 -2263
13562 -2263 -1859 -1532 -1255 -1410 -2025 -2131 -1213 -31 1240 2119 2105 2357 2306 2213 1781 1140 659 79 395 1160 2151
13541 2151 2869 2959 2745 2282 1451 1219 1318 1037 270 -1002 -2410 -3500 -3343 -2619 -2645 -2693 -2297 -1893 -1752 -1932
13521 -1932 -2073 -1643 -350 512 627 -561 -2654 -5220 -3655 202 3293 5507 6637 6924 5457 3253 1246
13503 -186 -699 -795 -1262 -1892 -2394 -1724 -418 700 1394 1723 1474 813 163 -369 -948 -1329 -2716 -2587 -774 1368
13482 3336 5239 7067 8936 9834 10517 9541 7780 5000 2438 274 -814 -1713 -2329 -2564 -2101 -808 986
13464 2732 4037 4423 3932 2651 949 -1061 -3206 -5496 -5063 -2478 449 2988 5121 6567 6889 6439
13448 6439 4972 3339 2706 2590 2601 2778 2320 1523 661 45 -989 -1993 -2481 -2005 -1046 65 1082 2302 3935
13429 3935 5372 5656 4456 2653 457 -1683 -2803 -1606 -1677 -1879 -1667 -849 -235 -28 -415 -1415 -2563
13412 -2563 -3203 -2066 -959 77 -41 -862 -2391 -3505 -2429 111 2046 2977 2880 2714 3035 3184 3056 2610 1277
13392 -540 -2141 -2069 -740 372 1231 2532 3540 4242 4356 3694 2396 703 -1313 -3380 -4486 -1742 678
13374 2796 4500 5836 6647 6833 6769 6784 6888 6452 5157 3515 1967 341 -489 -1735 -2607 -2842 -2840 -2757 -2671
13355 -2671 -2019 -1745 -2167 -2734 -3370 -3884 -4144 -4031 -3611 -3134 -2734 -1907 -433 1036 2465 4223 6223 7945
13337 7945 8335 7691 5855 3155 466 -1411 -1201 -845 -629 -923 -1514 -1552 -459 1629 3460 5143 5471 4438
13319 4438 3448 2978 2946 2612 1916 1588 1585 1820 1286 301 -1705 -3829 -3299 -1468 -434 -2 -21 -219 -121 146 199
13298 199 -436 -1603 -1329 -77 1387 2360 2926 3210 2987 2747 906 -1180 -2946 -4465 -5073 -4150 -3179 -2398
13280 -2398 -1994 -1537 -1341 -1128 -462 -78 -146 -654 -1388 -2108 -3014 -3757 -3626 -2776 -1562 -685 -355 154 450 518
13260 518 413 -390 -1613 -3461 -4414 -3995 -3221 -2654 -2287 -2102 -2060 -2122 -2202 -2412 -1832 -1408 -1158 -1739 -3066 -4404
13240 -4404 -3798 -2120 -815 -130 -375 -979 -1224 -1343 -831 596 1728 1990 1678 1045 -84 -1609 -2950 -3951
13222 -3951 -4751 -4814 -3437 -1065 461 1375 1352 127 -1561 -2107 192 2246 3915 4216 3567 2159 411 -1733
13203 -3149 -3245 -2548 -1237 391 1691 2412 2373 1287 -312 -2564 -3915 -4115 -3734 -2592 -1111 -331 186 208
13185 208 -381 -1301 -2305 -2665 -1442 -750 -380 -903 -1682 -1849 -1531 -1139 -893 -763 490 1445 2366 2782 2578
13166 2578 1074 -1383 -3593 -3840 -3529 -2691 -2102 -1689 -1485 -905 -532 -265 -299 -375 -660 -991 -1669 -1759 -1112
13147 -1112 -53 1043 636 145 -110 -206 31 211 358 290 463 1725 3240 4689 5568 5286 3743 1240 -1961
13127 -3153 -478 1718 2450 2207 1278 467 -680 -2234 -3090 -2475 -2477 -2894 -2816 -1567 -256 125 -980 -2944 -1698
13108 -1698 1163 3855 5009 4517 2990 857 -695 -1795 -1423 -2264 -3145 -3488 -2491 -1064 351 1468 2756
13091 2756 3662 3790 2695 988 -543 -1469 -2030 -2351 -2490 -2386 -2831 -3600 -4303 -5141 -3938 -2556 -1399 -755
13073 -755 85 411 195 -336 -1067 -1695 -2513 -3698 -4843 -4750 -2927 -652 892 1738 2407 2641 1708 146 -1331
13053 -2845 -2533 -304 1990 2895 2388 938 -1049 -3498 -4633 -3117 -2400 -1772 -1698 -1875 -1814 -1112 -166 678
13034 1303 1419 1921 1610 1225 855 487 760 1837 2665 2835 2245 597 -725 -534 1071 2982 4889 6236
13016 6236 6559 5474 4083 2029 -481 -2862 -3568 -2187 -23 2350 4129 5202 6320 6946 8021 9418
13000 9418 11053 11984 11728 10532 8131 4943 1933 255 -220 -1001 -2383 -4533 -3275 -1179 526 1987
12984 1987 2720 2232 565 -1320 -3791 -3724 -1633 25 1521 2922 3300 2760 1592 91 -2212 -3640 -2860 -2368
12966 -2368 -2575 -2949 -2688 -1804 -1374 -1116 -1413 -1788 -2158 -2790 -3019 -2815 -2080 -1067 304 1494 2067 2191 1983
12947 1983 1297 148 -1005 -1852 -1708 -898 -47 791 1256 1501 1756 1265 218 -763 -1683 -2025 -1441 -1216 -1357
12928 -1357 -2011 -2781 -2490 -426 3058 5984 7112 6568 4847 2080 -523 -1785 -1610 -812 -282 -392 -430 -619
12910 -619 -1175 -2327 -2443 -365 1811 3162 3131 2299 324 -1918 -4111 -3671 -3009 -2711 -3069 -3868 -4710 -5413
12892 -5413 -5606 -5134 -3934 -2461 -1221 -427 149 -332 -1069 -2093 -2089 -330 563 1011 1207 1955 3318 5165
12874 5165 6988 7980 7539 5480 2006 -1373 -2981 -302 638 42 -1838 -4345 -3365 -2395 -1782 -2150 -2976
12857 -2976 -3125 -1196 303 914 1001 326 -496 -869 -493 615 2557 4445 5819 5490 3265 776 -752 -286
12838 507 826 411 -176 -435 -495 -432 -98 -77 -282 -574 -1004 -1434 -1260 -517 470 1039 1765 2434 2443 1812 1107 322
12815 -195 -476 -1472 -2301 -3555 -3745 -2694 -1943 -1670 -1502 -938 -278 48 -170 -581 -838 -1207 -2083 -2327 -1649
12796 -1649 -1413 -2063 -2797 -3193 -2539 -2271 -2262 -2590 -3266 -3877 -4081 -3844 -3355 -2419 -1076 554 1767 2213 2367
12777 2367 3448 5451 6613 6965 5107 2566 -166 -2361 -3509 -2702 -1777 -815 370 1096 1240 785 -50
12759 -825 -1355 -1757 -1632 -1418 -1526 -1193 -277 682 1177 422 -458 -1669 -1914 -1153 -490 596 1468 1486 863 -763
12738 -2718 -4775 -5143 -3948 -3325 -3242 -3172 -3194 -3474 -3873 -3732 -2804 -2676 -2625 -2003 -2011 -2819 -3971 -4879 -4163 -3802
12718 -3802 -2851 -1715 -275 1165 2122 2735 3132 2740 1876 673 -685 -1957 -1312 -1010 -1622 -3002 -4353 -4428
12700 -4428 -2774 -1602 -673 -337 955 2123 2947 3206 2509 1303 326 -386 -479 -502 -592 -536 -659 -376 -27 -276
12680 -276 -1300 -2508 -2274 -485 1131 2048 1710 167 -1553 -3445 -3881 -3020 -2728 -3608 -4688 -5040 -3325
12663 -3325 -1715 -550 284 407 -443 -1874 -1499 557 2815 3929 4087 3609 2954 2018 821 -749 -2399 -3504
12645 -3504 -2172 -1254 -763 -253 19 258 496 712 1144 1447 1741 2114 1994 1148 -742 -3053 -3082 -453 2101
12625 3342 3290 1927 -190 -2356 -3454 -3634 -2924 -1657 -172 1025 1996 2413 1973 1158 -440 -2198 -3326
12608 -3326 -4274 -3701 -2521 -1236 -110 1143 1937 2301 1755 520 -1096 -2395 -3376 -1747 -527 -178 -202 529
12589 1835 3277 4777 6339 8108 9433 9576 8652 6602 3199 -542 -3344 -5192 -4206 -3878 -4390 -2494
12573 -2494 -640 945 2158 2736 2800 2842 2421 1348 310 -765 -1093 -1000 -1101 -983 -1250 -1804 -3150 -4638 -2875
12554 -2875 -756 616 1024 853 -108 -1078 -1834 -2866 -4615 -4332 -3313 -2616 -2203 -2262 -2179 -1583 -1404 -1992 -2909
12535 -2909 -2387 -9 1802 2812 2864 1662 -159 -1966 -1568 776 2118 2576 1580 284 -1505 -2519 -2074 -1433
12517 -1433 -1114 -921 -511 64 673 749 355 -388 -932 -368 438 1624 2507 4159 5595 6646 6830 6104 4219
12498 4219 2777 1742 1971 2893 3783 3371 2653 2520 3235 4118 4214 3457 1690 -526 -1106 129 1706 2618
12480 2618 2735 1911 421 -753 -660 1248 3256 4760 5702 4728 2487 432 -1061 -306 878 1626 2261 3231
12462 3231 3694 3564 2081 143 -921 -1150 -324 1207 2447 3025 2289 803 -710 -1607 -1659 257 1869 2517
12444 2517 2408 1699 412 -805 -2107 -2817 -2135 -659 524 1331 2178 3322 3920 370 1690 2514 2594 2381 2486
12425 2486 211 -1976 -4648 -6024 -5468 -4940 -6236 -5677 -1864 2770 6426 8619 8970 7446 4521 1823
12408 875 1476 2854 3369 2654 680 -2152 -4452 -2457 -727 724 1459 1038 944 1196 1530 1158 515 -575 -1405
12389 -1405 -2067 -2411 -2171 -1933 -1041 -96 658 1639 2356 2960 3298 2623 2140 1434 647 -689 -2194 -3362 -3970
12370 -3970 -4034 -2988 -1535 -280 1118 2601 3337 3286 2098 -106 -2006 -3835 -2747 -1392 -179 1194 3065
12353 3065 5132 6560 7856 7932 6355 3276 86 -3367 -2552 -1348 -1411 -1286 -628 77 577 447 -348 -835
12335 -835 -1703 -1954 -1662 -1329 -838 -709 -1022 -1723 -1795 -1840 -1567 -940 588 2215 3020 3556 3511 2223 243 -1619
12314 -3394 -4250 -3384 -2727 -2996 -3611 -3455 -2353 -2045 -2186 -3290 -4489 -3581 -2628 -1860 -1613 -2058 -2658 -2879
12296 -2879 -2160 -1047 467 1526 2442 3027 3129 2609 1615 -142 -2055 -4003 -4981 -3495 -1719 -469 743
12278 1358 1488 1042 -21 -2206 -3363 -3058 -2792 -2994 -4289 -3493 -2099 -925 -1017 -2020 -3892 -5383 -4676 -3514
12260 -3514 -2761 -2325 -1666 -866 -504 -167 -175 -456 532 1274 1881 2029 1742 701 100 -777 -1623 -1864 -904 790
12239 2589 4378 5112 3382 1963 268 -510 539 2101 3081 3258 2635 1212 -1280 -3159 -4055 -3171 -1397
12221 -46 695 547 -374 -1907 -3176 -2841 -694 1184 2597 2936 2382 1143 -389 -1342 -950 450 1651 1825
12203 1825 1186 -62 -1375 -2102 -2215 -2321 -2322 -1833 -820 -63 567 771 424 -259 -626 -624 -342 -119 -152 -175 -36 298
12180 761 1850 3543 5739 7126 7501 6794 5030 3086 701 -2211 -2424 375 1652 2272 2169 1073 35
12162 -1265 -1809 -1961 -1471 -718 -117 313 758 805 393 -385 -1202 -1594 -776 290 1032 1300 1094 670 383 270
12142 270 187 -417 -1778 -4188 -2534 -10 1712 2645 3026 3330 3572 3450 2635 961 -812 -857 1271 3735 5289
12123 5289 5900 5563 4396 1892 -1981 -4811 -145 3971 6437 6395 3682 -917 -2327 978 2460 2551 1313
12106 1313 703 1509 2223 4178 5410 5966 5520 4935 4383 3771 2476 578 -1249 -1869 -2237 -3089 -3661 -1468
12087 709 1618 740 -1540 -2828 -490 817 1198 1076 765 59 -493 -1097 -2095 -2914 -4194 -6163 -5111 -1066
12068 2514 4099 2993 931 2937 8373 11361 7932 8680 30285 60188 90956 115359 128677 126637
12054 126637 109792 82055 50119 20764 4131 7743 9431 5673 427 -506 2548 5291 6746 5510
12040 5510 2296 -1359 -3755 -3317 -1293 21 773 704 -44 -765 -955 -288 345 744 222 -940 -2444 -3470
12022 -3470 -1563 -233 -489 -1232 -2236 -2490 -1776 -871 -709 -1895 -3788 -5485 -6271 -5004 -4054 -3338 -2805
12005 -2805 -2378 -2293 -2971 -3684 -3897 -3338 -3239 -3052 -3167 -3141 -2825 -2346 -1395 -990 -637 -379 -252 -617 -2044 -4584
11985 -4584 -2742 523 2799 3348 1087 -3890 2578 12644 22067 29534 33297 32757 28784 23361 17670
11970 17670 13190 8653 4085 1035 -1381 -2309 -1844 -1087 -530 -390 -583 -1417 -2114 -3059 -3301 -2377 -1487
11953 -1487 -750 106 962 2468 4240 5490 6104 5684 4585 2491 20 -3248 -3523 -1057 919 2051 2299
11936 2299 1572 -91 -1893 -3058 -2830 -2020 -2043 -1432 -505 -50 -725 -2351 -3649 -2763 -1777 -1155 -1666 -2843 -2699
11917 -2699 -425 742 490 -812 -2107 -2841 -2638 -2012 -1129 -14 729 1436 2345 3436 4122 3371 1876 582 168
11897 566 873 407 -172 -641 -736 -665 -1133 -1660 -2028 -2274 -1900 -1456 -852 -546 -448 -1013 -2004 -3342 -4750 -3916
11877 -3916 -1968 -595 -188 -187 -504 -1133 -1957 -2490 -3105 -4232 -4028 -2478 -562 801 1507 1764 1780 1779 2495 3356
11857 3356 4099 4104 3888 2872 2247 1504 528 -539 -1204 -769 -220 -545 -1731 -3517 -5190 -5524 -5272 -4504 -3923
11838 -3923 -3587 -3438 -2521 -1339 -722 72 768 1042 859 652 1155 1233 1294 1265 432 -408 -1943 -3273 -4287
11819 -4287 -1848 -404 -913 -2326 -2822 -2003 -760 -301 -1153 -2354 -1172 -14 -1292 -1316 3881 10751 16431
11802 16431 18933 16212 10453 5122 10075 25339 44018 63345 78163 85534 83046 70612 51065
11789 51065 28464 10528 8412 14260 16288 13048 7286 3560 3245 3337 2190 -179 -2282 -1368 -166
11773 1050 1436 751 449 328 -142 -1593 -2877 -3096 -2210 -1343 -1122 -1907 -2478 -1949 172 2438 3636 4097
11755 4097 4266 4300 4144 3260 1102 -2227 -4210 -869 1288 1865 1077 -504 -1981 -2065 -1462 -898 -338 127
11736 304 518 293 -681 -1986 -3154 -3129 -3425 -4663 -4314 -2017 81 1755 2959 2449 607 -1272 -2576 -2933
11718 -2933 -2236 -1071 141 1078 1631 1756 1261 437 -491 -1555 -2144 -555 600 1132 1612 2235 2999 3763 4547
11699 4547 3742 3053 2199 872 -537 -1774 -2581 -1721 1004 3852 6172 7456 8263 7917 6603 3847 1165
11681 -1425 -3447 -5138 -4756 -3595 -2314 -1087 164 980 2137 3010 3246 2822 1624 12 -2314 -4185 -5047
11664 -5047 -5560 -5073 -4517 -3364 -1751 -153 810 929 1003 864 1220 1553 1285 523 -431 -1208 -1475 -1142 -1527
11645 -1527 -2880 -2781 -154 2355 4244 5230 5149 3793 2103 422 -832 -1502 -1768 -1414 -1011 -127 493 327
11627 327 -789 -2092 -3676 -4699 -3643 -2436 -1797 -1252 -897 -890 -798 -1406 -1718 -1678 -1180 -410 543 774 462
11608 462 -216 -730 -1464 -2148 -2914 -3305 -3554 -3289 -2925 -2691 -2206 -2140 -3127 -3637 -2199 -1097 -678 -998 -2603
11589 -2603 -3827 -3080 -1815 -995 -478 29 202 -208 -478 -267 15 372 1016 1516 1114 308 -765 -1148 -1329
11570 -1329 -720 -801 -1290 -3337 -5031 -4681 -2462 -833 2602 3910 3360 567 521 -15 1691 3535 7089 8133
11552 8133 12521 10515 6900 322 -3768 -7427 -7237 -3452 -782 -11 -309 -2089 -3698 -2875 -1120 77 -105
11534 -1731 -3823 -4069 -228 1079 212 -2354 -3587 -4216 -5085 -7314 -2053 5065 12996 16982 16976 11610 2494
11516 -22 3574 12160 14820 12753 7097 265 -1569 2988 6265 4101 287 -2739 624 5123 7132 6420
11500 6420 3531 -780 -5140 -5546 -3955 -3453 -3665 -3966 -3775 -3048 -2910 -2797 -3036 -3744 -4985 -4808 -3383 -1173
11481 543 890 -467 -2050 -1787 -635 1360 2394 2313 1225 -635 -2526 -3213 -2985 -2883 -3240 -3338 -3218 -2749 -2402
11462 -2402 -2282 -1461 -12 1197 2188 1993 665 -1246 -2975 -2840 -1328 -584 -305 -704 -1517 -3011 -5071 -3469
11444 -3469 -699 1237 1507 321 -2277 -3522 -4969 -5507 -5097 -3987 -3351 -2104 -316 1455 2940 3950
11428 3950 4505 3613 1656 -949 -3231 -4665 -4080 -2559 -1750 -1530 -1542 -1438 -1831 -2136 -2378 -1772 -894 -528
11410 -528 -436 -883 -1008 -384 970 2031 2217 1308 -32 -2105 -4565 -2979 -1690 -1715 -2653 -3803 -4843 -5640
11392 -5640 -4986 -4054 -1336 394 1232 969 344 -960 -2322 -2637 -1844 -968 -548 -235 -616 -1116 -1747 -1481 -551
11372 145 881 1652 2269 2507 2168 1799 1080 328 -1049 -2339 -3232 -3511 -3850 -3857 -2710 -1144 -716 -320 -109
11352 -102 -250 -185 -433 -1158 -2202 -3660 -3547 -1212 663 1643 1533 -329 -4375 -1494 5434 12813 19224
11335 19224 22821 23241 19994 13819 6880 120 -2422 -338 1380 1947 1629 1166 1110 1478 2672 3428 4311
11318 4311 4788 4277 3234 1485 526 418 1323 2625 3623 4371 4019 2543 -32 -3753 -2054 656 2080
11301 2080 2395 1992 1372 2205 3058 3937 3820 3042 1845 833 819 2028 2315 1537 -133 -2714 -5294 -5734
11283 -5734 -3559 -2473 -2418 -2417 -2648 -2986 -3559 -3933 -3315 -3106 -3145 -3307 -4214 -4732 -5053 -4633 -4596 -4624 -4030 -3188 -2783
11262 -2783 -3228 -4005 -3233 -2338 -710 369 1395 1566 1699 2067 2103 1379 -841 -3337 -4839 -3167 -2545 -3264
11244 -3264 -3006 -2580 -3166 -3090 -835 3058 5856 6984 6482 4784 3164 2174 2149 2085 1364 463 1232 2599
11226 2599 2398 -532 -3140 673 3370 2947 -401 -1632 1438 2326 -421 -4826 -64 3095 4056 3569 1141
11208 -2009 1563 10597 16826 13694 5900 12364 24996 28124 19574 27478 58684 77474 70331 108174
11194 108174 256193 467533 693840 886263 1001198 1010325 911508 728880 502748 285639
11184 285639 125069 70983 80033 65954 32278 16161 29612 29108 17966 10046 12874 13115 5918
11170 -5072 3812 7848 5463 1203 2737 6850 7948 6857 4524 2518 1114 388 113 -511 -1512
11155 -1512 -1233 -497 687 1804 3513 4257 5063 4513 3158 2592 3131 4130 4688 4650 4505 4391 4431 3831 2215
11136 2215 419 -897 -1204 -818 -505 -542 -68 1303 2116 2677 2879 3015 3550 4107 4744 4401 3260 1258 -1113
11116 -3304 -4583 -5080 -4114 -3002 -2339 -3123 -3555 -3547 -3104 -3152 -3824 -4908 -5150 -3479 -2503 -1689 -844 -271 -208
11097 -208 -778 -2318 -3843 -3664 -763 1254 1852 569 -2066 -1956 1412 4550 6192 5922 3674 968 -1824
11079 -2395 772 4169 5874 5616 3806 1498 -722 -2451 -2180 -1421 -1033 -1340 -1807 -2723 -3413 -2939 -1005
11061 1371 3824 5320 5601 4693 2964 1348 499 -653 -2027 -3456 -4824 -4190 -2918 -1945 -2177 -2353 -2204
11044 -2204 -1282 -8 1016 1792 1796 691 -1473 -5087 -4955 -1726 941 2417 2910 2871 2070 159 -1700 -2873 -3166
11025 -3166 -3097 -2453 -1920 -2352 -2564 -2354 -1959 -1301 -1343 -2452 -3649 -2936 -1726 -926 569 1795 2238 2339 1984
11006 1984 1643 911 -935 -3722 -1104 2707 5252 5549 3633 157 -911 984 2276 1885 475 -892 -1895
10989 -1895 -2857 -3799 -4056 -2229 668 2461 3300 3212 4035 5889 7999 9560 10013 9428 7787 5904 4060
10972 4060 2394 961 -67 -202 793 2464 4278 6242 7759 8923 8732 7196 4298 1327 -376 -81 391
10954 123 -784 -1783 -2630 -2855 -1520 654 1359 793 -1087 -2185 -2594 -1843 -1600 -1970 -2522 -1882 -234 928 1322
10935 1322 1300 2723 3357 3831 3899 3800 3700 3256 3159 3596 4290 4746 4034 2505 183 -1522 -3077 -3474 -2253
10916 -2253 -1620 -1772 -1254 -295 288 453 565 911 1597 2578 2402 1271 -1351 -735 1258 3863 6375 7265
10898 7265 5190 623 -4164 -4431 -1721 1142 1844 1760 557 -738 -1438 -1403 273 1950 4382 8131 13366
10881 13366 17177 18672 18644 12909 8593 3901 1431 357 -177 -1243 -2001 -4963 -5761 -1239 2881 5384
10865 5384 5779 4356 892 -2499 -4435 -1877 -516 -53 361 1724 3278 4169 4124 3044 1564 840 1300
10848 1300 2292 3002 3744 4007 3378 1720 -816 -2801 -3415 -2892 -4040 -4746 -2235 -194 621 -246 -1839 -5521
10830 -5521 -5122 505 5426 10036 12262 12280 10263 5092 580 -2702 -1475 233 529 -355 -1870 -2652 -3399
10813 -3399 -4005 -3353 -2007 -884 365 1420 1212 -961 -4475 -4952 -2772 -291 932 2126 2527 2889 3958
10796 3958 4398 3369 922 -2216 -4598 -2442 -1179 -2693 -5337 -5273 -1631 912 1361 -184 -2514 -2712 -1750
10779 -1750 -811 -1147 -1282 -733 -555 -3 816 3267 4360 3774 1864 -1125 -1016 1492 3274 3651 2270 139
10760 -3153 -6322 -2714 -413 -559 -542 2582 5409 5401 2039 -3683 -4007 3491 9201 10044 8115 3268 -265
10742 1328 10017 17245 19138 16623 14552 16248 21273 25987 27880 32268 34230 35353 41917 59673
10728 59673 83240 104336 131912 186266 276473 393994 524320 651469 761934 842743 869087
10717 869087 835796 755078 635342 491548 346635 225887 150562 120995 105142 83852 60718
10706 60718 46077 38802 29329 21466 20655 24976 26201 20630 12646 8717 10559 12763 11317 5975
10692 5975 714 3724 10900 14188 12453 6785 830 1532 3306 1349 -3411 -2453 1663 4013 4707 4154
10676 4154 2997 1200 -1636 -1271 1623 3183 2743 1132 608 3282 6603 8364 7330 3636 -1078
10660 -3198 -722 438 310 -639 -1360 -958 -537 -802 -1299 -2023 -2308 -2258 -2358 -2342 -1513 504 2001 2463 1834 515
10639 421 2042 4611 7161 8973 9975 9593 7695 4602 1873 460 632 1372 1706 1076 -904 -3031 -2983
10622 -2983 -1338 -90 540 443 295 -255 -1354 -2616 -3603 -2905 -1684 -423 401 903 744 -403 -2202 -4477
10604 -4477 -5719 -3025 -981 -849 -2117 -3378 -3273 -2318 -1324 -891 -991 -1216 -1519 -4014 -3262 -2130 209
10586 1603 2003 1732 822 -719 -680 1145 3861 6383 7230 5702 2134 -2019 -4893 -6583 -5917 -3318 -1336
10568 334 920 74 -2521 -4103 -1976 165 1687 1975 823 -1491 -4492 -2858 -307 1907 3508 4505 4438
10551 4438 3204 2371 1413 812 858 1412 1778 1680 932 -469 -2151 -1847 -200 1632 2880 3723 3115 1148
10532 -1672 -5896 -2370 780 1967 1328 -114 -1313 -667 80 -171 -1374 -3018 -4302 -5416 -6964 -6705 -4784
$$ [...]