
##TITLE=AC1402_HONAH12211_7653193_SUyz3jfani
##JCAMPDX= 6.0         $$ Bruker NMR JCAMP-DX V2.0
##DATA TYPE= NMR SPECTRUM
##DATA CLASS= NTUPLES
##ORIGIN= BRUKER
##OWNER= Administrator
$$ 1.72 TOPSPIN		Version 2.1
$$ 2013-03-19 19:52:20.149 -0500  Administrator@X
$$ Compression mode = diff/dup
##.OBSERVE FREQUENCY= 400.02188249412
##.OBSERVE NUCLEUS= ^1H
##.ACQUISITION MODE= SIMULTANEOUS (DQD)
##.ACQUISITION SCHEME= undefined
##.AVERAGES= 64
##.DIGITISER RES= 22
##SPECTROMETER/DATA SYSTEM= spect
##.PULSE SEQUENCE= noesygpps1d.comp
##.SOLVENT NAME= COFFEE_meoh
##.SHIFT REFERENCE= INTERNAL, COFFEE_meoh, 1, 14.96086
##AUDIT TRAIL= $$ (NUMBER, WHEN, WHO, WHERE, PROCESS, VERSION, WHAT)
$$ ##TITLE= Audit trail, TOPSPIN		Version 2.1
$$ ##JCAMPDX= 5.01
$$ ##ORIGIN= Bruker BioSpin GmbH
$$ ##OWNER= Administrator
$$ $$ E:\/data/COFFEE/nmr/AC1402_HONAH12211_7653193_SUyz3jfani/12/pdata/1/auditp.txt
$$ ##AUDIT TRAIL=  $$ (NUMBER, WHEN, WHO, WHERE, PROCESS, VERSION, WHAT)
(   1,<2013-03-19 19:52:14.274 -0500>,<Administrator>,<X>,<go>,<TOPSPIN 2.1>,
      <created by zg
	started at 2013-03-19 19:40:44.586 -0500,
	POWCHK enabled, PULCHK disabled,
       configuration hash MD5:
       86 BA 57 50 F2 9D 5C 9B 26 00 A9 28 5F 66 2E 89
       data hash MD5: 64K
       90 43 95 86 69 D3 02 FD 11 6B DD CA AC 9E 8B B5>)
(   2,<2013-03-19 19:52:17.368 -0500>,<Administrator>,<X>,<proc1d>,<TOPSPIN 2.1>,
      <Start of raw data processing
       efp LB = 0.3 FT_mod = 6 PKNL = 1 PHC0 = 0 PHC1 = 0 SI = 128K 
       data hash MD5: 128K
       D5 E2 B1 51 DC 0F B0 B9 E7 C0 67 48 58 AA FC 6E>)
(   3,<2013-03-19 19:52:18.414 -0500>,<Administrator>,<X>,<proc1d>,<TOPSPIN 2.1>,
      <pk PHC0 = -75.81116 PHC1 = 0 
       data hash MD5: 128K
       11 BC EC 59 A2 AC 0B FB 5A FD 11 FF 97 42 A0 85>)
(   4,<2013-03-19 19:52:19.071 -0500>,<Administrator>,<X>,<proc1d>,<TOPSPIN 2.1>,
      <abs ABSG = 1 
       data hash MD5: 128K
       81 5C 6E 3A F3 5A BF BE 20 43 D6 9A DF CC 76 C7>)
(   5,<2013-03-19 19:52:19.258 -0500>,<Administrator>,<X>,<proc1d>,<TOPSPIN 2.1>,
      <abs ABSG = 2 
       data hash MD5: 128K
       C1 55 E2 0D 94 49 97 D4 01 3D 6B A7 7D 09 2C 6E>)
(   6,<2013-03-19 19:52:19.430 -0500>,<Administrator>,<X>,<proc1d>,<TOPSPIN 2.1>,
      <abs ABSG = 3 
       data hash MD5: 128K
       BE FD 4B 87 AC A9 98 4A ED 4C 22 17 20 04 5C 16>)
(   7,<2013-03-19 19:52:19.618 -0500>,<Administrator>,<X>,<proc1d>,<TOPSPIN 2.1>,
      <abs ABSG = 4 
       data hash MD5: 128K
       C9 D9 72 7F A3 E6 18 66 15 94 C0 69 E8 F1 53 E6>)
(   8,<2013-03-19 19:52:19.805 -0500>,<Administrator>,<X>,<proc1d>,<TOPSPIN 2.1>,
      <abs ABSG = 5 
       data hash MD5: 128K
       82 C5 52 F8 8C 3F 1E 00 E6 9D 3E ED 32 0C 6D F7>)
$$ ##END=
$$ 
$$ $$ hash MD5
$$ $$ 4F 64 45 A1 18 25 53 76 F5 AA 0A CE 08 9F 8C 1D
##$RELAX= 
##$RELAX= 
##$RELAX= 
##$RELAX= 
##$RELAX= 
##$RELAX= 
##$RELAX= 
##$RELAX= 
$$ Bruker specific parameters
$$ --------------------------
##$DU= <E:\>
##$EXPNO= 12
$$ [...]
##$TP07= 0
##$TPNAME0= <>
##$TPNAME1= <>
##$TPNAME2= <>
##$TPNAME3= <>
##$TPNAME4= <>
##$TPNAME5= <>
##$TPNAME6= <>
##$TPNAME7= <>
##$TPOAL= (0..7)
0.5 0.5 0.5 0.5 0.5 0.5 0.5 0.5
##$TPOFFS= (0..7)
0 0 0 0 0 0 0 0
##$TUNHIN= 0
##$TUNHOUT= 0
##$TUNXOUT= 0
##$USERA1= <user>
##$USERA2= <user>
##$USERA3= <user>
##$USERA4= <user>
##$USERA5= <user>
##$V9= 5
##$VALIST= <valist>
##$VCLIST= <CCCCCCCCCCCCCCC>
##$VD= 0
##$VDLIST= <DDDDDDDDDDDDDDD>
##$VPLIST= <PPPPPPPPPPPPPPP>
##$VTLIST= <TTTTTTTTTTTTTTT>
##$WBST= 2048
##$WBSW= 25
##$XGAIN= (0..3)
0 0 0 0
##$XL= 0
##$YL= 0
##$YMAX_a= 6486559
##$YMIN_a= -13233443
##$ZGOPTNS= <>
##$ZL1= 120
##$ZL2= 120
##$ZL3= 120
##$ZL4= 120
##$ABSF1= 14.96086
##$ABSF2= -5.597322
##$ABSG= 5
##$ABSL= 3
##$ALPHA= 0
##$AQORDER= 0
##$ASSFAC= 0
##$ASSFACI= 0
##$ASSFACX= 0
##$ASSWID= 0
##$AUNMP= <proc_prof1d_extract.lims>
##$AXLEFT= 0
##$AXNAME= <>
##$AXNUC= <1H>
##$AXRIGHT= 0
##$AXTYPE= 0
##$AXUNIT= <>
##$AZFE= 0.1
##$AZFW= 0.1
##$BCFW= 0
##$BC_mod= 0
##$BYTORDP= 0
##$COROFFS= 0
##$CY= 15
##$DATMOD= 1
##$DC= 0
##$DFILT= <>
##$DTYPP= 0
##$F1P= 0
##$F2P= 0
##$FCOR= 0.5
##$FTSIZE= 131072
##$FT_mod= 6
##$GAMMA= 0
##$GB= 0
##$INTBC= 1
##$INTSCL= 1
##$ISEN= 128
##$LB= 0.3
##$LEV0= 0
##$LPBIN= 0
##$MAXI= 10000
##$MC2= 0
##$MEAN= 0
##$ME_mod= 0
##$MI= 0
##$NCOEF= 0
##$NC_proc= -2
##$NLEV= 6
##$NOISF1= 0
##$NOISF2= 0
##$NSP= 0
##$NTH_PI= 0
##$NZP= 0
##$OFFSET= 14.96086
##$PC= 1
##$PHC0= -75.81116
##$PHC1= 0
##$PH_mod= 1
##$PKNL= yes
##$PPARMOD= 0
##$PPDIAG= 0
##$PPIPTYP= 0
##$PPMPNUM= 2147483647
##$PPRESOL= 1
##$PSCAL= 4
##$PSIGN= 0
##$PYNMP= <proc.py>
##$REVERSE= no
##$SF= 400.020009693103
##$SI= 131072
##$SIGF1= 0
##$SIGF2= 0
##$SINO= 400
##$SIOLD= 131072
##$SPECTYP= <>
##$SREGLST= <1H.CDCl3>
##$SSB= 0
##$STSI= 131072
##$STSR= 0
##$SW_p= 8223.68421052631
##$SYMM= 0
##$S_DEV= 0
##$TDeff= 65536
##$TDoff= 0
##$TI= <>
##$TILT= no
##$TM1= 0
##$TM2= 0
##$TOPLEV= 0
##$USERP1= <user>
##$USERP2= <user>
##$USERP3= <user>
##$USERP4= <user>
##$USERP5= <user>
##$WDW= 1
##$XDIM= 131072
##$YMAX_p= 431677447
##$YMIN_p= -15525
##$CURPLOT= <Network HP LaserJet P1505>
##$CURPRIN= <$Network HP LaserJet P1505>
##$DFORMAT= <normdp>
##$LAYOUT= <+/1D_H.xwp>
##$LFORMAT= <normlp>
##$PFORMAT= <normpl>
##$SURQMSG= 1
$$ End of Bruker specific parameters
$$ ---------------------------------
##NTUPLES= NMR SPECTRUM
##VAR_NAME=  FREQUENCY,     SPECTRUM/REAL,   SPECTRUM/IMAG
##SYMBOL=    X,             R,               I
##VAR_TYPE=  INDEPENDENT,   DEPENDENT,       DEPENDENT
##VAR_FORM=  AFFN,          ASDF,            ASDF
##VAR_DIM=   131072,        131072,          131072
##UNITS=     HZ,            ARBITRARY UNITS, ARBITRARY UNITS
##FACTOR=    0.0627417313425164, 1,          1
##FIRST=     8223.62146879497, 777,          -64394
##LAST=      0,             2902,            -64822
##MIN=       0,             -15525,          0
##MAX=       8223.62146879497, 431677447,    0
$$ Real data points
##PAGE= N=1
##DATA TABLE= (X++(R..R)), XYDATA
$$ [...]
$$ plain form
63932 3587209 3817866 4036047 4236007 4412548 4561261 4678805 4762979 4812281 4825439 4801639
63922 4801639 4741179 4645620 4517287 4358985 4174473 3969001 3748918 3520415 3288525 3057212
63912 3057212 2830085 2610574 2401387 2204228 2020343 1851061 1697348 1559087 1435315
63903 1435315 1325129 1227817 1142163 1066463 999639 941702 892646 851312 815911 785321 759246
63892 759246 737220 718106 700586 683744 667211 651154 636043 622003 608440 594813 581707
63881 581707 570577 562263 556294 551869 549009 548370 550306 554593 560914 569230 579714 592588 607919
63868 607919 625362 644178 663783 684214 705798 728351 750992 772844 793644 813442 831845
63857 831845 847919 860990 871381 880023 887254 892176 893410 890439 884019 875184 864031 849713 831644
$$ packed form
63932C587209K30657K18181J99960J76541J48713J17544Q4174M9302J3158k3800
63922D801639o0460r5559j28333j58302j84512k05472k20083k28503k31890k31313
63912C057212k27127k19511k09187j97159j83885j69282j53713j38261j23772
63903A435315j10186r7312q5654p5700o6824n7937m9056m1334l5401l0590k6075
63892G59246k2026j9114j7520j6842j6533j6057j5111j4040j3563j3627j3106
63881E81707j1130q314n969m425k860o39J936M287O321Q316J0484J2874J5331
63868F07919J7443J8816J9605K0431K1584K2553K2641K1852K0800J9798J8403
63857H31845J6074J3071J0391Q642P231M922J234k971o420q835j1153j4318j8069
$$ plain form
63844 831644 810524 787936 764926 741253 716193 689867 663324 637372 611850 586312 561004
63833 561004 536711 513849 492214 471562 451980 433568 416237 400050 385459 372847 361918
63822 361918 351819 341935 332406 323791 316243 309192 301949 294532 287641 281735 276501 271467 266803 263009
63808 263009 259959 256837 253184 249538 246773 245137 244224 243612 243142 242620 241647 239923 237593 235115 232775
63793 232775 230445 227967 225690 224339 224173 224536 224454 223444 221480 218518 214647 210553 207156 204670 202611
63778 202611 200867 200031 200389 201195 201599 201812 202661 204245 205688 206195 205729 204653 203281 201982 201300 201600 202748
63761 202748 204272 205753 206979 207859 208295 208161 207479 206652 206308 206693 207332 207560 207278 206910 206691 206443 206144 206293
63743 206293 207426 209435 211634 213481 215081 216985 219569 222656 225675 228164 230060 231582 232984 234550
$$ packed form
63844H31644k1120k2588k3010k3673k5060k6326k6543k5952k5522k5538k5308
63833E61004k4293k2862k1635k0652j9582j8412j7331j6187j4591j2612j0929
63822C61918j0099r884r529q615p548p051p243p417o891n906n234n034m664l794
63808B63009l050l122l653l646k765j636r13o12m70n22r73j724k330k478k340
63793B32775k330k478k277j351j66L63q2j010j964k962l871m094l397k486k059
63778B02611j744q36L58Q06M04K13Q49J584J443N07m66j076j372j299o82L00J148
63761B02748J524J481J226Q80M36j34o82q27l44L85O39K28k82l68k19k48k99J49
63743B06293J133K009K199J847J600J904K584L087L019K489J896J522J402J566
$$ plain form
63729 234550 236677 239740 243786 248429 253077 257303 261144 265119 269831 275438 281527 287496 292921 297609
63715 297609 301655 305517 309628 313669 316565 317583 317102 315856 313811 310423 305876 301255 297412 294275
63701 294275 291456 288885 286481 283834 280789 278011 276406 276123 276575 277333 278539 280436 282923 285778 289035
63686 289035 292872 297150 301244 304386 306204 306923 307095 307230 307607 308156 308374 307656 306054 304584 304385 305659
63670 305659 307785 310322 313322 316628 319621 321949 323987 326175 328361 330157 331526 332507 332757 331885 329943
63655 329943 327041 322835 317075 310514 304459 299417 294847 290310 286158 282850 280299 278277 276949 276508
63641 276508 276648 276837 276891 276899 276840 276759 277222 279123 282870 287961 293399 298387 302708 306708 311004 316053 321875
63624 321875 328186 334731 341471 348587 356495 365795 376932 389782 403682 418046 433018 449448 468197
$$ packed form
63729B34550K127L063M046M643M648M226L841L975M712N607O089N969N425M688
63715B97609M046L862M111M041K896J018m81j246k045l388m547m621l843l137
63701B94275k819k571k404k647l045k778j605k83M52P58J206J897K487K855L257
63686B89035L837M278M094L142J818P19J72J35L77N49K18p18j602j470j99J274
63670C05659K126K537L000L306K993K328K038K188K186J796J369R81K50q72j942
63655C29943k902m206n760o561o055n042m570m537m152l308k551k022j328m41
63641B76508J40J89N4Qn9q1M63J901L747N091N438M988M321M000M296N049N822
63624C21875O311O545O740P116P908R300J1137J2850J3900J4364J4972J6430J8749
$$ plain form
63611 468197 489452 512782 537812 564667 593727 625140 658747 694266 731154 768277 804000
63600 804000 836730 865184 888232 904939 915053 919230 918522 913853 906168 896802 887179 878061 869255
63587 869255 859943 849105 835752 819265 799698 777530 753027 726146 697264 667775 639585 613984
63575 613984 591146 570669 552342 536313 522787 511870 503691 498353 495637 494941 495680 497705 501144
63562 501144 505946 511822 518671 526710 536077 546476 557446 568834 580819 593605 607378 622552
63550 622552 639842 659965 683343 710131 740498 774881 813901 857807 905781 955702 1004519
63539 1004519 1048764 1084881 1109810 1122087 1122624 1114225 1100261 1083759 1067242 1052497 1040076 1029363
63527 1029363 1019448 1009755 999603 987527 971598 950500 924124 893251 859032 822747 785621 748561
$$ packed form
63611D68197K1255K3330K5030K6855K9060L1413L3607L5519L6888L7123L5723
63600H04000L2730K8454K3048J6707J0114M177p08m669p685r366r623r118q806
63587H69255r312j0838j3353j6487j9567k2168k4503k6881k8882k9489k8190k5601
63575F13984k2838k0477j8327j6029j3526j0917q179n338k716o96P39K025L439
63562E01144M802N876O849Q039R367J0399J0970J1388J1985J2786J3773J5174
63550F22552J7290K0123K3378K6788L0367L4383L9020M3906M7974M9921M8817
63539A004519M4245L6117K4929J2277N37q399j3964j6502j6517j4745j2421j0713
63527A029363r915r693j0152j2076j5929k1098k6376l0873l4219l6285l7126l7060
$$ plain form
63515 748561 712139 676924 643666 613000 585024 559331 535454 513290 493133 475365 460082
63504 460082 446969 435499 425264 416095 407904 400477 393521 386954 381130 376616 373580 371429 369226
63491 369226 366524 363631 361082 359136 357921 357661 358375 359530 360525 361531 363363 366430 370185 373806 377000
63476 377000 379913 382645 385297 388239 391835 395907 399792 402872 404790 405273 404222 402010 399212 395897
63462 395897 391515 385673 378771 371661 364964 358972 353944 350150 347623 346142 345419 345180 345141 345190 345615 346937
63446 346937 349459 353048 357460 362787 369462 377793 387562 398235 409623 422265 437058 454659 475413
63433 475413 499662 527724 559433 593944 629922 665499 698065 724832 744244 756737 763954 767657
63421 767657 769743 772706 779118 790519 807269 829295 856433 888157 923773 962943 1005284 1049177
$$ packed form
63515G48561l6422l5215l3258l0666k7976k5693k3877k2164k0157j7768j5283
63504D60082j3113j1470j0235r169q191p427o956o567n824m514l036k151k203
63491C69226k702k893k549j946j215k60P14J155R95J006J832L067L755L621L194
63476C77000K913K732K652K942L596M072L885L080J918M83j051k212k798l315
63462C95897m382n842o902p110o697n992n028l794k527j481p23k39l9M9M25J322
63446C46937K522L589M412N327O675Q331R769J0673J1388J2642J4793J7601K0754
63433D75413K4249K8062L1709L4511L5978L5577L2566K6767J9412J2493P217L703
63421G67657K086K963O412J1401J6750K2026K7138L1724L5616L9170M2341M3893
$$ plain form
63409 1049177 1091650 1129744 1161472 1185311 1199805 1204531 1201001 1191773 1178867 1163581 1147356 1131706
63397 1131706 1117069 1102401 1086136 1067158 1044786 1018484 988015 953675 916192 876621 836363
63386 836363 796916 759377 724336 692278 663708 638735 616857 597506 580666 566781 556127
63375 556127 548418 542967 539195 537095 537178 539819 544732 551296 559347 569246 581146 594668 609545 626185
63361 626185 645197 666600 689927 715025 742380 772641 806122 842782 882373 924371 967820
63350 967820 1011375 1053511 1092653 1127114 1155038 1174695 1185190 1187077 1182189 1172781 1160698 1147119
63338 1147119 1132703 1117830 1102754 1087512 1071568 1053627 1032192 1006481 976731 943673 908065
63327 908065 870834 833254 796629 761959 730110 702064 678709 660470 647342 639023 634751 633124
$$ packed form
63409A049177M2473L8094L1728K3839J4494M726l530r228j2906j5286j6225j5650
63397A131706j4637j4668j6265j8978k2372k6302l0469l4340l7483l9571m0258
63386H36363l9447l7539l5041l2058k8570k4973k1878j9351j6840j3885j0654
63375E56127p709n451l772k100Q3K641M913O564Q051R899J1900J3522J4877J6640
63361F26185J9012K1403K3327K5098K7355L0261L3481L6660L9591M1998M3449
63350I67820M3555M2136L9142L4461K7924J9657J0495J887m888r408j2083j3579
63338A147119j4416j4873j5076j5242j5944j7941k1435k5711k9750l3058l5608
63327I08065l7231l7580l6625l4670l1849k8046k3355j8239j3128q319m272j627
$$ plain form
63315 633124 632332 630429 625314 615020 598745 577694 554429 531284 509517 489720 472357 457617
63303 457617 445158 434287 424356 415019 406392 399007 393280 388859 384775 380382 375932 372028 368769 365634
63289 365634 362109 358163 354171 350555 347508 344915 342469 339902 337109 334192 331390 328884 326512 323798
63275 323798 320480 316967 314048 312143 311104 310685 310890 311765 313159 314858 316669 318201 318840 318313 317166
63260 317166 316422 316724 317927 319461 320940 322473 324530 327551 331587 336248 340956 345252 349027 352598 356530
63245 356530 361175 366427 372114 378537 386279 395446 405466 415854 426819 438959 452623 467863 484733
63232 484733 503224 523029 543649 564749 586210 607942 629855 651890 673838 695289 716021
63221 716021 736417 757175 778664 800821 823628 847312 871921 896936 921421 944412 965077
$$ packed form
63315F33124p92j903n115j0294j6275k1051k3265k3145k1767j9797j7363j4740
63303D57617j2459j0871r931r337q627p385n727m421m084m393m450l904l259l135
63289C65634l525l946l992l616l047k593k446k567k793k917k802k506k372k714
63275C23798l318l513k919j905j039m19K05Q75J394J699J811J532O39n27j147
63260C17166p44L02J203J534J479J533K057L021M036M661M708M296L775L571L932
63245C56530M645N252N687O423P742R167J0020J0388J0965J2140J3664J5240J6870
63232D84733J8491J9805K0620K1100K1461K1732K1913K2035K1948K1451K0732
63221G16021K0396K0758K1489K2157K2807K3684K4609K5015K4485K2991K0665
$$ plain form
63210 965077 982658 996403 1005606 1009732 1008556 1002131 990523 973723 951981 926167 897672 867990
63198 867990 838554 810739 785569 763299 743522 725936 710927 699304 691605 687742 687263 689802
63186 689802 695239 703539 714569 728191 744427 763354 784851 808638 834534 862316 891243 920197
63174 920197 948634 977032 1005906 1034656 1061951 1087155 1110763 1133392 1154911 1174603 1191535
63163 1191535 1204432 1211741 1212349 1206040 1193022 1173328 1147007 1114611 1077078 1035353 990581 944489
63151 944489 899000 855277 813425 773257 735141 699981 668507 640683 615750 592850 571673
63140 571673 552531 535848 521706 509911 500255 492463 486002 480195 474592 469147 464083 459693 456174
63127 456174 453482 451395 449884 449300 449986 451719 453841 456000 458500 461762 465613 469360 472502 475139 477705
$$ packed form
63210I65077J7581J3745R203M126j176o425j1608j6800k1742k5814k8495k9682
63198H67990k9436k7815k5170k2270j9777j7586j5009j1623p699l863m79K539
63186F89802N437Q300J1030J3622J6236J8927K1497K3787K5896K7782K8927K8954
63174I20197K8437K8398K8874K8750K7295K5204K3608K2629K1519J9692J6932
63163A191535J2897P309O08o309j3018j9694k6321l2396l7533m1725m4772m6092
63151I44489m5489m3723m1852m0168l8116l5160l1474k7824k4933k2900k1177
63140E71673j9142j6683j4142j1795r656p792o461n807n603n445n064m390l519
63127D56174k692k087j511n84O86J733K122K159K500L262L851L747L142K637K566
$$ plain form
63112 477705 480490 483524 486724 489926 492838 495260 497389 499717 502448 505198 507402 508781 509242 508638 507129
63097 507129 505615 505213 506149 507602 508767 509592 510292 510712 510668 510479 510626 511112 511663 512367 513503 514847 515742
63080 515742 515995 516161 516790 517909 519402 521468 524339 527949 532204 537342 543633 550873 558573 566580 575194
63065 575194 584678 594947 605821 617399 630102 644510 661187 680466 702256 726104 751606 778834
63053 778834 808353 840832 876667 915928 958518 1004236 1052727 1103557 1156391 1210949 1266652
63042 1266652 1322475 1377426 1431220 1484388 1537670 1591385 1645329 1699158 1752737 1806133 1859241
63031 1859241 1911494 1961982 2009787 2053910 2092756 2124040 2145601 2156279 2155829 2144136 2120934 2086284
63019 2086284 2040936 1986192 1923775 1856036 1785930 1716361 1649472 1586570 1528606 1476652 1431938
$$ packed form
63112D77705K785L034L200L202K912K422K129K328K731K750K204J379M61o04j509
63097E07129j514m02R36J453J165Q25P00M20m4j89J47M86N51P04J136J344Q95
63080E15742K53J66O29J119J493K066K871L610M255N138O291P240P700Q007Q614
63065E75194R484J0269J0874J1578J2703J4408J6677J9279K1790K3848K5502K7228
63053G78834K9519L2479L5835L9261M2590M5718M8491N0830N2834N4558N5703
63042A266652N5823N4951N3794N3168N3282N3715N3944N3829N3579N3396N3108
63031A859241N2253N0488M7805M4123L8846L1284K1561J0678m50j1693k3202l4650
63019B086284m5348n4744o2417o7739p0106o9569o6889o2902n7964n1954m4714
$$ plain form
63008 1431938 1395395 1367068 1346211 1332324 1325990 1328232 1339035 1357080 1381110 1410915 1446525 1486960
62996 1486960 1530518 1576171 1624045 1674461 1726929 1780229 1833147 1885008 1935759 1985669 2034875
62985 2034875 2083048 2129322 2172215 2209557 2238982 2258911 2268874 2268476 2256428 2231234 2192752 2142350
62973 2142350 2081494 2010970 1931866 1846625 1758479 1670080 1583017 1498321 1416912 1339690 1267662
62962 1267662 1201869 1142743 1089558 1040882 995611 953387 914228 878248 845700 816753 790945
62951 790945 767186 744505 722614 701600 681350 661541 642017 622948 604672 587541 571805
62940 571805 557471 544326 532215 521181 511201 501943 492992 484305 476194 468927 462485 456691 451356
62927 451356 446268 441228 436195 431325 426874 423119 420297 418367 416849 415101 412868 410384 407910 405369
$$ packed form
63008A431938l6543k8327k0857j3887o334K242J0803J8045K4030K9805L5610M0435
62996A486960M3558M5653M7874N0416N2468N3300N2918N1861N0751M9910M9206
62985B034875M8173M6274M2893L7342K9425J9929R963l98j2048k5194l8482n0402
62973B142350o0856p0524p9104q5241q8146q8399q7063q4696q1409p7222p2028
62962A267662o5793n9126n3185m8676m5271m2224l9159l5980l2548k8947k5808
62951G90945k3759k2681k1891k1014k0250j9809j9524j9069j8276j7131j5736
62940E71805j4334j3145j2111j1034r980r258q951q687q111p267o442n794n335
62927D51356n088n040n033m870m451l755k822j930j518j748k233k484k474k541
$$ plain form
62913 405369 402604 399803 397434 395801 394822 394198 393674 393134 392532 391770 390716 389355 387864 386320 384446 381909
62897 381909 378952 376394 374852 374233 374157 374525 375274 375921 375869 375090 374062 373064 372039 371133 370857 371448 372485
62880 372485 373342 373773 373896 373922 374066 374417 374711 374551 374030 373811 374365 375407 376316 376782 376757 376173 375151 374162 373490
62861 373490 372769 371557 370202 369544 369820 370418 370784 371026 371493 372259 373258 374469 375725 376631 376993 377081 377266 377592
62843 377592 377957 378455 379249 380218 380977 381229 381011 380629 380412 380404 380273 379734 379077 378983 379661 380468 380660 380316 380216 380914
62823 380914 382247 383752 385256 386962 389089 391580 394148 396604 399085 401880 405057 408415 411798 415291
62809 415291 419006 422926 427114 431860 437330 443173 448770 453936 459230 465493 473118 481723 490589 499531
62795 499531 509333 521108 535137 550565 566380 582397 599066 616738 635697 656809 681488 710706
$$ packed form
62913D05369k765k801k369j633r79o24n24n40o02p62j054j361j491j544j874k537
62897C81909k957k558j542o19p6L68P49O47n2p79j028r98j025r06k76N91J037
62880C72485Q57M31J23K6J44L51K94j60n21k19N54J042R09M66k5n84j022r89o72
62861C73490p21j212j355o58K76N98L66K42M67P66R99J211J256R06L62Q8J85L26
62843C77592L65M98P94R69P59K52k18l82k17qj31n39o57r4O78Q07J92l44j00O98
62823C80914J333J505J504J706K127K491K568K456K481K795L177L358L383L493
62809D15291L715L920M188M746N470N843N597N166N294O263P625Q605Q866Q942
62795D99531R802J1775J4029J5428J5815J6017J6669J7672J8959K1112K4679K9218
$$ plain form
62783 710706 744355 781868 823281 869427 921226 979071 1042920 1112651 1188061 1268457 1352510
62772 1352510 1438743 1526115 1613809 1700309 1782957 1858648 1924733 1979020 2019302 2043715 2051802
62761 2051802 2044772 2024302 1991237 1945741 1888481 1821331 1746997 1668290 1587685 1507017 1427181
62750 1427181 1348259 1270364 1194512 1122469 1055638 994249 937830 886218 839722 798387 761588
62739 761588 728578 699033 672727 649007 627103 606902 588948 573637 560772 549954 541001 533818
62727 533818 528189 523967 521222 519894 519345 518690 517719 517397 519143 523454 529347 535483 541847 549941 561065
62712 561065 574783 589564 604688 620970 639746 661874 687791 717791 751869 789791 831723
62701 831723 878435 930607 988370 1051814 1121364 1197174 1278704 1365515 1457917 1555956 1657997
$$ packed form
62783G10706L3649L7513M1413M6146N1799N7845O3849O9731P5410Q0396Q4053
62772A352510Q6233Q7372Q7694Q6500Q2648P5691O6085N4287M0282K4413Q087
62761B051802p030k0470l3065m5496n7260o7150p4334p8707q0605q0668p9836
62750A427181p8922p7895p5852p2043o6831o1389n6419n1612m6496m1335l6799
62739G61588l3010k9545k6306k3720k1904k0201j7954j5311j2865j0818q953p183
62727E33818n629m222k745j328n49o55r71l22J746M311N893O136O364Q094J1124
62712E61065J3718J4781J5124J6282J8776K2128K5917L0000L4078L7922M1932
62701H31723M6712N2172N7763O3444O9550P5810Q1530Q6811R2402R8039J02041
$$ plain form
62690 1657997 1761168 1863030 1961861 2055317 2139973 2212647 2271395 2314748 2340776 2347657 2334813
62679 2334813 2303012 2253769 2189212 2112116 2025293 1930986 1831263 1728720 1626167 1525663 1428363
62668 1428363 1335204 1247187 1165045 1089235 1020290 958547 903395 853434 807695 766245 729283
62657 729283 696178 665877 637924 612551 589953 569955 552293 536702 522698 509663 497299
62646 497299 485770 475349 466162 458226 451393 445144 438828 432328 426260 421330 417665 415003 413247 412469
62632 412469 412452 412666 412781 412874 413021 412949 412317 411098 409464 407484 405212 402936 400992 399431 398247 397859 398803
62615 398803 400807 402756 403991 405193 407436 410743 414342 418168 423184 429938 437674 445411 453326 462356
62601 462356 472805 484173 496367 510365 527426 548067 572033 598880 628351 660398 695102
$$ packed form
62690A657997J03171J01862R8831R3456Q4656P2674N8748M3353K6028O881j2844
62679B334813l1801m9243o4557p7096q6823r4307r9723j02543j02553j00504r7300
62668A428363r3159q8017q2142p5810o8945o1743n5152m9961m5739m1450l6962
62657G29283l3105l0301k7953k5373k2598j9998j7662j5591j4004j3035j2364
62646D97299j1529j0421r187p936o833o249o316o500o068m930l665k662j756p78
62632D12469j7K14J15R3J47p2o32j219j634j980k272k276j944j561j184l88R44
62615C98803K004J949J235J202K243L307L599L826N016O754P736P737P915R030
62601D62356J0449J1368J2194J3998J7061K0641K3966K6847K9471L2047L4704
$$ plain form
62590 695102 732465 772171 813601 856038 898635 940177 979190 1014338 1044516 1068516 1085057
62579 1085057 1093358 1093417 1085516 1069822 1046821 1017796 984357 947592 908177 867249 826559 787479
62567 787479 750288 714726 680960 649591 620869 594404 569837 547500 528120 511858 497896
62556 497896 485150 473300 462942 454667 448154 442271 435981 429080 422168 416084 411358 407992 405660
62543 405660 404083 403187 402952 403296 404217 405930 408590 411892 415149 417835 419958 421889 423946 426223 428757
62528 428757 431767 435687 440960 447832 456417 466880 479329 493516 509006 525927 545344 568519
62516 568519 595866 626888 661073 698473 739439 784208 832844 885230 940854 998733 1057599
62505 1057599 1115938 1171900 1223567 1269516 1308857 1340595 1363380 1376197 1379049 1372620 1357575 1334629
$$ packed form
62590F95102L7363L9706M1430M2437M2597M1542L9013L5148L0178K4000J6541
62579A085057Q301N9p901j5694k3001k9025l3439l6765l9415m0928m0690l9080
62567G87479l7191l5562l3766l1369k8722k6465k4567k2337j9380j6262j3962
62556D97896j2746j1850j0358q275o513n883o290o901o912o084m726l366k332
62543D05660j577q96k35L44R21J713K660L302L257K686K123J931K057K277K534
62528D28757L010L920N273O872Q585J0463J2449J4187J5490J6921J9417K3175
62516E68519K7347L1022L4185L7400M0966M4769M8636N2386N5624N7879N8866
62505A057599N8339N5962N1667M5949L9341L1738K2785J2817K852o429j5045k2946
$$ plain form
62493 1334629 1305156 1271205 1234754 1197266 1160062 1124827 1093423 1067189 1046549 1031372 1021690
62482 1021690 1017950 1020514 1029112 1043080 1062009 1085705 1113394 1143430 1174017 1203819 1231485 1255045
62470 1255045 1272423 1282496 1285246 1281011 1270010 1252413 1228214 1196986 1158382 1113176 1063420 1011351
62458 1011351 958354 905094 852277 800993 752507 707876 667594 631586 599686 572035 548687
62447 548687 528907 511452 495752 482319 471675 463370 456443 450461 445592 441923 439211 437224 435839
62434 435839 434859 434172 434079 435047 437024 439194 440519 440350 438581 435482 431463 426848 421837 416696 411780 407154
62418 407154 402424 397336 392426 388577 385839 383134 379401 374799 370550 367710 366265 365332 364035 362167
62404 362167 360118 358318 356872 355740 354983 354638 354534 354552 354973 356229 358277 360530 362474 364092 365636 367354
$$ packed form
62493A334629k9473l3951l6451l7488l7204l5235l1404k6234k0640j5177r682
62482A021690l740K564Q598J3968J8929K3696K7689L0036L0587K9802K7666K3560
62470A255045J7378J0073K750m235j1001j7597k4199l1228l8604m5206m9756n2069
62458A011351n2997n3260n2817n1284m8486m4631m0282l6008l1900k7651k3348
62447E48687j9780j7455j5700j3433j0644q305o927n982m869l669k712j987j385
62434D35839r80o87r3R68J977K170J325j69j769l099m019m615n011n141m916m626
62418D07154m730n088m910l849k738k705l733m602m249k840j445r33j297j868
62404C62167k049j800j446j132p57l45j04J8M21J256K048K253J944J618J544J718
$$ plain form
62388 367354 369525 372412 375876 379287 382154 384740 387824 391839 396418 400785 404543 408122 412490 418362
62374 418362 425686 433928 442702 451877 461243 470594 480306 491356 504387 518996 534315 550194 567474
62361 567474 587280 610360 637060 667547 702008 740827 784602 833757 888173 947385 1010943
62350 1010943 1078102 1147114 1215267 1279893 1339142 1391567 1435339 1468426 1489693 1499569 1499423 1490397
62338 1490397 1472998 1447738 1415670 1377904 1334827 1286437 1233718 1179176 1125497 1073863 1024083
62327 1024083 976172 931114 889983 852915 819374 788989 761705 737258 714886 693577 672532
62316 672532 651588 631391 612928 596544 581460 566488 551144 535893 521483 508347 496552
62305 496552 485946 476240 467174 458757 451253 444991 440250 437174 435471 434320 432954 431431 430511 430658
$$ packed form
62388C67354K171K887L464L411K867K586L084M015M579M367L758L579M368N872
62374D18362P324Q242Q774R175R366R351R712J1050J3031J4609J5319J5879J7280
62361E67474J9806K3080K6700L0487L4461L8819M3775M9155N4416N9212O3558
62350A010943O7159O9012O8153O4626N9249N2425M3772L3087K1267R876j46r026
62338A490397j7399k5260l2068l7766m3077m8390n2719n4542n3679n1634m9780
62327A024083m7911m5058m1131l7068l3541l0385k7284k4447k2372k1309k1045
62316F72532k0944k0197j8463j6384j5084j4972j5344j5251j4410j3136j1795
62305D96552j0606r706r066q417p504o262m741l076j703j151j366j523r20J47
$$ plain form
62291 430658 431499 432440 433463 434961 437002 439201 441327 443685 446727 450483 454531 458510 462514 466936 471982
62276 471982 477419 482885 488305 493837 499473 505027 510648 516982 524521 532979 541734 550877 561473 574678
62262 574678 590891 609904 631606 656328 684684 717336 754845 797491 845222 897906 955576
62251 955576 1018186 1085022 1154437 1224215 1292119 1356007 1413559 1462202 1499645 1524726 1537759
62240 1537759 1539979 1532568 1516201 1491273 1458273 1417754 1370226 1316377 1257414 1195029 1131038 1067147
62228 1067147 1004867 945377 889438 837652 790781 749469 713582 682200 654518 630485 610220
62217 610220 593089 577927 564196 552368 542945 535476 528969 523009 517990 514245 511440 509031 507021
62204 507021 505920 506105 507548 510129 513926 519036 525292 532279 539582 546951 554382 562134 570510 579481
$$ packed form
62291D30658Q41R41J023J498K041K199K126K358L042L756M048L979M004M422N046
62276D71982N437N466N420N532N636N554N621O334P539Q458Q755R143J0596J3205
62262E74678J6213J9013K1702K4722K8356L2652L7509M2646M7731N2684N7670
62251I55576O2610O6836O9415O9778O7904O3888N7552M8643L7443K5081J3033
62240A537759K220p411j6367k4928l3000m0519m7528n3849n8963o2385o3991o3891
62228A067147o2280n9490n5939n1786m6871m1312l5887l1382k7682k4033k0265
62217F10220j7131j5162j3731j1828r423p469o507n960n019l745k805k409k010
62204E07021j101J85J443K581L797N110O256O987P303P369P431P752Q376Q971
$$ plain form
62190 579481 588567 597284 605602 613812 622013 629941 637303 644083 650493 656832 663401 670314 677333 684074
62176 684074 690359 696136 701007 704342 706147 707568 710174 714909 722040 731942 745470 763627 787203
62163 787203 816680 852071 892772 937878 986681 1038410 1091412 1143008 1190416 1231551 1264907
62152 1264907 1289304 1304304 1310638 1309659 1302329 1288945 1269629 1244606 1214099 1178431 1138442 1095554
62140 1095554 1051276 1006813 963191 921457 882541 847003 815079 786942 762798 742657 726076
62129 726076 712254 700587 691176 684579 680938 679581 679699 681170 684392 689466 696093 704248 714326 726230
62115 726230 738739 750203 759698 767112 772281 774718 774383 772256 769717 767468 765328 762903 760002 756242
62101 756242 750731 742732 732723 722413 713524 706697 701628 697946 695703 695303 697312 702191 709705 718626
$$ packed form
62190E79481R086Q717Q318Q210Q201P928P362O780O410O339O569O913P019O741
62176F84074O285N777M871L335J805J421K606M735P131R902J3528J8157K3576
62163G87203K9477L5391M0701M5106M8803N1729N3002N1596M7408M1135L3356
62152A264907K4397J5000O334r79p330j3384j9316k5023l0507l5668l9989m2888
62140A095554m4278m4463m3622m1734l8916l5538l1924k8137k4144k0141j6581
62129G26076j3822j1667r411o597l641j357J18J471L222N074O627Q155J0078J1904
62115G26230J2509J1464R495P414N169K437l35k127k539k249k140k425k901l760
62101G56242n511p999j0009j0310q889o827n069l682k243m00K009M879P514Q921
$$ plain form
62087 718626 727470 735706 743928 752801 762338 772423 783534 796369 811013 827011 844213 863025
62075 863025 883780 906378 930698 956870 984709 1013204 1041094 1067911 1094131 1120315 1146533
62064 1146533 1172739 1199308 1226835 1255617 1285673 1317162 1350315 1384846 1419643 1453063 1483290
62053 1483290 1508493 1527287 1539459 1545934 1547535 1543876 1533790 1516737 1493325 1464488 1430587 1391466
62041 1391466 1347085 1297973 1245364 1190955 1136275 1082168 1029074 977816 929744 885921 846399
62030 846399 810451 777370 747014 719814 696281 676239 658541 641948 626281 612235 600044
62019 600044 588963 578307 568260 559107 550301 540995 531128 521290 511785 502552 493856 486295 480144
62006 480144 475307 471909 470252 470184 471182 473190 476672 481650 487263 492601 497444 501925 506041 509863 513679
$$ packed form
62087G18626Q844Q236Q222Q873R537J0085J1111J2835J4644J5998J7202J8812
62075H63025K0755K2598K4320K6172K7839K8495K7890K6817K6220K6184K6218
62064A146533K6206K6569K7527K8782L0056L1489L3153L4531L4797L3420L0227
62053A483290K5203J8794J2172O475J601l659j0086j7053k3412k8837l3901l9121
62041A391466m4381m9112n2609n4409n4680n4107n3094n1258m8072m3823l9522
62030H46399l5948l3081l0356k7200k3533k0042j7698j6593j5667j4046j2191
62019F00044j1081j0656j0047r153q806r306r867r838r505r233q696p561o151
62006D80144m837l398j657o8R98K008L482M978N613N338M843M481M116L822L816
$$ plain form
61991 513679 517380 520026 520577 518962 516064 512727 509027 504388 498252 490745 482761 475202 468110 460875
61977 460875 453339 446227 440266 435420 431315 427889 425119 422496 419380 415692 411792 407933 404333 401517
61963 401517 399900 399075 398165 396969 396229 396666 398219 400315 402387 403931 404622 404739 405178 406651 409009 411610
61947 411610 414255 417558 422480 429644 438954 449712 461196 473320 486694 501955 519108 537639
61935 537639 557175 577808 599654 622257 644644 666072 686559 706502 725915 744295 761196
61924 761196 776440 789563 799505 805389 807454 806792 804137 799309 791899 782144 771035 759843 749667
61911 749667 741196 734717 730423 728745 730282 735428 744197 756294 771051 787279 803522 818670 832206
61898 832206 843836 853048 859060 861071 858604 851840 841580 828631 813252 795505 776045 756119
$$ packed form
61991E13679L701K646N51j615k898l337l700m639o136p507p984p559p092p235
61977D60875p536p112n961m846m105l426k770k623l116l688l900l859l600k816
61963D01517j617q25r10j196p40M37J553K096K072J544O91J17M39J473K358K601
61947D11610K645L303M922P164R310J0758J1484J2124J3374J5261J7153J8531
61935E37639J9536K0633K1846K2603K2387K1428K0487J9943J9413J8380J6901
61924G61196J5244J3123R942N884K065o62k655m828p410r755j1109j1192j0176
61911G49667q471o479m294j678J537N146Q769J2097J4757J6228J6243J5148J3536
61898H32206J1630R212O012K011k467o764j0260j2949j5379j7747j9460j9926
$$ plain form
61886 756119 736672 717906 699834 682797 667138 652802 639613 627624 616703 606012 594455
61875 594455 581683 568384 555615 544074 533859 524535 515447 506382 497999 491342 486836 484012 482322
61862 482322 481916 483368 486845 491871 497996 505450 514991 527118 541631 558061 576402 597234 621158
61849 621158 648349 678624 711624 746725 783070 819991 857319 894928 932021 967121 998778
61838 998778 1026058 1048314 1064777 1074651 1077631 1074288 1066007 1054539 1041415 1027609 1013725 1000535
61826 1000535 989350 981769 978977 981178 987705 997662 1010363 1025065 1040462 1054756 1066269 1073714
61814 1073714 1075938 1071861 1060991 1043665 1020465 991715 958045 921188 883522 846638 810805 775905
61802 775905 742300 710462 680347 651798 625332 601844 581466 563264 546328 530785 517380
$$ packed form
61886G56119j9447j8766j8072j7037j5659j4336j3189j1989j0921j0691j1557
61875E94455j2772j3299j2769j1541j0215r324r088r065q383o657m506k824j690
61862D82322m06J452L477N026O125P454R541J2127J4513J6430J8341K0832K3924
61849F21158K7191L0275L3000L5101L6345L6921L7328L7609L7093L5100L1657
61838I98778K7280K2256J6463R874K980l343q281j1468j3124j3806j3884j3190
61826A000535j1185p581k792K201O527R957J2701J4702J5397J4294J1513P445
61814A073714K224m077j0870j7326k3200k8750l3670l6857l7666l6884l5833l4900
61802G75905l3605l1838l0115k8549k6466k3488k0378j8202j6936j5543j3405
$$ plain form
61791 517380 506279 496661 487483 478433 470019 462864 456988 451805 446782 442050 438190 435420 433223 430952
61777 430952 428581 426471 424555 422300 419590 417160 415796 415508 415848 416707 418221 420094 421688 422861 424154
61762 424154 426003 428246 430603 433133 435930 438800 441626 444675 448121 451510 454171 456060 457799 459927
61748 459927 462428 464878 466746 467592 467273 465947 463768 460808 457509 454812 453260 452119 450056 446749 443269
61733 443269 440706 439021 437523 435931 434528 433640 433483 434368 436542 439797 443517 447127 450339 453103 455648
61718 455648 458475 461934 465714 469111 471922 474747 478110 481535 483942 484906 485030 484900 484119 481844 478046
61703 478046 473669 469532 465562 461312 456772 452322 448201 444339 440557 436599 432219 427534 423150 419582
61689 419582 416703 414062 411542 409258 407058 404664 402236 400185 398492 396755 394972 393533 392329 390690
$$ packed form
61791E17380j1101r618r178r050q414p155n876n183n023m732l860k770k197k271
61777D30952k371k110j916k255k710k430j364k88L40Q59J514J873J594J173J293
61762D24154J849K243K357K530K797K870K826L049L446L389K661J889J739K128
61748D59927K501K450J868Q46l19j326k179k960l299k697j552j141k063l307l480
61733D43269k563j685j498j592j403q88j57Q85K174L255L720L610L212K764K545
61718D55648K827L459L780L397K811K825L363L425K407R64J24j30p81k275l798
61703D78046m377m137l970m250m540m450m121l862l782l958m380m685m384l568
61689D19582k879k641k520k284k200k394k428k051j693j737j783j439j204j639
$$ plain form
61675 390690 388587 387178 387479 388957 390164 390484 390542 390966 391445 391222 390057 388440 387020 386047 385316 384620 384126
61658 384126 384096 384312 384192 383667 383504 384365 385920 387409 388793 390702 393328 396011 398079 399567 400959 402595
61642 402595 404549 406793 409254 411917 414956 418501 422246 425574 428163 430163 431687 432501 432388 431444 429771
61627 429771 427201 423682 419721 416118 413318 411185 409261 407032 404232 401232 398955 398048 398185 398524 398716
61612 398716 398994 399330 399112 397877 395885 393510 390453 386074 380387 374193 368146 362115 355667 348771 341770
61597 341770 334953 328522 322807 318094 314257 310912 307899 305287 302899 300316 297543 295191 293710 292743
61583 292743 291637 290281 288987 287718 286083 284072 282181 280613 278824 276277 273307 270906 269715 269462
61569 269462 269277 268389 266701 264871 263756 263577 263779 263800 263731 263966 264417 264547 264085 263343 262740 262377 262207 262320
$$ packed form
61675C90690k103j409L01J478J207L20N8M24M79k23j165j617j420r73p31o96m94
61658C84126l0K16j20n25j63Q61J555J489J384J909K626K683K068J488J392J636
61642D02595J954K244K461K663L039L545L745L328K589K000J524Q14j13r44j673
61627D29771k570l519l961l603k800k133j924k229k800l000k277r07J37L39J92
61612C98716K78L36k18j235j992k375l057m379n687o194o047o031o448o896p001
61597C41770o817o431n715m713l837l345l013k612k388k583k773k352j481r67
61583B92743j106j356j294j269j635k011j891j568j789k547k970k401j191k53
61569B69462j85q88j688j830j115j79K02K1o9K35M51J30m62p42o03l63j70J13
$$ plain form
61551 262320 262831 263685 264748 265961 267271 268604 270073 272029 274601 277242 279045 279609 279470 279659 280913
61536 280913 283244 285991 288215 289302 289416 289291 289511 290137 291060 292395 294187 295934 296908 296990 296782 296741 296621
61519 296621 295980 294863 293537 291868 289516 286723 284383 283184 283035 283439 283992 284306 283948 282940 282068 282177
61503 282177 283188 284185 284460 284099 283504 282879 282370 282304 282884 283818 284621 285192 285732 286135 285839 284468 282398 280502
61485 280502 279452 279408 280222 281652 283384 285040 286382 287383 288022 288107 287535 286784 286846 288393 290966 293296 294500
61468 294500 294797 294933 295189 295262 294957 294546 294389 294547 294888 295233 295219 294385 292756 291096 290181 290009 290148 290647 291967
61449 291967 293989 295788 296720 297157 297683 298048 297645 296828 296891 298522 300872 302617 303578 304800 307181 310512
61433 310512 314008 317344 320804 324563 328279 331560 334529 337566 340620 343143 344808 345900 346783 347301 347071
$$ packed form
61551B62320N11Q54J063J213J310J333J469J956K572K641J803N64j39J89J254
61536B80913K331K747K224J087J14j25K20O26R23J335J792J747R74Q2k08m1j20
61519B96621o41j117j326j669k352k793k340j199j49M04N53L14l58j008q72J09
61503B82177J011R97K75l61n95o25n09o6N80R34Q03N71N40M03k96j371k070j896
61485B80502j050m4Q14J430J732J656J342J001O39Q5n72p51O2J547K573K330J204
61468B94500K97J36K56P3l05m11j57J58L41L45j4q34j629j660r15j72J39M99J320
61449B91967K022J799R32M37N26L65m03q17O3J631K350J745R61J222K381L331
61433C10512L496L336L460L759L716L281K969L037L054K523J665J092Q83N18k30
$$ plain form
61418 347071 346273 345722 346159 347776 350394 353688 357027 359511 360595 360648 360580 360862 361111 360660 359328 357493 355540
61401 355540 353453 351031 348386 346074 344648 344171 344160 343995 343323 342162 340789 339550 338730 338496 338905 339823
61385 339823 340801 341198 340678 339617 338800 338648 338846 338793 338271 337613 337315 337608 338341 339150 339767 340213 340678 341233 341790
61366 341790 342377 343285 344717 346452 348143 349866 352017 354601 357062 359105 361350 364678 369099 373802 378366
61351 378366 383325 389313 396187 403487 411313 420046 429344 438131 445686 452183 457989 463037 467158 470587
61337 470587 473687 476592 479478 482809 486747 490575 493302 494802 495884 497264 498863 500076 500242 498865
61323 498865 495880 491853 487563 483302 478919 474538 470750 467991 466213 465358 465596 466797 468237 469340 470470
61308 470470 472543 476052 480904 487081 494927 504672 515913 527683 538877 548640 556508 562251 565535
$$ packed form
61418C47071p98n51M37J617K618L294L339K484J084N3o8K82K49m51j332j835j953
61401C55540k087k422k645k312j426m77j1j65o72j161j373j239q20k34M09R18
61385C39823R78L97n20j061q17j52J98n3n22o58k98K93P33Q09O17M46M65N55N57
61366C41790N87R08J432J735J691J723K151K584K461K043K245L328M421M703M564
61351C78366M959N988O874P300P826Q733R298Q787P555O497N806N048M121L429
61337D70587L100K905K886L331L938L828K727J500J082J380J599J213J66j377
61323D98865k985m027m290m261m383m381l788k759j778q55K38J201J440J103J130
61308D70470K073L509M852O177P846R745J1241J1770J1194R763P868N743L284
$$ plain form
61295 565535 565874 563081 557667 550625 542787 534498 525893 517341 509528 502999 497553 492293 486550 480737
61281 480737 475875 472258 469080 465685 462659 461200 461616 463043 464653 466682 470103 475502 482350 489230
61267 489230 494849 498986 502447 506022 509694 513082 516327 520145 525159 531638 539801 549761 560959 572088
61253 572088 581924 590049 596657 601922 605839 608581 610709 612925 615563 618312 620514 621800 622246 621817 619985
61238 619985 616372 611610 606994 603161 599559 595411 590783 586412 582811 579902 577402 575216 573488 572464
61224 572464 572250 572643 573241 573751 574018 573781 572767 571206 569967 569889 571090 573076 575293 577366 579031 580215
61208 580215 581091 581767 581985 581366 579891 577934 575939 574351 573713 574474 576690 580203 585129 591883 600708 611514
61192 611514 624197 638748 654852 671604 687776 702130 713560 721431 726151 729077 731446 733530
$$ packed form
61295E65535L39k793n414p042p838q289q605q552p813o529n446n260n743n813
61281D80737m862l617l178l395l026j459M16J427J610K029L421N399O848O880
61267D89230N619M137L461L575L672L388L245L818N014O479Q163R960J1198J1129
61253E72088R836Q125O608N265L917K742K128K216K638K749K202J286M46m29j832
61238F19985l613m762m616l833l602m148m628m371l601k909k500k186j728j024
61224E72464k14L93N98N10K67k37j014j561j239p8J201J986K217K073J665J184
61208E80215Q76O76K18o19j475j957j995j588o38P61K216L513M926O754Q825J0806
61192F11514J2683J4551J6104J6752J6172J4354J1430P871M720K926K369K084
$$ plain form
61180 733530 735085 736284 737688 739414 740938 741818 742078 741752 740560 738350 735451 732176 728270 723329 717520
61165 717520 711423 705229 698572 691200 683347 675381 667448 659563 651642 643305 634035 623859 613640 604496
61151 604496 597147 591865 588638 587089 586631 587076 588712 591362 593594 593415 589683 582531 572748 561401 549906
61136 549906 539598 530899 523353 516703 511453 508140 506502 505746 505369 505458 506407 508590 512104 516596 521548
61121 521548 526921 533323 541366 551089 562189 574521 588088 602786 618548 635612 654349 674811
61109 674811 696603 719079 741540 763412 784515 805062 825231 844829 863431 880547 895461
61098 895461 907215 915196 919576 920820 918923 913466 904379 892254 877945 862217 845778 829251 812951
61085 812951 796853 780772 764410 747344 729373 710971 693068 676290 660633 645957 632486
$$ packed form
61180G33530J555J199J404J726J524Q80K60l26j192k210k899l275l906m941n809
61165G17520o097o194o657p372p853p966p933p885p921q337r270j0176j0219r144
61151F04496p349n282l227j549m58M45J636K650K232j79l732p152r783j1347j1495
61136E49906j0308q699p546o650n250l313j638p56l77Q9R49K183L514M492M952
61121E21548N373O402Q043R723J1100J2332J3567J4698J5762J7064J8737K0462
61109F74811K1792K2476K2461K1872K1103K0547K0169J9598J8602J7116J4914
61098H95461J1754P981M380J244j897n457r087j2125j4309j5728j6439j6527j6300
61085H12951j6098j6081j6362j7066j7971j8402j7903j6778j5657j4676j3471
$$ plain form
61074 632486 620580 610156 600569 591147 581817 573210 566077 560586 556322 553013 550989 550642 551661 553189
61060 553189 554685 556299 558390 561041 564145 567724 572065 577654 584932 593854 603718 613680 623503 633652
61046 633652 644727 657099 671008 686661 704170 723666 745359 769108 794105 819564 845853
61035 845853 874320 905776 939644 974929 1011501 1050003 1090866 1133900 1178673 1224860 1272284
61024 1272284 1320902 1370745 1421777 1474104 1528534 1586697 1650422 1721212 1800407 1889385 1989214
61013 1989214 2100471 2224052 2362295 2519473 2701839 2917583 3176343 3488438 3865181
61004 3865181 4320716 4873596 5546987 6369071 7374202 8600943 10082535 11831052 13819842
60995 13819842 15966477 18120432 20071527 21598759 22553646 22932602 22884979 22646671 22444105
$$ packed form
61074F32486j1906j0424r587r422r330q607p133n491m264l309k024l47J019J528
61060E53189J496J614K091K651L104L579M341N589P278Q922R864R962R823J0149
61046F33652J1075J2372J3909J5653J7509J9496K1693K3749K4997K5459K6289
61035H45853K8467L1456L3868L5285L6572L8502M0863M3034M4773M6187M7424
61024A272284M8618M9843N1032N2327N4430N8163O3725P0790P9195Q8978R9829
61013A989214J11257J23581J38243J57178J82366K15744K58760L12095L76743
61004C865181M55535N52880O73391Q22084J005131J226741J481592J748517J988790
60995A3819842K146635K153955J951095J527232R54887L78956m7623k38308k02566
$$ plain form
60986 22444105 22423354 22621095 22960229 23261342 23285985 22819983 21763422 20170789 18215712
60977 18215712 16110853 14037454 12114843 10403363 8920433 7657368 6593140 5703185
60969 5703185 4962965 4349155 3841023 3421199 3074617 2787160 2546036 2341005 2164471
60960 2164471 2010637 1875183 1755309 1649152 1554920 1470932 1396166 1330206 1272685 1223093
60950 1223093 1180775 1144524 1112374 1082413 1053685 1025976 999130 973245 949092 927367 907600
60939 907600 888702 870581 854223 839970 826738 813405 800114 787592 775915 764680 753902
60928 753902 743926 734699 725849 717360 709637 702948 697232 692414 688485 685312 682783 681117 680696 681621 683650
60913 683650 686465 689719 693010 696283 700163 705484 712446 720648 729894 740467 752530 765779 779894
$$ packed form
60986B2444105k0751J97741L39134L01113K4643m66002j056561j592633j955077
60977A8215712k104859k073399j922611j711480j482930j263065j064228q89955
60969E703185p40220o13810n08132m19824l46582k87457k41124k05031j76534
60960B164471j53834j35454j19874j06157r4232q3988p4766o5960n7521m9592
60950A223093m2318l6251l2150k9961k8728k7709k6846k5885k4153k1725j9767
60939I07600j8898j8121j6358j4253j3232j3333j3291j2522j1677j1235j0778
60928G53902r976r227q850q489p723o689n716m818l929l173k529j666m21R25K029
60913F83650K815L254L291L273L880N321O962Q202R246J0573J2063J3249J4115
$$ plain form
60900 779894 794847 810403 825737 840008 853139 865574 877378 888061 897283 905240 912101 917430
60888 917430 920526 921133 919490 915722 909600 900969 890097 877419 863168 847549 831122 814711 798851
60875 798851 783550 768556 753695 738942 724388 710228 696645 683622 671067 659138 648275
60864 648275 638804 630610 623251 616277 609442 602813 596724 591424 586672 581840 576414 570232 563296 555717
60850 555717 547962 540742 534427 528836 523703 518958 514310 509002 502481 495045 487439 480053 472894 466025
60836 466025 459426 452621 445117 437204 429755 423180 417174 411544 406605 402514 398882 395462 392718 391231
60822 391231 390829 390833 390907 391158 391515 391566 391150 390665 390582 390871 391202 391603 392579 394418 396580 398120 398777 399279 400336
60803 400336 401665 402464 402639 402944 403802 404580 404382 403194 401883 401221 401245 401415 401152 400270 399081 397995 396960
$$ packed form
60900G79894J4953J5556J5334J4271J3131J2435J1804J0683R222P957O861N329
60888I17430L096O07j643l768o122q631j0872j2678j4251j5619j6427j6411j5860
60875G98851j5301j4994j4861j4753j4554j4160j3583j3023j2555j1929j0863
60864F48275r471q194p359o974o835o629o089n300m752m832n426o182o936p579
60850E55717p755p220o315n591n133m745m648n308o521p436p606p386p159o869
60836D66025o599o805p504p913p449o575o006n630m939m091l632l420k744j487
60822C91231m02MP4K51L57N1m16m85q3K89L31M01R76J839K162J540O57N02J057
60803D00336J329P99J75L05Q58P78j98j188j311o62K4J70k63q82j189j086j035
$$ plain form
60786 396960 395421 392991 389927 386784 383788 380778 377617 374349 371034 367659 364229 360777 357299 353824
60772 353824 350552 347804 345819 344595 343847 343143 342248 341408 341123 341587 342504 343472 344302 344902 345205 345414 346028
60755 346028 347287 348773 349866 350474 351071 352093 353639 355684 358298 361517 365088 368445 371003 372660 373952
60740 373952 375483 377142 378166 378085 377208 376009 374440 372185 369232 365749 361705 357092 352343 347994 344019
60725 344019 339974 335764 331882 328845 326742 325232 323650 321250 317867 314339 311835 310692 310247 309694 308679
60710 308679 307123 305109 303070 301523 300437 299294 297982 297063 296963 297336 297535 297362 297096 297113 297714 298936
60694 298936 300283 301032 301103 301258 302157 303583 304891 305796 306272 306147 305386 304598 304697 306090 308510 311478 314575
60677 314575 317528 320503 324183 329027 334602 340071 345208 350362 355573 360427 364808 369036 372994 375754
$$ packed form
60786C96960j539k430l064l143k996l010l161l268l315l375l430l452l478l475
60772C53824l272k748j985j224p48p04q95q40k85M64R17R68Q30O00L03K09O14
60755C46028J259J486J093O08N97J022J546K045K614L219L571L357K558J657J292
60740C73952J531J659J024q1q77j199j569k255k953l483m044m613m749m349l975
60725C44019m045m210l882l037k103j510j582k400l383l528k504j143m45n53j015
60710C08679j556k014k039j547j086j143j312r19j00L73J99j73k66J7O01J222
60694B98936J347P49P1J55Q99J426J308R05M76j25p61p88R9J393K420K968L097
60677C14575K953K975L680M844N575N469N137N154N211M854M381M228L958K760
$$ plain form
60663 375754 376541 375630 373959 372178 370437 368756 367137 365526 364062 363229 363364 364118 364772 365050 365248 365619
60647 365619 366019 366293 366595 367106 367628 367683 366929 365252 362521 358490 353105 346866 340742 335584 331573 328273
60631 328273 325226 322372 319854 317696 315907 314743 314478 314848 315117 314803 314099 313432 312954 312714 312989 313982 315315
60614 315315 316294 316688 316892 317302 317920 318604 319298 319872 320134 320179 320383 320843 321208 321345 321755 322934 324657 326341
60596 326341 327849 329429 331087 332666 334432 336887 339900 342635 344546 345881 346981 347591 347272 346144 344832
60581 344832 343855 343359 343242 343264 343276 343529 344559 346465 348636 350554 352676 356012 360939 366930 373490 380870
60565 380870 389584 399582 410240 421024 431755 442196 451680 459374 464783 467745 468037 465373 460017
60552 460017 453121 446133 439932 434750 430738 428115 426832 426628 427618 430365 435177 441735 449716 459396 471257
$$ packed form
60663C75754P87r11j671j781j741j681j619j611j464q33J35P54O54K78J98L71
60647C65619M00K74L02N11N22N5p54j677k731m031n385o239o124n158m011l300
60631C28273l047k854k518k158j789j164k65L70K69l14p04o67m78k40K75R93J333
60614C15315R79L94K04M10O18O84O94N74K62M5K04M60L65J37M10J179J723J684
60596C26341J508J580J658J579J766K455L013K735J911J335J100O10l19j128j312
60581C44832r77m96j17K2J2K53J030J906K171J918K122L336M927N991O560P380
60565C80870Q714R998J0658J0784J0731J0441R484P694N409K962K92k664n356
60552D60017o896o988o201n182m012k623j283k04R90K747M812O558P981R680J1861
$$ plain form
60537 471257 485247 500832 517513 534844 552068 568232 582659 594901 604280 609922 611421 609184
60525 609184 603998 596540 587478 577770 568563 560731 554499 549419 544623 539334 533421 527662 523370 521497
60511 521497 521863 523258 524467 525211 526041 527527 529939 533641 539252 547162 557347 569983 585880 605871
60497 605871 630122 658495 691277 728838 770652 815253 861255 907821 954037 998389 1039127
60486 1039127 1074660 1103235 1122717 1131275 1128334 1114565 1091046 1058682 1018408 971636 920378 867019
60474 867019 813954 763273 716499 674472 637374 604938 576726 552222 530773 511661 494381
60463 494381 478800 464962 452913 442764 434621 428155 422418 416532 410503 405066 400672 396964 393242
60450 393242 389159 384807 380431 376240 372435 369335 367388 366805 366959 366467 364377 361257 358658 357495 357386
$$ packed form
60537D71257J3990J5585J6681J7331J7224J6164J4427J2242R379N642J499k237
60525F09184n186p458r062r708r207p832o232n080m796n289n913n759m292j873
60511E21497L66J395J209P44Q30J486K412L702N611P910J0185J2636J5897J9991
60497F05871K4251K8373L2782L7561M1814M4601M6002M6566M6216M4352M0738
60486A039127L5533K8575J9482Q558k941j3769k3519l2364m0274m6772n1258n3359
60474H67019n3065n0681m6774m2027l7098l2436k8212k4504k1449j9112j7280
60463D94381j5581j3838j2049j0149q143o466n737n886o029n437m394l708l722
60450C93242m083m352m376m191l805l100j947n83J54m92k090l120k599j163j09
$$ plain form
60435 357386 357573 357841 358248 358517 358215 357278 355954 354396 352698 351217 350404 350277 350345 350162 349850 349938 350732 351931
60417 351931 353014 354005 355594 358234 361337 363845 365455 366759 368107 368968 368739 367648 366431 365522 364997
60402 364997 364960 365462 366227 366978 367913 369406 371366 373322 375076 376789 378467 379867 380968 382069 383347 384678
60386 384678 386029 387583 389343 391058 392759 394943 397812 400610 402208 402358 402112 402873 405181 408437 411656
60371 411656 414401 416972 419721 422371 424216 424985 425236 425743 426718 427815 428744 429563 430362 431007 431434 432133 434009
60354 434009 437553 442189 446684 450315 453538 457391 462408 468391 475053 482384 490157 497490 503345 507385
60340 507385 509964 511278 510864 508094 502960 496256 489097 482325 476177 470374 464627 459162 454596 451223
60326 451223 448591 446004 443267 440674 438395 436240 434056 431941 429979 428037 426097 424492 423610 423511 424092
$$ packed form
60435C57386J87K68M07K69l02r37j324j558j698j481q13j27O8j83l12Q8P94J199
60417C51931J083R91J589K640L103K508J610J304J348Q61k29j091j217r09n25
60402C64997l7N02P65P51R35J493J960J956J754J713J678J400J101J101J278J331
60386C84678J351J554J760J715J701K184K869K798J598J50k46P61K308L256L219
60371D11656K745K571K749K650J845P69K51N07R75J097R29Q19P99O45M27O99J876
60354D34009L544M636M495L631L223L853N017N983O662P331P773P333N855M040
60340E07385K579J314m14k770n134o704p159o772o148n803n747n465m566l373
60326D51223k632k587k737k593k279k155k184k115j962j942j940j605q82r9N81
$$ plain form
60311 424092 425423 427661 430760 434625 439521 446092 454937 466349 480437 497225 516601 538235 561475
60298 561475 585046 606938 624948 637495 643802 643415 636039 622065 603034 581262 558986 537825
60286 537825 518777 502419 489021 478491 470305 463711 458214 453770 450350 447529 444818 442237 440019
60273 440019 437754 434490 429952 425163 421345 418557 415929 413003 410268 408319 406989 405564 403630 401506
60259 401506 399899 399184 399048 398815 398097 396987 395637 393979 392018 390170 388973 388579 388789 389447 390492 391634
60243 391634 392399 392656 392869 393576 394748 395872 396638 397330 398401 399853 401292 402576 404042 405941 407969 409699
60227 409699 411220 412906 414743 416447 418201 420580 423569 426294 428091 429300 430601 432093 433595 435410
60213 435410 438108 441744 445937 450587 455938 461952 468206 474475 480914 487541 493965 499777 504910 509536
$$ packed form
60311D24092J331K238L099L865M896O571Q845J1412J4088J6788J9376K1634K3240
60298E61475K3571K1892J8010J2547O307l87p376j3974j9031k1772k2276k1161
60286E37825j9048j6358j3398j0530q186o594n497m444l420k821k711k581k218
60273D40019k265l264m538m789l818k788k628k926k735j949j330j425j934k124
60259D01506j607p15j36k33p18j110j350j658j961j848j197l94K10O58J045J142
60243C91634P65K57K13P07J172J124P66O92J071J452J439J284J466J899K028J730
60227D09699J521J686J837J704J754K379K989K725J797J209J301J492J502J815
60213D35410K698L636M193M650N351O014O254O269O439O627O424N812N133M626
$$ plain form
60199 509536 513956 518613 523821 529390 534757 539540 543703 547202 549910 551942 553670 555212 556228 556391
60185 556391 555842 555027 554199 553153 551309 548146 543800 539155 535034 531387 527610 523545 519615 516096 512874
60170 512874 510050 508057 506859 505639 503729 501374 499114 496880 494294 491525 489184 487526 486304 485375
60156 485375 484849 484640 484395 484053 484073 484889 486389 488133 489871 491641 493491 495277 496773 497886 498793 499840
60140 499840 501325 503383 506054 509260 512703 515983 519066 522482 526850 532187 537820 542884 546809 549501
60126 549501 551341 552952 554751 556708 558608 560339 561715 562327 562087 561793 562545 564435 566419 567779 569143
60111 569143 571490 574553 576920 577655 577152 576328 575623 575013 574404 573560 572009 569520 566459 563282 559932 556186
60095 556186 552372 549125 546556 544283 542271 540948 540363 539978 539630 539975 541473 543506 545197 546590 548248
$$ packed form
60199E09536M420M657N208N569N367M783M163L499K708K032J728J542J016J63
60185E56391n49q15q28j046j844l163m346m645m121l647l777m065l930l519l222
60170E12874k824j993j198j220j910k355k260k234k586k769k341j658j222r29
60156D85375n26k09k45l42K0Q16J500J744J738J770J850J786J496J113R07J047
60140D99840J485K058K671L206L443L280L083L416M368N337N633N064L925K692
60126E49501J840J611J799J957J900J731J376O12k40k94P52J890J984J360J364
60111E69143K347L063K367P35n03q24p05o10o09q44j551k489l061l177l350l746
60095E56186l814l247k569k273k012j323n85l85l48L45J498K033J691J393J658
$$ plain form
60080 548248 549984 550886 550577 549651 548771 548008 547196 546228 544753 542155 538238 533506 528502 523273 517673 511765
60064 511765 505567 498906 491871 485021 478781 472987 467470 462683 459172 456648 454182 451279 448229 445437
60050 445437 442933 440715 439104 438463 438771 439781 441536 444488 448966 454530 460029 464495 468017 471504 475634
60035 475634 480284 485024 489711 494270 498262 501124 502719 503307 503017 501704 499275 495786 491227 485580 479191
60020 479191 472797 466966 461630 456268 450505 444511 438907 434262 430636 427557 424514 421352 418204 415234
60006 415234 412560 410238 408114 405870 403381 400901 398670 396584 394504 392690 391506 390806 390078 389271 389015
59991 389015 389887 391770 394124 396620 399283 402226 405506 409144 413079 417065 420749 423888 426457 428557
59977 428557 430248 431443 432003 431885 431162 429939 428404 426946 425954 425325 424403 422669 420415 418468 417365 417072
$$ packed form
60080E48248J736R02l09r26q80p63q12r68j475k598l917m732n004n229n600n908
60064E11765o198o661p035o850o240n794n517m787l511k524k466k903l050k792
60050D45437k504k218j611o41L08J010J755K952M478N564N499M466L522L487M130
60035D75634M650M740M687M559L992K862J595N88k90j313k429l489m559n647o389
60020D79191o394n831n336n362n763n994n604m645l626l079l043l162l148k970
60006D15234k674k322k124k244k489k480k231k086k080j814j184p00p28q07k56
59991C89015Q72J883K354K496K663K943L280L638L935L986L684L139K569K100
59977D28557J691J195N60j18p23j223j535j458r92o29r22j734k254j947j103k93
$$ plain form
59961 417072 417399 418317 419795 421625 423562 425435 427019 427997 428222 427936 427647 427771 428345 429007 429322 429227 429068
59944 429068 429132 429329 429555 430105 431276 432619 433169 432629 431872 431955 432913 433942 434598 435315 436661 438509 440224
59927 440224 441468 442460 443439 444272 444841 445552 447061 449547 452660 456184 460251 464734 469012 472790 476741
59912 476741 481726 487591 493307 498179 502244 505488 507350 507359 505778 503341 500664 498115 495893 493962 492106
59897 492106 490242 488479 486828 485213 483905 483460 483942 484632 484959 485430 487123 490345 494294 498047 501564
59882 501564 505599 510920 517627 525039 532153 538340 543663 548491 552960 556884 560078 562496 564104 564821
59868 564821 564588 563303 560709 556555 551023 544927 539338 534878 531311 527872 524104 520400 517566 515874
59854 515874 514781 513657 512603 512394 513836 517308 522792 530043 538691 548242 557914 566516 572771 576078
$$ packed form
59961D17072L27R18J478J830J937J873J584R78K25k86k89J24N74O62L15r5j59
59944D29068O4J97K26N50J171J343N50n40p57Q3R58J029O56P17J346J848J715
59927D40224J244R92R79Q33N69P11J509K486L113L524M067M483M278L778L951
59912D76741M985N865N716M872M065L244J862Rj581k437k677k549k222j931j856
59897D92106j864j763j651j615j308m45M82O90L27M71J693L222L949L753L517
59882E01564M035N321O707P412P114O187N323M828M469L924L194K418J608P17
59868E64821k33j285k594m154n532o096n589m460l567l439l768l704k834j692
59854E15874j093j124j054k09J442L472N484P251Q648R551R672Q602O255L307
$$ plain form
59840 576078 576904 576315 575190 574014 573186 573136 574027 575514 576828 577027 575289 571230 565126 557799 550267 543419
59824 543419 537783 533398 529854 526529 522868 518551 513586 508312 503207 498671 495060 492790 492033 492261 492424
59809 492424 491775 490338 488505 486496 484398 482288 480004 477126 473538 469727 466153 462638 458850 455087
59795 455087 451979 449662 447884 446788 446795 447638 448289 448169 447756 447707 447961 448214 448687 449780 451235 452271 452521
59778 452521 452362 452341 452657 453196 453766 454221 454581 455048 455697 456237 456297 455968 455844 456453 457729 459088 459986 460463 461135
59759 461135 462544 464505 466400 468093 470155 472923 475772 477863 479373 481429 484869 489601 495154 501236
59745 501236 507534 513478 518619 522938 526566 529463 531684 533656 535863 538396 541072 543756 546269 548261
59731 548261 549585 550628 551785 552705 552628 551440 549858 548397 546767 544586 542218 540460 539661 539563 539765 539891
$$ packed form
59840E76078Q26n89j125j176q28n0Q91J487J314J99j738m059o104p327p532o848
59824E43419n636m385l544l325l661m317m965n274n105m536l611k270p57K28J63
59809D92424o49j437j833k009k098k110k284k878l588l811l574l515l788l763
59795D55087l108k317j778j096PQ43O51j20m13m9K54K53M73J093J455J036K50
59778D52521j59k1L16N39N70M55L60M67O49N40O0l29j24O09J276J359Q98M77O72
59759D61135J409J961J895J693K062K768K849K091J510K056L440M732N553O082
59745E01236O298N944N141M319L628K897K221J972K207K533K676K684K513J992
59731E48261J324J043J157R20p7j188j582j461j630k181k368j758p99r8K02J26
$$ plain form
59715 539891 539597 538920 538552 539168 540463 541379 541386 541032 541095 541749 542869 544624 547226 550441 553841 557340 561000
59698 561000 564525 567515 570198 573314 577163 581204 584730 587502 589562 590857 591370 591330 590964 590222 588933
59683 588933 587091 584799 582217 579719 577795 576452 574953 572519 569170 565578 562246 559158 556091 552800
59669 552800 548934 544229 538945 533793 529297 525435 521983 518901 516284 514166 512493 511184 510158 509504
59655 509504 509608 510837 513011 515408 517386 518880 520336 522426 525638 529686 533251 534836 534116 532065 529674
59640 529674 527111 524318 521627 519063 515676 510473 503901 497595 492676 489021 486149 483916 482099 480062
59626 480062 477417 474573 472147 470146 468125 465874 463494 461007 458292 455329 452152 448629 444660 440612
59612 440612 437218 434903 433340 431784 429801 427612 425797 424746 424445 424751 425670 427163 428860 430224 431013
$$ packed form
59715E39891k94o77l68O16J295R16Pl54O3O54J120J755K602L215L400L499L660
59698E61000L525K990K683L116L849M041L526K772K060J295N13m0l66p42j289
59683E88933j842k292k582k498j924j343j499k434l349l592l332l088l067l291
59669E52800l866m705n284n152m496l862l452l082k617k118j673j309j026o54
59655E09504J04J229K174K397J978J494J456K090L212M048L565J585p20k051k391
59640E29674k563k793k691k564l387n203o572o306m919l655k872k233j817k037
59626D80062k645k844k426k001k021k251k380k487k715k963l177l523l969m048
59612D40612l394k315j563j556j983k189j815j051l01L06R19J493J697J364P89
$$ plain form
59597 431013 431320 431217 430706 430075 429908 430486 431453 432308 433014 433905 435170 436655 438049 439090 439659 439787 439492
59580 439492 438623 437070 435071 432986 430713 427755 424010 420085 416614 413728 411437 410038 409654 409728 409481
59565 409481 408668 407487 406044 404342 402503 400567 398349 395972 394222 393805 394488 395550 396807 398532 400642
59550 400642 402776 405001 407662 410593 413332 416067 419475 423677 428327 433828 441257 450742 461073 471534
59536 471534 483195 497660 515301 535269 556105 575294 589159 594837 592499 584944 575258 565606
59524 565606 557621 552418 549928 549156 549390 550576 552530 554641 556471 557906 558510 557547 554858 551027 546390
59509 546390 540627 533675 526276 519054 511661 503516 494919 486724 479182 471811 464339 457122 450598 444866
59495 444866 439989 436301 434157 433455 433583 433769 433469 432478 430834 428733 426656 425425 425781 427794 430833 434150
$$ packed form
59597D31013L07j03n11o31j67N78R67Q55P06Q91J265J485J394J041N69J28k95
59580D39492q69j553j999k085k273k958l745l925l471k886k291j399l84P4k47
59565D09481q13j181j443j702j839j936k218k377j750m17O83J062J257J725K110
59550D00642K134K225K661K931K739K735L408M202M650N501P429R485J0331J0461
59536D71534J1661J4465J7641J9968K0836J9189J3865N678k338p555r686r652
59524E65606p985n203k490p72K34J186J954K111J830J435O04r63k689l831m637
59509E46390n763o952p399p222p393q145q597q195p542p371p472p217o524n732
59495D44866m877l688k144p02J28J86l00r91j644k101k077j231L56K013L039L317
$$ plain form
59479 434150 437301 440008 442060 443651 445461 447990 450971 453791 456366 459173 462475 465905 468887 471113
59465 471113 472537 473281 473690 474184 474814 475242 475384 475826 477316 480013 483526 487548 492068 497056 502416 508326
59449 508326 515214 523145 531496 539424 546441 552403 557271 561145 564182 566114 566112 563581 558950 553197 546740
59434 546740 539373 531236 523168 515925 509640 504275 500013 496863 494427 492541 491717 492406 494279 496843 500475
59419 500475 506065 513788 523024 533515 545860 560586 577392 595747 615794 638214 663254 689932
59407 689932 715736 736855 749349 751060 742870 728070 710513 693304 678729 668643 664353 666064
59395 666064 672438 680639 686873 687374 679709 663828 642070 617894 594207 572626 553874 538294 525847
59382 525847 516029 508235 502108 497371 493646 490795 489194 489153 490224 491579 493008 495010 497908 501460 505480
$$ packed form
59479D34150L151K707K052J591J810K529K981K820K575K807L302L430K982K226
59465D71113J424P44M09M94O30M28J42M42J490K697L513M022M520M988N360N910
59449E08326O888P931Q351P928P017N962M868L874L037J932kk531m631n753o457
59434E46740p367q137q068p243o285n365m262l150k436j886q24O89J873K564L632
59419E00475N590P723R236J0491J2345J4726J6806J8355K0047K2420K5040K6678
59407F89932K5804K1119J2494J711q190j4800j7557j7209j4575j0086m290J711
59395F66064O374Q201O234N01p665j5881k1758k4176k3687k1581j8752j5580j2447
59382E25847r818p794o127m737l725k851j601m1J071J355J429K002K898L552M020
$$ plain form
59367 505480 510146 515401 520544 524848 528286 531325 534343 537626 541574 546409 551816 557331 563043 569558
59353 569558 577308 586257 596254 607258 619120 631444 643900 656538 669669 683500 697975 712947
59341 712947 728381 744273 760336 775850 789956 802075 811870 818871 822467 822484 819582 814856 809068
59328 809068 802251 793860 783269 770417 756118 741556 727360 713481 700081 688011 677875 668969
59316 668969 659889 650253 641181 633868 628176 623058 618002 613555 610474 608859 608319 608699 610309 613526 618563
59301 618563 625815 636077 649909 666761 685038 703004 719104 731321 737066 734689 725054 710946
59289 710946 694858 677852 660511 644019 629655 617731 607805 599702 593634 589304 585708 582180 579178
59276 579178 577604 577683 578963 581201 584598 589163 594442 600179 606796 614762 623724 632720 641156 649095 656521
$$ packed form
59367E05480M666N255N143M304L438L039L018L283L948M835N407N515N712O515
59353E69558P750Q949R997J1004J1862J2324J2456J2638J3131J3831J4475J4972
59341G12947J5434J5892J6063J5514J4106J2119R795P001L596J7k902m726n788
59328H09068o817q391j0591j2852j4299j4562j4196j3879j3400j2070j0136q906
59316F68969r080r636r072p313n692n118n056m447l081j615n40L80J610L217N037
59301F18563P252J0262J3832J6852J8277J7966J6100J2217N745k377r635j4108
59289G10946j6088j7006j7341j6492j4364j1924r926q103o068m330l596l528l002
59276E79178j574P9J280K238L397M565N279N737O617P966Q962Q996Q436P939P426
$$ plain form
59261 656521 662823 667222 669449 669724 668242 664940 659710 652653 644152 634752 624899 614734 604357 594379
59247 594379 585965 579972 576077 573081 570102 567264 565161 563936 563158 562502 562264 562989 564692 566713 568498
59232 568498 570316 572923 576548 580526 583963 586437 587898 588273 587536 585974 584010 581798 579265 576421 573288
59217 573288 569569 564840 559171 553337 548315 544804 543144 543255 544476 545831 546766 547406 547885 547792 546698 545074
59201 545074 544076 544342 545347 546121 546345 546578 547585 549659 552480 555423 558057 560469 563052 565983 568988
59186 568988 571775 574499 577581 581105 584640 587709 590230 592450 594597 596682 598557 600086 601299 602408
59172 602408 603549 604592 605361 606058 607177 608968 611310 614285 618468 624250 631099 637971 644428 650856 657529
59157 657529 663925 669222 673144 675918 677573 677636 675684 672012 667556 663094 658609 653583 647868 642008 636577
$$ packed form
59261F56521O302M399K227K75j482l302n230p057q501r400r853j0165j0377r978
59247E94379q414n993l895k996k979k838k103j225p78o56k38P25J703K021J785
59232E68498J818K607L625L978L437K474J461L75p37j562j964k212k533k844l133
59217E73288l719m729n669n834n022l511j660J11J221J355R35O40M79r3j094j624
59201E45074r98K66J005P74K24K33J007K074K821K943K634K412K583K931L005
59186E68988K787K724L082L524L535L069K521K220K147K085J875J529J213J109
59172F02408J141J043P69O97J119J791K342K975M183N782O849O872O457O428O673
59157F57529O396N297L922K774J655O3j952l672m456m462m485n026n715n860n431
$$ plain form
59142 636577 631498 626279 620747 615148 609633 604015 598066 591693 584843 577664 570795 565060 560716 557323
59128 557323 554453 552088 550195 548448 546752 545596 545466 546287 547841 550382 554311 559497 565487 572216 579934
59113 579934 588463 597127 605466 613533 621472 629314 637327 645991 655267 664281 672111 678667 684561 690324
59099 690324 696079 701828 707620 713347 718537 722505 724761 725314 724537 722762 720099 716786 713539 711219 710084
59084 710084 709643 709268 708615 707310 704674 700140 693804 686184 677556 667916 657559 647233 637518 628361
59070 628361 619489 611021 603333 596438 589933 583595 577641 572212 566913 561212 555160 549379 544406 540286
59056 540286 536785 533666 530666 527554 524335 521216 518235 515188 512063 509319 507465 506444 505683 504663
59042 504663 503345 502051 501077 500379 499610 498588 497677 497476 498106 499130 500341 502211 505240 509190 513440 517964
$$ packed form
59142F36577n079n219n532n599n515n618n949o373o850p179o869n735m344l393
59128E57323k870k365j893j747j696j156j30Q21J554K541L929N186N990O729P718
59113E79934Q529Q664Q339Q067P939P842Q013Q664R276R014P830O556N894N763
59099F90324N755N749N792N727N190L968K256N53p77j775k663l313l247k320j135
59084G10084m41l75o53j305k636m534o336p620q628r640j0357j0326r715r157
59070F28361q872q468p688o895o505o338n954n429n299n701o052n781m973m120
59056E40286l501l119l000l112l219l119k981l047l125k744j854j021p61j020
59042E04663j318j294r74o98p69j022r11k01O30J024J211J870L029L950M250M524
$$ plain form
59026 517964 523396 530120 537720 545575 553759 563105 574398 587569 601712 615884 629840 643824 657702
59013 657702 670556 681281 689327 694760 697893 699088 698631 696584 693053 688855 685464 683840 683665 684174
58999 684174 685348 687622 690753 693900 696729 699576 702424 704514 705203 704473 702372 698755 693941 688801 683581
58984 683581 677330 669194 659850 650932 643379 637026 631556 627019 623446 620664 618696 617853 618352 620188 623438
58969 623438 628263 634491 641528 648747 655727 662205 668207 674222 680777 687669 694080 699615 704727 709772
58955 709772 714003 716036 715194 712016 707474 702084 695776 688226 679152 668548 656890 645015 633653
58942 633653 623098 613367 604482 596455 589189 582665 577140 572908 569842 567428 565266 563300 561522 559736
58928 559736 557800 555845 554085 552575 551296 550215 549032 547213 544653 542087 540401 539584 538742 537098 534639
$$ packed form
59026E17964N432O724P600P855Q184R346J1293J3171J4143J4172J3956J3984J3878
59013F57702J2854J0725Q046N433L133J195m57k047l531m198l391j624j75N09
58999F84174J174K274L131L147K829K847K848K090O89p30k101l617m814n140n220
58984F83581o251q136r344q918p553o353n470m537l573k782j968q43M99J836L250
58969F23438M825O228P037P219O980O478O002O015O555O892O411N535N112N045
58955G09772M231K033q42l178m542n390o308p550r074j0604j1658j1875j1362
58942F33653j0555r731q885q027p266o524n525m232l066k414k162j966j778j786
58928E59736j936j955j760j510j279j081j183j819k560k566j686q17q42j644k459
$$ plain form
58913 534639 531929 529735 528792 529320 530636 531778 532724 534457 537624 541697 545876 550346 556057 563598 572858
58898 572858 583543 595328 607481 619022 629550 639562 649764 660328 670978 681479 691838
58887 691838 702271 713243 725403 739163 754245 769805 784961 799138 811935 822929 831754 838239
58875 838239 842260 843471 841487 836461 829260 820789 811275 800503 788676 776629 765168 754574 744893
58862 744893 736248 728532 721128 713424 705455 697621 689846 681521 672321 662599 652770 642766 632496 622552
58848 622552 613940 607086 601487 596460 591814 587591 583500 579107 574476 570090 565992 561492 556088 550351
58834 550351 545383 541476 537753 533276 528117 523118 518873 515271 511952 508953 506778 505880 506144 506942 507679
58819 507679 508186 508567 508927 509434 510426 512091 514095 515847 517124 518171 519282 520622 522379 524588 526791
$$ packed form
58913E34639k710k194r43N28J316J142R46J733L167M073M179M470N711P541R260
58898E72858J0685J1785J2153J1541J0528J0012J0202J0564J0650J0501J0359
58887F91838J0433J0972J2160J3760J5082J5560J5156J4177J2797J0994Q825O485
58875H38239M021J211j984n026p201q471r514j0772j1827j2047j1461j0594r681
58862G44893q645p716p404p704p969p834p775q325r200r722r829j0004j0270r944
58848F22552q612o854n599n027m646m223m091m393m631m386m098m500n404n737
58834E50351m968l907l723m477n159m999m245l602l319k999k175q98K64P98P37
58819E07679N07L81L60N07R92J665K004J752J277J047J111J340J757K209K203
$$ plain form
58804 526791 528378 529407 530577 532203 533755 534692 535158 535360 534786 532755 529494 526001 522887 519974 517037
58789 517037 514342 512296 510955 510102 509514 509101 509054 509927 512236 515878 520185 524619 529139 533896 538943 544370
58773 544370 550242 556102 560871 563648 564417 563605 561128 556414 549463 541473 534137 528471 524403 521295 518575
58758 518575 515982 513523 511370 509701 508574 507993 508071 508987 510728 512974 515294 517413 519297 521140 523293
58743 523293 525965 528901 531596 533989 536668 540081 543850 547293 550501 554355 559453 565471 571653 577497
58729 577497 582812 587595 592123 596798 601647 606273 610478 614466 618154 620859 622208 622976 624371 626688
58715 626688 629417 632516 636695 642182 647973 652889 656895 660811 664931 668533 670759 671411 670707 668671 665154
58700 665154 660205 654023 646484 637074 625410 611676 596491 580616 564915 550306 537407 526326
$$ packed form
58804E26791J587J029J170J626J552R37M66K02n74k031l261l493l114k913k937
58789E17037k695k046j341q53n88m13m7Q73K309L642M307M434M520M757N047N427
58773E44370N872N860M769K777P69q12k477m714o951p990p336n666m068l108k720
58758E18575k593k459k153j669j127n81P8R16J741K246K320K119J884J843K153
58743E23293K672K936K695K393K679L413L769L443L208L854N098O018O182N844
58729E77497N315M783M528M675M849M626M205L988L688K705J349P68J395K317
58715F26688K729L099M179N487N791M916M006L916M120L602K226O52p04k036l517
58700F65154m949o182p539r410j1664j3734j5185j5875j5701j4609j2899j1081
$$ plain form
58688 526326 516946 509234 502980 497523 492193 487005 482478 478794 475507 472126 468604 465149 461952 459186
58674 459186 456965 455245 454071 453876 455089 457443 460244 463411 467629 473359 480353 488418 497836 508475
58660 508475 519122 528392 535872 541733 545688 547082 545783 542281 537104 530810 524324 518446 513001 507116
58646 507116 500428 493480 486944 481083 476021 471907 468536 465330 461965 458740 456227 454859 454929 456542 459407
58631 459407 462954 466778 470743 474651 478210 481414 484628 488147 491891 495625 499273 502960 506882 511058
58617 511058 515015 517907 519297 519690 519956 520377 520696 520856 521021 520873 519681 517309 514546 512115 509933 507716
58601 507716 505834 505055 505659 507316 509692 512736 516301 519786 522253 522946 521838 519819 518243 518159 519891
58586 519891 523248 527898 533523 539904 547041 555128 564301 574446 585193 595984 606148 615137 622775
$$ packed form
58688E26326r380p712o254n457n330n188m527l684l287l381l522l455l197k766
58674D59186k221j720j174j95J213K354K801L167M218N730O994Q065R418J0639
58660E08475J0647R270P480N861L955J394j299l502n177o294o486n878n445n885
58646E07116o688o948o536n861n062m114l371l206l365l225k513j368P0J613K865
58631D59407L547L824L965L908L559L204L214L519L744L734L648L687L922M176
58617E11058L957K892J390L93K66M21L19J60J65j48j192k372k763k431k182k217
58601E07716j882p79O04J657K376L044L565L485K467O93j108k019j576q4J732
58586E19891L357M650N625O381P137Q087R173J0145J0747J0791J0164Q989P638
$$ plain form
58573 622775 629238 634872 640070 645206 650469 655842 661431 667756 675543 685301 697259 711593 728467
58560 728467 747876 769588 793084 817446 841539 864529 886030 905559 922213 935194 944316 949667
58548 949667 951239 949439 945557 940901 935662 929239 921527 913097 904210 894477 883515 871157 856940
58535 856940 840272 821388 801411 781246 761137 741507 723379 707457 693481 681047 670415
58524 670415 661944 655316 650018 646163 644053 643191 642500 641541 640900 641194 642121 642691 642224 640912 639428 638083
58508 638083 636584 634657 632601 630864 629348 627657 625910 624621 623724 622451 620443 618317 616765 615659
58494 615659 614536 613476 612952 613119 613750 614682 615912 617455 619502 622563 627010 632559 638507 644556 651191
58479 651191 659308 669525 681813 695639 710454 725883 741422 756179 769261 780189 788603 793867
$$ packed form
58573F22775O463N634N198N136N263N373N589O325P787R758J1958J4334J6874
58560G28467J9409K1712K3496K4362K4093K2990K1501J9529J6654J2981R122N351
58548I49667J572j800l882m656n239o423p712q430q887r733j0962j2358j4217
58535H56940j6668j8884j9977k0165k0109j9630j8128j5922j3976j2434j0632
58524F70415q471o628n298l855k110q62o91r59o41K94R27N70m67j312j484j345
58508F38083j499j927k056j737j516j691j747j289q97j273k008k126j552j106
58494F15659j123j060n24J67O31R32J230J543K047L061M447N549N948O049O635
58479F51191Q117J0217J2288J3826J4815J5429J5539J4757J3082J0928Q414N264
$$ plain form
58467 793867 795622 794467 791320 786187 778502 768790 758973 750586 743611 737612 733180 731433 732581 735804
58453 735804 740286 745823 752683 761330 771973 783898 795411 804795 811101 813886 812805 808004 800496
58440 800496 791584 782168 772847 764205 756518 749638 743616 739036 736309 735216 735637 738026 742421 747624
58426 747624 752428 757339 764040 773283 784213 795712 807347 818792 829234 837850 844396 848980 851611
58413 851611 852169 850524 846524 840215 832236 823753 815774 808611 801971 795442 788925 782813 777788 774336
58399 774336 772471 771894 772250 773246 774827 777349 781249 786407 792197 798265 804776 811637 818037 823199 827211
58384 827211 830717 834140 837599 841235 845048 848638 851529 853611 854988 855663 855689 855402 855162 855127 855454 856380
58368 856380 857922 859963 862881 867462 873803 880974 888322 896473 906374 917852 929902 942021 954488
$$ packed form
58467G93867J755j155l147n133p685r712r817q387o975n999m432j747J148L223
58453G35804M482N537O860Q647J0643J1925J1513R384O306K785j081m801p508
58440H00496q912r416r321q642p687o880o022m580k727j093M21K389M395N203
58426G47624M804M911O701R243J0930J1499J1635J1445J0442Q616O546M584K631
58413H51611N58j645m000o309p979q483p979p163o640o529o517o112n025l452
58399G74336j865n77L56R96J581K522L900N158N790O068O511O861O400N162M012
58384H27211L506L423L459L636L813L590K891K082J377O75K6k87k40l5L27R26
58368H56380J542K041K918M581O341P171P348Q151R901J1478J2050J2119J2467
$$ plain form
58355 954488 967589 981244 995137 1008529 1020196 1029292 1036191 1041944 1047026 1051168 1054231 1056646 1059071
58342 1059071 1062060 1065980 1070886 1076592 1083179 1091137 1100797 1111986 1124536 1138573 1153930 1169814 1185506
58329 1185506 1200909 1216025 1230531 1244334 1257812 1270953 1282993 1293493 1302902 1311361 1317967 1322293
58317 1322293 1325710 1329916 1334891 1339704 1344742 1351539 1360546 1370558 1380410 1390139 1400418 1411886 1424999
58304 1424999 1439598 1454666 1469437 1484557 1501224 1519427 1538062 1556600 1575464 1594822 1614122
58293 1614122 1632903 1651186 1669087 1686989 1705950 1726987 1749921 1773772 1798150 1823448 1850012
58282 1850012 1878051 1908103 1940484 1974475 2009054 2044199 2080480 2117786 2155623 2194372 2234904
58271 2234904 2277145 2320299 2364376 2410247 2458270 2508091 2559763 2613885 2670664 2729883 2791645
$$ packed form
58355I54488J3101J3655J3893J3392J1667R096O899N753N082M142L063K415K425
58342A059071K989L920M906N706O587P958R660J1189J2550J4037J5357J5884J5692
58329A185506J5403J5116J4506J3803J3478J3141J2040J0500R409Q459O606M326
58317A322293L417M206M975M813N038O797R007J0012R852R729J0279J1468J3113
58304A424999J4599J5068J4771J5120J6667J8203J8635J8538J8864J9358J9300
58293A614122J8781J8283J7901J7902J8961K1037K2934K3851K4378K5298K6564
58282A850012K8039L0052L2381L3991L4579L5145L6281L7306L7837L8749M0532
58271B234904M2241M3154M4077M5871M8023M9821N1672N4122N6779N9219O1762
$$ plain form
58260 2791645 2856146 2923057 2992208 3064398 3140246 3218704 3298061 3377857 3458407 3539125 3619116
58249 3619116 3699008 3780440 3864170 3950570 4041478 4139387 4244965 4357338 4476645 4604236
58239 4604236 4740607 4885408 5039474 5204624 5381438 5569390 5769109 5982189 6208832
58230 6208832 6448173 6701086 6970223 7257113 7561816 7885796 8232706 8606025 9008334
58221 9008334 9443118 9914721 10426229 10979951 11580311 12233959 12947237 13726334 14579925
58212 14579925 15519001 16554806 17700575 18975481 20404009 22012595 23831328 25899155
58204 25899155 28264349 30982118 34118332 37756902 42001100 46972410 52818406 59725003
58196 59725003 67919288 77669372 89299957 103216783 119910748 139930690 163828851
$$ packed form
58260B791645O4501O6911O9151P2190P5848P8458P9357P9796Q0550Q0718P9991
58249C619116P9892Q1432Q3730Q6400R0908R7909J05578J12373J19307J27591
58239D604236J36371J44801J54066J65150J76814J87952J99719K13080K26643
58230F208832K39341K52913K69137K86890L04703L23980L46910L73319M02309
58221I008334M34784M71603N11508N53722O00360O53648P13278P79097Q53591
58212A4579925R39076J035805J145769J274906J428528J608586J818733K067827
58204B5899155K365194K717769L136214L638570M244198M971310N845996O906597
58196E9725003Q194285R750084J1630585J3916826J6693965K0019942K3898161
$$ plain form
58189 163828851 192053845 224749865 261477171 300936448 340784870 377640220 407441460
58182 407441460 426303440 431677447 423220366 402798686 373639939 339240367 302644026
58175 302644026 266219940 231681533 200130123 172112908 147743021 126852201 109117600
58168 109117600 94149922 81555441 70971132 62073428 54578316 48244758 42874063
58161 42874063 38300814 34385907 31016721 28104805 25576826 23368618 21427199 19711914
58153 19711914 18189544 16830541 15610703 14511996 13519249 12618631 11800153 11057703 10384675
58144 10384675 9772344 9213614 8704934 8242757 7821021 7433708 7077017 6747141 6438449
58135 6438449 6145993 5868060 5604707 5355523 5120291 4900028 4695511 4505677 4328526
$$ packed form
58189A63828851K8224994L2696020L6727306L9459277L9848422L6855350K9801240
58182D07441460J8861980N374007q457081k0421680k9158747l4399572l6596341
58175C02644026l6424086l4538407l1551410k8017215k4369887k0890820j7734601
58168A09117600j4967678j2594481j0584309q897704p495112o333558n370695
58161D2874063m573249l914907l369186k911916k527979k208208j941419j715285
58153A9711914j522370j359003j219838j098707r92747r00618q18478p42450o73028
58144A0384675o12331n58730n08680m62177m21736l87313l56691l29876l08692
58135F438449k92456k77933k63353k49184k35232k20263k04517j89834j77151
$$ plain form
58126 4328526 4162572 4006642 3859451 3720257 3588950 3464976 3347178 3234947 3128382
58117 3128382 3027116 2930274 2837775 2750292 2667761 2589270 2514481 2443658 2376245 2311003 2247722
58106 2247722 2187200 2129421 2073425 2019091 1967240 1917723 1869224 1821296 1774784 1729906 1685855
58095 1685855 1642800 1602247 1564748 1529090 1494539 1462009 1432192 1404436 1378475 1355408 1335645
58084 1335645 1317458 1298918 1279867 1260725 1240761 1219093 1196338 1173772 1151622 1129434 1107379
58073 1107379 1086013 1065330 1045088 1025509 1006818 988736 971196 954769 939607 924776 909559
58062 909559 894669 881253 869445 858708 848817 839485 829731 818728 806792 794628 782180 769182
58050 769182 756358 745000 735563 727508 720171 713119 706067 699214 693224 688149 682861 676413 669463 663398
$$ packed form
58126D328526j65954j55930j47191j39194j31307j23974j17798j12231j06565
58117C128382j01266r6842r2499q7483q2531p8491p4789p0823o7413o5242o3281
58106B247722o0522n7779n5996n4334n1851m9517m8499m7928m6512m4878m4051
58095A685855m3055m0553l7499l5658l4551l2530k9817k7756k5961k3067j9763
58084A335645j8187j8540j9051j9142j9964k1668k2755k2566k2150k2188k2055
58073A107379k1366k0683k0242j9579j8691j8082j7540j6427j5162j4831j5217
58062I09559j4890j3416j1808j0737r891r332r754j1003j1936j2164j2448j2998
58050G69182j2824j1358r437q055p337p052p052o853n990n075n288o448o950o065
$$ plain form
58036 663398 658420 653515 648018 642125 635874 628677 620147 610615 600586 590245 579756 569545 559989
58023 559989 551050 542416 533887 525593 517862 510860 504388 498245 492664 487977 483867 479619 475280 471908
58009 471908 470202 469431 468283 466344 464185 462306 460643 458969 457263 455638 454136 452553 450364 447049
57995 447049 442605 437462 431880 425909 419991 414914 410873 407228 403629 400748 399378 399314 399762 400352 401029
57980 401029 401294 400330 397862 394349 390431 386599 383236 380469 378026 375650 373563 372183 371539 371279 371104
57965 371104 370883 370614 370608 371481 373488 376014 378081 379228 379576 379299 378494 377403 376239 374796 372645 369699
57949 369699 366233 362383 358091 353672 350110 348521 349308 351876 355163 358520 362154 366798 373082 381333
57935 381333 391640 403631 416259 428413 439851 451053 462024 471852 479750 485906 490839 494376
$$ packed form
58036F63398m978m905n497n893o251p197q530r532j0029j0341j0489j0211r556
58023E59989q939q634q529q294p731p002o472o143n581m687m110m248m339l372
58009D71908j706p71j148j939k159j879j663j674j706j625j502j583k189l315
57995D47049m444n143n582n971n918n077m041l645l599k881j370o4M48N90O77
57980D01029K65r64k468l513l918l832l363k767k443k376k087j380o44k60j75
57965C71104k21k69oQ73K007K526K067J147L48k77q05j091j164j443k151k946
57949C69699l466l850m292m419l562j589P87K568L287L357L634M644O284Q251
57935C81333J0307J1991J2628J2154J1438J1202J0971R828P898O156M933L537
$$ plain form
57923 494376 495889 495262 493029 489640 485061 479073 471620 462906 453480 444112 435322 426981 418594 409976
57909 409976 401606 394344 388808 384864 381741 378773 375943 373465 371079 368211 364715 360871 356709 352069
57895 352069 347423 343876 342064 341670 342206 343531 345379 347238 349169 351824 355088 357661 358864 360018 362918
57880 362918 367476 371969 375176 377121 378011 377780 376744 375494 373870 371009 366810 362556 359595 357983 356722
57865 356722 354767 351475 346753 341369 336822 334354 334053 335060 336443 337730 338852 339967 341339 343260
57851 343260 345944 349399 353295 357098 360439 363260 365498 366830 366972 366001 364165 361538 358207 354572 351035
57836 351035 347487 343489 338954 334277 329830 325669 321800 318410 315757 314013 313263 313415 314140 315088 316220
57821 316220 317775 319964 322775 326006 329355 332625 335936 339551 343334 346535 348267 348055 345868 341962
$$ packed form
57923D94376J513o27k233l389m579n988p453q714r426r368q790q341q387q618
57909D09976q370p262n536l944l123k968k830k478k386k868l496l844m162m640
57895C52069m646l547j812l94N36J325J848J859J931K655L264K573J203J154K900
57880C62918M558M493L207J945Q90k31j036j250j624k861m199m254k961j612j261
57865C56722j955l292m722n384m547k468l01J007J383J287J122J115J372J921
57851C43260K684L455L896L803L341K821K238J332J42r71j836k627l331l635l537
57836C51035l548l998m535m677m447m161l869l390k653j744p50J52P25R48J132
57821C16220J555K189K811L231L349L270L311L615L783L201J732k12k187l906
$$ plain form
57807 341962 336836 331061 324909 318417 311869 305715 299829 293525 286755 280689 276470 273884 272010 270743
57793 270743 270737 272003 273577 274737 275810 277507 280013 282996 286056 288916 291469 293815 296174 298745 301801
57778 301801 305681 310399 315436 320295 325102 330256 335760 341333 346945 352631 357890 361865 364134 364853
57764 364853 364210 362268 359253 355375 350350 343709 335664 327175 319055 311461 304323 297764 291963 286957
57750 286957 282697 279093 276072 273873 273007 273507 274566 275488 276662 278821 281534 283342 283399 282189 280586
57735 280586 279102 278167 278207 279005 279687 279723 279488 279622 280362 281620 283106 284248 284601 284420 284140 283314 281035 277564
57717 277564 274491 272848 272024 271031 269885 269028 268280 267215 266021 265109 264279 262938 260823 257944 254339 250418
57701 250418 247045 244653 242767 240993 239845 239916 240822 241819 242916 244371 245519 245246 243511 241353 239407
$$ packed form
57807C41962n126n775o152o492o548o154n886o304o770o066m219k586j874j267
57793B70743oJ266J574J160J073J697K506K983L060K860K553K346K359K571L056
57778C01801L880M718N037M859M807N154N504N573N612N686N259L975K269P19
57764C64853o43j942l015l878n025o641q045q489q120p594p138o559n801n006
57750B86957m260l604l021k199q66N00J059R22J174K159K713J808N7j210j603
57735B80586j484r35M0P98O82L6k35J34P40J258J486J142L53j81k80q26k279l471
57717B77564l073j643q24r93j146q57p48j065j194r12q30j341k115k879l605l921
57701B50418l373k392j886j774j148P1R06R97J097J455J148k73j735k158j946
$$ plain form
57686 239407 237376 235047 232856 231226 230118 229566 229963 231498 233848 236751 240509 245730 252962 262746 275650
57671 275650 292084 312434 337471 368253 405460 448979 497941 550375 602381 647972 680428
57660 680428 694494 688197 663482 625325 579666 531485 484274 440514 401856 368773 340732 317119
57648 317119 297815 282816 271651 263412 257139 252026 247480 243278 239641 237062 235988 236459 237877 239271
57634 239271 240089 240660 241646 243141 244575 245400 245487 244954 244021 243088 242458 241870 240688 238721 236553 234889 233912
57617 233912 233389 233055 232649 231843 230454 228629 226720 225063 223954 223548 223617 223621 223235 222637 222126 221638 220934 220084
57599 220084 219448 219140 218762 217855 216456 215030 213812 212452 210471 207952 205471 203323 201158 198579 195754
57584 195754 193145 190891 188849 187056 185660 184451 182961 181119 179377 178115 177297 176816 176686 176660 176085 174462
$$ packed form
57686B39407k031k329k191j630j108n52L97J535K350K903L758N221P232R784J2904
57671B75650J6434K0350K5037L0782L7207M3519M8962N2434N2006M5591L2456
57660F80428J4066o297k4715l8157m5659m8181m7211m3760l8658l3083k8041k3613
57648C17119j9304j4999j1165q239o273n113m546m202l637k579j074M71J418J394
57634B39271Q18N71R86J495J434Q25Q7n33r33r33o30n88j182j967k168j664r77
57617B33912n23l34m06q06j389j825j909j657j109m06O9Ml86n98n11m88p04q50
57599B20084o36l08l78r07j399j426j218j360j981k519k481k148k165k579k825
57584A95754k609k254k042j793j396j209j490j842j742j262q18m81j30k6n75j623
$$ plain form
57568 174462 171956 169094 166256 163771 162158 161755 162123 162275 161633 160557 159829 159817 160269 160806 161405 162308 163576
57551 163576 164973 166364 168000 170151 172567 174596 175802 176115 175417 173477 170507 167306 164478 161785 158690
57536 158690 155281 152119 149262 146007 141812 137080 132819 129788 128195 127939 128774 130341 132353 134839 137998
57521 137998 141751 145655 149448 153543 158795 165735 174197 183696 193878 204367 214334 222690 228925 233562
57507 233562 237512 241072 243843 245569 246596 247245 247052 245170 241552 237174 232863 228321 222790 216425 210373
57492 210373 205435 201246 197050 192832 189235 186649 184806 183195 181438 179362 177143 175426 174911 175599 176695
57477 176695 177398 177663 178065 179041 180368 181343 181444 180831 180062 179271 177895 175507 172627 170233 168581 167138
57461 167138 165672 164667 164364 164096 163146 161822 161001 160886 160845 160395 159666 158907 158114 157311 156653 156050 155120 153755
$$ packed form
57568A74462k506k862k838k485j613m03L68J52o42j076p28j2M52N37N99R03J268
57551A63576J397J391J636K151K416K029J206L13o98j940k970l201k828k693l095
57536A58690l409l162k857l255m195m732m261l031j593k56Q35J567K012K486L159
57521A37998L753L904L793M095N252O940Q462R499J0182J0489R967Q356O235M637
57507B33562L950L560K771J726J027O49j93j882l618m378m311m542n531o365o052
57492B10373m938m189m196m218l597k586j843j611j757k076k219j717n15O88J096
57477A76695P03K65M02R76J327R75J01o13p69p91j376k388k880k394j652j443
57461A67138j466j005l03k68r50j324q21j15m1m50p29p59p93q03o58o03r30j365
$$ plain form
57443 153755 152345 151278 150593 150353 150841 151975 152988 153247 153131 153519 154578 155700 156540 157357 158197 158498 157926
57426 157926 157080 156810 157180 157572 157600 157407 157224 157133 157228 157562 157938 158129 158329 158956 160001 161007 161782 162668 163926
57407 163926 165327 166559 167598 168344 168321 167221 165492 163949 162980 162531 162605 163134 163491 162846 161240 159769 159442
57390 159442 160218 161469 162956 164905 167369 170062 172807 175689 178702 181612 184371 187320 190642 193810
57376 193810 195991 197002 197488 198030 198474 198416 198047 197992 198384 198558 197764 195860 193185 190141 187060 184215 181728
57359 181728 179698 178443 178229 178616 178645 178098 178101 179842 183003 186095 188148 189353 190190 190794 191324 192112 193030
57342 193030 193357 192749 191802 191207 190789 189995 188958 188358 188391 188589 188715 189162 190228 191534 192480 192996 193397 193673
57324 193673 193375 192255 190748 189559 188901 188327 187389 186254 185560 185683 186310 186709 186345 185266 184017 183220 183124
$$ packed form
57443A53755j410j067o85k40M88J134J013K59j16L88J059J122Q40Q17Q40L01n72
57426A57926q46k70L70L92K8j93j83r1R5L34L76J91K00O27J045J006P75Q86J258
57407A63926J401J232J039P46k3j100j729j543r69m49P4N29L57o45j606j471l27
57390A59442P76J251J487J949K464K693K745K882L013K910K759K949L322L168
57376A93810K181J011M86N42M44n8l69n5L92J74p94j904k675l044l081k845k487
57359A81728k030j255k14L87K9n47LJ741L161L092K053J205Q37O04N30P88R18
57342A93030L27o08r47n95m18p94j037o00L3J98J26M47J066J306R46N16M01K76
57324A93673k98j120j507j189o58n74r38j135o94J23O27L99l64j079j249p97r6
$$ plain form
57307 183124 183503 184031 184688 185674 187039 188562 189968 191078 191788 192155 192517 193291 194560 196095 197798 199845
57291 199845 202326 205015 207672 210319 213083 215986 218980 221966 224670 226827 228673 230949 234151 238050
57277 238050 242135 246192 250197 254094 258084 262709 268045 273132 276923 279682 282690 286591 290746 294292
57263 294292 297109 299460 301438 303209 305240 307709 310056 311610 312429 313104 314056 315467 317634 320769 324513
57248 324513 328151 331377 334487 337883 341777 346293 351432 356863 362217 367617 373503 379827 385863 391033
57234 391033 395468 399548 403329 406873 410745 415608 421380 427299 432903 438543 444852 452022 459840 468173
57220 468173 477160 486878 497052 507214 517153 527163 537755 549137 561009 572851 584259 595042
57208 595042 605271 615379 625977 637300 648932 660311 671400 682594 694084 705664 717129
$$ packed form
57307A83124L79N28O57R86J365J523J406J110P10L67L62P74J269J535J703K047
57291A99845K481K689K657K647K764K903K994K986K704K157J846K276L202L899
57277B38050M085M057M005L897L990M625N336N087L791K759L008L901M155L546
57263B94292K817K351J978J771K031K469K347J554Q19O75R52J411K167L135L744
57248C24513L638L226L110L396L894M516N139N431N354N400N886O324O036N170
57234C91033M435M080L781L544L872M863N772N919N604N640O309P170P818Q333
57220D68173Q987R718J0174J0162R939J0010J0592J1382J1872J1842J1408J0783
57208E95042J0229J0108J0598J1323J1632J1379J1089J1194J1490J1580J1465
$$ plain form
57197 717129 728475 739638 750463 761089 772060 783780 796075 808472 820722 832878 845135
57186 845135 857818 871239 885245 899122 912318 925109 938188 951767 965531 979424 993882
57175 993882 1009173 1024996 1041055 1057696 1075607 1095038 1115585 1136631 1157760 1178837 1199974
57164 1199974 1221435 1243450 1266078 1289324 1313262 1337892 1362915 1387816 1412218 1436091 1459651
57153 1459651 1483197 1506989 1531122 1555447 1579723 1603911 1628245 1652991 1678233 1703952 1730222
57142 1730222 1757197 1785003 1813778 1843827 1875522 1908985 1944036 1980649 2019356 2060994 2106067
57131 2106067 2154507 2206000 2260322 2317247 2376347 2436974 2498396 2560080 2622183 2685849 2752608
57120 2752608 2823174 2896978 2973043 3050951 3130793 3212667 3296951 3384949 3478583 3579252 3687390
$$ packed form
57197G17129J1346J1163J0825J0626J0971J1720J2295J2397J2250J2156J2257
57186H45135J2683J3421J4006J3877J3196J2791J3079J3579J3764J3893J4458
57175I93882J5291J5823J6059J6641J7911J9431K0547K1046K1129K1077K1137
57164A199974K1461K2015K2628K3246K3938K4630K5023K4901K4402K3873K3560
57153A459651K3546K3792K4133K4325K4276K4188K4334K4746K5242K5719K6270
57142A730222K6975K7806K8775L0049L1695L3463L5051L6613L8707M1638M5073
57131B106067M8440N1493N4322N6925N9100O0627O1422O1684O2103O3666O6759
57120B752608P0566P3804P6065P7908P9842Q1874Q4284Q7998R3634J00669J08138
$$ plain form
57109 3687390 3803298 3928181 4064537 4216179 4388165 4586211 4815844 5082441 5392476
57100 5392476 5754591 6179391 6678748 7265789 7955183 8762649 9703965 10794571 12049563
57091 12049563 13482601 15103317 16914551 18910646 21076565 23387543 25810088 28304807
57083 28304807 30828708 33333311 35758599 38028914 40057495 41758992 43061419 43910272
57075 43910272 44266704 44107166 43427593 42247684 40610254 38576391 36220594 33627495
57067 33627495 30888239 28094727 25332474 22674021 20174557 17870645 15781726 13913069
57059 13913069 12259010 10806436 9538386 8436610 7482298 6656199 5939758 5316834 4774190
57050 4774190 4300593 3886095 3522285 3202485 2921125 2673125 2453994 2260120 2088524
$$ packed form
57109C687390J15908J24883J36356J51642J71986J98046K29633K66597L10035
57100E392476L62115M24800M99357N87041O89394Q07466R41316J090606J254992
57091A2049563J433038J620716J811234J996095K165919K310978K422545K494719
57083B8304807K523901K504603K425288K270315K028581J701497J302427Q48853
57075D3910272L56432j59538o79573j179909j637430k033863k355797k593099
57067C3627495k739256k793512k762253k658453k499464k303912k088919j868657
57059A3913069j654059j452574j268050j101776r54312q26099p16441o22924n42644
57050D774190m73597m14498l63810l19800k81360k48000k19131j93874j71596
$$ plain form
57041 2088524 1936422 1801250 1680948 1573966 1479013 1394923 1320750 1255932 1200332 1154059
57031 1154059 1117181 1089800 1072504 1066428 1072278 1089254 1115139 1147022 1180945 1210611 1227565 1224136
57019 1224136 1197012 1148415 1084439 1012420 938873 868361 803339 744898 693564 649333 611303
57008 611303 577926 547902 520741 496509 475291 456925 441014 427069 414681 403540 393182
56997 393182 382949 372443 361975 352223 343564 336010 329757 325241 322550 321249 321046 322256 325277 329884
56983 329884 335475 341734 348508 354978 359510 360558 357507 350559 340220 327272 312983 298828 285804
56970 285804 274163 263836 254896 247508 241669 237298 234619 234248 236729 242079 249879 259774 271709 285596
56956 285596 300859 316347 330508 341488 347322 346587 339278 326990 312032 296276 280731 265947
$$ packed form
57041B088524j52102j35172j20302j06982r4953q4090p4173o4818n5600m6273
57031A154059l6878k7381j7296o076N850J6976K5885L1883L3923K9666J6954l429
57019A224136k7124m8597o3976p2019p3547p0512o5022n8441n1334m4231l8030
57008F11303l3377l0024k7161k4232k1218j8366j5911j3945j2388j1141j0358
56997C93182j0233j0506j0468r752q659p554o253m516k691j301k03J210L021M607
56983C29884N591O259O774O470M532J048l051o948j0339j2948j4289j4155j3024
56970B85804j1641j0327q940p388n839m371k679l71K481N350P800R895J1935J3887
56956B85596J5263J5488J4161J0980N834p35p309j2288j4958j5756j5545j4784
$$ plain form
56944 265947 252488 241024 232141 226105 222725 221545 222400 225769 232374 242370 255217 270439 288221
56931 288221 308953 332188 356194 378355 395807 405919 406858 398340 381953 360539 336909 312853
56919 312853 289132 266199 244775 225728 209553 196127 184931 175354 166818 158923 151660 145358
56907 145358 140265 136234 132932 130243 128313 127281 127148 127834 129154 130764 132386 134191 136828 140937 146667
56892 146667 153704 161798 171289 183081 197934 215607 234851 254335 273429 291768 308187 320562
56880 320562 326968 326899 321364 312136 301103 289916 279706 270953 263769 258387 255288 254964 257797 264212
56866 264212 274779 290015 310115 334985 364562 399023 438486 482191 527727 571089 607748
56855 607748 633936 647232 646456 631766 605269 571246 534944 500542 470043 443979 422816 407469
$$ packed form
56944B65947j3459j1464q883o036l380j180Q55L369O605R996J2847J5222J7782
56931B88221K0732K3235K4006K2161J7452J0112R39q518j6387k1414k3630k4056
56919C12853k3721k2933k1424j9047j6175j3426j1196r577q536p895p263o302
56907A45358n093m031l302k689j930j032j33O86J320J610J622J805K637M109N730
56892A46667P037Q094R491J1792J4853J7673J9244J9484J9094J8339J6419J2375
56880C20562O406o9n535r228j1033j1187j0210q753p184n382l099l24K833O415
56866B64212J0567J5236K0100K4870K9577L4461L9463M3705M5536M3362L6659
56855F07748K6188J3296p76j4690k6497l4023l6302l4402l0499k6064k1163j5347
$$ plain form
56843 407469 398750 396946 402158 414722 435094 463593 500628 547053 603697 670149 743898 820566
56831 820566 894611 959631 1008545 1034686 1034008 1006994 958629 896407 827853 759068 694406 636585
56819 636585 586909 545737 513132 489206 474013 467354 468853 478241 495533 520997 554822 596568
56807 596568 644716 696584 748384 795129 830812 849585 847678 824815 784256 731728 673839 616298
56795 616298 562625 514273 471868 436017 406971 384215 367005 355085 348526 347227 351113 360534
56783 360534 375801 396363 420932 448217 476706 503629 524934 536803 537097 525545 503393 473257
56771 473257 438592 402472 366859 333102 302525 275966 253100 232922 214849 198931 185204
56760 185204 173422 163458 155381 148962 143502 138384 133512 129048 125042 121545 118801 116961 115735 114626
$$ packed form
56843D07469q719j804N212J2564K0372K8499L7035M6425N6644O6452P3749P6668
56831H20566P4045O5020M8914K6141o78k7014m8365o2222o8554o8785o4662n7821
56819F36585m9676m1172l2605k3926j5193o659J499R388J7292K5464L3825M1746
56807E96568M8148N1868N1800M6745L5683J8773j907k2863m0559n2528n7889n7541
56795F16298n3673m8352m2405l5851k9046k2756j7210j1920o559j299L886R421
56783C60534J5267K0562K4569K7285K8489K6923K1305J1869K94j1552k2152l0136
56771D73257l4665l6120l5613l3757l0577k6559k2866k0178j8073j5918j3727
56760A85204j1782r964q077o419n460n118m872m464m006l497k744j840j226j109
$$ plain form
56746 114626 113490 112565 111938 111281 110346 109457 109173 109500 109704 109054 107513 105653 104094 103152 102768 102507 101818
56729 101818 100601 99436 98963 99157 99576 100169 101320 103014 104583 105533 106152 106920 107731 108234 108681 109752 111486
56712 111486 112943 113210 112409 111416 110777 110320 109815 109590 110133 111233 111980 111828 111325 111403 112155 112718 112331 111051
56694 111051 109397 107852 106890 106911 107713 108378 108219 107619 107463 107941 108513 109004 110086 112442 115903 119628 122812
56677 122812 124994 126060 126370 126710 127652 128941 129804 129878 129515 129084 128362 126974 125212 123941 123584 123598 123192
56660 123192 122343 121740 121837 122324 122654 122817 123380 124802 126873 128927 130612 132331 134712 137710 140587 142928
56644 142928 145258 148277 151814 155094 157827 160429 163143 165601 167359 168321 168449 167637 166138 164576 163133
56629 163133 161248 158578 155837 154044 153193 152298 150668 148607 146808 145504 144317 142721 140564 138311 136737
$$ packed form
56746A14626j136r25o27o57r35q89k84L27K04o50j541j860j559r42l84k61o89
56729A01818j217j165m73J94M19N93J151J694J569R50O19P68Q11N03M47J071J734
56712A11486J457K67q01r93o39m57n05k25N43J100P47j52n03P8P52N63l87j280
56694A11051j654j545r62K1Q02O65j59o00j56M78N72M91J082K356L461L725L184
56677A22812K182J066L10L40R42J289Q63P4l63m31p22j388j762j271l57J4m06
56660A23192q49o03R7M87L30J63N63J422K071K054J685J719K381K998K877K341
56644A42928K330L019L537L280K733K602K714K458J758R62J28q12j499j562j443
56629A63133j885k670k741j793q51q95j630k061j799j304j187j596k157k253j574
$$ plain form
56614 136737 136215 136367 136550 136549 136665 137279 138504 140109 141632 142730 143608 144843 146692 148825 150861 152679
56598 152679 154023 154403 153912 153581 154292 155649 156607 156877 156976 157168 157262 157419 158226 159743 161168 161707 161259 160187
56580 160187 158986 158288 158526 159343 159907 159972 160030 160293 160313 159987 160144 161485 163523 165270 166661 168621 171921
56563 171921 176490 181774 187310 192999 199169 206310 214473 223074 231457 239330 246276 251256 253256 252419
56549 252419 250008 247190 244265 241152 238121 235716 234129 232950 231508 229451 226999 224659 222703 220958
56535 220958 219152 217347 215904 215056 214582 213907 212546 210546 208478 206855 205602 204298 202904 201877 201544
56520 201544 201728 202190 202915 203594 203260 201169 197938 195203 193917 193495 192809 191602 190454 189658 188743 187226
56504 187226 185338 183681 182382 181077 179672 178630 178279 178231 177868 177154 176526 176156 175815 175522 175700 176482 177260
$$ packed form
56614A36737n22J52J83jJ16O14J225J605J523J098Q78J235J849K133K036J818
56598A52679J344L80m91l31P11J357R58K70R9J92R4J57Q07J517J425N39m48j072
56580A60187j201o98K38Q17N64O5N8K63K0l26J57J341K038J747J391J960L300
56563A71921M569N284N536N689O170P141Q163Q601Q383P873O946M980K000q37
56549B52419k411k818k925l113l031k405j587j179j442k057k452k340j956j745
56535B20958j806j805j443q48m74o75j361k000k068j623j253j304j394j027l33
56520B01544J84M62P25O79l34k091l231k735j286m22o86j207j148p96r15j517
56504A87226j888j657j299j305j405j042l51m8l63p14o28l70l41k93J78P82P78
$$ plain form
56487 177260 177273 176452 175442 174911 175064 175704 176581 177677 179147 180955 182668 183874 184684 185497 186302 186642 186392
56470 186392 186091 186289 186981 187941 189208 190859 192549 193726 194154 193996 193562 193183 193065 192949 192237 190793 189388
56453 189388 188916 189367 190031 190555 191258 192422 193772 194774 195053 194408 192875 191012 189817 190036 191543 193512
56437 193512 195148 196206 196932 197602 198172 198372 198133 197771 197693 198037 198665 199386 200048 200540 200854 201070 201208 201295 201633
56418 201633 202708 204551 206434 207551 207915 208193 208732 209149 208986 208455 208296 208992 210299 211487 211971 211631 210583
56401 210583 208857 206568 204331 203099 203437 205195 207999 211698 216111 220708 224957 228751 232182 235127
56387 235127 237456 239414 241302 242940 243910 244313 244785 245829 247523 249786 252364 254495 255236 254337 252323
56372 252323 249550 245752 240904 235978 232202 229731 227650 225257 222836 221111 220394 220508 221203 222308 223574
$$ packed form
56487A77260J3q21j010n31J53O40Q77J096J470J808J713J206Q10Q13Q05L40k50
56470A86392l01J98O92R60J267J651J690J177M28j58m34l79j18j16p12j444j405
56453A89388m72M51O64N24P03J164J350J002K79o45j533j863j195K19J507J969
56437A93512J636J058P26O70N70K00k39l62p8L44O28P21O62M92L14K16J38Q7L38
56418B01633J075J843J883J117L64K78N39M17j63n31j59O96J307J188M84l40j048
56401B10583j726k289k237j232L38J758K804L699M413M597M249L794L431K945
56387B35127K329J958J888J638R70M03M72J044J694K263K578K131P41q99k014
56372B52323k773l798m848m926l776k471k081k393k421j725p17J14O95J105J266
$$ plain form
56357 223574 224713 225605 226280 226749 227108 227811 229475 232160 235111 237534 239413 241207 242998 244497 245817
56342 245817 247589 250149 253173 256335 259768 263537 267224 270498 273659 277066 280413 283146 285300 287266
56328 287266 288957 289903 290121 290220 290652 291505 293013 295491 298512 300834 301600 301223 300700 300359 299673 298159 296076
56311 296076 294282 293569 294128 295527 297205 298901 300561 302024 303121 304019 305148 306710 308529 310408 312368
56296 312368 314502 316826 319322 321874 324168 325958 327536 329618 332610 336184 339687 342781 345572 348332
56282 348332 351280 354577 358421 363083 368712 375005 381274 387010 392222 397034 401230 404672 407990 412292
56268 412292 418071 424802 431716 438586 445642 453195 461629 471478 483142 496569 511330 527029 543631
56255 543631 561575 581592 604316 630010 658692 690392 725258 763633 806188 853672 906250
$$ packed form
56357B23574J139Q92O75M69L59P03J664K685K951K423J879J794J791J499J320
56342B45817J772K560L024L162L433L769L687L274L161L407L347K733K154J966
56328B87266J691R46K18R9M32Q53J508K478L021K322P66l77n23l41o86j514k083
56311B96076j794p13N59J399J678J696J660J463J097Q98J129J562J819J879J960
56296C12368K134K324K496K552K294J790J578K082K992L574L503L094K791K760
56282C48332K948L297L844M662N629O293O269N736N212M812M196L442L318M302
56268D12292N779O731O914O870P056P553Q434R849J1664J3427J4761J5699J6602
56255E43631J7944K0017K2724K5694K8682L1700L4866L8375M2555M7484N2578
$$ plain form
56244 906250 963307 1024117 1088367 1155605 1224640 1294033 1362862 1430251 1494358 1552729 1603714
56233 1603714 1646726 1681005 1705037 1717593 1718696 1709102 1689435 1660410 1623514 1580806 1533995 1483938
56221 1483938 1430929 1375389 1318402 1261606 1206410 1153369 1102599 1054567 1009925 968595 929679
56210 929679 892432 856869 823331 792045 763258 737169 713489 691539 671019 652157 635036
56199 635036 619469 605766 594759 586533 579795 573148 566538 560790 556132 551898 547565 543421 540176
56186 540176 538239 537378 536866 536074 535087 534574 535008 536338 538388 541013 543671 545501 546302 546991 548590 551136
56170 551136 554013 557038 560696 565447 571187 577278 582971 588091 593393 599862 607482 615264 622716 630693
56156 630693 640337 651740 664186 677259 691148 706248 723061 742287 764516 790024 819206 852875
$$ packed form
56244I06250N7057O0810O4250O7238O9035O9393O8829O7389O4107N8371N0985
56233A603714M3012L4279K4032J2556J103r594j9667k9025l6896m2708m6811n0057
56221A483938n3009n5540n6987n6796n5196n3041n0770m8032m4642m1330l8916
56210I29679l7247l5563l3538l1286k8787k6089k3680k1950k0520j8862j7121
56199F35036j5567j3703j1007q226o738o647o610n748m658m234m333m144l245
56186E40176j937q61n12p92r87n13M34J330K050K625K658J830Q01O89J599K546
56170E51136K877L025L658M751N740O091N693N120N302O469P620P782P452P977
56156F30693R644J1403J2446J3073J3889J5100J6813J9226K2229K5508K9182L3669
$$ plain form
56144 852875 891835 936677 988529 1049517 1121789 1206213 1302320 1408870 1523600 1642638 1760962
56133 1760962 1873655 1976608 2066759 2142810 2206035 2259800 2307825 2352593 2394774 2433336 2465999
56122 2465999 2489971 2502854 2503609 2493391 2475363 2452783 2426562 2394764 2354249 2302151 2236044 2154450
56110 2154450 2058381 1951872 1840199 1728061 1619718 1519520 1430693 1353871 1287783 1231131
56100 1231131 1183061 1142484 1108216 1079716 1056759 1038592 1024265 1013533 1006499 1002530 1000421 999484
56088 999484 999622 1000554 1001896 1003889 1007173 1011867 1017570 1024049 1031136 1038286 1045195 1052554 1061170 1070491 1079142
56073 1079142 1086863 1094879 1104348 1115419 1127755 1140895 1154065 1166702 1179327 1192958 1207631 1222507
56061 1222507 1237439 1253271 1270410 1288275 1306461 1325311 1344892 1364418 1383292 1401922 1421029
$$ packed form
56144H52875L8960M4842N1852O0988P2272Q4424R6107J06550J14730J19038J18324
56133A760962J12693J02953R0151P6051O3225N3765M8025M4768M2181L8562L2663
56122B465999K3972J2883P55j0218j8028k2580k6221l1798m0515n2098o6107q1594
56110B154450r6069j06509j11673j12138j08343j00198q8827p6822o6088n6652
56100A231131m8070m0577l4268k8500k2957j8167j4327j0732p034l969k109r37
56088I99484J38R32J342J993L284M694N703O479P087P150O909P359Q616R321Q651
56073A079142P721Q016R469J1071J2336J3140J3170J2637J2625J3631J4673J4876
56061A222507J4932J5832J7139J7865J8186J8850J9581J9526J8874J8630J9107
$$ plain form
56050 1421029 1440784 1460959 1481247 1501093 1519961 1538140 1556776 1576884 1598893 1623129 1649827
56039 1649827 1678478 1708011 1737984 1768883 1801016 1833906 1867097 1900846 1935643 1971696 2009227
56028 2009227 2048606 2089871 2132642 2176759 2222443 2269657 2317890 2366865 2416921 2468503 2521687
56017 2521687 2576409 2632883 2691692 2753722 2819765 2889829 2963143 3039229 3118554 3201663 3288313
56006 3288313 3378189 3471835 3570093 3673284 3781835 3896911 4019358 4148798 4284955 4429075
55996 4429075 4582631 4745530 4917192 5098607 5291535 5496413 5713012 5942430 6186406
55987 6186406 6445348 6719449 7011297 7324959 7662802 8025711 8416189 8838632 9296712
55978 9296712 9793180 10332204 10919283 11559017 12255882 13017238 13852920 14772506 15786696
$$ packed form
56050A421029J9755K0175K0288J9846J8868J8179J8636K0108K2009K4236K6698
56039A649827K8651K9533K9973L0899L2133L2890L3191L3749L4797L6053L7531
56028B009227L9379M1265M2771M4117M5684M7214M8233M8975N0056N1582N3184
56017B521687N4722N6474N8809O2030O6043P0064P3314P6086P9325Q3109Q6650
56006C288313Q9876R3646R8258J03191J08551J15076J22447J29440J36157J44120
55996D429075J53556J62899J71662J81415J92928K04878K16599K29418K43976
55987F186406K58942K74101K91848L13662L37843L62909L90478M22443M58080
55978I296712M96468N39024N87079O39734O96865P61356Q35682R19586J014190
$$ plain form
55969 15786696 16911687 18169150 19582622 21178365 22990503 25062238 27443551 30194167
55961 30194167 33391054 37130431 41525002 46707642 52841438 60124665 68792699 79131570
55953 79131570 91500209 106338397 124149239 145457102 170716503 200129279 233375688
55946 233375688 269335073 305887584 339890320 367476614 384820573 389251263 380208764
55939 380208764 359447590 330335993 296703444 261882197 228269568 197320824 169736035
55932 169736035 145688073 125031331 107458853 92598479 80068787 69515309 60626999
55925 60626999 53133815 46800937 41429462 36855970 32945063 29582656 26675459 24149954
55917 24149954 21946343 20013830 18311226 16806913 15474563 14290246 13234191 12291648
$$ packed form
55969A5786696J124991J257463J413472J595743J812138K071735K381313K750616
55961C0194167L196887L739377M394571N182640O133796P283227Q668034J0338871
55953G9131570J2368639J4838188J7810842K1307863K5259401K9412776L3246409
55946B33375688L5959385L6552511L4002736K7586294J7343959M430690r042499
55939C80208764k0761174k9111597l3632549l4821247l3612629l0948744k7584789
55932A69736035k4047962k0656742j7572478j4860374j2529692j0553478q888310
55925F0626999p493184o332878n371475m573492l910907l362407k907197k525505
55917B4149954k203611j932513j702604j504313j332350j184317j056055r42543
$$ plain form
55909 12291648 11449523 10694020 10012676 9396110 8836193 8324588 7854476 7421554 7021926
55900 7021926 6650840 6304759 5982773 5684518 5408189 5151650 4913869 4694040 4490564
55891 4490564 4301948 4127457 3966074 3816075 3676356 3546810 3426749 3314409 3208689
55882 3208689 3109838 3017418 2928894 2841223 2752717 2662739 2571116 2478962 2388916 2303290 2222551
55871 2222551 2146147 2073751 2004951 1938796 1874639 1812734 1753451 1696754 1642996 1593109 1547273
55860 1547273 1504318 1463190 1424081 1387375 1352502 1318732 1286237 1255521 1226489 1198900 1172952
55849 1172952 1148544 1124672 1100422 1075984 1051942 1028240 1004702 981919 960618 940515 920705
55838 920705 900884 881432 862577 844303 826885 810815 796203 782737 770188 758592 748058
$$ packed form
55909A2291648q42125p55503o81344o16566n59917n11605m70112m32922l99628
55900G021926l71086l46081l21986k98255k76329k56539k37781k19829k03476
55891D490564j88616j74491j61383j49999j39719j29546j20061j12340j05720
55882C208689r8851r2420q8524q7671q8506q9978r1623r2154r0046q5626q0739
55871B222551p6404p2396o8800o6155o4157o1905n9283n6697n3758m9887m5836
55860A547273m2955m1128l9109l6706l4873l3770l2495l0716k9032k7589k5948
55849A172952k4408k3872k4250k4438k4042k3702k3538k2783k1301k0103j9810
55838I20705j9821j9452j8855j8274j7418j6070j4612j3466j2549j1596j0534
$$ plain form
55827 748058 738621 730081 721842 713253 704204 694928 685136 674119 661881 649396 637285 625077 612353
55814 612353 599887 588846 579437 571139 563766 557476 552055 546990 542113 537598 533583 530375 528688 528919
55800 528919 530419 532184 534102 536750 540078 543164 545389 547100 548774 550102 550304 549068 546797 544087
55786 544087 541221 538173 534970 531894 529166 526378 522342 515656 505464 491868 476007 459823 445270
55773 445270 433299 423624 415604 409141 404610 402222 401716 402373 402959 401912 398215 392241 385442 379067 373255
55758 373255 367328 360682 353224 345153 336598 327611 318396 309300 300511 291960 283631 275843 269077 263593
55744 263593 259325 255953 252941 249814 246670 244156 242608 241503 240213 239013 238665 239121 239331 238492 236855
55729 236855 235160 233804 232823 232116 231353 230008 227817 225010 221962 218827 215612 212359 209182 206433 204772
$$ packed form
55827G48058r437q540q239q589r049r276r792j1017j2238j2485j2111j2208j2724
55814F12353j2466j1041r409q298p373o290n421n065m877m515m015l208j687K31
55800E28919J500J765J918K648L328L086K225J711J674J328K02j236k271k710
55786E44087k866l048l203l076k728k788m036o686j0192j3596j5861j6184j4553
55773D45270j1971r675q020o463m531k388n06O57N86j047l697n974o799o375n812
55758C73255n927o646p458q071q555q987r215r096q789q551q329p788o766n484
55744B63593m268l372l012l127l144k514j548j105j290j200l48M56K10q39j637
55729B36855j695j356r81p07p63j345k191k807l048l135l215l253l177k749j661
$$ plain form
55714 204772 204690 205904 207571 209090 210369 211487 212638 214358 217048 220220 222867 224705 226311 227786 228119
55699 228119 226316 222553 217769 212761 208155 204596 202186 200068 197176 193288 188960 184823 181345 178929
55685 178929 177645 177080 176919 177522 179574 183272 188192 193700 199202 204249 208704 212600 215587 216971 216635
55670 216635 215479 214436 213438 211898 209913 208257 207285 206518 205470 204380 203917 204421 205584 206758 207567 208248
55654 208248 209308 210816 212233 213009 213120 212941 212888 213291 214184 215024 214996 213819 211948 209791 207209 204028 200498
55637 200498 196853 192881 188394 183698 179081 174266 168949 163541 158760 154717 151013 147511 144461 141972
55623 141972 139995 138703 138348 138710 139156 139238 138894 138172 137147 136011 134857 133477 131716 129845 128205 126662
55607 126662 124859 122882 121203 120051 119201 118267 116918 115030 113032 111762 111490 111350 110307 108481 106927
$$ packed form
55714B04772q2J214J667J519J279J118J151J720K690L172K647J838J606J475L33
55699B28119j803l763m784n008m606l559k410k118k892l888m328m137l478k416
55685A78929j284n65j61O03K052L698M920N508N502N047M455L896K987J384l36
55670B16635j156j043r98j540j985j656r72p67j048j090m63N04J163J174Q09O81
55654B08248J060J508J417P76J11j79n3M03Q93Q40k8j177j871k157k582l181l530
55637B00498l645l972m487m696m617m815n317n408m781m043l704l502l050k489
55623A41972j977j292l55L62M46Q2l44p22j025j136j154j380j761j871j640j543
55607A26662j803j977j679j152q50r34j349j888j998j270k72j40j043j826j554
$$ plain form
55592 106927 106353 106723 107921 109891 112028 113263 113025 111648 109747 107738 106035 105009 104524 104123 103930 104750
55576 104750 106920 109611 111805 113607 116085 119983 125022 130408 135662 140784 145773 150130 153047 154103
55562 154103 153590 151973 149304 145542 141288 137587 134817 132201 128636 123835 118553 113945 110834 109358
55548 109358 109050 109203 109245 108918 108363 108123 108730 110034 111183 111578 111606 112108 113420 115363 117930 121292 125189
55531 125189 128882 131850 134127 135970 137604 139243 140869 141921 141708 140208 138037 135592 132678 129056
55517 129056 124837 120151 114888 108998 102759 96616 91028 86441 82987 80172 77353 74616 72660 71712
55503 71712 71130 70328 69499 69088 69102 69435 70439 72512 75270 77758 79545 81180 83371 85945 87873 88352
55487 88352 87655 86754 86188 85614 84608 83477 82853 82756 82558 81829 80719 79578 78732 78630 79617 81368 82956
$$ packed form
55592A06927n74L70J198J970K137J235k38j377j901k009j703j026m85m01j93Q20
55576A04750K170K691K194J802K478L898N039N386N254N122M989M357K917J056
55562A54103n13j617k669l762m254l701k770k616l565m801n282m608l111j476
55548A09358l08J53M2l27n55k40O07J304J149L95K8N02J312J943K567L362L897
55531A25189L693K968K277J843J634J639J626J052k13j500k171k445k914l622
55517A29056m219m686n263n890o239o143n588m587l454k815k819k737j956r48
55503G1712n82q02q29m11J4L33J004K073K758K488J787J635K191K574J928M79
55487H8352o97r01n66n74j006j131o24r7j98p29j110j141q46j02R87J751J588
$$ plain form
55470 82956 83676 83516 82841 82033 81415 81036 80431 79163 77666 76991 77528 78506 79021 79014 78959 79139 79593 80310 81097
55451 81097 81609 81835 82163 82672 82821 82243 81384 80918 80899 80936 80884 80832 80697 80359 80074 80314 81229 82530 83785 84557
55431 84557 84542 83859 83055 82561 82324 82114 81873 81549 81000 80386 80194 80472 80508 79790 78882 78652 78925 78713 77671
55412 77671 76527 75965 75850 75868 76312 77674 79724 81429 81852 80992 79754 79121 79345 79862 79955 79341 78209 76958
55394 76958 76037 75721 75765 75489 74519 73285 72509 72334 72278 71907 71232 70483 69869 69560 69697 70289 71178 72081 72664
55375 72664 72775 72723 73107 74180 75610 77006 78340 79584 80369 80500 80550 81301 82629 83514 83303 82464 81929 82023
55357 82023 82376 82643 82957 83585 84314 84508 83892 83087 82940 83401 83576 83053 82564 82902 83741 84155 83977 83862 84108
55338 84108 84207 83648 82543 81197 79641 77919 76492 75911 76189 76717 76755 75995 74725 73524 72773 72513 72794
$$ packed form
55470H2956P20j60o75q08o18l79o05j268j497o75N37R78N15pn5J80M54P17P87
55451H1097N12K26L28N09J49n78q59m66j9L7n2n2j35l38k85K40R15J301J255P72
55431H4557j5o83q04m94k37k10k41l24n49o14j92K78L6p18r08k30K73k12j042
55412G7671j144n62j15J8M44J362K050J705M23q60j238o33K24N17R3o14j132j251
55394G6958r21l16M4k76r70j234p76j75n6l71o75p49o14l09J37N92Q89R03N83
55375G2664J11n2L84J073J430J396J334J244P85J31N0P51J328Q85k11q39n35R4
55357H2023L53K67L14O28P29J94o16q05j47M61J75n23m89L38Q39M14j78j15K46
55338H4108R9n59j105j346j556j722j427n81K78N28L8p60j270j201p51k60K81
$$ plain form
55321 72794 73815 75467 77002 77686 77725 78098 79396 81229 82816 83721 83867 83262 82063 80700 79626 78952
55305 78952 78427 77753 76903 76236 76323 77426 79163 80775 81716 81848 81197 79906 78487 77718 78018 79045 80124
55288 80124 80969 81844 83032 84364 85321 85572 85243 84615 83722 82510 81317 80741 80895 81162 81039 80943 81666 83139
55270 83139 84197 83779 82151 80775 80952 82551 84100 84263 83152 81959 81450 81396 81524 82134 83315 84295 84380
55253 84380 84044 84227 84924 85389 85507 85852 86410 86330 85254 83939 83173 82806 82269 81349 80070 78492 77068 76603
55235 76603 77294 78316 78808 78806 78773 78834 79065 79986 81908 84061 85174 84877 84000 83521 83725 84275 84610 84266 83213
55216 83213 81882 80667 79592 78787 78883 80285 82276 83513 83501 82964 82680 82565 82158 81415 80599 79759 78823 78091
55198 78091 78174 79325 81041 82508 83387 84020 84790 85468 85409 84440 83233 82612 82663 82765 82412 81746 81355 81711 82835
$$ packed form
55321G2794J021J652J535O84L9L73J298J833J587R05J46o05j199j363j074o74
55305G8952n25o74q50o67Q7J103J737J612R41J32o51j291j419p69L00J027J079
55288H0124Q45Q75J188J332R57K51l29o28q93j212j193n76J54K67j23r6P23J473
55270H3139J058m18j628j376J77J599J549J63j111j193n09n4J28O10J181R80Q5
55253H4380l36J83O97M65J18L45N58q0j076j315p66l67n37r20j279j578j424m65
55235G6603O91J022M92kl3O1K31R21J922K153J113k97q77m79K04N50L35l44j053
55216H3213j331j215j075q05R6J402J991J237j2n37k84j15m07p43q16q40r36p32
55198G8091Q3J151J716J467Q79O33P70O78n9r69j207o21N1J02l53o66l91L56J124
$$ plain form
55179 82835 84335 85771 86983 87991 88621 88545 87802 86973 86593 86619 86755 87019 87655 88625 89631 90522 91332 92017
55161 92017 92538 93052 93578 93519 92135 89651 87449 86820 87779 89285 90326 90546 90094 89281 88440 87903 87902 88433
55143 88433 89116 89314 88575 87016 85219 83802 83150 83366 84194 85079 85671 86245 87334 88941 90496 91615 92437
55126 92437 93097 93321 92863 91981 91169 90648 90439 90642 91255 91882 92052 91790 91534 91519 91538 91353 91044 90876 90993 91279
55106 91279 91416 91135 90613 90462 91086 92082 92598 92267 91512 90911 90635 90573 90679 90962 91395 92040 93036 94259 95219
55087 95219 95593 95661 95852 96000 95513 94352 93416 93572 94550 95188 94788 93858 93293 93108 92394 90595 88387 87018
55069 87018 87077 88253 90004 91855 93130 93228 92535 92397 93562 95058 95280 93951 92270 91282 90917 90709 90600
55052 90600 90652 90679 90687 91176 92384 93660 94201 94145 94302 94979 95766 96423 97242 98369 99404 99986 100273 100506 100476 99839
$$ packed form
55179H2835J500J436J212J008O30p6p43q29l80K6J36K64O36R70J006Q91Q10O85
55161I2017N21N14N26n9j384k484k202o29R59J506J041K20m52q13q41n37jN31
55143H8433O83J98p39j559j797j417o52K16Q28Q85N92N74J089J607J555J119Q22
55126I2437O60K24m58q82q12n21k09K03O13O27J70k62k56j5J9j85l09j68J17K86
55106I1279J37k81n22j51O24R96N16l31p55o01k76o2J06K83M33O45R96J223R60
55087I5219L74O8J91J48m87j161r36J56R78O38m00r30n65j85p14j799k208j369
55069H7018N9J176J751J851J275R8o93j38J165J496K22j329j681r88l65k08j09
55052I0600N2K7QM89J208J276N41n6J57O77P87O57Q19J127J035N82K87K33l0o37
$$ plain form
55032 99839 98769 97916 97798 98430 99382 99969 99610 98340 96925 96130 95845 95246 93876 92342 91743 92497 93936
55015 93936 95025 95334 95237 95303 95732 96399 97189 98016 98663 98960 99173 99879 101268 102796 103762 104054 104013 103716 102836
54996 102836 101317 99850 99356 100105 101544 102944 103999 104795 105431 105807 105703 104940 103564 102019 101053 101225
54980 101225 102380 103740 104612 104938 105136 105560 106258 107159 108239 109441 110545 111267 111510 111487 111524 111727 111927 112030
54962 112030 112279 112952 113874 114541 114797 115036 115497 115718 115032 113486 111966 111432 112200 113744 114945 114789 113302
54945 113302 111727 111325 112013 112604 112358 111754 111565 111742 111615 110878 109924 109329 109295 109560 109696 109532 109376 109695 110587
54926 110587 111720 112850 114048 115372 116607 117551 118305 119166 120500 122821 126570 131537 136830 141767 146464
54911 146464 151222 155705 159299 161968 164058 165335 164930 162435 158457 153865 149001 143953 139082 134746
$$ packed form
55032I9839j070q53j18O32R52N87l59j270j415p95k85n99j370j534n99P54J439
55015I3936J089L09r7O6M29O67P90Q27O47K97K13P06J389J528R66K92m1k97q80
54996A02836j519j467m94P49J439J400J055P96O36L76j04p63j376j545r66J72
54980A01225J155J360Q72L26J98M24O98R01J080J202J104P22K43k3L7K03K00J03
54962A12030K49O73R22O67K56K39M61K21o86j546j520n34P68J544J201j56j487
54945A13302j575m02O88N91k46o04j89J77j27p37r54n95l4K65J36j64j56L19Q92
54926A10587J133J130J198J324J235R44P54Q61J334K321L749M967N293M937M697
54911A46464M758M483L594K669K090J277m05k495l978m592m864n048m871m336
$$ plain form
54897 134746 130733 126586 122478 119313 117746 117391 117247 116791 116399 116685 117614 118446 118572 118242 118347 119452 121122
54880 121122 122291 122327 121671 121392 122192 123989 126449 129607 133750 138877 144571 150364 155883 160676 164313
54865 164313 166842 168767 170288 170749 169220 165543 160512 155060 149540 143869 138136 132804 128264 124391
54851 124391 120738 117261 114563 113130 112525 111819 110811 110249 110596 111149 110832 109526 108079 107208 106820 106359
54835 106359 105380 103842 102250 101413 101686 102435 102680 102273 102022 102611 103849 105093 105989 106539 106776 106642 106059
54818 106059 104941 103343 101693 100632 100454 100846 101249 101304 100929 100353 100232 101285 103400 105357 105899 105068 104093
54801 104093 104011 104766 105731 106637 107644 108700 109380 109481 109489 110074 111189 112009 111906 111200 110703 110761 111129 111642 112483
54782 112483 113637 114535 114655 114287 114344 115431 117322 119346 121060 122521 124024 125668 127220 128420 129393 130611
$$ packed form
54897A34746m013m147m108l165j567l55j44m56l92K86R29Q32J26l30J05J105J670
54880A21122J169L6o56k79Q00J797K460L158M143N127N694N793N519M793L637
54865A64313K529J925J521M61j529l677n031n452n520n671n733n332m540l873
54851A24391l653l477k698j433o05p06j008n62L47N53l17j306j447q71l88m61
54835A06359r79j538j592q37K73P49K45m07k51N89J238J244Q96N50K37j34n83
54818A06059j118j598j650j061j78L92M03N5l75n76j21J053K115J957N42q31r75
54801A04093q2P55R65R06J007J056O80J01QN85J115Q20j03p06m97N8L68N13Q41
54782A12483J154Q98J20l68N7J087J891K024J714J461J503J644J552J200R73J218
$$ plain form
54766 130611 132380 134556 136877 139401 142432 146142 150522 155583 161267 167077 172095 175570 177380 177816
54752 177816 177043 174942 171417 166722 161457 156303 151683 147555 143557 139510 135761 132935 131250 130233
54738 130233 129194 127921 126742 126021 125758 125748 125877 126124 126391 126548 126658 126941 127468 128009 128313 128478 128881 129822
54720 129822 131361 133554 136596 140607 145375 150455 155467 160110 164025 166953 169037 170597 171425 170655 167631
54705 167631 162667 156706 150520 144605 139576 136009 133851 132465 131351 130370 129272 127673 125725 124203
54691 124203 123486 122960 121868 120343 119044 118128 117258 116454 116210 116739 117621 118285 118402 117808 116555 115193 114439
54674 114439 114347 114184 113392 112329 111803 112148 113057 114110 115148 116140 116943 117277 116988 116379 116138 116683 117581 117927
54656 117927 117368 116451 115877 115783 115940 116311 117036 118023 118940 119551 119812 119725 119362 118977 118822 118781 118496 117924 117547 117809
$$ packed form
54766A30611J769K176K321K524L031L710M380N061N684N810N018L475J810M36
54752A77816p73k101l525m695n265n154m620m128l998m047l749k826j685j017
54738A30233j039j273j179p21k63j0J29K47K67J57J10K83N27N41L04J65M03R41
54720A29822J539K193L042M011M768N080N012M643L915K928K084J560Q28p70l024
54705A67631m964n961o186n915n029l567k158j386j114r81j098j599j948j522
54691A24203p17n26j092j525j299r16q70q04k44N29Q82O64J17n94j253j362p54
54674A14439r2j63p92j063n26L45R09J053J038R92Q03L34k89o09k41N45Q98L46
54656A17927n59r17n74r4J57L71P25R87R17O11K61q7l63l85j55m1k85n72l77K62
$$ plain form
54636 117809 118467 118794 118401 117693 117422 117957 119064 120207 120848 120607 119541 118338 117852 118240 118821 118974 118858
54619 118858 118950 119216 119211 118831 118438 118253 118138 118045 118228 118769 119277 119273 118646 117606 116472 115707 115830 116997 118808
54600 118808 120704 122369 123607 124105 123676 122622 121530 120654 119737 118526 117406 117325 118927 121690 124120 125067
54584 125067 124742 124198 123965 123696 123077 122462 122295 122421 122397 122260 122514 123496 125051 126763 128167 128842 128639 127864
54566 127864 127061 126603 126547 126698 126685 126180 125314 124756 125104 126272 127699 129001 130133 131052 131626 131894 132096 132331
54548 132331 132458 132441 132533 132933 133416 133569 133402 133555 134719 136804 138818 139731 139539 139293 140007 141715 143672 145289
54530 145289 146594 147865 149125 150097 150487 150144 149019 147167 144880 142767 141419 140869 140540 139916 139164 138868
54514 138868 139225 139860 140383 140763 141050 141133 140988 140815 140669 140258 139388 138357 137611 137195 136876 136622 136657 137081 137673
$$ packed form
54636A17809O58L27l93p08k71N35J107J143O41k41j066j203m86L88N81J53j16
54619A18858R2K66nl80l93j85j15r3J83N41N08mo27j040j134p65J23J167J811
54600A18808J896J665J238M98m29j054j092q76r17j211j120q1J602K763K430R47
54584A25067l25n44k33k69o19o15j67J26k4j37K54R82J555J712J404O75k03p75
54566A27864q03m58n6J51j3n05q66n58L48J168J427J302J132R19N74K68K02K35
54548A32331J27j7R2M00M83J53j67J53J164K085K014R13j92k46P14J708J957J617
54530A45289J305J271J260R72L90l43j125j852k287k113j348n50l29o24p52k96
54514A38868L57O35N23L80K87Q3j45j73j46m11q70j031p46m16l19k54L5M24N92
$$ plain form
54495 137673 138044 137859 137105 136302 136185 136951 138023 138825 139483 140429 141609 142587 143225 143761 144284 144633 144851 145293
54477 145293 146220 147589 149205 150723 151596 151523 150973 150861 151662 153195 155097 156941 158022 157904 157342 157780 159511
54460 159511 161126 161408 161028 161492 162975 164275 164713 164910 165520 166231 166534 166691 167227 167925 168021 167177 165727 164121
54442 164121 162684 161832 161859 162415 162699 162368 161828 161445 160957 159962 158565 157146 155830 154662 153964 153935 154118 153959
54424 153959 153779 154397 155691 156456 156110 155786 157035 159855 162724 164306 164521 164082 163631 163415 163254 162645 161218
54407 161218 159233 157406 156292 156015 156447 157281 157989 158164 157975 157981 158468 159241 160045 160825 161569 162293 163213 164553
54389 164553 166111 167369 168124 168631 169062 169245 169084 168813 168564 168066 167024 165475 163490 160931 157917 155265
54373 155265 153957 154191 155250 156273 156890 157248 157751 158773 160290 161731 162460 162510 162633 163491 164952 166300
$$ packed form
54495A37673L71j85p54q03j17P66J072Q02O58R46J180R78O38N36N23L49K18M42
54477A45293R27J369J616J518Q73p3n50j12Q01J533J902J844J081j18n62M38J731
54460A59511J615K82l80M64J483J300M38J97O10P11L03J57N36O98R6q44j450j606
54442A64121j437q52K7N56K84l31n40l83m88r95j397j419j316j168o98k9J83j59
54424A53959j80O18J294P65l46l24J249K820K869J582K15m39m51k16j61o09j427
54407A61218j985j827j114k77M32Q34P08J75j89OM87P73Q04P80P44P24R20J340
54389A64553J558J258P55N07M31J83j61k71k49m98j042j549j985k559l014k652
54373A55265j308K34J059J023O17L58N03J022J517J441P29N0J23Q58J461J348
$$ plain form
54357 166300 167052 167349 167628 168118 168801 169674 170743 171752 172219 171978 171440 171100 170945 170665 170280 170153 170389 170632
54339 170632 170501 169879 168707 166916 164756 162852 161666 161138 160950 160864 160638 160026 159153 158570 158552 158592 158033 157041
54321 157041 156515 157045 158331 159624 160374 160391 159635 158088 155846 153336 151373 150678 151115 151651 151423 150720 150480
54304 150480 150928 151188 150420 148914 147804 147945 149316 151328 153341 154922 155860 156157 155899 155117 153791 152064
54288 152064 150412 149463 149476 150020 150307 149919 149148 148587 148535 148872 149323 149670 149815 149848 149999 150360 150699 150719 150437 150120
54268 150120 149936 149915 150190 150906 151790 152217 151935 151503 151687 152531 153345 153531 153181 152833 152975 153880 155597 157809
54250 157809 159825 161024 161337 161161 160790 160179 159286 158388 157871 157841 158097 158349 158295 157593 156128 154290 152746 151783
54232 151783 151080 150235 149328 148752 148593 148424 147751 146550 145344 144818 145330 146645 148105 149153 149816 150607 151872
$$ packed form
54357A66300P52K97K79M90O83Q73J069J009M67k41n38l40j55k80l85j27K36K43
54339A70632j31o22j172j791k160j904j186n28j88q6k26o12q73n83j8M0n59r92
54321A57041n26N30J286J293P50J7p56j547k242k510j963o95M37N36k28p03k40
54304A50480M48K60p68j506j110J41J371K012K013J581R38K97k58p82j326j727
54288A52064j652r49J3N44K87l88p71n61n2L37M51L47J45L3J51L61L39K0k82l17
54268A50120j84k1K75P16Q84M27k82m32J84Q44Q14J86l50l48J42R05J717K212
54250A57809K016J199L13j76l71o11q93q98n17l0K56K52n4p02j465j838j544r63
54232A51783p03q45r07n76j59j69o73j201j206n26N12J315J460J048O63P91J265
$$ plain form
54215 151872 153237 153876 153385 152298 151607 151831 152646 153327 153337 152573 151368 150341 149943 149935 149550 148332 146623 145082
54197 145082 144054 143627 143922 144807 145617 145719 145288 145034 145229 145520 145677 145886 146256 146676 147291 148429 149777 150334
54179 150334 149695 148787 148767 149651 150595 151080 151099 150592 149576 148675 148643 149206 149197 148012 146315 145000 144120 143293 142645
54160 142645 142766 143899 145617 147284 148492 149105 149146 148746 148104 147456 146977 146600 146012 145061 144157 143926 144404 144932
54142 144932 144998 144832 144857 144954 144791 144700 145588 147763 150276 151728 151613 150635 149884 149915 150546 151224 151442 151025 150322
54123 150322 150113 151112 153263 155595 156957 157000 156410 156142 156544 157221 157595 157427 156957 156709 157205 158576 160357
54106 160357 161729 162112 161514 160317 158892 157523 156500 156001 155891 155877 155959 156458 157504 158681 159375 159353 158833
54089 158833 158145 157555 157358 157773 158692 159743 160656 161448 162224 163031 163968 165191 166665 168087 169265 170448 172079
$$ packed form
54215A51872J365O39m91j087o91K24Q15O81J0p64j205j027l98ql85j218j709j541
54197A45082j028m27K95Q85Q10J02m31k54J95K91J57K09L70M20O15J138J348N57
54179A50334o39r08k0Q84R44M85J9n07j016r01l2N63rj185j697j315q80q27o48
54160A42645J21J133J718J667J208O13M1m00o42o48m79l77n88r51r04k31M78N28
54142A44932O6j66K5R7j63r1Q88K175K513J452j15r78p51L1O31O78K18m17p03
54123A50322k09R99K151K332J362M3n90k68M02O77L74j68m70k48M96J371J781
54106A60357J372L83n98j197j425j369j023m99j10j4Q2M99J046J177O94k2n20
54089A58833o88n90j97M15R19J051R13P92P76Q07R37J223J474J422J178J183J631
$$ plain form
54072 172079 174252 176563 178547 180075 181289 182214 182676 182727 182976 184173 186342 188693 190667 192815 196203
54057 196203 201106 206815 212740 218961 225413 231023 234281 234522 232306 228665 224377 219936 215818 212527
54043 212527 210432 209610 209846 210883 212701 215419 218911 222802 226902 231421 236587 242312 248361 254600 260823
54028 260823 266668 271938 276749 281136 284800 287597 289890 292026 293779 294900 295884 297407 299064 299514 298125
54013 298125 295769 293657 291951 289971 287249 283741 279249 273406 266431 259406 253479 248909 245140 241706
53999 241706 238699 236231 233781 230616 226814 223371 221038 219500 217998 216316 214621 212709 210202 207401
53985 207401 205173 203811 202649 201063 199300 197992 197329 197084 197073 197162 197115 196805 196399 196030 195531 194814 194337 194802
53967 194802 196492 199081 201974 204622 206815 208975 211869 215667 219464 222182 223737 224813 225614 225496 223953
$$ packed form
54072A72079K173K311J984J528J214R25M62N1K49J197K169K351J974K148L388
54057A96203M903N709N925O221O452N610L258K41k216l641m288m441m118l291
54043B12527k095q22K36J037J818K718L492L891M100M519N166N725O049O239O223
54028B60823N845N270M811M387L664K797K293K136J753J121R84J523J657M50j389
54013B98125k356k112j706j980k722l508m492n843o975p025n927m570l769l434
53999B41706l007k468k450l165l802l443k333j538j502j682j695j912k507k801
53985B07401k228j362j162j586j763j308o63k45j1Q9m7l10m06l69m99p17m77M65
53967A94802J690K589K893K648K193K160K894L798L797K718J555J076Q01j18j543
$$ plain form
53952 223953 221432 218938 217260 216775 217562 219312 221370 223291 225235 227563 230242 233012 236008 239709 244182
53937 244182 248796 252925 256671 260598 264940 269412 273761 278115 282618 286974 290622 293411 295908 298950
53923 298950 302917 307513 312328 317507 323680 331160 339458 347857 356366 365818 377038 390269 405454
53910 405454 422601 441460 460957 479189 493950 503313 506230 503070 495455 485189 473389 460785
53898 460785 448445 437521 428283 420030 412100 404471 397212 389877 381930 373446 364956 356711 348438 339843
53884 339843 331087 322726 315253 308757 302939 297499 292430 287867 283742 279816 275991 272310 268630 264644
53870 264644 260360 256224 252580 249286 246095 243143 240745 238846 237021 234975 232834 230952 229624 228875
53856 228875 228316 227293 225450 223197 221421 220585 220186 219179 216946 213862 210929 208832 207431 206166 204845
$$ packed form
53952B23953k521k494j678m85P87J750K058J921J944K328K679K770K996L701M473
53937B44182M614M129L746L927M342M472M349M354M503M356L648K789K497L042
53923B98950L967M596M815N179O173P480Q298Q399Q509R452J1220J3231J5185
53910D05454J7147J8859J9497J8232J4761R363K917l160p615j0266j1800j2604
53898D60785j2340j0924r238q253p930p629p259p335p947q484q490q245q273q595
53884C39843q756q361p473o496n818n440n069m563m125l926l825l681l680l986
53870B64644m284m136l644l294l191k952k398j899j825k046k141j882j328p49
53856B28875n59j023j843k253j776q36l99j007k233l084k933k097j401j265j321
$$ plain form
53841 204845 203805 203298 203024 202489 201699 201226 201517 202288 202718 202346 201672 201663 202587 203616 203783 203116 202521 202712 203714
53822 203714 205246 207002 208461 209040 208795 208567 209086 210216 211365 212298 213265 214567 216384 218797 221691 224798
53806 224798 228095 231935 236473 241221 245550 249462 253487 257938 262709 267721 273177 279223 285597 291648
53792 291648 296637 300188 302614 304688 306891 309054 310847 312316 313622 314593 314868 314270 312655 309796 305934
53777 305934 302135 299346 297175 294280 289962 284705 279187 273636 268299 263734 260169 257177 254381 251875
53763 251875 249548 246669 242820 238736 235414 232741 229851 226723 224431 223546 223075 221527 218682 215776 214102
53748 214102 213862 214306 214655 214674 214515 214292 213941 213494 213252 213490 213999 214150 213551 212538 211872 211981 212646 213377 213945
53729 213945 214490 215278 216515 218281 220377 222277 223494 224138 224927 226477 228705 231032 233004 234543 235739
$$ packed form
53841B04845j040n07k74n35p90m73K91P71M30l72o74rR24J029J67o67n95J91J002
53822B03714J532J756J459N79k45k28N19J130J149R33R67J302J817K413K894L107
53806B24798L297L840M538M748M329L912M025M451M771N012N456O046O374O051
53792B91648M989L551K426K074K203K163J793J469J306R71K75n98j615k859l862
53777C05934l799k789k171k895m318n257n518n551n337m565l565k992k796k506
53763B51875k327k879l849m084l322k673k890l128k292q85m71j548k845k906j674
53748B14102k40M44L49J9j59k23l51m47k42K38N09J51n99j013o66J09O65P31N68
53729B13945N45P88J237J766K096J900J217O44P89J550K228K327J972J539J196
$$ plain form
53714 235739 236657 237342 237883 238515 239715 241921 244872 247474 248808 249246 250136 252335 255427 258486 261112 263499
53698 263499 265930 268660 272013 276090 280398 284150 286994 289218 291214 292989 294276 294960 295247 295462 295757
53683 295757 295963 295718 294787 293325 291855 290984 291003 291634 292185 292142 291702 291581 292232 293329 294060 293789 292403 290274
53665 290274 288068 286430 285517 284815 283594 281639 279449 277730 276759 276257 275747 274999 274165 273537 273202 273026 272977
53648 272977 273291 274170 275371 276344 276836 277232 278152 279723 281418 282672 283604 284895 286885 288965 290167 290365
53632 290365 290561 291824 294129 296517 298271 299616 301227 303414 305925 308403 310728 312955 315113 317224
53618 317224 319452 322073 325218 328683 332136 335586 339507 344321 349767 354994 359381 363142 367011 371421
53604 371421 376127 380565 384403 387680 390672 393774 397386 401623 406051 409899 412646 414378 415461 415902
$$ packed form
53714B35739R18O85N41O32J200K206K951K602J334M38Q90K199L092L059K626K387
53698B63499K431K730L353M077M308L752K844K224J996J775J287O84K87K15K95
53683B95757K06k45r31j462j470q71J9O31N51m3m40j21O51J097P31k71j386k129
53665B90274k206j638r13p02j221j955k190j719r71n02n10p48q34o28l35j76m9
53648B72977L14Q79J201R73M92L96R20J571J695J254R32J291J990K080J202J98
53632B90365J96J263K305K388J754J345J611K187K511K478K325K227K158K111
53618C17224K228K621L145L465L453L450L921M814N446N227M387L761L869M410
53604C71421M706M438L838L277K992L102L612M237M428L848K747J732J083M41
$$ plain form
53590 415902 415210 412966 409478 405743 402713 400602 398895 396910 394323 391306 388362 385958 384104 382256
53576 382256 379899 377264 375090 373506 371633 368733 365471 363362 363015 363546 363821 363615 363326 363204 363322 363793
53560 363793 364438 364618 364047 363481 363974 365586 367487 369219 371084 373222 375116 376389 377459 378954 380917
53545 380917 383033 385294 387964 391090 394472 397982 401584 405230 409141 414028 420541 428481 436873 444900
53531 444900 452486 460055 468068 476877 486638 497185 508253 519965 532839 547058 561941 576525
53519 576525 590665 605266 621318 638886 657271 676039 695617 716785 739707 763694 787920
53508 787920 812258 837361 863953 892105 921091 949848 977609 1004264 1030235 1056022 1081711
53497 1081711 1106810 1130652 1153106 1174939 1197238 1220372 1243620 1265920 1286862 1306756 1325944
$$ packed form
53590D15902o92k244l488l735l030k111j707j985k587l017k944k404j854j848
53576C82256k357k635k174j584j873k900l262k109l47N31K75k06k89j22J18M71
53560C63793O45J80n71n66M93J612J901J732J865K138J894J273J070J495J963
53545C80917K116K261K670L126L382L510L602L646L911M887O513P940Q392Q027
53531D44900P586P569Q013Q809R761J0547J1068J1712J2874J4219J4883J4584
53519E76525J4140J4601J6052J7568J8385J8768J9578K1168K2922K3987K4226
53508G87920K4338K5103K6592K8152K8986K8757K7761K6655K5971K5787K5689
53497A081711K5099K3842K2454K1833K2299K3134K3248K2300K0942J9894J9188
$$ plain form
53486 1325944 1344464 1362464 1380546 1399347 1418859 1438475 1457675 1476499 1495187 1513516 1530678
53475 1530678 1545833 1558631 1569065 1576979 1581953 1583718 1582394 1578219 1571272 1561657 1549771 1536064 1520695
53462 1520695 1503762 1485823 1467804 1450269 1433029 1415521 1397320 1378196 1357963 1336490 1313734
53451 1313734 1289731 1264749 1239556 1215224 1192433 1171047 1150495 1130365 1110570 1091275 1072987
53440 1072987 1056583 1042819 1031748 1022795 1015396 1009442 1005072 1002229 1000534 999633 999598 1000896 1003890 1008445
53426 1008445 1014183 1021009 1029131 1038659 1049592 1062204 1076972 1093862 1112120 1131112 1151025 1172376
53414 1172376 1195248 1219598 1245941 1274887 1305952 1337731 1369593 1402610 1438325 1477020 1517753
53403 1517753 1559820 1603583 1649877 1699121 1751111 1805313 1861173 1918390 1977026 2037211 2098636
$$ packed form
53486A325944J8520J8000J8082J8801J9512J9616J9200J8824J8688J8329J7162
53475A530678J5155J2798J0434P914M974J765j324m175o947r615j1886j3707j5369
53462A520695j6933j7939j8019j7535j7240j7508j8201j9124k0233k1473k2756
53451A313734k4003k4982k5193k4332k2791k1386k0552k0130j9795j9295j8288
53440A072987j6404j3764j1071q953p399n954m370k843j695r01l5J298K994M555
53426A008445N738O826Q122R528J0933J2612J4768J6890J8258J8992J9913K1351
53414A172376K2872K4350K6343K8946L1065L1779L1862L3017L5715L8695M0733
53403A517753M2067M3763M6294M9244N1990N4202N5860N7217N8636O0185O1425
$$ plain form
53392 2098636 2160551 2222340 2283920 2345486 2407043 2468329 2528876 2587868 2644141 2696855 2746220
53381 2746220 2793183 2838229 2880781 2919866 2954952 2985858 3012250 3033779 3050578 3063119 3071484
53370 3071484 3075102 3073178 3064958 3049500 3025740 2993229 2952640 2905305 2852462 2795235 2735063 2673571
53358 2673571 2611807 2549915 2487782 2425859 2365159 2306477 2249887 2195093 2142125 2091360 2042850
53347 2042850 1995860 1949269 1902298 1854772 1806947 1759414 1713027 1668531 1626215 1586137 1548545
53336 1548545 1513666 1481217 1450677 1422184 1396623 1374541 1355360 1337985 1321810 1306764 1292665
53325 1292665 1278985 1265092 1250402 1234565 1217963 1201873 1187610 1175410 1164502 1154279 1145059
53314 1145059 1137658 1132552 1129616 1128386 1128396 1129465 1131811 1135827 1141643 1148972 1157394 1166759 1177319 1189618
$$ packed form
53392B098636O1915O1789O1580O1566O1557O1286O0547N8992N6273N2714M9365
53381B746220M6963M5046M2552L9085L5086L0906K6392K1529J6799J2541Q365
53370C071484L618j924q220j5458k3760l2511m0589m7335n2843n7227o0172o1492
53358B673571o1764o1892o2133o1923o0700n8682n6590n4794n2968n0765m8510
53347B042850m6990m6591m6971m7526m7825m7533m6387m4496m2316m0078l7592
53336A548545l4879l2449l0540k8493k5561k2082j9181j7375j6175j5046j4099
53325A292665j3680j3893j4690j5837j6602j6090j4263j2200j0908j0223r220
53314A145059p401n106k936j230J0J069K346M016N816P329Q422R365J0560J2299
$$ plain form
53300 1189618 1204226 1221451 1241143 1262744 1285578 1309256 1333947 1360215 1388380 1417995 1448176
53289 1448176 1478437 1508897 1539578 1569852 1598802 1625874 1650890 1673687 1694096 1712099 1727678
53278 1727678 1740601 1750598 1757573 1761345 1761379 1757228 1749177 1738117 1724816 1709598 1692583 1673817 1653139
53265 1653139 1630281 1605156 1577829 1548423 1517453 1486049 1455220 1424783 1393549 1360736 1326757
53254 1326757 1292502 1258464 1224925 1192504 1161913 1133217 1105659 1078186 1050046 1021139 992040
53243 992040 963578 936121 909376 883014 857294 832819 809800 787862 766545 745832 726211
53232 726211 708366 692759 679283 667282 656031 645283 635303 626324 618008 609521 600152 589782
53220 589782 578644 566750 553828 539890 525562 511602 498238 485202 472289 459629 447544
$$ packed form
53300A189618J4608J7225J9692K1601K2834K3678K4691K6268K8165K9615L0181
53289A448176L0261L0460L0681L0274K8950K7072K5016K2797K0409J8003J5579
53278A727678J2923R997O975L772L4m151q051j1060j3301j5218j7015j8766k0678
53265A653139k2858k5125k7327k9406l0970l1404l0829l0437l1234l2813l3979
53254A326757l4255l4038l3539l2421l0591k8696k7558k7473k8140k8907k9099
53243I92040k8462k7457k6745k6362k5720k4475k3019k1938k1317k0713j9621
53232G26211j7845j5607j3476j2001j1251j0748r980q979q316q487r369j0370
53220E89782j1138j1894j2922j3938j4328j3960j3364j3036j2913j2660j2085
$$ plain form
53209 447544 436394 426425 417506 409170 401171 393810 387301 381166 374836 368648 363355 358622 352950 345538
53195 345538 337458 330335 324382 318484 311910 305181 299290 294655 290993 287780 284634 281449 278324 275357
53181 275357 272623 270323 268723 267768 266956 265806 264220 262270 259985 257684 256153 255939 256515 256614 255468 253426
53165 253426 251431 250177 249712 249487 248753 247242 245527 244463 244293 244549 244743 244734 244391 243431 241857 240223 239089
53148 239089 238386 237635 236694 236009 236089 236947 238105 238989 239276 239002 238504 238278 238743 240009 241788 243547 244796
53131 244796 245279 245015 244277 243441 242679 241792 240552 239203 238426 238681 239786 241220 242629 243872 244812 245328 245508
53114 245508 245628 245995 246863 248261 249756 250650 250742 250721 251417 252772 253906 254151 253575 252459 250733 248243 245297
53097 245297 242581 240553 239075 237669 236092 234625 233771 233604 233552 233000 232005 231165 230839 230831 230914 231277 232214 233633
$$ packed form
53209D47544j1150r969q919q336p999p361o509o135o330o188n293m733n672p412
53195C45538q080p123n953n898o574o729n891m635l662l213l146l185l125k967
53181B75357k734k300j600r55q12j150j586j950k285k301j531k14N76R9j146k042
53165B53426j995j254m65k25p34j511j715j064j70K56J94rl43r60j574j634j134
53148B39089p03p51r41o85Q0Q58J158Q84K87k74m98k26M65J266J779J759J249
53131B44796M83k64p38q36p62q87j240j349p77K55J105J434J409J243R40N16J80
53114B45508J20L67Q68J398J495Q94R2k1O96J355J134K45n76j116j726k490k946
53097B45297k716k028j478j406j577j467q54j67n2n52r95q40l26qQ3L63R37J419
$$ plain form
53079 233633 235164 236608 237918 238812 238825 237890 236618 235758 235499 235550 235811 236605 238072 239640 240415 240058 238991
53062 238991 237771 236567 235270 233769 231959 229843 227836 226651 226542 226921 227130 227396 228466 230369 232122
53047 232122 232840 232684 232400 232303 232104 231524 230665 229768 228928 228161 227507 226911 226127 224983 223742 222991 222985 223255 223111
53028 223111 222478 221904 221761 221895 222256 223307 225305 227566 229130 230012 231068 232605 233918 234434 234584 235078
53012 235078 235887 236537 236990 237550 238092 238090 237413 236548 235962 235711 235750 236157 236844 237435 237686 237689 237467 236715 235349 234089
52992 234089 234020 235483 237665 239373 240021 239865 239530 239499 239886 240486 241003 241309 241500 241699 241878 242038 242430 243399
52974 243399 244954 246681 248203 249570 251041 252624 254151 255710 257685 260219 262907 265242 267195 269110
52960 269110 271063 272596 273159 272684 271639 270556 269530 268184 266150 263591 261168 259405 258114 256560 254219
$$ packed form
53079B33633J531J444J310Q94J3r35j272q60k59N1K61P94J467J568P75l57j067
53062B38991j220j204j297j501j810k116k007j185j09L79K09K66J070J903J753
53047B32122P18j56k84r7j99n80q59q97q40p67o54n96p84j144j241p51oK70j44
53028B23111o33n74j43J34L61J051J998K261J564Q82J056J537J313N16J50M94
53012B35078Q09O50M53N60N42ko77q65n86k51L9M07O87N91K51Lk22p52j366j260
52992B34089o9J463K182J708O48j56l35l1L87O00N17L06J91J99J79J60L92R69
52974B43399J555J727J522J367J471J583J527J559J975K534K688K335J953J915
52960B69110J953J533N63m75j045j083j026j346k034k559k423j763j291j554k341
$$ plain form
52945 254219 251318 248656 246957 246320 246164 245676 244456 242797 241322 240406 240018 240021 240345 240785 240932 240581 240058
52928 240058 239823 239784 239309 238067 236599 235839 236213 237339 238460 238920 238378 237009 235567 234900 235126 235471 235180
52911 235180 234470 234300 235266 236978 238539 239315 239125 238008 236201 234287 232960 232397 232005 231050 229553 228369
52895 228369 228235 228910 229468 229417 229230 229632 230626 231552 231983 232157 232442 232803 233107 233692 235062 236962 238156 237499
52877 237499 235139 232508 231149 231605 233227 234810 235493 235386 235419 236461 238492 240786 242830 244688 246422
52862 246422 247625 247991 248005 248493 249494 250151 249848 248935 248135 247644 247172 246473 245439 243953 242160 240660 239887
52845 239887 239317 237842 234970 231208 227233 223342 219940 217876 217604 218360 218875 218821 218957 219795 220788 221097 220655
52828 220655 220061 219732 219637 219659 219791 219964 220085 220237 220502 220565 219909 218587 217393 216951 216941 216660 216142 216186 217223
$$ packed form
52945B54219k901k662j699o37j56m88j220j659j475r16l88LL24M40J47l51n23
52928B40058k35l9m75j242j468p60L74J126J121M60n42j369j442o67K26L45k91
52911B35180p10j70R66J712J561P76j90j117j807j914j327n63l92r55j497j184
52895B28369j34O75N58n1j87M02R94R26M31J74K85L61L04N85J370J900J194o57
52877B37499k360k631j359M56J622J583O83j07L3J042K031K294K044J858J734
52862B46422J203L66J4M88J001O57l03r13q00m91m72o99j034j486j793j500p73
52845B39887n70j475k872l762l975l891l402k064k72P56N15n4J36Q38R93L09m42
52828B20655n94l29r5K2J32J73J21J52K65O3o56j322j194m42j0k81n18M4J037
$$ plain form
52809 217223 218615 219368 219295 219188 219921 221579 223480 224932 225886 226763 227701 228167 227582 226171 224806 223948 223132
52792 223132 221700 219692 217698 216064 214726 213708 213257 213319 213337 212956 212708 213539 215569 217691 218668 218413 217906
52775 217906 217977 218581 219275 219942 220710 221489 221997 222117 221902 221364 220559 219704 218783 217287 214899 212300 210592 209924
52757 209924 209470 208888 208888 209952 211379 212273 212776 213550 214521 215002 214758 214137 213434 212938 213382 215374 218408 221276
52739 221276 223498 225601 227974 230336 232489 234700 237063 239266 241313 243731 246662 249505 251878 254200
52725 254200 256757 258894 259845 259775 259256 258132 255766 252193 248299 244897 242203 240156 238690 237669 236944
52710 236944 236456 236055 235362 234132 232578 231090 229947 229552 230367 232057 233188 232594 230816 229444 229246 229757
52694 229757 230521 231659 233081 234143 234552 234897 235795 237045 238075 238740 239254 239685 239956 240056 239985 239729 239527
$$ packed form
52809B17223J392P53p3j07P33J658J901J452R54Q77R38M66n85j411j365q58q16
52792B23132j432k008j994j634j338j018m51O2J8l81k48Q31K030K122R77k55n07
52775B17906P1O04O94O67P68P79N08J20k15n38q05q55r21j496k388k599j708o68
52757B09924m54n82%J064J427Q94N03P74R71M81k44o21p03m96M44J992L034K868
52739B21276K222K103K373K362K153K211K363K203K047K418K931K843K373K322
52725B54200K557K137R51p0n19j124k366l573l894l402k694k047j466j021p25
52710B36944m88m01o93j230j554j488j143l95Q15J690J131n94j778j372j98N11
52694B29757P64J138J422J062M09L45Q98J250J030O65N14M31K71J00p1k56k02
$$ plain form
52677 239527 239824 240698 241605 241930 241432 240036 237697 234852 232508 231362 231062 230746 230022 229092 228223 227635 227641 228375
52659 228375 229479 230529 231609 233012 234605 236065 237674 240243 244137 248773 253129 256336 257875 257766
52645 257766 256652 255150 253130 250172 246764 244267 243420 243564 243735 243802 244000 244032 243497 242740 242433 242571 242743
52628 242743 243234 244812 247385 249878 251770 253781 256432 258753 259296 258005 256181 254753 253383 251365 248707
52613 248707 246080 244131 243064 242615 242274 241791 241555 242182 243648 245138 245905 246003 246039 246490 247479 248883 250317
52596 250317 251216 251317 251017 250975 251389 251914 252247 252519 253051 253967 255110 256141 256652 256349 255316 254073 253281 253349
52578 253349 254259 255614 256871 257653 257959 258062 258206 258415 258546 258455 258092 257538 256949 256444 256017 255630 255366 255390 255741
52559 255741 256228 256548 256441 255760 254546 253092 251816 250971 250485 250141 249866 249761 249862 249898 249402 248143 246433
$$ packed form
52677B39527K97Q74R07L25m98j396k339k845k344j146l00l16p24r30q69n88OP34
52659B28375J104J050J080J403J593J460J609K569L894M636M356L207J539j09
52645B57766j114j502k020k958l408k497q47J44J71O7J98L2n35p57l07J38J72
52628B42743M91J578K573K493J892K011K651K321N43j291j824j428j370k018k658
52613B48707k627j949j067m49l41m83k36O27J466J490P67R8L6M51R89J404J434
52596B50317Q99J01l00m2M14N25L33K72N32R16J143J031N11l03j033j243p92O8
52578B53349R10J355J257P82L06J03J44K09J31r1l63n54n89n05m27l87k64K4L51
52559B55741M87L20j07o81j214j454j276q45m86l44k75j05J01L6m96j259j710
$$ plain form
52542 246433 244854 243629 242476 241265 240554 241017 242357 243351 243255 242726 242945 244137 245529 246567 247407 248084
52526 248084 248032 247023 246082 246659 248915 251471 252895 253010 252570 252197 251998 251915 252009 252459 253484 255217 257462
52509 257462 259699 261515 262983 264512 266453 268933 271827 274668 276789 277796 277758 276729 274440 270865 266837
52494 266837 263472 261052 259050 257223 255988 255537 255333 254930 254692 255151 256106 256964 257632 258342 258866 258666 257931
52477 257931 257699 258680 260413 261885 262569 262596 262327 262164 262500 263448 264676 265808 266920 268400 270384 272613
52461 272613 274840 277098 279487 281871 283943 285438 286194 286112 285193 283586 281524 279236 276916 274635 272235
52446 272235 269479 266466 263798 262001 260825 259451 257518 255626 254624 254685 255352 256184 256912 257170 256643 255530
52430 255530 254429 253697 253333 253442 254228 255369 256075 256101 256189 256994 258153 258953 259507 260449 261747 262660 262937 263269
$$ packed form
52542B46433j579j225j153j211p11M63J340R94r6n29K19J192J392J038Q40O77
52526B48084n2j009r41N77K256K556J424J15m40l73j99q3R4M50J025J733K245
52509B57462K237J816J468J529J941K480K894K841K121J007l8j029k289l575m028
52494B66837l365k420k002j827j235m51k04m03k38M59R55Q58O68P10N24k00p35
52477B57931k32R81J733J472O84K7k69j63L36R48J228J132J112J480J984K229
52461B72613K227K258K389K384K072J495P56q2r19j607k062k288k320k281k400
52446B72235k756l013k668j797j176j374j933j892j002O1O67Q32P28K58n27j113
52430B55530j101p32l64J09P86J141P06K6Q8Q05J159Q00N54R42J298R13K77L32
$$ plain form
52412 263269 264390 266349 268973 272395 276703 281477 286194 290998 296770 304437 314200 325087 335155 342517
52398 342517 346509 347753 346968 344083 338780 331498 323383 315358 307748 300729 294626 289584 285423 282129
52384 282129 280206 280137 281533 283241 284409 285212 286332 287986 289817 291656 293895 296967 300828 305267 310350
52369 310350 316153 322197 327672 332277 336427 340541 344422 347478 349310 349989 349944 349646 349225 348434 347171 345953
52353 345953 345480 345862 346701 347934 349932 352564 354874 356155 356909 358193 360349 362907 365485 368228 371442
52338 371442 375284 379773 384745 389947 395563 402505 411567 422315 433325 443663 453717 464586 477175
52325 477175 492035 509358 528639 548709 568689 588844 610128 632912 656466 679684 702012
52314 702012 723584 744660 765173 784795 803336 820951 837959 854542 870682 886310 901408
$$ packed form
52412B63269J121J959K624L422M308M774M717M804N772P667R763J0887J0068P362
52398C42517L992J244p85k885n303p282q115q025p610p019o103n042m161l294
52384B82129j923o9J396J708J168Q03J120J654J831J839K239L072L861M439N083
52369C10350N803O044N475M605M150M114L881L056J832O79m5k98m21p91j263j218
52353C45953m73L82Q39J233J998K632K310J281P54J284K156K558K578K743L214
52338C71442L842M489M972N202N616O942R062J0748J1010J0338J0054J0869J2589
52325D77175J4860J7323J9281K0070J9980K0155K1284K2784K3554K3218K2328
52314G02012K1572K1076K0513J9622J8541J7615J7008J6583J6140J5628J5098
$$ plain form
52303 901408 916001 930100 943567 955982 966846 976139 984515 992602 1000149 1006144 1009765 1010921 1009886
52290 1009886 1006880 1002174 996194 989208 981153 972083 962574 953402 944967 937302 930524 924949 920808 918173
52276 918173 917200 918165 921139 925810 931752 938840 947396 957933 970668 985194 1000759 1016889 1033541
52263 1033541 1050486 1066900 1081999 1095936 1109525 1123075 1136036 1147964 1159239 1170415 1181324
52252 1181324 1191369 1200513 1209314 1217936 1225668 1231559 1235174 1236524 1235685 1232838 1228433 1222883 1216124 1207808
52238 1207808 1197970 1187255 1176422 1165894 1155886 1146687 1138495 1131078 1123971 1117162 1111310 1107017 1103995
52225 1103995 1101284 1098287 1095310 1092959 1091374 1090404 1090260 1091517 1094386 1098362 1102747 1107161 1111426 1115413
52211 1115413 1119370 1124144 1130521 1138404 1146992 1155732 1164624 1173572 1182008 1189443 1196023 1202172 1207928 1213022
$$ packed form
52303I01408J4593J4099J3467J2415J0864R293Q376Q087P547N995L621J156j035
52290A009886l006m706n980o986q055r070r509r172q435p665o778n575m141k635
52276I18173r73R65K974M671N942P088Q556J0537J2735J4526J5565J6130J6652
52263A033541J6945J6414J5099J3937J3589J3550J2961J1928J1275J1176J0909
52252A181324J0045R144Q801Q622P732N891L615J350q39k847m405n550o759q316
52238A207808r838j0715j0833j0528j0008r199q192p417p107o809n852m293l022
52225A103995k711k997k977k351j585r70j44J257K869L976M385M414M265L987
52211A115413L957M774O377P883Q588Q740Q892Q948Q436P435O580O149N756N094
$$ plain form
52197 1213022 1217474 1221660 1225848 1230020 1234245 1238848 1244022 1249479 1254664 1259154 1262790 1265600 1267811 1269786
52183 1269786 1271678 1273109 1273372 1271933 1268669 1263692 1257190 1249447 1240838 1231665 1222109 1212351 1202643 1193215
52169 1193215 1184283 1176245 1169665 1164822 1161345 1158492 1155836 1153547 1152049 1151604 1152262 1154020 1156837 1160488
52155 1160488 1164417 1167812 1169959 1170657 1170217 1168981 1167043 1164613 1162362 1160909 1159998 1158759 1156978 1155601 1155612
52140 1155612 1156751 1157806 1157898 1157052 1155681 1154053 1152362 1150945 1150282 1150920 1153309 1157502 1163176 1170309 1179728
52125 1179728 1192544 1209012 1228389 1249944 1273663 1299784 1328091 1357939 1388677 1419786 1450826
52114 1450826 1481484 1511524 1540549 1568053 1593766 1617631 1639243 1657729 1672506 1683857 1692452
52103 1692452 1698595 1702392 1704362 1705330 1705691 1705238 1703738 1701332 1698288 1694620 1690095 1684475 1677737 1670089 1661610
$$ packed form
52197A213022M452M186M188M172M225M603N174N457N185M490L636K810K211J975
52183A269786J892J431K63j439l264m977o502p743q609r173r556r758r708r428
52169A193215q932q038o580m843l477k853k656k289j498m45O58J758K817L651
52155A160488L929L395K147O98m40j236j938k430k251j453r11j239j781j377J1
52140A155612J139J055R2q46j371j628j691j417o63O38K389M193N674P133R419
52125A179728J2816J6468J9377K1555K3719K6121K8307K9848L0738L1109L1040
52114A450826L0658L0040K9025K7504K5713K3865K1612J8486J4777J1351Q595
52103A692452O143L797J970R68L61m53j500k406l044l668m525n620o738p648q479
$$ plain form
52088 1661610 1651745 1639535 1624800 1608901 1593745 1580047 1567114 1554417 1542711 1533280 1526573 1522151
52076 1522151 1519671 1519378 1521618 1526301 1532978 1541243 1551044 1562755 1576854 1593267 1611001 1628656 1645462
52063 1645462 1661663 1677835 1693975 1709428 1723546 1736129 1747208 1756632 1764081 1769377 1772575 1773804
$$ packed form
52088A661610r865j2210j4735j5899j5156j3698j2933j2697j1706r431o707m422
52076A522151k480k93K240M683O677Q265R801J1711J4099J6413J7734J7655J6806
52063A645462J6201J6172J6140J5453J4118J2583J1079R424P449N296L198J229
$$ [...]
##END NTUPLES=NMR SPECTRUM
##END=
