
##TITLE=AC1403_PERAH12212_7653237_G05gJBbeM3
##JCAMPDX= 6.0         $$ Bruker NMR JCAMP-DX V2.0
##DATA TYPE= NMR SPECTRUM
##DATA CLASS= NTUPLES
##ORIGIN= BRUKER
##OWNER= Administrator
$$ 1.72 TOPSPIN		Version 2.1
$$ 2013-03-20 01:04:26.216 -0500  Administrator@X
$$ Compression mode = diff/dup
##.OBSERVE FREQUENCY= 400.02188249412
##.OBSERVE NUCLEUS= ^1H
##.ACQUISITION MODE= SIMULTANEOUS (DQD)
##.ACQUISITION SCHEME= undefined
##.AVERAGES= 8
##.DIGITISER RES= 22
##SPECTROMETER/DATA SYSTEM= spect
##.PULSE SEQUENCE= zg30
##.SOLVENT NAME= COFFEE_meoh
##.SHIFT REFERENCE= INTERNAL, COFFEE_meoh, 1, 14.98509
##AUDIT TRAIL= $$ (NUMBER, WHEN, WHO, WHERE, PROCESS, VERSION, WHAT)
$$ ##TITLE= Audit trail, TOPSPIN		Version 2.1
$$ ##JCAMPDX= 5.01
$$ ##ORIGIN= Bruker BioSpin GmbH
$$ ##OWNER= Administrator
$$ $$ E:\/data/COFFEE/nmr/AC1403_PERAH12212_7653237_G05gJBbeM3/10/pdata/1/auditp.txt
$$ ##AUDIT TRAIL=  $$ (NUMBER, WHEN, WHO, WHERE, PROCESS, VERSION, WHAT)
(   1,<2013-03-20 01:04:17.873 -0500>,<Administrator>,<X>,<go>,<TOPSPIN 2.1>,
      <created by zg
	started at 2013-03-20 01:03:11.810 -0500,
	POWCHK enabled, PULCHK disabled,
       configuration hash MD5:
       86 BA 57 50 F2 9D 5C 9B 26 00 A9 28 5F 66 2E 89
       data hash MD5: 64K
       D6 5E C4 00 93 18 4E AC CD 1A E1 57 44 E7 91 62>)
(   2,<2013-03-20 01:04:21.029 -0500>,<Administrator>,<X>,<proc1d>,<TOPSPIN 2.1>,
      <Start of raw data processing
       efp LB = 0 FT_mod = 6 PKNL = 1 PHC0 = 0 PHC1 = 0 SI = 32K 
       data hash MD5: 32K
       50 6B 63 46 91 6B F7 E9 FA A3 CA 11 FA 64 2E DA>)
(   3,<2013-03-20 01:04:21.498 -0500>,<Administrator>,<X>,<proc1d>,<TOPSPIN 2.1>,
      <pk PHC0 = 99.42078 PHC1 = 0 
       data hash MD5: 32K
       17 80 56 17 B2 FA A9 37 E8 BB 8F 9D 45 AB 9B DC>)
(   4,<2013-03-20 01:04:21.716 -0500>,<Administrator>,<X>,<proc1d>,<TOPSPIN 2.1>,
      <abs ABSG = 1 
       data hash MD5: 32K
       18 E8 1F 18 43 55 CB B5 40 A7 F1 AC 86 34 69 C6>)
(   5,<2013-03-20 01:04:21.873 -0500>,<Administrator>,<X>,<proc1d>,<TOPSPIN 2.1>,
      <abs ABSG = 2 
       data hash MD5: 32K
       E7 44 4A 42 80 4D F6 12 93 06 24 C8 45 56 D2 3E>)
(   6,<2013-03-20 01:04:22.045 -0500>,<Administrator>,<X>,<proc1d>,<TOPSPIN 2.1>,
      <abs ABSG = 3 
       data hash MD5: 32K
       B6 DB 03 1C 74 2A E5 E9 F7 ED D0 EA 72 3E 36 6B>)
(   7,<2013-03-20 01:04:22.201 -0500>,<Administrator>,<X>,<proc1d>,<TOPSPIN 2.1>,
      <abs ABSG = 4 
       data hash MD5: 32K
       31 AD 05 12 79 73 9A 37 57 F2 88 62 DD A6 D3 0F>)
(   8,<2013-03-20 01:04:22.326 -0500>,<Administrator>,<X>,<proc1d>,<TOPSPIN 2.1>,
      <abs ABSG = 5 
       data hash MD5: 32K
       DE 6A 47 BE C3 50 E8 E5 33 5A FA 58 83 50 5F 4F>)
$$ ##END=
$$ 
$$ $$ hash MD5
$$ $$ 22 BD 54 FE F9 40 04 1F E7 DA 00 8B B2 FC 0D A7
##$RELAX= 
##$RELAX= 
##$RELAX= 
##$RELAX= 
##$RELAX= 
##$RELAX= 
##$RELAX= 
$$ Bruker specific parameters
$$ --------------------------
##$DU= <E:\>
##$EXPNO= 10
##$NAME= <AC1403_PERAH12212_7653237_G05gJBbeM3>
$$ [...]
150 150 150 150 150 150 150 150
##$TP07= 0
##$TPNAME0= <>
##$TPNAME1= <>
##$TPNAME2= <>
##$TPNAME3= <>
##$TPNAME4= <>
##$TPNAME5= <>
##$TPNAME6= <>
##$TPNAME7= <>
##$TPOAL= (0..7)
0.5 0.5 0.5 0.5 0.5 0.5 0.5 0.5
##$TPOFFS= (0..7)
0 0 0 0 0 0 0 0
##$TUNHIN= 0
##$TUNHOUT= 0
##$TUNXOUT= 0
##$USERA1= <user>
##$USERA2= <user>
##$USERA3= <user>
##$USERA4= <user>
##$USERA5= <user>
##$V9= 5
##$VALIST= <valist>
##$VCLIST= <CCCCCCCCCCCCCCC>
##$VD= 0
##$VDLIST= <DDDDDDDDDDDDDDD>
##$VPLIST= <PPPPPPPPPPPPPPP>
##$VTLIST= <TTTTTTTTTTTTTTT>
##$WBST= 2048
##$WBSW= 25
##$XGAIN= (0..3)
0 0 0 0
##$XL= 0
##$YL= 0
##$YMAX_a= 664915
##$YMIN_a= -567272
##$ZGOPTNS= <>
##$ZL1= 120
##$ZL2= 120
##$ZL3= 120
##$ZL4= 120
##$ABSF1= 14.98509
##$ABSF2= -5.573092
##$ABSG= 5
##$ABSL= 3
##$ALPHA= 0
##$AQORDER= 0
##$ASSFAC= 0
##$ASSFACI= 0
##$ASSFACX= 0
##$ASSWID= 0
##$AUNMP= <proc_prof1d_extract_pilot.lims>
##$AXLEFT= 0
##$AXNAME= <>
##$AXNUC= <1H>
##$AXRIGHT= 0
##$AXTYPE= 0
##$AXUNIT= <>
##$AZFE= 0.1
##$AZFW= 0.1
##$BCFW= 0
##$BC_mod= 0
##$BYTORDP= 0
##$COROFFS= 0
##$CY= 15
##$DATMOD= 1
##$DC= 0
##$DFILT= <>
##$DTYPP= 0
##$F1P= 0
##$F2P= 0
##$FCOR= 0.5
##$FTSIZE= 32768
##$FT_mod= 6
##$GAMMA= 0
##$GB= 0
##$INTBC= 1
##$INTSCL= 1
##$ISEN= 128
##$LB= 0
##$LEV0= 0
##$LPBIN= 0
##$MAXI= 10000
##$MC2= 0
##$MEAN= 0
##$ME_mod= 0
##$MI= 0
##$NCOEF= 0
##$NC_proc= -8
##$NLEV= 6
##$NOISF1= 0
##$NOISF2= 0
##$NSP= 0
##$NTH_PI= 0
##$NZP= 0
##$OFFSET= 14.98509
##$PC= 1
##$PHC0= 99.42078
##$PHC1= 0
##$PH_mod= 1
##$PKNL= yes
##$PPARMOD= 0
##$PPDIAG= 0
##$PPIPTYP= 0
##$PPMPNUM= 2147483647
##$PPRESOL= 1
##$PSCAL= 4
##$PSIGN= 0
##$PYNMP= <proc.py>
##$REVERSE= no
##$SF= 400.02
##$SI= 32768
##$SIGF1= 0
##$SIGF2= 0
##$SINO= 400
##$SIOLD= 32768
##$SPECTYP= <>
##$SREGLST= <1H.CDCl3>
##$SSB= 0
##$STSI= 32768
##$STSR= 0
##$SW_p= 8223.68421052631
##$SYMM= 0
##$S_DEV= 0
##$TDeff= 65536
##$TDoff= 0
##$TI= <>
##$TILT= no
##$TM1= 0
##$TM2= 0
##$TOPLEV= 0
##$USERP1= <user>
##$USERP2= <user>
##$USERP3= <user>
##$USERP4= <user>
##$USERP5= <user>
##$WDW= 1
##$XDIM= 32768
##$YMAX_p= 466074680
##$YMIN_p= -753031
##$CURPLOT= <Network HP LaserJet P1505>
##$CURPRIN= <$Network HP LaserJet P1505>
##$DFORMAT= <normdp>
##$LAYOUT= <+/1D_H.xwp>
##$LFORMAT= <normlp>
##$PFORMAT= <normpl>
##$SURQMSG= 1
$$ End of Bruker specific parameters
$$ ---------------------------------
##NTUPLES= NMR SPECTRUM
##VAR_NAME=  FREQUENCY,     SPECTRUM/REAL,   SPECTRUM/IMAG
##SYMBOL=    X,             R,               I
##VAR_TYPE=  INDEPENDENT,   DEPENDENT,       DEPENDENT
##VAR_FORM=  AFFN,          ASDF,            ASDF
##VAR_DIM=   32768,         32768,           32768
##UNITS=     HZ,            ARBITRARY UNITS, ARBITRARY UNITS
##FACTOR=    0.250966925370066, 1,           1
##FIRST=     8223.43324360094, 100110,       -57740
##LAST=      0,             -201417,         -176507
##MIN=       0,             -753031,         0
##MAX=       8223.43324360094, 466074680,    0
$$ Real data points
##PAGE= N=1
##DATA TABLE= (X++(R..R)), XYDATA
$$ [...]
19532a00216A84994B2011g8577k7564A7123a66221D3712c9391j260O069q0127
$$ -100216 184994 22011 -78577 -106141 17123 -166221 43712 -39391 -40651 -34582 -114709
19521a14709d424B25573a02640i389m4447B90971i8318k6463j86906A86715b8901
$$ -114709 -4424 225573 -102640 -9389 -53836 290971 -98318 -124781 -311687 186715 -28901
19509a57915c6159l64952C66905c6561a2426k2122r266A25299a58502G9481Q4010
$$ -157915 -36159 -401111 366905 -36561 -12426 -34548 -43814 125299 -158502 79481 163491
19498A63491l2529n0920a62507r073b4538j80179k7568m4920g4427H204a44605
$$ 163491 130962 80042 -162507 -171580 -24538 -204717 -232285 -277205 -74427 8204 -144605
19486a34816E0534N0723a04013n4110f43A38874b47937A87894l0340a68425j37833
$$ -134816 50534 101257 -104013 -158123 -643 138874 -247937 187894 157554 -168425 -306258
19475c06258b7008m543o2769C4602a74846h3395A8413b77857e6280A7702a68730
$$ -306258 -27008 -31551 -94320 34602 -174846 -83395 18413 -277857 -56280 17702 -168730
19463a30530L9838L7754j32290a3261p0944q7352L6645b2873C3364a21474j25112
$$ -130530 -90692 -52938 -185228 -13261 -84205 -171557 -134912 -22873 33364 -121474 -246586
19452b46586g3147j7069L7845H4764b76798A29920a01680B2152b09316A85737
$$ -246586 -73147 -90216 -52371 84764 -276798 129920 -101680 22152 -209316 185737
19441B96009b65976a1307e43k14019E6353j903k4254K99b20431C8111b4345k26781
$$ 296009 -265976 -11307 -543 -214562 56353 54450 30196 30495 -220431 38111 -24345 -251126
19429b51126l4487A0167e7388J19b3066j59017H3619O1510n2166b84252f4413
$$ -251126 -285613 10167 -57388 -57269 -23066 -182083 83619 145129 92963 -284252 -64413
19417c1947j46099P7383L4493J3122a7597n4961b7538j25489g2549A12810b92921
$$ -31947 -178046 -100663 -66170 -53048 -17597 -72558 -27538 -153027 -72549 112810 -292921
19405i0835k61692H4473c55392A934a25981B7596a65703B3460q006K21070j08757
$$ -90835 -352527 84473 -355392 1934 -125981 27596 -165703 23460 15454 236524 127767
19394A27767f9387k58046J23906B7314O2860b6838j47497K0036F0190L16000a31738
$$ 127767 -69387 -327433 -203527 27314 90174 -26838 -174335 -154299 60190 376190 -131738
19382f5691j34910B01570e6758j84210q9714h5001F0025Q6418b2681B2002a69305
$$ -65691 -200601 201570 -56758 -240968 -330682 -85001 60025 146443 -22681 22002 -169305
19370e25914H385f2002j31437G4081j2411f8353m7847A68111K6653b6704j04308
$$ -525914 8385 -62002 -193439 74081 61670 -68353 -116200 168111 194764 -26704 -131012
19359a31012r7773C91M88h1718j76585J19353d3681B65987b03304A7259b53110
$$ -131012 -228785 391 879 -81718 -258303 -138950 -43681 265987 -203304 17259 -253110
19347e3405H1570a58720O7550b9588B61272i0385k29765a28920A4708b09365f1921
$$ -53405 81570 -158720 -91170 -29588 261272 -90385 -320150 -128920 14708 -209365 -61921
19335a84345j35863f0181M741l6447B5159f8152A28905b18362h3525j78371a25169
$$ -184345 -320208 -60181 -55440 -91887 25159 -68152 128905 -218362 -83525 -261896 -125169
19323f3696j38018f2830A17661e50B58346A5220c3768a1336k09144B30735j03580
$$ -63696 -201714 -62830 117661 -550 258346 15220 -33768 -11336 -220480 230735 127155
19312A27155a20420j67204g4528m9358A92712b61977e4850q183F0587f2250A20227
$$ 127155 -120420 -287624 -74528 -123886 192712 -261977 -54850 -63033 60587 -62250 120227
19300A99348a12130d5481A50780b55565a25351B63586a38175d5680B33293f9769
$$ 199348 -112130 -45481 150780 -255565 -125351 263586 -138175 -45680 233293 -69769
19289a66414h2467k3789a5438n0646A23069a80668j36814A43315D2082a14344
$$ -166414 -82467 -106256 -15438 -66084 123069 -180668 -317482 143315 42082 -114344
19278F2295b31808i8767D5084a13947j88286h1014I693b00421q4741H0830B1533
$$ 62295 -231808 -98767 45084 -113947 -302233 -81014 9693 -200421 -285162 80830 21533
19266b7479j99850J13412j0388I1203R461c24828a684B33520D7875K8403E772
$$ -27479 -227329 -113917 -124305 91203 100664 -324828 -1684 233520 47875 76278 5772
19254b65595Q4163B39115b46870n950J446q6217a11559B02901a80703A7098J4799
$$ -265595 -181432 239115 -246870 -252820 -251374 -337591 -111559 202901 -180703 17098 31897
19243C1897a98033A94294a41217A14824l6356c3013n7872j17604g2474j25623
$$ 31897 -198033 194294 -141217 114824 78468 -33013 -90885 -208489 -72474 -198097
19233a98097D18106A17590c3061j6222A97708a8240l42148a35501A82448b55778
$$ -198097 418106 117590 -33061 -49283 197708 -18240 -360388 -135501 182448 -255778
19222A13285m0854J5985d40076B28947d97570A40458K45983b42662l11M1047A45965
$$ 113285 72431 88416 -440076 228947 -497570 140458 386441 -242662 -242973 -201926 145965
19210a38417b1843o9697L5147j84688O7770A29217l1289B9397L6611c70535J60665
$$ -138417 -21843 -91540 -56393 -241081 -173311 129217 97928 29397 66008 -370535 -209870
19199b09870B53757c21514B05632C1049d0206j22673O3406j78463a30280N4472
$$ -209870 253757 -321514 205632 31049 -40206 -162879 -99473 -277936 -130280 -75808
19189g5808o126B5862a16231j22647b9725l6142j32219F2688A7420f1513A96790
$$ -75808 -81934 25862 -116231 -238878 -29725 -65867 -198086 62688 17420 -61513 196790
19177d9112B59461e147j96507B03051c84986C9135R9325N6086b34682B6486a96825
$$ -49112 259461 -5147 -201654 203051 -384986 39135 138460 194546 -234682 26486 -196825
19165A92930b00834c3715k70635f8122o1876B3403g7871p6649A42417a41754A10027
$$ 192930 -200834 -33715 -304350 -68122 -129998 23403 -77871 -154520 142417 -141754 110027
19153A21167f4801j4079A48917O8599B2522J57260a73125B6241R8189d2932n5682
$$ 121167 -64801 -78880 148917 217516 22522 179782 -173125 26241 124430 -42932 -98614
19142i8614j01949b8535B3969J59191B1834e27191A1450J35711a72027G6573N5622
$$ -98614 -200563 -28535 23969 183160 21834 -527191 11450 147161 -172027 76573 132195
19131A32195P0143b0375n4829j46023A1575a10508j35264A007a09491k30406A0679
$$ 132195 202338 -20375 -75204 -221227 11575 -110508 -245772 1007 -109491 -339897 10679
19119A89860F4512d0706C160e75555f7998i179q372r2814A60470O5994c30306
$$ 189860 64512 -40706 3160 -575555 -67998 -9179 -17551 -110365 160470 226464 -330306
19107A39685b32621A11860K2884Q943D1889G424i3105c1389J0074n3311G7275
$$ 139685 -232621 111860 134744 143687 41889 7424 -93105 -31389 -21315 -74626 77275
19095C13640p21A01672m4977J32453i0144H2726K22202d884j62761C3347j4397
$$ 313640 312919 101672 56695 189148 -90144 82726 304928 -4884 -167645 33347 18950
19084A8950O0300k1521J26457Q3117b88843B74603b66842Q3206I0193q518a68935
$$ 18950 79250 57729 184186 267303 -288843 274603 -266842 -183636 90193 81675 -168935
19072a88643A13205a98175Q8512B08294l9917c78559A8031f6181A11843c9094
$$ -188643 113205 -198175 -109663 208294 168377 -378559 18031 -66181 111843 -39094
19061e7035k25617b0824B9490J99839b02555j83497J46278P0681a4766l07478
$$ -57035 -282652 -20824 29490 229329 -202555 -386052 -239774 -169093 -14766 -322244
19051c22244G5912a91544a8007j89768C5175K6777b68751d1192J315k62142g2484
$$ -322244 75912 -191544 -18007 -207775 35175 61952 -268751 -41192 -39877 -302019 -72484
19039a0677j87004b4639N677j88201A72310b20211O7874f1813G9595c02462F4517
$$ -10677 -197681 -24639 -18962 -207163 172310 -220211 -152337 -61813 79595 -302462 64517
19027a03739L176j41749A37691R5615D6208b46486a01201r9233A230M6124a24749
$$ -103739 -100563 -242312 137691 233306 46208 -246486 -101201 -200434 1230 47354 -124749
19015d5024p9836I7259b03791D1419a61549k05305A37561d84652l5327a64915
$$ -45024 -124860 97259 -203791 41419 -161549 -366854 137561 -484652 -519979 -164915
19004g8428D2522g7338J9241c025A12602j4315B1235K33705A05961a99487E8403
$$ -78428 42522 -77338 -58097 -3025 112602 98287 21235 254940 105961 -199487 58403
18992F6622K1292J28672C3617L18235i4180A35739l2059a6950j61000a6160A16891
$$ 66622 87914 216586 33617 351852 -94180 135739 103680 -16950 -177950 -16160 116891
18980b20275B36482a95989C8474a49247A07633g4320G5004c2370C13692i2447
$$ -220275 236482 -195989 38474 -149247 107633 -74320 75004 -32370 313692 -92447
18969b38577B12575a06718o9L7599l66407a5671C20768a34543k09167A2866J65269
$$ -238577 212575 -106718 -106787 -69188 -435595 -15671 320768 -134543 -343710 12866 178135
18958A78135d7354C08962G016g7244A18542c30216d5775j05870P0134k86669J78593
$$ 178135 -47354 308962 7016 -77244 118542 -330216 -45775 -151645 -81511 -368180 -189587
18947a89587m8125A9515i8196B58772A26687c68695A20538a44260o885A75175
$$ -189587 -237712 19515 -98196 258772 126687 -368695 120538 -144260 -151145 175175
18936A19028f3532L0955A66848a12257F5308a40172c0989l50140E1499k0402J16100
$$ 119028 -63532 -32577 166848 -112257 65308 -140172 -30989 -381129 51499 31097 147197
18925A47197c19686a17649H9761M5685g2959r4443K2272F7929f10D0656g5702
$$ 147197 -319686 -117649 89761 135446 -72959 -167402 -145130 67929 -610 40656 -75702
18913c31828F1739P5922L00156b26996h707k80036a39884G4092f0794A29532e2620
$$ -331828 61739 137661 437817 -226996 -8707 -288743 -139884 74092 -60794 129532 -52620
18901b60834J24930J1502B71572B9103b2690G4055b12204j9681a735E5368b63786
$$ -260834 -135904 -124402 271572 29103 -22690 74055 -212204 -231885 -1735 55368 -263786
18889d76228d4128q052j46275g2761A1437J4196M4505l4681a72986j0410Q5950
$$ -476228 -44128 -52180 -198455 -72761 11437 25633 70138 35457 -172986 -183396 -97446
18878i7446Q54B59068A9098b79806H9265g4845b301j23716C39022p6227D8753
$$ -97446 -96592 259068 19098 -279806 89265 -74845 -2301 -126017 339022 262795 48753
18866B00103b37204f6264A61707a97033A74452a56506B053a18206j7326r4300
$$ 200103 -237204 -66264 161707 -197033 174452 -156506 2053 -118206 -135532 -229832
18856b29832e1177G4589a18192K4817c6289H0879i8664r4139b9691m3019B38961
$$ -229832 -51177 74589 -118192 -93375 -36289 80879 -98664 -192803 -29691 -72710 238961
18844c063j56115p8226h2339B61651A15427C3288a79954M2802B14948b72895h0647
$$ -3063 -159178 -237404 -82339 261651 115427 33288 -179954 -137152 214948 -272895 -80647
18832c29566F0506a6778H7514b0734E0479Q9048A0667c36375a09065A71476L5143
$$ -329566 60506 -16778 87514 -20734 50479 139527 10667 -336375 -109065 171476 206619
18821B06619k6709m6218a15502C15588J6332A32778J51096j16668K13000A17788
$$ 206619 179910 133692 -115502 315588 331920 132778 283874 167206 380206 117788
18810H3324Q730a30947r1949F3483b6607m47772a03543H5260c33655E8856b08395
$$ 83324 92054 -130947 -222896 63483 -26607 -474379 -103543 85260 -333655 58856 -208395
18798i9061A24443K1068b8020j82298c0866j77612n8039a06353L4345p2115A92745
$$ -99061 124443 145511 -28020 -210318 -30866 -208478 -266517 -106353 -72008 -144123 192745
18786I5054c9920F8997L7876p115a40243e4479D5557b3395m79800A26857b86363
$$ 95054 -39920 68997 106873 99758 -140243 -54479 45557 -23395 -503195 126857 -286363
18774A29543b6723j38427L6840j443E7229a66127A63100L60364C7689a04698n2842
$$ 129543 -26723 -165150 -128310 -129753 57229 -166127 163100 523464 37689 -104698 -157540
18763a57540A35458m7069m1794a2456B1558a67993A91240F9204b94862j41987
$$ -157540 135458 88389 46595 -12456 21558 -167993 191240 69204 -294862 -436849
18753d36849a46880B4522b27681f5486K1408J0285a2485k50530A21329O3243h324
$$ -436849 -146880 24522 -227681 -65486 -44078 -33793 -12485 -263015 121329 184572 -8324
18741b52951J09992d9948j13693A14580a69203l3564c5377C06668H5636J57307
$$ -252951 -142959 -49948 -163641 114580 -169203 -202767 -35377 306668 85636 242943
18731B42943h3361A29130A0294a40371L636B30145F4026c78975D6783a73963B36743
$$ 242943 -83361 129130 10294 -140371 -136735 230145 64026 -378975 46783 -173963 236743
18719A8121N569c421A38537a58511A47771L2004b19831R7435B64795g6692A93122
$$ 18121 23690 -3421 138537 -158511 147771 179775 -219831 -122396 264795 -76692 193122
18707b98823J40392B01909A6528J73843I4765a93690A17743c6717q6378l38983
$$ -298823 -158431 201909 16528 190371 94765 -193690 117743 -36717 -123095 -462078
18697d62078A51386h2324j30578M5375b7057A55416f486B27024h4328m42542H3444
$$ -462078 151386 -82324 -212902 -167527 -27057 155416 -6486 227024 -84328 -526870 83444
18685H6612b17984b4480k92747a47597A96342c6405o441m9955k37742a13570B84496
$$ 86612 -217984 -24480 -317227 -147597 196342 -36405 -42846 -92801 -330543 -113570 284496
18673b3291E9299k0004c60519a61424D26678f3279A00915m9051a11897D7172c9654
$$ -23291 59299 39295 -360519 -161424 426678 -63279 100915 51864 -111897 47172 -39654
18661F286J95261c79218F7980g44A11893a8730k44803K2925Q795d4512j93421
$$ 6286 201547 -379218 67980 -744 111893 -18730 -263533 -240608 -231813 -44512 -237933
18650b37933C7107b66109I672h2991J2344C6536J08938o4475O0377F9717b41789
$$ -237933 37107 -266109 9672 -82991 -70647 36536 145474 80999 141376 69717 -241789
18638A69093b07322Q9084p3601D0322N5768J56332a63268l6761R774R2810A11417
$$ 169093 -207322 -118238 -191839 40322 96090 252422 -163268 -200029 -190255 -97445 111417
18626a68435A0374a7314n8350j20440h7290j82119A42598D5725b76924A70766
$$ -168435 10374 -17314 -75664 -196104 -87290 -269409 142598 45725 -276924 170766
18615a92577o1304c6214A41621C5627M7190g2610l6961j9236B9081a67643j0948
$$ -192577 -253881 -36214 141621 35627 82817 -72610 -109571 -128807 29081 -167643 -178591
18604a78591B56004b22503j09073i9410B66466E9543d6070q0713k4692M9434j63004
$$ -178591 256004 -222503 -331576 -99410 266466 59543 -46070 -126783 -151475 -102041 -265045
18593b65045k9460I1723i5373j4164L9574k23088A37267c4513B74637j8816a98621
$$ -265045 -294505 91723 -95373 -109537 -69963 -293051 137267 -34513 274637 255821 -198621
18581i9183k9834B70844a87270A95216p9074c51170R5794d239I9596J38607k2750
$$ -99183 -129017 270844 -187270 195216 116142 -351170 -255376 -4239 99596 238203 215453
18570B15453d4403H0841f8264B26761c51682g8181j38631i0411k63142J36409
$$ 215453 -44403 80841 -68264 226761 -351682 -78181 -216812 -90411 -353553 -217144
18560b17144A36627H475b9342C27794D3975b34906A80075r399G8460a87345Q9284
$$ -217144 136627 8475 -29342 327794 43975 -234906 180075 170676 78460 -187345 -98061
18549i8061k32430a52089a7192j82829P5068k54420a45554A2713b178n2582o9701
$$ -98061 -330491 -152089 -17192 -200021 -124953 -379373 -145554 12713 -2178 -54760 -124461
18538a24461A83335e3420B52207j03930a03207B2544b76497a15053j11400a2627
$$ -124461 183335 -53420 252207 148277 -103207 22544 -276497 -115053 -226453 -12627
18527D8696a65717f0565j1973A03525a4187m3903k30659H1752a58465I1570b73190
$$ 48696 -165717 -60565 -72538 103525 -14187 -58090 -288749 81752 -158465 91570 -273190
18515C0172b30879j96585a48926j2194F6697D412J17797m5092b34222J07040M4832
$$ 30172 -230879 -427464 -148926 -161120 66697 4412 122209 77117 -234222 -127182 -82350
18504h2350A35892N5153r4704a62934B137b05918D5837b64282A07913d6560c801
$$ -82350 135892 191045 96341 -162934 2137 -205918 45837 -264282 107913 -46560 -3801
18492C64583j71377A5920Q7935i2754C0071e6436j60672A26497c7227a4917k14887
$$ 364583 193206 15920 103855 -92754 30071 -56436 -217108 126497 -37227 -14917 -229804
18481b29804F0457h7403B239J21243o492b41609B25504D6068B1161b1854p7459
$$ -229804 60457 -87403 2239 123482 116990 -241609 225504 46068 21161 -21854 -99313
18470i9313K4550C2804a048l75301J76982f4796A3372c13935G5137a2461j65935
$$ -99313 -74763 32804 -1048 -376349 -199367 -64796 13372 -313935 75137 -12461 -178396
18459a78396I8199a57070a2078G2986b2982H1578b5910P530j51536k95056h1113
$$ -178396 98199 -157070 -12078 72986 -22982 81578 -25910 -18380 -169916 -464972 -81113
18447b82352a3065l74534A14275a28801J4743A18827h7099A27015a0387B36742
$$ -282352 -13065 -387599 114275 -128801 -114058 118827 -87099 127015 -10387 236742
18436a8246F906a74113A3017J87627Q3674g299B46551a99800R1743p3795d8781
$$ -18246 6906 -174113 13017 200644 284318 -7299 246551 -199800 -108057 -181852 -48781
18424f1616H0387k9897d734l38832b6876l88306A5178b76488C8362c8634c807
$$ -61616 80387 50490 -4734 -343566 -26876 -415182 15178 -276488 38362 -38634 -3807
18412a98579d9445A295J25460L1052C6269a70361E8374a60577A58830o2266b73739
$$ -198579 -49445 1295 126755 157807 36269 -170361 58374 -160577 158830 96564 -273739
18400f2720j28144B80221A37596e7222I9218h4987J9734L0331k73752Q6623G8468
$$ -62720 -190864 280221 137596 -57222 99218 -84987 -65253 -34922 -308674 -222051 78468
18388a27749L1757A02058b7824A70130J84336A04734d995j01124A19107d2155
$$ -127749 -95992 102058 -27824 170130 354466 104734 -4995 -106119 119107 -42155
18377f7738q0330H4406J09278G9904J69218l5286e8865m0654b1143k00897J04653
$$ -67738 -148068 84406 193684 79904 249122 213836 -58865 -99519 -21143 -222040 -117387
18366a17387M7057k97902A39685b15945R6163J3436r9986C1559M6846b75633j12110
$$ -117387 -70330 -368232 139685 -215945 -119782 -106346 -206332 31559 78405 -275633 -387743
18355c87743C85656c6744j26988p2890A33455B3763M14286j67842a03116d7560
$$ -387743 385656 -36744 -163732 -236622 133455 23763 438049 270207 -103116 -47560
18344A32022a6952j51915A23651a27147m2219j36284c6761l16268a00883c2737
$$ 132022 -16952 -168867 123651 -127147 -169366 -305650 -36761 -353029 -100883 -32737
18333a33723C34157d0307j40455A61106F4408a7978F6803l3157a74155j80904
$$ -133723 334157 -40307 -180762 161106 64408 -17978 66803 33646 -174155 -355059
18323c55059f6077k28677D3424R9816F1957A7616M09667c19400G1569j9575B841
$$ -355059 -66077 -294754 43424 143240 61957 17616 427283 -319400 71569 51994 2841
18311A38524I695a9109B83014A30090a2918k27734p7285c3292A05528j0381J18394
$$ 138524 9695 -19109 283014 130090 -12918 -240652 -317937 -33292 105528 95147 213541
18300B13541a09282B20570a42765A7033R580c49194i8393C99967b06151B06155
$$ 213541 -109282 220570 -142765 17033 26613 -349194 -98393 399967 -206151 206155
18289A69736a87877k889A77063G8061a424k7570E3060b818r5286j15432A46212
$$ 169736 -187877 -190766 177063 78061 -1424 -28994 53060 -2818 -98104 -213536 146212
18277D3415O784a74430g305E3435b73198a7753I4197a07675A8622J2954g9386
$$ 43415 50199 -174430 -7305 53435 -273198 -17753 94197 -107675 18622 31576 -79386
18265A54475b8895C6101R5701a03617n8675E6297f0318j35514A12016a53100c1383
$$ 154475 -28895 36101 131802 -103617 -162292 56297 -60318 -195832 112016 -153100 -31383
18253a26066q409a9363j06430c1832n7366o8600L1255m026A35771a14818j17558
$$ -126066 -134475 -19363 -125793 -31832 -89198 -157798 -126543 -130569 135771 -114818 -232376
18242b32376C0644c76406a04684d9858k58313a24620b506l5784m6706B40793A02164
$$ -232376 30644 -376406 -104684 -49858 -308171 -124620 -2506 -38290 -84996 240793 102164
18230A76380a02745d1345A03315R1900a8706j11302j72732a2453k50868A49989
$$ 176380 -102745 -41345 103315 195215 -18706 -130008 -302740 -12453 -263321 149989
18219c6676B52657g3057b9850C3535J1376d31673A0071a24887D3863c80187b9575
$$ -36676 252657 -73057 -29850 33535 44911 -431673 10071 -124887 43863 -380187 -29575
18207A84226D4361b73995B60539A553K91946j11217B2794c03096A29585J51882
$$ 184226 44361 -273995 260539 1553 293499 182282 22794 -303096 129585 281467
18197B81467c5776o1456A54145K22591a56160j04815J14967k8882A01357M5007
$$ 281467 -35776 -97232 154145 376736 -156160 -260975 -146008 -174890 101357 146364
18187A46364a59203B18824J54369a5138E5688G254J4331a02794j30369L2822A60477
$$ 146364 -159203 218824 373193 -15138 55688 7254 21585 -102794 -233163 -200341 160477
18175B41500K5006o5226e6420C32520c00365J9963o8416O3459a34309j0111m8489
$$ 241500 266506 201280 -56420 332520 -300365 -280402 -348818 -285359 -134309 -144420 -192909
18164a92909A29712j5280E988g1411E4096K58156c22644J08286Q5995p253I2243
$$ -192909 129712 114432 5988 -71411 54096 312252 -322644 -214358 -128363 -135616 92243
18152G6118a48526D7206K78952f5496j1436j14155L4107O2290j27397j36765a76495
$$ 76118 -148526 47206 326158 -65496 -76932 -191087 -156980 -94690 -222087 -358852 -176495
18140F1084J15331G7709g1424D6640b28109B32914A06864a24931K0410B04546
$$ 61084 176415 77709 -71424 46640 -228109 232914 106864 -124931 -104521 204546
18129i5070j68456e5082n1314B51112a13613A8408K7637L03138F3366f2391j75497
$$ -95070 -263526 -55082 -106396 251112 -113613 18408 46045 349183 63366 -62391 -237888
18118b37888Q5943B70305C6801J17473a99618E0503d538j47556k12674A52357
$$ -237888 -151945 270305 36801 154274 -199618 50503 -4538 -152094 -364768 152357
18107b83394c3055C01015a14854B82623d1974p2115j25913F3246L8341a44511
$$ -283394 -33055 301015 -114854 282623 -41974 -114089 -240002 63246 101587 -144511
18096b06478G0949b85665J11808M7000B29395C9095K52299a47989A7630c2704
$$ -206478 70949 -285665 -173857 -126857 229395 39095 291394 -147989 17630 -32704
18085C48392o0230b7657A50690b07029A16503C4831a43231e0863a1375j29336
$$ 348392 288162 -27657 150690 -207029 116503 34831 -143231 -50863 -11375 -140711
18075a40711j57j49750B06263e0342I0377a38109K6979I0853a74966e365j63106
$$ -140711 -140868 -290618 206263 -50342 90377 -138109 -111130 90853 -174966 -5365 -168471
18064a68471A37801a48696a6369A041f2319j13782c7949j8221k1563D8142a77013
$$ -168471 137801 -148696 -16369 1041 -62319 -176101 -37949 -56170 -77733 48142 -177013
18052b51056H6092a51481B99594b42023A69267n5114A0504K06181D675d6109D1927
$$ -251056 86092 -151481 299594 -242023 169267 114153 10504 216685 4675 -46109 41927
18040f7183b7199E2417a40312A12908c21675e825j43310C5490R5376g879H9493
$$ -67183 -27199 52417 -140312 112908 -321675 -5825 -149135 35490 130866 -7879 89493
18028H7613Q8649g6516p7052A24787D5441J85441a14593B88648A0344a86146h6369
$$ 87613 176262 -76516 -153568 124787 45441 230882 -114593 288648 10344 -186146 -86369
18016g3734B57303B7187A264d07360A87917H0977a16326A17404j1305N118d00379
$$ -73734 257303 27187 1264 -407360 187917 80977 -116326 117404 106099 111217 -400379
18004B2408a35111j95368M7377J2800I7587N0471d9413G8845a83602Q4892B37838
$$ 22408 -135111 -330479 -283102 -270302 97587 148058 -49413 78845 -183602 -98710 237838
17992b27411J7173B5742h6784p872H8131b16966A58018L4318Q4487i6026b7974
$$ -227411 -210238 25742 -86784 -94656 88131 -216966 158018 192336 276823 -96026 -27974
17980A13353m0J0559f4929A6370R9300b3866B98752a79834N3189B1826K15345
$$ 113353 113313 123872 -64929 16370 115670 -23866 298752 -179834 -126645 21826 237171
17969B37171R487H9936a5842A01074l2540b06362A95280F5805h690C10317m7112
$$ 237171 246658 89936 -15842 101074 68534 -206362 195280 65805 -8690 310317 263205
17958B63205g713k85743A51899o6196J30443M5552E7222e14815a77528B19270
$$ 263205 -7713 -293456 151899 85703 216146 261698 57222 -514815 -177528 219270
17947c30129R224C4629N1181a38025k2206B09999a5511A07610a22279N747M6315
$$ -330129 -320905 34629 85810 -138025 -160231 209999 -15511 107610 -122279 -116532 -70217
17936g0217A3856f4145r0794N9825G4850J15103L2102c6292j33033E3168a51026
$$ -70217 13856 -64145 -154939 -95114 74850 189953 222055 -36292 -169325 53168 -151026
17924a81961Q5943K3696j73149A31852e1566k0126p1173M1655C9209d550C4592
$$ -181961 -96018 -72322 -245471 131852 -51566 -71692 -142865 -101210 39209 -4550 34592
17912B89235a51893d8974J7630F8475J28490H7318a02414A35926d19939B46387
$$ 289235 -151893 -48974 -31344 68475 196965 87318 -102414 135926 -419939 246387
17901B047J65218a82676F2174J00005f0975r8828P2497A18109R947D920J0673
$$ 2047 167265 -182676 62174 162179 -60975 -159803 -87306 118109 128056 4920 15593
17890A5593b318j63186p0797H0921R9479F3122e3839E9204i1159j1748q3101d5844
$$ 15593 -2318 -165504 -236301 80921 180400 63122 -53839 59204 -91159 -102907 -186008 -45844
17877a4131A72665A6139a17901B03112G6230P0489R9228a17787A64125b42678
$$ -14131 172665 16139 -117901 203112 76230 146719 245947 -117787 164125 -242678
17866A1133b38928B86273H7064a15507j74183e4835j50398G0117N6354a01182
$$ 11133 -238928 286273 87064 -115507 -289690 -54835 -205233 70117 126471 -101182
17855A33923h5717A18795J95475G8026M5162a38308K1524C4132L58546A51393
$$ 133923 -85717 118795 314270 78026 123188 -138308 -116784 34132 392678 151393
17844a22795q0048H9933a34824G7838a62368A87254d15169a04069I364c02257
$$ -122795 -202843 89933 -134824 77838 -162368 187254 -415169 -104069 9364 -302257
17833H747c01855e6543K5011j94256A28579a2620I6985P1483h3733B62709e6591
$$ 8747 -301855 -56543 -31532 -225788 128579 -12620 96985 168468 -83733 262709 -56591
17821e4676C51524A67527K1727B4694N6969B9354a11012F1215L30267b15860p9244
$$ -54676 351524 167527 189254 24694 81663 29354 -111012 61215 391482 -215860 -295104
17810b95104A25228j290n2374F843b6001j55993O2695N4820A72184a01595A82958
$$ -295104 125228 123938 71564 6843 -26001 -181994 -119299 -64479 172184 -101595 182958
17798B3487e2561k52248m1558R9007h939A28755L06851b03393C1300d3971A10996
$$ 23487 -52561 -304809 -346367 -247360 -8939 128755 435606 -203393 31300 -43971 110996
17786b9463n1767L1658j77720A46085l546a65232B07254g5537J0259G1807a37294
$$ -29463 -81230 -49572 -227292 146085 142539 -165232 207254 -75537 -65278 71807 -137294
17774i9070C49208o1941B3062f9828k15568g5871A83811f695D8573b0224B17858
$$ -99070 349208 287267 23062 -69828 -285396 -75871 183811 -6695 48573 -20224 217858
17762I9983c04430R9252e8837B20076O4120G714c37995B16857I0097C0205a51792
$$ 99983 -304430 -205178 -58837 220076 284196 7714 -337995 216857 90097 30205 -151792
17750i041C0755J38928F5954j1206k5559K5469j382i9983L1396j32502A58851
$$ -9041 30755 169683 65954 54748 29189 54658 53276 -99983 -68587 -201089 158851
17738B7240e7233A08717c0361p4185d0979D1399A9117g262A46095J64705l0749
$$ 27240 -57233 108717 -30361 -104546 -40979 41399 19117 -7262 146095 310800 280051
17727B80051E0435a84054j26018A65990E860J72369I006a4310l32159a40164M2856
$$ 280051 50435 -184054 -310072 165990 5860 178229 9006 -14310 -346469 -140164 -97308
17716i7308D1534h8032K4920A4356Q8345f8254B22699o9387a16877A93653B8037
$$ -97308 41534 -88032 -63112 14356 102701 -68254 222699 153312 -116877 193653 28037
17704A29504B3633c5234A90401k3663a44158f7893q2952A07419m6972B6593J98243
$$ 129504 23633 -35234 190401 166738 -144158 -67893 -150845 107419 60447 26593 224836
17693B24836a23706N2473j2564q7080K3793A33476n5816a35864L0055B30936D0779
$$ 224836 -123706 -71233 -83797 -170877 -147084 133476 77660 -135864 -105809 230936 40779
17681G3085J93340d8901D26322I285J21764a04383a7737A51486b6538j09864B83389
$$ 73085 266425 -48901 426322 9285 131049 -104383 -17737 151486 -26538 -136402 283389
17669B80454j05999b14580i9159A43417O3854b13728g4446H1292J15156B8805
$$ 280454 174455 -214580 -99159 143417 207271 -213728 -74446 81292 196448 28805
17658a16303c1095l3029a3959j01600A45755c12170A53588a03696A63280Q624
$$ -116303 -31095 -64124 -13959 -115559 145755 -312170 153588 -103696 163280 171904
17648A71904a75106a3682A16138J0817K44845h891B52259a61924H0939L42626
$$ 171904 -175106 -13682 116138 126955 371800 -8891 252259 -161924 80939 423565
17638D23565G679b8919B8011R2394a52447j28041B563a64115A33598f2513l3774
$$ 423565 7679 -28919 28011 120405 -152447 -280488 2563 -164115 133598 -62513 -96287
17627i6287M05L3614A27313K56716c33114A68902M5995N3841p3887b8096A49360
$$ -96287 -95882 -62268 127313 384029 -333114 168902 214897 268738 194851 -28096 149360
17615i050j20826d3994C46053A29262m6003j425B1507L6881R0451a8104j95806
$$ -9050 -129876 -43994 346053 129262 83259 81834 21507 58388 148839 -18104 -213910
17604b13910C23967j18470Q0106p0287N0600b05941M4368H3355J4121J15010C781
$$ -213910 323967 205497 285603 215316 265916 -205941 -161573 83355 97476 212486 3781
17592A78885D484b23094C99197j78324j01803J4506j6545f9537B44002b35998
$$ 178885 4484 -223094 399197 220873 119070 133576 117031 -69537 244002 -235998
17581d14298a58357I2196e176E8787c0917j10603C89384A44357g5600B42766K9768
$$ -414298 -158357 92196 -5176 58787 -30917 -141520 389384 144357 -75600 242766 272534
17570B72534A7353b0096H0310a27471D2251a22177f829E7320J39732Q9017a84982
$$ 272534 17353 -20096 80310 -127471 42251 -122177 -6829 57320 197052 286069 -184982
17558A358J81468a0352B73474b52752E16253a33866q1578B4227J24184a90324
$$ 1358 182826 -10352 273474 -252752 516253 -133866 -215444 24227 148411 -190324
17547A3370c10810g4588D9329P7869g0857B793b55646K3509A20353E7788J75687
$$ 13370 -310810 -74588 49329 127198 -70857 2793 -255646 -232137 120353 57788 233475
17536B33475A15715C2332h4446H7064d7176C38883g3905A68642c10513A65611
$$ 233475 115715 32332 -84446 87064 -47176 338883 -73905 168642 -310513 165611
17525D1463j0749R9346m8902b36346L6867A16453A8671b01723A9925J7195Q1784
$$ 41463 30714 130060 81158 -236346 -199479 116453 18671 -201723 19925 37120 118904
17514A18904J26653p3310j6516b3662j98273e0362B60707c7755i836j12871j49950
$$ 118904 245557 172247 155731 -23662 -221935 -50362 260707 -37755 -9836 -122707 -272657
17503b72657J17314j7681L9599c4868A65757N46499l40102b10183A63111F7905
$$ -272657 -155343 -173024 -133425 -34868 165757 712256 372154 -210183 163111 67905
17492A13385R3818e0047B59803a7278D9578k1267P4781k6665P182J08481D0709
$$ 113385 207203 -50047 259803 -17278 49578 28311 103092 76427 83609 192090 40709
17480I3288O1955b0287D33200i6698C00976a83422A77445o0253J09704D8210J69598
$$ 93288 155243 -20287 433200 -96698 300976 -183422 177445 117192 226896 48210 217808
17469B17808M3711j21421n290P3790h132D10860c13333h129c319A03157E677L93287
$$ 217808 261519 140098 134808 208598 -8132 410860 -313333 -8129 -3319 103157 5677 398964
17457C98964b00994A17835E6402J64622r9446J97784D2521K36470J62635h0518
$$ 398964 -200994 117835 56402 221024 121578 319362 42521 278991 441626 -80518
17446H9597J55824k2888M0523j09501b9551B70561j5940j329r1351J16650k6309
$$ 89597 245421 222533 263056 153555 -29551 270561 254621 253292 161941 278591 252282
17435B52282P388i3711B43385J66117B8211K17249L7828J99265K31807B52511
$$ 252282 259670 -93711 243385 409502 28211 245460 283288 482553 714360 252511
17424C59189A73540J91155E6770Q3047N9581J55985J18107j75127p8621J23771
$$ 359189 173540 364695 56770 139817 199398 355383 473490 298363 219742 343513
17414C43513o5779K80564B20851K39431E7865R6048k554K8747C0635L50146A17827
$$ 343513 277734 558298 220851 460282 57865 153913 151359 180106 30635 380781 117827
17402D5314a1785j5826A19070l5256i15C5263a01156E2533M61988b12686A29715
$$ 45314 -11785 -27611 119070 83814 -915 35263 -101156 52533 514521 -212686 129715
17390D680R8947J54526k6488b7304r168m7893p9460I8638a49335g3938k349k4196
$$ 4680 103627 258153 231665 -27304 -36472 -84365 -163825 98638 -149335 -73938 -76287 -100483
17378a00483B55688I2382J96719O9318A45218n8113l6159K06316o6710L12977
$$ -100483 255688 92382 289101 358419 145218 87105 50946 257262 190552 503529
17368E03529I6577R9098K31300K515P679A12727a8624A40580n7655f6586C92334
$$ 503529 96577 195675 426975 429490 437169 112727 -18624 140580 82925 -66586 392334
17356e8439A7940f5618A43767k9039m6921L5575J94777k3092j4520J34238A92691
$$ -58439 17940 -65618 143767 114728 67807 103382 298159 275067 260547 394785 192691
17344c66210C38185b7739C77092J42551c44735A68958a26834B55146O7423A17218
$$ -366210 338185 -27739 377092 519643 -344735 168958 -126834 255146 322569 117218
17333B67484A23667K4806b33182A94882a00874A7480J92490P0297a02993B94798
$$ 267484 123667 148473 -233182 194882 -100874 17480 209970 280267 -102993 294798
17322B34162f0170B34180h2153B66192B9032L48689C2887f0373B18823k613o8583
$$ 234162 -60170 234180 -82153 266192 29032 377721 32887 -60373 218823 216210 147627
17311A47627l6123K947j7561J90916J18623j50553l0875L29487B27931O8766o7254
$$ 147627 111504 114451 96890 287806 406429 255876 225001 554488 227931 296697 229443
17300B29443Q4782o573c6084B32239C9022J11862a42100A48881b57694A82475
$$ 229443 314225 307652 -36084 232239 39022 150884 -142100 148881 -257694 182475
17289C08892A16606B9662i701F1482R8502N3051a24453b2483A99665o5155L00451
$$ 308892 116606 29662 -9701 61482 159984 213035 -124453 -22483 199665 134510 434961
17278D34961b8705b351D14476j29368j31738D6694Q6652a3488n077B90371f4060
$$ 434961 -28705 -2351 414476 285108 153370 46694 133346 -13488 -18565 290371 -64060
17266H1827L46426j91167q2362L73073k24758o1184I6666g9478B55230P3186j23451
$$ 81827 428253 237086 154724 527797 303039 241855 96666 -79478 255230 328416 204965
17255B04965J05815p2506i9499B30147a36813A77582K87330I3728K14362J09780
$$ 204965 310780 238274 -99499 230147 -136813 177582 464912 93728 308090 417870
17245D17870E9997K53071q0057O1284p9478L24720A48484e0750k0418G6675M9377
$$ 417870 59997 313068 233011 294295 214817 539537 148484 -50750 -71168 76675 126052
17234A26052J91276A00829J4214n7295J85638L62447G6873a5115C54485j18417
$$ 126052 317328 100829 115043 57748 243386 605833 76873 -15115 354485 236068
17224B36068J73405i0729C00815D1456O57716k84022r7991J08377E7346J53994
$$ 236068 409473 -90729 300815 41456 699172 415150 317159 425536 57346 211340
17214B11340R7160C1238c1998m6396E50232k32580j43650L12101c5887I8735R5282
$$ 211340 308500 31238 -31998 -78394 550232 317652 174002 486103 -35887 98735 194017
17203A94017I5180K10723j18774J83323D0616b70677D9445J79657A08939J95497
$$ 194017 95180 305903 187129 370452 40616 -270677 49445 229102 108939 304436
17193C04436K17292e558C30331j8007M6356G6910K63496n7529J17032J15214j36390
$$ 304436 521728 -5558 330331 312324 358680 76910 340406 282877 399909 515123 378733
17182C78733j16089A03517K02685J84982q274j88674R5472J8621j98422O3470
$$ 378733 262644 103517 306202 491184 482910 294236 389708 408329 209907 273377
17172B73377L27543k17223A5876M85651f2745D07979m1875E6080K32471l5551
$$ 273377 600920 383697 15876 501527 -62745 407979 366104 56080 288551 253000
17162B53000J0821J99307q6994K0138a31747B23711D4738K57929K85064j14592
$$ 253000 263821 463128 376134 396272 -131747 223711 44738 302667 587731 473139
17152D73139G8286c7986E35734K43897C57451m7179K3907A32387K84453J14827
$$ 473139 78286 -37986 535734 779631 357451 310272 334179 132387 416840 531667
17142E31667m3092l0827P326J71865B67917K5313A30043R4098E3948O240L98801
$$ 531667 488575 457748 465074 636939 267917 293230 130043 224141 53948 60188 458989
17131D58989k06266K87297A59119K48556p8322K56969k61783J6605q9760K03212
$$ 458989 252723 540020 159119 407675 329353 586322 324539 341144 251384 454596
17121D54596r7955K28267j06253N4382B9501L92456j04195A23070F660K39870
$$ 454596 356641 584908 478655 533037 29501 421957 317762 123070 6660 246530
17111B46530J67691D0434M12580j68909K21068j48017M8621A50552L3260J40147
$$ 246530 414221 40434 453014 284105 505173 357156 405777 150552 183812 323959
17101C23959J08941o5990j53642J97806Q0178j43878M30264j92998k51567p3069
$$ 323959 432900 366910 213268 411074 491252 347374 777638 584640 333073 260004
17091B60004K43387A67099J5527M18882k94483J11423j78582N2425J6510M22551
$$ 260004 503391 167099 182626 601508 307025 418448 239866 292291 308801 731352
17081G31352C53075J13596N239J08672B40665N8413J6702j9185L45191q9973j76760
$$ 731352 353075 466671 471910 580582 240665 299078 315780 296595 641786 551813 375053
17070C75053o8618K28858k60305L81572L0339C19274K14513B21458N39857l76041
$$ 375053 306435 535293 274988 656560 686899 319274 533787 221458 761315 385274
17060C85274n8413K87468j28559m0076k3535q8763K48162m5131N2084l4868L6392
$$ 385274 326861 614329 485770 445694 422159 333396 581558 536427 588511 553643 590035
17049E90035k55074K66033k26442L53745n6734C27641O68207C69961l3889J16613
$$ 590035 334961 600994 374552 728297 671563 327641 995848 369961 336072 452685
17039D52685J30392k33657l0022O5792J11382J12908o6961L6929l8544K5137j53667
$$ 452685 583077 349420 319398 385190 496572 609480 542519 579448 540904 566041 412374
17028D12374K14811n0443K0994j42856o2270L01889n0686q0372K5635K89123C77707
$$ 412374 627185 576742 597736 454880 392610 694499 643813 563441 589076 878199 377707
17016E17010K77767k52208N20384m53428K78349B66143O19144k72189L87005N988
$$ 517010 794777 542569 1062953 609525 887874 266143 885287 613098 1000103 1006091
17006A006091J5384m50935L49152k67452r9296N6325p655K63003k78645J64033
$$ 1006091 1021475 570540 919692 652240 552944 609269 601614 864617 585972 750005
16996G50005l9321r3573L25562D48920L58747O1949k04914j25255K08964J01690
$$ 750005 710684 617111 942673 448920 807667 869616 664702 539447 748411 850101
16986H50101r7259R7837p5198j43302J14198Q0511r7436L71889k7974l43021L69529
$$ 850101 752842 850679 775481 632179 746377 826888 729452 1101341 1073367 730346 1099875
16975A099875k19515l6476J83547j72932j28714j61516K09815K27717r9521j22183
$$ 1099875 880360 843884 1027431 854499 725785 564269 774084 1001801 902280 780097
16965G80097K4502j4664m5488K44681J13581j76573J31863J14328l75491p1938
$$ 780097 804599 789935 744447 989128 1102709 926136 1057999 1172327 796836 724898
16955G24898J97302K27809l52354N77305l08350m0654J14038j6348j60290l8040
$$ 724898 922200 1150009 797655 1374960 1066610 1025956 1139994 1123646 963356 925316
16945I25316Q4066J80899j71913L91454o07977L62501N0619k00320M25769k20240
$$ 925316 1009382 1190281 1018368 1409822 801845 1164346 1214965 1014645 1440414 1220174
16935A220174m29680N17528J84819K627m33621Q1964P2856m27718O64048k96151
$$ 1220174 790494 1308022 1492841 1495468 1061847 1143811 1216667 788949 1452997 1156846
16925A156846K70742r9684j9124J3288P9854J68445n0434k56735J16049J12713
$$ 1156846 1427588 1327904 1308780 1322068 1401922 1570367 1519933 1263198 1379247 1491960
16915A491960j30009k53357N40946n01482K81075p8657M17837k66211j3526O9188
$$ 1491960 1361951 1108594 1649540 1148058 1429133 1350476 1768313 1502102 1488576 1557764
16905A557764p0634J38254J29206J5762M1987J16512j74054k10215J39209M22305
$$ 1557764 1487130 1625384 1754590 1770352 1812339 1928851 1754797 1544582 1683791 2106096
16895B106096k12740k9979K8978K4204J68055k30726M5787K63661K15924n15508
$$ 2106096 1893356 1863377 1892355 1916559 2084614 1853888 1899675 2163336 2379260 1863752
16885A863752J46597J07251q6535l7547j89994J43141L65252q1673k82271K72068
$$ 1863752 2010349 2117600 2031065 1993518 1803524 1946665 2311917 2230244 1947973 2220041
16875B220041j31272m1984K91753r3792M1314K74700q1167j66563L7028K30544
$$ 2220041 2088769 2046785 2338538 2244746 2286060 2560760 2479593 2313030 2350058 2580602
16865B580602j25115J22709K11300l01001K55078M33509l25062n7585q3234K28530
$$ 2580602 2455487 2578196 2789496 2488495 2743573 3177082 2852020 2794435 2711201 2939731
16855B939731j76792K22831j26494M3643M58742J09834j28406J94717l73451J94442
$$ 2939731 2762939 2985770 2859276 2902919 3361661 3471495 3343089 3537806 3164355 3358797
16845C358797K66035k19190M16466l87944K68719r9701J16192K68358k57442O1723
$$ 3358797 3624832 3405642 3822108 3434164 3702883 3603182 3719374 3987732 3730290 3792013
16835C792013K88380q6206p9148K91267j00473L52780J49741k23741J60014K45679
$$ 3792013 4080393 3994187 3915039 4206306 4105833 4458613 4608354 4384613 4544627 4790306
16825D790306L8001K6739L64835m08472K28341O5403L27113N8239k63263M69748
$$ 4790306 4828307 4855046 5219881 4811409 5039750 5105153 5432266 5490505 5227242 5696990
16815E696990Q3072J98433m50021O03448p4336L85028j29544M41628K19370J36262
$$ 5696990 5780062 5978495 5528474 6131922 6057586 6442614 6313070 6754698 6974068 7110330
16805G110330p7948J87408M60250j01158M82573j17301J97506j954M66793J65969
$$ 7110330 7032382 7219790 7680040 7578882 8061455 7944154 8141660 8139706 8606499 8772468
16795H772468N6816L52016K26864J88328O8033N84207Q8570M53259J43730O7171
$$ 8772468 8829284 9181300 9408164 9596492 9664525 10248732 10337302 10790561 10934291 11001462
16785A1001462P02761L26373M4602N69116N56201j69570P59358O64996N34765
$$ 11001462 11704223 12030596 12075198 12644314 13200515 13030945 13790303 14455299 14990064
16776A4990064J40404N83166K20229J153176J83185Q07300L59545M90507J072013
$$ 14990064 15130468 15713634 15933863 17087039 17270224 18077524 18437069 18927576 19999589
16767A9999589R38067N95812O41679J099642P46033J117282R70564J242163P84314
$$ 19999589 20937656 21533468 22175147 23274789 24020822 25138104 26108668 27350831 28135145
16758B8135145J295824J262634J455236J701290J226645J818211J712360K049906
$$ 28135145 29430969 30693603 32148839 33850129 35076774 36894985 38607345 40657251
16750D0657251J910088J930914K736251K400165K857440K608454K900309L676044
$$ 40657251 42567339 44498253 47234504 49634669 52492109 55100563 58000872 61676916
16742F1676916L582223L790576M116447M334006N179092M571024N781080N729131
$$ 61676916 65259139 69049715 73166162 77500168 82679260 87250284 93031364 98760495
16734I8760495O290782O323024P144984P477733P552238Q063638P992022Q022422
$$ 98760495 105051277 111374301 118519285 125997018 133549256 141612894 149604916 157627338
16726A57627338Q045528P854902P178541O930674N878923M569921L301951K418773
$$ 157627338 165672866 173527768 180706309 187636983 193515906 198085827 201387778 203806551
16718B03806551R75133j020176j974705l809734m782580n871481o699153p157563
$$ 203806551 204781684 203761508 201786803 197977069 193194489 187323008 180623855 173466292
16710A73466292p762681q169730q207433q428055q014390p749451p187402p323453
$$ 173466292 165703611 157533881 149326448 140898393 132884003 125134552 117947150 110623697
16702A10623697o590837o298411o076078n742310m902848m841179m157413m509280
$$ 110623697 104032860 97734449 91658371 85916061 81013213 76172034 72014621 67505341
16694F7505341l774736l570444l094899l189849l092791k894951k071644k409710
$$ 67505341 63730605 60160161 57065262 53875413 50782622 47887671 45816027 43406317
16686D3406317k277824k054017j718173j712535j636684j763327j397585j207510
$$ 43406317 41128493 39074476 37356303 35643768 34007084 32243757 30846172 29638662
16678B9638662j721594j312980j050534j122161q54736n78324j229195o67951
$$ 29638662 27917068 26604088 25553554 24431393 23576657 22998333 21769138 21101187
16670B1101187r50526o44872j200379j5190o45333r31874l40850n69898o18212
$$ 21101187 20150661 19505789 18305410 18290220 17644887 16713013 16372163 15802265 15184053
16661A5184053k84903q02671k98686p18901j62728k67945p22403O7770o91427
$$ 15184053 14899150 14096479 13797793 13078892 12916164 12648219 11925816 11993586 11302159
16652A1302159j43684l38015l71110m05142k90097O6168m84939m31075r2544m01053
$$ 11302159 11158475 10820460 10449350 10044208 9754111 9820279 9335340 8904265 8811721 8410668
16642H410668K58729p80492k3789K044p9379m62895j16935l39871L4830j15709
$$ 8410668 8669397 7888905 7865116 7867160 7787781 7324886 7207951 6868080 6902910 6787201
16632F787201j90028O807j07024M8552n76966k23180M3493l55408J80615k24335
$$ 6787201 6597173 6603980 6496956 6545508 5968542 5745362 5788855 5433447 5614062 5389727
16622E389727j87245j39941j23106L0075m16566K57381m30549N99369l20042J0425
$$ 5389727 5202482 5062541 4939435 4969510 4552944 4810325 4379776 4979145 4659103 4669528
16612D669528k82804J4153m81926M21574n76298J14658j18493j31921n8454q5479
$$ 4669528 4386724 4400877 3918951 4340525 3764227 3878885 3760392 3628471 3570017 3484538
16602C484538M30447j93446k77053j81658P2032n2156j23844n511k21848K4665
$$ 3484538 3914985 3721539 3444486 3262828 3334860 3282704 3158860 3153349 2931501 2956166
16592B956166j31692J25580j6671j25384M5130j47510l9446P0565k50127J89021
$$ 2956166 2824474 2950054 2933383 2807999 2853129 2705619 2666173 2736738 2486611 2675632
16582B675632J03629l20746P4430o625k81464l7674L27339k84063k27861J52737
$$ 2675632 2779261 2458515 2532945 2526320 2244856 2207182 2534521 2250458 2022597 2175334
16572B175334M14583l34750k44832M36337k57306J71469m55068L02327l80215
$$ 2175334 2589917 2255167 2010335 2446672 2189366 2360835 1905767 2208094 1827879
16563A827879l08843L80400m5016L1390j73675k1590L10609m02521L17965L2568
$$ 1827879 1519036 1899436 1854420 1885810 1712135 1690545 2001154 1598633 1916598 1949166
16553A949166k60800j92375M30351m2362m29001J89021k38295L15370k2296o12625
$$ 1949166 1688366 1495991 1926342 1883980 1454979 1644000 1405705 1721075 1698779 1086154
16543A086154L76553N5073j07662j5974k2295n3646M4392K11305m7140k40717
$$ 1086154 1462707 1517780 1410118 1394144 1371849 1318203 1362595 1573900 1526760 1286043
16533A286043k90469K85869k43290q979K67471j91146J36450j93480n3715K67944
$$ 1286043 995574 1281443 1038153 1029174 1296645 1105499 1241949 1048469 994754 1262698
16523A262698M6684j51719P905M5416J01193r5481k6803p954J03485l72981j72441
$$ 1262698 1309382 1157663 1165568 1210984 1312177 1216696 1189893 1181939 1285424 912443 740002
16512G40002M14475j95254L20561k72813m7677R5999p1727K5295j28842K16593
$$ 740002 1154477 959223 1279784 1006971 959294 1055293 983566 1008861 880019 1096612
16502A096612l6190j41248L74103k68694j52110J81459J14469n3245k0964j99601
$$ 1096612 1060422 919174 1293277 1024583 872473 1053932 1168401 1115156 1094192 894591
16492H94591O9260P8688j47716J15299K96139m92681J5269j82972M1487K28461
$$ 894591 963851 1042539 894823 1010122 1306261 813580 828849 645877 687364 915825
16482I15825J37383q3518k59933J9070p2818j20152K93435N1273j03096j14708
$$ 915825 1053208 969690 709757 728827 656009 535857 829292 880565 777469 662761
16472F62761K4562K83668m13989j82501L14019o0439K6512k75427J57205K56272
$$ 662761 687323 970991 557002 374501 688520 628081 654593 379166 536371 792643
16462G92643J18939l42508L5681J72992j76879r9689R7629M9191K26376j20138
$$ 792643 911582 569074 604755 777747 600868 501179 598808 647999 874375 754237
16452G54237k30836J60664B71647N58454j28204J59114L3831Q6013j14378j83305
$$ 754237 523401 684065 271647 830101 701897 861011 894842 980855 866477 683172
16442F83172j95871n6188P0775K50187B88043l488L0110O7636J46764k47100K74787
$$ 683172 487301 431113 501888 752075 288043 284555 314665 382301 529065 281965 556752
16431E56752L8300J03045A23157L29356j80572L22782R3079J96637m37481O5070
$$ 556752 595052 698097 123157 452513 271941 594723 687802 884439 446958 512028
16421E12028j0185A86809L25572j96774L3611A24650N36635k41220j53966J48988
$$ 512028 501843 186809 512381 315607 349218 124650 661285 420065 266099 415087
16411D15087j34398R3302n6725L86299l05677L19165j69479L8128j48552N6168
$$ 415087 280689 373991 317266 703565 397888 717053 547574 585702 437150 493318
16401D93318J07632j17902j63117L56602n5193j98186A42219K05611A25682J16014
$$ 493318 600950 483048 319931 676533 621340 423154 142219 347830 125682 241696
16391B41696L9328P8126A79219L69846k61451J2214K0509K35869B59600m855a7637
$$ 241696 281024 359150 179219 549065 287614 299828 320337 556206 259600 254745 -17637
16379F02161A7706L18531M923P6543o7696L9144J66713k57674k5991N6955Q5054
$$ 602161 17706 336237 341160 417703 350007 389151 555864 298190 272199 329154 414208
16368D14208j17361J59034A92092M31878C11281J18628l461J36146j41417j47379
$$ 414208 296847 455881 192092 623970 311281 429909 426448 562594 421177 273798
16358B73798G1123K34490J13004j19701k4444P7372a93043D98243A66475J17252
$$ 273798 71123 305613 418617 298916 274472 351844 -193043 498243 166475 283727
16348B83727n2154K87824C8012J83551K21728j59639L3221m8671L14635k06722
$$ 283727 231573 519397 38012 221563 443291 283652 316873 268202 582837 376115
16338C76115J55990A43815J28861J89351A25893D4255M0860L92739k03819j19109
$$ 376115 532105 143815 272676 462027 125893 44255 85115 477854 274035 154926
16328A54926L1847J006J8131J59666p5850G7566N9988j7250K75828n5329J87986
$$ 154926 186773 187779 205910 365576 289726 77566 137554 120304 396132 340803 528789
16317E28789k49058P9796J12546B09978J29466r0782q5532D0534K47611K9470
$$ 528789 279731 359527 472073 209978 339444 248662 163130 40534 288145 317615
16307C17615A23813C9725M97910H1061c2797E44836A01683J56546j01458L51439
$$ 317615 123813 39725 537635 81061 -32797 544836 101683 258229 156771 508210
16297E08210I6199C1073N0847K14517O296Q9868F4763J35975P1709D8393N9534
$$ 508210 96199 31073 81920 296437 302733 392601 64763 200738 272447 48393 107927
16286A07927m1558K44537j09558J99262j25867D0548J54169l0393b4836k7086
$$ 107927 66369 310906 201348 400610 274743 40548 194717 164324 -24836 -51922
16276e1922B38278B4025J94743q8929K19126c7468A46921H978J84003J38576n3428
$$ -51922 238278 24025 218768 129839 348965 -37468 146921 8978 192981 331557 278129
16265B78129e3196H6873J95099A3610J5020K5457M10455A36843K92051D5872K51291
$$ 278129 -53196 86873 281972 13610 28630 54087 464542 136843 428894 45872 297163
16254B97163j47663J03637M9536J60781A90043E4350M83165a1826E7313K27958
$$ 297163 149500 253137 302673 463454 190043 54350 537515 -11826 57313 285271
16244B85271n8418M6560k5268j7319j9580K02832M3197A96121J68047H7986J00381
$$ 285271 226853 273413 248145 230826 211246 414078 457275 196121 364168 87986 188367
16233A88367N56J08758e0191a8183C38973J09995A41167n8336B1746K1507J37966
$$ 188367 188923 297681 -50191 -18183 338973 448968 141167 82831 21746 43253 181219
16222A81219l8134L93753e6196A98821q779c601A95896j0907h0298A30264c42663
$$ 181219 143085 536838 -56196 198821 190042 -3601 195896 184989 -80298 130264 -342663
16210C24334q5105a9571C20677l5839O1739A11963b829C86736c663p5502i236
$$ 324334 239229 -19571 320677 284838 346577 111963 -2829 386736 -3663 -79165 -9236
16198B65588D6609J16988D3810A9296L04577n0017l1023N2784a59555I0955J19369
$$ 265588 46609 163597 43810 19296 323873 273856 242833 295617 -159555 90955 210324
16187B10324J16340A6668K26660D1570L58816G7525K97492f2723H7872c1238A94468
$$ 210324 326664 16668 243328 41570 400386 77525 375017 -62723 87872 -31238 194468
16175A43857a71130D99917k11871H9360j8903K8807b8882B40673O1321r273a8122
$$ 143857 -171130 499917 288046 89360 70457 99264 -28882 240673 301994 292721 -18122
16163a90268B59592h6108G1245H63a06350D8467a49389b8170F8234J23524B0586
$$ -190268 259592 -86108 71245 863 -106350 48467 -149389 -28170 68234 191758 20586
16151I7373P3989j828p7315a50319a4927E5218J78530N3111b08327A33924O3894
$$ 97373 171362 169534 92219 -150319 -14927 55218 233748 286859 -208327 133924 197818
16140A97818A0005M682h7174H852e4680F9555L48301A67096E287h9586A43045
$$ 197818 10005 14687 -87174 8852 -54680 69555 417856 167096 5287 -89586 143045
16128F7129a05565B27802M7578g7286H4031a60002A11991l5242K06614b04745
$$ 67129 -105565 227802 275380 -77286 84031 -160002 111991 76749 283363 -204745
16117g6275j42048A53563k2377b91281c524j2800k63135b6504j03100C9279a77723
$$ -76275 -218323 153563 131186 -291281 -3524 -16324 -279459 -26504 -129604 39279 -177723
16105b145B08563M2980C5461a05456j22449a01020A39588d3304B2811a17446C3161
$$ -2145 208563 251543 35461 -105456 -227905 -101020 139588 -43304 22811 -117446 33161
16093c5247D35597j91135l2378L8058b49819A66673J50248c21424b0645C43386
$$ -35247 435597 244462 212084 250142 -249819 166673 316921 -321424 -20645 343386
16082A32664B4039a33833a9221C9783b751j59166F1973o458g0642C84161d178
$$ 132664 24039 -133833 -19221 39783 -2751 -161917 61973 55515 -70642 384161 -4178
16070A0359a69764a1297r6796A21180a00394c9800j46309A70998a97527h5328
$$ 10359 -169764 -11297 -108093 121180 -100394 -39800 -186109 170998 -197527 -85328
16059A30574N0934H5783J29026A2086L07105i995j9688l806n3792j55654E6728
$$ 130574 181508 85783 214809 12086 319191 -9995 -29683 -33489 -87281 -242935 56728
16047g3883H6938J68758i6339B13700M1820c5890k61087a01197q0502d1480J6341
$$ -73883 86938 255696 -96339 213700 255520 -35890 -296977 -101197 -181699 -41480 -25139
16036b5139l94786e3409P836H6340a01585j3532N1392G6552j1411d3848d272A00309
$$ -25139 -419925 -53409 -45573 86340 -101585 -115117 -63725 76552 65141 -43848 -4272 100309
16023c12146I3457J63373c8240F9944N4859g3283b5322m3288n86740d2151H0737
$$ -312146 93457 256830 -38240 69944 124803 -73283 -25322 -68610 -655350 -42151 80737
16011a48401H2006e9583k12034C13106a25308b7588A78300a89205k15602A24513
$$ -148401 82006 -59583 -271617 313106 -125308 -27588 178300 -189205 -404807 124513
16000A40222D7589h4121H7881a0474j24568O955A04253b7970f091j74210d1953
$$ 140222 47589 -84121 87881 -10474 -135042 -128087 104253 -27970 -6091 -180301 -41953
15988F6591B5529P4706R8251a77775Q3195j14053E76452D8024b9560C91857A43567
$$ 66591 25529 100235 198486 -177775 -94580 -208633 576452 48024 -29560 391857 143567
15976a7202j39549B7690K1433N0151e07099a84876A41009C6349g3117I30J325
$$ -17202 -156751 27690 49123 99274 -507099 -184876 141009 36349 -73117 930 2255
15965B255J43447C8635c72329g5043D16850b40579O3446e6850n1922A4510a7237
$$ 2255 145702 38635 -372329 -75043 416850 -240579 -177133 -56850 -108772 14510 -17237
15953a4794n0737l4400B12918c24569A41976R072o3366N3472G0093g4803G8357
$$ -14794 -65531 -99931 212918 -324569 141976 151048 87682 141154 70093 -74803 78357
15941e7862q5475P048r9718O3154H0576c23842A70661G5523A8751a97595r798
$$ -57862 -143337 -136289 -236007 -172853 80576 -323842 170661 75523 18751 -197595 -207393
15930b07393e1060j95864D2341K18510c72932A90548d3078q5102B21074G0825
$$ -207393 -51060 -246924 42341 260851 -372932 190548 -43078 -128180 221074 70825
15919c80854C0586b28221B5638d1612B75K02705C7881J28740D8241b53594g6461
$$ -380854 30586 -228221 25638 -41612 275 202980 37881 166621 48241 -253594 -76461
15907a69413C45955p9857H523f1033l4479l51918a67494O5938A98793h5637A73744
$$ -169413 345955 266098 8523 -61033 -95512 -447430 -167494 -101556 198793 -85637 173744
15895a90797A13235l8383A4111K22381a73077O4556A21141f5549k38293J20295
$$ -190797 113235 74852 14111 236492 -173077 -108521 121141 -65549 -303842 -183547
15885a83547M0537B0796O3722C2065a5137J21o231k63792h4494H4508c3472C64084
$$ -183547 -143010 20796 84518 32065 -15137 -15016 -21247 -285039 -84494 84508 -33472 364084
15872F8926l1717J19351J29208b73338i8553A0225l317J77840b54519B14353a17687
$$ 68926 37209 156560 285768 -273338 -98553 10225 6908 184748 -254519 214353 -117687
15860G7931c1020B247c86785C7178e15533E2488b18270K8836k1990J0943c6103
$$ 77931 -31020 2247 -386785 37178 -515533 52488 -218270 -189434 -211424 -200481 -36103
15848B41886p0476o0288b9218D3889a70546A02721a58260B09038b03912A19878
$$ 241886 171410 111122 -29218 43889 -170546 102721 -158260 209038 -203912 119878
15837I8253f0878Q664A76063J04242b98775B51973a74225r961M5971F2877J33210
$$ 98253 -60878 -52214 176063 280305 -298775 251973 -174225 -184186 -138215 62877 196087
15826A96087E9827J94974a53899m03205h5201A20649b53912f8296k1962l1960
$$ 196087 59827 254801 -153899 -557104 -85201 120649 -253912 -68296 -90258 -122218
15816a22218A93726h4496p3431k9645A5510b59591A48960d5465n8583j40935d2143
$$ -122218 193726 -84496 -157927 -187572 15510 -259591 148960 -45465 -104048 -244983 -42143
15804D0245M3605L8582D2454g6614Q770r9378g93q5492J3458G031a06718B50892
$$ 40245 83850 122432 42454 -76614 -67844 -167222 -793 -86285 -72827 7031 -106718 250892
15791E0643b10153N5782e1937l5231A04983a7377H8934A4331J04503a58146I7566
$$ 50643 -210153 -154371 -51937 -87168 104983 -17377 88934 14331 118834 -158146 97566
15779A14173J65447a49932M2746j64987A93512r5598a26207j37560B34580b14835
$$ 114173 279620 -149932 -107186 -272173 193512 97914 -126207 -263767 234580 -214835
15768c06789a6243C20493g6442B29516e21537K04322P451j85460H2701P1177a62031
$$ -306789 -16243 320493 -76442 229516 -521537 -317215 -309764 -495224 82701 153878 -162031
15756a66769G9988c12823a47369B20988b742j02708L9576a9655l8993B88165G7389
$$ -166769 79988 -312823 -147369 220988 -2742 -105450 -65874 -19655 -58648 288165 77389
15744B12885i5020K8286k88393M2814Q2792o3756g9485I3271D4357b40841A66891
$$ 212885 -95020 -66734 -355127 -312313 -229521 -293277 -79485 93271 44357 -240841 166891
15732C3727c78658A7230a93539E4637O725b57396A83946c02027e1370J5447a4543
$$ 33727 -378658 17230 -193539 54637 61362 -257396 183946 -302027 -51370 -35923 -14543
15720B6088a15049F3365a43356f9274j54222c4206p5218j63824d7931r9441p1751
$$ 26088 -115049 63365 -143356 -69274 -223496 -34206 -109424 -273248 -47931 -147372 -219123
15709b19123A1329R4130b01221k1232A37505j0243e7236B04472F312J26993b21862
$$ -219123 11329 105459 -201221 -222453 137505 127262 -57236 204472 6312 133305 -221862
15697b78408J12314h573m02716o3966J65238J26281A79781d5713A8435O917b14003
$$ -278408 -166094 -8573 -411289 -475255 -310017 -183736 179781 -45713 18435 25352 -214003
15685h9497k28279B86166a16392k6230I0150a4629j94802A6342M1142c5491l3559
$$ -89497 -317776 286166 -116392 -142622 90150 -14629 -209431 16342 57484 -35491 -69050
15674f9050l3913j8829d1759k15726J24477c2720B7460g1721L384j3257g439j60792
$$ -69050 -102963 -121792 -41759 -257485 -133008 -32720 27460 -71721 -68337 -81594 -7439 -168231
15662a68231M8795A83304c49481D3946b5037P435H6506K58689a81563A29874c35621
$$ -168231 -119436 183304 -349481 43946 -25037 -17602 86506 345195 -181563 129874 -335621
15650a65978j52591A74836m6741a73546f4024C4985g5295j96022A19833k8437
$$ -165978 -318569 174836 128095 -173546 -64024 34985 -75295 -271317 119833 91396
15640I1396a07964C9621J02983D2970g9264J0334J0804K5509j5080l0619I7693
$$ 91396 -107964 39621 142604 42970 -79264 -68930 -58126 -32617 -47697 -78316 97693
15628G4816L12183A50085a38579p9127P4695K5275C36144A62452n2548J01324
$$ 74816 386999 150085 -138579 -217706 -143011 -117736 336144 162452 109904 211228
15618B11228a2230C62139a07718L1355j25380N994G4791b14762b1286j75997e9372
$$ 211228 -12230 362139 -107718 -76363 -201743 -195749 74791 -214762 -21286 -197283 -59372
15606A489P5456a42199O7969j13522h2374A98767F8811P7948E5116K89338A6162
$$ 1489 76945 -142199 -74230 -187752 -82374 198767 68811 146759 55116 344454 16162
15594A22371B8692P7823a51067D7122N5310a39851B04452a63932L4107m8354D6973
$$ 122371 28692 106515 -151067 47122 102432 -139851 204452 -163932 -129825 -178179 46973
15582C71019a82920A01056a51383n5620D66488h0289F766K15133C558J64130K038
$$ 371019 -182920 101056 -151383 -207003 466488 -80289 6766 221899 3558 167688 169726
15571A69726b3094j50444b3790E5024B6537P0637a32930b7972A8482P0894b6325
$$ 169726 -23094 -173538 -23790 55024 26537 97174 -132930 -27972 18482 89376 -26325
15559A52527a96418H1552a95983F5906e3345j90473C3027b60823a05910L1368
$$ 152527 -196418 81552 -195983 65906 -53345 -243818 33027 -260823 -105910 -74542
15549g4542j05335G1186G451K82962j19040B4978g213B34593A0360a9245C8228
$$ -74542 -179877 71186 7451 290413 171373 24978 -7213 234593 10360 -19245 38228
15537B19028b83091G719b64925L8058f6144k30654e6533j93551A52380o5681Q7861
$$ 219028 -283091 7719 -264925 -226867 -66144 -296798 -56533 -250084 152380 86699 174560
15526A74560b28726B56931j18856e8399B3689b81576H5929L1266A475b26805F1563
$$ 174560 -228726 256931 138075 -58399 23689 -281576 85929 117195 1475 -226805 61563
15514c1331k4924D1574A8855J19735L6357O583a2510q3944j7313L0473r65B13924
$$ -31331 -56255 41574 18855 138590 174947 181530 -12510 -96454 -113767 -83294 -84259 213924
15501a34452f4322k98867A43115J09098D4409c83897E2620c8890J3800m5593j25968
$$ -134452 -64322 -363189 143115 252213 44409 -383897 52620 -38890 -25090 -70683 -196651
15490a96651K5249L4316M905C15069D5612R0724a56473H4874b61521B42960A2272
$$ -196651 -171402 -137086 -132181 315069 45612 136336 -156473 84874 -261521 242960 12272
15478H9962r220L594M5970Q8962I4450K9547P6930o1362j5912i5279E5188J10640
$$ 89962 80742 84336 130306 219268 94450 123997 200927 139565 123653 -95279 55188 165828
15466A65828M4557J22814b29192f6556l28431F0744K26976a14599A65435d607
$$ 165828 210385 333199 -229192 -66556 -394987 60744 287720 -114599 165435 -4607
15455c57771B35425F3700J65371A13042l0841B6811N5166c4274q8162G7669A6001
$$ -357771 235425 63700 229071 113042 82201 26811 81977 -34274 -122436 77669 16001
15443a39320c3241n5821A24954O8921a59991j27163A4229J61067b3337m4494j49079
$$ -139320 -33241 -89062 124954 193875 -159991 -287154 14229 175296 -23337 -67831 -216910
15432b16910b9800B65507d8426k16823I5272N6g8356b0840j15419D3164a27656
$$ -216910 -29800 265507 -48426 -265249 95272 95328 -78356 -20840 -136259 43164 -127656
15420A14259d789A69611D6946a8429D67628a19938C2383J69012C3452J38937a94482
$$ 114259 -4789 169611 46946 -18429 467628 -119938 32383 201395 33452 172389 -194482
15408d8041A23499J26912D4771b84422a21383A3230A848d00782b6997p2363m8130
$$ -48041 123499 250411 44771 -284422 -121383 13230 1848 -400782 -26997 -99360 -147490
15397a47490H717J60656k6209k1342b6013l56567a73294B99711e1034H7756k8686
$$ -147490 8717 169373 143164 121822 -26013 -382580 -173294 299711 -51034 87756 59070
15386E9070c17135J30114G2134k885K42583I2490f0385j46913A12213h4227l53537
$$ 59070 -317135 -187021 72134 69249 311832 92490 -60385 -207298 112213 -84227 -437764
15375d37764b1160B12836a72448O5462A1917a34899A1221M4558g7385C4271c09471
$$ -437764 -21160 212836 -172448 -106986 11917 -134899 11221 55779 -77385 34271 -309471
15363G0335K72961B419a27675C0701e3180G2251a59399b2835B99539g0902H5729
$$ 70335 343296 2419 -127675 30701 -53180 72251 -159399 -22835 299539 -70902 85729
15351a30641j96774J31993H221K44710b18155A23146d0700B55421a21722A29854
$$ -130641 -327415 -195422 8221 252931 -218155 123146 -40700 255421 -121722 129854
15340a88618c7356j84767C00092a35512B75351a25975G0701b1667B26377p9686
$$ -188618 -37356 -222123 300092 -135512 275351 -125975 70701 -21667 226377 146691
15330A46691q040d515p1123j16718A40010E9208N6039e0078A66578b07793n4597
$$ 146691 138651 -4515 -75638 -192356 140010 59208 115247 -50078 166578 -207793 -262390
15319b62390A1567c6610A49683a60914A26761J12072H6216K3870C4694d4973A06990
$$ -262390 11567 -36610 149683 -160914 126761 238833 86216 110086 34694 -44973 106990
15307E0770J35805k1669b2160j28011B57401f6249I919J25025B0396J53405d8997
$$ 50770 186575 164906 -22160 -150171 257401 -66249 9919 134944 20396 173801 -48997
15295I1808J46399L7961p7218b7972C2721a61397E9622K35809d82187g1588B19462
$$ 91808 238207 276168 198950 -27972 32721 -161397 59622 295431 -482187 -71588 219462
15283a29749A56260J11475o4591r7036K43233e0229I7500D8089d4956D99442A82648
$$ -129749 156260 267735 203144 106108 349341 -50229 97500 48089 -44956 499442 182648
15271E79450B03120L538b63602B8031J53150J64619B1116J35633a03113A24886
$$ 579450 203120 206658 -263602 28031 181181 345800 21116 156749 -103113 124886
15260A72281l5992a6633B34374j09389O5822J98885j53290o669L1620a76072A42418
$$ 172281 136289 -16633 234374 124985 190807 389692 236402 229733 261353 -176072 142418
15248C09014j47183M59197J037129J000180n59474O81247k40888I12123l60272
$$ 309014 161831 621028 1658157 2658337 2098863 2780110 2539222 912123 551851
15239E51851j34746l0025F4139e5619j35855A74602n0945d0436A26019e8516B87489
$$ 551851 417105 387080 64139 -55619 -191474 174602 123657 -40436 126019 -58516 287489
15227f385I5377L42152a99083d5883F1947a59713A51622J00991A18125B8521g0002
$$ -6385 95377 437529 -199083 -45883 61947 -159713 151622 252613 118125 28521 -70002
15215A76051C1758J51769a84781c2323A71560b27264A44654a44754B91659P1690
$$ 176051 31758 183527 -184781 -32323 171560 -227264 144654 -144754 291659 363349
15205C63349E5293O0210a79198E7637M0626a96451E8775b29027b5927B50269G6426
$$ 363349 55293 115503 -179198 57637 98263 -196451 58775 -229027 -25927 250269 76426
15193A35659L5977d2033J8769j77664F6513a50318E825a28806A94680m1201L80687
$$ 135659 171636 -42033 -23264 -200928 66513 -150318 5825 -128806 194680 153479 534166
15182E34166k00370p3306j15719n9056J26633d1821j87397O7670B10565A1678
$$ 534166 333796 260490 144771 85715 212348 -41821 -229218 -161548 210565 11678
15171G2172A4780b9915B92007o5654A06022J02675G347a24276B43702B0351N1460
$$ 72172 14780 -29915 292007 226353 106022 208697 7347 -124276 243702 20351 71811
15160G1811B8471a22038A1091d8785B93597J8824a28429A73115n5391b31722B61438
$$ 71811 28471 -122038 11091 -48785 293597 312421 -128429 173115 117724 -231722 261438
15148A72018D1985K38265A39930h1005C60208k0485J8312A11042c2000B71449
$$ 172018 41985 280250 139930 -81005 360208 339723 358035 111042 -32000 271449
15137b38856a8291G3830c6850q1507G2975L26739C5145L48935a07975o7548A82515
$$ -238856 -18291 73830 -36850 -118357 72975 399714 35145 384080 -107975 -175523 182515
15125B0361L21767G2682K38305e5746B63523K64430A32090K8473K42631c30764
$$ 20361 342128 72682 310987 -55746 263523 527953 132090 160563 403194 -330764
15114e5680B02401d8504A33093L43406J20229i8962C65152F5543O6749K46401
$$ -55680 202401 -48504 133093 476499 596728 -98962 365152 65543 132292 378693
15104C78693G1884a68520A96524J24539C2363N0928B904L01208A476K3037c9272
$$ 378693 71884 -168520 196524 321063 32363 83291 2904 304112 1476 24513 -39272
15092G2109j957h134m1398A11131J6419G948a10860D35613j81244F4528c0271
$$ 72109 70152 -8134 -49532 111131 127550 7948 -110860 435613 254369 64528 -30271
15080A85861K70203f682k3975A62515D8858J24377f6493A56593J07607A27079
$$ 185861 456064 -6682 -30657 162515 48858 173235 -66493 156593 264200 127079
15069D6121L01504A67733m8886O2551R988b01562f101B57293J35677b9637A4984
$$ 46121 347625 167733 118847 181398 191386 -201562 -6101 257293 392970 -29637 14984
15057A89651K9920J28753A46967E3853L17792n6978j29060K52538q2811j71596
$$ 189651 219571 348324 146967 53853 371645 314667 185607 438145 355334 183738
15047A83738n6253J12729J74118B04848H396J29960J36867j00727n0390K06570
$$ 183738 127485 240214 414332 204848 8396 138356 275223 174496 124106 330676
15037C30676j64604c48229B95364A0426M77896E0673O2548K34636A24864O19N0409
$$ 330676 166072 -348229 295364 10426 488322 50673 113221 347857 124864 125483 175892
15026A75892N1921J913F594J45694J23241I0725F165P2893K19385m9318q2001
$$ 175892 227813 229726 6594 152288 275529 90725 6165 79058 298443 249125 167124
15015A67124j1299l007m9675K33311d391C70502J5293j29235g5857E67395B11879
$$ 167124 155825 152818 103143 336454 -4391 370502 385795 256560 -75857 567395 211879
15003B88524c33567C70876j83846K23294A15915J42426G1512k8860b10186A90245
$$ 288524 -333567 370876 187030 410324 115915 258341 71512 42652 -210186 190245
14992A65516M073a8406n478B75819j35351M8358M12299k79568j00361R215L42587
$$ 165516 169589 -18406 -23884 275819 140468 188826 601125 321557 221196 230411 572998
14981E72998a18193C41931A33084P2500J09689J64665c1128n6630C81523E7131
$$ 572998 -118193 341931 133084 205584 315273 479938 -31128 -87758 381523 57131
14970B35672E1519L57949j52008a44823C56098B8980N16307A45255m0085K36228
$$ 235672 51519 409468 257460 -144823 356098 28980 545287 145255 105170 341398
14960C41398K1936h1534A19658K52497j51981L65880B89550D4791L14035l4304
$$ 341398 363334 -81534 119658 372155 220174 586054 289550 44791 358826 324522
14950C24522o7812a09737A45110b0851F51028q2217j57147A71067j697K04145
$$ 324522 256710 -109737 145110 -20851 651028 568811 411664 171067 169370 373515
14940C73515K04720A8464J63457L16450F2812J19930D153L50675m0872J11925
$$ 373515 578235 18464 181921 498371 62812 182742 4153 354828 313956 425881
14930D25881B02031J86415K4464A83657c4726I8872J97506L2722A6347M71189
$$ 425881 202031 388446 412910 183657 -34726 98872 296378 329100 16347 487536
14920D87536k3752k3282A98289M10099j00798j30512B5521M26020j66559P9799
$$ 487536 463784 440502 198289 608388 507590 377078 25521 451541 284982 364781
14910C64781j65571L34285j20820k3387l7942A01271Q210M98146J6959k14543
$$ 364781 199210 533495 412675 389288 351346 101271 109481 607627 624586 410043
14900D10043n7457L0715J47640o312k20602L68844A11721K97920M8954r8799J84865
$$ 410043 352586 383301 530941 524629 304027 672871 111721 409641 458595 359796 544661
14889E44661j31762A10085L3331K56653p6643p886M5335N1341K4533m6363K04749
$$ 544661 412899 110085 143416 400069 323426 315540 360875 412216 436749 390386 595135
14878E95135j97302M1803P5628K26562C43124K5186J14807j23909N0951k3657
$$ 595135 397833 439636 515264 741826 343124 368310 483117 359208 410159 386502
14868C86502o304l8463K35169j15711N7447q7829o4480a39309C34835J02577K52852
$$ 386502 380198 341735 576904 461193 518640 430811 366331 -139309 334835 437412 690264
14857F90264l43565j58497M40684j32600J84653k18129J78539j43607B36509J09765
$$ 690264 346699 188202 628886 496286 680939 462810 641349 497742 236509 346274
14847C46274R8664o6644O0095j43965J90576J86840B9685N72698j52103J67727
$$ 346274 444938 378294 438389 294424 485000 671840 29685 602383 450280 618007
14837F18007D9198M23054j93624N2697K65579k96044K85379Q1797k6512J09487
$$ 618007 49198 472252 278628 331325 596904 300860 586239 668036 641524 751011
14827G51011k97j88119B09053J34431P5339M56161k86205j92058K84772j77078
$$ 751011 750714 562595 209053 343484 418823 874984 588779 396721 681493 504415
14817E04415J11128K48915C89271P9506M4210J30563k74625J85452J80369j24021
$$ 504415 615543 864458 389271 468777 512987 643550 368925 554377 734746 610725
14807F10725k65392r0345M79608k69824J97723k0639M7173j61177K8325o3095
$$ 610725 345333 254988 734596 464772 662495 641856 689029 527852 556177 493082
14797D93082D8962M70699A01239L23062r0924Q92696F04755r1561n5683J00259
$$ 493082 48962 519661 101239 424301 333377 1226073 604755 513194 457511 557770
14787E57770M8053k07495K64359p1055J46819j41827Q7219L5792n3939j66141
$$ 557770 605823 398328 662687 591632 738451 596624 683843 719635 665696 499555
14777D99555O2115q1266N7106m5869B31526N56018m1900l18325K99449P9323J69742
$$ 499555 561670 480404 537510 491641 231526 787544 745644 427319 726768 806091 975833
14766I75833l13204k67584M02360k59860o3117Q0112k15259N76687J3063j1715
$$ 975833 662629 395045 797405 537545 474428 554540 339281 915968 929031 917316
14756I17316k08353M1382J01162j09870K70741m06139L39904k47355k84273M24580
$$ 917316 708963 750345 851507 741637 1012378 606239 946143 698788 414515 839095
14746H39095k62126J8086R4720J59843k14997J39719P5938j98239L09101q3483
$$ 839095 576969 595055 689775 849618 634621 774340 850278 652039 961140 877657
14736H77657o3578O8349k74663J51455q3033O3417k31475K58483K30919k08178
$$ 877657 814079 882428 607765 759220 676187 739604 508129 766612 997531 789353
14726G89353J63637j47712q0279p4019k9112N94824l49382J0945J37353l6490
$$ 789353 952990 805278 724999 650980 621868 1216692 867310 878255 1015608 979118
14716I79118j45435M11269k12589k40811O299p1964l6313J56201l29291J57617
$$ 979118 833683 1244952 1032363 791552 797851 725887 689574 845775 516484 674101
14706F74101L37804k06310j36963P67472F37402L79039m2805k80399L54668j9627
$$ 674101 1011905 805595 668632 1436104 637402 1016441 973636 693237 1047905 1028278
14696A028278Q4010k4906m27105J22397K30931Q2621j79731J17854J64379l73438
$$ 1028278 1112288 1087382 660277 782674 1013605 1096226 916495 1034349 1198728 825290
14686H25290M8501J78263n3373j04971L96722J20944m35145L63688l18217L79464
$$ 825290 873791 1052054 998681 893710 1290432 1411376 976231 1339919 1021702 1401166
14676A401166m41632M3039j27148m4684L46149l32222M36539k59283J76620k80832
$$ 1401166 959534 1002573 875425 830741 1176890 844668 1281207 1021924 1198544 917712
14666I17712J90088j62882K40839K86087n46266J50395J63591q3199m7430J46190
$$ 917712 1107800 944918 1185757 1471844 925578 1075973 1239564 1156365 1108935 1255125
14656A255125k71451Q4347K22866K42782n44101K76343j91689J05009P6451J40614
$$ 1255125 983674 1068021 1290887 1533669 989568 1265911 1074222 1179231 1255682 1396296
14646A396296K39262j79067J0816j6114j82158J19932j41869O0712J03769k72505
$$ 1396296 1635558 1456491 1467307 1451193 1269035 1388967 1247098 1307810 1411579 1139074
14636A139074L41127J85880m43913K97576j32069j02454J90682r9704J12517j83160
$$ 1139074 1480201 1666081 1222168 1519744 1387675 1285221 1475903 1376199 1488716 1305556
14626A305556j03688j7439K18497j84139M19224l06324K95635j60394j46010L3717
$$ 1305556 1201868 1184429 1402926 1218787 1638011 1331687 1627322 1466928 1320918 1354635
14616A354635J64766K34032j40706j84784O0987J47108J27973l54441K24836N4057
$$ 1354635 1519401 1753433 1612727 1427943 1488930 1636038 1764011 1409570 1634406 1688463
14606A688463K75342k94911o3892K16452j90474K40125k4453K6738j39932j31669
$$ 1688463 1963805 1668894 1605002 1821454 1630980 1871105 1846652 1873390 1733458 1601789
14596A601789j61240M1233j3515M71643j83335Q0379j65626N54817m71134K21709
$$ 1601789 1440549 1481782 1468267 1939910 1756575 1836954 1671328 2226145 1755011 1976720
14586A976720k80650L62737J36167J0801m57588J11113O1084J90439o5085N1623
$$ 1976720 1696070 2058807 2194974 2205775 1748187 1859300 1920384 2110823 2045738 2097361
14576B097361q3629K95085r1408K44674j70325M76700m15710k05893l8574j18399
$$ 2097361 2013732 2308817 2217409 2462083 2291758 2768458 2352748 2146855 2108281 1989882
14566A989882M69644m19846N57301M57156j06736m00073J86479p9975O04455k96800
$$ 1989882 2459526 2039680 2596981 3054137 2947401 2547328 2733807 2653832 3258287 2961487
14556B961487l5234M08233J76380K77253M17542P20239O25003J602454L484083
$$ 2961487 2926253 3334486 3510866 3788119 4205661 4925900 5550903 7153357 10637440
14547A0637440O977459J6346487J4119665k2090145A1007062m358683O86069M25711
$$ 10637440 17614899 33961386 48081051 25990906 11007062 6648379 7334448 7760159
14539G760159C521378o16793q99298M97277n36836J70676m0321J54492r7458L3829
$$ 7760159 3521378 2904585 2005287 2502564 1965728 2136404 2096083 2250575 2153117 2186946
14529B186946R2740K47208m82035L46667m7841K63514m4789P5208k2812j2997
$$ 2186946 2279686 2526894 2044859 2391526 2343685 2607199 2562410 2637618 2614806 2601809
14519B601809j05492J14390p6934J30112L70817m31670L14901N2274k84660K55846
$$ 2601809 2496317 2610707 2533773 2663885 3034702 2603032 2917933 2970207 2685547 2941393
14509B941393O1160L25925j39108K39561k25588K52670k47636J44299J02251j08502
$$ 2941393 3002553 3328478 3189370 3428931 3203343 3456013 3208377 3352676 3454927 3346425
14499C346425k72747J15631L27108j46364k10789K36836J28342k37582M49480
$$ 3346425 3073678 3189309 3516417 3370053 3159264 3396100 3524442 3286860 3736340
14490C736340m3560m8762K57817l37029J95895R1898j54947Q0810K86654J0633
$$ 3736340 3692780 3644018 3901835 3564806 3760701 3852599 3697652 3778462 4065116 4075749
14480D075749m756K47214o5681J3648j68958K29047J44170J23957j14509l78727
$$ 4075749 4070993 4318207 4252526 4266174 4097216 4326263 4470433 4594390 4479881 4101154
14470D101154J06381M00734J69231k51384l1333K14757q652Q3422J54663K10613
$$ 4101154 4207535 4608269 4777500 4526116 4494783 4709540 4700888 4784310 4938973 5149586
14460E149586K14020n35157L74564o9441J70693J57276J54697p7678j84265R7843
$$ 5149586 5363606 4828449 5203013 5133572 5304265 5461541 5616238 5538560 5354295 5452138
14450E452138j82024N62640J16935k74002K45914J85253K08616m43573K81915
$$ 5452138 5270114 5832754 5949689 5675687 5921601 6106854 6315470 5871897 6153812
14441F153812K37047r7946L5828M32621l3515q4090J65063L45374l03864K02604
$$ 6153812 6390859 6292913 6328741 6761362 6727847 6643757 6808820 7154194 6850330 7052934
14431G052934M76399l50864J59917K12105o2551L74985k58092K40025o3187J44451
$$ 7052934 7529333 7178469 7338386 7550491 7487940 7862925 7604833 7844858 7781671 7926122
14421G926122l3037K82895O8719K00196J12275J19720N54362q0297k60705J21876
$$ 7926122 7893085 8175980 8244699 8444895 8557170 8676890 9231252 9150955 8890250 9012126
14411I012126K10118L62500j7753L37173P5861N1834J25805J58458L80809j67109
$$ 9012126 9222244 9584744 9566991 9904164 9980025 10031859 10157664 10316122 10696931 10529822
14401A0529822K05407N51540k08347K46408R8440M15707O7477J05361J04671M79448
$$ 10529822 10735229 11286769 11078422 11324830 11423270 11838977 11906454 12011815 12116486 12595934
14391A2595934p2851N94140j47927J01621J82221J58608M63134K69623K76828
$$ 12595934 12523083 13117223 12969296 13070917 13253138 13411746 13874880 14144503 14421331
14382A4421331L70409J71278N59135l37984N39992M18138L10917J88686Q0546
$$ 14421331 14791740 14963018 15522153 15184169 15724161 16142299 16453216 16641902 16722448
14373A6722448L69327N81678L56146J55093M43212N42864J47667M25662K18040
$$ 16722448 17091775 17673453 18029599 18184692 18627904 19170768 19318435 19744097 19962137
14364A9962137K33270J156415p5967N99127M67919O80069L13101N54044P51090
$$ 19962137 20195407 21351822 21275855 21874982 22342901 23022970 23336071 23890115 24641205
14355B4641205O86271N62544L72205Q01875N58948N98115P08537P01540Q69507
$$ 24641205 25327476 25890020 26262225 27064100 27623048 28221163 28929700 29631240 30500747
14346C0500747O21103J075081N46127P50386J183213O26210J262057Q55154R95800
$$ 30500747 31121850 32196931 32743058 33493444 34676657 35302867 36564924 37420078 38415878
14337C8415878Q65828J210002J221945J457879J377005J040376J662678J183170
$$ 38415878 39281706 40491708 41713653 43171532 44548537 45588913 47251591 48434761
14329D8434761J823452J368905J368994K084560J606037J733628J895588K278757
$$ 48434761 50258213 51627118 52996112 55080672 56686709 58420337 60315925 62594682
14321F2594682K086993K302579K043451K683774K529530L051278K865157L124747
$$ 62594682 64681675 66984254 69027705 71711479 74241009 77292287 80157444 83282191
14313H3282191K666311L703311L354152M010167M111886M015471M554452M858360
$$ 83282191 85948502 89651813 93005965 97016132 101128018 105143489 109697941 114556301
14305A14556301N104243N101632N759245N789034O549322O500304O731036P948416
$$ 114556301 119660544 124762176 130521421 136310455 142859777 149360081 156091117 164039533
14297A64039533P721473Q688001Q731272R358522R939006J0760049J0503788J1697545
$$ 164039533 171761006 180449007 189180279 198538801 208477807 219237856 229741644 241439189
14289B41439189J2179460J2676412J3561891J3767447J4288472J4675044J4756525
$$ 241439189 253618649 266295061 279856952 293624399 307912871 322587915 337344440
14282C37344440J5261856J5114539J5065430J4521496J4153710J3564916J1964087
$$ 337344440 352606296 367720835 382786265 397307761 411461471 425026387 436990474
14275D36990474J0849024R040217O072064K673752M49149n42751n17714j616338
$$ 436990474 447839498 456879715 462951779 465625531 466074680 465531929 465014215 463397877
14267D63397877m631053o150046q135531r857907j0907206j2145437j3570650
$$ 463397877 458766824 452616778 444481247 434623340 423716134 411570697 398000047
14260C98000047j4555870j5352552j5729332j5151713j5086087j5216497j4502437
$$ 398000047 383444177 368091625 352362293 337210580 322124493 306907996 292405559
14253B92405559j4255183j3756803j0593126j2574760j1772063j1035402j1348225
$$ 292405559 278150376 264393573 253800447 241225687 229453624 218418222 207069997
14246B07069997r734916r455237q554449q474280p942171p685666o986461o537930
$$ 207069997 197335081 187879844 179325395 170851115 162908944 155223278 148236817 141698887
14238A41698887o421630n189225n838793n588246m724694m870634m464099l967834
$$ 141698887 135277257 130088032 124249239 118660993 113936299 109065665 104601566 100633732
14230A00633732l924302l984067l646432l315716l049021l365204l114981k695691
$$ 100633732 96709430 92725363 89078931 85763215 82714194 79348990 76234009 73538318
14222G3538318k287474k504391k118612k308250k248267k062697j988445j964034
$$ 73538318 71250844 68746453 66627841 64319591 62071324 60008627 58020182 56056148
14214E6056148j354078j334989j792150k008046j694608j148259j171346p95972
$$ 56056148 54702070 53367081 51574931 49566885 47872277 46724018 45552672 44756700
14206D4756700j081932j552012j409128j746971n53982j027194k33270j210690
$$ 44756700 43674768 42122756 40713628 38966657 38412675 37385481 37152211 35941521
14198C5941521j398357q95439j127234l41633p18778q21297p27247o98551r88382
$$ 35941521 34543164 33647725 32520491 32178858 31460080 30638783 29911536 29212985 28224603
14189B8224603m00409q95036n04221p16330p64753J48716r36958n86255o28851
$$ 28224603 27824194 26929158 26424937 25708607 24943854 25092570 24155612 23569357 22940506
14180B2940506l75781n01659m63315j66481p32393m14776k70506m42018k14169
$$ 22940506 22564725 22063066 21599751 21433270 20700877 20286101 20015595 19573577 19359408
14171A9359408o24862l78621j66045l94750K210q40888n39894K58344n17492p10657
$$ 19359408 18734546 18355925 18189880 17795130 17797340 16956452 16416558 16674902 16157410 15446753
14161A5446753J50753l02545K3901m52436n54274j00096L0455m29955l67851k19676
$$ 15446753 15597506 15294961 15318862 14866426 14312152 14212056 14242511 13812556 13444705 13225029
14151A3225029j60208l7482n22592r5470J43621m99053p5482q3488k30059r7868
$$ 13225029 13064821 13027339 12504747 12409277 12552898 12053845 11978363 11894875 11664816 11566948
14141A1566948o84632J35531j65781l33443j5543l7332n91976M26127l46513q1685
$$ 11566948 10882316 11017847 10852066 10518623 10503080 10465748 9873772 10299899 9953386 9871701
14131I871701l46449R2006k45393P038m0128l301o64567J27512l60317M7755p1508
$$ 9871701 9525252 9617258 9371865 9378903 9338775 9335474 8670907 8798419 8438102 8485857 8414349
14120H414349k75398J97201k16089k49518k3620M1811n11163j10244p6655N8715
$$ 8414349 8138951 8336152 8120063 7870545 7846925 7888736 7377573 7267329 7190674 7249389
14110G249389j1441k32485K83682m01439q0252k39796R7878m2245j94500r4201
$$ 7249389 7237948 7005463 7289145 6887706 6807454 6567658 6665536 6623291 6428791 6334590
14100F334590O4275j40626l30329K78164j86746Q293j89612p9337j19031N3038
$$ 6334590 6398865 6258239 5927910 6206074 6019328 6027621 5838009 5758672 5639641 5692679
14090E692679R6899l24679J38830k12593N3370j97300j01372K41571J9598m36750
$$ 5692679 5789578 5464899 5603729 5391136 5444506 5247206 5145834 5387405 5407003 4970253
14080D970253O9750K9265J1625q12l17417p1736M4791J14496k86787o2706N8600
$$ 4970253 5040003 5069268 5080893 5080081 4762664 4690928 4735719 4850215 4563428 4500722 4559322
14069D559322j38379n9421K08595k32514L56490l44689K6504l89628K57926j24712
$$ 4559322 4420943 4361522 4570117 4337603 4694093 4349404 4375908 3986280 4244206 4119494
14059D119494j26194q0713K5082L23382l32974j54565K01545l98074M75265k19614
$$ 4119494 3993300 3912587 3937669 4261051 3928077 3773512 3975057 3576983 4052248 3832634
14049C832634O5425p4760k83392r8875J09583j70476J77589J01239k01653j05675
$$ 3832634 3898059 3823299 3539907 3441032 3550615 3380139 3557728 3658967 3457314 3351639
14039C351639k35525m8904K61788j95524J46365j48843K95463l50554J70748j32683
$$ 3351639 3116114 3067210 3328998 3133474 3279839 3130996 3426459 3075905 3246653 3113970
14029C113970K21392k52648o5292N0900j8930k77397K84597o31302M33406m05947
$$ 3113970 3335362 3082714 3017422 3068322 3049392 2771995 3056592 2425290 2858696 2452749
14019B452749K67526m2405M05664o07405J38858J16665j00102p2404J21055l51391
$$ 2452749 2720275 2677870 3083534 2476129 2614987 2731652 2631550 2559146 2680201 2328810
14009B328810L67434l66590N4106J02830j61304K33011j84302J91770r5135n49682
$$ 2328810 2696244 2329654 2383760 2486590 2325286 2558297 2373995 2565765 2470630 1920948
13999A920948K75489l1168j0512R2042J86260m5597n6004l08995K30142K25160
$$ 1920948 2196437 2165269 2154757 2246799 2433059 2387462 2331458 2022463 2252605 2477765
13989B477765R91010K288074O004400J5097790K0030351j4479376j6130852p023401
$$ 2477765 3468775 5756849 11761249 26859039 46889390 32410014 16279162 9255761
13981I255761k484902r21939j121785j050850q8207O961l41121k01586j48255
$$ 9255761 6770859 5848920 4727135 3676285 3588078 3595039 3253918 3052332 2904077
13972B904077j04272J10972k67503j61696J6980R5573N3135k49696j35742K67624
$$ 2904077 2799805 2910777 2643274 2481578 2498558 2594131 2647266 2397570 2261828 2529452
13962B529452m7804k14381M4073J50367Q885k53877o2046o9742k17273J44612
$$ 2529452 2481648 2267267 2311340 2461707 2470592 2216715 2154669 2084927 1867654 2012266
13952B012266L10565j46574j38935l6591j44341P6665m9657k28523J73446L1577
$$ 2012266 2322831 2176257 2037322 2000731 1856390 1933055 1883398 1654875 1828321 1859898
13942A859898K35751k53899l53363N79838k49839K24706m15206L11423o4656j02073
$$ 1859898 2095649 1841750 1488387 2068225 1818386 2043092 1627886 1939309 1874653 1772580
13932A772580K06023n0266k11253J32384k71095J0010K78588p4903J85018m40459
$$ 1772580 1978603 1928337 1717084 1849468 1578373 1588383 1866971 1792068 1977086 1536627
13922A536627J56522l14820M60584j95869K00728l08782J06668j02196k02384
$$ 1536627 1693149 1378329 1838913 1643044 1843772 1534990 1641658 1539462 1337078
13913A337078K57267J66735k38148j79748K45455R0383n8606j34972K0362R161
$$ 1337078 1594345 1761080 1522932 1343184 1588639 1679022 1620416 1485444 1505806 1514967
13903A514967N38373n27683Q0262l17320M07867k95814r8773N5667J73837m65497
$$ 1514967 2053340 1525657 1605919 1288599 1696466 1400652 1301879 1357546 1531383 1065886
13893A065886M15430k08471m4828J08566m5495l1930l8005N11262n19150J16760
$$ 1065886 1481316 1272845 1228017 1336583 1291088 1259158 1221153 1732415 1213265 1330025
13883A330025r9906k00974m4893K04726L05530l33406l79l0783j1837K67046k32499
$$ 1330025 1230119 1029145 984252 1188978 1494508 1161102 1160723 1129940 1118103 1385149 1152650
13872A152650p7775j64460K00329r3056n1570J66391O1729j17245l0605K18352
$$ 1152650 1074875 910415 1110744 1017688 966118 1132509 1194238 1076993 1046388 1264740
13862A264740k10284l5223N7469Q949k08910K04152O3779K72189l68268k59171
$$ 1264740 1054456 1019233 1076702 1085651 876741 1080893 1144672 1416861 1048593 789422
13852G89422K95481N2165K65210l18756j53900n1449j37291L42917J3856k0775
$$ 789422 1084903 1137068 1402278 1083522 929622 878173 740882 1083799 1097655 1076880
13842A076880O4606M1980q5183K10013k19658k89480J23165J07681K2555j87797
$$ 1076880 1141486 1183466 1098283 1308296 1088638 799158 922323 1030004 1052559 864762
13832H64762K78555J7270L4710m37004M1628J01224l1670p4350L49208j01394
$$ 864762 1143317 1160587 1195297 758293 799921 901145 869475 795125 1144333 1042939
13822A042939R8578l33143n2080M10505k63777J08249k24159M09817m13041J2450
$$ 1042939 1141517 808374 756294 1166799 903022 1011271 787112 1196929 783888 796338
13812G96338M10820J14536n93732K24594j21925k21230L52208m9804r0347L3534
$$ 796338 1207158 1321694 727962 952556 830631 609401 961609 911805 821458 854992
13802H54992j78787n5640K08707q0853K7306O7967k07765J27754n63K77309l20408
$$ 854992 676205 620565 829272 748419 775725 843692 635927 763681 763118 1040427 720019
13791G20019L26809n06126K52747j25841M6642N8020J68467B73655O20467j25804
$$ 720019 1046828 540702 793449 667608 714250 772270 940737 273655 894122 768318
13781G68318j64873K43252j95520L96206j02892l17592P9533R9478m7042j51775
$$ 768318 603445 846697 651177 1047383 944491 626899 706432 805910 758868 607093
13771F07093L44046l95069q32J92107q593J18802k82384j934L28339l66120K21208
$$ 607093 951139 556070 555238 747345 738752 857554 575170 573236 901575 535455 756663
13760G56663p6448J6545j02451K43266C80893L11364n6286J64559k50296K59365
$$ 756663 680215 696760 594309 837575 380893 692257 635971 800530 550234 809599
13750H09599N0433J70885D91222K58030j37801K9736j37036K49439j22376j1567
$$ 809599 860032 1030917 491222 749252 611451 641187 504151 753590 631214 619647
13740F19647J31371j83205L19851j90162N6687l05517K24926j69337Q2104K3496
$$ 619647 751018 567813 887664 697502 754189 448672 673598 504261 586365 609861
13730F09861k1447j83274J57372M5516J44711k77676p1541L65753J46610m56844
$$ 609861 588414 405140 562512 608028 752739 475063 403522 769275 915885 459041
13720D59041R7649J2837L67586j59142k05867j24077j06096M39697k61257J25574
$$ 459041 556690 569527 937113 777971 572104 448027 341931 781628 520371 645945
13710F45945m4490O0576k6983n9858j3551J74550l17076m8905L1632J80396j29082
$$ 645945 601455 662031 635048 575190 561639 736189 419113 370208 401840 582236 453154
13699D53154P116l029j21622L36976C30184M85268m02344J69421J15501M8423
$$ 453154 460270 457241 335619 672595 330184 815452 413108 582529 698030 746453
13689G46453k20508B17983L28955k25952J73724j10536P1810j19245M80658j43924
$$ 746453 525945 217983 546938 320986 494710 384174 455984 336739 817397 673473
13679F73473l9670J21830r6916k58413K68810j81737A59530N98078C43185J04832
$$ 673473 633803 755633 658717 400304 669114 487377 159530 757608 343185 448017
13669D48017m900K5267P5128j70608J96138j81605L74040B03911K34209J5180
$$ 448017 443117 468384 543512 372904 569042 387437 761477 203911 438120 453300
13659D53300G7179M28067L8507B57693K94348k68433J57136j8559J33176M3481
$$ 453300 77179 505246 543753 257693 552041 283608 440744 422185 555361 598842
13649E98842p8790B04321K1519k45K36564k6044Q8358D9001P26651C09222L20964
$$ 598842 520052 204321 225840 225595 462159 436115 524473 49001 775652 309222 630186
13638F30186k89553Q4394l6529N7078N9570k34286J95388J36886j88364j16581
$$ 630186 340633 425027 388498 445576 505146 270860 466248 603134 414770 298189
13628B98189q3743J08238J25182J60822J57541C65168R7112A01068M64266j77100
$$ 298189 214446 322684 447866 608688 766229 365168 462280 101068 565334 388234
13618C88234k0664l5368J66024E0296K31237n0287M07695B49233K64975R55k15183
$$ 388234 367570 332202 498226 50296 281533 231246 638941 249233 514208 515163 299980
13607B99980M03599B35435J21571j29710Q5714K17118p4376k01875j10939o0876
$$ 299980 703579 235435 357006 227296 313010 530128 455752 253877 142938 82062
13597H2062M91274m9211j34293H266M92865P1961k59360j19187J23304J39981
$$ 82062 573336 524125 389832 8266 501131 573092 313732 194545 317849 457830
13587D57830j81515H8111L13786R8295j07866j28767L9458A15273P8246k0733
$$ 457830 276315 88111 401897 500192 392326 263559 303017 115273 193519 172786
13577A72786J35002M18832A99302J36954M220J08125k09711H1307J02881j9596
$$ 172786 307788 726620 199302 336256 340476 448601 238890 81307 184188 164592
13567A64592P3803L4742Q9949I7710J5746R2896J44178K89422B38230R2521j29319
$$ 164592 238395 273137 363086 97710 113456 206352 350530 639952 238230 330751 201432
13556B01432r7327J99356j35346M6457m796g8224A98826K80526p6818K03442A78808
$$ 201432 104105 303461 168115 214572 209776 -78224 198826 479352 402534 605976 178808
13544B65617j0690j7511n7839L88469k23540c4705A23922J42035m4596J64485
$$ 265617 254927 237416 179577 568046 344506 -34705 123922 265957 221361 385846
13534C85846K15569A46507J95681C2310M97238k58125H585L51711Q57g6873C03925
$$ 385846 601415 146507 342188 32310 529548 271423 8585 360296 361153 -76873 303925
13522B20546J70885L14387a6148C22284J05643q6209J26705r5377K90713l15347
$$ 220546 391431 705818 -16148 322284 427927 341718 468423 373046 663759 348412
13512C48412l2824J30308J791A73374K47054A45442F8331k8766L27013B1259K45167
$$ 348412 315588 445896 447687 173374 420428 145442 68331 39565 366578 21259 266426
13501B66426P1751J08960o4884B8883L15453I527L22341j63804n7375M66464B01075
$$ 266426 338177 447137 382253 28883 344336 9527 331868 168064 110689 577153 201075
13489D42728j5165E661M70804j81288k6705N946D2038J14812B3303d1241A30614
$$ 442728 427563 5661 476465 295177 268472 274418 42038 156850 23303 -41241 130614
13477B41959j4922A07903L04849A91979K15001M1704A12268L93687k26388l9289
$$ 241959 227037 107903 412752 191979 406980 448684 112268 505955 279567 240278
13467B40278N4085l9238j01923J64557A53146K44319k9576j981r3453C1502N29975
$$ 240278 294363 255125 153202 317759 153146 397465 367889 365908 272455 31502 561477
13456E61477A69544M188f3941D55107j16654L8118J35477j95652n0893J6289n6629
$$ 561477 169544 173732 -63941 455107 338453 376571 512048 316396 265503 281792 225163
13445B25163K0739n9808J406L03576B06451N5323j17894L55293B23562k8561A1938
$$ 225163 245902 186094 187500 491076 206451 261774 143880 499173 223562 195001 11938
13433A29221d4145C66873b0196G2856L22983j67157H4394K48766A8643M22648
$$ 129221 -44145 366873 -20196 72856 395839 228682 84394 333160 18643 441291
13423D41291q9440A00043J66360A08657l0413N40466k79639j10796l3933g962
$$ 441291 351851 100043 266403 108657 78244 618710 339071 228275 194342 -7962
13412A75935J71593K17527k47518j46198KL6848a7054j76177D2712L5499K21601
$$ 175935 347528 565055 317537 171339 171341 208189 -17054 -193231 42712 78211 299812
13401B99812a47105D62733j37360B4587g0000A13900J93391Q5418j72986J67000
$$ 299812 -147105 462733 325373 24587 -70000 113900 307291 392709 219723 386723
13391C86723a15368B85507q2781b7180H1424J72411j978r7071J08248A06380K32035
$$ 386723 -115368 285507 202726 -27180 81424 253835 251857 154786 263034 106380 338415
13380C38415A64778K3100J52836C1202J25881K12372L7751j22536j17550R4706
$$ 338415 164778 187878 340714 31202 157083 369455 407206 284670 167120 261826
13370B61826K34107k10160I6286J99812N063I6432a31110G702K79231m9185L36318
$$ 261826 495933 285773 96286 296098 301161 96432 -131110 7702 286933 237748 574066
13359E74066k18358M2396G9382l3026J71206q483n2708L50566B09046j66R064
$$ 574066 355708 398104 79382 46356 217562 209079 156371 506937 209046 208880 217944
13348B17944l661J50437j68616L86135H6354L00986n1593H3429M1865J00350p5345
$$ 217944 214283 364720 196104 582239 86354 387340 335747 83429 125294 225644 150299
13337A50299K29761q9705A28081N38808A90600K01326A63849j2458K34505A06964
$$ 150299 380060 290355 128081 666889 190600 391926 163849 151391 385896 106964
13326C61476j53520M4807E5250J42189K47820j04229J23510B15930f3777B06557
$$ 361476 207956 252763 55250 197439 445259 341030 464540 215930 -63777 206557
13315F0395L28035j26582a08903B88996c4897A44783K88910A80730m8713o3414
$$ 60395 388430 261848 -108903 288996 -34897 144783 433693 180730 132017 68603
13305F8603J06340K60840a24919A11666L20830A18686b0924q2341A28020a14164
$$ 68603 174943 435783 -124919 111666 432496 118686 -20924 -103265 128020 -114164
13294A44442m4966b36976A89592J072J3884r7760m9528k8131c0526r1411B30864
$$ 144442 99476 -236976 189592 190664 204548 106788 57260 29129 -30526 -121937 230864
13282C93312M0111m5144a15521H6983K86401F1004a08775I3777A4562J20795e6597
$$ 393312 433423 388279 -115521 86983 373384 61004 -108775 93777 14562 135357 -56597
13270c6072I8968J76128p6624p3503m9171a53613A70861f7280H9034B5235K9810
$$ -36072 98968 275096 198472 124969 75798 -153613 170861 -67280 89034 25235 55045
13259E5045J93507h1490C5633K6546L2846R3271E5024N9384c8518C11304h1817
$$ 55045 248552 -81490 35633 62179 95025 188296 55024 114408 -38518 311304 -81817
13247D15961A02486D613Q835K58648E8678h42A72773k8800b3351B98951b36908
$$ 415961 102486 4613 13448 272096 58678 -842 172773 143973 -23351 298951 -236908
13235D1569k653O8084J30852g0114b5595j51768B02097G521M57295k24832F6090
$$ 41569 38916 107000 237852 -70114 -25595 -177363 202097 7521 464816 239984 66090
13223A52865c64727B97893h0182A68763g3124k4881A76475H2713L0492K77692
$$ 152865 -364727 297893 -80182 168763 -73124 -98005 176475 82713 113205 390897
13213C90897A54645d7278A51387E8162R5448K164a47579A36055L1523C8430J16971
$$ 390897 154645 -47278 151387 58162 153610 155774 -147579 136055 167578 38430 155401
13202A55401F2198B100a37480A36309L7502j3118M3739a59224A48505Q6690j03644
$$ 155401 62198 2100 -137480 136309 173811 160693 204432 -159224 148505 235195 131551
13191A31551F0873a3991B24865O4452n4937H5959a291A43026g4441A12280M2537
$$ 131551 60873 -13991 224865 289317 234380 85959 -1291 143026 -74441 112280 154817
13180A54817J73518l6143H3905b9352A32403b6944A53561o8100K04275o65r0275
$$ 154817 328335 292192 83905 -29352 132403 -26944 153561 85461 289736 289071 198796
13169A98796F8092a38957r5080G7571Q287P929P9462L3979A9474a44475A95997
$$ 198796 68092 -138957 -234037 77571 85858 93787 173249 207228 19474 -144475 195997
13157A21455L23876A14917K80924A76803l7922M6073l4422k2468J39075p8227
$$ 121455 445331 114917 395841 176803 138881 184954 150532 128064 267139 188912
13147A88912L58826f4250B39453A09745J86202a23645B41964A01878K61901D7015
$$ 188912 547738 -64250 239453 109745 295947 -123645 241964 101878 363779 47015
13136b23861h9619C99837H9703i5252j01805D39668D8308Q9076c5423A37698R2075
$$ -223861 -89619 399837 89703 -95252 -197057 439668 48308 137384 -35423 137698 229773
13125B29773b5341A14917J53655J15813j35503J00482o7768Q8871g5390k31508
$$ 229773 -25341 114917 268572 384385 248882 349364 281596 370467 -75390 -306898
13115c06898A51145R5952g3748H3738b09988A46411a06935A93285k608G4961c29625
$$ -306898 151145 247097 -73748 83738 -209988 146411 -106935 193285 190677 74961 -329625
13103a06836H8890J91960O8991j68939C7932g2068F5197i3383j60798A24082Q0300
$$ -106836 88890 280850 349841 180902 37932 -72068 65197 -93383 -254181 124082 204382
13092B04382a15109A47151M22093a18113A64042l7832D1362J10138D6535c646
$$ 204382 -115109 147151 569244 -118113 164042 126210 41362 151500 46535 -3646
13081c5359F0514a390A74594d4897j60017e8563B65799f1631q1841C4027J7261
$$ -35359 60514 -1390 174594 -44897 -204914 -58563 265799 -61631 -143472 34027 51288
13070E1288K16740c7306B10405a15674c8024m1653A90936I5117L0802a86262C09787
$$ 51288 268028 -37306 210405 -115674 -38024 -79677 190936 95117 125919 -186262 309787
13058B95187p2811j05098l3883F019a94254N020C2182a87646A30689a1771B52680
$$ 295187 222376 117278 83395 6019 -194254 -189234 32182 -187646 130689 -11771 252680
13046d2906C14597a46554C5638M41678B1489a06976A41794P4406L43060i2401
$$ -42906 314597 -146554 35638 477316 21489 -106976 141794 216200 559260 -92401
13035C62628I2482c7936D6617K67704g9667B3444R8245k4666K0952b6629A97877
$$ 362628 92482 -37936 46617 314321 -79667 23444 121689 97023 117975 -26629 197877
13023A2623f8474R45F5471P477J0291i608p1896D0362L0855a87420f3884G5545
$$ 12623 -68474 -67529 65471 72948 83239 -9608 -81504 40362 71217 -187420 -63884 75545
13010A30162M4119K0431a50601d7005A71940G8793a25615C56207p0082c1949A04027
$$ 130162 174281 194712 -150601 -47005 171940 78793 -125615 356207 286125 -31949 104027
12998b797B14659b59581d0731j66162A45985E846K41317M2267c024G2403c27123
$$ -2797 214659 -259581 -40731 -206893 145985 5846 247163 289430 -3024 72403 -327123
12986D6465r086K6879K52693A57547a01436b8326A47442K88843G0098N1062b30306
$$ 46465 37379 64258 316951 157547 -101436 -28326 147442 436285 70098 121160 -230306
12974c51411i4015H530a76096m6029b8749o1705j20725A39682J17142a11998A25317
$$ -351411 -94015 8530 -176096 -222125 -28749 -90454 -211179 139682 256824 -111998 125317
12962A65833F3634e438j75895B57052R5047a80446F6891a19865j13751H8140g0950
$$ 165833 63634 -5438 -181333 257052 352099 -180446 66891 -119865 -233616 88140 -70950
12950c9872A58886e6415A76674G0247e8530B41804C0012a31736A25474L0617b91574
$$ -39872 158886 -56415 176674 70247 -58530 241804 30012 -131736 125474 156091 -291574
12938d7202G3346J44201f5376o5244k98342A24924l9804B3811L14665j50829a58956
$$ -47202 73346 217547 -65376 -130620 -428962 124924 85120 23811 338476 187647 -158956
12926A20796g3342k02643d122A74686a69881F3920e0800A72703L2373a3364p68
$$ 120796 -73342 -275985 -4122 174686 -169881 63920 -50800 172703 205076 -13364 -14132
12915a4132I9709J41117m3397b01340P2031A40142J1809N0100J47879a71967k8386
$$ -14132 99709 240826 197429 -201340 -129309 140142 151951 202051 349930 -171967 -200353
12904b00353k0343A71885h4434d1722m7104j53687D30021A93719b44715P1701
$$ -200353 -220696 171885 -84434 -41722 -88826 -242513 430021 193719 -244715 -173014
12894a73014E5659N4333c2872B68301c0944A49200O9777b35590B47134q2F2819
$$ -173014 55659 109992 -32872 268301 -30944 149200 218977 -235590 247134 247052 62819
12882B62130a04447L7207B49202o8865a0340k8803I418h2988j7310B19767a96065
$$ 262130 -104447 -67240 249202 180337 -10340 -39143 9418 -82988 -100298 219767 -196065
12870b69781p5569A48220A3278a80453B34641k0979B9007A2960a38042F6736b9716
$$ -269781 -345350 148220 13278 -180453 234641 213662 29007 12960 -138042 66736 -29716
12858A74037J01112n4198L8123b00463A09057L69849j37366e0217A71091O3615
$$ 174037 275149 220951 259074 -200463 109057 478906 341540 -50217 171091 234706
12848B34706b01646D475L5222R6976J8467C1434J84622Q5971j09878q0569p144
$$ 234706 -201646 4475 39697 136673 155140 31434 216056 302027 192149 111580 104436
12837A04436J38395B3926J41431h4277D0134a01318C98897D5292J26916i317C25974
$$ 104436 242831 23926 165357 -84277 40134 -101318 398897 45292 172208 -9317 325974
12825F3182a36701A87395A8033f2897e70j2403C8770J23519C8457M6594b00005
$$ 63182 -136701 187395 18033 -62897 -570 -12973 38770 162289 38457 85051 -200005
12813I7698b45398F812K02267K28616A54172j1514j0701o3922c03964B58677p5981
$$ 97698 -245398 6812 209079 437695 154172 142658 131957 68035 -303964 258677 182696
12802A82696N1117K6348o2851h5896F3456C1479J15292a12418o7226b5081C5821
$$ 182696 233813 260161 197310 -85896 63456 31479 146771 -112418 -179644 -25081 35821
12790g4330A54853A8405b31680A40335A1434J16082B0586b09881C60701n1810
$$ -74330 154853 18405 -231680 140335 11434 127516 20586 -209881 360701 308891
12780C08891e5690A56379i5503C70776a85496B02993a05835m07919A93452b7200
$$ 308891 -55690 156379 -95503 370776 -185496 202993 -105835 -513754 193452 -27200
12769d8189A62167a30248j3069H9873J83624I8173R5707g5015B9749j3249a03342
$$ -48189 162167 -130248 -143317 89873 273497 98173 193880 -75015 29749 16500 -103342
12757a80754B80272b62696d0401B02402A00699J51560I3001k2289L09374b3687
$$ -180754 280272 -262696 -40401 202402 100699 252259 93001 70712 380086 -23687
12746B03832N8679a77278F7447a36405O1570k47216A2806d0264k41425c7065m6520
$$ 203832 262511 -177278 67447 -136405 -74835 -322051 12806 -40264 -281689 -37065 -83585
12735h3585A30804M0427c5679k21709Q5304J502A40785E4162i5847r6519D1986
$$ -83585 130804 171231 -35679 -257388 -172084 -170582 140785 54162 -95847 -192366 41986
12723a6746D5399J525b6273k19799E456a37991M0214j49766R4710L4135A32237
$$ -16746 45399 46924 -26273 -246072 5456 -137991 -97777 -247543 -152833 -118698 132237
12711B19930a93362j81075J23746c0052B24371P1209d3205I8992a48793B48730
$$ 219930 -193362 -374437 -250691 -30052 224371 295580 -43205 98992 -148793 248730
12700E442L15338a3249B51455a51420M8725E2657k5549J32226o7827J185Q7184
$$ 5442 320780 -13249 251455 -151420 -102695 52657 27108 159334 91507 92692 179876
12689A79876f534B0357c98716f5291j71060C43846G2164b56235B8271i5447C3866
$$ 179876 -6534 20357 -398716 -65291 -236351 343846 72164 -256235 28271 -95447 33866
12677c19606b8331B95310b073j20493B33907e50j21051A78740J76833a6971E5016
$$ -319606 -28331 295310 -2073 -122566 233907 -550 -121601 178740 355573 -16971 55016
12665c10292A28120L0541K7556J93773a23970D26562b57317A27657k697Q9941
$$ -310292 128120 158661 186217 379990 -123970 426562 -257317 127657 124960 214901
12655B14901a30214a1283A26J82542g3898O683D8861J410J27371G5713J79848
$$ 214901 -130214 -11283 126 182668 -73898 -67215 48861 50271 177642 75713 255561
12644B55561L1052d4715k0975A10938C0711J57122q0937C9952i3749A06076K01198
$$ 255561 286613 -44715 -65690 110938 30711 187833 106896 39952 -93749 106076 307274
12633C07274d8138C07445b82811B2449c0683F36683B81903O0621K9511A59774
$$ 307274 -48138 307445 -282811 22449 -30683 636683 281903 342524 372035 159774
12622D04568A63705m2042k8754P2094P5940m5806a16483b2921j71111A74275p6612
$$ 404568 163705 121663 92909 165003 240943 195137 -116483 -22921 -194032 174275 97663
12611I7663a9191k6085B50739b36475g8485B0194K54064a69606Q4403H5843J7889
$$ 97663 -19191 -45276 250739 -236475 -78485 20194 274258 -169606 -85203 85843 103732
12600A03732J38051k1060r5200l0408a39216B31282a7957k8709b0175r2950A67883
$$ 103732 241783 220723 125523 95115 -139216 231282 -17957 -46666 -20175 -113125 167883
12588C92588a5872A14861k1673J9174M0750e167k85673A48140C6870J90537q0345
$$ 392588 -15872 114861 93188 112362 153112 -5167 -290840 148140 36870 227407 147062
12577A47062a08732D152a84516c0235B68230H9102a78626A34517Q3489K43611
$$ 147062 -108732 4152 -184516 -30235 268230 89102 -178626 134517 218006 461617
12567D61617I4048p952h5741p0175D9554f4120B13656a19161M9026A19904R7954
$$ 461617 94048 86096 -85741 -155916 49554 -64120 213656 -119161 -70135 119904 217858
12556B17858B4054f5560D46795A39721L9029A956i8712B11763d0538p9123N3634
$$ 217858 24054 -65560 446795 139721 178750 1956 -98712 211763 -40538 -119661 -66027
12545f6027j09377A76711J97887j14142c3135H4830J37830a17998b669o5134D117
$$ -66027 -175404 176711 374598 260456 -33135 84830 222660 -117998 -2669 -67803 4117
12533A26118J03430b43479B2784J486b66751A71704F4368N8665m0146m238C558
$$ 126118 229548 -243479 22784 24270 -266751 171704 64368 123033 82887 78649 3558
12521f3022C1843a23065b4454D7029Q2143K89719b3141j41923E7049J57774m2880
$$ -63022 31843 -123065 -24454 47029 129172 418891 -23141 -165064 57049 214823 171943
12510A71943P1771b5472A1774K1074a50543I7940K81687G8868A7055c5276a5103
$$ 171943 243714 -25472 11774 32848 -150543 97940 379627 78868 17055 -35276 -15103
12498A89028a81679A32937a63383E0781J21937g0499I8955d2401n0390j5982G2512
$$ 189028 -181679 132937 -163383 50781 172718 -70499 98955 -42401 -92791 -108773 72512
12486a1814D5634c5428j91141B48271f3322j21202L0722m736e0189F6380L815
$$ -11814 45634 -35428 -226569 248271 -63322 -184524 -153802 -158538 -50189 66380 70195
12475G0195f7530D4069J44487a4957A47967b61713a10752j89250F50b05086A45048
$$ 70195 -67530 44069 188556 -14957 147967 -261713 -110752 -300002 650 -205086 145048
12463f3065k84419A57653h2101A67097P035J27131j01080a65374g7109H7960I821
$$ -63065 -347484 157653 -82101 167097 174132 301263 200183 -165374 -77109 87960 9821
12451c3864r5018B4933a86815H9002B3838M40550b43248F7209P4990e1792a4169
$$ -33864 -128882 24933 -186815 89002 23838 464388 -243248 67209 142199 -51792 -14169
12439I5669m4122b68993A26198f8670k21530J08162A18424Q2282i6875K9315E2142
$$ 95669 51547 -268993 126198 -68670 -290200 -182038 118424 200706 -96875 -67560 52142
12427D996a60704B13051a73951M7751j9927j1944A43928a24274R712L8741G327
$$ 4996 -160704 213051 -173951 -126200 -146127 -158071 143928 -124274 -114562 -75821 7327
12415G1298c19909N1118H3754b33600D3295e815k6649j63539A89356P412g3989
$$ 71298 -319909 -268791 83754 -233600 43295 -5815 -32464 -196003 189356 196768 -73989
12403a42949D3170h8051j08044c0870B6194f4782G1470r394L59251E8349a43766
$$ -142949 43170 -88051 -196095 -30870 26194 -64782 71470 62076 421327 58349 -143766
12391c36589b2876E2581K01488o34j6778a18111r5118A72733C3174J11598a63475
$$ -336589 -22876 52581 254069 253435 236657 -118111 -213229 172733 33174 144772 -163475
12379D3399N0136a2606A76583c25204B5404K29287a79249m3452h3358j15413m175
$$ 43399 93535 -12606 176583 -325204 25404 254691 -179249 -222701 -83358 -198771 -202946
12368b02946C2988K37057D8296J12761a47789A65422b25567H1152l0950c73868
$$ -202946 32988 270045 48296 161057 -147789 165422 -225567 81152 50202 -373868
12357c8918k34957G0055e1539A31918k3968c18280E0423J44197a9534m010o9001
$$ -38918 -273875 70055 -51539 131918 107950 -318280 50423 194620 -19534 -23544 -92545
12346i2545I0081f419j31070b4647A16221c62797I8358L78126b4697j80124I7169
$$ -92545 90081 -6419 -137489 -24647 116221 -362797 98358 476484 -24697 -204821 97169
12334H3392J53691e7566J2005k4193I572e11751a34951j91592h4670A12537b15593
$$ 83392 237083 -57566 -45561 -69754 9572 -511751 -134951 -326543 -84670 112537 -215593
12322b4156B13254C5025C869R9692g9066H7062i5725B6467J42482e2588r9034
$$ -24156 213254 35025 3869 103561 -79066 87062 -95725 26467 168949 -52588 -151622
12311a51622A64470D4545a8189D704a42432g181B12451b7044E4552K57240j13262
$$ -151622 164470 44545 -18189 4704 -142432 -7181 212451 -27044 54552 311792 198530
12300A98530Q4889A1377g974B14866a11791j79553C71940d05587A86196i1876
$$ 198530 283419 11377 -7974 214866 -111791 -291344 371940 -405587 186196 -91876
12289D8114J3066a43328j00762A94126a10152P78L0747A87331c41331G347L0397
$$ 48114 61180 -143328 -244090 194126 -110152 -109374 -78627 187331 -341331 7347 37744
12278C7744K46659a88822P4293j1953F2927J93309D4940J58708b80631J37653
$$ 37744 284403 -188822 -114529 -126482 62927 256236 44940 203648 -280631 -142978
12268a42978B32103j06526E0783J63034C0305b27324I9101J4240m8457r163a78522
$$ -142978 232103 125577 50783 213817 30305 -227324 99101 113341 64884 55721 -178522
12256a69110A28969L6766F9306J05813a34138B21298m8534E954K35176M9963b18572
$$ -169110 128969 165735 69306 175119 -134138 221298 172764 5954 241130 291093 -218572
12244B51141N0799H5348J13247a8700C79908a24212J6679B54526A3409g7790B0017
$$ 251141 301940 85348 198595 -18700 379908 -124212 -107533 254526 13409 -77790 20017
12232G1241b01698D35609A8177Q8081J08298K9191M6251r6772I0002M51716A43396
$$ 71241 -201698 435609 18177 106258 214556 243747 289998 193226 90002 541718 143396
12220E63549E3405P6465J6178b08714C1263Q6798J67336m1792J2390a4874A59550
$$ 563549 53405 129870 146048 -208714 31263 118061 285397 243605 255995 -14874 159550
12208A43756M2786E5676E953a35708C21843E8577r428J81663j03134K59339G7322
$$ 143756 186542 55676 5953 -135708 321843 58577 49149 230812 127678 387017 77322
12196B12244C0254a36908A89694m5462l6757K10437m5979a01717E4915e0276B70840
$$ 212244 30254 -136908 189694 144232 107475 317912 271933 -101717 54915 -50276 270840
12184a15406l9426c803I2116R9114a45952B47502j7030G0457e3B37109D0632k274
$$ -115406 -154832 -3803 92116 191230 -145952 247502 230472 70457 -53 237109 40632 38358
12172C8358j2937J44958k9744B240L0266K5086Q1121K53704b6068j07716D6904
$$ 38358 25421 170379 140635 2240 32506 57592 138713 392417 -26068 -133784 46904
12160A81007H897J98113R3204b47266B66928H1172P7158f3796g721B5280g1565
$$ 181007 8897 207010 300214 -247266 266928 81172 158330 -63796 -7721 25280 -71565
12148A52697M4227b6059B24360B5564A448a20853j7082O8017G9762K64835a58682
$$ 152697 196924 -26059 224360 25564 1448 -120853 -137935 -69918 79762 344597 -158682
12136b5732k29913C11111A00297A8802i9883A42199k7146a96475f4662B18295
$$ -25732 -255645 311111 100297 18802 -99883 142199 115053 -196475 -64662 218295
12125A8078b41229H2722f2474B58094a10981C998i0042a6137C5265h2516A19240
$$ 18078 -241229 82722 -62474 258094 -110981 3998 -90042 -16137 35265 -82516 119240
12113C16377B0971J38576K39399j35933C0278e914j95460M1734B80827a65700
$$ 316377 20971 159547 398946 263013 30278 -5914 -201374 -159640 280827 -165700
12102g3981C17853j10792b6606C5713P4926b2198j42346B41881e8450D34947a02220
$$ -73981 317853 207061 -26606 35713 110639 -22198 -164544 241881 -58450 434947 -102220
12090D8272J44338a33851M9191B25882b6515B04380I9208c46551C20439C3220
$$ 48272 192610 -133851 -84660 225882 -26515 204380 99208 -346551 320439 33220
12079A10111J84866j37950a13866D5697g1146j44540C16875A12803a91105p3647
$$ 110111 294977 157027 -113866 45697 -71146 -215686 316875 112803 -191105 -264752
12069b64752A96616m5490B3358J14971a49575o441D5562b26621f6909j95202A53883
$$ -264752 196616 151126 23358 138329 -149575 -156016 45562 -226621 -66909 -262111 153883
12057g8326h163A02833K2031c84442A34622o6791J132212Q3156E08922B13343
$$ -78326 -8163 102833 124864 -384442 134622 67831 1200043 1283199 508922 213343
12046e0088C300c763A19969b08397A10960m1628g0190k40032B8324b25414A9498
$$ -50088 3300 -3763 119969 -208397 110960 69332 -70190 -310222 28324 -225414 19498
12034a47458k59793A45932D5302j3802o188J49499c78744e8065C11616A39498
$$ -147458 -407251 145932 45302 31500 25312 174811 -378744 -58065 311616 139498
12023A15778A0277K6820c14249J48616j8427L4356A28888j9147f5647A85798E435
$$ 115778 10277 37097 -314249 -165633 -184060 -149704 128888 109741 -65647 185798 5435
12011C21454b46490j74130B8595b24662A65743N0649l9649b23374A11647e7273
$$ 321454 -246490 -420620 28595 -224662 165743 216392 176743 -223374 111647 -57273
12000B669P8491c16352a7531k58816J3636J05856e4426c963B07621d1795k79130
$$ 2669 81160 -316352 -17531 -276347 -262711 -156855 -54426 -3963 207621 -41795 -320925
11989c20925K1819Q781f2939j10755D5799h4551o5428K3130A77780a07405B45382
$$ -320925 -299106 -290325 -62939 -173694 45799 -84551 -149979 -126849 177780 -107405 245382
11977G800a88941g3494e330B03882e8503R637A39968J56799d37903K12230H1149
$$ 7800 -188941 -73494 -5330 203882 -58503 -48866 139968 296767 -437903 -225673 81149
11965B55834j27536b20296b4662j45469B43629K9857c0053k0773C8728K90999
$$ 255834 128298 -220296 -24662 -170131 243629 273486 -30053 -50826 38728 329727
11955C29727h6110B56362b43898A38426i0735n1736M535d4988a562j00495l28956
$$ 329727 -86110 256362 -243898 138426 -90735 -142471 -137936 -44988 -1562 -102057 -431013
11944d31013B8353b70376B07813J19139a29785a4951E01061a03764A49814n2397
$$ -431013 28353 -270376 207813 326952 -129785 -14951 501061 -103764 149814 97417
11934I7417O2876d48619C0983b2368A13241E6561j4960J06413a44977B0043K44408
$$ 97417 160293 -448619 30983 -22368 113241 56561 41601 148014 -144977 20043 264451
11923B64451i542m3842l1227A53919b49982p2177e7574A9666L90593d8863b0014
$$ 264451 -9542 -53384 -84611 153919 -249982 -322159 -57574 19666 410259 -48863 -20014
11911b86349A28276L31228c71365a1355n2799m9288C01062A44176a67836a4210
$$ -286349 128276 459504 -371365 -11355 -64154 -113442 301062 144176 -167836 -14210
11900b84305i8880g89n8342B16937b074j31966D9059J1259n113J2902J34725a18163
$$ -284305 -98880 -789 -59131 216937 -2074 -134040 49059 60318 55205 68107 202832 -118163
11887a18821e0368q1493j41812G6393j8494d9267D8114a2072j03569b7620m0520
$$ -118821 -50368 -131861 -273673 76393 57899 -49267 48114 -12072 -115641 -27620 -68140
11876f8140B1961c6101B06725a22495l7987h112B6211a85805a511j51455k95051
$$ -68140 21961 -36101 206725 -122495 -160482 -8112 26211 -185805 -1511 -152966 -448017
11865d48017D2796b49936h638l54l35681J7011A48465c49017a19495E853K27202
$$ -448017 42796 -249936 -8638 -8992 -344673 -327662 148465 -349017 -119495 5853 233055
11854B33055e8787G153K9817P1510d81268i9067A33809a16130j28251a20299q8625
$$ 233055 -58787 7153 36970 108480 -481268 -99067 133809 -116130 -244381 -120299 -208924
11843b08924C84228f7640l44204F1602k5503J97930K32322d24768A43253j449
$$ -208924 384228 -67640 -411844 61602 36099 234029 466351 -424768 143253 141804
11833A41804c16112C6605b08184J03384j39548c4065j63798O4730B62512a73276
$$ 141804 -316112 36605 -208184 -104800 -244348 -34065 -197863 -133133 262512 -173276
11822b35807p0238A77803a93658j4643R0513D8824K83024b17139A94395a4943
$$ -235807 -306045 177803 -193658 -208301 -117788 48824 331848 -217139 194395 -14943
11811a63054a0675A81203q6004J06281a65519A90393A1635a21128j73006A09971
$$ -163054 -10675 181203 95199 201480 -165519 190393 11635 -121128 -294134 109971
11800d1862q6213b496D33526A36045K4519a74942L3436p737B55960B1508b27820
$$ -41862 -128075 -2496 433526 136045 160564 -174942 -141506 -149243 255960 21508 -227820
11788d15532R7282B39153d7232E9637B0972a71828B17609a13221H7864b16669
$$ -415532 -318250 239153 -47232 59637 20972 -171828 217609 -113221 87864 -216669
11777B7340J31391c23781A56998f0668n6219A1496c05610H2445L29443A3373J22295
$$ 27340 158731 -323781 156998 -60668 -116887 11496 -305610 82445 411888 13373 135668
11766A35668A9932c69187a06398j13913Q9804c7953a1707m58287A65151b8823
$$ 135668 19932 -369187 -106398 -220311 -130507 -37953 -11707 -469994 165151 -28823
11755d71305c8957m0013A90770E5143b72680K9637D1279J6136a05561j8156K338
$$ -471305 -38957 -78970 190770 55143 -272680 -243043 41279 57415 -105561 -123717 -121379
11744a21379E1428b04311g8317C0373a25062A12017C1506a63280A55747E7791
$$ -121379 51428 -204311 -78317 30373 -125062 112017 31506 -163280 155747 57791
11733a20443B50969j7266a27736M4784j60802A04666e3643A06671J7207R752a35426
$$ -120443 250969 233703 -127736 -82952 -243754 104666 -53643 106671 123878 133630 -135426
11721h3533k51223J06449N2809K4112H5642b2589k12908g017E1737c0469j7427
$$ -83533 -334756 -228307 -175498 -151386 85642 -22589 -235497 -7017 51737 -30469 -47896
11710d7896j63152Q2691B7383a50972B60649b1728j66035C10907a7005B09842
$$ -47896 -211048 -128357 27383 -150972 260649 -21728 -187763 310907 -17005 209842
11699a31636b0667j38720A0238J6888L893J4664a26710B9404R095j0442Q3006
$$ -131636 -20667 -159387 10238 27126 31019 45683 -126710 29404 38499 28057 111063
11688A11063C8734J34248f401n9008J1487j83941A14064n5199R5204b24589g345
$$ 111063 38734 172982 -6401 -65409 -53922 -237863 114064 58865 154069 -224589 -7345
11676B75212A9184a33780I6147N3503o9936R6532a71351r4731J18749q4346d9734
$$ 275212 19184 -133780 96147 149650 79714 176246 -171351 -266082 -147333 -231679 -49734
11664B28637j1548h6790E2334b56700b9333B4618a71771J6292A09945b91931a02312
$$ 228637 217089 -86790 52334 -256700 -29333 24618 -171771 -155479 109945 -291931 -102312
11652f6104j95081C71p1b26711B33761F8474a56596N6948A08905a11241b5135
$$ -66104 -261185 371 300 -226711 233761 68474 -156596 -99648 108905 -111241 -25135
11640e4608j81359A00836d15531B72062a24541N7411A20759K1017R530E6579b63
$$ -54608 -235967 100836 -415531 272062 -124541 -67130 120759 141776 151306 56579 -263
11628E8707c3601C88943e8714E9744Q7724k8234F134c53942J53597G1473A8128
$$ 58707 -33601 388943 -58714 59744 147468 119234 6134 -353942 -200345 71473 18128
11616G240N1718B8125b72630A49807a23433A68291p7146a50699D6152J84990h329
$$ 7240 58958 28125 -272630 149807 -123433 168291 91145 -150699 46152 231142 -8329
11604A33562E962P9128J58658L2364d8354m1549A13342a54228C73574j33988n7278
$$ 133562 5962 85090 243748 276112 -48354 -89903 113342 -154228 373574 239586 182308
11593A82308a45719A79203a32723k08565R9823H2348Q1216p4259b11981j2370
$$ 182308 -145719 179203 -132723 -341288 -241465 82348 163564 89305 -211981 -224351
11583b24351a02339B48148D7107B712J07915O3715b54847J09429k6631l0162D379
$$ -224351 -102339 248148 47107 2712 110627 174342 -254847 -145418 -172049 -202211 4379
11571B4714K98090C8857A3541d11753I0189B385K7643d0819B96617O4268C2311
$$ 24714 322804 38857 13541 -411753 90189 2385 30028 -40819 296617 360885 32311
11559a2303D9081K72748d2836m2930B0164k844a25207n8576k25266a33303e7370
$$ -12303 49081 321829 -42836 -85766 20164 17320 -125207 -183783 -409049 -133303 -57370
11547A16590E5765L2701J01456a06491j70021a00510j2575B24093b12603A01074
$$ 116590 55765 88466 189922 -106491 -276512 -100510 -113085 224093 -212603 101074
11536b1869j26436B91567C229e05966a03541B65123f5079q4500A65119m9674Q5665
$$ -21869 -148305 291567 3229 -505966 -103541 265123 -65079 -149579 165119 115445 201110
11525B01110d5533D6194M4868a59649G8394e6093A38028M4291J01096D9641J652
$$ 201110 -45533 46194 91062 -159649 78394 -56093 138028 182319 283415 49641 51293
11514E1293D624J75178J01416a29182B65759E3415L20080D3763J35937D0463J2676
$$ 51293 4624 179802 281218 -129182 265759 53415 373495 43763 179700 40463 53139
11503E3139A5317P2829R201L00681f0066B66410j26390J30286J54563a86399B4356
$$ 53139 15317 88146 97347 398028 -60066 266410 140020 270306 424869 -186399 24356
11491D9181b2241l57299C92624J73359A76187K39487f8738m9897E5487K73471
$$ 49181 -22241 -379540 392624 565983 176187 415674 -68738 -118635 55487 328958
11481C28958r3617E1529b5624H773g6098K5805I455N18621b14955J01455b6820
$$ 328958 235341 51529 -25624 8773 -76098 -50293 9455 528076 -214955 -113500 -26820
11469G2053J91423j00827E1587K17791h2453H4905M06868E742J19043m7628Q3084
$$ 72053 263476 162649 51587 269378 -82453 84905 491773 5742 124785 77157 160241
11458A60241N1441c7126k2953B55592A25920B7523a61147q0087H9557b8884I6272
$$ 160241 211682 -37126 -60079 255592 125920 27523 -161147 -241234 89557 -28884 96272
11446c2332j49963A99681J70301a03903B6596R7570d88595A59557o5435e5509
$$ -32332 -182295 199681 369982 -103903 26596 124166 -488595 159557 94122 -55509
11435a00134E7694K15492f7418A9852R6522C5809a54359A3899K15162r8385b67436
$$ -100134 57694 273186 -67418 19852 116374 35809 -154359 13899 229061 130676 -267436
11423a10841b0336F3324J408K674C0618m095b0041k9922b3288q8408A8759a49776
$$ -110841 -20336 63324 64732 67406 30618 26523 -20041 -49963 -23288 -111696 18759 -149776
11410A54935b13090D641e8131Q726l31675A02237a23684j90292f6136A14498k0290
$$ 154935 -213090 4641 -58131 -49405 -381080 102237 -123684 -313976 -66136 114498 94208
11399I4208i7061k8983n4388Q3928a0916l0716o3849B6823c10991a0604F2995
$$ 94208 -97061 -126044 -180432 -96504 -10916 -41632 -105481 26823 -310991 -10604 62995
11387c22935c7716C9272j2245b20669N5547L7224A57669n7500j1706L6204c01942
$$ -322935 -37716 39272 27027 -220669 -165122 -127898 157669 100169 88463 124667 -301942
11375b13099B04020B573c56393b7321C1424n012J03207j4290J38127g4496b3089
$$ -213099 204020 2573 -356393 -27321 31424 26412 129619 115329 253456 -74496 -23089
11363i556l1401j33528j09000A28056i0117E100L7125a31039j01640A74672a97644
$$ -9556 -40957 -174485 -283485 128056 -90117 5100 42225 -131039 -232679 174672 -197644
11351F8064A2977h0512D32281g9879B14868k0591a27184j63492i1603p7235H103
$$ 68064 12977 -80512 432281 -79879 214868 194277 -127184 -290676 -91603 -168838 8103
11339G1404a25051b3478j61648q114h2943A60395k4931J36568g0444o257A01506
$$ 71404 -125051 -23478 -185126 -193240 -82943 160395 135464 272032 -70444 -76701 101506
11327a14640j17150A57603D5775b35083N2838d560m13042a2520j77689B72601
$$ -114640 -231790 157603 45775 -235083 -182245 -4560 -417602 -12520 -190209 272601
11316b88655R1604c0249n4445B90711j42787p2998c44556A90298a3272l44869
$$ -288655 -197051 -30249 -84694 290711 147924 74926 -344556 190298 -13272 -358141
11306c58141A16985c44221h2149A50116e7323D94K13256J011a04146A51844b93544
$$ -358141 116985 -344221 -82149 150116 -57323 494 213750 214761 -104146 151844 -293544
11294f1958B05183B1802a64865N2224a431k55702B01668a49346A85152a36098
$$ -61958 205183 21802 -164865 -112641 -1431 -257133 201668 -149346 185152 -136098
11283C442M758P2707i6451a0784B88c99455a02380B5833J4044a3400A02613a31947
$$ 3442 8200 80907 -96451 -10784 288 -399455 -102380 25833 39877 -13400 102613 -131947
11270G1677f6579q3449B5912L8248c3262A08630d9230A08647b66712D10909A24519
$$ 71677 -66579 -150028 25912 64160 -33262 108630 -49230 108647 -266712 410909 124519
11258A39083f0206A33959a89743R3975q6023r3033A74106i9389L5219I524Q1763
$$ 139083 -60206 133959 -189743 -95768 -181791 -274824 174106 -99389 -64170 9524 91287
11247I1287a81648r1708A67989J05908o5061f6919B45379b2827A34228B2893J7784
$$ 91287 -181648 -273356 167989 273897 208836 -66919 245379 -22827 134228 22893 40677
11236D0677a57777k550e0860F9496J20519B9130a01956D852h352A2580K76625
$$ 40677 -157777 -160327 -50860 69496 190015 29130 -101956 4852 -8352 12580 289205
11225B89205a48504j07571Q9783A88184i4743b2458k1865o6555a36o4561A70941
$$ 289205 -148504 -256075 -166292 188184 -94743 -22458 -44323 -110878 -136 -64697 170941
11213a77354a2229G8725l8944a09040A33829C095h7181j27150a2918A93123b76823
$$ -177354 -12229 78725 39781 -109040 133829 3095 -87181 -214331 -12918 193123 -276823
11201b32780j47666a77694L575B86927d83j6251p6890k49774A14717c86447e5902
$$ -232780 -380446 -177694 -174119 286927 -483 -16734 -93624 -343398 114717 -386447 -55902
11189a19355m3701k32705D86a31635j8892N2339B88480L6572c1747A24751a20582
$$ -119355 -163056 -395761 486 -131635 -150527 -98188 288480 325052 -31747 124751 -120582
11177F0936a77907l893j76800e0429D04913G5550a4318l0331p7236l8181P5379
$$ 60936 -177907 -181800 -358600 -50429 404913 75550 -14318 -44649 -121885 -160066 -84687
11166h4687I0718m2572a67102A3879D813N3015J4783a48779C9623J78535d8375
$$ -84687 90718 48146 -167102 13879 4813 57828 72611 -148779 39623 218158 -48375
11154A77891a0780j78874A5977L12177n9696C2224O1577b6393F8102a43840B47191
$$ 177891 -10780 -189654 15977 328154 268458 32224 93801 -26393 68102 -143840 247191
11142H934a55084A22454f4061p444b3959G9966b1203A45439g065k61195B2081
$$ 8934 -155084 122454 -64061 -71505 -23959 79966 -21203 145439 -7065 -268260 22081
11130D66205d3100I2147a2070o2054k4044I4028J84168b9117A1597d1796G9766
$$ 466205 -43100 92147 -12070 -74124 -98168 94028 278196 -29117 11597 -41796 79766
11118a70654A71493B9316O5885h3473l3450H7825b39320q8952h7932j57782A4163
$$ -170654 171493 29316 95201 -83473 -116923 87825 -239320 -328272 -87932 -245714 14163
11106H7172J8274J59278b47737B2193J65056P0363G9638M8874a08127l9154A68134
$$ 87172 105446 264724 -247737 22193 187249 257612 79638 128512 -108127 -147281 168134
11094A57829k3195B8458b44851A25107b86968D8185J11964J71713G0444a43088
$$ 157829 134634 28458 -244851 125107 -286968 48185 160149 331862 70444 -143088
11083D8433J73616r31p9324D8647G423K81230E7781A4681l893J60202a12984D43961
$$ 48433 222049 221118 141794 48647 7423 288653 57781 14681 10788 170990 -112984 443961
11070B46987B4497J10449P7814l2896J40772D6711J53371k2965L00887L16210
$$ 246987 24497 134946 212760 179864 320636 46711 200082 177117 478004 794214
11060G94214B23101K54294K62718j14175l03518j15699K39203j2228A21458Q3911
$$ 794214 223101 477395 740113 625938 322420 206721 445924 433696 121458 205369
11050B05369L49198J71810l09574K75930J017l46550M58828j4883j62012j42472
$$ 205369 554567 726377 416803 692733 693750 347200 806028 791145 629133 486661
11040D86661K39305J11931l65928K64131J43399k33930j41627L3881j77530O6085
$$ 486661 725966 837897 471969 736100 879499 645569 503942 537823 360293 426378
11030D26378K7016J93382j24463K1188j13252N07138k90742M6632k28932Q6646
$$ 426378 453394 646776 522313 543501 430249 937387 646645 693277 464345 550991
11020E50991k4138P4142k15568J18954j13363R3805J12168j57234J66605j79463
$$ 550991 526853 600995 385427 504381 391018 484823 596991 439757 606362 426899
11010D26899r401J89639L70744B86635L39282j98728n7015J17562J0268J93969
$$ 426899 417498 607137 977881 286635 625917 427189 370174 487736 498004 691973
11000F91973J0322C28458K53477B09905O43976j57839J6145m5607j50334L28632
$$ 691973 702295 328458 581935 209905 853881 696042 712187 666580 516246 844878
10990H44878D21901N76350k70003p8315j85206L49092j43036K26087j32055K94930
$$ 844878 421901 998251 728248 649933 464727 813819 670783 896870 764815 1059745
10980A059745k77204J47275K87825Q5296J91283J76963m5677O52847J40155k07109
$$ 1059745 782541 929816 1217641 1302937 1494220 1671183 1625506 2278353 2418508 2211399
10970B211399K7712k54805j26098J82695m35256j70632r8057j37438l83094K46527
$$ 2211399 2239111 1984306 1858208 2040903 1605647 1435015 1336958 1199520 816426 1062953
10960A062953j08617K05507l93027Q5527j79634L06763k88770r8391J23814k0253
$$ 1062953 954336 1159843 766816 852343 672709 979472 690702 592311 716125 695872
10950F95872k90747p8449p6952q1067a15579H6362K20640o5314n9215o504P8506
$$ 695872 405125 326676 249724 168657 -115579 86362 307002 241688 182473 175969 254475
10939B54475m6001B9733J89283b048A55999N5216D0729K3062c44512A90566b72388
$$ 254475 208474 29733 219016 -2048 155999 211215 40729 63791 -344512 190566 -272388
10927D0687b22810j34436h5551A52962f1446k63015Q0414e9649C48337a95814
$$ 40687 -222810 -357246 -85551 152962 -61446 -324461 -244047 -59649 348337 -195814
10916A20216a95707L2515B02893E1765i542j69994k42734J82075a15355j90963
$$ 120216 -195707 -163192 202893 51765 -9542 -179536 -422270 -240195 -115355 -306318
10906c06318h6711A71225b2882k51180C87988a57482O4168b0067D9753c30876
$$ -306318 -86711 171225 -22882 -274062 387988 -157482 -93314 -20067 49753 -330876
10895I9474J45177a85592A2743e4451k90013E87546a19761N032A32139Q7999H6905
$$ 99474 244651 -185592 12743 -54451 -344464 587546 -119761 -114729 132139 220138 86905
10883a24700k1187j8618K1031E7162a63718A35343m195J78932i5331j6896K6131
$$ -124700 -145887 -164505 -143474 57162 -163718 135343 131148 310080 -95331 -112227 -86096
10872h6096C7183K9229C326N9412k4198f4511B59546D2347a1335A2549a02726
$$ -86096 37183 66412 3326 62738 38540 -64511 259546 42347 -11335 12549 -102726
10860d1356j19535O8227l1533F4547P6603A668L3133e2201A40653f6290l7823
$$ -41356 -160891 -92664 -124197 64547 141150 1668 34801 -52201 140653 -66290 -104113
10849a04113a7191A46495b12056c1857o5221j870k15400C7962R7638E6751J0490
$$ -104113 -17191 146495 -212056 -31857 -97078 -98948 -314348 37962 135600 56751 67241
10838F7241c2502l12684J00666O4376d4211B6999Q6618a56972l5476h6524j44021
$$ 67241 -32502 -345186 -244520 -180144 -44211 26999 113617 -156972 -192448 -86524 -230545
10827b30545O1797o9928A71437G4024f1479A3135i5918A30573F4897a71959C8297
$$ -230545 -168748 -238676 171437 74024 -61479 13135 -95918 130573 64897 -171959 38297
10815A8565b53464D134b32079i614j86668Q034B36154a5559B03913B9536c18849
$$ 18565 -253464 4134 -232079 -9614 -196282 -188248 236154 -15559 203913 29536 -318849
10803g8922c1262G9883a76488A82411a45195A61755a9889j35711D3629b54851
$$ -78922 -31262 79883 -176488 182411 -145195 161755 -19889 -155600 43629 -254851
10792A02034a04429j48531a24080j55602a0541l27629a24846d4662A31349b10287
$$ 102034 -104429 -252960 -124080 -279682 -10541 -338170 -124846 -44662 131349 -210287
10781A15669c5185H1619A5823N6926M0660D0708J023i9842B58117E8910F140b0417
$$ 115669 -35185 81619 15823 72749 113409 40708 41731 -99842 258117 58910 6140 -20417
10768C79832C9192J1582d6132k41163A56327i4009r8494e1172A5156a51993e0225
$$ 379832 39192 50774 -46132 -287295 156327 -94009 -192503 -51172 15156 -151993 -50225
10756H7846R1786c36113B52796a25027j21113D9751a26755L0784A04329b60555
$$ 87846 179632 -336113 252796 -125027 -246140 49751 -126755 -95971 104329 -260555
10745d4089A03474c7472d473j07738k32543e1036j50356R7657E2027J7802O1271
$$ -44089 103474 -37472 -4473 -112211 -344754 -51036 -201392 -103735 52027 69829 131100
10734A31100o5371j3588J08605M0440Q5397f6978o7952A1467b07696B07808n2347
$$ 131100 65729 52141 160746 201186 286583 -66978 -134930 11467 -207696 207808 155461
10723A55461i425k15167B91469D6213a55935P4314A59665a49514A03326k9681
$$ 155461 -9425 -224592 291469 46213 -155935 -81621 159665 -149514 103326 73645
10713G3645c08988f0073k0685j46277A70129e0255B7989A2567J57252c64230J70882
$$ 73645 -308988 -60073 -80758 -227035 170129 -50255 27989 12567 169819 -364230 -193348
10702a93348c9021A70672a9701l3180B80177i0062k48163A12423b16997D0922
$$ -193348 -39021 170672 -19701 -52881 280177 -90062 -338225 112423 -216997 40922
10691a52607B36684a71211A66539L158n8420i6456A45958D2414c30459a0623m01378
$$ -152607 236684 -171211 166539 169697 111277 -96456 145958 42414 -330459 -10623 -412001
10680d12001c9989m4175L8391j26970K6656A3708c0380j02999L5833A19107b76544
$$ -412001 -39989 -84164 -45773 -172743 -146087 13708 -30380 -133379 -97546 119107 -276544
10668A44262J24196b16967j01497A2781a88982M7753g750k2028l06186d2989j70163
$$ 144262 268458 -216967 -318464 12781 -188982 -141229 -7750 -29778 -335964 -42989 -213152
10657b13152F94c9252k01204O6336B58654n8626d0102k62512E8411J93270F4561
$$ -213152 694 -39252 -240456 -174120 258654 200028 -40102 -302614 58411 251681 64561
10645B33665a2104l14335E7976M4032R3159c9636I2760a15492N4857q4737B1446
$$ 233665 -12104 -326439 57976 102008 195167 -39636 92760 -115492 -60635 -145372 21446
10633a08074j17457A46562K84372e5614D9715b83678B54248r0948c13428B88851
$$ -108074 -225531 146562 430934 -55614 49715 -283678 254248 163300 -313428 288851
10622f4289j40397b9575B1534n260a17655o3973f9656j95758d8566j93233a5130
$$ -64289 -204686 -29575 21534 16274 -117655 -181628 -69656 -265414 -48566 -241799 -15130
10610a44058B5733a04578B2929e64191I0049b16442B62895j04930N0732q1201
$$ -144058 25733 -104578 22929 -564191 90049 -216442 262895 157965 208697 127496
10600A27496A0700b18178j71682A12804M2408J21680e3529k12649j20366a16672
$$ 127496 10700 -218178 -389860 112804 155212 276892 -53529 -266178 -386544 -116672
10589f3781j99930b0944C9640c1820j30837P5575A05367a44786r3057h0824G0907
$$ -63781 -263711 -20944 39640 -31820 -162657 -87082 105367 -144786 -237843 -80824 70907
10577h228A3483c60332J10590L1229A7142K18920d4985B69357B4022g1831n0524
$$ -8228 13483 -360332 -249742 -218513 17142 236062 -44985 269357 24022 -71831 -122355
10566a22355b513B35779a77726P3187A71067b3811A09587a79870c5179n0744A28853
$$ -122355 -2513 235779 -177726 -104539 171067 -23811 109587 -179870 -35179 -85923 128853
10554e8002k15328A92706k6146J6317c980k6542j58222j8727B6500e0691k03649
$$ -58002 -273330 192706 166560 182877 -3980 -30522 -188744 -207471 26500 -50691 -254340
10543b54340A15938a37086b9254k26812a20914H9295J68222D3268g4208D1036
$$ -254340 115938 -137086 -29254 -256066 -120914 89295 257517 43268 -74208 41036
10532b1344o9030b5377E0950B2478Q8222m211e7580A05443d96291a68919C1948
$$ -21344 -90374 -25377 50950 22478 110700 106489 -57580 105443 -496291 -168919 31948
10520a49100O0609L6838e565m0244j94485N672H5720c24973C74036A43832a28003
$$ -149100 -88491 -51653 -5565 -45809 -240294 -234622 85720 -324973 374036 143832 -128003
10508A5639J83877J51611d63727A3528b47908G3034b133p5279j34495a6919r8171
$$ 15639 199516 351127 -463727 13528 -247908 73034 -2133 -77412 -211907 -16919 -115090
10497a15090M5955A53484J19593d0886m4933k06139B8473c66573f7694C57954
$$ -115090 -69135 153484 273077 -40886 -85819 -291958 28473 -366573 -67694 357954
10486c15254b0452k51446c3129A5632a74117C14867D936K97875b09864C09941
$$ -315254 -20452 -271898 -33129 15632 -174117 314867 4936 302811 -209864 309941
10475A83783A3718b3736G1365a0816a1m4387J9490g360a863j5732D04696I9502
$$ 183783 13718 -23736 71365 -10816 -11 -44398 -24908 -7360 -1863 -17595 404696 99502
10462a57208B05571b40355A12225k7188a43271k49143R6453h3830k16716J39456
$$ -157208 205571 -240355 112225 85037 -143271 -392414 -295961 -83830 -300546 -161090
10452a61090l0552B57418r5109p8864a62365m7505e5506A49174J99768A9996a05319
$$ -161090 -191642 257418 162309 83445 -162365 -209870 -55506 149174 348942 19996 -105319
10440d4763G0934J23660c7483m916j03821A15665l9766c20520K2494J3335g6445
$$ -44763 70934 194594 -37483 -42399 -146220 115665 75899 -320520 -298026 -284691 -76445
10428b68663B1952O5014a7145l5692B20574E9544a60667E8579a59639B88620a68300
$$ -268663 21952 86966 -17145 -52837 220574 59544 -160667 58579 -159639 288620 -168300
10416B10896b22018A10640a07857B44364b03481L9376G0632J00220R5190a11235
$$ 210896 -222018 110640 -107857 244364 -203481 -164105 70632 170852 266042 -111235
10405d2253A90013q2364B244i9330k7911A67831B5635i9404j8359D7545M9541
$$ -42253 190013 107649 2244 -99330 -127241 167831 25635 -99404 -117763 47545 97086
10394I7086J00465N004b55301A06175b96266a38154j23874A24116p32g0474C8356
$$ 97086 197551 202555 -255301 106175 -296266 -138154 -262028 124116 123384 -70474 38356
10382A84613K18288a982A28321O6459e9056H1524l3869L61766I92a26003G7267
$$ 184613 402901 -1982 128321 194780 -59056 81524 47655 409421 992 -126003 77267
10370B36389A03215O6276l2409P9389K61881k01789p5779J28023A27076B3324
$$ 236389 103215 169491 137082 216471 478352 276563 200784 328807 127076 23324
10359B66463j07044C6673K87644b67187A18465K4475K02549J33181j12060L58523
$$ 266463 159419 36673 324317 -267187 118465 142940 345489 478670 366610 725133
10349G25133A38313J74970A49797c6142D41533b8836G4362a56269A21355J59364
$$ 725133 138313 313283 149797 -36142 441533 -28836 74362 -156269 121355 280719
10339B80719c6605o6165D6962P4525M4915j3281a85504c3400B71635c1553k05252
$$ 280719 -36605 -102770 46962 121487 166402 153121 -185504 -33400 271635 -31553 -236805
10328b36805q0497B84413a14473B09995G2795P7926K08519F4033G96K03667c8455
$$ -236805 -317302 284413 -114473 209995 72795 150721 359240 64033 796 204463 -38455
10316B39268a77297j25114D2007J24853G0429e803A2106b8291k30947H9165l6896
$$ 239268 -177297 -302411 42007 166860 70429 -5803 12106 -28291 -259238 89165 52269
10305E2269b09635Q4718a2129I2438b8495A99190A027J5789c11787B38299j04825
$$ 52269 -209635 -124917 -12129 92438 -28495 199190 1027 16816 -311787 238299 133474
10294A33474b16388a9275A1077a16312C15305F975e4686r3409b7191A49397M5201
$$ 133474 -216388 -19275 11077 -116312 315305 6975 -54686 -148095 -27191 149397 194598
10283A94598p7422c9799B14706g3698I0817M0159a18484A20787J9385L6322a0689
$$ 194598 117176 -39799 214706 -73698 90817 130976 -118484 120787 140172 176494 -10689
10271a05682M8890a5130j02684q6641D03161a21908A56763c22741a30208j03900
$$ -105682 -56792 -15130 -117814 -204455 403161 -121908 156763 -322741 -130208 -234108
10261b34108A98604b44289f1869A72544a54304E80505A41489e922B58519f8257
$$ -234108 198604 -244289 -61869 172544 -154304 580505 141489 -5922 258519 -68257
10250a18427B99911A40027j8871a55226j02573O9099L5013B0163a64017J928F6840
$$ -118427 299911 140027 121156 -155226 -257799 -188700 -153687 20163 -164017 -162089 66840
10238f1309j76073Q9426H3366a6599B15708D012J3388b10831A21303f7916l3826
$$ -61309 -237382 -147956 83366 -16599 215708 4012 17400 -210831 121303 -67916 -101742
10227a01742B06722c04260h2409A51881d2109a7436A48779a863G4631K26985K820
$$ -101742 206722 -304260 -82409 151881 -42109 -17436 148779 -1863 74631 301616 304436
10216C04436b47885C9000K73162P475c04396d1016j321q6642B9780A4888a98131
$$ 304436 -247885 39000 312162 319637 -304396 -41016 -42337 -128979 29780 14888 -198131
10204A22243h7288j13463i6794B00963d00548e3685J3836k80391C1252J32009
$$ 122243 -87288 -200751 -96794 200963 -400548 -53685 -39849 -320240 31252 163261
10194A63261K08255d0590k82776J12012N7875P787A22484b12563N2398L2306a3648
$$ 163261 371516 -40590 -323366 -211354 -153479 -145692 122484 -212563 -160165 -127859 -13648
10182b76260h6821A75866b0702d062o2327D3585f1020j70736B2814b40633B41241
$$ -276260 -86821 175866 -20702 -4062 -66389 43585 -61020 -231756 22814 -240633 241241
10170A4184e2886B11088c10958A11333a80776H5270a77902I2335b11069a4648
$$ 14184 -52886 211088 -310958 111333 -180776 85270 -177902 92335 -211069 -14648
10159B89309A8451L5260J53767p8633b36130a14029k27170G6842R73b41410J15112
$$ 289309 18451 53711 207478 128845 -236130 -114029 -341199 76842 77815 -241410 -126298
10148a26298M6565j68871Q1663l8525j69728R6804J01524N2461q4448O6815l5509
$$ -126298 -79733 -248604 -166941 -205466 -375194 -278390 -176866 -124405 -208853 -142038 -177547
10137a77547p8920B06343b45200A0738a25357C8346b67725F3197a29718d2996
$$ -177547 -256467 206343 -245200 10738 -125357 38346 -267725 63197 -129718 -42996
10126g0321C01468e26876K57307A88869b87756i7413h14B25155c18271j26905
$$ -70321 301468 -526876 -269569 188869 -287756 -97413 -814 225155 -318271 -445176
10116d45176A0979e0728l17794J3487d6476k5717k24073A79706f0998j76433h6908
$$ -445176 10979 -50728 -368522 -355035 -46476 -72193 -296266 179706 -60998 -237431 -86908
10104H1185c84322J78495R7912A4702d9891B15260a28315k1478j84700B40130
$$ 81185 -384322 -205827 -107915 14702 -49891 215260 -128315 -149793 -334493 240130
10093A36911a38616K5424c381j50443k85999d3886I1144i3013B57663a54884L7084
$$ 136911 -138616 -113192 -3381 -153824 -439823 -43886 91144 -93013 257663 -154884 -117800
10082a17800c5888E900J27003d9028A07159b68683A22135a49760G5075M6028a12670
$$ -117800 -35888 5900 132903 -49028 107159 -268683 122135 -149760 75075 121103 -112670
10070F3286a04905A44974J8552a05627B80986a19588A69575e3992A06412d42934
$$ 63286 -104905 144974 163526 -105627 280986 -119588 169575 -53992 106412 -442934
10059g3802j79946P8733N2966A19550b50958B0496Q3600a22324k16093g520k27011
$$ -73802 -253748 -175015 -122049 119550 -250958 20496 104096 -122324 -338417 -7520 -234531
10048b34531p853e76m43826J52769J3096B79725i0280k04189H4045b26066j8662
$$ -234531 -242384 -576 -444402 -291633 -278537 279725 -90280 -294469 84045 -226066 -244728
10037b44728K0936o2732B10701B9981a72973j22451C65217a55940r2137a17189
$$ -244728 -223792 -286524 210701 29981 -172973 -295424 365217 -155940 -248077 -117189
10026a9699j60380A25538a61556j77103H6620d0751F4744j0398a42130C18938
$$ -19699 -180079 125538 -161556 -338659 86620 -40751 64744 54346 -142130 318938
10015b359l6859f58j434q5241A99306A7984J59560P5770D8221a64408a0219C9488
$$ -2359 -39218 -658 -2092 -87333 199306 17984 177544 253314 48221 -164408 -10219 39488
10002a81884F1635b49874A68098c55271B76471B3282a73511j0757d0467j38767
$$ -181884 61635 -249874 168098 -355271 276471 23282 -173511 -184268 -40467 -179234
9992a79234b4297l4220p7897e8942A0467f3520o2307k43820J43637i4452j67109
$$ -179234 -24297 -58517 -136414 -58942 10467 -63520 -125827 -369647 -226010 -94452 -261561
9981b61561A8580K46930e9382A53539g6142E6944a5906c317k77088J13251D38563
$$ -261561 18580 265510 -59382 153539 -76142 56944 -15906 -3317 -280405 -167154 438563
9969c45198I0681i1166B94356b7922j88643C4196c02961A39017J60529A27361
$$ -345198 90681 -91166 294356 -27922 -216565 34196 -302961 139017 299546 127361
9958F2357A6379i9975j6250K1253j49896A4224L10450E1985J06055F3541g909
$$ 62357 16379 -99975 -116225 -94972 -244868 14224 324674 51985 158040 63541 -7909
9946a58959A72820c2164k11159d744j97417l3433E52215c58825a25071A08014
$$ -158959 172820 -32164 -243323 -4744 -202161 -235594 552215 -358825 -125071 108014
9935a16325A28210n7966O2580E1366a85030C04804a97856j17323B01971b32151
$$ -116325 128210 70244 132824 51366 -185030 304804 -197856 -315179 201971 -232151
9924a1380j27233A49520c63019I4312J18044b3261p3381j43983C6417j109a4196
$$ -11380 -138613 149520 -363019 94312 212356 -23261 -96642 -240625 36417 35308 -14196
9912d8908i839k00233B29973c04602d9760E1954a49279k94818A2867g0365A12264
$$ -48908 -9839 -210072 229973 -304602 -49760 51954 -149279 -444097 12867 -70365 112264
9900b83173D0527g416I315K7034g756j01344o7232B09802N3367a05658G9241g3858
$$ -283173 40527 -7416 9315 36349 -7756 -109100 -176332 209802 263169 -105658 79241 -73858
9887a24397a511k05828G6783i3658G2374g1101c1551q2468k10866J36949A62166
$$ -124397 -1511 -207339 76783 -93658 72374 -71101 -31551 -114019 -324885 -187936 162166
9875A54113b82884B39332o7085g2890D24024h7162p9175B46400b0402p5872H6779
$$ 154113 -282884 239332 172247 -72890 424024 -87162 -166337 246400 -20402 -96274 86779
9863F6500h338j47992C36717b09299A68834H2020a18434j5732F2827c53785B1166
$$ 66500 -8338 -156330 336717 -209299 168834 82020 -118434 -134166 62827 -353785 21166
9851f0432k63806a21166k3267c1901j20025f5051b1819j12676M5984c5108A23133
$$ -60432 -324238 -121166 -144433 -31901 -151926 -65051 -21819 -134495 -88511 -35108 123133
9839i9485o7194B08162L4741e4996k43633R1939A78205b22872h2119a7011j4888
$$ -99485 -166679 208162 242903 -54996 -298629 -206690 178205 -222872 -82119 -17011 -31899
9828c1899C3269j6587a18007I3545L932I291e20073b05804b7346j60760K6870
$$ -31899 33269 16682 -118007 93545 97477 9291 -520073 -205804 -27346 -188106 -161236
9817a61236k69045g2765j22956M379A22715J5995a289A73595a7964k33061B3390
$$ -161236 -430281 -72765 -195721 -191342 122715 138710 -1289 173595 -17964 -251025 23390
9805d20296a20105j4160B07037b9226n6800G4124c24421D1732a92458B15510H5946
$$ -420296 -120105 -134265 207037 -29226 -86026 74124 -324421 41732 -192458 215510 85946
9793a07669j46729f2397j97636J15271M3771J3755k45984F6155J89682a02931
$$ -107669 -254398 -62397 -260033 -144762 -100991 -87236 -333220 66155 255837 -102931
9782H5622j8889J84169b36412A6029K16359K4717a48472I6734a11172L2115p2838
$$ 85622 66733 250902 -236412 16029 232388 257105 -148472 96734 -111172 -79057 -151895
9771a51895b14F3018J2862a21155A3159b19018A22441A4899i3673j16668A1333
$$ -151895 -214 63018 75880 -121155 13159 -219018 122441 14899 -93673 -210341 11333
9759G7970l77d05863a56560m736N7302H6913d16864J85562E2640L0173C2608d1105
$$ 77970 77593 -405863 -156560 -161296 -103994 86913 -416864 -231302 52640 82813 32608 -41105
9746d2957A6572a31321n3196N2642q3062A8036e8004G9694J76981O0585A32636
$$ -42957 16572 -131321 -184517 -131875 -214937 18036 -58004 79694 256675 317260 132636
9734d4177j41625A89760b0837j78973a009A57142i023C32315c08272B19536b49466
$$ -44177 -185802 189760 -20837 -199810 -1009 157142 -9023 332315 -308272 219536 -249466
9722B18971a18742B34411b70965a03136k5956I6430a38654j90478J26336a6705
$$ 218971 -118742 234411 -270965 -103136 -129092 96430 -138654 -329132 -202796 -16705
9711A90599h3033j13987K1649B5511a30898a6693o3020B98035b37278i2964A8585
$$ 190599 -83033 -197020 -175371 25511 -130898 -16693 -79713 298035 -237278 -92964 18585
9699a65381p3287B48894a50781H5981d4390L741o9762C778J5132K13277H435J29919
$$ -165381 -238668 248894 -150781 85981 -44390 -40649 -110411 3778 18910 232187 8435 138354
9687A38354a1660o2128g931B87482a79950L6178k48635J95373D9106J1010e4480
$$ 138354 -11660 -73788 -7931 287482 -179950 -143772 -392407 -197034 49106 60116 -54480
9675c25788G6299M6840c24183A37258g2340j80410g0612j28490F1935N5337L0249
$$ -325788 76299 123139 -324183 137258 -72340 -252750 -70612 -199102 61935 117272 147521
9664A47521R7375a68810m357A20375g0512l15417A69904R3664b70893J03694b7813
$$ 147521 244896 -168810 -173167 120375 -70512 -385929 169904 263568 -270893 -167199 -27813
9652B59163f7675A49163b49163n3066B53536b62049k01071A2441c7279J2095D5887
$$ 259163 -67675 149163 -249163 -302229 253536 -262049 -463120 12441 -37279 -25184 45887
9640c5844A23600J1780f2034k01477f7598A16179c78104A82122a70939k5834C86536
$$ -35844 123600 135380 -62034 -263511 -67598 116179 -378104 182122 -170939 -196773 386536
9628f6957A56336E8955a20571j2197d0687H1549a35202G3977b90518a08488j32127
$$ -66957 156336 58955 -120571 -132768 -40687 81549 -135202 73977 -290518 -108488 -240615
9617b40615C03708j2754C9707d6933j67674m3363B08350a10115A4644b2270p6341
$$ -240615 303708 290954 39707 -46933 -214607 -257970 208350 -110115 14644 -22270 -98611
9606i8611j65174Q8203d1340B34329c6034B20316A83a60712B08458a41150L3989
$$ -98611 -263785 -175582 -41340 234329 -36034 220316 183 -160712 208458 -141150 -107161
9595a07161j89030A92467F2788a4797k97511J27786d2486A1122J46296d9711j37156
$$ -107161 -296191 192467 62788 -14797 -312308 -184522 -42486 11122 157418 -49711 -186867
9584a86867B2467c1742j77024E5005e868l64798d9986k75974I5958b26484B24213
$$ -186867 22467 -31742 -208766 55005 -5868 -370666 -49986 -325960 95958 -226484 224213
9572A06171b20015P7346a4792q198k82089A5812a86790B1194P3935M9564J16654
$$ 106171 -220015 -142669 -14792 -22990 -305079 15812 -186790 21194 95129 144693 261347
9561B61347A13600J22m0832b54484J6521A47509c48757A74227b23620F468a48606
$$ 261347 113600 113722 72890 -254484 -237963 147509 -348757 174227 -223620 6468 -148606
9549G1111a05828J8486d1259k01499D4279a26408B15078c47727d762n2118l7248
$$ 71111 -105828 -87342 -41259 -242758 44279 -126408 215078 -347727 -4762 -56880 -94128
9538i4128B18568a40116j86883a33880l2969j05795p7976j6440A82610D3926M1682
$$ -94128 218568 -140116 -326999 -133880 -166849 -272644 -350620 -367060 182610 43926 85608
9527H5608b0074j91180D6062a06767j31251A4197f41959A38987i2346A74356b10760
$$ 85608 -20074 -211254 46062 -106767 -238018 14197 -641959 138987 -92346 174356 -210760
9515c60074J55225C44544H0618a9487A45974J54696a69652O793A06311k1158d4642
$$ -360074 -204849 344544 80618 -19487 145974 300670 -169652 -162859 106311 85153 -44642
9503E4127h5538A85113a0270n0227n6235C1566a08154j16636B1828a67451A7204
$$ 54127 -85538 185113 -10270 -60497 -116732 31566 -108154 -224790 21828 -167451 17204
9491i9300A52807c62244A60497b98867A94422b30379B9216a43123C8549a64545
$$ -99300 152807 -362244 160497 -298867 194422 -230379 29216 -143123 38549 -164545
9480b33192c5941l00045K9663M0628B83181a12321j09847R2442k45027a00084
$$ -233192 -35941 -335986 -306323 -265695 283181 -112321 -222168 -129726 -374753 -100084
9469B88745b91969A0330b24635h8157A72455b1549H1592c24445H3292K9827b94138
$$ 288745 -291969 10330 -224635 -88157 172455 -21549 81592 -324445 83292 113119 -294138
9457b99644B07177H2535J0513N568a03107A6467J51808h065A05286N7435a53731
$$ -299644 207177 82535 93048 98616 -103107 16467 168275 -8065 105286 162721 -153731
9445b5971I7451b30706H5398b91665c5666D1562A9488K822Q8781P347b87011a21645
$$ -25971 97451 -230706 85398 -291665 -35666 41562 19488 22310 111091 118438 -287011 -121645
9432b1526k66710d0939J8527j18702D5191P1865d02768a71533j4387C22503a17786
$$ -21526 -288236 -40939 -22412 -141114 45191 117056 -402768 -171533 -185920 322503 -117786
9420A60438e6626k54060f2723o9298A03537R1101a79344I7524a33741k52034H4050
$$ 160438 -56626 -310686 -62723 -132021 103537 194638 -179344 97524 -133741 -385775 84050
9408h1718B15239D0207a87477O8669a6735A24381k7450l4151o207e5596A4409
$$ -81718 215239 40207 -187477 -118808 -16735 124381 96931 62780 56573 -55596 14409
9396a34226E5035c25183b3831r9615N4983E1473e4627j66328a04732p5012j96637
$$ -134226 55035 -325183 -23831 -123446 -68463 51473 -54627 -220955 -104732 -179744 -376381
9385c76381c0436p1193A49989b08151A27308b68245f6587n348B11423a35940A31676
$$ -376381 -30436 -101629 149989 -208151 127308 -268245 -66587 -71935 211423 -135940 131676
9373i8651m5134q4543F8395a04356E033b51002a17905A46641L74443f4186q8692
$$ -98651 -143785 -228328 68395 -104356 5033 -251002 -117905 146641 521084 -64186 -152878
9362a52878A49569e1059A64184a72716B08318b87340d0347G0625B0257J93898
$$ -152878 149569 -51059 164184 -172716 208318 -287340 -40347 70625 20257 214155
9352B14155i9150I8997i1607I4924e9153B5497c31131J37386L4604B51069a17733
$$ 214155 -99150 98997 -91607 94924 -59153 25497 -331131 -193745 -159141 251069 -117733
9340a66925j96983A50423C1383c5071n5272O39H902d0478k23480a26234A21290
$$ -166925 -363908 150423 31383 -35071 -90343 -89704 8902 -40478 -263958 -126234 121290
9328A19983b08862n5156j0228B3826b21037A21399a03884L5629I2294M1856J00640
$$ 119983 -208862 -264018 -274246 23826 -221037 121399 -103884 -68255 92294 134150 234790
9317B34790b61798J09027q7079L9863B14535b9089D96467G2340J2823M6222a98216
$$ 234790 -261798 -152771 -239850 -199987 214535 -29089 496467 72340 85163 131385 -198216
9305a83725f266D0667a17714c4534m1055l06095J85611b6299k77734h563I8815
$$ -183725 -6266 40667 -117714 -34534 -75589 -381684 -196073 -26299 -304033 -8563 98815
9293c01384B2067a72497b5872j90568o2230E5121i4095k5049M0155k12520F8294
$$ -301384 22067 -172497 -25872 -216440 -278670 55121 -94095 -119144 -78989 -291509 68294
9281g4514j6884m7135b2617a0869A22882g9245I0638l4516i10F0577a637j90422
$$ -74514 -91398 -138533 -22617 -10869 122882 -79245 90638 56122 -910 60577 -1637 -192059
9269a92059M0269j19763j8544g8470o542B49528D3111p841b5771C22524a71602
$$ -192059 -151790 -271553 -290097 -78470 -85012 249528 43111 35270 -25771 322524 -171602
9257e7216q6158B25743P7404i2309l526q9663A51570b02437f3939j84291A15397
$$ -57216 -143374 225743 303147 -92309 -95835 -185498 151570 -202437 -63939 -248230 115397
9245B52579a32688m5718b7321n6916A55670a68218d6289A86452e6173C0667b79305
$$ 252579 -132688 -178406 -27321 -84237 155670 -168218 -46289 186452 -56173 30667 -279305
9233b20133C2752a7414B67126I0268b47415O2081h47k08325c7635A44038a276
$$ -220133 32752 -17414 267126 90268 -247415 -185334 -847 -209172 -37635 144038 -1276
9221A615P1762c3552E8917a89602N2696A7928O4352a63734K5309L1413r4657i5088
$$ 1615 73377 -33552 58917 -189602 -136906 17928 82280 -163734 -138425 -107012 -201669 -95088
9208a45885p9043A71932B0292c02893J39428j17182b4727k65457J8381a07661
$$ -145885 -224928 171932 20292 -302893 -163465 -280647 -24727 -290184 -271803 -107661
9197a59669A30180a5549n6722j36603e037l85979e2883j01623b967m42882A5561
$$ -159669 130180 -15549 -72271 -208874 -5037 -391016 -52883 -154506 -2967 -445849 15561
9185i5470B54560c8990d587q7188A87817c57815j7518R5039J6741A9702J87847
$$ -95470 254560 -38990 -4587 -91775 187817 -357815 -375333 -280294 -263553 19702 207549
9174B07549F4434M3639i8448j51054a1294F0464c3544A36281n5797k5314b70221
$$ 207549 64434 108073 -98448 -249502 -11294 60464 -33544 136281 80484 55170 -270221
9162A14660J06060a11726c2508m32443J84314M5323O8209B87294c9789j38362
$$ 114660 220720 -111726 -32508 -464951 -280637 -235314 -167105 287294 -39789 -178151
9152a78151e2155j94408A11125b00171i7072m8811D892R3880G095K35661b80614
$$ -178151 -52155 -246563 111125 -200171 -97072 -145883 4892 98772 7095 242756 -280614
9140a33862k96543B58021a00300B44999G4438Q2670c16722A226a89164H4605c22679
$$ -133862 -430405 258021 -100300 244999 74438 157108 -316722 1226 -189164 84605 -322679
9128c01343a6824B40418e74800C4001e1615a307j65796c1843F4622K20476H1025
$$ -301343 -16824 240418 -574800 34001 -51615 -1307 -167103 -31843 64622 285098 81025
9116A73123g1977H5919a61387k00760J78497B1439d41370h9677o0543B85257b3283
$$ 173123 -71977 85919 -161387 -362147 -183650 21439 -441370 -89677 -150220 285257 -23283
9104I4422C3115a09831B1200q987M7081A7761N3067K5191b41764R6220e7063b7036
$$ 94422 33115 -109831 21200 12213 59294 17761 70828 96019 -241764 -145544 -57063 -27036
9091b2097A13897c15984J23865E2682j9474a94761B5277b7691n6115D2130c85460
$$ -22097 113897 -315984 -192119 52682 33208 -194761 25277 -27691 -83806 42130 -385460
9079a13609c2645D7059K5973g1200B05407a46091A32907b17186j8050L8658F62
$$ -113609 -32645 47059 73032 -71200 205407 -146091 132907 -217186 -235236 -196578 662
9067c7823j26246d9666k86456O3228M8498G9158e6321j85025A79934a68515c502
$$ -37823 -164069 -49666 -336122 -272894 -224396 79158 -56321 -241346 179934 -168515 -3502
9055a14648A07130c2320m41139G2384a8305j15222N1326L9656E8537J04182B5067
$$ -114648 107130 -32320 -473459 72384 -18305 -133527 -82201 -42545 58537 162719 25067
9043h0092b2842E03822c06204C37687F6309M230b18095c457I4619D5120K1529
$$ -80092 -22842 503822 -306204 337687 66309 70539 -218095 -3457 94619 45120 66649
9032F6649J18516a06599j38795n7488a40900o854A30452d64315a44248A9548M03071
$$ 66649 185165 -106599 -245394 -302882 -140900 -147754 130452 -464315 -144248 19548 422619
9021D22619i1094B00864J6444a90396k5192B26406a5798j92663r3860K2218f9467
$$ 422619 -91094 200864 217308 -190396 -215588 226406 -15798 -208461 -302321 -280103 -69467
9009F8325G222c97378a51902B1446g5069H4323a06476r1359E075b38542H3621
$$ 68325 7222 -397378 -151902 21446 -75069 84323 -106476 -197835 5075 -238542 83621
8997b4804B9426L2497b42841l6522Q232j4518A95624c72191P6021c4153E0023
$$ -24804 29426 61923 -242841 -279363 -271131 -285649 195624 -372191 -296170 -34153 50023
8985b47758G5193B54K76833a4244A18482h7510A19102b76841a4143j25801N416
$$ -247758 75193 254 277087 -14244 118482 -87510 119102 -276841 -14143 -139944 -134528
8974a34528N1572k7315k48343B05989b55994B58417a9470m0777r5417C5758g408
$$ -134528 -82956 -110271 -358614 205989 -255994 258417 -19470 -60247 -155664 35758 -7408
8962A91893b55364A63128a76951M8763o5066G3747b9857k31643B3978h6095K3403
$$ 191893 -255364 163128 -176951 -128188 -193254 73747 -29857 -261500 23978 -86095 -62692
8951f2692q6328F79812h6866j77257R657a1070m2382F2764a72941l63999b7237
$$ -62692 -149020 679812 -86866 -264123 -254466 -11070 -53452 62764 -172941 -536940 -27237
8939b5106G9238K29301L3363b66266A7584O0996J48282a84462A21272a9911j7164
$$ -25106 79238 308539 341902 -266266 17584 78580 226862 -184462 121272 -19911 -37075
8928c7075m92498b02995C1520J14469L04034P07090L129116Q788734D571865A001687
$$ -37075 -529573 -202995 31520 145989 450023 1157113 4286229 13074963 4571865 1001687
8917C73881H0743J81230E6785a68540J3574K8432L0184p5579B1732L34545c6173
$$ 373881 80743 261973 56785 -168540 -154966 -126534 -96350 -171929 21732 356277 -36173
8905B69971j3534e1025H7992a66836g7065j20625a4078l69167a30481I4449M7585
$$ 269971 256437 -51025 87992 -166836 -77065 -197690 -14078 -383245 -130481 94449 142034
8894A42034f3538B50846h0738B946J55059b52373B0979J33385M5731c3404C6577
$$ 142034 -63538 250846 -80738 2946 158005 -252373 20979 154364 200095 -33404 36577
8882H9293K06512b81712i6319D8390b41877A7456g0092G2334l5156e70998a80813
$$ 89293 295805 -281712 -96319 48390 -241877 17456 -70092 72334 37178 -570998 -180813
8870c8241E8888a42236b2582B2715a54660B25162e3466A10298a10622k28251J18184
$$ -38241 58888 -142236 -22582 22715 -154660 225162 -53466 110298 -110622 -338873 -220689
8859b20689j20715E8888a27832j5143I1091b92461a40711E5492a03525j71167
$$ -220689 -341404 58888 -127832 -142975 91091 -292461 -140711 55492 -103525 -274692
8849b74692H3558C1852a13882I8309b3807G2664b34298H397K49173c7138B35677
$$ -274692 83558 31852 -113882 98309 -23807 72664 -234298 8397 257570 -37138 235677
$$ [...]
##END NTUPLES=NMR SPECTRUM
##END=
