
##TITLE=AC1403_PERAH12212_7653237_G05gJBbeM3
##JCAMPDX= 6.0         $$ Bruker NMR JCAMP-DX V2.0
##DATA TYPE= nD NMR SPECTRUM
##DATA CLASS= NTUPLES
##NUM DIM= 2
##ORIGIN= BRUKER
##OWNER= Administrator
$$ 1.72 TOPSPIN		Version 2.1
$$ 2013-03-20 01:32:09.187 -0500  Administrator@X
$$ Compression mode = diff/dup
##.OBSERVE FREQUENCY= 400.02188249412
##.OBSERVE NUCLEUS= ^1H
##.ACQUISITION MODE= SIMULTANEOUS (DQD)
##.ACQUISITION SCHEME= NOT PHASE SENSITIVE
##.AVERAGES= 4
##.DIGITISER RES= 22
##SPECTROMETER/DATA SYSTEM= spect
##.PULSE SEQUENCE= jresgppsqf.2
##.SOLVENT NAME= COFFEE_meoh
##.SHIFT REFERENCE= INTERNAL, COFFEE_meoh, 1, 14.96128
##AUDIT TRAIL= $$ (NUMBER, WHEN, WHO, WHERE, PROCESS, VERSION, WHAT)
$$ ##TITLE= Audit trail, TOPSPIN		Version 2.1
$$ ##JCAMPDX= 5.01
$$ ##ORIGIN= Bruker BioSpin GmbH
$$ ##OWNER= Administrator
$$ $$ E:\/data/COFFEE/nmr/AC1403_PERAH12212_7653237_G05gJBbeM3/13/pdata/1/auditp.txt
$$ ##AUDIT TRAIL=  $$ (NUMBER, WHEN, WHO, WHERE, PROCESS, VERSION, WHAT)
(   1,<2013-03-20 01:31:59.578 -0500>,<Administrator>,<X>,<go>,<TOPSPIN 2.1>,
      <created by zg
	started at 2013-03-20 01:17:36.312 -0500,
	POWCHK enabled, PULCHK disabled,
       configuration hash MD5:
       86 BA 57 50 F2 9D 5C 9B 26 00 A9 28 5F 66 2E 89
       data hash MD5: 8K * 40
       63 7A 6C E0 AB 59 2C E7 DE B8 17 29 17 C9 02 C6>)
(   2,<2013-03-20 01:32:04.015 -0500>,<Administrator>,<X>,<proc2d>,<TOPSPIN 2.1>,
      <Start of raw data processing
       xfb same F2: SI = 16K WDW = 3 SSB = 0 FT_mod = 6 PKNL = 1 F1: SI = 512 WDW = 3 SSB = 0 FT_mod = 6 PH_mod = 2
       data hash MD5: 16K * 512
       48 5B A7 B0 2E 49 79 F7 9A F1 B9 56 9A 36 8B 46>)
(   3,<2013-03-20 01:32:05.359 -0500>,<Administrator>,<X>,<proc2d>,<TOPSPIN 2.1>,
      <abs2 F2: ABSG = 5 ABSF1 = 10.00117 ABSF2 = 0.0006350016
       data hash MD5: 16K * 512
       C4 C5 6F 14 77 F0 E2 3C 8E 95 73 A6 3C 18 A0 9A>)
(   4,<2013-03-20 01:32:06.093 -0500>,<Administrator>,<X>,<proc2d>,<TOPSPIN 2.1>,
      <tilt
       data hash MD5: 16K * 512
       09 D2 86 AC 01 96 25 F3 B2 5D 2F 01 69 3B 03 E5>)
(   5,<2013-03-20 01:32:07.531 -0500>,<Administrator>,<X>,<proc2d>,<TOPSPIN 2.1>,
      <abs1 F1: ABSG = 5 ABSF1 = 0.06497851 ABSF2 = -0.06497862
       data hash MD5: 16K * 512
       47 FF B5 AB 24 92 C7 81 EB 01 6F A4 05 7C A0 FF>)
(   6,<2013-03-20 01:32:08.796 -0500>,<Administrator>,<X>,<proc2d>,<TOPSPIN 2.1>,
      <symj
       data hash MD5: 16K * 512
       9B 9E 79 C5 76 DB 4B 1E 38 EB C2 F6 E2 37 01 DD>)
$$ ##END=
$$ 
$$ $$ hash MD5
$$ $$ E2 B6 85 CB A7 AF 28 4C FB 20 27 6F C0 2A 33 F3
##$RELAX= 
##$RELAX= 
##$RELAX= 
##$RELAX= 
##$RELAX= 
##$RELAX= 
##$RELAX= 
$$ Bruker specific parameters
$$ --------------------------
##$DU= <E:\>
##$EXPNO= 13
##$NAME= <AC1403_PERAH12212_7653237_G05gJBbeM3>
##$PROCNO= 1
##$TYPE= <nmr>
##$USER= <COFFEE>
##$ACQT0= 1000000
##$AMP= (0..31)
100 100 100 100 100 100 100 100 100 100 100 100 100 100 100 100 100 100
$$ [...]
##$TD0= 1
##$TE= 300
##$TE2= 300
##$TE3= 300
##$TEG= 300
##$TL= (0..7)
0 120 120 120 120 120 120 120
##$TP= (0..7)
150 150 150 150 150 150 150 150
##$TP07= 0
##$TPNAME0= <>
##$TPNAME1= <>
##$TPNAME2= <>
##$TPNAME3= <>
##$TPNAME4= <>
##$TPNAME5= <>
##$TPNAME6= <>
##$TPNAME7= <>
##$TPOAL= (0..7)
0.5 0.5 0.5 0.5 0.5 0.5 0.5 0.5
##$TPOFFS= (0..7)
0 0 0 0 0 0 0 0
##$TUNHIN= 0
##$TUNHOUT= 0
##$TUNXOUT= 0
##$USERA1= <user>
##$USERA2= <user>
##$USERA3= <user>
##$USERA4= <user>
##$USERA5= <user>
##$V9= 5
##$VALIST= <valist>
##$VCLIST= <CCCCCCCCCCCCCCC>
##$VD= 0
##$VDLIST= <DDDDDDDDDDDDDDD>
##$VPLIST= <PPPPPPPPPPPPPPP>
##$VTLIST= <TTTTTTTTTTTTTTT>
##$WBST= 2048
##$WBSW= 25
##$XGAIN= (0..3)
0 0 0 0
##$XL= 0
##$YL= 0
##$YMAX_a= 59571
##$YMIN_a= -105776
##$ZGOPTNS= <>
##$ZL1= 120
##$ZL2= 120
##$ZL3= 120
##$ZL4= 120
##$ABSF1= 0.06497851
##$ABSF2= -0.06497862
##$ABSG= 5
##$ABSL= 0
##$ALPHA= 0
##$AQORDER= 0
##$ASSFAC= 0
##$ASSFACI= 0
##$ASSFACX= 0
##$ASSWID= 0
##$AUNMP= <>
##$AXLEFT= 0
##$AXNAME= <F1>
##$AXNUC= <1H>
##$AXRIGHT= 0
##$AXTYPE= 0
##$AXUNIT= <>
##$AZFE= 0.1
##$AZFW= 0.5
##$BCFW= 0
##$BC_mod= 0
##$BYTORDP= 0
##$COROFFS= 0
##$CY= 15
##$DATMOD= 1
##$DC= 0
##$DFILT= <>
##$DTYPP= 0
##$F1P= 0
##$F2P= 0
##$FCOR= 0.5
##$FTSIZE= 512
##$FT_mod= 6
##$GAMMA= 0
##$GB= 0
##$INTBC= 1
##$INTSCL= 1
##$ISEN= 128
##$LB= 0
##$LEV0= 0
##$LPBIN= 0
##$MAXI= 10000
##$MC2= 0
##$MEAN= 0
##$ME_mod= 0
##$MI= 1
##$NCOEF= 0
##$NC_proc= -5
##$NLEV= 6
##$NOISF1= 0
##$NOISF2= 0
##$NSP= 0
##$NTH_PI= 0
##$NZP= 0
##$OFFSET= 0.06497851
##$PC= 4
##$PHC0= 0
##$PHC1= 0
##$PH_mod= 2
##$PKNL= no
##$PPARMOD= 1
##$PPDIAG= 0
##$PPIPTYP= 0
##$PPMPNUM= 2147483647
##$PPRESOL= 1
##$PSCAL= 1
##$PSIGN= 0
##$PYNMP= <proc.py>
##$REVERSE= no
##$SF= 400.021882494141
##$SI= 512
##$SIGF1= 0.06497851
##$SIGF2= -0.06497862
##$SINO= 16
##$SIOLD= 512
##$SPECTYP= <>
##$SREGLST= <1H.MeOD>
##$SSB= 0
##$STSI= 512
##$STSR= 0
##$SW_p= 51.9856959427865
##$SYMM= 3
##$S_DEV= 2676
##$TDeff= 40
##$TDoff= 0
##$TI= <>
##$TILT= yes
##$TM1= 0
##$TM2= 0
##$TOPLEV= 0
##$USERP1= <user>
##$USERP2= <user>
##$USERP3= <user>
##$USERP4= <user>
##$USERP5= <user>
##$WDW= 3
##$XDIM= 16
##$YMAX_p= 291398592
##$YMIN_p= 0
$$ End of Bruker specific parameters
$$ ---------------------------------
##NTUPLES= nD NMR SPECTRUM
##VAR_NAME=  FREQUENCY1,    FREQUENCY2,      SPECTRUM
##SYMBOL=    F1,            F2,              Y
##.NUCLEUS=  1H,            1H
##VAR_TYPE=  INDEPENDENT,   INDEPENDENT,     DEPENDENT
##VAR_FORM=  AFFN,          AFFN,            ASDF
##VAR_DIM=   512,           16384,           16384
##UNITS=     HZ,            HZ,              ARBITRARY UNITS
##FACTOR=    0.101534562388255, 0.501933850740131, 1
##FIRST=     25.9928259484165, 8223.18227667557, 241
##LAST=      -25.8913354319817, 0,           -211
##MIN=       -25.8913354319817, 0,           0
##MAX=       25.9928259484165, 8223.18227667557, 291398592
##PAGE= F1=25.99282594842
##FIRST=     25.9928259484165, 8223.18227667557, 241
##DATA TABLE= (F2++(Y..Y)), PROFILE
$$ [...]
##PAGE= F1=-2.202297678447e-005
##FIRST=     25.9928259484165, 8223.18227667557, -314
##DATA TABLE= (F2++(Y..Y)), PROFILE
14569C320q12G37a776k065J858A42J426N54k91p31C65c30k23b63b1B66A26d05
14550a746j187R05a23A254L11F52a231j749e68B324J874Q17j33j382j580C84f76
14532a480p41p67k55R38h67C50Q25R5m41C13c38j124j038k441j010K704a398C97
14513A925J226R19R87k27j235j649A71a420j188J50a071E60J516R07j16q47n64
14496A456j94l43C93c25j229j621o4a301E17J319L77q3r23A34e32o4G24K061K249
14477E034J791Q76l1j017j587k513C40a674q23O49Q34b13F47J205J804J593J007
14460F256J270M94rk61j015j400k229G50a866j535P64R89P51c60E22N16R1C66
14441f81j155n97j56L16L15K94L03N4j56n90m83l15R7J52m84j114r24J34J167
$$ y = [3320, 2508, 737, -1776, -3841, -1983, 142, 1568, 2122, 1831, 1100, 365, -330, -553, -263, -21, 266, 126, -405, -1746, -2933, -2028, -123, 1254, 1565, 652, -1231, -2980, -568, 2324, 4198, 5015, 4882, 3500, 1920, 384, -676, -1480, -2221, -2988, -3243, -2305, -867, 350, 1175, 1270, 829, 313, -338, -1462, -2500, -4941, -5951, -3247, -1398, 397, 1925, 3151, 4070, 5057, 4830, 3595, 1946, 171, -1420, -2608, -2458, -1071, 560, 2076, 2983, 2867, 2020, 1456, 1262, 919, 393, -325, -1554, -3175, -3239, -1301, 517, 1836, 2213, 2130, 1207, 134, -532, -596, 724, 2785, 5034, 6825, 7701, 7670, 6653, 5066, 2553, 340, -1674, -2497, -1848, -1014, -213, 647, 1852, 3656, 5249, 6256, 7526, 8020, 8011, 7750, 6735, 5335, 3106, 750, -1866, -3401, -2637, -1648, -897, -360, 522, 1038, 1129, 366, -681, -1836, -2433, -2589, -2273, -1958, -1664, -1361, -1307, -1463, -2053, -2536, -2851, -2754, -2602, -3086, -4200, -5124, -4990, -3823]
14422c823J734R06M10n96o42k07J70M44O20M11b02C69O40J23k78C35b17h9E51
14402A116J66k73A51a021j382j664j520J71J402J135P44J003d26J65q01r53r5
14385b110l4m64J15Q65O97L09o34j859j026a444A682K417J400J42j404A967c86
14367b793p13m7M45M12Q2K97K28K90P85A0P35L67J77l34a31q42l01L7N35c26a48
14345C69N76O63M68M1o60B71f72k91A50J538J448J184M18N45N16N68M22J64N0
14326G003j11k28J79j56n37q06j081j169j161F81a50o43p29j037k65a357E12J520
14308B032P27P9l23k84m10H55e3q06n57q6j13l69m98m23j50Q34Q85N62O4n02o9
14287a281M93B03P96k44f14j350Q5P62M55K28a34A366L007K933J937k34j881k642
$$ y = [-3823, -2089, -1183, -773, -1369, -2011, -2218, -2048, -1604, -984, -573, -202, 369, 1009, 1132, 854, 335, -217, -89, 551, 1116, 1282, 1009, 151, -1021, -2403, -4067, -5587, -5416, -4014, -2879, -2135, -1132, -426, -261, -1062, -2015, -2110, -2144, -2608, -2493, -1628, -931, -622, -1256, -3115, -4141, -1444, 1682, 4099, 5499, 5641, 4237, 1967, -386, -2793, -3506, -3553, -3108, -2696, -2614, -2317, -2089, -1799, -1014, 10, 745, 1112, 1289, 955, -131, -973, -1274, -1237, -702, -326, -148, 369, 945, 1608, 2076, 2117, 1457, 271, -672, -963, 150, 1688, 3136, 4320, 4738, 5283, 5799, 6367, 6789, 6953, 7003, 6892, 6664, 6843, 6687, 6150, 5344, 4263, 3094, 1933, 681, -150, -793, -1522, -2559, -2824, -1357, 512, 2032, 2759, 2838, 2515, 2231, 1821, 855, -53, -859, -1416, -1502, -1615, -1984, -2482, -2905, -3055, -2221, -1336, -774, -710, -1212, -1281, -788, 203, 999, 755, -614, -1964, -1879, -1117, -662, -434, -134, 1366, 4373, 7306, 9243, 9009, 7128, 4486]
14269D486j652j127n22n55B87b39k96j61q82j148m78J023c85A559J606L63r83
14252B545A111a369l257b188D78J751J060k46j73r85E05J66J161J239Q44k62n71
14235C082l88J48L98L90Ln54j306c51k462Q18D20K115M16A399a343k738a118G37
14216A227k35E4e43A019J844J583R10n67j869B93a658l08f34F79P86N99m3n42
14198A479C89a579j395M94J034M55a91A420J913K358J589J050k3p49j424k073
14182D061j873p95k58l83c38j542j718o60J978Q97j2p05m67Q67f95b70J7o23o63
14163a539J35n1m61j154r21p12J152J199J163A31J179P03L07j34k81m82n60C86
14144C1a15A20J08r6b7k5F96P95L2o2k94l00q7N51J064J338Q12l76o37j252I11
$$ y = [4486, 2834, 1707, 1185, 630, 287, -239, -535, -696, -1578, -2726, -3204, -2181, -385, 1559, 3165, 3528, 2545, 1111, -1369, -4626, -2188, 478, 2229, 3289, 3043, 2870, 1885, 505, 671, 1832, 3071, 3915, 3653, 3082, 2694, 2842, 3240, 3630, 3633, 3079, 1773, -351, -2813, -1995, 420, 2535, 2951, 1399, -1343, -4081, -1118, 737, 1227, 992, 54, -543, 1019, 2863, 4446, 5356, 4789, 2920, 293, -1658, -1966, -634, 679, 1465, 2064, 2021, 1479, 389, -1579, -2974, -2480, -1446, -991, -191, 1420, 3333, 5691, 7280, 8330, 8307, 7558, 6134, 4061, 2188, 1393, 1135, 752, -338, -1880, -3598, -4258, -2280, -1383, -1395, -2100, -2567, -1700, -695, -270, -253, -876, -1539, -1404, -1455, -1916, -3070, -3991, -4703, -3551, -2352, -1189, 131, 1310, 2013, 2320, 2186, 1905, 1423, 863, 386, 31, -115, 120, 228, 132, -27, -52, 696, 1491, 1523, 1461, 1167, 867, 780, 1331, 2395, 3733, 4545, 4169, 3532, 2280, 911]
14122a37o75c06B39O93R12P90L66M0m08l90j58k00n97C24d30q57j001j118%M81
14102b925J48J137a08A484K034K521J442l63j874B410b07n81A36J028P36q6o35
14085A179k23C43b74n45c97I32J317Q03M4m96j134e3j060m27Q3f03R9b35C5a64
14064a098j459j503M33J333h53D58R60p9m4m29J11M20O29K62j41H05d18j067o0
14045a545g62C66L59k98c46r01j184j119O67c88B756K703J591k00j590k123H55
14027a218j303o90k90LQ8M56J112e10F72J036K05o19D78f27o9g7A02c3j62j09
14007c04k35q15q22r44o64Q34J440c72B78K11j27J13j9B19D0j1LL93L61mj53B17
13984AM36R64R93M10j76l58k92r27cp7D3P36J008M62K84o5k49n78D82i11j572
$$ y = [-137, -812, -306, 239, 932, 1844, 2634, 3000, 3040, 2632, 2242, 2084, 1884, 1287, 324, -430, -1287, -2288, -3406, -3406, -2925, -2777, -1640, -108, 1484, 3518, 6039, 7481, 7118, 5244, 2410, -207, -788, 136, 1164, 1900, 1814, 1179, 956, 343, -274, -819, -397, 932, 2249, 3052, 3096, 2600, 1466, -53, -1113, -1540, -1457, -603, -504, -235, 35, -164, -1098, -2557, -4060, -3627, -2294, -853, 458, 1418, 1339, 1295, 866, 977, 1397, 2026, 2288, 2147, 805, -418, -1485, -1545, -762, 366, 725, 427, -346, -1247, -2431, -3550, -2883, -388, 2756, 5459, 7050, 6850, 5260, 3137, 855, -1218, -2521, -3211, -3501, -3498, -3410, -2954, -1842, -510, 672, 1708, 1913, 1294, 478, -627, -696, -77, 102, -33, -195, -304, -539, -1354, -2176, -3120, -3784, -2950, -1510, -372, 278, 489, 362, 475, 456, 219, 40, 29, 32, 425, 786, 782, 629, 217, 1, 437, 1401, 2394, 2804, 2628, 2270, 1978, 1051, -3, -80, 43, 779, 1787, 2249, 2533, 2468, 2219, 1641, 482, -911, -2483]
13963b483q06J0J198e07A003J380J309J112J051J109Q70L43%o78n12J31n12j397
13945E209j818j077o49k15L53M75K20o57D43a749j894J439e01N0j082j347j151
13928d031m30P28J363h76G81J192L34m81C91a702j855j391J083J191R19L50k43
13911a648k53LN01O42M0m36K15n92K32O13C56R34P52K91o0o52m32L50K24o6k0
13890A677H07e93j468q48K53O37J73L34J94P0K66l04o37p29k51L14L41L89K15
13871a644J87M75D36J448Q13k40I54h79j682j499r66M11K64O72M62J07j170n08
13853d788l93o67p16Q45J476J804a214e44IO67L25N45k46D32a060k137j403P66
13835c834J768h52c40o0o24m86n64m43m19p20k06J249b22B666K789J935J017L84
$$ y = [-2483, -3289, -3279, -2081, -507, 1003, 2383, 3692, 4804, 5855, 6964, 7834, 8177, 8177, 7499, 6987, 7118, 6606, 5209, 3391, 2314, 1665, 1450, 1803, 2278, 2498, 1841, 443, -1749, -3643, -2204, -501, -451, -1533, -2880, -4031, -4461, -3733, -2370, -876, 781, 1973, 2307, 1826, 391, -1702, -3557, -4948, -3865, -2674, -1755, -1405, -1648, -1901, -1898, -1397, -755, -715, -1151, -936, -1528, -1296, -683, 356, 1290, 2042, 2333, 2273, 1621, 1189, 1539, 1763, 1697, 1677, 807, -593, -2061, -2909, -2656, -2019, -1846, -1512, -1318, -1248, -982, -1286, -1923, -2652, -2903, -2589, -2248, -1859, -1644, -1457, -982, 436, 1884, 2697, 2457, 954, -879, -2561, -4060, -5026, -4615, -4351, -3679, -3217, -3110, -4280, -4788, -5181, -5848, -6564, -5719, -4243, -2439, -1214, -544, 9, 676, 1001, 1546, 1300, 432, -1060, -3197, -4600, -3834, -2066, -852, -340, -400, -1024, -1510, -2074, -2517, -2936, -3656, -3862, -2613, -222, 2666, 5455, 7390, 8407, 8791]
13817H791k6j46r83r76j025q01o16j110j422D93k7N35Q25L82K59n16D54a403j008
13798b411K18L16j66j445j031a948D81J927P6j169i84j993J359G19J549L92m88
13781B172o31E51i12j357j63M27J67h80I76K498K430J559L75j363k251j796A171
13763A79a65k84A44N37A80f99q69p33M5O38j25k8L08L51J38o38j160p8a161D33
13742A465Ro85f1n37r2j57p42j459a166D81J072J202O28j38p47A063f00j432m12
13723b444M87b74A637K024J957P62n61j047j455j320l89J56J69j71j97l91l48
13706H26B25i51o86f02i6D0c24n43j005j5m35m79j97M80N94h31j90n69j266j601
13686d457P03J811b87E37A36h82r31j89j41k26n86r70p82J728a256B48O02j69
$$ y = [8791, 8765, 8619, 7636, 6660, 5635, 4834, 4218, 3108, 1686, 493, 466, 1001, 1826, 2208, 2467, 1951, 454, -1403, -2411, -2193, -1877, -2043, -3488, -4519, -1948, 481, 2408, 2484, 1315, -984, -2977, -1618, 719, 2268, 2660, 2172, 1541, 551, -912, -2269, -2432, -2005, -1838, -880, 976, 3474, 5904, 7463, 7838, 6475, 4224, 2428, 1171, 179, -165, -449, 144, 681, 180, -699, -1568, -2301, -2256, -1618, -1743, -1771, -1463, -1112, -974, -1612, -2772, -2850, -1161, 433, 1465, 1474, 789, -61, -598, -690, -847, -1589, -3048, -1166, 481, 1553, 2755, 3383, 3245, 2498, 1063, -600, -2032, -2444, -1957, -274, 1637, 3661, 5618, 6380, 5819, 4772, 3317, 1997, 1608, 1764, 1933, 1762, 1565, 1174, 826, 225, -951, -1637, -602, -96, 40, -324, -867, -1872, -1887, -2322, -2801, -2998, -2518, -1924, -831, -1021, -1590, -2856, -4457, -3754, -1943, -287, 537, 136, -882, -1813, -2002, -2143, -2369, -2955, -3925, -4707, -2979, -1256, 248, 850, 681]
13668F81F2i23r82p25j43J26M71L43K15M39L83K39o3j04j62p32p04n06m94o08
13648c930n3J068J106L58k80n92m16k28m73l78J74K40M51L68J29L10K40K16j44
13629a834n60k79L4R82b71F33J62C65d32r54o23P9P82b91C37J13d72j471N01D26
13608A837O26j42r09B01i70r32o87q27K30J268f03D29M64J1m1O51J209J288J551
13589E562J187R55Q6q63j436j124p82j97l93p62H42a260k155O77f34A068O73o6
13571A675l59E23h79j566k74a011G48J768J779K477J921R18J45p25r38j070j670
13554E353j989I80f33p95N1l2l91o77n77j84K8K46J57J11m28l10J65N93M81K96
13534a899k4K94K2K07O00A98R19Q93J64l97H09d7p76p0J31c45J09m66o92j046
$$ y = [681, 62, -923, -1905, -2630, -2773, -2647, -2176, -1833, -1618, -1179, -796, -557, -620, -724, -886, -1618, -2322, -2828, -3322, -3930, -3983, -2915, -1809, -1451, -1731, -2323, -2739, -2967, -3440, -3818, -3644, -3404, -2953, -2585, -2456, -2146, -1906, -1690, -1834, -2394, -2673, -2639, -1657, -271, 633, 795, 365, -432, -1386, -2009, -1930, -1148, -291, 337, 450, -472, -1943, -1442, 426, 1837, 2463, 2321, 1412, 201, -970, -1902, -2589, -3416, -3186, -1918, -603, 429, 893, 904, 863, 1514, 2723, 4011, 5562, 6749, 7704, 7790, 6927, 5491, 4367, 3585, 3388, 2995, 2233, 842, -1260, -3415, -2738, -634, 1068, 1741, 1675, 1316, 523, -879, -2445, -2719, -1011, 748, 2516, 4295, 6772, 8693, 9611, 9756, 9031, 8093, 7023, 5353, 3364, 980, -633, -1428, -1377, -1409, -1800, -2477, -3054, -3238, -3210, -2964, -2807, -2696, -3124, -3434, -3269, -2676, -2195, -1899, -1923, -1629, -1607, -1400, -800, 198, 1117, 2010, 2174, 1777, 809, -47, -823, -893, -762, -345, -236, -702, -1394, -2440]
13514b440j288m30K70J28O77O10jk20k01M94Q51b99A69a97k251j409J214P17O00
13495a326A70K333J865J078J1j606A334a730n03E32K568J291L77n40p45o56p82
13478B045p25D41c51n89o34o03m79o48j22J99Ln75p89R66J455h43H1d0p83o62
13458a485n80O6N76b02I37K03D30e39r87n30K42P01L47J27N7c6D80N25L87J09
13438A501l24E45b60j055j156q72J23J261g00B46Q19J74D03a106j383K99J039
13421a151c42A83N3K15M65J75k39a29j276o15i20F04J483R39L16m55j052D98f73
13401a766k92R74B65J090M42l98E05c77o49M83G28J745R80P90Rq39l06o66j89
13382B252m38o43m35L0P0p0A25h97j509j712J80J160P74j70j011M80e76A345J510
$$ y = [-2440, -3728, -4158, -3888, -3760, -3083, -2473, -2474, -2694, -2895, -2401, -1550, -299, 169, -197, -2448, -3857, -2643, -1926, -1326, 170, 2503, 4368, 5446, 5457, 3851, 1334, -1730, -2233, 532, 3100, 4391, 4768, 4228, 3483, 2827, 2045, 1320, 441, -351, -940, -1574, -2177, -2656, -3304, -3426, -3227, -3224, -3799, -4588, -3622, -2167, -843, 81, -40, -823, -1485, -2065, -1999, -1423, -202, 937, 1140, 430, -539, -1526, -2056, -1814, -1113, -766, -639, -582, -36, 480, 1005, 1392, 1501, 1177, 545, -260, -1315, -2471, -3343, -3220, -1959, -700, 246, 1065, 1239, 403, -1106, -2489, -2190, -1151, -342, 183, 236, 451, 916, 1091, 852, -129, -1405, -2020, -920, 604, 2087, 3026, 3342, 2887, 1835, 498, -673, -1766, -2058, -1084, 265, 1355, 1797, 1399, 505, -377, -1026, -543, 728, 2473, 3453, 4243, 4252, 3413, 3107, 2441, 2252, 1814, 1171, 736, 766, 836, 766, 125, -897, -2406, -4118, -3938, -2778, -2004, -2174, -3185, -2705, -576, 1345, 2855]
13363B855O46j96j209h4k802a274A881K278J564N45o33j139j656A283C0a348j220
13346b568Q51A050L246K501J350R18o99j667k367j701A149C75K7L77Q28M56J05
13329B168o29F25Q8J332J770J530N28n98j325j316G45a34DJ09a33B93M85N60p0
13310A268A49a641j710O67e44A365R69M02k73p90F20d28n78n1K46f3G36J014Q53
13291B603N85j88m48m44k68k36m57E27a17n82j87M00J77l5l79j07M01A53N16N87
13271A256L02K13P06O56L24k85j269B46i14n55c05A437J806J901J538nj759B116
13252f46b62B503J865l3j389F87a753o36R33L09j014j085J392i05L23k61o48o68
13234b159oN74O18c24J31j98q5k02n17l26P08D99J137L61q28c35j062n85L47g28
$$ y = [2855, 3501, 3305, 2096, -84, -2886, -1274, 1881, 4159, 5723, 6268, 5635, 4496, 2840, 1283, 30, -1348, -2568, -1717, 1050, 4296, 6797, 8147, 9065, 8366, 6699, 4332, 2631, 1149, 375, 402, 779, 1607, 2063, 2168, 1539, 625, 713, 2045, 3815, 5345, 5873, 5275, 3950, 2634, 745, -134, 4, 113, -133, 293, 778, 1338, 1268, 149, -1641, -3351, -2684, -544, 1365, 2334, 2736, 2463, 1673, 620, -428, -1006, -1057, -811, -63, 736, 1750, 2603, 3188, 3000, 2552, 2108, 1840, 1604, 1147, 527, -117, -699, -886, -486, -309, -344, -723, -830, -429, 153, 669, 1256, 1558, 1771, 2477, 3133, 3457, 3172, 1903, 246, -914, -1469, -305, 1437, 3243, 5144, 6682, 6677, 4918, 2116, -646, -262, 2503, 4368, 4335, 2946, 687, -1753, -2389, -1456, -1147, -2161, -3246, -1854, -905, -582, -843, -1491, -2159, -2165, -1591, -973, -324, -193, -391, -476, -678, -1195, -1521, -813, 499, 1636, 1997, 1169, -335, -1397, -1982, -1635, -728]
13213A74M84o3d67j123j91d09H78L41D36e19r89o17j33o0J7j02j22r8J80K77j38
13192b304k55j38N82P27N96c65E7O27K69L10K6n73j51Q42J502J692P75n42j472
13173C362A308E1L10J236J367R90P7j004H05b585j425c33B973K789J839n00j787
13156E314B372c50o62C77Q67m4G5a406j110p46l07Q48i76H06J609R59J20p07j169
13137A618n44Q89J564Q29J63m00n09n23l07j85K52J38j289a04j741j056R25Q15
13119a161N32L04B62P68Q83R70K01K02j65j87q45j023A72a15B52O42J54D57g24
13099c078J2A50K767J273j09r88A027a673j807J728H37J214L06l95j79J7M53P60
13081C013L74j78j52j40n34r62D47b74F44K282K473J931Q88r72k472A173b123
$$ y = [174, 658, 595, -467, -1590, -1781, -409, 878, 1219, 436, -519, -1508, -2125, -2258, -2318, -2301, -2403, -2525, -2623, -2443, -2166, -2304, -2559, -2697, -2115, -1388, -792, -365, 57, 684, 953, 1263, 1289, 716, 565, 1407, 2909, 4601, 5376, 4834, 3362, 1308, 51, 361, 1597, 2964, 3954, 4031, 3027, 805, -2585, -4010, -333, 2973, 5762, 7601, 7101, 5314, 2372, -350, -1012, 377, 1244, 1200, 75, -1406, -2516, -3262, -3569, -2721, -976, 806, 2415, 3374, 3494, 2787, 1618, 1074, 1963, 3527, 4356, 4519, 4119, 3610, 3087, 2780, 2595, 2847, 2985, 1696, -104, -1845, -2901, -1976, -1161, -629, -325, 262, 1030, 1913, 2883, 3084, 3286, 3121, 2934, 2089, 1066, 172, -115, 252, 894, 1048, 457, -724, -3078, -3066, 150, 2917, 4190, 4081, 3093, 1027, -1673, -3480, -1752, 837, 2051, 2357, 1962, 1783, 1800, 2253, 3013, 3387, 3209, 3057, 2917, 2383, 1421, 447, -274, 644, 2926, 5399, 7330, 8218, 7246, 4774, 1173, -2123]
13063b366A08K007N67q24c58k408a034A673J663J334N95l63q21j081j103p35k14
13046I48P2K64j07D12f50n33N3M23J25j96l56m85n51M43g98C86J353J112j11o94
13026B046C31g71p8B43Q30M44Q1J0k55n47j28L15J55L93N36J68j62A032H4a342
13005b251N45g37B1J11O0R5P87J294J542Q47M37o68j020j382l33N92R61M47L14
12986D105k80j55l55n82A270h8j310j110q23O49a248H4J489J155L26p85G04i66
12967b448k29P73K76J17O33M14A36O91N43k20b84k031q73J499B26J113K11k26
12949A324C93e96o02k39j49n49q09a059B059L042L351J632k10j780k685k214j523
12932A672F49A46e92q62q29q88p72m60j30K00Q65J673bA331Q12k20L38L00L39
$$ y = [-2366, 108, 2115, 2682, 1858, -358, -2766, -1034, 1673, 3336, 4670, 5265, 4902, 4081, 3000, 1897, 1162, 948, 1020, 1284, 1177, 412, -650, -1183, -1130, -707, -582, -778, -1134, -1619, -2170, -1727, -798, 386, 1739, 2851, 2740, 2046, 331, -771, -849, 243, 1073, 1517, 1598, 1608, 1353, 806, 678, 993, 1148, 1541, 2077, 2245, 2083, 1032, 84, -1342, -2251, -1706, -737, 21, 132, 192, 287, 1074, 2368, 3910, 4757, 5194, 4526, 3506, 2124, 1791, 2383, 3344, 3791, 4105, 3825, 3670, 3315, 2733, 1270, -88, -1398, -2508, -3331, -2682, -1248, 84, 1573, 2728, 3054, 2269, 704, -966, -2448, -2677, -1904, -1628, -1511, -878, -464, 136, 827, 1370, 1150, -284, -2315, -3188, -1689, 226, 1339, 1550, 1324, 393, -596, -1198, -1437, -1586, -2135, -2944, -1059, 2059, 5101, 8452, 10084, 9874, 8094, 5409, 3195, 1672, 649, 146, -592, -1454, -2283, -3171, -3943, -4403, -4533, -4333, -3468, -1795, -2, 1331, 2143, 1923, 2261, 2561, 2900]
12913B900j0j45n24n42D21i83K25A424K174J647N78p19j535j674C10a071n63J74
12895a460L13d20G54J029O26k35q43d8j867k000R40J416J62n06j129j77M93L70
12877b346K85J29K5Np0MP0Om92N57a15B336J698Q55M51L88l53n06o10l02n14r18
12855B525j103m78K13Q32P27P30Q96Q47O47k32j089j652H96a092j331Q16B25J805
12837B030J223Q64o27A679e98l15B528K663J037l70j077j071q95n9M33J54l79
12820B964j059D46j98Q46N2J93p7m58A53c05B7M81K64J1l72a62n84p8n6J51K95
12799d34D51J771J786K053J500M32o41j453k341H76a164r11l45O17L61K10K32
12782a000k38j20n65p74l52P68g82H25J449P42l27q57C96g20o86L22a5A248J164
$$ y = [2900, 2890, 2745, 2221, 1679, 421, -983, -758, 1424, 3598, 5245, 5823, 5104, 3569, 1895, 310, -1071, -1634, -1460, -1147, -420, 754, 1783, 2409, 2174, 1331, -48, -1915, -3915, -2975, -1559, -1397, -1903, -3032, -3209, -2716, -2346, -2061, -1932, -1907, -1902, -1972, -1968, -1898, -1892, -2384, -1827, -115, 2336, 4034, 4889, 5340, 5728, 5375, 4869, 4259, 3957, 3443, 2525, 1422, 944, 1157, 1989, 2716, 3446, 4342, 5189, 5836, 5604, 4515, 2863, 896, -1092, -2423, -1607, 225, 2030, 3253, 4117, 3490, 1679, -598, -913, 2528, 5191, 6228, 5858, 4781, 3710, 2815, 2756, 3189, 3343, 2964, 1905, 446, 248, 1094, 1146, 1339, 1262, 804, 153, -305, 27, 508, 772, 783, 411, -162, -746, -824, -880, -729, -434, 451, 2222, 4008, 6061, 7561, 7993, 7352, 5899, 3558, 876, -1164, -2075, -2420, -1803, -1442, -1232, -1000, -1238, -1358, -1923, -2697, -3049, -2281, -782, 825, 2274, 3016, 2689, 1832, 396, -720, -1406, -1084, -15, 1248, 2412]
12763B412O78L12L2m84j417c79k586m07J379O42N8m10o05j166l85J623I43L211
12745D154K958J428k07j825k195j524j304e9r60J54m54r10r07n38k30O80N06K44
12727b474J6K26M79P16I8J208K97n49f2j170n93b95B138K366J523j25j294j496
12709C112j490G19f0m83j005m98j60m4J42l12j142J009f98D61P08l45d80j673
12691b153j177q7O83J335b15I65O51K95L6J91q2l49D05a471j231J17n7o29j8a519
12670D91J595O96l67A130h01k067j401J12N28N28J045R36d82I8B0K08L09M69O82
12651A688P93O53Q4k28m79n93N3K55M28J5r15C21a737j355L49J227c49D63O30
12632A093M25O7k91F26d42o25k88k03m53o36r7J82j45k67j12O94P71f54A79K18
$$ y = [2412, 3090, 3402, 3434, 2950, 1533, -379, -2965, -3372, -1993, -1351, -1293, -1703, -2308, -3474, -3859, -2236, 943, 4154, 7112, 8540, 8333, 6508, 4313, 2789, 1485, -59, -1019, -865, -1319, -2229, -3136, -3674, -3904, -3224, -2718, -2474, -2458, -2232, -1753, -1037, 98, 1306, 1603, 1054, -62, -1232, -1825, -295, 2138, 4504, 6027, 5902, 4608, 3112, 1622, 719, -60, -543, -1548, -2046, -2206, -2250, -2108, -2420, -3562, -2553, -698, 461, 1169, 824, -480, -2153, -3330, -3417, -2734, -1399, -215, 965, 1616, 1911, 1947, 2138, 2056, 1707, 405, -1471, -2702, -2585, -2642, -3271, -3289, -1519, 491, 2086, 2782, 2415, 1130, -801, -2868, -4269, -4157, -3629, -3101, -2056, -1120, -482, 98, 20, 228, 537, 1006, 1688, 2481, 3134, 3218, 2990, 2511, 1918, 1971, 2226, 2654, 2669, 1754, 321, -1737, -3092, -2743, -1516, -349, 463, 1093, 1518, 1585, 1294, 626, -442, -1067, -1355, -1558, -2011, -2647, -2744, -2562, -2707, -2974, -3086, -2392, -1621, -654, 179, 397]
12612C97m1c56j250j633q50J829g74b19A09L66L25L57M05P0o34G7e32k26L14C48
12591A138P97L4j64G50a58q82M1j52o41p02j80L81N22b90A619J705J497J031n56
12572E296j941I94C26Q84J123j18F26a706k410K69J912b19A085R75O74J68m53
12555B449n65H56C26N83M06k27d2k113j766r2J676P98K77q4o2k58q27q40N07O70
12535b156P81f19g2B38B8g36m95b8A966J904J465j62j509A426a29I2J703J345
12517C140Q12r21Cc218m62g00A134J81n32e45q69c89A046O55n39g79k044f10B918
12497E523P94r68j684F93b567M35E14J494M04p10D84e18K55F79N01K8J37m0j19
12478A186m31A25f49r00p17k14R94gA537J033P76L77r53A364a14q52o43o16r37
$$ y = [397, 356, -356, -1606, -3239, -4089, -2260, -774, -219, 109, 475, 800, 1157, 1562, 1632, 998, 77, -532, -758, -444, 348, 1138, 1935, 1969, 1805, 750, -158, -1040, -999, -1151, -1792, -2494, -2674, -2293, -1771, -290, 1619, 3324, 4821, 5852, 5296, 3355, 994, 326, 1210, 2333, 2215, 626, -1706, -4116, -3847, -1935, -219, 1085, 2060, 2734, 2902, 2449, 1884, 856, 326, 909, 1315, 1088, -42, -2155, -3921, -4013, -2337, -1539, -1262, -1346, -1408, -1666, -2493, -3333, -2826, -2156, -1375, -619, -72, 238, 28, -736, -1231, -28, 1966, 3870, 5335, 5173, 3664, 1426, -129, 92, 1795, 3140, 3952, 3031, 3, -3218, -3680, -700, 1134, 1315, 783, -545, -1414, -389, 1046, 1701, 1162, -779, -2823, -610, 2918, 5523, 6317, 5349, 3665, 693, -2567, -2132, 514, 2008, 2412, 1702, 484, -518, -263, 679, 1180, 1208, 1345, 1305, 1186, 755, 125, -649, -1549, -2266, -2480, -1486, -7, 1537, 2570, 3346, 3723, 2770, 1364, -114, -966, -1609, -2225, -3162]
12459c162p52L47R04J100L40j54l5j58k53K81O75J76p71j802M00J334i3A279Q45
12440B124L18j41j060f43j886a021E78J104J740g62o0j96o83m61k69J57N35g87
12421a91E61L35R06J82j42m47A87f57j31O0L59o6j29l13k52j78K51b20C70R41
12401A311O18N61j34p02A43a821j924J44J377a030C7M06M69k04a96j423j721q74
12383d214J486e25A158L61k21o21C3g63j032j144p31J323a127M27p37j906J541
12366a802I64J584K19j241a190j768J110f1A175J35F03e50j245j42N04k47p73
12349b453j075m18Q25J547B33J268J11m39C56c18k37a36k55m34J04b93B6K59Q6
12330C71J33R38J047Q41N70j20p25A283h55q00K88J45l62r75j405J371b21A352
$$ y = [-3162, -3914, -3567, -2663, -1563, -1223, -1377, -1412, -1570, -1823, -1542, -867, -691, -1462, -3264, -2864, -1530, -93, 1279, 2124, 2442, 2301, 1241, -643, -2529, -1021, 578, 1682, 3422, -762, -822, -1018, -1701, -2162, -2431, -2274, -1739, -787, -191, 561, 896, 1802, 1984, 1842, 1395, 187, -657, -788, -728, -369, -435, -564, -877, -1129, -1307, -1056, -220, 370, 1311, 1929, 2490, 2356, 1654, 143, -1821, -3745, -3601, -2224, -1030, 37, 443, 912, 708, -196, -1619, -3340, -4214, -2728, -525, 1158, 1519, 1298, 677, 33, -763, -1795, -2939, -3670, -2347, -1127, -700, -1437, -3343, -1802, 964, 2548, 2767, 1526, -1190, -2958, -1848, -61, 1175, 1310, 603, -550, -1795, -1937, -1433, -1680, -2453, -3528, -3946, -3121, -1574, 233, 1501, 1612, 1173, 356, -318, -555, -136, -391, -825, -721, -293, 26, 285, 371, 504, 1442, 2489, 3330, 3900, 3780, 3055, 1283, -855, -1655, -1367, -1222, -1584, -2559, -3964, -2593, -221, 1352]
12311B201n5n83E69g69j082O86A52M17M09N99Q97M78Q3n84p37H35I9d00q24r28
12291b152o93j87K06o52j072J385f47B087K112J710L56m46j400r17j029j102m08
12274I63J10J25J10J15Q79J011J091O56m48j611A291e35j402j315r44J112a261
12256b54l86j520j447j453m02K129a065H49O45m39c54k135j030a395A176K238
12240C414J303L59o21j080j251j008n24L4J23j54I3c92o72J9a68I57L78m7A38
12220A74i02q65j078q85J266a194M78l2lJ39B12J179J483J376J078K86j476A669
12201a195p23D93K273J199J08o20j035A112C8i02o55o60k56rR66b24G81R17R69
12182B667M32K44N91J006J123R22R0j340k176H47a743j184Q69i29J32o28o80J88
$$ y = [2201, 2146, 1563, 569, -769, -1851, -1165, 152, 569, 978, 1577, 2474, 2952, 3035, 2451, 1714, 835, 99, -400, -1224, -2152, -2845, -3032, -2826, -3478, -4550, -3165, -647, 2087, 4199, 5909, 6265, 5819, 4419, 3502, 2473, 1371, 963, 1073, 1198, 1308, 1423, 2302, 3313, 4404, 5060, 4612, 3001, 1291, -535, -1937, -3252, -4196, -3084, -1261, -254, -640, -2160, -3607, -5060, -5462, -3333, -1065, 849, 1494, 1055, -354, -2489, -3519, -1395, 1176, 3414, 4717, 5076, 4455, 3375, 2124, 1116, 592, 626, 749, 595, 93, -392, -1064, -1045, -168, 957, 1335, 1288, 138, 174, -902, -1767, -2845, -3730, -2464, -1194, -716, -748, -751, -612, 212, 1391, 2874, 4250, 5328, 5614, 4138, 1669, -1195, -1918, 493, 2766, 3965, 4073, 3453, 2418, 1112, 38, -902, -1557, -2217, -2473, -2482, -1516, -224, 781, 1698, 2667, 3099, 3343, 3934, 4940, 6063, 6985, 7075, 5735, 3559, 847, -1743, -2927, -2058, -929, -797, -1425, -2105, -1917]
12164a917M80n66j125L77J223N87q3o75j305q45N64L54l51j128m72Q28N34r5m65
12145d080r5k26M47O56P97i72F41J700K25o63q54B81E9c7n14r48k87L5m85l83
12125b619o47p82N24J317i76d29l48m54r64m24L93J78m27q40J92J398g78A26J23
12106B49O4P57J027J395M08j014r83G62B26Q10J106N44j05k84q16o83A46a049
12087b249j428K10Q45J163c39I24R64L05q40B08f79k05C07K241K578J420P47j50
12069G143j071j849k070E4a537k94N50j38q79R36C370P263O603M367J264j729
12053B1138m337n687n532A663B27a77e6n87o40m60P14C63J737J499J439N82m41
12036E179j908A342A84M65J498Q84k4n69o77n61K0O37P94K76q50i0k060l44M9
$$ y = [-1917, -1437, -2003, -3128, -2751, -1528, -941, -1024, -1699, -3004, -3849, -3285, -2931, -3282, -4410, -4882, -4054, -3520, -3615, -4080, -4175, -4401, -3954, -3298, -2501, -972, 641, 2341, 2566, 1903, 1049, 281, 59, -37, -551, -1499, -1786, -1751, -2236, -2619, -3266, -4048, -3524, -2207, -976, -429, -777, -1231, -2195, -2619, -2226, -2048, -2475, -3315, -3123, -1725, -778, 126, 249, 313, 1070, 2097, 3492, 3900, 2886, 1903, 762, 226, 1036, 2142, 2686, 2581, 2297, 1481, 798, 146, -1049, -2249, -3677, -3467, -2622, -1459, -339, 924, 1888, 2193, 1353, 208, -679, -884, 307, 2548, 5126, 6546, 7293, 7143, 6072, 4223, 2153, 54, -1537, -1831, -1281, -1419, -2298, -1362, 3370, 10633, 17236, 21603, 22867, 21138, 16801, 11114, 5582, 1663, 227, -177, -56, -643, -1283, -1743, -1029, 363, 2100, 3599, 5038, 5620, 5179, 3271, 1342, 184, 649, 2147, 3031, 3007, 2438, 1761, 1200, 1220, 1857, 2651, 2927, 2077, -90, -2150, -2494, -2445]
12017b445n30l87K60J349E1J187P82O50J010K212R72k5j004j952j777A42a591
11999a326b05cp12j139o50P57d96C50M61N97N26N49j11j126d08k469O41A271J986
11980C257K83j076k47M507O340N297L199M77k151l606m379m377C722G32a854p68
11964b622J201O28a67E30J220Q36J74o75H93d20p64n12M70c52D05O0a03r21j549
11945b573j48J283c8A572J084J21j019a004l359J123b1B952J205L99j91p48r95
11928B622A181F4b13b7k68k47r78j301p83l59K77R66R38Q68A8Q51P48O07Q7m27
11908A884F53g86m49P0j273k182J884B12K527R87n23A384a530k705R40a608P16
11891h92J92K89q4n51m52k5d33F20J060L00r6j83L54P60Q68L35q29A247a546k005
$$ y = [-2445, -2975, -3362, -3102, -1753, 51, 1238, 2020, 2670, 3680, 5892, 6864, 6839, 5835, 3883, 2106, 142, -1591, -1326, -205, -3, -715, -1854, -2504, -1747, -496, 350, 811, 1408, 1934, 2483, 2372, 1246, -408, -2877, -2236, 1271, 3257, 3540, 2464, 2217, 6724, 13064, 18361, 21560, 22037, 19886, 16280, 11901, 7524, 3722, 732, -1854, -2622, -1421, -793, -167, 530, 1750, 2586, 2760, 2085, 893, -420, -1184, -1696, -1226, -352, 405, 465, -103, -1024, -2573, -2721, -1438, -38, 1572, 2656, 2777, 1758, -1004, -4363, -3240, -21, 2952, 4157, 4556, 4365, 3617, 2622, 1181, 64, -213, -27, -295, -542, -1520, -2821, -3604, -3963, -3686, -2720, -1782, -914, 18, 869, 1617, 2224, 2311, 1884, 653, -786, -1235, -1165, -2438, -4620, -2736, 212, 2739, 3726, 3203, 1384, -1530, -4235, -3295, -1608, -892, -700, -411, -495, -1046, -1498, -1523, -433, 620, 1680, 1980, 1884, 1701, 2055, 2815, 3683, 4018, 3189, 1247, -1546, -3551]
11871c551Q51i63C59R81J076P35K02r50c00l529k795K504a532E99P58l12b71k160
11853b431q63a080g2A92N53J269K154J545K35j049k042A079n14Q97K500K377J523
11836G862L0j016j664k028j411o09m66c05p82o25k70k37L2N68f61E01J422J402
11818C325L23n77j529f66k262L58D28L218K111K59k465f66n191b785b9C79d62
11800e42B403L069K278K916O679R752J0741O172J419m797q542j0638q983n345
11786G124j636r97j093j085H40a823l072Q8a695D23M03O49O11J27A031h63j339
11769b202P60c3A220N40j22k83F30d92j380j537j166O39J076J027e79E47J168
11752A715J893O04q1k06p17j333C96h31j114q15o45k48M77P52O92g83B71R32L84
$$ y = [-3551, -2700, -963, 359, 1340, 2416, 3151, 3353, 2403, -300, -3829, -6624, -4120, -1532, 599, 1357, 1045, -271, -2431, -3294, -1080, -72, 192, 745, 2014, 4168, 5713, 5948, 4899, 2857, 1079, 565, 1462, 3962, 6339, 7862, 7892, 6876, 5212, 3184, 1773, 1164, 698, -305, -1087, -1712, -1982, -2219, -2187, -1619, -661, 501, 1923, 3325, 3648, 3071, 1542, -666, -2928, -2570, 428, 3646, 5757, 6016, 3551, -666, -5857, -2785, -29, 379, -462, -542, 2403, 5472, 7750, 10666, 17345, 27097, 37838, 44010, 45429, 40632, 32090, 21452, 12469, 7124, 5488, 4491, 3398, 2313, 840, -1823, -4895, -4807, -1695, 423, 826, 1475, 2086, 2213, 1031, -863, -2202, -1442, -33, 1220, 1760, 1638, 1355, 630, -492, -1872, -3409, -4575, -3936, -2860, -1833, -579, 547, 1715, 3608, 4212, 4131, 3925, 3208, 1875, 396, -831, -1945, -2760, -3405, -3653, -3176, -2424, -1732, -783, 271, 1203, 1587]
11733A587m14C81A86P65J188O39k8k97A025c14j060n96K71c09A486J526P84j88
11715C608j109j085l73M09N70m1q73a007k108N14J222N56N3p78j055q1M40K37
11697b007N58k62m14j60M36R01a74C58N98P42P08O46J14n52q67D40i76j268p84
11678c028n07M22Q5J48M68J018B22J012J59n7l49N2D67d58j736j634O6J236M55
11659b071L53n96j461q60k73N38J066P22M14R40e10p1n58o37l13N90c64H94R76
11640A870N88J825Q33J041p9j539A917a679j118H5K318J373O1j104F64b518k186
11623d704J702J333N46c16c4B30h4r37o42r30q96q98l18L86J14j7J979a93A591
11603B157o85c77k167M89e04a00j360k696L61a586a18G04N7k11L62R75K24I16
$$ y = [1587, 1173, 381, 186, 951, 2139, 2778, 2750, 2453, 1025, -314, -1374, -1970, -1699, -309, 1486, 3012, 3796, 3608, 2499, 1414, 1041, 1450, 2020, 1979, 1106, -1007, -3115, -2601, -1379, -823, -770, -1548, -2603, -2684, -2244, -2007, -1449, -1711, -2125, -2285, -1849, -948, -174, 358, 956, 1698, 2406, 3052, 3166, 2614, 1747, 440, -976, -2244, -3028, -3535, -3113, -3028, -2880, -2412, -1394, 222, 1234, 1393, 1336, 987, 1039, 467, -458, -2194, -3828, -3762, -2526, -2071, -1718, -2314, -3775, -4635, -4908, -4370, -3304, -2582, -2168, -1228, -510, -581, -1139, -1776, -2089, -1499, -364, 894, 1870, 2458, 4283, 5116, 6157, 6078, 4539, 1917, -1679, -2797, 85, 2403, 3776, 3837, 2733, 664, -2518, -4704, -3002, -1669, -1123, -316, -34, 230, -84, -1021, -1663, -2593, -3489, -4387, -4705, -4319, -4205, -4222, -2243, -193, 1591, 2157, 1472, -377, -2544, -2055, -504, -100, -1460, -4156, -3795, -1586, -118, 704, 761, 550, 912, 1887, 2111, 916]
11584g06j623j260j89J203J118e36A8K06A07a49l87l71q13q33N27i09I42J591
11566B533J077J5j731f84j465k87b88A894R57o29r97B18K83P79Q42R4J426k47
11548C395j484D74g42m99k173k946k057J36J511J425J694J586N71J5p29n02N10
11531b200d12A499J199O5j044A73b816l875J564a100D363M188J441k640k098k583
11515B671a521i4E269L306R75L91j138k318k070j540j008K00J247R97L02j031
11499C582A294b195k565a894a21A515N5b49j716j771J58J012a229A99J078K87
11483A564m71a07j525j200r90O02J301h64b9D19B0d13q76k41j13J09l32j18N0
11464a934J51J72O0r3l71q11j016p9J517e91A321J426Q37jj175F29a124j695r67
$$ y = [-706, -2329, -3589, -3778, -2575, -1457, -536, 18, 224, 107, -149, -536, -907, -1720, -2553, -2026, -909, 942, 2533, 3610, 3625, 1894, -684, -2149, -2436, -288, 1894, 2851, 2222, 1225, 218, 501, 1280, 2122, 2216, 3642, 3395, 1911, 474, -742, -1241, -3414, -6360, -8417, -8281, -6770, -5345, -3651, -2065, -1494, -1479, -2208, -2710, -2200, -412, 1499, 2698, 2763, 1719, 173, -2816, -6691, -5127, -1100, 4363, 8551, 9992, 7352, 5254, 2671, -1521, -94, 5269, 8575, 9550, 9941, 8803, 6485, 4415, 2875, 1867, 2067, 3314, 4311, 4613, 3582, 1294, -2195, -4760, -1894, -121, 1515, 1570, -249, -1965, -3736, -3578, -2566, -1229, 199, 1277, 1564, 1093, -107, -1632, -2832, -3822, -3220, -1919, -864, -29, 419, 20, -413, -1289, -1530, -1643, -1534, -1866, -1984, -1934, -1783, -1611, -1551, -1644, -2015, -2826, -3842, -3921, -2404, -591, 1321, 2747, 3584, 3583, 2408, 629, -1124, -2819, -3786]
11445c786R95R28O65L16j3n37j037q33k78pL01M92O50N52n8p55j038j37J263P49
11425a568k37j250q84n68R70N65p1O2Q14g31E73J386J096M65k41l40j070D82f19
11405b267j845j328J704J553e43A033N24Q1q15d18j533j388r13Q3P29a705D43
11387B544J301J330O24l73r18j883D69a061o31k28K0Q47A48K68L10g49k194j569
11369d512K185h15E20K050K042J746M04n54j676j996E81a69B20J37c17j143j469
11352b929o9O50L24p6o32o7a063A538L273L653J740n02k541j905L546Q147J0220
11335B7169R533O327J171l572p637r975j1105A535d999D68K802R83j77n53l70
11320C153L31K36k58j221A59b924j15a95A109D48a298k830J535b33A156K35l46
$$ y = [-3786, -2791, -1863, -1198, -882, -895, -1432, -2469, -3302, -3580, -3587, -3286, -2794, -2144, -1592, -1650, -2405, -3443, -3580, -2317, -1568, -1805, -3055, -3939, -4507, -3537, -2972, -3043, -2981, -2167, -731, 573, 1959, 3055, 3520, 3279, 2939, 1869, 482, -619, -2267, -4112, -5440, -3736, -2183, -543, 1033, 1557, 1638, 823, -418, -1951, -3339, -4252, -4169, -3440, -1705, 443, 2544, 3845, 5175, 5799, 5426, 4508, 2625, 469, -1061, -1692, -1920, -1900, -1053, 148, 416, 726, -749, -2943, -4512, -2327, -815, 520, 2570, 4612, 6358, 6762, 6208, 4532, 2536, 581, -169, 220, 357, -317, -1460, -2929, -2998, -2348, -2024, -2100, -2732, -2799, -1063, 1538, 4811, 8464, 10204, 9702, 7161, 5256, 8802, 16949, 27169, 36702, 43029, 44200, 40628, 32991, 23016, 11911, 1535, -4999, 468, 3270, 4253, 4076, 3523, 3153, 3484, 3720, 3462, 2241, 159, -2924, -3039, -195, 1109, 448, -1298, -4128, -2593, -233, 1156, 1391, 1045]
11303A045C82g12q51p24k49J101B21J363O34P23Q81M70J38j216A141a737k802
11286d539K01b002B24J643J142Q61K8n58o37l85M8M49P41l69A179a831r20a238
11267b64o11k409l055j230Q01J271J016P78J039J318O4q77j144O60J219e39K48
11250b91A775K101o88a086M0E749L635p59l146j48Q01k886g50E288M508m213D76
11232A3490J2803k59p489J8731K6320L78j8585R7427J88016K28334K23344J70806
11220I53316P9242l1484j33583k04550k29692k06628H5764l0116O262k0416A3092
11208A9434R352n201A1245m246K082l950d088C370O221M62m383H64l64P6b815
11192B93L170P78j642C44d86p40j104L49B62J423J74k25o6K64N76J33j63n41G78
$$ y = [1045, 382, -712, -1563, -2287, -2536, -1435, 221, 1584, 2218, 2941, 3822, 4292, 4430, 3214, 1141, -1737, -4539, -4338, -2002, 224, 1867, 3009, 3870, 3898, 3340, 2703, 2318, 2366, 2815, 3556, 3187, 1179, -1831, -2751, -1238, -264, -875, -3284, -6339, -7569, -6768, -5497, -4481, -3703, -2664, -1346, -1282, -2159, -3303, -2643, -1424, -539, -291, 1775, 3876, 3188, -1086, -1046, 5749, 9384, 8625, 5479, 5331, 6132, 3246, -750, 5288, 9796, 5583, 476, 13490, 26293, 26034, 18545, 37276, 63596, 63974, 45389, 142816, 330832, 559166, 782510, 953316, 1032558, 1001074, 867491, 662941, 433249, 226621, 85764, 55648, 61910, 41494, 13092, 19434, 28786, 23585, 11245, 6999, 9081, 5131, -4088, 3370, 9591, 10053, 5670, 864, 500, 576, -2815, 293, 3463, 4241, 2599, 344, -486, -1226, -2330, -1981, 262, 1685, 1859, 1634, 1568, 1832, 2408, 2541, 2378, 1837, 778]
11172h24q73L44j68p56j46l46q80Q04h39G81M82D01h27j545j534J145B09J680
11154A889J103M89k23m05l96n78p27n63j79K217M174N157M065K636j31k228l986
11137A2314m640B665D69J738J297k36q62j136C98f4k75k4A45J338J808J394K50
11120D935p16j379j266O62J094Q02n32r66A237b36q31k64K94c82E1J82P5M33J5
11101G56j2rN62M76n38B3a939j726o15R86a293a30J1K4D41J791J853P86j737a38
11080b948I73M942L286J666j213l063A397c348E25M302J998n23j188B477A29f71
11063I30K680K960J919L03j583k927A530a95j528j731o65e99B214J567K23j506
11047B498ck966i87B459J974L93j103j247k7O20j15j237g21k340k29O29j00l15
$$ y = [-824, -1697, -1353, -1521, -2277, -2423, -2769, -3649, -2845, -839, 781, 1263, 401, -827, -2372, -3906, -2761, 209, 1889, 2992, 3481, 3258, 2853, 2457, 1879, 1152, 589, 410, 2627, 6801, 11958, 16023, 18659, 18528, 16300, 12314, 7674, 2665, 469, 2207, 3504, 3268, 2406, 1270, 398, -64, -339, -363, 145, 1483, 3291, 4685, 4935, 4219, 2840, 1574, 2236, 3330, 4132, 3600, 2634, 1237, -236, -1067, -1331, -1037, -382, 51, 233, 308, 741, 756, 744, 735, 1297, 1773, 1235, 23, -1939, -3665, -4280, -3294, -1293, -130, -119, -95, 441, 2232, 4085, 4871, 3134, -138, -2948, 973, 5915, 9201, 10867, 9654, 6591, 1397, -3348, 525, 4827, 6825, 6302, 5114, 2477, 129, -671, 930, 3610, 6570, 8489, 8792, 7209, 4282, 1530, -195, -1723, -3454, -4119, -599, 2214, 3781, 4004, 2498, -3, -2969, -987, 2459, 4433, 4826, 3723, 2476, 2449, 3069, 2954, 1717, -721, -3061, -3290, -2661, -2761, -3076]
11029c076J516A161K738K124M88n46j668j734A273r1OD57a536J33A242J615l7
11012B820A378e71k58F83J340M26j96q41B42a015j200m56L09K68J21k42r09r92
10994d116q36q72L36R97J126J472A23R48L00J06l51J05K16R91J175J783J395L90
10976G181j221k304I75b069k239J452a216A69Q35L73m2F37b67j04A41P77R72j30
10958A760m50E21c61o83n33O4N12d04J84k9n10p72L63b56C81K28B05d91q78l85
10938a754P28A24L31i45k997q77a906B62J017l17a652k828J905A76K458J623O24
10921D881p43r09o72o06n90h0l82A819K801J869j86k445b96m763q74J705L17j227
10903e138P16o59j447h92F604O874L380r85n957A362c332D078M358P07j983B826
$$ y = [-3076, -1560, 1161, 3899, 6023, 6511, 5965, 4297, 2563, 1273, 1182, 1188, 457, -1536, -1403, 1242, 2857, 2820, 1378, -571, -829, 683, 2023, 2449, 2253, 1412, 242, -1015, -2215, -2671, -2362, -2094, -1973, -2215, -3124, -4116, -4952, -5824, -5488, -4491, -3365, -1893, 123, 1071, 1371, 1477, 1126, 1231, 1447, 2438, 3613, 5396, 6791, 7181, 5960, 3656, 975, -2069, -4308, -2856, -1216, 169, 1004, 1377, 1335, 637, -267, -371, 141, 918, 1890, 1760, 1310, 521, -361, -1044, -1577, -1513, -1001, -404, -220, -249, -759, -1531, -1168, -256, 381, 609, 205, -491, -1369, -1754, -1026, 124, 455, -945, -3942, -4819, -1906, 262, 1279, 962, -1652, -4480, -2575, 176, 2634, 4257, 4881, 4138, 3229, 2557, 1951, 1361, -80, -462, 1819, 4620, 6489, 6303, 3858, -296, -5059, -5933, -4228, -3911, -5138, -4422, -5081, -6528, -892, 6604, 13478, 16858, 15873, 9916, 1362, -3332, 4078, 8436, 9143, 7160, 2826]
10886h33k701k472j020a997C426M510L085J708j554l215l555B142n01M59J205
10871C305J103J81p21j914a111k818j070J728L4j178l10K046d85G9i09j718j078
10854c705J471M88l87L14g97H40J205R56M11q8j028D37a123o50J85L69A036L017
10836D053M026L524J875R03k20l701k929J482N281N294M000J247j414l682n918
10821A3821o092B179a277k354q96J505O33n83r28r46K34J149J265R24J34m07j70
10804a717E83K461J533K63j159A676c33o83b2F95C01a042r47L21l20j200j416
10787d604L33J892m02k042J866f65G40d6k382k483b185a062p41l264J747e34H87
10769B212J028m49I1c582H5N783M064J726p35j941k509k622A145a490j218a317
$$ y = [-833, -3534, -6006, -7026, -1997, 3426, 7936, 11021, 12729, 11175, 7960, 4405, 2142, 1641, 2100, 3305, 4408, 4589, 3868, 1954, -1111, -3929, -4999, -3271, -3237, -4415, -4725, -2679, -485, 79, -909, -2627, -3705, -2234, -1746, -2133, -1819, -797, 840, 2045, 3001, 3412, 3324, 2296, 437, -1123, -1773, -1588, -1219, 1036, 4053, 8079, 11603, 13478, 14381, 14161, 10460, 7531, 9013, 14294, 19588, 23588, 24835, 23421, 19739, 13821, 7729, 2179, -1277, -3631, -4527, -3022, -2389, -2972, -3900, -4846, -4612, -3463, -2198, -1274, -1140, -1547, -1717, 583, 3044, 4577, 4840, 3681, 1676, -333, -1016, -22, 695, 301, -1042, -1989, -1668, -1988, -3188, -4604, -4271, -2379, -2781, -4823, -2957, -665, 740, -46, -2428, -4911, -2185, -1062, -1803, -5067, -3320, -534, 887, 2212, 3240, 2791, 91, -3582, 85, 5868, 9932, 11658, 10923, 8982, 6473, 3851, 1145, -1490, -2708, -1317]
10752A750K699N15j654j96M318M348J785j318l262k622K91K575N789O230L600
10737B4848R83L350O672N832N956Q563Q849M537O78J1348L1213L7222L2909M7740
10723B30700J04928J73503K13816K17174J86759J32585O6930l489p0232j32727
10713A119947j82695k09940k06649j70373j07243n2029l4185l6618l3880j7628
10703F8707n604n115p408m599o116j0243r705K063O584J158o633r475o079L680
10689A1215M775K154j778m736n157B879p21K001K501J621k89k229k397k94j18
10674B954D40d141b037I68J486l33P4J452L52j928b787j537C83K536L66j229m63
10657A593l21D7a754f41B442K052M94l36r52j797b64j554P43A293J309O84l87
$$ y = [1750, 4449, 4964, 3310, 3114, 7432, 11780, 13565, 12247, 8985, 6363, 6654, 9229, 15018, 21248, 24848, 25831, 29181, 35853, 41685, 47641, 56204, 65053, 69590, 70268, 81616, 112829, 150051, 182960, 230700, 335628, 509131, 722947, 940121, 1126880, 1259465, 1326395, 1322906, 1252674, 1119947, 937252, 727312, 520663, 350290, 243047, 191018, 156833, 120215, 86335, 68707, 63103, 57988, 50580, 45981, 39865, 29622, 19917, 21980, 28564, 29722, 23089, 13614, 7535, 11215, 15990, 18144, 16366, 11630, 6473, 2879, 2158, 4159, 6660, 8281, 7992, 5763, 3366, 3072, 2954, 440, -4141, -2037, 968, 2454, 2121, 2195, 3647, 3999, 2071, -2787, -4324, 383, 2919, 3285, 2056, 1593, 1272, 47, -1754, -641, 2442, 4494, 4988, 4652, 3700, 1903, -264, -1818, -1075, 1293, 2602, 3286, 2899]
10640B899p92r2J500J516m40j745D64a490l61M85j23J26M60b51D8f1k21o50j594
10621b526q03a553C80J46a027k083j107l43p51j080b921b19A676j22G36a145l86
10604a531E11K864J607L83j542A738e41k189l55O88O00lj035j407J471J159j61
10587a773j599R3c02B337J609L71j071A232a583j152O33N77j94p05L27a030b28
10569a14l86J02c8A11b48n7A21P04M94F28g48j816l32a253G36J154Q0I60e02j365
10549a867j239j577j585j482P60K432R76N48j8n66L43J032P00M66L84a89H1R6
10531A77a222j413p19J241g16B12NN11J834K047J397k42j592A385a307k320J071
10514b556f46B68a59K3m06j401j778L36K38J08a037G72O70Po97a361k227j165
$$ y = [2899, 2107, 2015, 3515, 5031, 4591, 2846, 464, -1490, -1851, -1366, -1489, -1363, -903, -251, 48, -61, -282, -932, -2526, -3329, -1553, 380, 526, -1027, -3110, -4217, -4560, -5311, -6391, -2921, -219, 1676, 1554, 736, -1145, -1531, 511, 3375, 4982, 5365, 3823, 1738, -541, -2730, -3085, -2397, -1797, -1800, -2835, -4242, -2771, -1612, -1773, -3372, -3279, -302, 2337, 3946, 4317, 3246, 1232, -1583, -2735, -2102, -1525, -1719, -2424, -2097, -1030, -228, -114, -500, -398, -38, 111, -248, -305, 121, 825, 1319, 628, -748, -2564, -2896, -1253, 736, 1890, 1970, 960, -502, -1867, -3106, -4683, -6268, -7750, -6990, -4558, -3582, -3034, -3052, -3618, -3275, -2243, -1543, -1077, -693, -189, 81, 177, -1222, -2635, -3354, -2113, -716, 212, 217, 728, 2562, 4609, 6006, 5764, 4172, 1385, -1307, -3627, -2556, -646, 268, -159, -136, -542, -1943, -3721, -3385, -3147, -3039, -1037, 772, 1442, 1449, 752, -1361, -3588, -4753]
10496d753K318i25n17j175j184J044a339I76J203N57j94r67c54k260l34d39A732
10478B329l36E85a960j843P32P74j105j71J743I63K259K145R27m26k063F62b667
10460e660O84J636K79q83j510k251R79J270J530L72m46l86L71Q53J295M42j95
10443a620l83J21f81I55J180M59n35r32D55a32j190j741n74J551d36G66j61j66
10425D39a93o71j13K64A9Q67J397R90J46p15r16B92g10o82O3a82A100R67l93E37
10404a351k448j122a497B710K380N9k210q19K313K217l66C01K539K1086K5354
10389D9280K3992J8874Q408k672j5350k4352k7972F792A489P904J056m818i46
10375c309A679K465j073D73b547j654j014l11n84n52L26J215J883J260d45A078
$$ y = [-4753, -2435, -925, -1442, -2617, -3801, -2757, -1339, 976, 2179, 2736, 2542, 1575, -354, -2614, -2948, -439, 1732, 2329, 1993, 585, -1960, -3803, -3071, -2297, -3402, -3573, -1830, 963, 3222, 5367, 6294, 5868, 3805, 662, -2667, -5660, -4976, -3340, -3061, -3944, -5454, -7705, -6726, -5456, -3926, -3554, -4000, -4386, -4015, -3162, -1867, -1425, -1620, -2003, -1882, -681, 955, 2135, 2594, 2059, 1127, 455, -132, -1322, -3063, -3637, -2086, -436, 766, 605, 439, -193, -864, -977, -713, 19, 886, 2283, 3273, 3419, 2704, 1788, 292, -710, -1392, -1329, -182, 1100, 2067, 1674, 537, -1351, -3799, -4921, -1497, 2710, 5090, 5149, 2939, 2120, 4433, 6650, 6284, 301, 2840, 23926, 49280, 73272, 92146, 100554, 97882, 82532, 58180, 30208, 6792, 1489, 9393, 10449, 5631, -946, -3309, 1679, 4144, 3071, 473, -2547, -4201, -5215, -5526, -6110, -6662, -6336, -5121, -3238, -1978, -445, 1078]
10358B009J22r60l59j06A44d35k84b39B34b98j552j581j348l7R77J244J123a35
10339B78I3e18j089j365j441j46J044J15k53j141p5N93J467J081L39o69j251j261
10321d570K80O34R13J120P12b45F20N14q7l58a85j463r52n50k44k41MJ90N09J114
10301a818d37D29M49D29K697J0734J6190J9248J9604J6873J1494L123o249j4634
10287G9509j9673k0858j7349I765l227j717k352a002k594j356J091a219A050J743
10273B793O41n14j331A22a731j003J134O65L52p58n51m52J11R9p24p26L60R96
10255b228g57a47j47j98o00k88j096r69Q56k195L61J803K58k555C35R130J3812
10238B3277R412K219m5j976O4O490J4290J1853P935K781j630o02J854L718j443
$$ y = [2009, 2131, 1171, 812, 706, 144, -435, -719, -239, 234, -298, -1850, -3431, -4779, -4816, -3839, -2595, -1472, -135, 278, 93, -518, -1607, -2972, -4413, -4559, -3515, -3400, -3653, -4794, -4869, -4276, -2809, -1728, -1389, -2058, -3309, -4570, -4290, -3656, -2743, -1623, -911, -245, 620, 1134, 1047, 689, -185, -1648, -2600, -3150, -3394, -3635, -3631, -3441, -2932, -1818, -437, 429, 878, 429, 3126, 13860, 30050, 49298, 68902, 85775, 97269, 100392, 94143, 79509, 59836, 38978, 21629, 9765, 6538, 4821, 2469, -1002, -3596, -4952, -3861, -1219, 1050, 2793, 3434, 2920, 1589, 122, -1731, -2734, -1600, -935, -583, -1341, -1892, -2344, -2233, -2134, -2858, -3584, -3224, -2228, -757, -147, -294, -492, -1092, -1380, -2476, -3445, -2589, -4784, -4423, -2620, -2362, -4917, 335, 9465, 23277, 32689, 34908, 34863, 32887, 32951, 39441, 53731, 65584, 73519, 76300, 74670, 74068, 75922, 79640, 78197]
10223G8197r228j6394k1523F688c996G957O263R14k727m014C635B16b196L11D72
10207B321J17J15J484J718K907L773L783L200K238R11o33j796l583n165E494G8
10190c097C620P628R537J0360J1358J1295R160M738n73n204q980j1702j2121j0086
10176A9030n590k570j184k606l384H15a304r41r36k5R74g96E60P43l8D85a057
10158b373L56f18i3D97L5j68i6k30q52q75j239q21l00n95O11J673a068E0O00q3
10138E67a47r74j307m99m98N8R7K51P60i23F19J734J175Q27j610A183b94k34A085
10118B996K994J735N2j633k917I77a439j291j127j324J498e48C112L523O54k802
10102D487A300m6R09M21n42c980A148J2691J3255J5446Q632M247k311B6356J292
$$ y = [78197, 68969, 52575, 31052, 6688, -3996, 7957, 14220, 15134, 12407, 8393, 3635, 216, -2196, -1885, 472, 2321, 2438, 2553, 4037, 5755, 8662, 12435, 16218, 19418, 21656, 22567, 21934, 20138, 16555, 11390, 5494, 78, -3097, 3620, 11248, 20785, 31145, 42503, 53798, 62958, 67696, 67123, 61919, 52939, 41237, 29116, 19030, 13440, 10870, 9686, 7080, 3696, 815, -1304, -2245, -3181, -3206, -2232, -796, 560, 1303, 1265, 485, -1057, -2373, -2017, -618, -93, 497, 532, 364, -96, -326, -1178, -2053, -3292, -4113, -4413, -5008, -4397, -2724, -1068, 50, 650, 567, -147, -1121, -2428, -2927, -3425, -3367, -3270, -3019, -2259, -923, 619, 2353, 3528, 4355, 2745, 1183, -294, -528, 1085, 2996, 5990, 7725, 7777, 6144, 3227, 977, -1439, -2730, -3857, -5181, -3683, -548, 3112, 6635, 7289, 4487, 1300, 1254, 2163, 2584, 2042, -3980, 1148, 13839, 27094, 42540, 51172, 55419, 53108, 26356, 27648]
10087B7648K8497K3995J5597P221N085m784j1959j5937j5404p002P286J7422J4731
10074I2396M066j3991l4658c188F6488P4003O6869M8008K1483n270l1639m9833
10062A90109n7926n5447C4884A4370K208K765k730m865E870j975K506M330K911
10049A3642J152j458l416D589A15a50C843N118K977K535J483l99j920m183m493
10034D961f2l936A00L173K151J11k309D87b34A795N49a05m827n848K386a270D949
10016F202o28p48j007j699l06N094P815Q526M877K497k026j3816o864a094l555
10001d649A266K083J257j22H30a419F327L149M749K11j835q03b085n505r250n016
9985b1856M30R048d757D748N883M839L078J6164J3674P326J954m684r342j2642
$$ y = [27648, 56145, 80140, 95737, 102958, 108043, 103259, 91300, 75363, 59959, 52957, 60243, 77665, 92396, 96462, 82471, 47813, -3188, 66488, 140491, 207360, 255368, 276851, 271581, 239942, 190109, 132183, 76736, 34884, 14370, 16578, 19343, 16613, 11748, 5870, 3895, 6401, 10731, 13642, 14794, 13336, 9920, 4589, 115, -150, 3843, 8961, 11938, 14473, 15956, 15557, 13637, 9454, 4961, -62, -3998, 100, 3273, 5424, 5535, 3226, 487, -234, 1795, 2344, -105, -4932, -10780, -8394, -1270, 4949, 6202, 5574, 4826, 3819, 2120, 1814, 6908, 14723, 23249, 28126, 30623, 28597, 14781, 7917, -1094, -4649, 1266, 3349, 4606, 4484, 830, -1419, 6327, 9476, 14225, 14436, 12601, 11798, -2085, -7590, -16840, -21856, -21426, -12378, -4757, 4748, 10631, 15470, 18548, 34712, 48386, 55712, 57666, 52982, 43640, 30998]
9971C0998j2599G378I55b258j998J599i05N9j199j920Q6J289J37m62L76J258a84
9953A05a50r77j068r44l36O66g2B162K412J147m5q91k070Cc618k698J930a683
9934B19J061J30E49g9m15o78n94o86L86j29a086F02J731l82P37k44A014i20j080
9915b000m98j28R89k88P71D60J520J035M85K66p55j46p62K09L88J32n39o71G52
9895c92p68j409k166j468R41b360B59R39J69d23j887j299M04g46A542J599N89
9878C730L48R25Q55J193N38k071G99b136G14O505M549O82j141n611A366c058J050
9861b008B195K773k169A211a641j001d64A533M52B26b267R81A449L057K003j37
9845F372j077j894A35g47B008M646N160K893J388q53n74j354o44l35m067N44l264
$$ y = [30998, 18399, 7378, 955, -2258, -4256, -2657, -905, -846, -2045, -3965, -3879, -2590, -2453, -2915, -2539, -1281, -184, 105, -150, -1127, -2195, -3139, -3475, -2809, -72, 2162, 4574, 5721, 5676, 4785, 2715, 3, -3618, -6316, -4386, -1683, 219, 1280, 1410, 549, -79, -494, -1172, -1766, -2452, -2066, -2195, -1086, 602, 2333, 1951, 2688, 2444, 1014, -920, -2000, -2498, -2626, -1637, -1925, -1154, 460, 1980, 3015, 3500, 3766, 3011, 2865, 2103, 2312, 2700, 2832, 2293, 1622, 752, -392, -1160, -2569, -4735, -6203, -5262, -2360, 259, 1198, 1367, -423, -2310, -3609, -3205, -746, 1542, 3141, 3730, 4078, 5003, 5858, 7051, 7589, 5518, 799, -2136, 714, 7219, 11768, 12450, 11309, 5698, 1366, -3058, -2008, 2195, 4968, 2799, 1211, -1641, -2642, -464, 1533, 1985, 226, -2267, -1286, 1449, 4506, 6509, 6372, 5295, 3401, 135, -747, 2008, 6654, 11814, 14707, 16095, 15242, 14668, 13314, 12670, 12335, 8268, 8812, 5548]
9828E548k632C97a143L6A94J274R35M88N62k15J1j66O1k41k75o41l05q23a98j204
9808a402k111k278j72K363J788b81C4i17j354j083J149a98B036J948J139J2n18
9791D617j214F96b866B000Q024P769N095J684k565o238G564B85a934e71K0j858
9775b409J49F08K393j8A335b023k355a222B460L543K036r16j008B527b361a177
9758C451M856J805m73k368j212R80J595Q53j262l638j853k13k6m2Q3j95H08a372
9739c848M69k89k390k240o55J840c521D671J2295J2469J1312O684J033m687r084
9724C4693j1541j1105C123a337J94G18L255L558K366O96p56j703k763A998a231
9708a662A717K150Q64m25j081A492b03r45k10n92l71p03Q92e84b21r45j64n47
$$ y = [5548, 2916, 397, -1143, -1107, 194, 1468, 2403, 2891, 3453, 3238, 3249, 3083, 3144, 2903, 2628, 1987, 1682, 859, -198, -1402, -3513, -5791, -5963, -3600, -1812, -281, 34, -917, -2271, -3354, -2205, -198, 2036, 3984, 5123, 5135, 4617, 3403, 696, -2866, 2000, 10024, 17793, 22888, 24572, 22007, 15769, 7564, 285, -1934, -571, -551, -2409, -2260, 608, 3001, 2983, 1335, -2023, -4378, -1222, 2460, 6003, 8039, 7123, 6115, 2527, -2361, -1177, 3451, 8307, 10112, 9639, 7271, 6059, 7039, 8634, 9487, 8225, 4587, 2734, 2521, 2495, 2453, 2536, 2341, 808, -1372, -3848, -3379, -3668, -6058, -8298, -8953, -7113, -3521, 4671, 16966, 29435, 40747, 47431, 48464, 43777, 34693, 23152, 12047, 3123, -1337, -1143, 718, 3973, 7531, 9897, 10593, 9837, 8134, 5371, 1998, -1231, -1662, 1717, 3867, 4731, 4306, 3225, 1492, -203, -1148, -1358, -1950, -2321, -3024, -2132, -584, -221, -1166, -1330, -1877]
9690a877q71K34k38K4L45P37c02A109J543J243R80M58n75j001j611C83a028K00
9672h28k2H0J041M65k76m66c10j743j812p66o90J28J381J742i07b88C60J001N93
9653A954J81k54o44C48g86j107j019K32a221e6G05M20E01e14j572j158o24J73
9635c695R46h75A917K773J856P39J076J311J585Q35q92k597l159B365a307l039
9619d346a028D67A39a295j094g73F29P33m51A22c22D35j30c38j243j04g91A266
9600C299J372J96q95j648n38O54J148O20r35G08b843j794a130A423J951O16O30
9583D620k35o01j114q72E72h34j059j120j148r12J03R84Q46J435d25A057P64j44
9565A677N04K62l46n60L09Q67J361J982J452M81P3q76j882k618H0b34G35K313
$$ y = [-1877, -2748, -2514, -2752, -2728, -2383, -1646, -302, 1109, 2652, 3895, 4875, 5333, 4758, 3757, 2146, 383, -1028, -828, -850, 80, 1121, 1586, 1310, 844, -310, -2053, -3865, -4631, -5321, -5193, -3812, -2070, -907, -288, 360, 1361, 1954, 2135, 1881, 1237, 348, -786, -1893, -2912, -2680, -1221, -56, 705, 1125, 501, -514, -2086, -3244, -3868, -3695, -2749, -875, 1917, 4690, 6546, 7285, 8361, 9672, 11257, 12092, 11200, 8603, 5444, 2365, -1307, -4346, -1028, 467, 139, -1295, -2389, -773, 629, 1362, 911, 122, -322, 435, 305, -338, -1581, -1685, -791, 1266, 3299, 4671, 4867, 3972, 2324, 1786, 2440, 3588, 4208, 3273, 708, -2843, -4637, -1130, 1423, 3374, 3990, 4620, 4385, 3784, 2670, 1798, 572, -834, -1893, -3013, -4161, -5073, -4970, -3986, -3140, -1705, -425, 1057, 1821, 1677, 2181, 2443, 2097, 1537, 1846, 2713, 4074, 6056, 7508, 7989, 8062, 7186, 5304, 2686, 80, -234, 735, 3048]
9547C048L173J340M54N34k700A888a291j163P43g39K74A321K796K252J278j805
9531E842B093d75kF10L57A13b383k885E12J7858K0375J8982k420O265K220p416
9515E6376O211j0855j6917r555k739j0016m171B105d716k873c495J458j43K25
9501a955C47K238J286l42A732f27k211m49J16L44j75j01j08i80I03a072j905c82
9482B930L702M498J190j277m095A403d046j572a266C964M486L100P419O489J190
9467B6648P54n560M106J778j085l519l21j027k339o269E799D07a579M99c34h9
9450a826p50D745Q985Q745N256J341m415p324G731a086k683D00J611n06A63a222
9433b527r82J225e38A680K252K642P65P7j704B687a062k701j148M50k396j25a093
$$ y = [3048, 6221, 7561, 8015, 8549, 5849, 1888, -1291, -2454, -1711, -739, -465, 1321, 4117, 6369, 7647, 5842, 2093, -475, -477, 610, 967, 113, -2383, -5268, 512, 18370, 38745, 57727, 55307, 61572, 63792, 56376, 62587, 51732, 34815, 25260, 22521, 12505, 8334, 2105, -4716, -7589, -3495, -2037, -2180, -1955, 347, 2585, 3871, 3529, 1732, -627, -2838, -3287, -3171, -2827, -3002, -3103, -3211, -980, 903, -1072, -2977, -382, 2930, 6632, 11130, 12320, 11043, 6948, 1403, -4046, -5618, -1266, 3964, 8450, 11550, 18969, 25458, 26648, 27402, 21842, 25948, 27726, 26641, 23122, 22801, 21774, 19435, 13166, 5799, 407, -1579, -1080, -334, -89, -1826, -2576, 4745, 13730, 22475, 27731, 29072, 24657, 17333, 7731, -1086, -3769, 400, 2011, 1505, 163, -1222, -2527, -3509, -2284, -538, 1680, 3932, 6574, 7339, 7416, 5712, 2687, -1062, -3763, -4911, -4461, -6857, -6982, -1093]
9415H170O981J0995J9820L9036N9249P4011P8525P1025N0203K0454j2684m3111
9403C82674o4126p2860o9346n8079m3599l1529B1392I227D582B264G39a814n8
9390a872g75J84m03j401j221j41M69K07N33L99g17H37R40M77r55a42j378r60l55
9371b835J007g46a58qp61p91j364k321j74J610J142M88j22J1j42R6L52O22b79
9351A161J082j0r17c64j925k040r86J561a332I85J301Pr01B40c65m50J16n7k32
9332i88o70j050j106r22M6O76K65M16Q93J068i6A244J082R85L66L3m15q34p15
9313A746q19a35j400j767j574m74J269J196Q49Q79N29c12o8o22p55j202l19K32
9295c046l49j033j004J495a850d49a22B91O40J333J599M57r79j592c78j572R6
$$ y = [8170, 15151, 26146, 45966, 85002, 144251, 218262, 296787, 367812, 418015, 438469, 425785, 382674, 318548, 245688, 176342, 118263, 74664, 43135, 21392, 9227, 4582, 2264, 739, -1814, -1872, -775, -591, -994, -2395, -3616, -3757, -3288, -3081, -2548, -2149, -717, 837, 1777, 2254, 1299, -142, -1520, -2480, -2835, -1828, -746, -158, -166, -927, -1718, -3082, -5403, -5577, -3967, -2825, -2337, -2459, -2448, -2590, -2494, -2142, -1520, -279, 1161, 2243, 2233, 1316, -364, -2289, -4329, -5315, -3754, -1332, 985, 2286, 2293, 1392, 240, -365, -815, -699, -756, -988, -1658, -2708, -3814, -4736, -4690, -4014, -3749, -3333, -2440, -1372, -96, 1244, 2326, 3311, 3677, 3710, 3295, 2461, 1746, 927, -135, -1535, -3302, -4876, -5350, -4081, -2885, -2036, -1157, -628, -312, -380, -1002, -1757, -2959, -3278, -3046, -3395, -4428, -5432, -3937, -1850, -449, -122, 291, 931, 2264, 3863, 4320, 3341, 1749, -378, -1950, -1854]
9278a854g45A54L44P93J477J912J687J05o91j553j666j238c00j592q44M76O65
9261a595K0l38j57O80d35J21o51j435q59M48R30P02J19n16m48r68j233r84L08
9242d901R24R23M52K58k27O90E4K184J561L51j109F66b422l170p11K939A0K083
9224B093O95p21G43e39n57b82G96L66n2J57J13L80k19p03a00j138r85q43m16k85
9204c767J29J493E52K338J551Q76q78j707A174B22c65o37j068j005L6J296o35
9187b378q27k00L3R88g39E05L03C21f57q48p04L48K36l65j034O49f33A267Q11
9168B078G66g26j257l03N82K65M3L92d93l3p78j026j688j24P84J181R32L32n41
9149a454q62j103m86m4l60P14J067J147c63G91J484M58l1k99k77m9M26P09M96
$$ y = [-1854, -745, 154, 498, 1291, 2768, 4680, 6367, 6472, 5781, 4228, 2562, 1324, -300, -1892, -2736, -2260, -1595, -1575, -1913, -2070, -1390, -435, -314, -965, -2400, -3259, -2811, -1881, -1179, -1060, -1576, -2024, -2992, -4225, -5209, -4901, -3977, -3054, -2602, -2344, -2571, -1881, 54, 2238, 3799, 4150, 3041, 666, -2422, -5592, -6303, -3364, 10, 2093, 2788, 2067, 743, -539, -1096, -282, 796, 1162, 1110, 1267, 1380, 1760, 1541, 838, -100, -1238, -2223, -3066, -3482, -3767, -3638, -2145, 552, 2890, 4441, 5317, 4439, 2732, 1174, 222, -365, -1002, -2070, -3075, -3039, -1743, -2378, -3205, -3405, -3372, -2384, -739, 505, 808, 321, -657, -1505, -2209, -1861, -1625, -1990, -3024, -2375, -633, 1267, 2078, 766, -726, -1983, -2286, -1704, -1439, -1396, -1004, -493, -526, -1304, -2330, -4018, -4142, -3358, -2177, -1245, -913, -1454, -2316, -3419, -3905, -3949, -4309, -3595, -2528, -1381, -363, 791, 2275, 2733, 2702, 2403, 2126, 2077, 2503, 3212, 3708]
9130C708P7n84j312a54j910o79M50K13m43r90q32P08O50P39P95c71C59A08a348
9110c326a570H43J623R24l70j343a37j195k4K79c77H08P97K33m85A30b113j742
9092c855j165J42J007L99K10M32O25J6j234j245J390P82L95P79e57a84j47o72
9074a003o61J56O19c40F51P74O82K46l89I32e56j247J34a19A524J632J274J335
9056E765J46j183j820A433Bf52jj11e9A155O05J13r30d30j351j096n83k05L30
9037c335M37k76K46J118b50A297P27J10n19p37D6a127j045l96J089e7A220L48
9019A568J21l31l84K74J53k4n12c97j802j694a932f80I9J90q6bm08o00M63C43
8998A350J34C93a815r66d30A453Q38N25J089J008M25j195A975h40k081j00J1L04
$$ y = [3708, 3785, 3201, 1889, -154, -2064, -2743, -2293, -2080, -2523, -3513, -4345, -3637, -2987, -2248, -1453, -371, 359, 108, -1348, -3326, -1570, 843, 2466, 3390, 3020, 1677, -137, -1332, -1356, -1077, -377, 808, 1605, 1838, 1353, 130, -2113, -3855, -5020, -4878, -3871, -3472, -3262, -2830, -2205, -2189, -3423, -4668, -3278, -2496, -2101, -1322, -557, -184, -331, -1003, -1664, -1508, -889, -340, 651, 1425, 2107, 2353, 1964, 932, -556, -1803, -1669, -119, 1524, 3156, 4430, 5765, 5911, 4728, 2908, 1433, 2, -652, -653, -764, -59, 1155, 1760, 1873, 943, -430, -1781, -2877, -3460, -3665, -3335, -2898, -3174, -2928, -1810, -250, 1297, 2024, 2134, 1615, 878, 46, -1127, -2172, -2568, -1479, -57, 1220, 1568, 1689, 1358, 974, 1248, 1401, 1377, 865, -397, -2199, -3893, -1932, -680, 99, 289, 203, -2, -410, -1010, -547, 343, 1350, 1484, 393, -1815, -2781, -430, 1453, 2291, 2816, 3905, 4913, 5338, 4143, 1975, -840, -2921, -3021, -3010, -2706]
8980b706a145H46J526O11o20A109c45q02MM73a80E5GP3O2A4d21j61b47B98K60
8959E58A20e96q50j183j478j509r21o92M66J413J504a519f09A045P00K05J89Q57
8941B996R33L80p90j568F3a000M75A468K470J805J40j318k241D50b2B54K46a06
8922a047j486j807r81m55J555J160R49i05G51J034R26L95K6j80m19m38l99p69
8904I27B48L28P15M39J68E56b254o32f87A109j20b96o89b86A207J628J315L53
8886D503J15o31q41o42l10n48G68i58k303n27J688e48C77p2g22j107N45f36M2
8867e94n37k70M17c36B96M76P96Q81P99k12o48A016c9q71r85j93M77Ok90n12j034
8846c441q28l81r1R28M12O2P54J221c27D36L98R39J127J148O83k42p94m84l44
$$ y = [-2706, -1145, 846, 2372, 2983, 2363, 1109, -345, -1147, -1143, -670, -180, 55, 7, 80, 142, 14, -421, -582, -247, 298, 558, 120, -596, -1446, -2629, -4107, -5616, -6537, -7229, -6763, -5350, -3846, -1519, -609, 1045, 1745, 1950, 2139, 2996, 3929, 4309, 3519, 1951, 63, -1000, -525, 1468, 3938, 5743, 5883, 4565, 2324, 450, -22, 254, 500, -106, -1047, -2533, -4340, -5321, -5776, -4221, -3061, -2112, -905, 751, 1785, 2711, 3106, 3132, 2952, 2533, 2095, 1696, 927, 248, 576, 1291, 1730, 1898, 556, -2254, -2886, -687, 1109, 989, -296, -985, -286, 1207, 2835, 4150, 4503, 4618, 3987, 3146, 2504, 2194, 1646, 768, -958, -3261, -3788, -2100, -548, 377, 305, -722, -1829, -1284, -636, -594, -1131, -1401, -984, -336, 296, 772, 1568, 2449, 3248, 3036, 2388, 1016, -39, -910, -1895, -2088, -1611, -1605, -1895, -2407, -3441, -4269, -4650, -4741, -3813, -3401, -3339, -2585, -1364, -327, 436, 834, 1773, 2900, 4048, 4731, 4489, 3695, 3211, 2867]
8827B867M12L50p4o68j175q15B85G2a76p79k047j699o1J166Q78J47q57j214M33
8808d209J796R36L36q08l00K53M6l00m87K77R09K96p48r42j430j0N73k34l34j553
8788e933j897J160J155P9n15J055J532J051L66N4K50O60A66J970K102J695L40
8771F273j103j082r7O85J034O25jj196B360a867k503E06K527k14e85m251q89a568
8752G62e72k907j020J074m34O96J130O33l086p087q170O620c00A0318K661E529
8735F63M818J6472J4956J7313k13j8844A3966N600K4431K2506J5308K6638J5798
8722A24247k3728m1301M5483M4029N7600K2426P813k2430j8970q339j4859l0310
8710A41661j9674k5863l1296l1638j2738a4928N607A9078J0571J0025J29q482
$$ y = [2867, 3279, 3629, 3555, 2887, 1712, 897, 285, 72, -176, -955, -3002, -4701, -4762, -3596, -2718, -2571, -3428, -4642, -4209, -2413, -1477, -1141, -1949, -2249, -1996, -1950, -2250, -2737, -2460, -1551, -1255, -2003, -2945, -4375, -4385, -3812, -4046, -4380, -5933, -7830, -6670, -5515, -5436, -5951, -4896, -3364, -2313, -1947, -1893, -1643, -983, 166, 2136, 4238, 5933, 6273, 5170, 4088, 3991, 4676, 5710, 6335, 6334, 5138, 2360, -1867, -4370, 506, 3033, 2819, -585, -4836, -5725, -1568, 762, -572, -3479, -4499, -3425, -3859, -3163, -2033, -1400, -4486, -11573, -19743, -13123, -300, 10318, 12979, 5529, 663, 5481, 21953, 36909, 54222, 54009, 35165, 13966, 19566, 43997, 66503, 81811, 108449, 124247, 100519, 59218, 104701, 148730, 206330, 228756, 236569, 214139, 195169, 186830, 171971, 141661, 121987, 96124, 64828, 33190, 20452, -14928, -9321, 19078, 29649, 39674, 39803, 31321]
8698C1321r106n261j458D883J3220o544M416A5c850m114L391E2K867J190J217
8683E326O80N02n05p31l81r49j702B16b380k508j19a700A796J021B82h13H369
8665A9265N276P48M050K5901N0520N5219M4124J6734p313j4993k6840n3755m7713
8652G1223C4178j1400O04n492H870m096P61j772a054l764C04K368m99e28l500
8637d028j729K69O74n80O23d11C571K242j375A712b508j342a325A495J391M44
8621C330O91l55l10l38o64G23h38j194q57r5J00M29L10qp09j028l80j42J60m2
8601d294K01J199R99K66o01q83r3O91m32j137P66a168F20J166R98J172J774P21
8583F451J54j126k703d38k458k062j000J665J583a115C6J693K055K102P48q96
$$ y = [31321, 22215, 16954, 15496, 4883, 18103, 11559, 15975, 15, -3850, -7964, -4573, 52, 2919, 4109, 5326, 6006, 6508, 6003, 5272, 4891, 3942, 2240, 216, -2380, -4888, -5007, -1700, 1796, 2817, 282, -813, 8369, 19265, 24541, 25289, 29339, 55240, 105760, 160979, 205103, 221837, 214524, 199531, 172691, 118936, 71223, 34178, 22778, 23382, 17890, 8870, 4774, 5535, 3763, -1054, -4818, 304, 2672, 2173, -528, -4028, -5757, -5488, -4814, -5394, -4771, -411, 3571, 5813, 4438, 1712, -2508, -3850, -1325, 1495, 2886, 3330, 4021, 3666, 3356, 3018, 2354, 723, -838, -2032, -2889, -2984, -2884, -2455, -2145, -2153, -2862, -3890, -4270, -4412, -4252, -4294, -4093, -2894, -1895, -1629, -2230, -3113, -3206, -2515, -2947, -4084, -3318, -1168, 620, 1786, 2784, 3956, 5730, 6451, 6605, 5479, 2776, -438, -2896, -4958, -5958, -4293, -2710, -1115, 36, 1729, 3784, 5886, 6634, 5738]
8567E738B648a716k072a418I59J978K157J854m08j533B053a83J4A248J302m3A120
8549a168j544a029B175K027M72j425F95g42A61Q46k18C01c1j46o3r35j464r89
8531c628K13J257d55A330R77N39r16ck572j403J845a82C50i44k926R08F18K571
8513C189J282P23J724q03k027j668p82H19K66m16a57j268m50r4J04J86g17a49
8494g3j348j670k07a122H39M51j36k52R8l59b73p02oC08K102K282K127qo72q02
8474E337j321A532b176j318E86K517R63n09j162D53h91l96d70H14N37E74a867
8456c270e97A298N05q19i84j825m08j98j03M53Q07P50l90k48k72O70d21B76a1
8436a359j041k94Q96C5J447Q27m29C70a494m90l13m67n4J360D13J157m93f11j923
$$ y = [5738, 2648, -1716, -3788, -1418, 959, 2937, 5094, 6948, 6540, 5007, 2053, -183, -169, 1248, 2550, 2507, 1120, -1168, -2712, -1029, 2175, 4202, 4674, 3249, 695, -742, 161, 1007, 789, 301, -31, -177, -240, -1175, -2639, -3628, -3415, -2158, -455, 1330, 2307, 2846, 1930, -3, -2575, -3978, -2133, -182, 350, -944, -3870, -2962, 618, 3189, 4471, 5194, 6918, 6115, 4088, 2420, 1638, 819, 1085, 669, -157, -1425, -1875, -1969, -1865, -1679, -717, -149, -73, -1421, -3091, -3298, -1122, 839, 1290, 1154, 902, 1000, 641, -273, -975, -981, 308, 2410, 4692, 6819, 6811, 6139, 5337, 4016, 1532, -2176, -3494, 586, 3103, 4066, 3557, 2395, 453, -891, -1287, -470, 814, 1351, 574, -1867, -3270, -597, 1298, 1803, 984, -984, -2809, -3217, -3415, -3518, -3065, -2258, -1508, -1898, -2146, -2418, -1748, -421, 276, -11, -1359, -2400, -2694, -1798, 35, 1482, 2309, 1880, 370, -1494, -1984, -2297, -2764, -2818, -1458, 413, 1570, 1077, -611, -2534]
8417b534r19L25k5m13o5mk36k17Q13a534G65J781R52j97o28p28o95F11j08J095
8397A598J238J181j34j476F44a169j673j644j643J40J066N98m76P5R67J387R03
8380a469g08E19Q86K95A60b455j774b073P41n22j010J6a305N4k239j326a813A543
8361C390K76K83o90K366K798q1j469k698B063N46n51G09G9c8A059J011j022H8
8342c52p71k76R9l33k09k81m1J87j49n38j82l28K86J239B49K318K293R75p35j868
8322C232A90f13A907J697R96n08j447A075a595k312j491J22N42M99j34J90L25
8305c854J592P48e99A34J064J209P45l63p96r10C69b53r50j30A98J598J85r64
8287A017a722j953J491f95q10k894J511b48A898J345M66l3r69A319D85M1P41N13
$$ y = [-2534, -3453, -3128, -3153, -3566, -3631, -3635, -3871, -4088, -3275, -1534, 765, 2546, 3498, 3301, 2673, 1945, 1250, 611, 503, 1598, 2836, 4017, 3883, 2407, 644, -1169, -2842, -4486, -6129, -5989, -4923, -4325, -4801, -4726, -3759, -2372, -1469, -708, 519, 1405, 1700, 160, -2455, -4229, -2073, -1332, -1854, -2864, -2848, -1305, -1251, -3490, -4816, -1813, 1543, 3390, 3666, 3949, 3259, 5625, 8423, 8342, 6873, 4175, 2063, 2609, 2058, 709, 79, -38, 1059, 2070, 1048, 88, -352, -1123, -1399, -1300, -1633, -1842, -2123, -2164, -1977, -2126, -2664, -2846, -3174, -2888, -1649, 249, 2567, 4860, 5835, 5100, 3232, 190, -613, 1907, 3604, 4600, 4092, 2645, 1075, -1595, -3907, -5398, -5276, -4734, -4235, -4369, -4179, -3854, -2262, -1514, -599, 134, 1198, 2407, 3152, 2789, 1993, 1083, 369, -253, -1203, -1333, 198, 1796, 1981, 1017, -1722, -3675, -2184, -695, -1505, -4399, -2888, -248, 1898, 3243, 3709, 3676, 2707, 1319, 485, 526, 1267, 1780]
8269A780o87a071k811d83C306K087o00k222a447l165k063J276K016J477J68j615
8253c353L7A295M570K666j46k722g9n411m17a355A623P92C47a695N96A541J734
8236C275j56j277G71L76L74k22B09h31j261k940b252H287J2276J1468R166M799
8220D5996N14l783o376p612q999r086B970J433O843J1561Q869L565r7l337l359
8205B8448J93L938M334J195k647p406j1563F556k273M057M666K591j93j667j580
8190A2157j711j189j414k777B100p86L558M208J978k137C190d450p42e69B107
8174A961O39M744Q883J0304Q701M794L70k547m990p211p182o864n152B829A84
8158c919J458B174L235J139n81k413H57a481m07a82B749M366M322P41J209K538
$$ y = [1780, 1093, -1071, -3882, -483, 3306, 5393, 4793, 2571, -1447, -4612, -6675, -5399, -3383, -1906, -1738, -3353, -3316, 1295, 5865, 8531, 8385, 5663, -79, -5490, -5907, -1355, 1623, 2415, 347, -1695, -1099, 1541, 3275, 3119, 1842, 771, 1147, 1521, 1299, 209, -831, -2092, -5032, -2252, 8287, 20563, 32031, 41197, 45996, 46510, 42727, 36351, 28739, 19740, 10654, 2970, 4403, 11246, 22807, 31676, 35241, 35144, 31807, 28448, 28641, 32579, 36913, 38108, 35461, 28055, 16492, 6556, 4283, 8340, 13006, 15597, 15404, 13737, 12157, 10446, 9257, 7843, 5066, 2100, 1314, 4872, 9080, 11058, 8921, 3190, -4450, -5192, -569, 2107, 1961, 2600, 7344, 16227, 26531, 35232, 40026, 40396, 37849, 32859, 25648, 18466, 11602, 6450, 2829, 184, -3919, -2461, 2174, 5409, 6548, 5967, 3554, 857, -1481, -1888, -182, 2749, 7115, 11437, 12178, 13387, 15925]
8142A5925O653P585O006K791j300m436p385q966H028B38c700E21L027J357O04
8127E509N37Q08J709J056k42k189l372A021k75L10a07j712H83M201M667K736J165
8110A3652l7l44q42j327j241q52l99k83l90j830B614A300L872N989O418Q200Q771
8093C4550P461M416P3k610l808m241n899r113G738k743N893O328N430N183M182
8078C2011J480k015n978r226D740g9A0218P453K913k487n267F370N86Q155Q891
8063B4002J172p532E582J1783K8788K5043K0726K2385M9151Q3235J02129R3637
8051D42459O5386K2667k2917o5452r1776r8395q6629o2280l6919k7609j2029r883
8039A6623J69K910Q61N5j875q83j414k488j120J393M93j127j89L366O560N873
$$ y = [15925, 22578, 30163, 36169, 38960, 37660, 33224, 25839, 16873, 8028, 238, -3700, 521, 3548, 4905, 5509, 6046, 6854, 8563, 9619, 9377, 7188, 3816, 1021, 746, 1056, -107, -1819, 883, 5084, 9751, 12487, 13652, 13615, 13271, 12429, 11102, 9861, 9009, 8610, 8327, 7937, 6107, 2614, 1300, 5172, 11161, 17579, 25779, 34550, 42011, 46427, 46500, 43890, 40082, 35841, 29942, 20829, 7738, 4995, 10888, 17216, 22646, 27829, 32011, 33491, 31476, 25498, 16272, 4740, -79, 10218, 17671, 20584, 18097, 12830, 6370, 6956, 15111, 24002, 25174, 17642, 5582, 17365, 46153, 71196, 91922, 114307, 163458, 246693, 348822, 442459, 507845, 530512, 507595, 442143, 350367, 251972, 165343, 103063, 66144, 38535, 26506, 16623, 16792, 19702, 20563, 20618, 18743, 17860, 16446, 13958, 12838, 14231, 14724, 13597, 13408, 16774, 23334, 29207]
8023B9207J812j47K042L643J689m354q654o367j086Q53j138n68Q00J371k356K703
8007A9450R962R385L285k475J491Q732J3833K1031K9266L0758L1262N5769J23862
7994C55611J98466K39379K34242J77690Q2634k8828j32872k05085k29869k08778
7984D82590j54611r8569o3148l4520L660K1318J0196j2690k5511k7285j5398n668
7972H0364n015j0553j3177j2916o886l472l036m826m057j206j331k218k939k281
7958F451B659c853l987D91O625Q18K609l002k291C15d96C129Q528N405K211p527
7942A1746P7m412B499J0672A134a394D079L142l286J3725L2915L6146L6385K5486
7928A48592J6428l0279j1926j4913l6839C2485D309d589A361J130c006m559b645
$$ y = [29207, 31019, 30872, 32914, 36557, 38246, 33892, 25238, 18871, 17785, 18638, 17500, 16932, 17732, 19103, 16747, 19450, 29412, 38797, 42082, 39607, 41098, 49830, 63663, 84694, 113960, 144718, 175980, 231749, 355611, 554077, 793456, 1027698, 1205388, 1288022, 1259194, 1126322, 921237, 691368, 482590, 327979, 229410, 166262, 131742, 135402, 156720, 166916, 154226, 128715, 101430, 86032, 80364, 75349, 64796, 51619, 38703, 31817, 28345, 25309, 20483, 16426, 15220, 13889, 11671, 8732, 6451, 2659, -3853, -7840, 491, 7116, 7934, 10543, 7541, 5250, 315, -496, 3129, 11657, 17062, 19273, 11746, 11823, 7411, 2499, 13171, 1134, -1394, 4079, 7221, 3935, 17660, 50575, 86721, 123106, 148592, 165020, 134741, 122815, 107902, 71063, 32485, 4309, -4589, 1361, 2491, -3006, -7565, -2645]
7914B798K624J210k193b66E32K080J38G02f24A148M97m98J586J177j525b564d38
7896F191N056l46D543d917J704D512L920J831j382C168j36O93J737j170B002r51
7880A051J169j10E34c653l943J291K544A323N938N866N335L550m76n277G797E39
7863e554J804A144J363A109c248k957A997N352N63l621B072M614N415J760k210
7848A1651E462h21m223J540k95n56d18D866L884K357J246N37p1J049J430R2j294
7831A4096l618P74k780n32l82l562G05J385L365K876J821J020P42J818M845L017
7815B1594N893O027J6838L0465L5867L1917J9469L727j1679k4056l0647l2602
7803G2813k7145j8808q131m214n206D066L866J0607J0229P157L413j66j262M21
$$ y = [2798, 5422, 6632, 4439, -266, 532, 2612, 2750, 702, -624, 1148, 1645, 1147, 2733, 3910, 2385, -2564, -438, 6191, 11247, 10901, 4543, -4917, -3213, 4512, 8432, 10263, 8881, 3168, 3032, 3725, 5462, 4292, 2002, 1051, 2220, 2110, 534, -3653, -7596, -6305, -3761, 1323, 7261, 13127, 18462, 22012, 21536, 16259, 7797, 539, -5554, -3750, 1144, 2507, 1109, -3248, -6205, 1997, 7349, 7912, 4291, 2072, 6686, 12101, 13861, 11651, 5462, -821, -5044, -3504, -3799, -4355, -418, 4866, 8750, 11107, 12353, 12890, 12819, 13868, 15298, 15390, 14096, 10478, 11252, 8472, 7940, 7558, 3996, 705, 2090, 5455, 8331, 10152, 11172, 11914, 13732, 18577, 21594, 27487, 33514, 50352, 80817, 116684, 148601, 168070, 171797, 160118, 136062, 105415, 72813, 45668, 26860, 18729, 14515, 9309, 4066, 7932, 18539, 28768, 35925, 39338, 39172, 37910, 38331]
7789C8331j937J090k123r130G588e973j0276O489A04J6390J2199q529B180b889
7774C697D16c356A0700J9193J6328P042o763o939J4006K1003P807J4604J5656
7761A12637J3848P930m973j1739k1304k8927l2586A3169d02p358n711M456M494
7748d521D534L693j384k171g90q605J509C031J1132Q221N212j146o391q548B396
7732g75G647J1692M858j933q663E955j238J569k087j651K99J974K629m65j942
7717E043J994p6L992O016Q20p157E72N239P904J243J73L933K520l224o446m450
7701G464j330L93O048J0045N678m394j1106m109P243P185J050k279k723k039O761
7686B3887J2490P026l564r838l846M329l82k996O769R907K084l148L532O914k659
$$ y = [38331, 36394, 37484, 35361, 26231, 7588, -5973, -16249, -9760, 104, 16494, 28693, 20164, 2180, -2889, 3697, 416, -3356, 10700, 29893, 46221, 53263, 46500, 39561, 53567, 74570, 82377, 96981, 112637, 126485, 134415, 129442, 117703, 96399, 67472, 34886, 13169, -402, -7760, -13471, -9015, -4521, 4534, 8227, 6843, 4672, -790, -9395, -7886, 3031, 14163, 22384, 27596, 26450, 20059, 11511, 2396, -775, 7647, 19339, 24197, 22264, 13601, 5955, 4717, 6286, 4199, 2548, 2847, 4821, 7450, 6985, 5043, 7037, 6961, 10953, 16969, 17789, 10632, 572, 5811, 13715, 14958, 15131, 19064, 21584, 18360, 11914, 7464, 6134, 6527, 12575, 22620, 28298, 23904, 12798, 8689, 15932, 23117, 24167, 21888, 19165, 17126, 23887, 36377, 43403, 39839, 30001, 26155, 30484, 30102, 27106, 33875, 43782, 45866, 42718, 46250, 53164, 50505]
7671E0505j1973P84J5603P463m532M88J1145M251n699N183K5805K0821l420k4014
7657I2410l6219B0081H370M6955M5560K0056J955J0852L7904K1378k2370k7697
7645A42963L4583O2862K8550J0416M0701N7654l240o1423L4759J43135Q7869K2312
7633F01141J94217M06219L37308J03853L36121J520623K642387L258251L355841
7624A2755961K944986K094593R36308l59691j608755k623886l247215l378139
7616G514162k976024k059307p70974r8144k38474m01650k71790k8828l0508j34460
7606E04003j31449j4281Q261n1769o0164k577Q049k5698m6278j5074J0679j3191
7594A70511l6376k4188N157N947m364M565J3085L359q471q334j927j543k541k000
$$ y = [50505, 38532, 39316, 54919, 62382, 57850, 58338, 69483, 73734, 68035, 73218, 99023, 119844, 116424, 92410, 56191, 20081, 8370, 55325, 100885, 120941, 122896, 133748, 171652, 193030, 170660, 142963, 177546, 240408, 268958, 279374, 320075, 377729, 374489, 313066, 347825, 490960, 578829, 601141, 795358, 1201577, 1538885, 1642738, 1978859, 3499482, 6141869, 9400120, 12755961, 15700947, 17795540, 18731848, 18372157, 16763402, 14139516, 10892301, 7514162, 4538138, 2478831, 1707857, 1609713, 1371239, 969589, 697799, 668971, 638463, 504003, 372554, 358273, 366534, 314765, 254601, 252024, 260073, 234375, 188097, 173023, 183702, 170511, 134135, 109947, 115104, 121051, 116687, 121252, 134337, 137696, 129225, 120891, 118964, 117421, 114880, 112880]
7580A12880j1955l6696D287M6928N7839L8107L3067M5309M8623J6367l0456m5356
7568B14715R67K4630m0211E5983J97907L84448M11035L52540K20182M3172j38667
7557A526600k81686l57177l51477k64482j02404R81j4617l0225j3843l57q282
7546A03031j0042J163J479j4985k0768L0992O9030O5646M6089K4654P262q758
7534B94793k6359m7023n9748n5306l0248r168j0158j4707m056P436N730J754n81
7521E2359n150q656r637o756q386h65E875K2605J4541L383l385n15L217O094P680
7506E9495O287m5p947j0519m637k572m786l002M992M932l626j7349I155J1422
7492B0577R760M455N441O511K711j374l620n262j2436j2643J3876K1353J0332
$$ y = [112880, 100925, 64229, 4287, 51215, 109054, 147161, 180228, 225537, 274160, 290527, 260071, 214715, 215682, 240312, 200101, 55983, 253890, 638338, 1049373, 1401913, 1622095, 1665267, 1526600, 1244914, 887737, 536260, 271778, 169374, 170355, 155738, 125513, 111670, 111313, 103031, 92989, 94152, 95631, 80646, 59878, 90870, 159900, 225546, 271635, 296289, 303551, 294793, 268434, 221411, 161663, 106357, 76109, 66941, 56783, 42076, 38020, 45456, 51186, 52940, 52359, 47209, 38553, 28916, 22160, 13774, -865, 5875, 28480, 43021, 46404, 43019, 42504, 45721, 51815, 59495, 65782, 65737, 57790, 47271, 42634, 40062, 35276, 32274, 37266, 42198, 38572, 21223, 9155, 20577, 30337, 34792, 40233, 46744, 49455, 48081, 44461, 39199, 26763, 14120, 27996, 49349, 59681]
7479E9681j150n239k981J957M434N268L93j0703j9238o080J2936N626j0032j4281
7465B0591K806Q388J353k471Q99l514A1981j333K8138K0884N841o787j2417j7862
7451B8445A396J3352K5965Q277q481O208L4138K7966J602k7269D0998j1204L1241
7438F1035K7673J9423O738p288j7818j1314Q336J6111J1518O650L496k986r464
7425A12110j0648j3576k3579k2732J4158K6389L575k1926B2457C674K4758N1845
7413H0277M3933K7005J1710R639K0676K0039p972m4187n9804k8948O432q606j8732
7400E1462J2251J7595m655k6656L2K1172R8r355J8643K5048r117D7414B998N1355
7386E4353J9166k026J6147K1983n916l2775k597L1133J860l3080j912M2778J2037
$$ y = [59681, 58531, 53292, 50311, 52268, 56702, 61970, 62363, 51660, 32422, 26342, 39278, 44904, 34872, 20591, 23397, 31785, 33138, 30667, 31566, 28052, 11981, 10648, 38786, 59670, 65511, 58724, 46307, 28445, 1396, 14748, 40713, 48990, 40509, 46717, 80855, 108821, 110423, 83154, 40998, 29794, 61035, 88708, 108131, 114869, 107581, 89763, 78449, 86785, 102896, 114414, 121064, 124560, 121574, 112110, 101462, 87886, 64307, 41575, 55733, 82122, 85697, 63771, 22457, 3674, 28432, 80277, 124210, 151215, 162925, 172564, 193240, 213279, 205307, 161120, 101316, 72368, 78800, 70194, 51462, 63713, 81308, 76653, 49997, 50029, 71201, 71299, 61944, 80587, 105635, 96518, 47414, 2998, 54353, 73519, 71493, 87640, 109623, 103707, 70932, 68335, 99468, 101328, 68248, 66336, 109114, 121151]
7373A21151l2421k5982K3882J5160k6690j4071M0802J9155j9064J002L3513L32
7361A36769o4195C1291R3545L8910l3041l7633N6202M0637l1412m9317M5695M5222
7349B00099k7698n3647N3421O3956j6096n7342L3070O5475k4524A18076A8900
7337A11068J5198K3557J27878R0184m2418j41420J9916J29544J428j12850M3189
7326B65274J53259J1732j43328r270J81869L7305j55721m1493K13769O3652j69844
7315D07204o8319K59719R3697j93468j06940L33888J65325k01757j66465L83501
7305I06385K29800k39041k80734M93106L49232k69450l73902O65520N39590k97460
7295A723046n72206Q74000R17819k57671q99068J179030J563742j79038j489208
$$ y = [121151, 88730, 62748, 86630, 101790, 75100, 61029, 101831, 120986, 101922, 102924, 136437, 136769, 72574, 31291, 124836, 163746, 130705, 93072, 149274, 189911, 158499, 109182, 154877, 200099, 172401, 118754, 172175, 236131, 220035, 162693, 195763, 261238, 236714, 118076, 18900, 111068, 126266, 149823, 277701, 367885, 325467, 184047, 203963, 333507, 334935, 222085, 265274, 418533, 430265, 286937, 277667, 459536, 496841, 341120, 299627, 513396, 577048, 407204, 338885, 598604, 692301, 498833, 391893, 725781, 891106, 689349, 522884, 906385, 1136185, 897144, 616410, 1109516, 1458748, 1189298, 815396, 1480916, 2020506, 1723046, 1150840, 2024840, 2942659, 2684988, 1785920, 2964950, 4528692, 4349654, 2860446]
7286B860446J918366L141713K85645k588082L865811Q145504L047616n120187
7278A5556832J3973475M4562188N9052647O1659481N1374730K9717728J354344
7271B77251425k6923555m8415708n8379770n5201910m0086765j7810162m976119
7264B5457436o414371q047443k961213J315563j011752l141969j486627J080256
7256D789880j43240j604941r34970P97273J15916r22707p13413N06216J75655
7247B065669n85739n41594L72983J91884l77934m44624K52242J98791k46109l51336
7237E34233J72171J83395j60617k86475J05945J60582j15813k76274M5478J83910
7227E46535l1603k12248k1399J34701j6565j26259L1853J18653k0872j52102m1318
$$ y = [2860446, 4778812, 7920525, 8206170, 5618088, 9483899, 17629403, 20677019, 15556832, 29530307, 74092495, 133145142, 194804623, 246179353, 275897081, 277251425, 250327870, 201912162, 143532392, 88330482, 48243717, 30433555, 25457436, 19043065, 10995622, 8034409, 9349972, 8338220, 5196251, 3709624, 4789880, 4646640, 3041699, 2106729, 2904002, 3019918, 2097211, 1383798, 1890014, 2065669, 1479930, 938336, 1311319, 1503203, 1125269, 680645, 932887, 1131678, 885569, 534233, 706404, 889799, 729182, 442707, 548652, 709234, 593421, 317147, 362625, 546535, 514932, 302684, 281285, 415986, 399421, 273162, 305015, 423668, 402796, 250694, 209376]
7216B09376J35725K2568j14253n1003K23004K47269J85410J08441K2209p5834
7206I12912j41531j44353j05482j05699j49947j23745N9343N3329l9015o8555
7196A47257N2958O4059j8035m1860M0456M6659m0168p0855N7021P5493l3134n8341
7184B21510Q4849J00058j8802o9455O4208J05308k2540j03841N8586J40585k396
7173E58070q7084R4293J60502k0145j55849Q1846K47008L0528j36057J07242L34398
7162A214752N3652k57416K8016M27419J21655k37604K30677P19621K41635m21810
7152B120597N8804J061886N15256m58567M66979K208443J360132l86493J340607
7143H287644N340266M556270J357741Q258091K8655381M4222337N0671995M6821919
$$ y = [209376, 345101, 367669, 253416, 202413, 425417, 672686, 858096, 966537, 988746, 912912, 771381, 627028, 521546, 415847, 265900, 142155, 201498, 254827, 215812, 147257, 200215, 264274, 246239, 204379, 244835, 291494, 251326, 180471, 237492, 312985, 279851, 221510, 306359, 406417, 387615, 318160, 382368, 487676, 465136, 361295, 419881, 560466, 558070, 470986, 565279, 725781, 705636, 549787, 631633, 878641, 909169, 773112, 880354, 1214752, 1268404, 1010988, 1039004, 1466423, 1588078, 1350474, 1581151, 2300772, 2542407, 2120597, 2179401, 3241287, 3756543, 3297976, 3764955, 5973398, 7333530, 6947037, 8287644, 13627910, 18184180, 19541921, 27800012, 56455393, 100677730, 151349725, 198171644]
7135A98171644L2826452J1564293j2234107l2920810m5777861m8474496m1424368
7128F1730747k7565026j3433184p336131o358526J10290L498131M09520k662907
7120H392914l262069o92533M27157q26389j535209k24970O59859o1469n70101
7111B307190j76476J39317k35856n36242j08820K35292j05397n29303D18711J7136
7101D35847M7962j83827O8820J97933n7307j64332K33170K77316K3348j83911
7091F95019j05299O9785k1830j78839p8261J32389J7160j41683n2734J13859J2389
7080D61955j35771m0018J39038L5862j25558p4645J22608M1809j07912p6136R5095
7069C36327J8342j54074H8502J98892O3797r5112k3906J43152L7489j28953o9790
$$ y = [198171644, 230998096, 242562389, 230328282, 197407472, 151629611, 103155115, 61730747, 34165721, 20732537, 13396406, 7037880, 7148170, 10646301, 11055821, 8392914, 5130845, 4438312, 4865469, 4039080, 2503871, 2278901, 2938760, 2877291, 2307190, 2130714, 2270031, 2034175, 1497933, 1389113, 1624405, 1519008, 989705, 418711, 435847, 483809, 299982, 368802, 566735, 509428, 345096, 578266, 855582, 878930, 695019, 589720, 659505, 637675, 458836, 380575, 512964, 530124, 388441, 335707, 449566, 461955, 326184, 286166, 425204, 461066, 335508, 260863, 383471, 425280, 317368, 241232, 336327, 354669, 200595, 88502, 287394, 351191, 256079, 232173, 375325, 412814, 283861, 214071]
7058B14071J60171N8359j33436j09083J66271O8064j33237r6756K00429Q4397
7048D79250j35714j09444J96729Q9953j58188j26337K58341J21068j70090j87128
7038B58440K92719J75895j57407j77032L54895K99388o1389l16768j63469l251
7028E02021B22963K45366O75452L10894k61437l97574N27087N06291j80748l77103
7018A271191P62446R09342m102j035618H97171O94895K51106K66066J696538J475443
7008E281219m10873k145569J744578L609275M72277l382805L393685R041199L643444
6999B1246430o512849J2058271M6793505O2435838O5735839N5305479L2391547
6992B89454060J944532k8935520n2924860o4842878o2944357C3148602A4626620
$$ y = [214071, 374242, 432601, 299165, 190082, 356353, 424417, 291180, 194424, 394853, 479250, 343536, 234092, 430821, 520774, 362586, 236249, 494590, 615658, 445568, 258440, 551159, 727054, 569647, 392615, 747510, 1046898, 985509, 668741, 505272, 502021, 222963, 468329, 1143781, 1454675, 1193238, 795664, 1322751, 1829042, 1648294, 1271191, 2033637, 2942979, 2938877, 1903259, 897171, 1592066, 1843172, 2109238, 3805776, 5281219, 4870346, 2724777, 4469355, 8078630, 8550907, 5168102, 8561787, 17602986, 21246430, 14733581, 26791852, 73585357, 136021195, 201757034, 257062513, 289454060, 291398592, 262463072, 209538212, 144695334, 81750977, 33148602, 14626620]
6984A9769736l064410G634511l269483M474882j0467l520118k643550J737223
6976D402998L88660j701946A362863J103332M43493r33964I54065P93199L79290
6967B126554n82359G07000M74616L58463l77939E13648L35402L34567k33408D41499
6956F29994K90144j48914C67110J18065K67844q3038l32179L5851K38987m0013
6946E72627k76831m4675K11105o603k07493j1891J86132p66j78951m3859J66696
6935C65491J5906j51078p3825J49776L6167j21145r8142J21326M4170r4807q8937
6924A04902J05942M6347p5734H7454R3187N2451n8099H6168P2893N3396m7044
6913A65413p9303O1187N3791l8669G1519L6497N9113k2768G1986K9064N5732j7021
$$ y = [19769736, 16705326, 7634511, 4365028, 8839910, 8829443, 5309325, 2665775, 4402998, 4791658, 3089712, 1362863, 2466195, 2909688, 1975724, 954065, 1747264, 2126554, 1544195, 707000, 1181616, 1540079, 1162140, 513648, 849050, 1183617, 950209, 441499, 629994, 920138, 771224, 367110, 485175, 753019, 669981, 337802, 373653, 612640, 572627, 295796, 251121, 462226, 455623, 248130, 236239, 422371, 421605, 242654, 198795, 365491, 381397, 230319, 156494, 306270, 342437, 221292, 123150, 244476, 288646, 193839, 104902, 210844, 257191, 181457, 87454, 180641, 233092, 174993, 86168, 159061, 212457, 165413, 86110, 147297, 201088, 162419, 71519, 108016, 167129, 144361, 71986, 101050, 156782, 139761]
6901A39761o7717J6734N1750j3100F1177J1616N9898j118n6147j4618M6308J190
6889A08306m8933m832N1668O921m5124k5587M5889J2325l4493k1007L8265J1694
6877I5092l4580B8496L9968J7699k2159j5886L2556J3027l0107A7654L7725K4624
6865H0003j6288l1313K1969K0818j6111B6795K3302K4807r125k9126M109J8160
6853E8922j2608A4993K1842K3710r909A8171J1934K7150l263k4906j2788K2967
6841C9265L845j3372O794J9293l278k5446p530K4215M305j8581p091K1832N425
6828D9676j8481A2820J9725R997j1673j0349J5451O769j3908j4123J7092R088
6816D0889j2366A1818J6816J1534r574A3260J4221J2618p978A1532N393J3827
$$ y = [139761, 72044, 88778, 140528, 127428, 61177, 72793, 132691, 131573, 75426, 60808, 107116, 108306, 59373, 54541, 106209, 113130, 68006, 42419, 88308, 100633, 66140, 45133, 83398, 95092, 60512, 28496, 68464, 86163, 64004, 48118, 80674, 93701, 63594, 17654, 55379, 80003, 63715, 32402, 54371, 75189, 59078, 26795, 50097, 74904, 65779, 36653, 40762, 58922, 46314, 14993, 36835, 60545, 50636, 18171, 30105, 57255, 53992, 29086, 16298, 39265, 43110, 29738, 36532, 55825, 52547, 27101, 19571, 43786, 48091, 29510, 22419, 44251, 49676, 31195, 12820, 32545, 42542, 30869, 20520, 35971, 42740, 28832, 14709, 31801, 40889, 28523, 11818, 28634, 40168, 30594, 13260, 27481, 40099, 32121, 11532, 16925, 30752]
6804C0752m557A0207Q638J4070j792j2115L744J0629l412A4397K96J5182l33j3041
6790A6501M14J3147J609j3273E331N834L30C939J3672J5634K190j2482j0874P701
6776A9780K648q586l510J0364K193j1005k529J5144N665r091F775Q471O947p116
6762A5077o937J1765Q710n458I853R02P833k060m314Q308O836o193G545Q271J4963
6747C0779K60p509J5792L2694K9119J6313L662p086j1923j4065j6256k0745k3683
6734B7352F197K002Q269l183n735P838P882j907n947M563O780l240o374J4951
6720C2096K0740J0514l349j1304q259k668l421o057o886p307E552O037J6245R345
6706C7179k649j2973D639a308E650K710K333k08m506j463O362L319l736l963P771
$$ y = [30752, 26195, 10207, 18845, 32915, 31123, 19008, 22752, 33381, 29969, 14397, 14693, 29875, 29542, 16501, 16915, 30062, 31671, 18398, 5331, 11165, 11495, 3939, 17611, 33245, 35435, 22953, 12079, 19780, 22428, 13842, 10332, 20696, 22889, 11884, 9355, 24499, 30164, 21073, 6775, 15246, 22193, 15077, 8140, 19905, 28615, 23157, 9853, 10755, 18588, 16528, 12214, 20522, 27358, 21165, 7545, 15816, 30779, 31039, 23530, 39322, 72016, 101135, 117448, 121110, 114024, 102101, 88036, 71780, 51035, 27352, 6197, 8199, 16468, 13285, 7550, 15388, 23270, 21363, 15416, 19979, 26759, 23519, 17145, 32096, 52836, 63350, 60001, 48697, 40438, 37770, 34349, 28292, 21406, 14099, 5552, 11589, 27834, 37179, 34530, 21557, 4639, -1308, 5650, 8360, 10693, 10485, 5979, 4516, 10878, 14197, 10461, 6498, 14269]
6691A4269O697j968n571L735N251k038I942M486J3610P600k917K005J0953L514
6677D9193J3644J6823L3953K6780K4651J5641M609l574j5266l3821k4918l1030
6665G6685k6219p305N439p663p987L230P570K68q155j2008r534n309A280c760
6650E384O865q70l566j295k64B258a4H475O985M80n929D124k54K54j759K796N464
6633A0625J085k088k439j983C28c598D384N269j392A18a874G527M098j359l361
6618F905j344j958j392N314N629Q62o349a06F787O419l04E033b631G373J0673
6603A8046P454L026k009l467l81K445m86p390E189A199P869K055m069a254l309
6588d563C495O338N107J455k510l960R58M397K104j847l804j660R47K667R80k579
$$ y = [14269, 20966, 18998, 13427, 17162, 22413, 20375, 9942, 14428, 28038, 35638, 32721, 34726, 45679, 49193, 62837, 79660, 113613, 140393, 165044, 180685, 185294, 181720, 166454, 132633, 107715, 76685, 50466, 43161, 48600, 40937, 32950, 36180, 43750, 44018, 35863, 23855, 14321, 9012, 1280, -3760, 5384, 12249, 11379, 7813, 6518, 6254, 2258, -14, 8475, 15460, 15940, 10011, 4124, 3870, 4124, 2365, 5161, 10625, 11710, 9622, 7183, 5200, 328, -3598, 4384, 9653, 8261, 118, -1874, 7527, 11625, 10266, 6905, 5561, 3603, 2211, 7525, 13154, 14016, 7667, -106, 6787, 13206, 12902, 5033, -2631, 7373, 18046, 25500, 28526, 26517, 23050, 22669, 25114, 24628, 17238, 5189, 1199, 9068, 11123, 7054, -1254, -4563, 3495, 9833, 14940, 16395, 13885, 9925, 10883, 15280, 17384, 15537, 11733, 10073, 11020, 13687, 14667, 12088]
6572A2088E274c697B54O840J166C680a028B804M666J473J56l73k679h68l893B768
6555D224C23N370J3627J1437O177Q28k045j824j010k364o115r362D401e188d79
6539G240P064O746M779R46m023p303G637B637p30K809N246K609k801C243b497
6523A6K923J999L146K558o72D868a024j046G18M714O203N709O35n288E797j116
6507D681P470P823P386J0802J1778J0220O617L281K261n023l266R53j196m243
6493E9544n431n774m555k760L32J997L740L740M282R558J4315J1958J1518O370
6479A08834k305r931j5632j9128k0215j9020j0237K464L803j753m124M460J0014
6466B7230O574M85k719R02J1389K1589K6987K7904K2671J3592J093j0450j9749
$$ y = [12088, 5274, -3697, 254, 7094, 8260, 3680, -1028, 2804, 7470, 8943, 9099, 8726, 6047, -868, -4761, 2768, 4224, 323, 5693, 19320, 30757, 36934, 37762, 35717, 33893, 32883, 30519, 24404, 15042, 4401, -5188, -479, 7240, 14304, 21050, 25829, 26775, 22752, 15449, 7637, 2637, 1907, 4716, 9962, 12571, 9770, 3243, -2497, 16, 2939, 4938, 8084, 10642, 9970, 4868, -1024, -2070, 718, 5432, 11635, 17344, 17979, 12691, 5797, 4681, 12151, 19974, 27360, 38162, 49940, 60160, 66777, 70058, 72319, 67296, 64030, 64983, 63787, 59544, 54113, 48339, 43784, 41024, 41356, 43353, 47093, 50833, 55115, 64673, 78988, 90946, 102464, 108834, 106529, 96598, 80966, 61838, 41623, 22603, 12366, 14830, 18633, 16880, 12756, 17216, 27230, 33804, 34289, 31570, 32472, 43861, 65450, 92437, 120341, 143012, 156604, 157697, 147247, 127498]
6453A27498k2442j8729r672p29K308p77n398r515j1638j1858r980p168j456O514
6439B6958M586P894n27o102j0101A1159A186Q315J4766P145K63p137q792j118
6425A4628R821J0098J0729M716J578J037J56k381o246r447j0361j0502C864j119
6411B745J1418J1366O302J12n344o130J47M216N052n08o222A1330b094a06A1368
6395A7166K92l119l387J243M865L475Q00J286K637O00j385j236R028J7349J7641
6380F7255J1022K602l593j075Q015J4496J1348Q40j2112k0341j9725j3242p720
6367C7770n936J1380K8290K5535R758j1410k7487m512K8254L9452M6231N1042
6355B28367P6625R3527Q8472O3688K5074j8907n9862r0412j07951j02311p0240
$$ y = [127498, 105056, 86327, 76655, 75926, 78234, 77457, 72059, 62544, 50906, 39048, 29068, 21900, 20444, 26958, 31544, 39438, 38911, 32809, 22708, 11159, 1186, 9501, 24267, 31412, 31675, 24538, 15746, 14628, 24449, 34547, 45276, 49992, 51570, 52607, 52763, 50382, 44136, 34689, 24328, 13826, 3864, 2745, 14163, 25529, 31831, 31943, 26599, 20469, 20616, 24832, 29884, 29376, 23154, 11330, -2094, -106, 11368, 17166, 17458, 14339, 10952, 12195, 17060, 20535, 21335, 22621, 25258, 25858, 24473, 23237, 32265, 49614, 67255, 78277, 80879, 77286, 76211, 84226, 98722, 110070, 110910, 98798, 78457, 58732, 45490, 37770, 31834, 43214, 71504, 97039, 106797, 95387, 67900, 63388, 91642, 131094, 177325, 228367, 304992, 398519, 486991, 550679, 575753, 556846, 496984, 406572, 298621, 196310, 126070]
6344A26070j5541J5375J0631P876K8675N5451O0844O7242O4031O4385N7832L1366
6332E74237j2807o3101j08765j34357A14652D5103Q1271R6377P9205O2012L3942
6321C97910J4321M8340J64407L09774L64823L18583K00722K4260j26359j83737
6311A533044j18273j3683L8q7676k26009k89543l04861k32338A01431d225B5268
6299A23053O1094J1633k8386m6927l5508j3152q807n309L668M401N203J5021K0332
6286A06316J3212L490p91K494L09j1253l0571C9602e499F673K5226J0108p79o804
6272C4424p732j1300D801K513P890N262k690K23Q618m5O58K8523P0409Q7400R7160
6257C10722Q4322N1013J2694l2074o8144q8929q8751o6030k6221j1215k1995j2077
$$ y = [126070, 110529, 125904, 136535, 144411, 173086, 228537, 289381, 356623, 420654, 485039, 542871, 574237, 561430, 498329, 389564, 255207, 114652, 45103, 126374, 222751, 301956, 363968, 397910, 412231, 460571, 624978, 934752, 1299575, 1618158, 1818880, 1843140, 1716781, 1533044, 1414771, 1401088, 1401126, 1313450, 1087441, 797898, 493037, 260699, 101431, -4225, 25268, 123053, 184147, 195780, 167394, 120467, 84959, 71807, 63000, 57691, 61359, 65760, 70963, 85984, 106316, 119528, 123018, 122227, 124721, 125030, 113777, 83206, 39602, -5499, 6673, 31899, 42007, 41228, 34424, 26692, 15392, 4801, 7314, 15204, 20466, 17776, 17999, 26617, 26572, 27230, 55753, 126162, 213562, 310722, 395044, 446057, 458751, 426677, 358533, 269604, 180853, 114823, 88602, 77387, 55392, 43315]
6245D3315r589p877n309H190g040B667J5325Q846L440N59q432H084c216q2A226
6229b657k183J631D579N572N842O55o400C95d63A757a023l491A417M395j609b078
6212h838b49G491O619P877P655L919j321m389k487J661R00l311n188J947R463
6197C0836Q947K801m274n517K173J3678J8376J8073J4867R851M678j624q595j9163
6183H5107l1939A0261L2356P3806P2778O0378L6683R123k1433m7403o2782o6829
6171I6938C9417G676M616m520a737A3814J9269O511m320J803j3067J9838L6961
6158H0809L6050K8689J2058p702k6314l5485l8661j1985L7081M9263M0764K3009
6146A87576N27j6851k0456m166J9719M7075O9880Q3164P9096N4112J4484l0963
$$ y = [43315, 33726, 25849, 20540, 8190, -7040, 2667, 17992, 26838, 30278, 30837, 22405, 8084, -3216, -3298, 1226, -2657, -4840, -3209, 4579, 10151, 15993, 16648, 10248, 395, -463, 1757, -1023, -4514, 1417, 5812, 4203, -2078, -8838, -249, 7491, 14110, 21987, 29642, 33561, 32240, 27851, 25364, 27025, 27925, 24614, 19426, 21373, 30836, 39783, 42584, 38310, 32793, 34966, 48644, 67020, 85093, 99960, 109811, 114489, 112865, 104270, 85107, 53168, 10261, 42617, 116423, 189201, 249579, 286262, 295385, 273952, 226549, 163767, 96938, 39417, 7676, 12292, 7772, -1737, 13814, 33083, 39594, 35274, 37077, 24010, 43848, 80809, 116859, 145548, 157606, 149904, 123590, 88105, 49444, 37459, 74540, 123803, 164567, 187576, 188103, 171252, 150796, 146630, 166349, 213424, 283304, 366468, 445564, 499676, 514160, 483197]
6134D83197o9457r2491r8113q6534o5915C0312C9a1378G188K1093K834L750o757
6121B8108j0185F981k379P564J1835J5677J0529O855j226j2138k0064q432J1959
6108B7161J7450R969m090j6943j2466k449N239O386K61o05j832k126n63m159o902
6093A4331F983B431N07M208J747K476J972j369j472k415k810J1560J8121K0882
6079E5838J7205L332m210r626p993q041p051p353m037L453L723M986N885J1567
6065E7678K6967L8302L1648Q164k7662n5610A7832k956J4617j3083K677K7143
6053D6230K455k0881J6084L5963j368C0643J825O0104P807m8868L7040R5846K4909
6040B09306r2755E8253J90789Q2132j06961J4566L96439K50591k21195j30727
$$ y = [483197, 413740, 321249, 223136, 136602, 70687, 30312, 39, -11378, 7188, 28281, 31115, 34865, 28108, 17923, 6981, 4602, 12166, 24001, 39678, 50207, 57062, 55836, 43698, 23634, 15202, 27161, 44611, 54580, 50490, 33547, 21081, 18632, 23871, 30257, 30518, 29913, 28081, 25955, 25392, 21233, 14331, 6983, 2431, 2938, 7146, 8893, 11369, 13341, 11972, 10500, 8085, 5275, 16835, 34956, 55838, 73043, 76375, 72165, 62539, 54546, 46505, 39454, 32101, 28064, 31517, 35240, 40226, 46111, 57678, 84645, 122947, 154595, 162759, 135097, 79487, 17832, 14876, 29493, 16410, 19087, 46230, 48685, 27804, 43888, 79851, 78483, 30643, 32468, 92572, 100379, 51511, 88551, 184397, 209306, 116551, 58253, 249042, 331174, 224213, 238779, 635218, 885809, 664614, 533887]
6030E33887J786002K560372K859589K589726J752845N12250q49336k006758k704959
6021G033618k818953A826033C89997L43738O9909l14869A71049J34991N8326j18166
6011B46200H6522O9124N7667m5223F2800A9128M3566j5469n148M8496K0477k4458
5999H6592C8880n000K0103j0858A5491J9363K0967p003A9906G701J8361j853C768
5985A2027K0729M427j2139A1740K653j751A925P389J5420L449r843I66J448P703
5971A0117l121b45C537P721O823J0216Q996Q98j1609E443b409A5563J0173M694
5957C0430J5656L3301N0254N9853O1639N1071L0178J457k9609n3550o6834o5062
5945A18784n2229k9748j2194l169M028K261l886j0396C065i73b88A945M515L444
$$ y = [533887, 2319889, 4880261, 7739850, 10329576, 12082421, 12594671, 11745335, 9738577, 7033618, 4214665, 1826033, 389997, 733735, 803644, 488775, 171049, 306040, 364366, 246200, 86522, 155646, 213313, 168090, 62800, 19128, 62694, 47225, 42077, 90573, 111050, 86592, 38880, 33880, 53983, 43125, 15491, 34854, 55821, 48818, 19906, 7701, 26062, 24209, 3768, 12027, 32756, 37183, 25044, 11740, 14393, 12642, 1925, 9314, 24734, 28183, 18340, 966, 2414, 10117, 6996, -245, 3537, 11258, 18081, 28297, 37293, 38191, 26582, 5443, -2409, 15563, 25736, 30430, 46086, 79387, 129641, 189494, 251133, 302204, 332382, 333839, 304230, 250680, 183846, 118784, 66555, 36807, 24613, 21444, 25472, 27733, 23847, 13451, 3065, -973, -288, 1945, 6460, 9904]
5931I904j422B698f67B258J808j335a597m685r5A662Q603N022p90o432i82o629
5915g611j444K648J814J33k490J677l765N79J205q57j397j878M671B623J3734
5900A6357J4964J2970R010N274J244k942p277j0484j1215j0305p961B479c842
5886f595b337f51B48b148k7J085Pk641J313B680L419M76k772c40q38I59O75e05
5867a714h3D93c53p86a25A117J8A56h60l75j280l114o9a616B271K942O15k570
5849C258a630o647K213b660g68j35r82k046k192Q32a967B23J327J798P50j348
5833B750D87c085m424k457L152a950A363d914b198m968a297B754G78l75a631k447
5817d078p93j058Q87i78B553J673j24A722b595l676a144B204M59r66A95E9g52
$$ y = [9904, 8482, 2698, -667, 2258, 4066, 2731, -1597, -6282, -6377, 1662, 10265, 15287, 14497, 8065, -982, -7611, -9055, -6407, -4593, -4460, -6950, -5273, -9038, -8459, -7254, -8111, -9508, -11386, -6715, 2623, 16357, 31321, 44291, 53301, 58575, 59819, 56877, 49600, 39116, 27901, 17596, 9635, 2479, -3842, -6595, -2337, -651, 248, -2148, -2175, -1090, -1083, -3724, -2411, 2680, 6099, 6575, 3803, -340, -1178, 959, 1634, -505, -1714, -83, 493, -353, -1139, -125, 1117, 1135, 156, -860, -1235, -2515, -5629, -5698, -1616, 2271, 5213, 5828, 3258, -1630, -8277, -6064, -2660, -768, -903, -1885, -3931, -6123, -5291, -1967, 223, 1550, 3348, 4098, 2750, 487, -3085, -7509, -9966, -6814, -1950, 1363, -4914, -2198, -7166, -1297, 2754, 778, 403, -1631, -4078, -4871, -5929, -5042, -978, 2553, 4226, 4102, 1722, -2595, -6271, -1144, 2204, 2663, 1697, 195, 59, -752]
5799b32l175l061o140m643J441g149C476J0746J883o213C870d048n654c958a602
5783b279k522l42J104a608A461L027J799j078j966H4a285D69K746K206N32p46
5767E207k197E51a632j398L27R06e68D15K041J803O50j877I96K553P281P415N586
5750B3831J972k413o306F626f228j379C470J0470M899N33r99r59r04l040m587
5735H883A966c428o52J593Q83l83A222N886M759K408o99k921m445B510E39P20
5719A259L026M24j748a091m099K84J274j465l536P97L542J193J97j219R52i82
5702B27a0m54o02K05A256J405j85A064l94J690M14D76d303l317a368C693N54h39
5683h443L098D293P593J856k119m955k767L479M019K846J334k474J124l602m959
$$ y = [-232, -3407, -6468, -12608, -17251, -15810, -7149, 3476, 14222, 16105, 9892, 3870, -4048, -9702, -3958, -1602, -2279, -4801, -5143, -4039, -1608, 1461, 4488, 6287, 5209, 3243, 84, -1285, 469, 3215, 5421, 5953, 5207, 3010, 551, -1632, -3030, -2703, -1797, -568, 415, 2456, 4259, 4909, 3032, 996, 3549, 10830, 18245, 23831, 25803, 23390, 17084, 6626, -6228, -7607, 3470, 13940, 18839, 19372, 18373, 17414, 16510, 13470, 8883, 1966, -3428, -4080, -2487, -1604, -1987, 1222, 7108, 11867, 14275, 13576, 10655, 6210, 2510, 539, 1259, 4285, 4709, 2961, -1091, -5190, -4906, -3632, -5097, -8633, -7836, -4294, -3101, -2904, -4123, -3171, -982, 227, -10, -464, -1066, -861, 1256, 2661, 2476, 1064, 670, 2360, 2774, 476, -4303, -7620, -1368, 3693, 4247, -839, -8443, -5345, 4293, 11886, 13742, 11623, 6668, 3901, 7380, 11399, 14245, 15579, 13105, 14229, 10627, 5668]
5668E668a076n512J743a942f37a77A650L201K240j777C13f489K764A937K797J357
5652F091J314R80p7k054k658d43l549j213J355f12D512N573M400J778k554n314
5636H395C004j012K631M191L310R80k135D949c004l779F10M127p57A105cD356
5619I265K186j316D345i43B348P549M529j268l250k027J214K218N91k02j37o86
5603A0879l301A44e116C066O598K940l80q46J909K627L63l684n015k632J673L738
5587A0357K328p17k67L493N294K711k665l360L56O796L377l207r384p061L632
5572A1683L107k633k393O641O471k032H954B068J6197J5515P229L35l088n636
5558C2620o938A2394D018n97Q017K902M701L888Q833P441L127j0542A5056E476
$$ y = [5668, -1076, -6588, -4845, -1942, -637, -177, 1650, 4851, 7091, 5314, 313, -6489, -3725, 1937, 4734, 6091, 7405, 8385, 8308, 6254, 3596, -443, -3992, -5205, -3850, -612, 4512, 10085, 14485, 16263, 13709, 8395, 3004, 1992, 4623, 8814, 12124, 13104, 10969, 4949, -3004, -6783, 610, 4737, 3980, 1105, -3, 4356, 9265, 11451, 10135, 4345, -943, 2348, 9897, 14426, 13158, 9908, 7881, 9095, 11313, 11904, 11702, 11565, 10879, 7578, 144, -5116, 3066, 9664, 12604, 12224, 11378, 13287, 15914, 16277, 12593, 7578, 4946, 6619, 10357, 12685, 11968, 11701, 15194, 20488, 23199, 20534, 17174, 17530, 24326, 27703, 24496, 15112, 8051, 11683, 14790, 12157, 9764, 16405, 22876, 20844, 8954, 2068, 18265, 33780, 41009, 41344, 38256, 32620, 25682, 12394, 4018, 3421, 11438, 14340, 19041, 22929, 31762, 39203, 42330, 31788, 15056, 5476]
5543B2234K7832J5714M820p203m821R346J5222P437l565M293K2319K1844J7894
5530A53366J3207K0190J5925L1735p429k6760n9450o0277l7489K7394M8210K7046
5518A45668K4462K6379K6749K3140M345j5862l7488l1876J3839N9715O2091L9144
5506C40306r520K7986K0765O9074N6869j531K2490O4546J35117J63427J70753
5495A060282K13464K72420L34936N16475R23603J459524J886814K013554J781617
5486A0462689J196476L59653n90378j490870k192784k595866B512539F27854J325625
5477A953479J148842M61719j37735n27581o57898n56202l50932k12815j79341
5468I41536j64412j20843q0137p0848q0906o4227l6253j0358j4980k6294k9959
$$ y = [22234, 50066, 65780, 70600, 63397, 58576, 67922, 83144, 90581, 87016, 91309, 113628, 135472, 153366, 166573, 186763, 202688, 234423, 226994, 200234, 140784, 80507, 43018, 70412, 118622, 145668, 170130, 196509, 223258, 246398, 250743, 234881, 197393, 165517, 179356, 239071, 301162, 340306, 330786, 358772, 379537, 448611, 505480, 503949, 526439, 590985, 726102, 889529, 1060282, 1273746, 1546166, 1881102, 2397577, 3321180, 4780704, 6667518, 8681072, 10462689, 11659165, 12018818, 11428440, 9937570, 7744786, 5148920, 2512539, 627854, 1953479, 3102321, 3564040, 3426305, 2898724, 2240826, 1684624, 1333692, 1120877, 941536, 777124, 656281, 576144, 505296, 424390, 360163, 323910, 313552, 298572, 272278, 242319]
5457B42319k0527k1593j9564j0081l898m661m676j0811j6314j7297r822n74O33
5444A03134o357j1038o305J896M698n68n168q361q984n550o64K653J517j966L356
5429F2293Q476M891n414j7132j9530P238J9144J1347Q71o282q511r073q856p658
5415C1804j952M573M342J039k151l480m292n595r154E398J4357K8622K6523J7219
5401I2119M722m346n681n41r98j0094k2041B4564B876Q878R163J349K585N145
5387B9996r2q509j0070Q207J5006Q616J919L09O537P441K389o127j4461j7974
5373B3187H442J133Q850M160k050n040k210L106N123J434k775o842E138d049k517
5358f566f50B627J513L433M574L525r71n272C337L800O731K415n132E436m2o06
$$ y = [242319, 221792, 200199, 180635, 170554, 166656, 161995, 157319, 146508, 130194, 112897, 103075, 102501, 103134, 96777, 85739, 79434, 81330, 86028, 85460, 80292, 71931, 62947, 57397, 56733, 59386, 60903, 58937, 62293, 70769, 75660, 70246, 53114, 33584, 40822, 59966, 71313, 72184, 65902, 57391, 48318, 39462, 31804, 29852, 34425, 38767, 39806, 37655, 34175, 29883, 24288, 15134, 5398, 19755, 48377, 74900, 92119, 96841, 92495, 86814, 86273, 85275, 75181, 53140, 24564, 2876, 11754, 20917, 22266, 24851, 29996, 29904, 21395, 11325, 19532, 34538, 43154, 45073, 45382, 51919, 59360, 61749, 55622, 41161, 23187, 8442, 9575, 18425, 22585, 20535, 15495, 13285, 16391, 21514, 22948, 20173, 13331, 5138, -4049, -6566, -650, 2627, 4140, 7573, 12147, 15672, 14701, 9429, 3337, 7137, 13868, 16283, 11151, 5436, 5394, 4788]
5342D788b119A1812L1666L2109K7388J9756J0694M39r927k0144k8197l2523A5431
5328D324N495M7D862N95O101N160K287p61m632E837c486A021Q018L516j638E312
5311A54P358J1311Q043N05m891j0053A447a814g10l684k455a542D67d348k50F949
5294A5666L903m777D948c003G586J0744R010Q366P806N642L820L019M226N460
5280F5679M580J184k668l630K567J4714K4544K8412K3966J2141m482k2925l5466
5267A08616l4352k2405m504j470r242j3065m49R936N276n315j5570e252E998J9344
5253B5342J3435J295j2159j0679J8648K7550J7042r31J305M8531Q9535R8724Q5219
5240D02857N0445M504m3280o5817q1003o6181l4929j5898k3646l1472l3053j3962
$$ y = [4788, -2119, 11812, 43478, 75587, 102975, 122731, 133425, 133864, 123937, 103793, 75596, 43073, 15431, 4324, 9819, 9866, 4862, 5457, 11558, 16718, 19005, 18244, 13612, 5837, -3486, 1021, 9039, 12555, 10917, 5312, 154, 7512, 18823, 26866, 27371, 22480, 12427, 1447, -1814, -710, -4394, -6849, -1542, 467, -4348, -4598, 6949, 15666, 19569, 14792, 4948, -3003, 7586, 18330, 27340, 35706, 43512, 49154, 52974, 55993, 60219, 65679, 70259, 71443, 68775, 65145, 67712, 82426, 106970, 135382, 159348, 171489, 167007, 144082, 108616, 74264, 51859, 47355, 45885, 36643, 23578, 23129, 33065, 38341, 33026, 17456, -5252, 5998, 25342, 38777, 40072, 27913, 17234, 35882, 63432, 80474, 79543, 80848, 129379, 218914, 317638, 402857, 453302, 457806, 414526, 348709, 267706, 201525, 166596, 150698, 127052, 95580, 62527, 48565]
5228D8565L131j43n230l622J321K408L02M584O463l677j5798j7679l690J0274
5214B7209Q836J1283J1241L754j2282j8501j4545m398Q680K3489K3780R436j2591
5201F5391j4269J3717J7659l389p109L2756L9724j3361R080Q7642Q6470J9142
5189C33453j0217K38763N32698O36077N80963L91937J28718j35169l01095k45328
5179B150800R8129M80740O03271M57426J38000k42067n82179p55592p02751m40810
5169A204967j60733j11372k03559k64095j51717j7792j7730n6590p7852j7133
5159A26394R821k4974m1183K0222M3840J1758k4928l8524k6278J682k688k43j5280
5146C9619j5846J7242L5222L3170R195o730n393J0411J5295J1941J8620M6905
$$ y = [48565, 51696, 51553, 46323, 42701, 44022, 46430, 46732, 51316, 57779, 54102, 38304, 20625, 16935, 27209, 36045, 47328, 58569, 62323, 50041, 31540, 16995, 12597, 21277, 44766, 68546, 77982, 65391, 51122, 64839, 82498, 79109, 72000, 104756, 144480, 131119, 140199, 227841, 314311, 333453, 323236, 561999, 1094697, 1730774, 2311737, 2703674, 2832392, 2697223, 2396128, 2150800, 2248929, 2729669, 3332940, 3790366, 3928366, 3686299, 3104120, 2348528, 1645777, 1204967, 1044234, 932862, 729303, 465208, 313491, 295699, 277969, 221379, 143527, 126394, 136215, 111241, 70058, 90280, 134120, 145878, 120950, 82426, 56148, 57830, 55142, 54899, 39619, 23773, 41015, 76237, 109407, 118602, 111872, 106479, 116890, 132185, 144126, 162746, 209651]
5134B09651Q0158J06768J17326J13942R7970O7222K4646j8806n8512q8390j00955
5123E51020r6421p6580n5432n4723p1755q0084E3504K2939N1795K1570k064l1409
5111A16335l9327j9307j733K973m958j3975j9606F300J1651J6656O080l925q607
5098B8155n101n60J96k783m466n633l850J35K353J524M92R71J348M71j515k656
5082I081k799k007j291j54K679L517K011j312l260E21d733A135Q148N232P62k699
5066A2578l684j061M03J793M187M595K134k928p959b432B022J7062J5286J2180
5052D6550P923M439O179J2912J9309J8718J2952K494p942j5921k0513j9204j1752
5039E6144j875M206Q225J3597K4300L4676L9353L5700K3497N133j4467l1135m0784
$$ y = [209651, 289809, 396577, 513903, 627845, 725815, 793037, 817683, 798877, 740365, 651975, 551020, 454599, 378019, 322587, 267864, 196109, 116025, 53504, 76443, 128238, 149808, 147744, 116335, 77008, 57701, 55968, 58941, 53983, 40008, 20402, 6300, 17951, 34607, 40687, 36762, 28155, 23054, 22494, 22690, 19907, 15441, 9808, 5958, 6093, 8446, 9970, 10462, 11433, 12781, 13252, 11737, 9081, 6282, 4275, 2984, 2830, 5509, 9026, 11037, 9725, 6465, 521, -4733, 1135, 9283, 14515, 15277, 12578, 8894, 7833, 8236, 10029, 14216, 18811, 20945, 18017, 10058, -2432, 2022, 19084, 34370, 46550, 54473, 58912, 65091, 78003, 97312, 116030, 128982, 131476, 123534, 107613, 87100, 67896, 56144, 54269, 58475, 66700, 80297, 104597, 139273, 178626, 214326, 237823, 242956, 228489, 197354, 156570]
5026A56570m2986l8316k8382j7280r126k353M84k784o600m597K913L589J46l098
5012H180k984j567A465a488d4D634J999k152f36n205J007a642B75R43l69J10Q97
4995A856l70g50m499o72b711O16j477K80F93L130R18j398D89c958l925c100A193
4977C060p49c78m563J005h77D75Q3b35j703j833k218J289a397B366L019K65k563
4960C087g87j950e26A707M86C36b680l780c188f99f2n63C6K243J031j487h36L57
4942d79B508P58I57c718k695b562i02m38k009j987J845J645K97j566l409J438
4926e086a469a96p42k259k355K66K430d2B593J268n94C43d296k720b870A00K453
4909B553Q92M5l88j27L20L85O28r87q65Q99L153L311J478k039D455a769m742K065
$$ y = [156570, 113584, 75268, 46886, 29606, 20480, 18127, 18611, 15827, 9227, 4630, 7543, 11132, 11278, 8180, 5196, 3629, 1465, -1488, -44, 4634, 6633, 4481, -636, -5841, -4834, -1642, 275, 1218, 849, 959, 1856, 1486, -750, -5249, -5921, -2711, -2095, -3572, -3292, 693, 3823, 4741, 3343, 489, -3958, -7883, -3100, 1193, 3060, 2311, -378, -4941, -3936, -877, 475, 558, -235, -1938, -3771, -5989, -4700, -1397, 2366, 5385, 5650, 3087, -787, -2737, -526, 1707, 2193, 336, -2680, -6460, -3188, -699, -62, -625, 36, 2279, 3310, 1823, -836, -479, 2508, 3266, 957, -3718, -6413, -2562, -902, -1340, -3349, -5336, -3491, -1846, -1549, -3115, -6524, -5086, -1469, -196, -938, -3197, -5552, -5286, -2856, -42, 2593, 3861, 3267, 343, -4296, -7016, -2870, 100, 2553, 3445, 3490, 3102, 2975, 3295, 3680, 4308, 3321, 2456, 3355, 6508, 9819, 11297, 9258, 4455, -1769, -6511, -4446]
4891d446g97B044J789K1A792a692l459k729K708a863I32Q73F96b814m202Q36L044
4874c136a450J24p3M39a49C89a06r49Q8d27j32k502l809K048K152a066A662K639
4856D301J223m57k294i92k186L89d76C553L917K645J40j769k676B560h86l132
4840d018j688J469g94B355K202j2B106a289j11I29J844L68A464a674j351f74A608
4822A375d77j334Lj31j430M97c65A321E76b202l537j83l49K099h82A567L22I9
4803b628k273o26K037i64F29j73a453p00j1r30j674l94J814J010L76b18B612J807
4785D419M0j636I62l48J090K003J150o89k023f3j476j229J054F20J728r89a980
4767e441b565B87J38a403p03eD48a104k432k270l51b725A436K187p2A591i76j225
$$ y = [-4446, -797, 2044, 3833, 3854, 1792, -1692, -5151, -7880, -5172, -1863, 932, 1805, 696, -2814, -7016, -6180, -3136, -1450, -1326, -1399, -960, -149, 389, -106, -1055, -967, -427, -559, -3061, -6870, -4822, -2670, -1066, 1662, 4301, 5524, 5067, 2773, -992, -3178, -2789, -476, 3553, 7470, 10115, 10255, 8486, 5810, 2560, -886, -4018, -5706, -4237, -794, 2355, 4557, 4545, 2106, -1289, -1400, 929, 2773, 3141, 1464, -1674, -3025, -674, 1608, 1375, -477, -1811, -1808, -1939, -3369, -2872, -365, 1321, 576, -2202, -5739, -5922, -6271, -4172, -882, 1567, 1889, 99, -2628, -4901, -5527, -3490, -964, 629, 456, -1453, -2153, -2164, -3094, -4768, -5162, -3348, -2338, -1962, -218, 2612, 4419, 4459, 2823, 962, 614, 1704, 3707, 4857, 4168, 2145, -63, -1539, -2768, -1714, 620, 2348, 1359, -1980, -5441, -2565, 287, 425, -1403, -2106, -5, 448, -1104, -3536, -5806, -6157, -2725, 1436, 3623, 3551, 1591, -976, -2201]
4749b201d35C425M220K615n45k800k314n69M88L94M85q92A608c099m343L695J411
4732b336k340j793c073J068j892k493K042b049d32A182P99n86a515k889J687a331
4715b613l633k116k74L243F37N898K436j541B428b939l558q30c582A45J583e0
4698b440J017Q4k441m34A753M886R55C684b464k242f91B22e49o28j903l603J993
4681d690a786j07j777J066A84a26l879P36C12g84m683a733D864K648j878B129
4664A537j81b970k665H16L856j989c899j621b02B414L66j227g95m170b392A933
4647B038c651J581G144L542l077h68k495A974Nd223C17O637Q24j683K132M138
4631A2365j163C728d475D42J071d237e74G837K610m594F49K986J706k453j222
$$ y = [-2201, -435, 3425, 7645, 10260, 9715, 6915, 4601, 4032, 4520, 4914, 5399, 4507, 1608, -3099, -7442, -3747, -2336, -4676, -6469, -3073, -2005, -3897, -6390, -4348, -2049, -432, 1182, 1981, 1395, -1515, -4404, -2717, -1331, -2613, -6246, -8362, -8636, -5393, 637, 6535, 8971, 7430, 2428, -2939, -6497, -7327, -3582, 145, 1728, -50, -2440, -1423, -1339, -3780, -4214, 1753, 6639, 7594, 3684, -2464, -4706, -691, 222, -549, -1177, -3080, -6683, -4690, -1786, -1893, -3670, -2604, 184, -126, -4005, -3269, 312, -784, -5467, -1733, 4864, 7512, 5634, 2129, 1537, 1356, -2970, -5635, 816, 4672, 2683, -3899, -5520, -202, 2414, 2780, 1553, -795, -4965, -2392, 1933, 2038, -3651, -2070, 7144, 10686, 7609, -868, -3363, 1974, 1979, -4223, 317, 6954, 7778, 6095, 8227, 12365, 11202, 3728, -4475, 442, 1513, -4237, -574, 7837, 10447, 5853, 649, 3635, 5341, 2888, 1666]
4616A666K076q68a971D481J0529L976l976p129k572j553d093a67A1783M129o672
4601I240d328B523R912J302k589L713L873m081D475K859P332j897D556M463R064
4586A8083N83n261M040J5385K1231L1301M2318M4535L5500J7389n756k8433m5486
4573A45429n0936l9295j2665l144j0097p414M200k46j1276m066J0963R3E432M096
4559I528K2083O310j2562A0808J2439P913j1106E367K0279Q876j4277C021K9344
4546C2365J4393j0338A4240J4566J4914j0503D512J8884K1138q287H719K5124
4534C3843K3496p831A6884J4183K8950m486B2678J3712L1851n021B0796J4869
4522C5665M2336O26C4549J637N2412P024m4778r838N7094R542n2609j2272P4416
$$ y = [1666, 3742, 2874, -1971, 4481, 15010, 18986, 15010, 7881, 5309, 3756, -4093, -167, 11783, 15912, 9240, -4328, 2523, 12435, 13737, 11148, 14861, 18734, 14653, 4475, 7334, 14666, 12769, 4556, 9019, 18083, 18666, 13405, 17445, 32830, 54061, 85362, 127680, 172215, 207715, 225104, 219348, 190915, 145429, 94493, 55198, 42533, 39389, 29292, 21878, 26078, 25832, 14556, 10490, 21453, 21546, 5432, 9528, 31611, 37921, 25359, 10808, 23247, 31160, 20054, 5367, 25646, 34522, 20245, 3021, 32365, 46758, 36420, 14240, 28806, 43720, 33217, 4512, 23396, 44534, 36247, 8719, 33843, 57339, 49508, 16884, 31067, 60017, 55531, 22678, 36390, 68241, 63220, 20796, 35665, 78001, 78627, 34549, 36186, 88598, 95622, 50844, 41006, 98100, 107642, 55033, 42761, 117177]
4509A17177J9755n4589l7319Q4573K8439o1916D6316J12653M6757o2819E7682
4497A79568O8517o5626F8154J45551R4393p2283H2816J89006J42619p5292A19047
4485C38452K15716o6757A96692K63140L33476n4597C20004L48126N73709R263
4475A251102o24841M37944J114566L00692p34073N74098K220960P39103B273398
4465F020172J3737100J7686722J8629063J5776247R418463Q57747p889685j4776024
4457E9459805j8326499j8048792H531087A047525L697370j54607k028245q49545
4449A712498P79009j41828j056247E49750O42116J10447n10014B91267M06002
4440F97269J29146k84888A79428K67450J23057j73214A24616J78900J14152j07874
$$ y = [117177, 136932, 82343, 45024, 129597, 158036, 96120, 46316, 158969, 205726, 142907, 57682, 179568, 248085, 182459, 68154, 213705, 308098, 235815, 82816, 271822, 414441, 339149, 119047, 338452, 554168, 487411, 196692, 459832, 793308, 738711, 320004, 668130, 1241839, 1251102, 626261, 1064205, 2178771, 2479463, 1745390, 2319488, 4540448, 5279551, 2273398, 6020172, 19757272, 37443994, 56073057, 71849304, 81267767, 82125514, 74235829, 59459805, 41133306, 23084514, 8531087, 1047525, 4744895, 4590288, 2562043, 1712498, 2491507, 2349679, 1293432, 549750, 1191866, 1302313, 792299, 291267, 697269, 826415, 541527, 179428, 446878, 569935, 396721, 124616, 303516, 417668, 309794]
4430C09794A03059J07437R7454o9419G6045Q3436Q9575m5961G4782M7418Q0724
4419B02924k6675G0386J2056P3773j1507F3021l848O2203n814D7290K03N9611
4407A07104j475E1981j344M9184L441m6142B7217M3970Q347l6737A9981M4061
4395F4042Q676k8824j9853L6609J2632k4742A0128K7613J3680j9768A0897L4095
4383D4992J4396j5307A9408J6027J2899j3974G432K3179J6191r526A1063J0405
4371B1468J7235n050A2567M469J4644m169I435Q742J5612k531A2518K270J5853
4358C0641j139A0790p79K2198O673r904j2968O127L929j0480j337L5357L9971
4345H9577L7747L4506K9714K2017R224q951k8737m5485n3395D0821j3583L833
$$ y = [309794, 103059, 210496, 307950, 238531, 76045, 159481, 249056, 203095, 74782, 122200, 202924, 176249, 70386, 82442, 156215, 144708, 63021, 59173, 121376, 115562, 47290, 47493, 107104, 105629, 51981, 50637, 99821, 103262, 57120, 27217, 71187, 79534, 42797, 19981, 64042, 72718, 43894, 24041, 60650, 73282, 48540, 10128, 37741, 51421, 31653, 10897, 44992, 59388, 44081, 19408, 35435, 48334, 34360, 7432, 30611, 46802, 37276, 11063, 21468, 38703, 33653, 12567, 17036, 31680, 27511, 9435, 18177, 33789, 31258, 12518, 14788, 30641, 29502, 10790, 10011, 32209, 38882, 28978, 16010, 22137, 26066, 15586, 14249, 49606, 89577, 127324, 161830, 191544, 213561, 222785, 213834, 185097, 139612, 86217, 40821, 27238, 31071]
4333C1071o291r796J008J583o995l926R472L935p394c113A1428R089j767I300
4318C163J323A575J629J2080O930j716r629d63A893R21D46N036L142l799b31I891
4301A7891j2p840a59C104R54a656a90F633J185B524c002E285L124l649a269a75
4284A591i19k501c54B36a327E769P327K522m402B259f45C978P53r53j9p99A23
4266A974O241K324l753A19K069M711j6B551g46F34a03k71E231M732j27m635a253
4248b912J253k054M93b27d9rC385K760j144c46l864A302K568o24m47J147L34j902
4230B378I17J404K81I5a811B275L046o23B042C67L76A03a617q73h61C184N778
4213H962N074J731k287n774B452n51Q97j067D2c03l89j451r95J13l72M65a147
$$ y = [31071, 24780, 14984, 15992, 17575, 10580, 6654, 16126, 20061, 12667, -3113, 11428, 20517, 18750, 9300, 3163, 4486, 1575, 3204, 15284, 22214, 20498, 10869, -463, 1893, 2814, 446, 5482, 8624, 4825, -231, 9891, 17891, 17879, 10039, -159, 3104, 4058, -1656, -190, 6633, 7818, 2524, -3002, 5285, 8409, 4760, -1269, -175, 1591, -919, -3420, -354, 236, -1327, 5769, 13096, 15618, 11216, 2259, -645, 3978, 4731, 3778, 3759, 2960, 123, 1974, 8215, 10539, 6786, 119, 2188, 6899, 6883, 2551, -746, 634, -103, -374, 5231, 9963, 9836, 5201, -1253, -2912, -1659, -3713, -3220, -227, -49, -58, 3385, 6145, 5001, -346, -4210, 1302, 3870, 3246, 2799, 3946, 4280, 2378, 917, 2321, 2602, 95, -1811, 2275, 5321, 4698, 2042, 367, 743, 103, -1617, -2490, -861, 3184, 8962, 14036, 15767, 13480, 7706, 2452, 1901, 2798, 1731, 42, -303, -692, -2143, -3138, -3025, -3397, -2932, -1147]
4195d86j825n58A380K383k99j713k33J350m42D78h59B33L41e55j173M80K23j76
4177a201B396K930N05k502b37p98A646J623k06j233A49i99a02A349J99C90c73
4159D07N67I6a296a25A658M49F66a457r71c46C745M322K793R21k92q32l70j094
4141I193k527B844a436j104b0A682J22B91c080n06f41F93J99B55a96A87O96J215
4123B098M39A228a437o34I85K641QA166a890j92E50K758K849J050o85j405j166
4106C951j220j194B42h2b2m49j717o19Q84j91K86G61J129I39a776q2A396K265
4088C661N64j185H42h01B00J731O51j026i38k498m70J640N91q3j184r42j62J538
4070b508J139L4d82A479K079J261p1r36j264j044j64O72K33o69D08M38J499N32
$$ y = [-486, -2311, -2869, 1380, 3763, 3464, 1751, 1518, 2868, 2426, 478, -859, 233, 574, -555, -1728, -1248, -1025, -1201, 2396, 5326, 5831, 3329, -237, -1035, 1646, 3269, 3063, 1830, 149, -999, -102, 1349, 1548, 390, -373, 407, 974, 96, -1296, -125, 1658, 2107, 666, -1457, -2428, -346, 3745, 8067, 10860, 11781, 11489, 10657, 10287, 9193, 6666, 2844, -1436, -2540, -20, 1682, 1804, 291, -3080, -3586, -641, 693, 892, 255, -196, 187, 883, 2098, 2537, 1228, -1437, -2071, 985, 3626, 3634, 1166, -1890, -2082, 550, 3308, 6157, 7207, 6522, 5117, 3951, 2731, 1537, 242, -82, -22, -471, -2188, -2807, -1923, -2114, -1828, 761, 1890, 939, -1776, -1858, 1396, 3661, 4225, 3040, 842, -801, 200, 1931, 2582, 1556, -938, -3436, -3906, -2266, -1675, -1758, -2942, -3884, -4046, -2508, -1369, -1335, -482, 1479, 3558, 4819, 4748, 3812, 2548, 1504, 1340, 2012, 2245, 1576, 408, 846, 2345, 2877]
4052B877q34b07m95A286J700J005k08r42p09n70j30l91f8m35A005K247J616J112
4034E980J65m97n30o83j155A347b278j042E50K602K43q25H51l41J054O65o49d65
4015c172o12a291A4f05k084k094a554C30L91e6r80p58L4K30o57q28R1J345b61
3995A34b87j816k224P78J761h04b29F41J833K077J555M0j896A647a095j749J45
3978b699a124H50J569Q82l48A096i11j191e57A628J706K26l55j13J164J055p67
3961D544A993a094j028i83c89G9R48P10J13H98c83q17p22J05o6k47o63p64R63
3942b594L82K75j0q04j057j634J633a402d4r0l35k76K61g5G5c32q09j778j408
3923d327J901f01g0m69n57l41l67M1j030a366e61B23J739J760K135M61j517B181
$$ y = [2877, 2043, -207, -702, 1286, 2986, 3991, 3783, 2841, 2132, 1562, 1432, 1041, -68, -503, 1005, 3252, 4868, 5980, 6145, 5648, 5118, 4435, 3280, 1347, -2278, -3320, 550, 3152, 3395, 2570, 851, 510, 1564, 2229, 1580, -465, -3172, -3784, -1291, 14, -605, -2689, -4783, -1554, 330, 721, -56, -1036, -1794, -1760, -1530, -2187, -3015, -2924, -1579, -261, 134, -287, -2103, -4327, -3549, -1788, -804, -229, 641, 2474, 4551, 6106, 6146, 4250, 1647, -1095, -2844, -2699, -1124, 850, 2419, 3301, 2953, 1096, -911, -2102, -557, 1628, 3334, 3560, 3205, 3092, 4256, 5311, 4544, 1993, -1094, -2122, -983, -389, 79, 1027, 1737, 1850, 898, -383, -1200, -1922, -1817, -1883, -2130, -2793, -3557, -2594, -2212, -1937, -1947, -2751, -3808, -5442, -3809, -1402, -44, -134, -469, -745, -484, -75, 75, -332, -1141, -2919, -4327, -2426, -601, -70, -539, -1096, -1437, -1804, -1763, -2793, -1366, -561, 223, 1962, 3722, 5857, 6318, 4801, 2181]
3904a88j162j435k481J421g91I53m43a854k954a443E55J51g28j964n61J053e38
3886A019K39B11b356M66A305K507J404K36j091j995E25i6I46J638J616J195K53
3869E648n82j016l75L54r3r03j438b0j295j120q27O64L46j4M5g62A125Q95m33
3850A587p57a59n60l90n56l0Q10A008J582R43J56n68m65N0O45J858J550Q70m53
3831G176j958B464hj091k25p00j206l70Q80M46n96N72Q33N52q71j587b79B378
3812D407J340Q5j251j160r64q84k22k48k2q3J10R3K72J40k89B27i89j707j120
3793c816J054R56L63l48k08R45C44K177K826J649Q77r45j786B063C50d84K00A005
3774C175J680N97k14n14o87j017j044H77b25o57l81o85q42r69l36Q99J375d13
$$ y = [-188, -1350, -2785, -5266, -3845, -791, 953, 510, -1854, -4808, -1443, 555, 706, -728, -2692, -3253, -2200, -538, 1019, 1258, 211, -2356, -1890, 1305, 3812, 5216, 5452, 4361, 2366, 525, -96, 946, 2584, 4200, 5395, 5648, 5066, 4050, 3675, 4029, 3936, 3033, 1595, -20, -1315, -2435, -3262, -2598, -2252, -2266, -2221, -762, 1125, 2020, 1587, 830, -159, -719, -1109, -1665, -1695, -885, 1008, 2590, 3533, 3689, 3121, 2656, 2706, 3351, 5209, 6759, 7629, 7176, 5218, 2464, -8, -1099, -1324, -2024, -3230, -3600, -2720, -2274, -2870, -2298, -1465, -913, -1784, -3371, -279, 2378, 4407, 5747, 5832, 4581, 3421, 2457, 1573, 1351, 1103, 1081, 998, 1108, 1201, 1473, 1613, 1324, 227, -989, -2696, -3816, -2762, -1806, -1443, -1791, -1999, -1054, 344, 2521, 5347, 6996, 7873, 6928, 5142, 2063, 350, -484, -284, 1005, 3175, 4855, 5452, 5238, 4724, 4037, 3020, 1976, 877, -225, -882, -1263, -1948, -2790, -3759, -4095, -3196, -1821, -413]
3755D80r1f62j551j503a806e37b27q70o39N99d17j35o08Q0a10A50J6c09r92r00
3735b201j485J207I13L149J962q1j566A717a003j580n36J73r4o00K38J640Q34
3718i28l28n98m06K75b38A757K074J272r7j481A478g82j882q87n73J611b53A896
3699C659P23O5p61q99o31k36m53o36C18d87n83l04A37K415K838K213J359k71j652
3680G039l253A14c439J078i4A303O96M7n46e09k107f52A954J457N48l70q98r15
3662A776n89n44E1a099j228m02L18M30N02K2l49o98q1J226E51J723J315P40j68
3643D161j013j108I09g1r70q86m7e66D72M66C14c46g3A272N21n08@a427o20R43
3623a104B30P28L78o22a154r48I50L334K615J573o07j631k498A233e83n82p5m84
$$ y = [480, 389, -662, -2213, -3716, -1806, -537, -227, -1097, -1736, -1137, -417, -552, -1160, -1080, -110, 150, 166, -309, -1301, -2201, -3686, -2479, 913, 4062, 6024, 5943, 4377, 1717, -1003, -2583, -3119, -2946, -3040, -3640, -3402, -1762, -928, -1256, -1854, -2260, -1985, -238, 1757, 3831, 5103, 5006, 3525, 1478, -782, -2664, -3551, -4124, -2513, -253, 1896, 3659, 4382, 4447, 3686, 2787, 2156, 1920, 1467, 831, 318, -487, -1070, -1374, 137, 2552, 5390, 7603, 8962, 8691, 7039, 3786, 114, -3439, -2361, -94, 1303, 1999, 2046, 1500, -509, -2616, -652, 1954, 3411, 3959, 3589, 2691, 1776, 1187, 643, 51, -1099, -2327, -2729, -2411, -1981, -1479, -1457, -1806, -2504, -2585, -1359, 551, 2274, 3589, 4329, 4161, 3148, 2040, 909, -71, -1041, -1927, -1974, -566, 472, 938, 314, -346, -73, 1272, 1793, 1285, 0, -1427, -2047, -1104, 230, 958, 1336, 714, -1154, -2102, 950, 4284, 6899, 8472, 7865, 6234, 3736, 1233, -583, -1165, -1240, -1724]
3605a724q27k83R71a91A745J582K59j12m27n28A159b55j090k45k69m79r98j034
3587d370J268a435j21j601j669m3Q45L81j60J39J073h91G25J305J170J012r8j287
3569B827I40b79R7D29K12a86j279j743O69c96A129R02O83K84o5j04L75P06Q34
3550D744m60j289G06h15F54J756J490Q96M1l63l63Mj59j31k70o33j127G44f81
3530b442j735J894C26J422L60m46F65i04j201M24g37c44D64L29j5k62b25q36j503
3511b564J252A225K825K219L62j524k449B22a439r01M79e59A430J889J382R47
3495E648M06j353j491j285K90J168J781J098N8j122j990j251M87J425P44k59q74
3478C480q47K64m35I80g84q37P03N0r50l23g39A174J739P81N9l18j607c08j499
$$ y = [-1724, -2551, -2834, -1863, -191, 1745, 3327, 3586, 3474, 3047, 2519, 1159, -255, -1345, -1590, -1859, -2338, -3336, -4370, -3102, -1435, -1556, -3157, -4826, -4869, -4024, -3643, -3803, -3664, -2591, -891, 725, 2030, 3200, 4212, 4114, 2827, 940, -279, -182, 429, 641, -186, -1465, -3208, -2539, -396, 1129, 2031, 2714, 2998, 2933, 2829, 3204, 3910, 4744, 4284, 2995, 706, -815, 654, 2410, 3900, 4796, 4837, 4474, 4111, 4115, 3956, 3825, 3555, 2922, 1795, 744, -681, -2442, -4177, -2283, 326, 1748, 2108, 1662, 665, -904, -2105, -1681, -737, -344, 464, 793, 778, 516, -225, -1061, -2564, -1312, 1225, 4050, 6269, 6631, 5107, 2658, 222, -1439, -2340, -1861, -559, 1430, 3319, 4701, 5648, 6054, 4701, 3210, 1925, 2215, 3383, 5164, 6262, 6320, 5198, 3208, 1957, 2444, 3869, 4613, 4354, 3480, 2633, 2897, 2462, 980, -784, -1621, -918, -868, -1818, -2141, -739, 1174, 2913, 3694, 3753, 3435, 1828, -308, -1807]
3459a807L64l64Q06l10o34j442K24R97K00l77j105l14R35J197j8j020o43M15O78
3440b218K09n42M20c85A254J162L28r24e75k318j475a640A382J797L43p15j209
3423A598E87d24j023j002j0j97k59K13O70J012l00p45j334o75J028R25K83k25
3405b063Q33E31J793J114K86j20q98j200H5a261m54Q4J64O3j38p27o28o4J318
3386a643E13J249L94p06E86b62p75q23j031o72J536f86C42M27B46f92j116l68
3368b176P84a89F13P01O37P18Q23N24l03j183A159H6g94q56l04O20A57J820J717
3349C694R51m98j716A24J44K771K396R67m62j887A707c63q40b84A190Q27l28D73
3330i76k81b47A390Q68J46r72C46a0k8l36j603k392J467C51K733J421M80m22j259
$$ y = [-1807, -1443, -1807, -1001, -1311, -1945, -3387, -3163, -2166, -1966, -2343, -3448, -3762, -2827, -1630, -1648, -2668, -3311, -2896, -2218, -2009, -2551, -2131, -385, 1254, 2416, 2744, 1820, -575, -2893, -4368, -1640, 1382, 3179, 3522, 2807, 1598, 587, -424, -1447, -2449, -2459, -2656, -2915, -2702, -2032, -1020, -1320, -2065, -3399, -4074, -3046, -2121, -1838, -2063, -1230, 531, 2324, 3438, 3724, 3604, 2706, 1506, 85, -1261, -1715, -1631, -1467, -1404, -1542, -2269, -2897, -2961, -1643, 513, 1762, 2156, 1450, 586, -262, -1037, -1860, -2891, -3563, -2027, -686, 342, 769, 246, -692, -1808, -2176, -1392, -189, 613, 1314, 1951, 2669, 3492, 4016, 3713, 2530, 1159, 86, -794, -1650, -1954, -1334, 157, 1977, 3694, 4645, 4147, 2431, 124, 268, 3039, 5435, 6402, 5940, 4053, 1707, -363, -1203, -284, 1190, 2017, 1689, 473, -976, -1257, -247, 1390, 2258, 2404, 1432, 346, -10, -38, -374, -1977, -4369, -2902, 351, 3084, 4505, 4985, 4563, 3304]
3311C304j507D69g78j036j069q55m01M69R25a264D3J237L95o10d09q90c12E15
3292D91e78j467j83i06C36N35N34Q40N46R32J166R64N50j66o93j213j518A221
3273h67j796j457L23J695h41b35C5J23J32P55O13N24L86P19K1l75q46I99b26j037
3253a263j024o73q2J19J113F3J685R11j77m05K84R32J002L34p29q91n83l7N06
3234B895K88o85A218e53j459j118k28J329g47A44J67K43k05A45a89k42k27k73
3216i31p34L43c56D70P95R29P70K49j51j64k28o6j16k18o50E28d18n2A30b5j068
3195a093j611j127J168a017D51P88r0m54a12m45j85O2j26m07r05j025K17J170
3177a756d47G99Q16N22j77o65D78b63k67Q1a15B12J57i66j788n62J256h34K38
$$ y = [3304, 1797, 469, -778, -1814, -2883, -3738, -4139, -3670, -2745, -1264, 43, 1280, 1675, 1065, -409, -1299, -312, 515, 491, -578, -2045, -2228, -906, 336, 871, 1405, 2245, 2791, 3723, 4889, 5853, 6403, 6237, 5544, 4331, 2813, 1221, -867, -2663, -4120, -3797, -2102, -841, -235, 35, 158, 290, 1045, 1658, 2182, 2568, 3287, 3308, 2933, 2087, 999, -226, -1263, -2287, -2960, -3042, -2923, -1810, 63, 1748, 2659, 2482, 2077, 2361, 3293, 4295, 4629, 3900, 3009, 2426, 2389, 2895, 3183, 2498, 1218, -553, -2012, -3130, -3358, -2029, -747, 144, 311, 554, 349, 145, -189, -431, -658, -931, -1665, -1322, -356, 470, 1265, 2194, 2964, 3213, 3062, 2898, 2670, 2604, 2488, 2270, 1620, 528, -418, -470, 130, -25, -1093, -2704, -3831, -2663, -1017, 451, 1239, 1149, 695, -112, -557, -742, -680, -806, -1213, -2118, -3143, -2926, -1756, -447, 799, 1615, 2137, 1960, 1295, 478, -263, -530, -449, -115, 212, 369, -966, -2754, -3316, -2060, -834, -596]
3158e96n95l42l85Q3P8L83M15L62a40p1j59l68q09r95m96l0K43j30O91e14A603
3136B786P9o56G58f41j559n77h30B78m2b14q89p78j052L74i23a3B8M13J368J195
3116C004J161R14N32N18r20k112A022i10j523j32N12Q14L63j64m38q56n84K60
3098b658Q87N77j49m25q35q31Q8J084Q77f66c16C1M90P97N78q88a031r98a37A751
3077B595k57H86a355k273a664I66J841O19p46H19a368k154j987P82J642J178M90
3060a417J15j52r9M27c04B10a1j258o98G4J354Q50j57j009Id19j20j70q8r7j12
3039a006J6j03L73c20n52j202n12c46A809J149j12j033m71M03O10P43l66r69F35
3019E21N65J062J03l28G06b59m87b47A255J025L72J3n68n55F19c21p96j033j267
$$ y = [-596, -1191, -1533, -1918, -1835, -1757, -1374, -959, -597, -140, -211, -370, -738, -1547, -2542, -3038, -3068, -2825, -2955, -2264, -514, 1603, 2786, 2865, 2209, 758, -641, -2200, -2777, -830, 278, 236, -214, -1103, -1881, -2933, -2559, -923, -13, 28, 441, 1809, 3004, 4165, 5079, 5611, 6129, 5209, 3097, 1022, -910, -2433, -2565, -2053, -1239, -876, -1040, -1478, -2334, -2918, -2658, -1771, -1194, -1343, -1768, -2603, -3434, -3346, -2262, -1385, -666, -316, 31, 521, 1318, 1896, 1008, -1031, -2029, -137, 1751, 2595, 2338, 886, -1355, -3628, -1664, 966, 2807, 3426, 2680, 819, -1368, -3522, -5509, -4727, -3085, -1907, -1417, -1302, -1454, -1553, -1126, -304, 210, -11, -1269, -1967, 74, 1428, 2278, 2121, 1112, 9, -419, -539, -709, -797, -894, -1006, -990, -1093, -720, -320, -872, -2074, -2586, -346, 1809, 2958, 2846, 1813, 1342, 1745, 2355, 3098, 2732, 1763, 635, 521, 1086, 2148, 2251, 1923, 706, -259, -746, -247, 1255, 2280, 2652, 2665, 2097, 1542, 619, -321, -1117, -2150, -3417]
3000c417l23M94R20J036b98C23l2c75j252j564j205J239J468O18k93j693j212
2983d269K050i39b66f6n59q47l82N34CJ790K224K408K223R68j280l026A617a684
2964d094j188k37J164K111HJ392M83k20o09m80e4m8p2l53m36r7d32H02J159Q12
2944B773L39J40l80j027D66a000j957j442O54K2l41l80R70J649a58A031Q88J21
2926B040k47m41k72a6q82k93L93d0A095Q03j02l65E74bl10a0E74K40k36B71b44
2904h10o20m58l41n90K30M74g84A150J800J662J426Q27k83j361k109j132r15D50
2885a49j07q99j620q6L94N61Q1N09K48k96k19L1L16e54F3J161J140J007N31J15
2865D017p9n26j195E17a344k116a483H91K327J028M5q28q71j192a22j315l00g76
$$ y = [-3417, -3740, -3246, -2326, -1290, -298, 323, 291, -375, -1627, -3191, -4396, -3157, -1689, -1071, -1364, -3057, -4269, -2219, -939, -266, -66, -625, -1472, -1854, -1320, 3, 1793, 4017, 6425, 8648, 9616, 8336, 5310, 1617, -1684, -4094, -5282, -5519, -4355, -2244, 8, 1400, 1883, 1663, 1054, 574, -54, -102, -174, -527, -963, -1060, -432, 802, 1961, 2773, 3112, 3252, 2872, 1845, 466, -1000, -2957, -4399, -3745, -3723, -4064, -4444, -3474, -1825, -158, 1031, 1919, 2040, 1793, 1352, 1080, -16, -898, -1191, -798, -40, 1095, 1898, 1796, 1431, 574, -2, -312, -10, 574, 814, 578, 271, -244, -810, -1430, -1888, -2229, -2819, -2589, -2115, -784, 1150, 2950, 4612, 6038, 6865, 6582, 5221, 3112, 1980, 1065, 450, -149, -256, -1155, -2775, -2861, -2467, -1906, -1825, -1316, -1068, -1364, -1583, -1552, -1236, -554, 63, 1224, 2364, 3371, 3902, 4017, 3938, 3412, 2217, 517, -1344, -3460, -1483, 891, 3218, 4246, 4291, 3463, 2592, 1400, -122, -1437, -1737, -776]
2846a52k8o51j340j496j513M66J194J653b37I82O97J07o48A51b82F47M98N16K26
2827A887n2k48k28k96j16J43L31K42n50a06j121r36l64m08j96O73i58H37J321
2808B158R54K36q22A029i13j898j203k26Q00N86j34l49k00M17N94j8L13M20L3
2789a778K91jN71A16J728P49j98q97A31h94l91M95D7L53lr8i9l92a01A566J721
2768C287M00q44F09b255m38d88A258N56p90h19j536q08L35P51M98L90P7m49p51
2749b312j495R63h75A477J541J410J240J242M66k2j214k014A830f28k365Q78d01
2731A503J714J264M67p6m85j470A056a180j778J61Q42Q58c35A58b54n66l51j93
2713a364L97d0I86N15j53B90a250j350l96k02j92L82R73i90c64J53j88k56P4K10
$$ y = [-152, -180, -831, -2171, -3667, -5180, -4714, -3520, -1867, -237, 982, 1679, 1786, 1138, 151, -282, 647, 1145, 1661, 1887, 1835, 1587, 1359, 1063, 947, 1090, 1421, 1663, 1113, -106, -1227, -2163, -2527, -2935, -3131, -2458, -958, 837, 2158, 3112, 3348, 2526, 1029, -913, -2811, -4014, -4240, -3440, -2854, -2988, -3337, -3537, -3120, -2526, -2544, -2231, -1811, -1778, -1487, -1488, -917, 116, 1844, 2593, 2395, 1498, 131, -894, -1285, -790, 47, 400, 397, 299, -99, -491, -101, 1566, 3287, 3687, 2843, 609, -2255, -2693, -488, 1258, 1814, 1024, -819, -2355, -3163, -2828, -2077, -1579, -1189, -1112, -1561, -2312, -3807, -2844, -875, 1477, 3018, 4428, 5668, 6910, 7376, 7354, 6140, 4126, 1830, -628, -2993, -2115, -401, 1503, 3217, 4481, 4948, 4872, 4387, 2917, 1056, -1180, -2958, -2797, -1955, -1097, -335, 158, -254, -820, -1171, -1364, -967, -40, 986, 1501, 1348, 290, -1250, -2600, -2996, -3198, -3390, -3008, -2035, -990, -364, -211, -399, -655, -581, -371]
2693c71k6k06l00n56j54M11c86G85Q99K19nK61O74L42k74r77D11a089j175j009
2673c273j298p77J504J234R61M06k27n51L68c63B91m3b70l53K31D69Q81M02n18
2654A234a36j973n38i32C34O02m9A21a109j680j347M18J126Q27J57m60j17R79
2636a206G25K156J849J307R5j436B020a020j235R57A75N70r8J96M68Q9F79h97
2617a793b75B621L139K226Q21o45k157B372f01j345h08D1J032O37J66J9K78K30
2599B403P64J055O89J66m42j101r22A238n61E4c44p44p74l59K57J14m06j16rQ36
2579a545c94F90J304J43m03l58l16l73j9R4j06A8g84q23n15M76D7J399N35n21
2559A460B65a633j233h84B187K608J924N07n42j745j915A312l22r6D12b52q98
$$ y = [-371, -397, -603, -903, -1459, -1613, -1202, -386, 785, 1684, 1903, 1898, 2159, 2833, 3175, 2901, 1924, 411, -1089, -2264, -3273, -4571, -5348, -3844, -2610, -1649, -1243, -1470, -2021, -1653, -363, 291, 248, -270, -623, -392, 469, 1350, 1752, 1234, -136, -2109, -2647, -932, 334, 936, 887, 121, -1109, -2789, -4136, -3718, -2592, -1765, -1608, -2068, -2185, -1206, 725, 2881, 4730, 6037, 6132, 4696, 2020, -1020, -2255, -1298, 175, 745, 647, 843, 1311, 1400, 679, -897, -1793, -275, 2621, 5760, 7986, 8807, 8162, 6005, 2372, -601, -1946, -808, 41, 1073, 1710, 1876, 1895, 2173, 2403, 3167, 4222, 4911, 5077, 4635, 3534, 2612, 1238, 677, 54, -344, -1088, -1862, -2221, -1964, -1850, -2256, -2372, -2381, -1545, -394, 690, 1994, 2137, 1734, 1376, 1060, 687, 668, 762, 656, 18, -784, -1607, -2122, -1646, 47, 1446, 1981, 1460, 265, -1633, -2866, -884, 2187, 4795, 6719, 7226, 6684, 4939, 3024, 1312, 990, 894, 412, -252, -1150]
2542a150o37m97k49m13J063Q86M04l67p57m13J43k34j543J874G88K018J538J482
2524E826R87L65j84j125j750j475o47l03o39A68a568j620R11R78O25K94D31L48
2506G79J51D00c02m88l25l57p30j062j052L86R58M42K63R7J004DJ364J407J360
2487D135K67p46j388C33a591j226j100p6L29M11L52J34r4q9O90h36I18Q05J65
2468A888o80a63j222J4b22A300J856K846K350R94j047k539B422b97D4J653P56
2451B453m92B90a593J19A191K284P29j48j373C86a561g26A885J829K54j210G23
2433i39c97H52J168M30m34I16a44p24n1L04A13R34P74L88l24G45f16j303r45J03
2413b761Q12i55b93Ga52n06o37J03e36I8N71J08K67Q72J433J322P54j18q5K28
$$ y = [-1150, -1787, -2284, -2533, -2946, -1883, -997, -593, -960, -1717, -2130, -1987, -2221, -3764, -1890, 788, 2806, 4344, 5826, 6813, 7178, 6994, 5869, 4119, 2644, 1997, 1694, 1055, 168, -1568, -3188, -2277, -1299, -674, -380, 431, 779, 930, 400, -302, -790, -1115, -1472, -2202, -3264, -4316, -3930, -2972, -2530, -2267, -2170, -1166, 4, 1368, 2775, 4135, 4402, 3656, 2268, 333, -1591, -2817, -3917, -3993, -3664, -3253, -2901, -2767, -2861, -2950, -2260, -836, 918, 1723, 1888, 1208, -163, -1385, -1371, -222, 1300, 3156, 6002, 8352, 9346, 8299, 5760, 2422, -297, 44, 1697, 2453, 1961, 290, -1593, -1474, 1191, 3475, 4204, 4056, 2683, 386, -1561, -726, 1885, 3714, 3968, 2758, 723, -939, -397, 852, 2020, 2450, 2016, 916, -144, -868, -919, -615, 113, 1047, 1821, 2209, 1885, 745, -616, -1919, -2864, -2761, -1949, -955, -293, 7, -152, -658, -1295, -1192, -536, 98, 669, 777, 1044, 1916, 3349, 4671, 5425, 5307, 5222, 5450]
2393E450Q97O98K47o41j638j971A363D54c0r7D80Q84J349J533J045M02m05o47
2375D641j043j065j054C76d78f6A512K211K079J924J018R8m59j233k574A760a393
2357d366a973H42R86k27D0a841i10A362J268N04p94D60a994r51a385f28l79j167
2339b174N88D28J939Q97p80E4c169k482K640a308e82K19A61J809J683J377J297
2322F327j17j402k052E09a768j906o90k73J036J734f51a81g0k36J28B38J352R02
2304B492n31B23a990j605J537a41A462J428J663J843J518Q21n56j506k518A423
2287a624l02H10J589N90l60p72n12j71K24J34F37d40l12A21J910J558K41k73p24
2268B833n80k42j57n0N8J77p93A4i05Q6M03b6B34E5a89B40J083P60p4k35n5j63
$$ y = [5450, 6347, 7045, 7292, 6651, 5013, 3042, 1363, 454, -30, -127, 480, 1364, 2713, 4246, 5291, 5693, 5288, 4641, 3598, 2533, 1479, 376, -478, -66, 1512, 3723, 5802, 7726, 8744, 8842, 8383, 7150, 4576, 1760, -1393, -4366, -1973, 842, 1828, 1601, 40, -1841, -910, 1362, 2630, 3134, 2340, 460, -1994, -2945, -1385, -628, -1007, -2174, -1586, 428, 2367, 3264, 2484, 54, -3169, -5651, -3011, -1308, -582, -363, 161, 1970, 3653, 5030, 6327, 6210, 4808, 2756, 509, -1768, -3674, -4364, -4637, -3601, -1867, -651, -181, -70, -306, -178, 238, 1590, 2492, 1961, 223, -1990, -3595, -2058, -141, 1462, 2890, 4553, 6396, 7914, 8735, 8179, 6673, 4155, 1423, -1624, -1926, 810, 2399, 2989, 2629, 1857, 1345, 1174, 1398, 1532, 637, -440, -752, 121, 2031, 3589, 3830, 3557, 2833, 2253, 2011, 1854, 1804, 1862, 2039, 1246, 14, -905, -819, -416, -26, 234, 55, -189, 240, 1323, 2083, 2009, 1774, 1719, 1556]
2246A556r9L46l50o40A71d43l26n53n08n21r6M52R14a60F4d69j170k75c35A320
2225B242J37n38r17h52j712p18M10J359a87D56Ba638k501a655A543K869J332l65
2207E379j527j485j026n48C02e21p42j61O50b71D8a2k95k23J14i0B22a55l9L6
2187a58OK3p4n32j0D38J832K574K569J788M41q29j536j651j298p84k47q06A204
2167g50k339o4i9B179J150K91l66q07q44F51j36K62k03a98j358j727J320H9J458
2148A547M48Lm10p72c10j055l43O71I7R78Q97M92j42I21a228j245k38O73i31M60
2128d71k79k90o26n55Q79E33K270J477Q71p27j851d19k331a06C654L422J534l22
2110H288j711l238C6b925a146d16o64j642J145A153K192J196o52j453a30l094
$$ y = [1556, 1457, 1803, 1453, 813, 171, -443, -769, -1322, -1830, -2351, -2447, -1995, -1081, -160, 64, -469, -1639, -1914, -335, 1320, 2242, 2379, 1841, 924, -852, -2564, -3282, -2872, -1513, -187, 456, 2, -1638, -4139, -1655, 1543, 4412, 5744, 5379, 3852, 2367, 1341, 793, 302, -521, -1263, -1424, -774, -271, 48, -12, -307, -530, -416, -90, 222, -155, -194, -158, -152, -129, -203, -735, -745, 438, 2270, 4844, 7413, 9201, 9642, 8813, 7277, 5626, 4328, 3544, 3297, 2491, 1204, -750, -3089, -3153, -99, 2179, 3329, 3620, 3254, 2447, 1603, 651, 515, 777, 574, -198, -1556, -3283, -1963, 89, 1547, 1995, 1998, 1588, 816, -310, -1365, -1708, -1037, 97, 1075, 1972, 2464, 2322, 921, -1228, -2473, -2711, -2038, -931, -471, -750, -1040, -1666, -2221, -1342, 533, 2803, 4280, 5151, 4424, 2573, -419, -2750, -106, 3654, 7076, 8610, 8288, 6577, 3339, 36, -2925, -1146, -416, -1080, -2722, -1577, 1153, 3345, 4541, 3889, 2436, -130, -3224]
2094c224a30C258J365J74r71j771C61d13k19l68n82j036q50k63n9n17l7J287J120
2075a937e47J97o24l65K18M74A28P67Q94P16pl86H62e66j056l93j87J83L23e89
2054A116J116N22o3q45E32e15m14j94j64r4o4J32e75C20J032O93K48k18n83m02
2034A090B18f05p13o3d59E14N90j22A35a678k036M93a466E45J478J213J089R08
2016E233n1j366j828b24j681k1h55a62j44p86o26l31j3P5O64e89A22N75k1F0f43
1994a328k06L26b15D95L76q2C02c99n98l48l96l42j08M31g40fC45a6n32m43m3
1973a034h6A636J292P99r46r34F53c93q47n36J0N64d41B5c24q32r64r55p22K26
1953c571j97p58n34O56J306J316d02B0b96o44p67p32N12R33a1C90M33L43M51M00
$$ y = [-3224, -130, 3258, 4623, 4797, 3826, 2055, 361, -413, -632, -1000, -1582, -2618, -3468, -3731, -3790, -4307, -4344, -3057, -1937, -547, -350, -974, -1339, -1121, -647, 128, 895, 1789, 2505, 2498, 2112, 862, -566, -1622, -2015, -2202, -2019, -1696, -589, 1116, 2232, 2754, 2691, 1846, 532, -515, -929, -1123, -1287, -1381, -1445, -1313, -575, 320, 1352, 2045, 2293, 2075, 1492, 1090, 218, -605, -1318, -1381, -459, 514, 1104, 982, 135, -1678, -3714, -3221, -1466, 545, 2023, 3236, 4325, 5233, 5182, 3816, 1988, -224, -1905, -1926, -855, -162, -306, -1092, -1718, -2049, -2062, -1987, -1323, -589, 122, 697, 676, 60, -643, -1328, -1534, -1208, -215, 495, 871, 789, 302, -399, -997, -1345, -1741, -2083, -2191, -1760, -740, -6, 345, -16, -548, -991, -1034, -86, 1636, 2928, 3727, 2781, 1847, 653, -393, -1240, -1776, -1766, -1202, -441, 25, -324, -1156, -2120, -3075, -3797, -3571, -3768, -4526, -5060, -4404, -3098, -1782, -402, 20, -296, -940, -1707, -2439, -1927, -994, -11, 390, 823, 1166, 1617, 2017]
1933B017k06j80k82K21N51J014P85k28m87j185C83h70q77j11o88m58Q20P06f64
1913C80Q30R39M10o78A13b055k402M55J124L67L02K93K41N57J16N8J33K13b26
1893d4A30j2E2J57n2M09K30j47c65j598m55e17A628J041n23B64b352j025d45A616
1872B645M1j077d64r34e22A514K290J551L78j228k000H23c09j237p60l90k71j60
1854c127j78mm65m82m30L00J129J488c03H33Q43K97J7n94C56f84j085m71M79h03
1833G11J131J6k35n76B31g27p82l87O25b47F08N84j0m25Gf44C45J562J616M40
1813C963m17j006q93l72J4k60k91J55N7j69F6a089j317p44M83J314A93Q76M98
1794A567l64b16j756J99c89A098J230O20J12L29M77L68N40K21n11p53j071j129
$$ y = [2017, 1811, 1631, 1349, 1570, 2121, 3135, 3920, 3692, 3205, 2020, 383, -870, -1747, -1858, -2546, -3004, -2184, -1478, -664, 380, 1210, 2149, 2559, 1881, 113, -2055, -4457, -4002, -2878, -2511, -2209, -1916, -1675, -1118, -1002, -944, -811, -598, -226, -44, 130, 118, 52, 209, 157, 566, 796, 649, -365, -1963, -2418, -517, 1628, 2669, 2146, 264, -2352, -3377, -445, 1616, 2645, 2686, 1609, -464, -1398, -522, 1514, 3804, 5355, 5733, 4505, 2505, 823, -309, -1546, -2306, -2696, -2967, -3127, -3305, -3309, -3774, -4256, -4686, -4386, -3257, -1769, -303, 833, 1676, 1973, 1990, 1396, 356, -684, -1769, -2240, -1761, -803, 711, 1842, 1858, 1623, 1047, 231, -727, -1509, -1896, -1271, -247, 608, 1192, 1182, 757, 7, -644, 345, 1907, 3523, 3963, 3546, 2540, 1647, 1275, 1289, 1029, 738, 893, 950, 781, 66, -1089, -2406, -3150, -2667, -1353, 193, 1069, 1567, 1203, -216, -1972, -1773, -389, 1098, 2328, 2948, 3060, 3389, 3866, 4234, 4774, 4995, 4484, 3731, 2660, 1531]
1776A531E39b02m19j96L9a11G49Q48M53P63P58J99m3m77p35m70j50L44O31Q30
1756C700J401J072M39m51j694B215B5a921O89G45J419J4q49H8a087j453q05m82
1738c827p44R0b046g07A69J77I4g21k73L4j13n40q60r88p0a638E22K312K120J389
1718F343J08r64k347D35a570g63A491J810J036L96k48j2N24m35k144i17k329a075
1699B975L046J446k07q91j815j916F28a558J6B70R09q1B19g79m29m76m59n96l17
1680c056R76i10A29O88M30p6j79D20e68r03l03N41M51L1J4j34j41l02o01q19J04
1659b630J275@A267K86k35a2j416o19J11L49N05N01FN72K97M99J82j94D95h53
1638b212n24Q62O49p0l90j74j47K42J48P2J53M22L93l0J3b02B14R86R50R10K06
$$ y = [1531, 539, -202, -621, -817, -778, -111, 749, 1597, 2050, 2813, 3571, 3770, 3727, 3250, 2515, 2045, 1895, 2239, 2870, 3700, 5101, 6173, 6612, 6161, 4467, 2215, 25, -1921, -1232, 745, 2164, 2178, 1329, 88, -1087, -2540, -3345, -3827, -4571, -4481, -2046, -707, 169, 346, 94, -721, -994, -960, -1073, -1613, -2473, -3461, -3531, -1638, 522, 2834, 4954, 6343, 6451, 5487, 3140, 435, -1570, -763, 1491, 3301, 4337, 4733, 4485, 4473, 4997, 4562, 2418, -917, -3246, -1075, 2975, 6021, 7467, 7260, 6369, 4554, 2638, 628, -1558, -1542, 270, 1179, 1098, 219, -779, -1208, -1684, -2143, -2739, -3056, -2080, -910, 129, 817, 1247, 1171, 992, 420, -568, -1471, -1774, -1233, -782, -751, -737, -871, -1012, -1314, -1915, -2734, -2630, -1355, 0, 1267, 1553, 1318, -12, -1428, -2047, -1936, -1587, -1082, -581, 6, 578, 875, 1374, 1556, 1362, 495, -853, -2212, -2736, -1874, -1225, -1295, -1685, -1859, -2006, -1764, -1616, -1544, -1391, -969, -576, -606, -593, -202, 214, 1200, 2150, 3060, 3266]
1617C266R84N92R51J051M53k75j074j669j941G82b27k25K02k71o76p16l99l08
1599b620J76J58J58J01L50P32f7A061J127J080J101J042O46m71j140j309j359
1582A778G10d76o30K43c97C91Q75M63P12n4m26q68C47d3l6E80R78M98n40D86h67
1560b424j011N83i76C12J290N65K88k73n49q04a52r68k80a08B069K000J073j90
1542D952p57j731C43a438j05g47K62p14j961j737J100a520c89A44N07J559J841
1525D051J478K23j161k050D16a077o01K21M52C28J889K755K164J523J67o02j766
1508F458k836A267e54j122K15f27H34R21M77O63j58j128C04h0K7Hf66j694k605
1489d965K15J761J314M08o58n57Q20Q01c27p06j935a091A510K311J864N51j008
$$ y = [3266, 4250, 4842, 5793, 6844, 7297, 7022, 5948, 4279, 2338, 782, -227, -452, -250, -521, -1197, -1913, -2312, -2620, -2444, -2286, -2128, -2027, -1677, -945, -67, 1061, 2188, 3268, 4369, 5411, 6057, 5586, 4446, 3137, 1778, 710, -476, -1106, -863, -397, 391, 1266, 1729, 2441, 2387, 1961, 1093, 347, -43, -79, 580, 1558, 2056, 1516, 486, -867, -2424, -3435, -2852, -976, 312, 1602, 2167, 2455, 2182, 1633, 829, -152, -1120, -1400, -108, 2069, 4069, 5142, 4952, 4195, 2464, 343, -1438, -1543, -747, -485, -1199, -3160, -4897, -3797, -1520, -389, 144, 651, 2210, 4051, 5529, 5752, 4591, 2541, 416, -1077, -1678, -1457, -1005, 328, 2217, 4972, 7136, 8659, 8826, 8224, 6458, 3622, 1267, -554, -1676, -1461, -627, 834, 1755, 2232, 2895, 2737, 1609, 304, -80, -53, 8, -666, -2360, -4965, -4750, -2989, -1675, -1267, -1925, -2482, -1662, -861, -327, -1033, -2968, -1091, 1510, 3821, 5685, 6236, 5228]
1472E228j423j583A099l8M75R9o29b13j108p53j73K13Q3J60e19I12J247R01L00
1453C360k71n85G23a489k222r25J252a393b54N0p70j225j703j258K010J560P38
1436h52J43o72j282o75a286F92N95l02A7h59j097o36q10m31l45k62J44M20M45
1417c431O63M52N50O43M67a87L5D32L42B25h49j126n29k54O90Q00J28n38j075
1398b753o65j196n63Q95J980a049hB82Lc76j128j033J61J093J91l37n63j7h97
1378B11H0e49j393q36m22a410f93j2n78m01j54N21e83F78J390J096O25r4k43m67
1358B985o40p17L05R55N65P11K3o56j446a90k391j570P84J261J035l76m87j072
1340c006O72a056B3K47G0d76o58m33k82j55m47q45q7J424c72I77J008M41j90q04
$$ y = [5228, 3805, 2222, 1099, 1061, 1536, 1635, 1006, -213, -1321, -2074, -2247, -2034, -1951, -1791, -519, 912, 2159, 3060, 3360, 3089, 2504, 723, -1489, -3711, -4636, -3384, -1393, -254, -204, -974, -2199, -3902, -5160, -3150, -1590, -852, -709, -1381, -2663, -3338, -1286, 692, 1287, 985, 17, -859, -1956, -2592, -3402, -3833, -4178, -4440, -4296, -3876, -3431, -2768, -2316, -1766, -1123, -656, -187, -152, 432, 774, 225, -849, -1975, -2504, -2758, -2068, -1268, -1140, -1678, -2753, -3418, -4614, -5177, -4282, -2302, -1049, -8, 282, 285, -376, -1504, -2537, -2376, -1283, -1092, -1429, -1992, -2009, -897, 211, 80, -549, -1942, -2778, -3200, -1410, -693, -705, -1283, -1684, -1838, -1317, -583, 678, 2068, 3164, 3789, 3695, 3452, 2985, 2345, 1628, 1933, 2888, 3453, 4164, 4187, 3531, 2085, -190, -2581, -4151, -3367, -2106, -1071, -1447, -1934, -3006, -2334, -1056, 23, 270, 70, -476, -1134, -1567, -1849, -2004, -2451, -3296, -3383, -1959, -372, 977, 1985, 2426, 2236, 1432]
1320A432F00b85j001n27Q43I66K355J957Q27o01j302A832a67k33B93d6j500j945
1302c491r82O04R52L10J186H4K035R74j22j479f19K78C382L778K817J397J33j271
1284A0236j521j123j47Q28J551J528K02j413k711l468H39a587o59j00jL19N51
1267a477c31A228J786R21J06r27H64a669j31F43K416J090j69r26r46A053d05j369
1249a774p57P67d63I1a53n48E0K072K064J054n81j589A448B60a20k88k03l29c92
1229G10J379Q79k82A294f85j488r1e95A714J831P23k83j389G29h94n86c57A059
1210A480l97C80D7O5O59J028R18O39M60J21k95n57n61n11l20k34n11f34k935K55
1190c314a458I17K167J220O61l64j390A398i18j943r86O0O50P28L98M06g84D95
$$ y = [1432, 600, -285, -1286, -1813, -970, 966, 3321, 5278, 6105, 5504, 4202, 1832, -167, -400, 293, -46, -1546, -3491, -4473, -3869, -2917, -2607, -1421, 84, 2119, 3093, 2971, 1492, -619, -341, 3382, 7160, 9977, 11374, 11507, 10236, 8715, 7592, 7445, 8273, 9824, 11352, 11554, 10141, 7430, 3962, 839, -1587, -2246, -2346, -2347, -2028, -1477, -331, 1228, 3014, 3935, 4041, 3114, 864, -1669, -1800, 643, 3059, 4149, 3980, 3054, 2108, 1053, -405, -1774, -2531, -1764, -463, 91, -153, -701, 50, 2122, 4186, 5240, 4659, 3070, 1448, 260, -120, -408, -611, -940, -392, 710, 2089, 2968, 2686, 1294, -685, -2173, -2264, -595, 1714, 3545, 4268, 3985, 2596, 729, -894, -1480, -357, 1059, 1480, 1083, 380, 47, 112, 771, 1799, 2717, 3356, 3816, 3937, 3642, 3085, 2524, 2013, 1693, 1459, 948, -634, -3569, -3314, -1458, 917, 3084, 4304, 4965, 4601, 3211, 1398, -918, -2861, -3847, -3787, -3137, -2409, -2011, -1605, -784, 495]
1171B066J291P58j81j570A76h55F55J101q7oo66K35J518J624J367K63j272A874
1152a709k285h52A849J978J244j019j712c17k551j282J199K34m30p40k44Q18Q70
1135b443M24Q7K99e82G18J094O64N7j09p60D32g20m39r06o31o11m30l47k13Q2
1115d215O24M00R09h80F30J731J173O73k3j144j481F30Q6P13J212J192J024Q57
1097E714R29j81p30q48r9P5o15k067d80l238q5a87B228J167J74n02r55j035D14
1077a2o51m47o66n53n42m42P4R03J166c01C94P28L98L9N3k8j56K74mm55n04i5
1054g58r68j017r77q75M3L88K38K9J82L47P39a215B85R62L62N9J11j09k43F86
1033e59j382n53P45g60A2L79K3p2K85J99l30c22q83o48k36M3K4J17l3L77N98L23
$$ y = [2066, 3357, 4115, 3934, 2364, 176, -855, 655, 1756, 1669, 1663, 997, 1232, 2750, 4374, 5741, 6004, 4732, 1874, -1709, -3994, -852, 1849, 3827, 5071, 4052, 2340, -317, -2868, -4150, -2951, -2717, -3147, -3887, -4131, -3313, -2443, -2019, -1932, -1633, -582, 718, 1812, 2476, 2533, 2424, 1664, 432, -720, -1159, -2065, -2696, -3307, -3737, -4084, -4297, -4215, -3591, -3191, -2282, -880, 630, 2361, 3534, 4207, 4184, 3040, 1559, 630, 716, 1429, 2641, 3833, 4857, 5714, 6643, 6462, 5732, 4884, 4785, 4860, 4245, 2178, -480, -3718, -3803, -187, 2228, 3395, 3569, 3067, 2112, 1077, 414, -12, -663, -1110, -1776, -2329, -2871, -3313, -3239, -2336, -1170, -301, 394, 1122, 1520, 1559, 1612, 1584, 1428, 1702, 1698, 1243, 739, -95, -758, -1726, -2743, -3720, -4595, -4552, -4164, -3926, -3897, -3715, -3368, -2629, -1215, 285, 1247, 1609, 1668, 1779, 1670, 1427, 686, -559, -1941, -2494, -1749, -760, 12, 391, 414, 342, 627, 826, 496, -322, -1205, -1853, -2089, -2046, -2022, -1905, -1938, -1561, -963, -640]
1011f40K11g5F73M63L73L33K7j98l47D61a098j393j106p46j45m08L02J338J588
992a668g09L30j27l69j264L56f01B17a99j221j167o07j76L96Q86h04D01P84p5
973A110m87f5j061j356n01P38O55e16F4J07b02o64k71M61C19O65n5A60a512j294
953b806k05J112h69m19p4J38f07h5j12o92p26r50q59j095p83J091N39R83N95M61
933a633O65M07b63Ed45k82R6b5B75M96J12k26A59c53n59p3M38B81J194P28L55
912B558K58k81I96h81j579K6a186A6O42A16e34r00q03q79p89J487g9A400N98r67
892A031a050k900h25B605J850q8j509A48a877f05A959J818K26r47I79a076r75
875b051i02E28M77J52l34C37N35N37M40K35I82g48j975p15N54o24l54J646c80
$$ y = [-640, -429, -75, 673, 1136, 1509, 1842, 1869, 1671, 1324, 461, -1098, -2491, -3597, -4343, -4488, -4896, -4594, -3256, -1668, -709, -379, -506, -875, -2139, -1783, -601, 217, -199, -1420, -2587, -3194, -3370, -2974, -2088, -804, 401, 1185, 1110, 623, -65, -1126, -2482, -2983, -2245, -1590, -516, 64, 171, -202, -866, -1137, -676, 319, 984, 929, 160, -1512, -2806, -3011, -1899, -869, -1288, -1362, -1224, -607, -85, -197, -889, -1615, -2565, -3424, -4519, -5302, -4211, -3672, -2689, -2094, -1633, -968, -561, -263, 5, -445, -727, -631, -25, 275, 771, 883, 657, 159, -353, -912, -985, -547, 281, 1475, 2203, 2558, 2816, 2535, 996, -881, -2460, -2434, -1186, 16, 658, 116, -534, -1434, -2237, -3116, -3905, -2418, -79, 1400, 1998, 1031, -1050, -3950, -825, 2605, 4455, 4367, 2858, 148, -1877, -605, 1959, 3777, 4003, 3056, 979, -1076, -2051, -902, 528, 1005, 1157, 823, 337, 872, 1409, 1849, 2084, 982, -748, -2723, -3438, -2884, -3508, -3862, -2216, -380]
855H38J37m00hn65m56q1J46d46B37M36K31j60c04j620j384Q73a138e23k95r92
835a810j50Q74h7E07B6g43j050q10L81O31L09K97L07J98i8B94A31i74j938J017
815a895F48K271J609M26k64q93j405H67e68j399p75K87g65A168R63Q53J46m11
797B719p86q56a02r58j358c96A641K122J659J798L21l97j141j416j939C23b406
779d793b199B70J423N78n39m44j65j94l07k91A00J12O5n1a67r44j548j433n98
760d690M65P27O02Q93d36A458R61N75n36p12D63a360j298M85e54G82N25m94GK52
740B59J032J173O65J25p25F88a914p38d13A334M80p54g72j990k50a376A92Q44
722A036M14j33D61h06o36g11B34P65M85L64j10G45i60j049A61K415K440J731K14
$$ y = [838, 975, 575, -8, -573, -1029, -1110, -964, -446, 237, 673, 904, 744, -304, -1924, -3308, -2435, -1138, -523, -818, -1810, -1960, -1086, -87, 507, 26, -743, -1793, -2603, -2222, -1591, -1282, -985, -678, -480, -98, 294, 131, -974, -2912, -1895, 648, 2919, 4528, 4954, 4690, 3797, 2392, 867, -568, -1967, -2742, -2455, -765, 1168, 2131, 2984, 3130, 2719, 1933, 1077, -102, -1060, -2418, -396, 1641, 3763, 5422, 7220, 7541, 7144, 6003, 4587, 2648, 323, -2406, -4793, -2199, 270, 1693, 2271, 1732, 1288, 1123, 929, 622, 331, 100, 212, 277, 226, -167, -1111, -2659, -4092, -4690, -4225, -3498, -2896, -2003, -436, 1458, 2419, 2994, 2458, 1746, 463, -1360, -2658, -2173, -554, 782, 1307, 813, 7, 259, 1291, 2464, 3129, 3254, 2529, 688, -1914, -2652, -413, 1334, 1814, 1060, -772, -2762, -3012, -1376, 192, 1036, 1450, 1317, 461, -806, -1442, -711, 234, 999, 1484, 1848, 1738, 745, -960, -2009, 161, 2576, 5016, 6747, 6961]
703F961j636j829j047j192k69L60J01l51D39e53j201p63p15m20q2J026a328d44
684a41A20K09L32L53J44p8c27j688d89B359K560J497oj339B080a853J52B181K195
665D376L07j019p19j94M64K42n5k5K10K61p0n77o25r48k67k70l96l18A18L2g87
643b980j113a716E05J225k88a66j872j423J600A80O54Qk32K9d9p49K3A260J176
624B436L58j52p98p47A51a143j446l07N11J029K97O2l33n12k89j85J11M67M31
605a307N96b88cn5m96q6J71a70A67J29j04a25n14n11n79p26p11p66m22P47J341
584b266b14A626R79J71p25r02N05K782L322K231O30p00j653k518B869a27k322
567b449P63i1H61l61i93k229O80d36A357J147P69k4m71r19G65c12p48r7a7A478
$$ y = [6961, 5325, 3496, 2449, 1257, 988, 1348, 1449, 1098, 439, -553, -1754, -2517, -3232, -3652, -3734, -2708, -1328, -444, -141, 120, 329, 661, 1014, 1158, 1080, -327, -2015, -489, 2359, 4919, 6416, 6410, 5071, 2080, -1853, -1701, 2181, 4376, 4683, 3664, 2945, 2751, 3215, 3457, 3402, 3377, 3587, 3848, 3778, 3201, 2576, 1628, 1361, 1091, 695, 377, 118, 150, -787, -2980, -4093, -1716, 505, 1730, 1442, -166, -2038, -3461, -1861, 180, 834, 842, 610, 639, -49, -798, -775, 1260, 2436, 2794, 2642, 1844, 1097, 151, -1143, -2589, -2896, -2385, -1356, -1059, -997, -1330, -1842, -2131, -2316, -2205, -1738, -1307, -711, -288, -3, -58, -554, -640, -469, -170, 167, 296, 192, -125, -639, -1150, -1729, -2455, -3166, -3932, -4354, -3607, -2266, -214, 1626, 2605, 2776, 2051, 1149, 1654, 4436, 7758, 9989, 10619, 9919, 8266, 5748, 2869, -127, -2449, -1686, -91, 861, 500, -993, -3222, -2542, -436, 1357, 2504, 3273, 3249, 2778, 1859, 765, -312, -1060, -1157, -17, 1478]
546B579J73o45r68a4j117r98k13J025D21K374K487J801Q33l80j703k821f8l221
528c289k8i13A066J209P97O62L07j93n53l51k14R4K63L87M59K37k03o92q75I31
507a221k274r10R60O31N24P91b0A867J613J025j91j095A332a47D76J280O51k49
489B158r11e47j633r24O7N83L40K08j41n04r37o43O54J396R35K80m13l69N05c76
468a06o62r96l67e28A252J784J391R03L83M59P34N92m70j489k350H87c95j00D4
448I05P79N42L19l09l94k48Q9j6m43C28a316p83f69A240J653J117R9j154I73a023
427a877N50d59e6o05j727k177J233i24A075J195N28m54q37n51L96J219J282O28
409D481j96j331H60a526j610p46l81M53o5L56J93lP2O1j00J61O49L68K81J90L38
$$ y = [2579, 2752, 2107, 1139, -14, -1131, -2129, -2342, -1317, 421, 2795, 5282, 7083, 7916, 7536, 5833, 3012, -68, -3289, -3317, -913, 1066, 2275, 3072, 3734, 4041, 3848, 3295, 2944, 2730, 2824, 3087, 3474, 3933, 4170, 3967, 3275, 2400, 931, -1221, -3495, -4405, -3445, -2814, -2290, -1499, -20, 1867, 3480, 4505, 4314, 3219, 1332, -147, 476, 1756, 2407, 2158, 1247, -547, -2180, -3104, -3037, -2454, -2114, -1906, -2047, -2551, -3488, -4131, -3477, -2081, -1146, -866, -1279, -1648, -1143, -376, -106, -768, -1764, -2131, -528, 1252, 3036, 4427, 5330, 5713, 6172, 6906, 7498, 7028, 5539, 3189, 887, -395, -495, 44, 905, 1684, 2226, 2545, 2236, 1842, 1594, 1683, 1667, 1224, 328, -1316, -2099, -669, 1240, 2893, 4010, 4109, 2955, 973, -1023, -1877, -1327, -459, -56, -661, -2388, -4565, -3332, -924, 1075, 2270, 2798, 2344, 1507, 956, 1352, 2571, 3853, 4481, 4285, 2954, 860, -1526, -3136, -3882, -4263, -3810, -3875, -3519, -3326, -3329, -3257, -3196, -3296, -3135, -2486, -2118, -1837, -1647, -1309]
388a309O03A67J071L89n94A03g29b83A280J727J313L07o32j639I85e3j976o06
370b635N29R44k28k85p53p00K99J235P88L25O5o25l17d39I63M93k05C89g78j481
350b259j553j12R12P02J36k51l95J17J111B16J909Q50Q0n68k25M58O43O95p1j533
330B454B56a898j096R3O5k71P96g97C85O07p2A34e75K76I58P55O16J52K3J29O23
309C256N73Q02N89M37N46R1o7J4l81l92j552j862a82j893p6Q01b76A250J266P03
289C219K01K39j39J59N70O52Q45P79M28j81r84j603j998C73i48j026n90J4R1J38
269b321j32j367j373J398a159A877J932J689J81j436j951g3k265n49J140e54A04
251e75r44K46C12J709J242M59k33l55l89q8m59q12o82j75N6O3j52b96j180j460
$$ y = [-1309, -706, 167, 1238, 1627, 1033, 103, -729, -283, 1280, 3007, 4320, 4627, 3995, 2356, 985, -53, -2029, -2635, -2106, -1162, -1390, -1675, -2428, -3128, -2829, -1594, -806, -481, -416, -1041, -1358, -439, 963, 1456, 1251, 389, -778, -2259, -3812, -3924, -3012, -2310, -2174, -2425, -2820, -2703, -1592, 216, 2125, 2975, 3055, 2487, 2262, 2720, 3363, 4058, 3987, 2454, 256, -1898, -2994, -2901, -2836, -3107, -2311, -797, 385, 992, 920, 134, -575, -299, 958, 1713, 2329, 2481, 2504, 2633, 3256, 3829, 4631, 5220, 5657, 6203, 6294, 6227, 6241, 5860, 5468, 3916, 2054, -182, -2075, -2151, -1350, -276, 1250, 2516, 3219, 3420, 3659, 3520, 3679, 4249, 4901, 5746, 6525, 6953, 6772, 5788, 4185, 2187, 373, -948, -1974, -2564, -2550, -2459, -2321, -2453, -3820, -5193, -3795, -1159, 1877, 3809, 5498, 5679, 4243, 2292, -73, -2338, -2887, -1747, -554, 104, -575, -1519, -1273, 312, 2021, 3263, 3722, 3489, 3134, 2745, 2657, 2198, 1386, 704, 529, 585, 648, 496, -296, -1476, -2936]
231b936m68L18k00J0J97K57J118c4B234K480K206J618n1j117k750A458D8J497
213A545J796P81J30k21q9j09n41j205D95i83j371j449o29J865d52H03K51D8a313
193C89K033J279k02j006H83a005j063M42c97H97J048N50J1p07C32f71o44M38D28
173B136J010Jj277d30j711B180M549K837P74q43j551j710j343m49L63L94M40j
155E640o45j089j131o76o47E31i41m98c88A677J555j25A139a751c63A999J107
138C106n50H62h36o97l17r94j483J570J327l47j329L56A87K458J128P59L85m0
120D877l66j070A445a271r33d94H19J89k49Hb38B78Q26J114J213M95k46q89j25
101B666Q97Q02m63j161A284H3e35p9a84H00J268Q64K85n2j012C3b079p07a46A315
$$ y = [-2936, -3404, -3086, -3286, -3276, -3079, -2822, -1704, -34, 2234, 4714, 6920, 8538, 8487, 7370, 4620, 1458, 48, 1545, 3341, 4122, 4252, 4031, 3942, 3833, 3292, 2087, 495, -983, -2354, -3803, -4432, -2567, -452, 803, 1054, 48, -1313, 389, 2422, 3701, 3499, 2493, 883, -1005, -2068, -1626, -397, 897, 1945, 2495, 2506, 1799, 332, -671, -1315, -877, 428, 2136, 3146, 3147, 1870, -430, -2141, 2180, 6729, 9566, 10340, 9497, 7946, 6236, 4893, 4444, 4807, 5201, 5641, 5640, 4995, 3906, 2775, 2099, 1452, 531, -941, -1439, -388, 1677, 3232, 3107, 1139, -1751, -363, 1999, 3106, 2556, 862, -836, -1533, -1850, -2844, -4327, -2757, -1430, -1777, -3106, -2750, 187, 2645, 3773, 4532, 4917, 4877, 4511, 3441, 1445, -1271, -2204, -494, 819, 1008, 759, 8, -238, 278, 1104, 2218, 3431, 3926, 3680, 2791, 2666, 3563, 4365, 3902, 2741, 1284, 83, -535, -614, -184, 800, 2068, 2932, 3217, 3165, 2153, 33, -2079, -2786, -146, 1315]
80A526l53j29K11N41J80q4H43e19k79A63K52A17d85K0a28k40o00l59d96F84P95
59A479Q8G83b15j058l2IJ201K40m01A12c21F13J018L52l74E62f77K10A08N0b12
37h44o02l90p12L31Q94b93B30J74L35K40R2l0l08l40a86j036q35h34A163R56p95
16A324i11j356a053E3a64j024j712J069B03J023j51A61f08j16B6L85
$$ y = [1526, 1173, 1044, 1255, 1796, 1976, 1892, 843, -519, -798, 163, 415, 117, -485, -465, -128, -368, -968, -1327, -496, 684, 1479, 1567, 783, -215, -1273, -1305, 9, 1210, 1450, 1049, 112, -321, 613, 1631, 1983, 1609, 562, -677, -467, 108, 158, -212, -844, -1446, -1836, -2548, -2217, -1323, -293, 230, 404, 739, 979, 1071, 1041, 733, 393, -186, -1222, -2057, -834, 1163, 2119, 1324, -911, -2267, -1053, 53, -164, -1188, -2900, -1831, 203, 1226, 1075, 161, -608, -724, 26, 411]
0D11
##PAGE= F1=-0.101556585365
##FIRST=     25.9928259484165, 8223.18227667557, -514
##DATA TABLE= (F2++(Y..Y)), PROFILE
16383e14j264k90d63A241N31o22a40o79L52J30q84n57h08C83J860J580J311j05
16365E029j153j282l19M49K92l41r03E16a420j466J277f90k38j294j358a670d2
16347G18B60a501q01D7K414Q20r24b96k958e29A679K003K41o43p03J15P23j60
16329C255A587g23j775J169a91k7k38p72L3j416m81a091E77M92B63a480j777N54
16311b703R50l95j191M92b48B719K894J110n45k055A106b195l66M27R24C27J757
16294B084J371N64l93j045I97f53j151k50j7L32g44C18P62K36E49e94o24G35J675
16275B410Q2r68d77k088p84N81k50p67R9J91J41K20k91n8N70L66O73N45M51J98
16255f80l16m97j188j092J49J315j45m78p20K04M54j10N31E42L721K818J288p17
$$ y = [-514, -1778, -2068, -463, 1241, 1772, 1150, -140, -819, -467, -337, -1221, -1778, -808, 383, 2243, 3823, 5134, 5029, 3876, 2594, 2275, 2724, 3016, 2675, 1772, 516, -1420, -2886, -1609, -690, -928, -2222, -3580, -1670, -42, 718, 260, -1501, -2302, 47, 2461, 3281, 2357, -296, -3254, -529, 1679, 3682, 3923, 3280, 2577, 2692, 3415, 3255, 1587, -723, -2498, -1329, -191, -218, -456, -1228, -1195, -2611, -3092, -1091, 577, 1069, 263, -1480, -3257, -2703, -1753, -2148, -3339, -2847, -248, 2719, 5613, 6723, 6178, 4123, 1106, -2195, -2561, -2134, -1210, 327, 2084, 3455, 4019, 3626, 2581, 997, -653, -1804, -2054, -2071, -1739, -744, 318, 1080, 1316, 549, -594, -1218, 735, 2410, 2492, 1524, -477, -2565, -3349, -2768, -3018, -3785, -3686, -3495, -3354, -3134, -3425, -3483, -2913, -2547, -1874, -1329, -878, -680, -996, -1493, -2681, -3773, -3624, -2309, -2454, -2932, -3652, -3448, -2994, -3104, -2573, 542, 4263, 7081, 8369, 7652]
16237G652j754B931D0h85A68O95D12a061k381k3h12C074L520K305L13j412k009
16220E791j859j861c09k030j075J365a69H45p1a010k608j473K229i3A827J190
16204C017J80qK83K25l54m78L12J007K90j096j575d96j946R84A077K508J433K8
16186E046j362j791I37J15P66N56j77j073e97j443L41A2O10j32b42j078p03N84
16168a439a44A269J186M89L0m91r71C01d79n26j027n13K85R28c30A11K12d89q42
16149a331m64j91R76G78J699J390L42o71j392j78J375K159J995N61o78j786k329
16132C265A140a163j889O52A70J190K59n73j54J43O94N51L71l96j058c12j659
16115a971j164o09o99n87N57O39J95j50J75M25R32h77C48M33j87j55A68a25l97
$$ y = [7652, 5898, 2931, 40, -885, 168, 863, 412, -1061, -3442, -3465, -812, 3074, 6594, 8899, 9212, 7800, 5791, 3932, 2071, -309, -2339, -3414, -2049, -169, 845, 774, -1010, -3618, -5091, -2862, -93, 1827, 3017, 3197, 3189, 3472, 3697, 3343, 2865, 3177, 4184, 4474, 3378, 1803, -496, -2442, -1458, 1077, 3585, 5018, 5046, 3684, 1893, 937, 1052, 1818, 2374, 2197, 1124, -597, -2040, -1699, 12, 622, 490, -242, -1320, -2023, -1439, -144, 1269, 2455, 2944, 2974, 2483, 1512, 301, -479, -1005, -2032, -2545, -2260, -1332, -330, 111, 323, -489, -1331, -1795, -1986, -1010, 778, 2477, 3867, 4209, 3538, 2146, 1968, 3343, 5502, 7497, 8058, 7380, 5594, 3265, 1140, -1163, -3052, -2400, 170, 1360, 1619, 1046, 892, 1035, 1729, 2280, 2651, 2255, 1197, -312, -1971, -3135, -3744, -4443, -5030, -4473, -3834, -3639, -3789, -3614, -3189, -2257, -877, 348, 781, 594, 439, 168, -125, -522]
16096e22j017j495r67N67J056P17j36m31L23O90m2k72o82q40n57J00k7M9N32J159
16076a795d54A002J324O00o41G83a015k047P6a060a66f6q78k158j712K280c77
16058F79gj609m78g84d4p22j696j930j379J015O42P86R66i14B29K02e12j438n49
16039b499N88f12F55J071Q32J34p68E71a540j649K7J024J90kl41k69j8J30l87
16020b835n29O94J274D13J898J588P76l74j731C7b764n43c26A737R02m6q60D51
16001h31k87K33K2n78n25L4P25a22D78m5j53L1L80J138J606J227J62p22j312A154
15980e12j242n43N45C1J733J461J062L74n91j130j146q96C0e42K33p7E2O72K58
15961I82j45H6i84j211j190m09k16j25RQ44P85N06M43K74K86m1n85j154q86O56
$$ y = [-522, -1539, -3034, -4001, -3434, -2378, -1661, -1797, -2228, -1905, -1215, -1257, -1529, -2211, -3051, -3608, -3508, -3535, -3486, -2954, -1795, -454, 1002, 2326, 2926, 2285, 783, -1015, -3062, -2986, -1060, -166, -66, -944, -3102, -4814, -2534, -377, 679, -7, -1616, -2094, -784, -44, -766, -2462, -4392, -5771, -4756, -4114, -3328, -2362, -914, 229, 431, -512, -1950, -2499, -1911, -612, 655, 1726, 2558, 2692, 1924, 571, -1540, -3189, -3162, -2138, -1948, -1950, -2291, -2560, -2578, -2448, -2835, -3364, -2670, -1396, 413, 2311, 3899, 4675, 4301, 2570, 37, -2764, -3307, -326, 1737, 2639, 2593, 1733, 451, -831, -1118, -885, -863, -1441, -1966, -1932, -1207, -122, 478, 433, 280, 311, 691, 1829, 3435, 4662, 4824, 4102, 2790, 1154, -512, -1754, -2297, -1752, 31, 1764, 3225, 4287, 4661, 4070, 2940, 1794, 898, 30, -542, -309, -386, 52, 724, 982, 837, 86, -984, -2195, -3385, -3794, -4010, -4135, -4126, -3282, -2497, -1991, -1548, -1274, -988, -1029, -1614, -2768, -3654, -2998]
15941b998J241c99H13N79j93E59h55j938L94h78B46R04M23n84A16c29J15C74O30
15922A004N10n71e29k030m65P93M43o94l42l25q09n93N07o19q10k4J809a320F04
15902A494o50a101k262p76P23J1r36p2K202a07A717O83n40D39a333j357L21R13
15884a456g24b71G4J69R5k7b33m92n30q87J71M75L97k15j027q91Q32g74C05L18
15864F23H5a054j106j012k94K53L68J259f89D06J402Q72L06l07m97I02d79p65
15846a244m61K07j87p94m22f75D24J48a48p13L96H06J643O67L24j51l37k18l77
15827B357q22F45e71o15J62b95A00N44M84K62l34C76h84q50q22m52j1K92K90l1
15807b468L61K59g65iG77M06N40P24Q06P07rj242A349d39j232m49l03O82E8J756
$$ y = [-2998, -1757, -399, 813, 1392, 1199, 559, -855, -2793, -2399, -878, 246, 1150, 1573, 989, 116, -329, -214, 374, 1004, 1514, 943, -529, -2559, -3024, -2231, -1788, -2482, -2824, -3149, -3958, -4551, -4044, -4663, -5473, -5497, -3688, -1320, 604, 1494, 844, -1101, -3363, -4139, -3416, -3405, -4341, -4413, -2211, -107, 1717, 2400, 1860, 439, -1333, -2690, -2369, -1456, -724, -271, 74, 243, 338, 311, -233, -725, -1255, -2142, -1971, -1496, -1099, -1314, -2341, -3232, -2400, -774, 305, 623, 85, -1054, -2160, -3172, -3466, -3213, -2845, -1586, -689, 406, 1808, 2680, 2986, 2679, 2182, 902, -479, -1244, -1705, -1498, -1685, -2479, -2901, -675, 424, 572, -148, -861, -465, 806, 2449, 3116, 3440, 3289, 2952, 2734, 2357, 1535, 645, -571, -1186, -1024, -295, 100, 644, 1128, 1390, 1056, 376, -884, -1734, -2556, -3008, -3019, -2727, -2437, -2468, -2107, -1848, -765, -9, 777, 1183, 1723, 2447, 3253, 3960, 3951, 2709, 1349, -439, -1671, -2120, -2423, -1741, 58, 1814]
$$ [...]