
##TITLE=AC1404_GUAAH12213_7653413_rbBq1cP9aP
##JCAMPDX= 6.0         $$ Bruker NMR JCAMP-DX V2.0
##DATA TYPE= NMR SPECTRUM
##DATA CLASS= NTUPLES
##ORIGIN= BRUKER
##OWNER= Administrator
$$ 1.72 TOPSPIN		Version 2.1
$$ 2013-03-19 23:52:24.963 -0500  Administrator@X
$$ Compression mode = diff/dup
##.OBSERVE FREQUENCY= 400.02188249412
##.OBSERVE NUCLEUS= ^1H
##.ACQUISITION MODE= SIMULTANEOUS (DQD)
##.ACQUISITION SCHEME= undefined
##.AVERAGES= 8
##.DIGITISER RES= 22
##SPECTROMETER/DATA SYSTEM= spect
##.PULSE SEQUENCE= zg30
##.SOLVENT NAME= COFFEE_meoh
##.SHIFT REFERENCE= INTERNAL, COFFEE_meoh, 1, 14.98509
##AUDIT TRAIL= $$ (NUMBER, WHEN, WHO, WHERE, PROCESS, VERSION, WHAT)
$$ ##TITLE= Audit trail, TOPSPIN		Version 2.1
$$ ##JCAMPDX= 5.01
$$ ##ORIGIN= Bruker BioSpin GmbH
$$ ##OWNER= Administrator
$$ $$ E:\/data/COFFEE/nmr/AC1404_GUAAH12213_7653413_rbBq1cP9aP/10/pdata/1/auditp.txt
$$ ##AUDIT TRAIL=  $$ (NUMBER, WHEN, WHO, WHERE, PROCESS, VERSION, WHAT)
(   1,<2013-03-19 23:52:16.651 -0500>,<Administrator>,<X>,<go>,<TOPSPIN 2.1>,
      <created by zg
	started at 2013-03-19 23:51:10.510 -0500,
	POWCHK enabled, PULCHK disabled,
       configuration hash MD5:
       86 BA 57 50 F2 9D 5C 9B 26 00 A9 28 5F 66 2E 89
       data hash MD5: 64K
       D6 C7 3F A1 A1 29 93 36 8E FA FA BB 94 B6 B6 D5>)
(   2,<2013-03-19 23:52:19.791 -0500>,<Administrator>,<X>,<proc1d>,<TOPSPIN 2.1>,
      <Start of raw data processing
       efp LB = 0 FT_mod = 6 PKNL = 1 PHC0 = 0 PHC1 = 0 SI = 32K 
       data hash MD5: 32K
       E0 2D C0 C8 8C E2 27 B0 C6 F1 4F 0F 51 75 43 37>)
(   3,<2013-03-19 23:52:20.260 -0500>,<Administrator>,<X>,<proc1d>,<TOPSPIN 2.1>,
      <pk PHC0 = 97.85522 PHC1 = 0 
       data hash MD5: 32K
       17 F0 B0 6D 84 2D AC F7 73 BE 71 BC 31 55 E0 A6>)
(   4,<2013-03-19 23:52:20.479 -0500>,<Administrator>,<X>,<proc1d>,<TOPSPIN 2.1>,
      <abs ABSG = 1 
       data hash MD5: 32K
       15 EB 3B A6 61 3E 66 DE 78 12 07 D3 16 C9 DD AA>)
(   5,<2013-03-19 23:52:20.635 -0500>,<Administrator>,<X>,<proc1d>,<TOPSPIN 2.1>,
      <abs ABSG = 2 
       data hash MD5: 32K
       E0 85 2A FF BB E8 15 C4 AA 08 CC 2A 6C 10 C7 44>)
(   6,<2013-03-19 23:52:20.776 -0500>,<Administrator>,<X>,<proc1d>,<TOPSPIN 2.1>,
      <abs ABSG = 3 
       data hash MD5: 32K
       74 18 DB F6 26 9A 90 48 A6 42 90 6C C1 6F 25 36>)
(   7,<2013-03-19 23:52:20.916 -0500>,<Administrator>,<X>,<proc1d>,<TOPSPIN 2.1>,
      <abs ABSG = 4 
       data hash MD5: 32K
       A6 03 2A EF BF 07 0D 31 95 55 5F D4 F9 0F B4 98>)
(   8,<2013-03-19 23:52:21.088 -0500>,<Administrator>,<X>,<proc1d>,<TOPSPIN 2.1>,
      <abs ABSG = 5 
       data hash MD5: 32K
       73 BC 01 1D AB 83 4A 21 1C 7E B3 55 09 80 12 7A>)
$$ ##END=
$$ 
$$ $$ hash MD5
$$ $$ 06 BF B5 FC 94 3E 09 13 96 1E F7 03 03 85 F9 78
##$RELAX= 
##$RELAX= 
##$RELAX= 
##$RELAX= 
##$RELAX= 
##$RELAX= 
##$RELAX= 
$$ Bruker specific parameters
$$ --------------------------
##$DU= <E:\>
##$EXPNO= 10
##$NAME= <AC1404_GUAAH12213_7653413_rbBq1cP9aP>
$$ [...]
##$TP= (0..7)
150 150 150 150 150 150 150 150
##$TP07= 0
##$TPNAME0= <>
##$TPNAME1= <>
##$TPNAME2= <>
##$TPNAME3= <>
##$TPNAME4= <>
##$TPNAME5= <>
##$TPNAME6= <>
##$TPNAME7= <>
##$TPOAL= (0..7)
0.5 0.5 0.5 0.5 0.5 0.5 0.5 0.5
##$TPOFFS= (0..7)
0 0 0 0 0 0 0 0
##$TUNHIN= 0
##$TUNHOUT= 0
##$TUNXOUT= 0
##$USERA1= <user>
##$USERA2= <user>
##$USERA3= <user>
##$USERA4= <user>
##$USERA5= <user>
##$V9= 5
##$VALIST= <valist>
##$VCLIST= <CCCCCCCCCCCCCCC>
##$VD= 0
##$VDLIST= <DDDDDDDDDDDDDDD>
##$VPLIST= <PPPPPPPPPPPPPPP>
##$VTLIST= <TTTTTTTTTTTTTTT>
##$WBST= 2048
##$WBSW= 25
##$XGAIN= (0..3)
0 0 0 0
##$XL= 0
##$YL= 0
##$YMAX_a= 660726
##$YMIN_a= -562679
##$ZGOPTNS= <>
##$ZL1= 120
##$ZL2= 120
##$ZL3= 120
##$ZL4= 120
##$ABSF1= 14.98509
##$ABSF2= -5.573092
##$ABSG= 5
##$ABSL= 3
##$ALPHA= 0
##$AQORDER= 0
##$ASSFAC= 0
##$ASSFACI= 0
##$ASSFACX= 0
##$ASSWID= 0
##$AUNMP= <proc_prof1d_extract_pilot.lims>
##$AXLEFT= 0
##$AXNAME= <>
##$AXNUC= <1H>
##$AXRIGHT= 0
##$AXTYPE= 0
##$AXUNIT= <>
##$AZFE= 0.1
##$AZFW= 0.1
##$BCFW= 0
##$BC_mod= 0
##$BYTORDP= 0
##$COROFFS= 0
##$CY= 15
##$DATMOD= 1
##$DC= 0
##$DFILT= <>
##$DTYPP= 0
##$F1P= 0
##$F2P= 0
##$FCOR= 0.5
##$FTSIZE= 32768
##$FT_mod= 6
##$GAMMA= 0
##$GB= 0
##$INTBC= 1
##$INTSCL= 1
##$ISEN= 128
##$LB= 0
##$LEV0= 0
##$LPBIN= 0
##$MAXI= 10000
##$MC2= 0
##$MEAN= 0
##$ME_mod= 0
##$MI= 0
##$NCOEF= 0
##$NC_proc= -8
##$NLEV= 6
##$NOISF1= 0
##$NOISF2= 0
##$NSP= 0
##$NTH_PI= 0
##$NZP= 0
##$OFFSET= 14.98509
##$PC= 1
##$PHC0= 97.85522
##$PHC1= 0
##$PH_mod= 1
##$PKNL= yes
##$PPARMOD= 0
##$PPDIAG= 0
##$PPIPTYP= 0
##$PPMPNUM= 2147483647
##$PPRESOL= 1
##$PSCAL= 4
##$PSIGN= 0
##$PYNMP= <proc.py>
##$REVERSE= no
##$SF= 400.02
##$SI= 32768
##$SIGF1= 0
##$SIGF2= 0
##$SINO= 400
##$SIOLD= 32768
##$SPECTYP= <>
##$SREGLST= <1H.CDCl3>
##$SSB= 0
##$STSI= 32768
##$STSR= 0
##$SW_p= 8223.68421052631
##$SYMM= 0
##$S_DEV= 0
##$TDeff= 65536
##$TDoff= 0
##$TI= <>
##$TILT= no
##$TM1= 0
##$TM2= 0
##$TOPLEV= 0
##$USERP1= <user>
##$USERP2= <user>
##$USERP3= <user>
##$USERP4= <user>
##$USERP5= <user>
##$WDW= 1
##$XDIM= 32768
##$YMAX_p= 465341141
##$YMIN_p= -671508
##$CURPLOT= <Network HP LaserJet P1505>
##$CURPRIN= <$Network HP LaserJet P1505>
##$DFORMAT= <normdp>
##$LAYOUT= <+/1D_H.xwp>
##$LFORMAT= <normlp>
##$PFORMAT= <normpl>
##$SURQMSG= 1
$$ End of Bruker specific parameters
$$ ---------------------------------
##NTUPLES= NMR SPECTRUM
##VAR_NAME=  FREQUENCY,     SPECTRUM/REAL,   SPECTRUM/IMAG
##SYMBOL=    X,             R,               I
##VAR_TYPE=  INDEPENDENT,   DEPENDENT,       DEPENDENT
##VAR_FORM=  AFFN,          ASDF,            ASDF
##VAR_DIM=   32768,         32768,           32768
##UNITS=     HZ,            ARBITRARY UNITS, ARBITRARY UNITS
##FACTOR=    0.250966925370066, 1,           1
##FIRST=     8223.43324360094, -151549,      -71798
##LAST=      0,             68591,           1438
##MIN=       0,             -671508,         0
##MAX=       8223.43324360094, 465341141,    0
$$ Real data points
##PAGE= N=1
##DATA TABLE= (X++(R..R)), XYDATA
$$ [...]
23850 -216511 -194116 -129089 119193 -4631 90397 18105 -322092 54103 241210 -146432 -133441
23839 -133441 121033 289285 14227 -159661 134381 48415 268122 44886 16850 -276498
23828 80543 -15029 -80334 35361 -143260 -16714 37262 -291943 13529 190676 -132793 450337
23816 -216260 389681 -40913 18780 182643 -2477 -342411 -44513 -15914 233866 -15903 -80214
23805 -80214 126238 -284574 35658 56824 37760 -255939 107622 189898 118724 148341 -275256
23793 -82928 -112897 -264493 -12578 -505031 96811 -98820 -3634 -9402 212228 264678 23155
23781 -12407 935 -30253 169930 313844 -2642 -326 -204935 90767 102426 -144450 -199767 174391
23768 349009 224470 -13944 112787 209732 212577 -95256 -87335 -78064 -117662 100288 101791 96015
23756 96015 110196 -210853 -233251 -12956 -25122 -136894 -151737 192041 -263979 -121883 -33270
23744 -1631 -121964 -84449 179227 86702 -173338 115426 201519 -72185 230886 -274566 337329
23732 -34089 -208483 109303 -109882 -57106 203955 -18943 -525424 135143 -239443 153343
23721 -49224 73048 78346 15929 -89557 148610 -68945 172532 377109 -42692 223679 -256117
23709 213080 -85774 -2912 72827 -41170 -163083 -88574 -236822 -166708 123075 335679 -43794
23697 -286334 -164678 82548 -151937 208820 18888 -167820 -168583 -153774 -9945 -10814 -128077
23686 -128077 13942 -105776 -35895 -82913 239964 -292919 -40528 128462 -30535 356260
23675 147655 90591 -44176 -40576 68304 169331 303485 258318 -194924 -102141 211882 -82886
23663 53304 228227 -58607 -106875 -324000 -299476 -303397 -5205 -121059 -183594 141233 204816
23652 204816 -80355 -29621 -15086 54163 -47212 -210923 139073 -247733 -27501 -116218 -64583
23641 -64583 -252274 106122 -9054 204566 -17837 -111702 178851 188636 -194289 69880 -372814
23629 25625 -246413 25958 126561 35848 -93000 -16694 70412 -148458 276163 190237 -277895
23617 86472 -49932 200908 -167777 -383689 -68156 218039 -105081 -152656 265784 -238375
23606 173016 123314 -132807 48354 -143899 -218816 193644 19508 -140683 -41407 168690
23595 -144125 153607 -418100 -83845 -75780 8026 98479 -163963 -18901 296407 56267 -252178
23583 -293388 -160565 362499 -140721 107714 285907 -118012 24479 -37587 -121670 322448
23572 205785 -263635 -56390 67020 39788 -39367 198544 11152 -36661 73802 -213222 131316
23560 202350 142941 -106611 -197124 -24776 116780 -79054 22149 90407 41886 -207094 -18890
23548 22114 69535 -116926 128157 90251 369164 -197931 -58634 221289 50491 136031 -70277
23536 -58439 100579 -134962 -96536 145634 -125253 -28015 8360 205873 65214 45418 -181600
23524 246058 -59054 37511 24877 31636 -54418 96331 -178385 -189316 -519715 111531 -4144
23512 -258861 -116982 -97124 -195629 90331 -206355 -397329 -124265 -239991 -357415 -330332
23502 -330332 -117697 19775 -118306 49433 301430 -370102 82070 -68059 -74520 -200966 -202705
23491 -202705 -227432 15663 76811 -48561 44892 62925 9184 -214896 278253 -14501 -44387
23480 -44387 -120667 -181097 286931 4351 46920 -47401 -247933 -199502 -82948 166429 10980
23468 265652 201278 249851 -111334 90153 -336928 -103952 -45855 -56554 -140964 -59243 -296942
23457 -296942 -275388 -174436 -63613 -180627 -160996 48645 75680 -59976 33654 28397 330814
23446 330814 -198434 265265 52283 129528 141707 181963 -106613 128767 -118838 47568
23435 -345106 27712 90284 341708 -23284 -70554 103087 -175028 -297030 42407 465801
23425 465801 131822 96748 57192 97827 -331418 48885 166269 -72948 95110 103507 -138646
23413 -15756 48412 216943 184274 -131693 28951 -380121 -194230 -271951 61475 -48796 -41806
23402 -41806 -28448 -169906 -176192 212334 -96425 -38745 -270693 10496 57622 192159 -85881
23390 -332763 41315 -250486 186960 146672 -49918 150759 201538 -276601 -37346 -57541 163380
23378 85393 -114401 -135569 112243 115285 46472 -335462 30508 -71503 142116 -112300 -403424
23367 -403424 150152 407531 -241698 -52096 44431 -242364 8540 -2984 -60516 -183410 -113446
23356 -113446 -45246 -72346 -122847 -262704 88903 -93138 -154205 -209169 -26853 53208 -51834
23344 182970 -29230 -109063 342197 301072 129727 -57962 191311 -30356 159221 -19037 125044
23332 256761 -116899 24592 38515 -24758 102672 8047 -100997 110835 117192 -118125 27505
23320 172802 148395 -161960 -124012 16860 -65152 6736 -120761 76796 -14698 -106113 75339
23308 -248141 -197094 -68122 -161548 236122 21972 186231 -204373 -254137 -120722 -391528
23298 -391528 -255565 56487 -125743 172314 157783 -154248 -157024 -178137 -151718 225194 -32515
23286 291256 -39669 82212 23791 -13529 -102144 63326 52481 -108293 -321855 176304 74984
23274 233811 -162807 164707 -83165 282653 67672 -53904 -81312 376221 100625 -132773
23263 -125222 27834 143793 -171153 83075 116622 -39846 -21660 -183594 6907 72786 109504
23252 109504 -187075 42267 -127876 -209783 -180414 41025 -35846 1539 -28332 100201 -120720
23240 14942 488284 -108955 -176833 417890 -127271 -18242 -296201 82702 88641 -105613 -268732
23229 -268732 -229960 67698 54733 -45806 -126373 -71800 -67578 306889 84439 33797 36602 -177857
23216 -271381 -3199 369099 48127 -84978 -5047 -57632 57371 121727 -143408 -3567 74966 -102611
23203 71700 -289096 -29109 -94744 37539 -72668 26632 -304121 -24533 44776 -100176 107988
23191 22525 -363377 8713 -57825 -536080 282435 46314 -72612 -126566 382491 67667 270341
23180 270341 -53196 -309122 214604 -281184 -37828 -203530 75496 16705 320 -148751 315456
23168 114160 209161 -232719 -188885 230618 -34673 -112167 -201108 253050 -146563 72364 42218
23157 42218 -87079 -107653 10569 276060 -64584 -48785 -71094 262105 -174199 24910 -40168
23145 -53623 -134316 81704 114959 46566 -190421 -100328 58598 48611 17619 -65072 -47805 -127603
23133 -127603 -15214 120122 -107824 -141926 -52306 40192 -214038 -84125 83785 18158 -30496
23121 -285341 79149 -208440 -126328 160998 -40391 67305 -112697 145740 -130831 404189
23110 72357 148607 -54152 -289762 17182 -414663 186718 -46510 -105457 -75009 -145951 202771
23098 331532 218206 275126 36554 -82652 201432 44336 81079 -47608 -58739 97236 56948
23087 56948 -200708 -75711 72420 -143665 -284525 167477 -34915 30485 68488 147484 100962
23076 100962 -206003 -292162 -151079 45125 77802 -8469 292647 110607 -238756 -167862 142907
23064 49637 175535 325149 30917 -160677 73482 -82187 243442 -93714 73777 -2872 1493
23052 -149101 -182592 -133435 135454 -86916 3702 -349085 247232 319147 118370 216654 189502
23041 189502 -34656 -373477 -7545 -268039 46087 247063 -181266 234023 -88512 -268986
23031 -268986 -34979 -227184 108771 -228464 406732 -19460 -407537 -102110 -312766 -109308
23020 -22936 104384 110175 18272 172970 176859 -187007 -303647 -70241 121617 -365959 265664
23008 121456 -142107 402311 -101465 144405 96236 116565 -141239 347078 -72104 152603
22997 45443 -48893 76551 197554 -24155 -237342 175751 -106901 160791 -58272 73037 -48639
22985 -157872 -151443 -2034 272673 62259 -192730 102928 -77018 42429 204582 -21580 255585
22973 11589 -54991 -151253 -213857 -171802 135196 -280330 73390 18422 -153039 130947 -92077
22961 34238 -163302 -20279 -79903 -35814 -154023 -326514 -264707 -191190 -80622 -26396 62749
22949 -164445 50865 -64638 -261010 -39502 -254273 43358 75958 -7975 68227 -196004 99435
22937 -207020 -95335 86402 -450095 96803 -246471 321470 70116 -14482 160678 -170490
22926 -129928 -54254 -105102 179030 -155152 208851 -81683 -288105 -57197 -190797 185620
22915 -193138 -24476 -12308 139924 15132 -217223 -260279 -326861 -34863 -15912 -12423 66238
22903 -169307 86233 -220158 80392 -162028 87501 -27334 -179840 178293 -44695 -390350
22893 -390350 276009 131941 -100073 276664 -227032 963 131191 174060 133441 -39980 92860
22881 -406850 -209152 133291 -298404 -109551 -85965 -8563 100405 -180231 140552 -184056
22870 58010 46064 161278 7091 164202 33416 62525 -58923 -180200 -233230 -50949 312312
22858 -68479 -24271 62934 -192609 -20986 -163884 -436788 26711 -292936 -4527 47118 -225312
22846 -248279 238 96004 108076 -122875 -118386 99661 57698 -576 53776 -43594 -397237 -190404
22833 266860 -167252 -249555 199149 40511 64458 61893 210740 118585 -98511 -163488 81880
22821 -329992 -11136 11218 56624 55343 237162 246353 -129280 -218576 -115520 -40609 -13906
22809 -104236 -315394 223177 53516 -227585 -85920 92975 -55998 -195917 38966 -14745 -25511
22798 -25511 250207 275625 211366 265912 -423012 119064 843 -10358 -396440 -63916 -256236
22787 -256236 -62415 -244871 -159354 -121200 3858 186891 227891 -21166 -60299 -47281 -139995
22776 -139995 59819 147603 -331242 -219432 -54106 92199 -184069 121243 -128210 -21886
22765 -16142 120374 -197047 -26960 -139466 108041 40069 214575 369641 -121808 266877
22754 -312052 105443 93944 5194 108624 32997 75377 -91154 10960 34291 -181891 -186367
22743 -186367 -51641 96398 273502 -13104 71064 113091 -56328 18519 -184558 318046 -181225
22731 -337531 181639 -60515 -217109 37142 -199484 -45868 -276531 -180043 -98211 -253382
22721 -253382 -146665 -50009 -359864 -90812 -33486 -127355 -47296 -5033 97840 50677 12438
22709 46222 98723 10685 -124365 -181688 -254502 174824 -197226 -123872 -11828 -101730 -139982
22698 -139982 -130275 43196 14473 -147256 392148 138303 183841 -193236 -96772 275273 -58211
22686 -85317 -155260 66386 98836 64413 64873 -247911 -162322 -299963 -81570 -247556 163301
22674 104605 -353028 -194856 96285 -66600 -5730 8524 32973 30254 168546 -106753 -4198
22662 -397592 -123183 90733 270989 1915 6686 217894 103179 -232620 -44059 -251027 169794
22650 -85936 -165904 -130958 -268803 28102 -313943 -78773 -150640 -64421 -2481 -116212 -158538
22639 -158538 67928 -129012 79709 -259670 337065 -55634 -271826 229888 -160367 40871
22628 -205434 167412 -79610 -15419 16224 126342 -54527 -162500 -137392 106378 -21660 -116679
22617 -116679 127225 36279 -112798 -71743 100491 102471 -3211 -138170 100636 -276330 169857
22605 -486889 83298 -448425 -108031 -174706 -160380 22159 91019 -229497 -297918 103101 -117529
22593 -321159 -62170 -132903 -102370 -261563 186387 -99805 32900 -95308 119115 212552 126690
22582 126690 260529 -81060 361827 -210533 -86398 -54252 -352132 63454 -330224 -195757
22572 -195757 -202832 51810 -369965 -53228 106752 266919 22317 68604 1848 236663 -294281
22560 36391 -44482 -113400 -245350 -207781 -32594 -174984 -113966 34430 -154908 128388 -65704
22548 -245431 -91864 -236783 18755 -116213 -150461 -185643 -217549 22214 -25291 27040 -173231
22536 -52210 -225 -12248 -237090 65769 199804 -194379 8912 108462 -174958 -26066 86269
22524 -6698 -179461 133452 -106839 18571 -356774 187404 465310 -131390 27552 -134810
22513 82345 -295121 391690 -138600 -169727 -41072 14216 -149890 131380 294399 -90718
22502 -16488 -29622 -127200 -136037 15672 -131734 256825 228639 2252 19772 145652 -141657
22490 -119167 94023 -42312 4281 281342 -68491 -173834 -315697 2575 23408 209877 -150532
22478 -46378 -25036 -90875 -4764 151929 -23714 326552 145693 199677 31935 5081 329158
22467 329158 -1839 -173294 32974 359527 -11383 -54898 6494 -33676 56544 30770 -131872
22455 -93127 74250 -114472 -79500 -198376 -526992 227877 -10517 -294934 98104 -88107 -160069
22444 -160069 130784 -339970 -148491 -75319 -60472 97424 -131068 44190 167428 -35049
22433 -170683 -264824 -10536 -119410 -277544 266055 -210527 25801 76564 -198924 -133517
22423 -133517 -278452 -47974 56887 -305529 -157727 163022 -68103 -118202 -21103 -196343
22413 -196343 260367 -62083 112959 77914 -72618 69869 -215265 2491 -60331 -167493 117029
22401 45699 160600 144143 -205961 -134806 128721 -110047 163 -100479 -423056 -5816 279214
22389 77928 -74149 48138 113447 -80547 13609 -101092 163145 97416 -155067 -280652 -57331
22377 -463382 279326 -320174 -217358 68450 -74039 119152 -3435 65550 172943 -119989
22366 -32041 -22234 -241008 -312296 -102766 165912 78259 -281030 -25295 50461 432220 -228407
22354 -245859 -148329 8715 -123933 52128 56011 57221 -2801 244355 -157926 -256627 -155554
22343 -155554 92568 90570 -56314 75035 178653 -100465 -18811 -170091 139147 -431976 58600
22331 273281 -255999 -140299 287697 -32194 372244 -20575 149221 132415 -32115 -320540
22321 -320540 -324325 -94432 138859 45196 -144216 132122 202086 -104733 -276828 -161257
22311 -161257 83523 -121922 69963 -222385 -32011 29679 3803 -175475 -181427 99261 37088
22299 -200359 130511 9645 70298 -27997 -269976 48185 100845 234192 -186675 264431 -68030
22287 -76885 24501 277401 -284412 -205656 -194112 -361765 260527 98808 67260 -187978 -68457
22275 251469 118778 -79871 -131879 -31940 219384 -17583 205227 320578 -129156 -123185 -67038
22264 -67038 -62650 86997 -83653 -168739 -5778 198953 -106077 125447 -246311 186289 -182869
22252 52119 -283412 63445 -329452 -78872 -191398 -12898 -88242 -194044 176 -244016 47372
22240 -11426 -199427 -29760 16775 -159348 140887 102167 9687 -25861 -150250 -97714 -110248
22229 -110248 -280991 202767 -36935 -184766 -246568 27553 -16715 -316223 -125801 315535
22218 96339 173798 -401427 -345986 8313 48850 -135840 84546 40768 -128793 143834 -189751
22206 -34553 -144231 -440414 63003 -310960 172951 -101501 66395 -54877 -108108 -26371 209427
22194 -70676 -18354 36950 -26320 12726 -166121 76251 138897 47422 -17322 154682 216764
22183 216764 -187582 -40752 101237 22762 410972 88240 162404 -130543 -31065 -176668
22173 -176668 -309382 97716 3716 117304 257860 106226 158743 -147281 85170 -372215
22162 -25279 204313 -263089 283765 -69896 -301612 -41987 143438 -53019 -227814 158660
22151 -22472 278177 -174696 -142312 111560 99605 211284 102827 30356 117410 45476 174853
22140 174853 246044 66098 -134103 225419 29504 85994 -136809 120280 -72186 45512 -352661
22128 252412 43156 -38512 170667 248838 36432 50000 135404 125487 -175970 18840 107694
22117 107694 352166 210395 -125552 -197120 -115440 -201175 310941 -139868 -149641 -319483
22107 -319483 -197485 22897 189005 -153767 -31723 -59978 -435798 203199 66411 -21298
22096 75811 -277325 -1563 -161098 -22415 -242265 -193370 -114217 -100993 -426237 166828 -161886
22084 31195 -85068 -120132 315440 -108453 -23138 -281621 -204017 72003 -249829 177646 -227776
22072 171771 298017 -837 44585 -67112 -191486 100234 7371 -180238 133358 -351958 -419752
22061 -419752 -207379 -136264 -74746 26447 -3124 -54580 -78682 -129203 226067 80598 -519156
22049 95601 80494 -184766 -121749 -113375 -148222 -374895 -128340 34961 -189664 205186 102737
22038 102737 -11540 -50717 -128945 231495 -68123 -141538 181339 -479414 -110778 -36889 276369
22026 -268528 -265555 -6370 131253 -40719 9197 281182 6978 -146278 79147 -104680 -203755
22015 -203755 -21577 -140274 -160609 24072 143279 -215993 200113 -205990 -245076 -159990
22005 -159990 16971 -189925 -138685 307320 -241529 286289 206983 -45749 -9841 -84885 -36551
21993 -247407 -49344 -304820 130673 154694 461866 93124 28821 -124518 -39554 -110152 106104
21981 -129133 -100103 -30890 128285 443902 -21449 -475310 -57077 -135401 60508 -151101 -80793
21970 -80793 -242738 -373962 -125344 -232158 125175 -118464 -38833 37010 35678 244901
21960 244901 173402 62016 -236440 -330394 -231357 128012 -88624 6178 -201608 26145 221498
21949 221498 -137853 -86841 -131159 -193314 -356110 -229191 -81860 -182526 133038 -60503
21938 -322549 -513875 -110298 178305 104454 -33998 -442099 27401 -212650 25355 5479 45325
21927 45325 198666 -11378 38373 -48041 122966 345492 -32379 -348155 28916 -215582 -519134
21916 -519134 -93190 -276384 -91461 -100641 31859 52423 -155683 47124 200328 -7227 -147023
21905 -147023 -128593 74474 -36595 -67966 118529 -38327 -248683 146837 -131422 -312722
21895 -312722 -83761 -109348 -145434 -256361 159248 34920 27043 -29351 -78702 56971 -383310
21883 -101651 -115093 13089 -161068 261757 58844 52864 -160816 49723 92874 -291469 -195353
21872 -195353 113618 264820 -47976 -238802 -332139 -2370 164022 1171 -257134 -124818 152464
21860 30536 40982 280653 -167876 98525 -228945 248837 53754 -75360 8818 -187044 81560
21848 -146986 -160369 -160350 208146 48988 127283 -340141 17230 162520 -6667 -100991 68762 -145681
21835 218673 -61596 -134865 -182803 -79501 -123968 -158022 169129 301846 225489 -165840 -175431
21824 -175431 -116447 -45333 93785 -191025 -20324 3175 -69689 -246452 -95007 -62137 -202395
21813 -202395 70865 -286763 242927 14310 -138238 -277253 -152930 -82445 33527 -128126
21802 -65799 -155817 -63789 23675 25764 91055 -72003 -127173 -26096 17701 -31099 -162806 136954
21789 -343136 155939 47536 351800 -27874 -305574 115493 12983 30564 290205 -156289
21778 -131741 70993 71389 280763 -181189 -247367 -145194 244549 31348 101907 -80191 -250473
21767 -250473 -9333 82934 -49592 -86325 303544 137056 -3953 -106171 -96780 162067 -166723
21755 38374 108333 -119576 68677 166008 -225621 -158318 -145872 -143524 -240113 394 -9994 -342599
21743 -342599 -126394 45546 -169023 -103103 -7414 -68648 -59768 -237299 -202492 134568 -302760
21731 -109214 -170109 29799 -186826 28862 298389 208788 133416 -71015 63827 -147060 -94431
21720 -94431 165405 68581 99451 17744 -25292 -85787 -81495 -127807 -263800 64678 -227886
21708 138940 -85378 -245520 -66653 139232 -55067 -147352 -136850 -191151 20046 -62099 -155709
21697 -155709 -205361 -61937 -145903 -48680 -87399 254913 -238404 -261325 113404 76022 77338
21686 77338 -154977 41060 33320 -63735 188626 -208148 -81319 -287945 72154 -165859 -186395
21675 -186395 -25592 304223 130695 -108120 82648 -319819 -107734 -131360 27220 29705 -108484
21663 114563 -355920 -173075 -336377 157367 -101636 83657 -276265 47998 -2225 -96783
21653 -96783 -58014 95002 -31236 149762 -190299 46933 -281871 -257976 -96555 -163596 84307
21641 -30052 -410795 135473 -154083 -119987 -226205 -325614 -56970 -94842 61453 -167027 -224982
21630 -224982 -87772 -9018 72931 -26114 134790 277273 -96082 -252362 49903 9210 -300326
21618 155893 -441338 199152 -200389 186945 -132962 -53010 8189 140244 -71128 248401
21607 29845 145598 -60226 -244562 -365454 117322 -40931 -129402 -357328 92107 132343 150043
21596 150043 138187 92922 -76860 -62334 -141197 -158033 -91939 59800 398461 -132355 154539
21584 -72870 -101029 -309045 23115 19875 55786 -161555 90660 -177101 -39291 -150630 -99985
21573 -99985 -313032 268833 -221579 -122481 -113999 103819 -472239 5194 49733 -197333 -54166
21561 -76924 -120233 84346 -244378 48222 184989 26771 -283158 -341820 -80054 53227 336862
21550 336862 -529921 195189 -105318 41079 135015 204386 -6805 82074 -213615 -274144 -480
21538 153301 -145898 113453 88611 -223366 -99761 -85966 -310407 -35085 -160873 207416
21527 158732 246445 308561 -413521 -16585 44650 -300890 -68837 231172 -88721 143396 -225482
21515 -11768 190958 -35634 11652 8402 -53737 -97952 -190925 -73493 -413344 -38426 -403641
21504 -403641 -46159 102152 -58012 -386504 -23330 5985 -103222 -108055 50483 211414 47100
21492 105099 -237001 -57902 -27103 19816 -156649 -173603 -123677 -216678 5416 82387 -210627
21480 21919 -283455 -71632 149506 -304559 -308306 242438 -260488 258471 -111998 19398
21469 -813 -166136 -378401 41354 179123 352779 -134194 263192 -146909 -104978 -186374 141139
21457 2124 -254432 51778 -46662 219759 -197651 36232 -218118 150142 88546 -179935 -236624
21446 -236624 -51750 -254051 -94936 90110 -368976 234689 5867 125271 358382 478453
21436 478453 214726 371537 243803 -123132 -63196 36144 360995 201571 121724 -174921
21425 -180968 156911 128518 24262 -77176 398282 151059 -166404 -204227 -247388 -86700 -36193
21413 -75566 -36777 109748 82766 -107487 10149 -17378 -217369 -166029 -318628 -177081 -69446
21401 129070 64789 252296 -102204 -181644 159627 30411 -46518 -85902 -44714 -192364 -188120
21390 -188120 134639 49996 -158958 132786 -221719 10163 -95209 109704 -36400 -339830
21380 -339830 -208120 -127040 -74092 77344 36693 96497 132734 -134781 -671508 310363 -35404
21368 -303704 -44208 -409295 -95176 51021 -206420 -193062 31345 -258771 -149749 5628 -251857
21356 294377 260402 -125094 156421 -112494 79431 246601 -102635 24708 -398482 331076
21345 111934 -163067 24087 157632 11966 -260973 35225 -301932 -283930 -143882 212445
21334 169069 -188068 -133958 -315127 -212572 34993 100807 16799 -379751 307517 95138
21323 -137811 -104992 60057 -330494 -95884 141227 239618 -149182 -319147 189692 -113329
21312 -219173 19649 280409 -188133 -203406 142800 -219153 47627 -162330 -22056 -309596
21302 -309596 -144966 -270778 182308 -37597 -35302 253108 -312801 -5104 -92348 144614 -194772
21290 110084 169053 108582 199050 217553 -105373 -357012 -100152 -43433 -120007 15142 2209
21278 246516 26791 -41168 -248239 -162776 37100 -174112 235755 -188332 211325 -218577
21267 -322405 192310 153140 -243084 -33365 163713 36433 165757 -175517 -65907 134198
21256 -88870 164635 55150 -230501 342734 -138286 -399193 -90477 109276 -224541 -69126
21245 -591673 -81007 12392 -243234 -6130 -49704 54160 90124 -86815 73527 114951 48660
21233 -76376 70927 175054 -47091 70194 -81718 -164894 -48037 -318322 -79981 -135857 191517
21221 -40196 232463 153250 -83873 -56023 -4470 107095 178426 -4865 -144711 -178301 52581
21209 171481 -14631 -11205 -85216 128849 197102 -105849 296707 -279506 67159 133726 105889
21198 105889 -67047 -28339 -176942 -180461 76181 100651 144905 -72682 56104 -4217 74636 -116379
21185 -353749 27691 -150595 11100 -165528 -75588 -243797 234248 -45573 -390010 -7533 -32918
21174 -32918 131891 -74173 -259090 -33447 -26482 -55145 -377208 -211526 -462384 157769 -178502
21162 111144 90456 126953 17929 183438 -180832 -118831 127076 204358 -38045 -163882 -457090
21151 -457090 45763 102535 -291170 -272837 -146017 -29906 -66736 -352223 -8218 45358 238190
21140 238190 -101140 82979 -288690 -156003 224130 -178396 -253063 -103337 140276 234538
21130 234538 83552 -425155 30161 -30514 -67940 -159138 -125797 145754 228851 110332 -231613
21118 -144693 -202702 60869 -84030 89896 -179630 297100 50933 120754 -248512 83685 71668
21107 71668 125341 12291 -231631 -32700 2662 -198206 -53195 -21161 -156441 216234 -71081
21095 -147605 -120008 298147 93839 -171889 160467 -350009 -104413 -86802 -18373 182404
21084 -374079 18332 276607 -301972 -108214 68737 101193 146880 61343 373947 -30436 -258900
21073 -258900 -61518 6974 148125 499534 17657 113421 76572 -10653 -223330 146343 -258964
21061 -69790 -219839 29768 -47961 -299749 -103294 -86593 -45609 -109027 -3081 -244040 -172488
21050 -172488 -160720 54045 51997 -240075 -201690 189174 -137719 -252376 -99335 66198 6933
21038 -251085 -445437 38717 10999 119933 289208 -98131 56514 -278239 -84160 -31138 -199649
21027 -199649 -82002 -95395 -264751 -350298 33981 -115883 196041 -82682 -184726 -22262 133484
21015 -101375 -117645 59508 -15775 -174249 156203 240421 53477 -246873 111228 -149646
21004 127242 -329031 -125762 -13612 18443 95404 56885 -268516 25767 -175224 148106
20993 -57378 -339732 232771 -31244 58540 -55693 75355 -263009 -279141 -279159 -102697 -456223
20982 -456223 -359973 -439 -137426 -182605 152994 11988 -287868 79767 -151036 32963 -33558
20970 53351 -410627 99853 131756 24212 -399672 43261 -164790 188323 -93807 -321247 -46604
20958 370421 -204982 -199434 13811 226292 -551954 25400 -4448 -120345 -42711 -16183 -291196
20947 -291196 74720 24580 -57973 84606 -178746 194825 -263095 78304 -99652 39531 -457380
20935 -295310 23094 433361 -124373 -1657 189155 -142165 -314840 197190 -394317 -286467
20925 -286467 -54066 -3325 42911 151816 -32828 -69780 -173003 58209 148198 -191512 -230294
20914 -230294 -369556 -107883 -72378 -268963 -256386 -183492 85678 -120023 -292237 152118
20903 -148434 -195336 -13421 -31152 -22020 332556 31059 97158 212517 133975 63521 13463
20891 153365 196679 -14777 -435730 -308827 -202435 -115237 55103 139466 -288680 73164 4646
20879 -170628 -57391 8769 -219493 -74640 -295136 -43293 -314122 -265794 -271823 72053 -152870
20867 197930 -125226 -27198 -198594 203342 90422 77797 158175 65741 249404 -49777 264320
20855 5307 102548 -228172 183924 -8280 226025 -510113 25974 -231612 -165788 -136194 45922
20843 56936 -86525 192646 16412 -125457 216374 -139893 -277457 292775 -105603 124420
20832 39557 -70592 323309 -133993 83103 84218 -272385 -190177 -35747 -153705 315770 231770
20821 231770 46486 -327800 -98473 -110877 120505 -172515 -231213 157609 78717 -106907
20810 -42966 -145211 -158779 -130434 54005 22129 241715 -53496 131931 37133 -70799 115449
20798 -271255 -11134 -49579 -182320 -156261 -34164 112208 -34921 -313597 -104169 -74897 -271473
20787 -271473 -38270 289328 -330930 104180 -95049 242381 35853 -98793 -146019 -131922 143031
20775 -85367 -149013 -175374 33309 84912 -257431 -37734 -168481 92291 115248 91789 -297075
20763 -24636 8405 54566 -170379 -1661 -137011 -15950 -47588 228991 -40865 267346 -170874
20751 -322135 -8712 -39213 -51667 14369 186059 -207120 -334896 2745 -188299 -116020 -120093
20740 -120093 132702 7635 -108527 1509 -17371 -1301 170395 -131683 -194078 320183 -65824
20728 11776 211207 -28610 -409422 -252368 -156033 -62577 20594 -50700 -256774 -163403 -120630
20717 -120630 -158421 -184387 59384 31896 81109 -171578 -97422 125485 -267741 287629 -482395
20705 -274940 56238 -426759 -221807 -9484 -293168 -112030 82903 -46132 51643 -25344 -294505
20694 -294505 -30366 -60032 -20951 -166559 21182 152150 -113203 -55190 -266194 90364 31594
20682 207491 -60644 -83972 122292 107874 48920 -69314 186895 -395904 20940 -330076 -286385
20671 -286385 84669 -25927 -149392 118351 -212449 -89728 -31140 -352585 70102 99169 -201585
20659 52847 179349 -351079 31764 -210956 -62653 -11395 84271 15588 -301 -144356 61171
20647 12206 -26459 7186 17145 152000 205144 -261218 191617 -186857 341367 -354775 -183137
20636 -183137 53787 -111173 31893 -35878 -213639 -161601 186377 61541 -215308 -63752 -307144
20625 -307144 -158980 60629 -323366 -10094 -471358 -174477 25098 -24056 67963 46351 -129931
20613 -29806 -229024 -232793 -26076 69172 61753 173374 -37213 201347 202233 -163169 -105897 -269158
20601 -269158 -41503 -223929 -100114 -126898 -222962 6999 9852 -16997 -43755 202730 -66519
20589 137526 -113310 106182 249677 90158 336604 -315266 -93672 -16246 -31657 -65142
20579 -65142 72194 398577 -421423 -387505 6022 7136 -84885 71103 25060 19147 -180838 230583
20566 26456 -298954 216302 209857 128370 -229191 25789 73855 164411 -218985 80654 -177736
20554 -191110 89062 2858 -41372 184812 -101182 -93086 107412 -213436 -321938 343625 -207283
20542 131430 -287387 -61448 63118 155144 -24386 198382 -113905 183559 -68080 -65755 125582
20530 -94618 24856 -191364 -20239 -174149 -333184 -161393 -197043 221101 200304 117481 -19323
20518 -148424 193231 28620 -53288 -154595 243820 -112377 -376633 107170 -86162 -14167
20507 -188904 171372 -46277 -218885 -165713 240037 64489 -169737 112185 -208306 -208613 -9213
20495 255412 334 -284876 -81924 -145118 -317597 -119874 -155435 -87733 -151844 -136142 -181704
20484 -181704 259734 -289133 178921 23523 -56194 -112094 144268 85860 -66259 -252389
20474 -252389 -147600 128030 82302 -100339 140188 -282286 58357 -75770 60741 320852
20464 320852 40905 -158270 12303 143290 77725 68010 148142 56608 219307 205760 -605
20452 155635 127530 467500 -20624 -16336 75226 -478977 -246469 -84720 102446 -327554 36383
20440 -5130 1226 -144437 21378 -221197 -47926 -322350 37875 -3945 220189 -93926 182715
20428 -29045 185594 -47440 -423488 150845 -147571 -18756 -74666 -422983 -339907 -194159
20418 -194159 147803 1540 229992 49323 -268313 -242704 -219559 130990 137125 -4101 -167498
20407 -167498 -88311 178709 5847 182036 -203958 98473 278476 -116459 -8982 -467201 108266
20395 116424 -266144 -64072 -96357 -360787 21162 30328 -132405 -143849 -77367 -226488 -123652
20384 -123652 -122155 -247155 -65835 -144164 -150327 -107438 162916 48279 -60223 -101879 1064 225828
20372 225828 188174 -75848 -144974 -147879 44088 42726 -211134 -210609 -141375 59108 -176663 132287
20359 -211192 -99454 -190356 -27638 -254948 -104313 -68772 85763 168852 -28555 69384 -74559
20347 -169792 -150013 -243652 -113263 -138378 -29528 -75398 -165633 -123802 92938 139957 -171553
20335 109222 76197 -126676 9974 -157161 9451 -116588 112245 -197510 -95726 -148757 -196993
20324 -196993 -215564 -196881 -141609 227716 -83194 -260240 195455 21374 135373 -12339 -243191
20313 -243191 2975 111652 198104 -34473 82997 -124943 -2274 -63141 86012 -136879 133279
20301 -78872 -126610 -46437 -129772 41636 -21180 -22161 112639 -367932 19179 141823 -237818
20289 93341 -244158 37194 -198882 -27425 -59429 -8628 -160425 -145008 -227140 -113870 -262474
20278 -262474 -147337 -269396 -176661 97518 60993 -155729 20106 47372 -98061 -115196 95850
20266 65624 -3963 304002 24048 -203599 -65895 -352623 207990 46641 -188673 -155155 -50424
20254 50885 -355423 101588 -495395 -151094 -170826 56077 -40109 -43129 14380 111288 9816
20242 82382 337318 -37080 -153591 -197541 -182937 -317658 -15187 -242023 -67537 -47551 1926
20230 175715 106530 194692 -187616 -112474 -391469 -153635 3864 -475501 67540 -256806 -203633
20219 -203633 -208170 75448 -181311 -200125 32176 4303 -240819 265523 -202430 -26829 -199204
20208 -199204 -169809 114604 175744 -165948 -368807 -171461 -40528 130308 -261103 87323
20197 31198 -162029 -336741 111676 -106520 -131230 88804 113061 2354 104361 18319 -353534
20185 -75398 -245995 -9105 -69844 -81852 32165 -355414 98426 -188980 -64614 -119790 56972
20173 -269143 151334 -115296 23608 -167360 -1177 8970 -22179 -379141 -273210 -39142 -108872
20162 -108872 238453 88000 -295092 -192151 125021 97030 -180628 7122 -11119 -140455
20152 -140455 252012 -183939 20670 -59846 97886 -84757 -242414 -2468 36890 -328731 -145091
20140 -45485 32417 182723 396275 106930 -352869 -433383 252448 -206733 61683 144160
20130 144160 -182861 26304 -290598 -56334 106851 -305302 47664 -73430 57389 -185066
20119 187580 -93262 -106862 -96342 -277900 -92845 54296 -26318 -83144 44567 -192054 -228024
20108 -228024 372553 -223179 -222113 71080 105483 -88421 300797 -124043 1380 169931 297817
20097 297817 -311212 -100355 -244720 -345810 198974 225543 -147526 -145430 -85859 -364552
20087 -364552 64136 -48347 -203333 -292416 128963 137231 -220101 -183386 114613 94543 112534
20076 112534 14370 -322936 -86935 -71149 -229666 27307 190474 -14277 -24683 -77540 185390
20064 34242 16462 91080 -10169 29036 -123027 200295 35612 101467 -44469 -125959 4452
20052 -57125 -285981 127134 314819 304900 -170493 -247900 -286945 -141782 98563 112106 -9917
20040 -115195 -299630 -173273 -400640 200522 -240754 122895 -493217 -158291 -340485 32981
20029 -49854 -200452 23248 21567 -92138 -172979 39360 -257826 -176861 123666 6022 -370750
20017 242103 129544 -147740 115192 95942 11344 -40809 221492 6638 -58279 -101253 -49322
20005 -311854 -78126 -80977 257183 86895 -527923 -143879 109140 276289 76822 -82522 260189
19993 -169747 28505 -268186 -180969 53086 198580 3414 -39990 221487 -297636 42634 -176282
19981 224986 -243928 134293 -141921 -48941 20629 -53741 -131524 -337056 172695 45482
19970 -95715 -271372 -136262 -4537 -61766 -354958 -34335 159399 -142741 -122096 -10560 -91310
19959 -91310 207787 107956 -213839 92431 -37542 38983 -241615 82600 114879 -67789 -202466
19948 -202466 -64557 -201720 -144075 59387 152953 -113665 -407416 -76011 -64338 -378851 -401061
19937 -401061 -70931 -146975 -88122 -223540 -158318 28325 -483045 71722 -389748 80843 29656
19925 -177498 -154209 -325314 -34974 -82763 -310142 -52458 -208968 -110848 101232 -71601 -43117
19914 -43117 -129983 -290528 -104344 -218112 43771 -160752 -239401 -205436 -40236 80922 -121472
19902 -91323 -5706 189490 -237055 74767 -161008 -8753 -544728 -48538 -81909 -64594 -150392
19891 -150392 -231300 349345 22297 89058 -2285 -85562 -60514 -79357 -176801 -246933 122657
19879 -111877 -258239 -49069 101611 -239404 80783 -339359 4853 -11113 -151383 -105330 -19241
19867 127979 -115080 14052 112193 -53786 -46409 48093 95047 -194716 -217780 -4716 64032
19855 98083 -218658 -87759 -49661 66952 -259460 -528220 -100668 -162109 -805 36712 -296420
19843 -107027 218641 -17073 221519 10356 -177675 -164746 102954 -115583 169568 -208597
19832 -96207 -102849 -12041 -142376 28307 266362 -241862 -212411 214639 -26700 -103149 121335
19820 -69546 -74840 119880 304669 -197302 -172455 -74676 31589 -94424 -136969 186315 88460
19808 -28824 -314779 -160663 -243924 -137295 166795 101060 255241 96344 -273280 148963
19797 143461 189049 142866 174141 -156381 -178461 106143 38422 -194821 91416 -41589 -297546
19786 -297546 40105 17224 -232068 -121769 7782 -189140 -38126 18386 -67998 4439 36230
19775 36230 251544 -189871 12719 238717 208881 -22536 -327752 55451 45190 -132649 -125709
19764 -125709 -131572 -82582 151361 -25536 -174635 108860 -386486 -170254 -69870 -288645
19754 -288645 -136746 100074 -172725 -70020 -417709 -28109 -369149 32836 -306831 -173328
19744 -173328 -89 -75719 -231378 -396649 136049 263634 -67418 -23560 -118017 -109538 -230356
19733 -230356 -60419 -27928 -15977 86641 -64619 -140811 21826 -162150 -64994 12905 34834
19722 34834 14655 -196997 -38253 -202488 -163378 343896 148572 -102192 9976 -81634 -197834
19711 -197834 317803 -11505 -168765 -121742 -75470 17614 23135 -183026 -178629 126915 168013
19700 168013 -403268 -74933 151736 -132675 108927 -136773 -158702 -71498 82768 -177371
19689 58691 -124612 -55628 258325 -70288 -24241 159244 113259 -181016 117155 -314816
19678 219418 91379 -30528 -275512 115931 -109824 -141002 205555 -170035 -294575 37442
19667 -199544 -8383 183704 107020 26016 94112 173452 -114875 218040 -252728 -47467 -121449
19656 -121449 -260125 -308045 64232 143065 250290 -190996 -227571 -53053 -82193 -41539 -224871
19645 -224871 39436 -263061 -191806 216620 254570 129132 -679 -167962 266664 243449 -167538
19633 -74772 -148275 25883 -290209 115559 -385222 -26104 -294348 4046 -67653 116548 -69787
19621 -188547 128611 -109348 65023 -1374 62378 -286030 -6381 273284 68206 61444 -188678
19609 -276234 -96434 -130845 -247939 81027 -52167 -149437 -171211 -58930 235330 17168 275128
19598 275128 97219 62680 209385 -229215 167306 162834 -54539 202118 198705 -182916 123766
19586 -68840 146714 -207282 -196183 52831 -80364 -87785 -112841 -165473 124781 -219003 224180
19574 -207019 -260317 184305 -229341 -48677 -111628 -232068 202758 -301205 -251563 73302
19563 -233377 74527 -106385 968 -25043 -205249 -310214 -276563 77842 -128151 26154 147151
19552 147151 -184180 161572 73332 21520 -220599 -15885 -53279 195684 -58370 -92215 -192957
19541 -192957 71494 67411 -443391 212927 47013 44831 196852 -211735 82843 -148224 -26244
19529 -170363 -395143 120009 119301 -105699 48587 -107038 -1647 -109230 7036 -57211 -229665
19518 -229665 -206968 86421 189636 -66602 -35049 -202587 12519 -259297 -196733 -6882 -191135
19507 -191135 -98711 -1732 -281123 -149269 139814 109756 67090 -107971 376781 -62289 -353984
19496 -353984 -247575 -237330 -185119 -16306 12751 -58565 393652 41526 -286971 -21169 -246531
19485 -246531 -225056 -304251 -355630 -323211 -208367 162601 111669 15643 -134101 42905 -464875
19473 56198 50171 -106743 225928 157201 134643 -60710 -47027 -77248 -139594 -47952 -12726
19461 372978 61194 46560 -165310 -102404 -161036 21842 -103762 -237705 140490 -326581
19450 -69623 -85601 -418430 33976 -195839 132606 -124118 -161761 -80490 -74905 -21109 -316728
19439 -316728 -303491 -48157 206162 -24853 -57024 -442957 318223 -413759 -442572 51375 -102712
19427 -47140 -261757 -257349 93327 -2547 255558 -108869 -131409 -126531 55628 98325 64339 -251174
19414 31585 239551 -66620 -198907 -168341 142675 125625 -256493 -130355 23731 -214989
19403 -54458 -210697 -78893 139060 90921 -168182 29562 19993 -20067 -47549 -141002 -99770
19392 -99770 43944 -196193 -244938 21546 121506 248788 62447 -212550 -103503 -214931 -126378
19381 -126378 -26445 -95892 19067 126555 6744 -123592 -129752 41876 42983 67544 -141333
19369 -175512 -262793 68589 -73709 -367431 39300 -235229 -59350 -157332 52968 43897 -261070
19357 -21845 -184241 -58293 9505 224356 121970 -269516 160218 -108967 -11031 -54511 191276
19345 97607 -92840 -69151 98856 -105114 -304220 -258649 -39203 52570 -144082 -271095 -1748
19333 -242455 110631 83557 92348 -363131 263618 -41359 -145700 42216 5830 121467 -68788
19321 -181581 260627 -85616 -277566 -207609 -41562 123427 -143269 -138547 144390 -290990
19310 5384 -34322 -81733 121582 -122757 44068 -144914 -49240 -125317 -87349 353452 -101432
19298 -42489 20560 -223612 42907 -282061 -51763 -230036 -500441 21595 -284511 -64114 6944
19286 -91601 -297783 -167152 36064 -35944 95669 -156199 -60949 85298 -347052 -72310 -29820
19274 115015 48111 56391 74807 132209 236822 15765 51784 -301002 -102034 -82831 -160586
19263 -160586 -212786 -292559 24435 201802 111799 227908 -408751 -203632 -86856 39076 157849
19252 157849 -68580 -193352 192840 95622 -391252 -26247 -68504 -90409 -113140 -35004 222722
19240 267975 -209701 -76620 -99548 -283765 -37347 -67802 -346918 -418516 -259891 -157025
19230 -157025 -165379 -338273 -333681 -3527 209954 -54731 215501 -152057 -172207 -188215 166269
19218 232587 139316 -384021 -329143 -15473 164636 -114557 -229854 1807 -184872 -28819 4944
19206 -141463 -186808 -116557 129097 -128717 -149284 -27944 -310123 70490 -264873 -65168 -96290
19195 -96290 14439 3380 -176747 41060 -107987 -126079 187101 -185614 -165841 352519 -272671
19183 231920 -245028 74553 -161867 158065 -180260 -269628 -448237 -40165 68934 148057
19173 148057 -241192 -366915 92039 109577 -89740 18237 60234 26977 -4255 -39648 -24928
19162 -24928 -92603 -94147 55467 -50705 233011 251371 -156478 41228 -112399 31856 263887
19151 263887 155223 -8508 -206487 112790 -175500 9417 100220 34504 -311934 -258945 -212614
19140 -212614 -70231 116390 21461 141520 -298763 -156890 -155976 87640 -84024 -32223 29035
19128 -104560 -334920 -113718 -202427 -188887 -82001 40781 -91620 -389990 16999 -365589 -236157
19117 -236157 -121896 -78588 -93251 -309817 -368131 -128859 166331 -97355 211568 -51275
19106 -197609 129392 -89952 -251768 233838 194624 80838 251599 -26665 -195415 300495
19095 52334 -271377 -159329 99043 94853 -123042 -147167 -35452 166840 11923 -363209 77607
19083 228062 -227605 -108451 449090 254133 -221094 92614 -59282 -80322 216396 -158114
19072 -3627 -466532 129410 -20944 -134901 -358434 250813 -231109 -65041 -230011 -139979
19062 -139979 -61981 -98127 41743 -185673 -48177 -419784 17340 -12014 132156 9655 186088
19051 186088 142377 -216803 -77503 30552 -99479 -237623 -97599 -97963 169731 -69469 -70228 189771
19038 -273683 135967 -33220 -75067 -426628 -133196 -137163 121878 174087 -475556 141888
19027 144569 158128 -79100 -5251 -62861 61820 -127010 55134 -213983 -210956 -215327 168101
19015 1439 5763 28001 -383867 41742 184825 -152972 -126116 -165266 -224218 254172 -283508
19003 134328 87166 -253163 -121788 360271 143491 140321 -173865 107542 -248664 -49286
18992 -170282 92859 -151125 353824 325642 -63568 -8815 70159 63414 -282379 -182392 150208
18980 156797 -37829 189944 -111903 56982 -9423 -52805 -18645 -237022 150902 -171629 33506
18968 108144 -210506 150905 -272086 -16768 178982 15617 -135036 23416 -291880 -24286
18957 34855 156870 -173604 120533 -49484 65859 -70335 -3576 -282788 -4790 318514 84 -109481
18944 -54941 253241 1323 49835 -126545 14548 194988 306930 10851 -32898 -116918 152026
18932 -87044 -78980 -158504 -125889 72466 166466 -91583 -190800 26663 -19859 -350315 102261
18920 379130 -56312 -49324 -185338 89225 15339 -332506 34351 -130554 -41918 45167 -111908
18908 -147621 -332418 77451 321433 -212648 -86221 1849 -526048 -278046 19348 211043
18898 211043 -73858 49876 -84951 201257 -90720 -75155 14474 -1327 -71117 -167853 107680
18886 -146656 145149 28547 -58129 -300713 -223101 3984 -309291 148788 11782 -74313 -246805
18875 -246805 45300 155621 34195 -92265 277551 -180645 36289 109657 18126 -262777 47174
18863 -72171 -227839 -120769 203920 -423761 -45898 -26294 -142037 198259 134264 323514
18853 323514 280 -209658 -310573 258238 -322136 -116668 255791 321933 -136458 -75278
18843 -75278 40674 238237 -74191 -20622 -244833 52420 -76033 30370 -58847 -416493 77073
18831 156662 -329501 -101385 135544 -64715 52048 161233 16217 -220800 -130211 -46128
18820 112021 107908 66547 16154 39655 -43126 27411 74577 39271 -161765 309025 69803
18808 430564 30962 -124490 -213589 160658 251224 -252506 -39713 -91241 -176488 -124408 -56447
18796 -92259 -268176 -261441 -228150 39097 -124023 -158065 -89989 -76146 -373135 96984 -53368
18784 -33063 13800 -54901 83640 -107255 44100 27411 -110556 287797 53326 19332 -310649
18772 -177982 5513 9659 -121827 -81363 7139 91991 115565 193942 -137253 188198 -1136 -105521
18760 -105521 -28125 155970 -53120 -278368 -379556 -131755 -24218 -348757 130807 126943
18750 126943 81207 204741 -17369 -69760 192712 213845 -333195 -352878 -72175 -275333 -45100
18738 107969 -240645 27536 -22583 -103357 177391 -379142 -291844 -217320 280073 464414
18728 464414 127650 -221658 -284253 360353 -423867 -36634 -127392 -71563 -100664 -358347
18718 -358347 3222 370306 -201494 107831 31372 -286223 90178 17889 -61054 -110773 74086
18706 -44843 -126740 -224759 256099 13141 220348 -228934 -121644 -230577 -166642 -57084 -164594
18695 -164594 -348320 -279171 -176612 49328 -295964 145096 57434 -222525 171593 142934
18685 142934 201748 -87225 6205 133123 -227208 57244 13213 -28253 105547 -295719 -165861
18674 -165861 -78101 -261972 48819 -16955 124895 -267109 -57095 -164048 -276553 2625 24505
18663 24505 -268377 7225 -186671 -40118 -149345 114138 15063 49521 6852 -78371 144169
18651 -114775 -222616 -17381 -122928 447807 -65678 30786 -269502 -37168 69378 -156298
18640 -29354 -104063 3768 -188348 -159891 -124709 -160956 -218451 29731 -62724 -119529 -63535 229931
18627 62048 -75640 -103423 -175129 -148449 -210916 258986 19390 -204176 -400109 11745 200830
18616 200830 90967 -342338 143125 -252671 49119 -323057 67356 -146470 -84064 178560
18605 14183 -152152 -313613 127379 -237020 -110584 -153547 11429 101575 -49717 -160595
18595 -160595 -87632 -50816 -248396 -68906 327846 28187 191931 485536 172454 212720
18585 212720 116630 15528 49885 199387 80403 71528 -75573 -147608 -10612 -95664 -107460
18574 -107460 -241025 -155379 -234577 -288771 -448980 -100943 11911 31034 375728 -232770
18563 -68414 16352 50234 105919 24370 -10460 -298416 20634 -56 101304 -218328 127378
18551 -26195 -545292 -54137 55364 -97830 -219806 157205 -36284 93205 -34513 -127512 206542
18539 91013 -77984 -100152 121296 251994 67573 205165 -63814 109450 -102877 151227
18528 -332685 -97128 -180832 -251426 -120975 196354 -184381 179888 -216445 -262433 9296 -39593
18516 -53911 -164462 -163246 -63368 -56961 -79660 -68354 -247720 -6430 -295990 -427289 163581
18504 334729 228420 -90569 75684 10088 -94021 -170244 -96002 -28655 -192484 13031 -205647
18492 -123554 -124645 -51790 -308369 -216988 28488 44376 -89276 -12330 -395224 37276 43020
18481 43020 -157744 205782 -133429 -91124 -265093 -181393 -103149 399391 -50464 -293665
18471 -293665 -90162 35557 -11776 -185123 -239335 -303877 124130 -183796 -367810 -147277
18460 -103419 40886 162357 526631 65235 27003 -108521 230043 -57396 -107816 -76286 16571
18448 -27459 -260417 -170152 -125578 214873 40033 -176947 323369 179597 -65706 -400998
18438 -400998 35916 -328188 17613 -16872 52812 -95861 71297 -107578 11005 -263398 -113848
18426 -29643 -190137 -6817 203877 135305 -78663 -138168 -2422 3908 85554 -13685 -195439 -226800
18414 -226800 -77729 80791 91197 -109746 38419 -84794 -110626 -38964 300893 127007 -363831
18402 141977 -51747 -46259 -185444 -182521 -226822 265364 -122873 35897 133185 -30138 448568
18390 -315788 -166192 -3872 -73127 43401 27912 -173386 -39264 46728 65809 15620 -100280
18378 17034 -543677 -329839 -237264 150069 220906 -161295 -232992 70337 -48905 -30306 -323167
18367 -323167 -75992 -75787 113942 39037 62118 73326 73417 294561 -79175 -35592 36673 111261
18355 111261 -126036 -88365 194335 53135 -77929 -210181 294915 -208823 39941 56674
18345 56674 179034 -31338 93483 69240 -3062 -204520 -47166 -495 89465 265625 84745 -204404
18332 -242060 -186496 321098 -241383 -178859 105030 -162410 139827 -24003 17110 99557
18322 99557 -115133 -152497 152250 16052 20958 -317322 -24793 -177288 -57956 49261 -51261
18310 -76240 -384383 109660 -283102 209405 -2603 241817 -160605 -329023 61029 -350927
18299 -79739 -208800 -169053 -6173 -172267 46801 -378295 -175354 187251 -544750 -40048 -68545
18288 -68545 -65750 58874 -290317 6517 101546 53735 2777 -440782 31363 -268592 -2346 -140792
18276 -140792 111032 -113748 281076 -38074 -168747 46851 -83886 -252081 -403129 -233883
18266 -233883 72161 -168179 -271744 70219 147671 -143895 198780 103484 -63321 -482033
18256 -482033 270853 258132 101058 44026 372628 251058 -118136 -321530 -16776 -36134
18246 -36134 244308 70917 2935 -383016 -173494 -54353 -75421 223516 84207 25568 193521
18235 193521 -12309 -188748 -49318 -135096 -8443 -242272 -7150 87626 140133 -51051 -198624
18224 -198624 -307394 189034 136452 111878 -345349 -118574 271662 -90743 26157 -258402
18213 60235 -28428 -170210 -32606 15323 75363 -146318 -122211 -152874 -273611 -345847 -218265
18202 -218265 110156 -101017 82103 185935 -158912 -6597 379234 170789 -87777 -233046
18192 -233046 10532 61790 -190012 -367594 -447237 25941 192955 261718 -75725 86210 -155047
18180 178949 -27947 -144359 126134 134989 44643 -316096 79630 -108845 -132837 -121513 -143076
18169 -143076 100752 158983 27615 -23383 -225282 476 12297 92 263581 -259569 213828
18157 101118 71015 -233727 -179137 -57380 144637 59930 -172459 -69083 243831 -96885 -145427
18146 -145427 218832 324039 -370916 -219656 -80992 -144267 -70020 -110903 -99011 186650
18135 117189 -21832 15962 -156373 1058 -193296 172283 -134749 -264657 -128106 247797
18124 101568 79178 40102 -97594 -135796 -19669 -107427 -149890 243629 -133747 295334 45292
18112 -121410 -248177 108801 -73338 134015 -173470 -161314 -163094 92544 152658 -38790 -141798
18101 -141798 329657 -204376 -57959 54830 -280464 -354288 -38833 -122927 31323 -122769 -97870
18090 -97870 -44184 39877 127837 -119037 206657 -229829 -168186 133873 -4127 99902 -121450
18078 -94431 -267155 -190587 -62976 -159326 33504 -15849 77798 -90142 -78675 91829 -125622
18066 -195802 220371 -61335 -197065 -227833 -194758 -64815 -171238 -64922 2445 -53901 -100578
18055 -100578 -29937 73706 326633 26490 -18011 165423 -126665 12638 265078 157114
18045 157114 -80303 -86878 189950 -13146 -106256 127532 210388 207585 93208 -118685 20758
18033 -62084 -173678 -4969 -385855 77081 -35963 -8918 51023 67348 -67449 263 -219974 -107432
18020 68234 -37534 -209873 -222147 292652 -132196 -46632 53647 -41509 107731 -136351 218738
18008 -94331 -56347 25229 -112175 -273645 -146573 69984 -214446 -137459 -215928 -116070 85065
17996 -117696 -200287 -176667 15449 29637 -257700 -176369 77850 -86181 47053 -95970 -127842
17985 -127842 -358708 10526 156711 -254819 -117103 -108397 -4574 -89606 166705 -469 42274
17973 113926 173115 -250022 -150207 13423 121280 -118013 117415 268935 290671 -14048
17962 50199 12673 64487 -180741 30462 116532 66935 65376 -189158 104659 -195293 -267967
17951 -267967 20102 -316482 -106525 -19191 -91637 -133462 -147880 -51316 -274655 204789 -32494
17939 -68281 -157024 -70680 145418 190003 24306 -226799 91537 -115776 -222670 -310748 77527
17927 -57225 104927 114486 -8412 87261 321437 120237 -43910 -129227 283701 -286610 234691
17915 61591 -185967 114781 213215 173312 -84326 18174 143053 -41591 -120647 224090 124631
17904 124631 157225 -49631 22861 -109172 -38593 -262558 -185317 -180667 -11256 -142555 -51417
17892 93146 -118676 -27128 -375585 80856 -23829 78649 -102560 144164 -147474 -95051 -140897
17881 -140897 -110357 50251 -298418 131159 74660 234142 -8821 11343 -129949 58469 183205
17870 183205 122871 -273633 241487 -241892 156319 -46358 -14537 65371 -207630 210805
17859 12292 -22280 121425 159617 282240 -129071 -376852 1598 -453121 256625 197781 64013
17847 96900 -168065 -114801 -61732 143510 71506 123528 89380 -84159 13879 60114 -121255
17835 -201237 129119 131543 330185 -67104 141731 21318 323854 52788 54102 -123181 41576
17823 218198 82668 -36028 -6828 353286 174994 138911 81683 281423 -190360 63270 75869
17812 75869 -274451 -108908 64521 904 5774 324886 12018 -4764 255409 -15342 239387
17800 -69877 -79723 -37030 131982 -180526 -103111 -195513 -155910 -254610 -233966 14763 45544
17789 45544 141035 385136 -54141 183908 -198280 -227713 -121417 -278677 292540 -215203
17778 -166817 -202473 -115101 52201 48034 -97999 9259 -36038 91990 -153293 -3294 -263286 -143498
17766 -143498 -217633 -49153 -19416 -236413 -13646 -3305 -134238 -171616 83837 109922 82582
17755 82582 -149735 -212234 -184327 -132195 -47067 -109210 204938 10693 166863 -88593 192146
17743 -234441 -67516 -120944 -79588 -458850 25451 -264365 -177039 262663 14638 140776 -73139
17731 255261 -471365 -118842 -148019 -152496 -127292 85519 100950 -183671 1636 -249564 63002
17719 -122238 -33209 78042 92439 -448374 161601 -175914 161192 -13068 -316233 -151506
17708 160932 -12512 -39739 83907 94623 -19299 228098 49840 8513 -70595 -40412 -22031
17697 -22031 -52172 93543 16105 278469 102945 -72850 2063 -530436 174062 -43399 220027
17685 -133260 339315 19270 -40020 -3335 43400 -5145 222144 4334 -130475 224616 290533
17674 290533 -327160 301830 88979 69035 -301928 62842 -140322 1977 23070 -102597 -134358
17663 -134358 5470 -184820 74357 29144 97362 75124 119726 -24809 -145817 68586 -67382
17651 -169422 -320587 -45202 79162 95448 -393232 -6694 -151919 185848 -96431 134437 37420
17639 -165505 -85763 53947 76049 69750 -111478 349522 260902 321081 161026 -115341 459369
17627 -417436 -129758 113648 -101022 27982 236453 -126313 -64115 -38143 206062 196930
17617 196930 115515 173257 -78088 -25724 -58133 342818 -158411 -24504 49255 11529 -8770
17605 -84902 96659 90139 225826 181426 -15535 -10225 -340347 -36547 -84697 232042 32543
17593 407536 5860 121774 -96603 404900 -196244 402288 -159986 105831 109817 125828 6592
17581 38615 61911 -8961 88214 -138270 78220 87736 28968 228643 -14767 123660 149981
17570 149981 -71813 -65741 -191750 -52575 344179 205648 -274677 -230862 261288 138812
17560 138812 167075 15138 57544 -94291 -57993 339145 18095 14637 46454 464411 182092
17548 196967 -125172 182325 144880 33695 -194883 75537 -123740 -268159 -91388 45182
17537 175608 -44197 -153676 284982 18372 66776 269843 -1780 -155802 -95231 27430 182795
17526 182795 160839 -35085 -36311 168269 -2782 -382997 -53742 437317 115206 290061 273010
17515 273010 -194007 19438 202084 84706 -24952 204671 249665 173166 117544 221669 -40692
17503 155919 253681 -75024 228022 358384 -47364 186720 45832 116406 152117 434941 16727
17491 42299 212108 67624 -54629 -83140 194618 108932 24883 -102989 161886 109350 -36058
17479 141313 108550 196420 -3799 131753 347386 -123492 172445 66605 258029 -32947 260941
17467 -84092 -153665 -127752 -104507 43428 243445 399444 -33660 66359 151156 139527 -89058
17455 113119 290798 280953 -36465 212411 93079 400880 188366 331831 248549 317369 76480
17443 348676 55950 474732 705026 448712 316568 5227 -26802 141940 80442 409848
17433 409848 147412 232078 347222 187394 396407 291423 -55625 248625 540118 126071
17422 299007 289641 299710 288491 229143 408741 -21580 537331 372976 246669 107160 -111210
17410 183058 11878 243930 -85377 656470 393988 -183324 -22432 77658 202694 196727 69997
17398 303750 -89997 -119028 24075 171151 5927 366995 350115 194708 -283073 365813 135209
17386 59351 376007 331549 153726 -46585 161047 298968 138475 -269126 150471 -568 131159
17374 -16157 112203 331099 80062 102445 -121890 204722 -86995 -26444 -168692 187802
17363 -20346 132949 189990 234461 314639 -63490 36683 131904 77351 -152562 72307 392165
17352 392165 -718 244900 -149621 367741 70082 -5496 -258035 183347 222514 325944 -78260
17340 124932 417660 250203 216569 283933 -204284 -60350 -6934 305526 -83687 342688 251807
17329 251807 -30309 198198 504825 216613 656079 8528 252785 114435 290528 137824
17318 41749 -134726 39199 266332 140893 35039 115276 427873 275915 282419 42701 -159178
17306 93580 84679 410614 -4014 90967 550244 52677 191237 -73129 -93988 130881 426051
17295 426051 32848 325159 242425 145872 31982 232192 -59894 362950 269323 -10906 62633
17283 50438 321159 161395 182148 231491 273040 165908 273636 42954 251276 140258
17273 140258 439147 281076 -221856 -28444 36874 277771 33443 83041 194372 244913
17263 244913 242181 425205 370244 268525 318822 143366 100518 -114782 -5027 209452 245081
17252 245081 8190 290549 327562 228296 318303 190433 227860 306793 396298 56889 287771
17241 287771 422750 107206 250011 13483 -16994 168404 149123 476833 -18183 116137
17230 326047 218704 390921 31461 144849 118142 207222 327409 178450 46833 -46777
17219 262389 24733 56202 370020 289664 194285 495522 311867 -99477 107726 131348 54459
17207 190387 351589 96201 262510 356544 183205 150870 189975 145251 117220 356528 58163
17195 431773 -3655 559588 174295 184438 -111861 265577 126504 413541 142237 163633
17185 163633 198249 271764 413031 100285 -25395 148483 228895 481053 -71470 192310
17174 224786 369112 448681 123434 369203 466447 132954 216531 435775 568171 430906
17164 430906 141708 163888 366247 243398 453458 363583 -44722 412612 259988 239048
17154 239048 386117 266600 489908 211941 304288 397204 14358 345105 246352 535556
17144 535556 283270 49119 296285 92209 -58756 230469 526158 526195 198684 245123 234487
17133 234487 386179 419024 116115 465459 404062 237223 400711 391947 433268 224106
17123 224106 265781 721029 354953 635552 494642 161071 136085 184329 272896 272146 390287
17112 390287 281220 56487 275119 273053 412469 612283 466595 463300 244781 56802 175849
17101 175849 266075 356364 638207 323850 409830 463473 483131 424729 424461 394110 266654
17090 266654 435976 510413 583080 547057 728696 246084 544599 364271 352154 193193
17080 193193 115602 -12237 419853 554417 368662 375702 440607 532272 456178 455610 535970
17069 535970 680401 808765 512743 641321 415873 363949 477346 559164 575352 444265
17059 444265 726857 637083 769674 315204 781055 535912 62790 697551 422272 507124
17049 507124 530275 660743 582324 663378 425245 841269 381137 224764 428680 383708
17039 383708 634429 692763 488700 440334 668765 661896 422786 298633 432092 429107 332188
17028 332188 504548 544135 604328 566208 691563 558247 703932 698224 523544 553837 351082
17017 351082 535322 712634 918000 696681 665459 950048 297294 713027 583240 803533
17007 803533 631846 622651 995172 932308 706179 923020 658804 458342 607295 811474
16997 811474 628409 781161 1131855 778463 525487 787140 1089285 409992 849455 1123560
16987 1123560 782686 829851 750379 851270 731564 816358 671850 710438 967361 775683
16977 775683 690321 864963 850877 835436 1013098 999934 664037 1018660 803050 845483
16967 845483 781155 1022517 965097 922910 586956 727342 668827 998768 885344 588055
16957 588055 877425 994745 1268100 872451 863994 1031063 978131 633883 788074 844906
16947 844906 874553 1059957 1288194 1000487 1039786 1103267 1076620 1079704 1048142 853563 1159279
16936 1159279 1085177 1201653 1046889 1185115 1299999 1184579 1136082 1182645 1325266 1555741
16926 1555741 966110 1388295 1341541 1141668 1296835 1404879 1613935 1145565 1125095 1352788
16916 1352788 1492487 1240091 1345834 1370554 1500626 1396282 1576589 1504708 1488755 1307714
16906 1307714 1718565 1472389 1629881 1484569 1678456 1361815 1574254 1804792 1880339 1653661
16896 1653661 1482829 1945212 1503393 1795436 1526436 1617983 2050255 1782933 1537172 2028672
16886 2028672 1855566 2028281 2354997 1900638 1725566 2082527 2268488 1914728 2032428
16877 2032428 2144646 2134242 2063885 2397250 2210250 2510412 2331744 2439757 2599317 2405235
16867 2405235 2603139 2946035 2455116 2700245 2489298 2303331 2504877 2633458 2570546 2998114
16857 2998114 2596918 3005236 2890449 2722474 3160671 2853859 3087115 3048482 3573413 3215735
16847 3215735 3552623 3446190 3348077 3258635 3520589 3876116 3679843 3271992 3737865 3670766
16837 3670766 3851765 3660286 4108238 4133963 3838083 4059618 4204304 4450353 4125418 4235196
16827 4235196 4401509 4701432 4686643 5011527 4727907 5090977 5010874 5147714 5152924 5317206
16817 5317206 5613968 5520348 5539010 5695863 5913642 5884244 6352548 6102010 6288846 6478722
16807 6478722 6518044 6590628 6933680 7289699 7423415 7662952 7628124 7520267 7904630 8185425
16797 8185425 8116968 8574427 8978513 9021173 9196979 9759646 10205280 10389951 10481176 10438712
16787 10438712 10948748 10909250 11383617 11710737 12213846 12453313 13014878 13394750 13555194
16778 13555194 13987613 14527940 14738878 15482605 15828167 16544254 16862094 17420637 18129549
16769 18129549 19102952 19574852 19930109 21036460 21603601 23162013 23261790 24576745 25527660
16760 25527660 26715840 27667958 28903575 29831178 31687776 32833322 34609506 36202875
16752 36202875 37883793 39870167 41808402 43996843 46145675 48687462 51058592 54160870
16744 54160870 57207057 60391132 63935896 67746658 72144941 76241839 80886057 86221711
16736 86221711 91685274 97480665 104108674 110287955 117448395 124830057 132817080 141028535
16728 141028535 148841834 157598153 166197380 174182391 181673408 189026068 195115629 200803504
16720 200803504 204345372 207148240 207925607 207538135 205540360 202029509 197259288 191176948
16712 191176948 184587136 177161595 168972963 160545298 152035622 143482517 135298139 127094493
16704 127094493 119169108 111991338 105157283 98504274 92366729 86724114 81529633 76278037
16696 76278037 71986678 67573794 63676310 59771765 56736493 53435440 50732754 47726299
16688 47726299 45217756 42811186 40923580 38500123 36876937 35018287 33367573 31707392
16680 31707392 30487158 28882600 27949861 26694274 25351919 24413538 23400800 22110340
16672 22110340 21625754 20650244 19765603 19466599 18159371 17650013 17290143 16592580 15907244
16663 15907244 15483803 14797727 14217196 14071390 13291199 12923759 12328891 12360527 11913432
16654 11913432 11559148 11019257 10831813 10365050 10228342 9798762 9640402 9203137 9310234
16645 9310234 8945078 8810999 8207842 8338668 7724814 7783442 7931417 7183583 6960796 7137586
16635 7137586 6694819 6820145 6750423 6607570 6113815 6141345 5778582 5892804 5210425 5416976
16625 5416976 5364816 5375805 5055636 5168814 5005382 5052999 4460067 4653556 4868444 4400796
16615 4400796 4422273 3844778 4164455 4150588 4151025 3841910 3796953 3949520 3823984 3683619
16605 3683619 3586775 2912718 3352942 3538373 3237040 3206157 3257090 3129773 3126766 3130601 3135070
16594 3135070 2718311 2763947 2660993 2547864 2710353 2634260 2363741 2926857 2502624 2498744
16584 2498744 2397445 2337088 2165682 2238398 2089383 2295558 2320208 2064260 2355467 2237509
16574 2237509 2055252 2036615 1907294 2468474 2117716 2370977 2075800 1821308 1774668 2065471
16564 2065471 1761066 1910252 1940765 2014192 2007601 1921098 2085368 1755542 1718151 1531070
16554 1531070 1646508 1716228 1391280 1398371 1506452 1440810 1757781 1486490 1582973 1837257
16544 1837257 1486659 1803062 1732850 1542076 1361957 1326903 1198289 1403938 1492002 914220
16534 914220 1288646 1110491 1199867 1166624 919430 1079414 808235 1403893 1372753 989884
16524 989884 1183394 1306213 1044546 1122683 813915 937467 1258350 930397 1107241 862844
16514 862844 1012164 955092 639733 805747 1210768 828716 1103860 971316 856513 968500
16504 968500 757433 880025 668995 698192 1130581 487569 715580 691912 953329 847025
16494 847025 704837 1046755 705992 550519 840451 637616 604123 864301 405483 848219
16484 848219 1050127 880132 656109 712673 468820 522464 887697 907004 533553 654705
16474 654705 446563 1063630 849199 690509 865208 433418 417677 182053 742285 580650
16464 580650 768201 496706 286236 812375 670180 932518 756083 732252 553091 954323
16454 954323 536999 557833 370669 336785 359147 879064 416267 530302 366378 442168
16444 442168 491243 623543 339805 377249 492226 458490 254649 252905 632005 328360
16434 328360 296823 393624 477034 390776 436950 502288 474596 421797 404532 391660 115103
16422 611425 133739 117290 275628 365103 592843 676790 100279 420278 571860 447154
16412 447154 446747 591661 276558 474618 460251 294081 285566 168316 439585 205540 273047
16401 273047 150468 321364 64424 246508 834227 224449 525754 153392 404732 486557
16391 486557 287992 393070 295374 304753 237089 351604 379451 139605 144722 243497 268575
16380 268575 589372 277222 352973 403797 118484 423437 329058 213334 44365 265329
16370 265329 152923 457106 -89437 107496 290634 239974 476539 -100702 221806 396346
16360 396346 8737 164540 192558 302173 411920 506379 381823 70170 287357 290796 59242
16348 148073 -32873 441013 58562 163972 185215 -4521 -59299 283497 466091 302157 118513
16336 239776 -74552 96669 70592 199169 73262 182605 47299 122530 248676 165736 95308
16325 95308 143689 -56863 -24356 41317 445640 549964 77890 242853 81231 -20761 219583
16313 200108 120559 39289 232115 298823 358120 234873 365852 307246 421219 -68441 486474
16301 82322 265414 -4145 135812 255388 355261 175365 441905 297476 363504 421262 105976
16289 261983 40267 13037 81886 45416 -167997 -40754 147871 306148 237354 188139 145812
16278 145812 178001 412442 231319 -189899 39248 14060 405224 44138 124767 247530
16268 247530 63680 140011 143008 241181 -84822 230341 -226425 202261 -36865 -242854 -55574
16256 65744 10638 -164539 180747 19168 224399 -3234 128782 117119 364496 21132 82881
16245 82881 269516 87401 -55386 -162017 360426 143617 284548 70362 -284972 126835
16234 38435 268197 -174293 175544 28514 219364 411331 -17997 450144 106184 100551
16224 100551 -98369 155189 7162 -248997 81000 -11311 10520 69727 390776 42580 204329
16213 204329 191473 106626 -136226 21745 -67011 88999 -504480 48330 152869 -227832 -173395
16202 -173395 -15697 317465 -54368 -191570 -130981 155780 142845 59989 -207982 220854
16191 163041 94800 118490 67705 76888 125058 227205 209145 -242740 -56784 -309836 -152204
16179 298099 47912 26267 -360 -412077 269578 48753 54054 -145872 196636 -26888 247837
16167 -110637 217627 219290 -154014 48649 21528 -264747 110781 -121988 -156119 -128895 335146
16155 -45131 89939 -180655 92117 127703 -24400 49909 -544351 -134839 51646 21333 300711
16144 300711 -90305 -86473 98088 115632 18534 156350 -61089 106386 230522 -209084 -129089
16133 -129089 -18053 157211 -30600 -64801 66544 -93586 -194236 209937 -56559 71234 3950
16121 317690 -23385 9845 -32390 -358423 -68673 -412572 -114673 -67445 -102688 -37564 -53169
16110 -53169 116588 7278 114040 286365 236017 -4030 204521 119472 -105355 -271239 -135
16098 147749 110975 107025 345266 -235317 -93995 97143 15125 -245963 39940 187949 -136989
16086 -44526 -52863 400429 -154909 7704 -31621 -15814 -221165 16920 -146622 -99908 98558
16074 -42971 -73587 -103838 -187212 107723 -75485 -13630 46953 -97425 -133774 50773 199382
16063 199382 -179808 -219901 -17650 -110027 -218654 267716 434905 -57966 -21405 241159
16052 -103014 50136 37202 73581 159206 -96989 72636 29687 -33735 170657 100584 -183458
16040 143474 -59518 -127586 6014 130099 24522 -201544 175340 -51098 -98719 173432 -11328
16028 80485 -85162 -163227 76592 176905 -19778 -150866 -10922 39794 -119056 415065 110457
16016 -78367 -30311 -80519 353495 148231 164661 -155452 -72045 -7796 -6544 -185377 52337
16004 -239760 -88478 -14070 314603 -341017 -154277 -17768 39206 -76055 223988 39687 17099
15992 59752 113844 -78184 -259733 -238133 214337 181643 -385730 -118093 98255 419378 283558
15981 283558 356394 303175 140635 230626 -94495 -169947 -139925 -103608 85665 89302 -466873
15969 320280 596 189353 -221308 62621 90786 -16073 24649 -59419 -132694 -460541 -116916
15957 9945 -32306 -22581 73744 -74483 48903 -225319 129934 487888 -189285 -205096 -72644
15945 -152666 324174 84167 101422 -464164 -123037 -178254 199426 235334 -209812 297051
15934 51066 -221493 -87819 49286 -14412 -215051 -244510 -94309 -248313 -216558 -55229 1440
15922 -206467 -287132 96446 13749 -39945 -81433 54908 -318130 -243567 -23675 -222958 21688
15910 -238877 -186252 -110069 192338 178185 -277027 -193751 55156 71863 38308 -161867 -96366
15899 -96366 -17020 446892 32839 -194579 183149 16170 -119607 15889 -195751 61399 95572
15888 95572 -293437 -304748 -83674 14606 223014 167314 81846 76801 196616 -149139 90402
15876 30062 -145393 -19576 -138010 137969 -222197 107092 -75215 -129384 -228742 -343183
15866 -343183 -200867 18447 -192048 187948 23088 107439 291563 193254 -68418 341672
15855 272691 -134498 65450 150722 61611 -53169 -119483 -195813 -45996 -361313 10119 51042
15844 51042 -4885 -208114 -220435 -135916 137506 53260 -207383 400577 -115750 -120668 -210159
15833 -210159 288550 -223386 117772 -80751 -212772 -160155 134041 84806 61990 183390
15823 183390 -241134 -393717 69618 -159929 -88914 55725 -8140 -37119 -263320 -129083 68409
15811 -6301 -392768 51501 -215236 -148881 -131830 -100921 -405871 -60240 -292687 -38385 -110336
15800 -110336 157927 84233 100502 48494 148223 4833 -171020 -278302 248116 124046 -357846
15788 -256518 -324327 779 94405 195247 140822 -148529 -28723 50438 -73268 134517 -96819
15776 -257139 -81591 -6988 -98267 184233 121166 -161216 252999 -48016 98782 -220947 4835
15764 169591 -373763 -153446 92976 83457 246294 -194962 15359 107900 209120 -25392 58808
15752 48162 11692 140113 -215459 99394 94634 -56177 200160 -158685 -73950 -192970 187737
15740 -153344 153125 -19189 108650 -99589 -395303 -16310 28631 287982 40533 109080 252932
15729 252932 -308622 145893 171368 -238035 -81498 -60827 -201409 -289684 163695 239715
15719 239715 -59512 -18056 233716 -81305 25821 235457 74427 -378235 -10565 -44868 56314
15707 110671 -128475 -168488 -209876 -25838 11952 -145163 285923 -120315 67836 -266683
15696 353738 46399 -117767 188960 -74068 121241 283701 247684 89672 -75123 176404
15685 -81721 -245770 73540 103204 -225086 -51779 -188255 -143046 -2145 136237 233569 65865
15673 -105500 -135842 -77466 -549 4087 -276903 49534 122981 187030 -6874 -133300 82275 24052
15660 52371 -137293 -119387 -52741 -56618 -143257 -113123 -276601 -11992 -84335 -98903 173499
15648 157148 296213 -193708 -184952 125871 -30297 -81420 -355663 459217 426776 -43156 -126050
15637 -126050 -295814 121489 25418 64043 118013 -381496 -251259 -185238 -189445 -124806 24540
15625 13794 -4652 28818 179777 -320327 -48800 70509 174514 402270 64680 109605 3253
15613 -215041 187440 153232 -158044 221982 -213982 232086 42432 -52109 493259 29204
15602 180064 -257701 20361 -85482 -237689 -441885 -63128 -128974 229670 47073 29878 -118603
15590 -103408 -150643 -156590 -250513 297051 -226511 -64525 41882 -129129 287543 -40005 -375535
15579 -375535 244433 73255 38648 -31863 -26598 -46666 -30243 -91832 33498 -163038 286175
15567 -121914 -88989 348353 -310925 -139875 -186967 -224633 113458 22832 131225 -15568
15556 31504 -297026 -27796 -126255 40128 -50132 303900 211744 -141413 -352350 68157 37667
15545 37667 73123 -207989 -123849 -168645 -47799 66066 148687 -63204 299576 215828 -138434
15533 275937 66630 -139444 -36587 17062 106020 166226 -140469 -94006 -19476 12784 -16092
15521 -103776 167701 -141607 65338 109830 131900 112333 115749 242167 -169076 108170 -12034
15509 231246 -283961 -12845 26794 -46532 -228846 312091 -35675 -41095 -212907 295083 128165
15497 -8934 377723 -59278 -73618 98452 58866 115687 100265 -90840 -270787 -235440 -22515
15485 -8463 182 94905 -54714 2098 -172714 -59646 -124244 -94516 131327 357107 -273916 437120
15472 79635 -114701 1492 -136409 -31332 303887 -25906 190152 59927 151435 -155739 236427
15460 -58504 -85203 105841 28135 91043 -133371 208043 -328602 19278 308364 -78227 -93979
15449 -93979 -288747 153076 -160966 -86503 17658 -355911 -84803 -130276 220976 -176219
15438 176583 307334 -38623 -20738 124587 -200212 31394 -159720 127912 -240630 217401
15427 337862 85135 -244888 -188334 -362957 -545350 -95020 -257473 28083 -33746 95280 201356
15416 201356 72704 344976 191440 -215760 47525 -66271 131540 -33351 -330093 -73353
15405 -27165 148934 309762 -65156 -88701 -175510 52757 171082 -68126 24190 -307352 106777
15393 107513 -151830 223341 244055 -134013 -83393 323708 -195598 77404 -20770 261228
15382 -182025 104843 147026 2879 92564 -319869 178811 381427 -242808 240176 -5717 -234645
15371 -234645 4811 -135662 180612 -60028 -18993 -173510 -260298 96676 -6231 -136426 -200376
15360 -200376 -57220 156043 -83258 -140916 15139 126360 287332 -301381 305893 162601
15350 162601 281201 -196432 22699 188877 -20347 -393456 122355 59697 13516 198246
15340 198246 85358 -98844 -235720 136114 111492 -217006 -291788 -82911 296344 76835 -29738
15328 132002 -74472 186860 23080 83277 4667 396401 -116606 121948 162063 77312 -1980
15316 326183 83305 137561 20598 93565 160723 200036 -8320 24275 -50237 241249 -97194
15304 28236 -31665 89298 -122170 29833 147122 263100 -359951 85406 82733 59780 135207
15293 135207 171852 78467 147878 45616 5004 -69953 -112208 173010 -665598 -44445 107772
15281 42838 -124497 2754 -309480 277503 -34080 27486 -121459 -15489 285042 -122131 382540
15269 105526 -49992 291774 31011 262705 57260 155235 170980 1778 68131 194484 435013
15258 435013 -35918 447229 102075 187728 401858 91816 79173 227986 318909 807045
15248 807045 1432636 1553707 977944 1231261 399613 39539 136025 189705 151844 -4300 82864
15236 -72535 211500 104943 -34970 -144558 132659 -54007 89263 110091 296792 -42615 324820
15224 -143198 28916 -14371 128545 199954 167794 132421 -21322 -100490 -65926 96582 125267
15213 125267 7715 -30045 233372 -37725 49761 -26573 -9943 -112198 96606 -22737 -88166
15202 -88166 187731 122785 151657 240309 150841 121381 294182 129679 -282720 142875 100849
15191 100849 -147090 -39139 190755 210900 92507 182779 -447189 -71183 -205942 -15230 179277
15179 -87036 201776 -112096 -201799 -19600 -5362 -171721 -88788 -23902 209843 322546 94189
15167 -157442 2363 212143 69829 -37543 21995 131683 105063 82451 188323 115090 248429
15156 248429 228082 201030 220549 -226876 -169626 291194 202741 114073 170172 63966 166591
15145 166591 171475 327431 158170 91444 331808 335848 -72445 -91949 32393 370079 23241
15133 -52480 140782 63170 64591 446458 92340 121622 353880 227787 -32015 217647 413290
15122 413290 81820 381867 -154781 139688 51235 48104 61697 -78357 118381 345261 233463
15111 233463 -36482 -121702 316020 284050 -72197 214487 179171 62079 101411 130831 391177
15100 391177 -29201 151047 247147 -34730 226679 87392 237081 315490 -76201 -254410 242597
15088 326896 235006 294574 -196875 90840 184140 160476 -261245 8389 54559 559721 -126941
15076 178357 -139247 187435 448624 591167 439466 138049 -139087 243725 -191599 150501
15065 260348 386023 225074 15510 274759 29478 35599 -1935 237275 -61265 112161 -232909
15053 -4584 216456 337859 37750 379589 151846 382469 -155471 248979 291606 50383
15042 -12604 76610 -44743 120602 27942 404701 -732 297437 213154 546173 -18442 346564
15030 345357 418984 53722 344442 291858 10965 184564 154404 51824 333672 -83630 194062
15018 182207 189883 192548 226261 406760 177653 512457 499840 181222 31746 185673 278085
15007 278085 86430 283059 126630 273291 149775 476031 83016 275416 216464 282041
14997 282041 277444 48261 169637 396154 218770 310937 219876 243989 126477 85156 284575
14986 284575 -56090 308659 165381 247397 307789 340573 364308 232311 307190 -116744 477757
14974 661469 305458 172220 96984 45469 84496 70987 193225 448262 416612 343902 148867
14962 101632 43231 429726 377647 59091 146079 146895 446013 223222 387625 103822 3512
14950 47787 -13033 137890 449157 331550 150364 286858 189795 181271 381163 154706
14939 218846 508435 30200 23052 278746 317485 396453 106302 496614 -42018 24406 340182
14928 340182 452954 338390 443628 350556 308925 188078 274442 291254 452810 156140
14917 165303 637501 167967 478870 277619 264050 376773 124264 291962 65508 604599
14907 604599 123133 327103 405665 429530 340649 467640 263348 228405 208957 317380
14897 317380 323495 40870 -19784 385713 543466 331031 386065 441452 339841 420822 121675
14885 468257 542858 346836 522283 450025 502148 344985 384919 718704 210200 207011 474214
14874 474214 236305 224357 636364 679744 350094 376952 654147 402487 239651 302551
14864 302551 425075 487720 265548 138657 644798 574428 579722 259857 426109 814707
14854 814707 468764 603897 417254 611493 747232 405807 402301 879908 163166 379778
14844 379778 601518 679302 773665 239517 282491 41410 438166 332166 457454 1012704
14834 1012704 492926 376572 392846 450984 373793 618908 530865 643954 427775 222365
14824 222365 822847 640278 389900 486857 297952 373821 329011 449175 484040 464068
14814 464068 557961 611803 392511 555144 432869 793289 378245 363457 731616 576946
14804 576946 456186 741619 409046 411050 558874 419904 353990 972555 346528 457057
14794 457057 566128 584332 802942 504772 591446 684017 658630 825765 682819 572700
14784 572700 564064 432964 488965 478472 706148 331658 728627 649651 717767 365302 191509
14773 191509 668231 680289 602654 383834 707532 741359 806141 473605 319266 770832
14763 770832 494827 872733 732309 876247 506284 841066 614621 748023 634566 507425
14753 507425 527754 609169 855131 735566 731455 686098 699263 819241 500051 911800 891679
14742 891679 974827 797856 905793 773030 659465 968193 648833 858660 506922 606498
14732 606498 623834 1092273 762443 471961 869375 908137 708399 624672 385183 745540
14722 745540 704283 963391 616422 1142624 648974 985355 643769 609435 1248850 173736
14711 442270 497885 689408 647118 959765 928186 738023 806418 1194126 1004344 1042374
14701 1042374 1096785 1084406 1077947 955258 481767 908649 871988 777614 1217805 598734
14690 982874 921661 1105394 1101855 966898 1258310 968201 1318947 1003305 918225 963539
14680 963539 802813 796097 689531 1293874 915909 683278 908633 1229780 1063475 865686
14670 865686 1022291 903979 1204676 1291795 1040992 1017141 751417 1086160 1235643 1039379
14660 1039379 978597 1295778 995164 1012210 1250476 1187726 948576 724832 1279210 984305
14650 984305 850301 1392226 1320383 1206787 1188511 1305453 1503360 1259595 941831 1165589
14640 1165589 1323168 1231279 1458465 1199882 1271236 1556350 1015367 1204651 1284762 1523741
14630 1523741 1409870 1406282 1625170 1291824 1381651 1303189 1294436 1514920 1313562 1317782 1414636
14619 1414636 1229490 1177547 1383199 1623643 1545651 1678815 1928785 1613706 1108394 1200630
14609 1200630 1331724 1679228 1945428 1608264 1537892 1562002 1612412 1558131 1305617 2004718
14599 2004718 1429827 1980717 1886180 1558633 2057459 1913012 1781449 1849178 1751178 1648675
14589 1648675 1724897 1939250 2138827 1509146 1793694 2147591 2000346 1663469 2202673 1916276
14579 1916276 1932385 1982872 2139869 2154892 2301315 2121649 2401652 2307477 2325474 2084125
14569 2084125 2288962 2475656 2463970 2217079 2557001 2627344 2364684 2509138 2861948 2788831
14559 2788831 3045257 2986862 2719402 3406143 3378531 3534119 3880476 4711385 4897775 6284139
14549 6284139 8420750 12783535 21479099 38520699 45082982 25378231 10004393 4531297
14540 2750528 2566372 2504904 2032769 2022993 1895945 2220819 2067795 2066691 2293545 1871905
14530 1871905 2302999 2276831 2059083 2246941 1983743 2618124 2468513 2206779 2492966 2391959
14520 2391959 2554075 2412634 2518219 2571277 2734996 2760346 2848035 2745501 2639132 2903062
14510 2903062 2748538 3198306 2886296 2909186 3044109 2784796 3128342 3059085 2882227 2921716
14500 2921716 3217749 3281084 3422217 3454321 3244346 3625780 3613453 3460750 3642616 3548447
14490 3548447 3283250 3421447 3923238 3765565 3426799 3704399 3807529 3742029 3715276 4170142
14480 4170142 4157329 4076194 4184085 4099521 4154037 4169617 4217831 4451964 4251694 3922956
14470 3922956 4387509 4474048 4378921 4566619 4687339 4735072 4564755 4972195 5163907 4850214
14460 4850214 4760270 5425166 5220357 5015174 5151641 4985062 5455617 5372684 5172021 5543279
14450 5543279 5760836 5453045 5469884 5849771 5666554 5741898 5958059 5785254 6062944 6182625
14440 6182625 6400030 6547152 6293708 6394830 6610520 6868779 6604600 6865433 7263891
14431 7263891 7144690 7091356 7270389 7462180 7286963 7471799 7524079 7948646 7502341 7972381
14421 7972381 8116788 8138200 8368075 8364383 8611783 8696691 9044354 8896146 9252497 8837563
14411 8837563 9336313 9362198 9774811 9664013 10074965 9833395 9999288 10349505 10659810 10716617
14401 10716617 10541700 10738943 11053463 11247443 11259271 11620949 11599352 12149967 12200401 12694588
14391 12694588 12713091 12820089 12946497 12987083 13661122 13986751 14228408 13812405 14293466 14594522
14381 14594522 15073862 15248432 15737805 15628843 16028751 16408757 16741322 17028045 17598343
14372 17598343 17633567 18224962 18323837 18818213 19299917 19525274 20104053 20450876 20695299 21339987
14362 21339987 21260499 22006360 22367127 23086743 23217833 23889514 24668859 25050599 26052676
14353 26052676 26675028 27160419 27674229 28411741 29218548 29804508 30921816 31278458 31999163
14344 31999163 32820741 33893277 34798663 35864830 36506605 37529699 38592267 39916005
14336 39916005 40883626 42115608 43182119 44767362 45966946 47274222 48737808 50387401
14328 50387401 52115130 53437391 55050215 56914266 59125919 61288323 63010416 65177821
14320 65177821 67696066 70166050 72838705 75360863 78049279 81298088 84001268 87754472
14312 87754472 91000634 95221143 98487220 102989034 107449803 111616040 116781147 121926222
14304 121926222 127461952 133440170 139285267 145978229 152931536 160259213 168165163 176330293
14296 176330293 185237384 194350153 204061303 214236851 225322505 236686348 248589494
14289 248589494 261073051 274708837 288169866 302211181 317168214 332080112 347029219
14282 347029219 362703598 377804898 392743431 407467907 421102622 433800770 444960695
14275 444960695 454423025 460922897 464012929 465341141 464940670 464169845 462590153 460364414
14267 460364414 457199001 449898212 440099034 429122532 416465502 402926576 388176028
14260 388176028 372819060 357523784 341769977 326190667 310886872 296795069 283361421
14253 283361421 269529569 256309436 243708870 231976111 220553349 209614902 199449420
14246 199449420 189829519 180619270 172601624 164527716 156674681 149843032 142674656 135997391
14238 135997391 130606443 124972955 119568405 114361492 109483176 105196029 101033892 97298208
14230 97298208 93539126 89936642 86124690 82735411 79969421 76644099 74427975 71532283
14222 71532283 68980308 66359941 64522624 62543924 60401071 57929456 56061672 54430956
14214 54430956 53011826 52091112 49920427 48124268 46883279 45385637 44639967 43466578
14206 43466578 42395925 40896208 39670236 38454887 37376648 36718321 35903266 34625875
14198 34625875 33881733 32855305 31910107 31326095 30542491 29809280 29273036 28211253 27704542
14189 27704542 27376982 26562760 25756654 25438055 24614135 24240247 23495517 23103112 22679572
14180 22679572 22037890 21822706 21104461 20776327 20161787 19949378 19499475 19185833 19007619
14171 19007619 18547917 18334016 17733671 17231805 17103686 16695973 16323142 15845785 15689757
14162 15689757 15230054 15073076 15048216 14411408 14518820 14237275 13752992 13624033 13343499
14153 13343499 13684201 13316058 12977401 12268922 12273308 12158794 12106270 11791040 11770883 11520212
14143 11520212 11126703 11054387 11045022 10673224 10632913 10389836 10284596 10394788 9803625 9637118
14133 9637118 9912054 9471284 9541486 9524408 9080635 9149120 9012378 8858188 8813022 8806869
14123 8806869 8375408 8088080 8328552 8169362 8243387 7826624 7839220 7395982 7673424 7696265
14113 7696265 7302750 7358298 7266737 7087267 6958398 6980365 6661831 7117788 6399276 6696514
14103 6696514 6828124 6509899 6472041 6318479 6227072 5907351 6348850 5826162 5654432 5791554
14093 5791554 6000607 6041072 5568203 5323875 5655272 5561141 5474136 5332642 5703450 5219665
14083 5219665 5419599 4964856 5225689 4803173 4882867 5367862 4526797 5063869 5150670 4662900
14073 4662900 4803527 4576974 4407874 4581569 4535983 4581609 4243515 4434518 4745672 4204696
14063 4204696 4429518 4333214 4104956 4150010 4373292 4623107 4298164 4354274 4341527 4040979
14053 4040979 3779463 3666446 3893509 3847492 3840714 3447521 3743888 3765998 3451725 3608153
14043 3608153 3643543 3511894 3564171 3457935 3387304 3389731 3165015 3129718 3061925 2943567 3357583
14032 3357583 3026442 3145041 3159935 3040303 3040610 2969810 3046649 2847690 2678208 2907840
14022 2907840 2772004 2914826 2752339 2787539 2368220 2651593 2753095 2579630 2495669 2625563
14012 2625563 2442128 2463829 2369429 2520337 2272614 2606426 2221937 2131824 2380373 2273583
14002 2273583 2162091 2256830 2326806 1954753 1879098 2212686 2093162 2104768 1798409 1950632
13992 1950632 2390286 2759069 2853353 4452927 7032768 14723845 31559642 45268282
13984 45268282 28266980 14229566 8476294 6062213 4680470 4218420 3553898 3720302
13976 3720302 3068474 2770692 2798724 2547203 2865315 2811064 2827973 2360514 2549519 2410808
13966 2410808 2576042 2148797 2260285 2301165 2156823 2460331 2016091 2303131 2139292 2250664
13956 2250664 2107601 1791128 2254806 1914253 1721807 2121332 2025653 1994928 2120043 1948010
13946 1948010 1979568 1979589 2389411 1981213 2026397 1881177 1908643 1782743 1880377 2045971 1853028
13935 1853028 1670543 1385135 1773222 1372749 1761535 1614403 1831227 1453796 1811917
13926 1811917 1581069 1735642 1671236 1655088 1896876 1541694 1781105 1881970 1405776 1633420
13916 1633420 1562154 1636388 1358640 1479822 1862531 1328957 1376710 1476529 1649453 1467415
13906 1467415 1414202 1671415 1349825 1616750 1788564 1248796 1603598 1164834 1295142 1261023
13896 1261023 1460521 1518867 1434793 1163984 1087170 1427318 1246645 1012900 1587682 1684657
13886 1684657 1231549 1610927 1352541 1330809 1476413 1092455 1063752 1064588 1069273 1503574 995741
13875 995741 1118967 1496787 1188667 1343357 1338985 1066407 1333163 1069500 1281508 557289
13864 1143136 1419335 1380619 976116 1134532 1182880 1081410 1081562 1313621 1207739 893199
13854 893199 1304685 863949 1152964 798655 807827 1315833 964425 994297 1335279 962990
13844 962990 909114 881416 1171672 891807 1021095 1121491 586453 904910 795494 1142293
13834 1142293 1006559 1124636 866192 670080 1122558 1092061 784889 682122 821718 967413
13824 967413 596927 970658 934623 928180 928891 822008 664967 752842 1084289 864325 659671
13813 659671 594528 1102710 507639 960388 1008237 663308 783451 1031537 746415 1112165
13803 1112165 592748 939392 753041 841516 939044 507327 1005592 1025760 773311 570530
13793 570530 866947 812672 926856 617059 885783 972338 580183 1022819 592333 647965
13783 647965 834436 958824 1133785 670715 801269 654768 928621 750638 883055 617074
13773 617074 880334 432481 544325 911946 430927 920050 617128 906183 861619 739280
13763 739280 642864 756958 468567 883061 652858 525877 1057010 938783 698363 717748
13753 717748 623490 664022 539668 417071 684396 345848 826727 403189 779829 472282
13743 472282 822977 510216 564075 703326 981703 617456 798865 617650 836645 309864
13732 495665 537478 406131 441686 653989 676267 570040 674339 529859 818472 624013
13722 624013 654807 721031 445341 440239 543127 479190 748775 495010 483033 444253 691898
13711 691898 550725 627060 643188 539567 639281 426340 628425 367111 330974 491871
13701 491871 524902 363596 566146 238355 595014 746977 619753 459931 450487 789587
13691 789587 545919 297989 563356 300127 541967 512658 730055 432924 574336 395296
13681 395296 458674 410734 558901 579886 522087 547610 675005 502313 539619 750435 383828
13670 383828 511835 487871 493929 637460 464664 538794 660944 577464 531007 518065 594010
13659 594010 700164 586451 832891 429976 341290 346965 193350 141784 358950 366867 261314
13648 261314 551608 523310 322937 359052 604091 561270 606767 584493 494037 585220 410785
13637 410785 289436 461118 469474 375550 459017 326831 633547 593763 524096 328731 432236
13626 432236 402518 653182 310784 453675 501126 229394 324840 506240 499358 601951
13616 601951 413898 330869 206670 325298 406829 312797 176992 348044 26944 435523
13606 435523 298538 223546 336517 555797 169229 282649 305073 180323 267537 207427
13596 207427 313390 199569 339155 281819 487137 31322 394648 -79345 104893 40556
13585 394627 346781 119575 342473 265756 406104 129094 541878 370795 489384 55058
13574 253059 636687 353292 456492 354090 458475 398345 312267 250759 260245 283015 260397
13563 260397 276835 627325 605447 229996 266749 521983 164414 337201 93261 463408
13553 463408 197477 494042 298838 281929 348977 272727 329792 503544 346514 356539
13543 356539 227309 485450 424451 666271 401725 578165 196724 128699 100434 242266
13533 242266 417220 361854 438316 372014 177341 328293 163523 139829 212404 211742 103002
13521 307820 438882 153393 379288 437476 568059 160801 118740 243511 121862 327922
13511 327922 359993 40886 467920 394934 358032 173140 613744 162898 385058 163235
13500 235006 394844 251515 138549 502084 394194 317735 455351 315045 125361 182692
13490 182692 234997 11340 514684 386145 542052 -111924 126399 65065 407877 201754
13479 12005 133864 168238 184437 532029 86893 209155 332838 119084 115656 372108 339593
13468 339593 263397 177991 176367 443330 184017 227700 543254 73104 179053 383257 400393
13457 400393 136626 420595 159659 141626 -3612 373238 -91569 125978 286563 296137 265148
13446 265148 305127 206242 332522 98444 600771 153444 232028 84676 214539 247110 119712
13434 412590 242554 175143 249251 309666 301426 452124 244326 166667 368863 50528 299602
13423 299602 110393 -182458 135628 414149 438141 106939 148690 225262 341360 309175
13413 309175 46521 -50294 134498 -62627 454238 571473 375386 159912 292731 79191
13402 149098 253121 -61906 52690 473126 191833 190331 104320 57722 -12192 304709 110886
13390 447544 -48409 -314274 105272 242844 115470 -169087 207567 355225 240721 -54409
13379 171227 192660 451722 30062 269899 293984 527762 120243 -1402 31683 130665 160023
13368 160023 290540 173783 105142 18153 348884 95119 -24127 204505 166088 32213 18189
13357 18189 176206 82397 339445 372945 132711 352030 38420 415866 480910 104671
13346 52062 438609 139653 347873 542589 385922 532773 256855 72043 153879 51571
13335 348676 22767 401495 280539 197678 273908 574096 465710 -66939 38594 434319
13325 434319 373998 5284 180531 169301 53212 323209 184692 460963 388004 268549 472903
13314 472903 149829 365448 66950 205123 193617 315602 168361 186129 65983 -21674
13303 103155 66300 -43404 411011 -138064 333679 7889 -123749 98663 60787 18971 -1248
13291 201976 177706 54953 2506 -50841 102416 270914 -15128 -46495 74934 286140 141003
13279 237336 107873 124918 143496 295437 152081 166067 -187990 225160 285476 15594
13268 30454 378292 99609 101746 316662 -175019 55286 -9022 13734 23602 224504 238237
13257 238237 -267754 240961 -37230 156530 208422 231403 -127598 1034 229545 479224
13247 479224 -10079 44742 21530 -42514 273719 49713 290700 195967 -93199 13123 -83209
13235 325813 387490 214119 78524 178807 361578 232661 45226 489134 108528 21635
13224 105473 382273 85318 27148 167917 278680 28294 97251 18205 -53061 81235 -49152
13212 154265 -108742 112136 94316 -22865 177203 -34292 141664 65688 401624 339467
13202 339467 -103282 80181 -369278 323029 150245 617 443366 -178581 118942 236009
13192 236009 -22267 44880 145098 19752 77796 178510 114556 54102 61373 150885 -43260
13180 -2167 134358 27660 -222320 44887 227092 280971 -377257 -191041 -242728 28145 132459
13169 132459 185825 205044 345398 157720 172818 185976 96294 190466 -35550 207697 337704
13158 337704 -17734 -63954 297725 219041 94744 190476 -35450 142545 350974 107049 269899
13147 269899 100028 -61948 -132780 -89146 -207711 488632 89854 228140 -90480 37733 -120375
13135 20744 167304 126572 31344 284737 507823 18422 -15845 306390 258916 215123 24836
13123 44721 -170368 99685 -199070 186417 -212815 5163 141962 167905 -180178 314796
13112 -214764 390494 -162317 222592 315828 97604 71334 39247 376774 -24562 58656 170327
13101 170327 -150073 241931 53552 -113108 51376 -15918 265468 79252 -207602 70614
13090 263716 -11060 53209 -212537 -31030 49177 -48451 46720 112228 -120503 -222555 131186
13078 -42744 30099 50887 91876 42933 146326 37836 272475 51745 192916 6431 20320
13067 20320 306285 -132272 54618 287678 244540 318432 -93158 53667 187642 126925 -26170
13055 276090 12195 85690 -226008 132888 -102966 317947 71674 333508 130274 424821
13045 424821 116900 117733 267827 63783 -537 60704 -51371 -255430 47433 248813 227095
13034 227095 351209 275979 324886 93747 358456 31504 93157 -19404 51918 -156243 129954
13022 163531 274729 -88162 82252 138925 -86758 -152242 450589 56208 -64790 234201 26233
13010 -179036 -152729 22941 131478 47609 168557 245716 -3835 129519 226173 216357 -197556
12998 -112313 147241 -9106 419308 22456 260810 106106 -72323 63503 221013 106742
12987 352362 183259 -24003 -120183 -74497 -107250 299955 279664 -228223 432409 269975
12977 269975 -56440 -193351 -237455 -38357 94053 -67187 140364 221940 237694 17368 59617
12966 59617 106561 -6808 -120758 -31585 201222 224770 92994 -84000 531882 -135127 125230
12954 17499 -229267 352305 -21278 -207204 -216072 -34638 227019 229820 269327 66092 -384576
12942 71086 177218 -23810 -59524 122794 99354 26988 22112 -164284 -244743 -71381 -129641
12931 -129641 -232551 194674 -104067 -280027 118868 113848 -155080 66400 -303158 454256
12920 233170 210130 -42866 5396 -33322 31412 58746 263565 124356 -45627 -47107 27303
12908 449126 -231888 2998 -61470 63462 -31519 294405 -79168 -361830 -186364 -4825 -375701
12897 -375701 141317 69234 -66467 176842 14874 14366 -98818 -301730 209840 279554 -327641
12885 181665 116201 94399 -36961 -29969 105603 84240 -99027 -145354 104306 -313853 -85378
12873 142485 -15022 -184090 121225 -128591 189405 -206698 -63773 197247 -368580 239801
12862 -7477 -8598 -27782 149724 -42506 252977 31830 129856 -49698 38275 277708 -269140
12850 177970 55847 157580 382153 7837 148888 -26607 44776 212790 -29790 -134055 188876
12838 167366 159804 103518 -105621 386860 333044 194271 138924 -21314 21892 80925 131260
12827 131260 72212 154738 -192604 134791 -17025 -18127 150193 21078 -193263 15723 -9610
12815 143478 -127900 -64507 -202404 -236053 111091 -18566 44714 -306291 49298 -151450
12804 -182155 245962 253664 527759 51411 134803 40267 412993 378235 75572 297035 106216
12792 -168514 -7867 188143 -192889 -64740 -381858 -150450 100180 122016 -87853 104732
12781 159344 293449 -145805 -39056 -66699 136756 52501 109436 41476 -22521 -49377 116241
12769 217949 75329 -159014 197707 99144 -327880 212216 -126879 -62757 68326 -60417
12758 109850 70001 -582398 -243125 -119402 96919 -161368 -274065 188857 -215299 277253
12747 -187056 97730 149140 -335095 -102774 117046 -66082 254161 182962 234540 108846
12736 -26773 83554 271017 12115 81357 512802 174976 97602 98439 129355 111703 188751
12725 188751 93956 -109847 -132171 -80889 134527 140238 -35792 -199080 -130825 -102083 82936
12713 50680 134366 31348 37296 -22791 85030 138059 370843 455808 15506 -912 272189 -64112
12700 79157 92373 142553 126372 248994 216354 96217 -338024 270638 220343 -55979 -114920
12689 -114920 -18980 96297 181115 -6159 103744 -190936 76155 142526 88611 147844 -182782
12677 -207719 334948 433858 -19704 70570 -18203 -12065 52789 -12430 180150 174940 211583
12666 211583 270837 74340 40980 38123 19870 -343982 193970 -93474 46250 222297 -145938
12654 -74647 109289 106677 260449 259006 199381 37055 -3035 196842 29098 9746 -100422 99445
12641 94254 29778 56263 -81394 69646 25004 119121 162258 244938 130328 289469 383928
12630 383928 27782 96997 410141 324356 19929 322205 86852 439883 -81999 186775 143152
12619 143152 109157 183942 -67842 86561 51454 349666 -201474 -231365 312077 -58184 -60730
12608 -60730 54012 58136 172624 22305 166661 128814 59788 87433 77782 59676 160805
12597 160805 198607 340555 -121129 -87778 -279750 -55319 117480 -248537 -161816 -8647 -122371
12586 -122371 77011 -26157 57285 -171238 191287 56336 41394 -43336 270631 156556 140465
12575 140465 127015 486174 -4815 -32495 322910 256116 167872 -359906 -301756 53443 -117446
12563 -229394 136402 211227 153769 -74584 -239671 172561 109101 302766 -21599 281977
12552 -115423 -82218 -240412 -84972 203526 266821 -130928 -213226 -25535 -424056 -17915 56089
12540 -84639 -78978 -121616 -502110 5774 157763 49592 -79394 -108079 121560 218967 150218
12529 150218 37859 199501 38645 63007 32238 -229964 72205 114290 -88007 123454 400013
12518 400013 136051 359676 -10231 1396 150289 120335 -71226 62908 -216626 -75879 42727
12506 218360 30701 45844 16606 -296225 -176584 -327574 30293 -259245 5854 -64730 -367031
12495 -367031 -503747 -320913 271935 21084 -236541 -61422 60385 -41665 -151116 30218
12484 -240623 86289 16091 277856 -208738 301938 28220 216086 -300878 -90666 192404
12473 118878 263573 -30990 36222 247862 -121853 -72663 301486 70494 170571 11421
12462 -228354 -168364 119327 71486 138741 96022 -187134 -126412 50061 97511 16974 100849
12451 100849 -6486 -68675 -159492 -287295 -149993 -40131 -148917 14127 2467 145770 -78942
12439 428367 124338 225025 -49060 380686 -398970 193836 11793 258717 19117 -79895
12428 1436 -1795 -104607 -128007 -11955 104202 265300 -101100 -89802 -39561 -205688 -232339
12417 -232339 460 110058 -21855 160828 -91786 164742 89054 -7954 424268 -81426 190509
12405 156210 88289 -261872 364128 267586 81221 -87875 66813 -80261 -62865 67396 164820
12394 164820 90936 220430 -10819 -323314 -133352 -130265 109382 -248484 -165520 157616
12383 -98552 -46081 288360 33718 176646 280031 -59056 105234 236521 -40076 -26458 231648
12371 321804 -83101 167978 -267062 -372422 -17428 -305098 283938 -161947 -67745 -66011
12361 -66011 -41738 39902 -35205 68569 -399902 -15870 -142793 136292 -163986 -93611 -439971
12350 -439971 198551 345463 -73383 -273483 -55967 22466 296801 -110418 12933 -35870
12339 -167140 -151808 1085 53327 137595 87359 -86972 199076 117761 -28307 -203124 306404
12327 117512 7685 -54836 -41104 156005 128764 94577 -103413 117978 92068 -493600 75123
12315 -153876 91630 15792 -33205 60681 11214 348671 -64648 -120839 254994 -186806 -35695
12303 67894 198065 -339095 275598 5502 -299394 124770 53771 24902 79516 -24169 196005
12291 58737 76797 35081 3892 367176 -344123 -90690 140115 -108489 124342 -749 11384
12279 -3244 115144 352035 -58557 328733 368539 386206 303982 -214687 106293 294661 184151
12268 184151 247861 17721 270889 -170395 136878 -79985 159429 -270210 134970 154259
12258 154259 -215747 202655 279875 -10140 316905 -65275 73708 17503 172149 -9459 165875
12246 246353 -396784 325024 27494 32337 115146 216250 -118275 57567 -52817 -118665 170650
12234 346569 142837 -38344 75841 381356 261003 -10959 40621 493790 260427 115123
12223 62552 329545 397905 184334 311317 68036 90256 127000 372697 26728 165920 -195375
12211 110569 -126007 362701 137394 -80140 -47555 348939 231450 346933 277277 425663
12201 425663 351372 440022 166582 425846 158860 119298 144304 154655 308475 103917
12190 122155 -21710 291472 644905 -50797 679508 387550 -72424 252396 148799 403516
12180 403516 -144411 -77398 168872 96163 370480 324300 357523 289760 237725 207351 -89922
12168 89079 -153621 332143 59524 214940 380183 -3367 178034 -87084 116183 -71117 174533
12156 221002 410074 -121216 186051 -73077 250100 24491 48919 119549 119076 35413 110176
12145 110176 126161 323904 -2648 -171700 54448 -140355 -34228 -31255 135279 32531 -79845
12133 -170810 5286 79578 -227554 73557 151510 -93191 165734 109024 -266767 -304977 -16895
12121 -58749 -393716 -156635 -51192 -53173 64969 73631 -89171 76558 55234 223017 51053
12109 56121 299023 -140449 -26572 53187 -215729 108180 21954 -191122 94740 -149033
12098 52392 16199 157285 -132589 88729 2399 -113327 39386 16270 86220 -155854 -73876
12086 -155618 22489 -265885 276368 -17327 -177407 51493 -28228 24058 -22305 -53616 -11103
12074 -72651 288556 1015220 1663533 930073 138946 175531 -149152 197532 52956 91561
12064 91561 56157 -217613 308902 -111357 311582 122105 -24292 -75178 231176 242202
12054 242202 -56938 -57512 -146128 -117200 -226750 34312 -15057 -183331 130281 235577 72801
12042 99421 -243600 35831 117685 -26155 -233821 141391 47833 -114373 -7710 134282 -129577
12030 -143041 31878 -102372 30135 -9943 226868 -43673 -43386 -22902 3980 252495 -122653
12018 -57483 -196178 116019 -119266 115709 34632 82828 -21905 38104 161182 366665
12008 366665 44445 58218 -142485 -2603 250716 -31620 340989 -19842 -184201 261432 31369
11996 235735 -56838 -107910 165219 -58481 74929 19751 -22135 -111099 91229 265546 -743
11984 -78878 463437 -130482 -201288 138774 -356947 -98093 -18784 -130678 300565 -490526
11973 177050 -177971 92219 290272 171283 -83023 199769 -84816 307097 55623 267918
11963 267918 47168 -200205 238190 26247 -45200 184517 53319 80680 -23430 -304168 215074
11951 -146124 95425 -196960 -131591 -36689 -120851 218299 4609 -189100 -16554 -96339 9749
11939 -40968 -105634 -29319 -85572 206352 200907 12842 169063 26982 -15900 6133 -258867
11927 -91816 -32620 -178290 -70485 152195 61822 -71543 204696 -105224 -97543 -96105 11634
11915 -335576 -402174 -218427 77321 80034 20617 -48659 -88575 36552 -162049 129147 -6302
11903 53941 -95288 -210537 61243 333819 -251138 105239 89695 173382 39531 111620 185632
11892 185632 -265933 63409 -223204 -15905 -78825 -427202 -233181 -276940 53472 -277665
11881 18763 305339 -23560 -236156 50871 -40899 358544 -305429 2543 63079 -190229 325109
11869 -88120 -37960 -317622 -128350 -34393 -82575 -53457 -144999 -178212 143289 -23438 -42757
11858 -42757 -343104 174119 114388 -99734 121692 -23859 -234358 -411674 -3112 193424 -218572
11846 -194216 -105967 -117015 99512 -278553 311714 -11745 188823 -18264 53054 -284777 -54428
11834 -154499 -102275 -189270 -139879 255232 183072 -16285 234644 -69556 -244524 -428232 9316
11822 51976 -122707 -248337 -173166 -40238 -224983 -206098 -75291 -11460 58791 -105636 242503
11810 -9088 -211241 -3193 74197 -224878 99225 -292408 -68517 122581 191498 81650 191414
11799 191414 74242 -95914 200059 -41463 -51246 -47069 117877 -159423 -242603 -240478 229435
11787 81475 127417 -211730 -113519 64766 -34307 99869 -145352 -101400 -221499 15456 -190065
11775 -26429 90747 -43835 97792 135655 340327 106888 -31976 -212394 -122057 -32631 -76248
11764 -76248 2903 57954 -7440 -5351 -121649 -56685 -16931 -121754 36515 7564 60827 -231807
11751 66951 85481 -325269 246174 -193429 -236610 -208233 -19267 -192227 -141017 -158374 458116
11739 -77239 89479 211926 139777 -14002 -1334 -197125 68494 685 96543 -17152 35353 -204774
11726 77135 -313437 175777 105762 342075 -28474 307747 -57714 -33308 -109572 378700 -153957
11714 -188575 123045 62212 -122484 264842 -87840 97313 111220 -15524 78593 376581 292661
11703 292661 -74726 88646 -75630 516655 -28809 -312111 -47710 124541 125795 -89836 -129680
11692 -129680 -89175 -95633 201980 90599 107998 -26741 299590 -175187 107261 333362 -158597
11680 -30617 -10701 -161918 57158 -13883 -90245 -93926 153598 218065 -210700 -19696 361368
11668 -216972 76285 149405 371183 -163551 178395 -117702 89996 52636 217104 213338 28133
11656 100338 59792 251427 1609 194245 -25258 142271 202058 88595 -13480 122793 -475145
11644 252204 17163 -162569 -131901 6531 80121 -465799 26270 129055 57822 12104 -140336
11632 129172 68939 153880 -200894 237482 26737 210570 152086 -6128 42515 92335 348507
11621 348507 -64854 -47289 -120221 -116398 135077 -264623 -126137 -22651 250605 95880 194020
11610 194020 97618 51911 7534 -50067 351847 42148 242465 -415574 -139495 -126999 155563
11598 172801 337892 134995 -211502 65296 -36632 -134066 -1881 321777 124273 54957 193570
11587 193570 131920 153010 115442 487672 246734 40633 118829 -213280 -65309 24941 -170559
11575 -298897 183559 -418682 -24993 -95039 149276 57894 193760 -335441 -42168 373262
11564 -6263 73079 52272 71363 184090 -43342 105451 -16293 -126692 303736 224016 317990
11553 317990 -248102 353575 431647 232824 -169250 392991 -126219 -211385 203947 -109242
11542 184354 -88690 -44265 38035 107254 57410 44838 -10709 206950 99151 75812 323468
11531 323468 231767 195578 32007 382147 -162271 102656 -257456 157020 124783 -318095
11520 -46334 181904 10222 -100735 50907 -51662 242943 -170332 44625 226603 -107116
11509 31952 21000 143508 439926 340825 132230 212437 17375 433160 65460 36558 328964
11498 328964 122529 219807 245546 -58587 -31678 174782 422370 262502 -175768 57404
11487 183400 -104844 124287 181078 7997 272965 130492 131757 351394 -5907 128683 -57411
11475 98167 300466 112535 -14312 79517 160291 83672 425909 310379 99026 76106 161972
11464 161972 333371 -122795 146865 191041 1154 -39041 30132 -34965 -136588 366980 199193
11453 199193 75990 -70697 230506 63678 -152694 59242 -52989 113781 26238 17599 383356
11442 383356 135478 246921 -124484 74326 409469 -74361 12517 173454 229698 -184097
11431 197927 -169308 -168298 -117738 34321 -76422 136704 127953 -151525 127680 -31214 81888
11419 -38184 -6418 201074 245233 -4938 330405 145525 62092 -70549 -1686 -86686 -37488 65715
11406 148275 225618 248947 418665 51968 -129454 -87692 158787 -234143 78837 -287754
11395 -71787 9970 34445 -101507 212536 -138784 92804 -17545 -219155 281732 -263396 60239
11383 -89002 127805 -158800 130636 93158 195406 17468 185150 59920 98249 -287233
11372 -7462 -80649 135827 32198 -150965 396971 -81384 -98475 -67596 295714 -382460 39301
11360 -216805 -154665 -54088 -255366 -165747 60784 -202313 484617 -9171 154461 -49120 38277
11348 161521 -191302 -19837 -44380 260982 -36624 -46573 94250 -142759 -107014 -87302 32252
11336 -22610 -85580 -48994 117386 -173641 192842 -151390 89356 313298 145276 56223
11325 -10533 -278130 101219 77471 -97545 2611 -83453 198206 184687 34308 -211462 -98963
11313 -136737 52022 170025 -13062 -196392 -175704 109064 93354 -148825 -9919 -314184 -225244
11302 -225244 -103241 -141679 -286591 -250555 -70123 125519 163477 14422 -343091 -267177 -14341
11290 -210790 -325156 -44806 174886 -341959 81352 -147677 -151270 220156 163555 -124335
11279 165843 -72121 64574 -223380 -3871 -1911 534688 -57651 -36955 -178937 -210320 -623510
11268 -623510 -375256 275605 -55032 -107482 -86748 -2293 -264295 259117 72734 -156592 -20681
11256 59846 216831 164878 55854 -25278 15500 107955 -114311 -378260 -12733 -69403 -155629
11245 -155629 -115834 -73046 110886 123329 134375 -208082 -130819 -139774 155905 -174927 51181
11233 -106753 -105456 -218059 -57924 -175731 -443290 54948 -110181 70345 -273307 -225842 -39169
11221 -168949 31526 -240723 147157 22089 13196 96009 -110584 -121985 -169905 45320 -147979
11209 -10932 -26635 -87056 -269204 225073 72760 113491 13940 408458 68162 128681 -303968
11197 -125109 10359 208084 42471 146373 24749 -57656 -378218 -74026 -3030 -138641 -67676
11185 6546 -161417 156832 368221 -108926 -237864 154085 200035 -101899 67216 51430
11175 51430 55141 82538 320359 -334176 -309964 -114179 -42481 -384539 314081 -71207 -223280
11164 -223280 -122625 -167019 178135 108149 -165363 209247 -61835 90194 -154796 -154610 3306
11152 -209026 -11497 -26060 214800 7881 -178683 -337908 148928 142332 82383 -143712 -75591
11141 -75591 11947 347634 -44320 -320599 271804 169181 14731 165289 47160 237272
11131 237272 -36530 55094 197513 206576 166026 57656 79532 282802 28467 -25834 -8212
11119 -91692 2159 214216 36839 295549 276387 238218 -127327 169642 -123804 -206601 442511
11107 290365 -104091 112872 293642 -75218 -20334 -198251 259830 133099 303571 124611
11096 19691 247034 177449 368573 246969 468653 207952 -72175 -146977 315072 151163
11085 300147 385461 -46831 99625 54887 259410 116513 8496 111745 248918 100747 390135
11074 390135 159716 324334 338054 369491 752409 637932 486062 584600 286717 593029
11064 593029 224673 261256 423208 381615 341523 484863 596893 682189 529006 595176
11054 595176 557595 467667 767793 672752 875725 803389 1054680 548830 822763 812066
11044 812066 1114829 862200 920093 904429 584574 581561 690447 964853 876808 777649 592054
11033 592054 367536 539597 261459 787553 936584 891025 861284 718633 622818 911195
11023 911195 978590 786528 721016 746817 633811 611371 367792 853282 570823 798670
11013 798670 714279 900899 837623 534028 933699 845576 538214 426040 691778 869147
11003 869147 576734 524853 599194 481350 797021 554676 830510 567649 621226 819233
10993 819233 738492 863388 764072 815687 861651 672405 860380 991596 1006842 976333 938444
10982 938444 1173437 1015053 1458008 1250889 1454457 1412754 2150219 2177590 2410643 2849161
10972 2849161 2889565 3300417 2645774 2978543 3093447 2197273 2339456 1725653 1568017 1558362
10962 1558362 1576314 1444353 1693931 1554539 1873028 1704195 1918111 1807154 1447510 1322642
10952 1322642 1452396 1152377 1010937 637178 1007558 352428 521851 333103 332650 116072
10941 428875 265948 233095 95423 102031 335430 173917 405584 43176 277671 93005 11040
10929 -53016 -318303 -71209 -78069 122329 41913 360178 112204 -21117 -298375 -133122 38090
10917 170461 110129 -2388 86419 -12438 93393 -249038 -92494 -86488 -168356 -246166 -143066
10906 -143066 -31298 -153149 400772 44448 -339311 -101744 -119214 258855 -145415 -27245
10895 -834 37078 -64734 236648 -169515 -12411 -136560 249739 147662 176847 -149096 47452
10883 -22349 -135383 -296756 110850 -530672 -185682 91307 -183724 -18164 64322 46307
10873 46307 -33526 217833 201869 291515 -45713 -76063 118115 98829 -108545 -72796 209170
10861 97342 65030 223451 -128178 103389 -4176 -211760 -291765 42648 -215779 74158 17987
10849 61290 -87058 -169039 142564 -181358 -105499 -136225 -268095 -119485 52505 -254895 220302
10837 -85123 74686 -129222 77019 -52719 150962 72737 -238401 -127970 117806 -42310 191978
10825 27040 -47157 -147195 -23015 -154327 448470 -136142 278219 -352744 -73014 65572
10814 1188 -307967 -13741 142242 -324903 40844 -161924 444495 -74619 49985 -88904 19746
10802 -113465 -2730 -206758 -17492 -93804 67471 -123299 -159980 -46939 -248075 -244142 -182920
10791 -182920 -47268 -220957 -204465 -342249 326567 248523 83557 104307 -28660 -351164 -177795
10780 -177795 232314 -8140 302328 237745 -356689 -104421 -8237 108643 -159456 -84430 -484707
10769 -484707 -187717 121213 -14390 324564 -389019 95786 99046 -147135 67651 -161778
10758 -132350 -388599 -427146 -176645 173039 -113838 -385100 -187299 392297 143299 33427
10747 113095 40072 -133557 -225542 52113 -5677 -75067 -45824 115857 80999 -233624 -9189
10735 -292526 -174912 -37811 30016 -34793 119367 -64279 -142415 -156629 158055 163404 -212111
10723 276 -34534 -239180 -82687 156342 -172884 37568 -317124 -252711 -236805 178804 -72070
10711 -326642 183217 18426 32429 271787 -165540 -45290 -343022 -6716 -65102 -225551 54020
10699 -161350 217093 -9726 40206 97339 -36735 86985 -126461 -563380 -176864 139237 7270
10687 -69865 -123164 42248 148614 -230008 -68016 -55865 -41358 -72107 37268 -29506 69726
10675 153897 182643 -133507 -403634 -16395 -222291 41227 -29582 253735 -179758 44128
10664 -111140 51666 -207892 -145690 -139665 -169846 335147 -70207 78142 44468 -37343 -3112
10652 76581 -114623 -90020 -55348 59814 -357675 -95407 65438 260776 -274751 92576 4861
10640 5141 -157201 -352591 -102908 45047 -181091 -263674 25701 -57691 -73268 -299862 359928
10628 18715 -153313 178956 427339 101471 236308 58199 116790 198205 7126 -104444 -95950
10617 -95950 -248300 -498234 11176 -170520 -123568 -19594 -268046 109253 -283358 299878
10606 -87156 -138184 -196903 -137135 -309013 -83895 34439 8899 -245726 -160871 52603 264 68471
10594 68471 71091 -310939 -161450 -64428 254275 -175684 210576 -11074 -68972 166903 150649
10583 150649 91675 217807 12280 -225407 29531 -33885 -50225 78919 308987 150626 -26599
10571 52917 190057 -60152 -46306 -164243 4894 -112792 -356606 31304 -224252 213656 -74231
10559 225959 -49401 -87206 193735 -194107 2643 65123 -1448 -10392 223491 67778 -305230
10547 -280472 129209 -386279 78544 314341 65710 6054 -82864 33683 -70220 -168545 -193110
10536 -193110 261575 177161 -26931 113537 381491 -109754 115399 -229604 -250335 -81322
10525 -980 210876 -226652 153240 -203594 -62128 421552 187494 -73514 156934 380127
10515 380127 143005 18966 43174 78555 -73103 -239418 -22567 -127008 34127 196953 85279
10503 -295777 -112301 50195 -42269 63887 -441217 -90920 -151111 -51193 -55158 259875 -280946
10491 -39812 -1092 -112654 -34642 77487 17939 97370 82817 73978 195911 358463 698997
10480 698997 666967 240659 177269 444712 158021 -88435 94122 47383 56681 311064 -109644
10468 86690 -352408 246208 -2709 211337 92428 -130840 137245 199741 -181208 -197450 136132
10456 -407120 -68695 -28776 -150765 -295712 237608 266534 12155 187148 30202 160665
10446 160665 -257930 370173 -152532 -74908 70431 -106628 -19412 -164382 -81567 -76595 -134614
10435 -134614 -287700 -187904 -140672 19300 -21357 139182 -302550 -48008 -7004 -478176 -222109
10423 24964 -193259 70222 135803 -126564 179709 -44422 -9519 53734 -93035 66691 -6382
10411 -59124 -216334 36690 -239538 51304 -102994 31376 -8209 -255808 9928 244954 -386026
10399 49728 -321870 -22620 -153067 206388 189979 -71715 178957 18258 103411 348982 -122022
10387 96861 382895 200979 183237 -169451 -300576 237509 55337 -43512 -201389 226345
10376 461391 23499 462210 520295 161597 590416 490977 134970 512317 812651 223556
10365 247484 342546 182774 213319 -54130 345352 140343 272064 327514 377405 -16524 334047
10353 197755 204530 594484 372259 685153 493228 529097 -116079 184985 619753 195587
10342 489367 477970 -74487 162601 184495 194081 132125 144299 -190424 447058 312752 -145492
10330 267985 216068 -71140 -224233 -68570 383688 120341 275728 180229 308693 -135026
10319 295475 -19499 36459 233723 -129597 349487 88853 236204 39281 90023 -55375 -87382
10308 -87382 182364 -26236 -135713 9537 -27151 69601 227163 -108296 -83525 -391324 -15809
10296 -4789 -198559 -367175 -164146 -167042 -348805 367253 -179520 -327338 -110936 -23704
10285 -69144 185694 166651 -281629 -230846 45021 274006 -294680 -262552 -18372 205606 -106720
10273 255354 -149921 90358 -97348 -50728 36522 139167 122573 -109854 -142394 164873 41436
10261 1787 356286 266542 86982 281517 -125444 189298 239731 -14553 -156716 -48158 -93183
10250 -93183 82593 -66320 -232463 -382128 -9470 45554 -41447 -224565 -77720 207095 -168673
10238 182792 -237886 -109454 126762 -67379 -357443 -154629 168787 -46582 -62357 -114730
10228 -114730 -67429 155218 -146024 -178399 -309826 -63928 33473 -62992 189601 32707 -51734
10216 121378 -159302 -123010 -180208 8001 -69530 110047 -127515 -172604 21169 -76030 173646
10204 282155 196468 207086 -105260 -82510 -243982 17810 -237563 226133 -56113 -95539 -210755
10193 -210755 -189666 5701 -46143 121335 -458575 -10676 -145183 -43881 -189360 33095 -282820
10181 73629 -147110 81449 25023 -20768 -40987 228024 -300968 -415708 -143043 149079
10170 -10241 91175 1457 189831 -8469 -38822 14869 268300 20179 -103371 -62015 31167
10158 -403028 80359 -15112 -81292 -83711 44788 -113218 237529 -272305 -357522 -73329 -21320
10146 -185219 -131255 -228326 -77309 125725 305903 34502 2353 151703 86011 -643733 -248370
10134 -229573 82228 308921 -7467 60801 106258 241680 73131 -3216 -158870 157938 -149138
10122 -306485 116923 -25422 -158681 -29593 91454 -341575 -159388 88539 -123724 -164531
10112 -164531 68346 93484 -145088 -127722 -82597 -47747 -394482 173748 -324414 224443
10101 -295674 -29871 -139958 -16275 48652 -61092 -316076 -32006 30430 52992 149695 107627
10090 107627 119407 -64250 -10992 -207645 -112593 -137271 -24441 -68799 -111483 -5597 -293020
10079 -293020 -223231 -18775 -23221 45287 -159719 -531557 -221270 -27299 -22811 -190129 -27971
10067 161709 34864 -103923 -221100 82586 -175477 51317 177796 -93065 -1657 -128586 -182576
10056 -182576 226914 -128359 102078 -68561 -219355 93745 147915 -80415 276464 -236206
10045 -66730 13578 -145935 -263015 -104027 -182030 247311 -141443 -47130 418368 -106064
10034 -86626 95580 66018 -329691 11154 197161 -255017 68517 -162183 169716 132092 -223085
10022 -178379 -279036 142143 -154522 177847 171893 -200348 245901 304668 -116651 -147324
10012 -147324 234817 -119115 3029 -191405 -180444 54140 -205825 -200373 -25271 -82219 123665
10000 20995 130446 -69899 11902 -135902 56974 44629 -399761 92358 -68018 -252364 -91517
9988 -15321 -328431 -233852 -137833 146089 71619 -130864 -66516 105713 -155015 42518 -60540
9976 -139118 -158613 -263369 2369 -167511 95762 -235595 -261973 -303038 -120780 -103167 -313357
9965 -313357 -127308 -95460 -153183 -22312 -54609 -42928 -40033 22497 103284 -290175 30112
9953 157918 125605 -10845 250606 -196220 -64254 36905 -128401 -34458 148915 262718 -210650
9941 -320175 -22940 -119466 130849 195245 41319 126843 -11331 -345951 -54579 -533096 -338725
9930 -338725 8990 -101505 -34890 -311185 108964 -292757 -15653 98354 -135828 -311494 -40649
9918 -174579 -32007 197410 164002 -27 117999 -170781 -135843 74820 -230983 321339 -104988
9906 200720 -41540 8105 -46890 159203 63479 46348 226440 -176112 -297522 -67636 -37198
9895 -37198 -217044 -243287 107991 -176383 24203 95738 -78933 -89374 -42941 -275561 -106068
9883 -238429 18095 878 -264593 187620 212890 -171234 3620 -51844 -214599 199601 -72713
9871 -91615 108495 156779 -332660 -362388 -32206 214167 -231619 -180860 -50174 -106145 -167590
9860 -167590 72986 147939 -5909 133956 -225972 -432449 69002 -358457 -227929 -217798 -130025
9849 -130025 106396 -59419 -153729 58657 -40365 -92217 -157797 81905 -190733 80493 -248409
9837 51436 120455 209159 -262093 -152453 -51597 -125291 -177120 362642 -118839 67688 74949
9826 74949 -154301 47576 -66506 -17837 7709 -197904 -66828 115789 32635 -93044 -145411
9815 -145411 -197393 97803 -205857 -205370 -235326 -18262 -270076 -55649 -345583 -49303 -358163
9804 -358163 -112897 458666 197413 -98733 -239137 81599 -66090 203260 -122281 -2591 50187
9792 -121830 -355018 -12891 51115 -113770 78595 -295930 -19274 97414 38156 -301165 -24587
9780 65195 -165730 -306663 -151728 -77209 -38160 -16120 -40269 243170 -40992 -21133 -170617
9769 -170617 247731 -282009 -280234 -64549 -219347 16288 25488 -205226 237197 -30532 -46408
9758 -46408 -57834 166856 -65732 -236315 111785 -25964 -188433 -178375 194787 -61347 -37006
9747 -37006 125179 22097 36062 326458 -219391 -225782 74451 -34700 -61402 -180113 -32514
9735 -29802 98224 54655 -201972 403571 143997 86209 -215103 -113348 125169 128906 -150881
9723 -132628 -232428 -492466 -227982 -425494 29099 20093 -29111 -337365 -72681 8569 -99447
9711 -92225 -328480 -105144 -243149 210449 -147757 -20928 -356245 -166804 88156 17887
9700 -277306 230414 -1568 -74096 -77260 48826 17861 -266872 25639 49475 -98961 79066 117331
9688 117331 50939 -6283 -123608 -159475 -3367 -334087 -23203 -411090 -101157 -383674 128715
9676 -354604 -56645 -253707 -211053 1186 -208668 -72913 -301666 -169760 -93862 40714 -7549
9664 -291706 169954 -142559 -223890 17098 98708 -322655 2298 -201999 -24232 103767 -14192
9652 343541 -397429 -40068 -17250 21130 -149573 -196504 -373800 -405943 -161044 -370922 -10430
9640 -275754 179059 -260569 121459 122519 -153626 52060 -124340 8900 -198049 275687 110850
9628 148279 -79050 96860 -93484 -196751 -47709 -161447 -250299 103925 16012 53080 246614
9617 246614 -84631 -207863 56505 152607 152623 -142092 -186753 -53165 -178437 223732 -6792 -13203
9605 -13203 -160139 -109515 -97975 -228841 191020 167906 -297609 214399 -106795 219002
9594 -31487 4224 2037 -336528 -171170 -248343 199906 -375124 71413 -143353 -221226 214312
9582 -69434 -23325 104521 -148515 1108 61651 43917 -78618 -106713 -195872 301984 263702
9571 263702 -34477 -81831 -114339 -121757 -93255 153276 139056 285090 -326685 -129802 -175040
9560 -175040 -54493 -179998 75171 -111757 246937 -330000 -392445 -238313 82289 -255855
9549 76669 -51800 -57687 -265638 76345 15129 -218532 -98737 -158437 28320 70586 -17883 -97834
9537 -97834 101444 -194454 224267 -37866 -66160 14333 -75668 -121074 -424828 -392802 93593
9525 172416 83289 -216964 -122235 180189 -195185 -5690 30698 33383 10029 -238540 -34102
9513 -293266 357660 -175616 -73401 8541 141029 189251 126536 54354 275136 -28425 21334
9501 -250849 -200053 50026 129329 -166374 74638 72355 -211544 -382928 -9317 -326782 -165875
9490 -165875 -318004 -189387 -263789 4688 270797 161267 57161 497 -320930 -179518 -208101
9479 -208101 -449590 -327442 -297932 -207134 -256333 85982 164064 115090 191166 -155447 52270
9467 1578 -325566 -250281 9207 28150 -242941 92896 26719 -247760 -203645 -92955 -195366
9456 -195366 -70884 -156405 -111469 47862 -277047 146841 -207449 -234703 -194307 -57049 159549
9444 237055 -147223 39188 222914 -61339 -62007 109105 -111811 -235954 -246362 70 13923 -165662
9431 -50713 -211407 -121378 108259 76437 354701 -147937 -36099 -127850 -307780 -230072 -252356
9420 -252356 23384 363403 -87200 -162458 -147251 -146900 -81644 -73276 34640 6430 -230713 68589
9407 29172 71556 -540233 -20292 -58756 21238 179233 -52970 261658 -96763 158659 -170278
9395 45019 -67272 -294629 50575 -205578 -33818 -122228 -272446 177115 -357641 -243757 256266
9383 -82991 -208717 -201030 -312348 -32110 144459 109988 -249511 -378506 125418 214717 -187306
9371 -23028 137575 -43785 -267338 -45888 80462 -20428 56092 -177703 123620 -127516 -270465
9360 -270465 91151 89964 -254512 -68187 -266348 -205875 247460 189303 -31312 74880 -187624
9348 108861 -134657 -21435 -171720 -220431 -136837 -245925 -90177 -138202 -115505 -80820 -286128
9337 -286128 92874 -21016 107634 -179562 -97375 -492348 45057 -144985 167144 119345 -225548
9325 -172636 97524 39617 -266172 98651 -4768 -341099 57835 10181 -319296 -89271 -13008
9313 -119126 217617 213894 -281020 -206584 -363338 -119785 6138 -436134 -17218 -256994 36648
9301 -158546 39449 -243786 -120391 156162 -404893 -435514 213031 391471 -320630 89832
9290 -197959 238219 23102 -159792 209543 212764 19513 -80327 93932 100204 -264531 -191613
9279 -191613 86848 -285943 -170397 269845 94666 -33652 -155998 8660 -267067 273719 -20048
9267 -162568 117117 20809 214190 -217891 77293 -370522 155543 -419559 116372 -101637
9256 120087 235350 -248300 -116759 -16335 163454 59366 46185 -68634 -64677 -18766 -3614
9244 -110908 -255254 -205779 44382 217261 -181874 12039 -58914 88225 -156375 -19380 18097
9232 -240959 31266 -252931 6384 112587 -233952 58541 282132 54277 55445 -324707 -272929
9221 -272929 -24873 -105425 -229812 -518847 -197736 -321101 101547 64925 -260695 -319306
9211 -319306 -120839 -118143 236546 39832 -2064 -246029 -160347 3962 76299 -224227 231819
9199 246466 -165447 -306250 -71338 -208106 -299708 -61558 -291114 -7442 -209820 113237 310337
9188 310337 -50995 188478 202302 -122032 -51653 117127 -221365 149272 -231166 103775
9177 -65576 83259 -66113 208090 -352643 -4162 21348 21972 -261419 -119770 -57550 -236569
9166 -236569 -133981 -217228 -196480 -45518 -253997 167350 -38993 -234690 1998 -63083 82693
9154 -118424 172154 139681 -452098 -228437 -165477 -169433 -303391 -67424 -53502 -321843 -25062
9142 116955 -227196 297372 -86274 -45497 -14282 -52360 67617 186832 71851 192787 -524290
9130 -90116 -51382 25883 -172615 -370994 -64002 169854 35582 -158353 243569 -193932 -388296
9119 -388296 142440 144944 -15302 -107608 35327 87439 -206452 -294959 -168421 -44242 -287844
9108 -287844 24724 413083 -228337 87148 -84526 -195128 -210725 -267791 85904 73908 -223435
9096 -157931 24042 -154615 -8893 160338 -55232 -61811 147626 -27978 -215293 31766 74014
9085 74014 -136636 266941 -59188 -89486 107410 26057 -98931 262812 128177 132914 -183377
9073 -286340 -209809 -375095 -111961 -401946 57397 206228 108969 4435 -336310 -274839 -63675
9061 138781 -201201 -206872 8709 -33055 102809 -373645 120799 -50000 -205459 -38544 -49603
9050 -49603 -66520 69519 -3276 -783 -80446 -52803 72589 -212872 44879 -302312 -34182 208639
9037 -242372 -60103 -25961 -334152 107093 23362 81621 47217 87807 -285293 -20636 129219
9025 -473418 -154559 388174 -196827 -169221 -277069 116774 208439 -74169 152485 89893
9015 89893 33681 -14710 -682 254450 -232491 617054 -2079 22127 -43460 112175 -258178
9003 -172333 -137325 -216070 -238556 21360 -52069 -290118 -95177 -205839 327669 49643 -84834
8991 -44003 -106631 -129882 99289 263574 -239463 -198608 26560 -42947 278886 384440 135398
8979 -96532 47863 -89688 -61505 -394379 -411509 240569 -64367 -160772 -39146 56864 -42745
8967 67469 -224674 -202017 -130697 -103252 75874 -39752 -50494 -263002 -174722 -162639 235624
8955 -363082 33981 76874 297938 55144 -523872 231247 -78089 -201343 -328242 -102631
8944 318759 -101263 26591 48880 70625 -129732 363770 -34760 -37819 84038 429890 126119
8932 -100755 -205773 -232219 -54420 116306 -13931 -481628 123135 562277 1269523 2590359
8922 2590359 8689207 8402613 2155746 524130 558646 150556 -34912 248063 14967 -11499
8911 216669 190451 -254911 -171215 433149 234810 90670 69558 69936 -274065 335385 -19213
8899 -35440 63218 -210138 43766 -220916 -170869 44929 -33462 -151706 -415059 51079 -28726
8887 -54629 -408884 -213427 238024 281540 -28483 -61320 -200231 -98483 93805 13280 -200593
8875 201104 -41831 28073 58145 -208808 76067 -81061 -208571 -58866 -2627 44380 -101639
8863 -24345 -427709 -16677 -277786 -10746 -57105 -58856 124938 -61108 200013 -225680 -239660
8852 -239660 135903 -79333 -40236 25436 -6879 -97090 99099 11563 109242 191505 -221449
8840 -10459 -60318 200316 -178546 -65777 -35361 183876 -73116 -384516 -37336 -80334 -56317
8829 -56317 43817 33168 614 182106 -214046 120324 -69758 326787 110766 -68742 -122806
8818 -122806 -172047 58134 237510 64435 -186497 -227640 -8056 -23625 -56695 29644 -462236
8806 21851 -381525 -74606 216465 -16464 -221321 -252375 168496 282543 66265 -121949 -145644
8795 -145644 -82522 -105172 -313629 -32774 56319 58268 163132 37805 93246 -17904 202456
8783 170012 13207 17893 -269799 116024 -358859 -82470 181942 -240671 -231904 151724 93602
8772 93602 -143121 -49690 109979 12193 -235872 -376333 -65072 121213 -266550 -279233 -109932
8760 -29755 -267093 13302 -399298 30691 89607 205425 -71534 -165926 -42890 -27481 -62505
8749 -62505 222730 -94280 -7706 44287 -87265 -462814 -61549 -107614 48730 -349368 154840
8737 -172737 5447 81088 84467 90468 -103785 73438 -120498 103771 -242734 -256657 -97272
8725 -253371 116498 -147984 62778 -319688 -43644 -6844 -146243 -56280 -17943 87453 -498050
8713 129171 -135527 -211430 -87616 -37108 -58158 -34730 -109399 -178112 -467903 -64179 -172960
8702 -172960 -72984 -429058 -360682 134470 -40994 -83081 216157 195653 -338010 -40956 -147459
8691 -147459 174929 -363827 79060 -139792 -125477 59151 -137334 117581 -158729 -11757
8680 -25189 -105634 -66592 -4084 -145520 -238825 70517 -324692 -28910 -46699 -200054 -146027
8669 -146027 60955 59442 141999 103880 -205105 105238 -43429 -132879 111290 -23480 -325842
8658 -325842 -114793 -141817 -167350 -267697 353999 -50952 178913 -86919 128600 102774 -203790
8646 -124612 14421 -138186 -302676 -116260 -322103 -99032 -121569 268529 316821 -203402
8635 -297391 -61463 -61271 15737 129243 -204824 25823 -54754 153562 -243266 -205145 -276148
8624 -276148 31188 -141751 -71007 -31142 -47263 -195548 149035 -92949 -46420 -141297 152556
8612 -96118 -6265 58522 94237 -185795 -60754 104403 -60171 -245175 -122963 126849 165724
8601 165724 47867 -32948 156908 -77465 66100 500629 -135400 80966 -17234 -224319 -83660
8589 81121 307074 -379203 305026 -109040 2858 277449 42102 117156 -129504 21733 -292464
8577 -37569 279279 -186656 123822 -162365 157593 -241256 245494 -92508 450674 3755
8566 148180 -156606 -51188 -95534 -228974 -32718 -2447 -81202 -58873 179720 -114360 42956
8554 -264004 -135270 -38799 -116616 -120754 51041 -210169 33606 -426378 -18389 -80387 38939
8542 -29829 -402398 172758 141493 249107 -133334 164805 61160 -52637 -53983 -130865 -219795
8531 -219795 -40995 25970 -420428 34009 107379 10696 -264862 -158404 -62566 -525867 -106551
8519 -9304 116106 -132008 -159485 -42483 -63008 189460 3575 94778 159656 339076 -57590
8507 -20875 207173 85707 286238 35144 -268518 -217583 -208347 190036 -182240 -24810 -206965
8496 -206965 -170461 103644 -309547 -18693 -26597 75337 -323029 -221144 -100443 81612 82450
8485 82450 9548 46117 -326152 -43186 -36367 -101720 -115035 -89534 -96480 19770 -385211 -43470
8472 -110928 258780 -86133 -242905 -547627 45974 12856 -69767 113527 -54176 104115 -516242
8460 137317 -124563 -53668 46353 -18444 -197039 -306132 90548 -245395 -183516 -47265 -207199
8449 -207199 1300 -97672 -132082 -37521 75024 -271638 -220448 60771 -13935 71993 -20245 35321
8436 -6459 172186 50060 123386 -200922 -43952 94865 93752 -81996 124997 211769 41846 -164480
8423 -738 -52909 -115785 2166 60693 -163294 -179109 -363437 432084 63926 -333950 -395404 145133
8410 -90697 -251983 -150124 245657 73499 -15655 -9772 -200119 -90018 3124 -221459 42568
8398 -353240 126553 -119225 225772 -403259 -266848 57584 -218458 183916 217585 96909
8387 -19430 -157536 39813 17943 97888 111537 126528 -62608 -199130 -318273 13694 61582
8376 61582 -210340 -192254 -18214 105854 453288 405825 244572 251174 -93187 -88579 -134809
8365 -134809 24609 119103 -150976 6336 -111253 50726 202689 -72118 -109539 120907 -20311
8353 -280606 -79927 -73887 152188 -83262 169089 -145809 40405 41429 31971 108791 -99785 137544
8340 126002 -125563 -155304 -31323 277298 -105951 28115 86569 -278238 -104179 -74377 -149722
8329 -149722 -196520 -148412 131134 -85256 135337 279320 -23781 -274642 211258 12508 -52649
8317 -28663 -146765 29476 -181383 -170455 158974 -145205 9504 -142826 -56939 -87568 -348836
8306 -348836 -4691 135956 -201540 181596 -35844 100891 171479 12082 -244089 -149895 205861
8294 108455 -182300 -119350 -117746 -267400 -266299 369584 -358876 151700 208240 124189 49994
8282 -30222 -51904 -294114 -300676 110306 148732 -140012 -246434 -278595 -84394 -168417 -264457
8271 -264457 -165724 -144936 -292389 93022 145950 -110203 42725 -59616 -211489 -157992 -276583
8260 -276583 -8975 -170029 -72752 -129581 23091 81350 -119554 -64082 94181 -63148 -24661
8248 -152725 -7619 18769 -65844 204012 -250550 -301488 -132621 -23209 -113706 -266797 111396
8236 92370 -141168 -64472 -99541 231594 8519 -172516 21473 -24285 -46691 -139096 -127614
8225 -127614 -79563 -68859 -68906 -144944 125526 46703 62647 -88384 11033 -123737 59022 47157
8213 47157 365837 44670 194014 -345478 52684 43918 242433 -129630 -165569 -100583 97852
8201 -305437 -169837 -71210 25056 -131573 -29453 -141681 130808 -483733 -217626 -54689
8190 -39125 -138966 16019 63314 -114422 -154440 -306511 61851 233108 17734 47518 27924
8179 27924 -200461 178222 -119231 142262 60843 -317067 -93720 -332277 -7639 -203178 -107686
8168 -107686 -33230 121441 91494 16030 -556381 166795 -17304 -42475 221857 194823 -104393
8156 162392 -177216 -357375 -30406 171533 101357 -37818 -177369 3759 -139771 331700 -271890
8144 80834 -153121 23631 -178561 -181212 -52814 206499 132315 -149083 114487 -375539 80
8132 -60552 -372694 4310 198605 221770 183021 -260793 161685 -26112 292444 -164925 17348
8120 1966 -304611 -7939 111760 -52373 139695 303739 -184810 -71050 -39455 75760 -38695
8108 -67988 -147063 11944 263437 -238224 -102565 62981 -373637 -112147 -55823 22010 -232387
8096 14871 -137298 -76767 75224 -171357 -30344 -321647 84591 20135 -100895 43624 148356
8085 148356 -49095 -17695 9170 -373847 -117942 -137574 -33830 145473 -64454 -57920 2085 -121608
8072 68674 141271 270955 235934 -77874 199201 -86227 480173 9823 -22386 156508 25259
8060 157016 183158 -46322 -5130 -294222 -3457 -72931 -151814 93447 -53510 149008 172693 -205764
8047 -162145 -176722 107734 -126944 117819 -285566 47099 -169765 -103158 148992 -253013
8036 145538 63802 18134 -96363 195587 138246 208569 -233707 -149885 67922 -180068 143991
8024 -155271 -50487 -94957 -885 -51591 -26710 -80719 90239 -253388 103518 -203544 14425
8012 -199526 -212596 -144121 224211 106900 -220481 -39610 170549 166212 139403 -7261 49084
8000 122749 324146 -547141 -168284 -115819 -303396 182579 94392 -210111 -296970 -339577
7990 -339577 132892 -270872 -325569 -26272 5744 80275 326209 -13613 126672 -390041 -237206
7979 -237206 -149191 76138 100897 119946 67251 -8052 106216 -332954 -127487 -136172 -429301
7968 -429301 47433 93550 -195691 91625 -357298 -137578 -51174 84110 -136901 186315 -204917
7956 -444686 -177536 139857 -271724 132918 179416 -40952 32460 -46020 141528 203251 159951
7945 159951 -48344 -200506 -31803 -181466 45995 -294313 -297957 -116689 -76882 -56718 156399
7933 -47618 73050 -135181 42235 398751 78014 63561 50240 72803 -103631 27084 -123036
7921 96773 -82003 -139045 145599 -48988 -100418 -61217 -210654 -145430 28851 -47868 194066
7909 -213700 97612 -126631 -230684 109295 -108719 -258680 -252192 -152297 -63715 -27453 275165
7897 21299 287564 -266852 -133579 5430 104966 43419 170270 -106397 22005 -243221 509
7885 -323060 46892 252663 -52641 132488 -168084 -168296 -9609 -153859 -200448 -184907 -46569
7873 -93098 -394378 251514 376829 170248 171214 139415 -108053 115050 -60139 -195729 -173439
7862 -173439 -145456 128873 -139091 -308116 20286 -302684 211514 -75885 -104920 75880 70675
7851 70675 -57145 9472 -260524 -3058 33477 184083 117781 232365 -218322 -126125 -277962
7840 -277962 -131148 -53588 -44303 11518 -240863 -213069 98035 107556 51827 219768 131818
7829 131818 48035 -286505 -54692 -143173 -291749 7301 -138505 -161256 18252 24547 -292122
7817 47321 -95770 119937 -84136 183397 -166984 -379176 117347 188468 330050 -22688 27623
7805 40116 -99114 -276873 235539 -166469 98323 235108 -87999 1269 125591 54499 -221757
7793 -189591 -305 299463 108650 -5500 324252 -289194 360792 163553 34795 -108309 79831
7781 5709 33830 -56936 75284 -131694 -271488 -139496 87592 -463207 -286341 112494 34312
7769 -163077 17523 -72861 106017 190539 185433 219466 -59699 296113 144490 -245740 5069
7757 323966 -161538 54444 -146612 -69733 56978 152546 122083 -237734 23311 -53829 -178581
7746 -178581 245216 -89642 -320609 89500 305892 -411935 -14072 76477 72953 -45291 147144
7734 -182206 -267319 62653 -65385 120857 164501 21085 40131 128440 -238810 306880 -54094
7722 163033 260677 -239337 33471 -315240 -162512 52812 -184150 -32413 -155939 48089 -296968
7710 1340 289834 -242857 -324601 -17246 -87719 -192509 -217259 205332 -205118 -144319 -151047
7699 -151047 -208423 -55742 85187 11953 138659 -72741 127778 -114569 108147 -88736 -133592
7688 -133592 111088 -193659 -127553 -167272 253500 87816 176750 90931 -214712 -257642 -44381
7676 185954 -55938 -31612 264169 65608 137768 48442 -114221 72181 -125787 44494 -120669
7664 -25604 144093 269586 -109773 92778 -114628 9859 117088 -237974 -281831 317367 -82950
7652 228527 64666 16119 188510 69105 -328112 179317 -133029 178029 135700 -16246 -9702
7641 -9702 -236294 26638 -45953 -226240 245576 50225 57171 -165269 -445174 81025 284743
7630 284743 -213338 -260868 170817 15447 42233 -53859 97753 -286042 -203189 293570 283629
7619 283629 105862 160111 -28923 -217485 24606 -178471 -2719 235594 -25672 -310557 128636
7607 -301415 -139186 -77433 -12881 23175 280736 220314 349091 -348900 75560 196538 -118836
7595 7696 -87494 -191093 188069 -178230 132756 -167849 83927 -253040 14258 -192118 -173593
7584 -173593 -195606 -291495 -493 -292198 142470 -12836 -34002 38496 135283 -24458 -160265
7573 -160265 -266486 1558 110561 -212060 42959 -47648 -208179 -245311 42550 -175943 -46263
7561 -342839 205473 -263209 -166867 155401 -202274 -180455 -144226 -197652 -288355 -74618 -125994
7550 -125994 -218108 103320 -47488 -133324 123895 -132383 -64231 -516354 -250842 -223301 144761
7538 290275 -137479 210674 120296 361946 -3471 -164599 -32434 20473 -286842 -34052 123731
7526 -123701 -47965 454333 -75126 369500 199622 4321 -153317 42596 -28432 -297462 -52126
7514 -333015 -280811 19789 100935 61862 -72304 315629 -196020 15133 -140634 179627 -34128
7502 -243861 96313 -15214 -316529 -59602 -209071 -54477 110126 103345 139580 12325 -97899
7490 -121263 -92784 -136989 279033 -299639 -227535 239215 -338690 24015 -85481 -348058 22295
7478 -193127 42927 45792 -157344 -6639 142729 -100606 -65964 17090 -56621 -163024 -45519
7466 107141 1615 34748 -91841 -317822 -296999 250395 -73402 72165 51472 -152166 57189
7454 -207442 190948 -329658 -148197 129919 -164312 -100846 -107394 -184203 73526 -242033 2726
7442 -34420 108231 24747 -357267 10014 -62633 24010 -169751 -158682 -119604 102439 -264509
7430 18049 -167273 -321641 265486 62279 154707 73835 -210706 27366 -160932 293988 103896
7418 -192720 37584 -120160 265240 76577 -109177 150910 -292561 239837 185487 -25673
7407 395179 -141181 -206117 -125700 458 -209270 -216675 -88985 452892 -8055 -262011 86925 -40667
7394 -31515 11738 249215 -254242 203014 -89526 414261 -159422 -40135 -48728 26358 -108996
7382 263369 -152331 14408 248749 139173 -250849 57593 6118 -352945 -214447 114639
7371 -88415 -259229 68852 -327172 156876 37398 -16046 251790 43446 254032 -257564 -68886
7359 -108774 210471 235106 17998 -34828 100640 106220 -181379 72506 -368848 19766 -183225
7347 66127 333127 -52883 -18185 -105707 -75405 -118109 -99228 -183229 -201699 352197 -123403
7335 119215 19782 19811 68650 26161 -252873 -266134 39126 -158567 -69971 -202469 -267376 -158091
7323 -158091 23760 -412189 23106 -90223 -260307 -137571 374990 -165831 -209097 -413207
7313 -413207 -141301 -169547 -413072 -167324 146761 -162755 -216749 -5603 -179845 -224944 -144761
7302 -144761 -241712 36546 -26713 34655 24315 -376164 -225261 385410 -143902 115002 4612
7290 -82719 62071 -287530 104227 -169511 39677 11877 5513 -64603 -101296 -80872 6927 -256228
7277 -79735 -90913 -105984 -235645 65619 -18012 -299717 17117 -253280 10350 -32442 -309779
7266 -309779 100144 139302 139979 281182 18447 -130285 -61422 21 -126513 245905 -383795
7254 -267567 85818 -51487 -34112 -85901 -25235 -102932 -159383 -332056 63187 -40197 60485
7242 97844 36592 -101079 -257110 -399966 -83261 1215 -24372 152198 -27729 -356271 -22621
7230 -32225 -150309 177348 -58399 -41889 -351829 21926 -75442 229571 -36863 -179718 -79945
7218 259397 -129423 -26819 -256285 42860 -75593 354010 -143282 263986 -145212 -146448 -129714
7207 -129714 67830 -97804 118948 123539 -65195 -58569 182909 -27676 169813 47991 -217745
7195 276000 2775 -65289 -268639 -246409 360817 -65787 -137100 -17133 138965 297220 -135229
7183 -465912 -175726 153655 27150 -86561 -68840 135205 -257325 17903 -145083 -98020 -182202
7172 -182202 -127249 122849 209837 -242979 -146428 41900 92933 -490700 79716 255937 -36118
7160 -176879 -69060 -57514 85847 41850 59952 -185948 -362732 130551 -61989 -21885 -64397
7149 -64397 -194473 175222 -98695 -168425 -41605 -117293 -123791 -38658 278547 568040 29356
7137 -3783 201663 63338 266539 -76624 -111989 -2986 15963 184457 -68415 -5630 107029 -457139
7124 -190742 -216558 -417899 162741 -74601 -155795 -16338 185590 39306 210233 -348413 -11198
7112 155017 26600 -238631 -176637 56305 -133229 124879 -12703 -188112 -90520 -55282 145339
7100 -43407 180438 -52006 11338 111926 89941 -15323 -227657 21521 216871 72009 -197807
7088 -290327 -74345 -282276 -90418 -136284 -187728 -218774 -148603 264867 77811 -99864 -39260
7076 58868 19462 59935 -48751 -48427 18582 26427 141287 35864 -320993 187848 -288606 100365
7063 166026 -2415 -169329 -103547 -146123 -180915 138106 -152972 -29599 -245334 280852 68935
7051 219486 -35717 -411719 286898 276889 -169939 85657 59413 118814 -84611 221248 -51509
7039 -113849 4506 -198148 126317 -246624 -168655 -217361 -1387 17670 -264913 295419 -45868
7027 262105 -10215 -214934 -8791 -170176 -237997 28951 -54955 -38323 -68678 -20110 -206856
7016 -206856 90205 -25280 95391 148513 248794 63511 -345157 -70594 17570 -23726 -151496
7005 -151496 -104124 101206 -259255 200700 67539 -127064 -140710 6099 205182 -20733 -63450
6994 -63450 -288808 -85860 57576 -97481 39082 -64759 17931 287813 -88894 57085 173787
6983 173787 -147818 89442 278740 239153 -33938 342371 -61504 -33654 -65409 -214114 -6735
6971 171901 312318 -248915 134185 -405025 -167721 17395 -56142 -216072 -14212 4467 224247
6960 224247 -88270 161050 76567 60490 2130 -3475 -14856 -246875 327442 50335 -131519
6948 -300208 113740 -55352 -63113 40893 -62238 239001 57280 41563 -377402 49419 48010
6937 48010 -20450 51728 86471 -237937 -214030 219267 248296 79514 25524 -207608 68201
6925 433052 62326 -114234 -148127 22425 82213 -105597 -111556 -82033 140962 290065 162798
6914 162798 -178255 -33218 -350595 -98834 -279870 -240424 99849 13248 1863 48227 71737
6903 71737 132264 113833 -68498 -166628 -89033 -85105 95549 -159904 -213806 103080 244763
6892 244763 -94456 -143862 -129813 -117831 124726 -177881 -287021 -70837 -121673 -333703 -123130
6880 37357 15657 -261741 59122 92402 -138749 -46901 129597 -163994 18658 -14018 -67938
6869 -67938 -190514 -274315 -182210 -126105 7284 58009 -97755 228958 46917 -75181 -240815
6858 -240815 -142823 -294707 -9608 -95260 -161004 -281500 -45325 165547 -9356 54426 259354
6847 259354 -252038 -20740 -183753 -77369 -191210 359106 -104942 -200550 -94425 -8545 -399424
6836 -399424 -169340 128502 220460 245051 -132842 -188106 144301 -56182 -135479 -52357 -13537
6824 -213889 -223163 58993 181096 -122511 -235515 75021 -171718 -349807 -288037 -231957 -83577
6812 -31410 101558 69471 339795 -17210 121059 -240640 172137 31687 238409 -46853 138735
6800 -32230 -153997 -254298 148497 -191561 120193 -15428 -41600 376248 267953 -21111
6789 -331375 -69924 -152038 -208148 -362377 -7918 -127362 -178974 -473429 264646 -406185 -166791
6777 115546 -226860 -314003 206609 -34719 -76216 -58355 -56359 -80458 205233 -266721 102147
6765 88440 200911 -212827 -168663 113468 156952 -35698 -128693 -63631 -291120 -81652 -209180
6754 -209180 -71567 -24390 -467850 8088 7272 -492259 -53735 -170427 -110478 145943 -91278
6742 -18959 -160575 114563 51678 230224 -68305 45349 146 218046 14460 -19127 -84904
6731 -84904 24089 53716 75133 258632 172381 49752 -217805 -85295 -53212 74513 -7849 400553
6718 -75862 233594 130773 -239390 27862 -419512 207536 12604 -284856 -185629 -65060 59442
6706 57820 71794 -35113 209859 -50054 162994 46438 -31706 113462 37082 141309 166556
6695 166556 -188193 36105 238823 -49467 -98497 -152945 34606 -51776 21508 -5361 26533
6683 -178118 -108359 85948 -326898 -1360 45754 -139697 127777 -130142 -220321 -43652 -95420
6672 -95420 -335762 -21154 5829 -277512 -283554 -143639 -118052 -76562 20753 -120660 109678
6660 72695 216531 252269 10935 -256236 -78328 90344 139797 -30256 179193 83939 -49578
6648 -281255 67628 -27640 -14057 -286730 -170253 -51475 -154573 138699 -106579 25368 409832
6637 409832 -197851 25898 98558 -396790 110558 -210960 -105593 -209773 -195543 97198
6626 136030 312437 -141722 -30821 -165670 -239864 -169395 59693 -345119 -155368 159919
6615 -309572 -14955 69108 206908 135234 4086 -71723 169723 36384 223492 142713 -267032
6603 -185150 -200356 -327374 64536 -297104 -282265 251835 -46297 -33550 -73078 41542 106834
6592 106834 -245737 383993 -182448 -213487 -39778 191749 -258056 -108756 227220 -63387
6581 -84147 47209 7670 147758 -302069 -31833 247341 -8398 65619 110352 -47249 211947
6569 -35567 -3277 16585 -144802 141037 160604 -65285 283669 377763 -460724 -159153 -75510
6557 -387451 -141717 -146863 -38625 -94303 148021 -110028 105939 143482 -126841 -66016 -254014
6546 -254014 -137509 127360 216874 -186842 2297 259833 -359022 -119694 -51661 238565
6535 -5925 570952 -116330 -30299 -30047 -79446 320243 -74734 -59389 -9351 -159102 238777 -53702
6522 6998 22998 -90547 -44764 289742 -174563 -10360 234570 39294 -222019 226565 173424
6511 173424 -197408 125261 83187 2429 218594 -139704 121449 -158678 -10062 116888
6500 -1794 -5067 9847 75098 109386 219555 -103922 -39460 -12430 47207 160318 -177833 433575
6487 72512 44003 -230493 95825 72950 -37516 -63652 -188424 -27357 112326 26942 79041
6476 79041 130994 76387 253338 -50136 4537 -99215 -317874 -137647 -260533 -12876 -143209
6465 -143209 -68062 -244690 -155456 -194370 -65951 -347667 57394 -263672 61910 347955 -147091
6453 -6472 -94244 -379235 -61990 -150233 184822 -266632 -203727 63332 -180870 276654 -37613
6441 -158513 -44541 -125841 -141172 15295 -358524 111021 -261257 153054 163960 17368 -248576
6429 45886 -356836 -362325 -308353 -153208 36418 -85832 99298 26003 -90816 8194 106748 353606
6417 353606 225096 -8750 14601 283549 89820 122236 157837 173727 -63043 -215245 36598
6405 21167 -22091 399 -15726 44147 201292 166423 53866 51331 20026 -146662 -45863 220744
6392 -54901 -49095 -61252 -57742 169319 -105485 113099 103536 143890 -194248 87847 57840 -18150
6379 -21795 -53657 -47205 126479 21108 -90407 -196402 -190505 -54979 111491 47173 109814 -119128
6366 -104707 127850 -85927 390504 -22732 140294 -123504 -1485 262534 -2237 -196614 123885
6354 -143442 109350 -254860 -139224 -144775 64109 -195685 111357 -71565 28558 245395 105958
6342 -27685 -163356 -145336 -350372 -32326 314545 186036 -86531 172173 -274411 -122110
6331 -127427 -186460 -14945 309334 47530 159 -55507 136223 -225539 -174177 -88397 10060
6319 664 59690 280035 75787 -22405 -139481 -313965 -229253 47100 125680 124209 -18612 189174
6306 -112449 -90455 135898 -37890 28193 -135574 -182798 17948 -244043 215912 -287000 -124424
6294 183406 -183228 -59711 112075 166814 140293 170381 -159963 2337 -226735 14135 180118
6283 180118 71243 1594 223764 -99013 40107 171566 -193860 211455 -11730 -2507 -153420
6272 -153420 397577 301490 -132619 -388305 60065 329982 -289859 133450 -259468 119581
6261 -316210 260986 -38354 292696 -169567 -189410 -49323 12293 -2140 98515 168893 -135039
6249 115702 -11875 39171 129977 -252891 -201855 -291433 64600 41539 -151085 -23758 224336
6237 301897 126471 75878 -27684 69067 -54967 -52633 156656 -167246 -90344 -283974 -229877
6226 -229877 -91198 196077 -249370 -61714 -231802 -50312 -55996 -21455 -56963 -206400 -357864
6215 -357864 -30040 -307222 127104 48933 11478 -182988 -77017 67208 -182716 70694 51150
6204 51150 -135972 -56006 124973 -134575 -253278 -193200 -122757 21698 137100 -303099 -171218
6193 -171218 -22241 103619 -302101 -208015 -136940 54219 180700 14186 57645 33983 11226
6181 117136 -56390 1037 -229687 -37009 -233186 -122156 -57819 -17074 118080 54181 80238
6170 80238 130616 191859 186219 164702 193773 74928 -86522 -372722 175155 -76888 280691
6158 -252107 -208561 -88747 -191378 118535 -68484 -138743 -349454 -172547 131843 84614 113193
6147 113193 -148437 55328 -415272 -54105 -114941 148655 76015 261447 -78118 261947 -43682
6135 -47918 -306460 -39672 277405 36370 50288 127345 36612 228338 -207324 -17606 -74329
6124 -74329 188980 69411 -33396 -15802 -156936 53583 -138619 -51092 169662 -87132 19308
6112 3146 -101132 -190264 -159854 26034 15243 109351 67310 -312947 -159755 -20008 101517
6100 31030 -58010 57805 -328524 72280 -179704 -95801 -54153 18585 -190190 57366 -299478
6088 207216 -51720 -27 17402 -245915 -173510 -181580 -77571 -55523 388618 -27054 -7199 -362564
6076 -362564 -73258 -91736 -131820 -9392 207786 292700 -51935 298147 -247755 -7202 114655
6064 -58059 404 -112691 106454 177625 -40121 100733 69761 -277395 -334592 122677 -99744
6052 167751 -132148 494951 118827 -108610 336284 27086 282957 -212759 -53723 -47402
6042 -47402 75773 -32782 19723 169381 -256308 114012 -380210 -27952 -102628 -12725 -2770
6030 36972 -15711 103601 -118907 105374 91120 26608 -12300 111392 -171690 124251 169686
6019 169686 269406 40888 -131049 -23985 -120778 -76703 -6200 17813 126911 141103 231830
6008 231830 121637 -365308 77270 189395 198885 -207486 129058 209715 164598 -50546 85846
5996 227482 283883 -8297 -157309 119809 55800 321443 41574 244257 251713 -79830 75815
5984 216662 106090 45276 -58086 -182752 -99718 138814 -327708 -14719 99809 200064 313333
5973 313333 139699 121740 12140 -148047 112465 67146 -172789 162282 -49418 -353479
5963 -353479 -343617 -161155 24979 387640 -536848 -182803 99369 57429 -334299 -164216 13070
5951 -213762 12527 125631 -134123 -159696 -189489 66663 369034 51582 -301001 243088 112972
5939 181215 -105685 65700 216905 -8914 -395672 14339 30965 -98332 124701 83690 54055
5928 54055 -36572 -123305 160038 -94377 -177411 -318645 26993 -169998 -21593 -139414 178271
5916 -15752 42513 -51017 -38357 145605 -81909 -80074 150744 10764 -104196 -281299 290290
5904 42176 -240213 -96427 -157315 243933 -328056 -25627 -229606 -93771 -71843 144593 46162
5892 -28773 71476 106963 360872 -175844 -222673 -403612 149075 -40788 -194291 -283284 361315
5880 318112 -142629 119496 -360045 237592 -44155 49200 -164072 -31768 143314 -144774
5869 279093 -167730 -300963 -142687 280555 167542 299163 29801 174471 -211795 -106630
5859 -106630 27385 37457 -113318 -111424 133000 -235918 -312301 -45620 117136 -242894 -79350
5847 9306 -28647 -77181 -24269 149570 -129806 127231 133721 -68461 253323 -95726 178488
5835 -72104 -128184 -119411 -7319 -202498 44849 -174828 64370 232872 -176880 -132141 128173
5823 -118630 -205599 -19156 87817 -53548 -50618 346159 166074 137921 -29259 -86462 512528
5811 209207 -19128 6685 -339907 149873 -43670 173963 -205761 -105592 86944 -50665 -309544
5800 -309544 41685 -39797 -58702 -82964 -293875 -189111 -428574 150340 57867 105520 -10467
5788 236664 -158092 390847 -342193 140315 -66947 153359 -54299 458925 -36145 -284586
5778 -284586 -217863 378332 121939 364406 -121657 -382036 -134884 160117 -66430 -148289
5768 -148289 -219448 -127015 -88088 -214326 -26771 -179357 -71957 -219329 72830 -155283 -188930
5757 -188930 111079 -157316 352582 86260 -133096 174269 8499 184722 -37808 126839
5746 118484 -31096 30066 114756 -75560 -98063 25363 -93577 -118327 -414458 -274288 -142123
5735 -142123 120792 -168272 177848 20213 -229396 -103448 -103429 -189811 201445 98340 253220
5724 253220 317358 156186 35033 -115228 28171 -49494 133676 154286 106675 47722 1231
5712 -48062 243430 14174 312788 -43133 30694 179747 -434334 -28612 -42745 -181903 272439
5700 -96927 -233852 -209856 155082 -101943 166969 -104198 -28566 129826 -92545 268497
5689 -75668 232342 115481 -86185 21684 50795 7543 254257 -267495 -16520 191210 -140584
5677 -33112 127838 -77917 -10292 -89300 13835 183750 141973 53851 318594 56053 -55246
5665 -127159 -52620 95277 43623 17572 94127 -14911 -41006 -141448 174571 -180315 89768
5653 2195 145497 108190 70983 26518 -71225 17164 110620 19158 -62006 239158 126682
5642 126682 69719 212737 -58259 75709 -90003 13983 21683 133428 220878 -121108 247407
5630 -96894 11883 -122951 97990 -33970 -276380 3845 342338 146343 149836 149793 -276814 -75654
5617 116791 -168014 142681 -200009 -139519 96663 131535 -228262 -212811 -154000 -256876 65609
5605 -132512 176018 324987 96025 -216902 -154363 -157764 19117 -4400 150230 82135 -117352
5593 -545092 159982 -120042 -28005 77481 277186 274538 185346 -72498 7565 -53274 53997
5581 107862 75677 -13342 205465 256941 185858 -57676 -25162 -252719 -60563 130878 133636
5570 133636 27820 -44244 194507 -24092 50946 -159691 142119 53859 -294275 331321 319043
5559 319043 -3908 -18053 27540 272236 -107241 100631 -291130 59284 -143311 -28208 -44679
5548 -44679 141868 463043 27725 147775 104801 -27501 133031 117838 -160888 -64527 -114079
5537 -114079 134751 -42300 277907 137085 143482 290639 -234693 -92123 204198 219142 111666
5526 111666 200642 -37790 -214217 264399 26349 329255 133731 -48979 160279 272771
5516 272771 152365 -246565 -94929 190803 78966 -23670 -26650 -179982 -114683 -206579 236102
5504 -269699 -167338 265840 -185248 -136834 -90646 -38746 84494 76270 51959 -14423 -35752
5493 -35752 -66014 88498 -46628 -25949 164955 -155306 -154270 170539 -146281 -149853 142130
5481 -94499 -225881 106434 -87525 225645 64116 -57464 55293 -63793 -161275 -53422 35889
5469 98008 -134523 21588 -102125 -340406 212613 -155424 -50722 134884 75999 18973 142304
5458 142304 314730 16217 331096 -169484 159915 -153856 -68479 -47176 33154 -367524
5447 9108 -246638 -205432 80232 -202203 -91366 134120 484623 -1459 28831 226412 17238
5435 -94319 -49169 183160 326012 -56195 -188337 188634 179434 220156 75839 -308122 134260
5423 -52440 -143855 175972 -186276 -5138 -135474 -66970 -96112 -70438 111929 -247027 -199020
5412 -199020 206944 -41823 -9146 -94192 28862 356788 33866 154032 -11696 -220937 218020
5400 109981 -139231 -263193 24874 -193946 -228519 211249 137159 159745 116123 -245792 95288
5388 -24005 364430 -90241 -92921 -118733 23039 -501437 31287 68988 101681 192515 -184049
5376 95098 -441528 -183526 -40477 -22936 166745 -29442 -290811 27905 79487 -77842 293498
5364 46531 439775 27184 -72243 -252807 -14094 -529474 -27567 -57693 11168 -206821 93649
5352 121345 -193823 107603 97028 -35413 254062 -37582 -17110 234525 272232 54738 -60205
5340 246918 22647 -148196 -6359 -341033 -131355 135142 -111434 -31048 50315 -126717 135995
5328 -177701 99500 -86531 61214 311796 -181953 -63896 -145263 -15902 11360 107077 223989
5317 223989 -31635 168150 -428267 -42801 104619 -206822 143154 311567 -139165 44799
5306 -258405 -34894 267200 -16760 166160 -25496 -48497 -57151 303585 226738 255319 -84152
5294 -141735 -184947 98829 -221115 42423 -30806 282071 38809 50795 -46712 -133447 71690
5282 16018 220010 193317 -94625 3756 165992 87053 37998 -88141 -88588 93337 25355 -39486
5269 -77342 292254 -84008 -39590 -86873 41091 -231165 -49885 -188009 182197 -82428 -98983
5258 -98983 -100282 90107 102613 -53704 -167009 64866 222251 67565 75802 -474908 144026
5246 48519 129591 -307092 241251 -168884 -180497 208931 9729 381072 -193201 226970 5806
5234 174611 31640 91566 185976 52508 -189624 25753 194700 161690 -41320 -41604 -157291
5223 -157291 138113 153321 -161930 78417 -37763 38387 70705 -204872 -243812 -73002 245086
5211 -185346 153920 67719 328587 472 21353 167156 275189 -189101 -36821 27151 -12767
5199 -33126 262880 55539 -168172 244504 -173534 221557 26300 205589 -99384 -209520
5189 -209520 -279496 233890 -48834 238924 95942 -235458 44865 16776 167680 14292 171761
5178 171761 136389 267877 -43657 -172643 -67128 212767 -122664 -18728 283515 41725 -156266
5166 43264 57963 -141899 -65370 -53697 -167239 42790 252343 -136879 -403949 -258109 195410
5154 -6151 120817 -3968 73972 177035 -39977 -138388 -250331 -95875 -181135 102343 -70146
5142 227889 75245 -98194 -211739 -44792 513064 344556 82241 13270 -52741 280762 -270870
5130 -167202 -209211 -148000 24866 -317587 -118065 -144109 -64977 -3200 -151672 95923 57037
5119 57037 -348306 -156733 -135135 -134883 -46281 -119255 289499 -24003 -163491 498663 -36425
5107 135112 48447 -163142 331876 -46346 -232861 40175 -113835 -197329 70955 236543 7767
5095 -101673 -31373 40688 206447 114001 40942 -209948 -143168 -42918 124956 205539 34470
5083 22058 95656 -86670 -128903 -141934 79411 -38056 -85016 187646 51405 250470 -109776
5071 -17832 119544 -134576 53578 72827 -124609 -23424 75532 97815 193140 214107 -70998
5059 -4956 81287 -211126 -158135 -30294 129862 188645 -283382 22062 -46185 86259 167850
5048 167850 219520 352711 141622 -245260 -210906 -212112 -106363 203306 371204 -358296
5037 -107646 -69681 87360 -6534 -39973 -4829 48887 -26864 -276699 -56902 -173197 200611
5025 -13015 7210 154726 -35670 266027 -18374 -63277 76211 297447 16863 -211297 -74468
5013 386860 -521542 -67426 -104429 -69879 170599 53730 202116 114303 -33430 -327052 -7762
5001 108502 94181 107511 -24531 -11586 -192624 295644 -152323 145089 -17263 60808 321530
4990 321530 -288025 210446 16862 69751 4364 -180944 252673 -9621 -451772 -150354 104612
4978 -15861 9627 -108292 -109251 -585763 -53493 13877 -86756 -322978 249205 91663 322393
4967 322393 -82369 -70140 -41929 144193 128924 -234515 359218 68203 237203 -11936 -31564
4956 -31564 -226437 306060 36824 -317575 -8194 -97814 -58983 72942 276044 -29508 143366
4944 60520 -113876 -76119 179720 -139003 119240 151019 -343333 18706 143294 103075 -141555
4932 -209886 -183966 94452 -11277 268768 24844 -319939 201092 -201160 28956 108001 -80874
4920 -173717 26437 31903 -173515 51834 -135056 -301144 -198291 292712 105177 328499
4910 328499 197506 35294 -93405 373806 93644 -292426 28645 167933 63896 -263311 -71716
4898 -314151 18502 -26129 -94796 -536510 335020 313040 275800 -53586 235001 217227 35496
4886 398851 -45926 73363 -111961 104637 182209 -193801 -140282 285197 -68284 -220736 81522
4874 -5959 -22698 -153223 218736 64115 -22974 -47786 113203 -1893 210944 379643 -385018
4862 -130325 6902 291970 118478 -140525 -42755 -150267 192657 -44582 197232 -135272
4851 280456 103281 261161 69874 203911 -182828 45171 -25141 266059 -76926 54642 -20724
4839 299727 22219 118431 -105134 216275 118098 -121135 56302 -28630 73729 -29673 -102480
4828 -102480 -117720 8758 -238717 282026 115007 170897 -72675 -34477 -117232 -211637 86440
4816 114428 202089 -38764 -23964 85518 218911 -224322 -438803 -101046 -6549 -28040 -27102
4805 -27102 -19568 109530 -176929 -68319 -63374 -245299 29894 102103 543578 9911 -105662
4793 163530 -84990 29816 -4884 233701 -97061 -127644 -134275 130399 99042 -16204 99637 198278
4781 198278 15784 -89707 201466 319348 312240 -119672 -104033 -213809 74348 -233777 -82186
4769 -6814 -18430 -98622 109390 -162767 110708 -53690 203683 -102972 232789 85377 -64667
4757 50077 -27319 23784 -152284 -46270 110839 -171009 -198785 65171 -389830 -301309 -141756
4745 -7855 -135323 253377 -400722 -140764 176986 -260496 194516 -25812 24138 -289506
4734 21351 34172 110857 -15505 -147590 110267 111168 178924 -25530 149934 183451 -104007
4722 -106069 174342 238 -36130 70172 64512 13545 28572 16459 42867 68967 -390407 -355662
4710 -355662 85222 298560 310510 -125846 -137578 -171402 -342848 182865 85330 -77219 -197248
4699 -197248 -95752 -127335 367986 -110421 -127917 160152 -96899 177836 -35477 281675 -54072
4687 155652 400911 -201977 89668 -307215 73101 28430 -126905 -21820 259466 17623 232410
4676 232410 152510 141091 159574 -16400 -351340 -3436 -57746 7619 -80935 -27942 225710 17054
4663 -303391 202503 -24990 -50423 -180680 142721 191821 -93671 -91393 -275098 533346 -33082
4651 -11301 240284 180573 -85093 -6197 207404 38343 -46025 73377 -61320 -270151 31779
4639 81138 30468 -48376 -83363 -163961 -270292 8488 208779 20208 -35074 117652 133835
4628 133835 -321098 261853 240971 149521 -202417 99972 85181 335560 -274861 -465280
4618 -465280 77393 259799 142314 175678 -138915 50061 58345 -148477 -214279 9363 382203
4607 382203 -146016 -273969 -25434 -233654 242665 -37841 -291827 221485 431592 166770
4596 100232 193254 215895 224045 11450 243922 -13436 -108814 -18290 -106180 272700 210147
4585 210147 374371 -11474 31014 179432 -172279 274389 133608 -49196 390143 -29807
4574 -122554 -11708 275803 178180 140905 283125 -236108 189422 27767 -183589 126757
4563 63321 260991 107227 -122547 -40593 -71907 51439 -60922 123163 -36295 60028 -16912
4551 92832 -78199 -276288 80765 -6824 166058 -245688 220080 -142818 118850 -211532 -168155
4540 -168155 -225149 -19683 -359289 -71517 -161698 -77081 -76748 -176756 -89294 -19794 284659
4528 228793 -326766 192447 -54531 75699 -323764 -126530 370176 26599 63432 -70885 46760
4516 -204460 -71979 10918 -10689 135737 16024 165990 63276 215274 170493 -16677 -161800
4505 -161800 3446 -344597 74260 264599 14128 -87643 -59692 -376578 52216 41002 -23365
4493 13710 -85523 -76675 39372 -115440 249198 -41530 -204844 60869 118341 -105171 -189866
4482 -189866 149260 1525 181137 -62117 431406 -92232 -81901 -63791 48345 201758 243159
$$ [...]
##END NTUPLES=NMR SPECTRUM
##END=
