
##TITLE=AC1404_GUAAH12213_7653413_rbBq1cP9aP
##JCAMPDX= 6.0         $$ Bruker NMR JCAMP-DX V2.0
##DATA TYPE= NMR SPECTRUM
##DATA CLASS= NTUPLES
##ORIGIN= BRUKER
##OWNER= Administrator
$$ 1.72 TOPSPIN		Version 2.1
$$ 2013-03-20 00:05:27.418 -0500  Administrator@X
$$ Compression mode = diff/dup
##.OBSERVE FREQUENCY= 400.02188249412
##.OBSERVE NUCLEUS= ^1H
##.ACQUISITION MODE= SIMULTANEOUS (DQD)
##.ACQUISITION SCHEME= undefined
##.AVERAGES= 64
##.DIGITISER RES= 22
##SPECTROMETER/DATA SYSTEM= spect
##.PULSE SEQUENCE= noesygpps1d.comp
##.SOLVENT NAME= COFFEE_meoh
##.SHIFT REFERENCE= INTERNAL, COFFEE_meoh, 1, 14.96087
##AUDIT TRAIL= $$ (NUMBER, WHEN, WHO, WHERE, PROCESS, VERSION, WHAT)
$$ ##TITLE= Audit trail, TOPSPIN		Version 2.1
$$ ##JCAMPDX= 5.01
$$ ##ORIGIN= Bruker BioSpin GmbH
$$ ##OWNER= Administrator
$$ $$ E:\/data/COFFEE/nmr/AC1404_GUAAH12213_7653413_rbBq1cP9aP/12/pdata/1/auditp.txt
$$ ##AUDIT TRAIL=  $$ (NUMBER, WHEN, WHO, WHERE, PROCESS, VERSION, WHAT)
(   1,<2013-03-20 00:05:21.465 -0500>,<Administrator>,<X>,<go>,<TOPSPIN 2.1>,
      <created by zg
	started at 2013-03-19 23:53:51.652 -0500,
	POWCHK enabled, PULCHK disabled,
       configuration hash MD5:
       86 BA 57 50 F2 9D 5C 9B 26 00 A9 28 5F 66 2E 89
       data hash MD5: 64K
       4B A0 C7 A8 82 46 E5 29 4B 3A DF CA B1 B7 BE 63>)
(   2,<2013-03-20 00:05:24.559 -0500>,<Administrator>,<X>,<proc1d>,<TOPSPIN 2.1>,
      <Start of raw data processing
       efp LB = 0.3 FT_mod = 6 PKNL = 1 PHC0 = 0 PHC1 = 0 SI = 128K 
       data hash MD5: 128K
       30 CB 02 AD B1 83 CE EB E3 25 EE C1 58 DE D7 53>)
(   3,<2013-03-20 00:05:25.652 -0500>,<Administrator>,<X>,<proc1d>,<TOPSPIN 2.1>,
      <pk PHC0 = -79.57947 PHC1 = 0 
       data hash MD5: 128K
       D4 81 40 92 4D DC B2 2C 9D FE BB F7 7F 7D 68 D4>)
(   4,<2013-03-20 00:05:26.355 -0500>,<Administrator>,<X>,<proc1d>,<TOPSPIN 2.1>,
      <abs ABSG = 1 
       data hash MD5: 128K
       C4 27 97 20 A5 89 EA D2 B5 94 A6 79 E9 D8 CE 99>)
(   5,<2013-03-20 00:05:26.527 -0500>,<Administrator>,<X>,<proc1d>,<TOPSPIN 2.1>,
      <abs ABSG = 2 
       data hash MD5: 128K
       2B 63 19 91 E6 D0 E5 E1 24 2B E8 46 22 30 85 8B>)
(   6,<2013-03-20 00:05:26.715 -0500>,<Administrator>,<X>,<proc1d>,<TOPSPIN 2.1>,
      <abs ABSG = 3 
       data hash MD5: 128K
       66 1C 94 F9 B9 C9 58 51 66 88 36 15 77 90 33 24>)
(   7,<2013-03-20 00:05:26.902 -0500>,<Administrator>,<X>,<proc1d>,<TOPSPIN 2.1>,
      <abs ABSG = 4 
       data hash MD5: 128K
       F9 9F 6A 87 7B D1 C7 8A E1 C7 88 B3 15 2A DC 3B>)
(   8,<2013-03-20 00:05:27.090 -0500>,<Administrator>,<X>,<proc1d>,<TOPSPIN 2.1>,
      <abs ABSG = 5 
       data hash MD5: 128K
       8F C1 65 21 0B AB 40 E5 65 DD AF 76 51 2B 84 58>)
$$ ##END=
$$ 
$$ $$ hash MD5
$$ $$ 0C B5 D6 3C FF 9E F3 BE 99 C4 FD 22 9F 5C F6 7F
##$RELAX= 
##$RELAX= 
##$RELAX= 
##$RELAX= 
##$RELAX= 
##$RELAX= 
##$RELAX= 
##$RELAX= 
$$ Bruker specific parameters
$$ --------------------------
##$DU= <E:\>
##$EXPNO= 12
$$ [...]
##$TP07= 0
##$TPNAME0= <>
##$TPNAME1= <>
##$TPNAME2= <>
##$TPNAME3= <>
##$TPNAME4= <>
##$TPNAME5= <>
##$TPNAME6= <>
##$TPNAME7= <>
##$TPOAL= (0..7)
0.5 0.5 0.5 0.5 0.5 0.5 0.5 0.5
##$TPOFFS= (0..7)
0 0 0 0 0 0 0 0
##$TUNHIN= 0
##$TUNHOUT= 0
##$TUNXOUT= 0
##$USERA1= <user>
##$USERA2= <user>
##$USERA3= <user>
##$USERA4= <user>
##$USERA5= <user>
##$V9= 5
##$VALIST= <valist>
##$VCLIST= <CCCCCCCCCCCCCCC>
##$VD= 0
##$VDLIST= <DDDDDDDDDDDDDDD>
##$VPLIST= <PPPPPPPPPPPPPPP>
##$VTLIST= <TTTTTTTTTTTTTTT>
##$WBST= 2048
##$WBSW= 25
##$XGAIN= (0..3)
0 0 0 0
##$XL= 0
##$YL= 0
##$YMAX_a= 6158088
##$YMIN_a= -12849834
##$ZGOPTNS= <>
##$ZL1= 120
##$ZL2= 120
##$ZL3= 120
##$ZL4= 120
##$ABSF1= 14.96087
##$ABSF2= -5.597312
##$ABSG= 5
##$ABSL= 3
##$ALPHA= 0
##$AQORDER= 0
##$ASSFAC= 0
##$ASSFACI= 0
##$ASSFACX= 0
##$ASSWID= 0
##$AUNMP= <proc_prof1d_extract.lims>
##$AXLEFT= 0
##$AXNAME= <>
##$AXNUC= <1H>
##$AXRIGHT= 0
##$AXTYPE= 0
##$AXUNIT= <>
##$AZFE= 0.1
##$AZFW= 0.1
##$BCFW= 0
##$BC_mod= 0
##$BYTORDP= 0
##$COROFFS= 0
##$CY= 15
##$DATMOD= 1
##$DC= 0
##$DFILT= <>
##$DTYPP= 0
##$F1P= 0
##$F2P= 0
##$FCOR= 0.5
##$FTSIZE= 131072
##$FT_mod= 6
##$GAMMA= 0
##$GB= 0
##$INTBC= 1
##$INTSCL= 1
##$ISEN= 128
##$LB= 0.3
##$LEV0= 0
##$LPBIN= 0
##$MAXI= 10000
##$MC2= 0
##$MEAN= 0
##$ME_mod= 0
##$MI= 0
##$NCOEF= 0
##$NC_proc= -2
##$NLEV= 6
##$NOISF1= 0
##$NOISF2= 0
##$NSP= 0
##$NTH_PI= 0
##$NZP= 0
##$OFFSET= 14.96087
##$PC= 1
##$PHC0= -79.57947
##$PHC1= 0
##$PH_mod= 1
##$PKNL= yes
##$PPARMOD= 0
##$PPDIAG= 0
##$PPIPTYP= 0
##$PPMPNUM= 2147483647
##$PPRESOL= 1
##$PSCAL= 4
##$PSIGN= 0
##$PYNMP= <proc.py>
##$REVERSE= no
##$SF= 400.020009690653
##$SI= 131072
##$SIGF1= 0
##$SIGF2= 0
##$SINO= 400
##$SIOLD= 131072
##$SPECTYP= <>
##$SREGLST= <1H.CDCl3>
##$SSB= 0
##$STSI= 131072
##$STSR= 0
##$SW_p= 8223.68421052631
##$SYMM= 0
##$S_DEV= 0
##$TDeff= 65536
##$TDoff= 0
##$TI= <>
##$TILT= no
##$TM1= 0
##$TM2= 0
##$TOPLEV= 0
##$USERP1= <user>
##$USERP2= <user>
##$USERP3= <user>
##$USERP4= <user>
##$USERP5= <user>
##$WDW= 1
##$XDIM= 131072
##$YMAX_p= 401947304
##$YMIN_p= -11827
##$CURPLOT= <Network HP LaserJet P1505>
##$CURPRIN= <$Network HP LaserJet P1505>
##$DFORMAT= <normdp>
##$LAYOUT= <+/1D_H.xwp>
##$LFORMAT= <normlp>
##$PFORMAT= <normpl>
##$SURQMSG= 1
$$ End of Bruker specific parameters
$$ ---------------------------------
##NTUPLES= NMR SPECTRUM
##VAR_NAME=  FREQUENCY,     SPECTRUM/REAL,   SPECTRUM/IMAG
##SYMBOL=    X,             R,               I
##VAR_TYPE=  INDEPENDENT,   DEPENDENT,       DEPENDENT
##VAR_FORM=  AFFN,          ASDF,            ASDF
##VAR_DIM=   131072,        131072,          131072
##UNITS=     HZ,            ARBITRARY UNITS, ARBITRARY UNITS
##FACTOR=    0.0627417313425164, 1,          1
##FIRST=     8223.62146879497, 3767,         -64526
##LAST=      0,             6028,            -64034
##MIN=       0,             -11827,          0
##MAX=       8223.62146879497, 401947304,    0
$$ Real data points
##PAGE= N=1
##DATA TABLE= (X++(R..R)), XYDATA
$$ [...]
67956 78701 77093 76745 76949 76994 76666 76022 75067 73991 73374 73603 74228 74360 73694 72719 71941 71378 70906 70683 70956
67937 70956 71678 72537 73208 73461 73234 72754 72507 72900 73980 75501 77121 78421 78903 78218 76500 74406 72715
67920 72715 71879 71929 72733 74172 75938 77386 77961 77856 77863 78337 78637 77999 76697 75738 75458 75032 73583 71293
67902 71293 69059 67495 66706 66736 67662 69208 70720 71665 71940 71697 71089 70310 69604 69135 68946 69073 69518 70134
67884 70134 70764 71553 72745 74036 74489 73500 71695 70394 70178 70408 70289 69965 70232 71431 73090 74636 75996
67867 75996 77333 78536 79303 79613 79769 79942 79917 79400 78406 77185 75909 74635 73527 72836 72513 72034 70844
67850 70844 69000 67158 65912 65245 64725 64071 63399 62926 62611 62140 61292 60316 59889 60490 61729 62535 62239 61369
67832 61369 61053 61696 62674 63439 64407 66359 69260 72248 74749 77031 79503 81960 83940 85540 87377 89758
67816 89758 92223 93935 94303 93235 91158 88884 87101 85758 84121 81644 78625 75868 73854 72460 71246
67801 71246 69708 67441 64531 61753 59949 59161 58735 58328 58324 59062 60151 60946 61356 61705 62006 61914 61360 60739
67783 60739 60372 60122 59707 59106 58507 58005 57485 56756 55797 54914 54562 54847 55330 55519 55504 55854 56917 58531 60378
67764 60378 62257 63933 65046 65479 65644 66202 67465 69080 70269 70450 69748 68818 68107 67494 66854 66627 67301
67747 67301 68474 69063 68556 67552 66887 66742 66828 66932 66922 66626 66092 65702 65683 65760 65538 64975 64232 63375 62511 61834
67727 61834 61220 60204 58762 57634 57357 57359 56686 55404 54576 54989 56522 58620 60621 61623 60896 58724 56334
67710 56334 54731 53996 53748 53692 53548 53059 52364 51915 51799 51664 51519 51975 53337 54983 56145 56737 56904 56290
67692 56290 54579 52476 51274 51402 52095 52639 53308 54787 57174 59842 61964 62913 62454 60943 59197 57876
67676 57876 57040 56510 56466 57300 58846 60193 60538 60052 59633 59918 60879 62262 63937 65656 66920 67478 67681
67659 67681 67981 68294 68309 68198 68434 68953 69124 68697 68199 68147 68423 68731 69178 69946 70713 70832 69902 67951 65406
67640 65406 63212 62513 63606 65443 66667 66981 66987 67002 66792 66339 66042 65938 65466 64365 63240 62875 63328 64122
67622 64122 64965 65896 66963 68176 69611 71205 72542 73155 72981 72290 71254 69848 68182 66690 65905 66098
67606 66098 67059 68173 68807 68759 68330 67899 67586 67339 67088 66689 65979 65140 64748 65109 65710 65728 65020 64221 63865
67587 63865 63856 63894 63938 63987 63767 63007 61894 60882 60182 59694 59426 59633 60454 61592 62459 62583 61892 60699 59446
67568 59446 58397 57575 57028 56991 57636 58715 59672 60151 60267 60406 60869 61617 62175 61799 60091 57567 55409 54476
67550 54476 54668 55300 55850 56157 56174 55869 55365 54841 54277 53463 52347 51229 50568 50605 51133 51608 51617 51318 51258 51630
67530 51630 51930 51616 50876 50393 50442 50670 50782 50899 51102 51076 50632 50223 50488 51384 52199 52422 52264 52227 52480 52831
67510 52831 53134 53458 53782 53723 52809 51178 49826 49814 51159 52772 53641 53812 53976 54379 54604 54266 53408 52121
67492 52121 50339 48375 47236 47795 49677 51423 51933 51421 50845 50789 51210 51962 52981 53976 54446 54272 53970
67475 53970 54107 54637 55062 55057 54675 54113 53567 53256 53271 53464 53694 54126 54995 56160 57227 58044 58727 59274 59562
67456 59562 59723 60011 60202 59685 58356 56955 56143 55686 54963 53977 53384 53690 54757 55975 56601 56194 55062
67439 55062 54122 53963 54214 54176 53825 53755 54317 55362 56704 58230 59540 60054 59658 58853 58144 57618 57152 56663
67421 56663 56057 55357 54921 55164 55914 56427 56216 55510 54845 54594 54962 55948 57066 57619 57462 57095 56717 55818 54114
67402 54114 52354 51522 51565 51570 51042 50342 49917 49813 50017 50616 51381 51708 51374 50994 51303 52150 52580 51950 50718
67383 50718 49992 50387 51427 52119 52064 51833 52187 53148 54075 54514 54631 54783 55015 55150 55152 55144 55137 54932 54366 53602 53096
67362 53096 53208 53816 54429 54773 55106 55778 56594 56975 56773 56596 57068 58018 58710 58783 58660 58926 59530 59790 59145
67343 59145 57789 56546 56105 56430 56891 56892 56307 55383 54407 53569 52969 52591 52313 52102 52192 52816 53785 54575 54970
67324 54970 55376 56278 57573 58757 59668 60648 61854 62805 62860 61922 60435 58880 57586 56883 56989 57698 58445
67307 58445 58823 58909 59049 59487 60211 60940 61264 61025 60666 60902 61925 63063 63412 62711 61544 60797 60997 61970
67289 61970 63005 63446 63244 62844 62528 62088 61261 60261 59644 59776 60606 61775 62734 62940 62266 61247 60620 60634
67271 60634 60913 60979 60692 60197 59715 59498 59809 60757 62147 63597 64873 66122 67665 69448 70795 70978 70036
67254 70036 68750 67733 66919 66122 65666 66000 66931 67750 68010 67702 66763 64997 62629 60431 59005 58275 57901
67237 57901 57848 58274 59130 60205 61406 62674 63743 64284 64302 64184 64309 64725 65203 65537 65752 66029 66408 66642
67219 66642 66447 65833 64983 63908 62527 61136 60414 60757 61868 63187 64457 65634 66564 67149 67669 68528 69709
67202 69709 70820 71589 71969 71887 71348 70864 71212 72488 73758 73982 73126 72124 71905 72713 74164 75611 76475
67185 76475 76565 76206 75876 75663 75221 74375 73582 73627 74836 76642 77988 78195 77508 76776 76530 76482 75990 74930 73898
67166 73898 73541 73883 74411 74687 74774 75109 76015 77240 78025 77850 77189 77197 78451 80228 81379 81644 81669 81881 81992
67147 81992 81683 81195 80891 80707 80400 79993 79610 79185 78823 79142 80684 83050 85143 86252 86498 86321 86137 86515
67129 86515 87972 90259 92311 93311 93481 93573 93943 94488 95120 95814 96380 96657 96843 97277 97962 98664 99334 100063
67111 100063 100718 101117 101566 102677 104495 106236 107198 107650 108474 110102 112074 113542 113971 113389 112247 111124
67095 111124 110397 110082 110027 110265 111066 112552 114371 115906 116873 117536 118228 118861 119155 119240 119636 120592 121798 122955
67077 122955 124248 125930 127721 129038 129696 130014 130278 130556 130999 131846 133029 134153 135073 136193 137964 140267
67061 140267 142470 143937 144421 144205 143995 144428 145542 146881 148143 149449 150879 152158 153075 153868 154866 156040
67045 156040 157221 158492 159977 161481 162811 164217 165978 167724 168855 169622 171078 173713 176813 179545
67031 179545 182117 185293 189103 192671 195225 196762 197746 198641 199827 201516 203478 205108 206019 206548 207556
67016 207556 209740 213097 216928 220355 222998 225244 227806 231001 234571 238081 241269 244016 246363 248792
67002 248792 252209 257211 263287 269008 273171 275757 277810 280445 283992 287939 291617 294909 298276 302114
66988 302114 306241 310158 313714 317270 321209 325534 330095 335023 340654 347081 353875 360304 365755 370059
66974 370059 373638 377386 382196 388433 395726 403252 410255 416514 422518 429132 436830 445185 453338 461066
66960 461066 469153 478466 488851 499234 508844 518021 527668 538159 548990 559432 569309 579117 589571
66947 589571 601117 613738 627045 640552 653966 667277 680525 693576 706327 719194 733174
66936 733174 749062 766629 784758 802501 819829 837346 855605 874893 895385 917082 939612
66925 939612 962426 985307 1008520 1032455 1057361 1083387 1110552 1138497 1166643 1194878 1223869
66914 1223869 1254304 1285918 1317696 1349069 1380579 1413155 1447024 1481605 1516346 1551385 1587371
66903 1587371 1624849 1663894 1704173 1745231 1786748 1828621 1870862 1913419 1956105 1998697 2041057
66892 2041057 2083133 2124872 2166171 2206952 2247227 2287027 2326217 2364389 2400991 2435637 2468362
66881 2468362 2499574 2529677 2558602 2585599 2609509 2629444 2645365 2658070 2668479 2676840 2682663 2685391
66869 2685391 2684940 2681426 2674665 2664400 2651038 2635600 2618591 2599325 2576874 2551399 2523918 2494828
66857 2494828 2463482 2429510 2393816 2357597 2320839 2282565 2242460 2201457 2160540 2119602 2077855
66846 2077855 2034968 1991416 1947938 1904977 1862518 1820243 1777967 1736084 1695368 1656114 1617699
66835 1617699 1579324 1540949 1503126 1466127 1429799 1394278 1360126 1327461 1295437 1263129 1230767
66824 1230767 1199629 1170722 1143855 1117966 1092123 1066156 1040622 1016196 992947 970186 947194
66813 947194 924116 901903 881340 862325 844149 826161 808042 789780 771718 754419 738095
66802 738095 722233 706160 689976 674554 660505 647464 634569 621383 608090 595017 582303
66791 582303 569977 558086 546661 535744 525470 515932 506916 497930 488650 479291 470382 462134 454111
66778 454111 445639 436600 427723 419938 413432 407499 401307 394588 387573 380564 373867 367844 362585 357592
66764 357592 352179 346265 340430 335121 330226 325595 321516 318260 315380 311973 307615 302688 297777 293076
66750 293076 288502 284065 279893 276018 272342 268789 265368 262146 259239 256743 254576 252435 250027 247257
66736 247257 244116 240492 236402 232411 229409 227643 226149 223598 219746 215710 212643 210500 208337 205516
66722 205516 202190 198838 195835 193475 191863 190588 188962 186892 185133 184309 184001 183236 181693 179920 178360
66707 178360 176729 174550 171968 169696 168230 167299 166085 163919 160853 157580 154839 152917 151701 150971 150444
66692 150444 149708 148465 146849 145283 143993 142907 141985 141287 140669 139817 138792 138183 138389 138934 138851 137601 135374
66675 135374 132672 130028 128091 127445 127986 128726 128552 127199 125341 123801 122837 122194 121583 120908 120141 119260 118351
66658 118351 117619 117167 116873 116584 116333 116190 115988 115454 114600 113741 113072 112500 111975 111710 111828 111992 111695 110848 109799
66639 109799 108768 107544 105866 103919 102261 101282 100805 100208 98931 96897 94558 92561 91377 91067 91235
66624 91235 91209 90475 89108 87707 86826 86559 86741 87355 88473 89890 91062 91502 91095 90036 88640 87239 86082
66607 86082 85178 84318 83361 82390 81554 80846 80189 79638 79326 79208 79035 78709 78543 79001 80187 81748 83279 84612
66589 84612 85578 85785 85011 83714 82704 82185 81542 80270 78731 77663 77275 77268 77505 78030 78511 78311 77313 76189
66571 76189 75577 75352 74954 74174 73313 72771 72700 72868 72709 71813 70583 70058 70749 71969 72689 72726 72590 72464 72106
66552 72106 71649 71676 72284 72776 72635 72200 72002 71952 71727 71507 71654 71986 72044 71962 72340 73210 73817 73636 73029 72586
66532 72586 72309 71796 70875 69635 68111 66365 64706 63515 62909 62854 63368 64259 64879 64647 63804 63202 63284 63661
66514 63661 63744 63363 62666 61860 61321 61546 62615 63900 64635 64659 64323 63848 63170 62354 61809 62017 63211 65238
66496 65238 67492 68984 68857 67012 64157 61240 58943 57627 57338 57663 57847 57380 56461 55744 55630 55935 56222
66479 56222 56311 56387 56696 57248 57901 58617 59460 60260 60566 60212 59784 60094 61146 62015 61983 61411 61187 61574 62063 62234
66459 62234 62240 62345 62430 62215 61671 60954 60120 59225 58560 58424 58682 58856 58726 58590 58810 59358 60017 60830 62001 63376
66439 63376 64345 64428 63782 63008 62539 62396 62428 62587 62883 63158 63041 62171 60558 58746 57503 57208 57536 57875 58041
66420 58041 58433 59356 60374 60571 59516 57827 56649 56617 57415 58307 58921 59393 59900 60330 60475 60342 60043 59498
66402 59498 58519 57211 56060 55493 55514 55895 56543 57445 58370 58941 59037 58910 58822 58806 58861 59106 59464 59421 58492 56889
66382 56889 55373 54347 53487 52429 51457 51101 51290 51374 51016 50675 51077 52430 54271 55871 56674 56583 56000 55565
66364 55565 55726 56544 57783 58990 59604 59390 58810 58569 58734 58721 58358 58331 59170 60242 60464 59705 58744 57994 57131
66345 57131 56109 55661 56335 57618 58579 58964 59136 59232 58995 58373 57803 57813 58569 59840 61141 61988 62236 62206 62319
66326 62319 62642 62885 62761 62190 61305 60422 59919 59898 60054 60007 59615 58836 57567 56005 54926 55099 56351 57643
66308 57643 58136 57894 57472 57202 57048 56862 56551 56158 55873 55807 55682 55004 53712 52431 51950 52565 53974 55590
66290 55590 56807 57186 56639 55457 54115 53135 53037 54070 55878 57680 58981 59943 60946 61986 62690 62716 62002
66273 62002 60885 60108 60432 61941 63952 65844 67661 69579 71146 71638 71032 69985 68788 66966 64191
66258 64191 61165 59143 58756 59544 60560 61229 61607 61977 62290 62170 61528 60954 61187 62275 63590 64657 65534
66241 65534 66300 66637 66230 65290 64353 63700 63246 62835 62380 61771 60903 59789 58540 57296 56297 55871 56157 56916
66223 56916 57735 58351 58665 58647 58407 58253 58468 59038 59701 60155 60170 59771 59457 59923 61275 62787 63738 64244 64818
66204 64818 65381 65352 64673 64098 64222 64690 64671 63830 62592 61674 61528 62055 62688 62869 62532 61967 61306 60422 59324
66185 59324 58250 57366 56758 56773 57807 59565 61086 61857 62409 63390 64542 65156 65154 65065 65154 65246 65311 65578 66014 66265
66165 66265 66227 66202 66365 66509 66426 66204 66049 66136 66656 67550 68210 67919 66739 65496 64794 64536 64552 65017 65874 66474
66145 66474 66395 66147 66422 66978 67022 66531 66349 66848 67288 66913 66088 65793 66254 66660 66224 65032 63715 62690 62106
66126 62106 62223 63276 64808 65659 65121 63897 63421 64238 65557 66485 67086 67908 68959 69754 70130 70448 70991
66109 70991 71613 72032 72068 71606 70757 70117 70368 71368 72064 71681 70687 70190 70580 71288 71793 72265 72991 73679 73783
66090 73783 73302 72784 72603 72677 72936 73576 74561 75305 75322 75019 75344 76594 78017 78731 78727 78697 79081 79523 79268 78026
66070 78026 76408 75447 75630 76514 77462 78457 79813 81294 82182 82274 82183 82382 82557 82257 81612 80941 80098 78856
66052 78856 77585 76909 76869 76985 76980 76826 76281 75133 73926 73654 74635 76267 78006 79906 81961 83704 84870
66035 84870 85900 87246 88629 89461 89697 89711 89581 89019 87901 86431 84871 83516 82862 83420 85188 87519
66019 87519 89516 90534 90486 89921 89685 90245 91346 92452 93352 94105 94569 94375 93472 92423 92009 92575 93807
66002 93807 95144 96360 97704 99382 101076 102317 103285 104810 107381 110543 113566 116338 119232 122360 125483
65987 125483 128510 131614 134829 137856 140304 141918 142714 143140 143881 145087 145917 145353 143434 141198 139379
65972 139379 137694 135532 132845 130087 127665 125692 124006 122155 119640 116417 113001 109972 107584 105872
65958 105872 104779 103991 103021 101736 100543 99847 99658 99913 100774 102205 103684 104775 105723 106928 108109 108660
65942 108660 108713 109143 110425 112146 113823 115573 117617 119606 120907 121341 121305 121416 122263 124149 126635 128616
65926 128616 129345 129330 129751 131015 132327 132787 132514 132541 133869 136750 140617 144477 147555 149777 151648 153701
65910 153701 156180 159175 162671 166362 169746 172680 175569 178699 181579 183306 183569 183042 182751 183225 184230
65895 184230 185087 185279 184894 184492 184443 184545 184438 184103 183575 182355 179680 175504 170731 166261 162187 158177 154242
65878 154242 150705 147674 144941 142324 139729 136921 133626 129955 126486 123752 121765 120096 118399 116779
65864 116779 115642 115114 114718 113851 112608 111866 112316 113617 114730 114985 114524 113815 113036 112061 110855 109767 109391
65847 109391 110028 111249 112216 112601 112971 114022 115596 116842 117264 117224 117414 118146 119229 120215 120637 120259 119319
65830 119319 118384 117939 118176 119148 120820 122943 125091 126980 128689 130571 133120 136799 141670 147175 152534
65815 152534 157420 161937 165960 168998 170891 172222 173657 175130 175990 175760 174413 172118 169078 165698 162580
65800 162580 160244 158773 157672 156092 153480 150177 147177 145142 143836 142655 141405 140306 139498 138946 138670
65785 138670 138693 138841 138932 139160 139972 141610 144034 147319 151756 157470 164183 171433 178870 186339 193823 201308
65769 201308 208519 214809 219519 222441 223756 223563 221708 218041 212642 205775 197866 189465 181010 172666
65755 172666 164657 157619 152164 148147 144882 142208 140781 141080 142649 144749 147392 151246 156783 163949
65741 163949 172453 181861 191521 200883 209959 219073 228119 236381 243107 247875 250428 250645 248913 246101
65727 246101 242745 238385 232016 223227 212737 201876 191643 182272 173509 165172 157346 150100 143270
65714 143270 136751 130844 125969 122002 118246 114226 110220 106896 104633 103341 102656 102089 101281 100413 100112
65699 100112 100640 101408 101668 101419 101182 101118 101059 101238 102162 103580 104432 104249 103947 104647 106225 107658 108380 108560
65681 108560 108382 107927 107708 108445 110137 112058 113904 116293 119849 124340 129100 133799 138424 142963 147648
65666 147648 153179 160191 168610 177895 187696 197912 208372 218972 229989 241698 253671 264835
65654 264835 274269 281665 287058 290594 292664 293858 294576 294838 294606 294186 294171 294990 296427 297609 297727 296910
65638 296910 296061 295650 295062 293439 290674 286956 281749 274179 264367 253514 242531 231361 219823 208265
65624 208265 196970 185704 174410 163796 154686 147203 141066 136182 132460 129472 126864 124684 122816
65611 122816 120616 117770 115054 113433 112704 111843 110428 108812 107140 105186 103165 101673 100722 99802 99073
65596 99073 99431 100975 102448 102785 102405 102243 102345 102277 102246 102803 103763 104432 104731 105225 106113 107050 108034 109656 112297
65577 112297 115688 119482 123610 127905 131984 135873 140269 145864 152749 160714 169699 179585 189942 200394
65563 200394 211006 221886 232571 242174 250044 256009 260127 262542 263436 262820 260396 255934 249659 241962
65549 241962 232864 222232 210559 199031 188594 179306 170852 163341 157176 152302 148125 144240 140907
65536 140907 138552 137069 135834 134366 132763 131504 131004 131372 132409 133696 134769 135347 135403 134979 134043 132623
65520 132623 130963 129300 127504 125166 122159 118955 116252 114468 113658 113677 114068 114017 112944 111239 109965 109595
65504 109595 109411 108512 107114 106350 106854 108092 109219 110105 111212 112721 114132 114705 114169 113056 112365 112738
65488 112738 113874 114979 115812 116930 118773 120971 123012 125174 128150 131903 135509 138212 140010 141111
65474 141111 141421 140890 139878 138794 137689 136455 135122 133738 132266 130851 129744 128650 126645 123263 119349
65459 119349 116295 114655 114012 113866 113949 113794 112818 111021 109082 107576 106525 105778 105359 105291 105461 105812 106291
65442 106291 106606 106504 106336 106826 108115 109597 110834 112081 113661 115462 117368 119572 121965 123855 124898
65427 124898 125837 127592 129915 131730 132575 132954 133248 133057 131821 129611 127093 125043 123917 123552 123210 122261
65411 122261 120823 119487 118564 118051 118189 119360 121316 123090 123994 124286 124608 125154 125699 126148 126673 127485 128748
65394 128748 130578 132870 135211 137161 138652 140040 141773 143967 146208 147801 148366 148117 147421 146290 144676
65379 144676 143079 142287 142463 142978 143265 143338 143320 143051 142508 142107 142100 142090 141695 141402 142156 144134 146459 148207 149299
65360 149299 150368 152071 154650 157959 161743 165946 170649 175695 180636 185274 190022 195369 201136 206680
65346 206680 211756 216671 221455 225312 227206 226870 225068 222949 221182 219558 217303 213892 209593 205153
65332 205153 200979 196867 192565 188299 184441 180813 176646 171380 165345 159558 154885 151496 149032 147054
65318 147054 145254 143461 141690 140146 139019 138247 137646 137160 136789 136317 135401 133980 132323 130688 129214 128181
65302 128181 127930 128359 128920 129351 130011 131184 132508 133582 134711 136446 138607 140461 141786 143050 144539
65287 144539 145987 147298 148857 150767 152337 152923 152916 153281 154257 155121 155260 154973 154939 155233 155179 154137 152193 150038
65269 150038 148350 147338 146716 145892 144251 141613 138543 135999 134475 133660 133001 132318 131681 131039 130381 130003
65253 130003 130129 130427 130423 130279 130557 131218 131567 131341 131176 131607 132208 132178 131304 129863 127968 125705 123665 122613
65235 122613 122586 122812 122643 122173 121826 121700 121485 120882 120041 119691 120639 122892 125391 126987 127536 127606 127315 126181
65217 126181 124284 122757 122567 123240 123430 122532 121153 120161 119872 120208 120989 121856 122383 122642 123245 124448 125503
65200 125503 125426 124271 123140 122879 123226 123381 122996 122360 121881 121683 121600 121322 120624 119603 118769 118810 120236 123024
65182 123024 126370 128922 129820 129635 129858 131185 132793 133632 133923 134696 136173 137434 137720 137369 137255 137852 139047
65165 139047 140420 141461 141936 142321 143472 145643 148140 150210 151956 154038 156810 160137 163850 167945 172344
65150 172344 176801 181072 185111 189163 193735 199265 205697 212548 219607 227343 236446 247085 258796 270909
65136 270909 282904 294494 305545 315882 325173 333267 340670 348255 356196 363462 368699 371385 371867
65123 371867 370599 367772 363553 358259 352268 345950 339497 332598 324526 314946 304440 293861 283387
65110 283387 272621 261516 250656 240676 231796 223857 216407 208833 200882 193101 186304 180647 175653
65097 175653 171058 167024 163464 159847 155996 152507 149985 148240 146658 145041 143664 142688 141919 141087 140123
65082 140123 139193 138608 138645 139305 140375 141752 143501 145490 147155 147858 147384 146020 144298 142779 141859 141578
65066 141578 141687 141975 142416 143024 143746 144609 145699 146862 147656 147730 147094 145935 144426 142878 141845 141809 142890
65049 142890 144910 147480 149868 151180 151082 150191 149458 149269 149410 149637 149798 149470 148102 145767 143449 142184
65033 142184 141980 141819 140742 138748 136571 134742 133098 131234 129144 127162 125484 124131 123337 123524 124683
65018 124683 126156 127327 128273 129403 130656 131481 131558 131129 130571 130028 129623 129699 130541 131938 133299 134270 135081
65001 135081 136211 137823 139696 141625 143603 145559 147185 148322 149317 150604 152008 152917 153209 153526 154367
64986 154367 155340 155766 155754 156158 157500 159396 161162 162573 163845 165123 166284 167149 167635 167638 166977 165631 163992
64969 163992 162715 162202 162246 162191 161364 159395 156369 152827 149467 146619 144139 141891 140070 138728 137328 135300
64953 135300 132899 130915 129596 128527 127585 127243 127625 128067 128087 128128 128733 129553 129898 129875 130192 131053 131998 132729
64935 132729 133365 133909 134142 134073 133957 133808 133486 133240 133540 134279 134787 134810 134825 135165 135414 135047 134185 133337 132821 132759
64915 132759 133244 134102 134811 135074 135204 135625 136267 136887 137660 138908 140339 141168 141116 140886 141460 143118 145314 147371
64897 147371 149141 151031 153513 156702 160418 164543 169205 174618 180841 187622 194287 199936 204078 207158
64883 207158 210127 213377 216392 218574 220099 221616 223322 224620 224699 223268 220770 217979 215350 212730 209788
64868 209788 206636 203749 201230 198613 195581 192505 190004 188240 186967 185967 185076 184004 182537 180755
64854 180755 178754 176352 173503 170744 168665 166985 164741 161460 157615 153863 150381 147191 144586 142783
64840 142783 141513 140364 139327 138605 138113 137586 137111 137075 137526 137980 138004 137717 137540 137679 138091 138787 139879 141338
64822 141338 142916 144375 145667 146833 147834 148583 149157 149908 151289 153491 156155 158522 160065 161095 162696
64807 162696 165926 171032 177362 183914 189994 195534 200954 206673 212633 218337 223287 227199 229740 230414
64793 230414 229049 226234 222892 219435 215591 211037 205884 200599 195783 192011 189445 187504 185293 182537
64779 182537 179770 177532 175836 174617 174140 174488 175071 175268 175388 176397 178680 181598 184406 187195 190679
64764 190679 195244 200496 205725 210693 215868 221818 228442 234946 240538 244941 248265 250818 253168 255916
64750 255916 259050 261837 263711 264984 266298 267748 269026 270094 271062 271562 270956 269143 266502 263015 258165
64735 258165 251898 245035 238448 232344 226614 221336 216589 212245 208327 205175 202871 200924 198992 197553
64721 197553 197329 198267 199608 200835 202018 203244 204193 204440 203949 203225 203062 204034 205998 208202 210120 211996
64705 211996 214274 216655 218170 218195 217020 215354 213563 211494 208801 205331 201334 197349 193754 190459 187212
64690 187212 184176 181874 180458 179321 177658 175263 172625 170385 168921 168464 169330 171714 175222 178893 181974
64675 181974 184599 187438 190719 194046 197280 201001 205621 210471 214529 217890 221751 226799 232297 237108
64661 237108 240985 244309 247017 248496 248387 246844 243965 239607 233981 228009 222668 218174 214119 210229
64647 210229 206669 203695 201348 199571 198356 197664 197426 197726 198795 200680 203095 205866 209330 214015 219966
64632 219966 226719 233940 241751 250338 259530 268960 278418 287807 296876 305103 311741 315919 317028 315219
64618 315219 311375 306313 300207 292956 284838 276421 267987 259517 251187 243438 236525 230403 225124 220926
64604 220926 217786 215291 213230 211979 211917 212686 213386 213507 213364 213584 214371 215407 216332 217173 218239 219684 221305
64587 221305 222811 224076 224999 225320 224945 224396 224532 225645 227080 227901 227820 227423 227697 229341 232231 235452 238141
64570 238141 240445 243286 247017 250696 253083 254021 254324 254458 253871 251672 247568 242062 236024 230169 224659
64555 224659 219149 213413 207883 203245 199561 196176 192597 189069 186092 183756 181838 180268 179194 178779
64541 178779 179152 180362 182135 183921 185519 187382 189816 192109 193107 192727 192236 192695 193636 193689 192152 189408
64525 189408 186072 182444 178822 175758 173672 172525 172098 172320 173154 174415 175961 177826 179940 181975 183726
64510 183726 185409 187180 188615 189133 188926 188965 190012 192049 194733 197938 201625 205613 209814 214443 219704
64495 219704 225487 231581 237897 244156 249705 254040 257363 260189 262526 263906 264139 263539 262369 260523 257983
64480 257983 255175 252655 250653 249061 247617 245936 243654 240831 238068 235955 234473 233057 231185 228780
64466 228780 226140 223678 221663 220131 219027 218427 218499 219248 220457 221992 224000 226698 230045 233689 237073
64451 237073 239570 240777 240856 240444 240022 239555 238924 238515 239070 241018 244257 248495 253525 259121 265059 271373
64435 271373 278366 286219 294797 304037 314357 326464 340813 357420 376214 397383 421375 448716
64423 448716 479916 515420 555567 600663 651308 708625 773861 847405 928109 1013709 1101919
64412 1101919 1190979 1279147 1364153 1443582 1515786 1579991 1635303 1679834 1711112 1727343 1728232 1714692
64400 1714692 1688043 1649503 1600173 1541162 1473641 1398801 1317837 1232024 1142963 1052914 964733
64389 964733 881076 803382 731751 665992 606626 554526 509722 471111 437548 408764 384834
64378 384834 365104 348296 333637 321342 311719 304247 297876 291993 286639 281854 277240 272307 267007
64365 267007 261646 256396 251138 245829 240767 236322 232494 228925 225389 222057 219156 216555 213857 210901
64351 210901 207989 205628 204215 203993 205140 207710 211508 216071 220830 225366 229646 233973 238542 242978
64337 242978 246437 248275 248492 247459 245438 242581 239237 235909 232861 230073 227659 226008 225238 224765 223818
64322 223818 222397 221365 221430 222303 223010 222877 221954 220656 219295 218057 217141 216711 216726 216930 217018 216861 216604 216525
64304 216525 216639 216466 215379 213262 210674 208267 206149 203946 201301 198128 194529 190831 187714 185916 185568
64289 185568 185992 186357 186464 186696 187365 188370 189482 190658 191961 193392 194996 196964 199441 202287 205232
64274 205232 208233 211501 215167 219146 223355 227909 232922 238234 243433 248114 252088 255438 258389 261014
64260 261014 262957 263648 262886 261127 259102 257320 256053 255561 255992 257131 258495 259525 259482 257463 253091 247200
64244 247200 241311 236241 231597 226670 221375 216141 211365 207355 204443 202641 201400 200100 198686 197583
64230 197583 197152 197537 198794 200726 202671 203837 203897 203044 201646 200177 199287 199407 200245 201029 201285 201040 200333
64213 200333 199032 197268 195560 194218 192958 191374 189618 188315 187884 188115 188366 188098 187290 186389 185861 185845
64197 185845 186273 187158 188509 190137 191841 193720 195975 198527 201205 204280 208345 213565 219524 225930 233045
64182 233045 241237 250472 260457 270874 281221 290707 298581 304364 307655 308089 305716 301048 294515 286240
64168 286240 276640 266796 257770 249749 242205 234671 227070 219606 212721 206944 202448 198955 196260 194468
64154 194468 193407 192385 191060 190080 190137 190796 191134 191267 192238 194372 196792 198806 200847 203563 206800 210086
64138 210086 213510 217374 221306 224437 226393 227608 228659 229654 230271 230081 228870 226862 224688 223005 222140
64123 222140 222043 222473 223131 223844 224756 226186 228199 230501 232872 235524 238891 243245 248614 254888 261857 269313
64107 269313 277281 285940 295154 304221 312287 318904 324131 328321 331955 335387 338505 340873 342480 344186
64093 344186 347065 351453 356911 362981 369511 376173 382108 386309 388274 388089 385985 381911 375617 367127
64079 367127 357087 346526 336221 326327 316690 307354 298659 290934 284249 278402 273062 267977 263165
64066 263165 258861 255251 252364 250293 249316 249579 250751 252234 253685 255154 256779 258523 260221 261671 262706
64051 262706 263404 264331 266365 270017 274933 280211 285262 290327 296098 302904 310386 317994 325645 333740 342614
64036 342614 352134 361813 371106 379566 386897 393023 398058 402150 405315 407322 407645 405750 401715 396442
64022 396442 390948 385542 380075 374904 370961 368693 367472 366370 364986 363193 360583 356804 352101 346996
64008 346996 341614 335819 329770 323752 317685 311497 305886 301946 299907 298891 298058 297394 297122 297007 296695
63993 296695 296273 296048 296074 296316 296990 298338 300234 302398 304893 308075 312125 316912 322230 327827 333297 338309
63977 338309 343081 348455 355281 363744 373199 382746 392012 401442 411722 422937 434545 446215 458360
63964 458360 471680 486438 502474 519685 538163 558017 579471 603104 629649 659517 692851
63953 692851 730109 772330 820762 876519 940808 1015189 1101273 1200136 1312170 1437503 1576434
63942 1576434 1729472 1896959 2078549 2272894 2477841 2690994 2910036 3132327 3354147
63933 3354147 3570557 3776134 3965832 4135109 4279579 4395158 4478952 4529919 4548383 4534846
63923 4534846 4489326 4411759 4302869 4164737 4000839 3815697 3614373 3402036 3183734 2964145
63913 2964145 2747179 2535869 2332845 2140851 1962380 1798775 1650107 1516106 1396804
63904 1396804 1291977 1200388 1120171 1049876 988650 935505 889043 848192 812755 782801 757676
63893 757676 735965 716339 698156 681208 665243 649953 635247 621260 608117 595849 584644
63882 584644 574956 567161 561164 556524 553002 550813 550328 551726 555116 560838 569394 581009 595270 611218
63868 611218 627794 644364 660971 678037 695701 713467 730612 746888 762628 778070 792681
63857 792681 805290 814943 821536 825572 827438 827098 824447 819618 812750 803688 792267 778732 763495
63844 763495 746505 727358 706106 683578 660721 638033 615802 594367 573679 553040 531814
63833 531814 510234 489065 468721 449237 430912 414281 399370 385504 371969 358460 344952
63822 344952 331743 319711 309865 302303 296046 290083 284115 278110 271875 265569 260019 255797 252351 248738
63808 248738 244956 241806 239553 237584 235482 233720 232916 232916 233006 232758 232352 232202 232518 233055 233188 232330 230403
63791 230403 227839 225157 222738 220884 219676 218719 217459 215916 214738 214265 213902 212774 210775 208653 207235
63776 207235 206852 207286 207930 208115 207625 206828 206073 205155 203736 202066 200789 200098 199660 199357 199456 199911 200178 200096
63758 200096 200346 201470 202931 203806 204139 204806 206168 207614 208572 209179 209649 209671 208992 208140 207932 208428 208946 209039
63740 209039 208958 209148 209746 210712 212072 213863 216097 218859 222200 225882 229496 232932 236400 239884 242981
63725 242981 245543 248096 251262 254978 258718 262332 266274 271031 276662 282854 289100 294811 299551 303221
63711 303221 305823 307129 306953 305618 303652 300980 297024 291879 286887 283497 281756 280371 278189 275275
63697 275275 272569 270751 269535 268060 266028 264407 264679 267264 271053 274695 277941 281330 285032 288631
63683 288631 291879 294952 297899 300405 302240 303520 304405 304966 305415 306008 306589 306664 306095 305296 304636 304155 304103
63666 304103 305136 307531 310666 313727 316546 319222 321312 322061 321288 319473 317030 314023 310495 306545 302086
63651 302086 297021 291701 286738 282338 278266 274509 271437 269224 267619 266452 265880 265926 266311 267072 268847
63636 268847 272084 276276 280480 284408 288524 293172 298102 302923 307644 312551 317806 323428 329660 337027
63622 337027 345784 355343 364682 373551 382972 394083 406737 419920 433498 448737 466803 487478
63610 487478 509858 533735 559611 587824 618396 651524 687376 725371 764247 802837 840194
63599 840194 874953 905261 929571 947075 957345 960250 956591 948266 937396 925446 913250 901197
63587 901197 888910 875243 859269 841115 821386 799940 775811 748380 718227 686836 655797
63576 655797 626290 598903 573775 551070 531337 515185 502626 492985 485480 479704 475574 473175
63564 473175 472751 474530 478353 483655 489963 497236 505560 514728 524345 534310 545016 557089 571038 587134
63550 587134 605507 626309 649725 675810 704473 735872 770769 810124 854089 901529 950475
63539 950475 998604 1043015 1080118 1106632 1121012 1123869 1117269 1104074 1087592 1070763 1055053 1040420
63527 1040420 1026562 1013676 1001641 989070 973925 954887 931537 903535 870567 833208 793046
63516 793046 751632 709889 668794 629860 594263 561959 532333 505502 482264 462864 446470
63505 446470 431973 418754 406527 395033 384266 374691 366820 360659 355746 351597 347889 344369 340860
63492 340860 337404 334273 331762 330070 329285 329347 329947 330563 330801 330813 331268 332741 335087 337651 340074 342664
63476 342664 345849 349626 353819 358556 363939 369397 373871 376729 378051 378058 376848 374764 372369 369635 365715
63461 365715 360059 353469 347481 342876 339277 336052 333058 330497 328608 327632 327742 328783 330372 332369 335024
63446 335024 338612 343156 348637 355202 362935 371607 380794 390232 399997 410496 422368 436242 452514
63433 452514 471402 493155 517944 545498 575086 605909 637126 667244 693932 715156 730703
63422 730703 742296 752123 761607 771777 784274 801187 823706 851416 883262 918929 958841 1002924
63410 1002924 1049799 1097142 1142320 1182505 1214854 1237322 1249428 1252099 1246909 1235679 1220418 1202973
63398 1202973 1184582 1165966 1147685 1129841 1111373 1090208 1064496 1033602 997910 958224 915677
63387 915677 871882 828631 787341 748846 713491 681203 651608 624416 599724 577917 559363
63376 559363 544252 532450 523412 516466 511408 508586 508300 510431 514901 522051 532071 544298 557693
63363 557693 572044 588235 607321 629724 655321 683816 714822 747998 783391 821411 862261
63352 862261 905563 950643 996883 1043520 1089181 1131791 1168892 1198148 1217957 1228011 1229285 1223359
63340 1223359 1211745 1195839 1177224 1157638 1138389 1119688 1100560 1079588 1055978 1029837 1001350
63329 1001350 969962 934860 896285 855945 815968 777753 741896 708716 678516 651672 628905
63318 628905 611207 598999 591341 586220 581546 575725 567534 556015 540749 522103 501228 479827
63306 479827 459705 442061 427026 413953 402163 391405 381775 373414 366293 360146 354651 349700 345310
63293 345310 341260 337090 332700 328637 325474 323074 320750 317963 314534 310467 306055 302015 299029 297079
63279 297079 295602 294178 292716 291157 289589 288569 288676 289658 290633 291257 292037 293326 294697 295671 296390 297120
63263 297120 297674 297942 298535 300212 302903 305889 308769 311673 314640 317451 320142 323174 326900 331198 335792
63248 335792 340734 346453 353418 361754 371084 380788 390504 400333 410641 421935 434848 449747 466213
63235 466213 483452 501526 521598 544519 569690 595903 622711 650195 677805 704525 730100
63224 730100 755132 779881 803860 826784 849101 871317 893504 915749 938384 961411 984307
63213 984307 1006683 1028434 1048777 1065829 1077705 1083635 1083627 1077676 1065862 1048679 1026624 999884 969076
63200 969076 935863 902098 868594 835453 803349 773721 747721 725638 707276 692324 680430
63189 680430 671580 666346 665113 667169 671318 677450 686629 699403 714843 731635 749353 768066 787331
63176 787331 806358 824902 843315 861850 880450 899092 917750 935927 952690 967294 979488
63165 979488 989112 995700 998629 997464 992070 982528 969029 951638 930110 904154 874160 841551 808138
63152 808138 775055 742479 710406 679386 650243 623285 598241 575036 554211 536328 521210
63141 521210 508099 496412 486022 476905 468917 462004 456343 452099 449174 447270 446011 444977 443827
63128 443827 442524 441315 440408 439793 439455 439638 440758 443104 446678 451250 456484 462028 467574 472928 478051
63113 478051 483017 487767 491955 495272 497997 500896 504294 507523 509674 510725 511490 512573 513911 515314
63099 515314 516850 518543 520179 521699 523313 524916 525820 525516 524438 523541 523294 523440 523639 523905 524469 525487
63083 525487 526876 528235 529012 529032 528806 529077 530160 531984 534640 538548 544079 551266 559871 569431 579299
63068 579299 589040 598935 609825 622246 635936 650325 665359 681650 699961 720734 744102 770149
63056 770149 799018 830814 865556 903346 944523 989482 1038260 1090440 1145484 1203012 1262626
63045 1262626 1323691 1385560 1447941 1510823 1574043 1637034 1698985 1759218 1817589 1874686 1931431
63034 1931431 1988202 2044407 2099085 2151711 2202046 2249227 2291397 2326297 2351967 2366904 2369980
63023 2369980 2360460 2337986 2302512 2254479 2195146 2126549 2051039 1970984 1888781 1806777 1726949
63012 1726949 1650891 1580152 1516296 1460441 1412986 1373971 1343510 1321705 1308359 1302997 1305020 1313637
63000 1313637 1327807 1346532 1369201 1395521 1425160 1457493 1491527 1525987 1559785 1592632 1625064
62989 1625064 1657588 1689923 1721286 1751223 1779764 1806745 1831236 1851709 1866566 1874479 1874462 1865849
62977 1865849 1848241 1821585 1786349 1743506 1694118 1638936 1578616 1514292 1447745 1380949 1315510
62966 1315510 1252503 1192566 1136096 1083512 1035414 992294 953934 919260 887040 856844 829184
62955 829184 804617 782742 762242 742020 722158 703560 686711 671056 655697 640334 625246
62944 625246 610653 596588 583301 571250 560442 550166 539694 529104 519114 510195 502146 494542
62932 494542 487366 481007 475732 471291 467117 462828 458462 454242 450316 446899 444479 443495 443702 444140 443967
62917 443967 443165 442190 441147 439695 437730 435673 433834 431925 429543 426940 424795 423274 421778 419749 417255
62902 417255 414540 411458 407857 404267 401565 399964 398803 397476 396105 395104 394511 394046 393597 393328 393459
62887 393459 394111 395238 396508 397447 397879 397997 397965 397757 397620 398168 399613 401233 402164 402417 402579 402732 402433 401658
62869 401658 400977 400650 400277 399618 399074 398992 399037 398705 398004 397191 396231 395054 394039 393741 394292 395416 396803 398098
62851 398098 398835 398918 398949 399544 400420 400704 400065 399010 398067 397284 396628 396300 396367 396485 396319 395995 395872 396052 396316
62832 396316 396394 396152 395643 395045 394481 393932 393502 393636 394674 396227 397440 398050 398726 400147 402160 404240 406418
62815 406418 409211 412825 417011 421730 427356 433894 440406 445706 449629 453285 457954 463955 470732 477770
62801 477770 485099 492978 501537 510936 521483 533309 546180 560010 575343 592808 612186 632622
62789 632622 653919 677047 703120 732361 764523 799986 839881 885191 936181 992723 1054897
62778 1054897 1123138 1197942 1279438 1367091 1459770 1556150 1654996 1755042 1854712 1951943 2044139
62767 2044139 2128242 2201169 2260403 2304135 2330928 2339699 2330271 2303562 2260976 2203891 2134006 2053743
62755 2053743 1965751 1872228 1775139 1676777 1579391 1484411 1392697 1305434 1223964 1148659 1078818
62744 1078818 1013998 954647 901009 852253 807434 766783 731133 700312 672987 648034 625318
62733 625318 605061 587243 571838 558873 547820 537504 527274 517913 510788 506266 503500 501683
62721 501683 500829 501197 502607 504722 507643 511712 516940 523046 530002 538123 547627 558535 571114 586019
62707 586019 603819 624619 648305 674854 704233 736377 771661 811135 855882 906160 961443
62696 961443 1021157 1085017 1152777 1224079 1298489 1375159 1452369 1527774 1599366 1665873 1726149
62685 1726149 1778491 1820773 1851043 1867882 1870560 1859105 1834123 1796448 1747222 1688310 1622177
62674 1622177 1550953 1475865 1397831 1318374 1239620 1163557 1091512 1024174 961788 904366 851910
62663 851910 804382 761392 722226 686396 653937 624979 599387 577073 558160 542274 527990
62652 527990 513709 499075 485055 472687 462218 453364 445704 438719 431944 425287 418843 412432 405912
62639 405912 399887 395443 392947 391714 391003 390652 390547 390341 390245 391248 393762 396595 398040 397608 395915 393424
62623 393424 390365 387651 386550 387163 388143 388345 388054 388273 389541 391907 395352 399636 404158 408584 413359
62608 413359 419120 425938 433580 442206 452268 463961 477311 492595 510089 529554 550593 573454
62596 573454 598816 626830 657086 689705 725656 765563 808809 854375 901974 951524 1001701
62585 1001701 1049839 1093482 1131448 1163217 1187826 1203914 1210659 1208248 1197366 1178506 1151961 1118394
62573 1118394 1079261 1036467 991534 945201 897951 850771 805122 762128 722117 685082 651295
62562 651295 621146 594518 570683 548818 528444 509458 492124 477042 464687 454728 446152 438338
62550 438338 431738 427069 424037 421402 418303 415000 412139 409810 407655 405544 403691 402330 401669 402019 403494
62535 403494 405586 407439 408633 409420 410144 410849 411612 412915 415373 419240 424398 430671 438015 446572 456764
62520 456764 469194 484190 501479 520522 541195 564033 589806 618969 651435 686769 724599
62509 724599 764901 807773 852862 899069 944889 988866 1029668 1066030 1096938 1121811 1140233
62498 1140233 1151593 1155251 1151120 1139940 1123033 1101921 1078080 1052820 1027377 1003134 981551 963627
62486 963627 949660 939778 934495 934316 939084 948339 962271 981576 1006195 1034845 1066164 1099725 1135409
62473 1135409 1172136 1207780 1240154 1267684 1289344 1304408 1312287 1312314 1303802 1286627 1261569 1229716
62461 1229716 1191640 1147515 1097982 1044486 988825 932739 877897 825760 777192 732448 691675
62450 691675 655235 623522 596671 574547 556727 542460 530837 521148 513000 506187 500668 496625
62438 496625 494198 493108 492805 493050 494075 496100 498935 502054 504812 506592 507139 506775 505878 504101 500595
62423 500595 495141 488514 481416 473645 464815 455416 446460 438344 430752 423579 417195 411729 406691 401594
62409 401594 396498 391710 387329 383380 380046 377405 375145 372849 370512 368540 367334 367039 367561 368554 369452
62394 369452 369805 369700 369737 370478 371983 373884 375814 377691 379603 381586 383611 385782 388311 391198 394115
62379 394115 396898 400120 404782 411274 418896 426700 434618 443467 453885 465580 477711 489748 501874
62366 501874 514741 529016 545055 562873 582447 604165 628874 657394 690038 726730 767511
62355 767511 812740 862835 917975 978003 1042360 1109981 1179380 1248854 1316404 1379468 1435130
62344 1435130 1480985 1515799 1539248 1551343 1552421 1543444 1525670 1499926 1466537 1426072 1379757 1329048
62332 1329048 1275245 1219778 1164382 1110509 1058770 1009386 963015 920673 882935 849672 820581
62321 820581 795470 773852 754688 736777 719268 701725 684041 666467 649366 632705 615959
62310 615959 598759 581390 564447 548269 533041 519160 506997 496313 486407 476999 468653 462147
62298 462147 457652 454687 452665 451235 450125 448905 447134 444826 442656 441425 441275 441686 442410 443992 446918
62283 446918 450589 453837 456405 459195 462868 466951 470734 474392 478569 483300 488103 492897 498108 503925
62269 503925 510191 517157 525669 536318 548867 562757 577853 594565 613628 635927 662103 692138
62257 692138 725702 763151 805709 854432 909410 970178 1036223 1106531 1179198 1252219 1324290
62246 1324290 1394028 1458641 1514367 1558462 1590169 1609775 1617611 1614261 1600938 1578914 1548890 1511248
62234 1511248 1466624 1415831 1359610 1298993 1235799 1172390 1110943 1053030 999574 950825 906569
62223 906569 866730 831604 801206 774686 750973 729874 711885 696884 683588 670629 657581
62212 657581 644548 631247 617203 602694 588750 576011 564134 552637 541857 532531 524703 517735
62200 517735 511396 506270 502790 500450 498543 497302 497653 499919 503393 507289 511595 516800 523273 531136
62186 531136 540348 550525 560992 571401 582177 594014 607010 620488 633531 645541 656438 666566
62174 666566 676271 685450 693787 701555 709812 719449 730478 742870 757838 777471 803039 834296 870568
62161 870568 911799 958064 1008554 1061623 1115503 1168425 1218171 1262207 1298517 1326093 1344621
62150 1344621 1354068 1354753 1347486 1333292 1312999 1287222 1256529 1221416 1182229 1139513 1094477 1048838
62138 1048838 1004085 961187 921120 885222 854518 828867 807289 789133 774505 763518 755668
62127 755668 750213 746765 745183 745153 746166 747813 749941 752725 756688 762314 769418 777170 784918 792533 799725
62112 799725 805517 808959 810016 809256 807088 803961 800927 799017 797937 796169 792503 786865 779583 770774
62098 770774 760845 750979 742483 735997 731622 729388 729170 730478 732771 735799 739404 743283 747287 751600
62084 751600 756294 761094 766024 771885 779517 788725 798572 808679 819699 832479 847290 864066 882905
62071 882905 903956 926909 950819 974498 997160 1018873 1040455 1062900 1086863 1112657 1140475
62060 1140475 1170428 1202526 1236772 1272991 1310201 1346322 1378910 1406221 1427314 1441383 1447665
62049 1447665 1446172 1437949 1424139 1405019 1380241 1349751 1313985 1273303 1227832 1178131 1125700 1072445
62037 1072445 1019718 968112 918033 870128 825094 783473 745833 712787 684452 660030 638323
62026 638323 618709 601358 586598 574410 564529 556659 550409 545285 540839 536619 531986 526348 519727
62013 519727 512765 506106 499986 494427 489346 484438 479526 475258 472859 472759 473964 475182 476109 477126 478310
61998 478310 479567 481388 484519 488842 493225 496614 498765 499942 500512 500843 501017 500406 498030 493533 487472
61983 487472 480657 473601 466542 459443 451879 443424 434292 425146 416312 407786 400041 393990 389823 386626
61969 386626 383561 380819 378901 377631 376525 375649 375344 375383 375151 374563 374160 374333 374961 375767 376595 377377 378317
61952 378317 379970 382633 385671 388030 389485 390865 392951 395762 399146 403523 409559 417420 426791 437508
61938 437508 449803 463917 479694 496576 513877 531124 548232 565305 582194 598380 613394
61927 613394 627232 640153 652118 662607 670994 676967 680586 682090 681700 679476 675280 669060 661319
61914 661319 653169 645695 639301 633885 629572 627014 626939 629800 635942 645582 658203 672267 686167 699413
61900 699413 712491 725605 738005 748487 755992 759644 758919 754170 746603 737349 726806 715091 702678
61887 702678 690109 677381 664182 650673 637621 625785 615405 606264 597932 589979 582176 574491
61875 574491 566766 558591 549614 539840 529527 519114 509443 501593 495971 491827 488131 484714 482086 480439
61861 480439 479560 479691 481641 485801 491607 498322 505958 515181 526617 540535 556910 575546 596229
61848 596229 618852 643251 668985 695534 722644 750144 777466 803841 828942 852672 874173
61837 874173 891664 903692 910142 911709 908869 901853 891219 877924 863084 848135 834976 825253
61825 825253 819441 817004 817459 820945 827836 838195 851560 866795 882063 895265 904763 909644 909484
61812 909484 904163 893820 878631 858619 834052 806110 776735 747544 718997 690763 662707 635481
61800 635481 610258 587999 568777 551812 536298 522191 509952 499538 490071 480694 471417 462803
61788 462803 455076 447991 441501 436028 431873 428653 425599 422323 419085 416379 414444 413145 412072 410711
61774 410711 408723 406301 404142 402900 402634 402845 402940 402564 401592 400174 398895 398626 399886 402284 404736 406391
61758 406391 407364 408463 410145 411929 413101 413826 415048 417145 419311 420718 421731 423147 424577 424663 422977
61743 422977 420686 418935 417524 415775 413833 412206 410667 408636 406373 404746 403968 403465 402976 402815 402979
61728 402979 402972 402780 403170 404621 406724 409071 411920 415356 418551 420692 422216 424298 427392 431018 434732
61713 434732 438385 441484 443324 444049 444854 446661 449059 450887 451359 450211 447240 442452 436599 430932 426207
61698 426207 422246 418492 414687 410931 407435 404447 402174 400477 398791 396596 393917 391163 388582 386102
61684 386102 383600 381013 378213 375168 372255 370001 368339 366581 364343 362126 360586 359589 358517 357185
61670 357185 355869 354524 352730 350538 348733 347953 347924 347897 347485 346807 346106 345568 345388 345696 346470 347645 349157
61653 349157 350837 352422 353804 355075 356250 357231 358140 359386 361246 363664 366537 369835 373213 376009 378054
61638 378054 380120 383095 386898 390616 393509 395416 396319 396073 394638 392194 389028 385545 382350 379895 378022
61623 378022 376133 373839 371248 368725 366686 365484 365030 364558 363259 361297 359812 359762 360984 362475 363249
61608 363249 362836 361277 358885 355865 352094 347407 342076 336656 331343 325897 320374 315565 312287 310368
61594 310368 308635 305971 302318 298639 295902 294081 292244 289714 286911 284715 283191 281527 279310 277242
61580 277242 276213 275998 275411 273644 271071 268688 267078 266048 265095 263969 262740 261485 260187 258909 257806
61565 257806 256854 255948 255466 256256 258495 260934 262069 261995 262246 263624 265101 265330 264518 264123 265121 267239 269602
61548 269602 271547 272892 273959 275305 277114 278944 280318 281300 282148 282783 283132 283753 285443 288245 291365
61533 291365 294030 295949 296997 297146 296864 296953 297664 298341 298224 297263 295936 294578 293181 291569 289537 287011
61517 287011 284295 281961 280354 279406 279057 279445 280451 281377 281520 280907 280133 279601 279329 279338 279701 280161 280205 279746
61499 279746 279352 279506 279932 279993 279559 279091 278934 278950 278860 278576 278072 277304 276476 276067 276279 276648 276556 276021 275617 275703
61479 275703 276078 276412 276677 277099 277953 279430 281390 283244 284442 285101 285735 286368 286481 286035 285880 286679 287940
61462 287940 288736 289026 289552 290593 291537 291776 291380 290721 289931 289056 288376 288195 288414 288609 288531 288475 289084 290774 293282
61443 293282 295838 297839 299266 300480 301895 303938 306928 310688 314539 318025 321378 324917 328373 331303
61429 331303 333884 336545 338976 340359 340714 341203 342733 344859 346492 347209 347412 347578 347842 348137 348313 348223 347972
61412 347972 347996 348658 349848 351050 351632 350998 348861 345643 342353 339799 337983 336385 334589 332458 330053
61397 330053 327671 325747 324421 323351 322183 321049 320369 320357 320883 321629 322122 321887 320917 319793 319122 319044 319480
61380 319480 320512 322098 323728 324919 325864 327071 328495 329670 330637 332060 334173 336247 337500 338111 338910
61365 338910 340381 342376 344614 346953 349225 351236 353065 355099 357584 360318 362953 365493 368367 372042
61351 372042 376732 382395 388819 395581 402141 408157 413742 419270 424923 430457 435389 439409 442699 445945
61337 445945 449869 454557 459382 463746 467773 471949 476257 480080 482928 484778 485621 485191 483420 480792 477934
61322 477934 475121 472403 469890 467631 465546 463804 462980 463430 464762 466319 467983 470088 472738 475770 479311
61307 479311 483850 489724 496894 505230 514571 524438 534124 543157 551401 558636 564379 568229 570044 569780
61293 569780 567541 563840 559350 554219 548091 541047 534059 528102 523104 518241 513045 507741 502617 497679
61279 497679 493028 489040 485836 482972 480096 477719 476815 477604 479188 480626 481996 484018 486920 490225 493623
61264 493623 497445 502035 507122 512197 517232 522643 528702 535375 542612 550363 558240 565512 571600 576427
61250 576427 580230 583225 585529 587323 588958 590808 592918 594845 596030 596324 595961 594979 593092 590237 586823
61235 586823 583158 579047 574389 569784 565988 563017 560378 558014 556436 555952 556358 557378 558869 560560 562146
61220 562146 563738 565720 568164 570881 574028 577960 582449 586799 590920 595454 600530 605224 608783 611617
61206 611617 614370 616708 617946 618420 619277 621106 623639 626703 630555 635153 639994 645036 651192 659477 670010
61191 670010 682085 694794 707281 718763 728730 737036 743606 748278 751150 752837 754041 754956 755362 755184
61177 755184 754585 753478 751331 747733 743006 737999 733313 728926 724580 720298 716349 712836 709452 705569
61163 705569 700482 693804 685879 677709 670147 663126 655901 647972 639487 630767 621996 613545 606168 600496
61149 600496 596540 593944 592491 591987 591836 591093 588877 584507 577489 567898 556846 546127 537084 529826
61135 529826 523554 517523 511700 506685 503131 501213 500615 500969 502138 504066 506606 509711 513690 519068 526271
61120 526271 535483 546586 559039 572199 586086 601609 619497 639139 659045 678540 698380 719436
61108 719436 741319 762832 783471 803839 824545 845243 864976 883077 899334 913421 924703
61097 924703 932786 937899 940369 939929 936002 928696 919033 907962 895562 881512 866013 849755 833154
61084 833154 816139 798652 780867 762835 744407 725733 707509 690462 674840 660646 648044
61073 648044 637165 627669 618915 610637 603168 596942 591994 588059 584978 582748 581274 580284 579585 579307 579812
61058 579812 581475 584592 589282 595281 601887 608484 615211 622907 632211 642844 653962 665140 676850
61045 676850 690015 705250 722501 741326 761512 783388 807415 833459 860770 888822 917964
61034 917964 948976 982231 1017575 1054886 1094311 1135992 1179931 1226153 1274585 1324693 1375637
61023 1375637 1427095 1479761 1534900 1593658 1657054 1726499 1804017 1891828 1991760 2105071 2232880
61012 2232880 2376959 2540302 2727121 2942639 3193226 3486955 3834174 4247883 4743867
61003 4743867 5340418 6058108 6920744 7956899 9198081 10669520 12375063 14282246 16311558
60994 16311558 18331120 20163860 21621406 22567508 22982694 22983522 22774442 22561044 22478112
60985 22478112 22560763 22747037 22893080 22804893 22298802 21275548 19764538 17906937 15891483
60976 15891483 13888002 12013091 10329616 8861671 7609393 6559090 5689708 4976961
60968 4976961 4396029 3923549 3538909 3224494 2965289 2748672 2564545 2405194 2264783
60959 2264783 2139036 2025379 1922870 1831311 1750049 1677605 1612475 1553938 1501788 1455351 1413119
60948 1413119 1373395 1335037 1297474 1260393 1223763 1187994 1153703 1121222 1090458 1061167 1033163
60937 1033163 1006263 980211 954728 929594 904765 880440 856872 834004 811494 789252 767753
60926 767753 747518 728505 710324 692975 676922 662402 649054 636386 624312 613003 602440
60915 602440 592412 582901 574221 566637 559919 553426 546767 540286 534703 530300 526700 523535 520959 519279
60901 519279 518437 518204 518656 519995 522044 524341 526663 529019 531169 532636 533258 533324 533044 532290 530958 529219
60885 529219 527164 524466 520604 515292 508681 501387 494241 487699 481474 475130 469028 464178 461019 458788
60871 458788 456280 452857 448572 443877 439525 436248 434068 432245 430259 428500 427613 427593 428086 429215 431322
60856 431322 433973 435944 436412 435724 434836 434375 434406 434767 435314 435944 436536 436860 436591 435535 433824 431720 429332
60839 429332 426713 424063 421522 418824 415592 411946 408409 405071 401390 397098 392901 389747 387658 385877
60825 385877 384143 383148 383440 384372 384689 383978 383024 382705 383017 383346 383325 383113 382997 382989 382711 381529 379005 375410
60807 375410 371667 368566 366198 364258 362566 360915 358802 355946 352964 350889 349956 349367 348343 346806 344910
60792 344910 342578 339953 337765 336688 336501 336305 335479 334119 332667 331346 329974 328216 326092 324169 323013
60777 323013 322486 321975 321325 321014 321315 321877 322421 323248 324604 326083 327231 328352 330084 332449 334953 337391
60761 337391 339933 342532 344808 346550 347914 349203 350796 353037 355658 357571 357918 357190 356670 356813 356971
60746 356971 356741 356699 357472 358815 360087 361086 361895 362253 361677 360049 357714 355026 352095 348878 345292 341233
60730 341233 336650 331659 326559 321758 317589 314076 310982 308248 306177 304943 304091 302975 301634 300691 300347
60715 300347 300037 299294 298437 298031 298035 297925 297478 297003 296840 296887 296738 296154 295373 294949 295226 296064 297192 298681 300754
60696 300754 303188 305362 306907 307930 308521 308516 308008 307699 308367 310186 312821 315911 319197 322407 325391 328271
60680 328271 331152 333836 336081 338082 340389 343324 346632 349715 352107 353822 355351 357282 359816 362666
60666 362666 365329 367229 367697 366299 363433 360210 357380 354608 351200 347273 343703 341039 339086 337582
60652 337582 336720 336651 336955 337104 337278 338200 340142 342507 344606 346445 348363 350065 350576 349289 346677 343672
60636 343672 340634 337297 333550 329856 326819 324661 323171 321967 320767 319556 318520 317695 316821 315752 314877
60621 314877 314742 315308 315992 316462 317009 318048 319561 321108 322082 321970 320842 319648 319510 320539 321775 322507
60605 322507 323086 324120 325481 326615 327448 328319 329295 330154 330979 332175 333852 335635 337166 338489 339830 341285
60589 341285 342749 344002 344874 345468 346111 346909 347490 347405 346649 345577 344509 343650 343212 343256 343525 343811 344408 345910
60571 345910 348641 352607 357854 364416 371909 379632 387246 395067 403596 412931 422717 432396 441403 449245
60557 449245 455445 459400 460478 458518 454169 448549 442596 436870 431743 427473 424179 422067 421577 422964
60543 422964 425880 429776 434663 441029 449058 458365 468570 479726 492024 505432 519703 534356 548592
60530 548592 561595 573008 582724 590166 594281 594534 591493 586181 579260 571149 562546 554302 546931 540508
60516 540508 534903 529839 525023 520578 517143 515136 514069 513020 511812 511345 512777 516629 522651 530186
60502 530186 538638 547990 559097 573264 591367 613441 639088 668017 700000 734531 770890 808467
60490 808467 846824 885283 922576 957086 987408 1012580 1031689 1043454 1046487 1040130 1024901 1002013
60478 1002013 972575 937440 897720 855128 811600 768679 727372 688473 652693 620372 591246
60467 591246 564752 540616 519013 500151 483865 469754 457566 447250 438616 431149 424261 417636
60455 417636 411271 405238 399548 394225 389409 385294 382016 379564 377729 376036 373946 371377 369034 367847
60441 367847 367824 367760 366412 363837 361217 359532 358863 358843 359098 359080 358206 356622 355404 355434 356403 357327 357701 357593
60423 357593 356949 355561 353712 352172 351403 351195 351192 351376 351999 353406 355923 359427 363012 365596 366960 367834
60407 367834 368895 370167 371413 372495 373155 373099 372685 372971 374642 377255 379933 382386 384817 387202 389239
60392 389239 390841 392202 393500 394876 396551 398568 400624 402517 404517 406887 409274 411114 412507 414062
60378 414062 415879 417302 417918 418333 419601 422154 425470 428663 431183 433081 434760 436528 438411 440350 442382
60363 442382 444463 446344 447873 449339 451195 453504 455902 458105 460231 462685 465994 470654 476802 483982
60349 483982 491580 499514 508219 517842 527739 536839 544281 549613 552654 553373 551769 547798 541616 533918
60335 533918 525739 517721 509761 501588 493519 486393 480791 476511 472802 469039 465170 461581 458579 456043
60321 456043 453612 451067 448408 445670 442937 440602 439332 439592 441242 443728 446601 449846 453875 459294
60307 459294 466613 476071 487709 501537 517452 535025 553505 572091 590056 606532 620348 630223
60295 630223 635138 634531 628316 616872 601064 582201 561848 541488 522246 504866 489904 477678
60283 477678 468045 460533 454914 451307 449434 448166 446483 444686 443854 444020 443689 441510 437726 433456 429200
60268 429200 424799 420435 416705 413752 411078 408365 405851 403776 401997 400388 399074 398018 396862 395522
60254 395522 394490 394077 393763 392840 391532 390904 391664 393456 395331 396511 396760 396517 396761 398260 400657 402668
60238 402668 403426 403322 403223 403333 403343 403386 404114 405730 407559 408912 409987 411528 413815 416340 418486 420278 422394
60221 422394 425503 429537 433609 436720 438593 439722 440703 441777 443074 444920 447616 451132 455276 460012
60207 460012 465308 470887 476502 482383 488960 496138 503247 509868 516324 523144 530315 537289 543496 548579
60193 548579 552347 554926 556885 558844 560826 562250 562708 562474 562025 561284 559757 557353 554568 551668 548178
60178 548178 543631 538488 533694 529404 524881 519782 514806 510630 506852 502621 497911 493455 489695 486568
60164 486568 484172 482748 481893 480573 478303 475723 473720 472502 471899 471981 472849 474133 475188 475600 475258 474254
60148 474254 473140 472888 474071 476223 478408 480187 481657 482912 484103 485805 488565 492055 495401 498496
60134 498496 502299 507557 513841 520256 526570 533068 539556 545138 549034 551248 552427 553317 554379 555649
60120 555649 556840 557692 558276 558922 559864 561072 562442 564034 566059 568621 571498 574214 576351 577737 578285
60105 578285 577836 576381 574460 572997 572540 572729 572613 571406 568902 565421 561593 558025 554873 551700 548054
60090 548054 544206 541117 539507 539206 539498 539867 540146 540188 539868 539518 539881 541342 543328 544728 544776 543415 541034
60073 541034 538202 535515 533220 530796 527250 522029 515554 508763 502361 496575 491376 486649 482262 478139
60059 478139 474229 470363 466349 462299 458591 455393 452523 449987 448294 447809 448104 448455 448854 449924 451859
60044 451859 454086 456192 458571 461786 465620 469280 472377 475315 478751 482956 487744 492684 497209 500684
60030 500684 502709 503521 503950 504669 505406 505125 503109 499638 495400 490580 484977 478793 472722 467214 462112
60015 462112 457131 452153 446925 440961 434082 426686 419258 412077 405667 400962 398375 397073 395779 394102
60001 394102 392430 390794 388739 386414 384876 384841 385771 386733 387676 389139 391018 392474 393199 394053 396079 399276
59985 399276 402786 405993 408937 411760 414344 416668 419037 421566 423744 424952 425276 425333 425317 424748 423325 421522
59969 421522 419983 418695 417231 415594 414266 413401 412506 411228 410036 409749 410478 411463 412026 412314 412864 413698
59953 413698 414285 414377 414409 414816 415295 415135 414112 412682 411410 410614 410518 411270 412673 414212 415420 415938 415354 413584
59935 413584 411486 410417 410790 411632 411905 411668 411408 410940 409804 408432 407931 408727 410240 412029 414534 418450
59919 418450 423896 430442 437474 444371 450757 456771 462647 467920 471593 473395 474354 475698 477558 479179
59905 479179 480111 480688 481450 482597 484066 485794 487697 489489 490701 491020 490675 490400 490801 491766 492660 493077 493181
59888 493181 493393 494036 495277 497062 499054 500968 503032 505802 509498 513833 518516 523458 528390 532848 536769
59873 536769 540584 544448 547808 550087 551374 552053 552154 551469 549945 547551 544192 540215 536584 533974 532005
59858 532005 530016 528254 527574 528195 529592 531520 534290 537959 542153 546951 553138 561076 569940 578549 586404
59843 586404 593313 598388 600214 598156 593170 587272 582374 579410 578124 577547 576763 575270 572685 568439 562106
59828 562106 554044 545441 537586 531079 525659 520670 515667 510682 506056 502088 498841 496169 493853 491738
59814 491738 489792 487988 486197 484343 482698 481742 481565 481607 481207 480237 479003 477780 476721 475988 475585 475186
59798 475186 474522 473795 473240 472438 470563 467407 463671 460202 457400 455427 454375 453953 453403 452078 449884 447107
59782 447107 444173 441639 439896 438694 437437 436129 435460 435664 435977 435736 435419 435933 437325 438919 440464 442324
59766 442324 444676 447268 450068 453384 457219 461092 464730 468443 472543 476871 481189 485622 490338 495064
59752 495064 499292 502913 506397 510374 515115 520298 525235 529476 533352 537714 542981 548581 553460 557125
59738 557125 560064 563143 566653 569881 571675 571524 570042 568250 566519 564531 562253 560362 559385 558815 557651
59723 557651 555686 553750 552573 551904 551004 549577 547823 545858 543711 541848 541060 541527 542395 542707 542459 542285
59707 542285 542335 542077 541261 540461 540411 541188 542366 543656 545063 546616 548351 550466 553205 556512 559943 562921
59691 562921 565128 566776 568490 570642 572757 573907 573813 573123 572416 571416 569643 567388 565490 564367 563785
59676 563785 563328 562487 560507 556862 551934 546644 541415 536074 530666 525632 521081 516711 512627 509474 507418
59661 507418 505742 503902 502250 501187 500352 499393 498921 499804 501881 504277 506751 509707 512974 515611 517199
59646 517199 518444 520068 521694 522296 521303 518913 515748 512515 509653 506898 503545 499471 495586 492828 490999
59631 490999 489089 486618 484144 482441 481633 481216 480641 479682 478516 477522 476841 476061 474549 472221 469749 467883
59615 467883 466649 465326 463123 459745 455434 450722 446176 442265 439268 437263 436165 435832 436220 437432 439540
59600 439540 442270 444927 446744 447423 447308 447043 447093 447576 448410 449448 450451 451108 451256 451069 450949 451221 451944
59583 451944 452874 453526 453401 452436 451216 450419 449940 448871 446526 443210 439717 436404 433212 430396 428554 427791
59567 427791 427407 426703 425698 424763 423929 423005 422101 421526 421248 420894 420258 419435 418510 417568 417042 417599 419412 421869
59549 421869 424200 426183 428086 430162 432454 434936 437620 440636 444321 449107 455234 462713 471657 482459
59535 482459 495482 510740 527855 545986 563507 578107 587666 591173 588859 581811 571762 560894
59523 560894 551197 543789 538912 536405 535877 536606 537745 538720 539259 539115 538132 536481 534405 531694 527751 522289
59507 522289 515662 508466 501187 494270 488030 482256 476337 470057 463978 458801 454676 451458 449187 447741
59493 447741 446341 444130 441331 439173 438426 438503 438370 437943 438063 439288 441289 443506 445843 448431 451118 453688
59477 453688 456418 459901 464243 468886 473421 478198 483765 489928 495777 500528 504055 506606 508376 509448
59463 509448 509903 509909 509788 509936 510454 510965 511155 511480 512965 516129 520457 525063 529649 534610 540489 547562 555732
59446 555732 564512 573143 580910 587316 591969 594604 595337 594634 592695 589099 583391 575910 567686 559568 551826
59431 551826 544596 538241 533046 528834 525193 521971 519314 517310 515921 515353 516251 519240 524320 530988 538998
59416 538998 548766 560912 575630 592705 611965 633376 656742 681547 706973 731711 753683 770274
59404 770274 779114 778856 769799 754355 736704 721079 709824 703258 701205 703761 710130 717489 721869
59391 721869 720180 711183 695236 674006 650265 626941 605869 587624 572404 560521 551992 546243
59379 546243 542476 540047 538440 537349 536893 537412 538847 540718 542864 545774 549839 554578 558949 562336 564970
59364 564970 567516 570487 574023 577979 582159 586453 590823 595281 599976 605165 610869 616689 622289 627990
59350 627990 634498 642036 650188 658636 667566 677167 687245 697671 708698 720362 731904 742422 751968
59337 751968 761387 771044 780125 787304 791772 793561 793203 791240 787799 782516 775010 765448 754443 742487
59323 742487 729873 717215 705567 695679 687327 679679 672127 664539 656937 649430 642494 636868 632905
59310 632905 630174 627935 625897 624349 623643 623818 624756 626561 629626 634401 641142 649842 660246 671845
59296 671845 683762 694591 702312 704643 699934 688145 671098 651624 632170 613983 597362 582474
59284 582474 569758 559570 551697 545513 540670 537408 536040 536210 536999 537840 539127 541761 546215 552320
59270 552320 559855 568986 579840 591825 603722 614541 624126 632878 641047 648443 654669 659410 662490
59257 662490 663788 663217 660752 656513 650870 644369 637451 630276 622949 615836 609428 603883 598952 594423
59243 594423 590427 587192 584685 582700 581211 580475 580855 582627 585796 589923 594312 598606 603109 608203 613591
59228 613591 618430 622252 625294 627790 629417 629834 629436 628955 628323 626523 622831 617791 612595 607802 603106
59213 603106 598144 592925 587455 581596 575640 570526 566987 564750 563007 561453 560350 559700 558954 557620 555727
59198 555727 553684 552100 551714 552807 554474 555069 553811 551559 549735 548902 548738 548871 549170 549547 550069 551125
59182 551125 552995 555423 558024 560871 564148 567503 570406 573067 576271 580244 584328 587907 591103 594371
59168 594371 597963 602045 606862 612440 618449 624555 630692 636877 643066 649258 655351 660777 664717 666854
59154 666854 667474 666752 664467 660695 656110 651069 644919 636880 627370 617787 609080 601118 593437 585995 578943
59139 578943 572067 564816 556826 548369 540355 533862 529457 526761 524587 521563 516922 511126 505824 502772
59125 502772 502446 503709 504987 505678 506435 508369 512182 517766 524323 531038 537855 545433 554175 563556 572667
59110 572667 581139 589168 596925 604440 611948 619761 627725 635241 641990 648323 654722 661079 666647 670642
59096 670642 672853 673758 674053 674017 673432 672149 670505 668993 667762 666736 665982 665514 664882 663397 660837 657552
59080 657552 653863 649735 645080 639910 634064 627229 619475 611464 603816 596520 589233 581963 575105 568950
59066 568950 563442 558386 553665 549205 544948 540916 537220 533925 530943 528065 525132 522189 519466 517120
59052 517120 515019 512864 510527 508120 505767 503485 501358 499591 498274 497183 496060 495054 494724 495500 497173
59037 497173 498989 500266 500884 501211 501633 502305 503297 504737 506668 509019 511946 516040 521840 529171 537276
59022 537276 545654 554477 564109 574606 585889 598037 610982 624023 636079 646490 655292 662659
59010 662659 668415 672285 674353 674922 674062 671696 668166 664299 660717 657438 654493 652637 652910 655474 659356
58995 659356 663392 666964 669750 671385 671819 671618 671391 671134 670488 669352 667673 664948 660684 655366 650267
58980 650267 646080 642307 638292 634320 631386 630297 631350 634476 639270 645118 651735 659401 668304 677871
58966 677871 687213 696140 705307 715329 726115 737006 747153 755741 762328 767174 770980 774067 775991
58953 775991 775992 773581 768636 761343 752295 742314 731764 720188 707066 692883 679064 666730 655849
58940 655849 645733 636093 627331 619988 614190 609570 605536 601589 597607 593887 590855 588723 587446 586883
58926 586883 586823 586928 586891 586606 586022 584921 583283 581831 581653 582876 584119 583815 581935 579833 578492 577554 576284
58909 576284 574857 574175 574764 576433 578941 582430 587093 592839 599539 607357 616576 627261 639268 652427
58895 652427 666395 680463 693853 706324 718187 729687 740688 751145 761561 772649 784723
58884 784723 797717 811584 826232 841115 855341 868212 879278 887902 893334 895450 894855 891952 886403
58871 886403 878000 867687 857063 846964 837023 826549 815370 803856 792657 782455 773489 765215
58859 765215 756837 748309 740347 733268 726283 718322 709220 699718 690455 681423 672447 663789 656009 649313
58845 649313 643180 636773 629752 622595 616092 610597 605841 601277 596352 590628 584074 577286 571073 565672
58831 565672 560621 555471 550356 545719 541807 538585 535849 533175 530108 526852 524598 524642 527093 530754 534398
58816 534398 537857 541706 546189 550822 555008 558646 561967 565058 567942 571022 574912 579507 583607 585898
58802 585898 586225 585532 584614 583362 581191 577780 573258 568048 562726 557768 553255 549035 545259 542371 540383
58787 540383 538502 535824 532215 528311 524875 522447 521386 521815 523544 526288 529940 534455 539496 544391
58773 544391 548469 551356 553012 553518 552694 549976 544971 538259 531232 524846 518837 512498 505904 499872 494923
58758 494923 490862 487355 484376 481959 480036 478797 478826 480501 483419 486712 489872 493047 496584 500494 504464
58743 504464 508256 511926 515650 519513 523586 528081 533155 538549 543741 548497 553013 557396 561450 565179
58729 565179 569060 573355 577454 580566 582915 585624 589372 593707 597838 601491 604717 607385 609374 610993
58715 610993 612827 615220 618215 621840 626174 631154 636593 642356 648287 653912 658365 660680 660269 657330
58701 657330 652831 647805 642368 635522 626154 614167 600469 586003 571134 556023 541205 527567
58689 527567 515857 506327 498711 492350 486468 480603 474963 470244 466960 464884 463207 461265 459014 456767
58675 456767 454633 452442 450227 448454 447591 447631 448305 449699 452324 456494 461874 467801 473826 479790 485634
58660 485634 491494 497812 504845 511914 517533 520559 521004 519562 516649 512305 506857 501182 496154 492040
58646 492040 488465 484792 480579 475981 471763 468663 466677 465128 463412 461381 459088 456657 454574 453616
58632 453616 454181 456003 458728 462293 466400 470098 472546 473936 475078 476245 477034 477264 477255 477174 476842 476487 477052
58615 477052 479270 482838 486890 491030 495424 500074 504470 508062 510867 513512 516617 520026 522760 523987
58601 523987 524013 523965 524493 525255 525753 526055 526354 526393 525849 524921 524022 523257 522724 522971 524381 526374 528050 529590
58583 529590 532203 536575 542291 548963 556992 566588 576775 586176 594477 602423 610565 618646 626149 632928
58569 632928 639275 645722 652764 660557 669007 678345 689342 702640 718192 735778 755678 778162 802446
58556 802446 826884 850185 871788 891064 906957 918756 926583 930793 931449 928845 924048 918391 912619
58543 912619 906776 900578 893552 885182 875371 864514 852823 839918 825402 809487 792579 774639
58531 774639 755593 736139 717536 700661 685794 673215 663271 655774 649934 645136 641343 638560 636354
58518 636354 634215 632084 630243 628753 627278 625435 623262 621255 619799 618586 616863 614452 612173 610925
58504 610925 610620 610433 609837 608880 607665 606230 604835 603781 602895 601808 600677 600074 600116 600464 601250 603260 606824
58487 606824 611238 615655 619982 624541 629457 634897 641412 649397 658501 668088 678085 688902 700663 712949
58473 712949 725244 737333 749242 760887 771653 780306 785623 787175 785235 780090 772095 762516 753427
58460 753427 746242 740843 736603 733665 732662 733673 736255 740228 745792 753051 761922 772290 783630 794669
58446 794669 803915 810474 814008 814220 810959 804684 796325 786783 776903 767635 759682 753160 748010 744491
58432 744491 742830 742698 743621 745626 748937 753314 758354 764183 771150 779054 787430 796401 806412 817121
58418 817121 827336 836110 843240 848650 851985 852942 851445 847485 841336 833806 825594 816576 806511 796288
58404 796288 787405 780171 773512 766813 760856 756533 753666 751695 750629 750608 751349 752789 755647 760514 766831
58389 766831 773497 780069 786604 792734 797776 801624 804834 807859 810755 813566 816407 819203 821845 824558
58375 824558 827677 831069 834250 837079 839917 843063 846446 849941 853658 857772 862366 867597 873808 881305
58361 881305 890085 899943 910775 922654 935500 948763 961588 973436 984468 995177 1005679 1015513
58349 1015513 1024054 1030907 1036011 1039673 1042556 1045401 1048695 1052676 1057483 1063076 1069173 1075714 1083344 1092971
58335 1092971 1104786 1118070 1131958 1146009 1160074 1174201 1188790 1204297 1220562 1236869 1252822
58324 1252822 1268595 1284002 1297938 1309278 1318003 1324976 1330938 1336216 1341188 1346428 1352300 1358781 1365738
58311 1365738 1373144 1380962 1389079 1397447 1406289 1416120 1427548 1440941 1456225 1473009 1490841 1509302
58299 1509302 1527999 1546677 1565294 1583816 1602074 1620030 1638046 1656550 1675536 1694680 1713877
58288 1713877 1733396 1753597 1774835 1797457 1821558 1846872 1873222 1900888 1930113 1960493 1991407
58277 1991407 2022798 2054987 2087908 2121253 2155275 2190737 2228084 2267306 2308530 2352030 2397684
58266 2397684 2445169 2494740 2547056 2602195 2659623 2719156 2781179 2845759 2912431 2981029 3051928
58255 3051928 3125230 3200440 3277107 3355107 3434165 3513992 3595037 3678306 3764302 3853002 3945006
58244 3945006 4041723 4144187 4252713 4367921 4491042 4622773 4762796 4910901 5067758 5234257
58234 5234257 5410983 5598719 5798613 6011530 6238086 6479530 6737751 7014325 7310570
58225 7310570 7628559 7970905 8339579 8736334 9164431 9628447 10132252 10678981 11273462
58216 11273462 11923026 12635534 13418488 14281028 15235563 16297179 17483426 18815760 20320440
58207 20320440 22028714 23978902 26219366 28808023 31808842 35290609 39328977 44008544
58199 44008544 49426745 55704518 63000401 71518986 81513137 93285941 107190648 123622790
58191 123622790 143005436 165755740 192185958 222301174 255541526 290587402 325309285
58184 325309285 356873754 382043452 397758612 401947304 394210498 375931799 349704891
58177 349704891 318464252 284838345 250925348 218321981 188173249 161181640 137636013
58170 137636013 117495405 100501844 86286214 74448767 64607033 56415187 49570877
58163 49570877 43820693 38960714 34828246 31292004 28247458 25613198 23323707 21323124
58155 21323124 19564535 18010573 16630648 15397989 14290163 13290081 12384226 11560908
58147 11560908 10811146 10129187 9510184 8948150 8436950 7971696 7547983 7161073 6806827
58138 6806827 6481998 6182474 5902485 5636731 5382525 5139322 4907395 4687571 4480758
58129 4480758 4286674 4103910 3931773 3770817 3620989 3480629 3348050 3222871 3105097
58120 3105097 2994112 2889352 2790744 2697734 2609059 2524153 2443565 2367348 2294420 2224294 2158013
58109 2158013 2096362 2038434 1982951 1929819 1879317 1830918 1784138 1739457 1697141 1656041 1614834
58098 1614834 1573739 1533808 1495238 1457613 1421223 1386843 1354450 1323185 1292419 1262172 1232883
58087 1232883 1205433 1180896 1159499 1140179 1121706 1103691 1086040 1068294 1050313 1032779 1016018
58076 1016018 998962 980310 960277 940195 920846 902122 883916 866297 848990 831642 814529
58065 814529 798297 783222 769323 756869 745998 736134 726503 716992 707853 698939 689976 681163 672637
58052 672637 663690 653500 642463 631905 622549 614210 606837 600762 595680 590408 584260 578072 573336
58039 573336 570517 568506 565619 560996 555119 549025 543119 537024 530529 524070 517933 511583 504348 496408
58025 496408 488431 480530 472190 463134 453698 444477 436074 428976 423151 417849 412308 406572 401245 396630
58011 396630 392579 388969 385765 382783 379845 377088 374669 372348 369847 367376 365206 362929 359787 355664
57997 355664 351165 346768 342517 338547 335235 332733 330829 329405 328589 328363 328463 328737 329265 330090 331119 332275
57981 332275 333401 334145 334267 333942 333344 332149 330007 327332 324940 322947 320737 318121 315802 314361 313457
57966 313457 312425 311209 310174 309309 308175 306631 305190 304479 304543 304848 305030 305379 306349 307655 308261 307387 305195
57949 305195 302331 299285 296437 294204 292582 291013 289303 288318 289035 291178 293643 296170 299713 305044 311779
57934 311779 319030 326293 333476 340682 348341 356861 365761 373577 379058 382125 383369 383101 381243 377780
57920 377780 372819 366486 359159 351554 344235 337244 330496 324249 318774 313880 309259 305228 302607 301824
57906 301824 302431 303568 304562 305103 305150 304894 304568 304187 303554 302633 301706 300997 300300 299231 297851 296764 296440 296624
57888 296624 296624 296096 295315 294706 294379 294167 293934 293774 294073 295275 297256 298961 299144 297636 295428 293282 290844
57871 290844 287506 283544 279748 276355 273163 270484 269074 269039 269581 270001 270342 270907 271855 273561 276691 281343
57855 281343 286525 291053 294783 298577 303207 308657 314311 319432 323520 326514 328718 330306 330896 329806
57841 329806 326824 322630 318362 314671 311210 307101 301933 296226 290897 286488 283013 280229 277721 274967
57827 274967 271815 268874 266954 266139 265838 265746 266234 267616 269508 271303 272976 275082 278058 281714 285296
57812 285296 287918 289103 288940 287564 284577 279361 272026 263609 255169 247053 239282 232215 226397 221945
57798 221945 218495 215683 213373 211514 210049 208996 208461 208593 209574 211509 214185 217071 219707 221994 224057
57783 224057 226063 228343 231455 235801 241186 246972 252664 258238 263931 269872 275935 281818 287154 291499
57769 291499 294341 295421 295165 294476 293717 292110 288624 283369 277534 271974 266542 260978 255614 250677 245609
57754 245609 239934 234399 230297 227707 225315 222244 219245 217638 217654 218472 219574 221222 223514 225695 226904
57739 226904 227266 227667 228507 229275 229558 229902 231175 233418 235915 238262 240655 243024 244626 245002 244876 245531
57723 245531 247374 249522 250776 250673 249638 248409 247457 246771 245998 244721 242601 239501 235756 232336 230324
57708 230324 229917 230009 228929 225651 220404 214373 208818 204204 200029 195658 191260 187612 185031 183110 181665
57693 181665 181319 182558 184615 185949 185793 184775 184013 183999 184381 184479 183908 182894 182100 182136 183348 186013 190372
57676 190372 196310 203477 212082 223175 237673 255426 275866 299384 327435 361293 401203 446491
57664 446491 495380 544219 587476 619207 634776 631683 609932 572484 525003 474116 425095 380686
57652 380686 341535 307279 277452 251914 230783 214036 201226 191607 184424 179066 175111 172316
57640 172316 170511 169386 168559 167914 167711 168183 169107 169931 170307 170388 170589 171158 172009 172899 173673 174264 174474 173984
57622 173984 172756 171295 170266 169846 169665 169331 168800 168176 167457 166685 166106 165950 166049 165891 165069 163589 161750
57605 161750 159825 157883 155877 153820 151848 150110 148675 147539 146682 146088 145724 145504 145145 144110 141916
57590 141916 138649 134980 131524 128348 125285 122467 120158 118207 116142 113866 111885 110659 110049 109595 109136
57575 109136 108904 109089 109453 109375 108260 106035 103326 101040 99723 99300 99321 99345 99206 99132 99522 100347 100935 100712
57557 100712 100031 99817 100354 100992 101186 101253 101753 102686 103786 105217 107316 109814 111917 113179 113773 113839 113152
57540 113152 111661 110024 109200 109592 110804 112160 113305 114268 115072 115455 115120 114215 113257 112473 111461 109871
57524 109871 108193 107444 108037 109324 110301 110405 109541 107801 105497 103293 101907 101614 102183 103219 104470 105828
57508 105828 107217 108496 109490 110109 110482 110822 111127 111119 110531 109348 107771 106110 104793 104171 104038 103556 102008
57491 102008 99639 97454 96192 95775 95763 95876 95871 95303 93900 92063 90563 89696 89081 88359 87732 87577 87810 87986
57473 87986 87895 87713 87546 87135 86138 84491 82375 80009 77608 75458 73799 72642 71807 71123 70496 69844 69111
57456 69111 68442 68207 68712 69827 70913 71278 70780 70007 69703 70053 70653 71121 71467 71770 71837 71518 71168 71409 72443
57437 72443 73912 75395 76618 77178 76546 74709 72481 70871 70256 70386 70926 71680 72419 72918 73196 73438 73660
57420 73660 73663 73328 72750 72147 71789 71907 72358 72474 71633 70056 68712 68395 69164 70644 72447 74130 75212 75498
57402 75498 75171 74401 73225 71940 71154 71089 71221 70942 70262 69474 68556 67464 66662 66719 67502 68390 69166 70108 71305
57383 71305 72625 74336 76969 80334 83394 85427 86726 87843 88769 89231 89224 88789 87772 86279 84916 84012
57367 84012 83058 81459 79443 77606 75956 74182 72653 72233 73068 74226 74665 74042 72619 71017 70114 70484
57351 70484 71715 72755 73144 73427 74267 75697 77392 79075 80359 80791 80431 79983 79990 80283 80459 80398 79958 78758
57333 78758 76855 75215 74881 75886 77465 79048 80477 81519 81914 81855 81814 81829 81493 80694 79831 79249 78938 78854
57315 78854 79029 79190 78817 77836 76882 76550 76649 76474 75614 74293 73119 72631 72908 73501 73906 74115 74414 74731 74678
57296 74678 74405 74812 76487 78833 80716 81725 82320 82970 83715 84524 85544 86843 88271 89700 91131 92518
57280 92518 93736 94824 96000 97297 98414 99029 99101 98785 98179 97296 96206 95143 94478 94506 95164 96098 97117
57263 97117 98438 100174 101774 102442 102161 101806 102083 102730 103042 102822 102429 102125 101843 101499 101159 100916 100898 101364
57245 101364 102471 103894 105042 105689 106135 106645 107050 107098 106906 106768 106691 106492 106348 106868 108462 110800 113053
57228 113053 114570 115237 115374 115512 116163 117469 119016 120209 120964 121825 123290 125227 127182 129021 130950 133010
57212 133010 135036 137135 139770 143110 146678 149957 153155 157067 162331 169085 177214 186512 196569 206848
57198 206848 216976 226812 236218 245051 253451 261908 270862 280370 290247 300344 310512 320466 329930
57185 329930 338981 348117 358011 369184 381770 395370 409119 422152 434269 446101 458448 471392
57173 471392 484275 496608 508846 522025 536750 552795 569631 586983 604751 622656 640196
57162 640196 656850 672281 686578 700415 714631 729383 743999 757923 771597 786028 801738
57151 801738 818622 836732 856593 878667 902949 929255 957468 987288 1018079 1049222 1080318
57140 1080318 1110887 1140201 1167930 1194837 1222556 1252614 1285733 1321799 1360161 1399999 1440779
57129 1440779 1482641 1526313 1572609 1622039 1674785 1730863 1790182 1852606 1918229 1987744 2062460
57118 2062460 2143844 2233112 2331369 2439997 2560535 2694183 2841750 3004240 3183157 3380130
57108 3380130 3596736 3835255 4099626 4395638 4730673 5113805 5556172 6071199 6674961
57099 6674961 7386880 8229945 9230062 10415494 11817193 13468957 15406080 17662780
57091 17662780 20268970 23246059 26602089 30327078 34386284 38707820 43170123 47606631
57083 47606631 51837768 55713330 59133003 62033215 64362301 66071462 67123348 67500340
57075 67500340 67202818 66244219 64650280 62460527 59728656 56523493 52931604 49057394
57067 49057394 45017280 40930357 36909441 33053118 29438921 26119842 23125191 20463152
57059 20463152 18123340 16081302 14305966 12766207 11432766 10277451 9273672 8398384
57051 8398384 7632698 6960973 6370472 5851544 5396524 4997733 4646934 4336545 4060468
57042 4060468 3813623 3591673 3391495 3211203 3049206 2903672 2773085 2656676 2553885
57033 2553885 2463751 2385285 2318223 2263083 2220722 2192312 2179750 2185500 2211007 2253911 2305583
57022 2305583 2351154 2373307 2358563 2302528 2210885 2095801 1970438 1844956 1725518 1615293
57012 1615293 1515681 1426974 1348793 1280459 1221121 1169734 1125218 1086648 1053052 1023128 995629
57001 995629 970130 946935 925983 906251 886584 866790 847554 829477 812660 797073 782935
56990 782935 770608 760387 752467 747022 744209 744014 745932 748881 751649 753437 753628 751111 744396 732747
56976 732747 716872 698240 678102 657463 637501 619321 603411 589761 578383 569297 562227 556912
56964 556912 553716 553356 555957 560874 567644 576635 588376 602458 617446 631714 643983 652959 656849
56951 656849 653788 643091 625995 604997 582474 559989 538637 519422 503081 489877 479822 472919
56939 472919 469076 468115 470136 475664 485182 498680 515707 535595 557454 580202 602698 623370 639569
56926 639569 648004 646549 635578 617222 593675 566607 537629 508390 480171 453865 430292 409974
56914 409974 392669 377659 364566 353449 344148 336093 328817 322218 316235 310753 305911 302061 299261
56901 299261 297129 295313 293770 292606 292050 292638 294928 298848 303755 309393 316442 325853 337885 351985
56887 351985 367364 383367 399427 414901 428989 440726 449105 453264 452674 447380 438229 426753 414597
56874 414597 403116 393471 386701 383313 383067 385639 391327 400730 413959 430740 451228 476127 505920
56861 505920 540417 578956 620357 662476 702287 736551 762158 776058 775934 761642 735861 703063
56849 703063 667912 634251 604552 579759 559971 545677 538064 538045 545567 560255 582260 612136
56837 612136 650342 697277 753263 817703 888194 960698 1030251 1091071 1136529 1160318 1158694 1132113
56825 1132113 1085032 1024227 956721 888296 823106 764078 713252 671670 639411 616114 601514
56814 601514 595423 597551 607671 625852 652329 687101 729575 778206 830095 880959 925589 958514
56802 958514 974845 971637 949156 910773 861278 805268 746829 689776 637241 591017 551687 519377
56790 519377 494129 475698 463416 456490 454443 457427 466126 481044 501628 526146 552394 578205
56778 578205 601200 618623 627969 627684 617189 596726 567723 533035 496142 459842 425747 394677
56766 394677 367088 343169 322864 305916 291765 279635 268979 259732 251965 245428 239605 234036
56754 234036 228459 222913 217940 214318 212247 211034 209860 208520 207118 205483 203452 201397 199873 198915
56740 198915 198240 197877 197927 197824 196665 194406 192083 190652 190092 189826 189529 189281 189304 189800 190744 191755 192436 192895
56722 192895 193589 194613 195613 196491 197686 199452 201288 202459 202843 202924 203078 203215 203075 202643 202219 202173 202655
56705 202655 203586 204951 206918 209473 212088 214028 214997 215229 215008 214495 214012 214088 215002 216475 217897 218663 218286
56688 218286 216605 214064 211568 209857 209152 209395 210501 212174 213734 214513 214448 214219 214724 216324 218484 220276
56672 220276 221363 222289 223544 224659 224784 223999 223381 223648 224413 225059 225677 226625 227705 228410 228720 229015 229320
56655 229320 229229 228661 228195 228474 229570 231042 232348 233077 232975 232011 230405 228576 226987 225909 225218 224551 223813
56638 223813 223401 223670 224219 224028 222449 219882 217348 215543 214469 213854 213642 213988 214925 216219 217529 218657
56622 218657 219609 220471 221183 221458 221014 219979 218921 218285 217930 217435 216777 216323 216125 215717 214824 213833 213247 213028
56604 213028 212888 212895 213261 213721 213708 213150 212546 212221 211965 211504 210885 210278 209798 209642 210008 210775 211640 212625 213986
56585 213986 215516 216518 216752 216861 217474 218331 218795 218892 219266 220293 221742 223219 224495 225426 225962 226312 226805
56568 226805 227510 228219 228877 229846 231728 234987 239714 245638 252394 259870 268216 277572 287946 299247 310915
56553 310915 321390 328592 331556 331345 329854 327919 325109 321111 316474 311859 307279 302485 297642 293196
56539 293196 289365 286112 283426 281284 279490 277838 276344 275092 273966 272786 271619 270690 270010 269310 268358
56524 268358 267173 265925 264812 263980 263355 262544 261183 259399 257663 256116 254388 252303 250395 249274 248662
56509 248662 247565 245475 242946 240858 239470 238416 237288 235951 234541 233473 233245 233879 234620 234565 233564
56494 233564 232288 231460 231315 231763 232652 233742 234656 235100 235076 234832 234664 234717 234864 234851 234702 234854 235674 236939 238115
56475 238115 239032 239931 240837 241357 241246 240847 240749 241241 242252 243560 244856 245758 246016 245698 245142 244793 245039 245984
56457 245984 247339 248706 249966 251203 252300 252948 253074 252940 252777 252635 252630 253022 253899 255078 256340 257486 258239
56440 258239 258545 258985 260301 262369 264212 265252 265889 266584 267087 267123 267134 267643 268301 268348 267668 266659 265362 263649
56422 263649 262110 261772 262730 263864 264238 264125 264293 264808 265065 264706 264040 263651 263871 264610 265509 266248 266770 267264
56404 267264 268016 269261 270970 272591 273267 272614 271194 269949 269348 269392 270135 271644 273489 274918 275647 276024
56388 276024 276311 276330 276020 275874 276410 277531 278720 279752 280950 282803 285425 288305 290641 292137 293400 295241
56372 295241 297620 299673 300805 301178 301052 300325 299184 298589 299385 301122 302422 302501 301836 301312 301283 301634 302321
56355 302321 303493 305182 307173 309121 310690 311628 311879 311645 311266 310993 310884 310891 311003 311231 311543 311949 312731 314426
56337 314426 317333 321045 324643 327418 329328 330836 332540 334997 338540 342987 347612 351654 354873 357540
56323 357540 359982 362322 364614 366955 369386 371788 373930 375520 376180 375606 373949 371996 370756 370741 371698
56308 371698 372996 374131 374918 375504 376405 378262 381210 384591 387630 390397 393719 398124 403293 408646 414017
56293 414017 419481 424906 430067 434940 439476 443332 446215 448398 450493 452886 455710 459239 463815 469444
56279 469444 475890 483148 491367 500294 509291 518015 526695 535721 545423 556292 568812 582774 597258
56266 597258 611657 626355 642142 659381 678143 698729 721486 746360 773285 802961 836680
56255 836680 875282 918717 966816 1020092 1079531 1145830 1219122 1299403 1387049 1482837 1587360
56244 1587360 1700279 1820130 1944933 2072994 2202975 2333226 2461293 2584190 2698928
56235 2698928 2802579 2891986 2963860 3015493 3045404 3053293 3039567 3005204 2952027 2882727 2800166
56224 2800166 2706632 2603868 2493844 2379248 2263032 2147553 2034232 1924013 1817881 1716820
56214 1716820 1621468 1532174 1449434 1373857 1305336 1242551 1183833 1128593 1077438 1030813 988125
56203 988125 948563 912183 879576 850726 824920 801716 781322 763843 748729 735246 723127
56192 723127 712476 703273 695269 688164 681677 675626 670146 665691 662560 660470 658747 656925 654989 653114
56178 653114 651361 649750 648534 648202 649087 650975 653224 655330 657279 659310 661512 663809 666244 669111 672821
56163 672821 677709 683885 691156 699199 707876 717248 727257 737596 748056 758752 769928 781934 795646
56150 795646 812466 833378 858210 886333 917905 953987 995608 1043339 1097817 1160102 1231317
56139 1231317 1312094 1402140 1499693 1601317 1702705 1799865 1889436 1968421 2034781 2088721 2132818
56128 2132818 2170428 2204020 2234775 2262751 2286846 2305046 2315518 2317664 2312212 2300606 2284291 2263879
56116 2263879 2238387 2205347 2161987 2106448 2038250 1958325 1869089 1774223 1677985 1584521 1497426
56105 1497426 1419255 1351085 1292747 1243650 1203191 1170549 1144608 1124247 1108427 1096015 1086047
56094 1086047 1078304 1073147 1070648 1070262 1071368 1073616 1076647 1080085 1084043 1089059 1095307 1102365 1109958 1118325
56080 1118325 1127631 1137603 1148019 1158996 1170477 1182038 1193513 1205249 1217421 1229672 1241790 1254142
56068 1254142 1267062 1280449 1294319 1309118 1324986 1341346 1357690 1374187 1391099 1408323 1426005
56057 1426005 1444832 1465048 1485890 1506716 1527908 1549861 1571812 1592741 1612959 1633733 1655651
56046 1655651 1678270 1701107 1724032 1746915 1769807 1793364 1818307 1844562 1871591 1899318 1927978
56035 1927978 1957388 1987262 2018111 2050927 2086004 2122923 2161670 2202935 2247136 2293828 2342274
56024 2342274 2392095 2443204 2495472 2548560 2602029 2655819 2710812 2768463 2829524 2893600 2960241
56013 2960241 3029798 3102661 3178377 3256423 3337401 3422684 3513169 3609026 3710189 3816375 3927071
56002 3927071 4042173 4162371 4288433 4420677 4559611 4706278 4861405 5025192 5198628
55993 5198628 5383793 5581833 5791866 6013252 6247920 6499046 6768409 7056657 7365271
55984 7365271 7696563 8052448 8434913 8847175 9292936 9775327 10298177 10867405 11489496
55975 11489496 12169893 12915080 13735394 14643765 15652994 16777198 18035660 19453505 21060396
55966 21060396 22892354 24995137 27423942 30241027 33516212 37328518 41765283 46923829
55958 46923829 52922058 59912144 68087654 77686334 88994408 102346557 118116292 136705062
55950 136705062 158521775 183899482 212902731 245068346 279192282 313238969 344393191
55943 344393191 369318851 384740963 388314522 379426298 359447347 331247917 298267349
55936 298267349 263651595 229786160 198222520 169817863 144924494 123550894 105479964
55929 105479964 90358955 77775835 67320273 58619501 51351231 45246266 40087054
55922 40087054 35700487 31947575 28716701 25920275 23489311 21366604 19504110 17863749
55914 17863749 16415563 15133291 13993034 12975342 12065225 11249171 10514049 9848974 9245875
55905 9245875 8697546 8196862 7738051 7316752 6928396 6568214 6233087 5921520 5631464
55896 5631464 5359957 5105395 4868157 4648047 4442689 4249466 4067765 3898232 3740746
55887 3740746 3594207 3457689 3330850 3213485 3105224 3005421 2912876 2825745 2741744 2658419
55877 2658419 2573693 2486948 2399537 2313682 2230813 2151359 2075624 2004006 1936468 1872589 1812107
55866 1812107 1754789 1700102 1647775 1598432 1552784 1510433 1470458 1432888 1398422 1366796 1336607
55855 1336607 1306816 1277298 1247826 1217848 1187585 1158163 1130165 1103035 1076337 1050495 1025726
55844 1025726 1001271 976507 951978 928475 905774 883188 860919 839961 820854 803222 786455
55833 786455 770296 754761 739900 725729 712227 699500 687869 677432 667540 657232 646388 635937
55821 635937 626550 617625 607986 597159 585506 573396 560903 548266 536166 525409 516489 509424
55809 509424 503853 499309 495481 492207 489304 486703 484791 484221 485218 487275 489730 492433 495612 499312 503211
55794 503211 506850 509828 511830 512743 512782 512380 511879 511316 510496 509254 507608 505637 503262 500277 496535 491825
55778 491825 485590 477180 466664 455147 444010 434116 425972 420254 417655 418385 422176 428539 436483 444171
55764 444171 449433 450699 447247 438950 426515 411763 396807 382694 369262 356284 344134 333271
55752 333271 323711 315251 307752 301015 294828 289190 284115 279230 274141 269213 265331 262728 260724 258790
55738 258790 257211 256320 255834 255380 255128 255297 255380 254410 251881 248141 244109 240717 238224 235814 232237 227067
55722 227067 221050 215083 209483 204434 200469 197913 196358 195236 194554 194625 195485 197134 199972 204364 210014
55707 210014 216268 222730 228970 233954 236493 236232 233722 229682 224728 219586 214780 210028 204593 198343
55693 198343 192004 186308 181476 177574 174785 173049 171939 171183 170954 171381 172170 173016 174106 175828 178171
55678 178171 180749 183383 186288 189620 193031 195808 197402 197811 197474 196857 196149 195285 194146 192711 191093
55663 191093 189499 188084 186791 185449 184062 182973 182656 183396 185109 187325 189391 190901 192034 193284 194804
55648 194804 196218 197097 197317 196898 195876 194544 193414 192605 191622 190115 188609 187878 187697 186733 183833 179068
55632 179068 173436 167866 162715 158000 153791 150230 147174 144022 140221 136007 132377 130171 129414 129677 130616
55617 130616 131821 132499 131954 130307 128311 126536 125097 124041 123444 123112 122676 122010 121143 119793 117570 114760
55601 114760 112299 110713 109581 108395 107415 107177 107543 107766 107353 106391 105131 103779 102646 102024 101775 101417
55585 101417 100777 100238 100158 100338 100417 100552 101319 102866 104503 105396 105502 105623 106567 108480 110926 113360 115407
55568 115407 116955 118233 119712 121757 124362 127237 129977 131988 132509 131142 128395 125427 123089 121298
55554 121298 119358 116669 113183 109465 106504 105184 105656 107196 108766 109698 109861 109469 108970 108945 109706 110870
55538 110870 111589 111378 110639 110182 110314 110615 110602 110323 110130 110091 109949 109614 109312 109122 108663 107563 106036 104675
55520 104675 103668 102560 100873 98701 96490 94424 92321 90124 88218 87069 86743 86942 87450 88253 89164
55505 89164 89598 88978 87270 84927 82429 80103 78228 76953 76087 75228 74221 73233 72427 71857 71726 72272 73208
55488 73208 73729 73427 72882 72902 73411 73662 73484 73730 75204 77537 79474 80195 80051 79935 80205 80452 80261 79821
55470 79821 79560 79427 78959 78013 76948 76048 75184 74250 73448 72828 71961 70505 68841 67760 67651 68375 69694
55453 69694 71409 73153 74519 75393 75928 76251 76445 76628 76782 76709 76459 76557 77353 78411 79016 79079 78954 78572 77527
55434 77527 76035 75046 75099 75675 75913 75510 74698 73845 73438 73947 75319 76867 77965 78649 79332 80282 81559 83129
55416 83129 84699 85686 85674 84772 83434 82191 81615 82065 83166 83925 83759 83138 82883 83153 83476 83529 83363 83039
55398 83039 82522 81967 81700 81829 82133 82361 82379 82017 81078 79650 78231 77409 77408 77921 78352 78273 77712 77084 76891 77474
55378 77474 78899 80849 82723 84091 85089 86148 87391 88601 89734 91064 92690 94260 95288 95442 94458
55363 94458 92246 89252 86325 83958 82001 80270 78962 78225 77841 77697 78044 78781 79021 78052 76435 75421
55347 75421 75422 75762 75813 75615 75306 74679 73597 72402 71619 71543 72210 73379 74407 74553 73657 72338 71393 71222 71869
55328 71869 73207 74866 76306 77267 77974 78712 79407 79809 79918 79931 79868 79547 79023 78791 79339 80467 81278 81006
55310 81006 79848 78766 78484 78850 79222 79166 78663 77858 76971 76268 75847 75542 75256 75224 75663 76317 76761 77057 77694
55291 77694 78816 79910 80430 80442 80467 80894 81719 82771 84008 85514 87209 88612 89107 88574 87566 86699 86005
55274 86005 85149 84086 83175 82651 82308 81749 80774 79540 78554 78403 79293 80870 82607 84215 85490 86099 85928
55257 85928 85500 85585 86400 87492 88316 88575 88145 87163 86169 85653 85447 84948 83955 82820 81811 80851 79970 79492
55239 79492 79556 79892 80236 80567 80839 80871 80675 80467 80261 79880 79478 79500 79966 80307 80174 79918 79964 80213 80368 80390 80276
55218 80276 79876 79308 79144 79761 80887 82084 83230 84143 84274 83339 81927 80940 80724 81190 82319 83973 85584
55201 85584 86674 87460 88334 89085 89312 89281 89546 89881 89448 88104 86718 86038 85894 85729 85346 84948 84863 85341 86231
55182 86231 86845 86628 85901 85438 85402 85437 85694 86771 88396 89150 88076 85863 83860 82546 81629 81110 81403 82586
55164 82586 84237 85904 87273 88016 88008 87614 87303 87053 86608 86175 86359 87293 88314 88628 87998 86745 85431 84614
55146 84614 84582 85115 85673 85936 86032 86202 86426 86463 86113 85370 84466 83814 83756 84244 84852 85144 85050 84847 84856 85167 85630
55125 85630 86105 86683 87498 88412 89045 89257 89332 89541 89739 89670 89433 89304 89242 89049 88958 89530 90824 92166 93029 93677
55105 93677 94528 95285 95370 95062 95435 96921 98537 98995 98231 97325 97099 97372 97679 98090 99008 100474 102097 103518
55087 103518 104589 105168 105140 104680 104205 103976 103962 104144 104665 105519 106384 106983 107447 108015 108518 108496 107813 106846 105938
55068 105938 104889 103229 100989 99015 98364 99322 101068 102354 102556 102017 101484 101401 101755 102346 102948 103333 103375
55051 103375 103201 103107 103308 103791 104300 104442 103924 102878 101872 101367 101217 100893 100169 99330 98701 98247 97750 97156
55033 97156 96625 96392 96689 97638 99083 100611 101890 102903 103757 104364 104487 104039 103237 102496 102225 102642 103615 104726
55015 104726 105541 105794 105355 104279 103030 102368 102705 103622 104288 104274 103695 102726 101514 100622 100964 102858 105406
54998 105406 107267 107951 108026 108175 108541 108981 109417 109660 109248 107930 106197 104971 104756 105290 105992 106420 106279 105402
54980 105402 104053 103018 102936 103535 103840 103297 102436 102248 103044 104181 104808 104661 104143 103859 104152 104899 105618 105875
54962 105875 105683 105482 105689 106335 107146 107841 108269 108382 108233 107941 107573 107095 106538 106079 105847 105772 105750 105902 106415
54943 106415 107203 107931 108431 108839 109250 109464 109265 108820 108585 108797 109173 109201 108722 108252 108547 109759 111117 111662
54925 111662 111275 110779 111054 112340 114430 117119 120177 123234 126090 129047 132622 136952 141743 146733 151861
54910 151861 156933 161476 165090 167712 169290 169362 167286 163044 157694 152778 149113 146200 142951 138934 134704
54895 134704 130948 127740 124850 122358 120484 119008 117424 115709 114440 114060 114428 115240 116381 117623 118471
54880 118471 118791 119253 120596 122586 124275 125322 126548 129029 133000 137854 142842 147497 151625 155290 158732
54865 158732 162014 164740 166395 166922 166662 165634 163257 159135 153960 149194 145757 143236 140513 136878 132424
54850 132424 127627 122950 118867 115868 114196 113574 113338 112912 112216 111615 111408 111406 111165 110637 110310 110466 110604 109973
54832 109973 108584 107243 106573 106475 106674 107289 108457 109723 110303 109912 108994 108064 107146 105980 104608 103545 103326
54815 103326 103905 104592 104742 104482 104601 105638 107251 108605 109179 109028 108497 107943 107663 107834 108421 109275 110253 111197
54797 111197 111895 112254 112400 112489 112545 112666 113221 114513 116300 117919 118906 119206 118868 117915 116627 115594 115233 115411
54779 115411 115705 115936 116236 116714 117258 117719 118174 118908 120138 121813 123757 125935 128398 130959 133229 135140
54763 135140 137186 139831 142907 146028 149465 154020 159893 166140 171543 175665 178752 180836 181381 179749
54749 179749 175829 170222 163947 157896 152395 147269 142318 137624 133406 129789 126807 124475 122752 121540
54735 121540 120792 120509 120569 120773 121112 121720 122500 123025 123063 122978 123421 124706 126601 128538 129990 130908 131937 133970
54717 133970 137327 141646 146639 152415 158750 164543 168650 171033 172515 173532 173671 172391 169664 165877
54703 165877 161557 157200 152937 148365 143198 138061 134092 131678 130154 128861 127828 127146 126366 124996 123218
54688 123218 121562 120227 119193 118752 119317 120713 122093 122653 122241 121315 120540 120387 120862 121589 122183 122395 121959
54671 121959 120666 118847 117429 117089 117488 117718 117355 116741 116367 116409 116815 117471 118178 118723 119008 118987 118578 117908
54653 117908 117453 117571 117993 118141 117927 117833 118238 119110 120357 121901 123273 123712 123017 121932 121314 121247 121297 121349 121734
54634 121734 122648 123842 124912 125604 125826 125584 124966 124067 122887 121465 120045 119032 118707 119014 119524 119673 119169
54617 119169 118277 117522 117064 116543 115631 114502 113548 112872 112313 111827 111546 111570 111976 112936 114483 116165 117262 117478
54599 117478 117208 117019 117083 117260 117514 118000 118763 119535 119925 119800 119400 119062 118855 118624 118383 118451 119072 120097 121238
54580 121238 122446 123723 124686 124714 123632 121989 120561 119802 119788 120343 121060 121472 121460 121309 121251 121232 121360 122170 123942
54561 123942 125892 126629 125557 123464 121606 120601 120358 120596 120997 121131 120772 120293 120372 121222 122432 123591 124776
54544 124776 126201 127702 128838 129397 129608 129909 130637 131858 133340 134754 136031 137381 138816 139819 139792 138775
54528 138775 137427 136268 135233 134027 132587 131077 129712 128808 128760 129645 130979 132153 133013 133796 134538 134911
54512 134911 134722 134269 134039 134111 134109 133716 133057 132486 132064 131465 130426 129126 127951 127038 126259 125576 125081 124707 124242
54493 124242 123754 123697 124387 125592 126789 127553 127614 126928 126054 126080 127667 130282 132769 134544 135789 136675 136993
54476 136993 136627 135863 135133 134846 135500 137389 139973 142062 142967 143159 143527 144401 145585 146922 148240 148993 148539
54459 148539 146881 144805 143157 142181 141573 140998 140506 140484 141140 142036 142347 141683 140438 139185 138043 136913 136050
54442 136050 135972 136898 138550 140393 141782 142057 141003 139246 137849 137399 137705 138249 138643 138691 138508 138632 139568
54425 139568 141062 142217 142490 142246 142130 142238 142240 142029 141901 142204 143090 144501 146108 147344 147781 147517 146961 146330
54407 146330 145551 144650 143925 143633 143755 144162 144879 145961 147213 148246 148879 149306 149790 150299 150575 150544 150521 151000
54389 151000 152390 154828 157986 160931 162571 162618 161964 161760 162147 162270 161509 160222 159157 158572 158301 158290 158610
54372 158610 159085 159398 159645 160347 161742 163366 164555 165197 165750 166594 167606 168404 168811 168995 169292 170018 171368
54355 171368 173341 175749 178398 181190 183887 185865 186470 185731 184397 183048 181468 179173 176248 173182 170099
54340 170099 166815 163565 160979 159069 156948 154010 150923 148920 148391 148705 149176 149621 150052 150373 150525 150556
54324 150556 150472 150303 150298 150730 151514 152331 153103 153996 154965 155689 155979 155796 154835 152725 149898 147686 147070 147621 148158
54305 148158 148118 147744 147189 146184 144721 143400 142780 142739 142805 142866 143156 143709 144245 144649 145210 146170 147224 147763 147611
54286 147611 147283 147399 147968 148446 148436 148156 148177 148898 150294 152016 153559 154490 154685 154354 153772 153078 152377 151946
54268 151946 152056 152607 153118 153148 152693 152174 152108 152763 153931 154975 155279 154827 154298 154438 155376 156631 157761 158728
54250 158728 159570 160014 159767 159092 158656 158693 158657 157962 156751 155599 154722 153979 153462 153467 153828 153890 153406 152946 153060 153489
54230 153489 153642 153462 153292 153153 152801 152364 152299 152660 152935 152699 152020 151157 150379 150154 150938 152466 153711 153904
54212 153904 153310 152715 152480 152424 152358 152343 152554 153164 154121 154809 154266 152207 149613 147894 147534 147977 148599 149257 149901
54193 149901 150272 150161 149594 148655 147474 146479 146223 146783 147660 148441 149177 149927 150421 150584 150960 152102 153663 154654
54175 154654 154589 153893 153168 152561 152042 151852 152217 152892 153462 154018 155064 156638 157989 158418 158084 157564 156878 155557
54157 155557 153699 152260 151957 152366 152571 152335 152067 151870 151299 150129 148780 147809 147393 147500 148115 149031 149700
54140 149700 149646 148892 147862 147000 146598 146699 147052 147406 147937 149045 150636 152021 152786 153302 154033 154782 155104 155107
54122 155107 155232 155450 155332 154830 154372 154199 154171 154349 155094 156382 157558 158132 158420 159043 160076 161096 161832 162396
54104 162396 162915 163276 163316 163055 162684 162394 162281 162373 162689 163179 163627 163825 163964 164602 165964 167435 168130 167873 167295
54085 167295 167018 167237 168016 169390 170970 172057 172604 173652 176347 180694 185650 190226 194202 197966 202030
54070 202030 206538 210933 214158 215475 214955 213020 209893 205900 201935 198976 197144 195748 194214 192474
54056 192474 190510 188154 185529 183159 181400 180198 179595 179962 181381 183231 184867 186474 188786 192127 196145
54041 196145 200327 204357 208006 211151 214054 217319 221410 226369 232009 238144 244506 250709 256484 261862
54027 261862 266976 271789 276116 279802 282731 284743 285776 286099 286202 286388 286548 286444 286107 285814 285687 285489
54011 285489 284898 283899 282764 281668 280436 278707 276256 273139 269571 265776 261901 257984 253967 249782 245499
53996 245499 241386 237730 234587 231703 228764 225668 222537 219491 216544 213728 211217 209224 207813 206889
53982 206889 206285 205833 205368 204811 204275 203978 203982 204023 203677 202778 201646 200843 200587 200460 199795 198319 196413 194784
53964 194784 194019 194309 195307 196246 196541 196461 196935 198506 200743 202919 204937 207159 209529 211515 212979 214576
53948 214576 216993 220146 223436 226544 229708 233331 237615 242569 248158 254427 261485 269338 277751 286427
53934 286427 295390 305000 315450 326347 336847 346031 353057 357213 358199 356448 352977 348809 344503 340228
53920 340228 336217 333104 331711 332386 334667 337764 341300 345377 350079 355379 361491 368704 376555 383650
53906 383650 388747 391797 393538 394416 394336 393236 391322 388825 386009 383304 380944 378510 375413 371817 368459
53891 368459 365418 361689 356233 348974 340576 331837 323703 317146 312294 307951 302714 296520 290614 286014
53877 286014 282494 279061 274972 270182 265264 261029 257950 255764 253750 251425 248804 246076 243383 240856
53863 240856 238488 235875 232508 228487 224593 221434 218886 216698 215244 215136 216178 217230 217186 215782 213425
53848 213425 210689 208222 206699 206381 206698 206602 205469 203563 201671 200432 200005 200095 200191 199965 199617 199684 200395 201342
53830 201342 201994 202355 202817 203486 204063 204413 204854 205669 206683 207559 208226 208741 209006 208979 208950 209196 209533 209665 209909
53811 209909 211049 213406 216497 219729 222957 226269 229704 233452 237860 242850 247702 251906 256001 261032
53797 261032 267272 273915 279956 284964 288945 291964 294115 295602 296660 297499 298363 299389 300354 300780 300448
53782 300448 299647 298829 298148 297417 296320 294566 291954 288451 284164 279249 273909 268412 262920 257360 251768
53767 251768 246744 243176 241279 240218 238956 237219 235380 233653 231884 229999 228204 226613 225047 223340
53753 223340 221615 220096 218818 217712 216846 216430 216586 217120 217514 217215 216144 214911 214325 214596 215186 215488 215451
53736 215451 215413 215545 215770 216073 216580 217257 217772 217878 217861 218447 220172 222792 225420 227328 228569 229701 231005
53719 231005 232285 233486 235047 237319 239911 242065 243520 244544 245200 245251 244947 245230 246715 248862 250720
53704 250720 252202 254036 256588 259386 261976 264610 267772 271446 275273 279160 283246 287342 290880 293554
53690 293554 295693 297804 299949 301791 303112 304004 304528 304476 303629 302080 300115 297917 295613 293526 292050
53675 292050 291227 290790 290650 290896 291163 290532 288562 286086 284436 284078 284565 285554 287010 288372 288519 287117 285396
53658 285396 284974 286187 287969 289045 288845 287622 286203 285392 285157 284627 283316 282050 282082 283530 285388 286980
53642 286980 288560 290358 291870 292541 292635 292922 293783 295035 296456 298072 299953 301986 303907 305528 306921
53627 306921 308361 310070 312137 314748 318156 322152 325862 328644 331082 334510 339504 345385 351313 357209
53613 357209 363321 369461 375159 380309 385249 390336 395594 400593 404548 406934 408108 408977 409896 410416 410307
53598 410307 410203 410733 411588 412034 411973 411834 411677 411112 409998 408616 407149 405541 403874 402413 401240 400205
53582 400205 399207 398201 396931 395077 392618 389832 386998 384392 382355 380963 379817 378558 377400 376688 376154
53567 376154 375223 373908 372762 372036 371546 371338 371749 372771 374072 375731 378117 380856 382812 383522 383910 385004
53551 385004 386626 387962 388896 390011 391606 393400 395079 396567 397893 399270 401187 404023 407678 411928
53537 411928 416907 422816 429339 435889 442382 449292 456998 465563 475137 486040 498193 510809 522980
53524 522980 534531 546186 558986 573505 589524 606380 623649 641475 660287 680416 701949
53513 701949 724732 748418 772768 797990 824440 851931 879766 907701 936315 965991 995993
53502 995993 1025155 1053187 1080567 1107334 1132810 1156649 1179531 1202504 1225995 1249613 1272609
53491 1272609 1294455 1315297 1335975 1357278 1379112 1400669 1421381 1441381 1461011 1480342 1499259
53480 1499259 1517657 1535421 1552544 1569281 1585714 1601041 1613834 1623282 1629799 1634141 1636357 1635917
53468 1635917 1632428 1625765 1615835 1602796 1587424 1570783 1553486 1535555 1516963 1498011 1479104 1460300
53456 1460300 1441058 1420397 1397516 1372538 1346554 1320783 1295775 1271456 1247646 1224282 1201426
53445 1201426 1179387 1158679 1139540 1121740 1105280 1090922 1079422 1070381 1062624 1055774 1050660 1047878
53433 1047878 1046719 1046115 1046059 1047386 1050436 1054769 1060163 1067098 1075979 1086436 1097809 1110031 1123685 1139313
53419 1139313 1156954 1176252 1196772 1218312 1241121 1265811 1292823 1321962 1352605 1384395 1417619
53408 1417619 1452867 1490494 1530460 1572598 1616893 1663555 1712796 1764481 1817998 1872623 1928141
53397 1928141 1985024 2043885 2104770 2167069 2230118 2293750 2358217 2423655 2489682 2555458 2620072
53386 2620072 2682914 2743708 2802251 2858151 2910847 2959894 3005187 3046836 3084756 3118395 3146963
53375 3146963 3170084 3188195 3202124 3212072 3217059 3215498 3206410 3189887 3166356 3135616 3096942 3050242
53363 3050242 2996888 2939180 2879025 2817192 2753709 2688664 2622554 2556112 2490099 2425272 2362358
53352 2362358 2301897 2244073 2188719 2135585 2084630 2035933 1989134 1943070 1896343 1848493 1800505
53341 1800505 1754083 1710559 1670499 1633861 1600145 1568677 1539280 1512552 1489036 1468275 1449261
53330 1449261 1431705 1416150 1402622 1389939 1376784 1362901 1348757 1334549 1320231 1306184 1293053
53319 1293053 1281004 1269745 1259296 1250135 1242478 1235989 1230419 1226038 1223167 1221694 1221413 1222567 1225668
53306 1225668 1230901 1237960 1246417 1256006 1266648 1278470 1291922 1307673 1326138 1347037 1369514 1392942
53294 1392942 1417634 1444574 1474275 1506090 1538820 1571701 1604464 1636635 1667365 1696087 1722856
53283 1722856 1747864 1770926 1791678 1809912 1825353 1837324 1845004 1848031 1846708 1841642 1833314 1821883
53271 1821883 1807288 1789594 1769333 1747330 1724009 1699029 1671792 1642211 1610811 1578234 1544933
53260 1544933 1511256 1477390 1443130 1408044 1372125 1336132 1301020 1267108 1233977 1201167 1168738
53249 1168738 1137097 1106534 1077090 1048706 1021257 994470 968088 942147 916880 892277 868036
53238 868036 844067 820797 798780 778242 759291 742262 727403 714318 702216 690803 680488
53227 680488 671590 663724 656149 648331 639873 630221 618949 606309 593124 579969 566631 552471 537302
53214 537302 521810 507098 493845 481926 470795 460100 449887 440427 431994 424577 417563 409964
53202 409964 401368 392510 384423 377133 369833 362297 355283 349185 343156 336238 328797 322007 316269 311104
53188 311104 306432 302919 300694 298565 295174 290543 285979 282687 280853 279896 279116 278065 276659 275058 273351
53173 273351 271421 269241 267179 265663 264531 263064 260819 258237 256230 255248 254912 254492 253568 252308 251305
53158 251305 251108 251697 252352 252259 251327 250266 249768 249816 249847 249423 248550 247522 246667 246073 245435 244340 242916 241918
53140 241918 241872 242341 242438 241925 241367 241348 242010 243254 244785 245902 245950 245240 244965 245823 247185 247966 247893 247459 247061
53121 247061 246744 246625 246989 247894 248996 249750 249703 248851 247862 247618 248235 248858 248758 248245 248020 248054 247746 246919 245882
53102 245882 244582 242550 239843 237345 235848 235363 235550 236266 237337 238299 238889 239453 240376 241332 241550 240794 239639
53085 239639 238757 238273 237966 237754 237741 237873 237889 237753 237895 238744 240087 241196 241609 241359 240365 238210 235025 232131
53067 232131 230943 231323 231742 231167 230072 229362 229058 228576 227781 227124 226941 227188 227750 228568 229438 230136 230762 231641
53049 231641 232798 233815 234340 234529 234855 235594 236572 237333 237440 236708 235258 233422 231598 230133 229276 229139 229643
53032 229643 230478 231151 231223 230632 229734 228968 228490 228236 228191 228458 229068 229930 230956 232091 233132 233741 233725 233316 233064
53013 233064 233384 234141 234708 234621 234160 233997 234189 233935 232627 230783 229518 229338 229994 231240 233011 234869 236095
52996 236095 236599 237085 237998 238834 238912 238343 237808 237737 238133 238942 240086 241359 242657 244192 246113 248062 249392
52979 249392 249712 249119 248169 247813 248852 251045 253125 254165 254606 255411 256671 257798 258801 260380 262706 264940
52963 264940 266260 266728 266881 267090 267538 268202 268457 267338 264739 261933 260323 259974 259856 259252 258301 257280 256036
52946 256036 254333 252366 250646 249557 249070 248826 248422 247726 246906 246121 245343 244582 244050 243895 243929 243901 243825 243719
52928 243719 243227 242045 240677 240207 241102 242691 244070 245099 246105 246959 247001 245845 243886 241958 240757 240554
52912 240554 241107 241796 242081 241970 241913 242210 242687 243007 243045 242944 242918 243040 243045 242370 240686 238440 236588 235681 235503
52893 235503 235682 236290 237534 239207 240851 242261 243381 243868 243257 241637 239708 238092 236891 236074 235878 236545
52877 236545 237837 239110 239814 239837 239438 238993 238793 238952 239477 240407 241845 243827 246149 248263 249446 249384 248740
52860 248740 248807 250256 252341 253719 253884 253440 253125 253115 253305 253603 253693 252997 251284 248991 246686 244448 241962
52843 241962 238922 235150 230749 226489 223636 222878 223588 224473 224777 224531 223981 223328 222900 222933 223148 222981 222299
52826 222299 221512 221024 220986 221511 222571 223558 223593 222604 221621 221525 221893 221596 220340 218946 218151 217779 217401 217241 217867
52807 217867 219197 220511 221522 222800 224846 227224 229142 230493 231646 232343 231614 228969 225036 220746 216516
52792 216516 212622 209739 208426 208349 208619 208743 208807 208941 209166 209633 210447 211316 211817 211982 212181 212516 212874 213481
52774 213481 214738 216467 217950 218869 219631 220517 221094 220860 219996 219082 218315 217450 216303 215034 213996 213465 213362
52757 213362 213207 212571 211628 210971 210862 211062 211422 212096 212981 213572 213796 214414 216024 218090 219668 220815 222522
52740 222522 225228 228151 230315 231748 233302 235595 238400 241016 243012 244549 245993 247353 248324 248900 249540
52725 249540 250463 251143 250950 250050 249137 248348 247047 244825 242140 239685 237588 235681 234215 233715 234130 234565
52709 234565 234117 232757 231223 230183 229738 229704 230018 230648 231335 231819 232291 233228 234591 235600 235644 235126 234962 235393
52691 235393 235800 235672 235181 234618 233775 232362 230832 230264 231351 233725 236315 238175 238936 238764 238116 237492 237174
52674 237174 237137 237270 237639 238384 239352 240068 240266 240259 240547 241182 241802 242177 242313 242024 240962 239297 237962 237829 238983
52655 238983 241038 243779 247010 250134 252591 254604 256860 259447 261676 262999 263495 263325 262328 260430 257959
52640 257959 255224 252259 249254 246786 245200 244144 243115 242118 241430 241092 241120 241749 242894 243749 243748 243732 245271
52623 245271 248729 252767 255844 257457 257764 256905 255299 253854 253206 253070 252913 252839 253206 253695 253542 252615 251580
52606 251580 251018 250965 251349 252203 253228 253717 253303 252448 251922 252064 252704 253432 253693 252979 251396 249846 249275 249759
52588 249759 250590 251154 251468 251974 253059 254787 256819 258569 259616 259992 259980 259781 259578 259754 260677 262178 263522
52571 263522 264039 263628 262654 261580 260733 260235 259950 259635 259241 258987 259024 259140 258884 257941 256353 254438 252534 250744
52553 250744 248929 247066 245576 245071 245671 246710 247286 247034 246258 245458 244920 244704 244795 245222 246024 247101 248036
52536 248036 248230 247447 246225 245499 245704 246363 246641 246187 245370 244835 245004 245927 247314 248666 249585 250118 250694 251620
52518 251620 252741 253715 254451 255037 255383 255310 255106 255557 257152 259523 261983 264471 267492 271133 274635 277160
52502 277160 278698 279852 280882 281342 280729 279236 277635 276462 275483 274001 271581 268385 264922 261642 258848
52487 258848 256746 255349 254388 253561 252911 252755 253133 253528 253348 252664 252265 252888 254478 256299 257702 258684 259719
52470 259719 261192 263041 264874 266304 267257 267996 268798 269578 270043 270372 271421 273831 277038 279702 281146 281831
52454 281831 282289 282199 280976 278730 276079 273391 270848 268924 267971 267394 266037 263563 260809 258631 257036
52439 257036 255640 254332 253069 251628 250096 249148 249313 250185 250832 250787 250257 249642 249324 249714 250921 252415 253431
52422 253431 253730 253697 253797 254296 255340 256835 258266 259087 259417 260029 261617 264319 267829 271609 275039 277959
52406 277959 281199 286131 293418 302478 312221 321862 330820 338379 343904 347127 347859 345737 340793 334050
52392 334050 326947 320140 313368 306504 300179 295127 291414 288708 286989 286499 287120 288313 289672 291135 292515
52377 292515 293288 293160 292667 292888 294582 297722 301738 305935 309796 313199 316473 320134 324483 329467 334757
52362 334757 339783 343813 346357 347572 348098 348506 348980 349400 349420 348619 347053 345646 345538 346884 348735 350323
52346 350323 351931 354189 357015 359839 362489 365295 368493 372135 376492 381906 388149 394495 400640 407222
52332 407222 415218 425097 436639 449288 462502 476025 490091 505291 522113 540631 560615 581796
52320 581796 604047 627324 651365 675353 698175 719404 739823 760544 781647 802140 821282
52309 821282 839397 857219 874926 892123 908382 923462 937234 949759 961339 972214 982296
52298 982296 991274 998829 1004698 1008851 1011776 1014188 1016135 1016654 1014719 1010271 1003929 995964 986248 975194
52284 975194 964096 954109 945267 936848 928592 921230 915844 912953 912327 913576 916711 922001 929375 938221
52270 938221 947947 958567 970515 983911 998342 1013370 1028928 1044987 1061082 1076549 1091199 1105417
52258 1105417 1119434 1132832 1145065 1156339 1167477 1178831 1189675 1198991 1206581 1213015 1218608 1222906
52246 1222906 1225227 1225277 1223014 1218274 1210864 1200893 1188758 1174955 1160128 1145109 1130531 1116358 1102065
52233 1102065 1087344 1072454 1057916 1044128 1031353 1019752 1009251 999504 990245 981657 974266 968515
52221 968515 964504 962049 960809 960343 960252 960368 960766 961579 962955 965221 968838 973901 979703 985126 989616 993671
52205 993671 998234 1003773 1010004 1016263 1021881 1026341 1029520 1031890 1034181 1036722 1039300 1041754 1044374 1047462
52191 1047462 1050699 1053353 1055166 1056747 1058971 1062113 1065623 1068643 1070665 1071790 1072417 1072642 1071963 1069644 1065410
52176 1065410 1059669 1052995 1045586 1037407 1028748 1020292 1012509 1005243 998131 991331 985565 981423 978832 977300
52162 977300 976491 976452 977395 979432 982455 986176 990287 994679 999379 1004192 1008448 1011231 1011983 1010930 1008971
52147 1008971 1007103 1005787 1004848 1004078 1003849 1004890 1007393 1010700 1014024 1017208 1020570 1024253 1028107 1031993 1035885
52132 1035885 1039887 1044545 1050995 1060244 1072248 1086146 1101443 1118516 1137869 1159424 1182893 1208415
52120 1208415 1236343 1266469 1297870 1329571 1361267 1393294 1425920 1458676 1490464 1520277 1547562
52109 1547562 1571772 1592001 1607677 1619399 1628494 1635641 1640508 1642744 1642576 1640171 1635244 1627861 1619112
52096 1619112 1610318 1601895 1593522 1585015 1576324 1566970 1556359 1544636 1532536 1520247 1507075 1492423
52084 1492423 1476601 1460461 1444756 1430091 1417058 1405969 1396720 1389279 1384144 1382026 1383166 1387167
52072 1387167 1393421 1401517 1411305 1422832 1436215 1451479 1468403 1486504 1505145 1523705 1541752 1559042
52060 1559042 1575324 1590195 1603311 1614661 1624428 1632589 1638875 1643150 1645604 1646421 1645443 1642373 1637238
52047 1637238 1630495 1622568 1613273 1601698 1586831 1568504 1547706 1525761 1503163 1479398 1453968 1427409
52035 1427409 1401139 1376374 1353330 1331455 1310331 1290347 1272454 1257287 1244597 1233611 1223789
52024 1223789 1214993 1207013 1199297 1191271 1182648 1173338 1163386 1153238 1143760 1135540 1128258 1121082 1113620 1106103
52010 1106103 1098619 1090590 1081255 1070370 1058134 1044632 1029668 1013124 995208 976322 956856 937063
51998 937063 916952 896322 875149 853955 833529 814229 795824 778119 761456 746418 733330
51987 733330 722232 713002 705103 697441 689003 679696 670277 661419 653098 644763 635748 625568 614290
51974 614290 602670 591551 581024 570576 560084 550108 541099 532949 525718 520188 517115 516226 516525
51961 516525 517425 519096 521937 526226 532129 539405 547100 554077 559913 564840 568797 571115 571349 569827 567056
51946 567056 563033 557683 551691 546365 542632 540571 540018 541263 544880 551036 559376 569669 582229 597320
51932 597320 614174 630993 646120 659015 669949 678930 685202 687753 686196 681206 674164 666204 657538
51919 657538 647906 637672 627996 619680 612302 604970 597489 590115 582351 572873 560866 546870 532081
51906 532081 517328 503034 489726 478101 468678 461659 457040 454728 454547 456179 459011 462189 465158
51893 465158 468090 471387 474667 476646 476185 473114 467916 461009 452731 443717 434886 427091 420926 416688
51879 416688 414219 412939 412365 412659 414455 418150 423547 430144 437585 445645 453851 461334 467286 471584 474786
51864 474786 477339 478984 479143 477683 474952 471185 466339 460571 454480 448748 443787 439884 437390 436648 437873
51849 437873 441057 445643 450378 453939 455916 456839 457203 456891 455636 453457 450343 446005 440363 433986 427670
51834 427670 421839 416608 412095 408365 405326 403032 401753 401441 401476 401310 401060 401073 401304 401557 401898 402225 401849
51817 401849 400242 397956 395980 394366 392398 390098 388591 388691 389970 391660 393746 396596 400045 403461
51803 403461 406395 408673 410046 410240 409260 407380 404987 402640 400953 400050 399400 398557 397826 397696 397842 397259
51787 397259 395378 392532 389267 385776 382207 379023 376685 375284 374763 375187 376421 377809 378690 379131 379724
51772 379724 380666 381540 382094 382743 384011 385955 388502 392061 397273 404278 412628 421930 432105 442933 453663
51757 453663 463217 470596 475164 476889 476351 474160 470279 464302 456426 447640 438753 429752 420515 411676
51743 411676 404247 398684 394785 392288 390982 390486 390665 392234 396248 402819 410938 419821 429757 441163
51729 441163 453260 464306 473033 479369 483881 487088 489525 491990 495155 498810 501652 502087 499329 493858
51715 493858 486948 479858 473361 467722 462823 458325 453883 449311 444499 439266 433469 427308 421392 416412
51701 416412 412818 410813 410515 411899 414507 417351 419367 420159 420220 420238 420305 420047 419450 419086 419376 420043 420543 420617
51683 420617 419999 418015 414196 409241 404716 401617 399645 398026 396572 395719 395974 397649 400900 405703 411937
51668 411937 419601 428736 439018 449839 461086 473455 487425 502014 514999 524404 529431 530057 526382
51655 526382 518726 508056 495974 484241 474401 467463 463638 462451 463374 466209 470500 474783 476975 475761
51641 475761 471295 464430 455790 445903 435666 425924 416680 407387 397979 389093 381258 374526 369001 364975
51627 364975 362224 359929 357864 357020 358342 361313 364560 367491 370389 373116 374805 375022 374329 373355 372101
51612 372101 370569 369312 368743 368387 367468 365941 364391 363154 362100 361132 360404 360035 360047 360536 361562 362932
51596 362932 364524 366852 370864 376976 384560 392582 400497 408303 415808 422125 425977 426512 423905 419241
51582 419241 413846 408680 404228 400760 398494 397543 397879 399514 402783 408378 416968 428656 442830 458546
51568 458546 474974 491456 507416 522587 537354 552500 568422 584737 600779 616417 632363
51557 632363 649886 670323 694548 722577 753520 785878 817796 847119 871544 889140 898817 900430
51545 900430 894549 882137 864136 841065 813104 780756 745444 709348 674605 642594 613770 588009
51533 588009 565095 544947 527456 512271 498975 487434 477745 469787 463060 457057 451620 446831 442828
51520 442828 439884 438397 438469 439591 440892 441676 441578 440401 438129 435089 431829 428678 425478 421777 417314
51505 417314 412395 407871 404579 402641 401272 399394 396476 392840 389287 386531 384882 384285 384472 385012 385333
51490 385333 385010 384198 383542 383373 383184 382299 380913 379920 379674 379502 378647 377133 375390 373515 371386 369116 366864
51473 366864 364425 361508 358313 355346 352724 350045 346928 343352 339568 335999 333156 331335 330406 330157 330594
51458 330594 331593 332531 332837 332841 333465 335042 336963 338608 340059 341730 343793 346255 349238 352865 357180 362397
51442 362397 368888 376708 385479 395075 405994 418476 431402 442600 450358 454339 455109 453295 449498
51429 449498 444719 440292 437137 435054 432856 429314 424071 417768 411402 405639 400706 396705 393759 391798
51415 391798 390423 389242 388366 388337 389374 390891 392078 392878 394024 396024 398517 400778 402448 403466 403672
51400 403672 402962 401668 400344 399270 398525 398362 399013 400183 401331 402533 404581 408102 412980 418834 425579
51385 425579 433286 441866 451323 462185 475492 492426 513914 540271 571041 605444 643091 683998
51373 683998 727873 773754 820401 866485 910089 948513 979119 1000199 1010913 1010918 1000687 981838
51361 981838 956371 925390 889005 847511 802361 755917 710524 667782 628339 592164 559156
51350 559156 529563 503843 482263 464754 450855 439583 429574 419785 410039 400715 392100 384289
51338 384289 377470 371769 366915 362466 358327 354669 351391 348191 345165 342827 341393 340533 339910 339472 339025
51323 339025 338064 336448 334852 334155 334607 335918 337875 340432 343293 345843 347609 348682 349745 351710 355011
51308 355011 359017 362330 363990 364236 363875 363181 361787 359532 356884 354466 352511 350887 349361 347670 345562
51293 345562 342940 339950 336911 334200 332098 330611 329519 328723 328433 328831 329751 331001 332809 335539 339048
51278 339048 342822 346726 351090 355895 360490 364361 367646 370535 372696 373884 374568 375249 375457 374393 372551
51263 372551 371714 373015 375752 378561 380995 383275 385043 385426 384259 382415 380682 378984 376983 374855 372991
51248 372991 371272 369227 366747 364191 361818 359536 357332 355474 354070 352676 350717 348263 346060 344661
51234 344661 343694 342190 339644 336629 334282 333242 333133 333121 332862 332808 333549 334972 336200 336390 335568 334606 334395
51217 334395 335166 336667 338791 341693 345240 348726 351465 353600 355914 358830 361887 364377 366182 367739
51203 367739 369323 370682 371422 371532 371446 371685 372446 373454 374253 374685 374984 375270 375141 374014 371849 369218 366658
51186 366658 364294 362196 360705 360105 360227 360672 361276 362032 362751 363219 363657 364545 365879 366990 367381 367455 368106
51169 368106 369699 371705 373237 373700 373052 371801 370866 371076 372553 374683 376870 379220 382219 385811 389188
51154 389188 391666 393489 395422 397690 399620 400351 399558 397456 394476 391169 388071 385304 382406 378911 375051
51139 375051 371617 369141 367433 365932 364263 362474 360989 360384 360946 362310 363661 364375 364401 364110 363984 364432
51123 364432 365613 367335 369337 371672 374579 377931 381196 384058 386785 389773 393010 396244 399419 402642
51109 402642 405867 408926 411745 414308 416467 418043 418993 419332 419078 418542 418453 419331 420781 421817 422008 421947 422464
51092 422464 423610 424639 424894 424551 424457 425220 426492 427272 427023 426242 425756 425767 426004 426580 427985 430084 431778
51075 431778 432139 431497 430929 430905 431030 431059 431549 433231 436111 439568 443200 447238 452185 458389 466062 475476
51059 475476 486918 500533 516294 533878 552296 569798 584707 596592 606482 615857 625708 636607
51047 636607 649110 663417 678688 693232 705639 715525 723031 727819 728847 725254 717374 706753 695081
51034 695081 683181 671154 659237 647971 637318 626074 612724 596810 579298 561811 545866
51023 545866 532576 522440 515240 510397 507522 506427 506789 508238 510717 514289 518554 522809 526959 531802
51009 531802 538088 545586 553349 560672 567607 574777 582898 592234 602297 612288 621967 631871 642508 653687
50995 653687 664884 675888 686638 696698 705471 712893 719449 725398 730348 733812 735962 737646 739785
50982 739785 742885 747094 752520 759398 767966 778256 790087 803210 817408 832565 848837 866716
50970 866716 886818 909624 935558 965126 998690 1036221 1077705 1123721 1175118 1231938 1293141
50959 1293141 1357650 1425192 1495774 1568692 1642525 1715834 1787423 1856044 1920355 1979172 2031522
50948 2031522 2076553 2113738 2143079 2164944 2179843 2188653 2192795 2193655 2191837 2187370 2180603 2172403 2163305
50935 2163305 2152821 2139818 2123502 2104042 2082446 2059857 2036718 2012533 1986426 1957834 1926504
50924 1926504 1892041 1853838 1811450 1764838 1714335 1660663 1604849 1547789 1489938 1431818 1374689
50913 1374689 1320143 1268972 1220951 1175951 1134698 1098075 1066056 1037783 1012495 989900 969687
50902 969687 951154 933577 916777 901108 886830 873661 861156 849471 839433 831584 825392 819775
50890 819775 814275 809319 805424 802671 801006 800442 800723 801269 801831 802861 804830 807480 810181 812860 816137
50875 816137 820589 826320 833275 841559 851223 861961 873351 885385 898606 913545 930081 947630
50863 947630 966126 986607 1010493 1038367 1069829 1104483 1142588 1184666 1231065 1282244 1339023
50852 1339023 1402098 1471681 1548074 1632258 1725377 1827819 1939394 2060175 2190470 2329924
50842 2329924 2477319 2631396 2791266 2955703 3122500 3288815 3451703 3607932 3753691
50833 3753691 3885024 3998489 4091308 4161341 4207618 4230904 4233417 4217939 4187342 4144667 4093094
50822 4093094 4035794 3976154 3918173 3866037 3822759 3789150 3764057 3745412 3730940 3718074 3703514
50811 3703514 3683128 3652658 3608999 3550975 3478804 3392900 3293443 3181091 3057580 2925383 2787158
50800 2787158 2645841 2504854 2367540 2236307 2112651 1997940 1893623 1800541 1718492 1646765
50790 1646765 1584926 1532853 1490233 1456303 1429980 1410077 1395488 1385382 1379133 1375920 1374457 1373298
50778 1373298 1371365 1368096 1363239 1356785 1349058 1340560 1331540 1321798 1311000 1299116 1286421 1273040 1258583
50765 1258583 1242400 1224290 1204880 1185093 1165296 1145246 1124896 1104936 1086244 1069023 1052863
50754 1052863 1037610 1023843 1012454 1003968 998365 995324 994514 995751 999075 1004730 1013053 1024400 1039144
50741 1039144 1057729 1080669 1108428 1141178 1178637 1220360 1266274 1316843 1372534 1433213 1498243
50730 1498243 1567096 1639687 1716040 1795701 1877530 1960166 2042863 2125768 2209096 2291933 2372280
50719 2372280 2448399 2519631 2585419 2643891 2692147 2727836 2749883 2757736 2750802 2729135 2694343 2649491
50707 2649491 2598345 2544786 2492396 2443966 2401325 2365684 2337892 2318132 2305672 2299140 2296870 2296744
50695 2296744 2296002 2291695 2281348 2263114 2235567 2197826 2149871 2092406 2026451 1953427 1875718 1796766
50683 1796766 1720192 1648683 1583638 1525620 1474922 1431738 1396034 1367677 1346858 1334206 1330188
50672 1330188 1334384 1345683 1363207 1386595 1415148 1447073 1480152 1513107 1545926 1578744 1610755
50661 1610755 1640353 1666238 1688255 1707282 1724424 1740350 1755364 1769925 1784756 1800354 1816688
50650 1816688 1833649 1851588 1871080 1892301 1915090 1939669 1966941 1997921 2033156 2072818 2117040
50639 2117040 2165869 2219009 2275865 2335734 2397713 2460512 2522617 2582751 2640037 2693770 2743371
50628 2743371 2788748 2830488 2869273 2904908 2935907 2959861 2973979 2975425 2961842 2932306 2888162
50617 2888162 2832927 2771400 2708665 2649404 2597380 2555077 2523610 2502824 2491453 2487603 2489467 2495608
50605 2495608 2504334 2513075 2518862 2519308 2512590 2496542 2468688 2427672 2374206 2310205 2237413 2157358
50593 2157358 2072199 1984818 1898005 1813928 1734212 1659914 1591313 1528133 1470121 1417125 1368747
50582 1368747 1324394 1283816 1247223 1214751 1186135 1161002 1139083 1119971 1103084 1088237 1076074
50571 1076074 1067576 1063171 1062431 1064512 1068638 1074264 1081078 1089126 1098893 1111071 1125997 1143273 1162155
50558 1162155 1182460 1204936 1230520 1259445 1291289 1325662 1362305 1400556 1439323 1477828 1516015
50547 1516015 1554004 1591519 1628145 1663781 1698462 1732022 1764457 1796625 1830180 1866739 1907355
50536 1907355 1952790 2003878 2061426 2125930 2197618 2276761 2363842 2459436 2563926 2677258 2799006
50525 2799006 2928775 3066471 3211888 3363898 3520232 3678292 3836052 3991895 4143606
50516 4143606 4287953 4421405 4540925 4643718 4726623 4786410 4820900 4829407 4812060 4769289 4702322
50505 4702322 4613725 4506852 4384981 4251563 4111245 3969926 3833520 3706889 3593959 3498209
50495 3498209 3422601 3369190 3339013 3332050 3346891 3380534 3428725 3486430 3547826 3606134 3653984
50484 3653984 3684224 3690681 3668776 3616269 3533799 3424548 3293237 3145259 2986418 2822668
50474 2822668 2659426 2500786 2349362 2206833 2074533 1953544 1844394 1746934 1660583 1584619
50464 1584619 1518171 1460135 1409418 1365302 1327430 1295368 1268396 1245751 1226804 1210813 1196810
50453 1196810 1184134 1173069 1164557 1159172 1156475 1155487 1155643 1157163 1160618 1166297 1174011 1183387 1194224 1206539
50439 1206539 1220269 1235005 1249950 1264063 1276252 1285775 1292801 1298580 1304774 1312351 1321168 1330657 1340763
50426 1340763 1352092 1365282 1380558 1397926 1417434 1438944 1461803 1485195 1508961 1533950 1561485
50415 1561485 1592685 1628347 1669164 1715699 1768170 1826462 1890289 1959199 2032522 2109567 2189749
50404 2189749 2272187 2355162 2436381 2513968 2587015 2655011 2716983 2771346 2816362 2850447 2872127
50393 2872127 2880073 2873245 2850958 2812957 2759708 2692683 2614222 2527135 2434574 2340167 2247814 2160986
50381 2160986 2082220 2013306 1955790 1911030 1879827 1862240 1857812 1865648 1884056 1910179 1940305 1970691
50369 1970691 1998139 2019967 2033648 2036572 2026237 2000947 1960786 1907937 1845726 1777105 1704118
50358 1704118 1628590 1552673 1478408 1407186 1340022 1277898 1221245 1169426 1121529 1077658 1038875
50347 1038875 1005864 978321 955701 937812 924386 914733 908315 905247 905761 909494 915556 922873 930090
50334 930090 935633 938390 938132 934958 928898 920606 911870 904500 898850 894218 890574 888937 889955 892944
50320 892944 896659 900376 903918 907329 910993 915529 920982 926388 930570 933156 934488 934916 934628 933992 933546
50305 933546 933722 934848 937241 940922 945393 950106 955091 960766 967198 974008 981058 988870 998221 1009574
50291 1009574 1022972 1038149 1054602 1071802 1089530 1107977 1127495 1148471 1171414 1196769 1224255
50280 1224255 1252303 1278149 1298458 1310052 1310748 1300196 1280183 1253985 1225128 1196428 1169727 1146096
50268 1146096 1126088 1109785 1096724 1085953 1076464 1067640 1059245 1051160 1043482 1036950 1032755 1031549 1032882
50255 1032882 1036052 1041341 1049914 1062513 1078766 1097938 1119896 1145058 1173671 1205398 1239340 1274169
50243 1274169 1308447 1341204 1372191 1401431 1428732 1453895 1477184 1499133 1519877 1538888 1555216
50232 1555216 1567598 1574436 1574196 1566001 1549583 1524808 1491893 1452296 1408769 1363961 1319230 1275164
50220 1275164 1232866 1194051 1159884 1130228 1104096 1080379 1057973 1035607 1012026 986488 959152
50209 959152 931130 904075 879383 857559 838374 821614 807469 796120 787126 779507 772451 765837
50197 765837 760015 755194 751159 747545 744152 740803 736998 732103 726027 719425 713010 706883 700814 694967
50183 694967 689852 685550 681431 676845 671763 666532 661291 655986 650805 646191 642358 639004 635658 632170
50169 632170 628806 625976 624024 623221 623699 625259 627335 629403 631477 634118 637893 642943 649137 656448 664931
50154 664931 674434 684593 695213 706533 719033 732953 747955 763189 777762 791282 803954 816167
50142 816167 828149 840101 852435 865628 880037 896178 915083 937971 965539 998018 1035982
50131 1035982 1080567 1132470 1190864 1253565 1318073 1382280 1444551 1503795 1559717 1612793 1663803
50120 1663803 1713356 1761669 1808451 1852746 1892910 1926836 1952240 1966882 1968856 1957068 1931719
50109 1931719 1894326 1847099 1792112 1731011 1665445 1597570 1529796 1464053 1401412 1342452 1287805
50098 1287805 1238256 1194447 1156486 1123675 1094614 1067797 1042334 1018157 995659 975389 958019
50087 958019 944161 933921 926857 922534 920852 921663 924361 928167 932594 937302 941717 945256 947828 949673
50073 949673 950702 950376 948304 944601 939613 933675 927209 920635 913926 906575 898325 889664 881317 873484
50059 873484 865885 858402 851266 844669 838606 833215 828910 825922 823945 822543 821866 822636 825319 829530 834410
50044 834410 839491 845019 851526 859323 868431 878693 889804 901318 912768 923679 933544 942103 949792
50031 949792 957594 966097 974888 983135 990550 997405 1003809 1009517 1014463 1018927 1023120 1027123 1031421 1036979
50017 1036979 1044498 1053904 1064879 1077555 1092398 1109709 1129511 1151655 1175678 1200793 1226276 1251646
50005 1251646 1276252 1299154 1319856 1338778 1356494 1372895 1387814 1402189 1417591 1434321 1450584
49994 1450584 1463631 1471086 1471047 1461887 1442831 1414538 1378686 1337105 1291530 1243845 1195988 1149602
49982 1149602 1105820 1065103 1027055 990704 955395 921362 889302 859641 832479 807935 786087
49971 786087 766679 749239 733473 719328 706750 695634 685832 676997 668629 660525 653012 646402 640458
49958 640458 634788 629577 625478 622857 621592 621489 622433 624119 626222 628934 632949 638773 646392 655588 666104
49943 666104 677338 688352 698454 707483 715389 721929 726962 730718 733511 735381 736088 735120 731587 724584
49929 724584 713978 700600 685503 669370 652776 636535 621414 607831 596089 586503 578939 572734
49917 572734 567524 563787 561997 561636 561751 562233 563775 566592 569941 573019 575743 578460 581450 584996 589482
49902 589482 595061 601437 608144 614917 621809 629254 638019 648669 660889 673570 685626 696469 705701
49889 705701 712888 717818 720623 721430 720275 717520 713823 709345 703373 695235 685300 674633 663813 652604
49875 652604 640705 628343 616065 604346 593499 583635 574564 566005 558124 551672 547375 545256 544705
49862 544705 545225 546956 550381 555562 561760 567867 573237 578061 583046 588868 595893 604197 613612 623739
49848 623739 634064 644226 654235 664326 674467 684000 691959 697879 702093 705060 706591 706085 703375
49835 703375 698936 693232 686317 678229 669374 660235 650994 641783 633112 625683 619797 615192 611426 608296
49821 608296 605923 604667 604901 606713 609853 614022 619104 625037 631625 638703 646353 654723 663666 672782
49807 672782 681772 690532 698897 706486 712842 717627 720757 722525 723496 723992 723581 721342 716792 710456 703376
49792 703376 696142 688524 679945 670155 659421 648234 636982 625911 615249 605359 596741 589858 584766
49779 584766 580865 577217 573352 569689 566972 565314 564096 562805 561683 561397 562359 564560 567911 572444 578178
49764 578178 584877 592028 599088 605856 612565 619439 626237 632474 638053 643302 648354 652893 656611 659353
49750 659353 660544 659036 654207 646962 638988 631066 622663 613234 603335 594239 586860 581346 577439 574880
49736 574880 573471 572946 572909 573002 573145 573540 574357 575643 577587 580561 584597 589033 593036 596383 599427 602534
49720 602534 605954 610113 615504 622274 630372 640012 651472 664381 677748 690764 702959 713371 720317
49707 720317 722563 720408 715274 708588 701422 694698 688985 684105 679472 674934 670957 667984 665883 664015
49693 664015 661613 658079 653168 646938 639585 631550 623932 618382 616052 616580 618484 620639 623143 626836
49679 626836 632342 639773 649053 660194 673240 688115 704656 722753 742332 762924 783145 800736
49667 800736 813384 819755 820065 815990 810017 804414 800338 797891 797064 798424 802658 809653 818247 826584
49653 826584 832394 833199 827102 813873 795159 773434 750754 728409 707370 688659 673137 660939
49641 660939 651247 642941 635712 630390 627850 627675 628285 628448 628274 628510 629219 629567 628767 626861 624390 621547
49625 621547 617908 613084 607428 601884 597077 592771 588369 583689 578990 574447 570066 566127 563188 561466
49611 561466 560577 560145 560287 561161 562337 563193 563795 564838 566606 568546 570111 571548 573384 575414 576818 577271
49595 577271 577357 577652 577880 577469 576628 576323 577153 578794 580680 582682 584798 586594 587560 587872 588285 589208 590340
49578 590340 591319 592308 593671 595325 596764 597635 598130 598871 600560 603585 607714 612237 616656 621327 627279
49563 627279 635256 644916 655012 664334 672438 679411 685023 688384 688645 685935 681343 676009 670477 664918
49549 664918 659586 654786 650623 647062 644223 642426 641946 642825 644865 647679 650837 654047 657183 660159 662939
49534 662939 665733 668961 672855 677278 682146 687802 694719 703007 712564 723620 736712 752024 769095
49521 769095 787271 806142 825242 843444 858954 870180 876818 880178 882287 884474 886919 889610 893283
49508 893283 898907 906496 915127 924163 933674 943282 951229 955199 953756 946583 933890 916409 895780
49495 895780 874049 852533 831646 811865 794180 779295 766929 756373 747402 740275 735140 731783
49483 731783 729770 728443 727042 725283 723742 723228 723820 724932 726301 728366 731441 734910 737597 738815 738823
49468 738823 738451 738460 739162 740381 741764 743250 745181 747855 751089 754437 757780 761430 765597 769917 773588
49453 773588 775919 776671 776015 774230 771354 767154 761501 754826 748041 741958 736829 732459 728612 725228 722421
49438 722421 720399 719317 719098 719546 720739 723150 727159 732634 739255 747140 756759 768260 781274 795469
49424 795469 810887 827620 845642 865309 887632 913522 942791 974164 1005961 1036116 1061620
49413 1061620 1078785 1084863 1079639 1065554 1046500 1026372 1008014 992833 981172 973119 968937 968689
49401 968689 971748 977018 983739 991915 1001891 1013506 1025737 1037254 1047436 1056742 1065956 1075153 1083611
49388 1083611 1090642 1096042 1099646 1100938 1099482 1095497 1089571 1081938 1072420 1061056 1048503 1035789 1023873
49375 1023873 1013324 1004116 995776 988060 981507 976982 974678 973895 973925 974760 976680 979438 982184 984123 985057
49360 985057 985307 985218 984713 983309 980626 976827 972340 967198 961026 953803 946205 939009 932494 926790 922402
49345 922402 919802 918650 918046 917600 917742 918811 920393 921853 923050 924069 924500 923576 921050 917523 913836
49330 913836 910431 907435 905066 903602 902990 902756 902450 902144 902400 903731 906195 909601 913993 919704 926899
49315 926899 935401 945127 956396 969416 983594 997837 1011601 1025176 1038783 1051815 1063304 1072687
49303 1072687 1079594 1083141 1082146 1076203 1066120 1053208 1038536 1023001 1007589 993153 980173 969098
49291 969098 960686 955574 953561 953665 954871 956566 958272 959409 959513 958493 956451 953388 949221 944053 938306
49276 938306 932558 927310 922914 919681 917919 917731 918836 920795 923470 927055 931527 936296 940599 944069
49262 944069 946651 948228 948704 948411 947965 947673 947441 947415 948399 951526 957840 968307 983723 1004107 1028304
49247 1028304 1054541 1081247 1107015 1129885 1147228 1156735 1157455 1149946 1135684 1116589 1094854 1072642
49235 1072642 1051497 1032032 1014345 998787 986122 976957 971285 968745 969040 971793 976226 981472 987189
49222 987189 993468 1000079 1006316 1011760 1016757 1021829 1026939 1031728 1036243 1040986 1046367 1052485 1059455 1067534
49208 1067534 1076797 1086900 1097274 1107476 1117381 1127213 1137438 1148534 1160806 1174349 1189018 1204335
49196 1204335 1219672 1234702 1249515 1264099 1277923 1290409 1301685 1312507 1323445 1334449 1345203
49185 1345203 1355516 1365408 1375189 1385565 1397170 1409851 1422826 1435900 1450134 1466950 1486817 1509299
49173 1509299 1534201 1562173 1594170 1630787 1672211 1718293 1768250 1820370 1872122 1920268 1960798
49162 1960798 1989427 2003271 2002610 1990901 1972845 1952400 1932362 1914997 1902235 1895117 1893384 1895785
49150 1895785 1900675 1906503 1912294 1917960 1923953 1930402 1936797 1942746 1948823 1956317 1966098 1977928 1990887
49137 1990887 2004277 2018126 2033021 2049449 2067203 2085439 2103455 2121407 2140080 2159960 2180641
49126 2180641 2201195 2220953 2239909 2258525 2277276 2296348 2315710 2335421 2355736 2376856 2398702
49115 2398702 2421109 2444243 2468747 2495612 2526038 2561318 2602671 2651291 2708815 2777688 2860657
49104 2860657 2959538 3074073 3201393 3336087 3471292 3601040 3722639 3836814 3944753 4043919
49094 4043919 4125790 4177626 4188097 4153914 4082658 3988678 3884486 3774704 3657378 3530244
49084 3530244 3395452 3259382 3129536 3011859 2909644 2823542 2752433 2694722 2649009 2613644
49074 2613644 2586277 2564539 2547151 2533848 2524101 2516381 2508963 2501092 2492982 2484786 2476102 2466631 2456941
49061 2456941 2448164 2440941 2434947 2429518 2424451 2419954 2415970 2411990 2407678 2403410 2399889 2397395 2395729 2394838
49047 2394838 2395033 2396387 2398305 2400123 2401997 2404806 2409178 2414998 2421967 2430183 2439878 2450793 2462151 2473126
49033 2473126 2483101 2491642 2498581 2504111 2508518 2511815 2513890 2515031 2515966 2517211 2518594 2519506 2519395 2517947 2515176
49018 2515176 2511746 2509027 2508350 2510022 2513308 2517447 2522490 2528970 2536983 2545942 2555294 2565148 2575999 2587948
49004 2587948 2600406 2612584 2624068 2634866 2645080 2654641 2663228 2670298 2675314 2678127 2679114 2678824 2677517
48991 2677517 2675180 2671843 2667604 2662351 2655763 2647781 2638927 2630007 2621506 2613369 2605316 2597308 2589693 2582958
48977 2582958 2577379 2572952 2569672 2567743 2567322 2568167 2569722 2571595 2573737 2576144 2578616 2580939 2583124 2585222
48963 2585222 2587017 2588143 2588561 2588777 2589452 2590831 2592639 2594569 2596907 2600587 2606537 2614884 2624864 2635677
48949 2635677 2647531 2661780 2679851 2701977 2727120 2754253 2783443 2815386 2850034 2886239 2922917
48938 2922917 2960066 2998306 3037877 3078650 3120939 3165561 3212953 3262681 3314073 3367068 3422226
48927 3422226 3480094 3540645 3603201 3666837 3731039 3796033 3862310 3929882 3998193 4066646 4134871
48916 4134871 4202515 4269213 4334861 4399458 4462512 4523074 4580557 4635156 4687181 4736494 4782965
48905 4782965 4827027 4869166 4909068 4945921 4979499 5010460 5039565 5067038 5092752 5116553 5138198
48894 5138198 5157312 5173640 5187232 5198256 5206733 5212425 5214811 5213094 5206489 5194628 5177630 5155839
48882 5155839 5129621 5099408 5065714 5028982 4989568 4947897 4904500 4859776 4813755 4766107 4716321
48871 4716321 4663898 4608535 4550235 4489248 4425940 4360759 4294306 4227368 4160896 4095915 4033280
48860 4033280 3973360 3916109 3861575 3810287 3762961 3719887 3680804 3645358 3613500 3585389 3561016
48849 3561016 3539941 3521387 3504695 3489871 3477585 3468513 3462771 3460139 3460680 3464755 3472464 3483400 3497081
48836 3497081 3513305 3531934 3552600 3574907 3598804 3624417 3651452 3679032 3706259 3732907 3759434
48825 3759434 3786363 3813774 3841367 3868815 3895895 3922453 3948456 3974059 3999427 4024431 4048747
48814 4048747 4072299 4095451 4118707 4142423 4166786 4191749 4216832 4241312 4264880 4287974 4311309
48803 4311309 4335240 4359710 4384510 4409305 4433748 4457996 4482912 4509302 4536976 4564940 4592428
48792 4592428 4619283 4645351 4670025 4692586 4712635 4730005 4744566 4756370 4765758 4773038 4778100 4780505
48780 4780505 4779843 4775820 4767919 4755069 4735833 4709131 4674933 4634178 4588020 4537279 4482547 4424421
48768 4424421 4363374 4299758 4234265 4168123 4102370 4037120 3971998 3907113 3843079 3780239 3718584
48757 3718584 3658467 3600727 3545878 3493830 3444669 3399040 3357302 3318849 3282881 3249536 3219684
48746 3219684 3193835 3171806 3153329 3138366 3126717 3117866 3111450 3107552 3106231 3106951 3108760 3111090 3114176
48733 3114176 3118555 3124138 3129925 3134748 3138270 3141092 3143962 3147047 3149999 3152470 3154413 3156050 3157635 3159209
48719 3159209 3160530 3161290 3161342 3160595 3158813 3155866 3152135 3148284 3144530 3140481 3135839 3130935 3126339 3122229 3118431
48704 3118431 3114899 3111833 3109425 3107691 3106490 3105591 3104788 3104080 3103605 3103451 3103681 3104556 3106376 3109067 3112359 3116537
$$ [...]
##END NTUPLES=NMR SPECTRUM
##END=
