
##TITLE=AC1405_GUAAH12214_7652929_W1vMAXHEe5
##JCAMPDX= 6.0         $$ Bruker NMR JCAMP-DX V2.0
##DATA TYPE= NMR SPECTRUM
##DATA CLASS= NTUPLES
##ORIGIN= BRUKER
##OWNER= Administrator
$$ 1.72 TOPSPIN		Version 2.1
$$ 2013-03-19 22:53:02.475 -0500  Administrator@X
$$ Compression mode = diff/dup
##.OBSERVE FREQUENCY= 400.02188249412
##.OBSERVE NUCLEUS= ^1H
##.ACQUISITION MODE= SIMULTANEOUS (DQD)
##.ACQUISITION SCHEME= undefined
##.AVERAGES= 64
##.DIGITISER RES= 22
##SPECTROMETER/DATA SYSTEM= spect
##.PULSE SEQUENCE= noesygpps1d.comp
##.SOLVENT NAME= COFFEE_meoh
##.SHIFT REFERENCE= INTERNAL, COFFEE_meoh, 1, 14.96098
##AUDIT TRAIL= $$ (NUMBER, WHEN, WHO, WHERE, PROCESS, VERSION, WHAT)
$$ ##TITLE= Audit trail, TOPSPIN		Version 2.1
$$ ##JCAMPDX= 5.01
$$ ##ORIGIN= Bruker BioSpin GmbH
$$ ##OWNER= Administrator
$$ $$ E:\/data/COFFEE/nmr/AC1405_GUAAH12214_7652929_W1vMAXHEe5/12/pdata/1/auditp.txt
$$ ##AUDIT TRAIL=  $$ (NUMBER, WHEN, WHO, WHERE, PROCESS, VERSION, WHAT)
(   1,<2013-03-19 22:52:56.616 -0500>,<Administrator>,<X>,<go>,<TOPSPIN 2.1>,
      <created by zg
	started at 2013-03-19 22:41:26.677 -0500,
	POWCHK enabled, PULCHK disabled,
       configuration hash MD5:
       86 BA 57 50 F2 9D 5C 9B 26 00 A9 28 5F 66 2E 89
       data hash MD5: 64K
       65 E6 F6 F4 F9 FE 33 92 3F C8 E8 6C 72 68 CF 89>)
(   2,<2013-03-19 22:52:59.725 -0500>,<Administrator>,<X>,<proc1d>,<TOPSPIN 2.1>,
      <Start of raw data processing
       efp LB = 0.3 FT_mod = 6 PKNL = 1 PHC0 = 0 PHC1 = 0 SI = 128K 
       data hash MD5: 128K
       28 1A 40 9F A8 2E B8 CF F9 B3 06 93 15 0C 87 D0>)
(   3,<2013-03-19 22:53:00.772 -0500>,<Administrator>,<X>,<proc1d>,<TOPSPIN 2.1>,
      <pk PHC0 = -75.19592 PHC1 = 0 
       data hash MD5: 128K
       39 72 94 B2 98 B3 66 DD D7 2D 59 C1 12 BD F1 25>)
(   4,<2013-03-19 22:53:01.444 -0500>,<Administrator>,<X>,<proc1d>,<TOPSPIN 2.1>,
      <abs ABSG = 1 
       data hash MD5: 128K
       84 E2 4E C2 DF 64 68 AC 25 89 B8 EA BD 0B 21 BC>)
(   5,<2013-03-19 22:53:01.647 -0500>,<Administrator>,<X>,<proc1d>,<TOPSPIN 2.1>,
      <abs ABSG = 2 
       data hash MD5: 128K
       B5 61 E5 BD 9B 16 F2 3C D0 50 92 57 A0 BF 9F 84>)
(   6,<2013-03-19 22:53:01.803 -0500>,<Administrator>,<X>,<proc1d>,<TOPSPIN 2.1>,
      <abs ABSG = 3 
       data hash MD5: 128K
       E8 11 44 DB 9E 83 16 0B 27 4A 0D 36 DB 45 EB F3>)
(   7,<2013-03-19 22:53:01.960 -0500>,<Administrator>,<X>,<proc1d>,<TOPSPIN 2.1>,
      <abs ABSG = 4 
       data hash MD5: 128K
       7D 3E D4 EA B3 C6 1F EF 0C 81 F6 39 3B 61 DA 4B>)
(   8,<2013-03-19 22:53:02.147 -0500>,<Administrator>,<X>,<proc1d>,<TOPSPIN 2.1>,
      <abs ABSG = 5 
       data hash MD5: 128K
       9E DC 7F 7E A4 19 DB EF 6B 15 C4 C7 5C 48 3C 3C>)
$$ ##END=
$$ 
$$ $$ hash MD5
$$ $$ 55 3A 03 3F 8D 62 C4 73 3E 0B 56 18 3B 58 7F 51
##$RELAX= 
##$RELAX= 
##$RELAX= 
##$RELAX= 
##$RELAX= 
##$RELAX= 
##$RELAX= 
##$RELAX= 
$$ Bruker specific parameters
$$ --------------------------
##$DU= <E:\>
##$EXPNO= 12
$$ [...]
##$TP07= 0
##$TPNAME0= <>
##$TPNAME1= <>
##$TPNAME2= <>
##$TPNAME3= <>
##$TPNAME4= <>
##$TPNAME5= <>
##$TPNAME6= <>
##$TPNAME7= <>
##$TPOAL= (0..7)
0.5 0.5 0.5 0.5 0.5 0.5 0.5 0.5
##$TPOFFS= (0..7)
0 0 0 0 0 0 0 0
##$TUNHIN= 0
##$TUNHOUT= 0
##$TUNXOUT= 0
##$USERA1= <user>
##$USERA2= <user>
##$USERA3= <user>
##$USERA4= <user>
##$USERA5= <user>
##$V9= 5
##$VALIST= <valist>
##$VCLIST= <CCCCCCCCCCCCCCC>
##$VD= 0
##$VDLIST= <DDDDDDDDDDDDDDD>
##$VPLIST= <PPPPPPPPPPPPPPP>
##$VTLIST= <TTTTTTTTTTTTTTT>
##$WBST= 2048
##$WBSW= 25
##$XGAIN= (0..3)
0 0 0 0
##$XL= 0
##$YL= 0
##$YMAX_a= 6162787
##$YMIN_a= -13317778
##$ZGOPTNS= <>
##$ZL1= 120
##$ZL2= 120
##$ZL3= 120
##$ZL4= 120
##$ABSF1= 14.96098
##$ABSF2= -5.597201
##$ABSG= 5
##$ABSL= 3
##$ALPHA= 0
##$AQORDER= 0
##$ASSFAC= 0
##$ASSFACI= 0
##$ASSFACX= 0
##$ASSWID= 0
##$AUNMP= <proc_prof1d_extract.lims>
##$AXLEFT= 0
##$AXNAME= <>
##$AXNUC= <1H>
##$AXRIGHT= 0
##$AXTYPE= 0
##$AXUNIT= <>
##$AZFE= 0.1
##$AZFW= 0.1
##$BCFW= 0
##$BC_mod= 0
##$BYTORDP= 0
##$COROFFS= 0
##$CY= 15
##$DATMOD= 1
##$DC= 0
##$DFILT= <>
##$DTYPP= 0
##$F1P= 0
##$F2P= 0
##$FCOR= 0.5
##$FTSIZE= 131072
##$FT_mod= 6
##$GAMMA= 0
##$GB= 0
##$INTBC= 1
##$INTSCL= 1
##$ISEN= 128
##$LB= 0.3
##$LEV0= 0
##$LPBIN= 0
##$MAXI= 10000
##$MC2= 0
##$MEAN= 0
##$ME_mod= 0
##$MI= 0
##$NCOEF= 0
##$NC_proc= -2
##$NLEV= 6
##$NOISF1= 0
##$NOISF2= 0
##$NSP= 0
##$NTH_PI= 0
##$NZP= 0
##$OFFSET= 14.96098
##$PC= 1
##$PHC0= -75.19592
##$PHC1= 0
##$PH_mod= 1
##$PKNL= yes
##$PPARMOD= 0
##$PPDIAG= 0
##$PPIPTYP= 0
##$PPMPNUM= 2147483647
##$PPRESOL= 1
##$PSCAL= 4
##$PSIGN= 0
##$PYNMP= <proc.py>
##$REVERSE= no
##$SF= 400.020009645557
##$SI= 131072
##$SIGF1= 0
##$SIGF2= 0
##$SINO= 400
##$SIOLD= 131072
##$SPECTYP= <>
##$SREGLST= <1H.CDCl3>
##$SSB= 0
##$STSI= 131072
##$STSR= 0
##$SW_p= 8223.68421052631
##$SYMM= 0
##$S_DEV= 0
##$TDeff= 65536
##$TDoff= 0
##$TI= <>
##$TILT= no
##$TM1= 0
##$TM2= 0
##$TOPLEV= 0
##$USERP1= <user>
##$USERP2= <user>
##$USERP3= <user>
##$USERP4= <user>
##$USERP5= <user>
##$WDW= 1
##$XDIM= 131072
##$YMAX_p= 416387108
##$YMIN_p= -11976
##$CURPLOT= <Network HP LaserJet P1505>
##$CURPRIN= <$Network HP LaserJet P1505>
##$DFORMAT= <normdp>
##$LAYOUT= <+/1D_H.xwp>
##$LFORMAT= <normlp>
##$PFORMAT= <normpl>
##$SURQMSG= 1
$$ End of Bruker specific parameters
$$ ---------------------------------
##NTUPLES= NMR SPECTRUM
##VAR_NAME=  FREQUENCY,     SPECTRUM/REAL,   SPECTRUM/IMAG
##SYMBOL=    X,             R,               I
##VAR_TYPE=  INDEPENDENT,   DEPENDENT,       DEPENDENT
##VAR_FORM=  AFFN,          ASDF,            ASDF
##VAR_DIM=   131072,        131072,          131072
##UNITS=     HZ,            ARBITRARY UNITS, ARBITRARY UNITS
##FACTOR=    0.0627417313425164, 1,          1
##FIRST=     8223.62146879497, 910,          -62419
##LAST=      0,             3265,            -62447
##MIN=       0,             -11976,          0
##MAX=       8223.62146879497, 416387108,    0
$$ Real data points
##PAGE= N=1
##DATA TABLE= (X++(R..R)), XYDATA
$$ [...]
65313 140683 139540 138750 137916 136709 135029 133008 131075 129756 129171 128877 128463 128077 128084 128402 128643 128815 129409
65296 129409 130722 132435 134059 135494 137015 138908 141226 143719 145958 147688 149109 150584 152052 153007
65282 153007 153083 152397 151200 149537 147436 145184 143204 141791 141054 140856 140639 139660 137782 135843 134879 134972 135169
65265 135169 134546 133117 131715 131190 131757 132902 133814 134026 133697 133223 132673 131840 130824 130257 130698 131905 132961
65248 132961 133178 132696 132164 131920 131676 131007 129964 129029 128510 128157 127441 126134 124501 122968 121799 121079 120859
65231 120859 121111 121608 121993 122067 121908 121706 121569 121476 121299 120831 120040 119412 119727 121131 122649 123034 122066 120587
65213 120587 119367 118480 117834 117570 117572 117264 116462 116004 116816 118682 120582 122068 123470 124818 125425 124848 123634
65196 123634 122702 122363 122263 121932 121177 120218 119597 119664 120028 119889 119041 118128 117795 118138 119216 121359 124415 127222
65178 127222 128657 129047 129791 131589 133680 134960 135234 135092 134951 134669 134039 133323 133160 133961 135464 136978 137964
65161 137964 138242 137752 136586 135358 135049 136134 138164 140522 143185 146272 149285 151556 153324 155541 158549
65146 158549 161695 164477 167380 171154 175787 180744 185860 191458 197759 204639 211887 219263 226313 232549
65132 232549 237914 242839 247746 252623 257147 261010 264119 266548 268374 269488 269600 268551 266582 264141
65118 264141 261400 258141 254183 249756 245255 240687 235576 229560 222998 216773 211420 206584 201482 195846
65104 195846 190193 185150 180750 176552 172279 168045 163994 160019 156033 152358 149537 147731 146465 145092
65090 145092 143414 141710 140289 139245 138668 138781 139604 140636 141215 141246 141342 142102 143379 144423 144608 143872 142527
65073 142527 140933 139454 138470 138179 138395 138725 139005 139397 140010 140592 140787 140677 140846 141797 143334 144625 144850
65056 144850 143814 142012 140263 139241 139239 140144 141518 142783 143503 143596 143261 142731 142173 141763 141585 141354 140518 138883
65038 138883 136972 135452 134350 133173 131753 130506 129840 129741 130067 130768 131507 131526 130376 128543 126901 125674
65022 125674 124381 122727 121093 120066 119852 120250 120881 121311 121245 120864 120762 121386 122589 123876 124995 126095
65006 126095 127375 128755 130079 131543 133650 136532 139460 141432 142379 143373 145376 148068 150334 151691 152675
64991 152675 153858 155088 155959 156564 157364 158501 159640 160477 161168 162161 163705 165531 167034 167854 168294 169058
64975 169058 170516 172239 173303 173011 171368 169002 166624 164521 162543 160522 158535 156623 154513 151953
64961 151953 149232 147021 145657 144827 143957 142668 140877 138854 137220 136557 136800 137306 137633 137946 138513 139129
64945 139129 139323 138919 138141 137345 136812 136599 136410 135824 134849 133997 133618 133466 133242 133266 134091 135587 136872 137219
64927 137219 136701 135898 135283 134996 134995 135251 135811 136648 137423 137592 136881 135564 134113 132784 131795 131679 132986 135543
64909 135543 138304 140116 140569 140145 139700 139841 140668 142054 144041 146742 149916 153016 155860 158934 162780
64894 162780 167455 172849 179050 185902 192623 198608 204329 210593 217028 222176 225251 226949 228292 229491
64880 229491 230336 230983 231739 232543 233151 233404 232889 230927 227483 223639 220476 217856 214959 211668 208596 206033
64864 206033 203772 201945 201064 201035 200916 200025 198587 196935 194770 191743 188260 184993 181880 178265 173955
64849 173955 169545 165627 162141 158742 155435 152582 150369 148593 146999 145637 144728 144162 143404 142043 140337
64834 140337 139001 138514 138845 139829 141409 143348 144977 145555 144952 143838 143168 143419 144275 145050 145521 146231 147838
64817 147838 150266 152835 155198 157701 160707 163996 167171 170308 173763 177556 181420 185386 189861 195033
64803 195033 200581 206088 211462 216765 221809 226064 228911 229973 229339 227482 224781 221163 216408 210807
64789 210807 205136 199876 194800 189631 184861 181510 180062 179936 180058 179776 179130 178491 178177 178355 179112 180427
64773 180427 182104 183860 185598 187513 189817 192408 195012 197712 201080 205539 210685 215562 219682 223659
64759 223659 228680 235335 242975 250187 255960 260410 264393 268384 271934 274390 275939 277541 279754 282055
64745 282055 283595 284285 284711 285122 285044 283924 281640 278172 273292 267014 260064 253395 247309 241516 235905
64730 235905 230743 226118 221767 217710 214492 212457 211168 209989 208900 208234 207890 207401 206688 206133 205974 206237
64714 206237 207328 209903 213823 217866 221000 223473 226093 228813 230770 231523 231534 231306 230720 229426 227350
64699 227350 224484 220576 215468 209520 203386 197517 192184 187805 184771 182901 181420 179680 177756 176226
64685 176226 175464 175253 175035 174467 173836 173995 175747 179098 183073 186446 188804 190830 193454 196850 200494 204143
64669 204143 208332 213649 219816 225915 231470 236829 242328 247482 251337 253390 253859 253127 251261 248104 243570
64654 243570 237804 231269 224739 219032 214576 211279 208813 206937 205602 204940 205193 206486 208556 210881 213172
64639 213172 215645 218730 222628 227301 232704 238857 245761 253390 261656 270251 278667 286637 294453 302513
64625 302513 310477 317134 321240 322394 321123 318387 314999 311124 306065 298799 289079 277986 267169 257654
64611 257654 249499 242350 235881 229785 223854 218283 213553 209837 206763 204004 201815 200623 200203 199649 198273
64596 198273 196327 194750 194408 195643 198361 202222 206634 210742 213722 215330 216159 217239 219308 222489 226505
64581 226505 230951 235359 239344 243004 247001 251960 257784 263747 269169 273804 277703 281019 283966 286595
64567 286595 288522 289178 288445 286744 284275 280523 274842 267358 258945 250430 242174 234353 227211 220868 215095
64552 215095 209467 203674 197766 192292 188160 185991 185473 185566 185491 185333 185604 186506 187790 189055 189922 190197 190191
64535 190191 190704 192286 194581 196727 198254 199183 199345 198217 195635 192250 189031 186583 185080 184386 183954
64520 183954 182997 181267 179450 178367 177988 177704 177411 177711 178985 180800 182512 184037 185688 187466 188936
64505 188936 189839 190625 192180 195001 198743 202677 206550 210715 215402 220285 225107 230332 236578 243596 250434
64490 250434 256549 262027 266575 269154 269129 267250 264949 263012 261368 259724 257795 255172 251672 247812 244426
64475 244426 241838 239831 238234 236949 235432 232806 228835 224345 220475 217730 215872 214400 212984 211767
64461 211767 211377 212425 214837 217872 220826 223472 225854 228045 230175 232271 233918 234511 234044 233297 232994
64446 232994 233165 233625 234632 236611 239436 242472 245276 247988 251088 255026 259981 265798 272258 279582 288422
64431 288422 299160 311545 325354 341147 359854 381842 406887 435040 466957 503348 544625
64420 544625 591283 644185 704068 770961 844259 923190 1006956 1094313 1183069 1270038 1351851
64409 1351851 1426173 1492210 1549875 1598553 1636792 1662868 1675213 1672648 1655098 1624366 1583530
64398 1583530 1535039 1479516 1416464 1345613 1267401 1182986 1094630 1005800 920034 839475 764760
64387 764760 696150 634190 579281 531244 489564 453726 423138 397064 374913 356404 341283
64376 341283 329061 319130 310920 303816 297160 290573 284169 278270 273029 268386 264171 260061 255631 250687
64362 250687 245470 240306 235171 229853 224473 219556 215585 212645 210553 209109 208229 207968 208384 209237 209966
64347 209966 210257 210592 211840 214274 217298 220278 223218 226411 229829 233114 235795 237129 236192 232792 228102
64332 228102 223740 220169 216627 212627 208798 205939 203967 202369 201173 200779 201081 201432 201471 201426 201588 201967
64316 201967 202514 203183 203652 203506 202960 202973 204275 206553 208907 210783 212104 212720 212303 210834 208707 206194
64300 206194 203119 199321 195180 191395 188304 185661 183113 180680 178681 177356 176688 176540 176791 177370 178290
64285 178290 179667 181581 183861 186188 188475 190934 193628 196176 198254 200209 202735 205967 209409 212916
64271 212916 217171 222799 229387 235919 241903 247462 252465 256341 258941 260842 262381 262917 261683 259080
64257 259080 256505 254968 254472 254720 255709 257265 258557 258636 257282 254830 251289 246219 239666 232712 226650
64242 226650 221759 217199 212146 206737 201854 198160 195542 193387 191289 189421 188300 188181 188729 189308 189597
64227 189597 189839 190448 191479 192604 193502 194071 194271 193987 193164 191973 190665 189398 188311 187665 187653 188046 188198
64210 188198 187525 185933 183810 181668 179784 178086 176375 174757 173766 173881 174960 176428 178027 179988 182337
64195 182337 184436 185581 185847 185970 186631 188277 191445 196560 203279 210614 218003 225846 234694 244320 254068
64180 254068 263761 273664 283600 292655 299836 304625 306790 306139 302737 297059 289608 280563 270121 259094
64166 259094 248789 240113 232937 226390 219791 213260 207513 203114 199990 197629 195660 194049 192754 191469
64152 191469 189922 188305 187133 186676 186727 187042 187809 189462 192118 195345 198512 201306 203941 206904 210434
64137 210434 214128 217123 218824 219448 219690 219835 219404 217770 214918 211464 208119 205303 203202 201908 201440
64122 201440 201715 202517 203514 204456 205493 207078 209421 212247 215381 219340 224935 232396 241232 250809 260566
64107 260566 269808 278017 285493 293019 300566 306999 311462 314367 316467 317601 317328 316458 316885 319800 324818
64092 324818 330967 337692 344565 350731 355238 357682 358155 356852 353950 349616 343828 336410 327454 317521
64078 317521 307284 297220 287740 279248 271814 265064 258696 252942 248309 245061 243083 241994 241237 240373
64064 240373 239509 239147 239450 240061 240891 242486 245096 247819 249417 249833 250232 251580 253805 256384 259065 261803
64048 261803 264549 267417 270770 274901 279903 285942 293248 301634 310391 319003 327698 336987 346842 356623
64034 356623 365647 373551 380146 385191 388361 389375 388186 385078 380510 374852 368442 361826 355641 350158
64020 350158 345267 341102 338339 337540 338380 339860 341167 342026 342346 341903 340406 337538 332967 326683 319497
64005 319497 312848 307839 304460 301831 299122 296162 293369 291244 289882 288892 287794 286529 285488 285011 285057
63990 285057 285453 286311 287945 290412 293400 296600 300037 303888 308181 312862 318047 323947 330500 337328 344146
63975 344146 351071 358355 365957 373549 380939 388379 396524 406191 417904 431414 445716 459887 473959
63962 473959 488722 504740 521965 540468 561039 584703 611909 642563 676656 714599 757194
63951 757194 805768 862121 927817 1003471 1089239 1185974 1295361 1418816 1556778 1709186 1875803
63940 1875803 2055514 2245801 2443662 2646803 2853349 3060624 3264933 3462471 3649524
63931 3649524 3821531 3972758 4097774 4193220 4258045 4292379 4296556 4270805 4215154 4129546 4014562
63920 4014562 3872342 3706738 3522634 3325275 3120047 2912143 2705883 2504288 2309491
63911 2309491 2123532 1948676 1787013 1639819 1507239 1388505 1282525 1188387 1105400 1032774
63901 1032774 969446 914280 866323 824860 789357 759409 734540 713922 696442 681256 668200
63890 668200 657442 648750 641297 634169 626928 619671 612746 606498 601054 596228 591751 587778 585124 584824
63876 584824 587434 592744 600235 609737 621629 636369 653851 673355 694163 716095 739304 763680
63864 763680 788737 813997 839076 863329 885831 906047 924201 940603 954793 965796 973102 976944
63852 976944 977556 974641 967801 957185 943468 927287 908825 887804 863889 837342 809286 781013
63840 781013 752900 724366 695042 665581 636977 609474 582605 556072 530080 504933 480909
63829 480909 458610 438881 422031 407336 393516 379697 365936 352994 341592 331698 322578 313637
63817 313637 304999 297038 289638 282483 275883 270558 266486 262686 258540 254633 251784 249724 247454 244665
63803 244665 242107 240564 239951 239483 238339 236161 233288 230628 229012 228577 228813 229062 228737 227336 224716 221351
63787 221351 217916 214636 211464 208772 207299 207156 207435 207167 206330 205581 205230 204927 204258 203253 202197 201217
63771 201217 200249 199338 198770 198777 199197 199594 199803 200122 200780 201443 201572 201170 200802 200880 201276 201724 202273 203115 204123
63752 204123 204726 204267 202595 200424 198973 198930 199835 200776 201583 202906 205170 207955 210539 212584 214129 215351
63736 215351 216518 217788 218891 219477 219935 221322 224088 227394 230088 231940 233568 235676 238886 243743 250045
63721 250045 256501 261885 266476 271613 277872 284390 290036 294485 297958 300572 302337 303348 303608 302934 301223
63706 301223 298605 295315 291673 288169 285133 282322 279323 276430 274534 273949 273977 273911 273960 274715 276166 277783
63690 277783 279295 280857 282660 284841 287648 291170 294925 298113 300394 302134 303868 305764 307608 309085
63676 309085 310000 310427 310713 311199 311927 312644 313084 313188 313146 313302 313867 314617 315016 314835 314496 314599 315189 315734 315747
63657 315747 315149 314032 312294 309688 306098 301702 296893 292081 287503 283227 279329 276018 273553 272081
63643 272081 271498 271398 271255 270949 271097 272540 275327 278511 281173 283375 285832 288936 292577 296716 301591
63628 301591 307260 313384 319697 326372 333745 341862 350521 359627 369303 379758 391258 404185 418928
63615 418928 435528 453501 472182 491406 511775 534163 558980 586100 615391 647004 681051
63604 681051 717349 755541 794986 834209 870896 903015 929747 950843 965397 972138 971058 964065
63592 964065 953709 941722 928972 916097 903498 890926 877631 862856 845971 826281 803147
63581 803147 776359 746314 714076 681398 650303 622084 596699 573429 552065 533169 517330
63570 517330 504602 494713 487452 482669 480136 479538 480568 483092 487347 493737 502180 511819 521794 532157
63556 532157 543569 556148 569283 582778 597550 614760 634692 656980 681655 709365 740639
63545 740639 775426 813488 854928 900057 948641 998913 1047056 1087909 1116919 1132022 1134069 1125910
63533 1125910 1111200 1093413 1074966 1056845 1039340 1023102 1009101 997469 986865 975219 960732
63522 960732 942067 918216 888812 854422 816162 775224 733040 691511 652333 616101 582606
63511 582606 551957 524769 501073 479816 459990 441830 426269 413354 401922 390906 380422
63500 380422 371286 363884 357865 352726 348239 344377 341169 338669 336795 335115 333154 331010 329382 328732
63486 328732 328726 328799 329022 329922 331561 333292 334524 335293 335980 336960 338712 341790 346237 351299 356077 360288 364108
63469 364108 367535 370321 372240 372972 371899 368591 363517 357825 352420 347623 343554 340214 337157 333811
63455 333811 330385 327885 326908 326912 327089 327474 328706 331038 334180 337946 342520 348122 354851 362800 372007 382303
63439 382303 393583 406196 420730 437465 456327 477287 500477 525990 554017 585041 619197
63428 619197 655054 689361 718464 740122 754262 762547 767494 771649 777115 785650 798945 818283
63416 818283 843759 874273 908717 946953 989271 1035018 1082119 1127739 1169015 1203285 1228408
63405 1228408 1243410 1248763 1245908 1236583 1222647 1206110 1188821 1171902 1155468 1138857 1121043 1100970
63393 1100970 1077665 1050215 1017822 980178 937984 893044 847711 804136 763758 727056 693536
63382 693536 662294 633049 606622 584077 565503 550028 537050 526864 519850 515567 513193 512581
63370 512581 514260 518515 524987 533303 543576 556093 570896 587876 606973 628075 651035 676101
63358 676101 704029 735369 769797 806486 845117 886093 929692 975256 1021254 1065904 1107599
63347 1107599 1144878 1176239 1200067 1214957 1220361 1217014 1206709 1191623 1173841 1155189 1136918 1119219
63335 1119219 1101257 1082000 1061042 1038388 1013508 984982 951526 913401 872657 831868 792766
63324 792766 756119 722540 692850 667502 646097 627847 612477 600434 592154 587158 583665 578909
63312 578909 570043 555360 535135 511377 486639 462912 441363 422666 407155 394632 384315 375303
63300 375303 367126 359771 353285 347612 342844 339244 336700 334403 331431 327647 323698 320204 317327 315073
63286 315073 313458 312180 310591 308363 305910 303847 302316 301103 300115 299347 298599 297613 296320 294662 292491
63271 292491 290082 288412 288278 289250 290173 290700 291629 293546 295858 297557 298453 299183 300337 302004 303985 306087
63255 306087 308253 310662 313631 317295 321507 326119 331157 336594 342223 347993 354200 361141 368731 376729
63241 376729 385217 394609 405301 417515 431328 446588 462861 479758 497382 516280 536889 559086
63229 559086 582318 606138 630542 655648 681020 705569 728453 749954 771107 792536 814088
63218 814088 835562 857138 878814 900064 920464 940205 959431 977411 992926 1005184 1013813 1018073
63206 1018073 1016768 1009027 994797 974675 949726 921390 891023 859397 827065 795186 765481 739212
63194 739212 716606 697378 681358 668540 658981 652937 650698 652061 656277 662729 671384 682486 696198
63181 696198 712596 731482 751935 772669 793294 814754 837981 862419 886421 908791 929403
63170 929403 948579 966579 983659 999906 1014837 1027546 1037287 1043537 1045553 1042477 1034023 1020573
63158 1020573 1002496 979836 952808 922049 888170 851587 813140 774422 737070 702008 669664
63147 669664 640440 614435 591055 569442 549248 530606 513659 498566 485708 475275 466797 459611
63135 459611 453639 449031 445225 441296 437324 434446 433166 432470 431247 429813 429189 429426 429660 429659 430317 432438
63119 432438 435778 439514 443091 446351 449371 452584 456645 461730 467085 471596 474732 476841 478660 480739
63105 480739 483172 485644 487761 489431 490870 492226 493360 494113 494607 495127 495773 496383 496734 496793 496791 497077 497765
63088 497765 498543 499025 499278 499760 500670 501672 502417 503001 503686 504467 505345 506794 509435 513254 517612 522188 527501
63071 527501 534220 542202 550535 558512 566313 574759 584586 596017 608873 622940 638265 655211 674281
63058 674281 695797 719730 745881 774314 805519 840038 877973 919024 962988 1009992 1060166
63047 1060166 1113220 1168515 1225404 1283417 1342118 1400910 1458982 1515522 1570179 1623385 1676042
63036 1676042 1728805 1781725 1834545 1887004 1938687 1988884 2036926 2082372 2124400 2161059 2189590
63025 2189590 2207638 2213984 2208214 2190229 2160257 2118962 2067279 2006378 1938074 1864997 1789938 1715106
63013 1715106 1642265 1573377 1510515 1454971 1406871 1365958 1332479 1306984 1289547 1279711 1277207 1282150
63001 1282150 1294229 1312189 1334609 1361078 1392078 1427637 1466490 1506661 1546559 1585399 1622979
62990 1622979 1659543 1695683 1731918 1768202 1803932 1838384 1870915 1900705 1926487 1946620 1959435
62979 1959435 1963567 1958150 1942837 1917651 1882842 1838861 1786468 1726857 1661713 1592998 1522454 1451222
62967 1451222 1380116 1310229 1242997 1179573 1120438 1065773 1015865 970890 930579 894434 862070
62956 862070 833016 806411 781436 757995 736554 717294 699767 683297 667269 651040 634144
62945 634144 616834 600027 584470 570191 556808 544012 531607 519510 507996 497662 488857 481359
62933 481359 474759 468822 463301 457855 452513 447869 444307 441295 437967 434283 431092 429052 427980 427288
62919 427288 426609 425793 424629 422883 420499 417637 414611 411807 409479 407575 405899 404441 403315 402383 401205
62904 401205 399528 397596 395809 394193 392417 390261 387871 385596 383725 382439 381815 381741 381880 381927 382026 382753
62888 382753 384526 387037 389420 390949 391477 391304 390917 390848 391403 392332 392977 392941 392418 391763 391070 390438 390324 391228
62870 391228 393110 395411 397496 398830 399006 398042 396500 394816 392669 389564 385926 382945 381265 380455 379915
62855 379915 379663 379913 380538 381420 382811 384837 386981 388573 389523 390146 390552 390727 390918 391333 391663 391458 390897
62838 390897 390549 390452 390085 389280 388479 387914 387205 386069 384848 383931 383169 382350 381837 382132 383017 383809 384447 385766
62820 385766 388477 392257 396061 399177 401758 404434 407578 410989 414299 417634 421736 427265 434042 441127
62806 441127 447627 453311 458526 463804 469624 476305 483858 491997 500476 509437 519340 530554 543134 556961
62792 556961 571951 588083 605455 624471 645834 670164 697644 728191 761870 798958 839759
62781 839759 884794 935127 991972 1055735 1125772 1201237 1281695 1366583 1454630 1544412 1635049
62770 1635049 1725614 1814022 1897274 1972760 2038573 2092579 2132187 2155484 2161990 2151995 2125891 2084640
62758 2084640 2030238 1964999 1890732 1809164 1722697 1634031 1545168 1457324 1371561 1288928 1210139
62747 1210139 1135690 1066184 1002130 943524 890110 841845 798643 759896 724831 693204 665085
62736 665085 640149 617796 597861 580528 565660 552846 541979 533061 525522 518559 512137 506843
62724 506843 502766 499521 497418 497476 499822 503120 506173 509199 513033 517982 524273 532718 543935 557455
62710 557455 572467 589011 607651 628497 651468 677114 706202 738748 774450 813893 858346
62699 858346 908361 963432 1023047 1087235 1156037 1229150 1306137 1386232 1467929 1549528 1630077
62688 1630077 1708903 1784086 1852262 1910218 1955933 1987944 2004747 2005446 1990381 1960592 1917164 1861483
62676 1861483 1795484 1721129 1640128 1554624 1467573 1381742 1298573 1218522 1142131 1070198 1003172
62665 1003172 941074 883981 832203 785961 745159 709293 677407 648426 621843 597789 576161
62654 576161 556166 537234 519952 505367 493482 483153 473393 464086 455324 446827 438385 430385 423413
62641 423413 417595 412661 408395 404624 400974 397144 393499 390967 390078 390323 390720 390799 390693 390393 389469 387751
62625 387751 385800 384287 383203 382154 381226 380901 381229 381701 382101 382878 384438 386599 389044 391884 395441 399840
62609 399840 405141 411508 418886 426885 435332 444628 455177 466857 479478 493449 509437 527655 548014
62596 548014 570775 596454 625174 656655 690747 727494 766706 808014 851191 895793 940488
62585 940488 983342 1022905 1058436 1088934 1112648 1127929 1134187 1131682 1120753 1101631 1074846 1041583
62573 1041583 1003699 963312 921987 880190 837858 795625 755054 717485 683033 651008 620954
62562 620954 592979 567364 544284 523775 505667 489658 475630 463747 454008 445951 438939 432524
62550 432524 426343 420059 413809 408389 404503 401974 400105 398615 397666 397131 396587 396127 396445 397844 399770
62535 399770 401702 403934 406880 410037 412391 413712 414765 416248 418273 421084 425535 432363 441431 452240
62521 452240 464858 479746 496878 515715 536113 558616 583724 611467 642040 676204 714464
62510 714464 756122 799783 844685 890957 938491 986072 1031846 1074316 1112508 1145366 1171357
62499 1171357 1188888 1197158 1196625 1188603 1174310 1154310 1128929 1099148 1066934 1034724 1004564 977557
62487 977557 953860 933215 915729 902215 893656 890409 892056 897973 907734 920927 936902 954939
62475 954939 974528 995263 1016406 1036542 1053658 1065698 1071326 1070310 1063200 1050700 1033360 1011553
62463 1011553 985306 954313 918563 879142 838028 796889 756317 716338 677341 640265 606112
62452 606112 575537 548698 525266 504731 486956 472261 460771 451865 444634 438712 434320 431488
62440 431488 429660 428219 427143 426944 427970 429851 431693 432879 433706 435015 437165 439571 441396 442320 442283
62425 442283 440794 437117 431195 423926 416372 409079 402285 396313 391394 387340 383756 380451 377392 374376
62411 374376 371108 367646 364487 362109 360511 359292 358043 356593 354951 353237 351748 350996 351355 352575 353845
62396 353845 354566 354900 355317 355787 355911 355844 356471 358422 361354 364572 367941 371730 375844 379786 383290 386500
62380 386500 389578 392619 396001 400318 405881 412617 420504 429583 439517 449659 459867 470770 482904
62367 482904 496018 509651 524097 540289 558912 580036 603532 629486 658311 690725 727529
62356 727529 769123 815374 866176 921811 982368 1046976 1114021 1181943 1249344 1314468 1375096
62345 1375096 1428899 1473485 1506423 1526157 1533119 1529357 1516826 1496529 1469239 1436060 1397652 1353633
62333 1353633 1303576 1248485 1190793 1133085 1077206 1024280 974958 929576 888314 851205 817883
62322 817883 787661 760215 735899 714954 696502 678784 660360 640917 621071 601701 583324
62311 583324 565819 548820 532545 517890 505390 494436 484090 474386 466164 459738 454409 449415
62299 449415 444778 440967 438173 436095 434168 431916 429373 427223 426145 426032 426255 426694 427993 430570 433898
62284 433898 437090 439851 442580 445763 449589 453959 458624 463331 468020 472786 477695 482795 488286 494380
62270 494380 501006 508011 515682 524657 535185 546962 559950 574925 592830 613898 637828 664604
62258 664604 694711 728714 767087 810457 859540 914589 975020 1039650 1107269 1176939 1247749
62247 1247749 1318182 1385677 1446909 1498661 1538573 1565436 1579171 1580670 1571304 1552302 1524573 1488922
62235 1488922 1446046 1396232 1339551 1276713 1209578 1140588 1071891 1005107 941539 882181 827648
62224 827648 778405 734952 697495 665500 637860 613559 592104 573398 557412 543951 532614
62213 532614 522975 514758 507663 501140 494669 488391 483056 479164 476493 474699 473938 474579 476662 480165 485442
62198 485442 492814 501872 511751 522034 532877 544353 556273 568730 582171 596700 611725 626506
62186 626506 640670 654047 666451 677900 688664 698754 707680 715066 721235 726794 731796 735730 738255
62173 738255 739594 740278 740902 742252 745303 750846 759310 771186 787523 809698 838533 873711 914100
62160 914100 958571 1006424 1057055 1109334 1161311 1210418 1253949 1289581 1315771 1331885 1338064 1335085
62148 1335085 1324269 1307200 1285100 1258342 1226689 1190066 1149022 1104508 1057531 1009322 961685
62137 961685 916739 876077 840259 809167 782622 760446 742173 727174 715192 706386 700683 697368
62125 697368 695600 695054 695760 697606 700447 704563 710373 717630 725412 733102 740850 748696 755667 760250 761666
62110 761666 760345 757320 753569 749916 746981 744830 742679 739219 733384 724990 714744 703767 693179
62097 693179 684027 677231 673173 671435 671303 672602 675699 680617 686608 692901 699584 707368 716669 727193
62083 727193 738321 749588 760848 772256 784169 796993 811068 826681 844014 863043 883618
62072 883618 905661 929126 953764 979234 1005442 1032445 1059961 1087388 1114524 1141959 1170592
62061 1170592 1201063 1233741 1268792 1305913 1344308 1383045 1421026 1456427 1486839 1510383 1526272
62050 1526272 1534082 1533328 1524418 1509199 1489458 1465165 1435012 1398354 1355739 1308001 1256045 1201457
62038 1201457 1146118 1090973 1036113 982183 930656 882485 837573 796043 758945 726993 699452
62027 699452 675069 653495 635064 619671 606666 595418 585243 575096 564164 552692 541630
62016 541630 531477 521942 512570 503156 493637 484094 474948 466789 459971 454600 450754 448450 447480 447635
62002 447635 448956 451520 455150 459637 464971 470974 476889 481831 485599 488608 491112 492934 493904 494038 493156
61987 493156 490780 486603 480786 473712 465745 457329 448973 440985 433424 426417 420224 414825 409734 404586
61973 404586 399783 396253 394498 394061 393958 393492 392560 391363 390149 389315 389429 390734 392655 394154 394788 395117
61957 395117 395971 397589 399755 402453 405889 409920 413890 417206 419858 422347 425302 429256 434553 441316
61943 441316 449568 459437 471117 484645 499865 516679 535193 555500 577395 600371 623865 647439
61931 647439 670765 693502 715250 735657 754525 771767 787219 800615 811809 820892 827911 832518
61919 832518 834082 832243 827305 820040 811173 801140 790357 779687 770490 764116 761316 762142 766316 773544
61905 773544 783561 796035 810470 826078 841818 856751 870360 882278 891702 897410 898447 894566
61893 894566 885910 872709 855613 835978 815259 794090 772276 749662 726696 704136 682542 662189
61881 662189 643283 626033 610559 596729 584033 571706 559183 546467 534004 522285 511726
61870 511726 502703 495335 489155 483463 478290 474727 473880 475588 478525 481637 485149 490043 496975 506049
61856 506049 517377 531203 547356 565121 584033 604526 627510 653569 682933 715835 752156
61845 752156 790744 829761 867966 905199 941391 975709 1007014 1034683 1058345 1077085 1089639
61834 1089639 1095443 1095050 1089417 1079249 1065364 1049459 1034066 1021508 1012880 1008120 1007048 1010106 1017849
61821 1017849 1029908 1044940 1061635 1079245 1096829 1112464 1123779 1129092 1127611 1118765 1102025 1077513
61809 1077513 1046315 1009938 969737 926968 883071 839600 797934 759091 723627 691582 662640
61798 662640 636477 612940 591882 572994 555858 540120 525573 512181 500032 489208 479603 470936
61786 470936 462943 455575 448981 443215 437986 432848 427774 423382 420297 418346 416748 415051 413418 411954
61772 411954 410408 408835 407895 407898 408053 407389 406123 405335 405407 405617 405286 404532 403789 403331 403609 405206 407992 410831
61754 410831 412693 413659 414421 415254 416018 416737 417452 417775 417283 416293 415547 415143 414405 412949 411216 409707 408338
61737 408338 406951 405931 405756 406239 406832 407504 408715 410535 412389 413862 415257 417041 419132 421146 423092
61722 423092 425384 428187 431174 433992 436738 439858 443730 448355 453268 457764 461393 464288 466915 469537
61708 469537 472034 474044 474997 474135 470996 465980 460193 454608 449611 445254 441450 437825 433854 429446 425019
61693 425019 420812 416554 412109 408014 404937 402895 401326 399672 397551 394776 391674 389075 387421 386169
61679 386169 384570 382754 381440 380822 380444 380040 379759 379574 379187 378524 377696 376491 374663 372773 371902 372247 372805
61662 372805 372705 372133 371547 370854 369902 369110 368827 368597 367838 366906 366716 367505 368670 369724 370782 372122 373787
61645 373787 375684 377673 379599 381583 384118 387499 391349 395182 399193 403820 408627 412374 414363 415031
61631 415031 415016 414234 412206 408844 404530 399791 395223 391365 388214 385167 381859 378882 377189 376933 377300
61616 377300 377498 377479 377649 378211 378963 379525 379609 379122 378052 376175 373035 368452 362956 357367 351893 346042 339593
61599 339593 333239 327892 323648 319870 316100 312378 308696 304768 300580 296699 293651 291271 289007 286607
61585 286607 284100 281285 277809 273862 270347 268089 267043 266454 265625 264365 262797 261026 259109 257295 256028
61570 256028 255527 255429 255094 254337 253528 252882 252046 250775 249644 249456 250047 250376 249946 249559 250312 252297 254727 256984
61552 256984 259024 260867 262251 262889 262856 262618 262761 263642 265125 266742 268243 269833 271683 273353 274096 273768
61536 273768 273104 272958 273529 274466 275517 276759 278280 279947 281595 283215 284761 285920 286334 286080 285636 285217
61520 285217 284396 282687 280341 278151 276424 274585 272082 269352 267438 266694 266334 265418 263953 262733 262245
61505 262245 262120 261725 260954 260184 259661 259299 259077 259319 260366 262117 263967 265134 265052 263699 261654 259669 258089
61488 258089 256853 255986 255678 255724 255460 254673 254162 254800 256321 257668 258431 259250 260758 262756 264610 265980 266964
61471 266964 267955 269466 271634 273784 274981 275186 275353 276167 277281 278122 278814 279764 280799 281323 281108 280394 279469
61454 279469 278664 278540 279512 281332 283351 285180 286706 287679 287892 287681 287663 287951 288199 288516 289705 292296 295771
61437 295771 299105 301748 303829 305680 307561 309671 312046 314445 316553 318334 320095 322202 324854 327960
61423 327960 331102 333693 335444 336710 338202 340234 342391 344015 344893 345332 345734 346343 347325 348707 350112
61408 350112 350920 350921 350506 349913 348629 346047 342596 339589 337831 336830 335553 333523 330983 328408 326183 324539
61392 324539 323480 322882 322750 323130 323757 324128 324098 323999 323972 323597 322559 321318 320717 321114 322214 323527 324641 325329
61374 325329 325785 326566 327935 329452 330506 331055 331508 332123 332960 334139 335671 337200 338414 339595 341265 343401
61358 343401 345482 347263 349039 351196 354001 357756 362671 368609 375388 383280 392641 403069 413505 423167
61344 423167 431810 439086 444503 448289 451612 455460 459780 464098 468487 473366 478708 483951 488551 492213
61330 492213 494738 496077 496479 496268 495447 493695 490772 486810 482324 477971 474164 470834 467714 464848 462586
61315 462586 461067 460118 459796 460657 463207 467371 472766 479228 486757 495154 504052 513134 522095 530602 538631
61300 538631 546579 554628 562036 567507 570262 570468 568642 565068 559972 553893 547545 541384 535471 529707
61286 529707 524071 518565 513047 507211 500849 494164 487834 482661 479110 477154 476446 476624 477474 478903 480839
61271 480839 483206 485991 489174 492542 495673 498249 500384 502549 505215 508613 512728 517383 522491 528419
61257 528419 535870 545071 555169 564808 573305 580880 587757 593600 598044 601318 604002 606470 608827 611039
61243 611039 612729 613114 611685 608904 605852 603174 600697 598011 595002 591725 588115 584129 579957 575907
61229 575907 572148 568795 566224 565055 565660 567633 569952 571811 573295 575096 577610 580522 583310 585878
61215 585878 588431 590993 593398 595738 598446 601753 605220 608026 609716 610596 611423 612738 614479 616211 617749
61200 617749 619559 622467 626891 632403 638156 643864 650357 659064 670847 685299 701096 716878 731762
61187 731762 745184 756543 765190 770811 773827 775339 776477 777723 778915 779884 780810 781770 782242 781431 779029
61172 779029 775332 770706 765371 759692 754187 748947 743376 736888 729671 722382 715152 707331 698318 688328
61158 688328 678065 667818 657218 645973 634592 624183 615619 609039 604002 599841 595941 592096 588785
61145 588785 586731 585874 584970 582473 577669 570727 562001 551865 541191 531373 523552 518021 514440 512351
61131 512351 511322 510935 510951 511517 513062 515970 520276 525593 531419 537681 544962 554015 565146 578213 593106
61116 593106 609853 628238 647662 667504 687512 707818 728783 750807 774063 798327 823100
61105 823100 847794 871730 894241 915049 934264 951639 966101 976530 982818 985573 984993 980759
61093 980759 972990 962514 950061 935971 920808 905369 889628 872504 853235 832355 810805 788859
61081 788859 766685 745281 725752 707901 690588 673529 657770 644179 632262 620929 609908
61070 609908 599911 591631 585028 579525 574650 570423 567265 565579 565432 566577 568652 571289 574145 577005
61056 577005 579878 583024 586920 592110 598955 607491 617638 629369 642421 656019 669409 682758 697133
61043 697133 713407 731558 751157 772104 794598 818843 845154 874032 905679 939540 974725
61032 974725 1010924 1048740 1089097 1132434 1178464 1226684 1277012 1329540 1383545 1437414 1490394
61021 1490394 1544249 1602558 1668526 1744177 1831210 1931340 2045750 2175540 2323012 2491348
61011 2491348 2683020 2900447 3149127 3438824 3781372 4189762 4680755 5275553 5994662
61002 5994662 6852784 7860379 9027892 10365838 11884080 13593943 15497745 17546430
60994 17546430 19586002 21357863 22594170 23157990 23118381 22702060 22175107 21752651 21569045
60985 21569045 21661846 21935628 22149152 21990873 21226927 19818124 17919525 15780008 13631553
60976 13631553 11633760 9871330 8371512 7123273 6096358 5256703 4572821 4015826
60968 4015826 3560146 3185716 2877551 2622731 2409055 2226396 2067690 1928114 1804133
60959 1804133 1693270 1593767 1504084 1423062 1350302 1285786 1229276 1180434 1138948 1103753 1072581
60948 1072581 1043048 1013987 985162 956340 927663 900466 876512 856270 838708 822660 807594
60937 807594 793231 779379 766281 754339 743326 732501 721518 710565 699633 688486 677482
60926 677482 667633 659493 652539 645935 639426 633303 627956 623725 620779 618868 617488 616422 615910 616243 617465
60911 617465 619429 621828 624269 626773 630127 635200 641890 649276 656876 665245 675185 686844 699753 713311
60897 713311 727098 741101 755732 771282 787334 803163 818654 834219 849719 864196 876916
60886 876916 888031 897814 905893 911773 915659 918136 919299 918711 916095 911574 905307 897284 887523 876257
60872 876257 863952 851217 838539 825965 813217 800207 787195 774349 761488 748449 735428
60861 735428 722768 710738 699733 690218 682093 674480 666556 658297 649948 641129 631179 620324 609812
60848 609812 600703 592918 585602 577971 569598 560281 550029 539186 528341 517992 508212 498610 488743
60835 488743 478630 468710 459207 449888 440728 432392 425564 419932 414502 408944 404059 400699 398727 397319
60821 397319 395936 394614 393527 392632 391692 390483 389108 388135 388121 388853 389406 389254 388972 389437 390580 391507 391766
60804 391766 391834 392195 392489 392033 390898 389982 390061 391076 392387 393483 394300 395038 395854 396711 397371 397495 396838 395405
60786 395405 393431 391165 388742 386249 383849 381716 379879 378209 376496 374459 371786 368387 364569 360747
60772 360747 357051 353486 350419 348404 347340 346350 344933 343839 344207 346068 348296 349936 350871 351187 350720
60757 350720 349588 348471 347872 347520 347033 346744 347261 348427 349423 349916 350553 352181 354981 358482 362104 365515
60741 365515 368662 371588 374112 375701 375833 374463 372003 368918 365564 362251 359159 356197 353209 350186
60727 350186 346983 343048 337997 332494 327964 325215 323729 322530 321208 319811 318204 316130 313697 311301
60713 311301 309047 306640 303859 300876 298058 295629 293587 291815 290208 288738 287392 286138 285067 284520
60699 284520 284785 285600 286292 286549 286773 287424 288291 288748 288553 288052 287746 287983 288959 290647 292677 294550 296037
60682 296037 297198 298182 299245 300843 303291 306316 309317 312146 315314 319312 324061 329097 334003 338526
60668 338526 342655 346802 351514 356573 360667 362525 362369 361748 361832 362346 362451 362242 362723 364393 366464 367765
60652 367765 368021 367788 367404 366631 365504 364919 365870 368195 370564 371769 371734 371102 370131 368287 364868 359814 353836
60635 353836 347870 342476 337676 333242 329071 325341 322372 320368 319240 318576 317784 316410 314517 312823 312252
60620 312252 313156 314968 316749 318090 319241 320395 321161 321066 320337 319830 320110 320919 321564 321577 320918 319814 318661
60603 318661 317960 318044 318829 319909 320966 322038 323377 325079 326905 328592 330273 332352 334816 336949 337992
60588 337992 337888 337057 335657 333687 331761 331012 331827 333207 333832 333491 333031 333215 334122 335557 337451 339764
60572 339764 342353 345138 348247 352002 356819 363024 370574 379096 388392 398688 410046 421718 432468
60559 432468 441466 448492 453372 455775 455645 453341 449203 443416 436559 429825 424316 420360 417845 416938 418044
60544 418044 421206 425975 431829 438329 444991 451550 458525 467058 477856 490519 504100 517909 531363
60531 531363 543382 552640 558507 561241 561168 558272 552883 546178 539395 532882 526478 520527 515732 512030
60517 512030 508508 504728 501471 499726 499471 499965 500812 502100 503759 505473 507238 509429 512275 515742 520130
60502 520130 526349 535321 547340 562253 580124 601472 626891 656554 690040 726551 765271 805552
60490 805552 846715 887716 927050 963028 994109 1018916 1035925 1043276 1039267 1023350 996645 961276
60478 961276 919322 872699 823805 775468 729845 687713 649195 614739 584890 559420 537339
60467 537339 517808 500583 485614 472643 461303 451252 442117 433612 425780 418867 412930 407781 403217
60454 403217 399005 394739 390158 385642 381923 379155 376671 373847 370838 368225 366265 364807 363699 362880
60440 362880 362109 360955 359155 356891 354685 353051 352198 351978 352052 352101 351885 351254 350248 349165 348372 348005 347893
60423 347893 347709 347164 346227 345340 345199 346021 347136 347654 347578 347918 349607 352541 355737 358222 359708 360652 361761
60406 361761 363259 364598 365012 364371 363241 362212 361503 361238 361685 363006 365058 367567 370285 372828 374716
60391 374716 375829 376607 377562 378794 380175 381756 383662 385764 387805 389822 392123 394829 397687 400371 402757
60376 402757 404837 406549 407890 409091 410511 412314 414326 416265 418054 419768 421331 422451 422981 423171 423397
60361 423397 423748 424129 424700 425934 428101 430932 433939 437007 440516 444929 450342 456507 463235 470631 478817
60346 478817 487562 496395 505044 513387 520900 526568 529623 530156 528718 525578 520709 514243 506509 497740
60332 497740 488191 478505 469601 462181 456479 452300 449056 446036 443075 440678 439083 437539 435160 432173
60318 432173 429477 427176 424566 421663 419662 419462 420629 422377 424721 427998 431950 436201 441326 448615
60304 448615 458793 471505 486013 501928 519180 537561 556253 573729 588292 598855 604960 606042
60292 606042 601297 590624 575286 557235 538097 519131 501606 486534 474208 464487 457277 452301
60280 452301 448722 445626 442742 440208 437822 435087 431871 428498 425207 421995 418876 415810 412477 408650
60266 408650 404727 401344 398501 395707 393019 391241 390835 391141 391031 390033 388589 387458 387067 387170 387058 386306
60250 386306 385383 385246 386260 387853 389311 390552 391838 393087 393819 393783 393381 393401 394343 395998 397675 398852
60234 398852 399497 399822 399968 400101 400483 401207 402128 403345 405383 408404 411483 413389 414091 414839 416616 419111
60218 419111 421440 423299 425116 427471 430796 435301 440711 446219 451040 455034 458642 462378 466564 471400
60204 471400 476997 483238 489700 495767 500982 505505 510096 515398 521180 526613 531293 535554 539625 542925
60190 542925 544619 544665 543924 543248 542715 541763 539920 537339 534636 532147 529447 525807 521134 516163 511583 507329
60174 507329 502959 498424 494045 489918 485833 481880 478759 477241 477362 478284 478890 478521 477195 475304 473218
60159 473218 471211 469587 468610 468278 468350 468671 469305 470263 471332 472389 473681 475469 477511 479199 480286 481247
60143 481247 482769 485029 487587 489922 491947 494026 496565 499681 503338 507725 513271 520061 527367 534063
60129 534063 539605 544352 548776 552691 555572 557440 558877 560092 560536 559800 558531 557933 558472 559580 560568
60114 560568 561326 562015 562640 563298 564362 565942 567319 567486 566244 564377 562678 561135 559169 556453 553302
60099 553302 550334 547819 545326 542132 538072 533831 530173 527006 523578 519608 515805 513154 512025 512253
60085 512253 513789 516846 521415 526935 532501 537274 540774 543053 544658 546206 547788 548875 548839 547465 544878
60070 544878 541173 536397 530838 524967 518963 512534 505425 497952 490788 484342 478559 473217 468122 463027
60056 463027 457745 452523 448085 445094 443573 442879 442207 441195 440201 439996 441026 443070 445715 448956 452985
60041 452985 457617 462440 467448 472907 478547 483589 487809 491885 496219 500053 502368 503182 503271 502906 501631
60026 501631 499134 495604 491196 485852 479773 473499 467315 461000 454336 447480 440687 434046 427731 422173
60012 422173 417688 414111 411007 408124 405524 403372 401708 400335 398831 396730 393792 390185 386470 383428
59998 383428 381715 381562 382764 384905 387414 389555 390834 391573 392685 394660 397106 399498 401913 404649 407610
59983 407610 410538 413497 416500 419045 420643 421602 422586 423545 423795 423081 421824 420313 418415 416164 413924
59968 413924 411811 409627 407572 406396 406528 407541 408708 409664 410405 411192 412664 415429 419166 422635 424864
59953 424864 425951 426518 426934 427360 427956 428570 428654 428022 427368 427629 428991 430844 432409 433174 433011 432275 431521 430884
59935 430884 429963 428463 426603 424663 422617 420546 418948 418174 417936 417854 418113 419018 420150 420638 420263 419797 420206
59918 420206 421814 424253 426906 429393 431864 434797 438396 442371 446445 450835 455915 461596 467345 472657
59904 472657 477153 480337 481650 480918 478631 475757 473287 471749 470983 470484 470012 469724 469741 469961 470421 471471
59888 471471 473431 476384 480409 485592 491577 497588 503200 508614 513879 518399 521819 524879 528645 533083
59874 533083 537083 539804 541356 542214 542619 542617 542088 540493 537145 532076 526364 521275 517175 513481 509631 505893
59858 505893 503139 501858 501604 501603 501743 502580 504434 507056 510349 514859 521096 528776 537157 545817 554496 562403
59842 562403 568268 571170 571078 568768 565550 562863 561573 561527 561875 561641 559847 555614 548830 540607 532577 525717
59826 525717 520116 515536 511658 507974 504135 500428 497354 494698 491567 487431 482635 477787 473119 468676
59812 468676 464707 461565 459369 457892 456684 455364 453949 452800 452054 451255 449861 447936 445985 444254 442617
59797 442617 441011 439460 437784 435781 433701 432049 430908 429930 429031 428537 428593 428953 429478 430367 431662 432984
59781 432984 433974 434657 435153 435380 435304 435170 435258 435532 435672 435381 434676 434031 434115 435053 436091 436393 436032 435735 435789 435873
59761 435873 435973 436717 438515 440942 443306 445395 447449 449826 452941 457007 461564 465742 469362 473287 478287
59746 478287 483999 489468 494282 498604 502434 505594 508376 511563 515553 519796 523247 525326 526445 527684
59732 527684 529790 532404 534432 535272 535352 535267 534843 533546 531499 529524 528151 527119 525963 524659 523504 522656
59716 522656 521985 521210 520040 518406 516709 515709 515806 516447 516486 515372 513866 513332 514303 515972 517204 517718 518080
59699 518080 518794 519867 521148 522557 523892 524869 525558 526410 527609 528758 529483 530062 531015 532240 532966 532554
59683 532554 531027 528834 526457 524333 522785 521734 520580 518662 515835 512481 508957 505291 501492 497882
59669 497882 494774 491954 488835 485126 480980 476468 471415 466062 461386 458297 456790 456358 456850 458336 460351
59654 460351 462089 463425 465045 467388 470101 472703 475146 477375 478969 479684 479894 479978 479631 478355 476373
59639 476373 474447 472877 471224 469022 466342 463615 461314 459871 459482 459768 459915 459384 458347 457237 456031
59624 456031 454296 451956 449687 448318 447889 447538 446359 444207 441637 439291 437484 436118 434752 432892 430465
59609 430465 428001 426099 424923 424396 424669 425964 428019 430136 431832 433077 433839 433801 432771 431136 429711
59594 429711 429130 429332 429555 429030 427868 427058 427302 428169 428794 429005 429132 429056 428348 427294 426768 426900 426790 425789
59576 425789 424206 422349 419877 416712 413760 411877 410664 409124 407054 404964 403025 401013 399117 397906
59562 397906 397448 397172 396705 396291 396297 396783 397596 398458 398968 398981 399060 400114 402478 405617 408724 411361 413596 415841
59544 415841 418534 421776 425362 429369 434412 440981 448870 457792 468227 481060 496587 514508 534434
59531 534434 555184 573454 584588 585803 578442 566650 554216 543046 533919 527499 524297 524182 526396
59518 526396 529975 534089 538045 541147 542725 542485 540680 537677 533384 527446 520063 512139 504345 496448
59504 496448 487991 479395 471762 465553 460027 454255 448312 443077 439057 435850 432780 429653 426686 424070
59490 424070 421992 420873 421069 422289 423707 424829 425875 427129 428371 429406 430761 433228 436744 440391
59476 440391 443659 447191 451887 457697 463760 469513 475102 480702 485965 490404 493905 496501 497942 498042
59462 498042 497387 497130 497840 499005 499972 500951 502637 505224 508443 512419 517759 524662 532574 540966 549915
59447 549915 559559 569409 578608 586573 593069 597967 601254 603020 603019 600494 594882 586594 576777 566464 556324
59432 556324 547027 539256 533217 528452 524318 520466 516896 513774 511362 509994 510089 512085 516233 522393 530231
59417 530231 539687 551008 564292 579392 596359 615463 636426 658200 680125 702773 726571 749424
59405 749424 766542 773242 767963 752874 732311 710835 691931 677460 667968 663597 664594 670580 679144
59392 679144 685477 684156 672180 650820 624512 597870 573612 552757 535714 522480 512307 504079
59380 504079 497251 492036 488654 486742 485550 484471 483394 482758 483151 484618 486487 488162 489917 492522 496207
59365 496207 500477 504882 509465 514392 519577 524825 530007 535081 540239 546009 552847 560608 568817 577429
59351 577429 586863 597253 608213 619500 631420 644319 658091 672430 687193 702229 717208 731896
59339 731896 746229 759799 771618 780805 787319 791615 793734 793151 789465 782877 773959 763229 751016
59326 751016 737563 723127 708070 692908 678171 664143 650746 637807 625533 614647 605843 599047
59314 599047 593469 588542 584529 581943 580616 579831 579298 579552 581284 584672 589528 595774 603597 613292 625035
59299 625035 638649 653550 668964 683862 696338 703485 702906 694706 681494 666194 650340 634586
59287 634586 619866 607176 596632 587602 579715 573123 567834 563472 559888 557522 556888 557950 560158 562914
59273 562914 565964 569561 574335 580753 588591 597110 605815 614859 624571 634739 644489 652780 658971 663053
59259 663053 665445 666422 665617 662222 655878 647316 637873 628376 618759 608803 598917 589863 581887 574573 567600
59244 567600 561314 556369 553065 551276 550834 551699 553778 556804 560380 564014 567237 569920 572423 575177 578103
59229 578103 580626 582314 583241 583710 583846 583584 582806 581224 578318 573737 567873 561808 556461 551827 547220
59214 547220 542285 537577 534007 531879 530623 529414 527914 526508 526005 526982 529124 531276 532482 532927 533483
59199 533483 534382 534943 534769 534563 535286 536910 538558 539621 540227 540705 541134 541496 541954 542833 544373 546384 548162
59182 548162 549065 549346 550026 551720 553964 556025 557869 559829 561792 563440 565031 567178 569907 572628 575075
59167 575075 577735 581245 585871 591604 598286 605664 613649 622428 631829 640807 648167 653650 657647 660044
59153 660044 660273 658527 655888 652906 648873 642996 635583 627582 619538 611565 603862 596708 590223 584490
59139 584490 579559 575015 570035 564394 559015 554946 552034 549146 545569 541662 538173 535388 533100 531130
59125 531130 529675 529114 529547 530639 532069 534043 537092 541443 546872 553063 559700 566293 572509 578779 585979
59110 585979 594298 602918 611056 618760 626342 633594 640048 645660 650685 655178 659100 662711 666362 669929
59096 669929 672796 674420 674656 673664 671725 669207 666537 664117 662157 660472 658629 656569 654881 653980 653151
59081 653151 651066 647255 642393 636990 630660 623065 614759 606451 598008 588974 579702 571256 564302 558686
59067 558686 553997 549966 546314 542653 538646 534124 529143 524098 519534 515656 512247 509200 506750 504922
59053 504922 503188 501058 498678 496442 494364 492289 490412 489063 488165 487411 486824 486659 486885 487201 487552 488139
59037 488139 488927 489508 489626 489600 490120 491596 493701 495638 497069 498729 501765 506488 512256 518563 525605 533624
59021 533624 542475 552247 563618 576984 591665 606499 620738 633852 645028 653605 659681 663608
59009 663608 665210 664198 661068 656883 652378 647961 644293 642048 641175 641122 641722 643206 645466 648023 650722
58994 650722 653747 656929 659728 661949 663806 665193 665537 664535 662444 659545 655833 651364 646362 640853
58980 640853 634755 628476 622907 618653 615759 614234 614207 615386 617074 619206 622858 629197 638143 648414
58966 648414 658671 668348 677641 687110 697182 707719 718013 727294 735232 741943 747639 752293 755465
58953 755465 756440 754692 750288 743746 735529 725802 714596 702006 688285 674006 660146 647762 637504
58940 637504 629446 623218 618196 613811 610007 607214 605585 604391 602575 599761 596361 592809 589197 585639
58926 585639 582453 579754 577236 574609 572049 569957 568374 566805 564686 562011 559408 557485 556216 555222
58912 555222 554531 554517 555035 555349 555317 556045 558711 563180 568511 574505 581871 590920 601007 611469 622503
58897 622503 634686 648032 661770 674876 686682 697212 707052 716815 726775 737058 747913 759608
58885 759608 772329 786425 802298 819510 836347 850910 862529 871565 878082 881510 881639 879099 874553
58872 874553 867947 858924 847575 834469 820143 804872 788953 773122 758529 746033 735462 725945
58860 725945 717126 709543 703508 698189 692438 686021 679301 672070 663641 654003 644044 634544 625656 617452
58846 617452 610263 604281 599298 595000 591128 587403 583715 580242 576920 572985 567661 561188 554566 548452
58832 548452 542940 538160 534226 530703 527017 523404 520610 518596 516508 514036 511910 510860 510936 512080 514382
58817 514382 517443 520362 522822 525475 528858 532661 536433 540185 543772 546444 547695 548083 548623 549702 550950
58802 550950 551775 551691 550601 549029 547636 546293 544217 541178 537846 534609 530909 526293 521399 517221 513999
58787 513999 511482 509752 508996 508851 508756 508804 509666 511765 514962 518938 523464 528429 533793 539325 544288 547784
58771 547784 549589 550101 549316 546552 541690 535945 530766 526431 522436 518779 515983 514053 512301 510251 508065
58756 508065 506040 504306 503102 502817 503483 504608 505744 507009 508874 511541 514663 517616 520019 521991 523941
58741 523941 526193 528891 532152 536106 540840 546437 552944 560039 566889 572694 577435 581777 586301 591057
58727 591057 595765 600084 603826 607258 611011 615257 619232 622132 624235 626426 628824 630812 632383 634486
58713 634486 637811 642111 646968 652374 658192 663836 668922 673542 677478 679818 679829 677648 673656 667793 659943
58698 659943 650435 639580 627154 612847 596983 580513 564616 550369 538245 527675 517679 508124
58686 508124 499745 492763 486355 479924 474057 469567 466172 462839 459065 455250 452058 449815 448376 447370
58672 447370 446811 447374 449509 452396 454628 456127 458486 463141 470011 478208 487126 496401 505680 514923 524080
58657 524080 532090 537135 538469 537126 534334 530263 524905 519034 513365 507750 502137 497397 494168 491652
58643 491652 488633 485105 481981 479808 478653 478526 478988 479007 478201 477596 478234 479744 481241 482832 485055 487596
58627 487596 489898 492393 495678 499007 501173 502624 505170 509612 515049 520559 526184 532118 538189 544447
58613 544447 551150 557779 563034 566237 568000 569120 569507 568577 566219 563002 559639 556425 553143 549619 546332
58598 546332 543990 542400 540501 537870 535366 533700 532241 530168 528024 527055 527562 528947 530936 533706 537230
58583 537230 541579 547515 555679 565416 575386 584980 594203 602643 609767 615880 621673 627102 631931 636994
58569 636994 643549 651566 660043 668980 679648 692806 707953 724555 742782 762771 784200 806802
58557 806802 830330 853880 876195 896742 915556 932015 944803 953156 957231 957315 953793 947840 940887
58544 940887 933249 924387 914568 904949 895821 886110 874923 862320 848218 831939 813533 794272 775117
58531 775117 755707 735745 716412 699516 685834 675101 667018 661425 657799 655329 653439 651895 650652
58518 650652 649837 649659 650061 650631 650884 650443 649052 646848 644459 642410 640543 638467 636356 634730 633657 632801
58502 632801 632062 631507 630883 629895 628768 627861 626938 625613 624246 623519 623312 622907 622154 621649 621909 623205 625905
58485 625905 630075 635013 640153 646095 653663 662323 670854 679401 689390 701346 714168 726766 739130
58472 739130 751443 763259 773905 782759 788906 791459 790415 786428 779805 770760 760589 751377 744336
58459 744336 739353 736142 734748 734893 735988 737997 741380 746174 752081 759238 767728 776485 783926 789536
58445 789536 793551 795350 793734 788806 782043 774454 766205 758113 751664 747117 743180 739014 735196 732416
58431 732416 730764 730661 732967 737650 743688 750675 759117 768876 778879 788821 799562 811304 822891
58418 822891 833379 842794 850803 856236 858594 858586 856596 852082 845105 836917 828357 819112 809191 799713 791527
58403 791527 784433 778387 774045 771521 770055 769512 770693 773611 777022 780316 784280 789351 794740 800001
58389 800001 805740 811940 817262 820888 823528 825807 827233 827555 827476 827225 826099 824186 822789 822308 821586 820257
58373 820257 819768 820972 822708 823989 825700 828847 833014 837908 844502 853125 862256 870842 880124 891514
58359 891514 904292 917098 930164 944281 958916 973058 986720 1000018 1011917 1021339 1028467 1033735
58347 1033735 1036898 1038313 1039692 1042281 1045653 1049463 1054710 1062022 1070424 1079210 1089254 1101053 1113352
58334 1113352 1125324 1138219 1153119 1168853 1183988 1199060 1214936 1230688 1245122 1258716 1271997
58323 1271997 1283623 1292166 1298339 1303516 1307596 1310314 1313031 1317059 1321665 1325856 1330602 1337224 1345119 1353258
58309 1353258 1362419 1373693 1386278 1399030 1412746 1428673 1446085 1463566 1481341 1500186 1519499
58298 1519499 1538598 1558441 1579828 1601396 1621543 1640772 1659999 1678401 1695349 1712674 1732449
58287 1732449 1754125 1776336 1799739 1825437 1852399 1879179 1906548 1935727 1965755 1995392 2025879
58276 2025879 2058944 2093779 2128795 2164547 2202064 2240327 2278481 2318611 2363046 2410764 2459732
58265 2459732 2510862 2566253 2625438 2686788 2750746 2818116 2887137 2955944 3026068 3099884 3176510
58254 3176510 3253801 3332211 3412841 3494080 3574318 3655773 3741356 3830091 3920032 4013238 4113099
58243 4113099 4219152 4329534 4446223 4572627 4708191 4850774 5002178 5165784 5340807
58234 5340807 5524548 5718247 5925065 6144542 6375058 6619540 6882669 7164805 7465072
58225 7465072 7787815 8139102 8519288 8926302 9364046 9840207 10358231 10919263 11529773
58216 11529773 12199508 12934484 13740408 14630691 15623160 16732386 17974680 19377846 20977291
58207 20977291 22807444 24908387 27337379 30162188 33446314 37251556 41650047 46722805
58199 46722805 52557529 59271152 67039498 76099828 86738011 99287276 114113660 131554838
58191 131554838 151853361 175145187 201475403 230772161 262774971 296897441 331891828
58184 331891828 365326539 393370858 411547078 416387108 406927382 384937784 353880666
58177 353880666 317580253 279426288 242116841 207565567 176854199 150341107 127908942
58170 127908942 109187214 93679950 80858160 70241639 61428292 54075533 47892011
58163 47892011 42650839 38183753 34352969 31040004 28155917 25638563 23432959 21485271
58155 21485271 19754030 18211197 16829846 15582262 14449929 13423294 12490930 11639215
58147 11639215 10861919 10158926 9524876 8948631 8423697 7949424 7521642 7131393 6773312
58138 6773312 6446377 6145691 5861942 5590051 5331006 5084737 4848654 4623743 4414634
58129 4414634 4222230 4042536 3873397 3716228 3570597 3433356 3303830 3183968 3072682
58120 3072682 2965760 2862065 2764375 2673451 2586663 2503097 2424716 2351672 2281494 2213719 2150503
58109 2150503 2091922 2035328 1980018 1927899 1878922 1830574 1782661 1737966 1697171 1657471 1617206
58098 1617206 1577667 1539372 1500810 1462057 1425634 1392418 1360267 1327872 1296527 1267035 1238373
58087 1238373 1210644 1186043 1165577 1147623 1130736 1115114 1100489 1085338 1069017 1052074 1034033
58076 1034033 1013561 991308 969697 949470 929259 908909 890138 873364 856947 840290 824734
58065 824734 810720 796968 783226 770979 760630 750752 740864 732128 724522 716134 706192 696092 686555
58052 686555 676449 665467 655276 646885 639261 631569 624376 617653 610094 601595 594084 588703 584254
58039 584254 579489 574722 570066 564313 556946 549411 543118 537785 532690 527818 522790 516420 508359 499676
58025 499676 491032 481878 472140 462953 454940 447435 440203 434239 430105 427026 424338 422272 420673 418546
58011 418546 415512 412209 408845 404944 400908 398065 396686 395673 394583 394104 394181 393642 392140 390504 388774
57996 388774 385999 382454 379790 378292 376275 372931 369505 366742 363559 359403 355637 353285 351494 349592
57982 349592 348565 348956 349187 347596 344629 341519 338363 334915 331756 329178 326206 322147 317914 314689 312464
57967 312464 310952 310498 310996 311383 311374 312229 314592 317081 318327 318985 320303 321998 323008 323175 322822 321755 319963
57950 319963 318268 317109 315753 313821 312390 312440 313403 314409 315786 318153 321330 325386 331445 340062 349945
57935 349945 359611 369139 379052 388753 397545 405984 414638 422581 428678 433370 437605 440929 442174 441190
57921 441190 438409 433572 426427 417877 408914 399222 388343 377356 367711 359122 350312 341328 333434 327169
57907 327169 322053 317882 314838 312633 310822 309565 308809 307278 303747 298918 294666 291758 289605 287755
57893 287755 286220 284739 283147 282262 283032 285060 287201 289240 291693 294352 296516 298453 301148 304704 308273
57878 308273 311391 314067 315721 315542 313825 311608 308987 305213 300547 296497 293919 292149 290406 288880
57864 288880 287886 286924 285202 282507 279271 276239 274215 273613 274220 275736 278271 281745 285255 287899 289915
57849 289915 292119 294512 296395 297629 298713 299740 300245 300012 299041 296926 293341 289017 285082 281424 276945
57834 276945 271552 266620 263115 260449 257742 255225 253693 253339 253755 254609 255743 257027 258547 260653 263475
57819 263475 266667 269860 273138 276852 281177 285955 290758 294976 297962 299149 298049 294413 288587 281477
57805 281477 273985 266685 260083 254635 250283 246460 242952 240198 238393 236950 235357 233963 233313 233304 233602
57790 233602 234172 234715 234364 232859 231352 230935 231066 230632 230052 230827 233245 236053 238453 241102 244815 249509
57774 249509 254740 260244 265503 269670 272458 274446 276058 276780 275739 272696 268179 262939 257328 251016
57760 251016 243496 235106 227141 220456 214414 208008 201590 196613 193953 193475 194925 198076 201998 205457
57746 205457 208313 211502 215370 218986 221506 223216 224679 225666 225629 224726 223705 223030 222564 221944 220931 219537
57730 219537 218003 216611 215432 214308 213021 211488 210012 209376 210171 211859 213056 213136 212910 213214 213579 213017
57714 213017 211465 209494 207197 204402 201560 199255 197158 194609 191894 189758 187929 185473 182493 180030
57700 180030 178240 176124 173303 170690 169035 168086 167608 167915 168786 169100 168298 167259 166972 167215 167285 167238 167614
57683 167614 168516 169654 170872 172183 173795 176402 180833 187086 194438 202915 213850 228465 246735 268247
57669 268247 293461 323301 358071 397497 441346 489069 538703 586185 625414 649170 651587 631354
57657 631354 592796 543386 490151 438012 390077 348043 312318 282550 258258 238810 223217
57646 223217 210515 200254 192299 186343 181903 178531 175807 173418 171456 170252 169651 168921 167741 166770
57632 166770 166763 167529 168273 168643 168895 169181 169206 168570 167143 165151 163061 161286 159822 158359 156755 155102 153305
57615 153305 151045 148297 145470 142838 140319 138020 136459 135864 135670 135171 134330 133599 133214 133071 133034 133045 133057
57598 133057 133164 133586 134330 135031 135283 134933 133962 132424 130618 129027 127889 126963 125748 123723 120571 116655
57582 116655 113166 111173 110495 110088 109547 109464 110166 110928 110791 109534 107548 105403 103807 103256 103295 102763 101172
57565 101172 99245 97722 96497 95369 94788 95016 95282 94713 93704 93486 94608 96631 99023 101539 103879
57550 103879 105748 107287 108871 110502 111832 112655 112948 112562 111424 109944 108746 108040 107572 107138 106789 106665
57534 106665 106885 107449 108002 107957 107167 106216 105676 105403 104922 104217 103628 103206 102738 102310 102386 103272 104805 106532 108016
57515 108016 109013 109573 109892 110035 110090 110538 111937 114026 115662 116046 115600 115280 115480 115938 116242 115936 114616 112453
57497 112453 110210 108210 105756 102218 98272 95261 93578 92460 91246 90038 89169 88757 88898 89657 90609
57482 90609 90909 90106 88650 87427 86963 87102 87330 87377 87491 87963 88477 88366 87602 86920 86686 86274 85072 83500
57464 83500 82263 81089 79161 76629 74742 74326 74832 75141 74752 73976 73353 73135 73166 73136 73052 73325 74175 75155
57446 75155 75596 75402 75077 75065 75360 75642 75547 74967 74356 74478 75552 76858 77532 77484 77174 76785 76138 75230 74300
57427 74300 73479 72795 72460 72734 73518 74368 74815 74473 73200 71504 70497 70911 72296 73508 73836 73389 72725
57410 72725 72483 73083 74305 75398 75951 76325 76962 77780 78677 79918 81367 82026 81283 80119 79958 80617 80583 79219
57392 79219 77583 76919 77347 78247 79054 79393 79217 79079 79657 80850 82008 83125 84957 87686 90288 91663
57376 91663 91831 91578 91449 91477 91470 91184 90429 89227 87736 86017 84269 83119 83111 83867 84317 83879 82891 81873 80942
57357 80942 80136 79713 79866 80548 81646 82910 83722 83580 82908 82798 83798 85449 87083 88411 89259 89505 89495
57340 89495 89844 90530 90821 90396 89854 89765 89896 89797 89525 89284 88876 88075 87160 86603 86493 86598 86683 86474 85750 84756
57320 84756 84106 83969 83794 83156 82362 81833 81393 80672 79783 79025 78303 77393 76571 76417 77072 78049 78678 78496 77409
57301 77409 75802 74334 73363 72748 72318 72214 72508 72870 72950 72832 72822 73080 73702 74800 76196 77372 78135 78986
57283 78986 80481 82509 84606 86713 89121 91839 94508 96889 99119 101514 104318 107512 110636 113029
57269 113029 114508 115671 117295 119543 121953 123976 125340 126116 126630 127198 127816 128311 128765 129325 129556 128618
57253 128618 126460 124243 123058 122692 122239 121510 121136 121505 122357 123421 124808 126640 128731 130793 132661 134232
57237 134232 135446 136311 136818 136892 136619 136354 136329 136339 136154 136128 136962 138813 141004 142667 143483 143789 144178 145103 146643
57218 146643 148526 150329 151703 152458 152598 152317 151867 151426 151206 151496 152333 153255 153796 154131 154733 155459 155675 155415
57200 155415 155618 156849 158520 159968 161608 164249 167733 171086 173842 176415 179218 182141 184954 187641
57186 187641 190229 192735 195330 198210 201270 204226 206947 209338 211043 211742 211745 211815 212409 213468 214970 217312
57170 217312 221106 226978 235589 247536 263151 282491 305364 331056 358227 385546 412406 438707
57158 438707 464146 488278 511167 533387 555248 576591 597517 618820 641409 665595 691155
57147 691155 717742 745018 772629 800332 828044 855691 883205 910738 938676 967331 996781
57136 996781 1027093 1058490 1091215 1125380 1161048 1198395 1237750 1279540 1324091 1371386 1421208
57125 1421208 1473762 1529957 1590733 1656304 1726552 1802082 1884268 1974120 2071639 2176646 2289877
57114 2289877 2412905 2547352 2694640 2856493 3035353 3234324 3457104 3708173 3992952
57105 3992952 4317537 4688331 5112317 5598297 6158408 6808630 7568051 8457975 9501953
57096 9501953 10726378 12160559 13836027 15785448 18040941 20631028 23576292 26885017
57088 26885017 30550329 34549878 38848015 43397738 48136998 52976266 57783330 62379492
57080 62379492 66557930 70119754 72909372 74830998 75842150 75934914 75120168 73423507
57072 73423507 70891769 67603050 63672540 59249662 54506388 49620400 44758186 40061942
57064 40061942 35641733 31572823 27897364 24629218 21760260 19266859 17115778 15269100
57056 15269100 13687753 12333672 11171035 10167038 9292457 8522272 7836509 7220686 6665061
57047 6665061 6162859 5708646 5297668 4925835 4589811 4286937 4014769 3770307 3549721
57038 3549721 3349281 3166644 3000966 2851987 2719583 2604002 2505446 2423129 2355546 2302020
57028 2302020 2263191 2239806 2232186 2240850 2264704 2295556 2315260 2302220 2243676 2142430 2012588
57017 2012588 1870457 1729042 1597323 1480580 1380340 1295320 1223364 1162521 1110795 1065944
57007 1065944 1026031 989861 956773 926328 898351 872990 850400 830286 811838 794188 777001
56996 777001 760550 745101 730372 715921 701993 689592 679601 672155 666919 663582 661842 661426 662559
56983 662559 666072 672362 680112 686433 688507 685019 676138 662603 645221 625121 603874 582988 563321
56970 563321 545264 529410 516623 507280 500903 496891 495263 496232 499364 503939 510195 519451 532617
56957 532617 548982 566758 584261 599988 611856 617221 614114 602444 584037 561661 537940 514726
56945 514726 493082 473635 456898 443268 432871 425579 421305 420279 422960 429627 440057 453707
56933 453707 470179 489405 511326 535452 560564 584409 603567 614178 613612 601753 580661 553169
56921 553169 521976 489700 458873 431323 407595 387187 369351 353681 340173 328915 319786 312390
56909 312390 306245 300940 296131 291647 287692 284713 282843 281616 280483 279437 278858 278897 279439 280629 283050
56894 283050 287186 292991 300136 308534 318516 330539 344760 360839 378151 396092 413962 430528
56882 430528 443976 452580 455372 452294 444148 432628 419900 407607 396351 386306 377996 372191 369484
56869 369484 370433 375709 385527 399283 416399 437287 462860 493296 527984 566396 608072 651542
56857 651542 693866 731194 759225 773667 771822 754541 726089 691718 655647 621055 590545 565758
56845 565758 547149 534857 529448 531495 541030 557968 582586 615071 655002 701867 755667 816392
56833 816392 882927 952670 1021527 1083497 1130659 1155000 1151526 1120455 1067024 999391 926035 853838
56821 853838 787465 729644 681494 642843 613039 591908 579743 576427 581161 593303 612901 640006
56809 640006 673908 713458 757622 805037 853038 897294 932143 951379 949965 926519 884575 830914
56797 830914 772250 713233 656774 605188 560493 523901 495369 473799 457849 446735 440436 439344
56785 439344 443889 454252 469970 489769 512188 536272 561135 584745 603741 614703 615267 604246
56773 604246 581809 550164 513216 474722 436957 401411 369857 343704 322724 305407 290585
56762 290585 278082 267894 259465 251912 244570 237314 230619 225110 220703 216488 211833 207203 203373 200258
56748 200258 197265 194405 192190 190557 188911 187278 186438 186542 186494 185263 183231 181584 180771 180285 179813 179861
56732 179861 180914 182440 183236 182790 181868 181550 182008 182576 182766 182679 182512 182347 182555 183666 185459 186839 187119
56715 187119 186946 187342 188345 189268 189995 191117 192861 194618 195660 195802 195244 194303 193456 193266 194005 195474 197194
56698 197194 198664 199526 199756 199646 199491 199354 199173 198820 197981 196418 194535 193193 192625 192045 190799 189408 188852
56681 188852 189226 189751 189840 189522 188999 188413 187924 187488 186827 186043 185844 186518 187172 186869 186158 186412 187841 189298
56663 189298 190127 190999 192592 194472 195913 197052 198579 200724 203080 205154 206695 207746 208666 209927 211764
56648 211764 214075 216614 219023 220851 221968 222827 223848 224720 224922 224786 225234 226428 227497 227776 227566 227328
56632 227328 226927 226151 225404 225280 225770 226311 226396 225845 224691 223158 221538 219917 218152 216191 214158 212054
56616 212054 209725 207252 205040 203398 202247 201347 200537 199748 199054 198739 199003 199580 199910 199666 198871 197676 196378
56599 196378 195439 195028 194667 193907 193160 193250 194251 195444 196396 197289 198164 198650 198684 198775 199305 200077 200785 201413 202060
56580 202060 202871 204210 206318 208745 210741 212158 213287 213953 213781 213393 214140 216318 218707 220385 221953
56565 221953 224271 227020 229383 231418 233863 237133 241304 246648 253411 261312 269814 278467 286511 292694
56551 292694 296188 297338 296982 295547 293351 291205 289792 288779 287334 285288 283139 281164 279212 277188
56537 277188 275063 272596 269659 266681 264209 262180 260179 258213 256677 255719 255199 255130 255647 256645 257973 259752
56521 259752 261971 263925 264636 263789 261779 259065 256048 253360 251501 250110 248263 245699 243264 241929 241700
56506 241700 241612 240576 238200 235101 232466 231086 230727 230596 230288 230077 230372 231180 232128 232880 233480 234256 235256
56489 235256 235939 235750 234945 234343 234213 233987 233242 232310 231606 231051 230598 230662 231422 232208 232264 231714 231191 230972 231114
56470 231114 231935 233564 235312 236358 236858 237602 238713 239568 239920 240248 240862 241437 241637 241648 241831 242244 242627 242532
56452 242532 241536 239719 237850 236648 235948 235095 234077 233687 234512 236268 238253 239966 241212 241995 242530 243095
56436 243095 243788 244568 245486 246615 247873 249163 250568 252157 253711 254919 255704 256116 256140 255869 255624 255633 255844
56419 255844 256259 257011 257868 258294 258455 259507 262104 265126 266807 266782 266141 265718 265345 264736 264051 263394 262544 261439
56401 261439 260344 259434 258777 258698 259527 260937 262160 262903 263472 264083 264758 265907 268126 271252 274318 276701
56385 276701 278701 280856 283338 286188 289472 292915 296041 298931 302299 306519 311104 315322 318749 320981
56371 320981 321409 319753 316410 312019 307049 302059 297828 294839 292892 291458 290159 288830 287544 286736 286867
56356 286867 287779 288716 289083 288840 288122 287114 286392 286789 288554 291147 294126 297649 301710 305372 307435 307712
56340 307712 307167 306865 307143 307759 308492 309388 310520 311724 312753 313672 314863 316567 318706 321245 324275 327449
56324 327449 329904 331360 332908 335927 340357 344707 347657 348998 349140 348571 347925 347825 348400 349321 350357 351437
56308 351437 352351 352947 353525 354382 355204 355654 356358 358313 361367 364381 367008 370144 374353 378955 383128 386903
56292 386903 390454 393382 395460 397312 399620 402212 404651 407165 410347 414406 419343 425352 432351 439487
56278 439487 445832 451415 457078 463547 470978 479131 487563 495933 504454 513755 524042 534843 545928
56265 545928 557953 571719 587272 604257 622790 643324 665917 690230 716216 744368 775371
56254 775371 809886 848585 892109 940930 995313 1055334 1121031 1192796 1271480 1357495 1449722
56243 1449722 1545910 1644475 1745296 1848405 1952396 2054536 2151936 2242119 2322776 2391597
56233 2391597 2446425 2485483 2507665 2512695 2500781 2472239 2427935 2370029 2301514 2224808 2141416
56222 2141416 2053039 1962105 1870773 1780187 1691232 1605235 1523208 1445070 1370411 1299653 1233728
56211 1233728 1172935 1116809 1064917 1017155 973386 933347 896839 863646 833391 805792 780877
56200 780877 758675 738917 721314 705812 692237 680021 668644 658188 649105 641647 635734 631147
56188 631147 627601 624775 622380 620063 617401 614465 612240 611776 612799 613911 614326 614638 615562 616836 617949
56173 617949 619196 621282 624344 628008 632066 636537 641382 646591 652241 658125 663734 669032 674773 681664
56159 681664 689647 698430 708219 719421 732008 745678 760323 775896 792216 809483 828802 851724
56147 851724 879314 911871 949405 992190 1040966 1096677 1159950 1231003 1310276 1398570 1495800
56136 1495800 1599779 1706857 1813419 1915922 2010169 2092298 2160851 2216955 2262609 2300148
56126 2300148 2333033 2364817 2396083 2423502 2442592 2450502 2446238 2430384 2405766 2376648 2345549 2311367
56114 2311367 2271060 2221722 2160417 2084317 1993303 1891735 1786221 1682307 1584079 1495139 1417719
56103 1417719 1351435 1294717 1247052 1208526 1177995 1153472 1133932 1119173 1108255 1099661 1092859 1088312
56091 1088312 1085999 1085123 1085159 1086096 1087765 1089946 1092988 1097424 1103120 1109477 1116148 1122945 1129648 1136634 1144926
56076 1144926 1154809 1165162 1175076 1185258 1196749 1209169 1221447 1233565 1246289 1259838 1274041 1289183
56064 1289183 1305531 1322637 1340168 1358688 1378548 1398856 1418723 1438653 1459513 1481073 1502824
56053 1502824 1525103 1547939 1569861 1589580 1608009 1626984 1646877 1667052 1687782 1709831 1732906
56042 1732906 1756297 1780403 1805945 1832463 1859283 1887163 1917131 1948497 1979894 2011605 2045060
56031 2045060 2080751 2118372 2158158 2200272 2243809 2288340 2335416 2386529 2440598 2495622 2551666
56020 2551666 2609859 2669592 2729432 2790020 2853393 2920088 2989396 3061740 3138137 3217903 3299532
56009 3299532 3383394 3471199 3563501 3660047 3761658 3869280 3982193 4099680 4223181 4354144
55999 4354144 4491320 4633438 4782935 4943420 5114765 5294554 5483177 5683444 5896269
55990 5896269 6120973 6359098 6613791 6886152 7176320 7487221 7823048 8185137 8573818
55981 8573818 8993190 9449266 9944654 10480210 11060872 11694772 12388288 13148002 13986392
55972 13986392 14919643 15961612 17127121 18440407 19933932 21641239 23599824 25860469
55964 25860469 28485541 31538751 35084501 39195522 43952811 49443487 55776262 63107367
55956 63107367 71651113 81674931 93494595 107455664 123878884 142998581 164944937
55949 164944937 189758582 217380536 247595917 279905004 313213847 345333725 372680821
55942 372680821 390809231 395916214 386509971 364075392 332321003 295674776 258022486
55935 258022486 222142580 189676785 161335010 137178198 116900573 100035527 86066652
55928 86066652 74492012 64871832 56844523 50111490 44423970 39584502 35442058 31874580
55920 31874580 28779500 26077490 23710458 21629281 19788937 18154720 16702513 15409318
55912 15409318 14250162 13205431 12263571 11414380 10645904 9949132 9318974 8748614 8228405
55903 8228405 7751633 7315845 6917288 6549325 6207453 5890689 5596868 5321566 5062842
55894 5062842 4822158 4599376 4391393 4196714 4016794 3851621 3698384 3555722 3424956
55885 3424956 3305825 3195131 3091058 2994766 2906019 2820868 2735399 2648674 2560716 2471022 2380719
55874 2380719 2293192 2210818 2133362 2060452 1992879 1930370 1870698 1812196 1755041 1699540 1645656
55863 1645656 1594687 1548643 1507243 1468099 1430234 1394628 1360973 1327145 1292718 1259792 1229342
55852 1229342 1199846 1170622 1143376 1118958 1095479 1071237 1046852 1022994 998644 973428 949272
55841 949272 927821 908126 888539 869017 850050 831178 812119 793742 776584 760051 744243
55830 744243 730650 719775 709946 699836 690301 682261 674627 665942 656433 646809 636585 625265 613770
55817 613770 603005 592273 580717 569144 558809 549521 540515 532175 525273 519358 513475 507817 503271
55804 503271 499906 497219 495325 494753 495477 497160 499872 503653 507835 511564 514571 516869 518349 519165 519790
55789 519790 520150 519516 517701 515468 513232 510428 506788 503167 500351 497857 494457 488958 480180 467632
55775 467632 452975 439483 429109 421183 414745 410667 410227 412902 417043 421774 426630 429989 429462 423876
55761 423876 414002 401662 388827 377031 366701 357247 348289 340250 333287 326435 318615 309900 301130
55748 301130 292914 285571 279354 273983 268621 262977 257778 253637 250232 247141 244598 242805 241418 240454
55734 240454 240642 242001 242957 241926 239088 235669 232247 228722 225284 222282 219536 216622 213439 209932 205843
55719 205843 201409 197583 194904 192913 191335 190897 192136 194315 196549 199159 202840 207277 211736 216348
55705 216348 221528 226625 230367 232269 232592 231308 228161 223493 217990 211950 205506 199172 193365 187949
55691 187949 183044 179578 178025 177300 176093 174689 174237 174803 175573 176564 178559 181465 184186 186243 188277
55676 188277 190788 193474 195970 198172 199676 199900 198956 197620 196309 194890 193507 192614 192043 190968 189109
55661 189109 187232 186154 185866 185891 185955 186093 186529 187577 189286 191142 192532 193481 194472 195616 196465 196606 196044
55644 196044 195043 193952 193046 192174 190778 188611 186176 184017 181894 179093 175270 170537 165110 159375 153948
55629 153948 149138 144685 140435 136820 134116 131902 129878 128612 128597 129130 129076 128276 127271 126110 124557 123143
55613 123143 122756 123279 123672 123344 122465 121073 119014 116796 115341 114669 113851 112477 111245 110800 110847 110737 110237
55596 110237 109380 108176 106754 105350 104010 102711 101691 101126 100645 99783 98775 98173 97903 97522 97246 97673
55580 97673 98513 98700 97981 97429 98012 99526 101291 103135 105217 107539 110017 112616 115175 117521 119823 122262
55564 122262 124373 125443 125613 125782 126241 126258 125318 123960 122932 122120 120747 118222 114517 110181 106211 103393
55548 103393 101573 100006 98498 97607 97674 98309 99036 99795 100620 101432 102323 103385 104165 104046 103364 103312 104440 106015
55530 106015 107165 107765 107781 106688 104265 101225 98295 95187 91224 86514 81785 77359 72931 68127 62844
55515 62844 57362 52645 50102 50370 52505 54948 57119 59511 62417 65259 67285 68395 69042 69603 70023
55500 70023 69973 69286 68260 67522 67592 68618 70447 72699 74752 75921 75809 74448 72198 69769 68142 68048 69349
55483 69349 71169 72704 73704 74348 74963 75842 76908 77573 77289 76233 75131 74511 74519 75227 76507 77730 78270
55466 78270 78303 78467 78742 78413 77256 75999 75379 75427 75889 76595 77161 77070 76429 76035 76309 76787 76983 77080 77311 77371
55446 77371 77020 76694 76904 77479 77919 78137 78326 78521 78747 79243 79990 80424 80090 79307 78716 78513 78564 78903 79523
55427 79523 79980 79786 79095 78564 78652 79366 80457 81503 81993 81713 80950 80125 79454 79113 79271 79714 79857 79535 79352
55408 79352 79786 80355 80167 79016 77472 76155 75371 75207 75451 75552 75083 74181 73298 72690 72321 71974 71307 70198
55390 70198 69265 69463 70812 72155 72652 72915 73952 75538 76475 76132 74936 73556 72371 71591 71112 70314 68771
55373 68771 67113 66463 66966 67570 67368 66540 65818 65628 65945 66486 66873 66969 67167 67992 69374 70752 71884 73060
55355 73060 74399 75495 76016 76177 76353 76564 76694 76949 77757 79226 80855 81820 81610 80571 79778 80150 81608
55338 81608 83219 84111 84059 83307 82176 80955 79924 79226 78768 78301 77636 76845 76301 76394 77108 77986 78536 78600 78337
55319 78337 78089 78309 79274 80715 81938 82467 82314 81603 80429 79206 78586 78640 78667 78230 77875 78196 78677 78306
55301 78306 77076 76029 75842 76132 76228 75929 75406 74977 75192 76524 78689 80735 82047 82840 83465 83718 83263
55284 83263 82435 82087 82616 83457 83705 83163 82607 82888 83855 84469 84084 83205 82731 82807 82861 82582 82322 82595 83526 84807
55264 84807 85895 86330 86149 85869 85754 85385 84376 83195 82647 82742 82794 82579 82537 82663 82100 80351 78277 77241
55246 77241 77517 78096 77946 77000 75879 75023 74332 73580 72931 72790 73184 73639 73851 74159 75056 76519 78163 79810
55228 79810 81397 82567 82972 82840 82662 82422 81843 81313 81717 83145 84554 85055 84849 84537 84209 83719 83287 83169
55210 83169 83103 82748 82351 82384 82730 82843 82675 82861 83879 85428 86754 87337 87219 86892 86870 87251 87658 87746 87644
55191 87644 87731 88106 88515 88719 88710 88565 88279 87869 87516 87509 87993 88751 89322 89486 89575 90094 90982 91527 91106 89813 88247
55170 88247 86971 86300 86372 87057 87958 88744 89423 90090 90570 90566 90131 89716 89732 90257 91137 92128 92910 93193 92932 92309
55150 92309 91439 90263 88852 87660 87196 87402 87581 87051 85783 84277 82977 82079 81801 82370 83520 84388 84330
55133 84330 83685 83358 83685 84096 83980 83489 83262 83612 84235 84686 84890 85183 85879 86852 87610 87849 87817 88010 88543
55114 88543 88998 88905 88246 87470 87176 87698 88805 89803 90141 89991 90077 90825 91859 92414 92116 91248 90389 89930 89934 90307
55094 90307 90995 91982 93190 94438 95494 96068 95884 94993 94016 93732 94284 95006 95181 94723 94001 93372 93146 93611
55076 93611 94639 95552 95877 96046 96805 98086 99021 99084 98655 98354 98331 98424 98552 98731 98965 99305 99778 100190 100226 99813
55056 99813 99161 98433 97692 97143 97064 97461 98047 98565 98853 98681 98010 97346 97319 97802 97983 97457 96745 96527 96838 97208
55036 97208 97143 96275 94572 92716 91803 92297 93549 94629 95263 95738 96337 97194 98242 98960 98630 97288 96012
55019 96012 95747 96202 96447 96253 96197 96618 97180 97495 97629 97897 98518 99522 100654 101375 101298 100658 100159 100352 101341
55000 101341 102842 104208 104606 103718 102265 101429 101697 102636 103737 104934 106170 106972 106934 106340 105955 106235 106968
54983 106968 107638 107921 107810 107437 106924 106356 105821 105405 105198 105353 106109 107613 109635 111563 112765 113025 112650
54966 112650 112206 112045 111993 111534 110461 109291 108849 109462 110727 111995 112857 113208 113200 113172 113352 113606 113720 113886 114464
54947 114464 115255 115554 115103 114521 114529 115137 115836 116176 115870 114837 113547 112909 113292 113955 113913 113112 112292 112008 112312
54928 112312 113161 114480 115926 117139 118286 119893 122160 124815 127605 130482 133394 136310 139448 143051
54914 143051 147007 151117 155618 160871 166453 171113 173804 174322 172891 169696 165113 159901 154765 149940
54900 149940 145386 141132 137169 133336 129586 126197 123471 121353 119506 117647 115689 113744 112089 111004
54886 111004 110520 110490 110933 112035 113654 115124 115905 116312 117364 119890 123897 128690 133459 137759 141606 145230
54870 145230 148808 152446 156256 160225 164011 167148 169535 171375 172462 171860 168726 163424 157433 152079
54856 152079 147564 143342 139105 135075 131485 128183 124886 121552 118312 115223 112383 110125 108771 108180
54842 108180 107860 107545 107322 107127 106557 105441 104291 103815 104107 104615 104805 104593 104292 104377 105206 106659 108077 108787
54824 108787 108706 108299 108056 108147 108381 108254 107262 105512 103900 103354 103963 105125 106330 107353 107916 107816 107427 107467
54806 107467 108088 108734 109065 109478 110371 111436 112151 112572 113032 113305 112793 111569 110613 110729 111615 112333 112445 112309
54788 112309 112369 112635 113001 113690 114977 116567 117669 117842 117531 117568 118271 119242 119949 120259 120399 120622 121064 121833
54770 121833 123128 125156 127883 130906 133725 136178 138555 141230 144340 147900 152024 156877 162434 168328
54756 168328 173854 178154 180648 181421 181003 179732 177501 174155 169811 164690 159018 153241 147953 143345 139152
54741 139152 135398 132696 131397 130904 130418 129994 130163 130789 131085 130720 130172 129900 129827 129818 130086 130891 132174 133645
54723 133645 135003 136141 137436 139573 142675 145862 148386 150900 154724 159919 165164 169585 173512 176996
54709 176996 178833 177934 174843 170933 166721 161878 156429 150880 145423 139998 135123 131765 130223 129771 129490
54694 129490 128973 128217 127457 127167 127603 128199 127919 126388 124217 122111 120223 118584 117566 117397 117615 117481 116776
54677 116776 115813 114826 113808 112864 112286 112137 112115 112003 112017 112497 113369 114112 114231 113578 112249 110454 108608 107352
54659 107352 107215 108199 109793 111382 112536 113034 112880 112331 111755 111332 111026 110881 111179 112118 113399 114318 114346 113632
54641 113632 112859 112594 112787 113009 113134 113571 114705 116312 117738 118513 118579 118069 117193 116311 115779 115591 115384 114832
54623 114832 113872 112624 111343 110407 110086 110230 110447 110621 111006 111775 112725 113471 113742 113527 113136 113090 113676 114677
54605 114677 115790 117145 118976 120905 122125 122302 121793 120979 120061 119544 120095 121568 122855 123194 123048 123234
54589 123234 123759 124105 124151 124107 123909 123401 122888 122834 123071 122972 122368 121744 121501 121534 121570 121475 121187 120739 120419 120561 121159
54568 121159 121973 122927 124023 124895 124943 124039 122771 121828 121386 121164 120868 120515 120470 121185 122702 124428 125620 126121
54550 126121 126486 127390 128995 130854 132318 133136 133661 134328 134946 134924 134287 133965 134649 135823 136465 136415 136464 137251
54532 137251 138693 140408 142074 143292 143614 142901 141362 139321 137280 136029 136122 137170 138120 138339 138043 137705
54516 137705 137540 137603 137871 138052 137753 136981 136135 135418 134673 133848 133191 132857 132722 132641 132465 131778 130272 128483 127534
54497 127534 127838 128575 128776 128357 127708 126890 125876 125153 125392 126575 127972 128944 129400 129563 129664 129869 130191 130471
54479 130471 130577 130573 130546 130479 130446 130719 131488 132663 134129 135944 138040 139999 141477 142615 143671 144426 144434 143773
54461 143773 143167 143344 144515 146370 148279 149527 149773 149363 148918 148550 147771 146241 144338 142850 142280 142589
54445 142589 143423 144394 145144 145358 144880 143835 142579 141412 140377 139401 138592 138224 138434 139078 139886 140540 140684
54428 140684 140193 139518 139389 139939 140466 140325 139781 139619 140146 140981 141682 142151 142475 142790 143353 144320 145325 145596
54410 145596 144731 143175 141738 140792 140126 139522 139184 139463 140247 140896 140922 140606 140722 141695 143271 144983 146611
54393 146611 148139 149618 151247 153212 155226 156599 157108 157435 158323 159535 160126 159572 158125 156241 154304
54378 154304 152899 152673 153656 155097 156172 156491 155920 154469 152654 151523 151815 153284 155095 156698 158014
54363 158014 159024 159594 159719 159669 159832 160469 161505 162447 162688 162096 161230 160781 160858 161019 160952 160929 161489 162787 164429
54344 164429 165994 167545 169375 171259 172404 172431 171982 171843 171751 170832 169155 167880 167556 167181 165577 162993
54328 162993 160593 158848 157380 156072 155301 155017 154546 153607 152819 152808 153372 153887 154093 154104 153977 153704 153393 153132
54310 153132 152764 152022 150803 149216 147554 146251 145560 145223 144767 144183 143933 144170 144428 144299 143909 143491 142960
54293 142960 142352 142145 142628 143394 144057 145057 146942 149116 150200 149705 148581 147920 147863 148023 148371 149184 150489
54276 150489 151958 153216 154045 154419 154423 154017 152955 151243 149593 148917 149287 149821 149735 149086 148361 147866 147707 147877
54258 147877 148091 147995 147819 148354 149965 152024 153716 154953 156088 157198 158145 158984 159774 160264 160291 160156 160051
54241 160051 159486 158002 156179 155135 155067 155100 154593 153800 153079 152273 151282 150646 150999 152237 153558 154094 153353 151422
54223 151422 149054 147258 146477 146311 146163 145906 145796 146066 146831 148048 149307 149990 149939 149766 150140 150965 151550 151461
54205 151461 150920 150488 150593 151233 151883 151796 150698 149094 147696 146714 145992 145627 145921 146672 147083 146653 145857 145589
54187 145589 146109 146890 147464 147979 148729 149453 149492 148598 147248 146041 145103 144264 143624 143585 144367 145677 146909 147540
54169 147540 147449 147060 147091 147848 148756 148829 147675 145829 144107 142916 142264 142077 142257 142586 142866 143069 143230 143225 142816
54150 142816 141964 141069 140844 141760 143442 144780 144937 144234 143746 144033 144586 144616 144027 143421 143386 144018 144980 145833 146417
54131 146417 146995 147936 149219 150447 151338 151903 152101 151717 150823 150073 150206 151383 153185 155058 156602 157675
54115 157675 158504 159487 160637 161388 161246 160451 159715 159437 159507 159703 159909 159935 159560 158866 158291 158216 158578 158977 159095
54096 159095 158992 159027 159453 160105 160615 160891 161135 161332 161152 160621 160484 161405 162978 164073 164157 163776 163643 163714 163440
54077 163440 162661 161878 161701 162196 162861 163220 163399 164001 165381 167198 168877 170300 171747 173226 174316 174842
54061 174842 175352 176647 178944 181751 184537 187314 190509 194374 198664 202914 206949 211090 215899 221731
54047 221731 228372 234878 239847 242212 241982 240086 237380 234028 230028 226041 223291 222634 223951 226494 229603
54032 229603 233034 236824 241000 245407 249694 253423 256183 257751 258312 258522 259103 260247 261569 262674 263573
54017 263573 264420 265092 265246 264678 263477 261863 259982 257732 254830 251259 247639 244686 242228 239203 234904
54002 234904 229771 224684 220059 216067 213143 211431 210098 208132 205720 204014 203474 203275 202554 201440 200537
53987 200537 200025 199703 199396 198922 197970 196430 194572 192689 190862 189218 188015 187234 186538 185913 185852 186547 187358
53970 187358 187579 187357 187301 187515 187617 187494 187426 187547 187759 188123 188761 189377 189524 189454 190147 192193 195150 198295 201566
53951 201566 205356 209682 214087 218353 222866 228161 234254 240553 246290 251036 254888 258196 261093 263271
53937 263271 264301 264195 263637 263595 264618 266456 268424 270177 272096 274777 278205 281662 284442 286474 288110
53922 288110 289610 291126 292996 295640 299107 303018 307097 311482 316405 321857 327825 334630 342617 351636
53908 351636 361145 370812 380632 390483 399962 408842 417292 425386 432634 438175 441178 440877 436607 428339
53894 428339 417092 404383 391190 377748 364309 351644 340561 331148 322769 314724 306808 299205
53882 299205 292008 285006 278071 271601 266268 262238 258897 255557 252136 248872 245657 242173 238564 235454
53868 235454 233154 231212 228922 226000 222645 219224 216070 213348 211001 208954 207396 206578 206243 205569 203944
53853 203944 201653 199633 198675 198917 199885 200865 201432 201796 202483 203499 204040 203284 201367 199285 197852 196998 196123
53836 196123 194895 193587 192724 192568 192966 193642 194506 195632 197025 198554 200090 201544 202744 203433 203526 203304
53820 203304 203247 203698 204679 206012 207548 209244 211036 212741 214210 215513 216747 217711 218148 218463 219682 222354
53804 222354 225812 229051 232090 235827 240641 245872 250754 255219 259516 263654 267596 271555 275607 279266
53790 279266 281779 282685 282031 280400 278935 278777 279991 281379 281786 281237 280378 279218 277179 274185 270911 267879
53774 267879 264908 261643 258066 254270 250173 245795 241527 237813 234712 231928 229176 226439 224001 222253
53760 222253 221257 220456 219091 217000 214774 213018 211746 210683 209809 209250 208803 208023 206833 205708 205113 204987
53744 204987 204944 204820 204828 205192 205825 206450 206927 207377 207975 208658 209075 208835 207908 206756 206027 206042 206568 207120 207444 207766
53724 207766 208603 210398 213165 216364 219161 220998 222000 222864 224323 226676 229668 232696 235185 236937 238219
53709 238219 239510 241179 243287 245579 247666 249428 251263 253734 256864 260058 262871 265557 268626 272138
53695 272138 275787 279445 283212 287059 290806 294364 297632 300295 302149 303492 304645 305283 304835 303480 302050
53680 302050 300886 299588 298086 297081 296953 296930 296012 294252 292510 291321 290568 290002 289452 288707 287750 287015 286942
53663 286942 287334 287561 287288 286633 285750 284691 283600 282624 281643 280450 279175 278240 277950 278366 279374 280597 281429
53646 281429 281586 281558 282102 283324 284594 285326 285519 285620 286170 287579 289897 292783 295853 298921 301735 303766
53630 303766 304739 305188 306016 307589 309631 311873 314295 316763 319015 321132 323584 326666 330171 333722 337119
53615 337119 340302 343291 346291 349623 353504 357950 362809 367683 372117 376101 380216 384865 389635 393864
53601 393864 397589 401397 405562 409956 414589 419405 423664 426475 428065 429664 431922 434229 435857 436806
53587 436806 437031 435741 432260 427080 421383 415929 410973 406757 403333 400225 396976 393838 391305 389172
53573 389172 386709 383605 380135 376534 372908 369758 367871 367502 368097 368988 369928 370917 371932 373024 374304
53558 374304 375648 376688 377215 377394 377532 377875 378661 379978 381526 382838 383926 385341 387454 390010 392669
53543 392669 395632 399336 403665 407913 411537 414697 418018 422144 427556 434489 442743 451691 460741 469797
53529 469797 479187 489244 500121 511975 525072 539614 555541 572533 590007 607141 623272 638564
53517 638564 654133 671250 690408 711313 733580 757059 781573 806811 832686 859496 887474
53506 887474 916352 945567 974822 1004203 1033750 1063101 1091688 1119210 1145743 1171363 1195864
53495 1195864 1219101 1241530 1264067 1287232 1310672 1333655 1355767 1377022 1397678 1418246 1439299
53484 1439299 1460773 1481707 1501169 1519317 1537017 1554692 1572194 1589570 1607010 1623895 1638767
53473 1638767 1650629 1659606 1665989 1669372 1669240 1665765 1659344 1649883 1637292 1622282 1605881 1588342 1569335
53460 1569335 1549119 1528705 1508725 1488836 1468475 1447639 1426512 1404733 1381507 1356390 1329785
53449 1329785 1302743 1276360 1251268 1227538 1205020 1183622 1163217 1143487 1124277 1106107 1090074
53438 1090074 1077067 1067193 1059989 1055015 1052097 1051028 1051236 1051885 1052520 1053546 1055896 1060152 1066194 1073775
53424 1073775 1083051 1094260 1107162 1121307 1136779 1154198 1173857 1195270 1217796 1241457 1266774
53413 1266774 1293907 1322313 1351419 1381535 1413829 1449269 1487700 1528129 1569801 1612784 1657538
53402 1657538 1704393 1753640 1805747 1861053 1919343 1980019 2042594 2106680 2171609 2236513 2300939
53391 2300939 2365154 2429741 2495055 2561068 2627399 2693236 2757365 2818607 2876301 2930406 2981140
53380 2981140 3028603 3072670 3113135 3149866 3182792 3211709 3236023 3254768 3267068 3272758 3272452 3266774
53368 3266774 3255470 3237480 3211855 3178324 3136918 3087612 3030883 2968411 2902632 2835514 2768004
53357 2768004 2700477 2633174 2566208 2499693 2434084 2370060 2308081 2248423 2191561 2137851 2086712
53346 2086712 2036771 1987093 1937733 1888870 1840159 1791485 1743785 1698530 1656624 1618183 1582865
53335 1582865 1549987 1518768 1489093 1461691 1437118 1415082 1395295 1378282 1364356 1352204 1339648
53324 1339648 1325799 1311478 1297508 1283642 1269472 1255450 1242435 1230820 1220626 1212012 1205239 1200317
53312 1200317 1197035 1195212 1194787 1195867 1198698 1203367 1209497 1216574 1224603 1234077 1245354 1258453 1273485
53299 1273485 1290791 1310507 1332397 1356246 1382058 1409721 1438834 1469046 1500320 1532727 1566173
53288 1566173 1600303 1634419 1667508 1698706 1727760 1754808 1779844 1802693 1823207 1840908 1854730
53277 1854730 1863885 1868902 1870969 1870210 1865563 1856546 1844170 1829637 1813049 1793966 1772420 1748584 1722167
53264 1722167 1693057 1662155 1630646 1598708 1565784 1531928 1497937 1464111 1429743 1394171 1357714
53253 1357714 1321275 1285480 1250582 1216907 1184889 1154647 1125710 1097337 1069079 1040949 1012981
53242 1012981 984816 956066 927088 898949 872369 846999 822040 797356 773714 752153 733360
53231 733360 717463 704018 692250 681566 671815 662934 654540 646062 637112 627469 616959 605664 594086
53218 594086 582661 571111 558594 544580 529391 513923 499011 485072 472150 460224 449480
53207 449480 440223 432483 425824 419614 413307 406507 399016 391032 383046 375338 367718 359921 352056 344521
53193 344521 337632 331499 326062 321044 316093 311146 306515 302466 298927 295724 292840 290237 287699 285057
53179 285057 282409 279979 278000 276735 276136 275421 273580 270704 268198 267182 267139 266738 265484 263877 262316
53164 262316 260819 259655 259354 259810 260068 259312 257634 255632 253658 251711 249784 248064 246802 246019 245282 244007
53148 244007 242170 240485 239617 239497 239675 239994 240458 240858 241094 241569 242569 243536 243768 243616 244079 245240 246079
53131 246079 245987 245498 245210 244987 244670 244706 245346 245940 245779 245194 245034 245374 245478 244895 243924 243044 242458 242275 242653
53112 242653 243556 244607 245306 245335 244683 243601 242380 241173 240147 239684 240058 240828 240986 239999 238347 236840 235721
53095 235721 234746 233753 232727 231584 230373 229517 229362 229593 229525 228979 228479 228503 228935 229353 229667 230300 231832 234415
53077 234415 237438 239831 240836 240458 239131 237190 234918 232860 231650 231452 231935 232808 234082 235667 236998
53062 236998 237362 236565 235040 233321 231615 229976 228636 227796 227150 226105 224714 223993 224800 226682 228403 229530
53046 229530 230760 232614 234579 235919 236711 237467 238119 238057 237006 235408 233983 233293 233510 234223 234590 234125 233248
53029 233248 232713 232697 232845 232967 233144 233286 233233 233203 233469 233555 232593 230743 229483 229920 231356 232166 231739 230859 230383
53010 230383 230340 230406 230585 231016 231519 231798 231925 232262 232898 233448 233495 233067 232585 232474 232831 233377 233676 233572 233467 233962
52990 233962 235108 236266 236891 237173 237552 237953 238059 238163 238981 240476 241671 241993 242137 243053 244592 245835 246384
52973 246384 246602 246753 246704 246482 246491 247076 248378 250594 253771 257269 260065 261813 263037 264059 264362 263426 261723
52956 261723 260397 260206 261115 262583 263794 263927 262729 260804 258964 257343 255440 252962 250242 247818 245919
52941 245919 244446 243277 242394 241793 241328 240706 239738 238601 237738 237444 237648 238061 238343 238117 237166 235768 234623
52924 234623 234195 234257 234224 233781 233113 232679 232906 233850 235003 235674 235767 235916 236621 237576 238196 238497 238989 239761 240138
52905 240138 239346 237298 234769 232921 232454 232882 232838 231452 229316 227790 227568 228320 229474 230668 231532 231817
52889 231817 231919 232646 234187 235857 237097 238148 239345 240349 240667 240489 240351 240248 239767 239002 238614 238883 239308
52872 239308 239340 239045 238770 238620 238663 239303 240867 242844 244120 244190 243801 244022 244925 245657 245757 245799 246415 247207 247201 246138
52852 246138 244662 243291 241900 240341 238909 237792 236602 234938 233020 231289 229675 227809 225711 223713
52838 223713 221878 220069 218509 217650 217446 217327 216952 216423 215703 214503 213021 212184 212709 214359 216495 218875
52822 218875 221357 223245 223707 222758 221246 219842 218588 217451 216713 216509 216462 216198 216035 216697 218390 220446
52806 220446 222014 222901 223624 224748 226276 227668 228319 227993 226944 225748 224878 224262 223318 221675 219791 218469
52790 218469 217795 216997 215560 213997 213109 212913 212908 213076 213836 215068 216037 216550 217366 218911 220276 220252 219052 218098
52772 218098 218161 218483 217973 216582 215087 214028 213397 213154 213441 214250 215239 215985 216253 215984 215271 214419 213870 213923
52754 213923 214523 215277 215670 215406 214751 214415 214826 215598 216045 216169 216617 217554 218248 218226 218340 219915 223065 226616
52736 226616 229667 232453 235408 238223 240373 242038 243777 245561 246800 247240 247255 247203 247029 246659 246337 246332 246530
52719 246530 246525 245953 244636 242551 239759 236357 232586 229071 226690 225812 225800 225692 225314 225201 225490 225596 225179
52702 225179 224738 224796 225111 225280 225610 226672 228247 229507 230103 230393 230647 230850 231338 232749 234992 236978 237874
52685 237874 238072 238375 238751 238583 237827 237163 237056 237289 237464 237446 237205 236706 236100 235679 235493 235354 235258 235375 235515
52666 235515 235136 234202 233616 234299 236016 237545 237909 237092 235683 234307 233534 233858 235397 237683 240023 242125
52650 242125 244318 247106 250456 253549 255357 255549 254754 253820 252935 251643 249599 247105 244887 243528 243048
52635 243048 242888 242384 241522 241166 242283 244933 248326 251840 255583 259858 264533 269307 274175 279099 283332
52620 283332 285589 285034 281899 277160 271966 267411 264362 262998 262539 261781 260097 257864 255904 254563 253448
52605 253448 252047 250437 249247 248949 249398 250124 250881 251734 252653 253289 253259 252517 251338 250010 248655 247377 246426
52588 246426 246086 246415 247246 248471 250137 252130 253925 254926 255063 254825 254727 254998 255794 257316 259416 261317
52572 261317 262142 261718 260691 259794 259146 258314 256951 255298 253989 253320 252882 252101 251039 250306 250184 250271 250197 250186
52554 250186 250566 251034 250906 249936 248436 246787 245206 243947 243216 242902 242777 242950 243697 244881 245977 246686 247024
52537 247024 246811 245712 244038 242927 243272 244762 246300 247080 247057 246696 246646 247350 248564 249472 249615 249540 250142 251502
52519 251502 252786 253234 252879 252309 252049 252239 252733 253477 254800 257153 260385 263640 266308 268838 272104 276079
52503 276079 279697 282039 283124 283425 283120 282168 280666 278723 276176 272836 268942 265132 262002 259845 258668
52488 258668 258196 257957 257638 257350 257344 257497 257399 256980 256762 257276 258419 259596 260376 260838 261325 262072 263106 264302
52470 264302 265515 266748 268198 269968 271736 272996 273732 274569 276027 277851 279410 280628 282128 284378 287004
52455 287004 289074 289911 289549 288524 287276 285695 283296 279977 276433 273519 271262 268947 266183 263426 261284
52440 261284 259759 258486 257357 256438 255526 254254 252610 251012 249925 249615 250216 251652 253465 254996 255869
52425 255869 256201 256284 256233 255968 255447 254828 254383 254244 254320 254644 255705 258105 261766 265786 269305 272292 275332
52408 275332 278944 283311 288338 293670 298998 304709 311854 320891 330688 339291 345484 348975 349343 345868
52394 345868 338715 329517 320225 311734 304009 297120 291617 288003 286212 285596 285291 284818 284456 284848 286092
52379 286092 287534 288625 289686 291474 294199 297325 300282 303032 305926 309303 313285 317811 322705 327695
52365 327695 332389 336373 339496 342046 344410 346488 347682 347615 346656 345599 344940 344617 344303 343802 343241 342975
52349 342975 343234 343900 344855 346498 349499 353872 358697 363019 366733 370278 373901 377656 381855 386873 392620
52334 392620 398765 405510 413573 423244 433964 445059 456522 468804 482227 496955 513226 531187
52322 531187 550609 571140 592671 615094 637805 659972 681407 702711 724290 745568 765573
52311 765573 784120 802002 820020 838124 855563 871649 886258 899828 912990 926060 938782
52300 938782 950604 961224 970649 978805 985462 990725 995164 999080 1001910 1002769 1001436 998257 993218 985754
52286 985754 975760 964299 952973 942807 933977 926338 919848 914538 910420 907602 906380 907162 910191 915273
52272 915273 921854 929495 938295 948725 961057 975118 990504 1006739 1023195 1039149 1054123 1068058
52260 1068058 1081120 1093532 1105597 1117660 1129915 1142285 1154367 1165345 1174241 1180816 1186149 1191704
52248 1191704 1197669 1202734 1205624 1206275 1205205 1202517 1198046 1191906 1184158 1174360 1162264 1148794 1135539
52235 1135539 1123270 1111585 1100058 1089011 1078943 1069777 1061033 1052413 1043971 1035971 1028748 1022560 1017404
52222 1017404 1013119 1009667 1007088 1005271 1004041 1003525 1004098 1005921 1008758 1012286 1016303 1020641 1025172 1029972
52208 1029972 1035207 1040821 1046655 1052846 1059689 1066958 1073786 1079451 1084016 1088034 1091971 1096055 1100375 1104819
52194 1104819 1109139 1113319 1117638 1122165 1126455 1130092 1133340 1136824 1140604 1143915 1145917 1146472 1146067 1145062
52180 1145062 1143149 1139575 1133978 1126913 1119444 1112129 1104578 1096092 1086605 1076882 1067850 1059922 1052941 1046697
52166 1046697 1041435 1037798 1036244 1036617 1038336 1040828 1043620 1046208 1048300 1050208 1052603 1055754 1059243 1062506
52152 1062506 1065315 1067573 1069008 1069376 1068741 1067317 1065269 1062943 1061080 1060397 1060958 1062218 1063646 1065143 1066878
52137 1066878 1068829 1070531 1071326 1071099 1070841 1072167 1075996 1081861 1088698 1096138 1104794 1115587 1129182 1145926
52123 1145926 1165867 1188706 1213990 1241423 1270809 1301709 1333365 1365006 1396150 1426689 1456769
52112 1456769 1486413 1514976 1541200 1564133 1583944 1601431 1616812 1629468 1638883 1645312 1649269 1650859
52100 1650859 1650096 1647599 1644464 1641334 1637887 1633290 1626994 1619074 1609991 1600166 1589713 1578496 1566368
52087 1566368 1553328 1539407 1524505 1508473 1491520 1474520 1458886 1445968 1436418 1430048 1426245 1424556
52075 1424556 1424986 1427849 1433398 1441501 1451574 1462825 1474611 1486623 1498919 1511916 1526295 1542530
52063 1542530 1560306 1578520 1596020 1612240 1627045 1640243 1651549 1660882 1668372 1674009 1677571 1678916
52051 1678916 1678206 1675814 1672188 1667652 1662035 1654503 1644086 1630579 1614670 1597083 1577861 1556668 1533526
52038 1533526 1508930 1483387 1457323 1431531 1407333 1385891 1367337 1350774 1335255 1320657 1307580
52027 1307580 1296518 1287340 1279487 1272365 1265394 1257955 1249623 1240482 1231012 1221598 1212235 1202674 1192734 1182463
52013 1182463 1172134 1162089 1152565 1143549 1134720 1125434 1114826 1102180 1087323 1070588 1052438 1033363
52001 1033363 1014125 995525 977547 959077 939026 917594 895954 874832 854020 833321 813374
51990 813374 795254 779627 766452 755130 744760 734598 724587 715145 706277 697222 687270 676630
51978 676630 666079 655873 645364 633689 620658 606989 593759 581643 570665 560781 552472 546413
51966 546413 542621 540441 539425 539667 541105 543192 545697 549217 554209 559986 565393 570185 574954 579794
51952 579794 583913 586589 587762 587456 585319 581133 575313 568648 561949 556191 552474 551406 552749 556013
51938 556013 561119 568224 577184 587647 599480 612669 626730 640549 652841 662656 669498 673202 673795
51925 673795 671333 665789 657089 645269 630695 614274 597387 581336 566626 552888 539567 526624
51913 526624 514537 503827 494796 487606 482386 479152 477673 477490 478266 480212 484084 490578 499854 511777
51899 511777 526277 542910 560040 575148 586351 593300 596364 595386 589736 579310 564958 548047
51887 548047 530059 512538 496795 483347 471836 461686 452728 445196 439387 435508 433674 433900 436117
51874 436117 440246 446136 453398 461319 469024 475724 480958 484787 487781 490585 493337 495457 496089 494761
51860 494761 491646 487240 481872 475631 468748 461932 456208 452441 451041 451956 454673 458283 461848 464819
51846 464819 467042 468411 468824 468372 467216 465171 461819 457189 451955 446722 441524 436323 431539 427631 424472
51831 424472 421686 419449 418375 418645 419713 420952 422237 423822 425856 427989 429286 428761 426313 422943 419713
51816 419713 416732 413617 410584 408325 406977 406091 405652 406217 407791 409461 410642 411968 414301 417365 419958
51801 419958 421172 420870 419329 417054 414747 412865 411232 409438 407445 405446 403415 401309 399465 398189
51787 398189 396997 394914 391675 388153 385458 383916 383112 382587 382320 382610 383545 384523 384511 383046 380877 379285
51771 379285 378903 379575 381167 383959 388110 393306 399168 405638 412777 420502 428755 437537 446500 454744 461377
51756 461377 466118 469073 470120 468871 465205 459531 452461 444475 435963 427421 419498 412867 407994 404895
51742 404895 403036 401688 400615 400422 402031 405732 410889 416710 423138 430747 439838 449967 460352 470264
51728 470264 478847 485097 488595 490163 491367 493371 496449 500293 504190 506851 506701 502818 495570 486332
51714 486332 476780 468400 462147 458107 455479 453080 449955 445678 440331 434364 428376 423044 419240 417960
51700 417960 419736 424061 429589 434831 438540 439809 438524 435801 433360 432183 432145 432977 434874 437785 440691
51685 440691 442255 441892 439763 436065 431023 425400 420281 416183 412820 409886 407708 407012 408276 411425 415944
51670 415944 421290 427386 434642 443227 452405 461061 468983 477168 486629 497099 507075 514829 519092 519108
51656 519108 514629 506218 495342 483902 473415 464623 457876 453814 453433 457268 464516 473075 480472 484859
51642 484859 485474 482577 476972 469442 460569 451082 442009 434033 426779 419256 411147 403317 396882 392108
51628 392108 388469 385404 382656 380059 377496 375125 373364 372549 372662 373315 373845 373628 372582 371359 370716 370656
51612 370656 370457 369622 368473 367621 367102 366342 364901 363025 361493 361184 362712 366149 370861 375777 380098 383860
51596 383860 387781 392579 398494 405322 412721 420404 428137 435666 442526 447856 450503 449602 445323 439016
51582 439016 432498 427066 423144 420700 419755 420426 422728 426648 432420 440537 451421 465163 481458 499531
51568 499531 518120 536019 552959 569804 587547 606194 624765 642240 658241 673127 688077
51557 688077 705117 726360 752764 783761 818160 854825 892007 926500 954373 972862 981336 980526
51545 980526 971340 954586 931234 902395 869092 832393 793711 754694 716772 680980 648158 618977
51533 618977 593652 571821 552889 536346 521642 508080 495244 483431 473213 464500 456512 448879
51521 448879 442240 437261 433452 429597 425156 420585 416305 412183 408282 405271 403518 402309 400714 398914
51507 398914 397950 398253 399124 399746 400140 400887 402406 404763 407853 411367 414714 417265 418670 418927 418217 416815
51491 416815 415094 413490 412398 411943 411798 411364 410290 408721 406902 404752 402066 398960 395676 392092 387924
51476 387924 383423 379249 375549 371701 367277 362764 358890 355685 352690 349768 347057 344313 341045 337401
51462 337401 334319 332523 331815 331625 331865 332763 334038 334744 334171 332738 331807 332598 335291 339167 343521 348351
51446 348351 354131 361120 369100 377761 387114 397447 409082 422234 436875 452367 467179 479205
51434 479205 486673 489033 487152 482752 477589 472861 469001 465670 461895 456477 448684 438770 427867 417362
51420 417362 408338 401335 396294 392593 389404 386297 383521 381604 380694 380453 380480 380707 381373 382770 385064 388172
51404 388172 391697 395076 397888 400054 401815 403703 406410 410341 415104 419658 423228 425947 428464 431177
51390 431177 434154 437644 442193 448243 455982 465641 477536 491693 507814 525882 546544 570624 598571
51377 598571 630594 667041 708218 753941 803594 856352 910763 964013 1012138 1051382 1079480
51366 1079480 1095866 1101102 1096212 1082149 1059494 1028674 990550 946720 899134 849543 799407 750125
51354 750125 703052 659193 619017 582706 550599 523276 501003 483134 468268 455189 443518
51343 443518 433347 424527 416637 409506 403224 397637 392257 386918 382151 378605 376292 374696 373496 372820
51329 372820 372753 372775 371900 369426 365562 361283 357528 354577 352212 350260 348716 347457 346215 344937 343849
51314 343849 343068 342414 341788 341468 341767 342557 343337 343806 344193 345027 346607 348629 350402 351590 352695 354539 357325
51297 357325 360523 363702 366925 370154 372795 374266 374625 374167 372727 370025 366539 363350 361032 359230 357465
51282 357465 355898 355103 355422 356764 358762 360953 363109 365501 368488 371703 374030 374688 374067 373152 372423 371732
51266 371732 371066 370887 371661 373429 375964 379011 382248 385256 387697 389308 389695 388446 385726 382512 379918
51251 379918 378312 377272 376222 374824 372902 370443 367700 364981 362249 359288 356316 353978 352519 351462
51237 351462 350458 350005 350770 352527 354397 355954 357338 358349 358319 357174 355845 355123 354646 353593 351945 350425
51221 350425 349465 348922 348672 348794 349079 349029 348625 348683 350088 352836 356044 358756 360585 361732 362680 363873 365543
51204 365543 367658 369948 372106 374114 376361 379202 382342 384972 386664 387805 388880 389659 389610 388891 388259
51189 388259 387948 387230 385349 382504 379597 377316 375751 374637 373642 372515 371265 370240 369825 370068 370646 371123
51173 371123 371199 370831 370244 369816 369808 370187 370689 370993 370953 370872 371531 373616 376906 380243 382599 384146 386042 389089
51155 389089 392771 395721 397061 397153 396942 396738 395850 393536 390053 386510 383799 382013 380916 380506 380850 381607
51139 381607 382141 382115 381807 381758 382220 382934 383357 383059 381978 380341 378456 376644 375270 374610 374607 374919 375328 375991
51121 375991 377177 378836 380544 381888 382828 383694 384850 386322 387809 389094 390387 392114 394396 396920 399397
51106 399397 401944 404882 408307 412019 415770 419383 422693 425603 428278 431049 433969 436518 437979 438190
51092 438190 437749 437360 437084 436465 435273 433742 432052 430049 427722 425548 423898 422427 420614 418726 417631
51077 417631 417649 418208 418805 419654 421108 422955 424733 426354 427995 429650 431264 433126 435737 439410 444302
51062 444302 450670 458709 468196 478748 490451 503919 519560 536817 554024 568972 579997 587107
51050 587107 592170 597855 606317 618663 634883 653593 672172 688150 700871 711383 720512 727411
51038 727411 730218 727786 720516 709933 697884 685942 674904 664397 652943 638729 620804 599913
51026 599913 578147 557592 539284 523457 510376 500453 493659 489428 487251 486917 488101 490314 493493
51013 493493 498077 504111 510777 517407 524539 533231 543443 553876 563504 572609 582085 592251 602743
51000 602743 613169 623394 633348 643044 652757 662836 673225 683430 693128 702649 712650 723362
50988 723362 734274 744598 753929 762349 770044 777039 783384 789465 795961 803524 812539 823073 834799
50975 834799 846951 858573 869159 879188 890061 903466 920729 942584 969374 1001296 1038410
50964 1038410 1080532 1127247 1178156 1233041 1291777 1354107 1419521 1487229 1556166 1625059 1692642
50953 1692642 1757894 1820008 1878154 1931387 1978891 2020270 2055521 2084770 2108178 2126152 2139475
50942 2139475 2149034 2155490 2159522 2162370 2165586 2169630 2172814 2172241 2166148 2155058 2140588 2123737 2104737
50929 2104737 2083965 2061851 2037811 2010190 1977839 1941176 1901075 1857181 1808222 1753947 1695895
50918 1695895 1635973 1574975 1513018 1450893 1390165 1332027 1276803 1224770 1176853 1134014 1096266
50907 1096266 1062786 1032880 1006397 983144 962377 943180 925124 908322 892960 879001 866312
50896 866312 854786 844326 834892 826639 819910 814918 811452 808906 806618 804313 802286 801127 801103 801912
50882 801912 803178 805070 808068 812083 816215 819682 822761 826469 831487 837760 845105 853743 864099 876255
50868 876255 889834 904278 919210 934724 951518 970604 992676 1017718 1045301 1075192 1107662
50857 1107662 1143347 1183008 1227384 1277114 1332699 1394572 1463265 1539506 1624058 1717342 1819184
50846 1819184 1929041 2046578 2171873 2304903 2444907 2590456 2740103 2892646 3046672
50837 3046672 3200029 3349828 3492793 3625569 3744973 3848150 3932654 3996641 4039494 4062392
50827 4062392 4067964 4059173 4038713 4009407 3974593 3937701 3901747 3869510 3843698 3826173 3817052 3814952
50815 3814952 3817985 3823888 3829202 3829016 3818144 3792620 3750303 3690552 3613625 3520175 3411115 3287972
50803 3287972 3153259 3010253 2862320 2712582 2564095 2419970 2283128 2155992 2040249
50794 2040249 1936674 1845268 1765867 1698498 1642904 1598027 1562484 1535394 1516112 1503281 1494932
50783 1494932 1489676 1487027 1486401 1486566 1486462 1485781 1484252 1481014 1475323 1467350 1457640 1446240 1433000 1418268
50769 1418268 1402583 1385980 1368212 1349270 1329007 1306689 1281892 1255627 1229586 1204290 1178930
50758 1178930 1153073 1127581 1103636 1081714 1061880 1044300 1029092 1016325 1006580 1000884 999591 1001777
50746 1001777 1006118 1011978 1019456 1029062 1041760 1058657 1080034 1105150 1133547 1166028 1203705 1246567
50734 1246567 1293900 1345821 1403374 1467016 1535743 1607929 1682503 1759088 1837520 1917455 1998177
50723 1998177 2078609 2157724 2234919 2309701 2381026 2447366 2507415 2560292 2604894 2639470 2662024
50712 2662024 2670942 2665356 2645637 2614091 2574859 2532587 2491011 2452740 2419848 2394087 2376488 2367062
50700 2367062 2364927 2368566 2376070 2385487 2394967 2402319 2404472 2397872 2379826 2349416 2307057 2253470 2189436
50687 2189436 2116475 2037283 1955277 1873811 1795782 1723503 1658452 1601195 1551877 1510899 1478927
50676 1478927 1456347 1443046 1438777 1443389 1456531 1477463 1505420 1539889 1580163 1624739 1671505 1718471
50664 1718471 1764092 1807031 1846105 1880659 1910718 1936565 1958390 1976534 1991885 2005674 2018794
50653 2018794 2031438 2043449 2054890 2066152 2077622 2089481 2101977 2115761 2131734 2150583 2172660
50642 2172660 2198321 2228057 2262179 2300658 2343533 2391168 2443679 2500183 2558982 2618533 2677895
50631 2677895 2736191 2792116 2844215 2891411 2933103 2969106 2999896 3026640 3050090 3068574 3076741
50620 3076741 3066803 3032323 2972356 2892837 2803912 2715334 2633622 2562376 2503826 2459245 2428366
50609 2428366 2409490 2400559 2399874 2405699 2415662 2426880 2436534 2442101 2441237 2431698 2411436 2378763 2332725
50596 2332725 2273724 2203831 2126232 2044088 1959843 1875383 1792559 1713253 1638949 1570441 1508060
50585 1508060 1452087 1402771 1359944 1322831 1290433 1262033 1237126 1214929 1194332 1174639 1156218
50574 1156218 1140149 1127162 1117140 1109637 1104533 1101982 1101972 1104260 1108732 1115486 1124482 1135391 1147990
50561 1147990 1162529 1179478 1198942 1220648 1244577 1271366 1301825 1336151 1373849 1414447 1457929
50550 1457929 1504200 1552345 1600882 1648818 1696010 1742189 1786032 1825907 1861632 1895016 1928476
50539 1928476 1963487 2000659 2040850 2085528 2136051 2193099 2256922 2327748 2405721 2490800 2583103
50528 2583103 2683251 2792130 2910269 3037519 3173204 3316412 3466120 3621044 3779199
50519 3779199 3937561 4092460 4240616 4379694 4507591 4621322 4717037 4791204 4841495 4866558
50509 4866558 4865468 4837870 4784467 4707050 4608115 4490675 4358375 4215488 4066772 3917431
50499 3917431 3773064 3639231 3520705 3421084 3342867 3287573 3255643 3246411 3258341 3289209 3335942
50488 3335942 3394336 3458978 3523357 3580116 3621624 3640892 3632453 3592974 3521725 3420862 3295113
50477 3295113 3150667 2993936 2830938 2667177 2507344 2354823 2211593 2078746 1957023
50468 1957023 1846863 1748186 1660337 1582303 1512992 1451413 1396780 1348535 1306299 1269757 1238533
50457 1238533 1212107 1189919 1171567 1156819 1145354 1136661 1130392 1126754 1126266 1129012 1134251 1140841 1147977
50444 1147977 1155437 1163259 1171273 1178941 1185626 1191080 1195665 1200061 1204771 1209956 1215623 1221733 1228144 1234721
50430 1234721 1241603 1249181 1257755 1267451 1278585 1291818 1307715 1326316 1347373 1370853 1396923 1425630
50418 1425630 1456972 1491235 1528888 1570117 1614863 1663447 1716721 1775299 1838867 1906624 1978250
50407 1978250 2053977 2133633 2215941 2299003 2381258 2461684 2539125 2611821 2677780 2735559 2784458
50396 2784458 2823987 2853253 2870906 2875466 2865615 2840342 2799162 2742456 2671707 2589433 2498925 2403935
50384 2403935 2308316 2215593 2128657 2049800 1981028 1924226 1880844 1851376 1835216 1831101 1837658 1853463
50372 1853463 1876735 1905110 1935698 1965249 1990307 2007466 2013688 2006560 1984575 1947597 1897135 1835976
50360 1835976 1767248 1693850 1618483 1543701 1471485 1402832 1337992 1277069 1220233 1167547 1118928
50349 1118928 1074304 1033636 996819 963768 934533 909121 887215 868365 852469 839776 830355
50338 830355 823875 820053 819000 820814 825079 831152 838862 848547 860394 874067 889130 905505 923208
50325 923208 941657 959422 974641 985626 991238 991063 985583 976245 965223 954775 946393 940267 935475
50312 935475 930895 926145 921813 918857 917818 918460 920001 921642 923050 924426 926082 928046 930226 932869
50298 932869 936434 940867 945466 949879 954843 961323 969102 976992 984524 992621 1002221 1012972 1023849 1034590
50284 1034590 1045805 1057978 1071129 1085332 1100872 1117857 1136234 1155989 1176332 1194330 1205285
50273 1205285 1205502 1194816 1176376 1154397 1132311 1112240 1095061 1080731 1068948 1059674 1052712 1046977
50261 1046977 1040867 1033675 1026371 1020650 1017300 1015622 1014339 1012909 1011977 1012596 1015024 1018358 1021532 1024650
50247 1024650 1029099 1036330 1046732 1059794 1075065 1092662 1112954 1136180 1162498 1192169 1225355 1261742
50235 1261742 1300497 1340644 1381279 1421305 1459095 1492796 1521160 1544061 1562175 1576336 1587302
50224 1587302 1595887 1602915 1608731 1612639 1612718 1606332 1591258 1566776 1533777 1493758 1447853 1397109 1343465
50211 1343465 1289908 1239420 1193966 1154536 1121614 1095181 1074483 1058232 1044958 1032911 1019834
50200 1019834 1003544 983095 959258 933814 908506 884554 862571 842620 824476 808078 793568
50189 793568 780816 769225 758284 748067 738821 730213 721425 711993 702249 692839 684066 675773 667644
50176 667644 659552 651874 645438 640858 637775 635007 631675 628061 625187 623669 623129 622699 621964 621455 622182
50161 622182 624591 628082 631732 635455 640081 646229 653519 661186 669126 677966 688247 699882 712343
50148 712343 725044 737533 749546 760863 771054 779464 785705 790008 792909 794751 795829 796815 798592
50135 798592 801577 805656 810883 817981 828015 841826 859821 882020 908145 937887 971230 1008391
50123 1008391 1049514 1094734 1144676 1200445 1262770 1331168 1404023 1479246 1554803 1628895 1700060
50112 1700060 1767187 1829542 1886986 1940258 1990694 2039354 2086348 2130809 2170924 2203638 2224811
50101 2224811 2230540 2218753 2189658 2144967 2087132 2019111 1944123 1865020 1783931 1702620 1623017
50090 1623017 1547197 1476891 1413216 1356895 1308501 1268259 1235630 1209267 1187614 1169534 1154319
50079 1154319 1141236 1129432 1118326 1107835 1097978 1088452 1078851 1069168 1059831 1051238 1043407 1036052 1028762
50066 1028762 1021069 1012550 1003016 992614 981729 970768 959979 949380 938872 928432 918165 908243
50054 908243 898907 890541 883535 877992 873789 870998 869973 870834 873137 876414 880816 886857 894581 903411
50040 903411 912807 922627 932765 942877 952685 962230 971528 980281 988203 995395 1002027 1007805 1012195 1015140
50026 1015140 1017177 1018789 1019982 1020615 1020769 1020517 1019537 1017309 1013686 1009073 1004062 999088 994390 990120 986416
50011 986416 983471 981487 980472 980250 980983 983669 989688 999717 1013389 1030217 1050550 1075350 1105320
49998 1105320 1140569 1180799 1225266 1272628 1321316 1370058 1417670 1462491 1502696 1537410 1567061
49987 1567061 1592528 1614345 1632790 1647895 1658667 1662580 1656489 1638101 1606485 1561737 1504911 1438300
49975 1438300 1365298 1289741 1215330 1145190 1081309 1024287 973963 930192 892713 860497 831963
49964 831963 806118 783125 763543 747350 733889 722493 712866 704978 698776 693964 690101 687030 685153
49951 685153 685024 686682 689682 693837 699546 707189 716469 726554 736690 746479 755667 763877 770605 775417
49937 775417 778239 779440 779502 778543 776154 771564 763886 752460 737379 719733 701036 682365 664286
49924 664286 647450 632665 620220 609634 600404 592625 586606 582234 579233 577777 578330 580887 584727
49911 584727 588933 592862 596137 598585 600396 602263 605150 609794 616270 623919 631875 639809 648162 657660
49897 657660 668746 681498 695758 710951 725890 739059 749220 755798 758932 759343 757922 755166 750993
49884 750993 745160 737635 728437 717498 705067 692002 679122 666365 653019 638763 624041 609492
49872 609492 595494 582427 570847 561154 553404 547600 543805 541783 540977 541093 542389 545083 548860 553322
49858 553322 558620 565136 572751 580967 589684 599325 610100 621569 633118 644551 656040 667682 679210
49845 679210 689978 699137 706073 710742 713509 714652 714232 712378 709354 705165 699427 691878 682875 673190
49831 673190 663414 653723 644090 634619 625701 617972 611957 607729 605070 604007 604828 607444 611188 615576
49817 615576 620939 627832 636141 645320 655273 666243 677889 689300 700107 710807 721585 731468 739288
49804 739288 745008 749471 753079 755369 755809 754450 751737 748098 743753 738565 732100 724123 714998 705282
49790 705282 694986 683654 671104 657690 643889 630120 617112 605873 597050 590582 586099 583236
49778 583236 581394 579683 577497 574894 572148 569322 566673 565134 565751 568644 572998 578117 584085 591206
49764 591206 599155 607094 614633 622358 631142 640880 650103 657050 661118 663094 664143 664850 665230 665083 663913
49749 663913 660814 654941 646242 635626 624474 613994 604779 596654 589021 581557 574580 568640 563981
49736 563981 560566 558353 557198 556581 555858 554868 554096 554219 555570 557931 560667 563183 565506 568339 572381
49721 572381 577746 584182 591504 599440 607426 615232 623703 634093 646415 658951 669646 677558 682791
49708 682791 685617 686202 684820 681854 677630 672539 667082 661489 655472 648693 641368 634062 627091 620470
49694 620470 614331 608941 604305 600063 595894 591803 588107 585377 584297 585137 587362 590165 593455 597950
49680 597950 604081 611275 618612 625939 633956 643393 654444 666906 680460 694713 709122 722943 735156
49667 735156 744606 750564 753281 753821 753308 752403 751417 750590 750147 750334 751582 754399 758679 762967 764657 761204
49651 761204 751467 736163 717294 697149 677591 659820 644393 631352 620510 611778 605158 600393
49639 600393 596840 593982 591938 591145 591535 592434 593304 594113 594793 594819 593780 591977 589895 587276 583346 577993
49623 577993 572165 566913 562491 558552 554801 551168 547632 544203 540919 537746 534701 532200 530921 531050
49609 531050 531908 532618 532887 532940 533004 533307 534316 536400 539246 542004 544046 545252 545702 545611 545667 546830 549385
49592 549385 552516 555095 556759 558003 559435 561244 563246 565085 566371 566925 567058 567411 568384 569795 571245
49577 571245 572812 575102 578446 582179 585088 586708 587914 589971 593284 597427 602229 608224 615823 624570
49563 624570 633611 642616 651777 661003 669602 676830 682375 686136 687898 687547 685423 682039 677484 671519
49549 671519 664444 657496 652011 648317 645774 643848 642726 642798 643936 645650 647731 650318 653312 656089 657983
49534 657983 658968 659738 661140 663616 667250 672252 679176 688455 699818 712450 725771 739832 754887
49521 754887 770919 787669 804696 821041 835171 845847 853019 857543 860270 861901 863547 866540 871407
49508 871407 877629 884764 893266 903608 914963 925347 932938 936676 935577 928327 914108 893728 869561
49495 869561 844370 820283 798620 780056 764630 751802 740934 731786 724328 718206 712843 708189
49483 708189 704847 703095 702173 701032 699535 698313 697649 697276 697309 698482 701037 704025 706290 707774 709273
49468 709273 711233 713394 715467 717606 720079 722887 725792 728508 730875 733037 735352 737908 740316 742232
49454 742232 743835 745300 746043 745063 742055 737588 732150 725624 718000 709958 702343 695405 688964 683055 677956
49439 677956 673837 670735 668724 667728 667418 667724 669269 672787 678226 684963 692844 702359 713686 726333
49425 726333 740143 756116 775640 799193 826174 855732 887435 921499 958739 999300 1039982
49414 1039982 1072933 1088949 1083735 1061044 1029457 996602 966638 941714 923532 912904 909089 910696
49402 910696 916963 927615 941749 957498 972897 986806 998994 1009566 1018412 1025221 1030043 1033700
49390 1033700 1037316 1041293 1044972 1047381 1048058 1046970 1043962 1038760 1031399 1022288 1011741 999764 986480
49377 986480 972606 959284 947409 937180 928391 921090 915789 912916 912171 912644 913591 914933 916995 919954
49363 919954 923582 927277 930255 931951 932426 932241 931815 931008 929331 926316 921643 915350 908224 901599 896287
49348 896287 891868 887461 883123 879934 878741 879273 880646 882253 883833 885124 885960 886589 887334 887828 886978 883981
49332 883981 879215 873856 868774 864126 859992 856854 855069 854207 853454 852650 852434 853295 854921 856711 858510
49317 858510 860605 863301 866877 871623 877528 884092 890815 897684 904802 911705 917648 922595 927448 933148
49303 933148 939910 947501 955916 965443 976282 988284 1001029 1014020 1026931 1039787 1052898 1066615
49291 1066615 1081187 1096534 1111670 1124237 1131207 1130574 1122605 1109448 1093831 1078106 1063959 1052166
49279 1052166 1042346 1033273 1023838 1013767 1003458 993368 983812 975247 968317 963384 960174 958126 957038
49266 957038 957083 958253 960142 962447 965388 969369 974341 979732 984996 990108 995650 1002448 1010979 1021059
49252 1021059 1032385 1045440 1061359 1080529 1101742 1123285 1144417 1164837 1182594 1193702 1194609 1184885
49240 1184885 1167117 1144563 1119403 1092950 1066591 1041969 1020386 1002325 987620 975995 967441
49229 967441 962108 959904 960280 962421 965641 969585 974088 978955 984015 989433 995698 1003047 1011022 1018968
49215 1018968 1026908 1035382 1044395 1053242 1061766 1071085 1082234 1094556 1106369 1117106 1127823 1139455
49203 1139455 1151617 1163577 1175588 1188584 1202947 1218291 1234176 1250410 1266633 1282106 1296147
49192 1296147 1308681 1320267 1331526 1342467 1352506 1361322 1369498 1377913 1386661 1395193 1403465 1412185 1421739
49179 1421739 1431733 1442134 1454231 1469748 1489407 1512943 1540096 1570808 1604696 1641303 1681071
49168 1681071 1725367 1775064 1829027 1883697 1933705 1973114 1997200 2004156 1995784 1976807 1953257 1930599
49156 1930599 1912293 1899607 1892586 1890950 1894037 1900528 1908879 1917937 1926792 1934380 1939897 1943573 1946506
49143 1946506 1949734 1953904 1959692 1967825 1978416 1990714 2003761 2017095 2030795 2045233 2060858 2077874
49131 2077874 2095963 2114575 2133503 2152888 2172707 2192654 2212542 2232437 2252327 2271969 2291172
49120 2291172 2309973 2328540 2347258 2366793 2387647 2409659 2432478 2456548 2483140 2513301 2547319
49109 2547319 2585361 2628077 2676406 2731420 2794790 2868882 2955521 3053910 3159010 3261817 3352954
49098 3352954 3428819 3495056 3561542 3630880 3691271 3722439 3710304 3657106 3578677 3492803 3409021
49087 3409021 3326577 3239793 3145205 3045036 2945553 2853211 2772188 2704278 2649613 2607176 2575211
49076 2575211 2551595 2533999 2520177 2508726 2499509 2492866 2488394 2484891 2481283 2476981 2471495 2464579 2456950
49063 2456950 2450016 2444378 2439180 2433483 2427741 2423263 2420517 2418721 2417043 2415481 2414318 2413298 2411824 2409788
49049 2409788 2407756 2406237 2405062 2403784 2402560 2402271 2403565 2406067 2408838 2411500 2414577 2418847 2424807 2432766
49035 2432766 2442951 2455225 2468943 2483308 2497633 2511083 2522547 2531105 2536570 2539405 2540279 2539866 2538801
49022 2538801 2537497 2535993 2534177 2532061 2529826 2527894 2527140 2528648 2532744 2538464 2544376 2549916 2555594 2562076
49008 2562076 2569610 2578336 2588487 2599949 2611937 2623539 2634435 2644825 2654752 2663731 2671120 2676704
48996 2676704 2680875 2684204 2686883 2688591 2688875 2687448 2684129 2678837 2671927 2664269 2656535 2648610 2640182 2631783
48982 2631783 2624533 2618697 2613251 2607273 2601211 2596215 2592662 2590083 2588349 2588103 2589830 2593046 2596698 2600042
48968 2600042 2602895 2605254 2607068 2608396 2609633 2611431 2614213 2617746 2621360 2624772 2628498 2633231 2638979 2645156
48954 2645156 2651468 2658327 2666369 2675933 2687166 2700318 2715682 2733361 2753331 2775705 2800783 2828759
48942 2828759 2859334 2891702 2925137 2959711 2996138 3034688 3074568 3114870 3155984 3199491 3246588
48931 3246588 3297195 3350702 3406973 3466163 3527920 3591302 3655451 3720123 3785642 3852490 3920740
48920 3920740 3989792 4058839 4127603 4196273 4264723 4332352 4398891 4464622 4529312 4591498 4649647
48909 4649647 4703727 4754932 4804001 4850608 4894398 4935788 4975481 5013729 5050314 5084818 5116676
48898 5116676 5145422 5171147 5194416 5215443 5233712 5248671 5260512 5269955 5277441 5282795 5285525 5285091
48886 5285091 5280980 5272839 5260611 5244408 5224271 5200110 5171866 5139619 5103589 5064187 5022121 4978344
48874 4978344 4933644 4888078 4840777 4790488 4736370 4678278 4616459 4551349 4483690 4414404 4344144
48863 4344144 4273339 4202915 4134484 4069295 4007341 3948040 3891540 3838751 3790274 3746042 3705982
48852 3705982 3670276 3638817 3611010 3586309 3564492 3545284 3528277 3513375 3500871 3491039 3484146 3480864
48840 3480864 3481939 3487238 3495823 3507075 3520937 3536855 3553588 3570709 3589361 3610619 3633798 3657303
48828 3657303 3680583 3704243 3728644 3753487 3778607 3804128 3829858 3855416 3880956 3906911 3933036
48817 3933036 3958695 3984227 4010932 4039190 4067471 4093897 4118320 4142273 4167290 4193814 4221458
48806 4221458 4249603 4277697 4305466 4333128 4361312 4390646 4421344 4453148 4485616 4518432 4551333
48795 4551333 4583812 4615269 4645667 4675718 4705938 4735681 4763429 4787944 4808834 4826322 4840985
48784 4840985 4853621 4864717 4873914 4880339 4883303 4882196 4875797 4862484 4841277 4812219 4775723 4732311
48772 4732311 4683147 4629966 4573990 4515423 4454351 4391519 4327738 4263124 4197584 4131670 4066264
48761 4066264 4001630 3937389 3873374 3810042 3748128 3688399 3631701 3578768 3529770 3484281 3441792
48750 3441792 3402171 3365667 3332632 3303195 3277135 3254114 3234079 3217190 3203306 3191858 3182465
48739 3182465 3175420 3171292 3170180 3171588 3174876 3179589 3185394 3191909 3198561 3204641 3209610 3213364 3215966 3217247
48725 3217247 3217174 3216598 3216973 3218943 3221714 3224144 3225922 3227223 3227833 3227424 3226318 3225195 3224132 3222671 3220739
48710 3220739 3218750 3216786 3214385 3211348 3208112 3205133 3202426 3199938 3197895 3196431 3195254 3193896 3192065 3189693
48696 3189693 3187071 3185096 3184837 3186570 3189574 3193238 3197915 3204304 3212235 3220569 3228125 3234324 3239037 3242333
48682 3242333 3244458 3245726 3246240 3245878 3244683 3243134 3241921 3241416 3241308 3240607 3237994 3232318 3222950 3209827 3193276
48667 3193276 3173849 3152188 3128893 3104332 3078594 3051647 3023626 2994912 2965883 2936651 2907157
48656 2907157 2877434 2847427 2816429 2782997 2745775 2704448 2659856 2613449 2566950 2522202 2480722
48645 2480722 2443137 2409283 2378891 2351884 2327956 2306160 2285160 2263757 2241184 2217248 2192378
48634 2192378 2167328 2142635 2118443 2094916 2072507 2051650 2032347 2014269 1997019 1980122 1962948
48623 1962948 1945002 1926234 1906896 1887257 1867784 1849412 1833149 1819199 1806845 1795423 1785280
48612 1785280 1777561 1773119 1771802 1772673 1774712 1777317 1780345 1783852 1787713 1791418 1794196 1795461 1795203 1793974
48598 1793974 1792496 1791269 1790518 1790381 1790981 1792222 1793637 1794630 1794889 1794371 1792712 1788865 1781636 1770717 1757013
48583 1757013 1741938 1726615 1711765 1697929 1685318 1673598 1662253 1651265 1641164 1632370 1624851 1618520
48571 1618520 1613683 1610846 1610199 1611441 1614008 1617483 1621963 1627994 1635885 1645017 1654155 1662473 1669848 1676006
48557 1676006 1679893 1680300 1676733 1669284 1658045 1643343 1626460 1609449 1594008 1580780 1569620 1560075
48545 1560075 1551493 1543108 1534286 1524554 1513412 1500403 1485515 1469324 1452648 1436148 1420257 1405272
48533 1405272 1391458 1379087 1368272 1358730 1350033 1342352 1336605 1333405 1332154 1331781 1332219 1334433 1339010 1345495
48519 1345495 1353190 1361635 1369630 1374501 1373268 1364652 1349775 1331252 1312005 1294479 1280097 1269180
48507 1269180 1261604 1257482 1256979 1259787 1265275 1273182 1283662 1296587 1311226 1326684 1342337 1357612 1371694
48494 1371694 1383591 1392276 1396495 1394827 1386542 1372588 1355511 1338145 1322220 1308058 1295182 1282954
48482 1282954 1270767 1258066 1244575 1230590 1216872 1204144 1192647 1182207 1172698 1164381 1157684 1152610
48470 1152610 1148510 1144607 1140723 1137361 1135058 1133827 1133321 1133369 1134231 1136350 1139893 1144460 1149306 1154002 1158895
48455 1158895 1164685 1171534 1178812 1185691 1191590 1196002 1198346 1198346 1196300 1192719 1188024 1182708 1177374 1172220 1166919
48440 1166919 1161387 1156213 1151785 1147323 1141420 1133347 1123320 1111826 1099420 1086948 1075146 1064001
48428 1064001 1053243 1043364 1035287 1028979 1023261 1017274 1011366 1006240 1001892 997772 993414 988556 983149 977613
48414 977613 972580 968063 963311 957826 952069 946824 942321 938330 934701 931394 928328 925570 923426 922017
48400 922017 921022 919997 918707 917023 914862 912374 909830 907185 904161 900780 897274 893377 888393 882245
48386 882245 875816 869969 864759 859908 855414 851308 847433 843869 841064 839130 837549 835913 834378 832994
48372 832994 831265 828906 826403 824297 822470 820641 818989 817697 816417 814801 812995 811054 808484 805097
48358 805097 801832 799964 799801 800682 801793 802437 802070 800802 799391 798186 796649 794542 792886 792865 794371 796546
48342 796546 799228 802856 807348 812173 817353 823451 830640 838550 846956 856002 865941 877142 890067 904757
48328 904757 920747 937846 956266 975308 992675 1005936 1014305 1018567 1020220 1021346 1024172 1029569 1036613
48315 1036613 1044512 1054002 1065931 1079670 1094223 1109969 1127984 1148704 1172564 1200842 1234337 1272408
48303 1272408 1314951 1364214 1422930 1492017 1572080 1665952 1777678 1910339 2066972 2252043
48293 2252043 2469562 2721553 3011482 3348125 3744160 4214078 4776966 5457633 6278984
48284 6278984 7254453 8391520 9698444 11182434 12847737 14699436 16721829 18803704
48276 18803704 20665908 21904270 22174128 21383530 19731309 17574497 15258046 13026689
48268 13026689 11022033 9306529 7884997 6728269 5796514 5050589 4453330 3971871 3581408
48259 3581408 3263786 3003244 2786293 2603938 2450213 2318993 2204565 2103963 2015862 1938014
48249 1938014 1868031 1805582 1751213 1703681 1660680 1621444 1586514 1555551 1527413 1501801 1478933
48238 1478933 1458108 1438417 1420395 1405226 1392719 1381634 1371526 1362675 1354678 1346739 1338994 1332031
48226 1332031 1325469 1318549 1311745 1306085 1300965 1294103 1283602 1268718 1248837 1223444 1193470 1161439
48214 1161439 1129844 1100080 1072738 1047831 1024649 1002456 981413 961965 943482 924611 904980
48203 904980 885527 867035 849355 832231 815898 800563 786164 772828 760815 749813 739048
48192 739048 728370 718552 710273 703391 697381 691917 686824 682006 677613 673867 670625 667539 664673 662465
48178 662465 661022 659864 658432 656461 653960 651296 649261 648566 649182 650492 651922 653051 653377 652618 651220
48163 651220 650058 649668 650121 651335 652888 653846 653533 652388 651378 650719 649981 649320 649563 650870 652270 652913
48147 652913 653021 653224 653630 654058 654609 655410 656139 656339 656038 655692 655665 656028 656704 657551 658435 659362 660465 661812
48129 661812 663284 664669 665778 666647 667758 669810 672923 676317 679239 681988 685459 689799 694267 698474
48115 698474 703021 708595 715096 722012 729178 736738 744741 753197 762305 772299 783269 795362 808852
48102 808852 823679 839148 854499 869708 885447 902240 919858 937536 954711 971540 988715
48091 988715 1006603 1024590 1041497 1056713 1070679 1084163 1097428 1110422 1123400 1136795 1150433
48080 1150433 1163349 1174674 1184435 1193238 1201415 1208879 1215678 1222070 1227894 1232448 1235531 1238224 1241952
48067 1241952 1246905 1252121 1257067 1262352 1268570 1275328 1281979 1288605 1295557 1302391 1308051 1311911 1313928 1313944
48053 1313944 1311534 1306637 1299760 1291476 1282088 1271672 1259969 1246277 1230087 1211942 1193181 1174653
48041 1174653 1156092 1136881 1116994 1096911 1076928 1056868 1036393 1015460 994395 973483 952502
48030 952502 931013 909281 888505 869716 852763 836837 821694 807696 794809 782296 769534
48019 769534 756538 743598 730902 718682 707234 696619 686722 677660 669738 662953 657003 651777 647341
48006 647341 643410 639442 635406 631924 629496 628079 627539 627886 628772 629439 629586 629829 630881 632697 634795 636982
47990 636982 639273 641445 643172 644357 644919 644525 643070 641246 640141 640214 640962 641521 641280 640043 637999 635674
47974 635674 633647 632135 630911 629609 628043 626297 624567 622902 621052 618696 615885 613172 611222 610329
47960 610329 610283 610664 611193 611926 613076 614692 616620 618853 621697 625445 630087 635504 641628 648097 654205
47945 654205 659734 665623 673126 682366 692300 702110 711921 722103 732502 742622 751999 760182 766922
47932 766922 772705 778566 785000 791365 796567 799994 801665 801928 801277 799958 797542 793313 787300 780414 773300
47917 773300 765682 757169 748116 739182 730569 722232 714286 706608 698468 689388 680113 672055 665849 661044
47903 661044 657059 653805 651406 649940 649615 650680 652943 655709 658417 661213 664816 669838 676244 683413
47889 683413 690816 698578 707151 716435 725620 734076 741976 749798 757621 765243 772615 779762 786581 793126
47875 793126 799775 806550 812501 816346 817719 817364 816128 814133 810913 806022 799498 791953 784154 776328
47861 776328 767957 758456 747874 736794 725719 714800 703948 693041 682334 672783 665465 660306
47849 660306 655796 650479 644436 638913 634874 632444 631347 631151 631267 631447 632219 634237 637250 640256 642656
47834 642656 644709 646923 649595 652899 656802 660803 664248 667025 669538 672067 674583 677121 679718 682013
47820 682013 683551 684548 685781 687551 689352 690764 692169 694384 697972 703142 709863 717935 727305 738449
47806 738449 752076 768382 787079 808085 831496 856644 881906 905919 928502 949927 969704
47795 969704 986646 999897 1009446 1015763 1019261 1020016 1017708 1012027 1003364 992963 982128 971454 960902
47782 960902 950334 939680 928899 918227 908321 899784 892515 885788 878983 872020 865123 858470 852154
47769 852154 846289 840948 835944 830838 825290 819454 813873 808921 804508 800512 797199 794884 793343 792017
47755 792017 790724 789712 788969 788066 786891 785999 785833 785983 785778 785396 785911 788200 792184 797236 803029 809793
47739 809793 817896 827370 837922 849314 861593 874905 889157 903985 919048 934197 949336 964190
47727 964190 978224 990772 1001329 1009804 1016399 1021184 1023976 1024709 1023665 1021027 1016443 1009438 1000204 989559
47713 989559 978110 965801 952345 937770 922428 906782 891301 876328 861937 848129 835232
47702 835232 823884 814521 807053 801101 796381 792881 790842 790544 791938 794585 798181 802959 809269 816944
47688 816944 825585 835354 846896 860381 875125 890321 905700 921210 936481 950921 964161 976210
47676 976210 987351 997850 1007495 1015452 1020976 1024333 1026579 1028353 1029241 1028365 1025162 1019500 1011546 1001708
47662 1001708 990344 977510 963368 948725 934379 919957 904313 887355 870580 855371 841644
47651 841644 828731 816706 806003 796510 788026 781117 776424 773449 771085 769196 768649 769826 772072 774726
47637 774726 777851 781741 786527 792474 799851 808148 816149 823235 830131 837979 847284 858233 871453 887615
47623 887615 906427 926775 947983 970519 995252 1022280 1050608 1078758 1105465 1129929 1151665
47612 1151665 1170318 1185581 1197091 1204276 1206307 1202330 1191823 1174861 1152100 1124518 1093042 1058412
47600 1058412 1021469 983442 945680 909093 874029 840736 809540 780485 753179 727415 703712
47589 703712 682891 665202 650118 636926 625271 615121 606410 598742 591511 584472 578184 573527 570612
47576 570612 568473 566055 563225 560544 558465 557093 556376 556007 555367 554076 552487 551171 550045 548488 546240
47561 546240 543676 541276 539304 537987 537326 536704 535288 533123 531276 530584 530688 530647 530157 529715 529783 530220 530525
47544 530525 530324 529593 528577 527565 526721 526127 525945 526361 527298 528308 528872 528797 528255 527519 526672 525594 524222
47527 524222 522854 522100 522429 523728 525373 526777 527920 529426 531962 535370 538502 540207 540496 540312 540096
47512 540096 539196 536993 534065 531685 530475 530119 530113 530137 529780 528654 526920 525272 524258 523978 524382 525350 526352
47495 526352 526536 525466 523530 521531 520120 519646 520168 521400 522847 524142 525148 525857 526499 527649 529821
47480 529821 532894 536237 539385 542285 544963 547432 549921 552674 555402 557462 558796 560249 562672 565989
47466 565989 569346 571877 573254 573813 574271 575024 575720 575879 575818 576279 577091 577040 575505 573538 572739 573530 575131
47449 575131 576812 578565 580822 584178 589239 596163 604353 613047 622188 632395 644290 658206 674289
47436 674289 692302 711464 731153 751813 774566 799708 826106 852299 877718 902436 926073
47425 926073 947528 965796 980632 992245 1000603 1005339 1006254 1003571 997534 988062 975138 959425 942040
47412 942040 923658 904268 884035 864000 845460 828772 813206 798033 783491 770522 759695
47401 759695 750567 742183 734052 726476 719968 714757 711021 709114 708952 709489 709607 709512 710538 713451 717809
47386 717809 723218 730207 739177 749291 759265 768769 778117 787005 794669 801211 807728 814824 821752 827261
47372 827261 830687 831984 831288 828825 824934 819832 813562 806162 797625 787712 776219 763494 750303 737167
47358 737167 724174 711343 698587 685374 671116 656126 641523 627986 615235 603067 592122
47347 592122 583019 575331 568133 561248 555258 550516 546840 544056 542152 540850 539637 538363 537426 537244 537880
47332 537880 539242 541266 543773 546463 549208 552194 555694 559875 564755 570035 575003 579034 582259 585399
47318 585399 588741 591670 593489 594360 595055 595907 596381 595677 593504 590272 586754 583599 581026 578853 576870
47303 576870 575130 573827 572947 572210 571450 571027 571789 574481 579058 584634 590279 595852 601889 608727 616115
47288 616115 623762 631827 640503 649476 658289 667049 676202 685686 694892 703520 711860 720063 727707 734496
47274 734496 740835 747204 753347 758690 763275 767656 771915 775448 777745 778826 778796 777555 775250 772552 770088
47259 770088 767798 765162 761917 758306 754773 751637 748966 746603 744420 742699 742183 743620 747278 752958
47245 752958 760242 768546 776937 784081 788440 788761 784749 777429 768626 759908 752081 745622 741189 739328
47231 739328 739900 742163 745496 749873 755720 763444 773012 783843 795124 806338 817404 828249 838465
47218 838465 847579 855528 862599 868890 874017 877385 878684 878134 876271 873408 869253 863249 855341 846212
47204 846212 836656 826939 816980 806934 797345 788810 781698 776052 771590 767958 765165 763634 763623 764878
47190 764878 767093 770495 775620 782642 791257 801110 811981 823647 835984 849193 863637 879491 896804
47177 896804 915717 936170 957489 978774 999754 1020745 1041679 1061689 1079862 1095969 1110163
47166 1110163 1122339 1132191 1139629 1144768 1147604 1147976 1145824 1141323 1134847 1126889 1117893 1108037 1097257 1085597
47152 1085597 1073402 1061128 1049123 1037658 1026926 1016894 1007353 998279 990030 983049 977502 973328
47140 973328 970486 968977 968756 969764 972005 975439 979877 985001 990483 996071 1001685 1007444 1013388 1019143
47126 1019143 1023953 1027094 1028135 1026876 1023317 1017759 1010646 1002216 992485 981622 970059 958112 945740
47113 945740 932831 919510 906074 892871 880301 868634 857683 846967 836325 826081 816474 807365
47101 807365 798664 790558 783002 775479 767762 760454 754204 748761 743507 738649 735081 733098 732075 731506
47087 731506 731648 732866 735024 737866 741461 745806 750399 754660 758612 762741 767387 772543 778009 783431
47073 783431 788347 792472 795828 798371 799814 800158 800072 800238 800410 799789 798345 797154 797068 797611 797647 796950 796539
47056 796539 797501 799916 803139 806757 810953 816035 821966 828460 835322 842546 850120 857881 865631 873318
47042 873318 881025 888807 896551 904056 911212 918123 925108 932571 940790 949676 958696 967175 974818 982009
47028 982009 989513 997840 1006867 1015964 1024422 1031755 1037766 1042456 1045919 1048270 1049548 1049544 1047769 1043801 1037883
47013 1037883 1031134 1024879 1019694 1015137 1010348 1004766 998367 991553 984986 979294 974740 971221 968666 967183
46999 967183 966710 966784 967003 967619 969377 972716 977359 982666 988189 993858 999822 1006215 1013025 1020205 1027926
46984 1027926 1036549 1046188 1056471 1066992 1077843 1089328 1101259 1113093 1124812 1137143 1150579 1164623
46972 1164623 1178447 1191906 1205328 1218511 1230633 1241268 1250832 1259732 1267553 1273595 1277895 1281168
46960 1281168 1283842 1285674 1286412 1286317 1285788 1284893 1283685 1282716 1282741 1283919 1285738 1287772 1290116 1292997 1296427 1300514
46944 1300514 1305713 1312316 1319869 1327574 1335187 1343102 1351552 1360236 1368909 1377912 1387744 1398287 1408868
46931 1408868 1419040 1429018 1439217 1449491 1458994 1466830 1472814 1477400 1480751 1482085 1480289 1475071 1467053
46918 1467053 1456666 1443580 1427695 1410188 1392817 1376292 1360045 1343691 1327941 1313634 1300583
46907 1300583 1288155 1276714 1267626 1261718 1258431 1256861 1257111 1260120 1266452 1275811 1287662 1301799 1318196
46894 1318196 1336773 1357487 1380307 1404793 1429982 1455047 1479926 1504970 1530033 1554295 1576911
46883 1576911 1597501 1615879 1631735 1644842 1655402 1663958 1671034 1676974 1681945 1685946 1689030 1691667 1694746
46870 1694746 1698916 1704032 1709529 1715244 1721634 1729297 1738669 1750124 1763849 1779376 1795674 1812020 1828488
46857 1828488 1845245 1861738 1877105 1891238 1904741 1917671 1928929 1937339 1942943 1946756 1949376 1950328
46845 1950328 1948817 1944682 1938471 1930896 1922456 1913422 1903950 1894239 1884730 1876080 1868820 1863045 1858609 1855568
46831 1855568 1854323 1855289 1858496 1863508 1869707 1876769 1884986 1895020 1907207 1921093 1935820 1950843 1966042
46818 1966042 1981109 1995203 2007460 2017661 2026132 2033017 2037942 2040332 2039914 2036895 2031856 2025523 2018454
46805 2018454 2010753 2002171 1992550 1982098 1971120 1959639 1947488 1934850 1922470 1911186 1901224 1892169
46793 1892169 1883576 1875494 1868255 1861967 1856500 1851923 1848623 1846816 1846263 1846695 1848314 1851481 1856024 1861224
46779 1861224 1866492 1871687 1876745 1881494 1886063 1891030 1896749 1902759 1908286 1913212 1918138 1923613 1929774 1936770
46765 1936770 1944964 1954479 1964919 1975881 1987530 2000347 2014448 2029466 2045099 2061478 2078904 2097331
46753 2097331 2116196 2134724 2152404 2169155 2185050 2200016 2213962 2227061 2239528 2251014 2260596
46742 2260596 2267638 2272408 2275594 2277445 2277800 2276795 2275051 2273142 2271318 2269867 2269329 2270022 2271621 2273568 2275805
46727 2275805 2278828 2283041 2288290 2294086 2300141 2306502 2313230 2320051 2326464 2332106 2336819 2340284 2341865 2341082
46713 2341082 2338112 2333422 2326903 2317743 2305330 2290061 2273061 2255226 2236597 2216468 2194033 2169165
46701 2169165 2142740 2115978 2089325 2062236 2034187 2005533 1977062 1949051 1921277 1893793 1867137
46690 1867137 1841739 1817603 1794731 1773412 1753870 1735909 1719112 1703246 1688310 1674420 1661807
46679 1661807 1650681 1640891 1631877 1623241 1615217 1608397 1603026 1598808 1595350 1592558 1590563 1589477 1589394 1590541
46665 1590541 1593303 1598009 1604695 1613044 1622587 1632969 1643967 1655319 1666642 1677585 1688016 1697978
46653 1697978 1707443 1716083 1723297 1728495 1731506 1732694 1732612 1731565 1729617 1726985 1724224 1721977 1720678 1720595 1722041
46638 1722041 1725472 1731395 1740211 1751995 1766406 1782959 1801447 1821975 1844564 1868896 1894389 1920189
46626 1920189 1945064 1967721 1987526 2004572 2018782 2029285 2035128 2036336 2033713 2027695 2017995 2004392
46614 2004392 1987340 1967682 1946213 1923647 1900474 1876542 1851268 1824649 1797825 1772296 1748834
46603 1748834 1727454 1708022 1690377 1674067 1658615 1644156 1631321 1620337 1610541 1600940 1590976 1580732
46591 1580732 1570712 1561584 1553803 1547160 1540849 1534188 1527181 1520189 1513202 1505748 1497544 1488968 1480731 1473142
46577 1473142 1465936 1458837 1452170 1446726 1442979 1440602 1438882 1437489 1436640 1436546 1437010 1437680 1438485 1439568 1440860
46562 1440860 1441998 1442783 1443580 1445022 1447298 1449937 1452438 1455053 1458657 1463828 1470244 1477097 1483843 1490373
46548 1490373 1496702 1502928 1509474 1517023 1526076 1536655 1548389 1560651 1572785 1584657 1597064 1611186
46536 1611186 1627438 1645205 1663837 1683523 1704826 1727765 1751883 1777088 1803860 1832581 1863041
46525 1863041 1894687 1927020 1959630 1992122 2024230 2055867 2086976 2117348 2146578 2174081 2199270
46514 2199270 2221934 2242400 2260983 2277250 2290150 2299047 2304421 2307412 2308953 2309459 2308984 2307294 2303987
46501 2303987 2299014 2293085 2287181 2281557 2275543 2268466 2260506 2252392 2244401 2235939 2226094 2214378 2200939
46488 2200939 2186208 2170375 2153034 2133307 2110558 2085108 2058052 2030161 2001123 1970070 1936724
46477 1936724 1901678 1865712 1829307 1792940 1757362 1723209 1690601 1659433 1629926 1602658 1578218
46466 1578218 1557078 1539543 1525494 1514309 1505494 1499346 1496632 1497670 1502130 1509693 1520389 1534117
$$ [...]
##END NTUPLES=NMR SPECTRUM
##END=
