
##TITLE=AC1405_GUAAH12214_7652929_W1vMAXHEe5
##JCAMPDX= 6.0         $$ Bruker NMR JCAMP-DX V2.0
##DATA TYPE= nD NMR SPECTRUM
##DATA CLASS= NTUPLES
##NUM DIM= 2
##ORIGIN= BRUKER
##OWNER= Administrator
$$ 1.72 TOPSPIN		Version 2.1
$$ 2013-03-19 23:07:43.303 -0500  Administrator@X
$$ Compression mode = diff/dup
##.OBSERVE FREQUENCY= 400.02188249412
##.OBSERVE NUCLEUS= ^1H
##.ACQUISITION MODE= SIMULTANEOUS (DQD)
##.ACQUISITION SCHEME= NOT PHASE SENSITIVE
##.AVERAGES= 4
##.DIGITISER RES= 22
##SPECTROMETER/DATA SYSTEM= spect
##.PULSE SEQUENCE= jresgppsqf.2
##.SOLVENT NAME= COFFEE_meoh
##.SHIFT REFERENCE= INTERNAL, COFFEE_meoh, 1, 14.96098
##AUDIT TRAIL= $$ (NUMBER, WHEN, WHO, WHERE, PROCESS, VERSION, WHAT)
$$ ##TITLE= Audit trail, TOPSPIN		Version 2.1
$$ ##JCAMPDX= 5.01
$$ ##ORIGIN= Bruker BioSpin GmbH
$$ ##OWNER= Administrator
$$ $$ E:\/data/COFFEE/nmr/AC1405_GUAAH12214_7652929_W1vMAXHEe5/13/pdata/1/auditp.txt
$$ ##AUDIT TRAIL=  $$ (NUMBER, WHEN, WHO, WHERE, PROCESS, VERSION, WHAT)
(   1,<2013-03-19 23:07:33.678 -0500>,<Administrator>,<X>,<go>,<TOPSPIN 2.1>,
      <created by zg
	started at 2013-03-19 22:53:10.397 -0500,
	POWCHK enabled, PULCHK disabled,
       configuration hash MD5:
       86 BA 57 50 F2 9D 5C 9B 26 00 A9 28 5F 66 2E 89
       data hash MD5: 8K * 40
       38 A6 6B 12 94 BA 5D 89 E8 7F C0 C6 26 1F 15 1C>)
(   2,<2013-03-19 23:07:38.053 -0500>,<Administrator>,<X>,<proc2d>,<TOPSPIN 2.1>,
      <Start of raw data processing
       xfb same F2: SI = 16K WDW = 3 SSB = 0 FT_mod = 6 PKNL = 1 F1: SI = 512 WDW = 3 SSB = 0 FT_mod = 6 PH_mod = 2
       data hash MD5: 16K * 512
       27 66 9C 45 9F B7 AE 08 E7 BC F6 D5 00 E3 80 83>)
(   3,<2013-03-19 23:07:39.506 -0500>,<Administrator>,<X>,<proc2d>,<TOPSPIN 2.1>,
      <abs2 F2: ABSG = 5 ABSF1 = 10.00087 ABSF2 = 0.0003355524
       data hash MD5: 16K * 512
       C1 BF 55 C0 E2 1F 19 49 F0 10 08 CD 69 60 0A 73>)
(   4,<2013-03-19 23:07:40.194 -0500>,<Administrator>,<X>,<proc2d>,<TOPSPIN 2.1>,
      <tilt
       data hash MD5: 16K * 512
       FF CA 6F 0C 9B CD B1 CA A8 21 8E DE 73 18 ED 09>)
(   5,<2013-03-19 23:07:41.616 -0500>,<Administrator>,<X>,<proc2d>,<TOPSPIN 2.1>,
      <abs1 F1: ABSG = 5 ABSF1 = 0.06497851 ABSF2 = -0.06497862
       data hash MD5: 16K * 512
       F4 C5 F5 49 A1 78 26 A7 6D F5 B2 FD D0 46 3F 5B>)
(   6,<2013-03-19 23:07:42.881 -0500>,<Administrator>,<X>,<proc2d>,<TOPSPIN 2.1>,
      <symj
       data hash MD5: 16K * 512
       91 5C DD 33 7C F8 2E 6E 1C D6 EB ED 44 37 E0 B2>)
$$ ##END=
$$ 
$$ $$ hash MD5
$$ $$ DA 0B 29 2D 6E 2D 4B 58 55 67 A0 E7 A3 D9 96 36
##$RELAX= 
##$RELAX= 
##$RELAX= 
##$RELAX= 
##$RELAX= 
##$RELAX= 
##$RELAX= 
$$ Bruker specific parameters
$$ --------------------------
##$DU= <E:\>
##$EXPNO= 13
##$NAME= <AC1405_GUAAH12214_7652929_W1vMAXHEe5>
##$PROCNO= 1
##$TYPE= <nmr>
##$USER= <COFFEE>
##$ACQT0= 1000000
##$AMP= (0..31)
100 100 100 100 100 100 100 100 100 100 100 100 100 100 100 100 100 100
$$ [...]
##$TD0= 1
##$TE= 300
##$TE2= 300
##$TE3= 300
##$TEG= 300
##$TL= (0..7)
0 120 120 120 120 120 120 120
##$TP= (0..7)
150 150 150 150 150 150 150 150
##$TP07= 0
##$TPNAME0= <>
##$TPNAME1= <>
##$TPNAME2= <>
##$TPNAME3= <>
##$TPNAME4= <>
##$TPNAME5= <>
##$TPNAME6= <>
##$TPNAME7= <>
##$TPOAL= (0..7)
0.5 0.5 0.5 0.5 0.5 0.5 0.5 0.5
##$TPOFFS= (0..7)
0 0 0 0 0 0 0 0
##$TUNHIN= 0
##$TUNHOUT= 0
##$TUNXOUT= 0
##$USERA1= <user>
##$USERA2= <user>
##$USERA3= <user>
##$USERA4= <user>
##$USERA5= <user>
##$V9= 5
##$VALIST= <valist>
##$VCLIST= <CCCCCCCCCCCCCCC>
##$VD= 0
##$VDLIST= <DDDDDDDDDDDDDDD>
##$VPLIST= <PPPPPPPPPPPPPPP>
##$VTLIST= <TTTTTTTTTTTTTTT>
##$WBST= 2048
##$WBSW= 25
##$XGAIN= (0..3)
0 0 0 0
##$XL= 0
##$YL= 0
##$YMAX_a= 66847
##$YMIN_a= -125150
##$ZGOPTNS= <>
##$ZL1= 120
##$ZL2= 120
##$ZL3= 120
##$ZL4= 120
##$ABSF1= 0.06497851
##$ABSF2= -0.06497862
##$ABSG= 5
##$ABSL= 0
##$ALPHA= 0
##$AQORDER= 0
##$ASSFAC= 0
##$ASSFACI= 0
##$ASSFACX= 0
##$ASSWID= 0
##$AUNMP= <>
##$AXLEFT= 0
##$AXNAME= <F1>
##$AXNUC= <1H>
##$AXRIGHT= 0
##$AXTYPE= 0
##$AXUNIT= <>
##$AZFE= 0.1
##$AZFW= 0.5
##$BCFW= 0
##$BC_mod= 0
##$BYTORDP= 0
##$COROFFS= 0
##$CY= 15
##$DATMOD= 1
##$DC= 0
##$DFILT= <>
##$DTYPP= 0
##$F1P= 0
##$F2P= 0
##$FCOR= 0.5
##$FTSIZE= 512
##$FT_mod= 6
##$GAMMA= 0
##$GB= 0
##$INTBC= 1
##$INTSCL= 1
##$ISEN= 128
##$LB= 0
##$LEV0= 0
##$LPBIN= 0
##$MAXI= 10000
##$MC2= 0
##$MEAN= 0
##$ME_mod= 0
##$MI= 1
##$NCOEF= 0
##$NC_proc= -4
##$NLEV= 6
##$NOISF1= 0
##$NOISF2= 0
##$NSP= 0
##$NTH_PI= 0
##$NZP= 0
##$OFFSET= 0.06497851
##$PC= 4
##$PHC0= 0
##$PHC1= 0
##$PH_mod= 2
##$PKNL= no
##$PPARMOD= 1
##$PPDIAG= 0
##$PPIPTYP= 0
##$PPMPNUM= 2147483647
##$PPRESOL= 1
##$PSCAL= 1
##$PSIGN= 0
##$PYNMP= <proc.py>
##$REVERSE= no
##$SF= 400.021882494141
##$SI= 512
##$SIGF1= 0.06497851
##$SIGF2= -0.06497862
##$SINO= 16
##$SIOLD= 512
##$SPECTYP= <>
##$SREGLST= <1H.MeOD>
##$SSB= 0
##$STSI= 512
##$STSR= 0
##$SW_p= 51.9856959427865
##$SYMM= 3
##$S_DEV= 1357
##$TDeff= 40
##$TDoff= 0
##$TI= <>
##$TILT= yes
##$TM1= 0
##$TM2= 0
##$TOPLEV= 0
##$USERP1= <user>
##$USERP2= <user>
##$USERP3= <user>
##$USERP4= <user>
##$USERP5= <user>
##$WDW= 3
##$XDIM= 16
##$YMAX_p= 161068269
##$YMIN_p= 0
$$ End of Bruker specific parameters
$$ ---------------------------------
##NTUPLES= nD NMR SPECTRUM
##VAR_NAME=  FREQUENCY1,    FREQUENCY2,      SPECTRUM
##SYMBOL=    F1,            F2,              Y
##.NUCLEUS=  1H,            1H
##VAR_TYPE=  INDEPENDENT,   INDEPENDENT,     DEPENDENT
##VAR_FORM=  AFFN,          AFFN,            ASDF
##VAR_DIM=   512,           16384,           16384
##UNITS=     HZ,            HZ,              ARBITRARY UNITS
##FACTOR=    0.101534562388255, 0.501933850740131, 1
##FIRST=     25.9928259484165, 8223.18227667557, -674
##LAST=      -25.8913354319817, 0,           -733
##MIN=       -25.8913354319817, 0,           0
##MAX=       25.9928259484165, 8223.18227667557, 161068269
##PAGE= F1=25.99282594842
##FIRST=     25.9928259484165, 8223.18227667557, -674
##DATA TABLE= (F2++(Y..Y)), PROFILE
$$ [...]
$$ plain form
16072 -1479 -1707 -1670 -1220 -16 1044 1390 1339 1142 656 67 -335 -480 -172 389 464 38 -643 -1086 -1330 -1267 -843
16051 -843 -234 428 990 1318 1355 1207 811 829 1364 1921 1852 1373 727 522 515 541 361 26 -584 -1315 -847 928
16028 2360 3189 2233 899 -649 -1699 -2281 -2212 -1959 -2628 -1661 -283 502 466 -78 -821 -809 71 1058 1314 589 -582
16006 -926 -110 1485 2843 3604 1967 2823 3031 2399 -2063 -1712 -1051 107 936 4857 4307 1609 201 -647
15987 -1203 -1544 -1194 -785 -510 -204 -62 315 700 1128 1656 2369 2993 3403 3431 3402 3245 2707 2330 2012 1963 2063
15966 2063 1821 4548 4675 3875 1017 -2519 -4183 -4542 -5068 -2624 -2071 -1553 -260 35 0 -248 -329 -734 -979
15947 -979 -822 -547 -231 113 -258 -635 -787 -530 50 357 404 542 119 -432 -795 -530 -256 -54 -255 -365 -204
15926 -204 140 518 742 679 87 -44 94 247 395 496 361 355 546 484 269 43 2 55 255 221 73 17 105 213 249
$$ packed form
16072a479k28L7M50a6A044L46n1j97m86F7c35j45a72C89P5C8f43m43k44O3M24
16051h43b34D28N62L28L7j48l96J8N35N57o9m79o46k05pK6j80B6e84p31M68I28
16028B360Q29r56H99f49j050n82O9K53o69R67b83E02l6g8p43J2G1R87K56E89e82
16006i26a10A485J358P61j637Q56K08o32b063L51O61A07Q29L921n50A609B01f47
15987a203l41L50M09K75b04f2C15L85M28N28P13O24M10K8k9j57n38l77l18m9J00
15966B063k42K727J27q00A017b519j664l59n26K444N53N18b60C5@b48q1m05k45
15947i79J57K75b31A13b58l77j52K57E0L07M7J38A19d32l63K65b56e4k01j10J61
15926b04A40L78K24o3H7d4I4J53J48J01j35oJ91o2k15D3BN3K00l4G3A7Q8J08L6
$$ plain form
15901 249 -44 -618 -974 245 715 929 660 25 -824 -1151 375 1686 2283 2308 1282 -111 -897 375 1214 1532
15881 1532 1569 1507 1363 954 328 -495 -1160 -305 613 867 789 458 -170 -1040 -2112 -2791 -1714 -40 883 1122
15861 1122 761 295 115 158 342 337 113 -400 -1089 -1407 -1359 -1039 -602 -32 322 917 1468 1622 1223 710 473
15840 473 778 1054 1157 1101 893 902 923 1469 1480 1083 1418 1342 1168 977 351 -451 -923 -750 -235 423 1038 1623
15818 1623 2151 2358 2292 987 645 3172 4392 937 578 235 1 32 -438 -977 -448 155 248 -7 -30 -248 -126
15797 -126 -249 -661 -1115 -1260 -1435 -1500 -1383 -1327 -495 23 138 -117 -362 -379 -651 -136 195 252 -393 -1152 -1105 -402
15774 382 1031 1023 128 -997 -2295 -3718 -2232 -808 -94 -155 511 801 2744 3350 4184 4421 4545 3317 358
15754 -245 -648 -451 552 884 262 -507 -995 -1357 -1544 -1928 -939 196 1001 1300 1061 662 0 -601 -1219 -1869
$$ packed form
15901B49d4n74l56B45M70K14k69B5h24l27C75J311N97K5j026a11p86C75Q39L18
15881A532L7o2j44m09C28d95o65c05F13K54p8l31a70q70j072o79J077d0H83K39
15861A122l61B95A15M3J84nA13d00o89l18M8L20M37c2C22N95N51J54l99n13k37
15840D73L05K76J03n6k08RK1N46J1l97L35p6j74j91C51d51m72J73b35D23O15N85
15818A623N28K07o6I87l42K527J220I37l59B35AL1d38n39d48A55R3gk3k18J22
15797a26j23m12m54j45j75o5J17N6d95B3J15a17k45j7k72a36A95N7c93p59M7d02
15774C82O49qA28i97j298j423J486h08i4o1E11K90J943O06Q34K37J24j228C58
15754b45m03J97E52L32B62e07m88l62j87l84i39A96Q05K99k39l99@f01o18o50
$$ plain form
15734 -1869 -918 475 1521 2233 2598 2093 1725 1381 1766 2167 1938 1255 321 -258 -593 -447 -84 -149 -474 -781
15714 -781 -508 -512 -499 -584 -609 -589 -662 -886 -1650 -1324 -1560 -1866 -1228 1430 -1147 -1217 -3806 -2119 -2773 -4448 -3709
15693 -3709 -982 272 965 999 801 644 930 815 -2 -500 -653 -213 32 -54 -802 -1470 -2118 -2895 -3693 -3984 -4192
15672 -4192 -3767 -1771 -406 1091 2444 3570 3314 2239 1768 1172 681 -190 1725 999 88 -934 -2054
15655 -2054 -1156 -60 594 1056 925 821 1096 1571 1822 1249 -56 -1620 -2449 -1247 57 316 406 569 951 1435
15635 1435 1724 1913 2014 1882 1282 704 69 -482 -438 -524 -364 -455 -357 -483 -828 -1046 -1098 -769 -393 -241 -88 13
15612 42 -152 -145 62 318 693 878 993 -10 -672 -1280 -986 -472 90 971 2000 3047 3394 3650 3615 3106 3351
15591 3351 3798 4095 3410 1066 435 6 -23 253 659 706 702 827 971 866 817 772 897 995 1094 1160 935 612 622
$$ packed form
15734a869i18D75J046P12L65n05l68l44L85M01k29o83C21b58l35J46h4o5l25l07
15714g81K73mJ3q5k5K0p3k24p64L26k36l06O38A430a147p0k589J687o54j675P39
15693c709i82B72O93L4j98j57K86j15bm98j53b13C2e4p48o68o48p77p98k91k08
15672d192M25a771d06A091J353J126k56j075m71n96m91a90A725p26H8i34j120
15655b054Q98f0E94M62j31j04K75M75K51n73e6j564q29J202E7K59R0J63L82M84
15635A435K89J89J01j32o00n78F9d82M4q6J60r1R8j26l45k18n2L29L76J52h8A3
15612D2a52PF2K56L75J85J15a0o62o08K94d72I0Q81J029J047L47K56l5n09K45
15591C351M47K97o85A066D35Fb3B53M06M7mJ25J44j05m9m5J25R8R9O6k25l23J0
$$ plain form
15568 622 786 716 273 -707 -1634 -2569 -3141 -3346 -1586 -1435 -634 512 1499 2064 2607 2292 1835 1113 588 312
15548 312 191 160 49 94 409 880 1349 1555 1369 654 -119 -666 -381 -152 113 349 556 916 1331 1426 787
15527 787 -109 -738 -446 311 265 377 275 -414 -1126 -842 -205 -273 177 364 -703 -1066 -1036 -1438 -1455 -1254 -1527
15506 -1527 -527 -46 138 538 604 570 -2 28 -469 -7 -58 -41 724 896 484 21 -849 -1278 -1317 -996 -370 501 1250
15483 1250 1856 2246 2436 2266 1826 1560 1610 1654 730 -292 -1201 -1999 -2527 -529 258 492 451 407 336 314 247 290
15461 290 408 573 172 -670 -1651 -1301 -776 -607 -323 -782 -847 -1001 -1072 -1044 -486 295 923 1306 1382 1163 542
15439 -282 -1150 -2032 -1433 -461 -49 5 -315 -570 -135 856 1649 1984 1539 1014 735 935 1540 2573 3816 5814
15419 5814 7632 8387 8300 7601 6576 4599 3413 1685 354 -838 -1411 -857 -513 -854 -1401 -1396 -992 36 1098
$$ packed form
15568F22J64p0B73g07r27r35n72k05a586J51f34E12R87N65N43l15m57p22n25k76
15548C12j21l1D9M5L15M71M69K06j86F54a19n47K85a52A13K36K07L60M15R5o39
15527G87a09o29K92C11m6J12j02d14p12K84b05o8A77J87g03l63L0m02j7K01k73
15506a527e27d6A38M00O6l4bB8d69gn1J7G24J72m12B1h49m29l9L21c70E01P49
15483A250O06L90J90j70m40k66N0M4G30b92r09p98n28e29B58K34m1m4p1k2o7M3
15461B90J18J65A72f70r81L50N25J69K84m59o5j54p1K8d86B95O28L83P6k19E42
15439b82q68q82N99d61d9Ec15k55a35H56P93L35m45n25k79K00O05J033J243J998
15419E814J818P55q7o99j025j977j186A685C54h38n73N54L44l41n47NM04C6J062
$$ plain form
15400 1098 1568 1475 999 817 977 1517 2180 2810 3728 3969 3336 2035 1631 1157 327 -261 -909 -1495 -928
15381 -928 75 907 1282 1296 1023 478 -78 -436 -774 -625 -15 630 864 892 972 719 -78 -742 -1510 -2357 -2584 -2179
15359 -2179 -1065 57 138 55 428 1192 1770 1825 1630 1118 639 -209 -1293 -2024 -913 275 783 706 433 298
15339 298 497 704 1686 2399 1981 1743 828 82 -834 -1474 -2249 -2583 -1841 -471 544 869 267 -250 -545 -445
15319 -445 -517 -738 -1126 -909 -302 155 559 653 426 242 -97 -365 157 -5 -572 -880 -561 117 864 1172 1023
15298 1023 733 519 112 -183 -241 23 614 1369 2001 1965 1432 588 57 496 1978 3151 3663 1076 -289 -1275
15278 -1275 -1602 161 1867 2532 1838 1282 719 276 104 1095 1196 1077 1210 1234 740 787 555 517 1012 1580
15258 1580 1569 1497 1428 1486 1353 1044 648 -154 -1252 -2220 -3248 -1786 62 1318 1368 458 -552 -1294 -1507 -977
$$ packed form
15400A098M70r3m76j82J60N40O63O30R18K41o33j301m04m74C27b61o48n86N67
15381i28G5Q32L75J4k73D78g8l58l38J49a5F30K34K8Q0k53g8o64p68q47k27M05
15359b179a065E7Q1E5L73P64N78N5j95n12m79b09j084p31i13B75N08p7k73j35
15339B98J99K07R82P13m18k38H28H2h34o40p75l34P42d71E44L25B67b50k95J00
15319d45p2k21l88K17c02A55M04R4k27j84i7k68A57en67l08L19A17P47L08j49
15298A023k90k14A12a83n8B3N91P55O32l6n33E88E7M39J482J173N12A076b89r86
15278a275l27A61J706O65o94n56n63B76A04R91J01j19J33K4m94M7k32l8M95N68
15258A580j1p2o9N8j33l09l96a54j098r68j028J462F2J256N0D58e52p42k13N30
$$ plain form
15238 -977 96 885 1109 657 -129 -1081 -1758 -2189 -2152 -1452 -1244 -1062 -955 -1058 -750 -408 215 765 1112 1034 606
15217 606 103 -225 -409 -944 -1548 -2235 -1965 -1359 -861 -646 -322 -288 -365 -123 109 250 462 682 1193 1347
15197 1347 1579 1597 1194 501 -75 566 1807 1915 1419 447 -713 -1462 -1714 -1307 -723 -598 -842 -1126 -621 19
15176 237 887 1151 636 -359 -1048 -916 -60 265 427 416 631 483 109 -541 -1281 -1798 -1509 -1238 -925 -572
15156 -572 56 303 352 -91 -628 -1069 -1676 -625 321 483 43 -663 -16 135 303 -158 -527 -918 -719 78 560 674
15134 674 493 236 -168 -439 -768 -1025 -772 -447 -23 647 1409 2142 2825 1790 1423 1374 1082 651 -88 -387
15114 -387 -199 330 680 686 268 -672 -1930 -1815 -1739 -1057 -1083 -1323 -1937 -1407 -607 -358 -694 -1052 -1335 -1531 -1527
15093 -1527 -1139 -237 459 1353 1846 2422 2696 2102 1553 954 217 -611 -1284 -1535 -1610 -1694 -1725 -2506 -3812 -1626
$$ packed form
15238i77I6P89K24m52a29r52o77m31L7P00K08J82J07j03L08L42B15N50L47p8m28
15217F06A03b25j84n35o04o87K70O06M98K15c22L4p7a23A09J41K12K20N11J54
15197A347K32J8m03E01g5E66J241J08m96D47g13p49k52M07N84J25k44k84N05A9
15176B37O50K64n15c59o89J32f0B65J62j1K15j48A09e41p40n17K89K71L13L53
15156e72E6K47M9i1n37m41o07f25C21J62D3f63a6A35J68a58l69l91J99G8M82J14
15134F74j81B36a68k71l29k57K53L25b3F47P62P33O83j035l67m9k92m31h8k99
15114c87J88C30L50OB68f72j258J15P6O82k6k40o14N30f07K49l36l58k83j96M
15093a527L88b37D59Q94M93N76K74n94n49n99B17f11o73k51p5q4l1p81j306a626
$$ plain form
15072 -949 -414 -394 -256 -24 499 739 428 232 154 528 916 1046 680 131 -319 -575 -795 -853 -766 -111 782
15050 1629 2514 2759 2898 2881 1740 783 -60 -268 -102 -303 -331 -387 -772 -191 46 71 245 256 213 27 -27 113
15027 192 486 904 1232 1267 639 20 -243 -306 -46 7 -283 -641 -770 -777 -668 -620 -952 -1569 -1683 -1111 -256 324 579
15004 579 570 457 81 -371 -630 -410 -202 17 -93 -408 -189 -238 91 224 -78 -866 -1259 -861 -566 -575 -913 -1073 -792
14981 -792 -247 -56 -540 -1543 -1329 789 2630 3521 3466 681 -1255 -2469 -2243 -1969 -1763 -1810 -2305 -1855 -230
14961 726 1151 1010 1268 1720 1880 1343 1011 860 1041 1224 1238 1040 847 259 3 -286 -629 -1021 -1458 -1275 -1347
14940 -1347 -930 -495 -211 -242 -261 -92 56 -37 -458 -1250 -2384 -709 -1714 -1716 -503 -390 -1322 -2000 -547 838 2022
14919 2022 2598 2482 1842 663 -696 -1635 -742 1091 2274 3221 3037 3661 2545 960 80 -359 -39 255 436
$$ packed form
15072i49d14K0J38b4D99K40l11j96p8L74L88J30l66A31c19k56k20n8Q7a11G82
15050A629Q85K45J39j7j141G83f0k08a02k01k8n6l85a91D6K5J74J1m3B7b7A13
15027A92K94M18L28L5o28B0b43o3d6Gb83l58j29pJ09M8l32o17j14N72b56C24K55
15004E79rj13H1c71k59K20b02A7i3l15a89m9I1J33g8p88l93L98K95rl38j60K81
14981g92b47e6m84j003K14G89J841Q91n5F81a255j214K26K74K06m7m95M50b30
14961G26M25j41K58M52J60n37l32j51J81J83J4j98j93B59Cb86l43l92m37J83p2
14940a347M17M35b11l1j9i2E6c7m21p92j134g09j005ke03J13r32o78e47H38J184
14919B022N76j16o40F63f96r39g42A091J183R47j84O24j116I60H0c59c9B55J81
$$ plain form
14900 436 489 419 135 -379 -1193 -2276 -2783 -1546 -887 -47 329 472 942 1368 1395 1529 1431 1169 951 822 855
14879 855 915 1101 1071 773 452 -313 -1059 -2050 -2727 -3386 -3176 -2638 -1215 31 1165 2322 2493 2321 1802 1059
14859 1059 322 -402 -189 933 2281 3263 3213 2520 1897 1197 772 181 -347 -847 -1119 -1696 -1895 -1868 -1434 -467
14838 752 1536 1590 896 329 -798 -1497 -1604 -1351 -983 -216 608 1317 1209 704 172 -484 -1436 -1770 -737 -214
14817 172 68 -122 -448 -1107 -1846 -216 838 1181 770 -13 -1065 -1716 -2127 -1938 -1115 -13 998 1033 69 -824 -720
14796 -720 527 1540 1974 1473 351 -705 123 1137 1603 1521 1136 340 -417 -680 303 718 657 484 374 233
14776 233 -207 -788 -1199 -1249 -1085 -837 -789 -895 -593 -615 -896 -1010 -376 -572 -534 393 1898 3099 3396 2246
14756 2246 -128 -1649 -2586 -36 2426 4601 6242 7236 7202 6285 4343 1537 149 -172 616 563 71 -432 -1413
$$ packed form
14900D36N3p0A35c79q14j083n07J237O59d7C29J43M70M26K7J34r8k62k18j29L3
14879H55O0J86l0k98l21c13p46r91o77o59K10N38a215C1J134J157J71j72n19p43
14859A059C22d02a89I33J348R82n0o93o23p00m25A81c47n00k72n77j99K7M34d67
14838G52P84N4o94C29g98o99j07K53L68b16F08P09j08n05A72d84r52l34g37b14
14817A72F8a22l26o59p39b16H38L43m11a3j052o51m11J89Q23a3I98L5F9h24J04
14796g20E27J013M34n01C51g05A23J014M66q2l85C40d17k63C03M15o1j73j10j41
14776B33b07n81m11n0J64K48M8j06L02k2k81j14c76j96L8C93J505J201K97j150
14756B246a28j521r37c6B426K175J641R94l4r17j942A537A49a72F16n3G1d32r81
$$ plain form
14737 -1413 -1314 -927 -1075 -711 -57 194 660 599 1011 1372 1585 1676 1489 878 -46 -1120 -2140 -1944 -1410 -1722
14717 -1722 -2298 -3006 -3060 -2784 -3111 -3635 -3790 -3273 -2023 -1037 -272 137 303 404 611 891 858 255 -752 -694
14697 -694 -289 -318 -494 -647 -550 142 1041 1813 2947 2706 1496 546 512 964 1095 1162 1253 648 485 78 -583
14675 -1326 -72 1163 1882 2066 2030 1686 1396 1199 1225 1568 1813 1939 1535 749 -388 -996 543 2293 3283 4407
14655 4407 4902 4367 3290 2582 1706 1941 1995 1108 536 620 960 1127 1135 981 571 105 -466 -865 -972 -732
14635 -732 30 799 1239 1307 1103 727 -334 -1899 -3427 -4358 -3854 -2303 -727 -276 128 567 546 -9 -868 -1678
14615 -1678 -2554 -993 417 1251 1677 1696 1127 963 896 691 432 7 -470 -990 116 -197 -253 -1237 -1426 -356 941
14593 1677 1938 1376 718 -154 -387 -1288 -742 -478 -411 -579 -646 -535 -326 104 203 261 44 -212 -433 -397 -174
$$ packed form
14737a413R9L87j48L64e7A94M66o1M12L61K13R1j87o11d6j074j020J96N34l12
14717a722n76p08n4K76l27n24j55N17J250R86b72A37J66J01K07K80l3B55g52N8
14697f94b89k9j76j53R7A42Q99P72J134k41j210E46l4M52J31O7R1o05j63G8e83
14675a326g2A163P19J84l6l44k90j97K6L43K45J26m04G49c88o08E43J750R90J124
14655D407M95n35j077p08q76K35N4q87E36Q4L40J67Qj54m10A05d66l99j07K40
14635g32C0P69M40O8k04l76c34j565j528r31N04J551g27b76A28M39k1iq59q10
14615a678q76i93D17Q34M26J9n69j64o7k05k59Gd70n20A16a97n6r84j89c56I41
14593A677K61n62o58a54k33r01N46K64O7j68o7J11K09A04R9N8D4b12k21L6a74
$$ plain form
14571 -82 -722 -1053 -457 -310 -13 429 948 1563 2290 2734 3607 4008 4795 4411 4369 2294 1384 865 795 987 907
14550 907 798 1007 1131 1008 1186 992 615 100 -979 -2092 -885 171 779 975 639 -392 -808 -1397 -699
14531 -699 -1061 -896 -803 -811 -805 -663 -598 14 621 1072 1335 704 125 -34 67 168 234 559 848 902 585 688 957
14508 957 582 -110 -1289 -1915 -1269 -944 -84 -109 -45 -483 -851 -655 -183 191 360 390 501 468 442 702 1202
14487 1202 1848 2103 1910 1373 754 -440 -1874 -3674 -3827 -3701 -154 1214 2035 2283 2098 1852 1594 1234
14469 1234 1558 1910 2426 2184 1371 236 180 1215 1854 1746 886 -613 -2666 -2156 -1665 -189 798 794 586 274
14448 -8 711 1431 1685 1634 1366 1271 1214 636 -344 -760 -775 -1015 -1542 -1720 -1378 -992 -688 -557 -652 -918 -1557 -1540
14426 -1540 -424 -1661 -1214 -489 -771 -70 959 1423 1359 1269 840 3289 3469 499 279 1243 2767 3688 3873
$$ packed form
14571h2o40l31d57J47a3D29N19O15P27M44Q73M01P87l84m2k075r10n19p0J92q0
14550I07j09K09J24j23J78j94l77A00i79j113h85A71O08J96l36c92m16n89O98
14531f99l62J65R3qOJ42O5A4O07M51K63o31A25c4F7J01O6L25K89N4l17J03K69
14508I57l75a10j179o26O46L25h4k5d5m38l68J96a83A91J69L0J11l3k6K60N00
14487A202O46K55j93n37o19d40j434j800j53J26a54A214Q21K48j85k46k58l60
14469A234L24L52N16k42q13B36n6J035O39j08q60f13k053N10M91a89G98mk08B74
14448hG11P20K54n1k68r5n7n78c44m16j5k40n27j78L42L86L04J31r5k66o39J7
14426a540d24j237M47d89k82g0I59M64o4r0m29K449J80D99k20R64J524R21J85
$$ plain form
14407 3873 1596 1134 746 583 173 -22 328 621 558 390 -78 -625 -630 242 1467 2384 3001 3563 3021 -179
14386 -1023 -1564 -350 1221 1784 1740 1080 167 -703 -1668 -2595 -3023 -2162 -920 -160 153 134 282 175 234 238 -196
14364 -525 -864 -726 -477 -208 57 170 126 218 407 423 293 207 -38 -472 -765 -1432 -1861 -1809 -1468 -1094 -575 68
14341 721 1509 2509 3862 5658 6191 5730 3823 859 -792 -1071 -425 585 1110 1198 624 -413 -1935 -3575
14323 -3575 -5986 -6250 -5252 -2406 -1267 -208 496 1005 1574 2207 2119 2096 1850 1374 776 728 1347 2026 2428
14304 2428 2237 1703 1129 731 338 113 280 678 1213 1842 2041 1848 1612 590 -637 -1763 -2611 -2857 -1935
14285 -1935 -1256 -261 1030 2223 4725 5993 6213 5791 4707 1645 1035 634 557 738 952 1359 1612 1027
14267 1027 950 571 -12 -517 -809 29 293 -68 -772 -1587 -338 307 359 178 212 170 -8 -100 -215 -369 -188 -101 -94 -30
$$ packed form
14407C873A596m62l88j63A73b2C28K93o3j68g8n47nB42J225R17O17N62n42a79
14386a023n41c50A221N63m4o60A67g03r65r27m28Q61i20a60A53j9J48j07N9Ma96
14364e25l39J38K49b08E7J13m4R2J89J6j30q6c8m34k93o67m29N2L41L74N19F8
14341G21P88J000J353J796N33m61j907H59g92k79d25E85N25Q8n74d13j522j640
14323c575k411k64R98b406J139b08D96N09N69O33q8k3k46m76n98m8O19O79M02
14304B428j91n34n74l98C38A13J67L98N35O29J99j93k36E90f37j126q48k46R22
14285a935O79b61A030J193K502J268K20m22j084A645o10m01p7J81K14M07K53n85
14267A027p7l79a2n05k92B9K64f8p04q15c38C07N2A78L4m2hr2j15j54J81Q7Pc0
$$ plain form
14242 -25 -340 -803 -1023 -986 -643 -135 488 841 743 121 -737 112 493 368 -159 -493 -312 568 1296 1125 552
14220 78 -343 -576 -240 239 458 733 772 825 1801 3218 4309 5243 5034 3207 1971 1109 468 -47 -484 -1054
14200 -1054 -1631 -897 -121 545 974 1244 1454 1638 1366 846 202 -578 -1212 -1117 -1021 -969 -962 -820 -329 -94 -586
14179 -586 -1203 -1315 -979 -1020 -903 -826 -734 -158 630 1240 1484 1089 606 274 553 510 158 -129 -322 -289 84 411
14157 411 559 878 1696 2966 3638 3631 3136 1917 1104 295 -230 -654 -860 -930 -895 -847 -891 -550 -288 -574 -678
14136 -678 -296 258 311 118 162 210 -50 -400 -661 -988 -1461 -1707 -1457 -806 -348 -169 -369 -492 -258 256 159
14115 159 -341 -785 -739 -467 17 437 784 1077 805 527 -108 -954 -1438 -1903 235 726 1343 1166 1082 1387 1835
14094 1835 2342 2707 2595 2468 2117 1782 1178 291 -1156 -2934 -3533 -3114 -1975 -453 30 543 715 500 -50
$$ packed form
14242b5l15m63k20L7L43a35D88L53r8A21g37A12L81j25a59l34J81E68P28j71E52
14220G8c43k33b40B39K19K75L9N3R76J417J091R34k09j827j236q62D68d7m37n70
14200a054n77P34a21E45M29K70K10J84k72n20B02e78o34R5R6N2PJ42c29i4m92
14179e86o17j12L36m1J17P7R2a58F30O10K44l95m83B74K79m3A58a29j93L3H4L27
14157D11J48L19Q18J270O72pm95j219q13B95b30m24k06p0L5M8m4L41K62k86j04
14136f78b96B58N3A18M4M8e0l50k61l27m73k46K50O51c48a69k00j23K34B56r7
14115A59c41m44M6K72A7M20L47K93k72k78a08q46m84m65B35M91O17j77q4L05M48
14094A835N07L65j12j27l51l35o04B91a156j778n99M19J139d53C0N13J72k15e0
$$ plain form
14074 -655 -637 -242 95 459 1028 1417 1562 1477 1562 1501 1058 469 -178 -491 -761 -953 -789 -258 225 373 11 -577
14051 -1270 -1724 -668 341 410 -240 -931 -1297 -624 46 275 364 383 519 639 636 284 -145 -537 -660 -580 -511 -248
14028 124 -335 -891 -1075 -1167 -1135 -749 -766 -892 -868 -569 -102 99 149 -303 -592 -767 -766 -283 293 1240 2064 2745
14006 2745 3090 2808 1907 1074 471 264 -230 298 810 1274 884 179 -586 -890 -827 -654 -348 66 559 1001
13986 1001 1038 625 -90 -794 -1045 -1017 -1018 -1392 -1715 -2011 -2280 -1424 -1176 -314 -120 135 -35 -321 -993 -654 504
13964 1188 1232 819 228 -508 -1417 -2595 -4299 -4398 -3714 -1642 -466 422 983 1420 907 381 -273 -437 -320
13945 -320 -148 392 737 384 -349 -1288 -2115 -3131 -3515 -3636 -3599 -3217 -2103 -1431 -621 88 913 1772 2441 2894
13925 2894 2790 4133 3084 247 -193 -714 -1227 -1484 -1532 -960 -438 -533 -1040 -1683 -2004 -1844 -1164 -10 -85 -812
$$ packed form
14074f55J8b42I5L64N69L89J45q5Q5o1m43D69a78l13k70j92J64b58B25J48A1e77
14051a270m54f68C41O9b40o91l66f24D6K29Q9J9J36J20lB84a45l92j23Q0O9b48
14028A24c35n56j84r2L2L86j7j26K4K99a02I9N0c03k89j75Jb83B93R47Q24O81
14006B745L45k82r01q33D71k07b30B98N12M64l90A79e86l04O3J73L06F6M93M42
13986A001L7m13i0p04k51K8jl74l23k96k69Q56K48c14a20A35c5k86o72L39E04
13964A188M4m13B28e08r09j178j704r9O84a642d66D22N61M37n13C81b73j64J17
13945c20a48C92L45l53c49r39q27j016l84j21L7L82J114O72f21H8Q25Q59O69M53
13925B894j04J343j049B47a93n21n13k57m8N72d38r5n07o43l21J60O80a0p5p27
$$ plain form
13905 -812 -1105 -647 -475 -1042 -1992 -2259 -906 -12 -155 26 665 468 359 42 -256 -578 -720 -691 -583 -483 -583
13884 -583 -973 -1741 -2765 -1795 -620 18 108 -84 -742 -1078 -1096 -522 -61 -410 -510 -819 -439 258 551 527 270
13863 270 49 -458 -905 -1316 -1434 -1553 -1745 -2158 -2193 -2611 -2624 -1226 -36 750 942 735 85 -722 -1641 -2707 -1679
13842 -1679 -325 223 327 302 571 906 1297 1484 1406 1063 164 -598 -1022 -1229 -1097 -718 -337 -118 -143 -386
13822 -386 -940 -1498 -1851 -1997 -1361 -780 464 1316 1546 1212 630 -329 -947 -1374 -932 537 1222 719 -365 -1816
13802 -1816 -1367 -295 427 713 782 418 5 -450 -1179 -1772 -1746 -1213 -606 440 1266 1045 -164 -1186 -1519 -1555 -1459
13781 -1459 -2118 -1448 -481 498 1315 1722 1723 1313 1043 927 707 647 100 -635 -978 -1340 -1659 -2353 -3786 -1507
13760 -1457 -1033 -1495 -1522 -1657 -1752 -1331 -3883 -1985 -1855 -2067 -2332 -2775 -2294 -2170 -1712 -1310 -988 -701 -317
$$ packed form
13905h12k93M58J72n67r50k67i06a2j43B6O39j97j09D2b56l22j42K9J08J00j00
13884e83l90p68j024R70f20A8R0h4o58l36j8e22f1l49j00l09L80B58K93k4k57
13863B70D9d58m47m11j18j19j92m13l5m18j3a226c6G50J92k07H5g22r19j066J028
13842a679c25B23J04k5K69L35L91J87p8l43A64e98m24k07J32L79c37a18k5k43
13822c86n54n58l53j46O36N81D64Q52K30l34n82c29o18m27M42E37O85n03c65j451
13802a816M49b95D27K86O9l64Ed50p29n93K6N33f06D40Q26k21a64j022l33l6R6
13781a459o59O70d81D98Q17M07Jm10k70j16k20o0A00f35l43l62l19o94j433a507
13760a457M24m62k7j35r5M21k552J898J30k12k65m43M81J24M58M02L22K87c17
$$ plain form
13740 234 1097 1561 1245 373 -53 -384 191 1152 1320 787 156 -145 -406 -624 -1054 -1497 -1949 -2772 -3681 -3894
13720 -3894 -3520 -2746 -1720 -1717 -1897 -2513 -2710 -1837 -371 1286 1846 1392 497 -131 -401 -685 -876 -1088 -936
13701 -936 -699 114 529 474 118 -400 -927 -1969 -2780 -1790 -1509 -1170 -980 -521 -499 -729 -611 -238 84 -73 -109
13680 -109 -334 -499 -1014 -1252 -895 -409 -514 527 186 -444 -1163 -1462 -1672 -1350 -1064 -569 -23 278 382 413
13660 413 634 982 1238 1220 1100 974 973 968 1100 983 517 -366 -1176 -1959 -2828 -3057 -2933 -2001 -1382 -721 -258
13638 -213 -214 135 835 1680 2223 3273 2171 1463 888 273 -357 -548 -45 609 1191 1585 1774 1609 1270 695
13618 695 116 -811 -1768 -237 794 1242 1327 1220 1118 1080 958 955 1012 1049 1201 1163 962 637 418 -8 313 546 282
13595 282 -78 -501 -774 -815 -772 -548 -360 218 851 1288 573 -266 -681 -990 -800 -697 -364 -11 294 571 711
$$ packed form
13740B34Q63M64l16C73e3l31A91R61J68n33A56a45k61k18m30m43m52q23r09k13
13720c894L74P74J026Lj80o16j97Q73c71A286N60m54D97a31k70k84j91k12J52
13701i36K37A14M15n5A18d00n27j042q11R90K81L39J90M59K2k30J18b38H4g3l6
13680a09k25j65n15k38L57d09j05E27A86d44p19k99k10L22K86M95b3B78J04L1
13660D13K21L48K56j8j20j26jnJ32j17m66c66q10p83q69k29J24R32O19O61b58
13638b13jA35P00Q45N43J050j102p08n75B73c57j91d5F09N82L94J89j65l39n75
13618F95A16h11r57b37G94M48Q5j07j02l8j22lN7L7J52l8k01l25k19hC13K33k64
13595B82g8m23k73m1M3K24J88B18O33M37E73b66m15l09J90J03L33a1B94K77J40
$$ plain form
13574 711 710 330 -445 -1560 -2875 -3165 -1257 -242 194 342 149 -75 -384 -658 -1026 -1380 -1852 -2418 -2591 -2707
13554 -2707 -2214 -3595 -2058 -336 673 1417 1364 360 -606 -1967 -3600 -6154 -4216 -2835 -892 476 931
13537 931 1029 614 225 -23 -191 -873 -1321 -1145 -205 -122 -614 -1118 -1380 -675 98 443 438 69 128 528 1027 1542
13515 1542 1779 1780 1613 998 516 -12 -205 95 82 -175 -704 -986 -1354 -1987 -2360 -1007 834 2264 2851 3056
13495 3056 390 -598 -957 -359 190 492 585 349 413 362 270 -139 -882 -1885 -2930 -1148 -156 464 955 -9
13474 339 742 874 935 901 896 1012 893 621 249 -58 -181 -360 -393 -208 -156 -348 -51 177 392 345 190 -76 389
13450 706 671 187 -670 -1505 -2661 -1816 -411 484 917 728 544 161 33 104 -21 -483 -1204 -1296 -678 -352 -147
13428 -9 56 20 -43 -481 -684 -892 -1015 129 33 -38 -514 -991 -1486 -1109 -706 -590 -534 -181 526 913 631 57 -932
$$ packed form
13574G11jC30d45j115j315k90a257b42A94J48A49g5l09k74l68l54m72n66j73j16
13554b707M93j381J537c36F73P44n3C60f06j361j633k554J938J381h92D76M55
13537I31R8m15B25b3j68o82m48J76b05Q3m92n04k62f75I8L45nF9N9M00M99N15
13515A542K37Jj67o15m82a2j93I5j3a75n29k82l68o33l73a007H34J430N87K05
13495C056C90e98l59c59A90L02R3k36O4n1r2a39p43j003j045a148a56D64M91i
13474C39M03J32O1l4nJ16j19k72B49e8j23j79l3J85N2j92e1A77K15m7j55g6C89
13450G06l5A87f70q35j156Q45d11D84M33j89j84A61C3P1b1m62p21r2O18L26a47
13428iE6B0d3m38k03k08j23A29C3c8m76m77m95L77M03J16N6a81E26L87k82E7i32
$$ plain form
13404 -1968 -2833 -1824 -489 529 734 519 145 32 -141 -437 -828 -857 -910 -587 -317 117 390 719 362 -240
13383 -722 -986 -1222 -1791 -1746 -1229 -801 -417 -97 173 18 -138 -395 -151 -19 -436 -1496 -2473 -5225 -4036 -713
13362 -654 -662 -651 -1389 -1441 -1131 -157 852 488 -75 817 2887 4512 6154 6300 5047 2306 -1166 -2665 -1256
13342 183 680 422 -236 -917 -760 89 292 8 -313 -134 8 82 90 -188 -532 -976 -990 -1096 -1356 -1671 -2062 -1974 -1762
13319 -1762 -1525 -1723 -1610 -273 1066 2328 2368 2027 997 15 -1154 -2135 -1619 -592 -411 -594 -790 -562 -206
13299 159 277 269 629 858 829 639 323 199 240 692 1007 1163 1244 952 524 -47 -325 -689 -976 -477 286 494
13277 494 646 687 373 279 359 624 1056 1332 1265 989 610 1065 1757 2148 1958 915 84 -423 187 1594 2542
13256 2542 3638 3828 1959 862 1498 1620 1481 1127 592 261 368 920 1268 1354 988 171 -452 -748 -1312
$$ packed form
13404a968q65J009d89E29K05k15A45C2a41k96l91k9n3L23K70A17K73L29l57b40
13383g22k64k36n69M5N17M28L84i7A73A8a38k57a51a9m17j060r77k752J189g13
13362f54qJ1p38n2L10a57H52l64g5H17K070J625J642J46j253B306a166j499a256
13342A83M97k58b36o81J57H9K03Hc13a34HP4Qa88l44m44j4j06k60l15l91Q8K12
13319a762K37j98J13b73A066J262M0l41I97A5a154r81N16e92J81j83j96K28b06
13299A59J18qL60K29k9j90l16j24M1M52L15J56Q1k92m28d7k78l64k87d77B86K08
13277D94J52M1l14r4Q0K65M32K76o7k76l79M55O92L91j90I15H4d23A87J407R48
13256B542J096J90j869H62O36J22j39l54n35B61J07N52L48Q6l66A71d52k96n64
$$ plain form
13237 -1312 -1256 -694 -374 -389 -811 -437 361 975 931 402 -659 -1839 379 1415 1862 1486 484 -683 -899 -102
13216 456 73 -573 -1407 -2461 -1540 595 1950 2678 2757 2421 1261 -382 -413 61 643 965 1014 668 21 -314 -229
13195 -229 -11 113 -115 13 402 979 974 2524 2493 -691 -1025 -1379 -1247 -779 -222 -59 -415 -482 -107 -36 334 295
13173 295 -252 -936 -1253 -1194 -1142 -1147 -1218 -926 -712 -596 -517 -249 1007 1906 1777 876 -479 -1540 -2020 -2112 -1606
13152 -1606 -1469 -1017 -873 -815 -554 -249 42 174 186 -89 -516 425 654 921 968 581 9 -768 -1195 -1536 -1930 -1754
13130 -1754 -999 236 1212 1951 1958 1506 866 451 -236 -494 -981 -513 165 765 1310 1456 1516 1454 1034 430 -499
13108 -823 -812 -590 -504 -499 -474 -378 -331 -405 -383 -377 76 429 382 139 -48 -217 -159 -847 -854 -1060 -797 -462 -318 -14 465 719
13082 719 722 749 710 954 1265 1688 2120 2210 1883 1288 531 -318 -847 -996 -80 807 1167 1015 733 14 -616 -623 309
$$ packed form
13237a312N6N62L20j5m22L74C61O14m4D02f59j180C79J036M47l76D84f83k16a02
13216D56G3e73q34j054R21E95J355P28P9l36j160c82l1F1N82L22M9l46B1c14Q5
13195b29a1A13a15A3L89N77nJ550l1f91l34l54J32M68b22e9l56o7a07c6C34l9
13173B95b52o84l17N9N2np1K92K14J16P9b49A007Q99j29H76d79j061m80r2N06
13152a606J37M52J44N8K61b49D2J32J2h9m27D25K29K67M7l87Ig68m27l41l94J76
13130a754P55B36R76P39Pm52o40m15b36k58m87M68A65O00N45J46O0o2m20D30d99
13108h23J1K22Q6NK5R6M7p4K2OG6L53m7A39d8j69N8o88pk06K63L35J44a4D65K54
13082G19LK7l9K44L11M23M32R0l27n95E31c18n29j49h0H07L60j52k82A4f16pC09
$$ plain form
13058 1363 1750 1504 524 -642 -1480 -1232 -786 -415 177 706 991 1269 1612 1891 1729 1861 1271 855 38 -687
13037 -1145 -1235 -1101 -1499 -2278 -3237 -1633 88 1239 1813 2073 1680 1066 317 -85 -180 8 158 397 455 460 162 -381
13014 -723 -999 -829 -171 471 86 -1117 -2131 -2097 -1437 -589 -78 131 -403 -971 -541 -32 -496 -870 -1214 -539
12993 181 548 665 501 535 441 456 497 624 670 918 1288 1284 778 -157 -662 -294 -260 -563 -547 -963 -799 -1711 -2342
12970 -2342 188 297 103 113 472 748 908 1352 1877 2286 2092 1574 1117 934 696 839 856 460 227 80
12949 609 1657 3025 3060 2102 1535 1213 419 342 269 603 942 991 760 267 -659 -1404 -1102 -161 574 678
12929 678 247 31 -648 -1298 -1457 -821 292 1326 1831 1643 933 495 417 699 950 900 1030 814 935 915 809
12908 809 545 39 -362 -512 -790 -666 -242 163 534 1051 1128 1058 1014 985 986 1431 2348 3421 3465 1947 720 -885
$$ packed form
13058A363L87k46E24f42q38K48M46L71A77N29K85K78L43K79j62J32n90m16C8f87
13037a145r0J34l98p79r59J604H8J151N74K60l93o14C17h5r5HJ50K39N8NA62c81
13014g23k76J70a71D71H6a117j014L4O60e89g8A31d03n68M30c2m64l74l44e39
12993A81L67J17j64L4r4J5M1J27M6K48L70mn06a57n05b94L4l03J6m16J64r12o31
12970b342A88J09A03J0L59K76J60M44N25M09j94n18m57j83k38J43J7l96B27H0
12949F09J048J368L5r58n67l22D19p7p3L34L39M9k31B67f59p45L02a61E74J04
12929F78B47C1f48o50j59O36B92J034N05j88p10m38p8K82K51n0J30k16J21k0j06
12908H09k64C9c62j50k78J24b42A63L71N17P7p0m4k9JM45R17J073M4j518G20h85
$$ plain form
12885 -1724 -1213 -915 -150 605 1669 3009 5028 6362 5798 3969 1469 761 524 298 -864 -2329 -4068
12868 -4068 -5711 -1171 -135 -1493 -1510 -1212 -1804 -3023 -3533 -2562 -595 1287 2728 4075 4403 3006 -14
12850 -648 -964 -1072 352 1451 1540 1186 551 536 928 1207 915 239 517 219 -90 -614 -1125 -1406 -978 -295
12829 151 547 650 909 1245 1310 2722 1083 227 -332 -529 -49 374 359 277 110 -218 3 576 1307 1867 2083
12808 2083 2003 1960 2313 3138 3344 4357 1832 1787 1500 708 -150 -892 -1346 -944 -144 -217 -1007 -1127 -2181 -1391
12788 -1391 -672 -800 -178 51 290 598 682 869 776 435 -148 -712 -994 -891 -646 -378 -420 -758 -1154 -1243 -658
12767 -658 60 961 1567 1651 1778 2339 1817 1115 352 -366 -464 -299 -28 308 517 172 -645 -636 -258 -347 -726 -1141
12745 -1141 -1406 -1258 -587 34 689 1373 1567 1051 221 -579 -899 -458 240 1047 1818 2302 2339 2126 1957 1646
$$ packed form
12885a724N11K98a50F05J064J340K019J334n64j829A469p08k37k26h64j465j739
12868d068j643a171a35j358j7K98n92j219n10R71e95A287J441J347L28j397a4
12850f48l16j08C52J099Q9l54E51j5L92K79k92B39K78B19i0n24n11k81M28b95
12829A51L96J03K59L36O5J412A083B27c32j97d9C74j5q2A10b18CN73P31N60K16
12808B083q0m3L53Q25K06J013A832m5k87G08a50p42m54M02a44p3p90j20j054P90
12788a391f72j28a78E1K39L08Q4J87r3l41a48n64k82J03K45K68m2l38l96q9N85
12767f58F0R01O06Q4J27N61n22p02C52c66r8J65b8C08K09A72f45Rb58q9l79m15
12745a141k65J48e87C4O55O84J94n16B21e79l20M41B40Q07P71M84L7k13j69l11
$$ plain form
12725 1646 1021 167 -438 335 1396 1568 1098 261 -810 -859 -878 -2114 -2474 -2288 -1481 -408 546 996 799
12706 799 564 260 -168 -284 -215 124 375 490 602 352 -540 -917 -744 -13 602 643 422 558 902 997 868
12685 868 589 618 798 755 582 261 -275 -639 -321 71 735 1379 1951 2098 2024 1973 1504 667 172 -940 -1392
12664 -1392 -1427 -1319 -1235 -966 -817 -605 -723 -113 57 430 597 879 773 749 902 1348 1725 1755 1100 37 -1143
12642 -2755 -3378 -3845 -3465 -2792 -848 30 -290 -539 -163 311 910 1187 1508 1772 1799 2299 3564 3913 3376 -45
12621 -833 -895 -1309 -1584 -1752 -2278 -2405 -1928 -1440 -725 -106 199 246 266 -70 -30 -68 133 866 2094 3470 3870
12600 3870 4187 3694 1532 -141 -2015 -4097 -5296 -3846 -1112 -501 -530 -849 -1473 -1262 -1215 -1306 -1256 -992 -584
12581 -584 162 699 706 288 -197 -544 -690 -707 -602 -339 -48 -152 -194 -79 201 190 33 -627 -1207 -2282 -532 -4 256
$$ packed form
12725A646o25A67d38C35J061J72m70B61h10m9j9j236l60J86Q07d08E46M50j97
12706G99k35B60a68j16O9A24K51J15J12k50e40l77J73a3F02M1k21J36L44R5j29
12685H68k79K9J80m3j73B61b75l64L18G1O64O44N72J47p4n1m69F67A72i40m52
12664a392l5J08Q4K69J49K12j18a13E7L73J67K82j06k4J53M46L77L0o55C7a143
12642b755o23m67L80O73h48C0b90k49a63C11N99K77L21K64K7N00J265L49n37d5
12621h33o2m14k75j68n26j27M77M88P15a06A99M7K0g0c0l8A33P33J228J376M00
12600C870L17m93A532a41j874k082j199J450a112e01k9l19o24K11M7r1N0K64M08
12581e84A62N37PB88a97l47j46j7J05K63d8j04m2g9B01j1C3f27n80j075e32dB56
$$ plain form
12557 390 355 331 811 1435 1745 1575 1030 312 -282 -848 -1171 -1128 -793 -392 158 19 -54 448 1084 1446 1570
12536 1570 1307 1235 1177 1078 648 242 -482 -817 -798 -53 541 811 987 748 770 1719 2407 2907 2998 2639 1925 921
12513 -121 -788 -1566 -2378 -536 1011 1914 2153 1701 2598 168 -617 -889 -795 -408 -195 25 203 -32 -203 278
12492 602 938 886 640 117 -574 -1417 -1936 -1205 -250 -2215 -1679 -1714 -451 1010 1524 1673 2151 2466 1887 1378
12472 1378 472 -577 -994 -1328 -1611 -1975 -1898 -1556 -1397 -1220 -517 834 1355 1825 1869 1399 634 -382 -318 1053
12451 1608 1270 818 304 156 130 47 67 -127 -189 -182 -200 -390 -315 -245 -353 -279 193 1046 2180 3443 4106 4202
12429 4202 3238 1836 575 -187 -619 -473 252 700 507 120 -152 -122 197 228 -243 -1098 -1405 -1310 -682 306
12408 656 637 27 -1283 -1752 -1145 -731 -723 -1176 -1291 -979 570 1690 1647 736 121 670 1106 1055 750 662 1007
$$ packed form
12557C90l5k4M80O24L10j70n45C12b82n66l23M3L35c92A58A9e4D48O36L62J24
12536A570k63p2n8r9m30B42d82l35J9e3E41K70J76k39K2R49O88N00R1l59p14I21
12513a21o67p78q12e36A011R03K39m52Q97A68f17k72R4L87a95B5J78c2j71B78
12492F02L36n2k46A17e74q43n19P31b50j965N36l5d51A010N14J49M78L15n79n09
12472A378D72e77m17l34k83l64P7L42J59J77e17H34N21M70M4m70F34c82O4A053
12451A608l38m52C04j48k6D7K0a27o2Pj8j90P5P0j08P4A93Q53J134J263O63R6
12429D202r64j402E75a87m32J46B52M48j93A20a52L0A97L1b43q55l07R5O28C06
12408F56j9B7a283m69O07M14Qm53j15L12E70J120m3G36A21N49M36n1l05q8L45
$$ plain form
12387 1007 1674 2169 2931 2932 2559 1288 -39 -2021 -3086 -611 588 1417 1711 1542 994 290 57 329 809 1385
12367 1385 900 734 831 169 -562 -1023 -1059 -1001 -1629 -2652 -3387 -2874 -1919 -694 -610 -1336 -1965 -3068 -2791 -1215
12346 -392 -133 -559 -1180 -1104 -1147 -1014 -696 -302 25 126 308 629 874 866 1186 1311 1280 1199 1058 707 502 541
12324 541 965 1229 1268 1304 1364 1790 2956 3058 2500 1578 1944 2069 2459 2575 2181 1399 1061 788 928 782
12304 782 541 -63 -751 -1501 -2166 -1843 -1476 -1227 -1360 -1714 -2364 -2088 -1128 -553 -231 -355 -469 -481 -375 -3 274
12282 473 516 372 114 -267 -1064 -1362 -491 294 845 946 577 -135 -897 -1544 -1974 -2373 -2582 -2945 -3610 -2464
12262 -2464 -1706 -1072 -582 -137 -320 -94 117 87 -358 -265 -202 730 2188 3540 4095 3792 3414 2890 1766 383
12241 -628 136 944 859 -23 -1315 -2326 -1736 -503 590 1073 1043 729 223 -334 -722 -1253 -1558 -1849 -2257 -1813
$$ packed form
12387A007O67M95P62Jl73j271c9j982j065f11E88Q29K94j69n48B90E7K72M80N76
12367A385m85j66R7A69e62m61l6N8o28j023p35N13R55f94Q4p26o29j103K77a215
12346c92a33m26o21P6m3J33L18c02B5J01J82L21K45qL20J25l1q1j41l51k05L9
12324E41M24K64L9L6O0M26J166J02n58r22L66J25L90J16l94p82l38k73J40j46
12304G82k41f3o88p50o65L23L67K49j33l54o50K76R60e53b31j24j14j2J06cB74
12282D73M3j44A14b67p97k98d91B94N51J01l69a35p62o47m30l99k09l63o65J146
12262b464P58O34M90a37j83i4A17l0c58R3O3G30J458J352N55l03l78n24j124C83
12241f28A36Q08q5b3j292j011N90e03E90M83l0l14B23c34l88n31l05k91m08M44
$$ plain form
12221 -1813 -1677 -989 -197 416 570 275 -392 -1202 -2034 -2783 -3603 -3911 -3864 -3448 -2649 -1937 -1596 -1883 -1689 -1947
12201 -1947 -1713 -873 432 1809 3021 4022 4500 4245 4483 4499 4748 4026 1218 765 72 -736 333 955 1085
12182 1085 627 697 433 104 -202 -500 -721 -640 -270 -972 -1258 -610 -294 -242 -546 -241 575 1312 1942 2194
12162 2194 1691 1111 516 238 130 124 51 30 25 387 1283 1759 1613 894 -446 -1676 -3158 -4353 -5259 -4257
12142 -4257 -3486 -2324 -1259 -607 155 642 -408 -952 -1272 -1821 -1877 -1294 -762 -1190 -1529 -2154 -2030 -1270 -560
12122 -260 -197 -221 -99 117 307 248 349 303 156 -171 -569 -804 -310 326 892 846 416 -149 -762 -1253 -1418 -1203
12100 -1203 -924 -839 -935 -1246 -1284 -454 755 2046 3049 2158 2087 1794 1407 1349 1409 1569 1514 818 -522 -1637 -2105
12079 -2105 38 1617 2289 2018 1368 875 901 1297 1912 1798 1588 2042 1914 1787 1761 1374 1407 1261 613 -161
$$ packed form
12221a813J36O88a97D16J54B75c92q10q32p49q20l08M7M16P99P12L41k87J94k58
12201a947K34Q40D32J377J212J001M78k55K38J6K49p22A218m53G2g36C33O22J30
12182A085m58P0k64A04b02k98k21Q1b70p02k86f10b94N2l04b41E75P37O30K52
12162B194n03n80E16B38j08oE1k1nL62Q96M76j46p19d46j230j482j195r06J002
12142d257P71J162J065f07A55M87d08n44l20n49n6N83N32m28l39o25J24P60e60
12122b60O3k4i9A17J90n9J01m6j47a71l98k35c10C26N66m6D16a49o13m91j65K15
12100a203K79Q5r6l11l8d54G55J291J003q91p1k93l87n8O0J60n5o96e22j115m68
12079b105C8J579O72k71o50m93K6L96O15j14k10M54j28j27k6l87L3j46F13a61
$$ plain form
12058 -1074 -2081 -2084 -2060 -2076 -787 -180 124 307 484 488 673 1135 1514 1327 831 170 -427 -990 -1229 -1100 19
12036 955 1730 2216 2538 2917 3880 3486 2060 921 398 582 1520 1332 660 -30 -777 -1309 -1637 -1652 -1384 -862
12016 -862 -302 461 980 1472 1765 1906 1585 1009 486 10 -188 -178 56 458 417 -137 -484 -471 -581 -778 -717 -999
11994 -999 -1139 -1454 -2077 -3673 -4404 -3989 -1172 -146 793 1376 1641 1488 984 162 -221 -727 -687 -632 -6 881
11973 1513 1575 1075 660 162 -750 -1331 -2560 -3387 -1508 -1032 -1256 -1716 -1100 -1232 -328 606 1360 1744 1540
11954 1540 1073 622 175 -330 -561 -668 -177 -319 -528 -927 -1094 -451 434 909 1110 684 61 -619 -1801
11935 -1801 -3172 -3973 -1217 -3376 -1082 -176 690 745 504 252 292 119 -68 20 148 723 1406 1983 2096
11916 2096 1499 394 -616 -1004 -512 78 321 284 -163 -508 -629 -354 417 818 918 907 722 292 108 -1017
$$ packed form
12058a074j007lK4j6g87a80A24J83J77MJ85M62L79j87m96A70d27n63k39J29A9
12036I55P75M86L22L79R63l94j426I21C98J84R38j88F60c0p47n32l28j5K68N22
12016h62c02D61N19M92K93J41l21n76D86A0a88J0E6M02m1a37l47J3j10j97O1k82
11994i99j40l15o23j596p31M15a172a46G93N83K65j53n04A62b21n06M0N5fH81
11973A513O2n00m15A62g50n81j229q27a508M76k24m60O16j32c28F06P54L84k04
11954A540m67m51A75c30k31j07a77j42k09l99j67d51D34M75K01m26F1f19j182
11935a801j371q01a217k159a082a76F90N5k41B52M0A19f8B0J28N75O83N77J13
11916B096n97C94f16l88M92G8K43l7a63l45j21K75D17M01J00j1j85B92A08a017
$$ plain form
11895 -1504 -2013 -1745 -459 526 533 -20 -101 -227 -540 -925 -1309 -1267 -1503 -994 -742 -496 -16 654 1033 1102 927 479
11873 479 79 -382 -774 -756 -520 423 1592 2609 3723 5285 5771 6514 6400 5843 5211 4758 4094 2459 -619
11853 -1629 -2873 -1889 -786 242 611 621 468 420 616 431 148 -286 -1126 -1909 -2805 -2809 -2142 -1159 -226 633
11832 955 793 461 -519 -742 -1224 -577 718 1602 1432 426 -875 -1880 -2109 -1163 -861 -851 -969 -1145 -927 -713
11812 -713 -620 -638 -629 -356 34 509 957 968 513 -159 -610 -166 491 1199 1541 1535 1510 1517 1586 1687 1860 1904 1726 1146
11788 1146 183 -652 -1720 -2021 -2031 -1120 -533 871 1639 2035 1758 1064 409 -129 -198 -187 122 550 911 1373
11768 1373 1574 1406 931 517 227 -249 -763 -1137 -1633 -1394 -330 300 666 882 725 307 -166 868 1815
11749 1815 2369 1866 1049 -2 -929 -1429 -962 175 1031 1215 905 435 242 793 2093 2320 2434 2120 2181 2116
$$ packed form
11895a504n09K68d59E26Pb0q1j26l13l85l84M2k36N09K52K46a6F54L79O9j75m48
11873D79G9c82l92J8K36D23J169J017J114J562M86P43j14n57o32m53o64j635f19
11853a629j244R84g86B42L69J0j53m8J96j85A48b86q40p83q96mO67R83b26F33
11832I55j62l32e19k23m82e77G18Q84j70D26h75j005k29R46L02J0j18j76K18K14
11812g13R3j8RK73C4M75M48J1m55a59m51a66D91P08L42ok5PO9J01J73M4j78n80
11788A146A83f52j068l01j0R11e33H71P68L96k77o94D09a29o9J1A22M28L61M62
11768A373K01j68m75m14B27b49n14l74m96K39c30C00L66K16j57C07a66H68R47
11749A815N54n03q17br27n00M67A75Q56J84l10D35j93N51J300K27J14l14O1o5
$$ plain form
11729 2116 1942 1817 1542 1174 497 -234 -1027 -1414 -1275 -749 -467 -656 -969 -1011 -798 -437 -163 222 784 1456
11709 1456 2087 2924 2378 1629 528 -649 -1244 -1356 -449 810 1305 894 238 -259 -335 -23 780 1284 1342 1056
11689 1056 685 240 -239 -808 -715 -614 -610 -657 -916 -1097 -1087 -1002 -753 -578 -314 -179 341 319 554 616 872 1019
11667 1019 1138 1073 935 552 218 -88 -218 -242 -251 160 -27 -397 -806 -1064 -1148 -1344 -1196 236 1579 2679 3294
11646 3294 2798 1687 620 -191 -492 -436 1 137 174 -42 -551 -1116 -880 390 953 1172 1521 1430 487 -632 -1328
11625 -1328 -1279 -1313 -1010 -697 -294 -599 -1206 -1877 -2086 -945 69 971 1288 1095 844 462 211 -20 -400 -1065 -1856
11604 -1856 -3052 -3573 -3335 -2120 -1287 -252 694 1292 1328 1095 798 1015 1408 1576 1858 1929 1856 1466 902 207
11583 -491 -1256 -1759 -2127 -1991 -1611 -1416 -949 -795 -741 -1032 -1021 -1142 -882 -813 -998 -1146 -1114 -871 -519 -621 -1123
$$ packed form
11729B116j74j25k75l68D97b34p93l87J39N26K82j89l13m2K13L61a63B22N62O72
11709A456O31Q37n46p49E28f49n95j12d49H10M95m11B38b59p6b3G80N04N8k86
11689A056l71B40b39n69R3J01Mm7k59j81J0Q5K49J75K64J35C41k2K35O2K56J47
11667A019J19o5j38l83B18h8j30k4rA60b7l70m09k58q4j96J48B36J343J100O15
11646C294m96j111F20a91l01N6AJ36L7d2n09n65K36C90N63K19L49r1D87f32o96
11625a328M9l4L03L13b94l05o07o71k09i45F9R02L17j93k51l82B11b0l80o65p91
11604a856j196n21K38J215Q33b52F94N98L6k33k97K17L93J68K82P1p3l90n64B07
11583d91p65n03l68J36L80J95M67J54N4k91J1j21K60O9j85j48L2K43L52j02n02
$$ plain form
11562 -1123 -1440 -1762 -1357 -673 159 609 1064 1422 1882 1931 1695 802 54 -807 -1111 -1042 -619 -617 -477 -298 -432
11541 -432 -154 63 261 349 680 977 1387 1640 1446 1363 1389 1381 1075 424 -693 -1854 -3108 -4051 -4788 -4126 -3121
11520 -3121 -2811 -1175 -824 -495 -1808 -1759 -2147 -1306 -1383 -1254 -641 -427 418 599 263 -493 -1121 -1416 -1321 -1097
11500 -1097 -700 -342 134 334 651 949 958 786 635 866 1058 930 824 286 -315 -761 -812 312 1038 1495
11480 1495 1279 913 400 -282 -721 -591 -598 -441 -557 -1180 -1766 -2071 -1784 -1251 -523 35 545 974 1170 908
11460 908 414 -155 95 613 1172 1498 1129 435 -853 -598 652 1671 2726 2920 3553 2930 903 0 -751 -1073
11440 -1073 -896 -627 -420 -267 -55 -108 -252 -714 -810 -1080 -1397 -1541 -772 -136 440 680 185 -319 -884 -923 -406
11418 509 1387 1751 1553 976 -46 -990 -1471 -1102 -678 -684 -1348 -2264 -1975 -924 106 1039 1555 1094 -418 -2125
$$ packed form
11562a123l17l22M05f73A59M50M55L58M60M9k36H02E4h07l04O9M23KJ40J79j34
11541d32a54F3J98Q8L31K97M10K53j94q3K6ql06D24f93j161j254r43p37O62J005
11520c121L10a175L51L29j313M9l88Q41p7J29O13K14D18J81B63d93o28k95R5K24
11500a097L97c42A34K00L17K98Rj72j51K31J92j28j06B86c15m46n1C12P26M57
11480A495k16l66D00b82m39J30pJ57j16o23n86l05K87N33e23C5N10M29J96k62
11460I08D14a55I5N18N59L26l69D35h53K55F52J019J055J94O33o23I03@g51l22
11440a073J77K69K07J53e5n3j44m62r6k70l17j44P69a36D40K40A85c19n65l9d06
11418E09Q78L64j98n77d6r44m81L69M24oo64r16K89i24A06R33N16m61d18j707
$$ plain form
11398 -2125 -3118 -2590 -2591 -2645 -2487 -1960 -631 289 431 171 135 150 56 -130 -573 -770 -625 -344 -62 -2 -92 -68 68
11374 89 -321 -996 -1491 -574 746 1439 1519 1237 693 -154 -821 -723 -622 -816 -789 -795 -857 -908 -1152 -1044 -847 -288
11351 188 827 1274 1320 1106 765 201 -470 -1212 -1916 -2721 -2487 -994 230 1422 2117 2244 2029 1441 345 -37
11330 -845 -1057 -790 -189 513 1066 1532 1780 1735 1745 1697 1597 1144 582 -207 -698 -1205 -747 408 712 707 691 966
11308 966 1153 847 16 -1069 -559 30 487 441 -9 -462 -1031 -1503 -1486 -1146 -637 37 757 1389 1713 1662 1890 1671
11286 1671 1166 709 591 476 785 960 845 24 734 1054 1343 1381 1089 553 33 -512 -287 158 469 656
11266 656 801 969 855 645 481 840 1328 1316 1238 1180 1195 954 598 276 -25 150 244 244 181 67 -369 -966 -1439
11243 -1439 -1964 -2307 -2048 -1794 -1318 -547 87 82 -551 -1228 -1569 -1452 -701 141 565 1708 436 -443 -1394 -2154
$$ packed form
11398b125r93N28jn4J58N27f31B89J42A71l6J5E6a30m43j97J45K81f2br0K4F8
11374H9c21o75m95e74G46O93Q0k82n44a54o67R8J01j94K7oo2n1k44J08J97b88
11351A88O39M47M6k14l41B01d70p42p04q05K34i94B30J192O95J27k15n88C45c7
11330h45k12K67a89E13N53M66K48m5J0m8j00m53n62b07m91n07M58D08L04nj6K75
11308I66J87l06A6a069N10C0M57m6im53n69m72J7L40N09C7P20O32L24n1K28k19
11286A671n05m57j18j15L09J75j15B4P10L20K89L8k92n36C3e12K25A58L11J87
11266F56J45J68j14k10j64L59M88j2p8n8J5k41l56B76b5A50R4%o3F7c69n97m73
11243a439n25l43K59K54M76e47H7ne51o77l41J17g01A41M24J143D36d43r51p60
$$ plain form
11223 -2154 -2075 -1416 22 533 604 -16 -1054 -1974 -855 35 765 934 668 173 -50 -382 -274 190 486 1115 1618
11202 1618 2171 2181 2071 1708 1003 4 -892 -1671 -2238 -1821 -1414 -1563 -1662 -1881 -1955 -1746 -1258 -569 145 799 1291
11181 1291 1494 1116 1278 1555 1745 1608 1157 995 970 1381 1591 1650 1708 975 172 -184 286 581 489 208 -290
11159 -489 -227 -36 -199 -650 -97 1396 2915 3522 3376 3184 2479 1745 1345 991 365 -415 -1242 -1010 257 1243
11139 1243 1733 1481 833 -290 -1046 -381 510 872 706 302 -394 -1083 -297 -131 243 262 577 1182 1528 1133
11119 1133 327 -50 236 394 548 483 875 1036 834 447 -186 -450 -725 -1145 -1462 -352 683 -119 -907 -501
11099 -501 -537 -622 9 599 441 231 37 -309 -359 51 -151 -519 -888 -1184 -942 -512 -40 136 59 -73 -346 -652 -1179
11076 -1179 -1762 -1354 -1003 -1471 -1471 -1606 -1855 -1558 -1035 -1147 -3644 -2031 -783 251 1393 1869 2487 1783 1361
$$ packed form
11223b154P9O59B2N11P1a6j038r20h55C5P30J69k66A73e0l32J08A90K96O29N03
11202A618N53J0j10l63p05Dh92p79n67M17M07j49r9k19p4K09M88e69A45O54M92
11181A291K03l78J62K77J90j37m51j62k5M11K10N9N8p33A72a84B86K95r2B08b90
11159d89b27c6j63m51i7A396J519O07j46j92p05p34m00l54C65d15q27K32B57R86
11139A243M90k52o48b90p56c81E10L62j66C02c94o89b97a31B43J9L15O05L46l95
11119A133C27e0B36J58J54o5L92J61k02l87a86k64k75m20l17c52F83a19p88M06
11099e01l6q5IN90j58k10C7c09n0E1a51l68l69k96K42M30d0A36E9g3k73l06n27
11076a179n83M08L51m68%j35k49K97N23j12k497J613g83B51J142M76O18p04m22
$$ plain form
11057 1361 512 -49 -544 -1158 -1703 -2257 -1078 -1755 -2465 -2675 -2386 -4394 -3555 -1526 -40 1243 1455 869 -32
11037 -807 -811 60 993 1775 2270 2265 1830 1161 464 118 235 660 1281 1663 1842 1944 1929 1380 930 -70 -1230 -2169
11015 -2169 -2709 -2026 -1686 -1143 -461 226 562 889 279 -214 -304 -232 -435 -43 495 653 265 22 -227 -167 -32
10993 120 342 1446 2320 2210 1641 928 609 804 1323 1174 867 268 -348 -1069 -1891 -2351 -1858 -853 -233
10973 151 359 734 712 440 53 -78 -347 -662 -1247 -1470 -1284 -747 -55 303 502 490 233 -52 661 1178 912 597
10951 597 -99 -829 -1447 -1564 -846 328 1542 1844 1055 -291 -1363 -2105 -2848 -2216 -1322 -638 -857 -1618 -1299
10932 -1299 -423 163 560 350 -182 -900 -1718 -1992 -1963 -1749 -1675 -1616 -1652 -1833 -2116 -2727 -2550 45 1738 2643 2702
10911 2702 2650 2602 3662 4058 4388 4222 3147 1402 641 247 298 363 158 -268 -599 370 1520 1717 1096
$$ packed form
11057A361E12d9m95o14n45n54a078o77p10k10K89k008Q39a526d0A243K12n86c2
11037h07mF0R33P82M95nm35o69D64A18J17M25O21L82J79J02j5n49m50g0j160r39
11015b169n40O83L40N43d61B26L36L27B79b14r0P2k03d3D95J58B65B2b27O0c2
10993A20K22J104Q74j10n69p13l19J95N19j49l07B68c48p21q22m60M93h53b33
10973A51K08L75k2k72E3g8k69l15n85k23J86N37e5C03J99j2B33e2F61N17k66l15
10951E97i9p30o18j17P18C28J214L02p89b91j072p42p43O32Q94f38k19p61L19
10932a299d23A63L97k10a82p18q18k74K9K14P4N9l6j81k83o11J77D5J693R05N9
10911B702n2m8J060L96L30j66j075A402F41B47N1O5A58b68l31C70J150J97o21
$$ plain form
10892 1096 227 -365 -1160 -1223 -429 18 -245 -898 -1047 -649 -214 32 -257 -502 -758 -676 -434 -375 -367 -486 -534 -534 -508
10869 -508 -456 -99 205 317 150 136 463 642 870 1089 1406 1227 894 632 450 581 1098 1662 1792 1385 805
10848 805 103 -837 -1480 -2024 -2051 -1764 -1416 -1314 -1623 -2124 -2432 -1913 -469 553 1051 16 -1492 -2819 -3876
10829 -3876 -4214 -3597 -2062 -1568 -1445 -1659 -2188 -2828 -3650 -3155 -1336 -142 886 1785 2216 2289 2208 1954 1478
10810 1478 1434 1564 1284 1031 511 138 8 658 1465 2458 4029 4679 3779 1381 681 184 -102 -181 235 387
10790 387 715 617 578 673 572 210 -331 -495 -490 -97 267 494 420 26 -706 69 2044 3745 4125 4060 3005 1458
10767 428 22 -179 -602 -964 -1232 -1276 -979 -842 -892 -1127 -1154 -145 552 1202 1849 2236 1967 1564 912 13 -1089
10745 -2185 -4322 -4408 150 1546 2269 1903 1250 135 -932 -1919 -2373 -2021 -1423 -794 -467 -236 -539 -732 -618
$$ packed form
10892A096B27c65p95o3d29A8b45o53j49L98b14C2b57k45k56Q2K42N9Qj19m8%K6
10869e08N2i9B05J12A50j4L27J79K28K19L17j79l33k62j82J31N17N64J30m07n80
10848H05A03h37o43n44k7K87L48J02l09n01l08N19d69E53M98A6a492j327j057
10829c876l38O17J535M94J23k14n29o40q22M95a336a42H86Q99M31P3q1k54m76
10810A478m4J30k80k53E11A38HO50Q07R93J571O50r00A381F81A84a02p9B35J52
10790C87L28r8l9R5j01B10c31j64Ni7B67K27p4B6g06F9J975J701L80o5j055A458
10767D28B2a79m23l62k68m4K97J37n0k35k7a45E52O50O47L87k69m03o52A3a089
10745b185k137q6A50J396P23l66o53A35i32r87m54L52N98O29L27K31l03j93J14
$$ plain form
10726 -618 -569 -526 -609 -675 -370 -344 -499 -626 -404 -153 481 922 901 466 -35 -951 -1278 -710 -735 -1021 -1400 -1546
10704 -1546 -1343 -967 -343 358 930 1154 1120 723 815 849 1031 1031 453 477 1177 1794 2760 3570 4036 3968 1694
10682 156 -1326 -1100 -7 1219 2030 2256 2017 1482 837 465 220 -1 303 617 776 682 194 -506 -1200 -1768 -1897
10661 -1897 -1641 -1044 -211 -506 -1422 -2588 -3311 -1890 -883 160 265 -877 -2476 -1940 -1258 -619 -44 -166 -840
10642 -840 -767 -506 -468 -961 -1192 -1391 -1803 -2003 -1131 7 551 779 763 1163 1761 2615 3192 1412 336 -501 -966
10621 -966 -1098 -1601 -2113 -2777 -1744 -484 356 892 1302 1945 2790 3109 2918 2055 869 402 419 350 365 755
10601 755 1187 1693 1470 2225 2645 2718 2363 1498 375 -863 -1605 -1220 -1084 -1107 -1452 -2204 -2746 -3145 -2511 -1894
10581 -1894 -1288 -364 786 1479 1293 545 -421 -1429 -1869 -2124 -1760 -1394 -1104 -884 -781 -844 -917 -1321 -1581 -1486
$$ packed form
10726f18M9M3q3o6L05K6j55j27K22a53D81M41k1m35c5r16l27N68k5k86l79j46
10704a546K03L76c43C58N72K24l4l97R2L4J82%D53K4P00O17R66Q10M66o8A694
10682A56a326K26gA219Q11K26k39n35o45l72B20aC03L14J59r4A94e06o94n68j29
10661a897K56N97b11k95r16j166p23J421h83A60J05h77j599N36O82f19d4j22o74
10642h40P3K61L8m93k31j99m12k00Q72GN44K28j6M00N98Q54N77A412C36e01m65
10621i66j32n03n12o64J033d84C56N36M10O43Q45L19j91q63H69D02J7o9J5L90
10601G55M32N06k23P55M20P3l55q65C75h63p42L85J36k3l45p52n42l99O34O17
10581a894O06c64G86O93j86E45d21j008m40k55L64L66K90K20J03o3p3m04k60R5
$$ plain form
10561 -1486 -975 -150 722 1106 1014 177 -719 -561 246 1079 1684 1648 990 -24 -872 -1016 -756 -600 -480 -494 -426
10540 -426 -300 2 75 112 -139 -666 -1153 -1562 -1298 -167 1040 1567 1385 697 140 758 2321 3630 4072 2388
10520 2388 682 -624 -2103 -2247 -516 408 698 730 240 -429 -825 -136 740 1266 1413 1129 183 -887 -1944
10501 -1944 -2168 -1420 -289 543 1207 1195 536 -553 -1314 -2037 -2562 -2369 -1935 -1462 -950 -550 -475 -320 -303 -587
10481 -587 -677 -1184 -1676 -1921 -2073 -1582 -1175 -819 -810 -748 -534 -522 -692 -610 -324 322 1240 1804 2094 1649 703 -435
10458 -702 887 1339 1031 310 -663 -1573 -2064 -1707 -1386 -1187 -1158 -1034 -856 -1195 -1149 -804 -391 -34 -20 -420 -729
10437 -729 -301 22 -36 125 148 -80 -426 -1006 -1731 -844 -556 -599 -584 -565 -26 371 222 249 583 810 719 402 69
10413 569 1219 848 -181 -1545 -1919 -441 855 1349 1161 510 -388 -1506 -2019 -1166 262 1029 1661 1614 1235
$$ packed form
10561a486N11a50G22L84r2A77g19J58B46Q33O05l6o58b4q48j44K60J56J20j4O8
10540d26J26BP3L7a39n27m87m09K64a67A040N27j82o88A40O18J563J309M42j684
10520B388F82f24j479j44e16D08K90L2B40d29l96a36G40N26J47k84A83h87j057
10501a944k24P48b89E43O64j2E36e53p61p23n25J93M34M73N12M00P5J55J7k84
10481e87r0n07m92k45j52M91M07L56RO2K14J2j70Q2K86C22R18N64K90m45G03d35
10458g02H87M52l08C10f63r10m91L57L21J99K9J24J78l39M6L45c91c4J4m00l09
10437g29c01B2c6A25K3h0l46n80p25h44K88m3J5J9b6C71j49K7L34K27r1l17F9
10413E69O50l71a81j364l74d41H55M94j88E10c88j118n13Q53B62P67O32m7l79
$$ plain form
10394 1235 818 350 -362 -1024 -1758 -2092 -1041 -469 -303 -279 -402 -853 -1475 -1989 -1684 -929 -99 88 79 -195 -264
10373 -264 81 -1179 -2333 -3365 -111 1650 2816 5392 5375 5266 4030 2123 -350 503 1373 2247 2536 2135
10355 2135 1337 508 195 484 539 225 74 26 -116 -499 -997 -1680 -2372 -2928 -2943 -2020 -1294 -743 -467 -719 -498
10334 -498 -608 -539 -806 -174 691 791 996 1384 1416 1118 463 81 1181 2786 4487 3839 1352 127 -320
10314 593 1009 731 210 300 549 741 903 1049 1184 914 703 406 -118 -523 -800 -391 105 583 642 405
10294 405 100 18 143 -144 -343 -680 -336 504 894 725 75 -593 -830 -628 -432 -461 -740 -1220 -1780 -2074 -2100
10273 -2100 -1898 -1843 -1601 -916 260 1224 1590 1479 1425 2031 2571 2440 1588 -270 -1305 -1897 -1986 -676 436 1626
10253 1626 1396 658 -573 -1679 -2466 -3080 -2740 -1249 -453 82 146 -350 -243 122 -562 -628 -89 282 292 283 -126
$$ packed form
10394A235m17C50c62o62p34l34a041d69J66K4j23m51o22n14L05P55i9H8ra95o9
10373b64H1a179j154j032a11A650J166K576j7j09j236j907c50E03Q70Q74K89m01
10355B135p98E08A95K89N5B25G4B6a16l83m98o83o92n56j5R23P26N51K76k52K21
10334d98j10O9k67a74F91J00K05L88L2k98D63H1J100J605J701o48A352A27c20
10314E93M16k78B10R0K49J92J62J46J35k70k11k97a18m05k77c91A05M78N9k37
10294D05A00A8J25a44j99l37c36E04L90j69G5e93k37K02J96k9k79m80n60k94k6
10273b100K02N5K42O85B60R64L66j11n4O06N40j31q52b70j035n92q9f76D36J190
10253A626k30F58e73j106p87o14L40a249d53H2O4c50J07A22e62o6h9B82J0ra26
$$ plain form
10231 -1044 -1416 -1210 -627 -2 291 -342 -1080 -1861 -2768 -2311 -1972 -1629 -791 172 1389 1633 2037 2157 1902 1255
10211 1255 368 -220 -656 -531 -384 -215 -489 -681 -743 -545 -464 -386 -344 -517 -916 -1047 -1008 -702 -521 -161 409
10189 1032 1706 2137 2271 2413 2488 2423 2174 1896 1484 1109 704 222 -142 -302 -246 -688 -751 -575 -230 -267 -574
10168 -574 -539 -541 -601 -734 -1023 -1172 -1266 -1027 -326 2 -392 -515 -657 -516 -432 -652 883 1171 733 -65 360 -221 593
10144 1240 1305 957 53 -997 -1823 -2421 -2689 -2236 -1208 133 1064 1841 2225 1697 626 -522 -1759 -2966 -2930
10125 -2930 -1718 -364 612 1506 1991 1955 1713 1312 1025 685 585 569 -283 -1026 -764 -490 -128 52 272 287
10105 287 -133 -241 49 679 1356 1288 622 -252 -1177 -1529 -1521 -1192 -886 -646 -606 -358 45 480 1117 2037 2723 3240
10083 3240 3441 3406 3482 3548 3142 2473 807 309 403 377 926 626 -354 -1020 -578 397 1494 2728 2780 1900 1039
$$ packed form
10231a044l72K06N83bB91c42p38p81r07M57L39L43g91A72J217K44M04J20k55o47
10211A255C68b20m36J25J47J69k74j92o2J98Q1P8M2j73l99j31L9L06J81a61D09
10189A032O74M31J34J42P5o5k49k78m12l75m05B22a42j60N6m42o3J76b30l7l07
10168e74L5ko0j33k89j49r4K39c26Bc92j23j42J41Q4k20H83K88m38f5C60b21E93
10144A240O5l48E3i97q26n98k68M53J028A33R31P77L84n28F26e22j237j207L6
10125b930J212c64F12Q94M85l6k42m01k87l40j00j6b83p43K62K74a28E2K20J5
10105B87a33j08D9O30O77o8F22b52r25l52QL29L06K40M0K48D5M35O37R20O86N17
10083C240K01l5P6O6m06o69H07C09R4k6N49l00c54o66M42C97J097J234N2q80q61
$$ plain form
10062 1039 324 46 133 1041 2032 2476 2557 2374 1784 1051 -609 -870 -1947 -1526 -506 771 1075 1600 1270 726
10042 726 75 -306 -593 -997 -1467 -1998 -2257 -2317 -1969 -1940 -2284 -2400 -1954 -1773 -636 -268 -198 -1146 87 -260 -408
10021 -408 -735 -335 540 225 63 -335 -470 -55 602 575 322 -72 -986 -1464 -1812 -2997 -3847 -2377 -1188 -308
10000 28 41 -196 -889 -1764 -2557 -3939 -5094 -4964 -1542 -103 -2372 -2155 -2428 -2280 -1606 485 1862 1429 1974
9981 1974 1258 997 478 261 457 639 865 749 776 763 360 -93 -453 -599 -346 309 599 493 -206 -871 -1574
9960 -1574 -2474 -2843 -1674 -219 826 1144 824 196 176 438 565 408 124 186 125 190 89 649 964 1090 1044
9939 1044 854 690 246 -492 -1143 -872 -228 498 1056 1138 665 -114 -542 -351 1031 2041 1584 222 -1359
9919 -3383 -3241 -1464 -798 -829 -758 -342 473 731 493 49 -538 -1212 -488 252 1019 1941 2863 3706 4358 4973
$$ packed form
10062A039C24D6Q7R08R91M44Q1j83n90p33f09k61j077M21e06G71L04N25l30n44
10042G26G5c06k87m04m70n31k59o0L48K9l44j16M46J81f36b68P0r48H7b60j48
10021d08l27c35E40B25F3c35j35e5F02k7k53g2r14m78l48j185q50J470a188c08
10000B8J3a96o93q75p93j382j155J30a542a03k269K17k73J48O74D85J377m33N45
9981A974p16k61D78k17J96J82K26j16K7j3C60i3l60j46K53C09K90j06b06o65p03
9960a574r00l69J169b19H26L18l20A96k0K62J27j57A24O2o1O5H9N60L15J26m6
9939A044j90j64B46d92o51K71b28D98N58Q2m73a14m28J91A031J010m57B22a359
9919c383J42a464O66l1P1c42D73K58k38D9e38o74d88B52P67R22R22Q43O52O15
$$ plain form
9899 4973 4453 3214 1653 669 28 534 1468 2610 3233 3382 2943 1882 991 -210 -1043 -1410 -756 38 678
9880 678 1029 1325 1437 1463 1405 1301 1144 827 388 58 -296 -453 -105 -158 -429 -916 -950 -231 597 1461 2125 2119
9858 2119 1773 1128 445 -224 -778 -1006 151 855 767 552 283 274 64 -207 -675 -954 -976 -626 -21 808 1344 1295
9836 1295 786 -43 -868 -1437 -1585 -1724 -1671 -1225 -1140 -1287 -1511 -1673 -1953 -1155 -107 368 657 327 -20 -839 -1574
9815 -1574 -1743 -124 790 710 122 -549 115 722 1130 1247 950 390 350 937 768 -96 -1348 -805 317 1316
9795 1316 2133 3179 2511 1098 -1194 -3701 -1776 -302 782 910 418 -657 -1994 -2080 -744 -821 -1492 -1811
9777 -1811 -815 -27 348 291 -233 -534 -825 -1036 -658 -61 293 289 182 -477 -969 -1057 -1247 -1666 -1892 -1689 -687 343
9754 500 182 -393 -1176 -1176 -487 -292 -847 -1343 -1778 -1889 -1493 -987 -431 145 182 -121 -64 474 671 586 436 491
$$ packed form
9899D973n20j239j561F69B8N06R34J142O23J49m39j061q91b10q33l67O54C8O40
9880F78L51K96J12K6n8j04j57l17C88E8b96j57a05n3k71m87l4b31E97Q64O64o
9858B119l46o45D45b24n54k28A51P04q8k15k69rF4b07m68k79k2L50b1H08N36m9
9836A295n09d3q25n69j48j39N3M46Q5j47k24j62k80P98a07C68K89C27b0q19p35
9815a574j69a24G90q0A22e49A15O07M08J17k97C90m0N87j69i6j252N43C17R99
9795A316Q17J046o68A098a194k507a776c02G82J28D18f57j337q6g44p7o71l19
9777a811h15b7C48n7b33l01k91k11L78f1B93mj07d77m92q8j90m19k26K03f87C43
9754E00A82c93p83%d87J95n55m96m35j11L96N06d31A45L7a21N7D74J97q5j50N5
$$ plain form
9732 491 793 1247 1710 2250 2810 2096 966 147 -912 -1635 -1839 -1920 -1924 -1472 -1260 -1249 -1236 -1168 -722 -745 -1221 -1250 -1073
9709 -1073 -304 -47 -705 -705 -449 17 189 111 -187 -177 -645 -1071 -1189 -1095 -787 -579 -540 -113 173 228 130 -61 -314
9686 -314 -859 -1417 -1961 -2164 -1988 -2212 -1444 -881 520 1675 2128 1767 1040 491 1058 2181 3058 3956 4254
9667 4254 4403 3968 2922 343 -743 -1012 -1105 -918 -664 -379 -44 -422 -12 -42 0 28 23 673 396 111 112 -991 -417
9643 443 1476 2234 6073 5841 5033 4080 2154 163 463 424 1314 1050 390 230 237 327 677 1119 1488 1748
9623 1748 1360 933 54 -565 -633 506 1667 3093 4735 5675 6054 5777 4028 2136 1083 653 430 411 603
9604 603 573 157 -575 -1243 -1185 -376 18 64 -306 -644 -740 -700 -876 -1182 -1144 -1501 -1696 -1941 -1676 -1562 -1231 -977
9582 -977 -1138 -1850 -2071 -2231 -2356 -2105 -1326 -773 -544 -281 -141 216 438 468 -39 -898 -1935 2250 -814 3696
$$ packed form
9732D91L02M54M63N40N60p14I66A47i12p23k04q1mM52K12J1J3O8M46k3m76k9J77
9709a073c04d7o58%K56A7J72p8a87J0m68m26j18R4L08K08L9a13A73N5r8f1k53
9686c14n45n58n44k03J76k24P68N63E20J155M53l61p27D91N67J123Q77Q98K98
9667D254J49m35j046C43g43k69r3J87K54K85d4l78a2l0@B8nO50k77A11Ji91d17
9643D43J033P58L839k32q08r53j926A63L00l9Q90k64C90j60PR0L50M42L69K60
9623A748l88m27E4e65o8E06J161J426J642R40L79k77j749j892j053m30k23j9J92
9604F03l0A57e75o68N8c76A8M6c06l38r6M0j76l06L8l57j95k45K65J14L31K54
9582i77j61p12k21j60j25K51P79N53K29K63J40B16K22L0c9q59j037B250h14C696
$$ plain form
9561 3639 3070 980 735 -751 -103 -1109 -1687 -152 668 1804 2796 3345 3462 3088 2051 1746 1536 1213 681
9542 681 -324 -1104 -893 -662 -606 -770 -1213 -1618 -2000 -2133 -1960 -1424 -739 283 574 76 -620 -1077 -879 -1305 -771
9521 -771 -418 -663 -871 -2242 -1144 -983 -833 -971 -1001 -223 659 624 166 1 -834 -624 139 862 1310 1408 1376
9500 1376 811 511 -72 -385 50 569 812 740 -7 -442 -654 -629 -188 835 2092 2954 2982 2573 2227 2126 1988 2109
9478 2109 1865 1805 1783 1265 499 -409 -1903 -4763 -6617 -7413 -8403 -7493 -5296 -3967 -2562 -345 2016 4649
9460 4649 6645 8561 9900 10092 8721 6831 4285 113 -933 -1194 -864 -632 -778 -397 264 1056 1656 1863
9442 1863 1583 1001 755 965 1373 1627 1267 592 -195 -1308 -2077 -2225 -1681 -982 -841 -857 -957 -1119 -1151 -2090
9422 -2090 -2239 -1529 -1038 600 1535 1295 730 157 -569 -1173 -23662 1117 1581 1379 716 319 -343 -768 -1363
$$ packed form
9561C639n69I80k45g51a03j006n78a52F68J136R92N49J17l74j037l05k10l23n32
9542F81c24p80K11K31N6j64m43m05l82j33J73N36O85B83K91G6f20m57J98m26N34
9521g71L53k45k08j371J098J61J50j38l0b23F59l5A66Ah34K10A39P23M48R8l2
9500A376n65l00g2l13E0N19K43p2gm35k12K5a88H35J257Q62K8m09l46j01j38J21
9478B109k44o0k2n18D99d09j494k860j854p96r90R10K197J329J405c45B016K633
9460D649J996J916J339J92j371j890k546A13i33k61L30K32j46L81B64P92O00K07
9442A863k80n82k46K10M08K54l60E92a95j113p69j48N44O99J41j6j00j62l2r39
9422b090j49P10M91F00R35k40n65A57e69o04k2489A117M64k02o63C19c43m25n95
$$ plain form
9403 -1363 -1602 -1172 -282 376 643 633 423 -618 -560 141 868 909 254 -877 -2131 -1400 -84 712 1178 1266 977
9382 977 644 318 -86 -156 -441 -439 -340 -316 -372 -548 -951 -760 -297 50 329 561 521 292 -154 -413 -341 -253 -535 -919
9358 -919 -879 -477 565 1573 2376 2600 2088 1263 200 -660 -1142 -1104 -881 -723 -373 138 530 713 737 894 926
9337 926 860 548 -114 -962 -1679 -1720 -1441 -1268 -1238 -1250 -1437 -1596 -2039 -1871 -1436 -793 -387 103 222 343 407 363
9315 363 240 159 361 657 908 1061 1147 856 830 775 755 576 478 275 -1 -862 -781 -518 -200 -66 25 -245 714 1245
9291 1245 1133 580 -5 -225 -130 631 1499 3288 3123 2580 2459 1265 -31 -321 -307 -106 606 1012 922 246 -673
9269 -1417 -229 36 183 -120 -635 -1179 -1377 -1646 -1655 -834 -227 -114 -240 -440 -677 -800 -240 718 789 451 399
9248 399 859 1097 1770 1838 974 402 -506 -1378 -1816 -2243 -1591 -619 51 107 -72 -146 250 856 1545 1992 2138 1820
$$ packed form
9403a363k39M30b82C76K67j0k10f18N8A41P27M1B54h77j254P31h4G12M66Q8k89
9382I77l33C18h6p0k85KR9K4n6j76m03J91b97E0K79K32m0k29a54k59P2Q8k82l84
9358i19M0M02E65J008Q03K24n12q25B00f60m82L8K23J58L50A38L92J83K4J57L2
9337I26o6l12a14q48p17m1K79J73L0j2j87j59m43J68M35O43c87A03J19J21O4m4
9315C63j23q1K02K96K51J53Q6k91k6n5k0j79r8k03aq61Q1K63b00f6B5b45G14N31
9291A245j12n53ek20R5F31Q68J789j65n43j21j194c1k90J4a06F06M06r0B46f73
9269a417b29C6J47a20n15n44j98k69rQ21b27J13j26k00k37j23b40G18P1l38n2
9248C99M60K38O73O8q64D02e06q72m38m27O52f19E1N6g2p4B50O06O89M47J46l18
$$ plain form
9226 1820 1139 295 -538 -984 -746 -111 43 360 576 483 -32 -512 -844 609 1333 1299 967 584 344 3 19 -254
9203 -632 -724 -1198 -1478 -1812 -2052 -1135 -572 -593 -454 -482 -158 253 499 787 743 710 248 -119 -401 -1111 -1545 -2595
9181 -2595 -2441 -980 404 1403 1684 1361 834 258 -10 -365 -689 -53 315 206 -448 -1387 -2213 -3250 -3456 -2575
9161 -2575 -2173 -1818 -1174 -455 466 1309 1813 1982 1680 974 119 -185 -175 226 637 363 118 -476 44 1628
9141 1628 2063 1889 1409 1006 720 602 170 -410 -893 -1064 -1210 -945 -475 -28 413 1042 1559 1501 1003 284
9120 -673 -1345 -1638 -1160 -1611 -1598 -1011 -265 379 371 71 -97 166 584 825 1029 709 622 296 -166 -633 -960 -1321
9098 -1321 -1612 -1856 -1804 -768 -615 -363 -84 -273 -1421 -1652 -1560 -466 781 1494 1780 1787 1680 1535 1353 939 358
9076 -54 -393 -825 -1670 -1844 -832 13 -2 39 133 220 360 296 235 331 926 1590 2624 2521 767 130 522 1663 2148
$$ packed form
9226A820o81B95e38m46K38a11D3L17K16r3c2m80l32F09P24l4l32l83k40CJ6b54
9203f32r2m74k80l34k40R17N63k1J39k8a58B53K46K88m4l3B48a19k82p10m34j050
9181b595J54i80D04R99K81l23n27B58a0l55l24e3C15j09d48r39q26j037k06Q81
9161b575M02L55O44d55D66Q43N04J69l02p06A19a85J0B26M11k74A18d76D4J584
9141A628M35j74m80m03k86j18A70d10m83j71j46K65M70b8D13O29N17n8m98B84
9120f73o72k93M78m51J3N87b65C79qG1i7A66M18K41K04l20q7B96a66m67l27l61
9098a321k91k44N2g68J53K52h4j89j148k31R2d66G81P13K86Pj07j45j82m14C58
9076e4l39m32q45j74h32A3bC9R4Q7J40o4o1R6N95O64J034j03G67A30L92J141M85
$$ plain form
9053 2148 2292 2031 1572 767 14 -895 -1042 -688 127 471 55 -558 -1056 -1470 -1638 -1138 -341 354 715 477
9033 477 -121 -816 -1459 -1999 -1747 -983 -219 585 1336 1836 1738 1395 781 23 -170 -79 463 1111 1524 1494 883
9012 883 417 2 -102 -116 -584 -577 194 972 1181 781 150 -776 -1701 -2189 -1741 474 1023 430 -210 -596 -667 -804
8990 -804 -1005 416 1856 2143 1797 976 1120 497 57 -523 -1223 -787 123 310 -139 -770 -1389 -1797 -1934 -1500
8970 -1500 -828 -310 275 426 52 -80 1 198 622 1080 1428 1641 1287 678 -99 -1239 -2070 -2338 -1301 -17 542
8948 573 554 -130 -979 -1609 -597 245 803 1254 1698 1903 1718 1200 704 -80 -497 -844 -1097 -1484 -1572 -1298 -1234
8927 -1234 -1083 -1044 -1270 -1264 -1722 -1389 -1048 -681 -395 484 911 731 161 -766 -1601 -1970 -1857 -1342 -464 617 1370
8906 1370 1752 1477 840 -38 149 1273 1917 1714 1108 337 -384 -779 -1100 -1550 -2194 -3772 -1263 -1265 -1002 -1192
$$ packed form
9053B148J44k61m59G67A4h95j47L54A27L44E5e58m98m14j68N00c41C54L61k38
9033D77a21o95o43n40K52P64b19E85P51N00r8l43o14B3a70g9D63O48M13l0o11
9012H83D17Ba02j4m68PA94P78K09m00A50g76r25m88M48D74N49D30b10l86p1j37
8990h04k01D16J440K87l46q21J44D97E7e23p00M36A23J87a39o31o19m08j37M34
8970a500O72c10B75J51E2h0AJ97M24M58L48K13l54o09i9j140q31k68J037a7E42
8948E73j9a30q49o30e97B45N58M51M44K05j85n18m96h0m17l47k53l87q8K74O4
8927a234J51L9k26Om58L33L41L67K86D84M27j80A61g66q35l69J13N15d64F17P53
8906A370L82k75o37c8A49J124O44k03o06C37c84l95l21m50o44j578a263kK63j90
$$ plain form
8886 -1192 -1062 -571 2 127 119 188 862 1910 3384 4274 4956 4939 3955 1751 609 -433 -1084 -596 219 255 -187
8864 -819 -988 -848 -973 -875 -945 -709 -732 -587 295 865 1286 1420 1228 747 328 94 590 972 1096 540 -229
8842 -840 -1535 -1616 -1139 -194 373 711 89 -368 251 1071 1392 1742 1686 1805 1498 660 -93 -507 -548 -557 -382 56 -69
8818 -172 -410 -394 -92 275 535 540 3022 2622 1338 -1616 -1692 -1257 -633 -277 -369 -604 -825 -786 -269 -480 -397 -492
8796 -492 -220 53 25 -379 -929 -1376 -1701 -1145 -404 624 973 835 890 1043 927 864 892 1188 1486 1591 1359 359
8773 -559 -1638 -2174 -1974 -1782 -1051 -608 -168 330 1015 1735 2000 474 390 -1103 -2408 -3455 -2609 -2156 -2373
8754 -2373 -2399 -2283 -2057 -1471 -992 -25 223 658 842 689 187 -713 -1685 -2585 -2509 -3065 -2949 -2866 40 1312 2382
8733 2382 2209 1200 -267 -1090 -85 966 -1465 -2707 -3191 -2395 -1486 -1382 -7936 -737 4958 4971 2364 2261
$$ packed form
8886a192J30M91BJ25qO9O74J048J474Q90O82j7r84A751F09d33o51M88B19L6a87
8864h19j69J40j25R8p0K36k3J45B95N70M21J34j92m81C28I4M96L82J24E40b29
8842h40o95q1M77a94C73L38H9c68B51Q20L21L50n6J19l07F60i3m14m1rJ75E6f9
8818a72k38J6i2B75K60NK482m00j284a616p6M35O24b77r2k35k21L9b69k11Q3r5
8796d92b20E3B5c79n50m47l25N56d04F24L49j38N5J53j16o3K8K96K98J05k32C59
8773e59j079n36K00J92P31M43a68C30O85P20K65D74q4a103j305j047Q46M53k17
8754b373k6J16K26N86M79b5B23M35J84j53A87g13r72r00P6n56J16Q3D0J272J070
8733B382j73j009b67q23h5I66a465j242m84P96R09J04o554g37D958J3B364j03
$$ plain form
8715 2261 1367 649 -1735 -9079 -13043 -11710 -7012 -5676 -1154 -1210 946 1149 1388 1662 276 -991 -1937 -3891
8697 -3891 -5392 -2505 -688 -456 1579 362 1921 1472 1173 202 -732 -1045 -1199 -599 32 60 58 -203 -274 -670
8677 -670 -1210 -1846 -2197 -2626 -2204 -1773 -1607 -1257 -904 -601 -522 -757 -937 -578 481 -76 -1448 -2759 -3771 -9379
8657 -9379 -7520 -5515 -4304 -2430 -930 -543 134 1030 1513 1800 2176 1893 1416 1051 285 -782 -2087 -1968
8639 -1968 -1492 -1864 -2365 -3295 -4693 -5011 -4916 -4463 -2883 -1211 -924 -537 -100 306 826 1192 1234 962 850
8620 850 812 856 555 372 302 25 -306 -574 -771 -606 -862 -1276 -1755 -2036 -1684 -772 -38 468 338 -145 340 1689
8598 1689 2495 4212 8995 8723 7260 3064 1388 510 -290 -880 -988 -507 -129 -3 26 -459 -897 -1219 -1283
8579 -1283 -862 -381 -198 -516 -999 -1706 -1189 863 2049 2558 2457 1069 363 -318 -595 -562 -217 266 771
$$ packed form
8715B261q94F49a735p344l964J333M698J336a154n6I46K03K39K74B76i91r46j954
8697c891j501b505f88K32A579C62J559m49k99B02g32l13j54e99C2K8kb03p1l96
8677f70n40o36l51m29M22M31J66L50L53L03P9k35j80L59D81g6j372j311j012n608
8657i379J859K005J211J874i30L87A34Q96M83K87L76k83m77l65B85g82j305J19
8639a968M76l72n01r30j398l18R5M53J580a211K87L87a00C06N20L66M2k72j12
8620H50l8M4l01j83p0B5c06k68j97J65k56m14m79k81L52g72c8D68j30a45C40J349
8598A689Q06J717M783k72j463C064A388E10b90n90j08M81a29cB6d59m38l22o4
8579a283M21c81J83l18m83p07N17H63J186N09j01A069C63c18k77L3b17B66N05
$$ plain form
8560 771 1055 1052 936 941 821 562 500 539 709 809 685 314 -258 -1151 -1480 -795 462 1510 2313 3031 3432 3432
8538 3432 3556 3189 2562 1823 1009 92 -750 -1526 -1272 422 1410 1521 910 -11 -1633 -2451 -1762 45 1483 2168
8518 2168 2613 667 -454 -1210 -1343 -898 -720 -1312 -1477 -1352 -1050 -788 -522 -305 -61 -209 -349 -507 -331 -1107
8498 -1107 -2167 -4990 -720 70 1276 894 1535 1516 988 426 466 474 442 165 207 894 1524 1831 1738 1393 923
8477 923 852 708 974 915 672 69 -469 -730 225 1291 1743 1805 1701 1244 700 -101 -584 -683 163 724 1267
8456 1267 839 -67 -1403 -1695 -935 3 548 610 163 -594 -752 -1099 -1958 -2251 -1127 -769 -746 -1566 -1607 -1721 -2123
8435 -2123 -1888 -657 488 1411 2241 3781 4055 3505 1433 -375 1750 4254 4614 4418 6034 9915 13340
8418 13340 14481 14010 12650 13855 17250 18360 21760 30570 29865 28221 26688 25686 23536 19781 14512
$$ packed form
8560G71K84lj16Nj20k59o2L9J70J00j24C14b58q93l29O85D62J048Q03P18M01%
8538C432J24l67o27p39q14I2g50p76K54D22R88J11o11a1j622q18O89D5J438O85
8518B168M45F67d54p56j33M45J78n92j65J25L02K62K66K17f1j48j40j58J76p76
8498a107j060k823g20G0J206l82O41j9n28D26M0Ql2A65M2O87O30L07r3l45m70
8477I23p1j44K66n9k43F9d69k61B25J066M52O2j04m57n44a01m83r9A63N61N43
8456A267m28f7j336k92P60CN45O2A63e94j58l47q59k93J124L58K3q20m1j14m02
8435b123K35f57D88R23Q30J540K74n50A433c75A750K504L60j96J616L881L425
8418A3340J141m71j360J205L395J110L400Q810p05j644j533j002k150l755n269
$$ plain form
8403 14512 9257 -1565 464 2674 2959 916 -1840 -844 1897 2564 1974 1311 711 138 178 1107 1735 1308
8385 1308 1704 1689 2956 1259 586 -824 -1180 -559 220 535 411 -254 92 -639 -1426 -1426 -1126 -549 -259 66 213
8364 213 1001 1374 1327 1010 619 193 -393 -785 -891 -663 -519 -539 -831 -976 -492 76 621 567 895 914 817 431
8342 431 -132 -1051 -1515 -1195 -512 -88 413 766 814 786 921 1311 1637 1727 1648 1270 1139 133 -383 -523 -884 160
8319 677 849 1014 577 -26 -369 -977 -655 288 1227 1705 1563 675 -502 -843 58 435 771 1085 1397 1506 1019
8298 1019 413 -214 -803 -1255 -231 123 -231 -978 -704 -258 70 -4 -77 -225 167 463 225 -156 -633 -715 -611
8277 -611 -281 1026 1494 1547 1193 328 -1128 -3002 -4104 -4125 -546 -423 -663 -1172 -732 695 2068 3794 4581
8258 4581 4549 3488 1335 437 -543 -1015 -747 295 1141 1633 2007 1989 1883 1072 -8 -810 1505 2400 1877 1001
$$ packed form
8403A4512n255a565D64K210K85I16a840h44A897O67n90o63o00A38M0R29O28m27
8385A308L96j5J267A259E86h24l56e59B20L15j24b54I2f39p87%L00e49b59F6J47
8364B13P88L73m7l17l91A93c93l92j06K28J44k0k92j45M84G6N45n4L28J9r7l86
8342D31a32r19m64L20e12h8D13L53M8k8J35L90L26R0p9l78j31A33c83j40l61A60
8319F77J72J65m37b6l43o08L22B88R39M78j42F75e02l41E8L77L36L14L12J09m87
8298A019D13b14n89m52b31A23b31p47K74b58G0dp3j48A67K96B25a56m77q2J04
8277f11b81A026M68N3l54C28a128j874j102k1e46J23k40n09M40F95J373J726P87
8258D581l2j061A335D37e43m72K68B95Q46M92L74j8j06q11hq02A505Q95n23q76
$$ plain form
8238 1001 -286 -830 1748 3848 4347 5352 5080 2441 1674 988 449 -251 -586 -570 -168 23 143 -5 -392 -951
8218 -951 -1410 -1593 -1198 -413 324 392 -46 -488 -826 -1465 -1846 -1074 -460 87 565 771 549 -802 -2528 -3140 -3111
8197 -3111 -2065 -1670 -704 53 665 1234 1589 2008 1787 910 -66 -915 -961 -784 -487 -51 235 -69 -419 -707 -675
8176 -675 -478 302 709 908 448 -380 -1348 457 1854 2482 1622 386 137 -1041 -1528 -432 956 2204 2938
8157 2938 3060 3429 3604 3603 3305 3050 2526 1754 566 -452 -1108 -1047 -486 695 1270 1091 420 -605 -1382 -1709 -2154
8136 -2154 -1160 101 1105 1915 2237 2632 1738 618 -419 -832 -1015 -100 458 764 666 264 -91 -303 -1070 -1273
8116 -1273 -1251 -146 1277 1093 270 -994 -2506 -4488 -4500 -2826 -1807 -832 -42 697 893 913 617 329 12 -239
8095 -623 -450 -558 -824 -765 256 1713 2560 3504 2792 2233 1653 1199 311 -485 -1119 -1120 -890 -572 -381 -400 -508
$$ packed form
8238A001b86n44A748K100M99J005k72B441p67o86D49b51l35J6a68B3J20el87n59
8218i51m59j83L95d13C24O8d6m42l38o39l81P72d60H7M78K06k22h02j726o12K9
8197c111J046L95g04E3O12N69L55M19k21q77f6q49m6J77K97e1B35f9l50k88L2
8176f75J97C02M07J99D48c80r68D57J397O28q60C86A37a041m87d32I56J248P34
8157B938J22L69J75jk98k55n24p72E66d52o56O1d86F95N75j79D20f05p77l27m45
8136b154R94A01J004Q10L22L95q94F18d19m13j83a00D58L06r8B64i1k12p67k03
8116a273K2a46A277j84B70i94j512j982j2J674J019h32d2F97J96K0k96k88A2b39
8095f23J73j08k66N9B56J457Q47R44p12n59n80m54C11d85o34jK30L18J91j9j08
$$ plain form
8074 -508 -470 -29 387 417 67 -331 -567 -535 -1629 -2312 -3876 -3326 -2908 -3086 -3435 -2566 -1534 -948 -499 -165 820
8052 540 318 -784 -1637 -1001 -1486 -69 1649 2504 3023 2516 1963 990 232 -363 -298 -155 29 -178 -99 25 29 335
8030 335 753 1067 1685 2025 1543 1152 961 1026 1162 937 987 1102 1708 2116 2133 1357 258 -655 -1094 -1382 -1765
8009 -1765 -2075 -1987 -1616 -1163 -596 40 610 1236 1472 1119 404 -785 -1920 -2861 -3611 -3527 -2623 -2129 -1229 164
7988 296 -691 -1582 -1905 -1827 -673 878 2586 4069 5555 5301 4659 3730 3057 1634 942 96 -1263 -2103 -1166
7969 -1166 286 1248 1495 622 -793 -1405 147 1211 1482 1175 401 -156 321 298 275 959 1434 1337 1555 1616 1154
7948 1154 919 621 41 -1127 -1727 -1556 -1139 -1808 -1736 -1034 -1304 -1311 -445 10 475 742 980 1086 1146 1177 947 650
7926 650 -1638 -520 -564 -1433 -1049 -2421 -3743 -2519 -787 377 647 27 -522 -538 -467 -461 -774 -1031 -1605 -1684 -1319
$$ packed form
8074e08L8b9C87L0F7c31k36L2j094o83j564N50M18j78l49Q69J032N86M49a65H20
8052E40k22g84q53O36m85f9A649Q55N19n07n53r73B32c63O5J43B9a78P9B5ML06
8030C35M18L14O18L40m82l91j91O5J36k25N0J15O06M08J7p76B58f55m39k88l83
8009a765l10Q8L71M53N67D0N70O26K36l53D04g85j135r41p50Q4R04M94R00A64
7988B96f91q91l23P8f73H78J708J483J486k54o42r29o73j423o92I6a263q40R37
7969a166B86R62K47F22g93o12A47J064K71l07D01a56C21k3k3O84M75r7K18O1m62
7948A154k35k98D1a127o00J71M17o69P2P02k70pd45A0M65K67K38J06O0L1k30k97
7926F50a638e20m4q69L84j372j322J224g87C77K70B7e22j6P1Ol13k57n74p9L65
$$ plain form
7905 -1319 -1041 -321 738 2167 3009 3123 2469 1397 154 -640 -1444 -2070 -2043 -1602 -890 -15 130 -31 65 882
7885 882 826 680 399 -12 -284 -58 -480 -892 -1337 -1423 -1537 -1402 -1329 -918 -516 -2 407 -203 -591 793 448 154
7862 -688 -2092 -3960 -5017 -7153 -6389 -6302 -2948 -583 745 905 1256 1004 526 44 -260 19 -79 -466 -1057 -1518
7842 -1518 -3279 -2439 -1089 -814 -573 -265 690 1018 2976 3459 2288 1549 960 -24 -749 -379 518 910 372
7822 -286 -200 -259 -410 -814 -1185 -2325 -922 -1267 -1280 -1795 -1997 -149 820 1278 1417 1163 986 465 -580 -1106 -290
7800 91 212 184 -256 -1579 -1834 -710 84 -376 -1139 -1711 -1582 668 1883 2019 1716 1461 181 -1403 -2815 -2550
7780 -2550 -1440 -802 -268 -842 -1541 -2984 -1148 -1182 -1229 -1348 -1120 -2381 -4917 -4795 -2726 -1516 -1740 -1669
7762 -1669 -1095 -63 1030 1701 1750 1397 601 -2363 -2504 -578 -26 -932 -1379 -917 -1433 -2729 -3908 -4303 -3353
$$ packed form
7905a319K78c21G38J429Q42J14o54j072A54f40q04o26K7M41P12a5A30c1F5Q17
7885H82n6j46k81a2k72e8m22m12m45q6j14J35P3M11M02bD07b03l88G93l45A54
7862f88j404j868j057k136P64Q7b948e83G45J60L51k52m78D4b60A9g9l87n91m61
7842a518j761Q40a089K75K41b65F90L28J958M83j171p39n89b4p25L70E18L92C72
7822b86Q6n9j51m04l71j140i22l45j3n15k02a49H20M58J39k54j77D65e80n26b90
7800I1J21k8b56j323k55g10H4c76p63n72J29F68J215J36l03k55A81a403j412K65
7780b550J110O38b68n74o99j443a148l4m7j19K28j261k536J22K069J210k24P1
7762a669N74f3A030O71M9l53F01b363j41e78b6r06m47M62n16j296j179l95R50
$$ plain form
7743 -3353 -2502 -2436 -1701 -661 421 800 822 490 392 586 1195 839 1029 642 -404 -1085 -1481 -2096 -1867 -1757 -985
7722 -985 -227 205 516 561 242 -165 -272 -97 412 935 1427 1813 1931 1679 1115 408 130 1083 1884 2033 2018
7701 2018 1656 1141 718 216 181 511 889 702 -247 -1311 -2378 -3282 -1875 -1083 -971 -684 -52 630 892
7682 892 320 -581 -439 4908 13613 21390 28257 31997 31183 26173 20972 13307 1318 -208 -688 -1682 -3021
7665 -3021 -2456 -3490 -2939 -2371 -2751 -1817 610 694 45 -931 -1664 -1061 -544 196 713 779 171 -510 -1549 -2709
7645 -2709 -3009 -2972 -2549 -2531 -1969 -1663 -1434 -1227 -747 274 1066 1617 1451 362 -934 -1749 -2014 -1823 -1111 -496
7624 -286 -490 -1013 -1758 -2946 -3599 -3343 -420 700 889 471 -260 -390 -445 -341 -490 -894 -976 -386 72 -320 -1274
7603 -1274 -1640 -106 1303 1518 1565 1210 1057 576 489 319 246 186 -181 -162 74 223 324 184 -327 -965 -1271
$$ packed form
7743c353Q51O6P35f61D21L79K2l32r8J94O09l56J90l87d04o81l96o15K29J10P72
7722i85b27B05L11M5B42a65j07i7D12N23M92L86J18k52n64D08A30R53Q01J49j5
7701B018l62n15m23B16l5L30L78j87b47j064j067r04J407P92J12K87e2F30K62
7682H92C20e81J42D908Q705P777O867L740q14n010n201p665A318b08m80r94j339
7665c021N65j034N51N68l80R34F10Q4D5i31p33O03N17A96N17O6A71e10j039j160
7645b709l00L7M23J8N62L06K29K07M80B74P92N51j66C62i34q15k65J91P12d96
7624b86k04n23p45j188o53K56d20G00J89m18b60j30n5J04j49m04q2c86G2c20r54
7603a274l66a06A303K15M7l55j53m81q7j70p3o0a81J9G4J49J01j40c27o38l06
$$ plain form
7582 -1271 -168 812 1369 1261 875 453 -44 -823 -1268 -1547 -743 182 777 1272 1631 1534 1185 484 -177 -774
7562 -774 -912 -1184 -1066 -942 -804 -1158 -1356 -141 670 1675 2526 3449 3424 2910 2827 2456 1577 871 -312 -1228
7542 -1228 -1535 -1069 -631 -234 -108 118 560 612 476 85 -295 -459 -557 -870 -1066 -1284 -1041 -382 -106 -661 -1130
7521 -1130 -1330 -961 67 480 313 -408 -1320 -1191 -924 -202 693 504 421 501 960 1570 1707 910 527 177 125
7500 125 -755 -896 -145 -368 -643 -378 -178 -112 -353 -446 -309 -863 -1742 -2578 -3421 -4242 -2073 -644 508 665
7480 665 747 882 1063 1255 1251 1253 1146 1123 1361 1259 1389 1269 1151 1094 1120 1256 1066 913 -168 -1328 -2027 -2444
7458 -2444 -1721 -370 179 152 -229 -360 -860 -981 -1036 -1131 -808 257 1343 2037 2588 2217 1527 820 -168 -308
7438 -308 -1024 -1831 -1619 -815 -68 68 -246 -601 -1279 -1311 -1868 -1346 -533 -92 741 1465 1297 1050 531 -878 -1991
$$ packed form
7582a271a68H12N57j08l86m22d4p79m45k79g43A82N95M95L59r7l49D84a77n97
7562g74j38k72J18J24J38l54j98a41F70J005Q51R23k5n14q3l71q79p06c12r16
7542a228l07M66M38b34a08A18M42N2j36H5b95j64r8l13j96k18K43c82a06n55m69
7521a130k00L69F7M13j67d08r12J29K67b02F93j89q3Q0M59O10J37p97l83A77n2
7500A25g55j41a45k23k75K65a78O6k41r3J37n54q79q36q43q21b073f44E08J57
7480F65Q2J35J81J92mKj07k3K38j02J30j20j18n7K6J36j90j53a68j160o99m17
7458b444P23c70A79k7b29j31n00j21n5r5L23B57J086O94N51l71o90p07a68j40
7438c08p16q07K12Q04f8F8b46l55o78l2n57N22e33i2G41P24j68k47n19h78j113
$$ plain form
7417 -1991 -2887 -1707 49 112 -334 -1553 -3045 -3673 -932 -819 -843 -751 -363 269 495 121 -996 -2315 -1426 901
7396 2110 2370 1644 765 -87 41 -754 -1778 -2349 -2036 -649 -339 -372 78 1665 4463 8136 8838 7984 5165
7377 5165 210 -963 -596 665 1785 1594 -51 -2058 -3300 -5358 -5254 -3308 1503 2679 1010 -2099 -3137
7360 -3137 1313 2635 4468 5745 9161 12456 13185 13007 9424 9286 2922 6646 8914 10418 3455 2056
7344 2056 -87 -752 3433 7715 8971 2711 -4239 -4426 1184 13951 28441 30359 29141 22687 35544
7329 35544 80557 122057 168710 204345 216745 187240 140975 96119 43598 4037 35794 44070
7317 44070 39498 26670 5399 -145 2880 4592 2895 5825 3132 -1925 -10101 -11259 -7433 -3717 2459
7301 3771 2877 1853 -4370 -3818 -2834 -2612 556 2258 4329 1210 2736 516 -1741 -2119 -3079 -1148 3288
$$ packed form
7417a991q96J180D9O3c34j219j492o28i32J13k4R2c63B69K26A21i96j319Q89I01
7396B110K60p26G65h7D1g54j024n71L13f49L10l3G8J587K798L673P02q54k819
7377E165B10i63L67F65J120j91e1k007j242k058J04J946A503J176A010b099j038
7360c137A313J322J833J277L416L295P29j78l583j38B922L724K268J504C455j399
7344B056h7o65C433M282J256B711d239j87A184J2767J4490J918j218o454J2857
7329C5544M5013M1500M6653L5635J2400k9505m6265m4856D3598D037L1757Q276
7317D4070m572j2828E399a45B880J712j697K930k693a925q176j158L826L716B459
7301C771q94j024d370N52R84K22E56J702K071A210J526E16a741l78r60a148C288
$$ plain form
7283 4679 4830 4020 3815 2200 417 1328 995 462 -971 -2942 -2059 -1655 -764 628 1229 711 -1119 -2373
7265 -2373 -3869 -3480 -2417 -1625 -1457 -1863 -4374 -7135 -10710 -9401 -6477 -5460 -5831 -6211 -13812 -18074
7249 -18074 -13592 -8298 -3249 3383 6406 5554 1009 16 375 -557 -682 -4872 -4505 -1056 5074 9456
7233 9456 11292 8347 5798 2628 1888 2362 2380 -427 -2522 -10956 -17426 -12366 -2828 6278 6980 8953
7217 8953 9646 8204 13970 32285 43546 46770 46240 5627 15099 16317 -7490 -3531 1500 3728 19327
7202 19327 26878 14922 34441 42414 -5875 19711 58384 144007 218488 275996 279205 233109 219528
7189 219528 343081 560328 768382 915854 970683 940952 825320 677613 516860 374074
7179 374074 267268 208300 141217 115941 107523 86824 64652 -21151 22061 -55570 -60607 -31358
$$ packed form
7283D679J51q10k05j615D17R11l33D62i71j971Q83M04g64F28O01n18a119j254
7265b373j496L89J063P92J68m06k511k761l575J309K924J017l71l80p601m262
7249a8074M482N294c249C383L023q52A009A6L59e57j25m190L67a056E074M382
7233I456J836k945k549B628p40M74J8d27k095q434o470N060b828F278P02J973
7217H953O93j442N766J8315J1261L224n30E627R472J218g490c531A500K228J5599
7202A9327P551j1956J9519P973e875A9711L8673Q5623P4481N7508L209m6096j3581
7189B19528J23553K17247K08054J47472N4829k9731j15632j47707j60753j42786
7179C74074j06806n8968o7083k5276q418k0699k2172b1151B2061e5570n037K9249
$$ plain form
7167 -31358 5681 5330 5897 2015 -9571 -15002 -11747 -5904 -2063 512 7892 9230 13860 11445 6564
7152 6564 4221 5829 8711 12053 17596 16588 13551 8601 5840 6042 6310 3464 371 -191 -5527 2086
7135 5296 4859 2251 -2665 -5959 -12017 -11933 -10360 -10367 -11800 -8395 -6203 -4015 -1784 -1738 -2371 -2028 -7247
7118 -7247 -8188 -5565 -5187 -3796 -5353 -9251 -11183 -12548 -10143 -3642 392 382 7957 7360 4114 995 -4143
7100 -4927 -3533 -4497 -5031 -2122 -3342 -3198 -3714 -4166 -4962 -4757 -3576 -1330 -941 166 -571 -2029 -4064
7083 -4064 -4369 -3073 -1421 -1320 -3132 -4156 -2608 2190 5011 6038 4254 4231 5360 6998 8197 9334
7067 9334 10000 8664 7101 5867 4027 4946 3519 -1911 -4884 1375 5279 3687 779 -17197 -1561
7051 8223 13194 62813 164927 293063 429944 543045 609352 595785 540022 435491 300395
$$ packed form
7167c1358E681l51N67B015i571n431L255N843b063E12P380J338M630k415m881
7152F564k343J608K882L342N543j008l037m950k761K02K68k846C71a91n336B086
7135E296m37B251b665l294o058Q4J573pj433L405K192K188a784M6o33L43n219
7118g247r41K623L78J391j557l898j932j365K405c642C92j0P575n97l246I95d143
7100d927J394r64n34b122j220J44n16m52p96K05J181a330L89A66e71j458k035
7083d064l05J296a421J01j812j024J548B190K821J027j784k3J129J638J199J137
7067I334O66j336j563j234j840R19j427a911k973A375L904j592G79a7197a561
7051H223M971M9619J02114J28136J36881J13101O6307j3567n5763j04531j35096
$$ plain form
7040 300395 179042 82582 32350 24243 26491 12592 -1695 6868 8974 1926 -4368 -1791 2184
7026 152 -2270 -429 -3981 -2120 3423 1495 -4321 -6681 -6004 -2517 -2106 878 -444 -1917 -125 -1991 -4548
7009 -4548 -4705 -3327 -730 2581 5072 4724 3551 3029 3997 4339 4090 4103 4534 3862 2372 1458 1267 4672
6991 4672 2730 1275 -638 553 833 565 1229 2436 1978 878 1030 1104 1535 1403 2053 2343 2067 1782 861
6971 582 -399 -123 -444 702 649 -630 1268 1582 1358 1622 -250 -1119 -3533 -4187 -2895 268 -951 129 -85 417
6950 170 330 753 1685 2474 2759 2341 1222 525 -720 -1673 -829 565 1161 1390 781 363 -754 -1328 -1165 -735
6930 -735 -37 1041 1106 1922 2013 1236 -464 -1454 -1612 -1591 -1302 -946 -635 -250 -254 -420 -406 133 724 856 656 -54
6907 -905 -1157 349 1765 2229 1854 927 -610 177 677 616 -52 -737 -734 539 1532 1492 613 -244 -161 83 -190 -350
$$ packed form
7040C00395j21353H2582C2350q107K248A2592a695F868K106A926d368a791B184
7026A52b270d29l552J861C423A495d321k360O77b517M11H78d44j473a25j866k557
7009d548j57J378g30B581K491l48j173n22R68L42k49J3M31o72j490r14j91L405
6991D672j942A275f38E53K80k68O64J207m58H78J52P4M31j32O50K90k76k85H61
6971E82c99a23l21G02n3f30A268L14k24K64b50q69k414o54J292B68i51A29h5D17
6950A70J60M23R32P89K85m18j119E25g20r53h29E65N96K29o09C63g54n74J63M30
6930g35c7A041O5Q16R1p77d64r90j58K1K89L56L11b50mj66J4A33N91J32k00e4
6907i05k52C49J416M64l75I27f10A77N00o1e2o85LE39R93m0F13b44Q3H3a90j60
$$ plain form
6885 -350 -1115 -1742 -1925 -1058 -269 -235 -448 -342 274 389 -352 -1377 -1876 -2019 -1691 -1849 -1747 -1983 -2562 -2717
6865 -2717 -1985 -301 785 1288 1236 570 -308 -1021 -1114 -933 -755 -931 -994 -1275 -2527 -679 -626 -1269 -1090 -200 409
6843 1008 1172 751 58 -236 -374 -299 -293 -365 -208 76 232 539 923 1007 1047 850 714 145 -843 -2047 -3584 -3497
6821 -3497 -918 -889 -921 -794 -829 -683 -725 -1359 -2054 -2411 -1639 -587 74 118 -151 -739 -645 600 1216 1319 902 499
6799 499 392 800 1388 2070 2954 2992 2234 1687 672 11 87 840 1510 1806 1537 818 67 -474 -763 -759 -883 -796
6777 -796 -558 -84 345 727 980 973 863 676 239 -70 -122 73 701 1165 1512 1555 1250 805 474 378 499 791 945
6754 945 783 279 -155 -377 -198 -238 -283 -114 -609 -950 -1190 -1640 -1312 -1295 -1287 -1361 -1341 -1508 -1547 -1314 -711 -512 -627
6731 -627 -698 -225 346 711 854 833 480 74 -172 -393 -907 -1603 -2479 -5139 -3854 -1268 -594 -363 -549 -1066
$$ packed form
6885c50p65o27j83Q67b69L4k13J06B74J15c52j025m99j43L28j58J02k36n79j55
6865b717P32c01G85N03n2E70c08p13r3J81J78j76o3k81j252f79N3o43J79b00D09
6843A008J64m21E8b36j38P5Op2J57G6J56L07L84Q4M0j97j36A45h43j204j537Q7
6821c497i18K9l2J27l5J46m2o34o95l57P72e87G4M4a51n88R4F00O16J03m17m03
6799D99j07M08N88O82Q84L8p58n47F72A1P6P53O70K96k69p19F7d74k89Mj24Q7
6777g96K38h4C45L82K53pj10j87B39g0n2G3O28M64L47M3l05m45l31r6J21K92J54
6754I45j62B79a55k22J79m0m5a14m95l41k40m50L28J7Qp4K0j67l9K33O03J99j15
6731f27p1b25C46L65J43k1l53G4a72k21n14o96q76k660J285a268e94K31j86n17
$$ plain form
6711 -1066 -1631 -1748 -2297 -2559 -2631 -2290 -1683 -1042 -1 1288 2365 3278 3206 3238 3048 2942 2661 1564 781 139
6690 -319 -433 -450 -1387 -1828 -1939 -2186 -2173 -2511 -2289 -902 -728 -2069 -4038 -3418 -3812 -3516 -3884 -3953 -5083 -3136
6670 -3136 -1577 -2944 -3564 -6359 -5383 -4404 -2768 -1134 -996 -996 -156 203 1021 1087 337 -423 -1446 -2165 -2811
6651 -2811 -2180 -832 -148 257 714 617 265 -156 -544 -1015 -1781 -2214 -1684 -573 594 1376 1787 1697 1353 787
6631 787 248 -189 -421 -369 -381 -170 2 155 785 1598 2449 2607 2654 2292 1767 1271 1107 1042 965 550 121 39 457
6608 457 1314 2001 2374 2489 2282 1492 610 112 331 202 355 329 474 203 -43 -389 87 183 1 -1047 -650 -311
6585 -114 -349 -826 -1466 -1752 -1121 -442 37 424 1162 1940 2456 4389 4693 2404 815 -25 -244 402 1464 2034
6565 2034 1851 468 291 -424 -1099 -1201 -1276 -144 941 964 601 427 862 1537 2188 2546 2510 2163 1573 992 410
$$ packed form
6711a066n65j17n49k62p2L41O07O41aA288J077R13p2L2j90j06k81j097G81A39
6690c19j14j7r37m41j11k47J3l38K22i02J74j341j969O20l94K96l68o9j130J947
6670c136J559j367o20k795R76R79J636a134J38%a56B03Q18O6C37d23j023p19o46
6651b811O31h32a48B57M57r7B65a56l88m71p66m33N30e73E94P82M11r0l44n66
6631G87B48a89k32N2j2a70BJ53O30Q13Q51J58M7l62n25m96j64o5p7m15A21C9M18
6608D57Q57O87L73J15k07p90F10A12K19j29J53k6J45B03d3l46H7R6Aa047L97c11
6585a14k35m77o40k86O31d42C7L87P38P78N16J933L04k289H15b5k19D02J062N70
6565B034j83D68j77d24o75j02p5a44I41K3l63j74M35O75O51L58l6l47n90n81D10
$$ plain form
6543 163 -7 -750 -1114 -1370 -1202 -746 -493 -202 33 175 144 -104 -183 -183 -329 -360 -422 -1964 -3128 -657 -1781 -2867
6521 -2867 -3395 -3735 -3568 -2401 -1380 -731 -629 -916 -1676 -2039 -1942 -2115 -2047 -1710 -1532 -1146 -183 450 -92 -1081
6501 -1081 -2440 -3422 -4347 -4466 -3286 -1851 -587 421 1321 1452 809 661 -489 -1411 -2198 -2466 -1787 -1132 -641
6482 -641 -524 -380 -259 -712 -1205 -2073 -3074 -1719 -1104 -1199 -1131 -1331 -1623 -1188 -514 -614 -99 901 1909 2137
6462 2137 1691 1126 108 -950 -1536 -2479 -3099 -1186 540 1632 2055 1316 -1005 -2617 -3780 -3545 -2043 -544
6443 -12 251 1181 2107 2612 2806 2282 1513 505 -926 -1757 -1566 433 1562 2060 2319 2042 1615 1388 1284 1448
6423 1448 1926 2543 3144 4784 7612 8031 7859 6471 3008 1849 829 180 112 973 2160 2718 2493 1779
6405 1779 604 -955 -2132 -1349 5 -427 263 708 914 1435 2010 2631 3229 3232 3229 2744 2616 2304 2057 1955 1859 1310
$$ packed form
6543A63gp43l64k56J68M56K53b02C3J42l1a04p9%j46l1o2j542j164f57j124j086
6521b867n28l40J67J167J021O49J02k87p60l63R7j73O8L37J78L86a83D50i2r89
6501a081j359r82r25j19J180J435e87D21R00J31o43j48d89r22p87k68O79O55M91
6482f41J17J44J21m53m93q68j001J355O15r5O8k00k92M35e14j00i9I01J008K28
6462B137m46n65A08i50n86r43o20a186E40J092M23p39a005j612j163K35J502e44
6443a2B51R30R26N05J94n24p69E05i26q31J91D33J129M98K59k77m27k27j04J64
6423A448M78O17O01J640K828M19j72j388C008j159H29A80o8Q61J187N58k25p14
6405A779F04i55j177P83Ed27B63M45K06N21N75O21N98Llm85j28l12k47j02r6n49
$$ plain form
6383 1310 1095 713 660 1092 2030 2623 2526 2565 2067 1230 865 -316 -1912 -2292 -28 1347 2108 1879 1220 64 -812
6361 -2205 -1397 -807 -601 -869 -1016 -636 -591 -804 -404 175 533 439 -572 -1780 -3236 -3124 -3299 -2944 -1606
6342 -1606 775 636 -368 -1432 -1540 -1370 -922 -166 599 1520 1741 1209 625 46 -1895 -2508 -2394 -1728 -2036
6323 -2036 -2807 -2909 -430 -74 833 1918 2152 2434 2043 857 733 296 220 -144 -545 -539 -275 961 1633 963 -2548
6301 -3639 -183 799 187 -91 -922 -2349 -2492 -1164 182 -386 -678 -939 -663 -318 669 1058 505 -9 -1020 -1172
6281 -1172 2 743 983 579 173 -520 239 138 0 -652 -1553 -2370 -2426 -2406 -1033 -1268 -1298 -696 -475 -719 -711 -479
6259 -479 75 430 -97 -1908 -3434 -1359 1270 1912 2179 1491 687 -89 -151 196 444 90 -664 -1143 -914 -631
6239 -631 -488 -590 -553 -1414 -1275 -268 547 106 -1870 -3494 -5440 -6783 -7167 -6941 -5763 -2494 -104 1533
$$ packed form
6383A310k15l82n3M32R38N93r7L9m98q37l65c16j596l80b8A347P61k29o59F4h12
6361b205Q08N90K06k68j47L80M5k13M00A75L58r4e72j208j456J12j75L55J338
6342a606G75j39c68j064j08J70M48a66E99R21K21n32n84D6a895o13J14O66l08
6323b036p71j02d30g4H33J085K34K82l91H57j24B96p6a44m01OK64I61O72o70b548
6301c639a83G99A87i1q31j427j43a164A82c86k92k61K76c18F69L89E05ij011j52
6281a172BP41K40m04A73e20B39j01@f52r01q17n6K0a033k35l0O02K21k44QK32
6259d79G5L55i7j811j526a359A270O42K67o88F87h9o2A96K48I0f64m79K29K83
6239f31J43j02L7q61J39b68E47A06a870j624j946j343l84K26J178b494a04A533
$$ plain form
6220 2192 1822 948 0 -809 -1408 -1289 -1931 -2013 -1865 -1824 -1892 -1796 -986 238 1235 1778 1666 928 485 -753 -1657 -1975
6198 -1975 -2496 -2308 -1696 -1400 -1411 -1796 -1832 -983 487 1525 1718 996 24 -151 407 1661 2401 2617 2379 1603
6178 1603 244 -827 -843 579 2161 2791 2388 1389 385 -1000 -1372 -521 1 -390 -1151 -2542 -4531 -5655 -6115
6159 -6115 -5382 -3563 -2509 -2151 -1745 -1716 -1531 -1600 -1634 -1713 -1837 -1281 -283 1074 1811 2456 2029 1729 1546 1572
6139 1572 305 -427 1466 2896 4093 4111 2655 1906 483 -275 -343 -185 -364 -352 -1391 -1698 -1017 36 585
6120 585 709 -691 -2100 -2747 -1726 -3174 -4174 -4354 -5206 -4443 -3365 -1806 -728 769 -228 -2166 -2641 -2544
6102 -2544 -1899 -1514 -2992 -2614 -3227 -3395 -3081 -1660 -196 -47 -53 4675 13032 26043 36530 42325 45574
6085 45574 46578 39028 28708 16989 694 -5501 -793 -752 -2609 -3769 -3827 -2303 -950 -542 -1439 -1341 -600
$$ packed form
6220B192l70q74@h09n99J19o42q2J48M1o8R6Q10B38R97N43j12p38m43g53r04l18
6198a975n21J88O12K96j1l85l6Q49D87J038J93p22B4a51D07J254P40K16k38p76
6178A603B44h27j6E79J582O30m03r99C85a000l72e21Ac90p61j391j989j124m60
6159f115P33J819J054L58M06K9J85o9l4p9j24N56b83A074P37O45m27l00j83K6
6139A572C05d27A466J430J197J8j456p49D83b75o8J58j79J2j039l07O81C6N49
6120E85J24f91j409o47J021j448j000j80q52P63J078J559g28G69b28j938m75R7
6102b544O45L85j478L78o13j68L14J421a96d7oD675Q357J3011J0487N795L249
6085D5574J004p550j0320j1719F94e501g93M1j857j160n8J524i50M08q97R8f00
$$ plain form
6067 -405 -34 162 406 692 1118 668 -89 -669 -694 -317 113 185 -288 -909 -1430 -2074 -2515 -2588 -911 810 1695 1958
6045 1958 1721 1052 566 114 -45 -492 -179 -231 127 272 295 -333 -657 -769 -1601 -2491 -2646 -1386 -718 -526
6025 -526 0 -117 -211 -120 -322 -531 -846 -1958 -1124 76 101 -203 -206 93 736 1190 1334 1458 1436 1502 1419 1266 1125 881
6001 881 526 647 869 1132 1328 1050 302 -453 -938 -1540 -1855 -1980 -1592 -1172 -952 -919 -987 -1224 -1322 -2082 -3075
5980 -3075 -3121 -3791 -4321 -4490 -4114 -3492 -2734 -2338 -2163 -2199 -2172 -1470 -942 -569 -47 -225 -472 -216 200 603 275
5958 -221 -1020 -2008 -3303 -3904 -2564 -1546 -525 -85 -215 -378 -609 -1005 -753 -605 -850 -1269 -2259 -3133 -473
5938 1265 1992 2052 1190 24 -1474 -2789 -538 -99 -63 318 1009 1755 2719 3263 3492 3303 2660 1080 -618 -2576
5918 -2576 -3374 -2909 -2113 -1910 -2184 -2619 -3048 -3321 -4549 -5527 -4705 -3196 -1937 -308 1312 2869 3584 3334
$$ packed form
6067d05c4A62K44K86M26m50h9n80k5c17A13P2b88o21n21o44m41p3i11H10Q85K63
6045A958k37o69m86A14d5m47a79n2A27J45K3c33l24j12q32q90j55J260O68J92
6025e26@a17r4R1k02k09l15j112Q34G6K5b03lI3O43M54J44J24k2O6q3j53j41k44
6001H81l55J21K22K63J96k78C02d53m85o02l15j25L88M20K20L3o8k37r8p60r93
5980c075m6o70n30j69L76O22P58L96J75l6K7P02N28L73d7j78k47b16B00M03B75
5958b21p99r88j295o01J340J018e25h5j30j63k31l96K52J48k45m19r90q74d73
5938A265P27O0q62B4a474j315e38i9L6C18O91P46R64N44K29j89o43A080f18j958
5918b576p98M65P96K03k74m35m29k73j228r78Q22J509J259c08A312J557P15k50
$$ plain form
5900 3334 2648 1777 672 -225 -1471 -2258 -2835 -2323 -535 1124 1604 1227 255 -864 -1218 381 1741 2116 2707
5881 2707 2863 2354 1374 -48 -1243 -2979 -3901 -4185 -3681 -2886 -2034 -1210 -1052 -715 -1313 -2237 -2870 -2928 -2258 -1655
5861 -1655 -1152 -1448 -1920 -2431 -2881 -3514 -2253 -1526 -1207 -1227 -1584 -1856 -1915 -2037 -2146 -2784 -3771 -4164 -1503 1284
5840 3129 3840 3627 2864 1960 2203 2705 3944 3081 2450 9 -1190 -2314 -4277 -3966 -1848 -1131 -31 366 902
5821 902 1603 2041 1862 2088 2109 1884 1472 1113 960 737 509 83 -224 -505 -911 -1074 -1329 -1482 -1929 -2852 -2485
5800 -2485 -7881 -9811 -11788 -12628 -12210 -10988 -9540 -8718 -6708 -5272 -6878 -6875 -6371 -5440 -4330 -707 -8 -226
5782 -226 -806 -661 128 197 498 545 169 -496 -885 -1492 -1477 -1048 -659 -183 373 481 193 -115 -714 -1022 -1195
5761 -1195 -1514 -1256 -1212 -734 -346 -377 -495 -584 -804 -856 -1137 -1790 -2326 -2640 -1807 -262 729 1354 1363 1223 790 14
$$ packed form
5900C334o86q71F72b25j246p87n77N12e35A124M80l77B55h64l54C81J360L75N91
5881B707J56n09r80d8j195j736r22k84N04P95Q52Q24J58L37n98r24o33n8O70O03
5861a655N03k96m72n11m50o33J261P27L19k0l57k72n9j22j09o38r87l93a503A284
5840C129P11k13p63r04K43N02J239q63o31Ia190j124j963L11a848P17c1C66N36
5821I02P01M38j79K26K1k25m12l59j53k23k28H3b24k81m06j63k55j53m47r23L67
5800b485n396j930j977q40M18J222J448Q22K010J436j606LN04R31J110g07hk18
5782b26n80J45A28O9L01M7A69d96l89o07J5M29L89a83C73J08A93a15n99l08j73
5761a195l19K58M4M78c46l1j18q9k20n2k81o53n36l14Q33b62G29O25Rj40m33A4
$$ plain form
5738 -530 -1182 -2120 -641 98 27 -426 -540 -479 -820 -1110 -1592 -2081 -2127 -1542 -1030 -429 -50 30 -107 -270 -200 -34 250
5714 372 540 1412 2090 3103 4583 5647 5642 2879 1031 202 1195 2666 2820 2019 947 -102 -219 570 1211
5695 1211 966 526 -93 -766 -1265 -1589 -1399 -1159 -599 79 565 155 -148 -687 -1999 -3023 -2645 -883 203 791
5675 791 1061 591 48 -479 -825 -607 -1405 -2625 -3558 -4209 -3917 -3441 -2856 -2286 -1539 -216 1650 2269 2313 2260
5655 2260 1770 1395 1522 1517 1213 676 5 -451 -531 -189 356 577 453 207 -209 -490 -666 -524 -79 731 1592 2137
5633 2137 1905 1276 71 -1041 -2016 -2302 -1963 -1924 -2053 -2619 -2113 -790 -107 -318 -184 -1235 -1523 -2800 -2380
5614 -2380 -1219 -305 -125 -311 -147 103 -107 -209 -886 -172 729 1112 961 729 612 479 294 209 379 930
5594 930 1411 1491 737 -399 -1600 -1791 -499 326 326 -211 -1075 -2177 -1432 -1464 -1104 -690 -239 534 656 347 -276
$$ packed form
5738e30o52r38f41I8B7d26j14O1l41k90m82m89m6N85N12d29e0C0a07j63P0c4B50
5714C72J68Q72O78J013J480J064nk763A031B02R93J471J54q01I47a02j17E70O41
5695A211k45m40i3o73m99l24J90K40N60G9M86A55a48n39j312j024L78h83B03N88
5675G91K70m70D8d79l46K18p98j220r33o51K92M76N85N70P47b16A650O19M4n3
5655B260m90l75J27nl04n37Ed51q0a89C56K21j24B07b09k81j76J42g9G31Q61N45
5633B137k32o29G1a041r75k86L39L9j29n66N06g90a07k11J34j051k88j277M20
5614b380J161c05a25j86a47A03a07j02o77a72G29L83j51k32j17j33j85q5J70N51
5594I30M81Q0G37c99j201j91d99C26%b11q64j102P45l2L60M14b39E34J22l09b76
$$ plain form
5572 -1058 -1661 -2155 -2450 -2259 -1773 -1495 -1101 -838 -699 -414 -333 -35 469 907 761 674 -28 -308 307 538 -121
5550 81 1167 1818 748 -300 2 -658 -1785 -3108 -686 2466 4491 6993 6636 5362 3138 1478 913 1582
5532 1582 3298 4226 4586 3805 3218 1811 -49 -2551 -5425 -7806 -9346 -7266 -2009 3266 2694 1909 2749
5515 2749 2607 4045 4644 8452 7909 5091 3185 -1250 -3213 -4219 -2229 -1780 -1265 -1399 -2099 -1198 -2578
5498 -2578 -1076 -1483 -1245 -885 -484 91 315 597 239 -488 -1338 -1335 -1162 -282 207 459 981 1518 1678 1537
5478 1537 748 326 -451 -820 -919 -750 -522 -116 457 758 580 264 -170 -368 -207 -3631 -2656 -636 1834
5458 2481 1493 -154 -574 629 -403 649 1021 1550 1789 1451 961 -181 -680 -803 -869 -1102 -262 863 1805 2053
5438 2053 1999 1006 24 -1221 -1837 -1227 -1014 -998 -765 -604 -909 -983 -945 -743 195 442 885 717 1058 492 -191
$$ packed form
5572a058o03m94k95J91M86K78L94K63J39K85Q1c5D69M38j46q7b8k80C07K31a21
5550H1J086O51G48c00Bf58j127j323f86B466K025K502l57j274k224A478n65O69
5532A582J716R28L60p81n87j407d9k502k874k381j540K080b009C266n72p85Q40
5515B749j42J438N99L808n43k818j906a250j963j006J990M49N15j34p00R01j380
5498b578a076m07K38L60M01I1K24K82B39d88q50LJ73b82B07K52N22N37J60j41
5478A537G48C26d51l69r9J69K28a16D57L01j78B64a70j98J61l424R75f36A834
5458B481r88a54m20F29d03F49L72N29K39l38m90a81m99j23o6k33b62H63R42K48
5438B053n4r93B4a221o16O10K13J6K33J61l05p4L8K02A95K47M43j68L41D92a91
$$ plain form
5416 -610 -1181 -1343 -1285 -766 -155 439 407 191 -533 -1690 -2919 -2601 -1493 -789 -23 335 1206 1658 2267 1766
5396 1766 1108 774 41 -326 -844 -1520 -1544 -1416 -907 -977 -1414 -2033 -2551 -2795 -2641 -1450 -1449 -1791 -1717 -1919 -1688
5375 -1688 -1297 -1159 -1270 -1514 -1911 -1188 115 957 1378 1059 538 -165 -993 -1493 -1456 -895 -404 40 380 618
5355 618 590 667 969 1474 1540 1581 1597 1651 1660 1128 867 202 -592 -990 -734 -108 332 324 -15 359 648 566 304 -80
5330 -746 -1543 -2196 -2336 -2256 -1930 -1528 -469 423 1291 1552 1874 1981 1516 998 684 553 750 630 -122 -1043
5310 -1043 -1710 -1454 -1078 -622 69 633 596 190 -488 -1401 -610 317 580 -295 -1448 -1505 -478 324 945 410
5289 -769 -1124 -1461 -1165 -1480 -1473 -1609 -1566 -2440 -1512 -1107 -841 -833 -799 -1458 -1847 -2032 -2266 -3032 -2631 -1890 -669 238
5266 1169 1100 985 331 -206 -530 -902 -1195 -1591 -1757 -1754 -1727 -1176 269 1263 2074 3422 4660 5947 6834 7083
$$ packed form
5416f10n71j62N8N19a55D39l2A91e33j157j229L18J108P04b3C35Q71M52O09n01
5396A766o58l34D1c26n18o76k4J28N09p0m37o19n18k44J54J191Jl42P4k02K31
5375a688L91J38j11k44l97P23A15Q42M21l19n21a65q28n00L7N61d04D0L40K38
5355F18k8P7L02N05O6M1J6N4Rn32k61B02e92l98K56a08C32qa5C59K89q2k62h0
5330g46p97o53j40Q0L26M02d69D23Q68K61L22J07m65n18l14j31J97j20a22r21
5310a043o67K56L76M56F9N64l7A90d88r13f10C17K63b95j153n7d78C24O21D10
5289g69l55l37K96l15Pj36M3q74R28M05K66QL4o59l89j85k34p66M01P41f69B38
5266A169o9j15C31b06l24l72k93l96j66LK7N51B69R94Q11J348J238J287Q87K49
$$ plain form
5246 7083 5746 2686 159 -1840 -4446 -2230 -61 1639 1160 -496 4264 427 2396 4230 6971 8878
5230 8878 4636 8111 9104 12532 3823 179 -2521 -360 -8566 -11736 -10701 -8603 -6364 -3790 -942 -386
5213 -420 -1524 -1940 -427 1146 2088 1531 299 -682 -493 -771 -1071 -1594 -2514 -3076 -3377 -2978 -2258 -2277 -3827
5194 -3827 -3770 -1022 -804 -352 1028 1174 38 -1736 -3673 -3099 -4082 -4259 -4198 -4565 -2633 -1252 179 734 179
5174 -248 -1462 -1510 -1265 -886 -73 1642 2662 2789 2186 -691 -3053 -397 885 1863 2353 2509 1456 391 -143
5154 160 -1351 -1391 -2828 -3110 -3417 -4947 -3037 -818 -1843 933 1688 2062 1650 1610 1595 2093 1950 2024 1321 1008
5134 1008 791 1374 1515 692 -1065 -2068 -956 -169 372 373 313 -153 212 535 -161 -1641 -3689 -7075 -6739
5115 -6739 -4255 -4915 -3883 -1553 -334 234 119 210 -168 -1269 -1518 -1697 -2189 -2258 -2428 -2686 -3516 -3576 -3012
$$ packed form
5246G083j337B686A59a840k606K216f1A639m79d96D264D27J969J834K741J907
5230H878m242L475R93L428C823A79b521c60q206l170J035K098K239K574i42c86
5213d20j104m16d27A146R42n57B99f82J89k78l00n23r20n62l01L99P20j9j550
5194c827N7a022K18c52A028J46C8a736j937N74r83j77O1l67J932a252A79N55A79
5174b48j214m8K45L79g3A642J020J27o03f91k362c97H85R78M90J56j053C91a43
5154A60a351m0j437k82l07j530J910h18j025I33P55L74m12m0j5M98j43P4p03l13
5134A008k17N83J41F92a065j003i56a69C72Jo0a53B12L23a61j480k048l386L36
5115f739K484o60J032a553c34B34j15R1a68j101k49j79m92o9j70k58q30o0N64
$$ plain form
5096 -3012 -2646 -1868 -844 -100 49 -130 15 438 705 507 -156 -522 -277 -73 -196 -272 -9 916 1575 1797 2460 2087
5074 2087 2063 1944 1667 1325 523 -635 -1685 -2558 -3680 -2334 -2091 -1626 -1747 -1472 -1427 -1282 -784 -487 275
5054 340 788 68 -348 -692 -488 -227 173 873 1195 849 483 -46 -489 -292 71 553 277 -180 -933 -1048 -1345
5033 -1345 -1869 -2085 -2067 -1910 -1798 -1606 -1571 -1326 -1002 -355 -94 -468 -1040 -1959 -3476 -3141 -1229 -286 600 860
5013 860 774 469 245 111 140 76 530 1185 1563 928 -145 -917 -1048 -691 -252 172 617 650 405 160 -93 -331
4991 -331 -334 -172 231 628 1058 850 376 135 657 1352 1250 405 -917 -1935 -2010 -823 -224 -211 -906 -1641 -2175
4970 -2175 -1864 -1346 -1291 -1575 -2308 -219 352 172 -156 -429 -1017 -1007 -1241 -1825 -2056 -2517 -1454 -182 863 1916
4950 1916 2653 3359 2045 1624 1266 876 172 -43 -666 -772 -1006 -542 -769 -573 -164 -174 -556 -1011 -1116 -337
$$ packed form
5096c012L66P78h44a00D9a30A5M23K67j98a56l66K45g3j23p6iI16O59K22O63l73
5074B087k4j19k77l42E23f35j050q73j122J346K43M65j21K75M5J45M98K97B75
5054C40M48F8c48l44K04b27A73P00L22l46l66d6m43J97G1M82k76a80p53j15k97
5033a345n24k16J8J57J12J92L5K45L24c55i4l74n72r19j517L35a229b86F00K60
5013H60q6l05k24A11K9o4M54O55L78o35a45p72j31L57b52A72M45L3k45A60i3k38
4991c31lJ62B31L97M30k08C76A35N22O95j02D05i17j018p5h23b24J3o95p35n34
4970b175L11N18N5k84p33b19C52A72a56k73n88J0k34n84k31m61J063a82H63J053
4950A916P37P06j314m21l58l90A72d3o23j06k34M64k27J96a64j0l82m55j05c37
$$ plain form
4929 505 840 733 361 11 -5 623 682 -485 -2144 -3427 -3651 -3458 -3020 -2812 -1808 -298 774 1378 1592 1350
4909 1350 1377 1020 590 142 -225 -828 -1515 -1448 -477 333 876 457 144 181 392 776 689 702 679 900 1462 1368
4887 1368 824 201 -429 -967 -831 -479 147 931 2206 2936 2816 2723 1890 144 -375 -689 -854 -816 -671 -423
4867 -423 -504 -660 -628 177 1471 2873 4550 6584 6419 1927 1151 187 -807 -1628 -2014 -1361 -966 -851 -664
4848 -664 -430 -311 -387 -114 759 809 786 834 941 1142 1467 1320 1400 1293 1243 846 462 112 -4 66 -210 -591 -1095
4825 -1095 -1479 -1547 -965 -46 536 92 -1127 -2641 -2719 -1347 205 1923 2892 3399 3334 2184 1847 2143 2484 2537
4805 2537 2155 1364 602 455 1314 1401 536 -419 -1396 -1727 -1848 -1086 -165 160 1057 1873 2747 2913 2755 2178
4785 2178 2020 1680 1211 206 -441 -795 -671 201 1355 2288 2853 1966 1137 186 -390 -758 -723 -703 -866 -1063
$$ packed form
4929E05L35j07C61A1eF23N9d85j659j283k24J93M38K08J004b98G74O04K14k42
4909A350K7l57m30A42b25o03o87O7d77C33N43m19A44L7K11L84q7J3k3K21N62r4
4887A368n44B01d29n38J36L52A47P84J275P30j20r3q33A44c75l14j65L8J45K48
4867d23q1j56L2A77J294J402J677K034j65A927p76A87h07q21l86O53L95J15J87
4848f64K34J19p6a14G59N0k3M8J07K01L25j47Q0j07n0l97l84A12dF6b10l81n04
4825a095l84o8N82d6E36I2a127j514p8a347B05J718R69N07o5j150l37K96L41N3
4805B537l82p91F02j47Q59Q7E36d19r77l31j21P62a65A60Q97Q16Q74J66j58n77
4785B178j58l40m69B06d41l54J24B01J154R33N65q87q29A86c90l68L5K0j63j97
$$ plain form
4765 -1063 -213 15 -139 -785 -805 316 1139 1735 1850 528 -449 -835 -864 -709 153 924 1471 1708 1618 936 94
4743 -394 -237 447 1339 3437 3851 4409 3811 2290 979 -1127 -1762 -1177 -655 -487 -248 -894 -1250 -1497 -955
4724 -955 -345 354 691 883 692 298 -285 -501 -305 -469 -776 -1133 -856 -76 592 319 480 170 -728 -1799
4704 -1799 -1710 -1712 -1031 235 617 1261 1062 976 647 150 4 -459 -436 332 1175 2088 2852 2813 2169 1154 251 -429
4681 -996 -907 -853 -554 -416 -290 -182 120 456 335 -165 -795 -1362 -1188 -592 -350 -669 -1317 -1742 -1402 -1111 -900
4660 -900 -322 -302 -456 -895 -459 939 1901 1955 1744 1566 1536 1879 2712 3840 5221 4675 965 -376 -1386 -1952
4640 -1952 -1654 -811 -160 721 1296 1948 1915 1237 790 -193 -1304 -2441 -1627 -753 -394 -224 -633 -640 320 1094
4620 1094 593 -167 -1027 -1382 -1116 538 1915 2916 2320 1728 1105 696 775 897 1045 907 651 493 830
$$ packed form
4765a063b13A5a39o46k0C16Q23N96J15E28d49l86k9J55A53P71N47K37r0o82I4
4743c94J57D47Q92K098M14N58n98j521I79a127o35N85N22J68K39o46l56k47N42
4724i55c45C54L37J92j91B98b85k16J96j64l07l57K77g6E92k73J61A70g28j071
4704a799Q9kO81B35L82O44j99q6l29A50Dd59K3C32Q43R13P64l9o44j015B51d29
4681i96Q9N4K99J38J26J08A20L36j21a65o30n67J74e92K42l19o48m25L40K91K11
4660i00c22K0j54m39M36I39R62N4k11j78l0L43Q33J128J381n46I65c76j010n66
4640a952K98h11a60G21N75O52l3o78m47a93j111j137Q14g53L59J70m09pC20P74
4620A094n01a67q60l55K66E38J377J001n96n92o23m09P9J22J48j38k56j58L37
$$ plain form
4601 830 1062 884 528 335 959 1572 2099 2183 2215 1775 1392 959 793 1162 1270 1538 1626 1442 1288 1467 1559
4580 1559 1554 1110 210 -740 -923 -345 328 833 915 557 -495 -236 58 -82 -552 -1381 -2392 -3201 -2778 -2363 -2236
4559 -2236 -1603 -1351 -877 -218 340 1102 1606 1376 714 -3 -785 -829 -273 876 480 239 687 1883 2926 4244
4539 4244 5427 6669 7248 6654 5656 4154 3190 3391 4278 5270 4610 293 -1203 -942 330 -377 -1701 2856
4520 7328 7806 -1261 14678 54474 100723 140937 168821 183242 174983 148203 109082 70699 35471
4507 35471 10342 1023 8514 5222 548 6895 8913 8053 1180 267 -319 -1712 -2311 -2519 -323 -288 -378
4490 -378 351 -87 -282 -675 -776 -791 -268 1294 2885 3348 1935 684 -25 -267 -457 -816 -577 36 368 61 -810
4468 -1454 -1578 -572 4 -109 -326 63 752 1598 1930 1650 926 392 -562 -1377 -2262 -2990 -3024 -2737 -1849 -1453 -1035
$$ packed form
4601H30K32j78l56j93O24O13N27Q4L2m40l83m33j66L69J08K68Q8j84j54J79R2
4580A559nm44B10g40j83c45C28N05Q2l58d95b36E8h2m70q29j011q09M23M15J27
4559b236O33K52M74b18C40P62N04k30o62cp82m4b73H76l96B39M48J196J043J318
4539D244J183J242N79n94r98j502r64K01Q87R92o60B93a203K61C30c77j324B856
4520G328M78a261A4678L9796M6249M0214K7884J4421q259k6780l9121l8383l5228
4507C5471A0342A023P491l292E48O347K018q60A180B67c19j393n99k08c23L5r0
4490c78C51h7j95l93j01j5b68A294J591M63j413F84b5k42j90l59K39C6L32F1h10
4468a454j24e72Da09k17F3O89Q46L32k80p24C92e62q15q85p28l4K87Q88L96M18
$$ plain form
4447 -1035 -1399 -1369 -177 739 1062 1190 1088 187 -486 -444 -395 -328 -199 -64 163 598 878 1034 841 590 50 -164
4424 -643 -910 -796 -928 -591 485 1182 306 -393 -970 -804 -943 -988 -1104 -1110 -1809 -1859 -1757 -1351 -1083 -719 -69 11
4401 -84 166 203 105 -391 -1075 -1468 -1058 -10 619 908 757 17 -943 -1476 -1655 -1631 -1374 -1067 -1053 -1407 -2036 -3547
4379 -3547 -3854 -1654 -217 789 1542 1483 1108 361 -320 -543 -368 -403 -815 -1465 -1617 -1567 -1400 -1287 -714 -283
4358 -258 -639 -1298 -2071 -2141 -749 762 1538 1520 247 -982 -3369 -3809 -1301 302 918 839 157 -95 -385 -391 -530
4337 -530 -616 -824 -409 207 683 832 519 142 -308 -898 -1527 -1658 -1549 -936 -984 -312 173 167 -64 -462 -749 -803
4315 -803 -760 -847 -818 -1001 -1597 -2225 -4259 -2866 -1890 -843 -37 537 1046 1460 1630 1556 1437 1331 1106 714 336
4293 -349 -800 -1046 -901 -1112 -1523 -2041 -2534 -2400 -1979 -1614 -1086 -648 -341 109 324 240 -58 -509 -782 -110 952
$$ packed form
4447a035l64L0a77G39L23J28j02A87d86M2M9O7J29f4A63M35K80J56j93k51E0a64
4424f43k67J14j32L37D85O97C06c93n77J66j39m5j16oo99n0J02M06K68L64f9A1
4401h4A66L7r8c91o84l93M10a0F19K89j51A7i43n33j79K4K57L07J4l54o29j511
4379c547l07a654b17G89P53n9l75C61c20k23J75l5m12o50j52N0J67J13N73b83
4358b58l81o59p73p0g49G62P76j8B47i82k387m40a301C02O16p9A57i5k90oj39
4337e30q6k08d09B07M76J49l13A42c08n90o29j31J09O13m8c12A73of4l98k87n4
4315h03M3q7K9j83n96o28k034J393R76h43c7E37N09M14J70p4j19j06k25l92C36
4293c49m51k46J45k11m11n18m93J34M21L65N28M38L07A09K15q4e8m51k73a10I52
$$ plain form
4271 1687 1749 1308 213 -826 -1942 -2216 -1311 -542 -19 206 466 290 439 909 1278 1854 2585 2138 1732 1003
4251 1003 -28 -1149 -430 855 1718 1949 1763 1054 596 -186 -708 -1278 -1641 -1188 -354 -107 -256 -705 -918 -547
4231 -547 464 1348 1764 1391 334 -969 -1832 -1985 -1752 -1201 -505 319 948 1083 331 -989 -2209 -2382 -709 896
4210 1631 1346 464 -565 -1344 -1332 -719 38 -18 -68 768 1405 1857 1626 673 405 -549 -1416 -1796 -1603 -1577 -1617 -1950
4188 -1950 -2683 -3056 -2060 -268 -61 113 -33 -470 -800 -802 -457 -50 -194 -513 -850 -1172 -1589 -1955 -1392 -612 -159
4166 -246 -586 -964 -1444 -1539 -1208 -1030 -1156 -1436 -1754 -2074 -2441 -3494 -2455 -738 806 1798 3605 4372 3998
4147 3998 2873 811 -1309 -1325 -410 937 1970 3001 3185 2341 1502 680 301 215 -144 -848 -1625 -2006 -1276
4128 -1276 -1288 -1449 -1465 -643 539 1106 405 -1315 -2951 -1298 57 695 568 -319 -902 -1244 -1460 -1098 -1110 -1428
$$ packed form
4271A687O2m41B13h26j116k74R05e42a9B06K60j76J49M70L69N76P31m47m06p29
4251A003b8j121d30H55Q63K31j86p09m58a86n22n70l63M53c54a07j49m49k13L71
4231e47D64Q84M16l73C34i69q63j53K33N51e05C19O29J35C31i89j220j73g09H96
4210A631k85D64e65p79J2O13C8a8n0G68O37M52k31F73k68e49q67l80J93K6m0l33
4188a950p33l73R96b68f1A13c3m37l30kL45e0j44l19l37l22m17l66N63f12a59
4166b46l40l78m80r5L31J78j26k80l18l20l67j053J039g38H06R92J807P67l74
4147C998j125H11a309j6d10I37J033J031J84q44q39F80C01q6a44p04p77l81P30
4128a276j2j61j6f43E39N67D05a315j636a298E7O38j27c19n83l42k16L62j2l18
$$ plain form
4108 -1428 -721 267 692 177 -770 -1882 -3085 -3166 -1626 -743 -649 -350 -225 -943 -1234 10 1244 1579 1374
4089 1374 855 909 1447 1517 1057 544 76 -372 -306 -123 404 808 915 715 -216 -942 -294 986 1454 1311 760
4068 760 171 -258 -239 -203 -190 1 307 622 874 1202 1777 2534 1863 1101 309 -640 -1315 -1308 -516 -364 -31 265 172
4045 172 -871 -1253 -1104 -1140 -1322 -1500 -1367 -947 -302 153 387 175 -388 -1327 -1399 -1068 -790 -322 468 194 43
4023 -595 -546 -308 -140 -256 -493 -378 -126 282 546 300 -212 10 713 1358 1441 845 -153 -1293 -1839 -1324 -788
4002 -788 -656 -636 -783 -847 -315 -147 -225 -639 -662 -843 -1180 -1673 -2249 -2476 -2372 -2317 -2184 -2245 -2295 -2271 -2325 -1905 -1308
3979 -1308 -1217 -1506 -1935 -2117 -2100 -1794 -1271 -781 -152 231 297 -90 -168 -358 -188 721 2058 2962 2412 1580 543
3957 -327 -930 -950 -761 -463 -366 -418 -502 -366 -170 12 220 389 243 -407 -1456 -2416 -3623 -5590 -5932 -1699
$$ packed form
4108a428P07B67M25A77g70j112j203q1J540g43R4K99J25p18k91A0J234L35k05
4089A374n19N4N38P0m60n13G6c72O6a23D04M04J07k00b16p26b94I86M68j43n51
4068G60A71b58J9L6J3AL06L15K52L28N75P57o71p62C09f40o75Pe16J52c1B65r3
4045A72h71l82J49l6j82j78J33M20c02A53K34A75c88r39p2L31K78c22D68A94D3
4023e95M9K38a40j16k37J15a26B82K64k46b12A0P03O45Q3n96a53j140n46N15N36
4002g88J32K0j47o4c15a47p8m14k3j81l37m93n76k27J04N5J33o1n0K4n4M20N97
3979a308R1k89m29j82J7L06N23M90a52B31O6i0p8j90J70G21J337R04n50q32E43
3957c27o03k0J89K98R7n2q4J36a70A2K08J69j46d07j049r60j207j967l42a699
$$ plain form
3936 -922 -79 813 1316 1266 324 -88 -1846 -2190 -2261 -1076 369 1187 1116 978 1089 1313 1659 1780 1610 885 -379
3914 -1232 -507 225 746 1190 1461 1512 1202 513 12 760 1387 1224 1012 196 -394 -732 -749 -212 516 852 917
3893 917 847 774 1117 1597 1884 1825 1292 828 331 -45 -155 -65 -243 -362 -559 -62 -183 -639 -1016 -1216 -1081 -1164
3871 -1164 -1275 -1460 -1464 -1430 -1017 -366 139 379 460 434 608 837 949 623 252 -248 -684 -990 -584 348 998
3850 998 441 -402 -931 -671 -999 -1502 -1651 -1773 -1934 -2265 -3178 -4723 -2990 -1406 -266 -391 -637 -982 -1773
3831 -1773 -2057 -2541 -2102 -1450 -567 354 998 1056 630 64 -119 237 553 495 407 191 -36 -385 -688 -988 -1018 -958
3809 -958 -783 -1082 -1199 -1427 -1391 -537 640 859 426 -172 -939 -1815 -2970 -3472 -3481 -1886 -1167 -963 -1579 -1775
3789 -1775 -1998 -1957 -2070 -2051 -2072 -2159 -2074 -1807 -1236 -423 469 915 1243 1248 1100 682 356 346 468 928 1649 2114
$$ packed form
3936i22g9H13N03n0C24h8j758l44p1a076C69Q18p1j38J11K24L46J21j70p25c79
3914a232e07B25N21M44K71N1l10E13A2P48O27j63k12A96c94l38j7b12E16L36O5
3893I17p0p3L43M80K87n9n33m64C31d5j10f5j78j19j97f2j21m56l77k00J35q3
3871a164j11j85mL4M13c66A39K40Q1k6J74K29J12l26B52b48m36l06M06C48O50
3850I98D41d02n29K60l28n03j49j22j61l31r13j545J733a406b66j25k46l45p91
3831a773k84m84M39O52e67C54O44N8m26F4a19B37L16n8q8A91c6l49l03l00l0O0
3809i58J75k99j17k28L6e37F40K19D26a72p67q76j155n02rJ595P19K04o16j96
3789a775k23M1j13J9k1q7Q5K67N71d23D69M46L28Nj48m18l26j0J22M60P21M65
$$ plain form
3767 2114 2236 2146 1954 1516 1040 433 -151 -778 -1293 -1618 -1641 -986 -271 155 195 -4 135 -144 -630 -797 -1010
3746 -1010 -1094 -1236 -1165 -776 -289 363 921 1746 1510 1993 1094 84 -831 -1517 -1332 -733 -447 -190 183 -17 -624
3725 -624 -759 -228 350 786 1196 1253 961 461 145 67 275 673 1029 1142 798 476 -97 -479 -684 -656 -711 -588
3703 -588 -14 863 1766 2587 2475 1861 1453 1057 1070 844 374 -295 -791 -410 600 1663 2520 2514 2005 856 -594
3681 -2040 -1723 139 1752 3143 4232 3833 1087 18 -413 -418 -376 7 698 840 881 686 1067 720 361 -222 -583
3660 -583 -514 -390 -57 479 1235 1929 2138 2000 1777 1243 897 575 395 660 1024 960 421 -528 -1566 -2192 -2406
3639 -2406 -2656 -2171 -2348 -3171 -3524 -3201 -1766 -1433 -973 -358 521 1339 1986 2620 3320 1721 1031 -25 -1037
3620 -1037 -1195 -98 977 1326 1372 1321 1004 865 1201 1174 1026 757 342 214 223 663 1040 1099 687 -268 -1342 -2175
$$ packed form
3767B114J22r0j92m38m76D33a51o27n15l25k3O55b71A55M0dA35a44m86j67k13
3746a010q4j42P1L89b89C63N58Q25k36M83q99H4h31o86J85N99K86a90A83a7o07
3725f24j35b28C50M36M10N7k92D61A45F7K08L98L56J13l44l22i7l82k05K8n5J23
3703e88a4H63R03Q21j12o14m08l96J3k26C74b95m96L81F00J063Q57on09H56e94
3681b040L17A39J613J391J089l99A087A8d13nM2GO91J42M1j95L81l47l59b22l61
3660e83O9J24e7D79P56O94K09j38k23n34l46l22j80K65L64o4D21e28j038o26k14
3639b406k50M85j77q23l53L23J435L33M60c58E21Q18O47O34P00j599o90b5j012
3620a037j58i8I77L49M6n1l17j39L36k7j48k69C42j28RM40L77N9m12b68j074q33
$$ plain form
3598 -2175 -2597 -3271 -205 528 -142 -670 -1149 -1222 -982 -401 -6 10 -208 -605 -699 -791 -877 -671 -120 -125 -622 -1039 -1179
3575 -1179 -1048 -390 -284 -316 -798 -1270 -1569 -717 434 824 696 56 -712 -1194 -1381 -1455 -1355 -1131 -941 -551 -365
3554 -365 -575 -1033 -1564 -2069 -2656 -2270 -1677 -946 -389 -97 -146 -143 76 517 694 388 -377 -1047 -1466 -1581 -1478 -1451
3532 -1451 -1553 -1676 -1737 -1642 -466 778 1105 373 -956 -1898 -2059 -1454 -1144 -877 -713 -357 192 710 1212 1258 1073
3511 1073 433 -13 -414 -577 -392 357 1429 2141 2658 2218 1500 395 -297 -37 1304 2921 3781 4054 3689
3492 3689 3383 2907 1981 1299 728 47 -758 -1426 -2000 -2210 -1807 -1037 -229 241 724 972 1103 895 434 -68
3471 140 709 1115 1727 1947 1726 1324 1218 630 256 -349 -800 -567 345 1365 1798 1707 1307 732 -273 -713
3451 -713 -968 -259 972 1807 2121 2663 2929 1981 866 -231 -1172 -1696 -870 226 1468 1419 772 -130 -1776 -2872
$$ packed form
3598b175m22o74b05E28a42n28m79p3K40d01fA0b08l97r4r2q6K06a20nm97m17j40
3575a179J31c90J06l2m82m72k99g17D34L90j28E6g12m82j87p4J00K24J90L90J86
3554c65k10m58n31n05n87L86N93P31c89i7m9LG6M41J77l06c77o70m19j15J03K7
3532a451j02j23o1R5d66G78L27C73i56r42j61O05L10K67J64L56A92N18N02M6j85
3511A073D33a3m01j63J85C57J072P12N17m40p18C95b97c7A304J617Q60K73l65
3492C689l06m76r26o82n71D7g58o68n74k10M03P70b29B41M83K48J31k08D34f8
3471A40N69M06O12K20k21m02j06n88B56c49m51K33C45J020M33r1m00n75b73m40
3451g13k55b59I72Q35L14N42K66r48H66b31r41n24Q26B26J242m9o47a30j646j096
$$ plain form
3431 -2872 -21 1274 1526 1015 -298 -1135 -1347 -351 718 1194 1068 673 -46 -771 -1571 -1904 -564 429 297 -75
3410 -558 -1120 -870 133 404 402 308 228 229 210 209 497 354 58 -570 -1151 -1031 543 2088 2826 2323 1063 23 -454
3386 -525 407 166 -261 -408 -152 -24 -69 -301 -545 -598 44 936 1472 1571 1552 1148 806 597 746 857 574 -157
3363 -654 -925 -393 1235 1494 905 452 181 374 440 529 651 762 798 799 589 578 314 147 231 194 263 183 65
3339 -288 -819 -1468 -1561 -1555 -874 169 1116 2002 3229 3845 3127 679 -1780 -2124 -1288 -45 42 44 680 1316 1507 1063
3317 1063 -32 -1325 -1105 394 1469 1170 -118 -882 -1189 -965 -577 -610 -725 -348 -42 -334 -694 -798 -1066 -1539
3297 -1539 -1886 -2309 -1847 -1810 -1829 -2871 -3153 -3030 -3212 -3655 -1573 -367 607 1108 813 75 -853 -1879 -2538 -3112
3277 -3112 -189 743 314 -401 -1033 -1033 82 1285 1699 1642 1062 303 -360 -705 -640 -362 -43 248 402 332 233 172
$$ packed form
3431b872b1A274K52n11b98q37k12c51G18M76j26l95d6p25q00l33e64D29j32g5
3410e58n62K50A33K71kr4q0Jj9jK88j43E8e70n81J20E43J545P38n03A063B3d54
3386e25D07A66b61j47a52b4m5k32k44n3D4Q92N36R9j9m04l42k09J49J11k83a57
3363f54k71c93A235K59n89D52A81J93O6Q9J22J11L6Jk10j1k64A47Q4l7O9q0F5
3339b88n31o49r3OO81A69R47Q86J227O16p18F79a780l44Q36d5D2KO36O36J91m44
3317A063c2j293K20C94J075k99a18p64l07K24L88l3j15c48d2k92l60j04k68m73
3297a539l47m23M62L7j9j042k82J23j82m43a573c67F07N01k95G5h53j026o59n74
3277c112a89G43C14d01o32%H2J203M14n7n80C03c60l45O5K78d3B48J54p0r9o1
$$ plain form
3255 172 134 24 -163 -656 -1347 -1889 -643 187 461 353 327 215 175 371 975 1100 738 361 -359 -1105 -1623
3234 -1623 -2097 -2216 -1929 -1177 -320 61 34 -307 -611 -765 -1312 -951 -1097 -855 -441 -160 295 635 726 708 527
3213 527 85 -386 -812 -734 174 1166 1572 1133 330 -284 -619 -684 -779 -778 -718 -489 305 953 1557 1405 1100 1300
3191 1300 1835 2118 4047 3171 345 -432 -712 -1001 -1231 -1320 -1225 -1285 -1060 -174 542 1216 1196 487 -395 -827 -899
3170 -899 -1063 -1049 -1511 -1191 179 1296 1873 2122 1910 1244 516 14 -321 -174 35 -25 -743 -1036 -450 -695 -650
3149 -650 -677 -432 -52 96 60 31 -64 -162 -135 56 -268 -795 -1332 -1348 -1262 -1382 -1628 -1782 -1700 -1320 -528 180 340 -293
3124 -1198 -1834 -1994 -1906 -1496 -706 11 607 990 1035 732 280 -182 -449 -361 16 485 605 567 695 555 210 -151
3101 -742 -647 -404 -553 -884 -1017 -955 -47 991 1982 2613 2106 1339 613 100 -297 -618 -848 -115 809 1298 1499
$$ packed form
3255A72l8B4a63m93o91n42f43A87K74j08k6j12m0J96O04J25l62C61c59p46n18
3234a623m74j19K87P52c20F1k7c07l04j54n47L61j46K42M14a60B95L40R1j8j81
3213E27H5c86m26P8A74R92M06m39C30b84l35o5r5JO0K29C05O48O04j52l05K00
3191A300N35K83J929q76C45d32k80k89k30q9R5o0K25a74E42O74k0D87c95m32p2
3170h99j64J4m62L20A79J117N77K49k12o66E16A4c21J47C5b5p18k93d50k45M5
3149f50k7K45e2I6l6k9f4r8K7E6b68n27n37j6Q6j20k46j54Q2L80e28A80J60b93
3124a198o36j60Q8M10g06A1N96L83M5l03B80a82k67Q8A6M69J20l8J28j40B10a51
3101g42R5K43j49l31j33O2d7I91R91O31n07p67F13A00b97l21k30a15H09M89K01
$$ plain form
3080 1499 1327 553 -844 -2394 -3050 -3031 -3433 -1412 -1113 -1390 -1235 -1282 -1235 -1176 -993 -726 -504 -238 81 410 740
3059 740 836 823 692 167 -637 -695 -184 315 515 292 -211 -928 -1669 -2048 -1923 -993 -990 -1562 -1756 -1312 -1035 -666
3037 -666 -951 -914 -978 -948 -993 -816 -387 544 1123 1758 2016 1731 1408 1044 633 -137 -275 -271 -308 49 657 1240 1286
3014 1286 510 -754 -1772 -1693 -836 318 1093 1539 1518 1317 1328 1079 802 383 37 -207 -353 -370 -537 -681 -639
2993 -639 -525 -136 -132 -278 -505 -912 -183 499 785 796 332 -354 -971 -1555 -1765 -1990 -1939 -1799 -1766 -1358 -1592 -1853
2971 -1853 -1477 -1157 -655 -254 -224 -185 -158 -61 -160 -387 -665 -990 -1350 -984 757 1925 2530 2592 2796 1294 79
2949 -902 -931 -285 164 418 200 195 323 156 205 163 390 882 875 614 78 -431 -504 -557 -508 -658 -1216 -1341 -946 -1536
2925 -1536 -1252 -1630 -1730 -902 134 1390 2782 3442 3775 1613 328 -1181 -2010 -1290 -306 185 5 -494 -731
$$ packed form
3080A499j72E53h44j550o56J9m02a412K99k77J55m7M7N9J83K67K22b38H1L29L30
3059G40R6j3j31A67f37n8a84C15K00k23b11p17p41l79J25R30Ln72j94M44K77L69
3037f66k85L7o4L0m5J77c87E44N79O35K58k85l23l64m11a37j38Ml7D9O08N83M6
3014A286E10g54j018P9h36C18P75M46k1k01J1k49k77C83C7b07j46j7j67j44M2
2993f39J14a36Mj46k27m07a83D99K86J1C32c54o17n84k10k25N1J40L3M08k34k61
2971a853L76L20N02b54L0L9K7f1r9k27k78l25l60L66G57J168O05O2K04A294G9
2949i02k9b85A64K54B00nJ28A56M9m2K27M92pk61G8d31p3n3M9j50n58j25L95n90
2925a536K84l78j00Q28A34J256J392O60L33A613C28a181q29P20c06A85Ed94k37
$$ plain form
2906 -731 -206 987 705 -36 -879 -930 42 232 -514 -1688 -2074 -2542 -1240 -1483 -2434 -2648 -793 543 1102 972
2886 972 300 -852 -1679 -516 633 1086 975 599 277 -53 -75 -1 -185 -602 -1231 -2044 -2971 -2152 -1336 -646 53 986
2864 986 1461 1389 1386 806 418 49 -305 -622 -806 -795 -284 179 348 390 409 836 1358 1641 1442 723 -135 -691
2842 -691 -954 -1255 -1447 -1547 -485 1154 2257 2410 1735 1144 400 -334 -1184 74 298 -151 -359 -638 -752 88
2821 1101 2083 2358 1528 207 -686 -2443 -1783 -1621 177 -5 -735 -1859 -3101 -826 604 1489 1821 1683 1075
2802 1075 537 -190 -967 -712 -124 -30 203 287 153 296 647 861 876 614 -66 1 309 770 1488 2098 2185 1664
2780 1664 820 0 -316 -285 11 0 -218 -436 -748 -649 -575 -489 -286 -92 -203 -675 -1176 -1323 -887 -155 507 817 764
2757 764 261 -300 -995 -1424 -1438 -1157 -571 20 1002 1532 1459 901 -99 -930 -1085 -67 990 1803 1747 1510 2698 3163
$$ packed form
2906g31b06I87k82c6q43n1D2J90e14j174l86m68a240k43r51k14g93E43N59j30
2886I72C00h52q27e16F33M53j11l76B77e3k2aj84m17o29q13r27Q19Q16f46E3R33
2864I86M75p2ln80l88D9c05l17j84J1b84A79J69M2J9M27N22K83j99p19a35n56
2842f91k63l01j92j00d85A154J103J53o75n91D00c34q50G4K24a51k08k79j14H8
2821A101R82K75q30B07f86j757O60J62A77ep30j124j242h26F04Q85L32j38o08
2802A075E37a90p77K55a24c0B03Q4j34J43L51K14J5k62f6AL08M61P18O10Q7n21
2780A664H20@c16L1A1@b18k18l12R9P4Q6K03i2j11m72n01j47M36a55E07L10n3
2757G64B61c00o95m29j4K81e71B0R82N30p3n58i9q31j55f7I90Q13n6k37J188M65
$$ plain form
2735 3163 2758 -987 -820 -425 105 1045 2127 2945 1463 1481 940 685 718 825 1044 1024 939 929 587 -308 -1653
2714 -1653 -1292 -66 1384 2159 2280 1812 767 -236 -938 -1313 -1446 -1092 -235 620 1159 1503 1426 1098 583 -21
2693 -63 215 502 321 -163 -863 -2026 -1923 -827 712 1443 1705 1330 1132 971 543 43 -525 -993 -1290 -1438
2673 -1438 -616 352 247 288 12 438 1154 1685 1741 1301 664 295 65 152 106 -18 382 504 696 1020 977 283
2650 -824 -1995 -2814 -2449 -1374 -912 -834 -782 46 673 1000 987 472 -140 -798 -1399 -580 714 1066 787 389 -407
2628 -1421 -2788 -3483 -2779 -820 110 297 -50 -572 -1286 -1689 -1791 -1412 -506 662 1443 1464 976 373 -65 514
2607 1139 1304 805 334 -840 -1777 -2361 -2453 -2771 -2481 -1792 -1712 -1851 -2132 -2243 -2067 -2000 -1062 -488 -399 2 733 1518
2585 1518 2160 2129 1721 1259 887 49 -882 -1862 -2319 -1481 -632 -298 -211 -349 -254 -57 -141 -291 -495 -442 -249 19
$$ packed form
2735C163m05i87J67L95A05R40J082Q18A463J8n41k55L3J07K19k0q5j0l42c08j345
2714a653L61f6A384P75J21m68G67b36p02l75j33L54b35F20N39L44p7l28n15b1
2693f3B15K87j81a63p00j163J03h27G12P31K62l75j98j61m28D3e25m68k97j48
2673a438f16C52j05M1A2M26P16N31N6m40o37B95F5Q7m6a8C82J22J92L24m3B83
2650h24j171q19L65J075M62P8N2D6O27L27j3D72a40o58o01e80G14L52k79C89d07
2628a421j367o95P04h20A10J87e0n22p14m03j02L79e06F62P81K1m88C73f5E14
2607A139J65m99C34h40r37n84r2l18K90O89Q0j39k81j11J76O7R38d88Q9BP31P85
2585A518O42l1m08m62l72D9h82r80m57Q38f32b98Q7j38R5e7q4j50k04N3J93A9
$$ plain form
2562 480 1061 1567 1843 1871 1755 1223 366 -379 85 1018 1182 1000 326 -586 -1179 -1451 -2066 -2606 -1580 391
2541 1243 1313 603 -355 -1216 -433 531 461 396 443 1004 1124 740 295 -85 -318 -152 212 -254 -490 -631 -855
2520 -855 -1079 -713 -162 237 584 949 993 808 426 56 312 1159 1609 1367 734 -87 -917 -1705 -2547 -2265 -1002
2498 -150 51 -170 -615 -1209 -1487 -1631 -1019 -593 -613 -684 -866 -858 -600 -271 319 847 1287 1757 2078 1874 1358 978
2476 978 723 420 285 43 -339 -803 -1180 -1349 -601 570 1332 1677 1657 1433 1205 1398 1367 1092 439 -773 -1739
2455 -1739 -2475 -1820 -1295 -1474 -1581 -934 646 1869 2103 1207 176 173 924 912 161 768 -27 -452 9 447 711
2434 711 682 -44 -1200 -1343 88 926 1237 1062 1000 912 1012 950 544 -21 -632 -1048 -594 39 423 888 1229 1606
2412 1606 1987 1832 1055 -718 -2764 -1574 414 1759 2645 2806 2273 1850 1526 1345 1362 1252 1515 1738 1326
$$ packed form
2562D80N81N06K76K8j16n32C66c79H5R33J64j82C26e86n93k72o15n40J026C91
2541A243P0F03c55q61d33E31p0o5M7N61J20l84B95h5k33a52B12b54k36j41k24
2520h55k24L66a62B37L47L65M4j85l82E6K56Q47M50k42o33h7q30p88q42K82a002
2498a50E1a70m45n94k78j44O12M26k0p1j82QK58b71C19N28M40M70L21k04n16l80
2476I78k55l03j35D3c39m64l77j69f01E70P62L45k0k24k28J93l1k75D39g73r66
2455a739p36O55N25j79j07O47F46J223K34q96A76lP51j2A61O07b7m25IM38K64
2434G11k9d4j156j43H8Q38L11j75o2q8J00o2m06b1o11m16M54C9L84M65L41L77
2412A606L81j55p77g18k046J190D14J345Q86J61n33m23l24j81J7j10K63K23m12
$$ plain form
2393 1326 359 -12 -964 -1724 -1897 -1636 -1014 -215 270 230 -230 -581 -1013 -1265 -2085 -3237 -4051 -1500 -296 570
2372 918 1668 1738 1288 1182 1072 1214 904 569 479 911 874 552 1 -836 -768 -391 368 793 957 738 287 281 993
2349 993 2017 2710 2657 2193 1762 1680 1536 1220 820 658 616 846 1176 1527 1759 1440 1075 379 -211 -678 -899
2328 -899 -596 -722 -957 -370 425 1349 1509 1699 1943 1762 919 305 -216 -575 -910 -862 -828 -223 458 516 426
2307 426 634 503 188 -180 -812 -1621 -1271 -198 -647 -22 469 674 593 1056 1573 1622 1364 850 23 -638 -204
2285 595 1046 1122 1012 919 895 1068 1412 1684 1358 534 -548 -1064 -1078 -1357 -970 -672 -717 -1044 -1465 -1904 -2177 -2204
2263 -2204 -2245 -2423 -2470 -2806 -2394 -1526 -476 -84 -102 -262 -469 -834 -1419 -1378 -1120 -804 -577 -325 426 1032 1359
2242 1359 1238 787 239 -455 -1151 -980 -506 -514 -830 -1134 -1342 -947 -172 226 236 -217 -613 -1096 -1371 -345 533
$$ packed form
2393A326C59a2r52p60j73K61O22b15B70m0b30l51m32k52q20j152q14a500b96E70
2372I18P50P0m50j06j10J42l10l35r0M32l7l22Ah36O8L77C68M25J64k19B87oP12
2349I93J024O93n3m64m31q2j44l16m00j62m2K30L30L51K32l19l65C79b11m67k21
2328h99L03j26k35c70D25R24J60J90K44j81q43C05b16l59l35M8L4b23D58N8r0
2307D26K08j31A88a80o32q09L50a98m49b2D69K05q1M63N17M9k58n14B3f38b04
2285E95M51P6j10r3k4J73L44K72l26E34e48n16j4k79L87K98m5l27m21m39k73k7
2263b204m1j78m7l36M12Q68d76h4j8j60k07l65n85M1K58L16K27K52D26O06L27
2242A359j21m51B39d55o96J71M74ql16l04k08L95a72B26J0b17l96m83k75c45E33
$$ plain form
2220 1288 1638 2266 2477 1518 227 -803 -1489 -515 -720 -1567 -1586 -699 -137 408 1036 1411 1750 1952 1827 1228
2200 1228 702 548 688 640 482 360 469 2370 4384 1690 -573 -879 -756 -224 563 1308 1880 2408 2681
2181 2681 2508 2148 1647 798 385 -117 -376 198 -1 -331 -1342 -2057 -1817 -587 114 312 -350 -948 -967 -299
2160 270 560 609 463 -60 -497 -944 -1364 -1648 -1857 -1423 -556 437 888 708 218 -418 -766 -488 69 129 -124
2138 718 1223 957 500 -37 -438 74 955 1671 1184 488 -304 -1064 -1567 -2035 -2681 -738 792 1148 496 -693 -1792
2117 -1792 -2163 -1468 -103 289 -54 -827 -1938 -3042 -3585 -3891 -3777 -2101 -1066 -435 -436 -146 -176 -183 49 -230 -605
2096 -605 -1155 -1765 -2000 -1759 -1480 -1103 -535 260 1100 1258 1471 1148 611 -292 -1046 -1474 -1824 -1699 -877 147
2075 669 824 675 409 161 -464 -1139 -1653 -1772 -1020 22 890 1063 815 214 -480 -987 -1295 -1169 -1182 -1241 -951
$$ packed form
2220A288L50O28K11r59B27h03o86e15k05q47j9f99a37D08O28L75L39K02j25n99
2200A228n26j54J40m8j58j22J09J901K014A690e73l06J23b24E63P45N72N28K73
2181B681j73l60n01G98C85a17k59A98al30j011p15K40e87A14J98c50n98j9b99
2160B70K90M9j46f0m37m47m20k84k09M34e56D37M51j80B18d18l48K78F9O0a24
2138G18N05k66m57c7m01G4Q81P16m87D88c04p60n03m68o46g38G92L56D96f93j099
2117a792l71O95a03B89e4p73j111j104n43l06J14J676J035d35ja46l0pD9b30l75
2096f05n50o10k35K41K79L77e35B60Q40J58K13l23n37b92p54m28l50J25Q22A47
2075F69J55j49k66A61d64o75n14j19P52B2Q68J73k48B14d80n07l08J26j3n9K90
$$ plain form
2054 -951 -20 936 1256 1012 483 -128 -936 -1764 -1594 -393 401 1488 2424 2452 1261 770 386 236 83 48 345
2033 345 550 620 529 562 282 -254 -718 -1016 -1320 -1365 -1359 -1379 -1029 -424 78 257 210 88 -421 -198 398 602 350
2010 350 -169 -829 -1495 -1433 -105 536 84 526 254 -154 -959 -1891 -1876 -993 -550 -592 -1120 -1547 -342 188 -108
1988 -1028 -1583 -1746 -1275 -666 -296 -150 -18 162 99 85 81 230 72 -540 -1460 -2437 -3779 -4372 -4284 -3724 -3095 -2709
1966 -2709 -2718 -2750 -2513 -2961 -2951 -2706 -2576 -1143 -842 -1964 -1426 -1009 -737 -747 -749 -1064 -1317 -1397 -1118 -67 26 452
1944 452 711 477 -572 -1311 -1312 -454 336 685 846 728 461 210 41 -90 -476 -1106 -1811 -1976 -1843 -1870 -1575 -1063
1922 -1063 -793 -69 -163 -612 -1678 -3083 -3921 -2539 -1223 -901 -1065 -1389 -1346 -612 543 1923 3373 4508
1904 4508 4972 1668 849 192 -382 -141 737 1574 2019 2765 2449 3160 3926 1650 1651 681 300 -185 -307 -366
$$ packed form
2054i51b0I36L20k44D83a28q08q28J70c93D01J087R36K8j191m91l84j50H3l5K97
2033C45K05P0r1L3k80b54m64k98l04m5Ok0L50d24G8J79m7H8d21a98C98K04k52
2010C50a69o60o66O2a05E36H4M42B54a54q05r32J5Q83M43m2n28m27c42A88a08
1988a028n55j63M71O09b96J46a8A62o3j4mJ49G2e40r20r77j342n93Q8N60O29L86
1966b709rl2K37m48J0K45J30a143L01j122N38M17K72j0kl15k53q0K79f7B6M26
1944D52K59k34e72p39jd54C36L49J61j18k67B10D1i0l86o30p05j65J33k7K95N12
1922a063K70f9r4m49j066j405q38J382a223L22j64l24M3f12E43J380J450J135
1904D508M64A668q19A92c82a41G37Q37M45P46l16P11P66A650JF81C00a85j22n9
$$ plain form
1884 -366 645 1461 1552 1168 287 -270 423 756 675 206 -178 267 1699 2950 2821 1807 960 408 669 980
1864 980 932 294 -458 -154 -492 -995 -1446 -1759 -1388 -275 487 533 539 423 600 308 -345 -957 -1941 -3707 -3864
1843 -3864 -1649 -1322 -831 -369 237 563 559 108 -256 -674 -986 -1255 -1252 -1157 -639 -505 -617 -969 -1227 -1029 -713
1822 -713 -252 18 105 77 66 459 1394 2282 2553 1616 1090 514 -153 -684 -929 -269 725 1419 1511 1152 810 600
1800 600 808 1134 752 -184 -1087 -1789 -1973 -1896 -1174 -196 799 1628 3234 2814 3276 2906 1066 -2965 -1692
1781 -1692 -1428 -209 2179 3173 3525 3727 4963 4921 4279 2515 1539 1645 1629 1824 1819 1334 320 -738 -1452 -40
1760 865 1239 1183 944 692 305 -361 -1128 -1950 -2733 -1501 -754 -177 -282 -873 -292 459 1038 1027 744 756 262
1738 -209 -181 655 1591 1902 1622 1097 644 486 705 1056 837 528 385 261 477 124 -349 -939 -1428 -1092
$$ packed form
1884c66F45Q16R1l84B87b70D23L33q1B06a78B67J432J251j29j014q47D08K61L11
1864I80m8B94d58a54l38n03m51l13L71b75D87M6Oj16J77k92c45o12r84j766j57
1843c864a649L27M91c69B37L26mA08b56m18l12k69LR5N18J34j12l52k58J98L16
1822g13b52A8Q7k8j1L93R35Q88K71r37n26E14a53n31k45b69G25O94R2l59l42k10
1800F00K08L26l82a84r03p02j84P7P22a96G99Q29J606m20M62l70A066b965J273
1781a692K64b09B179R94L52K02J236m2o42j764r76J06j6J95nm85C20g38p14d0
1760H65L74n6k39k52C05c61p67q22p83J232P47a77j05n91b92D59N79j1k83J2B62
1738b09K8F55R36L11k80n25m53j58K19L51k19l09j43j24K16A24c49n90m89L36
$$ plain form
1718 -1092 -1724 -914 -43 836 1333 1607 1479 1455 1363 1450 1336 1201 976 703 -362 -1755 -2078 -1908 -1242 -462 -222
1696 -368 -596 -908 -1185 -1421 -1392 -920 -414 -451 -101 -61 -149 -616 -793 -750 -761 -159 -202 227 46 -221 -247 -271 -129
1672 -369 -476 -299 -99 459 1206 1402 968 -88 -1299 -1840 -2453 -2078 -1577 -923 116 1228 2114 2756 2984 2831
1652 2831 2636 2501 2820 6431 6550 5148 2666 1682 990 786 530 220 71 -19 93 -65 -570 -1156 -1534 -1359
1632 -1359 -926 -189 479 836 1028 1113 1062 737 94 -848 -1227 -929 -272 247 280 -265 -830 -1398 -1087 -922 -900
1611 -900 -799 -687 -15 627 650 646 303 -60 -602 -1180 -1839 -1965 -1384 -179 77 525 652 251 -317 -800 -771 -228
1588 66 -141 -710 -867 -445 250 835 755 618 262 302 511 1034 1387 942 184 410 -1875 -2500 -1832 -1267 -586
1566 -116 484 944 1395 1774 1843 1753 1552 1030 542 -190 -914 -1285 -272 1171 1819 2050 1951 1664 1085 430 -616
$$ packed form
1718a092o32Q10d3H36M97K74j28k4r2Q7j14j35k25k73c62j393l23J70O66d62b22
1696c68k28l12k77k36K9M72d14l7a01M0q8m67j77M3j1a59m3B27D6b21k6k4a29
1672c69j07J77i9D59P47J96m34h8j211n41o13L75N01O54A16J112Q86O42K28j53
1652B831j95j35L19L611J19j402k482r84o92k04k56B20G1a9I3f5n05n86l78J75
1632a359M33a89D79L57J92Q5n1l25I4h48l79K98b72B47L3b65n65n68L11J65K2
1611i00J01J12a5F27K3mC03f0n42n78o59j26N81a79G7M48J27B51c17m83K9b28
1588F6a41n69j57M22B50N85q0j37B62M0K09N23L53m45A84K26a875o25O68N65e86
1566a16D84M60M51L79O9r0k01n22m88a90p24l71b72A171O48K31r9k87n79D30f16
$$ plain form
1544 -1541 -2435 -2990 -3191 -3795 -3549 -2249 -1568 -963 -590 -512 -738 -1602 -2374 -2937 -1944 -1633 -825 121 936 1562
1524 1562 1608 1493 1305 967 510 147 158 520 1106 1814 1616 708 -264 -830 -791 -623 -354 -172 -184 -809 -1513
1503 -1513 -2116 -1310 -65 693 1063 1197 1145 732 102 -427 -856 -712 -61 690 1420 2315 2880 3283 3998 3568 5584
1482 5584 1752 864 402 1053 1914 1772 1182 616 -138 -717 -503 256 896 1383 1502 990 358 -72 -443 -898
1462 -898 -1438 -1577 -805 661 1386 1629 1546 1294 751 812 618 751 536 408 251 -362 -489 -430 -211 9 339 887
1440 887 1686 2215 2348 2548 2420 1986 1318 876 1035 855 601 450 190 -33 -127 9 776 1243 1847 2247 2386
1419 2386 2276 1994 1704 1370 975 613 302 -136 -503 -768 98 491 457 725 700 412 20 -252 510 1360 1583
1398 1583 1083 708 729 1221 1669 1874 1712 1360 904 406 -199 -601 -972 -1045 -1072 -1174 -1525 -1444 -995 -358 426
$$ packed form
1544a541q94n55k01o04K46J300O81O05L73P8k26q64p72n63R93L11Q08A21Q15O26
1524A562M6j15j88l38m57A47J1L62N86P08j98G08b64n66L9J68K69a72j2o25p04
1503a513o03Q06f5F93L70J34n2m13A02d27m29J44f1F90P30Q95N65M03P15m30K016
1482E584A752H64D02O51Q61j42n90n66a38n79K14B56O40M87J19n12C58g2l71m55
1462h98n40j39P72F61P25K43q3k52n43O1j94J33k15j28j57c62j27N9b11IL30N48
1440H87P99N29J33K00j28m34o68m42J59j80k54j51A90c3r4IP67M67O04M00J39
1419B386j10k82k90l34l95l62C02a36l67k65I8L93l4K68k5k88B0b52E10Q50K23
1398A583n00l75K1M92M48K05j62l52m56D06a99m02l71p3k7j02l51Q1M49c58D26
$$ plain form
1376 1410 2072 2312 2805 2897 2554 1743 1485 1322 1352 1495 742 892 630 1540 1476 1104 760 208 -760 -1430 -375
1354 957 1277 682 212 -532 -1133 -773 306 1447 2079 1810 651 -1114 -2463 -1434 -665 -638 -949 -1424 -1764
1335 -1764 -1230 -521 -294 -968 -1794 -2787 -3210 -2250 -2118 -2286 -2556 -2965 -5762 -6376 -6039 -5054 -2542 -632 -285
1315 -118 -21 104 586 667 686 426 -269 -929 -789 303 1087 1587 1738 1466 1028 738 398 -71 -526 324 746
1294 746 -5 -958 -2089 -2021 -2406 -2313 -2181 -2215 -1030 758 1799 1910 1405 1020 412 -46 -340 -431 -440 -933 -1028 -492
1271 -46 38 -323 -859 -1259 -382 430 246 213 400 188 -625 -1336 -2908 -3254 -1800 -740 -72 -378 -166 269 502
1250 502 -172 -745 -906 -867 -663 -419 -297 -85 -29 -293 -586 -714 -805 -724 -636 -726 -743 -567 -401 -604 -1023 -1453 -2350
1227 -2350 -3723 -3070 -190 1048 1516 1285 597 -228 -929 -475 649 598 238 -254 -631 -1002 -872 1051 1335
$$ packed form
1376A410O62K40M93R2l43q11k58j63L0J43G42J50k62R10o4l72l44B08g60o70c75
1354I57L20n95B12e32o01L60C06J141O32k69F51a114j349J029f65K7l11m75l40
1335a764N34e21K27o74q26r93m23R60J32j68k70m09k797o14L37R85K512f32b85
1315a18b1A04M82Q1J9k60b69o60J40C03P84N00J51k72m38k90l40g1m55C24M22
1294G46er53j131O8l85R3J32l4a030G58J041J11n05l85D12d6k94r1rm93r5d92
1271d6C8c23n36m00c82D30j84l3J87A88f25p11j572l46J454g40g2l06a66B69K33
1250E02a72n73j61L9K04K44J22h5b9k64k93j28r1Q1Q8r0j7J76J66k03m19m30q97
1227b350j373O53a90A048M68k31E97b28p01M54F49n1B38b54l77l71J30A051K84
$$ plain form
1208 1335 585 -482 -1584 -1840 -1399 -129 -1 -58 224 316 -100 -925 -1918 -3243 -3349 -2872 -955 638 1483 1898
1188 1898 1938 1930 1658 1336 957 654 592 435 -229 -689 -604 -513 -770 -1488 -2400 -2083 -1329 -1153 -1635 -2239 -2257 -1513
1166 -1513 -609 135 653 927 951 577 430 699 1692 3269 4862 6397 7013 5501 2512 1949 1188 231
1147 -759 -1411 -695 806 1393 1325 727 68 -396 -575 -395 -211 -191 -148 55 154 374 551 469 129 -283 -592 -580 -395
1124 -395 -264 -325 -348 -452 -323 -312 -698 -1294 -1546 -1733 -1690 -1786 -1678 -1328 -892 -625 -470 -431 -448 -463 -548 -525 -86 369
1099 737 1254 1486 1528 1159 428 -405 -829 -214 650 1501 2399 2925 3962 4393 4450 4962 5095 5434 5555 4896
1079 4896 243 -497 -945 -395 -205 349 472 386 67 -2 412 688 468 58 -694 -1663 -2711 -1966 -743 489 1250
1058 1250 1585 1458 1898 2409 2316 1939 933 41 -451 -581 -560 -417 -270 -98 316 598 691 574 455 565 493 281
$$ packed form
1208A335E85d82j102k56M41a29an7B24R2a00q25r93j325j06M77i55F38Q45M15
1188A898M0qk72l22l79l03o2j57b29m60Q5R1k57p18r12L17P54J76m82o04j8P44
1166a513f09A35N18K74K4l74j47K69R93J577J593J535O16j512B512n63p61B31
1147g59o52f95H06N87o8n98F8c96j79J80J84K0M3E5R9K20J77q2A29b83l09J2J85
1124c95J31o1k3j04J29J1l86n96k52j87M3r6J08L50M36K67J55L9j7j5q5K3h6C69
1099G37N17K32M2l69D28d05m24b14F50Q51Q98N26J037M31N7N12J33L39J21o59
1079D896B43d97m48c95J90C49J23q6F7bD12K76k20E8f94r69j048P45g43D89P61
1058A250L35j27M40N11r3l77I33D1d51j30K1J43J47i8C16K82R3j17j19J10p2k12
$$ plain form
1036 281 -126 -289 -379 -312 -307 -356 -221 -421 -796 -989 -858 -757 -686 -1089 -1378 -614 -68 254 336 241 -210 -474 -495
1013 -495 -525 -195 111 -131 -759 -1118 -598 -125 -180 -366 -934 -1281 -1509 -1780 -2043 -2013 -1753 -1286 -711 -330 281
991 895 1527 1819 1571 772 3 -257 -1411 -2194 -3118 -3307 -678 225 349 355 335 463 1128 2033 1798 2957 3472
970 3472 -363 -693 -1982 -2822 -2835 -2713 -2589 -2553 -2823 -2933 -1598 -908 -256 240 464 499 574 686 406 -254 -892
949 -892 -1220 -951 -258 500 679 730 650 397 325 393 683 852 894 526 156 -22 -70 217 616 1062 1337 1543 1506
926 1506 1027 626 402 -19 -251 -326 -406 -576 -888 -1535 -2537 -2577 -2824 -3213 -3919 -4689 -4823 -4401 -2003 -1152 -550
904 -484 -729 -885 -932 -1062 -1050 -759 252 1039 1157 1012 590 43 -107 -400 -591 -361 117 708 956 1087 880
883 880 759 451 452 844 1446 1870 2170 2321 1607 679 -313 -1260 -2208 -3066 -3633 -3393 -2139 -1556 -1210 -504 773
$$ packed form
1036B81a26j63r0O7Nm9J35k00l75j93J31J01P1m03k89f14f8B54Q2r5b10k64k1
1013d95l0a95A11a31o28l59N20a25n5j86n68l47k28k71k63L0K60M67N75c30B81
991H95O32K92k48G72Cb57j154p83r24j89f78B25J24Ok0J28O65R05k35J159N15
970C472c63l30j289q40j3J22J24L6k70j10J335O90b56B40K24L5P5J12k80b54o38
949h92l28K69b58E00J79N1q0k53p2O8K90J69M2l68A56b2m8B17L99M46K75K06l7
926A506m79m01k24a9k32p5q0j70l12o47j002m0k47l89p06p70j34M22b003Q51e50
904d84k45j56m7j30J2K91B52P87J18j45m22D3a07k93j91K30A17N91K48J31k07
883H80j21l08JL92O02M24L00J51p14F79c13r47r48q58n67K40J254N83L46e04G73
$$ plain form
861 1867 2902 3479 3249 987 -234 -1022 -1118 -620 -625 -913 -1482 -1887 -1870 -1488 -1323 -1720 -2238 -2586 -2071 -1322 -1363
840 -1363 -1563 -1613 -681 208 585 310 -269 -951 -1282 -991 -54 719 713 1124 3319 3867 2153 -1233 -1040 -871
820 -871 165 1591 2484 3090 2296 1684 1117 490 578 656 1024 1314 1147 919 736 656 537 -33 -812 -1435 -1638
799 -1638 -1342 -1193 -1161 -1316 -1848 -2070 -1864 -1521 -1175 -408 -112 -185 -322 -691 -1186 -1511 -1551 -1155 -140 721 991
778 991 1026 483 36 -605 -1330 -1862 -1592 -329 785 1326 1422 1642 1693 1897 2481 2205 1555 783 42 -517 -823 -1202
756 -1202 -549 -84 943 1515 3563 3583 1491 234 -604 -566 -720 -816 -863 -536 289 855 1041 717 35 -562 -104
734 21 -198 -825 -1797 -2428 -1909 -941 -131 458 792 1017 1149 1018 1512 1476 714 -140 -992 -1122 -791 232 1438
713 1438 2519 3551 3455 3081 2265 1179 700 290 -130 -845 -1289 65 1100 1649 1743 1372 916 696 829 1023
$$ packed form
861A867J035N77k30I87b34p88r6M98nk88n69m05J7L82J65l97n18l48N15P49m1
840a363k00n0f81B08L77k75b69o82l31K91e4G19oM11K195N48j714a233J93J69
820h71A65J426Q93O06p94o12n67D90Q8P8L68K90j67k28j83q0j19c3p79o23k03
799a638K96J49L2j55n32k22K06L43L46d08a12p3j37l69m95l25m0L96a40G21K70
778I91L5D83C6f05p25n32K70c29G85N41R6K20N1K04N84k76o50p72D2e17l06l79
756a202e49h4I43N72K048K0A491B34f04L8j54r6m7L27B89N66J86l24C5e62a04
734B1a98o27r72o31N19i41a31D58L34K25J32j31M94l6G14a40q52j30L31B32J206
713A438J081J032r6l74q16j086m79B90a30p15m44F5J035N49R4l71m56k20J33J94
$$ plain form
693 1023 871 729 592 368 -36 -630 -1470 -1933 -1294 -660 91 481 823 1083 1264 1497 1906 2042 2036 1907 1613
672 1613 1178 795 284 172 -191 -469 -448 171 621 382 -75 -585 -819 -271 107 132 184 -473 -457 -643 -976 -1457
650 -1457 -1997 -2631 -2853 -2611 -2076 -1852 -1783 -1822 -1666 -1033 96 494 522 500 363 112 -249 -419 -662 -276 -815 -1135
628 -1135 -1582 -2106 -2610 -3722 -4792 -4769 -4133 -1006 -662 -392 -224 -315 -531 -617 -436 -149 388 802 667 466
608 466 523 967 1218 1415 1271 1052 790 748 930 765 283 -614 -792 -394 312 859 927 442 920 997 1326 906
586 906 371 -127 -467 -525 -571 -543 -937 -1587 -1816 -2194 -1708 -1031 -327 127 478 553 497 395 295 231 641 581 284
562 -638 -1262 -1145 -849 -920 -745 -429 -185 -203 -536 -1172 -2065 -3283 -3487 -2272 -1141 -467 -282 -754 -1675 -2299
542 -2299 -417 1559 3005 2398 1480 468 251 1580 2964 2448 1353 498 -152 -334 -7 645 1117 895 153
$$ packed form
693A023j52j42j37k24c6n94q40m63O39O34I1L90L42K60J81K33M09J36oj29k94
672A613m35l83B84j12a91k78K1A71M50k39g5n10k34b71A07K5N2d73J6j86l33m81
650a457n40o34k22K42N35K24O9l9J56O33I6L98K8k2j37A12b49j70k43b76n39l20
628a135m47n24n04j112j070K3O36a006L44K70J68r1k16q6J81a49C88M14j35k01
608D66N7M44K51J97j44k19k62m2J82j65B83f14j78c94C12N47O8D42M78P7L29m20
586I06C71a27l40n8m6K8l94o50k29l78M86O77c27A27L51P5n6j02j00o4M10o0B84
562f38o24J17K96p1J75L16a85j8l33o36q93j218k04J215J131d67J85m72r21o24
542b299d17A559J446o07r18D68k17J329J384n16j095D98a52j82gF45M72k22A53
$$ plain form
522 -801 -1905 -3259 -4122 -4957 -1750 -1487 -1208 -1053 -1075 -468 -4 -323 -333 526 1157 1266 706 16 -386 -168 753
500 1357 1649 1224 787 498 358 619 945 1222 1234 737 146 -314 -519 -670 -666 -312 474 1046 1193 539 218
478 53 39 220 29 -408 -684 -959 -1286 -1559 -1649 -1486 -1233 -924 -749 -1164 -1792 -1924 -1607 -1046 -95 713 1567 2454
456 2454 3429 4074 4456 3956 2136 1272 265 -620 -846 -686 -196 433 1087 1094 1222 972 613 395 388 674 915
435 915 976 552 -136 -974 -1742 -1820 -1167 348 763 1021 1273 1494 1674 1732 1439 1071 695 547 635 961 1183 1063
413 1063 667 110 -202 -198 -15 -21 -201 -501 -717 -1126 -1445 -1201 -865 -825 -628 -521 -404 -222 -155 35 155 320 164
390 164 47 -347 -579 -601 -586 -988 -1366 -2119 -3362 -5326 -5192 -3022 -2104 -1578 -846 -517 -607 -631 -783 -1095 -1289
369 -1289 -1083 -182 882 1709 1710 1039 79 -738 -484 1 -309 -967 -1753 -2115 -1776 -727 565 1412 1755 1371 437 -575
$$ packed form
522h01j104j354q63q35a750K63K79J55k2d68dl19j0E26O31J09n60A6c86a68G53
500A357K92m25m37k89j40K61L26K77J2m97A46c14k05j51Mc12D74N72J47E39B18
478E3j4J81B9d08k76k75l27k73r0J63K53L09J75m15o28j32L17N61i5G13Q54Q87
456B454R75O45L82n00j820q64B65f20k26J60a96D33O54PJ28k50l59k18pK86K41
435I15O1m24a36q38p68p8O53C48M15K58K52K21J80N8k93l68l76j48Q8L26K22j20
413A063l96A10b02Ma5oj80l00k16m09l19K44L36M0J97J07J17J82O7C5J20J65j56
390A64D7c47k32k2J5m02l78p53j243j964J34K170R18N26P32L29r0k4j52l12j94
369a289K06a82H82Q27Jo71G9g38K54Ac09o58p86l62L39g27E65Q47L43l84D37e75
$$ plain form
346 -2215 -3456 -4020 -1366 -320 19 -311 -887 -1141 -616 124 284 -261 -1088 -1357 -816 -270 -263 -385 -1162 -1947
326 -1947 -2545 -2434 -1860 -736 805 2187 3236 4485 4577 865 602 4 100 154 -321 -949 -1606 -2949 -3305 -3123
306 -3123 -1192 433 1759 2965 3982 4595 4452 4379 3566 1406 -1498 -1741 -1943 137 1549 1315 405 -612
287 -1775 -2588 -3328 -3403 -3281 -1685 -164 941 1696 2135 1983 1482 768 -223 -931 -1386 -1351 -1707 -1703 -1982 -1754 -1546
266 -1546 -1150 -888 -824 -1228 -1731 -1879 -1899 -1373 -392 813 1402 1136 413 -450 -980 -965 -965 -1028 -1197 -1045 -222 732
243 782 217 -936 -1391 -1431 -1094 -681 -347 -163 -323 -691 -744 -528 -376 165 348 -326 -285 -258 -215 -351 -783 -1037
221 -1037 -1007 -696 -161 -197 -507 -822 -775 -736 -768 -1207 -1189 -969 -348 -108 100 -219 -616 -899 -616 485 1625 2401
199 2401 2360 1382 32 -881 -1692 -1137 -1693 -1593 -1150 39 918 1369 1262 841 -78 -1004 -607 405 1333 2068 2936
$$ packed form
346b215j241n64a366c20A9c11n76k54N25A24J60b61q27k69N41b70Pj22p77p85
326a947n98J11N74g36H05J382J049J249R2H65k63DR6N4c21o28o57j343l56J82
306c123a192D33J326J206J017O13j43p3q13A406a498k43k02A37J412k34D05f12
287a775q13p40p5J22J596a64I41P55M39j52n01p14b23p08m55L5l56Mk79K28K08
266a546L96K62O4m04n03j48k0N26c92H13N89k66D13d50n30J5%o3j69J52b22G32
243G82B17i36m55m0L37M13L34a63j60l68n3K16J52A65J83c26M1K7M3j36m32k54
221a037L0L11a61l6l10l15M7L9l2m39J8K20c48a08A00b19l97k83K83D85J140P76
199B401m1r78C2h81q11N55n56J00M43C9Q79M51j07m21g8r26L97D05R28P35Q68
$$ plain form
178 2936 4118 4030 3549 2677 2085 1229 541 25 -375 -434 -64 -329 -497 -661 -856 -1098 -1166 -766 131 492 188
156 -209 -344 -405 -416 -544 -320 102 465 442 78 -70 -530 -1217 -1618 -1667 -1828 -2085 -1728 -1122 -324 114 7 -120 -278
133 -278 -228 192 773 1173 1342 1387 1215 1148 1108 871 645 549 829 1198 1476 1721 1462 1003 524 173 -287 -758
111 -758 -1162 -1174 -538 -315 45 369 599 221 -677 -1493 -1431 -879 -87 -1396 -1318 -659 380 1044 1492 1488 1112 629
89 629 252 183 68 -255 -548 -824 -1000 -1017 -684 -69 381 541 432 312 291 345 341 289 107 -66 -187 -539 -647 -782
65 -782 -419 -297 -319 -239 -294 -568 -937 -1360 -1081 128 889 1268 1362 1430 1738 2216 2015 1561 1326 1399 1270 1082 700
42 700 92 -377 -694 -875 -922 -792 -692 -367 -202 -77 -28 241 289 107 -298 -531 -478 -182 -31 -72 -234 -379 -588
19 -588 -697 -628 -493 -267 -10 108 -127 -409 -647 -842 -836 -790 -841 -1061 -1112 -787 -763 -871 -846
$$ packed form
178B936J182q8m81q72n92q56E41B5c75n9f4k65j68j64j95k42o8M00A31L61A88
156b09j35o1j1j28K24A02L63k3G8g0m60o87m01m9j61k57L57O06c24A14Ga20j58
133b78N0A92N81M00J69M5j72o7m0k37k26r6K80L69K78K45k59m59m79A73b87m71
111g58m04j2e38K23D5L24K30B21f77q16O2N52h7j309P8f59C80O64M48ml76m83
89F29B52o9F8b55k93k76j76j7L33f9C81J60j09j20k1N4mn2A07f6j21l52j08j35
65g82L63J22k2Q0n5k74l69m23K79A28P61L79R4O8L08M78k01m54k35P3j29j88l82
42G00I2c77l17j81m7J30J00L25J65g7b8B41M8A07b98k33N3a82c1m1j62j45k09
19e88j09O9J35K26a0A08a27k82k38j95OM6n1k20n1L25K4j08K5
0h46
##PAGE= F1=25.89129138603
##FIRST=     25.9928259484165, 8223.18227667557, -628
##DATA TABLE= (F2++(Y..Y)), PROFILE
$$ plain form
16383 -628 -737 -733 -315 -273 -499 -962 -1636 -1183 -1142 -885 -689 -497 -416 -549 -1094 -1592 -2259 -2856 -2536 -1874 -1085
16362 -1085 -581 -958 -1579 -1962 -2378 -1376 -130 544 792 582 101 -508 -1177 -531 -383 -207 303 748 866
16343 866 242 -165 -170 -55 -145 -326 -897 -466 -290 -51 263 467 635 540 278 154 157 254 250 175 -363 -779 -1220 -2307
16319 -2307 -1062 -962 -873 -770 -866 -974 -997 -809 -521 -1185 -1006 -1432 -2169 -2260 -2135 -1853 -1460 -1292 -1669 -2813
16299 -2813 -3518 -2824 -2082 -958 -146 845 1207 971 398 -8 -141 87 245 87 -604 -486 -264 -56 -195 -501 -222
16277 -144 -112 -153 -247 -272 -968 -600 -88 184 -87 -650 -1410 -2272 -1421 -1066 -466 -90 -32 -83 -301 -504 -532 -563 -713
16254 -713 -705 -720 -509 -515 -760 -1084 -1405 -1844 -1915 -1376 -752 -93 545 986 852 568 -95 -870 -649 74 501 -37 44
16230 334 812 1331 1526 1363 968 305 -779 -1686 -2491 -2815 -2530 -1562 -1268 -1372 -1198 -1421 -895 -1317 -1912 -2174
$$ packed form
16383f28j09Mc15M2k26m63o74M53M1K57J96J92Q1j33n45m98o67n97L20O62P89
16362a085N04l77o21l83m16J002a30E44K48k10A01e08o69e31J48J76C03M45J18
16343H66B42a65ne5r0j81n71M31J76e1B63K04J68r5k62j24LR7mp5c63m16m41j087
16319b307a062J00Q9J03r6j08k3J88K88o64J79m26p37r1J25K82L93J68l77j144
16299b813p05O94P42i58a46H45L62k36C98hj33H7J58H7f04J18K22e6j39l06b22
16277a44L2m1r4k5o96L68h8A84h7n63p60q62Q51L55d66i0c2n1k18k03k8l1j50
16254g13Qj5K11ok45l24l21m39p1N39O24i3E45M41j34k84i5p75K21G4M27c7D4
16230C34M78N19J95j63l95C05g79r07q05l24K85R68K94j04J74k23N26m22n95k62
$$ plain form
16210 -2174 -1062 -697 -649 -400 -1476 -2612 -1807 -1253 -1069 -1101 -1065 -813 -451 -106 3 -216 -724 -135 -104 -297
16190 -297 -826 -1373 -1799 -1681 -712 -498 190 773 718 820 940 936 546 65 -500 -1061 -1484 -2194 -1814 -1531 -2176
16169 -2176 -2090 -1722 -812 -509 -632 -2434 -2733 -1883 -1565 -777 28 448 420 133 -467 -684 -514 -362 -183 -78
16148 215 475 -768 -626 -99 31 -107 -588 -817 -931 -558 -770 -1250 -682 89 69 48 -464 -1223 -1669 -1636 -1203 -970
16126 -970 -528 523 592 250 -266 -795 -349 574 391 20 -430 -462 -273 -331 -212 166 359 -759 -845 -1481 -805
16105 -805 -142 -48 -824 -2116 -2030 -1453 -702 316 824 341 -200 -606 -800 -1129 -1585 -1188 -1192 -912 -593 -517 -474
16084 -474 -736 -1109 -1131 -735 -308 -194 581 710 289 -289 -945 -1385 -1665 -1715 -1417 -231 404 665 1124 1183 772
16063 772 217 -233 -517 -311 295 464 106 -539 -976 -1219 -1165 -762 -173 469 1006 1298 1291 839 -346 -1416
$$ packed form
16210b174a062L65M8K49j076j136Q05N54J84l2L6K52L62a06Cb16n08a35L1j93
16190b97n29n47m26J18g12K14A90N83n5J02J20ml90F5e00n61m23p10L80K83o45
16169b176Q6L68h12L03j23j802k99Q50L18g77B8M20k8A33d67k17J70J52J79g8
16148B15K60g68J42i9C1a07m81k29j14L73k12m80N68H9k0k1d64p59m46L3M33K33
16126i70M42E23O9B50b66n29c49E74j83B0d30l2J89n8J19A66J93g59q6o36O76
16105h05a42d8p76j292Q6N77g02C16N08C41b00m06j94l29m56L97mK80L19P6M3
16084d74k62l73k2L96c08J14E81J29B89b89o56m40k80n0K98b31D04K61M59N9m11
16063G72B17b33k84K06B95J69A06e39m37k43N4M03a73D69N37K92pm52c46j070
$$ plain form
16043 -1416 -1959 -2196 -2134 -2411 -2267 -2178 -1547 -824 -639 -1357 -699 -1389 -2998 -3127 -3828 -3094 -1919 -716 -564
16024 -564 -1630 -2204 -2137 -1949 -2723 -1825 -345 233 26 12 -768 -816 49 1078 1375 650 -592 -1071 -252 931 579
16003 579 308 -143 -236 -341 -577 -1477 -1211 -747 -480 197 1054 1816 1463 83 -715 -1197 -1469 -1263 -836 -517
15983 -517 -415 -659 70 582 1096 1531 1344 613 -194 201 987 1496 1508 1290 868 209 -444 -786 -391 225
15962 538 898 -1884 -3534 -3981 -4617 -2345 -2044 -1701 -381 4 93 -155 -558 -710 -831 -780 -608 -369 -30 -298
15942 -298 -496 -522 -339 -6 -330 -865 -1400 -1359 -1573 -1188 -1113 -411 -224 -384 -736 -1015 170 560 754 624 -47 -271
15920 -271 -201 -580 -1128 -1303 -1584 -1361 -1058 -895 -78 -32 -65 -66 86 66 -25 -23 -589 -1316 -1478 -1023 -662 -959 359
15896 899 1159 871 268 -590 -952 434 1706 2298 2325 1335 28 -737 231 -505 -716 -485 -86 344 527 326
$$ packed form
16043a416n43k37O2k77J44Q9O31P23J85p18O58o90j609j29p01P34J175g16J52
16024e64j066n74O7J88p74Q98c45B33B6A2g68m8D9J029K97F50e92m79b52I31l52
16003E79k71a43r3j05k36r00K66M64K67A97Q57P62l53H3g15m82k72K06M27L19
15983e17J02k44G0N12N14M35j87F13a94B01P86N09J2k18m22B09d44l42c91B25
15962E38L60a884j650m47o36K272L01L43c81DQ9a55m03j52j21N1J72K39c0k68
15942b98j98k6J83fl24n35n35M1k14L85P5d11J87j60l52k79A70L90J94j30d7k24
15920b71P0l79n48j75k81K23L03J63g8c2l3jH6k0b5Kn66p27j62M55L61k97C59
15896H99K60k88B68e90l62D34J272N92K7r90B8g37B31e05k11K31h6C44J83k01
$$ plain form
15876 326 -484 -1175 -297 309 897 975 696 105 -746 -1831 -2672 -2016 -340 621 912 618 223 133 -50 -1363
15856 -1363 -2528 -2089 -1643 -1295 -1720 -2257 -1960 -1541 -1117 -1161 -1264 -1472 -1662 -2141 -533 305 591 914 829 68
15835 -85 565 1004 1526 1505 1050 512 -224 -64 515 352 -440 -1090 -1010 -458 264 875 1487 1852 1541 914 106
15813 -442 -518 -558 57 321 20 -267 -582 -679 -1039 -315 428 588 330 227 -61 13 -113 -700 -1997 -1418 -1368 -1393
15791 -1393 -1212 -1099 -385 77 215 20 -140 -105 -415 35 -1971 -896 -246 -1159 -1441 -679 219 962 548 22 -1176
15769 -1939 -3332 -2346 -880 -72 -35 -673 -1765 -2601 -1655 -606 487 1093 995 531 -105 -593 -501 565 962 412
15748 -314 -787 -1149 -1322 -1670 -995 9 299 765 864 597 -244 -736 -1025 -1748 -1132 263 892 345 5 16 380 696
15726 696 796 663 498 184 -222 -540 -742 -638 -213 -187 -428 -810 -640 -626 -555 -542 -444 -287 -218 -308 -942 -605
$$ packed form
15876C26d84o91b97C09N88P8k79A05g46j085q41O56c40F21K91k94B23r0e0j313
15856a363j165M39M46L48m25n37K97M19M24m4j03k08j90m79e33C05K86L23q5F8
15835h5E65M39N22k1m55E12b24f4E15j63d40o50Q0d58B64O11O12L65l11o27A06
15813d42p6m0E7K64B0b67l15r7l60c15D28J60k58j03f1A3a13n87j297N79N0k5
15791a393J81J13c85G7J38B0a40L5l10C5a971h96b46r13k82f79B19P43m14B2a176
15769a939j393R86h80g2c5o38j092q36R46f06D87O06r8m64a05m88R2E65L97D12
15748c14m73l62j73l48O75IK90M66R9k67b44m92k89p23O16B63O29C45EJ1L64L16
15726F96J00j33j65A84b22l18k02J04b13K6k41l82J70J4P1J3R8J57O9r0o34L37
$$ plain form
15704 -605 -835 -1175 -630 627 -722 -854 -3397 -1807 -2499 -4509 -3972 -1259 -2013 -2638 -2794 -2584 -3748 -3515
15686 -3515 -2681 -1532 -488 -605 -1077 -1894 -2543 -2422 -1821 -1745 -2478 -3267 -3642 -4051 -3908 -2105 -747 829 1592
15667 1592 1408 418 -1105 -303 186 345 120 1119 1201 259 -732 -1607 -826 225 836 1230 1044 794 -730
15647 -1076 -517 139 113 -1494 -2604 -1515 -1650 -1186 -850 -647 -593 -649 -1567 -3661 -3496 -3452 -2842 -1891 -865
15627 -585 -501 -517 -286 -305 -162 -418 -658 -935 -1055 -798 -486 -361 -179 -56 -21 -330 -836 -339 140 491 565 489
15605 489 -50 -1064 -1980 -1729 -1360 -719 -383 16 236 154 -43 -431 -1187 -2018 -2080 -1159 -25 634 457 33 1 261
15583 261 640 550 -164 -915 -1518 -1365 -991 -295 468 795 825 921 586 93 -433 -805 -894 -816 -656 -1448 -2428 -3156
15561 -3156 -3522 -1834 -1343 -569 490 1412 1946 2230 1114 -352 171 307 328 282 316 232 256 518 922 1324
$$ packed form
15704f05k30l40N45F27g22j32k543J590o92k010N37a259p54o25j56K10j164K33
15686c515Q34J149d88j17m72q17o49J21O01P6p33p89l75m09J43J803g47H29P63
15667A592j84D18a105c03A86J59A20R99Q2B59g32q75P81B25O11L94j86k50g30
15647a076e17A39k6a494j110J089j35M64L36K03N4n6r18k094J65M4O10R51h65
15627e85Q4j6K31j9J43k56k40k77j20K57L12J25a79e6b1l09n06c39A40L51P4p6
15605D89e0j014r16K51L69O41L36A6K20q2d3l88p56q31o2R21b5F34j77C3AK60
15583B61L79r0a64p51o03J53L74b95D68L27L0R6l35I3d33l72q9P8J60p92r80p28
15561c156l66J688M91e69D90R22N34K84A114c52A71J36K1m6L4q4K4K62M04M02
$$ plain form
15541 1324 1475 1147 298 -112 -461 -118 89 338 564 766 1103 942 782 501 -258 -1034 -798 114 45 9 -144
15519 -850 -1144 -643 -200 -507 -362 -649 -1244 -1365 -1225 -1380 -1326 -1085 -1362 -622 -194 -26 318 285 133 -503 -493
15498 -493 -933 -1189 -1156 -1019 -494 283 733 296 -579 -1031 -1097 -795 -184 678 1170 609 42 -459 -568 -190 148
15476 494 685 279 -619 -1012 -1777 -2317 -538 -561 -709 -972 -1013 -768 -222 162 183 275 -142 -1146 -1696 -1711 -1454
15455 -1454 -1311 -890 -449 -653 -796 -1058 -1221 -1191 -509 415 1130 1554 1538 1468 883 81 -803 -1826 -1692 -592
15434 -50 99 -251 -523 -222 727 1558 1953 1567 1049 721 856 495 175 -184 -249 -70 200 367 341 -345 -1644
15413 -1644 -2068 -2318 -2229 -2003 -1352 -809 -349 -635 -1116 -1156 -1176 -615 183 626 422 -301 -962 -1385 -1816 -1282
15393 -1282 -858 -458 -97 91 103 39 -88 -153 -381 -893 -1336 -886 79 417 -91 -407 -562 -631 -699 -598 -801 -661 22
$$ packed form
15541A324J51l28B98a12l49a18H9K49K26K02L37j61j60k81b58p76K36A14D5Ia44
15519h50k94N01b00l07J45k87n95j21J40j55N4K41k77f22a94b6C18l3A33e03J0
15498d93m40k56L3J37d94B83M50B96e79m52o6L02a84F78M92n61D2d59j09a90A48
15476D94J91B79f19l93p65n40e38k3j48k63m1K45b22A62K1R2a42j004n50j5K57
15455a454J43M21M41k04j43k62j63L0e09D15P15M24j6p0n85H1h03j023J34e92
15434e0I9b51k72b22G27Q31L95l86n18l28J35l61A75a84o5g0B00J67k6c45j299
15413a644m24k50Q9K26O51N43c49k86m81m0k0N61A83M43k04c01o61m23m31N34
15393a282M24M00i7I1J2C9h8o5k28n12m43M50G9L38i1l16j55o9o8J01k03J40B2
$$ plain form
15369 760 1042 55 -1134 -440 208 -449 -1236 -2127 -2444 -2152 -1073 -687 -428 -825 -548 -943 -1686 -821 -460
15350 -460 -282 494 -192 -1237 -1885 -1033 96 253 240 333 297 517 711 680 -162 -795 -2262 -1784 -1217 -792 -1078
15329 -1078 -1878 -2318 -1874 -577 457 798 212 -307 -544 -433 -433 -669 -1100 -942 -365 134 615 776 578 364
15309 364 -21 -278 255 105 -501 -930 -679 2 -666 -1914 -2508 -2162 -1860 -1676 -1159 -545 113 554 1035 1328
15289 1328 1629 1388 422 -227 206 575 439 252 138 -214 -1302 -1731 111 1309 1512 1808 1199 555 58
15269 -105 822 826 322 -118 1 661 646 363 290 788 1367 1354 -26 -1317 -1458 -1187 -1211 -1604 -1835 -1004 -1977 -3235
15247 -3235 -2102 -140 931 251 -1190 -2707 -1433 -1244 -747 250 54 -690 -852 -476 -749 -1419 -1891 -1953 -1351
15228 -1351 -1196 -1040 -941 -1024 -690 -319 328 898 1241 972 96 -1297 -1046 -554 -1054 -1505 -1903 -1590 -1068 -664
$$ packed form
15369G60K82E5a134d40B08d49p87q91l17K92a073L86K59l97K77l95p43h21L61
15350d60J78D94a92j045o48Q52I6J57j3R3l6K20J94l1a62o33j467M78N67M25k86
15329a078q00m40M44e77D57L41B12c07k37J11%k36m31J58c65A34M81J61j98k14
15309C64b1k57B55A05e01m29K51Bf66j248n94L46L02J84N17e45A13M41M81K93
15289A328L01k41D22b27B06L69j36j87j14b14j088m29A11J198K03K96o09E55E8
15269a05H22MC22a18AO60j5k83p3M98N79j3b6j291j41K71k4l93k31Q31r73j258
15247c235J133a40I31B51a190j517J274J89M97B50E4f90j62L76k73o70m72o2O02
15228a351J55J56R9q3L34c19C28N70L43k69I6a297K51M92n00m51l98L13N22M04
$$ plain form
15208 -664 -535 -298 -327 -428 -150 168 391 393 -59 -159 -100 369 753 1053 391 -276 436 614 706 950 704 -515
15185 -1422 -1983 -1774 -1009 -742 -897 -1135 -624 1 215 852 1008 217 -528 -1336 -1123 -43 343 479 397 -469 -2107
15164 -2107 -2520 -2041 -1555 -2096 -1761 -1470 -1177 -811 -78 271 384 0 -492 -924 -1536 -897 80 313 -52 -686 -908
15143 -908 -1663 -606 104 -244 -667 -528 204 640 491 499 224 -163 -385 -625 -801 -528 -198 231 866 656
15123 656 385 206 -299 -698 -730 -377 155 -456 -637 -347 260 668 722 343 -575 -1835 -1900 -1778 -1051 -1023 -1223
15102 -1223 -1849 -1395 -765 -1180 -1504 -1532 -1542 -1802 -1745 -1207 -239 456 241 -1107 -882 -585 7 131 -342 -711 -1147
15081 -1147 -1640 -1663 -1712 -1828 -1765 -2559 -3862 -1600 -786 -224 -229 -202 -129 237 200 389 404 354 272 187 122 -6 -471 -1045
15057 -1045 -1570 -1574 -1381 -999 -464 231 1012 1332 1056 411 -604 -1869 -569 -114 -228 -44 -237 -287 -379 -849 -260
$$ packed form
15208f64J29K37k9j01a50A68K23Ke9j00N9C69L84L00C91b76D36J78R2K44k46e15
15185a422n61K09P65K67j55k38N11AK14O37J56B17e28q08K13d3C43J36q2d69j638
15164b107m13M79M86n41L35K91K93L66g8B71J13@d92m32o12O39H0K33e2o34k22
15143i08p55f06A04b44m23J39B04M36j49QB24a63k22k40j76K73a98B31O35k10
15123F56k71j79b99l99l2L53A55d56j81K90B60M08N4C43e75j260o5J22P27K8k00
15102a223o26M54O30m15l24k8j0k60N7N38b39D56k15a107K25K97GJ24c42l69m36
15081a147m93k3m9j16O3p94j303a600g86b24nK7P3B37l7J89J5n0q2q5o5fm65n74
15057a045n25mJ93L82d64B31P81L20k76D11f04j265e69a14j14d4j93n0r2m70b60
$$ plain form
15035 -22 -6 52 -367 -559 -121 -26 68 77 -140 -749 -936 -307 236 0 -98 -142 93 125 -164 -524 -652 -643 -526 -481 -826
15010 -826 -1447 -1568 -1023 -169 329 406 -422 -662 -529 -823 -1283 -2147 -1774 -1030 -17 -356 -831 -1372 -1242 -1097
14990 -1097 -1025 -1022 -1297 -905 -356 -321 -648 -841 -615 -100 103 -351 -1337 -1547 492 1408 1659 1646 588 -1180 -2055
14969 -2055 -1811 -1588 -1420 -1510 -2073 -1907 -2354 -2997 -2695 -2162 -1429 -539 193 813 700 120 -808 -1538 -2161 -2577
14949 -2577 -2441 -1287 -158 -409 -713 -1052 -1420 -1215 -1335 -981 -580 -298 -270 -226 -939 -1565 -1226 -843 -955 -2121
14929 -2121 -558 -1542 -1501 -282 -134 -1031 -2192 -855 -680 -611 -465 -369 -209 101 -607 -1648 -848 913 749 609
14909 609 471 239 -39 -472 -989 -596 -221 96 315 433 447 260 -205 -891 -1955 -2893 -2014 -1308 -426 -1 176
14887 448 442 257 15 -147 196 781 965 612 125 -212 -217 -608 -2768 -2885 -4149 -1681 -2308 -2949 -2798 -2366
$$ packed form
15035b2fE2c67j92a21b6F8Ra40o09j87c07B36@i8m4I3L2a64l60j28RJ17M5l45
15010h26o21j21N45a69C29P7d22k40J33k94m60q64L73P44a7l39m75n41J30J45
14990a097P2Lk75L92c56L5l27j93K26a00A03c51r86k10D92R16K51j3E88a180q75
14969b055K44K23J68r0n63J66m47o43L02N33P33e39A93O20j13A20h08p30o23m16
14949b577J36J154a58k51l04l39l68K05j20L54M01K82K8M4p13o26L39L83j12j166
14929b121e58r84M1b82a34q97j161h55J75O9J46R6J60A01f07j041Q00I13j64j40
14909F09j38k32c9m33n17L93b21I6K19J18J4j87b05o86j064r38Q79P06d26aA76
14887D48oj85A5a47A96N85J84l53A25b12nl91k160j17j264a681o27o41J51M32
$$ plain form
14867 -2366 -1109 -8 737 1477 1393 561 -819 -1329 -591 -397 -444 410 560 783 918 858 982 1125 797 315 -153
14845 -622 -912 -1540 -1864 -2028 -1792 -912 -155 -1014 -1081 -667 -168 -603 -1255 -1364 -1177 -909 -228 573 1302 1257
14825 1257 717 -762 -1462 -1781 -2915 -4105 -4136 -3176 -1992 -964 -279 -943 -1586 -285 589 -660 -700 -66 -1077
14806 -1077 -1685 -2057 -1936 -1281 -193 -1259 -1742 -1675 -1128 -1026 297 1341 1244 262 -847 -2262 -2390 -1633 -595
14786 -216 -283 -713 -969 -827 -394 -67 458 385 290 -226 -453 -715 -1120 -1197 -1102 -957 -1037 -1187 -155 -137 -466 -705
14764 -705 -231 -546 -566 375 727 820 1045 1118 105 -1433 -2488 -1381 -1092 132 2042 2128 3390 2393 1562
14745 1562 680 -115 -616 -1166 -1503 -1447 -1368 -1534 -1128 -698 -880 -624 -112 34 444 383 493 157 477 1081 1360
14724 1360 729 -222 -1313 -2265 -1663 -1027 -1804 -2281 -2457 -2604 -2441 -2860 -3466 -3714 -3319 -2395 -1348 -459 35
$$ packed form
14867b366a109hG37P40q4E61h19n10e91J94m7D10J50K23J35o0J24J43l28C15a53
14845f22k90o28l24j64K36Q80a55q59o7M14a68m35o52j09J87K68b28E73P29m5
14825A257n40g62p00l19j134j190l1R60J184i64b79o64o43b85E89f60m0f6j011
14806a077o08l72J21O55a93j066m83O7N47J02B97J044r7B62h47j415j28P57e95
14786b16o7m30k56J42c94f7D58p3r5b26k27k62m05p7R5J45q0j50a55J8l29k39
14764g05b31l15k0C75L52R3K25P3A05a433j055J107K89A32J910Q6J262r97q31
14745A562F80a15n01n50l37N6P9j66M06M30j82K56a12C4M10o1J10A57L20O04K79
14724A360o31b22j091r52O02O36p77m77j76j47J63m19o06k48L95R24J047d59C5
$$ plain form
14704 255 403 663 888 -10 -859 -863 -768 -1251 -2437 -3874 -4753 -4425 -2298 -829 731 1541 1231 -504 -301 371
14683 852 996 1064 1145 111 -925 6 -616 -1468 -276 575 533 370 338 165 145 30 -183 -432 -668 -1115 -685 -430
14661 -430 -485 -858 767 631 117 -202 664 1794 2561 2053 462 -1226 -283 951 484 582 919 1099 1139 1022
14641 1022 652 227 -327 -792 -1125 -1201 -983 -1731 -1864 -1872 -1633 -1246 -918 -1675 -3302 -4498 -3989 -2399 -821
$$ packed form
14704B55J48K60K25a0q49mR5m83j186j437q79L28K127h29G31Q10l10e04K03C71
14683H52J44O8Q1A11i25Ff16q52b76E75m2j63l2A65k0C0a83k49k36m47M30K55
14661d30n5l73G67j36A17b02F64J130P67n08D62a226b83I51m67R8L37J80M0j17
14641A022l70B27c27m65l33p6K18p48j33qK39L87L28p57j627j196N09J590h21
$$ [...]