
##TITLE=AC1406_BRAA12215_7653149_5PJ1xK5njd
##JCAMPDX= 6.0         $$ Bruker NMR JCAMP-DX V2.0
##DATA TYPE= NMR SPECTRUM
##DATA CLASS= NTUPLES
##ORIGIN= BRUKER
##OWNER= Administrator
$$ 1.72 TOPSPIN		Version 2.1
$$ 2013-03-20 01:41:07.359 -0500  Administrator@X
$$ Compression mode = diff/dup
##.OBSERVE FREQUENCY= 400.02188249412
##.OBSERVE NUCLEUS= ^1H
##.ACQUISITION MODE= SIMULTANEOUS (DQD)
##.ACQUISITION SCHEME= undefined
##.AVERAGES= 8
##.DIGITISER RES= 22
##SPECTROMETER/DATA SYSTEM= spect
##.PULSE SEQUENCE= zg30
##.SOLVENT NAME= COFFEE_meoh
##.SHIFT REFERENCE= INTERNAL, COFFEE_meoh, 1, 14.98509
##AUDIT TRAIL= $$ (NUMBER, WHEN, WHO, WHERE, PROCESS, VERSION, WHAT)
$$ ##TITLE= Audit trail, TOPSPIN		Version 2.1
$$ ##JCAMPDX= 5.01
$$ ##ORIGIN= Bruker BioSpin GmbH
$$ ##OWNER= Administrator
$$ $$ E:\/data/COFFEE/nmr/AC1406_BRAA12215_7653149_5PJ1xK5njd/10/pdata/1/auditp.txt
$$ ##AUDIT TRAIL=  $$ (NUMBER, WHEN, WHO, WHERE, PROCESS, VERSION, WHAT)
(   1,<2013-03-20 01:40:59.156 -0500>,<Administrator>,<X>,<go>,<TOPSPIN 2.1>,
      <created by zg
	started at 2013-03-20 01:39:53.078 -0500,
	POWCHK enabled, PULCHK disabled,
       configuration hash MD5:
       86 BA 57 50 F2 9D 5C 9B 26 00 A9 28 5F 66 2E 89
       data hash MD5: 64K
       F2 74 09 45 BA 12 42 91 64 49 E1 6F D7 52 8E 00>)
(   2,<2013-03-20 01:41:02.312 -0500>,<Administrator>,<X>,<proc1d>,<TOPSPIN 2.1>,
      <Start of raw data processing
       efp LB = 0 FT_mod = 6 PKNL = 1 PHC0 = 0 PHC1 = 0 SI = 32K 
       data hash MD5: 32K
       5C B0 2D D2 51 54 F9 C4 5B 3A 8F 19 BE A5 5C 86>)
(   3,<2013-03-20 01:41:02.812 -0500>,<Administrator>,<X>,<proc1d>,<TOPSPIN 2.1>,
      <pk PHC0 = 97.42126 PHC1 = 0 
       data hash MD5: 32K
       11 58 AA 7D D4 A1 BB F7 61 55 68 EB 09 52 68 7A>)
(   4,<2013-03-20 01:41:03.046 -0500>,<Administrator>,<X>,<proc1d>,<TOPSPIN 2.1>,
      <abs ABSG = 1 
       data hash MD5: 32K
       34 02 B7 2E 0C 59 96 DF E2 FD B0 B6 01 16 5F 8A>)
(   5,<2013-03-20 01:41:03.203 -0500>,<Administrator>,<X>,<proc1d>,<TOPSPIN 2.1>,
      <abs ABSG = 2 
       data hash MD5: 32K
       9E 8C 59 47 6A 7A 15 CA 27 90 FE 6C 23 3B F1 DE>)
(   6,<2013-03-20 01:41:03.343 -0500>,<Administrator>,<X>,<proc1d>,<TOPSPIN 2.1>,
      <abs ABSG = 3 
       data hash MD5: 32K
       D6 65 26 1C 3F 72 1D 63 EA C0 9D 1F 86 9B 97 75>)
(   7,<2013-03-20 01:41:03.484 -0500>,<Administrator>,<X>,<proc1d>,<TOPSPIN 2.1>,
      <abs ABSG = 4 
       data hash MD5: 32K
       AB 5D A8 CF E2 3B 1B 37 79 B9 AD 0A BF AD 46 C6>)
(   8,<2013-03-20 01:41:03.609 -0500>,<Administrator>,<X>,<proc1d>,<TOPSPIN 2.1>,
      <abs ABSG = 5 
       data hash MD5: 32K
       BC 1C 31 66 0A C8 9E 1F CA F2 02 3A B3 84 1F 30>)
$$ ##END=
$$ 
$$ $$ hash MD5
$$ $$ 80 6D 4B 06 F2 AB 3F E0 36 E0 FF 16 4B 92 B1 D9
##$RELAX= 
##$RELAX= 
##$RELAX= 
##$RELAX= 
##$RELAX= 
##$RELAX= 
##$RELAX= 
$$ Bruker specific parameters
$$ --------------------------
##$DU= <E:\>
##$EXPNO= 10
##$NAME= <AC1406_BRAA12215_7653149_5PJ1xK5njd>
$$ [...]
150 150 150 150 150 150 150 150
##$TP07= 0
##$TPNAME0= <>
##$TPNAME1= <>
##$TPNAME2= <>
##$TPNAME3= <>
##$TPNAME4= <>
##$TPNAME5= <>
##$TPNAME6= <>
##$TPNAME7= <>
##$TPOAL= (0..7)
0.5 0.5 0.5 0.5 0.5 0.5 0.5 0.5
##$TPOFFS= (0..7)
0 0 0 0 0 0 0 0
##$TUNHIN= 0
##$TUNHOUT= 0
##$TUNXOUT= 0
##$USERA1= <user>
##$USERA2= <user>
##$USERA3= <user>
##$USERA4= <user>
##$USERA5= <user>
##$V9= 5
##$VALIST= <valist>
##$VCLIST= <CCCCCCCCCCCCCCC>
##$VD= 0
##$VDLIST= <DDDDDDDDDDDDDDD>
##$VPLIST= <PPPPPPPPPPPPPPP>
##$VTLIST= <TTTTTTTTTTTTTTT>
##$WBST= 2048
##$WBSW= 25
##$XGAIN= (0..3)
0 0 0 0
##$XL= 0
##$YL= 0
##$YMAX_a= 616099
##$YMIN_a= -524555
##$ZGOPTNS= <>
##$ZL1= 120
##$ZL2= 120
##$ZL3= 120
##$ZL4= 120
##$ABSF1= 14.98509
##$ABSF2= -5.573092
##$ABSG= 5
##$ABSL= 3
##$ALPHA= 0
##$AQORDER= 0
##$ASSFAC= 0
##$ASSFACI= 0
##$ASSFACX= 0
##$ASSWID= 0
##$AUNMP= <proc_prof1d_extract_pilot.lims>
##$AXLEFT= 0
##$AXNAME= <>
##$AXNUC= <1H>
##$AXRIGHT= 0
##$AXTYPE= 0
##$AXUNIT= <>
##$AZFE= 0.1
##$AZFW= 0.1
##$BCFW= 0
##$BC_mod= 0
##$BYTORDP= 0
##$COROFFS= 0
##$CY= 15
##$DATMOD= 1
##$DC= 0
##$DFILT= <>
##$DTYPP= 0
##$F1P= 0
##$F2P= 0
##$FCOR= 0.5
##$FTSIZE= 32768
##$FT_mod= 6
##$GAMMA= 0
##$GB= 0
##$INTBC= 1
##$INTSCL= 1
##$ISEN= 128
##$LB= 0
##$LEV0= 0
##$LPBIN= 0
##$MAXI= 10000
##$MC2= 0
##$MEAN= 0
##$ME_mod= 0
##$MI= 0
##$NCOEF= 0
##$NC_proc= -8
##$NLEV= 6
##$NOISF1= 0
##$NOISF2= 0
##$NSP= 0
##$NTH_PI= 0
##$NZP= 0
##$OFFSET= 14.98509
##$PC= 1
##$PHC0= 97.42126
##$PHC1= 0
##$PH_mod= 1
##$PKNL= yes
##$PPARMOD= 0
##$PPDIAG= 0
##$PPIPTYP= 0
##$PPMPNUM= 2147483647
##$PPRESOL= 1
##$PSCAL= 4
##$PSIGN= 0
##$PYNMP= <proc.py>
##$REVERSE= no
##$SF= 400.02
##$SI= 32768
##$SIGF1= 0
##$SIGF2= 0
##$SINO= 400
##$SIOLD= 32768
##$SPECTYP= <>
##$SREGLST= <1H.CDCl3>
##$SSB= 0
##$STSI= 32768
##$STSR= 0
##$SW_p= 8223.68421052631
##$SYMM= 0
##$S_DEV= 0
##$TDeff= 65536
##$TDoff= 0
##$TI= <>
##$TILT= no
##$TM1= 0
##$TM2= 0
##$TOPLEV= 0
##$USERP1= <user>
##$USERP2= <user>
##$USERP3= <user>
##$USERP4= <user>
##$USERP5= <user>
##$WDW= 1
##$XDIM= 32768
##$YMAX_p= 442567761
##$YMIN_p= -669377
##$CURPLOT= <Network HP LaserJet P1505>
##$CURPRIN= <$Network HP LaserJet P1505>
##$DFORMAT= <normdp>
##$LAYOUT= <+/1D_H.xwp>
##$LFORMAT= <normlp>
##$PFORMAT= <normpl>
##$SURQMSG= 1
$$ End of Bruker specific parameters
$$ ---------------------------------
##NTUPLES= NMR SPECTRUM
##VAR_NAME=  FREQUENCY,     SPECTRUM/REAL,   SPECTRUM/IMAG
##SYMBOL=    X,             R,               I
##VAR_TYPE=  INDEPENDENT,   DEPENDENT,       DEPENDENT
##VAR_FORM=  AFFN,          ASDF,            ASDF
##VAR_DIM=   32768,         32768,           32768
##UNITS=     HZ,            ARBITRARY UNITS, ARBITRARY UNITS
##FACTOR=    0.250966925370066, 1,           1
##FIRST=     8223.43324360094, 50163,        216104
##LAST=      0,             -96978,          -144996
##MIN=       0,             -669377,         0
##MAX=       8223.43324360094, 442567761,    0
$$ Real data points
##PAGE= N=1
##DATA TABLE= (X++(R..R)), XYDATA
$$ [...]
23874 148774 -136537 -88091 74743 -126824 37208 132813 -186355 -195047 -84406 -290450 -59909
23862 -95711 199452 -141032 282928 -42229 97723 312627 -120429 107897 121677 -366274
23851 -138474 31212 -399137 -249967 -156528 -24675 -69527 238266 -75644 93393 -85279 -80686
23840 -80686 3604 -358431 -56663 205143 -142678 164187 209295 144615 -338234 173800 -163862
23828 -28330 -108504 115225 -44188 -10151 6365 63502 43707 410888 -178331 3550 -131206
23816 63269 -67106 177438 105122 343374 4941 -109550 -88071 94439 238404 -251504 -112852
23804 -133199 -37581 9879 293118 -360169 -2597 -245542 -274569 -33592 -45166 34060 -352528
23792 -182471 152586 255215 -137726 150876 -50437 -194193 254604 -170752 -320114 -94237
23781 -236755 206140 42237 25989 104336 55165 -228834 114707 147856 125814 93773 1740
23769 70782 -113046 -106583 -140825 -160625 -55369 -97402 -23702 328814 -221190 -139578 246343
23757 186138 -215958 99760 218322 300201 139502 -29093 -379019 -30026 -188218 274440
23746 114961 -69120 -18688 41842 163917 170082 -80091 65809 -167283 -116056 -121313 39062
23734 -8645 -274463 170563 135677 26152 224980 -398411 -250317 -17000 -130619 202354
23723 173079 -107346 190381 178447 -60130 69297 154195 85093 -240509 105221 -109698
23712 -169575 109456 -156448 -72286 -182781 -200197 -335007 144787 -192121 3544 -170526
23701 -61077 120130 -291038 -40991 -76164 -30137 101032 -264077 76637 4454 -398815 -4745
23689 267635 -43676 -365357 107552 -3108 227345 -321407 -362120 66826 20392 -240841 -83306
23677 -68940 17301 217305 -157507 -179931 -170986 -153128 37002 -272586 64376 99575 -238030
23665 1990 47016 141038 -184295 22444 -247923 -221622 -212968 26651 -232321 151815 -94752
23653 158641 95997 144532 330548 92671 -69125 -325879 140198 93011 -270786 -66244 314135
23641 427002 -112219 66228 67808 69270 -173343 -75266 -98148 425884 199916 -251937 48696
23629 -106572 -467666 86785 -76771 131198 1784 -136996 267632 -71387 86589 -187945 -145279
23618 -145279 -89420 166761 96997 43734 -147108 13990 -79656 123112 -69467 44918 -410596
23606 8599 -5821 -153915 -250868 158220 12077 68676 37258 -22601 -164892 -110722 30422
23594 97074 -79717 -10695 -26287 -150013 168019 452350 37560 72142 -248639 123813 -200544
23582 82712 -211456 -89422 410858 -73337 -8930 -72008 -102117 -191394 -24989 -69368 38224
23570 7844 -26495 104790 254835 348883 -5694 -151591 65356 192328 -203359 3033 -100731
23558 238267 182638 13610 12182 -264225 -116395 114427 -84388 10343 21242 -11550 159723
23546 61702 -76750 64641 -39770 288198 66468 84903 -313788 -420346 91586 -13631 -91088
23535 -91088 -140278 -116506 -81141 -137093 -347633 -12126 293541 -126806 -153618 -152453 -48734
23523 53661 -77789 -73231 -358846 48939 -51352 56905 -211520 -347258 36165 21071 -124870
23511 285181 175876 -270093 161527 -278043 62705 121337 -292727 -56925 -15191 -127704
23501 -127704 -142987 20756 190012 9959 62790 -41795 39235 428342 4806 52305 -15357
23489 -106936 -139562 -131366 -288942 -210412 -1382 -149178 215278 166867 -68939 109598 -25119
23477 64540 -113114 -66404 -177512 42958 59009 44621 -186535 -486749 163618 -219021
23466 29489 18849 -358949 -206811 17534 -424972 -161859 -294238 267648 50621 -42808
23455 -151017 219515 17622 185776 -132240 61009 328333 358576 37511 -149340 -161247
23445 -161247 -179759 -35853 -105689 50753 -219461 -113506 -23290 202752 -189668 -100179 -76843
23434 -76843 117168 -128930 -43604 -240802 -126888 -119305 162110 122581 290859 261970 60644
23422 -240327 167256 -47154 -93700 213298 196542 -262533 -469403 71345 -224889 334447
23411 -67823 -36792 -57544 -159753 126607 314225 222562 -99422 219796 342508 19960 -177618
23399 -126531 -47568 3046 -91157 -85649 55639 332 114312 -10310 -38248 -52464 -68785 168209
23386 -339655 111801 -352870 -214234 -480642 -458234 52916 101735 96807 -32455 -165217 69185
23374 -59559 -39797 -163745 110040 19733 -331587 -4617 -241066 9172 19099 -66914 -250179
23363 -250179 -20506 -788 100172 67397 138929 -58548 -52370 -266599 -288728 74316 216952
23352 216952 -101563 -20573 -169436 -82808 107381 36777 -326608 191026 5331 -10278 -58819
23341 -58819 161916 -58960 -36090 -109736 63087 -351237 146946 28751 -40582 201197 -160320
23329 -55691 17827 216529 189897 119028 -133574 29780 -115049 -212164 11566 138354 10460
23317 -124428 -33469 -150513 40701 119516 388794 -63656 63576 -62026 -41081 -110915 -299656
23306 -299656 67913 1956 -45358 85035 118565 150256 94450 -197466 -271746 -161107 7475
23294 61606 -70836 56103 59047 -12261 228950 -8262 -104322 -228514 -10138 39998 201678
23283 201678 162613 -66900 77386 250182 -74508 117306 -14922 57180 -69248 110250 -121503
23271 177755 -130143 64765 -59544 -42051 128581 -88856 -79836 -266697 89662 -250566 10594
23259 -26735 -168632 65474 7250 182805 247762 -190740 14260 85109 -336229 -476948 181302
23247 258328 309833 38150 373514 3486 -218894 -301365 -197587 68185 381876 190408 162370
23236 162370 -76157 79750 -77081 74588 353869 25039 -9826 157174 -17849 268036 -102202
23224 -86649 136438 -151825 16653 -307568 128600 271733 -337731 -52776 -136087 -198451
23214 -198451 68163 -11892 110618 1911 23804 -32771 226744 -15340 -63384 -118156 54399
23202 -491198 102649 -83505 -190645 -113476 -5373 -66659 23145 166643 67464 51293 14713
23190 171105 -160859 -59660 113736 204746 123850 93177 -53855 6144 -169745 66034 -419841
23178 17639 184334 -205418 -101270 -93537 125200 29698 130136 -256011 27916 -106695
23167 -203918 44009 -242270 -188291 91952 8065 141436 39790 -155961 -68042 57960 83178
23156 83178 11208 94767 -154974 -76886 -85671 59281 -223639 -279358 -488908 171076 10990
23144 -79371 -85417 204057 2094 -256141 11949 -21011 -7643 -14917 -127888 250061 -154458
23132 -31014 212791 41523 -4962 -320280 -154258 -12737 308621 -60394 -264757 289879 427767
23121 427767 -373832 65961 -62116 -159582 40255 -175704 196852 -236326 -327600 68538 77351
23110 77351 32783 -120262 -76065 -109937 -1360 -177353 -129719 -131122 -151143 -29339 -239464
23099 -239464 -153707 100039 -37767 -36212 159510 348984 -191765 -230501 -83872 -69231 146857
23087 20962 -133870 -212229 -22729 128070 9397 -188302 -62880 76195 -59457 -272599 -207127
23076 -207127 -164039 14458 -123969 24210 90181 50211 162884 254590 69301 -154393 -190135
23065 -190135 -4156 -116225 -163914 8794 57285 -99186 -106091 -288624 -80033 42851 -87737 71930
23052 205043 71156 -60893 248229 19943 75748 139735 159393 -34691 -195731 -67557 -68591
23041 -68591 -130442 -113961 -133626 47952 -72131 128893 -104253 61901 2378 -42274 -10236
23029 4636 -120765 186820 -229049 41992 157627 111065 212538 -151704 -61641 141929
23018 -280502 -16204 28613 -85798 239596 121677 156562 -81472 511917 -141595 -204807 -123209
23007 -123209 -115226 -216541 38446 -171989 -265079 68768 5628 147710 -57876 217219 -287407
22995 124060 40984 31303 191359 145140 -95885 -142637 -57272 -148224 26164 20418 -141404
22983 -22645 -100468 280416 -78219 211462 231508 166768 257159 85421 -32127 -157249 48487
22971 -39582 7403 -408198 -210065 181547 173941 56004 89955 -111696 -15733 43720 64058
22960 64058 70997 -264997 68013 47337 -105532 -69520 -14892 103399 -65900 -143558 102437
22948 158395 47995 -212250 -206472 -273221 -35612 35156 334651 -48133 102592 24496 -144635
22936 244059 -307464 -5211 -358043 63663 27279 72999 -205668 213703 -205512 -285717 233775
22924 -456139 -237212 222831 270404 -128617 142486 -59778 -346107 -252626 -4925 25022 -51326
22912 -150143 -338878 136732 -192623 22291 -55909 124424 126351 -270197 -159044 -55930
22901 119491 152248 278039 90335 -81154 -297931 202661 -66586 48153 -5675 63701 -1713
22889 -390993 -61996 220729 -118597 -251727 42143 -87663 -73971 42924 -281335 91896 -114644
22877 175678 -88316 -63880 86926 -180986 -308775 249006 342733 -351085 -50350 -88637 -37265
22865 37947 95470 9251 -74775 82168 253889 -139750 -144286 -167329 -212703 73857 -267839
22853 -126320 226503 40726 256210 53032 -114158 17737 -229171 -58739 -138477 -192316 58486
22841 -25694 -13075 -118608 208411 -95980 -208304 -208857 -249412 99313 -256800 -65514 15328
22829 138986 175217 -180046 3200 52744 -66286 379857 -212844 -506784 199070 -98784 63502
22817 -423711 6697 205880 15459 -397674 282080 -262671 53372 30857 -230944 196819
22806 -116597 -123033 76281 -301691 376885 27961 -38359 -154454 21473 -136964 -81726 -26948
22794 -183561 -100752 -1275 -362555 -101845 33946 -177733 9338 -115946 117836 76799 -247286
22782 51732 25451 -91813 5701 -139165 -86361 -264358 -128162 187975 245105 -416575 -27073
22770 178984 130219 35526 -106322 79168 -108966 255012 64023 171867 -51266 -6306 -65674
22759 -65674 74617 -273932 -182285 105234 13056 -9675 -340674 293598 -333827 63772 -137615
22747 39691 -65077 -336347 -24077 118223 2546 -183335 -278060 -197451 -245027 70486 -203727
22735 -126266 -168272 -79107 28256 -83341 -7166 33405 -210333 -306395 30787 -94290 -70621
22724 -70621 -30712 -356639 102740 -154136 -57154 7884 -39293 274893 -90796 275513 86449
22712 200198 295828 -214909 130595 40088 -23982 622 215255 -16001 98587 -185409 -56313
22700 -150703 -210517 -81165 11851 -115996 55319 171631 -9723 251451 -70245 96747 -142218
22688 -70708 26635 65987 -349728 27592 17118 146676 -330216 18096 -143865 -118954 43388
22676 404 -246581 92646 -324334 90033 -110274 175623 -252590 -24616 -7150 45119 -108818
22664 -77757 -185484 -18732 -229745 -166674 -81176 -2388 285591 68634 148138 84000 186367
22653 186367 116156 -129674 -137288 -269905 -72845 -8800 -209665 94402 -301757 82758 176307
22642 176307 -93956 -291505 42211 -270184 300388 -149558 -143929 -157938 72068 -190077 -110024
22631 -110024 -9536 -79831 266516 -64579 76171 -51058 94584 -90934 121598 -101685 99959
22619 10035 98617 -37522 -74710 470376 167199 23640 48714 -86588 186839 -160088 -120516
22608 -120516 -206273 232781 -22613 121981 288842 -359580 208033 95417 -92219 149849
22597 -152583 -114811 92427 -43110 117885 -402224 36477 -42375 126199 101254 65912 -135809
22585 9069 19118 175018 -96526 -226262 -123017 -173557 -150001 55619 -11248 -3016 256603
22573 -109219 160747 124649 19565 -49511 298004 554 -11349 -173303 -198577 77178 87482
22562 87482 219396 -105969 18281 -331428 263897 127012 61853 -395440 -327348 -27884
22551 136975 -276004 139965 324219 -105517 146490 -4708 -63912 -162792 -263362 192581
22540 -157817 156973 -262465 31374 -68372 46256 125989 -308862 -291566 -27855 38511 -144293
22528 40752 118598 -294529 -188930 301432 -43870 94654 172048 81510 156295 93401 -38037
22516 -158583 119956 -48738 -69051 153988 -289060 19096 -229092 -241755 -76541 13354 -78031
22504 -11179 95485 154993 -72883 -62988 25216 -68697 -9128 -3712 41326 1512 -209043 -279393
22492 -279393 -162953 -217229 -148284 -125878 -71427 -10812 -34406 171576 174915 -84328 22320
22480 53914 -91487 401527 -292578 63522 -134298 13433 25392 334457 -102516 220618
22469 -55837 -101385 -95846 -253694 62824 182869 113936 -54391 -243726 56961 -92033 -51690
22458 -51690 -109777 -30235 -52068 -83312 60735 -378357 -173627 -266483 -59624 -214805 196847
22446 -173808 35319 -344179 188855 -40624 182010 -175094 -131556 98430 18734 -38489 -66425
22435 -66425 -382927 -400995 81235 -264828 -92384 -105481 -269843 18086 54453 -73205 313740
22423 -155907 50251 80353 -19459 -102445 105874 92431 -317912 -76179 -181526 -27534 172434
22411 -242450 85039 -80846 92817 111063 82334 284650 -39618 60081 56145 31275 -348047
22399 37423 45411 -111126 165901 -363732 15066 38780 257857 -2272 -42739 209711 -158289
22387 174858 188475 273271 -170309 185068 -14051 -4688 125105 -460565 -145279 -11674 134928
22375 174287 51864 -140246 328103 134228 40469 -319963 -198750 -303843 4091 16610
22365 16610 -195871 164788 -284098 68551 20218 -15329 -130088 175618 -48020 149684
22354 -30659 -48592 218019 286679 24793 100210 -27449 -40466 -104405 -22533 -13996 -76572 -52962
22342 -52962 165697 -269742 161060 -73821 -182544 -33811 -174156 311946 -233532 323890
22331 271325 -131649 -206047 -220201 -136645 -195825 23491 82947 -141680 -321984 12624 -193278
22319 169143 4587 -32198 76797 43186 -5585 -91339 161858 -181510 405675 161217 407536
22308 407536 154247 154633 -367278 -198106 108805 4322 341916 45414 -77068 33443 -189829
22296 81763 8128 88085 78095 -66397 -227933 -248200 -499487 -151263 118667 -315282 -245399
22285 -245399 -113412 -407658 -124351 42493 -48137 -78469 46105 273115 133004 109697
22275 109697 21006 -319835 33226 -57427 -30875 315151 45358 -39581 -419380 69344 -16697
22263 29379 -58215 -189764 -95827 -289847 -345598 -66793 94388 -178032 51663 -344043 85237
22251 -117595 117960 260342 -214930 -184714 -35914 247004 22779 18011 -3520 288771 -327186
22239 258608 -173490 148402 -4247 -202148 263114 -345301 -420251 -171968 -118624 70938
22228 -161481 116411 -40217 -191446 -125170 -33685 139973 134272 148819 136393 29376 -4104
22216 83033 184862 -122248 57612 -123643 -67472 -99763 -213593 140834 -92608 20766 -263809
22204 38616 200616 -403762 190320 136625 89967 30272 95080 -74371 -172701 -57242 346860
22192 -31603 -53406 67351 -13602 -23705 -154539 -158801 -69655 48213 -251267 -101026 54928
22180 -101185 102574 -296424 200843 111168 169856 -303349 89626 -301140 452002 74282
22169 -62978 -35949 115575 -53578 -41674 -30214 -73440 -216643 -180577 16163 -237623 -39594
22157 150609 137707 14480 131851 -68972 -207883 361348 -76975 36294 283233 -211081
22146 -49145 35456 -26018 -38113 -102338 -19331 -31307 33285 228298 195743 -64989 48400
22134 80661 71788 -36171 -871 -303856 -150186 52082 -156265 279935 18158 37215 -57648
22122 -141220 193309 204763 -232235 -137222 163844 81951 374953 -159091 -143993 -7436 -279511
22111 -279511 -305265 145774 -439271 165983 258768 -188716 -106794 -80805 49228 549 -363932
22099 -73916 -256466 122840 -380478 -126131 -117191 -226732 -361344 96719 25846 98687 -410743
22087 -255878 -290910 10316 -152356 176171 -195209 -89242 -1609 -326354 57447 -330745 -235114
22076 -235114 293214 5286 -134630 -91214 -34717 55871 264166 143670 -228913 -217931 74765
22064 -272662 -78395 -238050 125398 -134931 80247 256947 -44288 -352272 155447 -91164
22053 -93660 3762 171394 24495 -50560 186418 20128 -43366 244789 -18883 214871 -97495
22041 -67779 153316 -45789 321828 8545 -484248 -81724 -267503 -272253 5552 -130036 -59503
22029 195460 -112723 -18122 -188827 44316 -254528 -384346 61629 -117352 220179 -17657
22018 -46389 129070 -293605 29584 -76858 -117100 -192038 -346590 -197782 205025 -116988
22007 -61049 -67580 172919 -288124 -63642 -256871 -391275 -119072 -46934 94 -137149 -102264
21996 -102264 -101669 89459 -144489 262790 -241448 -241313 -369761 -308350 -115867 -221501 29667
21984 -157308 390929 -103560 313749 -203182 28643 142880 99483 -93964 -74824 218784
21973 -230236 39121 -237602 88821 -82696 179543 18824 -239485 67119 -7668 -178787 297401
21961 29205 -268814 -17740 180156 13920 -281658 101081 -7833 75383 280456 -240775 20787
21949 -85648 -320290 -39704 -9074 -73963 41628 62007 -167516 -323485 -74000 -77958 -238688
21938 -238688 -30604 78011 -70080 -186587 -198102 -21138 -163038 -133021 -164758 -249924 9116
21926 -33270 -30813 -199795 41638 -89925 121515 52232 89728 -287748 -196988 -19086 -99740
21915 -99740 46673 -77497 272358 -56345 -296630 29745 117818 124089 -142319 143053 60761
21903 -267349 -158574 -86348 -136586 160778 -89040 -116966 133960 -137010 -27387 -277844
21893 -277844 -227646 13140 161952 13966 -35222 -162480 139036 -205531 -258586 -48085 398351
21881 -178260 -7631 -290666 -207187 84788 -127879 77633 -96001 -210780 380590 -527361 51500
21869 -319849 -437611 33653 86774 72497 59742 -253903 26646 190765 -381211 -32336 133713
21857 3049 -32910 118975 45518 -161807 -67936 76041 -45433 -317900 32463 79533 -2880
21845 -68657 116662 328352 -140053 -15970 -136094 -200477 -47220 60476 -197491 -381383
21835 -381383 -243798 59341 167168 297532 89784 -304836 -33655 -65546 -177351 139112
21824 -283377 288680 6086 -149471 -198075 -9279 121353 -72345 -227601 -95830 57408 -284349
21812 -29542 -94007 -13450 -58523 -44112 -130212 8612 26591 -9757 103023 -15374 -52316 9806
21799 -143599 -165524 -31226 12244 -265328 -207874 16851 78207 -113504 -203649 -2207 64390
21787 159941 -28377 86505 43286 -244478 -98072 -27784 237575 55808 -177865 -92625 -378692
21776 -378692 344623 98908 -13158 -117091 16949 -126124 27548 -30011 -227021 -187056 -34668
21764 -72075 -34737 -273374 287261 -34541 -61085 28632 103351 -176558 -216124 211957 128328
21753 128328 -25160 184201 98513 46696 -198534 245197 295745 -266222 -77756 -149830 -88099
21742 -88099 258250 -81147 -197289 84688 225128 -99367 -42755 88335 -30825 25048 28283
21731 28283 -232922 -156401 -34496 244953 61834 -3003 -68366 285969 -70157 22623 -57167
21719 31043 9134 52009 -83806 -57608 166265 20640 264553 -124280 -344730 -76137 104262
21707 -93864 121487 -129124 -71867 -60955 -108158 -63638 -110551 65165 -158036 247563 -299094
21695 87203 -72179 -162294 -182741 114294 95271 35222 -270179 61290 41978 -93643 -170943
21684 -170943 -127678 -167530 249347 -132140 129830 -63661 121709 -74655 -208138 -1090 -96026
21673 -96026 -2443 -313143 -26518 165648 -84539 -283919 -222773 -21128 200521 -176118 18430
21661 -139587 -19320 31116 53789 -7012 271472 136568 -127131 -157867 -126095 -168271 54946
21649 39383 87814 -387660 74992 244380 43430 -3449 76108 354922 64838 -161581 191348
21637 -100959 163703 -151170 -4296 -114129 150858 89637 85883 146616 -168248 163852 -323168
21625 162571 -73647 310520 111645 276166 -14671 13319 108963 -172911 2690 -413256 -170811
21613 -20431 -23368 52858 67671 -186886 33907 87266 -388460 217067 102811 175977 289187
21602 289187 244768 43773 -181360 -216888 6587 -218586 38660 -263095 -40673 124093 107923
21591 107923 -286548 -194722 -160635 -10692 -59640 108554 392344 -252385 121637 -249552
21580 92692 -576371 21693 29864 183341 201551 55218 107118 -218660 -64501 -33896 -805 246138
21567 -52307 66412 -28253 -126424 384555 -378826 -32277 -298368 -57210 -85954 -62912 -176408
21556 -176408 -165187 -63523 -317783 -237599 82109 -325473 -215517 -252182 -223599 -63700 -273903
21545 -273903 16919 130873 -122636 18461 -271508 -17929 -253167 328610 140901 118616
21535 118616 -95173 63786 -290879 19107 57217 -143726 280077 -171967 299429 -22365
21524 108433 208729 -242920 172497 91307 -150613 265554 181465 94098 -239673 -188515
21514 -188515 94793 -282438 32126 -145900 -2027 2761 78828 21081 -181927 -1368 219986
21502 234533 -281052 -17691 -179225 -111038 -354774 -43017 145493 40265 -23205 -216586
21492 -216586 36910 -14849 -150665 -226901 -115525 93949 -116214 -130215 -228639 198780 134456
21481 134456 -50833 36481 -128388 26285 33005 226173 -333546 -106778 74715 -53135 23599
21469 -158148 51434 -297009 64101 -117400 -355873 -159462 49722 146588 -137848 -33094
21458 -89711 65109 -23656 -246520 -308022 -31375 181694 -56849 -224466 -342355 -51791 3508
21446 -58353 142298 177600 -26796 47529 -317296 190969 98182 248862 508125 329772
21436 329772 60189 387737 300299 -83182 -11352 351610 -260906 177032 81282 -164880
21425 -182936 -62196 -169716 64025 -17708 -21526 -69077 -239619 -142192 130959 290148 -125142
21413 -150134 8189 11078 -128690 211162 -135447 46812 -147111 -6305 -413836 -101237 -186430
21402 -186430 217423 165939 10537 -47659 -338787 -49237 -177881 -100057 -93652 -44656 -202041
21391 -202041 -349111 -2417 299177 93225 -50733 -315516 1132 180695 166156 -23999 274446
21379 -160824 -70397 -195549 -66672 28073 127071 -139840 249098 -37040 -124216 251182 -271968
21367 -45120 -283218 -357287 -51349 -274069 -609427 127756 -192329 116735 141431 6423 -191987
21355 147199 -84187 -40010 -57614 -91941 53204 122844 -54489 197160 -31130 29605 73547
21344 73547 75674 -272458 -62120 57232 -122077 -340612 87743 -12624 89581 -97218 -235648
21333 -235648 -38841 154178 -180614 105694 137870 377060 -29024 -41942 56750 97839 -51197
21321 -330810 -53300 -331257 84673 -101412 35523 -49626 -78164 -265061 -73449 -55399 283413
21309 -5800 -192293 -66457 89939 38619 235906 67632 -261826 34766 28555 -468253 128849
21297 57812 164461 -188343 -31703 44645 12894 -137653 -117833 -113035 -239174 -13549 -12080
21286 -12080 -167676 -293390 -61283 -177282 41505 205222 -141812 -60219 151819 -189097
21275 173422 -190058 187594 -151074 -290347 92187 171423 77861 -96376 -374335 -160821
21264 -187552 -250260 -310394 216040 -19862 263663 142328 5410 -179701 8721 -31365 -157006
21253 -157006 -266612 284944 118010 190711 -171326 44070 -126157 205940 203672 262894
21243 262894 -3479 -7423 -181881 144240 234416 247281 -43834 -74944 -267122 79570 26234
21231 -325634 54327 -285059 -117111 31969 -278194 130053 -138448 165769 -197755 32098
21220 -11515 137953 -249730 46408 -122420 -40443 180882 -39207 101740 29609 -88645 -330337
21209 -330337 175021 30386 -515688 -89780 -67352 -15247 -119976 30122 -176941 144629
21198 -2043 84997 -275934 -215044 48182 -132844 -156314 92867 -278819 -131298 28722 232837
21187 232837 -52638 49108 27551 21269 250077 -100896 67291 -318134 11637 396018 385044
21176 385044 -102427 -107853 165185 108311 -272800 -4063 -249163 147831 -155401 -30230 -46360
21165 -46360 -225267 56107 346463 9949 -7077 -152313 -97942 -30073 -293996 26227 76436
21154 76436 99087 244932 164158 -39513 -300901 3546 -94515 84219 234044 10730 -208840
21142 -36178 -157597 32533 28389 -543417 114023 -222451 284982 -141479 -49251 -110832 125827
21130 -38330 -194770 131515 89521 -417688 99329 41960 -276459 -45889 -253344 77052 232729
21119 232729 -93456 -84491 -103559 103909 118632 -243962 102037 159140 -305816 125085 40114
21107 155747 -205555 26530 -133265 28870 -123538 -18482 -179013 -311895 -260218 -137014
21097 -137014 70468 -54751 222393 -114305 49451 -18200 -299994 133891 -347672 -222478
21087 -222478 209743 -208285 196750 -180086 153002 -365077 210741 111070 103038 146473
21077 146473 205531 66485 -402775 233824 71280 -203712 -295830 93746 -302756 159564
21066 -286624 -110255 -6487 150661 71336 81086 -15828 -102864 171250 -142804 -160858 -163532
21055 -163532 109 17643 -46063 -67203 -331047 -37555 -23314 16910 318290 45009 -215762
21043 204181 265393 -23405 -221433 -51198 -45963 61983 28457 -32123 -182901 -150302 -142048
21032 -142048 37380 -24729 158168 -278331 -35955 21148 88269 -389922 -29084 -299593 -178858
21021 -178858 -182232 -46393 -43967 -140734 -73479 -106752 -134483 283115 -15781 -40686 -179994
21010 -179994 51881 -415181 -101258 233177 -95429 158526 -77312 -161090 -131740 24548 65011
20999 65011 101386 26377 -11005 484068 -135540 -229731 259061 28023 -396543 279336 149316
20988 149316 -97755 216575 -243745 -211342 -82168 230140 -298260 63136 90390 125068 47172
20976 -159605 53252 5205 -161125 40245 117479 326152 9267 -75984 -129620 181406 89269
20964 -76438 -305083 62596 57428 -140860 191334 -58909 -5954 93545 -128632 92543 -147257
20952 -18605 -146472 420445 -140756 250995 -93350 -191923 -115902 -2357 62366 -216342 -42056
20940 369740 25536 -117634 -49561 -159201 -95825 -262995 269085 -92641 -175627 130069
20929 165345 32186 73757 -59299 -99986 157995 -64218 -252773 318923 -22738 136733 38400
20917 -124405 -292835 121957 -215260 -311237 -301213 -136600 -217614 178110 137697 17658
20906 -159654 40647 191584 -135721 -247030 23371 181651 -506222 57353 -322017 -103682
20895 -102911 -209187 29327 94954 -44252 107576 9303 -7606 -218667 286318 101980 70804
20884 70804 -15472 -69916 -2775 138704 -128466 -22179 -409845 231506 4138 73547 -14860
20872 -16203 70607 197872 70499 85419 -380506 -123605 14344 -43181 -56060 -98748 -265374
20861 -265374 -339567 -11507 -47208 -93914 129345 -268040 -26902 131769 -226051 -10107 -187641
20850 -187641 -55490 118391 -54735 243596 -81933 -10825 154285 -258381 306462 -192039
20839 85507 281055 -138023 -168542 14189 70847 -59362 -94672 -142776 -20038 -13088 -72302
20828 -72302 -138892 -339477 138176 197798 -160624 -165415 -6081 -224769 -58086 -123064 -159980
20817 -159980 -34808 -203274 -201990 52208 178694 61903 -225923 -159328 162537 -78914 52560
20805 -87805 -150989 167979 155264 -258304 -26127 335825 -280044 -125841 -374890 -315109
20795 -315109 133000 -159111 14811 -9799 -240026 151432 -270287 -63415 58079 16594 -170560
20783 103420 38433 -79939 271177 35542 141081 35611 -299829 -257512 -327942 225289 176005
20772 176005 234915 -137347 -234053 153831 -95438 151318 189352 -8627 -107609 -293740 -352731
20761 -352731 -392364 -66714 -216678 -59359 199724 -53167 376319 -55430 -96892 176429 168683
20750 168683 67157 261709 -240615 -80955 -45189 -1448 -161509 -50990 88327 212659 -115971
20738 -77175 233025 -173819 203940 -426224 14976 107682 -189404 134387 26749 -208658
20727 200468 -175502 220153 -72601 -269 -53326 109891 151224 5630 -240265 -382184 -103567
20715 62832 -104382 57469 227016 -248647 -234157 -16270 -44485 -201725 3025 5997 -175434
20703 -164420 6715 256442 -316531 -178344 151493 -61175 -110406 -182988 106182 -99134 -128805
20692 -128805 -58518 -214265 -25613 -23771 -452302 -107698 -302746 -121102 23439 -152271
20681 -5742 -65763 43055 202869 -211060 -179975 6084 216775 -239853 -78492 158713 79788
20670 79788 155632 -240601 102776 197518 -69809 -29426 -169948 139895 -61032 -127567 164136
20658 -4038 -322738 -209666 191626 -135367 -364184 219004 9792 30475 -300637 -53261 -102978
20647 -102978 -196422 -67411 -132398 61664 274463 -143772 180724 -34037 -110381 -290563 -28089
20635 106671 -67105 -142717 65896 -161457 -4415 -26296 -132691 -116170 -200240 85379 194152
20624 194152 230585 -27032 -112614 113456 -23608 -17845 12059 -55566 297855 377135 -144916
20612 162011 -348023 -260673 150025 -260655 -67979 -197530 -60514 -186174 -48070 173183
20601 -185318 -21719 -224050 148496 -138242 -72251 94153 209730 -391112 -95765 116604
20590 26760 -195762 46667 -289723 63244 -192992 284840 -140975 -129099 -165534 126221
20579 -140289 31299 448993 -123783 -51231 -393715 -14039 -122550 -210208 109843 -299116
20568 -215301 23801 -97855 434350 191531 -162891 50682 17240 40521 393846 29462 -337940
20556 153944 -255121 -338498 -75652 -219406 -248486 -43461 -306409 -91565 289316 139835
20545 -41155 -42914 167645 -235132 -88198 -78446 -162840 -161395 -64908 -289062 71490 -59087 -32199
20533 -32199 -3021 392633 -231505 -93482 -170952 -70954 -144599 -242931 35655 -182468 260928
20521 65808 186641 186030 372896 -13556 113886 93242 -305268 -101932 250407 -93415 33358
20509 64132 -81188 -145888 -305013 -160449 -314192 3494 54886 -429061 -19121 -148025 75160
20497 15118 -82725 -256833 43205 -306162 -118044 -159230 -92137 -389826 -227273 204186
20486 -27006 128946 142979 -20186 140632 99115 -301438 113378 271280 -123678 17717
20475 -104147 -269967 -24469 -191399 -111186 -227536 -295897 -10326 -82969 -115100 -307449 -125401
20463 88237 -138231 132208 39781 8688 377421 189089 328826 -37430 -91238 136492 -3854
20451 -201155 -27788 278676 -56757 204857 -106343 56372 649 -107816 23025 -308456 93939
20439 5489 165956 -212061 97298 226696 193252 19931 6970 -231853 -230458 -305169 69216
20427 13535 51523 76761 -100968 -304298 155871 236397 -70677 89486 45467 -393680 -232759
20416 -232759 -242172 271586 -163176 15664 26510 12500 11346 -76263 -40157 -265527 -51854
20404 -34293 -342651 -186061 385872 149281 79781 -96763 -120479 100286 15967 -76051 34011
20392 192645 -154966 65751 -55462 50009 -182112 -163201 -168464 -116961 -88872 -4399 -119691
20381 -119691 -56468 -14966 -374927 183770 -408066 -232556 99102 -215347 -126349 -82898
20371 -82898 59970 -3958 85987 -283293 7983 -146196 -265587 -61754 -132226 -150732 -122560
20360 -122560 -8468 -36483 -16232 -152257 -5646 194658 -319615 307070 143812 -132533 -86436
20349 -86436 384439 -28399 -243909 -72501 -23467 54024 38850 72717 -231659 140220 -175373
20337 -226062 60096 -283969 210954 178320 -11659 -33308 -59681 -232981 77169 -40185 -91113
20326 -91113 -264874 -169890 -193690 -65694 13733 -73440 41095 -234622 179030 89520 -146413
20314 76992 59164 -340415 145103 -87159 236897 -124748 284083 -132394 -176256 -291968
20304 -291968 -238777 -134405 -16923 33476 -100938 -353507 -101254 31029 -309618 -81363
20293 145152 -412113 -181264 49142 -266463 -80030 -36597 115211 -196083 20342 44264
20283 44264 -136892 -5139 -37908 -36329 144020 349743 49032 80151 -59390 29463 202121
20272 202121 -49494 151828 43619 133489 -43333 -19933 -30337 -233661 -767 -595362 122361
20260 -3055 -91521 153180 -41089 -219206 -24343 -248056 73260 -83102 -37569 61950 -333614
20248 -112775 152084 -292477 24906 110100 163059 -29012 -265330 155531 165176 -48424 159073
20236 -217588 -252913 -430540 -49215 -112041 39197 85423 -316110 -201753 171755 293520
20226 293520 -57037 -69784 -295010 -224104 138542 -272306 43948 -220218 -244481 -97564 -404246
20215 -404246 -49465 -119244 -89014 -224759 -73338 -148570 -179316 -336221 2340 -185387 2783
20203 76746 -95103 -128357 -240773 42308 -151542 -308053 -329801 88917 342109 -127554 -74475
20192 -74475 75254 -2243 -57775 -294800 64791 -57664 -14934 163853 34345 -248166 150245
20180 -158331 12490 150736 265988 -40044 -129084 56504 -55319 40267 238251 19975 -189348
20168 47844 24365 55458 122748 -40893 12577 -125012 43980 -59692 23240 109981 -64030
20156 223017 58951 -41881 -54395 -8632 24979 -297477 -75286 48454 -174226 -116789 -258421
20145 -258421 -486595 206482 75957 -76609 93563 449894 11606 163149 -206068 -106673
20135 -106673 -63569 -133614 -46112 -47114 -112883 -78996 -114550 15852 217525 -151239 -316774
20124 -316774 -11673 -280582 -52917 329862 82572 -181641 -511776 61157 -199084 165593
20113 -252191 -289811 -459688 94216 -85224 -288780 -139580 -50931 -32999 -75233 -57527 -211071
20102 -211071 -203163 -178743 -88852 -161482 -43194 264734 12107 -14287 215387 -118165 -158023
20091 -158023 -121690 92464 -65705 -37054 -8368 -1062 -55022 197070 25447 7208 317968 -115802
20078 -175476 106216 113019 112819 -18710 186093 -301260 363258 -419971 67691 -209121 58952
20066 -328736 172509 139863 122317 60701 22339 -156617 -324587 -190102 -140795 -153773 17455
20054 -319332 174156 216415 -41643 -147403 -37482 -200357 -22249 -498805 74883 -149780
20043 -209830 -178557 -87098 -276928 -38899 177605 -334642 98915 24670 -2880 42954 33342
20032 33342 394066 -83589 -96811 -118657 56500 41004 -85219 317958 149535 -47980 33238
20020 -103059 -178238 93257 232908 -102870 -20041 -97221 -12077 -149757 -191561 -4419 -334004
20009 -334004 -197056 -175425 90523 -146660 -239011 -11129 -26500 -240620 -15314 39437 48642
19998 48642 180459 38883 -25553 -211509 197801 101276 -158714 -144500 42873 -34676 2011
19986 -233635 18951 -193047 -19376 130446 66112 47427 297177 158725 -295654 -196674
19976 -196674 99399 -294854 -88697 127117 25305 -85047 114237 98651 -233814 46772 -218749
19964 22870 289838 -265928 -140843 -21427 -237134 374981 159452 63497 -158699 91508
19953 -177214 -143123 -16239 48909 59968 308506 14281 -252558 -140735 -298351 20484 8634
19941 17731 -160822 222061 -344757 -130623 225860 -53375 -346350 65891 48639 278458
19931 278458 148345 -468120 -117566 -12738 -272363 -255064 -151350 155054 110288 118314
19921 118314 -46920 20888 90286 -136843 -264748 -23979 -73430 50019 -69925 -234737 82579
19909 -334589 230374 98658 -42801 -257027 -10689 -336175 160061 -395185 -66343 -98151
19899 -98151 -183803 15737 165562 -257146 -401930 -5255 -178524 159511 -164806 200837
19888 154770 63493 60419 -102105 -219857 -96709 101760 -111074 -5262 324245 118838 173536
19877 173536 -22001 -273865 146488 1899 152109 -198942 -108658 -72478 -385286 -34291 49047
19865 -60583 256262 -61265 -144984 -131466 8405 -84651 -74817 63929 -139841 -136196 -154279 336604
19852 -378164 70708 -133046 434292 -197921 -139519 -161541 -296469 -298581 151421 99546 69448
19841 69448 -36089 -185954 170257 -109704 -55465 -127587 -112628 -70683 -419534 -303901 -126367
19829 -90449 -160054 39911 -123576 -136484 -233949 -450155 -177474 -145667 97997 -67249 69881
19817 -427758 24962 126975 -254713 -53771 -23789 -140072 84349 330250 -331977 107949
19806 -175367 -314214 359081 -466045 203560 -41077 -53292 6399 139686 -167457 79258
19795 -158484 -100423 -141648 220096 -135237 -195296 -80383 22714 -207565 -53308 -65676 -174043
19784 -174043 -259522 63587 -99544 121509 203534 175013 46595 -80505 -21281 156602 -142316
19772 54722 167462 -59223 -402762 43388 139600 -138674 -237044 -181436 -171804 164919 -73339
19760 -247965 8018 -51374 -223773 32150 -203914 -61914 -307328 139580 -88975 -42466 17413
19748 -259507 -1821 239290 173628 13861 -256281 65349 158244 -44157 -43016 52418 -110619
19736 228636 151140 45792 39376 -57953 -147813 -154186 -26501 -231422 -265152 -63991 457486
19724 -330522 -124404 -103953 145591 -20906 -57290 215617 -75996 94029 -14195 17551 -62148
19712 -20533 -153797 -121556 184289 65533 -218949 160116 -28854 -153567 205701 147847
19702 147847 32520 255992 -7484 -351667 -68574 -214387 293707 -212675 64489 112917 108
19690 52447 129624 -45009 -181017 114572 -121949 -36984 63077 -278709 -15915 -147923 87563
19678 214105 146658 -51571 160626 22200 -91422 -228546 13467 -92698 -194372 7933 -942
19666 -207290 -537035 -257489 63164 136110 -172780 137447 -119744 159799 -202162 -211519
19656 -211519 24906 -6001 121263 150170 -300958 -217301 5727 172106 1192 -96296 -167916
19645 -167916 116596 12309 -182431 150942 65851 154072 84514 -127656 247649 -261714
19634 -1769 -14178 -174492 -302576 89873 -86906 -100021 -185061 -65880 23835 -384173 -109107
19622 -37887 -244023 32198 -104809 -220528 78929 25154 32512 -106138 116095 -210848 128101
19610 -14253 -56004 184239 18722 -318365 29483 -95041 144677 -158752 84888 7466 169137
19599 169137 62391 -136834 -161184 -159172 129663 -85747 21956 -94404 167385 -228992 -230410
19588 -230410 -122326 -136049 43446 -237680 -93796 -156619 -35294 154202 72681 -176155 -383699
19577 -383699 132760 -150851 -153260 -204015 -54757 -50149 -197789 -8073 235979 433474 -162041
19565 98115 -119593 45218 51308 -37881 -170499 310812 26580 -165258 -211855 -335555 85089
19553 -14877 105218 181044 -155010 1335 17509 171801 -53216 -332242 -95197 -64482 258143
19541 -228322 103863 -50374 -229175 166647 -3414 -208146 -364977 -72758 -12960 60985 47792
19530 47792 -248763 75913 -394058 94787 -334163 -503388 -334445 368505 102199 223992
19520 223992 -529073 48444 49300 6692 -106756 60782 -53686 -280445 -315676 -105402 27716
19508 -273256 266505 -118271 -104598 192215 28945 -124444 6834 -15089 -24264 21579 19350
19497 19350 -171245 79425 150952 120250 -96712 -60558 -221820 286277 42263 66220 -378684
19485 106501 -310548 -46300 -166421 -15416 -104869 12230 -247121 -27460 59986 -67223 -266427
19474 -266427 -47080 -218687 29014 -94146 -86497 -170531 196506 58337 -25499 -85784 -13311
19462 -171524 215038 128423 161574 -18952 -205950 162608 -73835 -19237 18331 84923 410263
19451 410263 -334994 -155974 -25890 -97053 -199243 -112197 65239 -7087 -213896 -8965 -85609
19440 -85609 -48749 137620 -292501 -142323 -282348 -35281 34661 304918 189320 -186592
19429 -126749 53056 -18754 -161687 -119464 -6406 -155603 164898 -271738 -332312 -249846 290067
19417 -153844 98769 -28907 -60572 -212527 -152145 -20218 -150568 -372948 109948 128176 244106
19406 244106 159663 -45399 136358 -170830 -136821 -353847 -59437 -174830 -58548 111272
19395 115604 92329 -163603 -77490 -206917 131576 -156587 -95914 149668 -276421 -150792
19385 -150792 -266951 -16093 -304717 -433847 -67925 8805 -113176 141387 6559 -142908 109949
19373 113347 29958 -47495 174043 -249452 58955 -296124 233330 1931 239804 172051 166386
19362 166386 -542569 -85824 61756 -95465 -61426 -276096 -218339 -256256 -49649 -135697 -59146
19350 -319363 -75379 82962 79668 123202 -149252 98921 -309312 153785 109533 -471359 74456
19338 -50982 -134828 17824 -211248 -53169 25027 79192 -292890 -191234 -354701 -294894 25944
19326 129937 -6830 -374164 -174495 -143565 -326955 -365048 152629 173535 -24786 -70491 -34586
19314 204603 53866 -228936 105902 -210839 -77869 23525 -9533 218933 117412 67875 -117430
19302 -76152 -301090 21189 25330 102031 64921 -212301 184415 -104060 -134937 -292050 89992
19290 -306450 14470 -25078 16393 -123834 -19038 210215 54352 35873 -93079 48180 104496
19279 104496 -212740 -41780 -330948 -222730 112339 -97306 -112195 144737 61434 -195429
19268 2169 351234 -198127 -338203 459600 -52820 -63459 46300 -11167 -14786 -36554 -315245
19257 -315245 36321 -39933 -216634 5243 117494 32338 -79268 -119328 8005 323400 166 187511
19245 187511 -127884 21978 -55798 -56897 -381631 -118778 64581 50515 105680 385508 -257185
19233 13069 -254221 -3880 -137098 -161838 58824 161945 66905 -166848 64409 -27921 -129205
19222 -129205 136802 113452 104696 132945 -36938 108952 -75370 -184441 213468 -203623 -261549
19211 -261549 -256216 -78778 -114529 -4514 164108 -1478 132246 -142338 58807 108356 36650
19199 -164653 225667 -157081 -90938 -261379 -67600 7928 69853 -199850 -127499 -91497 58275
19187 288331 29627 -110220 -222294 -50302 -20501 -109801 -334646 -127716 129636 -233333
19176 60393 43395 148877 -140327 109830 -212517 51724 -122990 -167778 5370 45087 418630
19165 418630 10650 -175191 1744 -221078 -211112 195535 -140629 233299 221814 -346486 -289199
19154 -289199 -329966 300362 -205004 -96006 -275182 -280746 96276 78585 -270783 -188704 -25934
19142 -48357 -142986 -63501 238303 -214099 -107226 -12869 351431 -355948 -368234 -424910 -352011
19131 -352011 -66852 261900 36502 -243772 -67342 -13877 -273045 -267633 -898 -44914 -416732
19120 -416732 22568 -189059 -92290 45367 -362152 169819 -170964 -241298 -412140 -183383
19109 -269822 -365659 -400847 208985 -96066 108408 -76273 20532 114172 -34909 -265456 61604
19097 169243 -36595 97333 29027 -301912 33876 208051 -208022 -193215 77086 83865 83475
19086 83475 -53654 23908 -59816 -123666 -283182 27274 -1571 -112631 17260 -239480 -7456
19074 44526 -279911 -4682 148194 239110 -131872 -83636 -9473 -241819 -64064 -181909 -101277
19063 -101277 -206556 -35953 -49127 -173940 304550 -30261 42403 -168210 -34305 51221 -329657
19051 53129 -413776 249458 -62119 -44122 -442753 -199347 104269 96529 -61701 -152212 -126198
19040 -126198 448080 -113350 45029 26806 -196575 -143781 -42545 162972 -37497 -285101
19030 -285101 -99886 -104695 199526 49554 31581 32562 411837 295419 79573 -112715 91556
19018 164021 315946 49135 -209960 277748 -124548 138481 -273141 253168 115665 38504
19007 39623 -116313 122609 1271 -10548 -91290 -266605 -282647 -200082 20359 -147261 -16600
18995 12303 -12651 -84311 36011 -216887 46343 324544 -118415 58234 -498431 -244658 -43144
18983 8681 -330844 -6416 -67688 80963 67064 -30253 202176 -89581 84930 -295041 -295530 205444
18970 -160354 172066 -215451 -131723 -77245 62517 -150429 1803 175930 -187730 -329540
18960 -329540 -42702 -113707 -120204 101839 -81272 17606 -2565 6443 72327 -148177 110122
18948 -45950 41917 -149110 -188732 -55582 -481445 -248962 -168030 -20072 96124 151150 289175
18937 289175 -4813 -405258 269411 17992 -114603 -39012 -78171 -170464 -255937 186880 -155138
18925 -162734 -3402 -110472 -60431 -108822 148091 135001 347735 258789 -55694 -159404 16627
18913 -56357 -286209 174559 25810 286452 -51580 347055 186843 136175 314028 -285688
18902 -254943 -20138 -5766 -185789 189355 105078 -54167 45103 65585 -139979 19671 -306117
18890 -184134 -191490 -72611 -16368 -45564 -169825 -120322 -390842 -197974 110200 160844 33558
18878 -168637 159924 320232 222513 44130 469088 -81571 -44584 -154063 2786 -177422 17988
18866 -256490 167381 101886 -114426 -56049 170288 -161956 -197448 -272412 172175 -120314
18855 148952 177352 35490 120743 -81320 42398 162545 124587 90057 145370 -59720 201241
18843 61504 47410 70334 -23226 -184490 -88760 -383409 39546 -149519 -197691 -120224 -192170
18832 -192170 175761 -36278 -26010 -281940 -28046 -154087 -69078 317277 -389309 222416
18821 -27016 113600 -149760 59403 -27002 -137469 40969 228619 -66245 293541 360554 -366667
18809 248771 96665 338970 -56721 25471 -73642 88599 -113065 144657 -316627 -207027
18799 -207027 46343 -199433 -361189 62103 177074 -7947 30376 -91560 -6232 72980 6593
18787 -275159 159633 -252882 168497 -51325 172407 -266800 -121239 194301 130568 -89844
18776 -13938 -131939 33465 -110393 -227670 184234 -41629 182227 -198611 -311224 -283393
18766 -283393 -31413 -38941 -35 364478 -62785 -66360 -44937 -265910 -93579 353433 268960 197843
18754 197843 375965 185405 -218187 99175 -174095 -35253 -164170 -135209 -49634 -182096
18744 -182096 20202 161379 -179246 114357 -77823 -269214 192602 365012 -95799 186987
18733 -141602 4430 43835 35609 97122 -239085 -130252 -416437 -258194 118432 -12089 -115671
18722 -115671 12214 199091 -143614 -242819 -25864 -206630 -53813 -45604 -73012 17270 -24296
18710 119483 -267244 -209931 -309888 -358568 -142871 127703 38244 -173614 -212380 123059
18699 -244330 -252998 -199327 -215668 244678 -121653 -102877 -189225 138753 376025 -325061 -314494
18688 -314494 -226031 -292345 262914 -212688 -350879 -120402 -121589 157987 -142160 -65683
18677 -85488 186754 -9072 57211 -153770 -122410 -190777 100631 -122464 -272656 157590 -312910
18665 -92349 347740 -336099 -34360 210672 8470 -6181 -119491 181506 -262261 8467 -317689
18653 71122 -26346 62235 -249584 -224085 54915 210632 -367487 -92412 -104793 -591501 -399017
18642 -399017 -43855 49987 43371 -164085 -111976 82293 -154153 206529 -122914 63748 -17614
18630 -408725 74870 177059 48071 251342 -175097 3838 -99057 -58756 -273059 177555 -7688
18618 -200031 31696 203342 58234 103705 263207 -23913 135238 145346 -223369 -52738 71878
18606 16024 -170076 312383 259492 205428 46834 -61113 60388 -207323 49566 377135 -192127
18594 -16452 -206287 164069 -255604 -65576 -178298 208801 -104966 -29800 188348 -357557
18583 -186963 -381913 -10435 -60027 -230486 75376 -264184 361559 -121371 -13588 -102149
18573 -102149 -81695 103774 28282 -64009 -208449 -65476 -161089 110919 -315554 6168 -94553
18561 155948 -107439 -45503 169762 -183663 -1710 199113 -202716 -127078 79344 -192367
18550 123464 -85282 -4505 189609 18634 38335 -164039 -231255 -222762 146684 -53268 -48431
18539 -48431 -54261 -40603 -12143 -299441 84879 -18197 -63338 -171161 151736 -8375 -116465
18528 -116465 -94818 95854 241225 1033 -26807 -266378 -42603 46136 237563 -205086 128970
18516 -133883 -110148 52581 -259465 -316938 -168845 -108426 -275938 -280978 -118551 -236122 40943
18504 -212956 -162709 286994 252589 -92382 59952 79297 169674 -25919 147814 -151654 -5807
18492 46946 93095 -144690 196697 -127408 37022 -100296 -78595 198966 -213326 -149989
18482 -149989 -35550 -157446 45721 -230443 -145461 -152892 42195 -239396 24823 -80194 -5702
18470 -122550 -204893 81085 32584 28486 -203322 -268011 -342507 -157305 -343362 207713 3542
18458 222699 -62444 75493 -215547 -64890 -16303 83976 -119665 222142 -181917 -103974 104327
18446 -240056 -2610 42572 -361983 -14378 -177465 285623 112125 165755 -159296 -21004 -208113
18435 -208113 -5621 -421305 272637 155856 279491 -177554 -29020 -29897 60948 -134190 -212764
18424 -212764 161126 212209 -40745 114122 -57274 148888 -124072 -183062 -187076 199055 -134425
18412 5927 132044 24629 23017 -63251 192574 74568 -178188 174641 175520 -108594 -177264
18401 -177264 185012 -375521 -168850 6069 -33639 -216408 174324 -371727 101663 78112
18391 78112 -23748 -139230 -99972 11263 -3464 -51216 -263388 -190664 35748 105530 -141264
18379 -11542 -175483 -343619 82905 -360332 -43278 -184252 -259047 88540 -55816 -263595 47243
18367 253977 226463 -167311 -311927 -162052 -55708 37679 -142901 -39698 -110284 83391 -77078
18355 -71999 -37758 -53056 344661 89557 130129 2826 -29637 144230 -265782 137395 107569
18344 107569 -108922 -317255 -94665 -395676 -60111 54783 -152064 184365 -56959 32067
18333 57688 7456 23041 152402 -26290 -222802 -264496 -185039 -294012 3362 52241 -19250
18321 -207652 -72788 -174044 -201795 -11699 -152513 -107475 -21237 -104348 -229323 231291 101573
18309 -125064 59121 -233852 114694 -40335 156249 -70067 -201929 47201 -48069 -309631
18299 -309631 -155631 162048 -133619 -56648 57766 -16010 -91381 -122319 46446 -19297 -71375
18288 -71375 -135799 36698 -174542 -16665 263165 -57703 51702 102011 -166936 67324 -58581
18276 189672 -245432 117314 66669 52957 -249894 -91536 44167 269586 199122 94080 83885
18265 83885 -295330 180269 50972 135158 281417 61524 -147888 295097 35457 -128552
18254 -34756 82162 -20066 -49904 160364 -83902 -53781 -434404 -250673 48176 -339252 -229063
18243 -229063 -42553 -48529 -166715 -108635 189432 202571 -158309 -165058 -48569 59932 -140041
18231 104921 -71644 -148514 -119961 93466 -68552 -316270 -294082 -336070 -23307 -140993 95803
18219 -154259 371734 -344952 -363404 103770 47500 118136 165454 81614 227871 28086 -115592
18207 -171817 41380 -423005 143669 42549 164529 43109 16653 -249125 293364 -35036
18196 -17983 112743 -270380 270316 -85403 180106 -54650 141083 71557 -268690 81990
18185 6905 -197339 -170970 -193494 184704 -126893 -93447 249030 15137 42780 -251248 14315
18173 41866 34891 109317 -157010 -220084 -200341 -353510 175272 -55111 -51607 244818 66809
18161 -53238 248693 88214 -186276 -53244 -96037 245832 36674 -5361 -137178 -172727 141646
18149 -176416 -513 35201 221508 -275420 -223320 49523 -334214 40207 244369 -116825 133090
18137 -8449 11151 -57966 -349000 -47529 187854 -306618 -88170 -75650 -266251 -191020 192893
18125 -310260 39425 -57685 -81724 -141690 -293595 67383 -30325 -153286 -85552 -123967 -190443
18114 -190443 -92439 129981 -145741 -136953 -26145 -202365 205943 48230 -193382 -209849 403905
18102 -54012 2873 77559 -165896 -208145 -387277 -209699 74253 -387240 83476 -173870 124771
18090 63358 -334703 -270901 64905 266687 126114 93288 55508 235101 47764 -94619 112993
18078 46983 -152626 -12050 153546 -93265 -98533 150168 208086 -40969 92616 -27705 -99567
18067 -99567 113370 9169 -147163 -155180 341969 201650 -76674 -1153 311749 139641 -217575
18055 -260495 -70780 -135221 10415 11428 222863 19233 246247 -187416 -16297 -439666 153619
18043 -267912 -338147 -129779 -170221 156105 251640 -52537 -72144 -9091 -169445 -103149 71158
18031 -411119 -61344 -175887 156424 -72410 201230 -529767 -45782 -168924 31059 25048 127689
18020 127689 -44208 -127268 34757 12400 -21020 -14813 -23922 -80623 -14711 125017 -131145
18008 136011 -231637 -134243 326858 -273153 -320663 -113215 -142830 74071 306673 122039
17997 176123 125158 76206 216532 278949 147621 126634 248759 13233 18423 -28775 -213310
17986 -213310 58283 60773 50843 7291 142622 -75035 -62638 -65084 220567 -116831 -175015 205938
17973 73402 -330424 -98812 23330 -38306 -239712 -240718 36264 12132 492045 -17003 -104569
17962 -104569 4797 -141781 -35659 -81005 36488 -70384 -148807 -150575 -4307 -2178 6540 156274
17950 156274 -95192 109590 212703 155976 29197 -409894 53584 -114861 -92266 -15178 216305
17938 166730 -114042 143624 108257 -110961 -125687 -360088 7622 -213024 180102 -204008
17927 130448 137455 -80803 48325 9132 -69667 -202111 77370 -34619 -268226 -51906 311030
17915 -101701 -189069 157499 -159180 -31331 -349361 -228273 135798 375964 -289240 -216767
17905 -216767 342758 -26574 -124038 99977 218205 -69564 97887 -111693 -97143 -57907 191129
17893 69575 -291878 105647 172154 51595 -158271 -59507 -169187 -173556 27198 -89237 -83107
17882 -83107 169705 56917 -395737 -245323 170428 29915 48576 36530 174930 211815 -449169
17870 -133953 -67057 78555 96448 60851 -278302 -180416 121035 52285 -226104 -88757 -130696
17859 -130696 -1672 138845 108067 68462 -157455 -156560 -77083 12106 -17937 -151725 2118 -162277
17846 -163240 39802 89332 286405 188111 255404 22825 -272138 245951 67113 -66282 55465
17834 38841 -32864 -178890 -86854 -141924 298096 -54371 -74087 -268476 -221057 -185333 -68860
17822 -60503 -427487 38307 81220 151307 -187039 -370493 -175636 89073 321534 -101523
17811 94240 174029 -218355 23602 -40036 -165554 51580 -180663 263880 92856 -471877 39415
17799 -262249 53107 -233415 1049 -445048 22629 -64813 255297 189521 -183506 -14229 152050
17787 295806 33278 152510 -339649 79605 185059 211256 160236 -146060 87452 66630 127778
17776 127778 368902 -490131 -77891 91566 98327 -73386 -60252 233594 -131829 109958 -35236
17764 124664 34207 248115 -140937 34857 35876 300483 15889 -185529 94557 16266 -299603
17752 184091 94535 155788 203835 173447 -35939 238225 189556 -7177 89484 -256916 -60129
17740 -35611 -6806 58345 -20045 -338988 69417 -304760 102988 -67240 -101144 -210107 -113379
17729 -113379 -61371 -239641 -197094 -128014 -124788 -77425 72417 138600 331646 205335 230594
17718 230594 -301888 -15211 -596 -220757 -225041 -49219 6932 106537 443589 -198953 -27457
17706 184256 -8052 -233346 -175760 -324142 36160 120145 114239 -179548 120733 -231176 161039
17694 -349622 229473 131247 446446 93279 209300 66252 89737 157320 144469 -44186 180356
17682 173909 -97513 -107395 21296 233501 146525 20140 78256 98914 10357 -88663 323881
17670 -1129 103697 -133929 -11937 33694 -115853 104564 12310 -81613 76923 78325 -93183
17658 -315783 -98685 129689 117084 -29918 -270208 -146731 13284 90120 -276157 -35965 -106381
17647 -106381 70658 232428 -167063 412756 85862 -77766 -243731 199349 -49753 -104092
17637 -104092 -309167 45772 -98461 -46193 -46926 312529 -302810 -25819 -34792 -85027 105801
17625 55465 -58823 -221368 -83304 129537 -127917 18554 267850 276659 -26398 -134803 -11789
17613 164279 -71285 104111 -42684 275521 -247503 395937 -217254 136853 129450 315332
17603 315332 117797 213026 -38462 -201170 294495 -16529 148120 -22190 62221 -6644 -146447
17592 -146447 -248475 144426 23643 329912 17681 -179255 -345931 41677 292755 -91 -118366
17581 -118366 -219227 6194 -8690 -100652 95983 292323 129961 142544 -71637 -81513 57490
17569 180695 246868 298946 88098 179001 -56083 -28062 -24785 -271775 41828 -35765 335318
17557 47240 150177 71610 151626 -11149 -25948 -147 24240 -239326 140268 123508 -94774
17545 84563 242616 -11784 32516 -126350 107008 238915 -406334 -109170 9175 137361
17535 137361 28461 318056 37417 108401 109448 167295 88376 22655 -61830 311095 266181
17524 266181 106036 56127 134690 126674 42945 -45492 -23798 -131235 92684 213252 169295
17513 169295 225726 -44165 12231 40048 202427 -29605 489 -60751 -180991 152772 150737
17502 150737 158010 -91361 22638 168672 -114589 -96598 -162952 434419 235214 278704 63169
17490 -63640 -36064 -13944 211098 -121029 497416 496451 52706 276533 122299 -132486 367323
17478 102607 131740 -203977 22475 208623 359955 348336 527160 -5180 133059 123843 -24736
17466 118347 341222 259210 179478 -137832 237841 -28032 -72960 97724 337970 -223322
17455 67443 286691 -158712 333471 100920 97703 223157 367110 -77999 280878 1359 196045
17444 196045 157808 40482 382074 162410 114750 345486 252919 -46010 69554 237720 405086
17433 405086 318285 340882 -32088 558013 -137911 213282 470018 173750 398109 512777
17423 512777 272204 177967 579305 173263 366598 435105 183079 82003 15910 136575
17413 136575 40669 -42373 54021 455227 215613 537615 380341 197636 409851 136823
17402 96519 60937 265703 -348092 504611 231427 -19861 339462 3491 240756 205047 196572
17391 196572 234343 234813 39909 289235 63588 74445 84522 121164 90270 127809 -71072 112077
17378 -32682 322672 188288 175014 334860 -127240 -226523 424643 127387 81031 191269
17368 191269 204370 213471 246278 -30330 456833 199353 172931 108908 -315933 -24739 37821
17356 172986 406493 274479 -46191 -221945 235086 167801 30799 270055 393412 99909
17345 183939 -153455 198495 548704 171048 114884 -106320 304687 50849 180482 107018
17335 107018 -35031 261519 132913 -90874 102794 35983 234388 -171500 125865 -174432
17324 135066 -187878 101030 -178399 13106 296421 245802 364518 316703 329863 304005
17314 304005 60678 86362 -128435 130894 45631 281918 -129568 185961 -21363 81155
17303 96464 67735 189364 97475 243697 139505 256085 183282 389508 233382 340094
17293 340094 -20296 128248 -12323 54047 192079 58252 39946 106956 164919 157564 24217
17281 287215 178765 216532 25745 -58366 285480 98072 189661 240258 119766 33818 86485
17270 86485 184028 65474 -88149 133335 132527 144859 369807 144116 -136446 36359 251486
17259 251486 312816 335498 608922 32173 176538 192701 112210 84364 106194 150490 266175
17248 266175 117823 501788 99281 -162337 139813 264889 41167 156625 130828 340400
17238 340400 419657 230066 35833 338265 121570 299944 205723 82586 94339 -15376 49435
17226 378557 96185 -207543 99050 108256 -169681 129920 126830 213192 17997 142961 9665
17214 141090 363582 -12902 177780 52828 177937 -29868 49079 416210 177479 87261
17203 -14364 232451 506022 271542 228079 273432 123839 6086 377617 249566 77240 33052
17191 79871 406430 266465 202872 209724 -97377 404352 45299 226479 18213 396780 494027
17180 494027 447235 19634 283293 64329 249177 327621 94602 469714 333918 478273
17170 478273 70653 587678 304616 -120692 171731 49215 102515 365754 112003 156299
17160 156299 428731 292506 362106 470159 429091 392740 219202 434963 477707 726559
17150 726559 182118 260821 93486 544369 372730 -5175 347331 460119 81160 572019
17140 572019 429395 271236 480958 217764 343810 160449 53250 410819 543564 555894
17130 555894 392781 338350 452018 454471 328002 443639 601240 505739 184420 195105
17120 195105 172757 248159 236118 151145 488008 287283 185636 389072 504777 222697
17109 453698 600509 347996 341779 459860 391535 432527 600851 233920 527635 373059
17099 373059 225141 443381 210682 261662 103690 170711 237727 417805 282482 363844
17089 363844 245667 237116 569750 271720 347737 317141 28493 265004 175766 556632 179973
17077 429769 375874 656556 511994 381405 402929 150724 336524 654086 593501 561037
17067 561037 453162 187272 261808 423785 228883 467887 385366 292778 394950 223919
17057 223919 544269 331132 559683 349322 471719 385527 208245 496279 495862 369258
17047 369258 387214 219766 638756 616344 187092 651656 393429 536321 483006 349004
17037 349004 590929 411044 507551 511770 274611 573874 202131 153339 794024 344270
17026 677826 542550 554359 360269 630065 590170 670610 568262 562242 354958 719059
17016 719059 782367 721601 648047 585431 526186 690415 488706 722236 873415 583148
17006 583148 662863 445056 429553 722506 975052 777625 836937 637098 374985 446766
16996 446766 813502 765721 966092 1009630 314894 663632 673721 942255 1080954 882497
16986 882497 229920 636270 783986 644794 705598 431537 538894 923045 1040873 975273
16976 975273 745696 913772 901018 784104 949716 900975 860785 731264 926241 1088957
16966 1088957 886178 726692 1075852 645551 887037 630333 843473 779394 1080867 1004837
16956 1004837 1122536 892789 628543 925839 1254923 720486 971079 953187 1113830 1092753
16946 1092753 841936 874787 898304 994965 1016897 920762 978409 872999 1299034 1284279 1202052
16935 1202052 992944 814771 1338867 1043228 913630 1347201 1520662 1250171 1130772
16926 1130772 1199053 833978 1036746 1419848 1330725 1591123 1596103 1125510 977757 1227314
16916 1227314 1264673 1350152 1458444 1167601 1310780 1374348 1081856 1605332 1473150 1477730
16906 1477730 1414669 1475356 1682568 2064233 1626863 1308591 1521540 1442466 1638123 1327821
16896 1327821 1418641 1805450 1700451 1796566 1597194 1663495 1929993 1939962 2050878 1779133
16886 1779133 1698151 1784757 1788259 1863295 1958274 1881890 1750979 2103857 1980800 2397362 2094272
16875 2094272 2034421 2233671 2107428 2097168 2242310 2227173 2219248 2300597 2454994 2319245
16865 2319245 2252302 2390418 2375760 2163898 2809031 2498459 2639965 2509466 2435984 2710385
16855 2710385 2732439 2885706 2794712 2863846 2689923 3240567 3101476 3073531 3352565 3264659
16845 3264659 3204860 3194461 3262488 3136324 3259305 3363814 3543822 3295943 3827418 3527335
16835 3527335 3919358 4178303 3777495 3886399 4470019 3871607 4184818 4415043 4184396
16826 4184396 4443805 4445361 4866638 4525389 4829990 4854291 4820135 4979552 5371148 5305530
16816 5305530 5369529 5375720 5580148 5176642 5742590 6028878 5816347 6190083 6367751 6367811 6495050
16805 6495050 6652874 6998802 6825102 7249872 7372453 7319068 7952746 7633258 7892062 8178490
16795 8178490 8058848 8405947 8608511 9099158 9492524 9700475 9648010 9925584 10107311 10500043
16785 10500043 11046420 11223098 11610934 11754322 12147738 12449456 12870977 13285099 13386623
16776 13386623 13890263 14394289 15066778 15297905 16106680 16925920 17048939 17955158 18382029
16767 18382029 19083998 19667168 20446973 21703115 21980221 22943702 23784544 24950937 25755416
16758 25755416 26804804 28084171 29424793 30594942 32019709 33575082 34903684 36524212
16750 36524212 38450324 40310940 42554499 44601955 47150185 49524158 52161913 54853612
16742 54853612 58064090 61700919 65082845 68781381 72824824 77224721 81831437 87143791
16734 87143791 92567976 98021822 104551930 110715841 117451744 124228846 131465913 138589835
16726 138589835 145772519 152826400 159899941 166351166 172287806 177764948 181661104 184777007
16718 184777007 186448029 187037907 186253059 184383679 181091948 176939435 171879528 165617919
16710 165617919 158992167 152143782 144986458 137308503 130693229 122945045 116178564 109362163
16702 109362163 102958347 96806777 91053315 85630331 80581170 75400545 71430183 67589194
16694 67589194 63354974 59970379 56652273 53432529 50410735 47881835 45069013 43112249
16686 43112249 40819349 38687693 36928287 35176154 33539657 32043202 30290115 28914388
16678 28914388 28012298 26394452 25476811 24439788 23529572 22193225 21364789 20507379 19553977
16669 19553977 19379983 18301331 17693883 17248631 16125807 15619656 15402116 14975223 14274473
16660 14274473 13987173 13154393 12569385 12597261 12348394 11783957 11789783 10995985 10654584 10480102
16650 10480102 10320619 10156606 9450091 9241202 8796657 8841141 8859735 8617978 7765165 7820945
16640 7820945 7464263 7382148 7127917 7228816 7077722 7041419 6488983 6351974 6247584 6175928
16630 6175928 5891297 5830066 5604115 5495031 5408154 5467579 5411552 4960360 4910979 4706436
16620 4706436 4809177 4812991 4467430 4555044 4749644 3937559 4307332 4154521 4144775 3987722
16610 3987722 3821501 4084565 3734564 3673791 3445514 3418125 3381578 3386511 3508559 3360875
16600 3360875 3556340 3267658 3278205 2788461 2801244 2793388 2868454 3179065 2870705 3056569
16590 3056569 2882259 2702911 2873645 2437335 2604956 2553688 2221450 2416795 2504731 2413046
16580 2413046 2505061 2352379 2327429 2356776 2640815 2296996 2011542 2166135 2251222 2073786
16570 2073786 2050065 1961927 1956252 1691059 1919276 1861499 2207539 1660959 1979707 1761815
16560 1761815 1662957 1392584 1577053 1821456 1588511 1365055 1800193 1514058 1890203 1640955
16550 1640955 1479693 1809060 1376318 1547590 1827573 1635660 1707251 1421737 1222400 1665386
16540 1665386 1507199 1436607 1511831 1311240 1326251 1315057 1281919 1290763 1024634 987057 1420102
16529 1420102 1185844 1625917 1195574 1124499 710398 1009910 1152549 969303 924872 1107822
16519 1107822 1166117 1393432 933669 840532 993209 1284021 1198988 871276 835575 1120769
16509 1120769 749676 806644 1101893 806902 835394 634252 949998 882967 968587 790346
16499 790346 772290 761275 936757 1090037 713313 939967 825413 874506 844166 778766
16489 778766 937830 605738 694306 955738 671134 617343 896811 796508 644445 868668
16479 868668 660761 598432 828884 755585 480469 884838 570818 662472 647413 622213
16469 622213 457276 453371 431301 890842 589124 510467 724856 419379 670606 331703
16458 854146 637543 647456 387504 543217 736583 664312 548816 650067 575735 597337
16448 597337 607581 471461 384362 588490 401779 743892 622746 692914 544690 669168
16438 669168 226111 658577 633725 596423 194985 423945 477541 726556 559998 372246
16428 372246 561037 523410 513436 374194 434781 425809 495611 542347 171037 363972 108789
16416 342443 457929 451366 360881 466167 854813 419622 132140 329886 615948 511562
16406 511562 325214 277053 98083 409762 604547 400949 122795 134936 107634 283490
16396 283490 376012 331600 434653 154577 205664 317834 465634 620281 214714 -5643
16385 373267 649841 48099 299174 474694 405005 623304 380872 273701 306568 244319
16375 244319 352261 349593 -57387 247213 522481 314879 391936 478778 196068 343047
16365 343047 558635 246006 -24952 84981 444972 195842 354466 148548 510629 244367
16354 251336 70513 185479 169935 450559 217069 598892 265528 243642 121378 522313
16344 522313 30777 413972 194063 262746 53239 292283 405941 346816 190042 125094
16334 125094 254171 292705 369326 296903 407037 354427 199216 272196 339565 28853 672013
16323 672013 138733 76401 179136 178306 262223 424750 51116 220730 533045 -54843 16656
16311 409835 245302 -311408 302203 300914 -125989 105343 206793 279140 -324285 105175
16300 -74286 128209 -45647 134815 499262 392359 24573 121514 32114 220908 132914 311637
16289 311637 115966 162961 100243 358917 228034 -195660 285172 38477 129888 215052
16279 215052 -207313 184487 74108 170897 97165 132710 218317 -65438 233567 273268 92980
16267 239612 361495 132018 241820 -126466 45449 51016 183225 316898 -141341 362817
16256 76772 57452 -47489 185424 360627 11692 65528 240037 151076 241491 -42843 -14147
16244 36853 -220418 93581 532511 40056 65307 133769 -43668 72264 341559 -36234 -184515
16233 -184515 189090 326459 62029 7708 272032 279551 204139 242483 82286 149363 -38434
16221 327375 267872 -44963 152030 11507 318921 98559 271498 56041 103834 371047 23961
16209 163677 -793 3350 -79604 78039 -167 112647 361865 142552 13428 17069 131455 323493
16197 323493 197956 -327255 -181280 135024 5756 -198418 354122 237932 293362 -284063
16186 47200 309834 347546 320711 145293 174359 102078 191051 56114 -66663 62477 362948
16175 362948 -74512 87152 30466 -1060 118881 111042 -221444 351904 261012 -240432 3507
16163 -205815 -46467 -170111 21750 58245 -62096 -96761 51869 -81841 251194 -111999 242458
16151 -31199 87151 97821 11492 -47008 -326469 465855 359732 151241 -126067 87522 -38786
16139 154322 204596 53655 -37765 67505 258112 -257470 352233 183316 62367 158550 176319
16128 176319 393021 -8909 -502552 -119837 134598 -153436 -29836 -39265 291712 -61427 58853
16116 323750 184559 -241721 61906 -43848 201270 2703 90656 242610 -430918 13678 -19716
16104 55048 -153622 89280 139958 315435 -315862 216782 180177 -30573 147661 36631 53203
16093 53203 144239 156480 347474 -97282 209075 -171807 -134421 180402 175526 -86593 128559
16081 -411151 494626 27542 97607 -187157 107071 -9482 -9438 -203579 -474184 285808 291559
16070 291559 -296624 115937 175462 167952 -35215 49714 158917 84716 -214580 -21879 -121275
16059 -121275 37731 107289 354362 -60771 -170305 89163 -22309 30885 -188138 -304192 -204407
16048 -204407 -260238 -163223 6534 -251643 -80280 -306093 -273900 215600 -142895 -88929 269845
16036 -305179 64298 132285 -30592 165786 -105499 117609 -28628 82380 101325 -93066 242054
16024 -125939 78826 -281700 99339 43303 -26888 92500 -21212 -208573 176149 102568 14263
16012 1584 231887 -86340 55171 259261 -176574 -277490 -443953 131009 -180680 54607
16001 -247350 49962 -532034 -45872 43334 180420 22913 173037 -81298 205608 91033 108158
15990 108158 -36535 299544 237549 -114269 60645 76318 60705 -36362 414079 206353 -72518
15978 160140 -147027 60957 -259839 -153205 -17928 -88601 187514 120178 -54521 78715 87801
15967 87801 -19638 263189 157993 -100981 -124597 135898 74318 -125391 92962 28834 142962
15956 142962 13679 -126291 159401 257027 -192596 -174808 -200029 68037 116439 -269677 161046
15944 -73432 374352 -45825 -95301 233442 -27110 197100 -57807 -158978 46529 71911 -102167
15932 -53998 -140172 48221 4917 43848 -80285 -72571 140598 -82187 -288796 -86326 -396020
15921 -396020 -128717 62290 22624 -211765 -323847 -248587 105709 -119396 -31369 -131139
15911 -131139 34261 -163909 -13686 -27232 111330 -266273 144575 90957 -34862 146338
15900 -95566 41458 3522 -4360 93000 -264489 -526759 -228617 220063 -44916 129385 109399
15889 109399 69416 -3843 41539 -36130 -24811 205025 -160008 -289349 161130 -30292 213833
15877 57401 262601 -28210 -198648 32121 452058 5020 -25074 -186520 8365 2941 170298
15866 170298 -249914 81229 -306537 137105 286533 -265152 -204552 61417 -189219 -64590
15855 226777 99953 -86416 -87096 -56384 158551 44509 -2649 126410 -30257 -97252 28973 -420709
15842 -122724 402669 -180872 -243590 322858 -25555 -328318 93670 378909 -198339 -36300
15831 160305 -73089 -231366 93507 -220118 196679 183 198781 29356 -216376 -141429 74557
15819 251922 -43492 72157 124005 135412 68737 164986 141893 169928 -38297 165119 -158261
15807 -99899 -307766 150399 67338 59456 -149307 47629 104264 -198334 -3287 -84188 -128321
15796 -128321 -100965 -28941 71554 92223 -181649 -185966 90364 106727 108446 -13340 32844 -160577
15783 -325959 85989 -313162 79421 -118252 209248 -76332 -55771 28049 -29388 40607 -153352
15771 -124056 -485752 -39276 -127931 -117736 339568 -175375 701 -52832 -185046 -289460 216291
15759 -71292 -65493 65485 -108596 52958 137926 -39486 16085 50282 -195307 126993 -20953
15747 9974 9344 -728 -213149 381721 130484 -295733 -137440 -222200 -168379 -295841 230497
15735 207954 -71052 -128127 -243130 144558 216783 -5495 -6311 305497 90166 -134400 -54386
15723 24990 -92898 -22543 -127330 -146742 -359043 512594 -317597 -80791 -120063 -102991 -71639
15712 -71639 122267 -285781 204165 -94027 -415767 -127809 124756 -167844 -139145 -301575
15702 -301575 324237 -90723 -196361 -29192 98000 30038 -148792 9002 -169849 165254 -212505
15690 -6896 85001 228141 204171 196489 -385769 60762 -198291 -52738 404090 187030 3454
15678 -281648 -126234 41199 157563 -184261 221365 68222 133472 172471 326030 -115229
15667 -128875 -57574 151668 93371 -54865 -245030 -186471 265804 1680 -215395 -15193 -31685
15656 -31685 -317396 39614 112863 186174 -368072 -191119 62087 134295 -99361 75961 52868
15645 52868 155056 41827 -233019 -173642 4132 55848 114617 -100690 78203 295762 98377
15633 -119183 -69472 142179 186349 -4290 -299518 207190 285840 -35081 219809 164158 -470992
15621 -28641 -207965 -72170 105260 61725 -150438 73222 -153448 -180006 66645 -60163 34094
15609 175497 87295 89642 -319009 -188515 12830 -127499 -50309 -60076 -72598 -186325 -181219
15598 -181219 32816 -20149 8334 -254017 135984 -22996 1325 -407227 281969 -87581 -141436
15587 -141436 276029 24761 -4604 -146191 118761 247151 106012 -16309 -10754 -31609 -41461
15576 -41461 58964 -211344 98896 112583 160790 -3728 59596 66928 -12003 29317 289960 -92746
15563 309685 -265032 114946 339752 21656 -62287 -179109 121083 19987 -118453 -317781
15553 -317781 12048 -19364 -156686 -448341 -110102 -115642 -120674 -77092 -106981 69455 -139572
15541 169078 102432 11167 -289733 21214 -129605 127998 174798 66030 -134062 83417 190633
15530 190633 -114630 -26539 -130304 215391 -53473 -33248 118111 -370510 258423 -338456
15519 -110391 148467 -147001 -225641 -227587 -119452 54380 184638 36917 -120172 125182
15508 -219772 -219347 106277 -175394 -111073 -61682 -217931 -70107 -56982 -65017 -430299 10749
15496 -105037 209446 106173 -213972 -208823 -168728 108928 220551 -181438 -787 173174 -310364
15484 220439 -106740 122765 5315 -340783 242606 270579 241314 -408905 -138380 50516
15473 261498 19402 -119269 -70138 67986 -98881 -9917 170907 84470 55184 362146 -194885
15461 -431747 268183 -214222 -257804 116822 -249437 -73890 162255 -12535 166278 -116856
15450 -62993 53802 280800 -48032 214555 -63541 284251 76232 -161287 99167 -138494 174617
15438 -63112 -97353 -45407 -128272 24250 24399 21251 -15597 -195739 -136838 118901 -196110 -264985
15426 -264985 -254048 116074 97933 -17571 -74982 60009 -240771 -21127 212820 86965 -201784
15414 181518 276100 102414 -365123 -57297 195698 -69825 -126563 231492 -41490 -299394
15404 -299394 -8661 -403432 101688 -57301 111343 138306 -300872 131881 -119517 -213933
15394 -213933 -68145 22361 189713 144064 -47550 143827 -157652 231384 -235072 229095
15383 -157766 267370 188260 73810 -81595 58117 26515 -151180 -45438 238878 -231123 -172577
15372 -172577 129274 9675 135476 239000 -100950 -10293 73220 -127421 17132 126342
15362 126342 -39765 -106170 19229 32945 110474 -268635 -107253 129960 -42160 -168219 12831
15350 176750 -108089 18137 138589 172638 49618 -186849 -149257 -185497 132393 -106696
15339 151797 -151364 -6958 455863 10943 40976 2186 11700 -203228 63075 30663 205647
15328 205647 -63131 243861 -22712 -289876 31745 95618 121962 -6068 16201 84368 164507
15317 164507 149073 -4591 132044 -78891 -137961 60755 -90935 191085 190081 -216191 -28897
15305 250585 477316 74985 -70156 150359 -48174 50012 -171231 84273 90047 174752 -18831
15293 155116 -172871 301286 89896 2493 -253558 -39078 -113953 186149 -154614 202331
15282 -70254 3434 -39528 -63785 207593 -235504 133086 135771 22372 81180 -32434 294598
15270 -25724 80579 -128494 260477 128244 251651 18338 -474571 -208704 -340080 94129
15259 53796 107547 169308 128365 54307 4023 266984 28196 334604 -47235 469726 727650
15248 727650 1425456 1307816 1504344 1703925 923633 266050 469797 21225 -148340 11681
15237 -87649 279702 3836 82865 -56617 155279 316190 108778 53035 49087 123538 -247571
15225 -169493 -113940 80271 -70591 -9956 108153 356117 47901 -40000 307763 52196 -162878
15213 218390 -25951 13206 327899 146981 15548 -44238 -215293 -144674 27154 149977 14882
15201 97865 39761 -29696 12976 6424 239776 -260314 143383 -104645 274483 -51429 -5707
15189 207222 -17219 186986 -83005 241536 239892 171145 163014 53920 88523 -236565 147374
15177 -2135 44360 64168 215800 -152252 -190447 -117513 313742 276336 217921 -169720 -90995
15166 -90995 206561 235361 -64263 -127606 -267627 150075 203503 140627 253402 -197581 33658
15154 190361 96602 249750 -37475 159387 12247 -7180 150336 191951 -272597 295009 94515
15142 -104662 80256 50377 -84093 174237 565404 -211528 121439 -185056 -5602 511944
15131 246881 -38785 154632 -207773 109825 -90925 135544 170410 101311 390349 121901
15120 49834 77723 177491 84185 67491 212145 -131408 214414 79399 209012 -33099 199091
15108 -222650 115533 303355 98826 256734 -48023 36088 -144737 -239223 262579 289431
15098 289431 125001 106789 179067 212219 -25072 214165 143412 453881 216048 -43525 254140
15086 290941 74132 -339033 139470 270691 396118 46743 94781 364378 65384 531427
15076 531427 -126975 261204 -159435 34139 437269 -204903 -43239 113453 5210 95648
15066 95648 361019 177169 12237 311426 100032 282299 174406 45714 -23739 203874
15055 91295 224261 -73938 64673 173264 -9264 -115234 167778 407412 -41796 32710 -160621
15043 -60098 -75977 129033 126110 212549 454613 -83009 -63719 332548 197500 450674 -116389
15031 369305 -149273 407808 57652 122569 81356 -228233 249475 181684 -267640 182873
15020 366423 554802 291532 254404 220632 179573 413358 174528 259980 -36658 -142790
15010 -142790 -56562 79199 359998 74872 110458 223043 529957 289711 -38129 311818
14999 118360 86116 286461 488940 257844 -191712 250465 -76881 390737 295418 258219
14989 258219 191665 86845 208974 36743 342582 317155 -91056 27078 229386 113223 168732
14978 168732 116455 221590 149781 209008 229439 130004 224168 215795 98836 384202 555186
14967 555186 224202 372689 106239 307279 174628 219154 327945 509166 554005 228010
14956 368677 621143 -141847 357846 301626 222579 356605 273806 347834 321219 46457 27169
14945 27169 275105 447785 58602 381330 217741 181313 358066 143147 301661 288137
14935 288137 68298 26096 121535 346798 1725 62713 207734 153033 -48022 243801 479061
14924 479061 210184 176412 213811 574379 334373 349300 -62237 373590 398975 -4982 459873
14912 486817 273248 287727 180590 95752 241782 254017 448673 632220 492231 383477
14902 383477 251079 89162 34504 307589 247611 456169 385398 503814 171629 18087
14891 218342 538485 224950 285283 391291 -34848 521439 285531 446634 604017 465023
14881 465023 376767 375061 461314 484044 330002 490327 349013 83264 254316 143892 224634
14870 224634 93269 231517 726510 220136 349490 489198 284175 229325 471069 175990
14859 480531 390130 841315 459755 445506 -49234 580109 346126 160424 355829 451433
14849 451433 481750 610139 366292 384346 405115 198340 182654 188650 515155 539197 257782
14837 456034 103902 336000 665123 448864 418972 534256 134184 558260 48796 90043
14827 90043 213148 624336 403138 599164 213340 512357 586722 363998 547946 554929
14817 554929 129229 630476 661281 803872 58031 680555 299866 526857 347831 684193
14807 684193 756449 274406 483320 697171 242674 685741 765612 545755 456305 421971
14797 421971 599299 491688 552371 345292 771348 631183 637854 187333 822469 429176
14787 429176 581928 523541 557953 258163 776394 204830 735618 556558 256021 336017
14777 336017 550944 742522 407578 279304 991225 591479 299760 605165 579330 589015
14767 589015 632364 794476 924735 582515 684789 701320 649221 483003 475667 853341
14757 853341 963166 553569 701683 736745 776234 387818 437950 655079 1043329 734689
14747 734689 417340 829868 706773 677242 700693 607637 887712 985356 607523 695287
14737 695287 763415 552621 490061 725296 895574 759991 730204 559839 522168 712277
14727 712277 764113 513334 821014 692686 689462 677571 817175 685033 485783 758010
14717 758010 736273 906340 354266 786390 713358 585690 809023 694990 707106 439271
14707 439271 919282 972731 948117 932420 1023024 945756 816052 1137329 990999 869704
14697 869704 965971 640859 933123 736262 1265154 830678 690333 865186 955425 1035986
14687 1035986 733338 478444 760467 884395 1003189 1011608 943563 685899 927704 630225
14677 630225 843280 1261439 923711 745653 854081 1205175 1095984 745209 645643 775292
14667 775292 977240 961597 1051634 966007 1072919 658155 1007942 1160623 1072723 615815
14657 615815 1270340 1359609 998935 867704 1035123 840652 1096261 1143199 1413733 1183848
14647 1183848 1020668 821780 1132530 948859 1155764 1062617 1146847 1413442 1103928 1197349
14637 1197349 1090190 1180998 1206029 1126934 1265428 1278030 1143293 1184312 1117213 1163860 1294885
14626 1294885 1606684 1156198 1602654 1043080 1202885 1062876 1438640 979669 1590509
14617 1590509 1238180 1799594 1511305 1566401 1089979 1206178 1272727 1538056 1526730 1430357
14607 1430357 1284691 1714798 1560227 1535739 1793659 1811806 1353468 1513505 1241406 1597754
14597 1597754 1629439 1665599 1822528 1813567 1495624 1672526 1313304 1655477 1552989 1711506
14587 1711506 1757370 1760127 2072004 1848175 2019370 1551003 1872362 1902476 1837445 1744223
14577 1744223 2163450 2066615 1952302 1982229 2066037 2262542 2458062 1992537 2445716 2168174
14567 2168174 1977947 2079411 2377881 2500878 2569924 2191874 2365272 2461233 2735959 2604987
14557 2604987 2546605 3021991 3067370 3328876 4018165 3809494 4394450 5647072 7056096
14548 7056096 11684039 21120992 37046360 40153636 22446796 11149208 5582669 3386374
14540 3386374 2661906 1836563 1733537 1787240 2090609 2162331 1981864 2179074 1793119 2078163
14530 2078163 2097298 2248358 2340767 2137248 2333193 2382063 2415204 2441181 2074163 2500927
14520 2500927 2569183 2542826 2466007 2627495 2597854 2558458 2236807 2634959 2704067 2811126
14510 2811126 2605284 2563599 2770478 2726654 2822434 2749669 2881069 2867183 2743410 3093444
14500 3093444 3011218 3094276 3138431 3110036 3344700 3289012 3520181 3078306 3172126 3403981
14490 3403981 3084612 3047842 3383367 3544466 3620116 3375064 3447761 3679491 3747375 3703857
14480 3703857 3486525 3993426 3919031 3715731 3726539 3760286 3734868 3774266 3871103 3925050 3821062
14469 3821062 3670032 4015995 4242903 4377977 4092841 4391943 4408242 4575752 4673771 4390115
14459 4390115 5030061 4913847 4978641 4784541 5179361 5068742 5095358 4878686 5051140 5321009
14449 5321009 5089144 5258529 5331229 5523240 5378066 5755173 5747222 5828899 5693364 5999732
14439 5999732 5852761 5916643 5743281 6155678 6330880 6388823 6367244 6505061 6610435 7062341
14429 7062341 6368226 6533439 6895532 6904786 7207460 6769798 7028240 7203544 6834197 7618519
14419 7618519 7776657 7696968 8025428 8243633 8162733 8178788 8072418 8401406 8460827 8863513
14409 8863513 8989225 9137231 8981038 9425486 9621599 9527570 9876090 9855201 10204804 10350555
14399 10350555 10367852 10691960 10632954 11042957 11012310 11219448 11128472 11891289 11905271 12033859
14389 12033859 12365570 12254122 12353125 12825699 12977747 13017929 13464302 13692974 14073453 14249610
14379 14249610 14684661 15010132 14934202 15244134 15694101 15921597 16199227 16462188 16709278
14370 16709278 17272753 17526301 18192227 18665131 18678508 19077184 19720002 19822210 20527072
14361 20527072 20810146 21358108 21757450 22080488 23082133 23434486 23960997 24481147 24966923
14352 24966923 25895940 26181133 26688115 27208682 27827062 28492289 29413839 30375956 31094263
14343 31094263 31601020 32571363 33840260 34200872 35282673 36688166 37433126 38362398 39641947
14334 39641947 40621021 41728976 43830564 44728686 46017467 47281642 49017508 50501976
14326 50501976 52114669 53756300 55736517 57477622 59695449 61569839 63914112 66049963
14318 66049963 68614597 71172824 73591305 76623079 79443925 82505423 86246846 89550390
14310 89550390 93220663 97263617 101328749 105875663 110536380 115511872 120711977 126089065
14302 126089065 132089626 138314107 145015713 151801191 159500747 167091244 175915220 184661742
14294 184661742 194116585 203642066 214542106 225392656 236763599 249024018 261887805
14287 261887805 274815133 288366359 302550778 316959298 331251089 345872341 360391630
14280 360391630 374635949 388239371 400968028 412501745 423050135 432077941 438331122
14273 438331122 442567761 442033762 438441042 436855095 433924144 428548068 424876981 418340623
14265 418340623 409394033 398361052 386410483 373239059 359221892 344582922 329611925
14258 329611925 314328479 299691128 285259954 271417519 259116767 246298098 234272955
14251 234272955 222517435 211274306 200792593 190868234 181407652 172542500 164529670
14244 164529670 156965679 149441646 142334703 135738742 129392284 123617658 118585240 113507019
14236 113507019 108571847 103590611 99464917 95530506 91546593 88379650 84627060 81199411
14228 81199411 78323468 74964891 72127363 69438277 67134124 64361145 62585470 60517409
14220 60517409 58339724 56119210 54214324 52618066 50754502 49162369 47796910 46140549
14212 46140549 45192401 43748778 42327130 40985354 39840578 39309757 38243337 36587421
14204 36587421 35456349 34653663 33697832 33136572 32437223 31545177 30600561 29610196 29268026
14195 29268026 28635262 27512240 27215420 26689958 25722765 24700476 24359299 23648803 22876715
14186 22876715 22920138 22069689 21691716 21274025 20924270 20251439 19862980 19429449 18775205
14177 18775205 18594044 18063833 17844791 17754892 17479392 16910315 16491240 16351369 16046702
14168 16046702 15627193 15416413 14809375 14606210 14487115 14240917 13998489 13789596 13380347
14159 13380347 13315019 13287582 12686624 12694582 12350778 12459885 11628396 11401753 11535207 11276776
14149 11276776 11244650 11101048 10891885 10725790 10703233 10454023 10046327 10111270 9820106 9784990
14139 9784990 9421462 9591494 8909715 8980705 9016873 8925890 8878941 8687140 8668584 8251066
14129 8251066 8186299 8271104 8053582 7800287 7827546 7697959 7419360 7496177 7522954 7462137
14119 7462137 7130071 7200100 6774982 6904516 6845012 7014062 6692352 6429825 6454838 6297617
14109 6297617 6446864 6362746 6120233 6111360 6289625 6048417 5875112 5830688 5932776 5651841
14099 5651841 5835717 5751678 5434616 5452157 5408477 4984953 5081646 5240392 4981390 5448555
14089 5448555 5065655 5333278 4993198 5176738 4949742 4782246 4597138 4558756 4267787 4637516
14079 4637516 4784365 4338504 4636702 4521057 4241496 4581948 4410730 4106340 4238580
14070 4238580 4139370 4150161 4199533 3955048 4433772 3797698 3808255 3522372 3768020 3826730
14060 3826730 3765418 3623542 3995609 3840172 3695629 3699519 3733672 3534767 3696301 3454613
14050 3454613 3486590 3196719 3402355 3214711 3424383 3338489 2999659 3063314 3216510 2868381
14040 2868381 2941559 3150150 3339939 2889867 2973757 2647616 2966159 2812047 2695229 2836833
14030 2836833 2655194 2931151 2854833 2692949 2532442 2747014 2610276 2639579 2658421 2456628
14020 2456628 2576771 2503561 2021034 2358824 2332431 2478652 2533495 2525826 2159946 1953406
14010 1953406 2455256 2016107 2044780 2171773 2166798 2197886 1720163 2061668 1860745 1745031
14000 1745031 2068870 2203918 1901385 2079760 1784010 2049376 1876256 1856423 2514769 2107171
13990 2107171 2349033 3244427 6193633 14363518 30374016 40912369 25025157 13815411
13982 13815411 8521953 6035475 4774092 3821772 3220635 2773661 3030802 2705294 2938207
13973 2938207 2710430 2862067 2637288 2440134 2333869 2236011 2154283 2136714 2075471 2277531
13963 2277531 2420258 1952554 1901210 2001675 2024626 1825645 2018589 1944635 1822863 1809811
13953 1809811 1763641 1996736 1974132 1688189 1929027 2072414 1794923 1587416 1878751 1716365
13943 1716365 2020606 1694776 1970349 1620931 1814868 1407511 1577198 1680095 1556991
13934 1556991 1754657 1631498 1832859 1593100 1777803 1516586 1393235 1212178 1550889
13925 1550889 1422433 1542159 1452143 1407107 1394515 1224007 1395101 1394988 1395672 1553812 1606878
13914 1606878 1358577 1465202 1168173 1400717 1684041 1277794 1534304 1698185 1607925 1407232
13904 1407232 1185411 1521235 1175388 1073003 1608150 1597581 1438291 1289247 1047265 878175
13894 878175 1181467 1288144 1269708 1171497 1232410 1256711 1144582 1393425 1232514 1195062
13884 1195062 927124 1175995 1206117 1044085 995559 1256354 1171368 1198018 1311433 1296149
13874 1296149 1082755 1081871 1264611 1187522 680209 1075475 730601 1188580 1156582 969519
13864 969519 1024542 913275 1036830 1043853 991127 936788 1085727 1069871 1251739 574022 1115293
13853 1115293 928571 1106071 961343 1145389 1023354 985827 895172 1189890 798850 992604
13843 992604 761804 1230613 1066086 761638 919944 882045 922022 927110 856522 962698
13833 962698 927848 1091585 1009241 806319 724715 973140 833557 1027667 750681 698925
13823 698925 790494 613113 812467 842194 791481 606887 826017 730954 573586 818074
13813 818074 724597 592197 843486 846761 926045 691206 745699 967637 930520 799809 775645
13802 775645 631437 712122 829307 487657 612465 866205 833862 833974 805312 815854 773723
13791 773723 768850 762288 1053424 647896 902222 799588 628420 515326 768316 753564
13781 753564 982344 586357 1061053 853223 765946 525368 593838 720917 542803 908231
13771 908231 569491 498739 672782 1014121 699973 529772 617277 631961 635280 529732
13761 529732 738511 735389 356396 696832 412539 468216 477493 555847 583532 1038014 332131
13749 421253 498013 520426 395859 690515 899115 344416 408697 512827 514191 661461
13739 661461 419148 739783 566412 630968 745665 466367 452355 342603 625710 498841
13729 498841 460000 714831 657059 639423 423205 757454 663548 393929 649419 351538
13719 351538 250703 543393 596599 159568 427639 390228 477006 724633 457760 552299
13709 552299 462422 354639 311131 568621 404403 642707 666068 403440 413707 556699
13699 556699 451652 621688 756532 566999 280637 550072 452317 266778 381037 658376
13689 658376 112828 536730 566025 491691 923397 270384 593591 352462 163274 340145
13679 340145 797054 461460 469312 583830 223055 657685 294801 588407 391593 602390
13669 602390 323836 353738 449662 494915 306585 543968 363682 539815 411914 449605
13659 449605 223617 220541 416679 570702 388429 372959 242157 514831 410832 116710
13648 419623 546134 501158 526330 355023 554515 364618 616922 385114 669647 327795
13637 702019 194774 659865 649233 367287 492236 477991 194948 290545 535014 131841
13626 80858 255846 152478 337427 484934 187875 580869 171247 433804 219652 286666
13616 286666 379459 286023 288890 89036 240719 413048 478641 574128 418930 234464 537488
13605 537488 637676 410770 452275 197913 172935 526513 635828 545525 236519 420341
13595 420341 534116 315875 429543 503183 609506 302278 165097 210178 178137 544988
13585 544988 292552 201750 399860 465598 27047 225632 339194 241479 365025 525379
13575 525379 493212 706673 329047 314634 347449 94558 93160 528095 44160 322623 250751
13564 250751 326019 460028 228341 233305 475519 -86486 109295 422243 164817 226110
13554 226110 218909 112871 107902 565074 224004 587473 401946 129249 346064 166827
13543 128139 82133 210392 93669 203935 346308 201467 471282 633869 309681 297451
13533 297451 77040 267985 165538 246010 75751 441681 225797 380524 281241 389948
13523 389948 298715 170345 240792 490298 621837 294274 165892 370547 379723 173342
13512 227851 -145777 339737 278516 447816 103323 286600 246530 183600 -47023 488098
13501 138784 378654 240618 239492 320746 10753 -189126 231011 270959 34805 366586 486866
13490 486866 259970 137487 514318 251039 446469 212453 269278 -14949 333619 63623
13479 355763 315247 293528 178949 106806 273006 93158 454768 331645 19771 367326
13469 367326 187202 121979 60076 321941 183682 365236 174792 212047 313215 104004
13458 -25343 172027 155931 563323 18988 293629 125065 363224 144395 98513 70120
13448 70120 164722 100636 242928 311939 279648 129554 330894 126421 147119 24384 -4090
13436 112057 151505 146918 -259800 306287 235279 392497 355831 240354 -41067 -9369 183675
13424 259283 -25333 41051 553592 310555 130418 185319 165308 227119 200530 9495 -9604
13412 125458 251373 -35652 127804 425782 173440 168701 205019 108732 368706 162030
13401 6423 303347 381985 172544 94311 56490 69424 259717 -168030 6044 207979 139384
13390 139384 255796 361444 179454 -120968 153757 260695 -115410 413098 198040 262896
13380 262896 132895 432974 148724 -43931 118943 187464 26354 277979 281380 320074 318731
13369 318731 68040 412662 -28361 422554 202585 217150 334443 539608 162506 388810
13359 388810 537388 28080 146300 200117 123032 -240533 549327 446356 382648 106635
13348 -21546 309780 -77055 369260 280045 188576 205124 473960 374240 200012 450976 493349
13337 493349 348073 354932 386067 33076 294045 60810 154962 88173 81722 128394 243749
13326 243749 373347 391841 258229 218060 412124 206512 81731 218823 -292508 268817
13315 270669 294602 62956 370324 -4199 30314 178891 283143 157232 368323 330839 59122
13303 136587 174060 70291 -36180 120456 177848 -50348 59311 303849 92046 -217701 470104
13291 -13422 -158100 77676 38131 202782 -92572 -31927 530946 -139839 165985 310998
13281 310998 346760 297017 236743 297147 167329 -223784 92490 76234 140632 228951 -24155
13269 -28269 213128 -46570 366541 93273 191181 161368 232504 302392 111279 92669 247959
13258 247959 -201366 95165 148273 195000 66565 -161561 107153 261332 -19868 53852 173227
13247 173227 146530 41334 -203784 267499 131365 -20079 -19914 467435 241349 470833 168441
13235 198089 -12167 -144279 139069 401409 265113 260876 145074 150468 164338 36518 154586
13224 154586 117308 305347 8993 9251 -174897 19774 210012 83744 109552 118457 -13013 27963
13211 -87421 147524 110568 55179 -280010 342737 249774 433263 -28041 -82042 294551 -94073
13199 -110829 475493 -31054 -6470 91486 113553 -101690 104733 183764 -118878 -15044 101871
13187 325485 146695 -132212 87500 -201173 -56357 41370 85471 200704 131391 -173097
13176 82618 -128745 105885 19968 346480 -131090 154160 213594 48133 149147 229615
13166 229615 -26702 -9051 137074 44915 101016 -240626 100146 -113519 -140257 61094 289839
13155 289839 -110614 -92796 21270 102613 278584 102227 41355 213753 -95355 115141
13144 199118 -238402 -47883 189633 321040 119827 263759 440366 94107 73749 291438
13134 291438 395105 99113 -224998 -135725 -146884 64701 -201341 -73673 293079 -36411 -126246
13123 -126246 309823 144603 53457 144745 189030 -346827 138816 -151627 -107445 119008
13112 -321948 -202073 3487 -155156 67757 191352 421981 223338 289685 -90369 96173 68331
13101 68331 239586 250725 25685 -357911 139365 -124810 -123631 -180601 238831 19470 -70483
13089 235922 120789 226909 -12234 56606 -30917 -148805 377686 -137604 -10592 -206645
13079 -206645 57356 283685 19169 38200 25908 101611 -48029 115874 39498 -89416 107160
13067 8591 274731 488913 67418 106043 -260066 58229 -114575 45488 -40588 36703 166817
13056 166817 169303 292151 260502 302019 35362 -107657 94500 120803 229554 430191 217931
13045 217931 53353 129840 -19465 -82841 350753 140095 185755 300168 49109 86881 415295
13034 415295 111913 44911 120258 -77016 85201 -71055 -73443 152228 263504 50300 183518
13023 183518 -340915 -111766 46635 208313 220996 24059 244877 84326 230603 117991
13013 117991 -61236 81500 57358 -30101 250665 69540 -155543 207360 17889 -42350 -98418
13002 -98418 54208 150611 -186534 -87512 326061 -260033 -3793 56086 171445 -149186 156426
12990 -75056 -35328 94860 192898 -28373 115050 88916 -135397 56876 195776 267618 153141
12979 153141 13355 -131107 -48847 106649 -175689 -83550 -16780 -65365 -9142 151740 179085
12968 179085 -182797 379973 -320872 152342 -115993 64235 24970 361748 106214 -53115
12957 -382096 -2086 -185204 162391 65292 527053 301972 -148929 -221052 283958 35120
12946 -257415 28249 83869 69745 -20717 53068 50958 -19936 28852 51805 230931 -29884
12934 3426 -58785 62087 -17086 -5923 -250070 119058 373191 -189757 40645 -11544 942 -108040
12921 -332435 360306 19492 -53978 -98237 9817 505959 -167181 84099 -165445 -90778 -3792
12909 -220716 -8599 -6869 -19701 294621 157125 63904 -5543 -251523 13898 187348 -236374
12897 17124 221874 240669 156967 239330 51027 175643 30875 -226301 -152353 -142771 288974
12885 -35420 379547 189509 208877 -91014 -155935 -193100 -245723 163483 -105410 153658 465643
12874 465643 74727 166407 -85681 187742 127682 77356 215979 -132223 -180906 -91459 -272581
12863 -272581 177144 -28552 -119576 66904 -78944 103094 -123461 155268 -125330 201983
12852 77470 -144931 303313 39002 -130213 35007 189811 -76328 -77841 89424 -250755 283041
12840 83332 225646 -83713 411955 -103594 213166 436888 -53988 232335 93125 64585
12830 64585 -320929 66291 -265057 265406 -120643 -15233 -330540 -36367 -69425 -88243 312704
12818 -199018 -377145 -93679 193729 99277 -64637 -87608 44863 -30892 -116951 75373 16883
12806 -95138 -230138 -49160 -100777 -257508 126831 -146926 -280654 -199320 -216001 -47126 410933
12794 92407 -58014 -105675 152962 47196 193138 -55397 -230759 -51186 72132 -193064 130164
12782 -218241 223129 -56399 -181604 458224 -97755 -247510 -215824 32551 158632 -14129
12771 110215 -101310 -153633 -14864 -127163 55293 -35002 181792 86192 -41375 -276551 -13375
12759 -47099 -25932 -191374 209049 39647 -342212 -13275 -199356 201639 29809 36644 -230863
12747 249162 121023 227902 -147536 -245360 -367168 71332 102103 -194512 -9710 292842
12736 -153329 88429 284101 -134755 56050 96527 193453 -78897 -296302 -43159 206548 -50333
12724 -7057 369203 -163539 -187988 52847 -66784 -416712 -269698 80733 163669 -132156 -134751
12713 -134751 255308 64195 267974 53707 173116 274072 162867 98376 205195 105309
12703 105309 448909 343763 -17930 179951 -10159 262859 -100171 24597 -16643 -49915
12693 -49915 174584 -182717 -204955 -262943 -254861 212539 14762 -32639 -31256 125755 183156
12682 183156 -47009 120821 139726 -316744 39195 299827 257104 -10763 137060 527310
12672 527310 270921 -35885 -8264 45147 -42925 151918 652366 54524 -134088 -197706 209435
12660 125611 -25180 100753 210775 268521 185395 75280 114416 -93359 -209193 -93907 109354
12648 89550 125478 115826 211999 89303 -65706 -143649 -185990 240089 -29628 -126428 36083 185449
12636 185449 177817 -50433 -89825 172515 -76217 253952 -36960 548038 395047 151672 20494
12624 81441 -56174 112459 68206 178553 -18290 204609 208262 370963 -245601 -235242 -297549
12613 -297549 -126536 -115499 345828 -77003 -72281 24586 96703 158908 -148860 113899 -107647
12601 76415 78667 212890 190527 274689 184922 55605 126881 32722 -50319 246871 -83182
12589 -197645 134170 -97922 -137051 -327129 -76316 104865 -277195 78025 -111122 -79155
12579 -79155 -204896 24283 -171609 242032 -145608 -212333 167289 -98491 1475 3037 -64105
12567 70200 38529 -195060 66984 241949 -58291 206796 25771 -146885 -97598 209456 -26283
12555 63395 -70581 72003 176840 -235444 -39912 120661 -364446 195941 112 -26678 35686
12543 -92682 -116061 144009 53134 -6288 109858 -177537 108477 130827 -8552 238166 -238124
12531 -156437 -12739 201563 134844 615079 37661 55732 -17191 -163363 -34035 100225 13694
12519 -25610 110879 232016 149095 -140829 -9207 95105 177736 69488 -178882 -202437 -9132
12507 96805 135565 90465 8095 69936 166410 197529 76087 -166514 78186 -91240 -163319 46723
12494 -83352 121617 113223 80937 300377 185441 327527 -1708 378280 -194748 -76174 245281
12482 82475 188158 245113 -105969 -348622 -223364 97718 59980 -52025 355031 -20774 -30514
12471 -30514 -60503 -139797 -337544 -161305 -163095 -60340 -253715 147440 103367 -279285 39766
12459 -46891 59369 -237756 -271300 183318 -123577 -25018 -88179 -140975 58547 -84871 137001
12447 175781 -8575 94280 173209 144366 -283908 172722 -353288 280115 -40462 -298567 -252007
12436 -252007 86572 77277 152915 245456 -104311 81732 467593 -211450 266894 -360127 -147884
12424 75110 390924 -146373 191420 -11707 203965 -200795 -126193 -190996 199284 -186669
12413 -296388 -363484 -265829 -134111 83170 -5942 54682 220275 247042 -143814 160621 -62703
12401 43037 166979 -51374 -55065 136377 35780 86703 47337 -123497 -62244 257529 74650
12389 19919 -184394 151297 19279 -229913 -236269 -170477 75935 -68411 44558 -245635 291666
12377 33101 -310405 -3495 93599 318504 -361660 -75158 -22851 -190482 13892 -94923 57281
12365 -48887 155184 -89196 -59379 -87607 41193 42815 21364 228503 -153205 295035 352095
12354 352095 45867 43322 142078 -61728 -168953 -116006 -68593 107123 -32236 -453587 178962
12342 -71797 -216030 115616 -73191 -127702 -94154 335162 67359 -105863 53450 280380 298641
12331 298641 34986 -335129 29552 -188457 -128882 8964 -178030 -32291 -7869 117390 -3885
12319 -2413 -25221 150300 86950 100765 -122883 -169368 392074 75081 451145 112760 -15807
12307 -15729 183628 -134400 -187211 194759 -138499 8973 251651 111758 -46003 119285
12296 93214 56612 -61626 -108131 134131 32328 109905 209383 20752 -104 -152617 108004
12284 -109518 175369 94494 466095 24585 -131984 218658 148390 421842 148260 32363
12273 317191 212944 -233519 164376 301158 40463 99296 44629 291610 370543 -213249
12262 64999 -99028 -102538 26350 268960 268757 -103901 54057 14227 -96655 -137047 205375 250734
12250 250734 -6190 32846 215887 272701 39265 -30274 -186158 -21768 185124 369168 329793
12239 329793 159 -249013 -102131 224906 166088 23851 428623 417665 297844 -184768 -191331
12228 -191331 29253 134821 146247 184314 216811 185204 327691 376672 44999 205864 173066
12217 173066 85394 297345 -168302 3256 48512 217357 165676 130095 32457 96795 -89972
12205 -5985 85390 14885 -50565 165106 370888 300362 -213832 131839 483542 63304 159691
12194 159691 369920 230079 145228 379198 190490 95197 213454 -76814 17201 215343
12184 215343 -214273 8138 288052 28553 178871 263386 -337732 83646 -143056 31183 333695
12173 333695 546116 -64722 185153 518952 -45201 62776 187874 78362 228583 20384
12162 329790 -44473 35079 -114221 121372 -250266 187704 101976 151511 123641 164869 100401
12151 100401 175336 260382 9908 -280483 299726 -23496 21168 -162947 -18638 181397 196725
12140 196725 -47463 41817 125890 232485 27662 25552 -32865 -272922 53631 -156457 -236454
12129 -236454 -100141 26027 109785 -485248 52838 69731 -77802 42958 -221402 11540 283814
12118 283814 -174197 369743 -117183 -11863 137779 -181866 376074 340549 112564 20311
12107 -151096 -35444 -66163 64404 94245 86633 70782 317807 156269 18802 138104 115175
12096 115175 -62310 -29265 137845 123156 42972 89804 258248 -306398 -60161 -25579 189912
12084 -244389 82114 170206 -408687 21611 -33960 -119217 173318 147414 -148884 -246126 159576
12072 -157317 -28374 18635 -180521 455592 168033 -1164 152402 301366 1023348 1420942
12062 1420942 403074 341104 319462 -34085 200218 -56380 -88880 30654 -84173 -146581 110257
12050 65600 173881 -213918 216038 199089 -167183 -158640 40938 304054 75380 -17540 56134
12038 45576 -122879 -6065 -112705 81637 -261679 314142 156218 -180454 -114652 268181
12027 -85751 -67213 -35324 -119899 -167959 195126 -143348 -139674 -136750 387685 -11053 66794
12015 34648 7083 96459 103757 -18951 92670 102557 253411 169886 129872 -158162 430473 178409
12002 -114763 340632 -80505 20755 34146 338368 43119 22099 -109881 -14495 -237307 134511
11990 5961 -245818 -161074 86946 -154876 -254005 -16519 -164080 -86405 93585 -207670 179009
11978 189170 -93216 -92124 -139964 -240724 -152460 -198451 61500 -223983 273809 -6330 50332
11966 -78149 23775 141637 -159664 -13538 -376193 -7423 -246009 56293 -271264 -63808 128884
11954 -103858 181239 -78920 -60254 -54269 6573 -361927 41109 246906 -67101 -144021 -145951
11943 -145951 -246800 -127054 -339947 -53503 -305736 225028 -16295 520953 53560 -39680
11932 246598 -27986 -205055 -50176 48139 55354 -144395 -253787 -77994 -151868 190272 -280067
11920 -197616 16710 334650 -167007 317640 29292 -180643 70861 -463471 -15237 39746
11909 22630 198096 -7980 69791 -203918 65661 -21628 -141206 92465 76071 215321 -103847
11897 -31903 81054 161071 -37259 -171072 142555 156861 -241624 275974 -264877 -193034 -112314
11886 -112314 -87258 -272758 -253335 100778 108292 216475 -199598 12437 -14518 77498 24809
11874 -311600 -20416 12983 -101170 183597 -265045 -48162 -45803 -4804 -174937 48253 -62031
11862 110805 140903 -135193 286263 -23372 -28922 -378724 82074 -95098 234647 -244837 83531
11850 151154 44336 141848 -123365 23860 -40816 -199074 84863 82173 -49556 207029 -179790
11838 -103766 -186565 -268094 42496 292010 -271101 -171224 -132613 -133749 -161478 -263950 24504
11826 289900 -74026 -205736 138597 -206080 -53792 -418394 -303862 6047 -105890 155783
11815 95603 -155275 31583 -11046 -174875 21032 7695 -155449 34403 -212060 -17315 -37565
11804 -37565 -51449 -320600 -389853 168904 166861 25901 351209 113689 -252945 206596 -54575
11792 -357477 -158209 -18265 223188 84580 -128992 -212702 89331 313895 201645 159024
11782 159024 227875 -110035 149097 -94732 67908 -32009 -195125 331130 49881 180442
11772 180442 121913 152130 170785 -81371 -50618 -332583 -25180 73777 4792 -360527 214524
11760 -2843 61106 -48353 -88808 98150 104871 219043 -194428 53937 -148679 2449 198564
11749 198564 160488 148492 -95698 4169 -140008 -197784 -362289 -56772 -58035 -49238 74078 -57354
11736 141179 -206305 84107 237305 -17165 -86167 124810 302982 -211964 -202758 225843
11725 54927 -16916 -58510 -30848 -249418 134303 -172578 -150863 -107250 -109777 -157136 -135622
11714 -135622 210382 -22892 245308 365096 262651 106326 -3379 -11566 57772 79740 96139
11703 96139 204054 145791 19301 185257 -351747 -214140 98486 -76593 -150579 124912 -78517
11691 16472 159241 169597 -24668 -111314 -154427 -237539 -86078 -32813 -34229 -142040 -49291
11679 -33723 19002 -240245 349921 245620 -145303 76738 109809 319223 245599 -28382 -117848
11668 -117848 169208 111596 -117080 111633 108812 168492 368610 186791 129873 103813 -145294
11656 165114 -73615 -38877 537361 2527 -54105 -93610 -10258 204128 -24376 -669377 -232355
11644 -68388 -187225 -37604 225477 13233 -42074 -56665 111177 156740 153487 321636 270764
11633 270764 155823 254434 -1033 29809 -70483 -6650 318244 -199855 175626 -55814 51842
11621 -23381 -307144 8201 189804 -162125 32377 119987 88532 21387 222603 80665 112202
11610 112202 435556 53802 360720 -87472 -161666 -94677 45081 427030 -106079 -82650 1213
11598 186628 -15063 94349 145753 -134726 -23843 127085 -44530 119092 170090 179793 -87054
11586 21420 262279 231006 63864 110266 -103833 310062 226868 14401 -4428 -13698 -234447
11575 -234447 136730 175998 102067 150108 61054 550 414017 6680 -63975 -55635 219211 453846
11563 453846 191433 114423 249432 -177157 144566 -125198 197386 -99734 209885 175538
11553 175538 -120118 184993 143283 144210 15731 267343 -117301 163053 204390 229303 -19316
11541 273260 64078 -66994 -51247 363325 -194318 60764 332689 119018 -117078 -98573
11531 -98573 245108 109551 68256 52634 94705 -358796 -23308 329332 281532 -99472 220512
11519 77527 -83726 -973 -74011 30690 -172913 -183098 215600 -40672 109400 -141087 102941
11507 114258 -139060 323334 583653 375223 -48732 449845 284834 -150863 774 329162
11497 329162 239038 365737 262383 27842 259489 123650 204887 -59162 478750 207902
11486 282329 16781 20212 126805 279327 479798 93155 104315 69665 262535 -128840 114400
11474 188478 293936 108760 9884 79414 364375 114988 343946 331327 205581 204362 51943
11462 166943 -64624 -101730 100925 138026 16184 -37507 -45568 -81332 -50151 93685 59410
11451 59410 -42568 305310 372903 -90978 141526 2849 178300 379029 -182959 7598 161852
11440 161852 38853 -170917 75433 -302602 285520 26036 134939 90631 13765 182555
11430 182555 -332613 138977 -62632 -20783 379251 33153 -239102 183216 -64523 -52226
11420 -52226 -120716 184516 -77141 -88636 -172136 103605 118669 313352 199704 -70482 427369
11408 -144688 -114439 -37158 -94793 162763 188421 89243 9061 134971 -128525 140671 257660
11397 257660 -143640 68884 -14933 62990 262203 234441 10252 -150728 372174 57174 1579
11385 -346106 -119227 65741 63457 204722 258011 191861 102146 -256958 -271663 75188 135853
11374 135853 300497 -16213 -90257 -13568 -215019 28910 2333 -197110 -16390 -34909 18634
11362 -67342 -122662 103960 162816 -15492 161317 127897 -130052 27257 27943 163457 254989
11351 254989 123221 -233820 58630 -115836 -73983 2605 158956 55218 -14779 94526 48461
11340 48461 159026 188375 -130516 -25630 16832 -81687 272068 -375645 -471135 -98949 -247289
11329 -247289 42152 106249 -48782 34150 5957 -194427 59932 -147204 -98816 199277 -91919
11317 91270 -278857 -151396 -258091 16289 36103 -330704 -39812 -147283 252311 446349
11307 446349 74938 -169953 -268693 -97106 17068 -34364 357325 -95677 176453 230107 156406
11296 156406 195742 -192921 -132683 5939 -46745 -9716 125879 145884 -48279 -168387 -204377
11285 -204377 108628 -117234 -40535 -159380 -106099 -122799 -276046 -10913 -93193 79353 46375
11274 46375 282297 19761 -7532 -86249 164841 83401 -370732 13063 239991 -79188 237230
11262 -79375 -280891 -100186 -185858 321143 -29909 92211 -188828 -238751 97522 32906 -60904
11250 -99765 -213224 -99282 7645 -13263 -9832 206007 39377 -140118 -382431 -178868 212157
11238 194517 -86484 1816 -334539 93803 -120469 -10037 -116079 185555 41331 212175 -166472
11226 -4075 168952 182252 -358708 -40252 -40867 -145191 175703 -68357 -45491 25973 -79032
11214 -30369 -8918 221036 -95417 67761 -244864 176658 -220749 -150413 -130804 -145829 8528
11202 -311339 56556 -26478 -233761 204770 376014 142792 4627 -15600 -143386 209728
11191 -59126 -274611 -19476 3865 252473 1169 -173281 -325855 -322585 -17917 224990 -44203
11179 -157990 -125030 200955 139265 89552 18258 18658 -111240 106531 -611807 74396 -212051
11167 -72710 -100154 248526 -272717 -270866 -175047 -34129 -150677 161649 -40772 -286187 -160290
11156 -160290 24585 43581 -65397 88933 110077 82121 -12672 -137306 -31936 99643 -127693
11144 -11623 -146286 104125 228868 -145013 19294 121430 -72512 260649 -215347 283472
11133 166923 1824 99573 -25642 -202494 53993 -3020 19380 9356 44396 135351 -2172 -208774
11121 -208774 -21318 22261 112598 112692 -234269 -104190 34182 -131992 315781 -174990 83507
11109 34401 124610 11699 151041 35909 137897 85334 5140 19770 224616 39924 -20470
11097 -92110 222486 141805 -40052 15378 206965 -106709 104807 185384 144272 -180947 -34209
11085 222471 185571 42688 249536 440846 375172 219834 235151 41009 532146 466343 5834
11073 -113511 411085 319696 114268 384189 311695 447364 485499 532415 571582 272154
11062 147752 232718 510989 447858 469352 596099 705781 1024923 680045 781657 519380
11052 519380 597353 594198 725560 913719 501001 595705 587975 733142 715667 856533 687439
11041 687439 974785 587047 688072 575336 668881 510506 768331 597960 602189 696720
11031 696720 933934 686589 603342 1011516 893484 650781 642737 499569 795570 778033
11021 778033 431351 854311 599201 725558 405788 700624 266998 877717 813691 461429
11011 461429 412812 464090 289490 342842 540207 822364 553252 506230 842124 793627
11001 793627 684441 519808 520128 854781 719700 575301 758345 268986 690261 737624
10991 737624 762054 676886 690583 880868 856612 940892 813017 932451 1239699 778085
10981 778085 1003302 972234 1008369 1208272 1538938 1839557 2147158 2613586 2785075 2518920
10971 2518920 2799005 2864171 2842013 2816139 2522573 2123537 1597416 1614299 1648103 1957541
10961 1957541 1696654 1682442 1508391 1508421 1717948 1743659 1407202 1348719 1293263 1144093 738950
10950 738950 373734 599435 521387 588257 383580 106973 429265 -39604 486527 79506
10939 240078 -165853 191526 -47925 205814 90305 274146 -68227 28272 -274674 -188698
10929 -188698 -410528 91862 166232 244648 -14589 16223 -295369 -82703 381042 -1339 -97722
10918 -97722 183550 17743 184513 -461422 19507 298621 -48726 -51859 -23551 -286431 158516
10906 120688 -68249 -210904 104541 -270442 194837 329879 284297 -177628 -77423 268326
10895 112529 69778 -241553 -56375 -260030 97522 65642 -255703 -229554 117174 80674 -105468
10883 -66699 -150730 66132 -197416 -24035 134920 -120828 99370 -164049 -54556 44117 70388
10872 70388 10229 68317 -348106 188110 -236711 21147 -416867 -29374 30516 151028 -128756
10860 -107263 214129 -361143 56646 -23507 -214541 -273889 -251600 -159162 -24603 52025 73569
10849 73569 -328533 -193979 -57962 175054 -183781 -301581 -122008 357668 140097 -49820
10838 93228 -207257 -34403 44513 21594 -109730 -136337 -173555 9407 -117219 -131001 164965
10826 -315173 81224 -10120 -108480 -109532 231986 259396 -75345 30512 51961 320043 -62569
10814 -4456 -4610 58378 -169227 56435 -216018 283902 -139888 -195651 -414184 -225047 -321376
10803 -321376 39631 -77316 106492 -238671 49951 248761 24177 -197607 -68595 -205317
10793 -205317 -227121 -279831 -334602 -86567 -141523 -63734 -113971 -133959 -37611 -40408 -173924
10782 -173924 -57888 91119 -100431 15021 -139593 19843 114430 -221943 29379 157437 73446
10770 66383 -253126 -19613 168143 255566 105598 82812 183714 356531 40867 -22337 261544
10758 -30500 -144038 -199897 -116185 -31842 -347276 -285794 -233106 -91303 -55183 84369 -34276
10746 -54046 49962 62512 -99916 -170161 -169292 197425 245387 -135224 99723 -324176 119880
10734 -74395 -1645 239356 37850 -106825 191980 -193446 161995 -68814 -125992 137540 151381
10723 151381 48461 114860 8603 77921 76261 71257 -86621 14179 -273939 -91560 -210544 -164215
10711 -164215 -519042 95135 -19614 208303 133369 -38833 4228 -67913 148571 -133713 -75474
10700 -75474 41277 -68628 85152 414187 -50381 -268811 134665 250387 -49484 -155987 16985
10688 -301119 30207 -17875 -22395 -420210 -198343 -154347 122412 -296624 -259367 -210731 -55273
10676 -31658 176845 29984 33462 -63721 -427390 -307159 131103 -64240 21131 -153599 -276758
10665 -276758 -136974 -149809 102570 -327019 45168 -232060 70336 69090 -12825 -106059 49747
10653 -180114 51525 -182088 -43417 -173728 -289956 49049 -105448 -155705 23430 38876 -38700
10641 -276802 61357 -172424 56802 -418685 -54326 -53635 82945 -226971 42308 -225775 242900
10629 246593 -96137 -81784 -200842 -221772 12766 -203578 -109319 271856 -198340 12136 -122784
10617 -275388 67092 105761 -68976 125419 31452 -217188 -373180 -114691 -26559 43507 -37812
10605 -153048 -141118 -259753 136264 95567 -145187 275165 37291 -118726 -237698 -156547
10595 -156547 -135753 -267840 32784 150598 -19392 -125142 -337581 -71971 -120394 -420815
10585 -420815 188937 5894 -119264 64183 16204 27448 76493 -138399 -209594 -58945 -3654
10573 -117116 -87394 -33374 311863 -37347 179114 160454 -108848 -183886 -277878 170367 42448
10561 20533 45337 -39681 8856 -156842 185645 -335132 137931 19062 -45389 -151271 -85591
10550 -85591 -119141 -64848 -29092 140874 94699 -191375 -30298 -237687 270650 -249117 -343464
10539 -343464 -131713 -118540 -130483 -203651 84456 100907 468300 -238615 -252974 -163973 151621
10527 5490 -75196 122272 -97640 -92833 221285 -333192 46676 245900 -56056 -54550 -467730
10516 -467730 -90929 -222733 239558 -121964 92498 66321 150589 -440161 165191 290311
10506 290311 43365 -91363 -203593 -55748 -28960 99324 23279 68002 -92079 -201969 134508
10494 -146542 -56631 89527 -46430 -247969 85362 -59982 -140499 33509 66660 -68825 -38232
10483 -38232 -35010 -8687 91182 459604 417022 367733 384387 203201 -96350 -260131 -195814
10472 -195814 -231209 -94131 -417279 199186 31567 -167200 -102686 137705 119969 -36754 96014
10460 72711 -217089 51981 -122060 38075 -47957 -449812 -34137 181816 221289 -321015 1976
10448 210890 97917 118167 -34465 -199895 265840 272697 67628 -53903 -19383 237233 392578
10437 392578 -56671 -619 112278 -194157 -41522 -100089 -33980 6340 -55869 -80468 27485 123855
10425 123855 -8158 66530 30239 -185216 53733 35051 89852 10993 -38433 27725 186053
10414 186053 -127124 180394 -186391 120654 256043 -257799 -244575 -297717 14638 201991
10404 201991 248236 -141738 -38766 -15255 -255900 -39207 -66491 35393 -119752 82280 5295
10392 248537 -60779 9431 -194063 55849 -29293 389369 -151153 69931 -318302 -19227 130816
10380 70710 59735 -188757 509489 293124 73742 432650 47928 413380 102628 115207
10370 115207 210051 5752 156592 482964 371390 321446 548719 548242 79248 158282 152297
10359 152297 438541 19363 359582 141548 289287 155785 523845 529710 433403 471890
10349 471890 869963 142634 62379 214794 46968 257864 565644 128172 148170 542762
10339 542762 191229 253189 41807 130094 -66334 30864 151628 102965 233301 -198619 95983
10327 -150786 173811 -106803 -5109 19659 -180375 137824 14078 209914 28510 91527 220614
10316 220614 140960 497263 -4816 176629 -137957 -138752 -213159 98991 -88114 45389 -81628
10304 -85630 87081 145019 4389 125201 -93578 299613 273859 280958 -97243 -111589 -374088
10293 -374088 -49032 223675 -118471 20806 -321044 70559 -156444 -62894 -48061 -170588
10283 -170588 -209309 400020 -47325 70704 -279596 -136023 79335 -291550 -131476 115351
10272 -25665 -59114 -65836 111978 -39325 -307441 105920 352288 -82300 -64738 -25679 -119141
10261 -119141 328525 34327 176697 -39354 80784 85243 342099 -2357 -55363 134422 -266300
10249 -287641 -15919 -22550 19804 -305958 -59595 -296466 284537 221589 -286936 -34993 196489
10237 142323 173815 -24875 242197 -182613 44302 78651 34067 -188244 479937 46795 -29952
10225 57094 59302 57699 106946 -59551 -30612 -27654 -94488 -315028 -57179 -54279 -288032 -212481
10213 -212481 -109189 -91544 222020 -18516 2688 -143802 -90897 285948 -121594 -16668 -439703
10202 -439703 191791 -189846 30656 -78045 104009 62092 -376182 -98496 -164529 -159147 87251
10190 107444 -308487 93893 -61292 -232312 79127 -253030 27505 -163020 -187437 -226371 -176668
10179 -176668 -384265 -67367 4524 128544 -164956 -132550 -51755 192030 100818 66647 -47993
10167 -44738 185843 171419 -42645 -64846 139580 233283 19567 -252398 -6482 -111654 39532
10155 29918 195647 21999 -156705 -4946 -42633 -130271 19875 -236694 167267 -150529 -148516
10144 -148516 -276845 -283033 -127016 -47514 -190427 -191310 -72163 91860 -64031 206344 -445452
10132 -161968 -236284 -317135 -310824 -70148 -59449 -438369 -21546 77526 -123259 -36709 104949
10120 -29196 -111882 53168 -60580 -347383 -254619 26127 40151 -114526 -304608 64090 36052
10109 36052 -197381 -65339 -193816 -373688 -100774 -389090 -188397 105116 -266541 27500
10098 102734 -212405 -2522 -91206 34548 63520 187412 145429 102482 -312930 -127980 -120848
10087 -120848 -310327 51822 -191762 -350991 -133248 268158 -301608 -291881 -30970 142253
10076 175157 -299453 -103342 -229157 197419 34941 465 96295 163010 -194082 5953 -115873
10064 220560 67886 -11924 75791 112425 192458 -157764 -65008 41224 54658 -40313 107123
10052 135629 -40205 280501 -384548 -16213 -182663 281095 -202464 135051 28266 101320
10042 101320 142273 64056 129743 -39729 221934 -126208 -111464 21802 -44544 -47081 981 -75488
10029 -201320 -247357 -140476 -24603 240282 306273 -93649 150181 39518 49262 80488 -43479
10017 -119365 -16514 -91235 51421 -240866 -107280 81497 2381 -64036 130871 -184168 -9177
10005 71710 -28545 -172237 -144096 66094 -334968 -10404 -97353 36661 -22358 -156186 -124967
9994 -124967 -136969 265088 -92552 -359163 23831 -342183 -206388 2208 -173450 -117932 173486
9982 -51008 -111813 -9006 84836 -213751 -35651 -328021 -91585 259262 -37375 163880 12527
9970 -74081 71160 -29071 -40256 -172752 -87946 134811 -268004 113176 59032 -76769 -11126
9958 -246153 -236611 10557 -244219 -193798 169090 -71411 14604 -155510 -40156 -33225 -177442
9947 -177442 380633 209346 130281 132281 182732 -298650 335027 -57999 -37773 -281063 55774
9935 -181418 -211451 -230820 -81455 -246813 -26512 -46748 -74313 53409 -38978 -518593 135438
9923 -18457 -3641 263288 -270921 -183276 141903 89437 241598 137814 -66035 -159488 30601
9911 -21997 25934 72079 95383 -278568 -173075 -344703 -144845 33344 -118091 -296503 -117994
9899 -206221 332242 38654 3995 15867 81687 66806 -218607 -110268 -228667 -293378 130942
9887 -201592 -54673 129462 -236374 -287529 -67201 100263 237258 26205 91633 58685 -282700
9875 -198530 -109600 -37124 -239860 -15218 -50261 -201600 67880 -314022 -128959 -251736 7924
9863 -82294 155786 23265 -113646 -162854 -193096 -226167 -149815 91269 -232532 129455 85965
9852 85965 -56648 28688 52129 163451 82547 -247128 -252428 5646 -8715 -61167 144478 324803
9840 324803 -211654 -118747 -33229 -10646 -316874 -43161 877 -75429 -142635 200281 -66697
9828 -53414 147244 -283884 18023 -451238 90008 -183369 2298 -190391 -41640 -195293 -282580
9817 -282580 -364347 137151 -207609 -325525 261903 105014 -154016 -225430 -76203 -318280
9807 -318280 -325696 157114 78676 -134560 -35090 -186614 -35098 -124813 -203835 -62419 40927
9795 -63081 306562 -142924 -39661 -89948 -11356 -305572 -9876 207060 49598 -124025 -111116
9784 -111116 -20460 -127864 189055 -10332 -319710 -8103 -31595 -262672 -261844 -247133 -124204
9773 -124204 -48269 -113271 377685 26397 -209369 -266974 -45758 122126 37488 -138995 24954
9761 -301086 271392 -11715 -11424 143544 -129796 83217 97486 -33788 92304 -10207 -271338
9750 -271338 8146 -56931 55254 -69277 66598 200344 -26220 -259888 143281 265525 -225034
9738 76381 167451 -183667 -437850 106283 -270740 -247816 -41567 37307 -252084 110234 -247191
9726 -76426 90626 -43515 345198 54149 245807 -132087 103326 -324381 -170308 179864
9715 62903 181007 -257820 -71348 -286017 63830 -83746 36802 30974 -415022 170536 -138693
9703 -41435 -158034 143932 -53557 -85806 -58106 263397 103921 -157533 -88043 9605 -184406
9691 -10615 -169644 61370 228496 36308 388506 -81772 -282409 89188 270305 116349 -208371
9679 55245 -58883 -183578 -237218 -102302 -112736 -223866 -65396 -1646 191295 -305739 96076
9667 -74796 44184 22019 -409175 122268 -175744 -65814 -421964 -195873 -33797 115666 -173356
9655 -128435 -164747 98512 49565 -224853 -188696 -145833 -251354 -156042 96421 163413 -170771
9643 127069 322942 -54188 19947 -146246 -298284 -56558 -36800 172249 -152542 1060 159178
9632 159178 -104380 -90186 -11415 -323505 131685 -193362 25330 -26673 235776 -39289 -347477
9621 -347477 224298 7145 138006 -156940 46535 308413 -203714 62670 -123010 -13518 -67627
9610 -67627 -128766 78356 -81204 199191 -75529 -139316 231676 82175 -356713 -108431 33063
9598 -122886 104688 53553 -214772 -161995 -217149 49022 22339 -83697 -95977 80086 281586
9587 281586 -145816 24963 82461 -322396 -617247 67872 59463 1333 -35607 -16662 17109
9575 27200 -85157 83774 -130182 -232219 -146066 120084 25454 271331 88167 -155300 81906
9563 -231384 -103134 -274624 225978 -230428 -188888 112273 22642 -142683 -285945 -95631
9552 52575 -186946 111362 -56299 -10892 38154 -293514 -232748 -11322 -165889 -215827 228971
9540 103294 241832 -398081 -149905 -19686 -190407 -52924 -84318 -295177 -221571 94142 -119274
9528 114738 -20685 -14786 -32267 -39212 -6519 -204081 -224428 212836 222176 -159304 40943 -99622
9515 -10360 12333 -162914 -42032 245500 30355 45184 41138 -175774 -266879 8239 -423835
9503 289774 111947 -41672 -411458 69283 -284734 350628 -10297 -134086 -135759 87810 -204365
9491 -112454 -397520 -314049 139180 -3893 34977 -116459 -187179 -8819 135536 8935 -41820
9479 -35074 -183906 -29430 200737 43458 -61142 173835 42306 -321100 -45531 74099 22578
9467 -129043 -225613 -208262 -155395 -99190 -137622 -189967 -321107 45452 -160245 -421823 -15527
9455 21984 -36383 -20857 164464 -322271 -142254 -225769 -142916 -56219 -32485 134446 210613
9444 210613 -204791 -96932 -165381 133982 165730 -81075 -347410 57585 -348360 -392120 89498
9432 63719 -51660 -123925 559052 -117782 184210 156872 -87707 -173513 -356331 -67937 -9324
9420 -226597 -140317 248441 -420186 -7537 46634 -116141 225648 -190037 -140419 -59356 236116
9408 151816 -260734 -131586 317603 -201439 -216771 54528 -175675 18502 -158843 49353
9397 6371 -62060 -162569 -45597 392 -134673 -187636 -83732 -211895 -252877 41114 -196935 -338975
9385 -338975 72347 -99150 -263053 -202332 -358040 -52009 -109016 13982 -53845 -182843 -13592
9373 -374279 303333 -162284 -187187 133987 -143020 -225547 48701 -102294 51861 203226
9363 203226 -26581 4500 -6865 56236 -236769 124530 138247 -295970 -279232 -9569 -161107
9352 -161107 -351487 92694 25785 322049 -195235 -129780 83201 96539 -190061 36395 21147
9341 21147 -155529 -153733 -29511 -327247 574 -102384 -131757 -214522 -81272 208832 -199405
9329 -82881 -87128 311260 -165973 -170081 -238959 17291 -83572 -79368 240138 8547 52162 20093
9316 255473 -83608 -16683 282 -60409 -206158 -315900 -37872 244351 -30394 -238689 145874
9304 31200 -105604 -29149 3084 -74526 -115675 48845 -238924 -133397 75216 17831 -190025
9292 24832 -16977 -35594 -274576 -101926 -185422 -77359 -91705 188979 -235399 -10687 -38367
9281 -38367 -67069 -150471 -342206 274269 43925 153942 -71499 -173940 -159248 179649 -168107
9269 -99566 225875 -54636 48633 7855 -53100 -52199 94960 -84162 -127165 -27687 -87683 -259127
9257 -259127 31253 239578 237975 118788 150955 316153 -56983 -15420 -127581 -163996 132602
9245 -321766 113094 -117706 -74054 89107 -68248 -148843 21304 -285613 -291975 36864 116127
9234 116127 2897 171844 -292547 71990 -175385 -369343 -125776 118318 -7764 -137020 -161741
9223 -161741 -308085 47074 -77294 -133618 283228 -180658 -16557 -275379 135319 -145550
9212 20086 -231799 53808 -392199 101598 -210749 -239680 27058 -420906 -388203 63804 164595
9201 164595 -116718 314822 188236 -286681 -21135 -130440 17372 -203734 106066 -209029
9190 71743 3282 -183543 -245179 -376165 -256330 -90573 -206293 -25369 -75114 -339038 -40665
9178 5551 -236428 2532 -136103 38115 37815 -59300 -41235 -70537 46725 3562 -63565 158351
9165 -137158 -106748 -46481 250254 -31547 93918 -7563 54844 -38349 -52560 -48379 7739 -322251
9152 386437 211784 65916 -82967 111399 -187182 169936 -19717 16443 -166503 33045 -88086
9140 112914 -30672 164999 -49797 110173 5171 281359 -322060 -68295 60998 -153195 14354
9128 -29187 -380778 -20925 -47570 -190149 -110119 221569 -2913 -118941 140096 192402 -11848
9116 -224205 164568 48966 -3451 -228153 4357 -24218 -103341 137246 13496 -130789 70181
9104 95649 -121647 37900 -173125 249768 -37475 -177182 80745 -133339 54326 -242922 -168030
9093 -168030 -176540 -243482 -134162 -342081 -249402 -156978 -125102 250622 -59434 -180906 -217435
9082 -217435 -159457 189531 -153958 -158388 77479 -301501 -141763 -142089 -54012 -58379 139066
9070 -37126 205965 -35476 39219 -18186 -64866 198586 -490048 17300 419275 140416 -2006
9058 143807 -248681 -299275 -479586 212264 -22581 -207018 83799 -6785 -26251 -120967 20648
9046 -108836 -319900 -101028 -1904 -59072 -16857 -114688 -271163 -13077 -93384 -251095 80107
9034 -152679 -285167 -457904 -194986 -348533 88934 59037 -99271 48601 -30892 45721 -232382
9022 -118638 -144541 78517 -26076 75527 -30273 77262 -119980 137303 -283097 72851 -115444
9010 -399873 -268294 207125 -24868 149405 428844 -138616 15042 78690 189612 -2325 9697
8998 -211951 -58749 -169079 -38805 160233 -165682 -12083 -78405 11646 242262 120880 -330166
8986 127094 135599 41800 -1389 -24451 -59848 -141688 -55151 -102322 275837 -206605 131755
8974 -448534 -195080 -99106 136552 37160 -130029 77995 130893 -16366 24725 -82579 -187750
8963 -187750 -95552 60292 118797 -220409 -71354 13809 95877 -131026 78832 78196 -45699 13433
8950 -193438 -63648 124221 -166838 93157 -40746 139178 324305 18528 54976 188374 -45412
8938 -264034 156667 -51167 -204763 86423 122209 -251053 -181479 -74786 37520 231888 -165417
8926 114271 449979 439709 861722 2533886 7738957 8231995 3015179 856568 735918
8917 735918 388854 -83874 -97321 284019 116950 -83528 63220 323061 548678 88033 168890
8906 168890 -160835 39788 33121 -155473 -362960 372583 -109094 225776 -341170 -46021
8895 35000 -196228 170979 286189 8442 -219008 -43831 -363905 -158005 30473 -123435 250834
8883 9767 133626 -199372 -4922 59836 39820 -36108 -114362 11871 27321 196652 -280927
8871 -62013 124690 80488 -49429 -116909 -420015 -172297 -90910 6752 -358475 7380 -28172
8859 119156 -64514 90012 -20707 151998 -45417 -37164 133642 224625 52030 -419088 -160423
8847 -85544 28378 -91690 50484 -81887 376876 -224498 5636 335524 276225 241454 -28417
8835 -405509 -212553 61919 -341484 31054 -184536 -363253 -153904 -237403 -102396 196439
8824 42023 -110661 -189280 158468 110916 125684 -331207 -101422 -78928 -217913 -46752 -141780
8813 -141780 -120997 78461 -99769 -147900 187924 64871 6524 -113060 -75305 177669 -92523
8801 228661 -64325 -9577 -156007 63667 -103597 -371856 -213327 227792 182896 -35536 107111
8789 -93713 153784 188618 -111613 -122066 -310242 283353 -139061 -21397 -607676 -157800
8778 -336150 -34851 -77666 117578 229099 87395 28246 104656 -123319 -106497 173400 -111963
8766 -80422 219329 -283053 -257798 -26718 -55211 -44996 45585 -51850 -353178 -88447 88519
8754 -168155 21651 -76714 -215351 -295196 20979 148050 -34030 -65399 -114806 -247179 278256
8742 192703 -35236 -62828 -234954 58430 23677 -7371 16529 -36231 -24936 -368534 -311737
8731 -311737 121979 284 -209763 -40657 -124525 83244 -131470 -107962 233512 -308905 -189516
8720 -189516 115788 41647 -408843 -335086 174799 -79982 195547 70393 138324 -115757 116650
8708 135856 -151722 17741 -70665 -407306 -145811 -63334 -84077 -79906 43636 -523234 -51641
8696 148809 -204565 -68520 24706 -216274 -158660 11424 44636 76053 -341420 -22245 -170779
8685 -170779 347550 309560 -203081 -138300 9191 33155 -12531 -19367 -273150 -74213 -132867
8674 -132867 109303 170505 25784 57750 -212820 -234523 -240602 113439 -87528 -9384 60965
8662 57853 -284306 -101636 -230831 -359052 -445385 -1845 336698 -90925 262550 64503 69556
8651 69556 -190189 -5845 -289174 96637 -294263 -49950 -91144 -141690 -205988 -93975 -64742
8640 -64742 251289 234938 -121329 -118141 141745 29001 -109618 106500 95835 29282 101385
8629 101385 213149 113850 -171373 -7758 -306517 -8202 -138523 72364 -191932 -185492 -48522
8617 -44 61829 236551 -186104 128749 63979 -74612 -166659 -221464 -50194 -187071 88806 1677
8604 49871 -205240 -73887 10216 -318891 -215392 44377 -78985 -305982 -202767 -275125 -2493
8592 117586 -137107 -77561 -284421 -104580 -225032 -305062 241544 433785 -72609 -142163
8582 -142163 149700 333702 -56662 -107129 -286741 496266 -176189 179734 -289976 -327229
8572 -327229 -8133 -370801 6130 -99482 -211771 -10993 -128325 -353182 -30524 -321314 76146
8560 -34021 -206915 11055 -83330 63178 -65268 -313998 -144969 -116474 405136 129826 -9458
8548 -70328 -463296 178033 97354 373873 212493 -88190 21797 -130537 -92799 -305351 48613
8536 -202225 -172348 377508 -182687 -371921 -310036 -45505 -51048 77390 37243 -71339 50038
8524 144814 115369 -163448 -482849 -6524 141064 -163282 -190073 71963 -73499 -179186 128182
8512 -250178 72780 88208 -163008 112013 15277 -48526 98450 122392 109293 -89822 -38699
8500 -33502 111563 266239 -202653 -169489 -175086 -228127 31826 -382606 -94987 -117933 142698
8488 -76667 179478 -126427 127412 -22319 -170992 220781 -78944 -108409 -51035 188472 3542
8476 4132 283403 -210590 42299 -282927 -70566 -76480 -247781 -62102 -46645 59958 143165
8465 143165 226465 259556 36717 134041 -73207 89355 -105084 -103988 107988 62007 59076 6009
8452 39117 91575 324038 171929 -36026 53971 257935 139345 -328618 -228390 305577
8441 -418150 83740 41167 -220446 -181904 253648 -113139 101383 -410101 340883 57630
8430 -255384 245943 -157078 99880 -70758 30692 -18271 53202 109331 -66079 -11086 -192755
8419 -192755 -94693 46372 -78017 -181964 7476 103407 -96403 211041 -192107 344366 -70163
8407 -21160 187591 284122 -321958 255619 56253 -143330 -82604 -94994 53799 149613 -288067
8395 -22702 -548 54157 56989 81387 230121 -123691 -15868 -144538 301422 -396388 -389936 -175604
8382 523755 -202298 42299 -95014 -13498 -99965 -125336 -504079 -120515 288399 -173109 218336
8370 -155228 -341029 -90185 -66783 -207960 -186132 -138232 114838 214969 -349451 -141204
8359 -23500 -76792 -257092 -174882 -89151 -291139 -367976 -37051 34723 13692 -13402 -391673
8348 -391673 -45266 -459065 -2950 -153146 70273 -348369 -137343 -119288 12339 17937 -84246
8336 -126031 20696 -195657 -210594 -190009 -373067 -120610 -87613 -114506 -397601 193346 172094
8325 172094 181410 -36252 -125631 -116569 3684 89705 81484 76097 42103 -312359 -359904 149839
8312 -332006 172703 -127462 108306 -209548 -385699 77047 24168 -205568 -161056 21694
8301 -106563 -155585 -153005 41185 266499 -89359 76599 -151070 75232 -3832 372668 -121170
8289 190469 -117375 53083 -103556 36394 172211 -223566 -217120 -45390 -9567 -300774 79136
8277 188831 85252 -233746 -236514 -9924 54042 172698 -133506 -174664 14259 -158574 -133564
8266 -133564 -2866 52449 -241236 54427 58611 -268395 92404 -223011 22193 -121103 225688
8254 63267 -37485 124599 -198709 192920 7647 -186976 -655498 284634 -224493 -195729 -54598
8242 -214283 -67113 -342995 -134040 129288 238037 191425 -89876 249395 -415925 28878
8231 -341394 -206637 22410 48018 231310 21424 -51145 144177 -241880 -209047 78476 317815
8220 317815 109686 -1399 -283895 -347154 -30190 -353256 56788 374261 17313 -184451 26153
8208 -443781 -350261 -149862 -270520 -173762 -16728 -24773 -209291 304259 -201650 -278390 108884
8196 -106644 -166113 71494 325859 28125 -70464 -327529 39296 -307844 142450 -86650 22426
8184 2618 82608 -186887 -72655 -267173 -118751 -81243 220836 73958 -196452 -136470 67341
8172 317959 -99853 74241 -22618 -203000 -170387 45284 -340774 -38031 134006 48493 -142328
8160 -134954 103105 93550 -303660 22312 12351 -176597 -333992 -72197 17678 115461 136014
8149 136014 11863 5669 -170128 -256725 -92328 49650 -125966 14366 -142163 -49593 -54676
8138 -54676 -69988 -422218 -89243 -126618 398183 -41437 -92451 147434 48152 169412 -29488
8126 108261 66666 -65467 267733 93569 258362 40988 -85388 67165 184538 -104524 112839
8114 -196311 -121260 -23435 2697 -44304 61080 15298 83787 -215688 131729 253178 24083
8102 104621 173137 -119278 173120 67722 99826 -198301 -136417 -42533 -39257 -23410 -229582
8091 -229582 17473 54386 48042 318474 30898 27983 -30274 101770 -152691 31778 158428
8080 158428 145097 -5470 -91850 -206993 -48382 215570 -90660 632830 -244778 32148 168192
8069 168192 -184253 -195851 -447144 189036 97280 -107013 -135760 215419 190508 88066 46364
8058 46364 135498 -71349 -68456 179642 -241269 121048 -2307 41682 184440 145688 52652
8046 -157655 -207857 -99649 -172051 87407 -18369 -261763 -126159 -218864 -246615 -34025 -221262
8035 -221262 157446 30139 88181 -184113 50769 -45507 -31326 -101914 -193452 -99560 -313528
8024 -313528 163712 -182381 -138932 86820 -117532 14422 -52134 306328 -7006 -405093 -274151
8013 -274151 103891 -178715 -73069 89577 -87879 -218289 82079 -387647 64769 466144 33387
8001 -165165 -319726 -184369 279469 77885 -8979 27503 -184613 18956 -16852 -29691 160360
7989 39151 -110788 -130377 270010 -36243 -139013 -217956 9689 -138614 128535 52457 -176000
7977 141405 263377 -4791 -58193 -42357 173262 19986 -2309 -3332 -32906 -104158 427623 -49116
7964 -9538 -257863 210746 44136 253836 55594 96454 57566 62010 -141258 195230 104900
7953 104900 -97298 36826 245277 77285 -62491 328255 -342290 375732 -132332 306994
7942 62584 -220918 -320373 -149196 -378846 272635 -52455 91719 53690 -152540 -27831 -280652
7931 -280652 -324379 22783 -206580 -98495 43137 -97229 5986 -176385 -32882 -13854 -274960
7920 -274960 -183221 -88590 -60451 -138750 145634 -256346 -164648 146987 -339099 -394931 -36789
7908 100091 -127182 22648 -95550 168763 68747 -118122 -34611 -131594 202001 101891 35441
7896 93409 32091 140866 -40177 195610 -1219 184630 -358498 -238918 -80227 -180487 -44088
7884 -131685 -21750 -77614 -70981 236628 -87366 -35271 -318137 -111978 -147630 75610 -277923
7872 92834 -11075 -297844 67236 -138774 -196888 -39980 -209782 -240578 68396 -154048 272611
7860 121656 -104073 291313 85702 -266227 -95825 10227 -231453 -284682 141618 -81724 -429340
7849 -429340 28945 -30667 -77201 14098 -467514 -45130 209560 -90736 205251 -228650 59957
7837 -181391 -218026 240649 5648 241605 -275971 -130520 -122254 -1095 365534 5115 -279730
7825 161868 -42267 -279627 305114 -110805 -215342 154012 -29704 56735 -53510 17133 221279
7814 221279 -73297 -275591 -194658 -165832 335734 106482 -3721 -347990 44503 -287303 100628
7802 -46869 62667 343503 -144309 -375719 -36078 76721 -82949 86972 69351 118215 87977
7791 87977 -118251 -95347 -80591 156981 -41227 271133 120170 29618 -171776 571198 -57379
7779 152297 -120079 -143240 -261561 8671 89676 -10756 53541 -21346 -56540 275637 -274369
7767 82013 -301224 -12030 -159219 18966 -80947 18957 -64609 231697 -88384 -89683 191124
7755 -103601 -183399 1222 -177020 245594 131366 284744 281265 66333 77089 -212670 -79092
7743 56470 -84540 -74367 -221127 -85255 -165966 152218 81987 13439 -102892 -155415 39088
7731 51398 -163041 -326171 -306111 57604 -31273 85669 65566 82777 41660 134018 -12027
7719 -272699 -161230 -48017 -171816 -200529 125555 211719 -152238 -117849 -118968 252767 -63895
7707 -141309 22183 168296 94827 -82678 -217931 63308 127133 -78137 -58809 107479 -279459
7695 -57760 -130393 36051 34026 -24600 -311431 122582 -39667 -126336 164622 -183224 -261966
7684 -261966 -13193 114 -114294 66580 50268 39097 -12526 80955 -357963 339772 -342753
7672 -198050 6824 -142982 104628 -284536 -10579 181328 -352696 -128719 5214 112679 -59565
7660 -195389 -28512 -95324 46651 -205061 168983 20033 -296506 29073 -212845 -145684 -221028
7649 -221028 162783 -9639 30158 83153 -46016 -200281 132 -39306 88903 -84767 -254273 35091
7636 145639 -68486 123693 -122154 21583 -5539 -36311 -75511 -185109 42140 -12321 40866
7624 -2395 -123186 146514 -78697 99818 -211554 -203736 -139972 73681 -267186 83260 -46862
7612 -180300 -141050 -150795 33036 -18895 -125361 16236 -391170 -34704 -373628 191599 -207114
7600 215350 -501576 374538 24714 -145407 191536 -104874 150371 -75297 27496 -66664
7589 -53956 16746 -68629 223025 -147896 -177892 81014 -192892 -274092 -5413 -76072 -233778
7578 -233778 -316474 -175732 57816 -145735 43562 245575 -139527 -154435 146144 -134250
7567 -118261 7214 -160175 215 39050 -285229 -34390 296923 -187280 92873 -248700 269963
7555 110313 147511 -92197 274966 142207 198189 120671 -248541 195770 -151710 -161756 -274522
7544 -274522 -499014 160378 102071 -107757 -262456 146017 -142351 -324205 -211790 65057
7533 -190502 2479 -74913 -93746 149784 156219 181196 -72680 91192 215992 -42518 24216 -116783
7520 -220709 -2742 -454161 -16565 345866 -151809 39779 82770 -198969 83319 -12893 -188207
7509 -188207 -2004 -158844 141691 26123 22282 -81688 -54131 -102249 100013 32638 -239641
7497 191263 26858 -38950 -254151 -148260 -39524 -41482 -143460 -112038 -186138 -47793 76582
7485 74224 124449 142575 -83397 319672 -109569 -184728 -279551 70184 -147006 194106 100965
7474 100965 -189567 -77669 -65355 -24414 -5151 198035 -34730 142886 148917 157698 166008 -165188
7461 -166373 -32788 -176917 162770 75421 -82548 -23380 -224101 118466 -145551 -34681 -273335
7450 -273335 -103805 209317 292236 -30321 -36667 69646 -105866 71401 -213487 -96034 -143735
7439 -143735 237581 -36526 -127555 -32885 -200280 -49026 -53011 -285600 -10179 173313 49993
7427 66344 96078 137173 50501 -41117 67795 -21500 -187526 -441117 -195660 341575 -192956
7415 -339898 122701 221733 216256 -38710 -81445 -300167 84408 236200 -23766 -2143 110469
7403 -269906 42126 -70318 119850 354625 -170789 -150875 -308142 -210301 -47003 -56022 -152383
7392 -152383 -37934 90578 -112173 -224873 -196181 -147736 -250348 88225 -163775 -171229 109316
7380 -162869 58029 -110055 -52889 -28577 -111622 -55408 -34781 -189186 -84532 -119462 10280
7368 -28655 -382426 -174545 52791 -134599 -127241 -175489 -242763 -338406 -20079 65433 -212365
7356 -113746 -52850 55969 -155085 302192 -183421 -380139 -215192 -516251 299261 -11028
7345 43215 120614 -179229 31679 28579 216510 -181142 359705 112692 -154872 97555 -106503
7333 -8556 21724 -2714 -46197 -52957 105169 -9500 -309095 -37824 33125 -67784 -136757 204783
7320 -52280 166858 70866 -13517 108051 -11321 -76371 129890 -124161 -287573 25657 20512
7309 20512 -40511 166177 104606 186938 60704 88902 175896 -187065 -182401 265061 -80936
7297 -329490 -14612 32607 -261859 355400 160674 -43631 55692 -71245 79475 109689 44870
7285 -162115 -69918 40575 -35179 258275 229931 24373 -90187 57936 -87205 -139036 125573
7273 258657 -183539 141864 133842 132696 323640 -89414 67466 7084 309743 32680 89287
7262 89287 -178568 32408 -62917 -84537 21298 195901 93537 -149744 -51901 327868 156752
7250 -33467 102445 -5780 -111292 140237 28346 -128678 -57543 43342 -112159 56574 256035
7239 256035 24674 -192753 -52141 -144927 7444 -183666 -141749 117899 92154 7393 -57763
7227 32938 -85224 -87720 97303 -76195 -32151 -185878 -253983 -127236 107084 -168068 -47685
7215 12171 359863 167799 -17922 40903 204504 75484 58280 112043 62147 -133367 -203401
7204 -203401 -142267 92748 -59823 -93974 272877 -107294 139942 97978 -261213 -304329 33702
7192 -341698 -167345 27165 229062 -255809 79685 167287 -22777 123976 94952 50523 188379
7181 188379 71097 -117227 187398 -166351 -105849 -77708 -133372 78418 126528 41015 -255811
7169 354514 116088 229653 -173345 -98096 25174 46336 70894 -15650 129184 -151698 100569
7157 173503 165043 -147746 66318 68210 -70231 -218755 57101 -177974 149920 64993 -147388
7145 20017 48234 73607 -243977 -29577 135677 -7680 38358 -229966 14912 125320 -22512
7133 -49927 338619 -76746 -64717 -116678 -219161 71271 -150639 89718 226142 236792 -133771
7121 -269834 -93024 -88401 -307360 146197 -131901 -94300 -74319 -84854 -163193 -98190 -29873
7109 -250403 168052 125947 181723 132265 -21127 77865 272872 48437 190901 126725 -3258
7097 -471092 -100125 285638 -193430 92676 -226215 -107931 201645 -66847 -145343 292301
7086 -73955 -12335 19123 -93080 94371 -212376 90156 -141540 27524 -184168 59368 196820
7075 196820 96110 -207657 -274594 254688 -280410 -169582 -250427 173287 -186835 183386
7064 -58316 264241 141790 -199977 208800 156346 -5488 -50144 -162999 352355 344169 121320
7052 -40607 -191032 -185359 -283345 25960 -272255 -226877 311087 79431 -11260 -42494 -37816 -307958
7040 -307958 -225312 160752 135799 122335 -293137 -31326 62550 -6506 -81519 51457 -272602
7028 -240470 -172697 -42022 -65430 -234393 34643 -23024 4656 7083 93465 -14248 -29151 -328757
7016 -328757 129005 -40228 -39248 116752 73276 -89428 60990 -18653 -241092 -112052 7248
7004 150262 -74109 227587 -139827 143556 -176772 -184593 -37276 -190568 -15579 -96073 144455
6992 -13630 12884 -153558 14155 -252475 -67059 3795 -64090 -32886 16961 46414 32475 -342082
6979 25063 -200265 -258773 16303 175671 -41976 -252 15238 193162 59293 164406 -145212
6967 -134123 -259419 -43630 65713 -315283 252574 -291950 -230514 93274 182442 -6551 -187561
6956 -187561 160757 -42888 -57248 -75204 -61683 -12779 -357205 286752 236017 93757 84588
6945 84588 93953 120011 -86214 -250965 -140132 307811 317692 -81138 -206809 -315454 -56752
6933 73633 78646 -190556 -49589 -100236 -129589 -1511 -43118 -123242 117221 -312361 -170357
6922 -170357 -80037 -122506 87717 -169155 181394 21326 -70039 126103 -84945 37438 -232952
6910 130813 52428 4917 137726 -975 65634 -369111 -102453 2547 -31919 -19239 -153497 110778
6897 147408 -38504 71306 -152073 -174256 166347 185541 -2984 -257725 124778 -142898 -136772
6886 -136772 3504 -212420 59537 -284387 -131366 113437 -140920 227280 -211633 100765
6875 -47495 93500 -207650 -77672 -159352 -41891 -130319 300106 192452 -274941 283985 213022
6864 213022 -23362 39747 -38331 -371061 158625 21672 34487 -93738 166130 5760 -200375
6852 243461 204469 -6166 76153 -82743 -228328 -75064 -115940 -70022 277315 -18125 -13543 333916
6839 151653 223090 -56466 -86619 207468 -170543 79186 -136179 -9184 -178673 61640 218892
6828 218892 -368810 -76519 -221366 123204 377286 448 -144022 -121481 133038 -2122 -2742
6817 -2742 -203036 -25976 49619 146998 66006 -184222 -82169 199162 386862 -237492 -46724
6805 -152033 79715 -19781 5529 -146254 -176186 -80742 -202494 -2129 -135728 -6486 11918 -47984
6792 23147 7980 -171035 184655 -156399 -81314 -165955 -133567 49595 -80992 -165580 -223870
6781 -223870 92864 289672 -113992 -119393 -124726 178249 242566 -98171 -9342 341199 -211786
6769 -117676 45039 -176317 322038 -65700 78956 43011 -46821 226177 -59572 13171 134379
6758 134379 76414 -256585 -78168 -80348 -116428 175224 109459 26943 -97143 -74450 -25491
6746 -159392 164267 80999 -135137 88614 -25462 -137290 -95938 -10710 199026 66015 -206546
6734 -204301 62879 -75298 132317 -46936 -463640 -139772 38012 -106415 -6231 -71981 78991
6722 -164721 -168766 -178862 -47760 -279269 -65908 35951 20807 -69744 -106342 76794 48377 257056
6710 257056 -168688 139443 100657 138118 153453 -320752 28390 -99525 -161266 207065 -24621
6698 6961 142145 -128163 -2687 -178706 8111 295589 -141051 -134584 -140506 21842 113639 77129
6686 77129 105134 84609 15156 -58059 -58586 -115835 -111071 -272819 -234331 1542 281747 200740
6674 200740 -70278 7349 -65654 -135118 -449165 -193569 79919 218835 325537 -119407 -71078
6663 -71078 137415 -312311 -158458 62024 -26601 359052 -114363 -155393 -38183 43671 -105702
6651 -193555 -109644 -147754 -33674 112789 164051 -134239 -73062 -55782 2742 -237573 190556
6639 -17582 -103439 86750 -238396 -133006 131256 -340425 -76561 -8655 -386845 75305 156417
6628 156417 217839 -319698 373823 -171833 -201540 35278 62445 84513 -95680 -32648 -29139
6617 -29139 33135 265476 -24941 -135808 186850 -24133 -258286 -92240 132546 -289606 154906
6605 266601 70252 -134040 -160442 -137532 -68575 -64815 -86955 36599 -315507 65651 66297 65414
6593 65414 -205410 190357 -25456 -106391 -246981 204248 7514 171402 -272279 109013 -38050
6581 -162258 150519 -130482 -184447 -356849 -62693 -457766 258165 73172 -252593 204351
6570 3105 -23443 130150 241200 -42773 73943 -268422 -148289 298043 53968 178225 65924
6558 108543 -138138 -52258 141088 -139975 78407 -59729 -54108 -28059 -25148 121711 144654
6547 144654 76394 147676 584 -146168 221478 -62258 -312076 357747 -143935 85365 93617
6536 93617 -89790 90603 130490 265242 -226038 14356 -211816 51577 -107649 372902 185216
6524 103336 106847 -119175 -41870 -7554 -64872 -167732 41827 -152654 86844 -133290 48465
6512 -252806 -135977 229503 -27953 -18778 -125774 252283 -9397 13509 -3006 36082 -131551
6500 54899 73393 -185837 106220 -181215 -243224 -73468 -29069 -36108 237135 -26879 312048
6488 -159665 18933 -21224 -296499 21107 2627 -4179 -218899 -25341 -177969 -223728 -56802
6476 204652 -405000 183153 -102887 65784 152680 94353 -126601 3031 -122654 283667 -41979
6464 -23356 -294367 146001 -256027 409277 338415 -7494 -142128 -120177 166025 -68086 60409
6452 -89897 67420 -81390 164775 -179258 69343 -330997 8409 30520 -318716 198826 327988
6441 327988 -279658 -125885 -429573 79652 178160 260517 -132380 -99203 301175 88172 49153
6430 49153 -163245 -355628 176897 39928 -240608 -49695 106326 -351262 -33067 -77704 -115023
6419 -115023 -121196 46514 284052 -66431 -217729 149806 33438 -26750 150821 -124462 325175
6407 230039 -502584 -279126 84018 91747 5287 78111 118100 107633 -6692 -154411 139768
6395 -123118 -128514 163132 -83388 -239962 212705 -248890 348870 -29757 279697 77484 -64749
6383 -194929 37150 93100 15076 -64222 80007 139001 29418 -135388 -35485 63325 37043
6372 37043 32420 -64666 52182 65456 272135 -78224 -293430 306133 162323 -149843 41559
6360 -24996 86053 -85819 246277 -274676 -79867 -214636 -193288 114152 -149611 -40736 147030
6348 -117540 -218062 -149479 238603 266491 43377 146182 29479 198099 167528 -17273 -151633
6337 -151633 -78254 121570 70632 70958 -203888 -281445 109042 -16018 256745 84946 -156408
6325 -216026 94603 171379 157556 -164524 316940 -35811 103106 -43588 192854 -51771 72923
6313 -156451 -296372 -59400 75547 273262 -132860 -54263 288637 122489 11741 45365 28870
6302 28870 43513 -134712 -95966 106255 -27138 -6816 103044 -97923 -244860 327621 296560
6291 296560 165688 9216 -28701 227040 365150 153601 -172699 311684 -5131 110290 -88103
6279 255416 -436752 -65576 -101711 -136451 -57123 105558 358 -103438 -98916 -65990 -33808 -69444
6267 -69444 -120611 103886 69759 -160834 -120370 81890 -354180 -327845 -182512 -253039 -254467
6256 -254467 -252483 -182236 420906 197792 -132237 -49128 -165614 -313065 -63202 -154687 71416
6244 64968 82198 -120005 -116554 11871 -185533 -68050 439050 -93481 -29041 18870 344032
6233 344032 44705 42329 -226075 19922 268658 -73471 -254275 -526351 90838 -53409 116988
6221 -145107 -242420 -91281 -98257 -110515 376 -336074 28 -154896 148829 -75249 228211 209979
6209 209979 47866 35605 140316 192494 -87203 -98456 -65856 122040 259704 -24976 -166629
6198 -166629 -64725 -208594 -125397 55757 -95839 -97026 292546 -400776 203356 495746 -1328
6186 -25590 -51560 64621 -96645 -284465 8018 200355 2773 -185280 152024 -278329 255230
6174 113057 -42492 -247188 180129 -109293 40610 22485 -72116 371384 -163350 152985
6163 120327 -27187 -231572 93106 82763 -34254 166418 17239 -447089 242551 361421 136847
6151 194659 -173238 -224414 84135 47779 179412 -214291 -159001 304472 -366966 94352 214592
6140 214592 62674 248127 -4839 31420 113162 171260 83616 72128 167024 -69880 -202381
6129 -202381 -201442 291823 -74303 -286665 -259797 30872 -216343 12881 -278414 77943 116669
6118 116669 285683 -263083 -83484 357068 73691 352733 -102467 63046 -90402 177123
6107 189808 -582521 161773 115620 -152940 287843 58988 144131 -83824 48642 242257 141920
6096 141920 520227 -105870 -59364 -11436 183522 167753 -107918 -80533 -52963 -151558 149146
6084 225351 136904 226655 83226 67230 -141925 -86653 296929 126001 285525 168047 -433994
6072 -492057 -39794 129374 140796 -179695 -163167 -48786 -99776 309880 -365619 69933 98701
6061 98701 20781 -348515 -391531 107376 -125125 -243819 269602 122296 20940 231748
6051 231748 -103776 16090 -88843 -33719 130662 107397 55827 -150491 -63238 -127931 -141108
6040 -141108 -68363 -75636 -41712 -15936 -94959 -215706 37661 50160 -141124 -111417 80589
6028 -22903 87320 -230195 -170686 195156 114695 37585 -163494 -119993 -234686 -218677 -148953
6017 -148953 -68583 77294 82480 -263282 29778 -223997 167415 -279379 -81110 45829 -107433
6005 83599 159856 -5855 144198 6616 -284404 -229668 141835 140825 430736 -73602 261334
5993 207178 276655 -121374 234492 -67235 -8 -203387 -106895 -159177 110958 -168257 -215434
5982 -215434 47215 77351 -342755 -72767 143353 -244316 214491 160937 -158894 72686 168785
5971 168785 113131 177777 90458 213467 6359 -23688 -54634 -9547 157018 -10316 -257501
5960 -257501 440635 127531 282969 -50294 -133951 161216 -40617 -29315 84093 132658 -4857
5948 174605 138056 -83342 -33545 -29870 11932 -144074 -76079 359207 -118456 -264232 336330
5936 -40442 -120070 4511 -145303 40069 3901 -82332 -180267 169798 -324197 45631 -128677
5924 127227 43532 325256 157211 62192 210978 -348891 175605 231203 197495 45739 -181207
5912 276220 31818 175080 17503 -315981 63828 85137 -224774 -74061 -218461 277183 87474
5900 -41270 74113 37768 173280 322382 -196271 338849 -76239 133863 3288 -8636 -26881
5889 -26881 199139 88396 73937 65775 -45881 -78513 -76479 -13204 -313103 250549 -38528 46348
5876 170231 512880 -39110 -157303 -7913 -351697 218910 193825 -255594 194619 -26175 -226153
5865 -226153 -211329 273352 -69595 -230436 -215391 283354 -156245 -139713 89165 -275759 74089
5853 -221671 -25074 -7214 403029 -105541 -189348 -35762 151014 344594 -6002 78749 390410
5842 390410 35768 -165221 -234696 21260 -7704 -153585 215460 -269966 59982 4708 -187540
5830 -1072 282360 133794 105160 24300 451177 7883 -160977 -4511 -10291 216399 24035 -58983
5817 94261 -131245 57303 159027 -104403 -189220 32823 247722 -112868 -66577 -245381 -416584
5806 -416584 -35350 35065 189212 335403 -56068 70275 52598 232258 -83515 130369 -269026
5794 92096 -34501 -127580 -3 -212343 -214076 104593 -158158 69523 43296 144096 -119200 153003
5781 -311486 -26063 -51668 -173879 95547 -134583 -106401 -53596 -114467 -113347 85459 143169
5770 143169 -75488 -157396 -183044 161507 172805 -131033 -211186 -174529 429828 -256262 112809
5758 23901 78860 33312 82570 28259 -55135 -374206 -70579 -106443 -28199 88706 209431
5747 209431 -100405 -125856 54051 -23905 -141784 287454 113161 33806 243957 135424
5737 135424 161246 374266 -232825 77433 15186 123191 -89102 83246 -94803 -50161 -72030
5726 -72030 138634 36438 -219014 -272827 -18615 91892 -62840 -126227 -256310 -288041 237792
5714 -228673 -97263 177494 -73431 433032 -24344 -92738 -203203 218236 34411 -249140 -108920
5702 -211968 -224387 255308 -66394 106718 -167032 -70059 -58713 204284 216433 40611 -145387
5690 -161267 17150 71244 98420 83133 -250926 26210 183404 147294 188978 -108565 9107
5678 -219166 48838 -206791 -103173 -275091 81365 -102792 31295 -169715 11796 148816
5668 148816 85657 300423 202228 -37230 56735 -6081 12583 175933 -273056 450374 163800
5656 -84414 130676 -246966 -155379 -58340 268588 -137745 55930 -120641 156495 76192 -50704
5644 -145554 167053 241193 150095 85105 199897 -78974 113674 149116 -106684 88821 -259148
5632 117500 -9389 -21906 -13103 167639 84248 -158346 -220175 3416 24728 -80897 67536 7471
5619 45397 17207 -63059 1156 -31321 32694 140427 15559 -132386 -130492 70503 -186295 50890
5606 -70845 311981 -186267 -83364 -107 425530 -114060 311818 -353752 -86353 106040 -144285
5594 124874 64943 55578 272400 63498 -16711 -54223 72487 -214564 15555 -90646 -193019
5583 -193019 19767 -275815 -52863 65877 292720 -26424 75947 103158 -106498 51048 -209154
5571 -121504 155665 34889 3097 -117068 74830 423669 136936 28217 140876 -160563 -235738
5560 -235738 -64009 -115710 -121883 2032 -6060 84523 361241 -142665 244605 334097 -220549
5548 77983 -189200 30162 113601 -92447 220110 -65265 182050 317607 -87118 -29537 -146184
5537 -146184 -34492 -71723 163050 279267 146102 -252311 123453 111523 206913 85841 105645
5526 105645 -202696 -398568 -182209 170500 58583 -22478 27870 -159832 -208569 468581
5515 294239 -192824 137346 -68339 54241 85002 -48570 -210349 -78588 138144 95294 63423
5504 63423 -22936 -193739 195433 43655 -504292 -155171 120574 -206423 89217 56760 35760
5493 35760 -51377 -119104 -191599 246504 232582 188752 -151286 -369106 17476 33496 109396
5482 109396 -180699 -54572 262351 148117 149081 322739 139000 101090 -146907 171881 398665
5471 398665 92536 283013 -191967 162627 56625 -1690 -55755 -85047 -36222 -257191 -36964
5459 487851 -136427 306299 -280358 16728 -40254 40297 -228357 251739 161671 -17038 -19022
5448 -19022 292239 -264978 314296 29291 -230838 -94839 120414 -75209 61061 -81079 18066
5436 -165232 49024 -184618 -237163 225659 142135 1399 -13095 -228791 117392 235555 -86726
5424 852 7742 -275652 23905 -182554 -65542 63242 -187201 -106351 348293 -185796 -74073
5412 -187640 -103062 -381526 -223798 177299 -363854 27974 334505 130036 -178568 92910
5401 17313 246714 209478 256781 -189219 24481 96370 193197 102695 -82650 -39392 -218819
5390 -218819 22313 115539 -258762 105896 -19884 245055 -93193 -51765 211341 73173 403909
5379 403909 92803 -65254 6888 156387 -308676 -68597 111014 118695 349212 32189 158232
5368 158232 70011 210102 -28087 320424 -132646 -293568 83913 36420 49052 -127210 -78795
5357 -78795 -119846 48291 -244798 131206 207128 77221 -246294 -87169 -283677 4647 63410
5346 63410 -242473 -16098 -147491 -25498 -302170 117651 79287 2744 300664 -73505 -191255
5335 -191255 229920 278911 -19463 -239239 146785 -31308 -487153 -40286 208133 49140 235414
5324 235414 -268192 287236 -292057 -131000 -264185 36058 93704 133995 203800 71488 266721
5313 266721 -65220 6869 -8425 -527232 -116841 -76613 74491 -112106 382579 52729 -76379
5301 198866 -172691 -191850 -110989 -61638 -230263 -37913 -250249 -150363 20320 192843 -31942
5289 -297591 76365 91000 27257 -67784 -440674 -148050 -230326 -141082 35838 -59327 250455
5277 211283 158109 -43012 44361 5931 -102544 20245 130635 117515 10345 -137368 -115919
5266 -115919 -165425 286 107454 -262391 267993 -188559 83766 60530 -36663 6591 301877
5255 301877 -40327 244993 -49448 41316 100766 214588 -13452 112372 -107369 -92382 145210
5243 26785 82815 71721 -167261 -211193 -74330 566383 195154 -11636 8004 -140491 -341375
5232 -341375 87176 105856 84454 275322 275941 -17280 -96296 -130145 -110907 -113325 243037 -129056
5219 41576 -206997 10213 -12500 -208573 96022 285759 -42292 386204 309936 -217335 306993
5207 34820 102734 -45593 314395 227304 291749 -214982 -340739 85250 248988 -229282 147537
5195 -193537 -72938 -153761 -242645 29374 -208723 93880 118053 -256857 193979 59327 235339
5184 235339 198653 -831 29411 146397 -119972 105989 -158703 71600 39496 287331 -257992
5172 3328 75078 -79299 64261 41630 16588 47636 -254885 -10706 91753 181056 -174454 -367077
5160 -367077 119928 -17929 -281488 10062 57808 38405 41352 -213477 11268 206733 64791
5148 19430 174076 -9256 25922 149248 -56218 -252807 -274296 239959 69107 -235833 -93331
5136 59201 48253 -272357 111113 -107921 -107483 -250077 367705 -152203 -216414 189928 391976
5125 391976 -280418 96017 -121396 -60695 -151224 -57193 76607 169735 17862 133732 387469
5114 387469 78320 -53898 142054 -30419 -26080 -137525 -177902 204262 -159424 59787 -54673
5102 -380321 -29927 251634 -56215 -73379 269078 -262422 -80294 3095 157803 -228066 215816
5090 -120120 50386 -106445 -58677 -22549 221404 -13911 355984 -40263 -94073 -8104 156246
5078 103707 56463 -129496 -279773 362669 298231 10661 144173 237393 28082 -88436 -96103
5067 -96103 -82519 243249 -253864 -181578 13151 28208 122010 -112038 -56728 42101 50100
5056 50100 16928 305920 -105443 237283 -37356 -146470 -121981 27879 190164 63014 99224
5045 99224 275136 -194456 -91133 219402 46479 -300058 -138042 274392 64331 -214282
5034 73420 86520 16263 138106 -34132 -420513 -52167 -55814 235485 136703 -299000 -107149
5022 243031 115034 27596 230251 113375 -380806 61825 206076 -420663 -39981 49862
5011 -12890 -40870 -104989 -230813 177773 348385 -82446 -112064 80776 -18136 -8791 81901
4999 -148350 193291 -4567 -30207 -94842 -143211 -40814 52258 -55865 238605 -354081 164201
4987 24947 -321093 -114800 -102930 -158787 183128 238719 4763 101607 -294383 -32618 -11902
4975 109048 80231 -94588 134473 30761 42712 -359380 -56421 194206 -61938 109670 -46615
4963 14078 -69060 395650 236324 -223587 -282721 218000 -90600 -184856 -12533 56383 91006
4952 91006 47227 159832 12916 200845 -150586 147322 166903 7676 208375 59385 -187033
4940 127413 -124422 -178987 156299 93352 127900 10731 75144 48459 -175248 82531 86908
4929 86908 -167504 -217100 -36826 -2340 -46684 21692 169744 -173895 -114131 60409 -158601
4917 145957 57376 -163084 -210875 -99145 -222091 -68524 73343 -10159 -30159 40384 -49 127309
4904 -117957 144827 65484 287128 -283744 -258001 -303209 -251141 361389 -24782 -398863 90920
4892 -19469 196702 -105384 -154093 275481 -63819 17964 78727 121605 -7645 216297 303524
4881 303524 -153606 184926 158419 -396374 -180932 156928 -1396 -233485 227300 -98837
4870 185336 -62080 153157 -211083 -113847 190787 -410935 -219998 252362 145109 66901
4859 -139195 5765 -369218 -43589 17572 108986 274561 -157803 -34753 -277667 27167 -173113
4847 -34805 -94607 -43129 143783 269381 22182 -371760 136964 -93528 -41634 -19800 196226
4835 105239 248287 213659 131475 231606 -227352 -75073 23 11356 -203758 29917 156173
4824 156173 -251255 -105293 -218444 203846 -351165 176294 36227 45100 -38307 -118369 336980
4812 -67233 109386 -70700 61062 -84356 -174190 -100094 59309 -207968 164396 285225 -99179
4800 163666 133763 140900 98280 136609 -97556 284476 40333 -117338 238887 41149 149165
4789 149165 153122 73350 132154 200780 183607 -140960 288302 24258 74355 138727 298230
4778 298230 86745 -45145 -145262 -204623 74586 -151849 257408 -57251 48186 -35227 -314449
4767 -314449 -142944 -124222 45866 315661 23025 120361 -11260 130631 390434 319383 -22544
4755 16353 -195625 -184159 207858 318032 30401 263969 311678 16978 81303 211867 -75693
4743 42567 226593 -142390 175206 -364914 21860 15640 17634 151921 183080 -89363 85866
4731 42714 -47815 -193717 196549 -52922 29359 119243 146298 111776 -209562 -83701 -121206
4720 -121206 23636 -46985 116778 -224097 -142402 98226 -159357 -123652 -77022 -258849 44392
4708 18224 408496 -74988 -81640 119128 -138138 265038 -130053 -154358 130605 136812 -345878
4696 -52692 425691 -22357 -198627 244303 -5344 -11682 220906 105085 16885 -231738 35733
4684 43540 -137715 147748 -198920 -172557 -99770 131444 201247 215410 -73478 364866 267731
4673 267731 55247 -2981 -70451 -220237 151951 389554 -37694 -25814 -163342 292423 509086
4662 509086 170777 132666 113845 -79408 24345 -72816 -22956 -114211 41564 -161537 236050
4650 217760 -41238 1079 128590 72344 -296974 -53993 60060 72079 43136 62476 -65672
4638 307305 64325 -271514 -116899 -83836 -33545 173648 11998 271153 -68382 -51108 101021
4626 -268563 -83708 -254554 -19865 -26454 24379 -29609 36915 -141720 -1960 235159 -350393
4614 -153865 -58288 121411 -13902 317311 -81963 64881 -57173 -252253 255114 -98691 -213173
4603 -213173 162402 -306581 178223 -46116 -108104 71136 119821 250248 -132217 -21291 93267
4591 81367 -196700 -230838 -138041 -146221 -228235 -407750 -143224 213289 61558 164813 160792
4580 160792 40714 -115881 136923 110093 -14008 -173809 162533 -63725 214223 -5186 -214516
4569 -214516 153072 5812 -197464 259124 -166622 -40369 60330 53430 85804 90193 -35190
4557 270090 346351 75028 -37001 279396 237635 -76743 -166569 5876 -129519 -109000 130751
4545 63463 5170 -109792 34804 101424 1210 105900 -84597 251814 61296 352528 164514
4533 -412317 -17482 -69401 48520 1084 253055 -49244 -77494 -291394 130683 -89303 -57908
4522 -57908 150558 -118848 -287148 -174048 -196232 -298944 37554 -26159 137863 -68966 -44345
4511 -44345 28025 -115195 142998 160048 -196289 25183 140015 53557 167331 107792 -190452
4499 120672 117999 70872 -150854 73981 95601 -262166 120647 44594 42821 194897 -176516
4487 176729 -6207 222882 -270241 -203890 -68687 -112440 26060 -201453 -107262 185188 30926
4475 131063 -221395 349552 245937 -118321 170747 -201654 51609 -113398 35958 -152729
4464 -217659 -298253 163275 10152 -157328 82777 117707 -117731 -22639 -45447 51345 33209
$$ [...]
##END NTUPLES=NMR SPECTRUM
##END=
