
##TITLE=AC1406_BRAA12215_7653149_5PJ1xK5njd
##JCAMPDX= 6.0         $$ Bruker NMR JCAMP-DX V2.0
##DATA TYPE= NMR SPECTRUM
##DATA CLASS= NTUPLES
##ORIGIN= BRUKER
##OWNER= Administrator
$$ 1.72 TOPSPIN		Version 2.1
$$ 2013-03-20 01:54:09.374 -0500  Administrator@X
$$ Compression mode = diff/dup
##.OBSERVE FREQUENCY= 400.02188249412
##.OBSERVE NUCLEUS= ^1H
##.ACQUISITION MODE= SIMULTANEOUS (DQD)
##.ACQUISITION SCHEME= undefined
##.AVERAGES= 64
##.DIGITISER RES= 22
##SPECTROMETER/DATA SYSTEM= spect
##.PULSE SEQUENCE= noesygpps1d.comp
##.SOLVENT NAME= COFFEE_meoh
##.SHIFT REFERENCE= INTERNAL, COFFEE_meoh, 1, 14.96086
##AUDIT TRAIL= $$ (NUMBER, WHEN, WHO, WHERE, PROCESS, VERSION, WHAT)
$$ ##TITLE= Audit trail, TOPSPIN		Version 2.1
$$ ##JCAMPDX= 5.01
$$ ##ORIGIN= Bruker BioSpin GmbH
$$ ##OWNER= Administrator
$$ $$ E:\/data/COFFEE/nmr/AC1406_BRAA12215_7653149_5PJ1xK5njd/12/pdata/1/auditp.txt
$$ ##AUDIT TRAIL=  $$ (NUMBER, WHEN, WHO, WHERE, PROCESS, VERSION, WHAT)
(   1,<2013-03-20 01:54:03.546 -0500>,<Administrator>,<X>,<go>,<TOPSPIN 2.1>,
      <created by zg
	started at 2013-03-20 01:42:33.749 -0500,
	POWCHK enabled, PULCHK disabled,
       configuration hash MD5:
       86 BA 57 50 F2 9D 5C 9B 26 00 A9 28 5F 66 2E 89
       data hash MD5: 64K
       12 36 D7 64 1C CA 93 CF C8 2B 70 5C 29 B1 2C 36>)
(   2,<2013-03-20 01:54:06.624 -0500>,<Administrator>,<X>,<proc1d>,<TOPSPIN 2.1>,
      <Start of raw data processing
       efp LB = 0.3 FT_mod = 6 PKNL = 1 PHC0 = 0 PHC1 = 0 SI = 128K 
       data hash MD5: 128K
       F2 1E DB 23 CB 2B 54 B4 52 63 F1 14 EF ED 92 AE>)
(   3,<2013-03-20 01:54:07.687 -0500>,<Administrator>,<X>,<proc1d>,<TOPSPIN 2.1>,
      <pk PHC0 = -81.81519 PHC1 = 0 
       data hash MD5: 128K
       E9 B0 E1 B8 4D 38 22 A4 FF D6 66 04 34 36 32 B8>)
(   4,<2013-03-20 01:54:08.312 -0500>,<Administrator>,<X>,<proc1d>,<TOPSPIN 2.1>,
      <abs ABSG = 1 
       data hash MD5: 128K
       A7 DE 2C 54 62 79 C9 39 AC 57 7C 49 30 82 4B 9D>)
(   5,<2013-03-20 01:54:08.499 -0500>,<Administrator>,<X>,<proc1d>,<TOPSPIN 2.1>,
      <abs ABSG = 2 
       data hash MD5: 128K
       B5 70 52 C8 F2 1C 0F 0F 3A 25 21 F5 DE 94 32 5D>)
(   6,<2013-03-20 01:54:08.687 -0500>,<Administrator>,<X>,<proc1d>,<TOPSPIN 2.1>,
      <abs ABSG = 3 
       data hash MD5: 128K
       53 80 28 5C FD 75 AC FB F0 29 6B 68 06 A2 08 69>)
(   7,<2013-03-20 01:54:08.874 -0500>,<Administrator>,<X>,<proc1d>,<TOPSPIN 2.1>,
      <abs ABSG = 4 
       data hash MD5: 128K
       CE B9 98 E9 33 98 AC 3F 15 3D 67 05 63 05 21 11>)
(   8,<2013-03-20 01:54:09.062 -0500>,<Administrator>,<X>,<proc1d>,<TOPSPIN 2.1>,
      <abs ABSG = 5 
       data hash MD5: 128K
       99 66 B3 4C 03 B3 CF E8 74 BF 5B A5 30 EE C0 16>)
$$ ##END=
$$ 
$$ $$ hash MD5
$$ $$ 19 9A B6 19 A6 F7 79 C7 83 6A CA 04 FD DA 45 EC
##$RELAX= 
##$RELAX= 
##$RELAX= 
##$RELAX= 
##$RELAX= 
##$RELAX= 
##$RELAX= 
##$RELAX= 
$$ Bruker specific parameters
$$ --------------------------
##$DU= <E:\>
##$EXPNO= 12
$$ [...]
##$TP07= 0
##$TPNAME0= <>
##$TPNAME1= <>
##$TPNAME2= <>
##$TPNAME3= <>
##$TPNAME4= <>
##$TPNAME5= <>
##$TPNAME6= <>
##$TPNAME7= <>
##$TPOAL= (0..7)
0.5 0.5 0.5 0.5 0.5 0.5 0.5 0.5
##$TPOFFS= (0..7)
0 0 0 0 0 0 0 0
##$TUNHIN= 0
##$TUNHOUT= 0
##$TUNXOUT= 0
##$USERA1= <user>
##$USERA2= <user>
##$USERA3= <user>
##$USERA4= <user>
##$USERA5= <user>
##$V9= 5
##$VALIST= <valist>
##$VCLIST= <CCCCCCCCCCCCCCC>
##$VD= 0
##$VDLIST= <DDDDDDDDDDDDDDD>
##$VPLIST= <PPPPPPPPPPPPPPP>
##$VTLIST= <TTTTTTTTTTTTTTT>
##$WBST= 2048
##$WBSW= 25
##$XGAIN= (0..3)
0 0 0 0
##$XL= 0
##$YL= 0
##$YMAX_a= 6104550
##$YMIN_a= -12750494
##$ZGOPTNS= <>
##$ZL1= 120
##$ZL2= 120
##$ZL3= 120
##$ZL4= 120
##$ABSF1= 14.96086
##$ABSF2= -5.597322
##$ABSG= 5
##$ABSL= 3
##$ALPHA= 0
##$AQORDER= 0
##$ASSFAC= 0
##$ASSFACI= 0
##$ASSFACX= 0
##$ASSWID= 0
##$AUNMP= <proc_prof1d_extract.lims>
##$AXLEFT= 0
##$AXNAME= <>
##$AXNUC= <1H>
##$AXRIGHT= 0
##$AXTYPE= 0
##$AXUNIT= <>
##$AZFE= 0.1
##$AZFW= 0.1
##$BCFW= 0
##$BC_mod= 0
##$BYTORDP= 0
##$COROFFS= 0
##$CY= 15
##$DATMOD= 1
##$DC= 0
##$DFILT= <>
##$DTYPP= 0
##$F1P= 0
##$F2P= 0
##$FCOR= 0.5
##$FTSIZE= 131072
##$FT_mod= 6
##$GAMMA= 0
##$GB= 0
##$INTBC= 1
##$INTSCL= 1
##$ISEN= 128
##$LB= 0.3
##$LEV0= 0
##$LPBIN= 0
##$MAXI= 10000
##$MC2= 0
##$MEAN= 0
##$ME_mod= 0
##$MI= 0
##$NCOEF= 0
##$NC_proc= -2
##$NLEV= 6
##$NOISF1= 0
##$NOISF2= 0
##$NSP= 0
##$NTH_PI= 0
##$NZP= 0
##$OFFSET= 14.96086
##$PC= 1
##$PHC0= -81.81519
##$PHC1= 0
##$PH_mod= 1
##$PKNL= yes
##$PPARMOD= 0
##$PPDIAG= 0
##$PPIPTYP= 0
##$PPMPNUM= 2147483647
##$PPRESOL= 1
##$PSCAL= 4
##$PSIGN= 0
##$PYNMP= <proc.py>
##$REVERSE= no
##$SF= 400.020009693594
##$SI= 131072
##$SIGF1= 0
##$SIGF2= 0
##$SINO= 400
##$SIOLD= 131072
##$SPECTYP= <>
##$SREGLST= <1H.CDCl3>
##$SSB= 0
##$STSI= 131072
##$STSR= 0
##$SW_p= 8223.68421052631
##$SYMM= 0
##$S_DEV= 0
##$TDeff= 65536
##$TDoff= 0
##$TI= <>
##$TILT= no
##$TM1= 0
##$TM2= 0
##$TOPLEV= 0
##$USERP1= <user>
##$USERP2= <user>
##$USERP3= <user>
##$USERP4= <user>
##$USERP5= <user>
##$WDW= 1
##$XDIM= 131072
##$YMAX_p= 409455288
##$YMIN_p= -11289
##$CURPLOT= <Network HP LaserJet P1505>
##$CURPRIN= <$Network HP LaserJet P1505>
##$DFORMAT= <normdp>
##$LAYOUT= <+/1D_H.xwp>
##$LFORMAT= <normlp>
##$PFORMAT= <normpl>
##$SURQMSG= 1
$$ End of Bruker specific parameters
$$ ---------------------------------
##NTUPLES= NMR SPECTRUM
##VAR_NAME=  FREQUENCY,     SPECTRUM/REAL,   SPECTRUM/IMAG
##SYMBOL=    X,             R,               I
##VAR_TYPE=  INDEPENDENT,   DEPENDENT,       DEPENDENT
##VAR_FORM=  AFFN,          ASDF,            ASDF
##VAR_DIM=   131072,        131072,          131072
##UNITS=     HZ,            ARBITRARY UNITS, ARBITRARY UNITS
##FACTOR=    0.0627417313425164, 1,          1
##FIRST=     8223.62146879497, 3255,         -63655
##LAST=      0,             4616,            -62286
##MIN=       0,             -11289,          0
##MAX=       8223.62146879497, 409455288,    0
$$ Real data points
##PAGE= N=1
##DATA TABLE= (X++(R..R)), XYDATA
$$ [...]
63890F73409j2549j1939j1569j1229j0508r098p246n629m508l226r95K008M794
63877E91715O877Q748J0959J3412J5925J8775K2082K5193K7404K8997L0767L2701
63865H33555L3955L4184L4056L4302L4872L5216L4818L3185K9961K5556K1142
63854A184802J7534J4321J0544N895P86m423r669j4838j9784k4668k9673l4391
63842A096436l8063m0524m2270m3425m3447m2237m0817m0131l9696l8251l5545
63831F52030l2606l0310k8514k6731k4865k3024k1290j9874j8930j7911j5905
63820C92070j3049j0796j0185j0462j0184r095q003p251o429n445m852m866m927
63807B86526m491l618k643j831j484j813k487k784k404j728j252j209j717k624
$$ plain form
63890 673409 660860 648921 637352 626123 615615 606517 599271 593642 589134 585908 584913 586921 591715
63877 591715 598592 607340 618299 631711 647636 666411 688493 713686 741090 770087 800854 833555
63865 833555 867510 901694 935750 970052 1004924 1040140 1074958 1108143 1138104 1163660 1184802
63854 1184802 1202336 1216657 1227201 1233096 1233882 1229459 1219790 1204952 1185168 1160500 1130827 1096436
63842 1096436 1058373 1017849 975579 932154 888707 846470 805653 765522 725826 687575 652030
63831 652030 619424 589114 560600 533869 509004 485980 464690 444816 425886 407975 392070
63820 392070 379021 368225 358040 347578 337394 328299 320296 313045 306616 301171 296319 291453 286526
63807 286526 282035 278417 275774 273943 272459 270646 268159 265375 262971 261243 259991 258782 257065 254441
63793B54441l259l018k286k010k290k280j645j151j334j590j276q35j016j554
63779B28897j560q42o9J80j69r51j813k123j501l57N13P28L77l74j222j599j210
63762B16905n30k87n75r03q95m59L45J160J345P25L6%K74P1n51q27n91m50o69
63743B14124p58l61K59Q28J417J958K132K048K342L177L777L452K565K014K130
63728B41104K618L191L651L663L073K416K486L338M219M621M900N533O175O021
63714B97009M970L783K964K080N83j116k124k320k431k829l125l084l123l415
63700B87822l279k094l00J177K068K573K573J867R88Q18J373J829J833J957K646
63685C03851L440L625L100K291J565J094R27R30Q65P24P66J075J345J238Q30N93
$$ plain form
63793 254441 251182 248164 245878 243868 241578 239298 237653 236502 235168 233578 232302 231467 230451 228897
63779 228897 227337 226495 226426 226606 226437 225486 223673 221550 220049 219692 220205 220933 221310 220936 219714 218115 216905
63762 216905 216375 216088 215513 214610 213715 213256 213601 214761 216106 216831 216867 216867 217141 217212 216661 215834 215243 214793 214124
63743 214124 213366 213005 213264 214092 215509 217467 219599 221647 223989 227166 230943 234395 236960 238974 241104
63728 241104 243722 246913 250564 254227 257300 259716 262202 265540 269759 274380 279280 284813 290988 297009
63714 297009 301979 305762 308726 310806 311389 310273 308149 305829 303398 300569 297444 294360 291237 287822
63700 287822 284543 282449 282149 283326 285394 287967 290540 292407 293395 294213 295586 297415 299248 301205 303851
63685 303851 307291 310916 314016 316307 317872 318966 319893 320823 321688 322412 323178 324253 325598 326836 327666 328259
63669C28259R42J775K424K265J485R02R06R36M14l52q09j184k075l287m019m142
63653C24440m351m950n311m823l705k562j809j668k156k699k416j119L97J302
63639B88570J495J285R44Q92J668L246M796N527N487N217N094N259N726O181O138
63624C47525N744N995P644J0177J2308J3345J3653J3955J4661J5791J7239J8907
63612D96944K0728K2607K4465K6409K8647L1056L3043L4271L5135L6041L6329
63601H25675L4732L0811K5266J8843J1885N062m93m249o761q607r629r720r607
63588I03208j0191j1676j3912j6970k0689k4254k6923k8764k9974l0051k8465
63577F61339k5734k2956k0529j8152j5843j4007j2579j0953q844o506m015j168
$$ plain form
63669 328259 329201 330976 333400 335665 337150 338052 338958 339894 340308 339956 339147 337963 335888 332601 328582 324440
63653 324440 320089 315139 309828 305005 301300 298738 296929 295261 293105 290406 287990 286871 287268 288570
63639 288570 290065 291350 292294 293186 294854 298100 302896 308423 313910 319127 324221 329480 335206 341387 347525
63624 347525 353269 359264 366908 377085 389393 402738 416391 430346 445007 460798 478037 496944
63612 496944 517672 540279 564744 591153 619800 650856 683899 718170 753305 789346 825675
63601 825675 860407 891218 916484 935327 947212 952274 951781 947532 940771 932164 922535 912815 903208
63588 903208 893017 881341 867429 850459 829770 805516 778593 749829 719855 689804 661339
63577 661339 635605 612649 592120 573968 558125 544118 531539 520586 511742 505236 501221 500053
63565E00053J724L703M244M112M631O353Q628J0423J1347J1835J2512J3541J4786
63552F07892J6397J8764K1805K4841K7444L0063L3454L7878M3005M8127N1919
63541I61589N2450M8145L8927K6358J2941J227p192j2434j5753j7794j8040j6229
63529A054195j3553j1566j0587j0272j1180j4481k0078k6279l1463l5217l7671
63518H31848l8755l8616l7854l6892l5473l3251l0393k7340k4401k1836j9902
63507D87135j8456j6937j5034j3101j1642j0676r830q806p544o120m768l863l643
63494C56715l905m029l396j996o15j25n12q96p31m51n79p23r7J299K721L707M267
63477C50654M334L795L093K985L514L952L778L129K175Q63n82j619k201k890l873
$$ plain form
63565 500053 501777 505480 509724 513836 518467 524820 533448 543871 555218 567053 579565 593106 607892
63552 607892 624289 643053 664858 689699 717143 747206 780660 818538 861543 909670 961589
63541 961589 1014039 1062184 1101111 1127469 1140410 1141637 1134445 1122011 1106258 1088464 1070424 1054195
63529 1054195 1040642 1029076 1018489 1008217 997037 982556 962478 936199 904736 869519 831848
63518 831848 793093 754477 716623 679731 644258 611007 580614 553274 528873 507037 487135
63507 487135 468679 451742 436708 423607 411965 401289 391459 382653 375109 368989 364221 360358 356715
63494 356715 352810 348781 345385 343389 342774 342649 342137 341241 340510 340059 339480 338757 338660 339959 342680 346387 350654
63477 350654 354988 358783 361876 364861 368375 372327 376105 379234 381409 382272 381690 380071 377870 374980 371107
63462C71107m482m130l150k321j990k070k398k719k620j961j083l40L45J179K115
63447C45482L038M007N050O024O946Q139R786J1649J3507J5481J7674J9862K2009
63434D88654K4721K8713L3827L8827M2044M2084L8237L0854K1486J2381N579K067
63422H09474J516K775M904P842J1962J7141K2677K8043L3175L7903M1527M3234
63410A062173M2525L9149L3080K4927J5937P292l70o622j0943j3126j3726j3745
63398A166551j3968j4807j6465j9088k2855k7887l3723l8958m2067m2835m2364
63387H51534m1475l9801l6867l3297l0107k7373k4435k1200j8285j5933j3513
63376E49248j0425o914l805j674m02O62K193M355O717Q855J0841J3014J5393J7703
$$ plain form
63462 371107 366625 362495 359345 357024 355034 352964 350566 347847 345227 343266 342183 341843 342188 343367 345482
63447 345482 348520 352527 357577 363601 370547 378686 388472 400121 413628 429109 446783 466645 488654
63434 488654 513375 542088 575915 614742 656786 698870 737107 767961 789447 801828 807407 809474
63422 809474 810990 813765 818669 826511 838473 855614 878291 906334 939509 977412 1018939 1062173
63410 1062173 1104698 1143847 1176927 1201854 1217791 1225083 1224713 1218091 1207148 1194022 1180296 1166551
63398 1166551 1152583 1137776 1121311 1102223 1079368 1051481 1017758 978800 936733 893898 851534
63387 851534 810059 770258 733391 700094 669987 642614 618179 596979 578694 562761 549248
63376 549248 538823 531909 528104 526430 526028 526690 528883 533238 539955 548810 559651 572665 588058 605761
63362F05761J9849K2071K4582K7332L0141L2943L5750L8495M0920M2691M3694
63351I64229M3986M3334M0981L6266K9425K1372J2899M633k426p253r953j1677
63339A165816j3096j3794j3688j4026j6091j9523k2996k6068k9324l2899l5963
63328I28348l7784l8351l7784l5903l2714k8790k4804k0963j6971j2359p034j948
63316F32943Q91k31n170j1937j8175k2393k4172k3966k2812k1581k0300j8535
63304D44562j6305j4105j2117j0123q254p088o777o681o179n387m790m544m394
63291C37818m005l212k270j775j991k345k208j919k263k969k813j516m82r45k258
63276C04847k873k284j195j96O36J138J061O92O83J144J519J469J267J209J227
$$ plain form
63362 605761 625610 647681 672263 699595 729736 762679 798429 836924 877844 920535 964229
63351 964229 1008215 1051549 1092530 1128796 1158221 1179593 1192492 1197125 1194699 1187446 1177493 1165816
63339 1165816 1152720 1138926 1125238 1111212 1095121 1075598 1052602 1026534 997210 964311 928348
63328 928348 890564 852213 814429 778526 745812 717022 692218 671255 654284 641925 634891 632943
63316 632943 633834 633603 628433 616496 598321 575928 551756 527790 504978 483397 463097 444562
63304 444562 428257 414152 402035 391912 383658 376570 369793 363112 356933 351546 346756 342212 337818
63291 337818 333813 330601 328331 326556 324565 322220 320012 318093 315830 312861 310048 308532 308050 307105 304847
63276 304847 301974 299690 298495 298299 298935 300073 301134 301826 302509 303653 305172 306641 307908 309117 310344
63261C10344J277J549K040K366K274K018J991K242K630L163L872M488M605M203
63247C49062L764L830M534N616O712P599Q203Q586R001R804J1158J2811J4336
63234D55016J5560J6604J7524J8179J8603J9156K0041K0887K1143K0813K0426
63223F63952K0296K0152J9605J8716J7923J7638J8046J9102K0451K1391K1205
63212H78477J9653J7127J4214J1114P460K747l046r228j4838j9291k2605k5029
63200H56755k6595k7173k6866k6103k5197k3898k1678j8470j4921j1800r223o679
63188F18152l710l48L123O541R809J2706J4987J6724J8250J9716K0855K1323K1209
63175G79337K0954K0822K0670K0286J9735J9180J8566J7760J6802J5689J3961
$$ plain form
63261 310344 311621 313170 315210 317576 319850 321868 323859 326101 328731 331894 335766 340254 344859 349062
63247 349062 352826 356656 361190 366806 373518 381117 389320 397906 406907 416711 427869 440680 455016
63234 455016 470576 487180 504704 522883 541486 560642 580683 601570 622713 643526 663952
63223 663952 684248 704400 724005 742721 760644 778282 796328 815430 835881 857272 878477
63212 878477 898130 915257 929471 940585 948045 950792 947746 938518 923680 904389 881784 856755
63200 856755 830160 802987 776121 750018 724821 700923 679245 660775 645854 634054 624831 618152
63188 618152 614442 614094 617217 623758 633567 646273 661260 677984 696234 715950 736805 758128 779337
63175 779337 800291 821113 841783 862069 881804 900984 919550 937310 954112 969801 983762
63164I83762J1016O888K272k385p329j2732j7956k2158k5334k8139l0826l2981
63152H24098l4250l4716l4385l3017l0709k8137k5865k3719k1261j8566j6125
63141E23348j4208j2679j1311r960q528p048n729m679l727k735j902j451j170
63128D38221o93j21J48K31Q20K153L463L871L532L338L646L935L815L742M256
63113D74357M942M816L685K543K372L024L631L701L396K912K222J396O98K43r6
63098E13842k57K1O03P62Q9p31n47Q70K518L255K795J590J86j026j698j639j004
63081E19629j74N42R92J070Q59Q37J579L054M440M932M621M328M634N412O279
63066E63034P152Q201R563J1255J3136J4831J6035J7034J8668K1364K4539K7247
$$ plain form
63164 983762 994778 1001666 1003938 1001553 994224 981492 963536 941378 916044 887905 857079 824098
63152 824098 789848 755132 720747 687730 657021 628884 603019 579300 558039 539473 523348
63141 523348 509140 496461 485150 475190 466662 459614 453885 449206 445479 442744 440842 439391 438221
63128 438221 437528 437407 437555 437786 438606 440759 444222 448093 451625 454963 458609 462544 466359 470101 474357
63113 474357 479299 484115 487800 490343 492715 495739 499370 503071 506467 509379 511601 512997 513695 513938 513842
63098 513842 513585 513606 514209 514971 515060 514329 513782 514652 517170 520425 523220 524810 524996 523970 522272 520633 519629
63081 519629 519455 519997 520989 522059 522918 523755 525334 528388 532828 537760 542381 546709 551343 556755 563034
63066 563034 570186 578387 587950 599205 612341 627172 643207 660241 678909 700273 724812 752059
63054G52059K9221L0932L2843L5133L7919M1143M4295M6803M8681N0229N1226
63043A200484N1148N0270M9690M9925N0281N0043M9565M9596N0062N0302N0082
63032A751448M9595M8714M6938M3913L9438L3189K5035J5492N218n735j7422k8989
63020B006834l9120m7462n4693o0957o5262o6810o6071o3906o0406n5359m9289
63009A377499m3148l7169l0762k3548j5879q355j301N232J1336J7132K2456K6711
62997A300204K9435L0949L2098L3335L4441L5165L5644L6051L6265L6119L5710
62986A675416L5129L4071L2026K8763K4407J9069J2642M987l820j3440k3362l2967
62974A792921m1678m9193n5559o0824o4659o6539o6468o5233o3581o1247n7315
$$ plain form
63054 752059 781280 812212 845055 880188 918107 959250 1003545 1050348 1099029 1149258 1200484
63043 1200484 1251632 1301902 1351592 1401517 1451798 1501841 1551406 1601002 1651064 1701366 1751448
63032 1751448 1801043 1849757 1896695 1940608 1980046 2013235 2038270 2053762 2058980 2053245 2035823 2006834
63020 2006834 1967714 1920252 1865559 1804602 1739340 1672530 1606459 1542553 1482147 1426788 1377499
63009 1377499 1334351 1297182 1266420 1242872 1226993 1218638 1217337 1222569 1233905 1251037 1273493 1300204
62997 1300204 1329639 1360588 1392686 1426021 1460462 1495627 1531271 1567322 1603587 1639706 1675416
62986 1675416 1710545 1744616 1776642 1805405 1829812 1848881 1861523 1866510 1862690 1849250 1825888 1792921
62974 1792921 1751243 1702050 1646491 1585667 1521008 1454469 1388001 1322768 1259187 1197940 1140625
62963A140625n1686m5717m1037l8008l5763l3505l1158k8850k6393k3690k1223
62952G63595j9704j9295j9435j9349j8661j7495j6216j5065j4077j3337j3119
62941E77842j3495j3838j3194j1392r437q402q217p938p051n968n192m588l830
62928D65300l092k804k919k917k600k377k562k738k246j147k85k70p42r76q65
62913D36760r21j302j440q96k16l48j391k423k703k527k612l020l157k639j734
62898D09431r46n24m47n29m38J25J041J761J851J450R60N41J22j88q5M72J036
62881D15633J118O98K22J49N40J053J239R61M87J09k23p05j191j313j104j150
62865D16523j768k435k410j747j148r75r44q45r38j319j485r33N6O78N42j5m23
$$ plain form
62963 1140625 1088939 1043222 1002185 964177 928414 894909 863751 834901 808508 784818 763595
62952 763595 743891 724596 705161 685812 667151 649656 633440 618375 604298 590961 577842
62941 577842 564347 550509 537315 525923 516486 508084 499867 491929 484878 478910 473718 469130 465300
62928 465300 462208 459404 456485 453568 450968 448591 446029 443291 441045 439898 439613 439343 438601 437625 436760
62913 436760 435839 434537 433097 432201 431985 431637 430246 427823 425120 422593 419981 416961 413804 411165 409431
62898 409431 408485 407961 407514 406985 406547 406672 407713 409474 411325 412775 413735 414276 414398 414210 414125 414597 415633
62881 415633 416751 417449 417671 417820 418360 419413 420652 421613 422100 422209 421986 421281 420090 418777 417673 416523
62865 416523 414755 412320 409910 408163 407015 406040 405096 404251 403313 401994 400509 399576 399632 400310 400852 400837 400414
62848D00414l89J2M64O43N12L14J51j76o94r31n49%M9k51j76K82K42o45j419r78
62828C96875M19J534J661J161P24O43Q05R17P34L95M11J023J780K202K570L448
62812D17302M588N038M413L443L058L494M421N353N738N327M781N251O886Q391
62798D87484Q627Q114Q208R249J0483J1458J2452J3511J4240J4834J6331J9195
62786F34186K2418K4898K7097L0432L5225M0297M4710M9022N4383O0978O7873
62775A091519P4038P9008Q2686Q5045Q6024Q5354Q2497P7002O8975N8957M7354
62764A918459L4309K0179N640q796k2991l6601m8686n8387o5725p1276p5206p7222
62752A513697p7489p6828p5765p3900p0700o6532o2325n8347n3935m8564m2759
$$ plain form
62848 400414 400025 400037 400501 401144 401656 401970 402121 401945 401251 400320 399771 399771 399820 399569 399393 399675 399917 399272 397853 396875
62828 396875 397294 398828 400489 401650 402374 403017 403822 404739 405473 405868 406279 407302 409082 411284 413854 417302
62812 417302 421890 426928 431341 434784 437842 441336 445757 451110 456848 462175 466956 472207 479093 487484
62798 487484 496111 504225 512433 521682 532165 543623 556075 569586 583826 598660 614991 634186
62786 634186 656604 681502 708599 739031 774256 814553 859263 908285 962668 1023646 1091519
62775 1091519 1165557 1244565 1327251 1412296 1498320 1583674 1666171 1743173 1812148 1871105 1918459
62764 1918459 1952768 1972947 1978587 1969791 1946800 1910199 1861513 1803126 1737401 1666125 1590919 1513697
62752 1513697 1436208 1359380 1283615 1209715 1139015 1072483 1010158 951811 897876 849312 806553
62741H06553l7691l4000l1288k8743k6030k3415k1082j8713j5930j2998j0653
62730E46010r189q169p140o199n547m913l874k549j416n85K62J231K089K843L897
62715E06751N403O905P921Q604R516J0985J2973J5346J7931K0496K2957K5576
62703F71364K8686L2326L6301M0486M4830M9234N3660N8298O3219O7999P2018
62692A218421P5140P7656P9387P9320P6424P0605O2601N3089M2199K9764J5761
62681A880367O37j4580k8581m0547n0728n9881o8062p4290p7591p8118p7000p5228
62669A236398p3022p0130o6354o1726n6513n1244m6510m2530l9047l5706l2412
62658F61204k9187k5946k2657j9618j7265j5721j4702j3823j2828j1544r996q545
$$ plain form
62741 806553 768862 734862 703574 674831 648801 625386 604304 585591 569661 556663 546010
62730 546010 536821 528652 521512 515313 509766 504853 500979 498430 497014 496429 496691 497922 500011 502854 506751
62715 506751 512154 519059 526980 535584 545100 556085 569058 584404 602335 622831 645788 671364
62703 671364 700050 732376 768677 809163 853993 903227 956887 1015185 1078404 1146403 1218421
62692 1218421 1293561 1371217 1450604 1529924 1606348 1676953 1739554 1792643 1834842 1864606 1880367
62681 1880367 1881004 1866424 1837843 1797296 1746568 1686687 1618625 1544335 1466744 1388626 1311626 1236398
62669 1236398 1163376 1093246 1026892 965166 908653 857409 810899 768369 729322 693616 661204
62658 661204 632017 606071 583414 563796 546531 530810 516108 502285 489457 477913 467917 459372
62646D59372p687p504p494p129o369n537m799m030l132k272j692j373r78k11P60
62631C99925J345J073J09r40j646k047k282k263j855j165m55P1K33j44r10j392
62615C87657q98N26K109L159L665M035M538N080N405N400N318N698O913Q758J0631
62600D57994J2178J3614J5356J7569K0066K2508K4705K6875K9589L3087L6705
62589G10246L9361M0638M0919M0382L8534L5102L0755K6234K1180J4652O624j738
62577A042889r337j5982k1878k6970l1045l4031l5921l6802l7000l6784l5833
62566G21306l3668l0722k8236k6705k5200k2812k0044j7992j6656j5043j2736
62555D71492j0414q772p745o935o155n361m560l963l800l845l604k993k309j570
$$ plain form
62646 459372 451685 444181 436687 429558 423189 417652 412853 408823 405691 403419 401727 400354 399376 399165 399925
62631 399925 401270 402343 402452 401512 399866 397819 395537 393274 391419 390254 389799 389870 390103 389959 389049 387657
62615 387657 386759 387285 389394 392553 396218 400253 404791 409871 415276 420676 425994 431692 438605 447363 457994
62600 457994 470172 483786 499142 516711 536777 559285 583990 610865 640454 673541 710246
62589 710246 749607 790245 831164 871546 910080 945182 975937 1002171 1023351 1038003 1044627 1042889
62577 1042889 1033552 1017570 995692 968722 937677 903646 867725 830923 793923 757139 721306
62566 721306 687638 656916 628680 601975 576775 553963 533919 515927 499271 484228 471492
62555 471492 461078 452306 444561 437626 431471 426110 421550 417587 413787 409942 406338 403345 401036 399466
62541C99466n04O81J297J219J192J700K246K190J730J384J106O74N39J378K968
62526D19266M337N024N553O566Q166J0182J2478J4820J6898J8691K0465K2422
62514E64868K4728K7793L1952L6677M0778M3536M5218M6244M6422M5366M3104
62503I96686L9834L5464K9883K3380J6359Q929J236o104j2435j7717k2152k5386
62491A067977k6744k6197k4474k2103j9003j5183j1180p405l495J109O248J1171
62479I30721J5410J9025K2033K3994K4272K2464J8617J3327P735K952q49m678
62467A095023r780j6352k3355k9572l4591l8608m1644m3339m3593m2885m1733
62456G29571m0085l7607l4390l0944k7540k4067k0531j7281j4523j2077r889q329
$$ plain form
62541 399466 398962 399643 400940 402159 403351 405051 407297 409487 411217 412601 413707 414381 414920 416298 419266
62526 419266 423603 428627 434180 440746 448912 459094 471572 486392 503290 521981 542446 564868
62514 564868 589596 617389 649341 686018 726796 770332 815550 861794 908216 953582 996686
62503 996686 1036520 1071984 1101867 1125247 1141606 1150535 1151771 1145667 1133232 1115515 1093363 1067977
62491 1067977 1041233 1015036 990562 968459 949456 934273 923093 915688 912193 913302 919550 930721
62479 930721 946131 965156 987189 1011183 1035455 1057919 1076536 1089863 1097598 1100550 1099701 1095023
62467 1095023 1085243 1068891 1045536 1015964 981373 942765 901121 857782 814189 771304 729571
62456 729571 689486 651879 617489 586545 559005 534938 514407 497126 482603 470526 460637 452308
62444D52308p502o656m964k675q30K21J264K937M652N319M728L637K751K108J406
62429D58704M43q50k388l850m887n453n742n789n518n175n272n907o461o279n423
62414C90153m465l718l074k472k165k346k745k795k210j282o00m94p94j109j232
62399C58652j147p62j1Q12J170R80Q83J519K681L638M038M104L957L408K568K103
62383C88593K469L249L775M113M870O113P103P304P165P495Q478R688J0843J1974
62369D83232J2893J3117J2649J2387J3370J5662J8438K0997K3459K6416L0271
62358F82891L5025M0321M5568N0272N4543N8981O3736O7807O9701O8769O5474
62347A303088O0373N3325M4059L3147K1918J1441J915o911j5138k2729k9805l6529
$$ plain form
62444 452308 444806 438150 433186 430511 429681 429902 431166 434103 438755 444074 448802 452439 455190 457298 458704
62429 458704 459147 458297 455909 452059 447172 441719 435977 430188 424670 419495 414223 408316 401855 395576 390153
62414 390153 385688 381970 378896 376424 374259 371913 369168 366373 364163 362881 362281 361787 360993 359884 358652
62399 358652 357505 356743 356732 357544 358714 359694 360577 362096 364777 368415 372453 376557 380514 383922 386490 388593
62383 388593 391062 394311 398086 402199 407069 413182 420285 427589 434754 442249 450727 460415 471258 483232
62369 483232 496125 509242 521891 534278 547648 563310 581748 602745 626204 652620 682891
62358 682891 717916 758237 803805 854077 908620 967601 1031337 1099144 1168845 1237614 1303088
62347 1303088 1363461 1416786 1460845 1493992 1515910 1527351 1529266 1522355 1507217 1484488 1454683 1418154
62335A418154m2682m7629n0879n2510n2917n2206n0164m6922m3306m0161l7449
62324I01329l4385l0697k7262k5154k4336k3797k2966k2336k2442k2772k2284
62313F22898k0825j9349j8627j8253j7274j5378j3121j1146r683q664p917p144
62301D55517o125n048m338l972l298j853r7R97R85K39o21j147r30K98K128L486
62285D36221L646L034K687L020L545L764L795M008M410M733M855M882M902M912
62271D92414M919M986N195N722O828Q595J0759J3018J5474J8474K2137K6229L0461
62258F65211L4651L8611M2358M6476N1762N8182O4542O9503P2643P4042P3195
62247A291176O9091O1460N1346M0215K8902J7622O610l759j3312k2240l0831l9261
$$ plain form
62335 1418154 1375472 1327843 1276964 1224454 1171537 1119331 1069167 1022245 978939 938778 901329
62324 901329 866944 836247 808985 783831 759495 735698 712732 690396 667954 645182 622898
62313 622898 602073 582724 564097 545844 528570 513192 500071 488925 479242 470578 462661 455517
62301 455517 449392 444344 440006 436034 432736 430883 430786 431783 432768 433007 432386 431239 430309 430607 432735 436221
62285 436221 439867 442901 445588 448608 452153 455917 459712 463720 468130 472863 477718 482600 487502 492414
62271 492414 497333 502319 507514 513236 520064 528659 539418 552436 567910 586384 608521 634750 665211
62258 665211 699862 738473 780831 827307 879069 937251 1001793 1071296 1143939 1217981 1291176
62247 1291176 1360267 1421727 1473073 1513288 1542190 1559812 1566422 1562663 1549351 1527111 1496280 1457019
62235A457019m7457n4951o0894o4542o5852o5497o4188o2110n9025n4904n0219
62224H07380m5518m0828l5790l0485k5761k2398k0169j8218j6251j4749j3886
62213E23327j2977j1389r511q171p473o860o125n628n492n316m860m390m072l572
62199D27491k631j520n24N74J957L088L369L266L975N865P969R298R965J0557
62185D82699J1088J1229J1222J1677J2525J2965J2623J2056J1784J1459J0490
62174F11817R095Q090P914Q480R849J2406J6208K0738K5532L0668L6389M2502
62162H39688M8438N3672N7868O0737O1926O1025N7624N1606M3502L4291K4767
62151A395144J5242N961k637j0354j7673k5277l3161m0432m6058m9637n1488n2141
$$ plain form
62235 1457019 1409562 1354611 1293717 1229175 1163323 1097826 1033638 971528 912503 857599 807380
62224 807380 761862 721034 685244 654759 628998 606600 586431 568213 551962 537213 523327
62213 523327 510350 498961 489450 481279 473806 466946 460821 455193 449701 444385 439525 435135 431063 427491
62199 427491 424860 423340 422816 423390 425347 428435 431804 435070 439045 444910 452879 462177 472142 482699
62185 482699 493787 505016 516238 527915 540440 553405 566028 578084 589868 601327 611817
62174 611817 620912 629002 636916 645396 655245 667651 683859 704597 730129 760797 797186 839688
62162 839688 888126 941798 999666 1060403 1122329 1183354 1240978 1292584 1336086 1370377 1395144
62151 1395144 1410386 1416347 1413710 1403356 1385683 1360406 1327245 1286813 1240755 1191118 1139630 1087489
62139A087489n1758n0050m6853m2713l8488l4368k9741k4379j9210j5386j2869
62128G21674j0621q091n813m412l591k476n89J801M187O416Q775J1503J4194J5782
62114G48739J5354J2877R062M740P58j930k766k274j721j931k823m119n866p979
62100G60121r833j0806j0833j0123q671o491m026j813Q9J931L711N131O055O576
62086G21018O750O668O766P603R164J0743J1692J2148J2836J4316J6478J8713
62074H54895K0535K2022K3612K5452K7106K8023K8160K7908K7620K7525K8009
62063A140867K9468L1712L3860L5107L5451L5378L4959L3513L0290K5280J9233
62052A485118J2961O804Q02m874j0013j4795j9841k5572l1654l7257m1769m5133
$$ plain form
62139 1087489 1035731 985681 938828 896115 857627 823259 793518 769139 749929 734543 721674
62128 721674 711053 702962 697149 692737 689146 686670 686081 687882 692069 698485 707260 718763 732957 748739
62114 748739 764093 776970 786032 790772 791530 789600 786834 784560 782839 780908 778085 773966 768100 760121
62100 760121 750288 739482 728649 718526 709855 703364 699338 697525 697614 699545 703256 708387 714442 721018
62086 721018 727768 734436 741202 748805 757969 768712 780404 792552 805388 819704 836182 854895
62074 854895 875430 897452 921064 946516 973622 1001645 1029805 1057713 1085333 1112858 1140867
62063 1140867 1170335 1202047 1235907 1271014 1306465 1341843 1376802 1410315 1440605 1465885 1485118
62052 1485118 1498079 1504883 1505685 1500811 1490798 1476003 1456162 1430590 1398936 1361679 1319910 1274777
62040A274777m7621m9565n1168n2273n2213n0252m6407m1743l7611l4574l2142
62029G79208k9505k6393k3182k0286j7654j4971j2307j0238r191q872q647q406
62017E89556q609r397j0045r731q619p711p616p843p430o007m027k186q16K14
62003D99733J262K545L941N214O424P835R262R875R046P129N012L046J007j012
61989E70319k426l116l822n126o566p330p431p624q321r202r827j0066r899r234
61975D70329q148p026o296o134o326o328n639m376l298l036l442l875l876l310
61961C99219k261j181p46r75r23J04J399J776J290J074J591K257K811L812N384
61946D14631O672P172P588Q725J0362J1989J3824J6185J8569K0313K1628K3036
$$ plain form
62040 1274777 1227156 1177591 1126423 1074150 1021937 971685 925278 883535 845924 811350 779208
62029 779208 749703 723310 700128 679842 662188 647217 634910 624672 615481 606609 597962 589556
62017 589556 580947 571550 561505 551774 543155 535444 527828 519985 512555 506548 502521 500335 499519 499733
62003 499733 500995 503540 507481 512695 519119 526954 536216 546091 555137 562266 567278 570324 571331 570319
61989 570319 567893 564777 560955 555829 549263 541933 534502 526878 518557 509355 499528 489462 479563 470329
61975 470329 462181 455155 448859 442725 436399 430071 424432 420056 416758 413722 410280 406405 402529 399219
61961 399219 396958 395777 395031 394056 393133 393237 394636 396412 397702 398776 400367 402624 405435 409247 414631
61946 414631 421303 428475 436063 444788 455150 467139 480963 497148 515717 536030 557658 580694
61934E80694K4263K4632K4214K3572K2707K1287J9734J8909J8610J7524J4886
61923H11032J1352P815M293M49l420o576q687r962j0594j0447r307p218m477j327
61909G62926K237O185J0048J3141J5321J7094J8691J9581J9263J7960J5907J2568
61897I30922P473J494l771p830j1452j5094j8184k0230k1568k2643k3356k3603
61885G72158k3675k3586k2670k0469j7622j5289j4030j3637j3650j3637j3274
61874E80619j2553j1765j1021j0109q910p600o191m468k530q76L97J836L719N458
61860E16006O550P528R306J1848J4281J6129J7809J9911K2565K5500K8308L0608
61848G26349L2327L3843L5566L7368L8595L8554L6928L3910L0094K5985K1424
$$ plain form
61934 580694 604957 629589 653803 677375 700082 721369 741103 760012 778622 796146 811032
61923 811032 822384 830199 834492 834941 831521 824945 816258 806296 795702 785255 775948 768730 764253 762926
61909 762926 765163 771348 781396 794537 809858 826952 845643 865224 884487 902447 918354 930922
61897 930922 938395 939889 936118 928288 916836 901742 883558 863328 841760 819117 795761 772158
61885 772158 748483 724897 702227 681758 664136 648847 634817 621180 607530 593893 580619
61874 580619 568066 556301 545280 535171 526261 518661 512470 508002 505472 504596 504993 506829 510548 516006
61860 516006 522556 530084 539390 551238 565519 581648 599457 619368 641933 667433 695741 726349
61848 726349 758676 792519 828085 865453 904048 942602 979530 1013440 1043534 1069519 1090943
61837A090943J5834R183K293l979r382j3746j6489j7241j6528j5088j2824r147
61825A003829m183J138O117J0702J4754J7653J8749J7840J5002J0440M572k054
61813A114559r075j6241k3145k9377l4806l9265m2137m2901m1999m0479l8716
61802G56418l6202l2758k9189k6336k4062k1712j9097j6575j4433j2706j1354
61791E11994j0231r017p550o099n016m284l697l282l189l304l289l045k780k653
61777D44558k536k216j616q23j9N86Q91R93J069J199J328J407J472J557J631J611
61761D51092J535J687K386L492M291M123L192K361K115K065J622Q01K9n89j247
61746D78955j833j855j168l51j29n38j013j054o24P6P70J098P43q2o50m87L3K67
$$ plain form
61837 1090943 1106777 1115960 1118253 1114274 1104892 1091146 1074657 1057416 1040888 1025800 1012976 1003829
61825 1003829 999646 1000784 1006901 1017603 1032357 1050010 1068759 1086599 1101601 1112041 1116613 1114559
61813 1114559 1105484 1089243 1066098 1036721 1001915 962650 920513 877612 835613 795134 756418
61802 756418 720216 687458 658269 631933 607871 586159 567062 550487 536054 523348 511994
61791 511994 501763 492746 485196 479097 474081 469797 466100 462818 459629 456325 453036 449991 447211 444558
61777 444558 442022 439806 438190 437367 437348 437934 438825 439818 440887 442086 443414 444821 446293 447850 449481 451092
61761 451092 452627 454314 456700 460192 464483 468606 471798 474159 476274 478339 479961 480762 480791 480202 478955
61746 478955 477122 475267 474099 473748 473619 473081 472068 471014 470390 470466 471236 472334 473077 472995 472345 471858 471891 472158
61728D72158L12Q74K078L046L086K745L080M140M911M722M042L694L872M249M546
61713E21555M618M303L620K893K298J531K96j084k088k868m010n457o326o174
61699E13107n722n832o205n875m814m140m580n416n417m353l084k523k928l989
61685D48229m993n066l840j997o97m05o73j006j386j763j752j217o56n55p76r56
61669D20491j162j544j767j412p45m12m66l42J71O23O87O46R04J445J996K390
61653D21503K497K235J811J629J744J771J508J295J526K166K954L717M251M344
61639D54951M229M497N151N153L644J198p60j685k238k977l560l611l504l728
61625D56760l945l451k396j766k057k552k325j505r66r12n30O74J808J569O0j222
$$ plain form
61728 472158 472470 473344 475422 478468 481554 484299 487379 491519 496430 501152 505194 508888 512760 517009 521555
61713 521555 526173 530476 534096 536989 539287 540818 541114 540030 537942 535074 531064 525607 519281 513107
61699 513107 507385 501553 495348 489473 484659 480519 475939 470523 465106 460753 457669 455146 452218 448229
61685 448229 443236 438170 434330 432333 431636 431231 430558 429552 428166 426403 424651 423434 422778 422223 421447 420491
61669 420491 419329 417785 416018 414606 413861 413449 412983 412641 412812 413435 414122 414768 415672 417117 419113 421503
61653 421503 424000 426235 428046 429675 431419 433190 434698 435993 437519 439685 442639 446356 450607 454951
61639 454951 459180 463677 468828 473981 477625 478823 478063 476378 474140 471163 467603 463992 460488 456760
61625 456760 452815 449364 446968 445202 443145 440593 438268 436763 435797 434885 434355 435029 436837 438406 438466 437244
61609D37244j326j068j782l465m933n481n545n672n703n341m849m657m687m608
61595C78127m456m476m496m111l402k925k949l194l436l732l902l452k473j957
61581C29166k596l657l854l043k255k119k260k331k584k992k816j781r17j255
61567B94706k202k338j497q74j070j249o75R3J83j62n7O13J112R80M25l11j198
61550B86479j907j739m82J119K096K232J942J532J016N53N22Q96J047O12K58J002
61534B97178K711L961L653K286J179Q33P22L81q1n31j136j920k563k923l213l425
61518B97112l110k127j104p36r78j344j631j840j784j305p19m82n96p40p99p73
61502B77044n07j2J89k94r52r76m91l47p31r02n08k02n11q68m51N60J191R39J96
$$ plain form
61609 437244 435918 434850 433068 429603 424670 419189 413644 407972 402269 396928 392079 387422 382735 378127
61595 378127 373671 369195 364699 360588 357186 354261 351312 348118 344682 340950 337048 333596 331123 329166
61581 329166 326570 322913 319059 316016 313761 311642 309382 307051 304467 301475 298659 296878 295961 294706
61567 294706 292504 290166 288669 287795 286725 285476 284801 284894 285077 284915 284858 285471 286583 287563 287988 287677 286479
61550 286479 284572 282833 282351 283470 285566 287798 289740 291272 292288 292841 293363 294259 295306 295918 296176 297178
61534 297178 299889 303850 307503 309789 310968 311801 312523 312904 312823 312292 311156 309236 306673 303750 300537 297112
61518 297112 294002 291875 290771 290035 289057 287713 286082 284242 282458 281153 280434 279952 279356 278616 277817 277044
61502 277044 276537 276525 276714 276420 275468 274492 274001 273654 272923 272021 271513 271311 270800 269932 269481 270041 271232 272171 272367
61483B72367l51l83k1L83O26R08J524K292K658K433J993J568R87L58L00R22J283
61466B89847O14m38p41l85m23j111j535j131m89k97m13m24l61k87J03Q99J532
61449B84960J520J192J045Q82L11k94k28L36N06J24J73J384L088M066M036L794
61433C06895L961M208L856K954K333K536K955K481R87l29l48N89J325J463J620
61418C37486K125K426K099J664J784K162K018J310P60O64M74k75j235j838k130
61403C49494k562l133l258k542j338m50m02j088j977k547k654k545k488k412k003
61388C18095j227n26l30m46l13K29P33Q44Q64J271J937K208J825J340J437K098
61372C30039K678K709K357K054J880J553R77N60P06J259J726K072K736L837M804
$$ plain form
61483 272367 272016 271633 271612 271995 272621 273529 275053 277345 280003 282436 284429 285997 286984 287342 287642 288564 289847
61466 289847 290461 290023 289282 288897 288474 287363 285828 284697 284208 283911 283498 283074 282713 282426 282529 283428 284960
61449 284960 286480 287672 288717 289599 289910 289616 289388 289724 290230 290354 290527 291911 294999 299065 303101 306895
61433 306895 310856 315064 318920 321874 324207 326743 329698 332179 333166 332837 332489 333078 334403 335866 337486
61418 337486 339611 342037 344136 345800 347584 349746 351764 353074 353834 354498 354972 354697 353462 351624 349494
61403 349494 346932 343799 340541 337999 336661 336211 335809 334721 332744 330197 327543 324998 322510 320098 318095
61388 318095 316868 316342 316012 315566 315253 315482 316215 317059 317923 319194 321131 323339 325164 326504 327941 330039
61372 330039 332717 335426 337783 339837 341717 343270 344247 344807 345513 346772 348498 350570 353306 357143 361947
61357C61947N145N088N044M950M709M789N595O571O862O729P194Q234Q556P574
61343D48987O384O089O222N742M750M048L680L165K783L248M176M152K600N70
61329E06596o95j108j370j967k921l958m582m426l773l289l126k840k239j591
61315D68711r34M2J270K225K871L758M887N491N455N882P446R136R711R601J0014
61300E45566J0747J0360Q390N944L900J884n48k799m099m649n208n978o560o707
61286E50243o516o123n636n244n019m732m161l446k775j977p47P68J998K667L147
61271E12447L937M988N755N908N684N473N296M947M613M912O168P941R488J0438
61257E97995J0808J0614R886Q910Q039P240O174M698L062J601N62J28K47M05r5
$$ plain form
61357 361947 367092 372180 377224 382174 386883 391672 397267 403838 410700 417429 424623 432857 441413 448987
61343 448987 455371 461460 467682 473424 478174 482222 485902 489067 491850 495098 499274 503426 506026 506596
61329 506596 505901 504793 503423 501456 498535 494577 489995 485569 481796 478507 475381 472541 470302 468711
61315 468711 467777 467819 469089 471314 474185 477943 482830 488321 493776 499658 507104 516240 525951 535552 545566
61300 545566 556313 566673 575063 581007 584907 586791 586243 583444 579345 574696 569488 563510 556950 550243
61286 550243 543727 537604 531968 526724 521705 516973 512812 509366 506591 504614 503867 504635 506633 509300 512447
61271 512447 516384 521372 527127 533035 538719 544192 549488 554435 559048 563960 570128 578069 587557 597995
61257 597995 608803 619417 629303 638213 646252 653492 659666 664364 667426 669027 669589 669717 669964 670369 670274
61242F70274j446l211m874o210p069p260o822o199n848n866o078o285o189n422
61228E91495l901k119p89j97n0J12M98J094J929L048M229M877M531L521K806K952
61212F14036L523L728L462L249L288L087K160Q00o9L01J863L725M855N100N419
61197F58527O785Q961J0881J2183J3662J5983J8530J9968J9659J8070J6020J3907
61185H33136J1649R125O564M545L482L148K969K650K250J673O65o35j755k669
61171H76797l907n512o563o345n516n412o453p932r144j0058j0898j1768j2715
61158G74574j3657j4151j3769j2712j1659j0938j0287r449q448p207n432l180
61146F53685j139p6l13j770m107o597q415r446j0385j1576j2210j1287r168p335
$$ plain form
61242 670274 668828 665617 660743 654533 647464 640204 633382 627183 621335 615469 609391 603106 596917 591495
61228 591495 587594 585475 584686 584489 584439 584551 585049 586143 588072 591120 595349 600226 604757 608278 611084 614036
61212 614036 617559 621287 624749 627998 631286 634373 636533 637333 637264 637565 639428 643153 648008 653108 658527
61197 658527 665312 674273 685154 697337 710999 726982 745512 765480 785139 803209 819229 833136
61185 833136 844785 853910 860474 865019 868501 871649 874618 877268 879518 881191 881856 881221 879466 876797
61171 876797 872890 867378 860815 854470 848954 843542 837089 829157 820013 809955 799057 787289 774574
61158 774574 760917 746766 732997 720285 708626 697688 687401 677952 669504 662297 656865 653685
61146 653685 652546 652470 652157 650387 646280 639683 631268 621822 611437 599861 587651 576364 567196 559861
61132E59861o568o043m638k497p36J52R05K440M742P099R022J0503J1641J2572
61118E98455J3758J5769J8548K1272K3221K4524K5696K6827K7635K8146K8670
61107H52521K9070K8635K7000K4764K2867K1533K0194J8285J5755J2669Q841M167
61095A086301q46n302q769j1628j4402j7036j9125k0655k2001k3274k4114k4247
61083H94902k3860k3189k2217k1019j9947j9155j8245j6828j5193j3925j3126
61072F88198j2438j1670j0880r960q730p355o242n418m518l278j671K63K201L298
61058F11800K998K156K509M657P244Q629Q671Q425Q603R112R803J0822J2254J3886
61044G21569J5549J7306J9275K1448K3758K6134K8471L0651L2601L4257L5585
$$ plain form
61132 559861 553293 547250 542612 540115 539379 539531 540436 542876 547618 554717 563739 574242 585883 598455
61118 598455 612213 627982 646530 667802 691023 715547 741243 768070 795705 823851 852521
61107 852521 881591 910226 937226 961990 984857 1006390 1026584 1044869 1060624 1073293 1082134 1086301
61095 1086301 1085455 1080153 1071384 1059756 1045354 1028318 1009193 988538 966537 943263 919149 894902
61083 894902 871042 847853 825636 804617 784670 765515 747270 730442 715249 701324 688198
61072 688198 675760 664090 653210 643250 634520 627165 620923 615505 610987 607709 606038 606301 608502 611800
61058 611800 614798 616954 619463 624120 631364 639993 648664 657089 665692 674804 684607 695429 707683 721569
61044 721569 737118 754424 773699 795147 818905 845039 873510 904161 936762 971019 1006604
61033A006604L6722L7925L9345M0967M2767M4873M7460N0537N3693N5958N6387
61022A513238N5249N4397N5818N9966O6091P3803Q3262R3883J04295J14040J24407
61011B398449J37282J54439J78552K13351K61876L25624M06206N05940O25383
61002E207102P62544R17534J097365J313707J575990J884483K217529K508954
60994A7485208K639325K479644J983077J251953N04073m7582l00071k71537m5799
60985B5678291K65107N15698N39384K24391l97921j149540j808456k231068k396796
60976A9239090k365418k212473j996697j758122j522107j301029j099114r19075
60968F065055p63696o33064n24165m33874l60545l02666k57812k23139j95773
$$ plain form
61033 1006604 1043326 1081251 1120596 1161563 1204330 1249203 1296663 1347200 1400893 1456851 1513238
61022 1513238 1568487 1622884 1678702 1738668 1804759 1878562 1961824 2055707 2160002 2274042 2398449
61011 2398449 2535731 2690170 2868722 3082073 3343949 3669573 4075779 4581719 5207102
61002 5207102 5969646 6887180 7984545 9298252 10874242 12758725 14976254 17485208
60994 17485208 20124533 22604177 24587254 25839207 26343280 26295698 25995627 25724090 25678291
60985 25678291 25943398 26459096 26998480 27222871 26824950 25675410 23866954 21635886 19239090
60976 19239090 16873672 14661199 12664502 10906380 9384273 8083244 6984130 6065055
60968 6065055 5301359 4668295 4144130 3710256 3349711 3047045 2789233 2566094 2370321
60959B370321j72932j52948j35941j22222j10385r8340q5817p4291o4553n6127
60949A296765m9062m4409m2360m1492m0529l9519l8588l6954l4121l0961k8564
60938H70206k6843k5167k3518k2156k0858j9484j8575j8422j8204j7099j5701
60927F44179j5160j5263j4638j2800j0796r664r206q667p758o737n948n542n304
60914E16696m662l309j773r19r13j181j291j238r98m89j8o2m33m54o8j6o02j173
60896D97097j281j529k518l658l876l158k475k376k546k675k947l509m157m797
60882D55595n576o279o172m924l298k405k471k789k744k345j793j030RJ048J716
60867D16542K021K325K834L444M064M838N863O887P565P859P941P773P167O274
$$ plain form
60959 2370321 2197389 2044441 1908500 1786278 1675893 1577553 1491736 1417445 1352892 1296765
60949 1296765 1247703 1203294 1160934 1119442 1078913 1039394 1000806 963852 929731 898770 870206
60938 870206 843363 818196 794678 772522 751664 732180 713605 695183 676979 659880 644179
60927 644179 629019 613756 599118 586318 575522 565858 556652 547985 540227 533490 527542 522000 516696
60914 516696 512034 508725 506952 506033 505120 503939 502648 501410 500412 499923 499905 499843 499410 498956 498888 498872 498270 497097
60896 497097 495816 494287 491769 488111 484235 481077 478602 476226 473680 471005 468058 464549 460392 455595
60882 455595 450019 443740 437568 432644 429346 426941 424470 421681 418937 416592 414799 413769 413778 414826 416542
60867 416542 418563 420888 423722 427166 431230 436068 441931 448818 456383 464242 472183 479956 487123 493397
60853D93397N598N340N055M392L776L903M605M835L932K372J045K12l78q13r85
60838E36286j171j954l408m829n535n623n667n888n960n540m661l649k806k248
60824D77347j923j700j457j119o59j70J34K06M62J416K912M077M353M236M579
60809D92694N468O295O815P447Q503R730J0784J1649J2356J2883J3524J4843J6780
60796F29771J8340J8771J8629J9061K0268K1359K1574K0989K0043J9066J8341
60785H46212J7986J7507J6071J3505J0557P973N680L147J18l257o613r312j0747
60772I08827j1090j1430j2647j4493j6146j7317j8149j8443j7744j6255j4922
60761G40191j4484j4888j5677j6410j6637j6096j5150j4511j4325j4051j3363
$$ plain form
60853 493397 498995 504335 509390 513782 517558 521461 526066 530901 534833 537205 538250 538462 538084 537271 536286
60838 536286 535115 533161 529753 524924 519389 513766 508099 502211 496251 490711 486050 482401 479595 477347
60824 477347 475424 473724 472267 471148 470489 470319 470453 470659 471121 472537 475449 479526 483879 488115 492694
60809 492694 498162 504457 511272 518719 527222 536952 547736 559385 571741 584624 598148 612991 629771
60796 629771 648111 666882 685511 704572 724840 746199 767773 788762 808805 827871 846212
60785 846212 864198 881705 897776 911281 921838 929811 935491 938638 938756 935499 928886 919574 908827
60772 908827 897737 886307 873660 859167 843021 825704 807555 789112 771368 755113 740191
60761 740191 725707 710819 695142 678732 662095 645999 630849 616338 602013 587962 574599
60750E74599j2551j1765j0613q992p644p211p245o908o254o023o397o907p359
60737D68730p995q633q622p890p137o717o124n032l998l555l271k462j328n72
60723C95394k73N2M86N84K14k23m33m77l66j3L14R7o47j278j421j473j959k800
60705C85778l552m010m210m149l850l569l590l853l957l540k659j889j946k895
60691C38109l801l576k301j209j163j632j604r95n40n15l16N82J798K470K262
60676C27569J626J191J139J252J322J430J766K331K875L053K610J590M89o1J6
60661C50198O1m08q72m24Q66J909K043J864K249L153L920M280M482M666M781N036
60645C87804N785O805P150O072L895J722L00o96k087l943n235n057l859k976k977
$$ plain form
60750 574599 562048 550283 539670 530678 523034 515823 508578 501670 495416 489393 482996 476089 468730
60737 468730 460735 452102 443480 435590 428453 421736 415612 410580 406582 403027 399756 397294 395966 395394
60723 395394 395121 395173 395659 396243 396457 396234 395801 395324 394958 394945 395259 395356 394709 393431 392010 390537 388578 385778
60705 385778 382226 378216 374006 369857 366007 362438 358848 354995 351038 347498 344839 342950 341004 338109
60691 338109 334308 330732 328431 327222 326059 324427 322823 321828 321288 320773 320457 321039 322837 325307 327569
60676 327569 329195 330386 331525 332777 334099 335529 337295 339626 342501 345554 348164 349754 350243 350182 350198
60661 350198 350259 349851 348979 348555 349421 351330 353373 355237 357486 360639 364559 368839 373321 377987 382768 387804
60645 387804 393589 400394 407544 413616 417511 419233 419533 418837 416750 412807 407572 402515 398656 395680 392703
60630C92703l184k920k415k170k097j890j734j949k395k773l132l498l397k531
60616C56618j580j431j833j712p86J00K69k4l37o39q61o21J14O95O31K79K10L43
60598C49435K24k18o44q97j069j078o56J25O68M26l60p53j32J022J649J388Q96
60581C50026P58P66O14O73J300J959J977J854K644M136M971M738M713N971P957
60566C95057R611J0938J2501J4117J5065J5109J4400J2708R723N989K623J17k024
60553E15934m303o486p893q072p112n585m062k592p91J391L478N213O953Q940
60539D95013J0819J2422J4305J6643J8097J7087J3948J0642Q222N750K177j871
60527F23254m877o316o901p315p508p081n930m397l131k683l065l656l757l123
$$ plain form
60630 392703 389519 386599 384184 382014 379917 378027 376293 374344 371949 369176 366044 362546 359149 356618
60616 356618 355038 353607 351774 350062 349276 349376 349645 349621 349284 348645 347784 347163 347277 347972 348603 348882 349092 349435
60598 349435 349659 349441 348797 347900 346831 345753 345097 345222 345890 346316 345956 345203 345071 346093 347742 349130 350026
60581 350026 350784 351550 352164 352837 354137 356096 358073 359927 362571 366707 371678 376416 381129 387100 395057
60566 395057 404668 415606 428107 442224 457289 472398 486798 499506 509229 515218 517841 517958 515934
60553 515934 511631 505145 497252 489180 482068 476483 472421 469829 469038 470429 473907 479120 486073 495013
60539 495013 505832 518254 532559 549202 567299 584386 598334 608976 617198 622948 625125 623254
60527 623254 618377 612061 605160 597845 590337 583256 577326 572929 569798 567115 564050 560394 556637 553514
60513E53514j965o31N63J363J779K148K813L754M698N573O718Q597J1338J4667
60499F14929J8289K2280K6942L2254L7702M2751M7308N1477N5006N7166N7127
60488A063231N4232M8091L8740K6716J2797k295j7774l2498m5112n4565o0345
60477A031218o2384o1149n7791n3712m9655m5360m0311l4653k9235k4800k1457
60466E50711j8880j6808j5159j3743j2216j0524r148q491q161p276n671m216l725
60453D16693l916l881l265k543k293k604l121l382l158k681k404k337j995j220
60439C77893o46q33j404j642j602j823k147j814p64J21L06L08P06J167J034L12
60423C69172m08p03m94Q9O00M21n00j290j050Q5J176J567J325Q35M87O12J220
$$ plain form
60513 553514 551549 550918 551481 552844 554623 556771 559584 563338 568036 573609 580327 588924 600262 614929
60499 614929 633218 655498 682440 714694 752396 795147 842455 893932 948938 1006104 1063231
60488 1063231 1117463 1165554 1204294 1231010 1243807 1241512 1223738 1191240 1146128 1091563 1031218
60477 1031218 968834 907685 849894 796182 746527 701167 660856 626203 596968 572168 550711
60466 550711 531831 515023 499864 486121 473905 463381 454233 445742 437581 430305 424634 420418 416693
60453 416693 412777 408896 405631 403088 400795 398191 395070 391688 388530 385849 383445 381108 379113 377893
60439 377893 377247 376414 375010 373368 371766 369943 367796 365982 365218 365339 365645 365953 366659 367826 368860 369172
60423 369172 368764 368061 367567 367656 368256 368677 368177 366887 365837 365922 367098 368665 369990 370825 371312 371924 373144
60406C73144J793J768J244P87O21M40P0j78K9O29J360K033K449K402K005J742
60390C92338J859K025J827J456J383J599J671J527J611K038K169J465L67k34j86
60375D12915j01k33mJ021K284K822K428J708J094L49p32j632j551m70O42Q77L82
60358D21799P9M90J267J893K321K601K383J422L77L65J660L394M634N179N216
60343D55080M891M507M495M706M300K793Q00p52j655k259k724l112l701m590n198
60328D57581m960m207l690l467k993k209j656j574j610j519j468j510j372r45
60314D24401m38QM37Q40J290K186L759N478O623P379Q592J0472J2467J4383J6611
60299E14488J8936K0177J9523J7377J4445J0775O246J258l646q224j2069j4436
$$ plain form
60406 373144 374937 376705 377949 378736 379357 379797 379867 379689 379718 380347 381707 383740 386189 388591 390596 392338
60390 392338 394197 396222 398049 399505 400888 402487 404158 405685 407296 409334 411503 412968 413335 413101 412915
60375 412915 412814 412581 412577 413598 415882 418704 421132 422840 423934 424283 423551 421919 420368 419898 420540 421417 421799
60358 421799 421878 422368 423635 425528 427849 430450 432833 434255 434632 434997 436657 440051 444685 449864 455080
60343 455080 459971 464478 468973 473679 477979 480772 481572 480820 479165 476906 474182 471070 467369 462779 457581
60328 457581 452621 448414 444724 441257 438264 436055 434399 432825 431215 429696 428228 426718 425346 424401
60314 424401 423963 423971 424408 425248 426538 428724 432483 437961 444584 451963 460555 471027 483494 497877 514488
60299 514488 533424 553601 573124 590501 604946 615721 621967 623225 619579 611355 599286 584850
60287E84850j5135j4979j4751j4249j3014j1362r924q723p465o288n465m777m016
60274D54702l673m193m885m597l367k447k658l560m276m300l492k113j039j100
60260D09002j952k283j453k80J46k28p00q62p65m12K70J044J401J097M43RN8K92
60242D04827J80l61p63m61L51R50R88P94P62Q62Q95Q90R09Q51P72J121K301M003
60224D19871N295N418M381K807J480R56J337K195K872L093L209L685M418M897
60210D65914M983N124N592N964N733N114M785N017N507N996O431O609O230N428
60196E44427M655L997L153K208J637J392P88l06j013q33o54j496k864l423k975
60181E48693k699l428m736n825o489o839o769o104m925l494k116j125o77n35l50
$$ plain form
60287 584850 569715 554736 539985 525736 512722 501360 491436 482713 475248 468960 463495 458718 454702
60274 454702 451029 446836 441951 437354 433987 431540 428882 425322 421046 416746 413254 411141 410102 409002
60260 409002 407050 404767 403314 403034 403180 402952 402252 401390 400625 400213 400483 401527 402928 404025 404468 404477 404535 404827
60242 404827 405007 404646 403883 403422 403773 404723 405711 406505 407267 408129 409024 409914 410823 411674 412446 413567 415868 419871
60224 419871 425166 430584 434965 437772 439252 440208 441545 443740 446612 449705 452914 456599 461017 465914
60210 465914 470897 476021 481613 487577 493310 498424 503209 508226 513733 519729 526160 532769 538999 544427
60196 544427 549082 553079 556232 558440 560077 561469 562257 561951 560938 560105 559451 557955 555091 551668 548693
60181 548693 545994 542566 537830 532005 525516 518677 511908 505804 500879 497385 495269 494144 493467 492932 492582
60166D92582j59k02l45k47n0k93j012j495j185l29M70R05Q90L66m22q06l12P90
60148D89146J839K518K881K959K737K486K632L164L508L299L027L567M973O172
60134E34908O149N219M607M844N229N034M511M147L568K043j32j659j783j083
60120E75602n32l62j79L35J226K362L361L650L014J968J270J113R71K68r90k236
60104E90841k959l256l711m662n746o292o103n592n212m988m606l797k642j553
60090E29722r08o33k96K63P48J037J595K815M222M897M578L843L304L101L074
60075E61362K831J733n06l108m725m892m379m053m004m063m464n412o485p026
60061E12809o918o529o052n381m558l938l825m062m167l771k994k263j775j294
$$ plain form
60166 492582 492423 492221 491876 491629 491579 491286 490274 488779 487594 487265 487735 488640 489530 489896 489474 488668 488356 489146
60148 489146 490985 493503 496384 499343 502080 504566 507198 510362 513870 517169 520196 523763 528736 534908
60134 534908 541057 546276 550883 555727 560956 565990 570501 574648 578216 580259 580127 578468 576685 575602
60120 575602 575070 574708 574529 574864 576090 578452 581813 585463 588477 590445 591715 592828 593799 594067 593077 590841
60104 590841 587882 584626 580915 576253 570507 564215 558112 552520 547308 542320 537714 533917 531275 529722
60090 529722 528814 528181 527885 528148 528896 529933 531528 534343 538565 543462 548040 551883 555187 558288 561362
60075 561362 564193 565926 565420 562312 557587 552695 548316 544263 540259 536196 531732 526320 519835 512809
60061 512809 505891 499362 493310 487929 483371 479433 475608 471546 467379 463608 460614 458351 456576 455282
60047D55282n79K63J143K356M045N549N979N430M901M950N148N013M785M789M750
60032E13804M231L313K373J513O27l37j510l162n193o931p870q247q538q722q519
60017D66832q015p513o976o176n223m474m073l954m106m357m145l081j594n25
60003D02620r3K20Q12J521K020K145J809J112N71P14J340J691J553J597K318L203
59987D25153L462L219L326M096M848M858M278L761L483K983J932O93j02k77j67
59972D65546o6k2j07n51j331j905j703q13P8M50M45N34Q66J140J075Q34Q37J208
59954D66515J584J538J021K98m17j040j527j917k386k876k840j765q3R70O54m12
59938D57317j030q56o52j212k436l574m090m049l685k942j679k22O66O29K25K62
$$ plain form
60047 455282 454703 454966 456109 458465 462510 468059 474038 479468 484369 489319 494467 499480 504265 509054 513804
60032 513804 518035 521348 523721 525234 525861 525524 524014 520852 515659 508728 500858 492611 484073 475351 466832
60017 466832 458817 451304 444328 438152 432929 428455 424382 420428 416322 411965 407820 404739 403145 402620
60003 402620 402527 402747 403559 405080 407100 409245 411054 412166 412737 413451 414791 416482 418035 419632 421950 425153
59987 425153 428615 431834 435160 439256 444104 448962 453240 457001 460484 463467 465399 466092 465990 465713 465546
59972 465546 465480 465458 465351 464800 463469 461564 459861 459048 459126 459576 460021 460555 461421 462561 463636 464470 465307 466515
59954 466515 468099 469637 470658 470956 470539 469499 467972 466055 463669 460793 457953 456188 456105 457075 457729 457317
59938 457317 456287 455431 454779 453567 451131 447557 443467 439418 435733 432791 431112 430890 431556 432185 432410 432672
59922D32672Q20J370J713K256L234M173M426L925L149K591K451K636K796K599
59908D70811K130J876K154K701L030K971K729K504K315K108J917J820J774J483
59894E02323O44n71j499j656j261p37%J225K606L394L487L575M059M482M336L834
59878E28241L516L557L819M223M608M572L810K420P60p46j624j717j627k193l337
59863E48282m069l910l523l525l481k817j959j744k078k037j031P84K896M661
59849E26449N537N808O637Q622J0658J1090R637P304M702J699j332l149k937j176
59835E89549J070K914L515K116j181n068p973r130q747p570o483o034o093o185
59821E34700o217o391o524o084n012l907l213k815k581k719l195l455l076k293
$$ plain form
59922 432672 433492 434862 436575 438831 442065 446238 450664 454589 457738 460329 462780 465416 468212 470811
59908 470811 472941 474817 476971 479672 482702 485673 488402 490906 493221 495329 497246 499066 500840 502323
59894 502323 502967 502396 500897 499241 497980 497243 497243 498468 501074 504468 507955 511530 515589 520071 524407 528241
59878 528241 531757 535314 539133 543356 547964 552536 556346 558766 559526 558780 557156 555439 553812 551619 548282
59863 548282 544213 540303 536780 533255 529774 526957 524998 523254 521176 519139 518108 518892 521788 526449
59849 526449 531986 537794 544431 553053 563711 574801 584438 591742 596444 598143 596811 593662 590725 589549
59835 589549 590619 593533 597048 599164 597983 592915 584942 575812 567065 559495 553012 546978 540885 534700
59821 534700 528483 522092 515568 509484 504472 500565 497352 494537 491956 489237 486042 482587 479511 477218
59807D77218j595j157r66j067j323j347j011o82o72q39j038j505k405l352l870
59792D54389m040m194m227l752k872k227k243k657k908k720k265j908j893k162
59778D14321k422k402k014j296l72M55Q12O25K74K82Q47J765K632L080K972K572
59762D22131K379K694L320L780L766L350K831K489K426K609K966L357L535L323
59748D64956L012L226M148N079N114M225L276K977L153L118K446J357N24N02J178
59733E08291J794J725J141O72O68J042J637K204K230J429L60j10K9l6o26j064
59717E21386p94k25po7N5L51M97N00O62J037J482K016K676L136L075K787K841
59700E41408L207L267K808K350K266K142J481O96P77J938L111L010J488m30j697
$$ plain form
59807 477218 475623 474466 473500 472433 471110 469763 468752 468070 467398 466559 465521 464016 461611 458259 454389
59792 454389 450349 446155 441928 438176 435304 433077 430834 428177 425269 422549 420284 418376 416483 414321
59778 414321 411899 409497 407483 406187 405815 406270 407082 407707 407981 408263 409110 410875 413507 416587 419559 422131
59762 422131 424510 427204 430524 434304 438070 441420 444251 446740 449166 451775 454741 458098 461633 464956
59748 464956 467968 471194 475342 480421 485535 489760 493036 496013 499166 502284 504730 506087 506611 507113 508291
59733 508291 510085 511810 512951 513623 514291 515333 516970 519174 521404 522833 523193 523083 523112 523076 522450 521386
59717 521386 520592 520367 520360 520293 520348 520699 521196 521696 522358 523395 524877 526893 529569 532705 535780 538567 541408
59700 541408 544615 547882 550690 553040 555306 557448 558929 559625 560402 562340 565451 568461 569949 569519 567822
59685E67822k093k038j953k022k200k194j610n36K07k19j614k904l368l330l495
59670E38453l981m323m202l827l639l856m237m312l871l158k501j908j283q05
59656D92550o05k43Q30K195K659J885J093J505K693L224K569J474O00k08j160
59641E11061j967k420k843l444l769l385k750k666l061l032k143j009l69j64P8
59626D78117L94M58K40K2j64o08j396k196k658k722k507k208k143k492k927k933
59610D54277k487k012j596q80J12P91R77J233J745J642L40j170j408m13M20L07
59594D51878k70p93j373j916j780p91K42O10N90O99P56L12m90j069j220j167j122
59577D43096j156j351j720k105k388k588k628k397k129k301k855l037k350j246
$$ plain form
59685 567822 565729 563691 561738 559716 557516 555322 553712 553176 553383 553164 551550 548646 545278 541948 538453
59670 538453 534472 530149 525947 522120 518481 514625 510388 506076 502205 499047 496546 494638 493355 492550
59656 492550 491945 491702 492532 494727 497386 499271 500364 501869 504562 507786 510355 511829 512429 512221 511061
59641 511061 509094 506674 503831 500387 496618 493233 490483 487817 484756 481724 479581 478572 478203 478039 478117
59626 478117 478511 478969 479209 479231 479067 478459 477063 474867 472209 469487 466980 464772 462629 460137 457210 454277
59610 454277 451790 449778 448182 447302 447414 448205 449182 450415 452160 453802 454142 452972 451564 451151 451571 451878
59594 451878 451608 450815 449442 447526 445746 444955 445197 445807 446397 447096 447852 448164 447674 446605 445385 444218 443096
59577 443096 441940 440589 438869 436764 434376 431788 429160 426763 424634 422333 419478 416441 414091 412845
59563D12845m94k71k35j80l0L90J137J803J918J530J067P80O22N83P62J180J793
59546D25200K586L471M229M711M984N152N328N852P228R598J2655J6080J9490
59533E26564K1695K0770J5742P963K37n286q045q390o915m493k134l49J102K636
59519E61097M172N119M958L793K322J144J08j381l396n238o317o940p795q982
59505E42664r932j0147r670q898q200p675p140o398n520m657l653k324j085o72
59491D56693j066j340r02k44M7K35Q19J538J866K056K822M123N123N328N130N182
59475D87410N765O732P630P988P816P594P326O115L396J61j906k361k179k114
59461E39373j956j413p04J44J611L828O060P607Q661R820J1182J2432J3393J4030
$$ plain form
59563 412845 412351 412080 411845 411665 411635 412025 413162 414965 416883 418413 419480 420260 420882 421465 422227 423407 425200
59546 425200 427786 431257 435486 440197 445181 450333 455661 461513 468741 478339 490994 507074 526564
59533 526564 548259 569029 584771 592734 592971 587685 579640 571250 564335 559842 557708 557359 558461 561097
59519 561097 565269 570388 575346 579139 581461 582605 582713 581332 577936 572698 566381 559441 551646 542664
59505 542664 532732 522585 512915 504017 495817 488142 481002 474604 469084 464427 460774 458450 457365 456693
59491 456693 455627 454287 453385 453141 453188 453423 454242 455780 457646 459702 462524 466647 471770 477098 482228 487410
59475 487410 493175 499907 507537 515525 523341 530935 538261 544376 547772 547933 546027 543666 541487 539373
59461 539373 537417 536004 535300 535444 537055 540883 546943 554550 563211 573031 584213 596645 610038 624068
59447F24068J4107J3455J2389J1474J0729R355O361J528m127q906j1640j2449
59435F66344j2270j1793j1061r995q888q255q364q966r442r215q220o723m802
59422E48350k277O00L031M694O411R121J2510J5441J7465J9064K0578K1990K3658
59409G00636K5912K7374K4947J6704M350p884j6522k0596k0840j8338j3981q371
59397F93391j887M696R464R813M296n772j6741k4901k8566k8349k5903k2632j9396
59384E47513j6634j4300j1977r447p127n519m469l435k363j705j468r81K10J603
59370D69901K321K121J523J202J456K068K522K491K264K438L122L764L926L900
59356E05019M281N176O186P008P745Q653R817J1198J2806J4699J6756J8549J9577
$$ plain form
59447 624068 638175 651630 664019 675493 686222 695577 701938 703466 699339 690433 678793 666344
59435 666344 654074 642281 631220 621225 612337 604082 595718 586752 577310 568095 559875 553152 548350
59422 548350 546073 546673 549704 554398 560809 569930 582440 597881 615346 634410 654988 676978 700636
59409 700636 726548 753922 778869 795573 799923 792039 775517 754921 734081 715743 701762 693391
59397 693391 691504 696200 705664 715477 719773 714001 697260 672359 643793 615444 589541 566909 547513
59384 547513 530879 516579 504602 495155 488028 482509 478040 474605 472242 470537 469069 468088 468298 469901
59370 469901 472222 474343 475866 477068 478524 480592 483114 485605 487869 490307 493429 497193 501119 505019
59356 505019 509300 514476 520662 527670 535415 544068 553885 565083 577889 592588 609344 627893 647470
59343F47470J9704J9242J8639J8129J7766J7412J6621J4855J2113R080O303L568
59331H20902L99l066o245q831j0843j2157j2683j2835j3135j3358j2803j1490
59319G03855j0315r868r808r657r469r285q636p242n720n000n135n287m674l205
59305F00554j257P11K414L871N379P197R278J1446J3638J5764J7309J7216J4395
59292G17915Q552P35p075j3076j6447j7227j5958j3714j1792j0676r506p263m264
59279F00204j764j77J329L376N489P014Q097R253J0549J1759J2774J3400J3268
59266F94571J2437J1591J1117J0408Q633N854K860J30k440m996p467r788j1926
59253G20984j3689j4767j4958j4202j2652j0843r502q849q377p551o484n581m856
$$ plain form
59343 647470 667174 686416 705055 723184 740950 758362 774983 789838 801951 811031 817334 820902
59331 820902 821301 818235 811990 803159 792316 780159 767476 754641 741506 728148 715345 703855
59319 703855 693540 683672 673864 664207 654738 645453 636817 629575 623855 618855 613720 608433 603759 600554
59305 600554 599297 600008 602422 606293 611672 618869 628147 639593 653231 668995 686304 703520 717915
59292 717915 726467 727202 720127 707051 690604 673377 657419 643705 631913 621237 611731 604468 600204
59279 600204 598440 598263 599592 602968 608457 615471 623568 632821 643370 655129 667903 681303 694571
59266 694571 707008 718599 729716 740124 748757 754611 757471 757601 755161 750165 742698 732910 720984
59253 720984 707295 692528 677570 663368 650716 639873 630371 621522 613145 605594 599110 593529 588673
59240E88673l991k838j502q2J320K508L396M118M658M626L819K689J869J359O62
59225F11284m23j649k901m398o136p586q228q201q124q297q338p759o778o242
59211E26224o549o987o483m889l093j915j378j083p79l62K21Q19J150J273J658
59196D97827K559L640M417M747M748M560M331M123L776L181K710K858L389L526
59182E50392L124K954L499M205M374M149M035M079M178M613N517O258O148N516
59168F13041N336N948O875P696Q397Q895Q928Q507P931P313O463N275L858K313
59154G06776O76j009k847n096p661r840j0968j1102j0705r984r016q202p882p711
59140F05429p069o021n234m967m761m143l097j808n51J42j49r96j254k27J635
$$ plain form
59240 588673 584682 581844 580342 580260 581580 584088 587484 591602 596260 600886 604705 607394 609263 610622 611284
59225 611284 610861 609212 606311 601913 595777 588191 579963 571762 563638 555341 547003 539244 532466 526224
59211 526224 519675 512688 506205 501316 498223 496308 494930 493847 493068 492706 492927 493746 494896 496169 497827
59196 497827 500386 504026 508443 513190 517938 522498 526829 530952 534728 537909 540619 543477 546866 550392
59182 550392 553516 556470 559969 564174 568548 572697 576732 580811 584989 589602 595119 601377 607525 613041
59168 613041 618377 624325 631200 638896 647293 656188 665116 673623 681554 688867 695330 700605 704463 706776
59154 706776 707452 706443 703596 698500 690839 680999 670031 658929 648224 638240 629224 621022 613140 605429
59140 605429 598360 592339 587105 582138 577377 573234 570137 568329 567778 567920 567771 566775 565521 565294 566929
59125E66929L341M354M829N194N752O539P464Q468R487J0221J0302R901R799J0481
59111F73061J1439J1789J1290J0251Q777O866N022L972L633L099J917P06K46M12
59097G52480L96l26j623k964l804l879l462l257l750m628m970m141k508j223j237
59082G11104k552m507o550q449r892j0470j0258r839r584r323q960q770q735q176
59068E95039o711n093m394m700n211n392n249m787l939k989k415k346k640l257
59054E35916l950l964k832j347q53j583k477k636k146j408n74J29K93l7k52M6
59038E12325O16J092J353J333J027Q84J443K474L135L171L232L722M226M478N076
59023E49587O569Q419R702J0347J0973J1801J2417J2507J2122J1274R798P725
$$ plain form
59125 566929 570270 574624 579453 584647 590399 596938 604402 612870 622357 632578 642880 652781 662580 673061
59111 673061 684500 696289 707579 717830 726607 733473 738495 742467 746100 749199 751116 751822 752068 752480
59097 752480 752876 752550 750927 747963 744159 740280 736818 733561 729811 725183 720213 716072 713564 712341 711104
59082 711104 708552 704045 697495 689046 679154 668684 658426 648587 639003 629680 620720 611950 603215 595039
59068 595039 588328 583235 578841 574141 568930 563538 558289 553502 549563 546574 544159 541813 539173 535916
59054 535916 531966 528002 525170 523823 522970 521387 518910 516274 514128 512720 512146 512275 512568 512531 512279 512325
59038 512325 512941 514033 515386 516719 517746 518630 520073 522547 525682 528853 532085 535807 540033 544511 549587
59023 549587 556156 564575 574277 584624 595597 607398 619815 632322 644444 655718 665516 673241
59011F73241N365K945N22j612k804k663j687r96j196j674j286K78K177L563M546
58996F78719N645O691O967O267N153M120L114J980Q25k67j483k982m643o204p360
58981F96542p779p370o490n524m319k598p35M78R87J666L172N218P207Q919J0240
58966F99614J0832J0634J0301J0588J1488J2286J2316J1446J0013Q447O880M983
58954H19828K399p44l995p148j0224j2953j4799j5578j5578j5054j4112j3017
58942F99025j2005j0719q629o112m300l605l249k625k258k744l580l839l554l500
58928F28306l962m424m418m020l506l098k958l082l187l011k661k457k520k661
58914E82341k503j692k49J144J690J470J460K282L450M241M769N672P134Q820
$$ plain form
59011 673241 678606 681551 682073 680461 677657 674994 673307 672311 671115 669441 668155 668433 670610 674173 678719
58996 678719 684364 691055 698022 704289 709442 713562 716676 718656 719481 719214 717731 714749 710106 703902 696542
58981 696542 688763 681393 674903 669379 665060 662462 661727 662205 663192 664858 668030 673248 680455 689374 699614
58966 699614 710446 721080 731381 741969 753457 765743 778059 789505 799518 807965 814845 819828
58954 819828 822227 821483 817488 810340 800116 787163 772364 756786 741208 726154 712042 699025
58942 699025 687020 676301 667672 661560 657260 653655 650406 647781 645523 642779 639199 635360 631806 628306
58928 628306 624344 619920 615502 611482 607976 604878 601920 598838 595651 592640 589979 587522 585002 582341
58914 582341 579838 578146 577897 579041 580731 582201 583661 585943 589393 593634 598403 604075 611209 620029
58900F20029J0539J2311J3930J4963J5262J5028J4398J3321J1909J0655J0188
58889G62533J0845J2382J4190J5936J7924K0441K2806K3645K2222J9023J4916
58878I56863J0411N938K127q35l583o769j0279j3677j6838j9576k1168k1001j9444
58865H42169j7407j5364j3373j1726j0707j0009r168q442q424q922r107q802q727
58852G01991r195r460q792p583o772o620o604o278n708n135m675m486m846n833
58838F10004o951p396o828n775n063m915m850m460l904l546l454l469l445l180
58824E42768k375r95N38J736K476K841K892K819K979L431L705L459L038K976L187
58809E75475L197K979K941L111K905J933N46n74j185j579k130k874l506l754l740
$$ plain form
58900 620029 630568 642879 656809 671772 687034 702062 716460 729781 741690 752345 762533
58889 762533 773378 785760 799950 815886 833810 854251 877057 900702 922924 941947 956863
58878 956863 967274 973212 975339 974504 970921 964152 953873 940196 923358 903782 882614 861613 842169
58865 842169 824762 809398 796025 784299 773592 763583 754415 745973 737549 728627 719520 710718 701991
58852 701991 692796 683336 674544 666961 660189 653569 646965 640687 634979 629844 625169 620683 615837 610004
58838 610004 603053 595657 588829 583054 577991 573076 568226 563766 559862 556316 552862 549393 545948 542768
58824 542768 540393 539398 539936 541672 544148 546989 549881 552700 555679 559110 562815 566274 569312 572288 575475
58809 575475 578672 581651 584592 587703 590608 592541 593087 592513 591328 589749 587619 584745 581239 577485 573745
58794E73745l847m237m620m663m358l873l211k304j253k91M76J139J881K849L942
58779E51375M716M799M491M525N070N351M575K876R72p10k184l484m613n724o918
58764E65117p925q355q179p647o875n804m446k934j431k17M11N89R78J997L250
58749E18529M060M329M379M248L786L329L610M812O148O708O439O092O354P160
58735E89983P918Q240Q308Q380Q206P403O343N949O450O904O390N074L697K507
58721F81752J330L03k17k88k81k52O4P41J608K573L501L986L789L310L050K679
58705G07648J405p51k758l856m496n657p645r919j1796j3015j3727j4200j4547
58692F06686j4636j4241j3191j1489r382p424o135n549n251n041n186n841o566
$$ plain form
58794 573745 569898 565661 561041 556378 552020 548147 544936 542632 541379 541088 541564 542703 544584 547433 551375
58779 551375 556091 560890 565381 569906 574976 580327 584902 587778 588750 588040 585856 582372 577759 572035 565117
58764 565117 557192 548837 540658 533011 526136 520332 515886 512952 511521 511304 511715 512304 513282 515279 518529
58749 518529 522589 526918 531297 535545 539331 542660 546270 551082 557230 563938 570377 576469 582823 589983
58735 589983 597901 606141 614449 622829 631035 638438 644781 650730 657180 664084 670474 675548 679245 681752
58721 681752 683082 683385 683168 682880 682599 682347 682411 683152 684760 687333 690834 694820 698609 701919 704969 707648
58705 707648 709053 708302 705544 701688 697192 691535 683890 673971 662175 649160 635433 621233 606686
58692 606686 592050 577809 564618 553129 543747 536323 530188 524639 519388 514347 509161 503320 496754
58679D96754o756o272n327m087k677j367l05O89J735K532K809K931L560M852O371
58664D95442P729Q916J0026J0938J1257J0486Q439N626K975R58o82k201l397m152
58650E62360m855n782o449o248n379m565m117l838l674l777m010l948l428k693
58636D99597k014j439q71j56P36J496J707J448J264J331J167N38M8L20J093J662
58620E07927J839J951K334L222M662O070O505N988N820O882Q292Q625P802O749
58606E84668N764M429K835J650J032N47Q9q9k17q59j946k785l073l110l036k690
58590E83209k140j559o48R78K883M184M784N395O378P431Q403R450J0343J0477
58576F49568R775Q793P904P046O229N597N020M433M415N637P870J0348J2861J5601
$$ plain form
58679 496754 489998 483726 478399 474312 471635 470268 469963 470652 472387 474919 477728 480659 484219 489071 495442
58664 495442 503171 512087 522113 533051 544308 554794 563233 568859 571834 572792 572110 569909 566512 562360
58650 562360 557505 551723 545274 539026 533647 529082 524965 521127 517453 513676 509666 505718 502290 499597
58636 499597 497583 496144 495273 495117 495853 497349 499056 500504 501768 503099 504266 504804 504852 505172 506265 507927
58620 507927 509766 511717 514051 517273 521935 528005 534510 540498 546318 553200 561492 570117 577919 584668
58606 584668 590432 594861 597696 599346 600378 600925 601014 600925 600708 599849 597903 595118 592045 588935 585899 583209
58590 583209 581069 579510 578862 579840 582723 586907 591691 597086 603464 610895 619298 628748 639091 649568
58576 649568 659343 668136 676040 683086 689315 694912 699932 704365 708780 714417 722287 732635 745496 761097
58562G61097J8222K0126K1559K3217K4853K5466K4893K3895K2573K0052J6051
58551A002004J1542P457L790M25k278m172n662o913p608p834q324r477j1005j2818
58537I49127j5218j7926j9973k0952k1465k1870k1648k0452j8806j7140j5110
58526G38567j2458r731p490n552l599j856o04K95R68J199R90P99Q12O64K04q8
58510G03120J26N35P81R42J114J095P91L31l21j270k163k506k466k586k780k593
58494F92150k321k647l170k674j064L47Q05J046J846L011M307N999P851Q950R215
58479G23651R883J1707J3880J5417J6391J7006J6722J5205J2995J0402O876K368
58467H72503j839m659o476p984q841q594p807p146o216m473k427p79Q01K927N214
$$ plain form
58562 761097 779319 799445 821004 844221 869074 894540 919433 943328 965901 985953 1002004
58551 1002004 1013546 1021003 1024793 1025218 1022940 1018768 1013106 1006193 998585 990751 982427 972950 961945 949127
58537 949127 933909 915983 896010 875058 853593 831723 810075 789623 770817 753677 738567
58526 738567 726109 716378 708888 703336 699737 697881 697277 697572 698540 699739 700729 701528 702340 703004 703208 703120
58510 703120 703246 703781 704562 705504 706618 707713 708504 708835 708514 707244 705081 702575 700109 697523 694743 692150
58494 692150 689829 687182 684012 681338 680274 680621 681426 682472 684318 687329 691636 697635 705486 714436 723651
58479 723651 733534 745241 759121 774538 790929 807935 824657 839862 852857 863259 870135 872503
58467 872503 870664 866005 859529 851545 842704 834110 826303 819157 812941 808468 806041 805262 806063 808990 814204
58452H14204O934Q182R359J0038R421P437M504Q02l330o887r027r985j0417j0423
58438H20812r841q833p468n440k878o54O99J687K839L937M825N884P096P728P787
58423H28180Q508J0522J2693J3794J4009J3737J2223Q831M583R71j858m427o429
58410I15337p316p589q058q534q490q298q490q589p895o758n841m834l159j202
58396H20284L67J726L252M516N067N327N648N432M350L306K946K436J139J78P52
58381H66726K060K617K445K231J490l76k207k476j679j289j090K36K506M284N313
58366H80791O557Q156R366J0269J1619J3233J4340J5202J6486J7517J7085J5545
58354A036166J4124J2590R827O392M191L654L364K601K170K541L058L263L377
$$ plain form
58452 814204 821138 829320 838679 848717 858138 865575 870079 870881 867551 860664 851637 841652 831235 820812
58438 820812 810971 802138 794670 789230 786352 785698 786397 788084 790923 794860 799685 805569 812665 820393 828180
58423 828180 836688 847210 859903 873697 887706 901443 913666 922497 927080 928051 926193 921766 915337
58410 915337 908021 900432 892374 883840 875350 867052 858562 849973 842078 835320 829479 824645 821486 820284
58396 820284 820651 822377 825629 830145 835212 840539 846187 851619 855969 859275 862221 864657 865796 865974 866726
58381 866726 868786 871403 873848 876079 877569 877193 874986 872510 870831 869542 868452 868688 871194 875478 880791
58366 880791 887348 895504 904870 915139 926758 939991 954331 969533 986019 1003536 1020621 1036166
58354 1036166 1050290 1062880 1072707 1079099 1083290 1086944 1090308 1092909 1095079 1097620 1100678 1103941 1107318
58341A107318L387L203L681N817R010J1681J3382J4821J6132J6853J7220J7783
58329A240288J8086J7364J6085J5074J3806J1445Q837P295O225M309K285J899
58317A362998K653K493J517K000M589P242Q430Q795R312J0101J1459J3777J6122
58304A461488J7032J6923J7530J9023J9886J9675J9461J9539J9129J8431J8453
58293A666570J8802J8156J7056J7486J9620K1625K2838K4374K6366K7502K7716
58282A908111K8547L0335L1676L2128L2855L4256L5473L6426L7793L8933L8666
58271B285199L7951L8935M1325M2895M3434M4890M7700N0450N3189N7290O2042
58260B805300O5209O7131P0156P3848P5218P4031P3321P3991P3723P2140P2090
$$ plain form
58341 1107318 1110705 1113908 1117589 1123406 1132416 1144097 1157479 1172300 1188432 1205285 1222505 1240288
58329 1240288 1258374 1275738 1291823 1306897 1320703 1332148 1340985 1348280 1354505 1358814 1361099 1362998
58317 1362998 1365651 1368144 1369661 1371661 1376250 1383492 1391922 1400717 1410029 1420130 1431589 1445366 1461488
58304 1461488 1478520 1495443 1512973 1531996 1551882 1571557 1591018 1610557 1629686 1648117 1666570
58293 1666570 1685372 1703528 1720584 1738070 1757690 1779315 1802153 1826527 1852893 1880395 1908111
58282 1908111 1936658 1966993 1998669 2030797 2063652 2097908 2133381 2169807 2207600 2246533 2285199
58271 2285199 2323150 2362085 2403410 2446305 2489739 2534629 2582329 2632779 2685968 2743258 2805300
58260 2805300 2870509 2937640 3007796 3081644 3156862 3230893 3304214 3378205 3451928 3524068 3596158
58249C596158P4543P7083P8943Q2615Q8830R4800R9416J05366J14081J23206J31198
58238D666239J39758J49616J58617J66130J74728J85421J95977K05970K18409
58229F260865K34271K50666K66567K84912L06804L29455L52260L78856M10458
58220I075114M43547M77028N15137N60220O09557O62681P24672P98480Q81444
58211A4747880R73167J079172J202973J343115J502551J692084J920280K190073
58203B6651295K510691K902560L385652L976810M707494N632067O808107Q276167
58195F4850843J0060375J2169607J4591237J7310837K0359147K3816468K7724496
58188A90883010L1938600L5960552L8778367L8875906L4704239K5622275J2692339
$$ plain form
58249 3596158 3670701 3747784 3826727 3909342 3998172 4092972 4192388 4297754 4411835 4535041 4666239
58238 4666239 4805997 4955613 5114230 5280360 5455088 5640509 5836486 6042456 6260865
58229 6260865 6495136 6745802 7012369 7297281 7604085 7933540 8285800 8664656 9075114
58220 9075114 9518661 9995689 10510826 11071046 11680603 12343284 13067956 13866436 14747880
58211 14747880 15721047 16800219 18003192 19346307 20848858 22540942 24461222 26651295
58203 26651295 29161986 32064546 35450198 39427008 44134502 49766569 56574676 64850843
58195 64850843 74911218 87080825 101672062 118982899 139342046 163158514 190883010
58188 190883010 222821610 258782162 297560529 336436435 371140674 396762949 409455288
58181D09455288j482031j3979287k2964995k8238282l0706063l1448780l1133396
58174B49502454k9990100k8088407k5574398k2716208j9803781j7041201j4527034
58167I1761325j2300970j0378268q748821p379423o234811n288014m509443l862937
58159C3058638l319886k865827k488300k169818j897605j668916j480379j321366
58151A5846541j183077j065042r66780q81061q01164p27721o62848o03779n47478
58142H407591m95666m50227m08658l68721l32856l03827k80386k60899k46682
58133E259669k37847k30123k19798k08021j96949j85512j72475j59871j49700
58124C499373j40530j30693j21658j15052j09317j02531r5720r0453q5799q0481
$$ plain form
58181 409455288 407973257 393993970 371028975 342790693 312084630 280635850 249502454
58174 249502454 219512354 191423947 165849549 143133341 123329560 106288359 91761325
58167 91761325 79460355 69082087 60333266 52953843 46719032 41431018 36921575 33058638
58159 33058638 29738752 26872925 24384625 22214807 20317202 18648286 17167907 15846541
58151 15846541 14663464 13598422 12631642 11750581 10949417 10221696 9558848 8955069 8407591
58142 8407591 7911925 7461698 7053040 6684319 6351463 6047636 5767250 5506351 5259669
58133 5259669 5021822 4791699 4571901 4363880 4166931 3981419 3808944 3649073 3499373
58124 3499373 3358843 3228150 3106492 2991440 2882123 2779592 2683872 2593419 2507620 2427139
58114B427139p5475p1806o8331o4193o0930n9605n8416n5618n2398n0483m9279
58103A760605m7720m6527m6272m5547m3444m1567m1266m1091l9316l6753l4749
58092A296353l2692k9822k7365k6310k5216k2680j9975j8728j7939j6018j3925
58081A045683j3471j4088j4076j3726j4464j6041j7113j7731j8721j9542j9076
58070H67634j7815j7079j6822j6230j5576j5452j5003j3164j0879r860r791q923
58058G01040p119o082o745q303r817j1058j1703j1234r902q600p731p030o354
58045E89362n864n632n720o178o495n792m260l404m096n245n405m701m138l999
58031E18433m097m725o141p739q821r566j0258j0350r317p761o647o108n864n993
$$ plain form
58114 2427139 2351664 2279858 2211527 2147334 2086404 2026799 1968383 1912765 1860367 1809884 1760605
58103 1760605 1712885 1666358 1620086 1574539 1531095 1489528 1448262 1407171 1367855 1331102 1296353
58092 1296353 1263661 1233839 1206474 1180164 1154948 1132268 1112293 1093565 1075626 1059608 1045683
58081 1045683 1032212 1018124 1004048 990322 975858 959817 942704 924973 906252 886710 867634
58070 867634 849819 832740 815918 799688 784112 768660 753657 740493 729614 719754 709963 701040
58058 701040 693921 687839 681094 672791 662974 651916 640213 628979 619077 610477 602746 595716 589362
58045 589362 583498 577866 572146 565968 559473 553681 549421 546017 541921 536676 531271 526570 522432 518433
58031 518433 514336 509611 503470 495731 486910 477344 467086 456736 447419 439658 433011 426903 421039 415046
58017D15046o348o098m851l492k997l153l284l264k943j704L32J642J131l24j202
58002C78491j350j432j411r34m92p72j482k014k639l931n479o333o155n087l235
57987C35745j165m7k13n06k7M55j4q88j195j234j650j844j022k2k64j429j903
57970C22777j194l01N7Q2L5K8M78J554K459K464K120K309K663K372J872K107K540
57953C44422J717k99j695j316J47J454K083K058J625J329J551J986K215K503L200
57938C62980L860L961L978M678N793O562P066P769Q264P745O356M732K715n3k758
57923D33648m218m738n646p174q429r167r960j0679j0518r586q841q393p472o096
57909C22731n113m451l085j037L17L50RM3J1m02o42n48q71j748k088j267k49q9
$$ plain form
58017 415046 408698 402600 397749 394257 391260 388107 384823 381559 378616 376912 377244 378886 380017 379693 378491
58002 378491 377141 375709 374298 373364 372872 372100 370618 368604 365965 362034 356555 350222 344067 338980 335745
57987 335745 334580 334533 334320 333814 333787 334242 334228 333340 332145 330911 329261 327417 326395 326373 326109 324680 322777
57970 322777 321583 321282 321339 321421 321456 321484 321962 323516 325975 328439 330559 332868 335531 337903 339775 341882 344422
57953 344422 346139 345840 344145 342829 342976 344430 346513 348571 350196 351525 353076 355062 357277 359780 362980
57938 362980 366840 370801 374779 379457 385250 391812 398878 406647 414911 422656 429012 433744 436459 436406 433648
57923 433648 429430 424692 419046 411872 403443 394276 384316 373637 363119 353533 344692 336299 328827 322731
57909 322731 317618 313167 310082 309045 309362 309712 309721 309764 309775 309373 308731 308183 307312 305564 303476 302209 301960 301871
57891C01871l94k19M49R61J058Q57M39Nj57k62q98j958k544k321k048k393l100
57874B89346l766m462n081n049m331l775l822l787l118k414k419k732k457j514
57860B40619m22O66J874K939L460L627M021M834N729O280O224N540M624M067L951
57845B98033L711K953J930J012J29q32j609j947k034k148k147j774j181q20q95
57830B92381j163j191o67L94J688K939M045M728M457L238K135K277L455M333M008
57815C27057K691J052l28q96n40j92j234l929p077r362j0351j0235r393q445p906
57800B60912p562o853n897n335n066m182k446q46k07j28J73P41J163J334J408
57785B27209J479J749K500L605M516M999N335N713N993O218O600O922O685O020
$$ plain form
57891 301871 301477 301258 301707 302668 303726 304583 305022 305027 304870 304608 303710 301752 299208 296887 294839 292446 289346
57874 289346 285580 281118 276037 270988 266657 262882 259060 255273 252155 249741 247322 244590 242133 240619
57860 240619 240197 240863 242737 245676 249136 252763 256784 261618 267347 273627 279851 285391 290015 294082 298033
57845 298033 301744 304697 306627 307639 307768 306936 305327 303380 301346 299198 297051 295277 294096 293276 292381
57830 292381 291218 290027 289360 289754 291442 294381 298426 303154 307611 310849 312984 315261 318716 323049 327057
57815 327057 329748 330800 330472 329576 329036 328844 327610 323681 316604 307242 296891 286656 277263 268818 260912
57800 260912 253350 246497 240600 235265 230199 226017 223571 222725 222518 222390 222563 223304 224467 225801 227209
57785 227209 228688 230437 232937 236542 241058 246057 251392 257105 263098 269316 275916 282838 289523 295543
57771B95543N573N398M784L409J667k52k534m765o029o394p032q266q790p697
57757B64615o053n402n680n760n285m755m379l930l479l301l304l160k755j972
57743B05400n56J277K657L073K984K871K413J257j22j128j910k679k898k060p37
57728B09842J66O69J312J934J896J246O69M54K39l50j379k570l112k152q2J397
57712B10179J252M24J92J57q93k736l890l767l156k689k199j681j556j707j415
57697A86515n35K70O41R39J244J039K28m18l93j83l63o41m09L22J053J576K048
57680A92933K555L004L452M249N832Q344J1525J5069J9167K4341L0644L7439M4294
57667D02848N1550N9340O6152O8907O4380N0663K8284R25k5419m5379n6932o1200
$$ plain form
57771 295543 301116 306514 311298 314707 316374 316122 313588 308823 302794 296400 289368 281102 272312 264615
57757 264615 258562 253160 247480 241720 236435 231680 227301 223371 219892 216591 213287 210127 207372 205400
57743 205400 204844 206121 208778 211851 214835 217706 220119 221376 221254 220126 218216 215537 212639 210579 209842
57728 209842 210008 210677 211989 213923 215819 217065 217734 218188 218427 218077 216698 214128 211016 208864 208782 210179
57712 210179 211431 211855 212047 212204 211311 208575 204685 200918 197762 195073 192874 191193 189637 187930 186515
57697 186515 185980 186250 186891 187830 189074 190113 190341 189923 189530 189347 188984 188343 187934 188256 189309 190885 192933
57680 192933 195488 198492 201944 206193 212025 220369 231894 246963 266130 290471 321115 358554 402848
57667 402848 454398 513738 579890 648797 713177 763840 792124 793049 767630 722251 665319 604119
57655F04119o0214n5655m9249m2764l7029l1651k6126k0758j6242j2869j0381
57644B41181q337o465m858l822l347k972k456k178k397k624k303j720j426j187
57630A95089m15O03R99P06N01N96K94p67k003k796l143l125k606j800j339j357
57614A79437j266p47k25l9L8R2l15j260j971j904j633j949k591k669k021j329
57598A59648j088j132j170j176j155j013p51n95p72j286j924k381k475k260j869
57583A38601j304n47J16J98m45j370j953j952j610j407j624k048k142j673j028
57568A19812p46r16j295j736k121k096j428n12J8J11K22N27P80R14J173J518J584
57551A15809J333J193J365J489J217O76J42k88n20l33L09J108J742K069J987J419
$$ plain form
57655 604119 543905 488250 439001 396237 359208 327557 301431 280673 264431 251562 241181
57644 241181 232844 226379 221521 217699 214352 211380 208924 206746 204349 201725 199422 197702 196276 195089
57630 195089 194674 195277 196276 196982 197483 198079 198373 197606 195603 192807 189664 186539 183933 182133 180794 179437
57614 179437 178171 177424 177199 177160 177198 177290 176975 175715 173744 171840 170207 168258 165667 162998 160977 159648
57598 159648 158560 157428 156258 155082 153927 152914 152163 151568 150796 149510 147586 145205 142730 140470 138601
57583 138601 137297 136750 136866 137064 136619 135249 133296 131344 129734 128327 126703 124655 122513 120840 119812
57568 119812 119066 118150 116855 115119 112998 110902 109474 108962 108980 109091 109313 109840 110620 111534 112707 114225 115809
57551 115809 117142 118335 119700 121189 122406 123082 123224 122936 122416 122083 122392 123500 125242 127311 129298 130717
57535A30717N48k13n58m47p1J32l16j319k053j922j366j108r69l10O15Q12J44
57518A22316l01L00J532K529K933K719J877P89J56J34Q8l66p42n08O4L95L43O5
57500A34323l52o91n91j43j7n25j176j496j694j976j941j311p20q81j424j354
57484A18031m38O00J118J100P97M81M69Q48J081N14p16j687j728j106n85n10n88
57467A17681m33j82l20q48r81j18J095J330K46j004j186l23O31R65O38Pn24q04
57449A15870j077j569j849j210J66J115R05J24k68j39R1L19O77J004J059J023
57433A16241J163J235Q21J26j34M27J464K245K204J295K7r76j552j890j917j356
57417A19423n08j65m36m59K91J062R15J16l24n5M14O08M88J43k91n78o36n92l51
$$ plain form
57535 130717 131265 131052 130494 130047 129976 130108 129792 128473 126420 124498 123132 122024 121055 120745 121360 122172 122316
57518 122316 122015 122315 123847 126376 129309 132028 133905 134694 134850 134984 135072 134706 133964 133456 133520 133915 134258 134323
57500 134323 133971 133280 132689 132546 132529 132004 130828 129332 127638 125662 123721 122410 121690 120809 119385 118031
57484 118031 117593 118193 119311 120411 121208 121689 122158 123006 124087 124601 123885 122198 120470 119364 118779 118269 117681
57467 117681 117248 117066 116746 115898 114917 114799 115894 117224 117470 116466 115280 114957 115588 116553 117191 117198 116674 115870
57449 115870 114793 113224 111375 110165 110331 111446 112351 112475 112207 112068 112159 112478 113155 114159 115218 116241
57433 116241 117404 118639 119460 119586 119452 119879 121343 123588 125792 127087 127114 126138 124586 122696 120779 119423
57417 119423 118915 118750 118314 117855 118146 119208 120123 120239 119915 119860 120274 120882 121370 121513 121222 120644 120008 119416 119065
57398A19065L93J337J467L95q37j074n45j81n1M60J286J676J435J127J044R01
57382A27898O33N52O15L78j34k45M21J420K038J926J125L7o23m29J53K38l88j117
57364A34498j375j073l12O63J259R32mo00l44L68Q95R60O48L23N15J335K111K072
57346A42871J370P73N45K77k22o68q88r63o97K13J343J741J174M89M11P69J120
57329A49658J409J626J506J025O16M24l0r15j425p20P43J596J146R7m44j49M24
57312A56587O74N87M97M50J48m39q23o71l21k49l23j60P4q0m49k63P29J899K563
57293A60430K601K152J343N62L74Q79J554J953K140K297K317K081J719J443J366
57278A85211J604K124K516K335J736J268J065P88L99L01N28N09j5m61k13N40J213
$$ plain form
57398 119065 119458 120795 122262 122657 121820 120746 120201 120020 119969 120429 121715 123391 124826 125953 126997 127898
57382 127898 128531 129083 129698 130076 129942 129697 130118 131538 133576 135502 136627 136664 136041 135612 135765 136003 135615 134498
57364 134498 133123 132050 131738 132401 133660 134592 134588 133988 133644 134012 134907 135867 136515 136838 137353 138688 140799 142871
57346 142871 144241 145014 145559 145836 145614 144946 144058 143095 142398 142611 143954 145695 146869 147358 147769 148538 149658
57329 149658 151067 152693 154199 155224 155840 156264 156234 155319 153894 153174 153917 155513 156659 156756 156312 156163 156587
57312 156587 157261 157848 158345 158795 158943 158504 157681 157010 156689 156440 156117 155957 156031 155951 155502 155239 155968 157867 160430
57293 160430 163031 165183 166526 167088 167462 168341 169895 171848 173988 176285 178602 180683 182402 183845 185211
57278 185211 186815 188939 191455 193790 195526 196794 197859 198647 199046 199347 199875 200384 200369 199908 199695 200235 201448
57261B01448J648K029K344K378K132J858J777J867J919J682J174Q17J014J625
57247B25712K130K290K324K488K860L415L875L687K696J767K036L517N100N907
57233B69804N982N652N113M736M988N691O178O404P007Q005Q435P889P454Q345
57219C61683J0238J1781J2275J2073J1738J1563J1705J2110J2394J2325J2178
57208D92063J2255J2392J2364J2456J2994J3619J3642J3055J2602J2893J3803
57197F34138J4810J5490J5697J5533J5260J5172J5471J6121J6715J6709J6037
57186H07153J5321J5091J5066J4777J4589J5214J6371J7043J7099J7559J8837
57175I84120J9960K0092J9797J9966K0394K0382J9962J9589J9196J8626J8458
$$ plain form
57261 201448 203096 205125 207469 209847 211979 213837 215614 217481 219400 221082 222256 223073 224087 225712
57247 225712 227842 230132 232456 234944 237804 241219 245094 248781 251477 253244 255280 258797 263897 269804
57233 269804 275786 281438 286551 291287 296275 301966 308144 314548 321555 329560 337995 345884 353338 361683
57219 361683 371921 383702 395977 408050 419788 431351 443056 455166 467560 479885 492063
57208 492063 504318 516710 529074 541530 554524 568143 581785 594840 607442 620335 634138
57197 634138 648948 664438 680135 695668 710928 726100 741571 757692 774407 791116 807153
57186 807153 822474 837565 852631 867408 881997 897211 913582 930625 947724 965283 984120
57175 984120 1004080 1024172 1043969 1063935 1084329 1104711 1124673 1144262 1163458 1182084 1200542
57164A200542J9324K0705K1422K1152K0565K0150J9828J9651J9943K0648K1253
57153A425183K1504K1658K1943K2364K2989K3970K5143K6093K6630K6909K7076
57142A691462K7176K7308K7640K8298K9401L0920L2395L3266L3759L4926L7355
57131B033906M0427M3289M6026M9157N2557N5724N8783O2359O6608P1220P6195
57120B656251Q1930Q8584R5973J04065J13033J22971J33981J46322J59922J74058
57110C877090J88262K03285K20690K41693K66881K96745L31867L73096M22254
57101F421863M82524N57657O51366P68028R13122J092030J308928J567190J869011
57092A5631719K212261K587966K982352L380918L769498M133329M458529M734434
$$ plain form
57164 1200542 1219866 1240571 1261993 1283145 1303710 1323860 1343688 1363339 1383282 1403930 1425183
57153 1425183 1446687 1468345 1490288 1512652 1535641 1559611 1584754 1610847 1637477 1664386 1691462
57142 1691462 1718638 1745946 1773586 1801884 1831285 1862205 1894600 1927866 1961625 1996551 2033906
57131 2033906 2074333 2117622 2163648 2212805 2265362 2321086 2379869 2442228 2508836 2580056 2656251
57120 2656251 2738181 2826765 2922738 3026803 3139836 3262807 3396788 3543110 3703032 3877090
57110 3877090 4065352 4268637 4489327 4731020 4997901 5294646 5626513 5999609 6421863
57101 6421863 6904387 7462044 8113410 8881438 9794560 10886590 12195518 13762708 15631719
57092 15631719 17843980 20431946 23414298 26795216 30564714 34698043 39156572 43891006
57084D3891006M952115N101665N174571N165916N062901M823372M372817L640493
57076H2184856K614072J365781K6299j270845k432329l414021m204608m804549
57068G0064656n214542n436099n478343n362627n120505m787320m396503l976881
57060C0291836l551841l139092k751004k395576k077365j797924j556161j349040
57052A1673833j172498j022201q94005p84268o90003o08915n39277m79695m28800
57043E054171l85042l46810l12786k82177k54559k29500k06409j84769j64364
57034B687755j45177j27093j09883r3455p7828o2679m7057k9908j0849R814L1520
57023B025160N2565O7921O9112M9092R083l9971q4041j14508j30568j35382j32201
$$ plain form
57084 43891006 48843121 53944786 59119357 64285273 69348174 74171546 78544363 82184856
57076 82184856 84798928 86164709 86191008 84920163 82487834 79073813 74869205 70064656
57068 70064656 64850114 59414015 53935672 48573045 43452540 38665220 34268717 30291836
57060 30291836 26739995 23600903 20849899 18454323 16376958 14579034 13022873 11673833
57052 11673833 10501335 9479134 8585129 7800861 7110858 6501943 5962666 5482971 5054171
57043 5054171 4669129 4322319 4009533 3727356 3472797 3243297 3036888 2852119 2687755
57034 2687755 2542578 2415485 2305602 2212147 2134319 2071640 2024583 1994675 1983826 1993640 2025160
57023 2025160 2077725 2145646 2214758 2263850 2272933 2232962 2148921 2034413 1903845 1768463 1636262
57012A636262j23851j13146j01965r0624p9104o8229n8948n1274m4746l9350l5129
57001H29896l1513k7947k4742k2510k1138k0093j9275j8705j7871j6304j4412
56990E95386j2725j0760p757m159j212P93K625M550N845N924M685J680l649j0478
56976E70748j6511k0022k1191k1092k0316j9082j7598j5683j2824r228o070m057
56964C87074k445j34K889N937Q830J1941J5366J8629K0963K1332J8617J2474L899
56951E25372n297j3466j9401k2389k2606k1206j9455j7790j5903j3449j0408p012
56939C36990l565k07L301P203J1209J4809J8128K1827K5933K9340L0548K8307
56927E23823K1630J0440l228j5668k4098k8466l0224l0255k8761k6352k3905k1613
$$ plain form
57012 1636262 1512411 1399265 1297300 1206676 1127572 1059343 1000395 949121 904375 865025 829896
57001 829896 798383 770436 745694 723184 702046 681953 662678 643973 626102 609798 595386
56990 595386 582661 571901 564144 559985 558773 559566 562191 566741 572586 578510 583195 584875 581226 570748
56976 570748 554237 534215 513024 491932 471616 452534 434936 419253 406429 397201 391131 387074
56964 387074 384629 384495 387384 393321 402151 414092 429458 448087 469050 490382 508999 521473 525372
56951 525372 520075 506609 487208 464819 442213 421007 401552 383762 367859 354410 344002 336990
56939 336990 333425 333218 336519 343722 354931 369740 387868 409695 435628 464968 495516 523823
56927 523823 545453 555893 552665 536997 512899 484433 454209 423954 395193 368841 344936 323323
56915C23323j9116j6457j4113j2172j0286q405o845n648m586l720l336l295l037
56902B12307k309j359l75P36J950L000L751M363M996N672O445P370Q379R500J1093
56887B75519J3456J6132J7989J8006J5788J1450N478j173p272j1848j4534j5449
56875C23542j4971j3555j1477q715n246j399K335N873R625J4027J9084K4512L0117
56862C73752L5944M1931M7476N1311N1928M8118L9261K5616Q826q029k1704l0550
56850F63880l4980l6199l4962l1663k6905k1345j5189q283o63P327J5383K3525
56838D99926L2106M1582N2112O3151P3521Q1699Q5672Q2634O9875M7009J7372
56827A146659j3180l9240n7943o8941p3222p2133o7137n9802n1550m3160l4631
$$ plain form
56915 323323 304207 287750 273637 261465 251179 242774 235929 230281 225695 221975 218639 215344 212307
56902 212307 209998 208639 208264 209000 210950 213950 217701 222064 227060 232732 239177 246547 254926 264426 275519
56887 275519 288975 305107 323096 341102 356890 368340 373818 372645 365373 353525 338991 323542
56875 323542 308571 295016 283539 274824 269578 268179 270514 276387 286012 300039 319123 343635 373752
56862 373752 409696 451627 499103 550414 602342 650460 689721 715337 724163 716134 694430 663880
56850 663880 628900 592701 557739 526076 499171 477826 462637 454354 453691 461018 476401 499926
56838 499926 532032 573614 625726 688877 762398 844097 929769 1012403 1082278 1129287 1146659
56827 1146659 1133479 1094239 1036296 967355 894133 822000 754863 695061 643511 600351 565720
56816E65720k5672j6215o445L305J2514K0799K8660L7239M6685N5078N9682N8749
56804H40099N1394L6741J5115r885l2419m8311n7105o0287n9253n5467n0740m5887
56792E23995m0162l3080k5731j9262j3243o847n50M794R735J5418K1523K6533
56780D63123K9496K9967K6778J8807P108n409j6584k5932l2994l6657l6803l5086
56768C85814l3106l0796k7419k3258j9433j6560j4400j2532j0789r228p999p144
56756A73150o388n404m256l282k633k349k620l405l896l196j567l09k75j074j888
56741A30608k312k335k072j811j759j652j069j48N39P85P50L42n95j488j351j96
56725A16236Q12Q90N86P93J527K169K316K000J533J389J726J913J200l8n50RN53
$$ plain form
56816 565720 540048 523833 517388 520693 533207 554006 582666 619905 666590 721668 781350 840099
56804 840099 891493 928234 943349 933464 901045 852734 795629 735342 676089 620622 569882 523995
56792 523995 483833 450753 425022 405760 392517 385670 385120 389914 399649 415067 436590 463123
56780 463123 492619 522586 549364 568171 575279 569870 553286 527354 494360 457703 420900 385814
56768 385814 352708 321912 294493 271235 251802 235242 220842 208310 197521 188293 180294 173150
56756 173150 166762 161358 157102 153820 151187 148838 146218 142813 138917 135721 134154 133845 133570 132496 130608
56741 130608 128296 125961 123889 122078 120319 118667 117598 117450 117989 118774 119524 119866 119271 117783 116432 116236
56725 116236 117048 117938 118524 119317 120844 123013 125329 127329 128862 130251 131977 133890 135090 135052 134502 134511 135064
56708A35064K67j27L79J398J739J147M39J42Oj91k45p3K4j30k68j18J33J08k55
56689A39439n53l01N71J561J983J628R32M52L03K04l5l00m26n24q97j567k044
56672A40426j830j127o36o09n56j87M0k16m01Q6P52P27K84M65J254J462P09L14
56654A40957J426L288M201L618K415J590J423J683J902J552N76l04k62P44K059
56639A66868L114L734L865L415K444J213O8o62q26o59o06p18n87l8L99Q2q51j601
56621A78654j582r52k77m3l76r93j452j563j554j695j872j732j206p04n99p33
56605A61321n79L6N88N27J11J15O61R21L32n34q34o59o97r75r10m46k08l64k79
56586A58127M04J141J317J068P81M14k01p54p66k59K55L92K24J43N22J350K181
$$ plain form
56708 135064 135331 135204 135583 136981 138720 139867 140306 140448 140454 140263 140018 139945 139969 139839 139571 139453 139586 139694 139439
56689 139439 138886 138585 139156 140717 142700 144328 145260 145712 146015 146219 146184 145884 145458 144934 144037 142470 140426
56672 140426 138596 137469 136833 136224 135668 135481 135521 135305 134904 134990 135742 136469 136753 137218 138472 139934 140643 140957
56654 140957 142383 145671 149872 153490 155905 157495 158918 160601 162503 164055 164631 164327 164065 164809 166868
56639 166868 169982 173716 177581 180996 183440 184653 184721 184059 183233 182574 181968 181250 180663 180625 181024 181106 180255 178654
56621 178654 177072 176120 175843 175800 175424 174431 172979 171416 169862 168167 166295 164563 163357 162653 162054 161321
56605 161321 160742 160778 161366 161893 162004 162119 162780 163701 164033 163499 162665 162006 161309 160334 159424 158978 158770 158406 158127
56586 158127 158531 159672 160989 162057 162838 163252 163051 162297 161531 161272 161527 161919 162143 162286 162808 164158 166339
56569A66339K567K611K735L009L105K904K742L001L873N422P359Q850R223Q838
56555B32578Q496Q007O356L455O96p49j242j662j994j781j297j222j601j961k245
56540B43834k741l270l309k859k486k486k592k552k404k124j573r43p70j296k062
56525B10367k385k020j267o30m52p92j440k052k280j915j094l49k33p60j433j803
56509A89462j828j658j330q50l25P8K44J35j48l88n19p42j102j165n84K11M38
56492A79929N5k07O9N05O66O52P39R58J234J480J437R00K45O9K49Q2n21p97m22
56473A87322q4k59l69J91R01R11L90K14O28J088J213J119R57P73P41R92J290J341
56455A99359J254J230R85P1j304k279k183j122J75Q90O44j32n49k03M43Q36J007
$$ plain form
56569 166339 168906 171517 174252 177261 180366 183270 186012 189013 192886 198308 205667 214517 223740 232578
56555 232578 241074 249081 255437 258892 259588 258839 257597 255935 253941 252160 250863 249641 248040 246079 243834
56540 243834 241093 237823 234514 231655 229169 226683 224091 221539 219135 217011 215438 214495 213725 212429 210367
56525 210367 207982 205962 204695 204065 203613 202821 201381 199329 197049 195134 194040 193691 193458 192698 191265 189462
56509 189462 187634 185976 184646 183796 183471 183549 183793 183928 183780 183392 182873 182131 181029 179864 179280 179491 179929
56492 179929 179984 179777 179846 180351 181017 181669 182408 183366 184600 186080 187517 188417 188662 188731 188980 189062 188541 187744 187322
56473 187322 187238 186979 186610 186801 187702 188613 189003 189217 189845 190933 192146 193265 194222 194995 195736 196728 198018 199359
56455 199359 200613 201843 202828 202899 201595 199316 197133 196011 196186 197076 197720 197588 197039 196836 197279 198115 199122
56438A99122J165J126P15L82O86J361J551R66K09j42j92l09n07n04k06J50L26
56421B05899L97O02R16R89O80M47P88J440J613J035K79m6Q9M36Q04Q88L71m52
56403B17175p00K4R85J210O59O2j54k74o75j208j281n50N59J165R65O63J025J856
56385B21506K446K675K847K732J829O13K71R73J465Q95k4j86M38J193J734J984
56369B43391J808J354J172J461J715J623J555J723J650J047M49L11L04J23J87
56354B59873P88J347J333J178J339J322N48l84n13K1L69M52R02J746K236J959
56338B74516J303Q29Q15J253J801J928J573J370J725K203K263K152K432L118L812
56323C03093M207L984K825J141N3K4K18j31n31k44L89O11N52P96J265J513J612
$$ plain form
56438 199122 200287 201413 202128 202510 203196 204557 206108 207074 207283 207141 206949 206640 206133 205629 205423 205573 205899
56421 205899 206296 206898 207814 208803 209483 209930 210718 212158 213771 214806 215085 215039 215128 215564 216368 217256 217627 217175
56403 217175 216475 216499 217484 218694 219353 219415 219261 218987 218312 217104 215823 215273 215832 216997 217962 218625 219650 221506
56385 221506 223952 226627 229474 232206 234035 234648 234919 235892 237357 238252 238228 238042 238480 239673 241407 243391
56369 243391 245199 246553 247725 249186 250901 252524 254079 255802 257452 258499 258948 259259 259563 259686 259873
56354 259873 260661 262008 263341 264519 265858 267180 267728 267344 266831 266852 267221 267673 268575 270321 272557 274516
56338 274516 275819 276648 277463 278716 280517 282445 284018 285388 287113 289316 291579 293731 296163 299281 303093
56323 303093 307300 311284 314109 315250 315303 315327 315545 315414 314883 314639 315028 315639 316191 316987 318252 319765 321377
56306C21377J792J767J316R66J204J618J771K221L556N078N577M890L770K737
56292C59640K048K053K558K622K006J874K903L877L596L041L789N278N770N327
56278D06382N473O399O819O598P080Q536R517R261Q885R407J0293J0724J0929
56265E16303J1517J2626J4248J6384J8578K0258K1754K3947K6903L0009L3388
56254G45915L7767M2973M8046N2970N8745O5560P2456P9089Q6162R3605R9943
56243A483231J04133J06652J08101J08038J05810J01355R4494Q4626P1772N6883
56233B425095M0582K2725L748j4683l1124m5463n7973o8265p5956q1563q5957
56222B031166q9387r1491r1794q9996q6459q2371p8719p5099p0487o5062o0089
$$ plain form
56306 321377 323169 324936 326252 327218 328422 330040 331811 334032 337588 342666 348243 353133 356903 359640
56292 359640 361688 363741 366299 368921 370927 372801 375704 379581 383177 386218 390007 395285 401055 406382
56278 406382 411855 418254 425073 431671 438751 447287 456804 466065 474950 484357 494650 505374 516303
56265 516303 527820 540446 554694 571078 589656 609914 631668 655615 682518 712527 745915
56254 745915 783682 826655 874701 927671 986416 1051976 1124432 1203521 1289683 1383288 1483231
56243 1483231 1587364 1694016 1802117 1910155 2015965 2117320 2211814 2296440 2368212 2425095
56233 2425095 2465677 2488402 2492150 2477467 2446343 2400880 2342907 2274642 2198686 2117123 2031166
56222 2031166 1941779 1850288 1758494 1668498 1582039 1499668 1420949 1345850 1275363 1210301 1150212
56211A150212n5966n1817m7255m3171m0187l7546l4308l0687k7500k5067k3147
56200G33561k1345j9230j6674j4246j2652j1742j0728r335p899o546n243m414
56188E93507m404m498l685k264j406j268r36j47M27O09R32J318J053K58o6L01
56172E79731N93O03J019K002K892L487M135M588M295L862M451N722O273O156O913
56157F36722Q874J0557J1247J1957J3316J4670J6030J8585K2372K5637K7660L0175
56145H47802L4723M0574M6721N4056O3883P5605Q7431R8221J07352J13824J16693
56134A686885J15574J10004R9595Q5628P1315N9520N1115M5838M3104M1176L7242
56123B446996K9576J8845O839m808j4382k0552k4037k7563l3521m2763n5550p1505
$$ plain form
56211 1150212 1094246 1042429 995174 952003 911816 874270 839962 809275 781775 756708 733561
56200 733561 712216 692986 676312 662066 649414 637672 626944 617609 609710 603164 597921 593507
56188 593507 589103 584605 580920 578656 577250 575982 575046 574899 575326 575935 576867 578185 579238 579496 579430 579731
56172 579731 580324 580927 581946 583948 586840 590327 594462 599050 603345 607207 611658 617380 623653 629809 636722
56157 636722 645596 656153 667400 679357 692673 707343 723373 741958 764330 789967 817627 847802
56145 847802 882525 923099 969820 1023876 1087759 1163364 1250795 1349016 1456368 1570192 1686885
56134 1686885 1802459 1912463 2012058 2097686 2169001 2228521 2279636 2325474 2368578 2409754 2446996
56123 2446996 2476572 2495417 2502256 2497448 2483066 2462514 2438477 2410914 2377393 2334630 2279080 2207575
56111B207575q8152j01669j09996j13541j12624j06654r6575q5376p4895o4309
56101A253784n3017m2691l4975k9148k3683j8375j3695r669o520m668l270p77
56089A013296K312L626K748K239L692N418N536M710M158L596K896L304N140O665
56075A069336O965P479R025J0002R510R425J1123J2925J3170J3201J4641J6288
56063A203090J6492J6295J7361J8897J9485J9839K0961K1577K0383J8861J9018
56052A412259K0004J9837J8821J8455J8601J8384J8380J9391K0582K1157K2151
56041A628022K4265K5949K5994K5999K7696K9975L1025L1365L2208L3040L3364
56030A948902L4513L7130L9242L9532L9910M2183M4842M6036M6923M8999N1032
$$ plain form
56111 2207575 2119423 2017754 1907758 1794217 1681593 1574939 1478364 1392988 1318093 1253784
56101 1253784 1200767 1158076 1123101 1093953 1070270 1051895 1038200 1028531 1022011 1017343 1014073 1013296
56089 1013296 1015608 1019234 1021982 1024221 1027913 1033331 1038867 1043577 1047735 1051331 1054227 1057531 1062671 1069336
56075 1069336 1076301 1083780 1092805 1102807 1112317 1121742 1132865 1145790 1158960 1172161 1186802 1203090
56063 1203090 1219582 1235877 1253238 1272135 1291620 1311459 1332420 1353997 1374380 1393241 1412259
56052 1412259 1432263 1452100 1470921 1489376 1507977 1526361 1544741 1564132 1584714 1605871 1628022
56041 1628022 1652287 1678236 1704230 1730229 1757925 1787900 1818925 1850290 1882498 1915538 1948902
56030 1948902 1983415 2020545 2059787 2099319 2139229 2181412 2226254 2272290 2319213 2368212 2419244
56019B419244N1754N2765N5444N8069N9270O1171O5534P0137P2713P5072P9383
56008C120556Q3912Q6666Q9748R5422J01440J04998J08000J13539J20469J26457
55998D151207J32896J41769J51096J58687J66744J77529J88472J97099K06525
55989E672024K20221K35736K49856K65270K85442L07807L29189L52916L82858
55980H301319M15605M46902M80576N22258N69656O18602O73217P39869Q16629
55971A3584633Q99562R93983J107922J240348J388441J560776J770357K021151
55963B4567173K316405K674459L121624L677589M366737N237835O351990P752616
55955F0066428R459860J1481608J3810085J6426512J9344869K2640041K6379100
$$ plain form
56019 2419244 2470998 2523763 2579207 2637276 2696546 2757717 2823251 2893388 2966101 3041173 3120556
56008 3120556 3204468 3291134 3380882 3476304 3577744 3682742 3790742 3904281 4024750 4151207
55998 4151207 4284103 4425872 4576968 4735655 4902399 5079928 5268400 5465499 5672024
55989 5672024 5892245 6127981 6377837 6643107 6928549 7236356 7565545 7918461 8301319
55980 8301319 8716924 9163826 9644402 10166660 10736316 11354918 12028135 12768004 13584633
55971 13584633 14484195 15478178 16586100 17826448 19214889 20775665 22546022 24567173
55963 24567173 26883578 29558037 32679661 36357250 40723987 45961822 52313812 60066428
55955 60066428 69526288 81007896 94817981 111244493 130589362 153229403 179608503
55948A79608503L0472139L4510604L7609630L8340687L5045623K6707651J3920074
55941C96214911r57950j4835577k5373423l1769735l4479826l4465240l2671034
55934B21662126k9863741k6606880k3260565k0034195j7061904j4426401j2147946
55927G8260494j0204180q569361p219092o112232n198517m442547l822007l309269
55919B9383289k874595k502951k190078j925660j695441j495147j326794j184397
55911A4188226j057055r42777q46020p64319o89763o21354n63842n16193m72219
55902G714684m31097l96920l68996l42249l16073k93852k74884k55246k35494
55893D799873k19363k06014j91292j75576j62713j52358j40723j27973j17545
$$ plain form
55948 179608503 210080642 244591246 282200876 320541563 355587186 382294837 396214911
55941 396214911 395256961 380421384 355047961 323278226 288798400 254333160 221662126
55934 221662126 191798385 165191505 141930940 121896745 104834841 90408440 78260494
55927 78260494 68056314 59486953 52267861 46155629 40957112 36514565 32692558 29383289
55919 29383289 26508694 24005743 21815665 19890005 18194564 16699417 15372623 14188226
55911 14188226 13131171 12188394 11342374 10578055 9888292 9266938 8703096 8186903 7714684
55902 7714684 7283587 6886667 6517671 6175422 5859349 5565497 5290613 5035367 4799873
55893 4799873 4580510 4374496 4183204 4007628 3844915 3692557 3551834 3423861 3306316
55884C306316j09053r8907q7430p8429p2222o5812n9714n8065o1571o6240o9454
55873B479419p1967p3916p4081p3261p3569p4346p3146p0353o8409o7027o3770
55862A695574n8829n4741n1825m8358m4678m2683m1732l9442l6063l3786l2372
55851A211065k9867k7026k6397k7440k7181k5423k4806k5671k5516k3683k2237
55840I25818k1813k0757j8816j7719j7598j6658j4755j3710j3691j2943j1387
55829G45971j0848j1328j0738q799p679q179q720q657r225j0519j0925j0223j0183
55816F19948j1250j1684j0706r627r160q463p459p311p858p378n544l994l297
55803E16217k081J48J958K555K983L976M853N169N208M478K067j055k555k123
$$ plain form
55884 3306316 3197263 3098356 3010926 2932497 2860275 2794463 2734749 2676684 2615113 2548873 2479419
55873 2479419 2407452 2333536 2259455 2186194 2112625 2038279 1965133 1894780 1826371 1759344 1695574
55862 1695574 1636745 1582004 1530179 1481821 1437143 1394460 1352728 1313286 1277223 1243437 1211065
55851 1211065 1181198 1154172 1127775 1100335 1073154 1047731 1022925 997254 971738 948055 925818
55840 925818 904005 883248 864432 846713 829115 812457 797702 783992 770301 757358 745971
55829 745971 735123 723795 713057 704258 696579 688400 679680 671023 661798 651279 640354 630131 619948
55816 619948 608698 597014 586308 576681 567521 559058 551599 544288 536430 529052 523508 519514 516217
55803 516217 514136 514284 516242 518797 521780 525756 530609 535778 540986 545464 547531 546476 543921 541798
55789E41798j961l308m898n472n453n288m441k944k140k992n228q351j1770j3867
55775D63685j3059j0067p140m903k128J453M553O716Q629R701P995L309k006o028
55761D60710q783j0408j0330r168q910j0156j1300j1344j1319j2004j2452j1870
55749C32666j0959j0362r591q535q048q105p282n116l110k326j785m59Q98J161
55735B59047N68j13q13j543j779j455j353j802k197k361k979m067m553m068l628
55720B26904l888m172l985l868m022l578k101m19P83J850L049M006M797O045P284
55705B28685O941M656K024K33j307l226m792n327n477n929o274o095n873n881
55691A92358n495m480l576l046k152q73m05r90r56Q22L040L928L667L439L411
$$ plain form
55789 541798 539837 536529 531631 526159 520706 515418 510977 508033 505893 502901 497673 489322 477552 463685
55775 463685 450626 440559 433419 428516 426388 427841 432394 439110 447739 457440 465435 468744 466738 460710
55761 460710 451927 441519 431189 422021 413111 402955 391655 380311 368992 356988 344536 332666
55749 332666 321707 311345 301754 293219 285171 277066 269784 264668 261558 259232 257447 256988 257886 259047
55735 259047 259615 259502 258689 257146 255367 253912 252559 250757 248560 246199 243220 239153 234600 230532 226904
55720 226904 223016 218844 214859 210991 206969 203391 201290 200871 201654 203504 206553 210559 215356 221401 228685
55705 228685 235626 240282 242306 242539 241232 238006 233214 227887 222410 216481 210207 204112 198239 192358
55691 192358 186863 182383 178807 175761 173609 172736 172331 171341 170385 171207 174247 178175 181842 185281 188692
55676A88692L152K964L260L427K631J108l38j369j852j490o41m85j424k292k096
55661A93247j418j086o80M51J741K236K035J733J270N12J68Q41J796J787P44l89
55645B04988r95j165j217j501k226k904k692j703j213j976l315m376n176n798
55631A68731n681m683l720l454l291k584j811j651j792j658j395j282r91l88o1
55616A34289k88m00r4k55j460k751k965k330j652r56j08K36l76j157j236j055
55600A17442j358j732j417p98o36o53k64L8m69j134p83K54N62k31j112j343j068
55583A05298m62M59J213J177N61J11mj29k52o2L42P02J228K109K860L015K994
55566A21160L310L460K698J434O85N04J68m21p98j136k060l307l847l365k546
$$ plain form
55676 188692 191844 194808 198068 201495 204126 205234 204896 203527 201675 200185 199544 199059 197635 195343 193247
55661 193247 191829 190743 190063 190514 192255 194491 196526 198259 199529 200041 200209 201050 202846 204633 205377 204988
55645 204988 203993 202828 201611 200110 197884 194980 192288 190585 189372 187396 184081 179705 174529 168731
55631 168731 163050 158367 154647 151193 147902 145318 143507 141856 140064 138406 137011 135729 134738 134350 134289
55616 134289 134001 133601 133507 133252 131792 129041 126076 123746 122094 121138 121030 121266 120890 119733 118497 117442
55600 117442 116084 114352 112935 112137 111501 110848 110584 110622 110153 109019 108236 108490 109052 108821 107709 106366 105298
55583 105298 104836 105295 106508 107685 108246 108357 108353 108224 107972 107910 108252 108954 110182 112291 115151 118166 121160
55566 121160 124470 127930 130628 132062 132747 133251 133419 132998 132200 131064 129004 125697 121850 118485 115939
55551A15939j877j256p94q94j360j425q78l27j66j35nM7q5k27l01l34r8P27J955
55532A08506K963L281K761J447j54j032o27M12J035J019P42K03q04j830k102j687
55516A14133j400j598j909k078k253k342j963j187o47o93r92j086q55m01P2K72
55500I5073J66K24Q42J620J761J104L13QJ60K50k07j167j923j758r71o61j257
55483I3577j873j622q59l67o3N77J270J222M49k21l29k00j66j12J02L78M67J22
55465I2352o79j384j278n54k95q83j316p50J45M14L72P06R09K00o31j19J344J812
55447I0365O87m67m61n3k68p08n96l20o65j357j539j283j459k250k750k138o38
55430G4100R04J888K227K084J660J155P20L71O9r2K1K26P4m26n33K30J135J117
$$ plain form
55551 115939 114062 112806 112012 111118 109758 108333 107455 107128 106962 106827 106822 106869 106784 106557 106256 105922 105824 106551 108506
55532 108506 111469 114750 117511 118958 118804 117772 117145 117557 118592 119611 120353 120556 119752 117922 115820 114133
55516 114133 112733 111135 109226 107148 104895 102553 100590 99403 98756 98063 97071 95985 95130 94729 94801 95073
55500 95073 95239 95463 96305 97925 99686 100790 101103 101111 101271 101521 101314 100147 98224 96466 95495 94834 93577
55483 93577 91704 90082 89223 88856 88793 89370 90640 91862 92311 92090 91761 91561 91395 91283 91385 91763 92230 92352
55465 92352 91673 90289 89011 88457 88162 87279 85963 85213 85358 85772 86144 86850 87759 87959 87328 87209 88553 90365
55447 90365 91052 90585 90124 90071 89803 89095 88499 88179 87514 86157 84618 83335 81876 79626 76876 74738 74100
55430 74100 75004 76892 79119 81203 82863 84018 84738 85109 85178 85086 85107 85333 85407 84981 84448 84678 85813 86930
55412H6930M26L23J118J628J052J21k02j70m65r25r83p40o11n49l91m14p04o54
55394H4790K5N55L05l9L42Q66N03l32l17O44J306R82K75l8K10Q34J391J236L85
55375I3923p7N26J232Q73J29M90J665J871N66q87j506j835k490l115l315l242
55359H4808k813j663k40L58K5j47L29O47L10p6j08l03p97p29K12R04M11n61q48
55340G9719m47J0N22J364K112K064J219R9j001j839j892r99R0M48Q0k98j81M20
55322H1490J166J515J022k2p36p52o46r54j372j376j053p37m03L0K36m5m64m79
55304G6420p7L48O16Q67J241J692J968J698P96j99o19m64k75k45q4K50M46N10
55286H4889P62J049Q43K05j51m9q0m21l76L36R06O29pj66J28L21K62J01k00o48
$$ plain form
55412 86930 87356 87679 88797 90425 91477 91598 91396 91226 90761 89836 88853 88113 87502 86953 86562 86148 85444 84790
55394 84790 84815 85370 85675 85636 85978 86844 87347 87015 86698 87342 88648 89630 89905 89867 90077 90911 92302 93538 93923
55375 93923 93846 94372 95604 96477 96606 97096 98761 100632 101198 100311 98805 96970 94480 91365 88050 84808
55359 84808 81995 80332 80092 80450 80475 80328 80657 81304 81614 81538 81430 81127 80330 79601 79813 80717 81128 80567 79719
55340 79719 79272 79282 79804 81168 83280 85344 86563 86662 85661 83822 81930 80931 81021 81469 81549 81251 81070 81490
55322 81490 82656 84171 85193 85171 84435 83683 83037 82083 80711 79335 78282 77545 77142 77172 77408 77363 76899 76420
55304 76420 76343 76691 77307 78174 79415 81107 83075 84773 85569 85370 84751 84287 84012 83767 83683 83933 84379 84889
55286 84889 85651 86700 87543 87748 87597 87548 87468 87047 86671 87007 87913 88542 88535 88369 88497 88818 89080 89181 88981 88333
55266H8333q90p25m60l66k64r1k30p53r27j98Q37J145O40J68L53R85J434J331
55248I0322Q96P38J100J392R10n7n21k40N9pO0M76N55j12q02p74m39n74j037j152
55228I0793p98l50M5L43K44l08o88l88J76L58L31O53J212J441J311J202J070N39
55210I7186k97r42j294j622j782j231N9J339J892J721J244P62L55M3j21j04J2
55193I7220Pk17m47m76n44j001j605j674j060l50RJ71K57j2o66j127r09k76K17
55174H7517K91j29r09j441j047j0O13N40O93J583K305J934J012O79R60J028O39
55157I6258K90K01P0k78p12j093j209p54J02N39J25m22j78O43J104Q96N54N04
55139I6640O08N18m3j114k147k244j216k0M25L21L12L67O2m82p97q31p39l63L85
$$ plain form
55266 88333 87443 86718 86258 85892 85628 85537 85307 84554 83627 83429 84266 85411 86051 86219 86572 87557 88991 90322
55248 90322 91218 91956 93056 94448 95358 95301 94780 94540 94599 94592 94652 95128 95683 95571 94769 93995 93556 92982 91945 90793
55228 90793 89995 89645 89690 90033 90277 89969 89281 88893 89069 89427 89758 90411 91623 93064 94375 95577 96647 97186
55210 97186 96889 95947 94653 93031 91249 90018 90077 91416 93308 95029 96273 97035 97390 97433 97312 97208 97220
55193 97220 97227 97010 96563 96087 95543 94542 92937 91263 90203 89853 89862 90033 90290 90278 89612 88485 87576 87300 87517
55174 87517 87808 87679 86770 85329 84282 84272 84885 85425 86118 87701 90006 91940 92952 93631 94591 95619 96258
55157 96258 96548 96749 96819 96541 95829 94736 93527 92773 92875 93414 93539 93117 92939 93582 94686 95582 96136 96640
55139 96640 97248 97766 97723 96609 94462 92218 91002 90982 91407 91728 92040 92407 92469 91987 91190 90359 89620 89257 89642
55120H9642J012J042P18L98j24q54q81L74J805J830O07l02k54j13m35n46J51J070
55102I5140J291P42J46K10J097K229K615J844O47no1m0K3L40M32l38j435j454
55084A03423m8J546K119J702R15Q8n67p31m28j42j12n9J70K74N3k41l30k64j67
55065A07201j41l75q90j152n80N03J144R93N69K51k17r33j359j064m33j58m11
55048A02948p60o42J09J018J262O05j08L2P51R72L95k26l38k69l76m07r4K28O7
55029A05167n55j179j347q78j9O40P55O83Q91J137Q71K61N1L39M08j04o44o25
55011A05852j57L38O08M34l16j230j574j191o55m11l36k82m25p84r98q32m02K16
54993I7855J008J637J632J098N92K76o8k06M12J555K184J811J015L61k04n87l11
$$ plain form
55120 89642 90654 91696 92414 92812 92688 91834 90953 91327 93132 94962 95569 95267 95013 94900 94465 93919 94070 95140
55102 95140 96431 97173 97319 97529 98626 100855 103470 105314 105961 105956 105895 105855 105878 106218 106650 106312 104877 103423
55084 103423 103375 104921 107040 108742 109657 109745 109178 108447 108019 107877 107765 107706 107876 108150 108203 107962 107632 107368 107201
55065 107201 107060 106685 105795 104643 104063 104566 105710 106703 107272 107523 107306 106373 105014 103950 103517 103359 102948
55048 102948 102188 101546 101655 102673 103935 104540 104432 104464 105215 106187 106582 106356 106018 105749 105373 104966 104872 105100 105167
55029 105167 104612 103433 102086 101208 101189 101829 102584 103267 104158 105295 106166 106427 106478 106817 107225 107121 106477 105852
55011 105852 105695 106033 106641 107075 106759 105529 103955 102764 102109 101698 101362 101080 100655 99871 98873 98041 97639 97855
54993 97855 98863 100500 102132 103230 103822 104098 104030 103824 104236 105791 107975 109786 110801 111162 110958 110371 110060
54976A10060M44O49Jl32N95J911K110J128J89m0pj97m38m35k30j0J34J63J21J96
54956A16012N23R85J372J493J158L92k74k09M15O86J55o02r28r40j003r66n60
54939A17709m6J52J25K27M32M88M35M41L67L2k65jQ55J786K298K281J974J836
54921A31126K256L109L806M037M226M968O244P419P844P221N664L590J437o21
54907A92326k545m124n157n817o313o311n366l907k982k947l189l277l410l513
54893A33468k983j837j054j088j121m65K89M38M64J011J506J136N07Q97K207L157
54877A36532L382L793M877N909O228O147O164O201N941N223L858J782m57k119
54863A93461l250m493n826o438o127n769n923n908m966l526k540k104j667j186
$$ plain form
54976 110060 110504 111153 111154 110822 111417 113328 115438 116566 116755 116715 116708 116511 116073 115638 115408 115398 115532 115695 115816 116012
54956 116012 116535 117520 118892 120385 121543 121935 121661 121452 121867 122553 122708 122106 121178 120238 119235 118269 117709
54939 117709 117663 117815 117940 118167 118599 119087 119522 119963 120330 120362 120097 120096 120951 122737 125035 127316 129290 131126
54921 131126 133382 136491 140297 144334 148560 153528 159772 167191 175035 182256 187920 191510 192947 192326
54907 192326 189781 185657 180500 174683 168370 162059 156693 152786 149804 146857 143668 140391 136981 133468
54893 133468 130485 128648 127594 126506 125385 124920 125209 125647 126111 127122 128628 129764 130271 131168 133375 136532
54877 136532 139914 143707 148584 154493 160721 166868 173032 179233 185174 190397 194255 196037 195580 193461
54863 193461 190211 185718 179892 173454 167327 161558 155635 149727 144761 141235 138695 136591 134924 133738
54849A33738j216j899k645k918k783k507k120j610j237j257j484j391p85j39q
54834A09739k58j34P12J680J945J455Q05L57l3l96m29o4J69k83j283k154k359
54817A09469j789o30P18J659J725J028K33j11o5o1k58l45j3N67R09Q06N42M39
54799A14823M21J95j71j03P82J941K237J208k22p01m1O51M49l56r74j195j212
54782A17732q80M1J134J632J426J119J045R52P51P81J157J461J469J566K158L090
54766A36634M007M812N539O176O758P300P463O888N782M680L504J732m52k103
54752A98720k976l907n272o095n592m586m324m645m529l905l585l651l243k070
54738A40340r98q49j373j802j745j316q22n28m36k26L16Q99J155J238J594K364
$$ plain form
54849 133738 132522 130623 127978 125060 122277 119770 117650 116040 114803 113546 112062 110671 109886 109747 109739
54834 109739 109481 109347 110059 111739 113684 115139 115944 116301 116268 115872 115443 115379 115548 115265 113982 111828 109469
54817 109469 107680 107050 107768 109427 111152 112180 112413 112302 112237 112176 111918 111573 111560 112127 113036 113842 114384 114823
54799 114823 115244 115439 115268 115165 115947 117888 120125 121333 121111 120410 120369 121020 121469 121113 120139 118944 117732
54782 117732 116852 116893 118027 119659 121085 122204 123249 124201 124952 125733 126890 128351 129820 131386 133544 136634
54766 136634 140641 145453 150992 157168 163926 171226 178689 185577 191359 196039 199543 201275 200823 198720
54752 198720 195744 191837 186565 180470 174878 170292 165968 161323 156794 152889 149304 145653 142410 140340
54738 140340 139342 138493 137120 135318 133573 132257 131435 130907 130471 130245 130561 131460 132615 133853 135447 137811
54722A37811L381M565N762O505O535O316O377O370N528L937K449J362m1k343n028
54707A89486o957p427o597n262m325m146m287m060l256k118r54j25q7q14j458
54692A37613j279p22p82j461j701r65l5P2o29j261j093j68P93J014M72l9j5m3
54674A29771q65j972k114j142k68k50m06O9P50O90r4p03n79q8J35q1l36r7O62
54655A23082J262R97J4p55o87r6K92J25m12q78q63l41K42M72M83O25P61N37J80
54636A25040K75P02O46r2o62m27R7J14k92m86l08p1R5K60K91L7k08NN51P74L34
54615A26675l31m70J64J001J131K10j109j780j413m84M44J179J588J375N79k15
54599A28544n38o17q97j240j157n95l0J83J83K22K87K13m6l56n47n29l11mJ67
$$ plain form
54722 137811 141192 145757 151519 158024 164559 170875 177252 183622 189150 193087 195536 196898 196857 194514 189486
54707 189486 182529 175102 168505 163243 158918 154772 150485 146425 143169 141051 140097 139972 139885 139071 137613
54692 137613 136334 135612 134830 133369 131668 130703 130668 130740 130111 128850 127757 127589 128382 129396 129868 129829 129814 129771
54674 129771 128906 126934 124820 123678 123410 123160 122754 122823 123573 124263 124169 123466 122887 122799 122934 122853 122517 122420 123082
54655 123082 124344 125341 125355 124600 123913 123817 124109 124234 123822 122944 122081 121740 121982 122454 122937 123562 124323 124860 125040
54636 125040 125315 126017 126663 126571 125909 125482 125579 125693 125401 124915 124607 124536 124631 124891 125182 125219 125011 125016 125567 126341 126675
54615 126675 126344 125874 126038 127039 128170 128380 127271 125491 124078 123594 124038 125217 126805 128180 128759 128544
54599 128544 128006 127389 126492 125252 124095 123500 123470 123653 123836 124058 124345 124558 124512 124156 123609 123080 122769 122765 122932
54580A22932m9n76q12r8J333K269J805M79m09m50l82p80j214j040l71K10N26Q95
54562A24268J501K058K131J624R80P86J054J057J91j099j724j224j71O84J106
54547A33222J169R96Q88J129J451J250O15M20J084J811J684R44N36O99P55K04
54531A48857n73q61n30j58l47r46j119l89N76O61k58j100r59j62L41J11n88j329
54513A41227j780j751j353r20n93k08K81O53Q83J204J489J137j3j164j453r24
54497A36715j85M38Q82R00L41l80o99o36o03o42l74L38J177J692J534O34m68p71
54479A39893J49J407J726R70J92J52M86M83J43J1K83N28L36m5K7O95J298J168
54461A49902N32J69L49O56Q15J020J339J412J079O34K08m46j214j441r81p04j253
$$ plain form
54580 122932 122883 122307 121495 121397 122730 124999 126804 127283 126874 126424 126042 125262 124048 123008 122637 122847 123373 124268
54562 124268 125769 127827 129958 131582 132562 133348 134402 135459 135650 134551 132827 131603 131432 132116 133222
54547 133222 134391 135387 136275 137404 138855 140105 140720 141140 142224 144035 145719 146663 147199 147898 148653 148857
54531 148857 148284 147423 146893 146735 146388 145442 144323 143934 144510 145171 144913 143813 142854 142692 143033 143144 142556 141227
54513 141227 139447 137696 136343 135423 134830 134622 134903 135556 136439 137643 139132 140269 140256 139092 137639 136715
54497 136715 136530 136968 137850 138750 139091 138711 138012 137376 136773 136131 135757 136095 137272 138964 140498 141132 140664 139893
54479 139893 140042 141449 143175 144145 144337 144489 144975 145458 145601 145612 145895 146423 146759 146714 146741 147436 148734 149902
54461 149902 150434 150603 150952 151608 152423 153443 154782 156194 157273 157907 158115 157669 156455 155014 154033 153329 152076
54444A52076j999j984j340r05q61o97k09K91O04P22N23Q4l6M13O85L5r66j192
54426A45244p27o13r67p69L02J205J174Q01Q63J109J000P76R06J112P77k6o27
54409A51540o76m16k14k60n63r10r55n75J10J065K261L173K989J629M7q11r04
54392A56530o20j17M53O48K57k48l64k39k19j34L31Q78R72O60L56Op38j615j843
54373A54954j220l78J80O24J127J320R51M89N69J064J257Q28K03o9M1K20L42N75
54355A63077R49J126P70J26j37K21N91K45p08j419j332p33k44j60m31q99j270
54338A59772j120k94P81J508J747J791J811J715J575J714K154K381J976J273Q96
54323A79680Q47N45k25r66j268j457j998k641k702k088j475j384j592j644j518
$$ plain form
54444 152076 150077 148093 146753 145848 144987 144290 144081 144372 144976 145698 146221 146305 146269 146682 147367 147402 146436 145244
54426 145244 144517 143904 142937 142168 142470 143675 144849 145650 146513 147622 148622 149398 150304 151416 152193 152167 151540
54409 151540 150864 150448 150234 149974 149411 148501 147546 146971 147081 148146 150407 153580 156569 158198 158245 157434 156530
54392 156530 155910 155793 156246 156894 157151 156903 156539 156300 156081 155947 156278 157156 158128 158788 159144 159150 158412 156797 154954
54373 154954 153734 153356 153536 154160 155287 156607 157558 158047 158616 159680 160937 161765 161968 161899 161940 162160 162502 163077
54355 163077 164026 165152 165922 166048 165911 166132 166723 166968 166260 164841 163509 162776 162532 162372 161941 161042 159772
54338 159772 158652 158358 159139 160647 162394 164185 165996 167711 169286 171000 173154 175535 177511 178784 179680
54323 179680 180527 181072 180847 179881 178613 177156 175158 172517 169815 167727 166252 164868 163276 161632 160114
54308A60114j448j380j055m94OK87M51M59O2o59j039n28N20J175J002L89k12q36
54290A56814j532j814j191L5J007J325J300J163P30k7o08n93j92J81N23R80J276
54273A59377J021M30J71M48P19M43k75r30j165r54n23k36l62p22p76k33O15J225
54255A58273J304Q85J66m69n40M8P45R13O51O01R04Q41p1j130j184k03O62O26
54237A63022J97J80M74M73J59l6j52o89j626k264k226j837j361o06L70Q77M76
54220A55431l04o59m87k09k2J09N8k68o07o90p16r60j208j075o98n05m67k29J99
54201A46693M53M68N12O41O71O72Q73J067Q33L63M21J176J760J342J91p26q50
54184A56560m24J5J93K17L34N18M15j23o31n17Q5L86r5j024j744j845j219j02
$$ plain form
54308 160114 158666 157286 156231 155737 155743 156030 156481 156940 157002 156343 155304 154776 155296 156471 157473 157862 157650 156814
54290 156814 155282 153468 152277 152312 153319 154644 155944 157107 157837 157810 157202 156609 156417 156598 157121 158101 159377
54273 159377 160398 160828 160999 161447 162166 162609 162334 161404 160239 159285 158762 158526 158164 157442 156666 156433 157048 158273
54255 158273 159577 160462 160628 160159 159619 159667 160412 161325 161976 162577 163481 164322 164251 163121 161937 161734 162396 163022
54237 163022 163219 163399 163873 164346 164505 164469 164317 163628 162002 159738 157512 155675 154314 153708 154078 154955 155431
54220 155431 155127 154468 153981 153772 153750 153859 153917 153649 153042 152352 151636 150676 149468 148393 147695 147190 146723 146494 146693
54201 146693 147146 147614 148126 148767 149438 150110 150983 152050 152883 153246 153667 154843 156603 157945 158136 157410 156560
54184 156560 156136 156151 156344 156561 156895 157413 157828 157705 157074 156557 156642 157028 156933 155909 154165 152320 151101 150999
54166A50999P93P18k34j081j040l52K38M32M13K81m1m94p60o16j71K39L48J98
54148A49870J17L47P39R14P00K70j17k63m1M18O46L30j24K5Q41J514J314L74o06
54129A57268j066q22j2Q78J247R24L53P2J97N12P81P95M32r8l25m8L73M72K38
54110A62171k9j81l29n65p51o15k8P34J084P69L11M84J242J633R44m36j502j745
54092A63191j402q74k88L46Q47R41O14K17Q3J03r7n01o34k62K55O03J057J791
54074A65990K180J551L67k47J6M61O38P61Q27L86m57q52m40R6K54M76J084J395
54056A74486Q05mk7N28O73K85J04M25Q16J130J731K551K877K453K004K248K970
54039A96055L504L733M102M836N586N880N711N495N488N447N093M773N114O007
$$ plain form
54166 150999 151792 152510 152276 151195 150155 149803 150041 150473 150886 151167 151126 150632 149872 149256 149085 149324 149672 149870
54148 149870 149987 150334 151073 151987 152687 152957 152840 152577 152536 152954 153600 153930 153806 153831 154672 156186 157500 157874 157268
54129 157268 156202 155380 155368 156246 157493 158417 158770 158842 159039 159551 160332 161127 161559 161461 161136 161088 161461 161933 162171
54110 162171 162142 161961 161632 161067 160316 159701 159673 160407 161491 162260 162571 163055 164297 165930 166874 166438 164936 163191
54092 163191 161789 160915 160627 160973 161820 162761 163375 163592 163675 163778 163681 163180 162546 162284 162539 163142 164199 165990
54074 165990 168170 169721 170088 169841 169857 170318 170956 171717 172544 172930 172473 171621 171181 171277 171531 172007 173091 174486
54056 174486 175291 175287 175260 175788 176461 176746 176850 177275 178091 179221 180952 183503 186380 188833 190837 193085 196055
54039 196055 199559 203292 207394 212230 217816 223696 229407 234902 240390 245837 250930 255703 260817 266824
54025B66824O478N978N213N170N875O743P798R560J1771J3072J2249R284N017
54012C71032L52m000p522j0137j2184j3784j4422j3538j1465r449q479q297p822
53999B50285o540n081m270l989l516k692k035j715j320q40j006k070l040k874
53985B09297j875j114r46r11q11r29j252j359j149r68r58q94p12o15n76l61m3
53968A93824N3rJ50M66M95L00N11J183J337K62j285j815q25P76J838K032J781
53951B01074J484J191Q68P18R64J491K021K601L452M233M104K961J981K332L696
53936B35171M791N029M812M519M134L812L804L774L066J861J133J239J514J557
53922B80216J863K617K931K149J167J406K902M365M955N078N443O047O382O185
$$ plain form
54025 266824 273302 279280 284493 289663 295538 302281 310079 319639 331410 344482 356731 366015 371032
54012 371032 371384 367384 359862 349725 337541 323757 309335 295797 284332 274883 266404 258107 250285
53999 250285 243745 238664 234394 230405 226889 224197 222162 220447 219127 218287 217281 215211 212171 209297
53985 209297 207422 206308 205362 204451 203640 202711 201459 200100 198951 197983 197025 196131 195419 194804 194228 193867 193824
53968 193824 193877 193868 194018 194484 194979 195279 195790 196973 198310 198572 197287 195472 194647 195423 197261 199293 201074
53951 201074 202558 203749 204617 205335 206299 207790 209811 212412 215864 220097 224201 227162 229143 231475 235171
53936 235171 239962 244991 249803 254322 258456 262268 266072 269846 272912 274773 275906 277145 278659 280216
53922 280216 282079 284696 287627 289776 290943 292349 295251 299616 304571 309649 315092 321139 327521 333706
53908C33706N778N732O146O265N126K772M27q36j241j712k484k947k630j787j003
53893C51312o84r82j856l100m455n687o467o470n829n191n018n062m887m601m528
53878B86495m432l780k683j932j929k214k256k109j963j532m24J089K246K717
53864B67293L028M021O046Q750J1463J3729J5496J6720J6841J4866J0237L575
53852C92065l612r919j4592j7349j8173j7446j5899j4054j1926r515p343o045
53840B46192n582n291m754m130l599l033k402j972j834j659j221p64n68n85p72
53825B08026j256j736j402j13R72Q15O2J13R86J365O89j21k47J0K39P58J745K513
53807B13418K543K360K589K842K541K192K730L958M830N077N382N939N947M927
$$ plain form
53908 333706 339484 345216 351362 357627 362753 365525 365952 365116 363875 362163 359679 356732 354102 352315 351312
53893 351312 350628 349646 347790 344690 340235 334548 328081 321611 315782 310591 305573 300511 295624 291023 286495
53878 286495 282063 278283 275600 273668 271739 269525 267269 265160 263197 261665 261241 262330 264576 267293
53864 267293 270321 274342 280388 289138 300601 314330 329826 346546 363387 378253 388490 392065
53852 392065 388453 378534 363942 346593 328420 310974 295075 281021 269095 259580 252237 246192
53840 246192 240610 235319 230565 226435 222836 219803 217401 215429 213595 211936 210715 209951 209383 208798 208026
53825 208026 206770 205034 203632 203519 204491 205306 205368 205481 206467 207832 208521 208400 208153 208163 208402 209160 210905 213418
53807 213418 215961 218321 220910 223752 226293 228485 231215 235173 240003 245080 250462 256401 262348 267275
53793B67275L599K917K869K743K167J397P98M74L77L95M09L38J79n8m14r38j652
53776B82875k457l099l332l249l286l701m221m390m150l795l494l129k609k065
53762B35898j672j466j357j261j192j263j532j784j725j432j371j757k188k187
53748B13711j821j488j261q41j01O57R93P02J4n13m06J72N33L25MJ70P37J168
53730B12755J258J200J109R49Q29Q65Q82P05O15R79J614K041K292K727L071K506
53714B36397R63l86m36N42J341J274Q11R13J977L352L882L132J944J435J667J904
53698B60712J977K575L898N036N167M627M173L830L159K184J297N74n1k99J0K68
53682B99137k42j132j279m22M72O33L41R7k47r38j596j689j299q66m75kL24J58
$$ plain form
53793 267275 270874 273791 276660 279403 281570 282967 283765 284239 284616 285011 285420 285758 285937 285879 285465 284527 282875
53776 282875 280418 277319 273987 270738 267452 263751 259530 255140 250990 247195 243701 240572 237963 235898
53762 235898 234226 232760 231403 230142 228950 227687 226155 224371 222646 221214 219843 218086 215898 213711
53748 213711 211890 210402 209141 208300 208199 208856 209849 210551 210565 210052 209646 209818 210351 210676 210680 210850 211587 212755
53730 212755 214013 215213 216322 217271 218100 218965 219847 220552 221167 222146 223760 225801 228093 230820 233891 236397
53714 236397 237360 236974 236538 237080 238421 239695 240506 241419 243396 246748 250630 253762 255706 257141 258808 260712
53698 260712 262689 265264 269162 274198 279365 283992 288165 291995 295154 297338 298635 299209 299158 298859 298869 299137
53682 299137 298895 297763 296484 296062 296534 297167 297508 297605 297358 296420 294824 293135 291836 290970 290495 290493 290817 290975
53664B90975l10m86k23%j72n42q12j054j470j921k041j664r50j66M92Q57Q07L85
53646B81705r5k33N8M39N59N44Q31J467J927J846J608J829K436K797K602K163
53630C02483J778J459J366J869K829L356K850J898J547J949K291K034J520J346
53616C30575J616K082K531K903L234L695M364M917M868M257L735L759M025L980
53602C80541L566L153K958K871K810K797K721K279J286m1j177j649j384q06n13
53587C99412p75j357j797j826j516j178j096j272j393j224r96j160j749k269k275
53572C77529j783j058l03K95N30M01K12K70P18J678L067M221M227L006J586Q96
53556C95492O96K07o57j347j639j791j829j454p43k59k79m56l91l9N96J647K978
$$ plain form
53664 290975 290665 290179 289956 289956 289784 289242 288430 287376 285906 283985 281944 280280 279330 279164 279656 280513 281320 281705
53646 281705 281610 281377 281435 281874 282433 282977 283808 285275 287202 289048 290656 292485 294921 297718 300320 302483
53630 302483 304261 305720 307086 308955 311784 315140 317990 319888 321435 323384 325675 327709 329229 330575
53616 330575 332191 334273 336804 339707 342941 346636 351000 355917 360785 365042 368777 372536 376561 380541
53602 380541 384107 387260 390218 393089 395899 398696 401417 403696 404982 404941 403764 402115 400731 399925 399412
53587 399412 398637 397280 395483 393657 392141 390963 389867 388595 387202 385978 384982 383822 382073 379804 377529
53572 377529 375746 374688 374385 374680 375210 375611 375823 376093 376811 378489 381556 385777 390004 393010 394596 395492
53556 395492 396188 396395 395738 394391 392752 390961 389132 387678 386935 386676 386397 385941 385550 385511 386107 387754 390732
53539C90732M090M709N169N889O743P203O952O214N644N898P016Q296R102R808
53525D83465J1348J3712J5608J5988J5366J5085J5689J6629J7293J7670J8091
53514F55944J8874K0260K2192K4114K5362K5853K6148K6763K7676K8492K8888
53503I30566K8829K8553K8301K7976K7249K6182K5427K5324K5151K3974K2157
53492A219689K1156K1600K2415K2373K1751K1670K2226K2325K1396K0284K0068
53481A456953K0659K1113K0935K0443J9913J8941J6941J3983J0871Q376O480M492
53469A640100J828j351m389o925r195j1603j4180j6596j8481j9631k0048k0024
53457A499505k0045k0464k1290k2405k3769k5185k6106k6108k5477k4907k4620
$$ plain form
53539 390732 394822 399531 404700 410589 417332 424535 431487 437701 443345 449243 456259 464555 473657 483465
53525 483465 494813 508525 524133 540121 555487 570572 586261 602890 620183 637853 655944
53514 655944 674818 695078 717270 741384 766746 792599 818747 845510 873186 901678 930566
53503 930566 959395 987948 1016249 1044225 1071474 1097656 1123083 1148407 1173558 1197532 1219689
53492 1219689 1240845 1262445 1284860 1307233 1328984 1350654 1372880 1395205 1416601 1436885 1456953
53481 1456953 1477612 1498725 1519660 1540103 1560016 1578957 1595898 1609881 1620752 1629128 1635608 1640100
53469 1640100 1641928 1640577 1636188 1629263 1620068 1608465 1594285 1577689 1559208 1539577 1519529 1499505
53457 1499505 1479460 1458996 1437706 1415301 1391532 1366347 1340241 1314133 1288656 1263749 1239129
53446A239129k4187k3310k2300k1566k1017k0265j9108j7462j5120j2020q643
53435A034131n753l726k462j807j638j522p47R91L165M931O014P005Q677J1078
53421A058337J3352J4626J5043J5733J7579K0248K2658K4184K5129K6162K7672
53410A280723K9631L1749L3622L5075L6416L8108M0229M2475M4756M7370N0403
53399A710557N3357N5753N7791O0048O2464O4157O4423O3752O3497O4429O5904
53388B386132O6606O5987O4604O3086O1270N8714N5566N2409M9397M6082M2120
53377C011973L7642L2936K8181K3649J9551J5521J0715M811j491p370j2971j9119
53365C144028k6253l4067m2078m9876n6796o1950o4959o6377o7160o7788o8009
$$ plain form
53446 1239129 1214942 1191632 1169332 1147766 1126749 1106484 1087376 1069914 1054794 1042774 1034131
53435 1034131 1028378 1024652 1022190 1020383 1018745 1017223 1016476 1017467 1020632 1025563 1031577 1038582 1047259 1058337
53421 1058337 1071689 1086315 1101358 1117091 1134670 1154918 1177576 1201760 1226889 1253051 1280723
53410 1280723 1310354 1342103 1375725 1410800 1447216 1485324 1525553 1568028 1612784 1660154 1710557
53399 1710557 1763914 1819667 1877458 1937506 1999970 2064127 2128550 2192302 2255799 2320228 2386132
53388 2386132 2452738 2518725 2583329 2646415 2707685 2766399 2821965 2874374 2923771 2969853 3011973
53377 3011973 3049615 3082551 3110732 3134381 3153932 3169453 3180168 3184979 3183488 3176118 3163147 3144028
53365 3144028 3117775 3083708 3041630 2991754 2934958 2873008 2808049 2741672 2674512 2606724 2538715
53354B538715o7325o5651o3522o1663o0233n8576n6040n3049n0943n0568n1295
53343A899850n1785n1383n0315m8726m6347m3262m0309l8147l6323l3945l0992
53332A428316k8241k5935k3395k0256j7295j5413j4387j3321j2105j1528j1939
53321A234501j2565j2452j1572j0611j0000r559q928p928o508m598k272J00K009
53308A139617L273M231N350O725Q177R748J1653J3723J5424J6729J8413K1002
53296A274065K3838K5874K7070K8267K9818L1187L1938L2320L2590L2490L1695
53285A601152L0284K8400K6040K3449K1218J9589J8060J6008J3327J0137O374
53274A814038K137k018n596q689j1582j4159j6167j7818j9598k1750k4263k7072
$$ plain form
53354 2538715 2471390 2405739 2342217 2280554 2220321 2161745 2105705 2052656 2001713 1951145 1899850
53343 1899850 1848065 1796682 1746367 1697641 1651294 1608032 1567723 1529576 1493253 1459308 1428316
53332 1428316 1400075 1374140 1350745 1330489 1313194 1297781 1283394 1270073 1257968 1246440 1234501
53321 1234501 1221936 1209484 1197912 1187301 1177301 1167742 1158814 1150886 1144378 1139780 1137508 1137608 1139617
53308 1139617 1142890 1147121 1152471 1159196 1167373 1177121 1188774 1202497 1217921 1234650 1253063 1274065
53296 1274065 1297903 1323777 1350847 1379114 1408932 1440119 1472057 1504377 1536967 1569457 1601152
53285 1601152 1631436 1659836 1685876 1709325 1730543 1750132 1768192 1784200 1797527 1807664 1814038
53274 1814038 1816175 1814157 1808561 1799872 1788290 1774131 1757964 1740146 1720548 1698798 1674535 1647463
53262A647463k9789l1669l2355l2508l3044l4020l4820l5238l5617l6007l5912
53251A276484l5026l3659l2288l1132l0336l0063l0201l0324l0058k9340k8295
53240I35762k7145k6159k5395k4566k3458k2344k1575k0868j9552j7462j5111
53229F92127j2949j1029r455q529q282q353q490q750r143r549j0133j1194j2496
53216E63775j3339j3473j3354j3216j2660j1513j0424j0019r998r706r067q370
53204D28636p572o619n994o146o632o678o379o471o963p029o390n842n988o281
53190C37652n917n047m470m473m674m748m692m440l844l052k500k308k051j353
53176B84083m16J62Q8l85p93r02p99o65o04o40p51p95n33J01P88J007N75j51o29
$$ plain form
53262 1647463 1617674 1586005 1553650 1521142 1488098 1454078 1419258 1384020 1348403 1312396 1276484
53251 1276484 1241458 1207799 1175511 1144379 1114043 1083980 1053779 1023455 993397 964057 935762
53240 935762 908617 882458 857063 832497 809039 786695 765120 744252 724700 707238 692127
53229 692127 679178 668149 658694 650165 641883 633530 625040 616290 607147 597598 587465 576271 563775
53216 563775 550436 536963 523609 510393 497733 486220 475796 465777 455779 446073 437006 428636
53204 428636 421064 414445 408451 402305 395673 388995 382616 376145 369182 362153 355763 349921 343933 337652
53190 337652 331735 326688 322218 317745 313071 308323 303631 299191 295347 292295 289795 287487 285436 284083
53176 284083 283667 283829 283917 283532 282739 281837 281038 280373 279769 279129 278378 277583 277050 277151 277939 278946 279521 279370 278741
53157B78741o64n16o31j256k190k827k651j838j214j374j922j903j010J3L42R7
53141B59197j0J98J07o71j593j850j408q91o56n07l70n26r76j095m94J90N5o39
53123B48061n87Q09K488K951K012Q06K67K32M1n21j149j568j784j885j844j556
53107B46773j003l88q5l63j047j569j497r72n34n29p66q01m56LJ66r8n10p04n85
53088B35035l54k42l18n72r34j154q23K22J526K296K152J451Q44O48P05P06M74
53071B41662O5l03m47m28n30q68j114q03N6Q70J094Q14N18M00J80k80n18LR89
53052B41360J411P10m27q46k68N64R18P47L07k94q62r30l85K9n10j705k311j677
53034B35831n68j21m68q05o29l06l65o99p46k90K13J65m51r98q49o3O94R07P09
$$ plain form
53157 278741 278077 277561 276930 275674 273484 270657 268006 266168 264954 263580 261658 259755 258745 258758 259100 259197
53141 259197 259187 259385 259492 258821 257228 255378 253970 253079 252423 251916 251546 251020 250044 248949 248455 248645 248700 248061
53123 248061 247474 248283 250771 253722 255734 256540 256807 257039 257080 256559 255410 253842 252058 250173 248329 246773
53107 246773 245770 245382 245297 244934 243887 242318 240821 239849 239315 238786 238020 237219 236763 236766 236932 236834 236324 235620 235035
53088 235035 234681 234439 234121 233549 232615 231461 230638 230860 232386 234682 236834 238285 239129 239777 240482 241188 241662
53071 241662 241727 241424 240977 240549 240019 239151 238037 237234 237290 238160 239254 240068 240586 240986 241166 240886 240368 240371 241360
53052 241360 242771 243481 243054 242208 241940 242504 243422 244169 244476 244182 243320 242390 242005 242034 241524 239819 237508 235831
53034 235831 235263 235142 234674 233869 233240 232934 232569 231870 231124 230834 231047 231212 230761 229763 228914 228851 229545 230452 231161
53015B31161N30M35J21m34o65q0J006J689J458O71K4j89j01J69O22J099J259R58
52997B39733M75K04K60M72O10M87K6n64p49j33J025J953K075J412L24q08j550
52980B45252j422l86Q00J183O63O4O0L63L43J12M14J508K718L277L132K628J855
52963B62564Q33Q0K61J242K032J903J159N36J96k72j066j818k073j825j457j304
52947B60991j391j547j699j953k322k490k085j264p32r87j652j866j298n22k88
52932B38895n70n69K65J430J832J090K3l72j63j91p09j012n53J95M60L06L68P97
52914B41522J066Q49N06N27Q52R53M13o20j476j513q46l32n71j162j283q31m16
52897B37638l11r9M42P73L35n39r95o99j48Q4L6J72O88J106P41m02j412j429o24
$$ plain form
53015 231161 231691 232126 232247 231813 231148 231068 232074 233763 235221 235892 235916 235727 235626 235795 236417 237516 238775 239733
52997 239733 240208 240412 240672 241144 241754 242241 242267 241703 240954 240821 241846 243799 245874 247286 247610 246802 245252
52980 245252 243830 243444 244244 245427 246090 246154 246214 246577 246920 247032 247446 248954 251672 254949 258081 260709 262564
52963 262564 263397 263477 263738 264980 267012 268915 270074 270610 270806 270534 269468 267650 265577 263752 262295 260991
52947 260991 259600 258053 256354 254401 252079 249589 247504 246240 245508 244521 242869 241003 239705 239183 238895
52932 238895 238325 237756 238021 239451 241283 242373 242396 242024 241861 241670 240961 239949 239396 239591 240051 240357 240725 241522
52914 241522 242588 243437 243943 244470 245322 246275 246688 246068 244592 243079 242233 241901 241330 240168 238885 238054 237638
52897 237638 237327 237228 237670 238443 238778 238239 237244 236545 236397 236481 236517 236689 237377 238483 239224 238822 237410 235981 235357
52878B35357J52N12P61R47N76m10j119p58K38Q38Q26Q22J121J326J202J153J555
52861B45099K181K580K593K245J498M79l53o49o30q14j346j874k050j904j687
52846B45368j478j140o53m01q95k062l050l066k308j723j784k009j846j481j388
52831B20084j479j239n86J1K95N81J219J990K355K024J152R3q01j273j231p69
52815B22426j06N18R19J096J267J578J835J789J690K124L061L515K600P15q83
52800B44144j541j741k084k480k592k574k806l156l095k515j940j791j854j635
52786B12340j001j81N80J125J242P74n5o79o42M7J025J848K148J717P37j99n53
52769B20273l50r5j08j81OL84N79M19Q9j66k87l11k44j01N2J89L03K93Nm62o20
$$ plain form
52878 235357 235509 236021 236782 237729 238305 237895 236776 236018 236256 237094 237920 238742 239863 241189 242391 243544 245099
52861 245099 247280 249860 252453 254698 256196 256675 256322 255673 255043 254229 252883 251009 248959 247055 245368
52846 245368 243890 242750 242097 241696 240801 238739 235689 232623 230315 228592 226808 224799 222953 221472 220084
52831 220084 218605 217366 216780 216791 217086 217667 218886 220876 223231 225255 226407 226500 225699 224426 223195 222426
52815 222426 222320 222838 223757 224853 226120 227698 229533 231322 233012 235136 238197 241712 244312 245027 244144
52800 244144 242603 240862 238778 236298 233706 231132 228326 225170 222075 219560 217620 215829 213975 212340
52786 212340 211339 211158 211738 212863 214105 214879 214824 214145 213503 213550 214575 216423 218571 220288 221025 220826 220273
52769 220273 219923 219828 219720 219539 219545 219929 220508 220927 221016 220850 220563 220252 220008 219907 219959 220148 220451 220744 220749 220287 219667
52748B19667p8Q86J385Q68j41m69L64J461J517M44m49j6J357K356K369J967J873
52731B35361K086K180J984J673J490J548J728J605Q09m35j399j664j481j209q46
52716B43430m00k78p62j391j423p91j27J08L9q8k74n86r01r80o60RN89M23o77
52697B35260j933k273j562p48o83j143j246n07P70J890K320J944J130M93M87J090
52681B35289J843K184J841J018J65m39q14r65p62k44J67J30j21j25J09J48j80
52664B39244n07m03K00J026J612J465N05n91q84j13J088K017K569L025L510L846
52648B57609L715K863J394j14j110j730k565l726m512m242l036j600n08L5Q3r2
52632B42464q7L23J039J805K378K535K207J653J215Q93M41j50o33r82j373j688
$$ plain form
52748 219667 219589 220475 221860 222728 222587 222118 222482 223943 225460 225904 225455 225439 226796 229152 231521 233488 235361
52731 235361 237447 239627 241611 243284 244774 246322 248050 249655 250464 250029 248630 246966 245485 244276 243430
52716 243430 243030 242752 241990 240599 239176 238385 238258 238366 238405 238317 238043 237457 236556 235576 234916 234925 235514 235937 235260
52697 235260 233327 231054 229492 228744 228061 226918 225672 225165 225935 227825 230145 232089 233219 233712 234199 235289
52681 235289 237132 239316 241157 242175 242340 241901 241087 240122 239360 239116 239283 239413 239292 239167 239276 239424 239244
52664 239244 238737 238334 238534 239560 241172 242637 243142 242551 241667 241554 242642 244659 247228 250253 253763 257609
52648 257609 261324 264187 265581 265467 264357 262627 260062 256336 251824 247582 244546 242946 242438 242473 242556 242464
52632 242464 242377 242700 243739 245544 247922 250457 252664 254317 255532 256425 256866 256716 256083 255101 253728 252040
52616B52040j554j017n90m41j50M21P01L04k51l00k6Rj09J65P99J101P08M6k86
52597B51570j47K19N41O81O84P25Q87J040J052R54P83M84J49N1J99K04j26l73
52579B59577j07M19P13Q16J080J343J061K05n43p13n95o83r72j109j017r84j208
52562B57283j470j387r13l75M7N62J191J293L45r84j385o61nj84m59k0N18Q6j011
52543B52471j506j060n24m16l44q8r3n51q85n41K56Q63Q55K16o00p95l8Q65Q51
52524B48936P3l27J9K69j08m36k7P29J099J140J336J725K115K539K888K613J597
52507B66180Q51J418K847L598K912J496L96j47n05r59j424j683j736j891k453
52492B68900l205l488l001k174j455o90L96J376J468N73n06r08l80P01J619J707
$$ plain form
52616 252040 250486 249469 248879 248438 248288 248709 249410 249714 249463 249163 249137 249146 249037 249202 250001 251102 251810 251856 251570
52597 251570 251423 251642 252183 252864 253548 254273 255160 256200 257252 258206 258989 259473 259622 259673 259872 260076 259950 259577
52579 259577 259470 259889 260602 261418 262498 263841 264902 265107 264564 263851 263256 262573 261601 260492 259475 258491 257283
52562 257283 255813 254426 253513 253138 253185 253747 254938 256231 256576 255592 254207 253546 253541 253357 252898 252878 253396 253482 252471
52543 252471 250965 249905 249381 248965 248621 248533 248440 247889 247004 246463 246719 247582 248437 248653 248053 247258 247220 248085 248936
52524 248936 249009 248682 248701 248970 248862 248426 248399 249128 250227 251367 252703 254428 256543 259082 261970 264583 266180
52507 266180 267031 268449 271296 274894 277806 279302 279698 279551 279046 278087 276663 274980 273244 271353 268900
52492 268900 265695 262207 259206 257032 255577 254887 255283 256659 258127 258700 258194 257286 256906 257607 259226 260933
52476B60933R44J84K87J095J687J624J371J411J536J354R88Q48J009J209J361
52461B77841J608J933K042J746J179N59r2p62j239j360j370j699k299k586k228
52446B73273j649j470j667j742j491j178r85q21o88p80j062j154p96j49N10R91
52430B59142J060M93n48j508k022k074j643o42N73J235J116R07J264J883K040
52415B61276J652J220J041R87R55J032J314J926L050M571N985P054Q200R725J0879
52400C20867J0426Q063M643J164j820l908m837n033n395o174o598o002m819l939
52386B96638l468k794j714q59q14j222j151k22R21J395J110Q32J249K249L149
52371B95299L454L275L228L933N373O621O589N215L547K408J482J68j178j600
$$ plain form
52476 260933 261877 262061 262348 263443 265130 266754 268125 269536 271072 272426 273414 274262 275271 276480 277841
52461 277841 279449 281382 283424 285170 286349 286908 286816 286054 284815 283455 282085 280386 278087 275501 273273
52446 273273 271624 270154 268487 266745 265254 264076 263091 262270 261582 260802 259740 258586 257790 257641 258151 259142
52430 259142 260202 260695 260147 258639 256617 254543 252900 252258 252831 254066 255182 256089 257353 259236 261276
52415 261276 262928 264148 265189 266176 267131 268163 269477 271403 274453 279024 285009 292063 300263 309988 320867
52400 320867 331293 339356 343999 345163 343343 339435 334598 329565 324170 317996 311398 305396 300577 296638
52386 296638 293170 290376 288662 287803 286989 285767 284616 284394 285315 286710 287820 288652 289901 292150 295299
52371 295299 298753 302028 305256 309189 314562 321183 327772 332987 336534 338942 340424 340592 339414 337814
52357C37814r42r2J94K3j62j77J2M28Q29Q36N39M98Q89J173R78P82J221K127K859
52338C49829L251L633M095M432M836N857P471Q726Q816Q181Q091R253J1190J2937
52324D50598J4024J4653J5255J6038J6897J7569J7882J7871J7628J7115J6268
52313F31798J5335J4845J5094J5837J6606J7183J7510J7450J6953J6264J5591
52302H10466J4723J3413J2077J1474J1679J1973J1821J1343J0531Q843O062K970
52290I37375M58j512l437n147o062o292o593p191p467p013o230n622n094m301
52276H65872l200j906l56J465L231M505N172N483N838O664Q199J0184J1930J2882
52262I35963J3037J2799J2529J2364J2279J2237J2339J2846J3825J4795J5039
$$ plain form
52357 337814 336872 336780 336974 336997 336835 336658 336670 337098 337927 338763 339302 339800 340689 341862 342840 343622 344843 346970 349829
52338 349829 353080 356713 360808 365240 370076 375933 383404 392130 400946 409127 417218 426471 437661 450598
52324 450598 464622 479275 494530 510568 527465 545034 562916 580787 598415 615530 631798
52313 631798 647133 661978 677072 692909 709515 726698 744208 761658 778611 794875 810466
52302 810466 825189 838602 850679 862153 873832 885805 897626 908969 919500 928343 934405 937375
52290 937375 937833 936321 932884 927737 921675 915383 908790 901599 894132 887119 880889 875267 870173 865872
52276 865872 862672 860766 860410 861875 865106 869611 874783 880266 886104 892768 900967 911151 923081 935963
52262 935963 949000 961799 974328 986692 998971 1011208 1023547 1036393 1050218 1065013 1080052
52251A080052J4364J3325J2474J1619J0069P542M663K419J154J43j622m270o848
52238A145084q368q780q721q690q836r280j0016j0594j0449r652q885q577q446
52225A025790q017p240o454n981n840n639m854l485k233j602j053K54K075L230
52211I78951L275L052L337L883M337N159O760Q368Q730P664O063M576L229K221
52197A049605K121K979M014M565M842N295N797N913N675N498N486N327M841M179
52183A116137L347J961j68k593m669o352q034r664j0583j0451r824r460r357q957
52169A031333p989o626n067l499k356j936j773j011N25K139L300M152M799M810
52155A020801L925K651J658R52K20m08n59k99o2K9K21N49P28O46N38N24L60j88
$$ plain form
52251 1080052 1094416 1107741 1120215 1131834 1141903 1149445 1154108 1156527 1157681 1157824 1156202 1151932 1145084
52238 1145084 1136716 1127936 1119215 1110525 1101689 1092409 1082393 1071799 1061350 1051698 1042813 1034236 1025790
52225 1025790 1017773 1010533 1004079 998098 992258 986619 981765 978280 976047 974445 973392 973646 975721 978951
52211 978951 982226 985278 988615 992498 996835 1001994 1008754 1017122 1025852 1033516 1039579 1044155 1047384 1049605
52197 1049605 1051726 1054705 1058719 1063284 1068126 1073421 1079218 1085131 1090806 1096304 1101790 1107117 1111958 1116137
52183 1116137 1119484 1121445 1121277 1118684 1114015 1107663 1099629 1089965 1079382 1068931 1059107 1049647 1040290 1031333
52169 1031333 1023344 1016718 1011651 1008152 1005796 1003860 1002087 1001076 1001601 1003740 1007040 1011192 1015991 1020801
52155 1020801 1024726 1027377 1029035 1029987 1030207 1029799 1029240 1028941 1028879 1028908 1029129 1029678 1030406 1031052 1031590 1032114 1032474 1032286
52137A032286r92j704k089k116j803j116p1J147K281L343M803P182J0464J4074
52123A065689J7438K0352K2787K4685K6081K7104K7759K7954K7826K7668K7448
52112A342791K6799K5632K4274K2801K0719J7755J4543J2098J0797J0213R693
52101A538115Q816P551O284N449M901M035K698J434M32j127l967p466j0303j2113
52087A544739j3667j5562j7478j8791j9187j8622j7226j5350j3240j0735p755
52076A377126m921l095k263j565l79J179K907M883P078R180J1054J2798J4205
52063A428187J4775J4489J4015J3853J3800J3489J2917J2161J1108R878Q969Q544
52051A576185P969O482M117J542o79k451m073o098q870j1968j4468j6090j7505
$$ plain form
52137 1032286 1031294 1029590 1027501 1025385 1023582 1022466 1022395 1023542 1025823 1029166 1033969 1041151 1051615 1065689
52123 1065689 1083127 1103479 1126266 1150951 1177032 1204136 1231895 1259849 1287675 1315343 1342791
52112 1342791 1369590 1395222 1419496 1442297 1463016 1480771 1495314 1507412 1518209 1528422 1538115
52101 1538115 1546931 1554482 1560766 1566215 1571116 1575151 1577849 1579283 1579715 1578588 1574621 1567155 1556852 1544739
52087 1544739 1531072 1515510 1498032 1479241 1460054 1441432 1424206 1408856 1395616 1384881 1377126
52076 1377126 1372205 1369110 1366847 1365282 1364903 1366082 1368989 1373872 1380950 1390130 1401184 1413982 1428187
52063 1428187 1442962 1457451 1471466 1485319 1499119 1512608 1525525 1537686 1548794 1558672 1567641 1576185
52051 1576185 1584154 1590636 1594753 1596295 1595616 1593165 1589092 1582994 1574124 1562156 1547688 1531598 1514093
52038A514093j9119k0152j9661j8069j6753j6300j6006j5164j3944j2761j1538
52027A334626j0117q844q221q203q307q252q037p586o823o098o040o733p440p453
$$ plain form
52038 1514093 1494974 1474822 1455161 1437092 1420339 1404039 1388033 1372869 1358925 1346164 1334626
52027 1334626 1324509 1315665 1307444 1299241 1290934 1282682 1274645 1267059 1260236 1254138 1248098 1241365 1233925 1226472
$$ [...]
##END NTUPLES=NMR SPECTRUM
##END=
