
##TITLE=AC1406_BRAA12215_7653149_5PJ1xK5njd
##JCAMPDX= 6.0         $$ Bruker NMR JCAMP-DX V2.0
##DATA TYPE= nD NMR SPECTRUM
##DATA CLASS= NTUPLES
##NUM DIM= 2
##ORIGIN= BRUKER
##OWNER= Administrator
$$ 1.72 TOPSPIN		Version 2.1
$$ 2013-03-20 02:08:50.078 -0500  Administrator@X
$$ Compression mode = diff/dup
##.OBSERVE FREQUENCY= 400.02188249412
##.OBSERVE NUCLEUS= ^1H
##.ACQUISITION MODE= SIMULTANEOUS (DQD)
##.ACQUISITION SCHEME= NOT PHASE SENSITIVE
##.AVERAGES= 4
##.DIGITISER RES= 22
##SPECTROMETER/DATA SYSTEM= spect
##.PULSE SEQUENCE= jresgppsqf.2
##.SOLVENT NAME= COFFEE_meoh
##.SHIFT REFERENCE= INTERNAL, COFFEE_meoh, 1, 14.96086
##AUDIT TRAIL= $$ (NUMBER, WHEN, WHO, WHERE, PROCESS, VERSION, WHAT)
$$ ##TITLE= Audit trail, TOPSPIN		Version 2.1
$$ ##JCAMPDX= 5.01
$$ ##ORIGIN= Bruker BioSpin GmbH
$$ ##OWNER= Administrator
$$ $$ E:\/data/COFFEE/nmr/AC1406_BRAA12215_7653149_5PJ1xK5njd/13/pdata/1/auditp.txt
$$ ##AUDIT TRAIL=  $$ (NUMBER, WHEN, WHO, WHERE, PROCESS, VERSION, WHAT)
(   1,<2013-03-20 02:08:40.437 -0500>,<Administrator>,<X>,<go>,<TOPSPIN 2.1>,
      <created by zg
	started at 2013-03-20 01:54:17.234 -0500,
	POWCHK enabled, PULCHK disabled,
       configuration hash MD5:
       86 BA 57 50 F2 9D 5C 9B 26 00 A9 28 5F 66 2E 89
       data hash MD5: 8K * 40
       57 15 6D 8D 61 0A 7C 9E C3 39 DE 20 7E 85 21 4B>)
(   2,<2013-03-20 02:08:44.843 -0500>,<Administrator>,<X>,<proc2d>,<TOPSPIN 2.1>,
      <Start of raw data processing
       xfb same F2: SI = 16K WDW = 3 SSB = 0 FT_mod = 6 PKNL = 1 F1: SI = 512 WDW = 3 SSB = 0 FT_mod = 6 PH_mod = 2
       data hash MD5: 16K * 512
       51 D0 4A D0 07 5D 09 02 88 C9 B7 9E 07 45 28 D9>)
(   3,<2013-03-20 02:08:46.187 -0500>,<Administrator>,<X>,<proc2d>,<TOPSPIN 2.1>,
      <abs2 F2: ABSG = 5 ABSF1 = 10.00075 ABSF2 = 0.0002153913
       data hash MD5: 16K * 512
       0E E6 1D 55 79 2B 9F 19 CC AA FC A6 D6 FD 6A 50>)
(   4,<2013-03-20 02:08:46.890 -0500>,<Administrator>,<X>,<proc2d>,<TOPSPIN 2.1>,
      <tilt
       data hash MD5: 16K * 512
       AB 98 85 A9 47 5A 1B B4 52 B1 83 43 52 53 CA 44>)
(   5,<2013-03-20 02:08:48.343 -0500>,<Administrator>,<X>,<proc2d>,<TOPSPIN 2.1>,
      <abs1 F1: ABSG = 5 ABSF1 = 0.06497851 ABSF2 = -0.06497862
       data hash MD5: 16K * 512
       92 01 35 5C 58 46 4E B7 01 04 D3 32 A1 DC D9 5C>)
(   6,<2013-03-20 02:08:49.640 -0500>,<Administrator>,<X>,<proc2d>,<TOPSPIN 2.1>,
      <symj
       data hash MD5: 16K * 512
       A4 4D 57 07 A2 79 44 11 8C 58 FB E6 D2 04 43 4B>)
$$ ##END=
$$ 
$$ $$ hash MD5
$$ $$ 02 74 B5 83 7A 0D F6 7D B2 34 11 D5 E8 55 0C 42
##$RELAX= 
##$RELAX= 
##$RELAX= 
##$RELAX= 
##$RELAX= 
##$RELAX= 
##$RELAX= 
$$ Bruker specific parameters
$$ --------------------------
##$DU= <E:\>
##$EXPNO= 13
##$NAME= <AC1406_BRAA12215_7653149_5PJ1xK5njd>
##$PROCNO= 1
##$TYPE= <nmr>
##$USER= <COFFEE>
##$ACQT0= 1000000
##$AMP= (0..31)
100 100 100 100 100 100 100 100 100 100 100 100 100 100 100 100 100 100
100 100 100 100 100 100 100 100 100 100 100 100 100 100
$$ [...]
##$TD0= 1
##$TE= 300
##$TE2= 300
##$TE3= 300
##$TEG= 300
##$TL= (0..7)
0 120 120 120 120 120 120 120
##$TP= (0..7)
150 150 150 150 150 150 150 150
##$TP07= 0
##$TPNAME0= <>
##$TPNAME1= <>
##$TPNAME2= <>
##$TPNAME3= <>
##$TPNAME4= <>
##$TPNAME5= <>
##$TPNAME6= <>
##$TPNAME7= <>
##$TPOAL= (0..7)
0.5 0.5 0.5 0.5 0.5 0.5 0.5 0.5
##$TPOFFS= (0..7)
0 0 0 0 0 0 0 0
##$TUNHIN= 0
##$TUNHOUT= 0
##$TUNXOUT= 0
##$USERA1= <user>
##$USERA2= <user>
##$USERA3= <user>
##$USERA4= <user>
##$USERA5= <user>
##$V9= 5
##$VALIST= <valist>
##$VCLIST= <CCCCCCCCCCCCCCC>
##$VD= 0
##$VDLIST= <DDDDDDDDDDDDDDD>
##$VPLIST= <PPPPPPPPPPPPPPP>
##$VTLIST= <TTTTTTTTTTTTTTT>
##$WBST= 2048
##$WBSW= 25
##$XGAIN= (0..3)
0 0 0 0
##$XL= 0
##$YL= 0
##$YMAX_a= 66444
##$YMIN_a= -128293
##$ZGOPTNS= <>
##$ZL1= 120
##$ZL2= 120
##$ZL3= 120
##$ZL4= 120
##$ABSF1= 0.06497851
##$ABSF2= -0.06497862
##$ABSG= 5
##$ABSL= 0
##$ALPHA= 0
##$AQORDER= 0
##$ASSFAC= 0
##$ASSFACI= 0
##$ASSFACX= 0
##$ASSWID= 0
##$AUNMP= <>
##$AXLEFT= 0
##$AXNAME= <F1>
##$AXNUC= <1H>
##$AXRIGHT= 0
##$AXTYPE= 0
##$AXUNIT= <>
##$AZFE= 0.1
##$AZFW= 0.5
##$BCFW= 0
##$BC_mod= 0
##$BYTORDP= 0
##$COROFFS= 0
##$CY= 15
##$DATMOD= 1
##$DC= 0
##$DFILT= <>
##$DTYPP= 0
##$F1P= 0
##$F2P= 0
##$FCOR= 0.5
##$FTSIZE= 512
##$FT_mod= 6
##$GAMMA= 0
##$GB= 0
##$INTBC= 1
##$INTSCL= 1
##$ISEN= 128
##$LB= 0
##$LEV0= 0
##$LPBIN= 0
##$MAXI= 10000
##$MC2= 0
##$MEAN= 0
##$ME_mod= 0
##$MI= 1
##$NCOEF= 0
##$NC_proc= -4
##$NLEV= 6
##$NOISF1= 0
##$NOISF2= 0
##$NSP= 0
##$NTH_PI= 0
##$NZP= 0
##$OFFSET= 0.06497851
##$PC= 4
##$PHC0= 0
##$PHC1= 0
##$PH_mod= 2
##$PKNL= no
##$PPARMOD= 1
##$PPDIAG= 0
##$PPIPTYP= 0
##$PPMPNUM= 2147483647
##$PPRESOL= 1
##$PSCAL= 1
##$PSIGN= 0
##$PYNMP= <proc.py>
##$REVERSE= no
##$SF= 400.021882494141
##$SI= 512
##$SIGF1= 0.06497851
##$SIGF2= -0.06497862
##$SINO= 16
##$SIOLD= 512
##$SPECTYP= <>
##$SREGLST= <1H.MeOD>
##$SSB= 0
##$STSI= 512
##$STSR= 0
##$SW_p= 51.9856959427865
##$SYMM= 3
##$S_DEV= 1317
##$TDeff= 40
##$TDoff= 0
##$TI= <>
##$TILT= yes
##$TM1= 0
##$TM2= 0
##$TOPLEV= 0
##$USERP1= <user>
##$USERP2= <user>
##$USERP3= <user>
##$USERP4= <user>
##$USERP5= <user>
##$WDW= 3
##$XDIM= 16
##$YMAX_p= 161002801
##$YMIN_p= 0
$$ End of Bruker specific parameters
$$ ---------------------------------
##NTUPLES= nD NMR SPECTRUM
##VAR_NAME=  FREQUENCY1,    FREQUENCY2,      SPECTRUM
##SYMBOL=    F1,            F2,              Y
##.NUCLEUS=  1H,            1H
##VAR_TYPE=  INDEPENDENT,   INDEPENDENT,     DEPENDENT
##VAR_FORM=  AFFN,          AFFN,            ASDF
##VAR_DIM=   512,           16384,           16384
##UNITS=     HZ,            HZ,              ARBITRARY UNITS
##FACTOR=    0.101534562388255, 0.501933850740131, 1
##FIRST=     25.9928259484165, 8223.18227667557, -873
##LAST=      -25.8913354319817, 0,           -1077
##MIN=       -25.8913354319817, 0,           0
##MAX=       25.9928259484165, 8223.18227667557, 161002801
##PAGE= F1=25.99282594842
##FIRST=     25.9928259484165, 8223.18227667557, -873
##DATA TABLE= (F2++(Y..Y)), PROFILE
$$ [...]
16122a242m61k57j42J35N73N78c18A51n9a13a4A42K43J22J68k50b4p6C6c61j84
16101e45K55j00J4J06J12k88q96r19i93a43G91Q48P64o5q79B80f56a73E62L88
16081I50K972J469O67m11j097j737D46c26k56A88J238j49o34A30d4jB71K26R5
16062E92A66A6J104C78a295M43B81O03k38B03a83m7a10C05K72l5H7g06o36k54
16042a596kK91c92F3h7k02k29J1K02a8A60D9e07q27M46M21H8M05K48Ro8m8j98
16019D36A49c08o21m19l53L52e65b12M8k65n71j55N20h2j76q56r29o89r76j543
15999e251b005K78N7jK27N85d08n08l53m92l50p99k25K85a174b5F02Q3A32e57
15978b56A096J306J142n11o61q76F61B82j00b44k85n99m05m3J02P06b41b3m0J0
$$ y = [-1242, -1703, -1960, -2102, -1967, -1394, -816, -318, 151, 92, -113, -14, 142, 385, 507, 675, 425, -24, -100, 36, -361, -545, -290, -390, -376, -270, -158, -446, -1342, -2261, -993, -143, 791, 1639, 2403, 2338, 1459, 280, -656, -173, 562, 950, 3922, 5391, 6058, 5647, 4550, 2813, 446, -326, -582, 188, 1426, 1277, 643, 130, -44, -45, 271, 497, 592, 166, 16, 1120, 378, -1295, -852, 281, 884, 646, 203, -183, -230, -110, 305, 577, 542, 87, -706, -1342, -1596, -1598, -1307, -392, 63, -87, -289, -518, -507, -305, -18, 160, 49, -507, -1334, -888, -467, 88, 493, 741, 750, 682, 634, 436, 149, -308, -929, -1348, -1701, -1349, -565, -212, -164, -429, -1000, -1155, -635, -82, -258, -1114, -2043, -2732, -3708, -5251, -2005, -1727, -1670, -1671, -1444, -859, -408, -916, -1269, -1761, -2111, -2910, -3135, -2850, -1174, -25, 602, 685, 132, -557, -256, 1096, 2402, 3544, 3033, 2372, 1496, 661, 282, 182, -244, -529, -1128, -1533, -1576, -1474, -768, -241, -23, -63, -53]
15958e3B3N52P20P90M00M76n85q77p00p4j46j62j77A04B8mf84J01l29l53j87M82
15936i70a3D28j19b26q53o95p98r0O58R89L22b79J6l50k49N5J33j2l05n31ON43
15914i73d6B60P62M42L56J26k21l94q0L82K17J50M19l6j42k25l33j41n33D68h
15892b23k28r0j02k91j61K45L67i1A61R9k2G0a33j17J04k55l19q40r54J131D8
15870A445R39J56j007B96h78m65e45D90J399K82r13e55j290j242J519e05C02l3
15852B69L76p5A56a34D2Q28N89M29p53C87h30j193j387j900m46mJ662a694a92
15832I92O04O80R70J236k43j395q66n41o66h4p91k33N28b43C16K08Q8j39k04F6
15811A99K04L88j7J68k93B65E3J27M21K39K92J15k25m62K90L00K0j32N3k48k21
$$ y = [-53, 23, 575, 1295, 2085, 2485, 2961, 2376, 1499, 799, 725, 579, 417, 240, 104, 28, 24, -684, -583, -912, -1265, -1452, -970, -13, 428, 309, -226, -1079, -1774, -2572, -2662, -2004, -1015, -693, -279, -263, -613, -862, -807, -674, -686, -991, -1522, -1516, -973, -46, 260, 1022, 1464, 1820, 1946, 1725, 1331, 1251, 1633, 1850, 2000, 2419, 2383, 2241, 2016, 1683, 1542, 1009, 468, -8, -223, -451, -541, -643, -934, -1095, -850, -483, -91, 161, 260, 238, 70, -133, -250, -146, -401, -720, -1560, -2514, -1383, 48, 1445, 2384, 2540, 1533, 296, -878, -1343, -545, 490, 1889, 2171, 1258, -555, -1845, -3087, -1568, -505, 302, 269, 645, 570, 156, -134, 42, 870, 1459, 1888, 1135, 387, -830, -2023, -3410, -5310, -5756, -5760, -4098, -1694, -192, 992, 1596, 2276, 3246, 4482, 4239, 2844, 1978, 1437, 771, -84, -875, -1108, -580, -243, 316, 524, 612, 473, 269, 66, 199, 403, 791, 774, 942, 649, 265, 53, 180, 601, 840, 1132, 1247, 1022, 560, 850, 1150, 1170, 1038, 1091, 843, 622]
15790F22f9A32R30L19J79K2J03n5n79E5h71q02B48J544Q98M79J16m56q07n41k13
15769A268mK9k29m67a96l50a15B39J90L38M96O9j58B06g02l70R0L55b58J16@I6
15746B32N05O42j83n08l41q3O2j03ek68a14H74K73m68C1f41m99RK72n3l09k26
15724a447j0K97M79C48J050Q94J447R74J16O67j182j691a336q41k61N87P18M13
15706g20l9l88k51M92j73l83K88M91C74Q16M87J66J42P1o26J616R81n22E61a81
15685h90l81l64j66N8J14j21L45a4A134N39L04m85j59j86J64N52N23R45M73k81
15665C523A053hj062p85P81I9L16p3o0R2J09Q4N9o0k39A57J82p5A12Q5K63J64
15643F24m0k09p3E4c73q05p42l45M26Q72d62J21a6k7j79B77A10L358j142r31a66
$$ y = [622, -69, 132, 1062, 1381, 1560, 1582, 1685, 1630, 1051, 55, -871, -1673, 248, 1792, 2690, 3169, 3285, 2829, 2022, 1481, 1268, 1264, 1293, 1064, 597, -196, -546, -115, 239, 429, 767, 1263, 1332, 1174, 206, -702, -1072, -982, -627, -258, -142, 0, 96, 232, 737, 1379, 1196, 688, 347, 264, 326, 223, -5, -273, -114, 874, 1147, 679, 31, -641, -1140, -1131, -859, -912, -1221, -1447, -1457, -1160, -681, 348, 1398, 2292, 3739, 4713, 4829, 5496, 4314, 2623, -1336, -2177, -2438, -1851, -1133, -720, -759, -1147, -1398, -906, -1079, -1462, -1174, -683, 374, 1190, 1677, 1843, 1985, 2056, 1430, 3046, 4027, 3505, 561, -181, -890, -1271, -1635, -1801, -1743, -1629, -1750, -1405, -14, 1134, 1673, 1977, 1492, 1333, 1147, 1311, 1863, 2386, 3331, 3804, 3523, 1053, -8, -1070, -1855, -1074, 99, 415, 342, 282, 374, 483, 567, 626, 566, 327, 157, 339, 264, 112, 197, 460, 624, 584, 375, 302, 54, -373, -1178, -1920, -2265, -1839, -967, -462, -341, -16, -43, -222, 277, 110, 3468, 2326, 1395, -166]
15621f55o2K59J98j64m93j75M47L14I4K54Q7j54A24Q7M31N32M37m6o34B05b23
15599c16j10E2K15J20K1L9N21N41m7l47C66e71o47R5M94K38k76J60q4k28c63J34
15577b29g5C40p8J46P6j2j95j03a02q6j35k18j88k00rd60D01Q52J654J759k9K57
15555D894J60o38e69n19l07J79N47c17j28n57p65o47l88J46L91N30P19b69A62
15535D134o29J694k43A541G38A88a26I3J51b18n65m08j11Q2J54J32k5k46j65J81
15515a189J5m27n52n94M31O49O04K85F4Q42M98Nj29j2J65N7k18l25k77o0j64j76
15493B70b17o34j87p4L40b62A02M18K11k03B03a46B11N53L78M25K28R76R02j75
15473C498q61J368G53k0K75K85J78K2J14L66N92j61q76a7j292j07j985o0J054
$$ y = [-655, -717, -458, -260, -424, -917, -1092, -645, -331, 94, 348, 435, 281, 124, 211, 642, 1174, 1611, 1565, 931, 205, -223, -316, -426, 52, 267, 387, 408, 447, 968, 1509, 1462, 1115, 366, -571, -1218, -1123, -629, -391, -667, -507, -591, -819, -363, -229, -75, 340, 262, 408, 484, 472, 277, 174, -102, -188, -323, -541, -729, -929, -938, -460, 401, 1253, 2907, 4666, 4637, 4894, 5054, 4416, -569, -1088, -1395, -1216, -669, -317, -445, -1002, -1767, -2414, -2802, -2656, -2265, -1735, -1016, -269, 162, 4134, 3505, 5199, 4956, 1541, 738, 188, -126, 93, 244, -218, -783, -1191, -1302, -1220, -1066, -934, -959, -1205, -1370, -1189, -1174, -1601, -2153, -2747, -2316, -1667, -1063, -778, 64, 906, 1404, 1409, 1280, 1268, 1433, 1490, 1272, 947, 670, 610, 446, 270, -217, -851, -1038, -1112, -772, -262, 102, 520, 731, 528, 203, -146, 211, 764, 1142, 1567, 1795, 2771, 3673, 3498, 2637, 4005, 753, 733, 1008, 1293, 1471, 1493, 1607, 1973, 2565, 2404, 1528, -17, -1309, -1416, -3401, -3461, -2407]
15454b407R57b39G46J08l24B47A6g0D1a62k83q16o40P70L01a80F76J41k77B01
15433dq4E12J26K05j43j15B4g67j139j151K66J222P03b36E6O4f23o58j97l78g23
15411A03J03b53m83r8c28D27R44K23n50B02f87n65j79J19K77c04D79N50J138Q72
15391C039q32r33C23g48n45e36b08@A70a25o1J8B80M74O66L33O2k25m31m68A32
15369b89l71j78K12K94f4H4O4b65m29p34n60J37J27N32d27A50e9A75b98O7f0K4
15347c6l78n28n05j5f22A42K84j67a7E38M62K5qr9L7j43A93e78o45p85k85N63
15325a730O44e43b60A03a16o27q98o21j30M58P18N57J29R1J4J58l26o54k64L33
15305a178N63A87M69J00O4q9K97J42k11D55b94p97m92k88M95N8d77d9A93B6i1
$$ y = [-2407, -1450, -239, 746, 854, 530, 247, 16, -70, 41, -162, -445, -1261, -1901, -1131, -830, -180, 676, 817, 540, 201, -4, -88, 512, 638, 843, 700, 585, 24, -767, -1906, -3057, -2791, -1569, -866, -236, 56, 120, -623, -1281, -1478, -1856, -723, 103, 206, -253, -736, -834, -328, 427, 1371, 1594, 1044, 202, -687, -1252, -1431, -1312, -1035, -304, 479, 1029, 2167, 3039, 2207, 1274, 323, -748, -1293, -536, -208, 0, 170, -125, -186, -168, 280, 754, 1420, 1753, 1815, 1590, 1159, 691, 132, -289, -660, -838, -626, -332, -64, 84, 148, -265, -694, -1428, -1988, -1851, -1724, -1192, -427, 150, -59, 175, -298, -231, -60, -36, -414, -942, -1447, -1462, -622, 142, 426, 259, -17, 538, 1000, 1025, 1017, 918, 955, 812, 193, -578, -1223, -2008, -2293, -1730, -1086, -543, -260, 103, -116, -743, -1641, -2262, -2392, -1934, -1216, -659, -530, -439, -425, -267, -593, -1247, -1511, -1178, -615, 187, 656, 756, 820, 731, 1028, 1170, 959, 455, -294, -1091, -1583, -1871, -1376, -1318, -477, -49, 193, 26, -91]
15283G8J069N39l91E83c32p04m09l58nM72N44j13j17K52K45N7o5m40p20o7a02
15261A090P53k00F08a60o01L9a43H46Q00p5m56D92a37q73m51f86K42l9l00k58
15241a041n1M38A96O97J63k73l76H3J23M94N90J108P26N65L60j73j288q56n00
15222A232n32A19b52j58J75N4k87l45l43M5M91G0M82P2o0o4J86M89P59n23a34
15200a617j511n83L53J199a011J70j9c43C33O03M44J27j50l03l46k70J0j48j23
15181A77Fa98m63n34l71j72K30O39K81J08J52j96K44j72m3j75l80n33r63K7o83
15160c202k54m43M52J490R45c61J37l84n65n97m22k29k05O37P02i9C15P44Q5k91
15140H53A11d12B13r6c75r73n51g41A161M78Jo81m56O21J109J262J143n26j313
$$ y = [78, 1147, 1686, 1295, 583, -332, -1036, -1445, -1803, -1808, -1336, -792, -905, -1022, -770, -525, -468, -533, -973, -1693, -1760, -102, 1090, 1843, 1643, 608, -160, -761, -722, -143, 846, 1646, 1571, 1115, 492, -137, -1010, -1461, -686, -444, -483, -783, -1041, -1092, -654, 196, 893, 1056, 783, 407, 83, 206, 700, 1290, 2398, 3124, 3689, 4049, 3876, 2588, 1732, 1232, 700, 119, -252, -410, -235, -181, -468, -813, -1156, -1111, -620, 70, 552, 624, 564, 500, 686, 1175, 1934, 1411, -134, -1617, -3128, -3711, -3358, -2159, -1011, -841, -860, -343, 333, 936, 1380, 1507, 1357, 1054, 708, 438, 448, 300, 177, 6, -198, -661, -1195, -1566, -1738, -1508, -869, -588, -480, -328, -524, -280, -452, -495, -670, -1050, -1583, -2546, -2519, -3202, -3456, -3899, -3447, -1957, -1012, -361, -224, -608, -1173, -1770, -2192, -2421, -2626, -1989, -1287, -99, 315, 1059, 1144, 853, 111, -412, 213, 117, -375, -1348, -1899, -741, 1161, 1639, 1640, 959, 503, 1124, 2233, 3495, 4638, 4112, 2799]
15121B799p15l08o32b28p72m28m57j88N74e83D29O26M0m99d4o4b6A12M36R34J424
15100B906P38M99nk12j29r79j175J19k5J33o09E94h4j4F46O10J65G08a62r21N01
15079e82A03N02K30j88G1i51j66b10G22R17K02n62B08i49q30K24c08A99b85k77
15059e62l07J7b37A33J0B2e61p06o79m36K65M77N03N46b54a2A36N2J32J71A77
15037g80o6j2n78l67o95N38d83A96K32j50A21J50J28O2B03a00m98l1b00D03L26
15016G29J22qm8l63q4oj40d27k75l54K31L37K36j06q7j78l60o09o01m23M32p81
14994b965R69P68c83C81J54k60d96m25l31j34M83c09D6N45P94N33P10n88k83o85
14974A072B40d29k16N9a6j77n31k92c60E05N05M0m43B34c18k14Kr8k67l75L72
$$ y = [2799, 2084, 1776, 1144, -228, -1000, -1428, -1885, -2073, -1499, -583, 429, 1055, 1095, 596, -44, -108, -26, 112, 548, 1482, 2906, 3644, 4143, 4138, 3926, 3797, 2818, 1643, 1762, 1737, 1870, 1261, 594, -84, -98, 646, 1256, 1421, 708, -162, -1083, -582, 103, 605, 835, 647, 71, -951, -1117, -210, 722, 1639, 1841, 1279, 208, -949, -1779, -1555, -308, 199, -285, -562, -869, -852, -237, 133, 143, 22, -561, -1267, -1946, -2382, -2117, -1640, -1137, -591, -254, -12, 136, 188, 320, 491, 177, -780, -846, -858, -1436, -1803, -2498, -1960, -483, 196, 428, 278, 121, 271, 399, 461, 203, -100, -598, -629, -200, 403, 729, 851, 843, 795, 432, 348, 342, 202, -427, -702, -1056, -825, -488, -252, -358, -445, -623, -983, -1592, -2193, -2616, -2184, -2965, -1996, -1228, -383, 381, 535, 275, -496, -921, -1252, -1386, -903, -309, 46, 591, 1385, 1918, 2628, 2040, 1757, 1072, 240, -429, -645, -586, -16, -193, -724, -1016, -360, 505, 1010, 1050, 607, 234, -318, -532, -530, -628, -895, -1270, -898]
14953h98b07k22M4n3l95q12o65j23a122e8A89J39D6c56a25m44j070j318M38J237
14933a282c36A10Ie26l58n53j367r60J792K20K90J55k9l08l06k01m8M12M30K63
14913a094K18q4J42b22D9J10K37P56J127O41L02O6k45k96k75m75m14j85l01M4
14893A141J76j40l25C14C9a23c1j1k01q76q60O7P42e51P6j39J6b05E12L35l20
14872E27a92r73n38rO82L24n4j14J83L44j57l3k00R7K28c0D64M20L09L79J73O9
14850A814k22m93E01a31p28n66l41K96L90e24g5D89K01K25L72L10K17jq8m53m13
14829H59l06k65b06r16r43j064k36L70O19P79K39J72J73p3oJ36J11Qj22k38c75
14807E28N17n4j79l6j06J49L56M93N43O37k17M05j098m48n06D28j26a10n02j021
$$ y = [-898, -207, -429, -385, -438, -833, -1645, -2310, -2433, -1122, -58, 189, 328, 46, -356, -125, -569, -1639, -2957, -2519, -1282, -336, 110, 9, -526, -884, -1437, -2804, -3764, -1972, -1752, -1462, -1307, -1336, -1644, -1950, -2151, -2199, -1787, -1357, -1094, -876, -960, -818, -222, 49, 159, 396, 1152, 2279, 2920, 3222, 3288, 3043, 2747, 2472, 1997, 1583, 1398, 1097, 1141, 1317, 1177, 852, 314, 39, -123, -31, -42, -243, -1119, -1979, -1912, -1170, -551, -475, -614, -598, -205, 512, 847, 527, -192, -1165, -1703, -1712, -1030, -706, -760, -874, -691, -347, -504, -537, -737, -640, -412, -30, 464, 884, 1193, 1572, 1745, 1814, 1592, 1099, 501, -131, -859, -1425, -1766, -1470, -1080, -524, -75, 489, 690, 915, 1287, 1597, 1814, 1813, 1725, 1272, 859, 553, 288, -206, -1122, -2065, -3129, -3365, -2995, -2376, -1597, -1358, -1186, -1013, -1086, -1092, -956, -845, -837, -959, -1197, -375, 528, 1045, 991, 812, 776, 670, 819, 1175, 1668, 2211, 2848, 2631, 3036, 1938, 1490, 984, 428, 302, -110, -612, -1633]
14787a633L17k30O48L93k91q79p49r48j108J762J142e24K10L0a37EJ02K80Q6p4
14767C99Oj64f8m88o27o22l44K95N12e79C91M46C24d40q39q06M66c81G52P40M9
14746A541m06B62d87m42P4c61A43K67j36a13n39l95r9J84d05J59j18k85k99k26
14726a174K8J66L8P5K22K70D28P13O25J50k36q04A50iC58M70j9C49j73K4K06K55
14704F61J68k24e4j41A82M84P17j96J25l09l09G9d42m54k09J91M08b45n57j135
14684a937j230O8J112P88L35J26j49K04b25B83j30a66l55o6b67H0J14b00p39r00
14664a839q09j009K55a487a03F09L71O9l18j33A63i7D40P73N69O8o32A65g44J31
14644f13i3m3n12p92m93P58C35L58m3A17f43m21K2K66L71f2A32K91L53L28K77
$$ y = [-1633, -1316, -1546, -898, -505, -796, -1675, -2424, -3372, -4480, -2718, -1576, -524, -314, -284, -137, 5, 107, 387, 473, 399, 405, 241, -68, -556, -1183, -1805, -2149, -1854, -1342, -579, 391, 837, 324, -440, -1279, -2085, -1619, -381, 752, 1492, 1541, 1135, 262, -487, -929, -855, -361, 143, 410, 274, -113, -652, -1047, -1146, -962, -405, -246, -364, -649, -948, -1174, -1146, -980, -942, -867, -645, -375, 428, 1141, 1766, 1916, 1680, 876, 150, -9, 358, 828, 809, 349, 176, 200, 406, 661, 829, 605, -54, -195, 182, 666, 1383, 1187, 1312, 1003, 694, 79, -442, -896, -1105, -914, -506, -245, -802, -1937, -3167, -3099, -1987, -1199, -864, -738, -887, -683, -225, 283, 153, -166, -521, -587, -267, 80, 194, -200, -939, -1839, -2648, -3657, -3402, -1487, -103, 609, 980, 1049, 731, 598, 163, -97, 440, 1213, 1782, 1850, 1218, 165, -744, -613, -93, -136, -648, -1440, -1933, -1175, 335, 693, 650, 117, -643, -1064, -1042, -776, -405, -62, 132, 423, 776, 1104, 1381]
14623A381K15L13L3m11n44D44A04b43j56N2a51ck40n96r54pM51aD19N49m81e5
14600d25J6lL3a17A51J33H3b99m54m49m37n56k40Q16M35d64J48p7j58l01k91l8
14578a181k68L66P1K64b26N8p3A73Q27O97O64L77O8m19I96e14j511j554j35a823
14557e55A61J72b8l62l51m24j52k6J68J20K66c68E19O17N12K40l40l52m11k22
14537E63D0e06N8A91K60L28k28A51b92p17o82p86O9N31O17N69L41B0J56n1a02
14515a65I4R63a7C597R26k13i99J88f9F14J24m3l8J53L65M27J32j86m24l35k28
14494E61j47QL05K78k70l08A96l0PK96K77J54o8l48b46o25n16m20l55p07R75h08
14471C87O98J20m34B63a05k89k61k02N8J47b29A10J96A40k5a39k33j90J03J02
$$ y = [1381, 1596, 1909, 1942, 1531, 987, 444, 104, -243, -399, -347, -151, -3, -243, -839, -1793, -1800, -1349, -1, 419, 968, 487, -55, -425, -409, -412, -379, -117, 151, 284, 83, -299, -753, -1202, -1639, -2195, -2435, -1619, -1184, -464, -316, -393, -551, -852, -1143, -1181, -1449, -1083, -1012, -748, -226, -168, -241, 173, 1000, 1697, 2361, 2738, 2806, 2387, 996, -514, -2025, -3579, -3714, -1823, -555, 161, 333, -28, -390, -741, -1165, -1317, -1343, -1175, -1055, -789, -368, 519, 1136, 1648, 1888, 1548, 1196, 785, 563, 40, -506, -448, 191, 451, 779, 551, 151, -292, -1009, -1691, -2477, -2408, -1877, -1260, -691, -350, 20, 176, 125, -102, -165, 94, 1057, -17, 3597, 4523, 4310, -999, -811, -69, 614, 738, 695, 657, 810, 1175, 1602, 1734, 1548, 1124, 789, 561, 414, 422, 727, 1005, 735, 427, 196, 166, 173, 469, 746, 900, 832, 484, -246, -871, -1387, -1807, -2162, -2869, -1894, -808, 387, 1085, 1205, 771, 263, -105, -394, -655, -857, -799, -652, -229, 110, 306, 140, 115, -139, -372, -562, -459, -357]
14451c57J36p7h2d0m26l81n27o59j240p69r49L39J330a343G09J224L84P65j351
14432A731i57p25L59j260L89q6M54O25d06C60P25K34rk17D95B22N1J36N54K69
14412A232F07c87j00E0O28L61r3L7l8j85C80f7k32gF91P40O85P43N56l2j82o68
14390B533n13q54ej145p36P15C76J347R54q7n44n70n75C94D8e71o30M1N38B33
14369A051L24n45B25a74o50m73P9M36J31k10J43A78P31K04l41A73d80m15l3L9
14349h89d32O7j52j98k94k46M5K94M57a51B64L07L18K64K57K233P02nn52A433
14328i56n25g23D77P35N91K64n5k31p99a12n57P8j98l69j60M49K01p3k49L8L40
14307f12J26kj33j26j48O8K17a45D25L54K91L4l9l25c69j063l61B24Q96j4E41
$$ y = [-357, -221, -298, -82, -40, -466, -847, -1374, -2033, -3273, -4042, -4991, -4652, -3322, -1343, 709, 1933, 2317, 3082, 1731, -957, -1682, -1323, -2583, -2194, -2280, -1826, -1201, -406, 360, 1085, 1319, 1310, 1093, 495, 222, 273, 409, 963, 1232, 607, -387, -487, 50, 678, 1039, 946, 983, 945, 760, 380, -67, -299, -7, 691, 1431, 2116, 2859, 3415, 3383, 3201, 2533, 2020, 1166, -5, -1150, -1886, -1171, 376, 1723, 2677, 2590, 2046, 1476, 901, 394, 48, -571, -1201, -1160, -622, 233, 1051, 1375, 830, 225, -174, -824, -1297, -1218, -782, -651, -861, -718, 178, 909, 1113, 772, 173, -480, -895, -928, -889, -432, -365, -517, -715, -1009, -1255, -1210, -916, -459, -151, 264, 571, 889, 1153, 1410, 3643, 4345, 4340, 3788, 1433, -956, -1481, -723, 477, 1212, 1803, 2067, 2012, 1781, 982, -112, -669, -591, -789, -1158, -1318, -869, -668, -741, -990, -952, -612, -486, -488, -621, -747, -895, -827, -610, -145, 425, 779, 1070, 1104, 1065, 740, -369, -1432, -1793, 224, 1120, 1106, 541]
14285b46p28p29m02m78N44e56B36N12j90H2c30k83K7K55a50B6L9K14Q91P62K65
14264B197l95H16f87j315j102R26a065b22j08n32q2B24K75A83o2N58J172P00l0
14245B521j62k25j42l70l04m24D04C9N06Q20J18m11A78h07q05n64L12h33K93J00
14225d40n38l08o2j79j02j13l05n14g14F86M21J15j4p5m3k0m84k30F1c37r8j07
14203e42J20J11j37O9f1B86L59J49k43a5o60o27k76C48K290O73n74q35I23b42
14182e44l83j87K54G89M88k87m00c1p92j063r30j85J299P59J16j58J57K85b25
14162C9K53L92N4C55M65B01F8L12L7J09j69A38b57j65j08M0j55j83m95k85K92
14141a316d49G96J125K95n04G58c89l01q36o37N39M83L63j55j44n01l60N52c17
$$ y = [-246, -974, -1703, -2105, -2583, -2039, -556, 236, 748, 558, 82, -330, -613, -586, -331, -150, 26, 65, 279, 1170, 1932, 2197, 1802, 816, -687, -2002, -3104, -2178, -1065, -222, -330, -862, -944, 224, 499, 183, 121, 679, 1851, 2551, 2521, 2359, 2134, 1992, 1622, 1318, 894, 404, 39, 545, 1365, 1483, 1072, 178, -807, -1612, -2176, -1864, -833, -540, -440, -978, -1286, -1348, -1527, -1629, -1742, -2047, -2561, -714, 686, 1107, 1222, 1208, 1133, 1090, 1070, 586, 356, 61, -337, -435, -542, -422, -311, -448, -379, -61, 286, 645, 794, 551, -15, -675, -1302, -1578, 348, 2638, 3311, 2737, 1902, 923, -242, -544, -927, -1114, -860, 789, 1277, 990, 590, -31, -823, -1886, -2816, -3001, -1702, -943, -827, -985, -828, -543, -225, 39, 292, 684, 738, 355, 820, 201, 68, 380, 417, 526, 357, 138, -257, -422, -530, -490, -645, -828, -1323, -1608, -1316, -449, 796, 1921, 2216, 1712, 758, -389, -690, -1526, -2163, -1624, -1141, -778, -933, -1077, -1578, -1938, -1386, -317]
14121E32J272R97L03m02r35F04g69j189q24L9L29J135d00G6k1f10m12m59k17L4
14101a664k04K4N81d91B77O27K51p4j12k97k87A13b27j51J15Q6J0B1c9m06m23
14080h68j91J76K92J67p84n58k20M0J24J18j22Ln24n03m34j244J858e04A98Q40
14060A038N14M8p3m70E24c36q66n37K58P36b51Q3l55l20n77l8P28L5iJk92m68
14038g68m18J04M55K98d0C09R8@h78J47c0G30L93J4n06d1k67i2F30J94A95f44
14015a190j89j06n5J21m0m25n00k08k51O17Q54f1A274J303J195J319m2l25j247
13996C477A335b45j514M15J08J24K00J40O0J8n28a06A65J34G8K80a8j488p74j03
13976b383M16L97M93L97b81H4K73J75M4k19f3qG6M81A73O67l35a18r86j394r71
$$ y = [532, 1804, 2801, 3104, 2702, 1767, 604, -769, -1958, -2782, -2743, -2414, -1279, -400, 76, 55, -610, -1022, -1481, -1698, -1664, -1868, -1844, -1263, -491, 277, 904, 1155, 1081, 969, 672, 385, 113, -227, -378, -263, -177, -167, 21, -39, -445, -868, -1059, -883, -591, -424, -1208, -1766, -1986, -1946, -1822, -1704, -1826, -1823, -2347, -2850, -3284, -4528, -2670, -504, 198, 1038, 1552, 1600, 1527, 1057, 524, -336, -1202, -1739, -1481, -745, -251, -168, -523, -843, -1420, -1458, -730, -695, -9, -8, -300, -768, -1186, -1082, -627, -329, -40, 309, 407, 0, -878, -731, -30, 730, 1123, 1137, 631, -41, -308, -92, 630, 824, 195, -644, -1190, -1379, -1485, -1540, -1419, -1459, -1884, -2384, -2592, -2843, -2226, -1372, -61, 1274, 2577, 3772, 5091, 5049, 4724, 3477, 1335, -245, -1759, -1344, -1236, -1112, -912, -772, -712, -694, -1222, -106, 165, 299, 78, 358, -18, -1506, -2280, -2383, -1967, -1570, -1077, -680, -281, 84, 357, 532, 576, 357, -63, -71, 76, 557, 173, 840, 505, -118, -1104, -2498, -3469]
13955c469J31a191e19P9o27j275l26L70K30J021N1m16j36j8P07A6J143R77O44
13936B780M32j58r34o16o37D6g40n41J20J52N8n8p4J71l14l75j30M18L35j83r3
13915a254k52J10N35D4L88m3j10p7F8b62m16l24l86j07jd64A473Q25n40F69f08
13893a807o68K22J62M96Q2d81E53R28O25K97l06A037Ig61O6b35j11A04Q10J066
13873A980P09k72j07n26o53C04c86k0j18b52e3C43j57c78q70J70J17D09J674J736
13853C819R25o15A679E78a60l98J86A4b68n93n90j86M49d59E01P36N43R7j14j29
13833A634j54j15J9l1q0P0J88J22j5l96E86a51l85O2a4E82p0A87b48k29J20f6
13810A29J71J19A40N3E4j9J24L20A74f28q12n45j108a252L95D2M83L64K19j55
$$ y = [-3469, -3338, -1191, -519, -440, -1067, -2342, -2668, -2298, -2068, -1047, -996, -1412, -1548, -1566, -859, 16, 1159, 2136, 2780, 3212, 3054, 2120, 1504, 867, 46, -740, -1281, -1161, -1009, -951, -1009, -1083, -912, -1226, -1601, -1731, -1313, -978, -1161, -1254, -1506, -1396, -861, 44, 432, 389, 279, 202, 68, -262, -678, -1002, -1388, -1495, -1496, -464, 1473, 2298, 1758, 669, -608, -1807, -2475, -2253, -2091, -1595, -1513, -481, 553, 1481, 2106, 2403, 2097, 1037, 9, -761, -695, -235, -346, 104, 914, 1980, 2689, 2417, 2310, 1784, 1131, 304, -386, -406, -524, -252, -53, 343, 186, -378, -1248, -1078, -961, 409, 2083, 3819, 4744, 4129, 1679, 578, -160, -558, -372, 14, -268, -861, -1451, -1637, -1188, -459, 501, 1237, 1780, 1877, 1763, 1634, 1480, 1365, 1384, 1353, 1273, 1343, 1531, 1653, 1638, 1242, 586, -151, -536, -474, -14, 582, 512, 187, -248, -477, -357, -66, 129, 300, 419, 140, 193, 54, 35, 159, 479, 174, -628, -1440, -1985, -3093, -1252, -857, 42, 525, 889, 1108, 953]
13790I53m0J54L62K72J2p15m27B15C2L7h4k43P9c7D70N80P32M01J296k03A335
13768E29d5j91a03B74J91k23F1b74B3L27n0j49d0m00D9M40L69C54o8a07D59A43
13745D69K32p1A54d13n81k38K4o16k39k46l39e24E29O15n5B08f35m39j00K16J87
13724g71j57m46k88d68G38M97k94A19a333K46J75j25k39p46J005I1K59j06b51
13704i29m15M40a86g2n2j70f4E47M99K50K0k84l17k45il81l23J36H31J087L34
13683B252l75q94g3n75A29M23L04l29j70J96K46J69j12l97a05m48m02l09N14b28
13662g9m83Q4m70k16jd71a06B15P5K87L46K11n6l29G2h84n99k47M42L65c39C25
13639I10M79J3l07C99a85l64J72a37F1J18p8a04m01n32k77J88M43a65C14M00K62
$$ y = [953, 913, 1067, 1429, 1701, 1713, 998, 571, 215, 32, 69, -84, -327, -248, -37, 470, 1050, 1782, 2183, 3479, 3276, 1335, 529, -45, -236, -103, 274, 465, 242, 61, -274, 23, 350, 300, 151, -40, -440, 49, 489, 858, 354, 286, -107, 459, 143, 469, 701, 630, 154, -413, -994, -1232, -1208, -1824, -2063, -2309, -2648, -524, 529, 1144, 1089, 208, -635, -1074, -1174, -958, -771, -928, -1374, -1662, -468, 738, 1235, 941, 119, -1333, -1087, -912, -1037, -1276, -2022, -1017, 91, 350, 244, -251, -929, -1344, -904, -186, -72, -124, -294, -64, 547, 1046, 1296, 1316, 1032, 715, 470, -9, -390, -713, -577, 831, 1918, 2252, 1877, 983, -73, -648, 129, 552, 856, 527, 357, 553, 799, 968, 856, 459, -105, -553, -955, -1264, -750, -228, -79, -562, -478, -948, -1164, -1165, -471, -106, 215, 290, 577, 923, 1134, 1078, 749, 72, -884, -1483, -1730, -1288, -923, -339, 325, 910, 1389, 1402, 1095, 399, -185, -549, -377, -137, 61, 179, 101, -104, -505, -1037, -1314, -1126, -683, -165, 314, 714, 976]
13618I76K7J8J36J83j41j34E31I3c16j33J92B70N92K57l79b51o99F02J103R84
13598B689M20Q1j168h3r74j30N15L21a06A72n5Q2K35J70Q7j63D2e45n90l73k68
13577a776N4J35N16e24b51h4A69M79M93L02o8j34R2M35Lk14m31D90c25O3D62P43
13555A205L60k25D96c87k92C09J091O55K32m07p90B11e15l34J27E45N32O17L44
13536B038j6M02J63j075l06D55a63m54n9G9J124R94L04q71k95n03l93f8m75oe4
13514A180R91Q92K64m85m98k95l72k99j84j19J17J85K78L07k8n65A24a039n48
13495a587K18L69L45Q2j21b64A15N08j43r5b46q60o11O18G63Q62Nm15n84A64a28
13473c16a26C18K15L05K64m2j34m24c5l06k31k61l06L97I7L12I5f12q37m46L61
$$ y = [976, 1003, 1021, 1157, 1340, 1199, 1065, 531, 93, -316, -449, -257, 270, 862, 1119, 740, -251, -950, 602, 1705, 2689, 3109, 3190, 2022, -83, -1057, -1187, -672, -351, -106, 172, 117, 199, 434, 604, 691, 528, 42, -545, -1135, -1508, -1776, -1722, -1587, -1071, -524, -251, -84, 169, 648, 1141, 1443, 1375, 1241, 1333, 1768, 1771, 1557, 1126, 490, -325, -262, 462, 1205, 1565, 1340, 496, -387, -679, 309, 1400, 2055, 2287, 1880, 1090, 211, -515, -849, -722, 545, 1077, 1694, 2038, 2022, 2424, 2587, 1512, 1206, 455, -163, -617, -676, 79, 1203, 2197, 2501, 1630, 1335, 832, 439, -68, -543, -549, -54, 1180, 2171, 3063, 3327, 2842, 2344, 2049, 1677, 1378, 1194, 1075, 1192, 1377, 1655, 1962, 1934, 1369, 124, -1039, -1587, -1369, -1000, -655, -573, -694, -264, 115, 623, 480, 385, -246, -1106, -1717, -1099, 763, 1625, 1630, 1215, 631, 164, -128, -316, -126, 318, 533, 838, 1102, 1060, 926, 502, -35, -341, -572, -833, -1139, -742, 97, 409, 95, -612, -1449, -1895, -1534]
13452a534N47d24h6C91Q36R06J230O66J332k97j465A93a329j390j038K9j49j055
13434d932l84Q77a887h03K94a33K5k90m25o16l9K63J32J02O7M00C43P15P00L16
13414B074l71o23B84c67l46N2J14J16j88J86J16a07j91k2A32K17K10j69oI5c28
13392a025K88E98J147J340J9j046r99b73j078m47g8A756J628P75r09A281A70f56
13373h17A40N65J107Q58P63P12j508A030c35j009k10O46a03H94P85K10l61E75
13354b63m74o37m67M70F26J053L1l02E22h00j285j091J525e07e1E16K30Oj22k65
13334C65j60N8i8n97j99O4L15a61E07N19L03j25n67B49b82l51j90j14f8F01L94
13313I95J14j64k97k72g6n05n58q6K7O3l8L88i2E99L53r1J313o83a14j993k25
$$ y = [-1534, -987, -424, -86, 391, 1227, 2133, 3363, 4029, 5361, 5064, 3599, 193, -1329, -2719, -3757, -3728, -3877, -4932, -5316, -4439, -1887, -803, -509, -133, -108, -398, -823, -1439, -1478, -1215, -1083, -981, -914, -514, 343, 1058, 1758, 2074, 1703, 1080, 284, -367, -713, -661, -547, -431, -619, -433, -317, -107, -298, -320, 132, 349, 559, 390, 384, 95, -328, -1025, -737, 598, 1745, 3085, 3104, 2058, 1059, -273, -1351, -1798, -78, 1756, 3384, 4159, 3250, 1281, 170, -656, -817, 140, 705, 1812, 2670, 3433, 4145, 2637, 1030, -335, -1344, -1554, -908, -103, 894, 1679, 1889, 1528, 575, -263, -737, -1374, -1841, -1371, 626, 1679, 1710, 1408, 522, -800, -2085, -3176, -1651, -507, -51, 516, 746, 752, 630, 365, 205, 263, -98, -695, -894, -830, -515, -161, 507, 1026, 1329, 1204, 637, 249, -282, -633, -823, -937, -68, 601, 995, 1109, 945, 648, 376, -76, -581, -1139, -1225, -1198, -1135, -1173, -785, -92, 599, 952, 861, 2174, 1491, -114, -2107, -2332]
13292b332h35A35h1q25n10O1M45K49J33R0a25B53M92J82o1l02a3m65l20J15b88
13270a9G5K1Na88l59k93J4l70J50N1N0j97l23L48a42f7j05j36P7K1J0B36K92J94
13246G22K83k74Aa012l54c78F07K22m4C76j85c78m29o96K59K87M36J2j51n2m7
13225g59qm83n16p38N65f27B1M05J04J8R0J35L83l30A93f83p03k70O50a11G7c10
13202e23b50B40L97J45l01F1c78l24m28d32N9l7K3a40A49J45J22q2R1P2K99K06
13180A002Q8k47B74c67l65J88D54M05K54K60l16m23D4f36p80o31m91M28P29e32
13159c9A59d26j86J0J84a81f6J3k94j01l11k80K84J66o08n26k69r8n41o3N38K35
13137a921L06L56e29a08j47q86j207j293L65a496a37I98N49l84E29O0N49P46J102
$$ y = [-2332, -835, 135, -81, -906, -1416, -1355, -910, -661, -528, -438, -125, 253, 745, 927, 866, 564, -13, -478, -798, -683, -288, -19, 75, 96, 101, -188, -547, -840, -826, -1196, -1046, -995, -945, -1142, -1465, -1117, -142, -67, -172, -308, -231, -210, -200, 236, 528, 722, 1005, 731, 1, -1012, -1366, -378, 607, 829, 785, 376, 191, -378, -807, -1503, -1244, -957, -521, -509, -660, -712, -759, -767, -1250, -1766, -2504, -1939, -627, 21, 426, 530, 548, 638, 773, 1156, 826, 193, -683, -1386, -1656, -1006, -111, 77, -310, -523, -250, 240, 637, 782, 481, 61, -378, -702, -1130, -432, -373, -410, -387, -140, 149, 294, 416, 334, 425, 497, 796, 1002, 1090, 843, 274, -367, -732, -544, 454, 859, 1113, 1373, 1057, 634, 44, -636, -1416, -2047, -2538, -2110, -1381, -532, -39, 159, -426, -612, -602, -418, -181, -66, -53, -347, -448, -759, -1039, -755, -589, -1197, -1723, -1992, -2090, -2631, -2694, -2156, -1921, -1615, -1259, -529, -108, -255, -1141, -2348, -3641, -3276, -1496, -137, 998, 1547, 1163, 529, 589, 1138, 1884, 2986]
13118B986L81qqj050D80g01j000p67K06N59N99L77J53k52m45o27j34P64O10d2
13097A05Ed68l39l93j81M05c35A79q9b24k02q2J42BN53N45K09k56D09b05m10j18
13075g33j88n10q66j490J801J96p6kl67M18N7M39L08K9n2K62K98b28A18a2D7i
13052D9J40C6b04l08o3J79I3M65L15j6J95j14D57d4l22J8E20O71J49j86n22A26
13029c49m71m27m62l82O89O58L28L9r2m61o9c52A37A1d25m81j64Q9d90H4L93K75
13007G52k48j36j21j19E6O2N37Q58L66m00E64g62r67J57b09H28M05L6k34l18A34
12985c28k34K21B50M20J27k61g4o91L81D20L16o5j70A0c0F92p9A39h2m45g8F08
12962D42b70j016j457i03A38M90B81e0l08C6J093J09n11a43p45K91b58R1j54k39
$$ y = [2986, 3367, 3359, 3351, 2301, 480, -701, -1701, -2468, -2262, -1703, -1104, -727, -574, -826, -1271, -1898, -2032, -1268, -658, -42, 105, 5, -468, -807, -1200, -1381, -976, -335, 179, 90, -224, -426, -508, -366, 2, 555, 1100, 1309, 1053, 409, -205, -615, -733, -921, -1431, -2297, -3787, -1986, -1790, -1866, -1868, -2235, -1817, -1760, -1321, -1013, -984, -1036, -774, -476, -228, 118, -12, 47, -9, 49, 189, 36, -204, -512, -575, -396, 93, 558, 873, 857, 1052, 938, 457, -44, -366, -348, 520, 1191, 1340, 1154, 632, 126, -349, -820, -1247, -1709, -2091, -1402, -744, -416, -377, -469, -930, -999, -352, 137, 11, -425, -906, -1070, -981, -490, 84, 477, 752, 504, 368, 247, 128, 56, 118, 655, 1513, 1879, 1479, 564, -762, -1729, -1572, -209, 828, 1233, 1269, 1035, 717, 134, -328, -562, -341, 250, 670, 797, 536, -74, -765, -384, 420, 736, 671, 501, 10, -30, 692, 613, 139, -82, -527, -78, 608, 442, -270, -1286, -2743, -903, 138, 628, 281, -50, -358, 36, 1129, 1238, 727, -143, -888, -597, -258, -167, -321, -560]
12942e60m76o56k88Q73G40J217P63L66j386J21L04M44K1I92a82j007d89A267N43
12923A810j01m91F08b07o92J13j02M19J04p5k55n30l88n73l79m84R79g70A20L58
12903D78JJ20A44d32n78l32j41M44M02Pk08m11l2L16d68K16p0l36a81J4A42b5
12880d3E8J73N12J86J42pm26A07e62L1A97M16L74%k95A88Cb71n51n56p41k04Q2
12857b241o11p8h69b4E63R37K48J79O3N9l51R75A211m39A42c28m40m26k15J36
12837a273b95F8M08R03R13L87k53o72q33A40b14j44a71D13Q40O47j3m83E64a24
12816d02r5b40A54L9e49r41n87P0R29I5J149J232R25ql11j121n19o75k85oK19
12795F95N05J72R8J265Q97K47j583E06A84R11Q34L00l03p74D65b68p39n65b81
$$ y = [-560, -1036, -1692, -1980, -1107, 740, 1957, 2720, 3086, 1700, 1821, 2125, 2569, 2590, 992, -182, -1189, -489, 1267, 1810, 1709, 1218, 608, -207, -899, -786, -888, -469, -365, -440, -695, -1225, -1613, -2186, -2565, -3049, -2070, -770, 120, 478, 479, 599, 144, -432, -1010, -1342, -1483, -1039, -637, -630, -838, -1249, -1281, -965, -468, -252, -322, -658, -181, -167, 142, -25, -43, 58, 231, 743, 929, 1071, 1064, 638, 107, -562, -531, 197, 613, 987, 987, 692, 188, 3, -271, -822, -1378, -2119, -2323, -2241, -2852, -2930, -869, -24, 563, 1500, 1748, 1927, 1990, 2049, 1698, 2673, 1211, 772, 142, -328, -768, -1194, -1409, -1273, -295, 68, 476, 1379, 2292, 2679, 2426, 1754, 921, 140, -214, -358, -171, 413, 1253, 1900, 1887, 1404, 564, -124, -402, -497, -240, 154, 193, -549, -1490, -2077, -2007, -1078, 95, 1244, 2476, 3401, 3393, 3082, 1961, 1442, 767, 482, 476, 695, 1200, 1372, 1470, 2735, 3632, 3879, 2296, 506, 184, 1095, 1929, 2229, 1926, 1152, 465, -268, -1007, -1572, -281]
12775Ea23j14k87l24j56O2J99P8j30k89o87j057n13J087e98G05Q90P82K26n08
12755B095m86n06n51c94a37L0l9H73k65P05J40l30B05g68p72J90f5H98J97D22
12734d36p56n87k44Q00M26J21j95K50k72d11m56j65j59m79L02I8J087P99L25J45
12714B454k59m68p61@b81E0Q12N88K36N4l5j43l36n69a54p50b39E14K60k08a58
12692g35F68J463J179J312n78A999I49c14j335j356j249n64K74K71o2K043Q49
12675a443J54b94E9d28j51j26j29M8K34b75F9L24l4g6m82g0F35R05O01j54m99
12654A488n01a60j316k65d9I12K87E83c69j122o67R94HP85K58l25c5p61m38J13
12634a121N60A00K46E8K79Q78R82J37p68E01e96q89J69c33D37N7j04M5P28M72
$$ y = [5, -123, -237, -524, -848, -1004, -942, -743, -665, -795, -1084, -1771, -2828, -3341, -2254, -598, 705, 1595, 2377, 2603, 2095, 1609, 1103, 552, -394, -137, -107, -146, 873, 608, 1313, 1453, 1123, 205, -768, -1540, -1350, -65, 898, 1095, 422, -436, -1192, -1779, -2023, -1223, -797, -676, -871, -621, -893, -411, -867, -1032, -1191, -1670, -1368, 98, 1185, 1984, 2309, 2454, 2195, 1727, 966, 0, -281, 50, 862, 1450, 1686, 1740, 1705, 1562, 1226, 657, -154, -904, -239, 514, 774, 566, -158, -735, 668, 2131, 3310, 4622, 4044, 1999, 949, -314, -1649, -3005, -4254, -4818, -4544, -4273, -4335, -2292, -1443, -1289, -294, 59, -428, -579, -705, -834, -786, -552, -275, 69, 393, 359, -76, -558, -70, 635, 1540, 2141, 1987, 1488, 987, -160, -1476, -1741, -49, 912, 1199, 583, -369, -1491, -2158, -1164, 8, 793, 1051, 726, -35, -796, -1234, -1121, -561, 100, 346, 58, 337, 1215, 2197, 2334, 1566, 501, -596, -1485, -1316, -333, 437, 494, 390, 435, 1163, 1635]
12614A635K64j39l10o12A47oM39N43O4k8Q3J59J43j06k66m71A46f40l75j65L27
12593h53i2B93K13k8j98c95n58j152J016M09F00O78j61C86a48b2G26O20P0l03
12573A113m35C10O8L46O93M67K49j99n35F91a32o85j64J3N1K35M3J9b09m47n67
12552a223n59j052j21K06R37M42N80L41J57b1A79H1b72k59a65E09Q81O57M28k0
12532B455l92n55o60i2j2I61J25l10C15a64p1D23Q52N42M4k82k06j72k53l47k10
12511C91j4L24L09n4M03k67j26n4l27i7m73m38n18l60p31j344n43N84c92Mj79
12490e67a60F44N40K04l89B96e79k032g89H71R24L36J17k05k66l80j50J01P4%
12470A422k06k77l03j66J86j24K38O8j72B40h2l08M7J51m0o94r76j197j462o32
$$ y = [1635, 1899, 1760, 1450, 838, 147, 141, 580, 1123, 1187, 1159, 1242, 1401, 1544, 1438, 1172, 701, 146, -640, -1015, -1180, -853, -92, 293, 506, 478, 280, -395, -953, -2105, -1089, -680, 600, 1278, 1117, 386, -148, -22, 726, 1346, 1416, 1113, 678, 310, 378, 724, 1417, 1884, 2133, 1934, 1399, 691, -132, -817, -981, -968, -917, -682, -639, -620, -209, -656, -1223, -1782, -2834, -2955, -2749, -1812, -1370, -790, -449, -292, -21, 179, 81, -272, -531, -165, 509, 1390, 2047, 2475, 2455, 2063, 1508, 848, -92, -104, 961, 1086, 776, 315, -164, -235, 423, 1275, 1817, 1861, 1579, 1373, 1201, 948, 601, 391, 377, 701, 1010, 956, 1359, 1092, 966, 912, 585, -97, -570, -1008, -1526, -1886, -2617, -3961, -4504, -3920, -392, -388, -567, -160, 644, 1184, 1388, 999, 296, -579, -2611, -789, 871, 1795, 2131, 2248, 2043, 1777, 1397, 1247, 1348, 1422, 1422, 1216, 939, 636, 470, 656, 532, 770, 838, 666, 240, -82, -390, -343, -192, -232, -926, -1902, -3099, -4561, -5193]
12450e193n17J20R01a616e97k41n28m68m49N37h39P1j308k236j480n94n3R06b111
12430a095B08J107K20l80E07a90r37q76k98m81k57a302M71e6E37L41N6j62JN14
12410A287M47J59k48H00b70j120j527n03a410B19J288Q91J85l11KK65k4k6m46
12391B043o67o10E7d66m51n07N18A35O07L44P0l1k52j84o6k61E3d57l10L52C4
12369B11A02b44n26J80D50Q84M49k0n30E81G8f7k8M1o20j558M08P72E42O22m93
12348F71a20q40l10M9L89L6j02d26J84j19l55n44n12m54R4O47L46o66j55k23f19
12326I73J099R02p11m82n15n63b34r62l68A18J088N78J49N9k26m17n23l85P3L85
12306H99M45o6k30l61k00k8J97j81D3b87m95k89l09k18LL55K90l44p3q0O60c8
$$ y = [-5193, -5710, -5590, -4689, -1616, -597, -838, -1366, -1834, -2283, -1746, -839, -768, -2076, -4312, -5792, -6386, -6439, -5533, -2111, -1095, 208, 1315, 1535, 1155, 507, -190, -1127, -2003, -2301, -2782, -3039, -1302, -831, -56, 537, 878, 934, 772, 773, 1287, 1734, 1893, 1645, 800, -270, -1390, -2917, -3420, -1410, 219, 1507, 2398, 2583, 2272, 2274, 2539, 2515, 2489, 2043, 1376, 766, 57, -466, -917, -1424, -906, 135, 742, 1086, 1156, 1125, 873, 689, 623, 362, 53, -457, -767, -415, 34, 211, 102, -244, -770, -590, 450, 1334, 1783, 1763, 1233, 581, 78, -67, -95, -54, -674, -2232, -1824, -1052, 542, 1164, 671, -120, -960, -1270, -1221, -832, -796, -898, -426, -242, -361, -716, -1260, -1772, -2226, -2132, -1485, -1139, -1805, -1960, -2183, -619, 973, 2072, 2974, 2263, 1781, 1266, 703, -234, -1196, -1564, 118, 1206, 1784, 1933, 1992, 1766, 1349, 826, 441, 514, 899, 1344, 1278, 1048, 687, 487, 459, 656, 475, 43, -287, -782, -1071, -1380, -1598, -1595, -1240, -950, -1294, -1367, -1447, -787, -38]
12283E03L67J90j51C97d08j34k68b87e7A72B5a77G26O96M29Q14R27Q89Q1n23r05
12262C134j004p20E71b54n72j5b36C62M9F3d28j39r5i7F27O08K76R5p7j72k84
12241A073k12j94k70C9e11l06l24N7lJ45l84K41d13F07Q46Q62J172N63n20A459
12220A98i96K86A328J243K28j48O1r95k89l06n3m4k62A4f52o61k95M34e11A34
12199G82M24K09jm55A57e61o82l68J50O41b26D5J79J90L68b1j064j050O9M34N09
12178a123E20M33Jm08a19p90l86N24a56B72j9f1B8M35J98j90A49c87l58J4b22
12156C41N72J37j21D00c30n57j23K05b29j517o73b17o88k40C26J088K86n20D17
12136B38f8m80k7j4b83B37L87M71o8P2k61C31f39k39D69P48L35j4o53A60f04p39
$$ y = [503, 870, 1060, 909, 397, -408, -542, -810, -287, -57, 172, 25, -177, 726, 1422, 1851, 2665, 3592, 4481, 4562, 4039, 3134, 2130, 1410, 571, -254, -826, -841, -236, 362, 411, 63, -428, -567, -662, -97, 627, 1235, 1511, 1606, 1529, 1357, 1073, 861, 667, 397, 39, -511, -817, -1141, -1084, -1087, -942, -1326, -1085, -413, 607, 1453, 2315, 3487, 4050, 3530, 1459, 198, -996, -710, 1328, 2571, 2799, 2651, 2712, 1717, 1428, 1122, 1069, 1025, 763, 14, -652, -1313, -1608, -1174, -511, 134, 782, 1206, 1415, 1414, 959, 157, -561, -1243, -1611, -1461, -820, -226, 45, 224, 414, 782, -21, -1085, -2135, -2066, -1632, -1123, 520, 953, 954, 546, -119, -909, -1295, -771, -156, 272, 253, -61, 28, 463, 661, 471, 149, -387, -745, -731, -222, 341, 913, 1050, 929, 400, -330, -887, -1010, -805, -229, -1746, -2419, -217, -905, -1145, 326, 1414, 1700, 1180, 417, 238, -68, -548, -575, -589, -283, 237, 624, 1095, 1027, 1099, 838, 331, -639, -878, 469, 1217, 1552, 1538, 885, 160, -604, -1343]
12114a343o06o8P70b8F46N34K39O1p3l21m34D0h44r28l13M58M84K60r0k03k64
12093a440l53j73l5j30K9D9J457M98R66L33I53a40j514o06r1C05J465P26k76n28
12073A692p39B95e00A68M08K11k0k57A83a42m79o02n33n41j0N66O87l77K95m21
12053a557k55J31P07d51p0p51M3K93M08a99A87Af94p19m86m02K19Q66N72g8b5
12031a19B3J43Q8Cc28n81j85A034J581M28N44K33j09E68M5R49R68R45L67j51q90
12010B801l21k39o97F04a85n65m12k67J08K90L59d8C02j08b30r8J5B19J6b40o63
11989i03l26l90k77l17j9Q90K62L39K16b3F42L71J76j16n07E4B2N08L50j63Ad83
11966B59J331Q38P6k1j175c28k37C42N21k3O5Q35R46k41q81E87d01kk92qB4d1
$$ y = [-1343, -1949, -2017, -1247, -28, 646, 1180, 1419, 1480, 1407, 1086, 652, 40, -844, -1772, -2085, -1627, -1143, -883, -973, -1176, -1440, -1793, -1966, -2001, -2131, -2102, 49, 1506, 2004, 2970, 3303, 953, -140, -1654, -2260, -2351, 305, 1770, 2496, 2220, 1692, 953, 295, -500, 168, 576, 787, 767, 510, 183, -142, -621, -1223, -1756, -2297, -2307, -1741, -1054, -1431, -1136, -1557, -1812, -1681, -974, -451, -521, -1272, -1229, -936, -528, -199, 187, 1, -694, -1413, -1899, -2301, -2082, -1216, -644, -78, -25, -119, 23, 166, 254, 3, -328, -909, -1094, 1034, 2615, 3043, 3587, 3820, 3711, 568, 613, 1562, 2530, 3475, 3842, 3691, 2801, 2480, 2241, 1544, 604, -185, -750, -1162, -1429, -1321, -1031, -672, -48, 302, 194, -230, -328, -313, 219, 235, -240, -903, -1229, -1619, -1896, -2213, -2232, -1342, -1080, -741, -525, -23, 642, 1013, 1189, 1073, 566, 54, 22, 530, 880, 717, 1, -483, 259, 1590, 2428, 2504, 2483, 1308, -328, -565, 342, 863, 840, 905, 1740, 2686, 2445, 1564, 587, -401, -403, -695, -703, 24, -41]
11943a10m34a84B50Q2A19a65I5Q43P79K04O11C64d56p09L83F23K75l63a9m64j93
11922f76m7K12A99O97O68O18J92o10m48C10c44A004N14M25l20n84C35a92l44J81
11902c55A50K92Eg82m75l77J49N86c90f8A08M13K28J72n1j57k67A48Db95n58M6
11880h07o3P8k6p3J9J05L04A26K28K2L50K71L09k57D01b46B05J028N06m72C63
11858e35j148n49o3K55P29d23F8P0b16j34j22k65k12k25n1K81A67O47L74J62n46
11837H04a72q28n17P0L42K08N1K01J3l05k6L89a96A24L38A32nb05o60l07L68I8
11814F81r2B56A00J4J43D7d52n45m43O2L30L37j08K7m9K16J80M0J81n11J97Q7
11792d51l57m13k52N07c07Fa74n86k39k18m2K2m1K94c98E3M34M44M65K817L27
$$ y = [-110, -544, -184, 250, 332, 119, -165, 95, 938, 1717, 1921, 2532, 364, -456, -1165, -782, 623, 898, 535, -19, -483, -676, -723, -511, 199, 896, 1564, 2182, 2374, 1764, 1316, 310, -344, 1004, 1518, 1943, 1623, 1039, 335, -192, -536, -355, 150, 442, 5, -782, -1257, -1634, -1485, -899, -390, -68, 108, 521, 749, 921, 870, 713, 446, 148, 4, -295, -853, -807, -870, -792, -818, -891, -872, -767, -463, 126, 354, 376, 726, 997, 1306, 1049, 401, -246, 205, 1233, 1739, 1267, 363, -535, -1683, -2232, -2295, -2040, -1311, -423, 68, 138, -216, -350, -472, -737, -949, -1174, -1225, -944, 167, 814, 1188, 1350, 804, -172, -1000, -1517, -1447, -1105, -897, -846, -645, -632, -937, -963, -574, -196, 124, 462, 132, 127, -205, -865, -1172, -804, 98, 681, 589, 256, 100, 114, 257, 47, -452, -997, -1440, -1378, -1048, -711, -819, -792, -841, -625, -445, -405, -224, -735, -538, -451, -808, -1221, -1473, -966, -307, 6, -174, -760, -999, -1217, -1259, -1237, -1278, -984, -398, 53, 487, 931, 1396, 4213, 4540]
11771D540B267k60I87b2q16m66j74j58Q1O84FO31K72k42A1e58n47R0B63M56k4
11750F95k99a48k8j043p4k67l02KQ03d75R8m95n56m14j54K76M03M61g9j09m22
11729f10l87k08J24m0N8LJ32d57D20N22j36Ba097j086l29i54h1A72J48A47R8L26
11707E71N26M21L57k54F54a30q41l99m80m53J134H8N88B12a0A9N35O48m74a002
11686b195Q66a98E96L86l73B27c44l32j66L21b31a00B38L27l1K5j97A57J84M22
11666G63N40M26O1k06k50k25R6J40L53N9k52o82a04o17j69L27C85R41N67K17j35
11645A975k53N5K78K1o30o77F0P5M81L47J74k45J8J8N3n9k63C08b73q04l61d36
11622I13K60l40j21M30O06M71O7q09k08C18K09M77L79m36D9a001Q9c81B25J32
$$ y = [4540, 2267, 2007, 987, -22, -838, -1304, -1478, -1636, -1555, -871, 6, 637, 909, 667, 11, -558, -1105, -1015, 263, 719, 695, 396, -148, -176, -1219, -1293, -1560, -1862, -1860, -1057, -475, -377, -872, -1428, -1842, -1996, -1720, -1317, -856, -79, -188, -610, -997, -1205, -1081, -1121, -1063, -1060, -928, -457, 420, 942, 806, 2, -1097, -2183, -2512, -954, -81, 172, 320, 147, 245, 571, 1097, 1518, 1875, 1621, 654, -130, -971, -1370, -1850, -2303, -1169, 88, 676, 212, -10, 19, 554, 1202, 728, -1002, -2195, -1329, -198, 596, 982, 609, 227, -344, -676, -842, -521, -231, -100, 238, 565, 534, 559, 362, 157, 341, 763, 1303, 1729, 1790, 1584, 1334, 1109, 1205, 1345, 1698, 1757, 1505, 823, -104, -721, -890, -563, 385, 1326, 1893, 2110, 1975, 1722, 1777, 2055, 2076, 1446, 769, 60, 135, 616, 963, 1137, 892, 910, 928, 981, 922, 659, 308, -273, -1077, -1438, -436, 913, 1173, 833, 712, 1142, 1748, 2219, 2286, 1477, 1269, 318, 527, 1004, 1383, 947, 49, -1001, -912, -381, 225, 357]
11602C57oA74h1j78q30K17K40k60k62k0k62J72P5L13d27j06n85o01J81P39G7N27
11580F04J7A96J1R23J120J124P31M92j78l19n37p11j421o29H1c64q7k85j71k31
11560a138a06F60M05J59k87k72i85D89A76a20j51B8e53b47k5qk0i4C86L70j23
11539F33I6a20l01k04a14j11n50m40j58M82b68A35L15j5J31K02n1J97D40c44n09
11518h53p74n64R40c99g4F26M14q7B35b72l69k16c96C1%c50n72p42j98j00Q14
11497a148b11q6n13J92a48D08M85K31k00m17A32n2k0d7B4Q1J18e4k23J37B34J01
11475C35O30j12k07L32j66k24A12d6l76k25n9K80e3F4d32l05J06B64Q11N24J94
11454A793O22K79M63A495D95e05o92k99L70K58L33K42E7M11L12q4B34d26n84J00
$$ y = [357, 351, 174, -81, -259, -1089, -872, -632, -892, -1154, -1174, -1436, -1264, -1189, -876, -427, -533, -1118, -1719, -1538, -799, 77, 604, 621, 196, 207, 1130, 2250, 3374, 4105, 4597, 4419, 4100, 3563, 2852, 1431, 802, 81, -364, -451, -736, -907, -1138, -106, 660, 1065, 1224, 937, 665, -985, 489, 176, -120, -271, 28, -553, -247, -272, -280, -300, -94, 386, 756, 633, 96, -120, -421, -625, -114, -225, -775, -1215, -1373, -891, -268, 135, 450, 435, 566, 768, 717, 914, 440, -344, -853, -1627, -2191, -1251, -399, -74, 626, 1040, 953, 235, -272, -641, -857, -396, 31, 31, -350, -922, -1664, -1862, -1962, -1148, -211, -297, -810, -618, -148, 408, 893, 1124, 924, 507, 132, 80, 60, -47, 24, 105, 223, -54, -277, -140, 234, 335, 965, 853, 646, 978, 812, 588, 112, -46, -422, -647, -706, -426, -53, 64, -432, -737, -631, 264, 1075, 1599, 1793, 2415, 2694, 3157, 1495, 495, -505, -1197, -1496, -1126, -868, -535, -293, 57, 468, 780, 696, 234, -426, -1010, -910]
11434i10K08K0c24C20b27o69F07R69j15D26a086p63R3m235e29C20O71R94R29J129
11414D043K5A410B36e66j16B2J184R09N67J96k62p81o81A01b63M8A56J77A7b42
11393c57m55l12h2D31M2j15%n8q2a32l41m84m41N8j17r13j420j034m8Q95e87D2
11370A294J65O01J136J60l76m16k29m53l23k73j15K4j03o4l34A17d9j16b8B76
11349D79J91j78A14b22m7B32N29N74N72N38M16m68q36E63a23n14LJ82j13k2K9
11328e58j3j05j01L13h1m4D80M14k97B49d33m03o89l44l03j46K37L63N73c52E08
11306E78B59NK62k04M19J827M11A359o58A04a32j84j90k51o3b3F78L77j6j00l31
11285F08D9e08L3B13Q63L92Mq3j6N0R27O28o11j103c33m29K71i5E63M72l3k7N5
$$ y = [-910, -702, -682, -324, 320, -227, -896, 607, 1576, 1461, 426, -1086, -1849, -1756, -5991, -529, 320, 991, 1985, 2914, 4043, 4068, 1410, 236, -566, -682, 22, 1206, 2115, 2682, 2878, 2616, 1835, 1154, 101, -263, -215, 156, 333, 17, -242, -357, -812, -1124, -82, 431, 473, 358, 358, 300, 218, -132, -473, -957, -1398, -1340, -1457, -2370, -3790, -4824, -4872, -3977, -587, 42, 1294, 1459, 2060, 3196, 3356, 2980, 2564, 2335, 1882, 1559, 1286, 1171, 1195, 1092, 1028, 694, 117, -49, -165, -28, 276, 479, 670, 492, 114, -222, -269, 232, 761, 1335, 1907, 2445, 2861, 2393, 1557, 563, -123, -637, -634, -452, -565, -587, -558, -571, -676, -777, -464, -81, -125, 480, 894, 597, 249, -433, -836, -1525, -1869, -2172, -2318, -2081, -1718, -1145, -352, 508, 578, 259, 264, 526, 322, 741, 2568, 2979, 1359, 701, 104, -132, -316, -506, -757, -820, -23, 678, 1055, 1039, 939, 608, 49, -508, -475, 213, 1076, 1468, 1472, 1389, 1373, 1423, 2350, 2978, 2367, 1264, -333, -762, -491, -95, 563, 1035, 1002, 975, 1030]
11262A030K28K98L72K59k79l39k05m06D13d61C4J445O35m01H43a22l05a93A08
11242C5b63j54m91l76q41r43n65K03N01J291A99O89k35K29j65j87A0e64m22o9
11222a055J30l83n4a31C74P09O72J85k75n47B19d91n78n0K18J04j52K51c39B9
11201c65l08k47Kd43A97K91J52l6N3P6J15l23A39fA48L85L67K85O5O5k97D27G0
11177d07J86m97j60J06b98B92O10P83L50J240n98H52C0f85k84D89J165K59k03
11158A710o07C39e12p53m63l54L45h29a75A63R6m9O03k55a267J03L30L92A10N54
11138F64J16j32H8b98j90J08A088J330j66o28n66m50A66a63l42j67J62J59a34
11118A47M99J51P3K16C23N8j62P5M52j67a80j021e00C85J56M70j94l85j41L72
$$ y = [1030, 1258, 1556, 1928, 2187, 1908, 1569, 1364, 958, 413, -461, 34, 1479, 2114, 1713, 843, -122, -427, -193, 108, 35, -263, -417, -908, -1284, -2125, -3068, -3633, -3430, -2929, -1638, 199, 888, 653, 882, 717, 530, 10, -564, -986, -1055, -925, -1308, -1362, -131, 374, 1083, 1755, 1940, 1665, 1118, 219, -491, -1069, -1119, -901, -797, -949, -698, -339, 29, -365, -673, -920, -918, -443, 197, 488, 640, 604, 657, 733, 848, 525, 139, -6, 148, 533, 900, 1185, 1250, 1315, 1018, 427, 70, -407, -221, -718, -878, -772, -298, 292, 902, 1685, 2035, 3275, 2677, 852, 30, -685, -969, 489, 1654, 1913, 1710, 1103, 339, -512, -1265, -1728, -2082, -1737, -829, -175, 163, 259, 210, 813, 558, -1267, -1164, -834, -442, 110, 664, 780, 648, 88, -298, -488, -380, 1088, 2418, 2252, 1624, 1058, 608, 166, -163, -505, -672, -510, -351, -134, 147, 646, 797, 870, 1086, 323, 381, 219, 294, 746, 579, -180, -1201, -500, 385, 541, 1011, 817, 432, 291, 663]
11098F63L78k78B00d77n99n00j0P42A13M77j59dl88p91m92k96pJ86N75B62K49
11077E11o8B14d0A09M04N36M90K34M29K67k01k97r0n10D52i42p31l34l6N31N33
11056i79d73A0J40b46o85k91e43A40P01P16K43l37o66C9c26b8A91aq2l72j16j05
11034f76NJ5J16k50j86o01O19L14NF7P80M15j0E77b25J2A211b37q32K32a40N9
11012h1F78JJ5K64r6k25K7K47J55P4R1J90J01Q32K3G9i74j090M07C06P78L64j30
10989A318nk7k65Ok60C19c04m78P7R2J02J96P8j23k31m59l8b76D67K51k89a24
10966g85K58K51l71r82r27j313J038i44F25O99L61r3n18m47l05J5K86M20M46L54
10946A843l44k45K3J73k36J68l28l45B80i2j72o5j58Q5C2P5J9h2l09k25j25q2
$$ y = [663, 1041, 763, 200, -477, -1076, -1576, -1586, -844, 113, 590, 431, -4, -392, -1183, -1675, -1971, -1978, -1792, -1217, 262, 511, 443, 214, -40, 109, 513, 1049, 1539, 1773, 2202, 2469, 2268, 1971, 1881, 1371, 452, -942, -1673, -2007, -2043, -1512, -979, -473, 10, 150, -246, -931, -1222, -543, 140, 841, 1557, 1800, 1463, 797, 39, -326, -28, 191, -1, -83, -455, -571, -676, -671, -656, -540, -790, -976, -1577, -958, -644, -639, 67, 847, 1262, 1252, 577, -225, -213, 1211, -237, -1069, -837, -140, -81, 678, 679, 694, 958, 862, 637, 664, 911, 1066, 1140, 1231, 1421, 1522, 2354, 2377, 79, -974, -2064, -1657, 306, 1084, 1448, 1318, 1313, 1286, 1021, 1027, 767, 319, -304, -782, -705, -613, -511, -315, -237, -360, -591, -1050, -1088, -276, 467, 718, 429, -124, -785, -527, -276, -647, -1629, -2556, -3869, -2831, -944, 625, 1324, 1685, 1592, 1074, 627, 322, 337, 623, 1043, 1489, 1843, 1499, 1254, 1277, 1450, 1214, 1382, 1054, 709, 280, -92, -264, -329, -487, -402, 32, 107, 126, -82, -391, -616, -741, -823]
10924h23J19F18J087O9o69a54j379j667J225Q19a98R7o74j101j287Q82P40e37
10905c99d3C35c12B24N99R7j77c05m27a36C53M92L13n69e72j182O21L95l94K15
10885i17c61r4p2k52j25k5J72A85N38J09j54B22b71m94lb96C79K35k48mO00K52
10863A214l65B85d35a48E33N19J26l94B44G8L84K81K85K62p3k82k46B59i2E9R79
10842A038P66M60l07p29C10c57k73B69K16g8n39o29Q1d74C48O55K57j21j49j29
10822H61k91B28h0k41r5Q0j8p8J81D02N14J76m27a27j057M0d30A19K82J51l3J112
10800A631M30R24L30k70r16r83C32d52k25c16B3J3b90n56n57b70C16p5a67j73
10780c40E9O41R6A49a406o37A621L298K393J059j002k004k648a588p90R95a61
$$ y = [-823, -704, 618, 1705, 1774, 1105, -154, -1533, -3200, -1975, -1156, -198, -101, -775, -1876, -3163, -2281, -1541, -537, -399, -43, 335, -312, 224, 823, 920, 743, -305, -732, -136, 353, 845, 1158, 589, -572, -1754, -1133, -738, -1132, -917, -361, -455, -527, -779, -904, -929, -757, 185, 723, 832, 678, 222, -271, -765, -768, -296, 379, 614, 366, 362, 962, 1214, 849, 285, -435, -148, 533, 1052, 1178, 784, 244, 78, 462, 743, 1028, 1290, 1217, 935, 689, 259, -92, 59, 1038, 1804, 2264, 1957, 1228, 310, -357, -630, 269, 485, -78, -617, -1246, -1165, -474, 348, 1003, 1260, 1139, 990, 861, 570, 228, -80, -321, -416, -336, -354, -432, -251, 402, 916, 1092, 665, -127, -1184, -1144, -430, 119, 401, 552, 519, 1631, 2061, 2985, 3315, 3045, 2129, 1146, 332, -452, -677, -316, 23, 36, -290, -846, -1403, -270, 316, 241, -167, -340, 59, 700, 796, 149, -1406, -2043, 1621, 4919, 7312, 8371, 7369, 5365, 2717, -1588, -2378, -1383, -161]
10762I1a82om40q51m84J58M47B70J055P20J03O57r63p24m02k32Q0K74M2j80j40
10741E60B24h4j65m30m81o64m40j85J16J87J98J25L7j48L4K5K21O73c41F51L45
10720I96m8j96A36d62r03k21Q4O95b66C04l5p4a81lG7P41N15O54L38j72p35o62
10698G56B98p5M7FN2J98M20M78K25j11J19j75j16k91B19e87n64m06c15B00L72
10677E72K47K5l33a57p77p20PN93A7J092O21N17r9m21q16l12j43A32c8j18j12
10656b68J32c6B40E1b39Lj26a09B15p2b12j45R4L6B300R82j11e96j09J15K09A22
10633G0d29n70m85j33N7J39O3k54k018n05K010g74A84R33R00M3o62o44B15a3C
10611a30j36R2B8a20k72q09m40J23b71H93J39n14a95j80C82J054O04L3m71p33
$$ y = [91, -182, -188, -628, -1479, -1963, -1805, -1358, 270, 1325, 2045, 2148, 2805, 1842, 1118, 716, 484, 564, 838, 880, 700, 560, 224, -84, -249, -679, -1160, -1824, -2264, -2449, -2333, -2146, -1948, -1823, -1786, -1934, -1900, -1875, -1654, -981, -341, 651, 996, 948, 752, 136, -462, -1365, -1586, -1502, -807, -266, 304, 269, 195, -181, -184, 77, 818, 1333, 1987, 2325, 2153, 1418, 756, 298, 223, 270, 6, 58, 256, 676, 1154, 1379, 1268, 1387, 1212, 1096, 805, 219, -587, -1151, -1557, -315, 200, 572, 819, 844, 511, -157, -934, -1654, -1647, -1054, 17, 1109, 1730, 2247, 2148, 1727, 911, 599, 456, 132, -38, -156, -268, -136, -36, 240, 51, -239, -236, -362, -109, 215, 143, -212, -357, -263, -227, 2300, 3282, 3171, -596, -705, -590, -381, 122, 70, -429, -999, -1484, -1617, -1560, -1421, -1358, -1612, -3630, -4135, -2125, -774, 184, 1117, 2017, 2060, 1398, 754, 215, -13, 3, -130, -266, -174, 28, -120, -392, -1201, -1641, -1518, -271, 893, 1032, 518, -195, -375, 382, 1436, 2040, 2073, 1602, 869]
10591H69A81b40C18N60H0h89r95L75J71l14L33O55J63b05I43j09D00a68p95k16
10571a179J95b66E80J007J059L97l15m71j98j4J48R6k05r09m92M20Q76N54j60
10552B373o28o42C93c8l57l87a17Ib47m26R4o98mA25R63J008O81M6k89m53l32
10531A749n61n44M1P05J63m65E44B00p5B2c7m3j70j86q2n2k01l84k79j9M01c25
10508C57L13j60B36a9k7C92M25J51l00A09f98m68K68L43b4j71j99k92m9KK26a56
10485A51K20J98j02k6N10L75m48a92r30q23r81O99O15g60D21K08PA55g66j110
10465a876r33Q90J14j85j35m21L17O16L29L83J08L23D4M78L85k15H1h52r67j31
10445a950M76O88i4C88K02j11a03l77EJ147N75l11F65a35j83D80R43J02n89d17
$$ y = [869, 181, -240, 318, 878, 80, -889, -1884, -1509, -1338, -1652, -1319, -664, -501, -205, 943, 834, 400, -168, -963, -1179, -984, -266, 580, 1587, 2646, 3043, 2728, 2257, 2059, 2045, 2193, 2289, 2084, 1175, 683, 1103, 1979, 2533, 2373, 1745, 1103, 393, -38, -395, -782, -117, 9, -247, -673, -579, -1277, -1281, 125, 1088, 2096, 2777, 2823, 2534, 2081, 1749, 1188, 644, 685, 1390, 1553, 1088, 544, 200, 125, 22, -37, -80, -250, -436, -518, -570, -771, -1155, -1434, -1453, -1052, -325, 357, 670, 510, 236, -19, -46, 392, 817, 968, 668, 109, -698, -1166, -898, -555, -24, -195, -394, -686, -735, -733, -507, -156, 151, 371, 569, 467, 441, 951, 1326, 878, -192, -1122, -1945, -2926, -2227, -1612, -760, 421, 629, 636, 155, -766, -1876, -2809, -1919, -1805, -1990, -2125, -2546, -2229, -1613, -1284, -901, -793, -470, 44, 522, 907, 692, 81, -852, -1819, -1950, -1474, -786, -94, 388, 590, 479, -103, -480, 5, 1152, 1727, 1416, 665, -135, -318, 480, 1423, 1525, 936, -417]
10424a864j393a190eC46e38q91L99L17J19l22k27k81l35L62A1J083L14J172K97
10405B877a52q32j80L84L27n57p03r16q25a487D11J166k0M3m17l46j84B87i8o42
10385g40q62q51n22J441b97B62N15j13b03B47N09L45L8D14a9l02j49a14A58b05
10364a390o98k53M94f71B65O09L78J78J37J54J29J09l25n18k95O13L73j16l80
10345A311a52q06p56p03q1J70L15i99g9D16pd9l15J28M0j72n30l06j89j51J06
10324a438M83b03C15O8K1A83A4L53P06N20L09m8p6D83j68A42K38r3O1o4C9f29
10301a137n15M83j61O09C61O97R92L74l34I95c32j048l52M48d45i7j83r49o70
10282a899K57e84A82L16j02A26L4J69K90k16d07m76l30k62L21K40L13Q6O1K03
$$ y = [-1864, -3257, -1190, -5, 346, -538, -1429, -1030, -713, -594, -916, -1143, -1424, -1759, -1397, 11, 1094, 1408, 2580, 2877, -152, -984, -1164, -780, -453, -1010, -1713, -2629, -3454, -1487, 411, 1577, 1557, 1600, 1183, 837, 653, 287, -98, -740, -1602, -2453, -2975, -1534, -297, 262, 777, 664, -203, 247, 756, 1101, 1139, 414, -19, -321, -470, -114, 158, -205, -1390, -2088, -2341, -1847, -671, 265, 874, 1252, 1430, 1567, 1721, 1850, 1959, 1634, 1116, 821, 1434, 1807, 1691, 1311, -152, -958, -1714, -2417, -2498, -2328, -2013, -999, -79, 416, 409, -49, -364, -236, -196, -368, -898, -1204, -1393, -1544, -1438, -955, -203, 315, 383, 404, 183, 14, 367, 1073, 1593, 1902, 1854, 1778, 483, 315, 142, 380, 287, 348, 284, 39, -629, -1137, -1652, -1169, -1330, -721, 361, 1058, 2050, 2424, 2090, 995, -332, -1380, -1732, -1284, -445, -97, -280, -1229, -1899, -1642, -584, 182, 498, 396, 126, 160, 329, 619, 403, -407, -883, -1213, -1475, -1154, -914, -601, -515, -454, -251]
10262b51R5j88J51l3l97J99C07L53p2B19e36p75p88q76a405b95A17K49A15CP3
10241G6N13J269P76J69o28G94f21q77j10K07J23b60j5n0M0Q1p2g9C84L12K4j37
10219E83j99A21e19j121L55f04B3N66K47L51N20K90k57m77D00c33m39b55C36K25
10199E61p7A25e21n99R0D10R26o0n79c0p15Oa59E40M29j89H2i65j042l39O44a37
10176B14a36n21o32k14j04C48O61i48k358R96a052G50J070K91l32F41c2H13L71
10157A184n6l44C91I3f2C1M13p5J30J66L17K93M4j11l74A16f59o31k05K70A42
10135B88d28a65B02J51M52K81P7C86d37o91l11L14h2A016N04l55B97a199n09n89
10115b297J18O57b63I77Q14J39o26C80g99j265r82l58J602f68j62L44b10r4D98
$$ y = [-251, -156, -344, -193, -226, -623, -424, 307, 660, 588, 219, -536, -1311, -2099, -2975, -1405, -295, 117, 366, 115, 3, 76, 589, 1858, 2634, 2803, 2175, 794, -621, -1498, -1608, -1401, -1278, -260, -275, -325, -285, -204, -276, -79, 384, 696, 720, 583, 384, 121, -519, -1640, -1285, -604, 23, 589, 836, 1187, 1707, 1997, 1740, 1263, 400, -333, -772, -255, 336, 561, 484, 125, -521, -1120, -1030, 410, 1336, 1276, 697, -30, -745, -739, -159, 540, 969, 780, 82, -965, -2007, -2346, -1702, -137, 214, -136, -657, -1289, -1503, -1607, 348, 1009, -948, -3306, -2310, -1052, 750, 1820, 2111, 1779, 641, -32, 813, 1184, 1128, 784, 391, 93, -62, 31, 444, 369, 499, 665, 982, 1275, 1319, 1208, 834, 116, -659, -1290, -1495, -1225, 142, 288, -428, -165, 202, 353, 805, 1086, 1163, 386, -437, -1128, -1439, -1125, -82, 1016, 1520, 1165, 297, -1199, -1708, -2297, -2179, -1522, -263, 977, 1791, 1930, 1304, 380, -799, -2064, -3046, -3404, -1802, -668, -830, -486, -210, -304, 498]
10095A247j08C81e57j62J96m1b48j84k11n34j91p4O04c38j84o75n97N13O8M30
10075g83K94j8j041r1M32M91b0F74N46L52j73C22f44q14o60O12b21G0P1c01o28
10054i29q58q18J0Q21e25L3a22F27J289J035L59j167G50d79m89M03E42P28L53
10035A623p2l43D04g14j512r08K8J115N97qo63p99o77j84R33Q89g77A86J029R11
10015B126M14r4n74o30n28A41d76O7i1p9k50n21e0E76N77K56k26%E28b03p18L05
9993f16E81Q05L95A34f68j167p99m4e38N1J8k84B12J302N78l20q50F6e00o64j72
9972a336J74J77J86c10B99R41J311J382jk69K61I19k97G9b50E6L85K59k35A34
9951c60k38K25C32O13M57J35k55C55e57j197j544K26Q42k96P47Q76b46F9c8k58
$$ y = [1247, 1139, 381, -557, -719, -523, -564, -248, -432, -643, -1177, -1368, -1442, -838, -338, -522, -1197, -1794, -1281, -1213, -783, -489, -507, -1548, -1639, -1207, -716, -20, 674, 1220, 1572, 1399, 322, -644, -1458, -2118, -1506, -221, 70, 141, -301, -929, -1787, -2605, -2595, -1774, -525, -492, -122, 627, 1916, 2951, 3310, 2143, 750, -479, -968, -565, 542, 1270, 1623, 1551, 1208, 404, -714, -2226, -3134, -3106, -1991, -1394, -1402, -2065, -2864, -3541, -3725, -2792, -1903, -777, 186, 1215, 2126, 2540, 2446, 1872, 1242, 714, 141, -476, -409, -91, -170, -420, -941, -50, 576, 1153, 1409, 1183, 1183, 528, -203, -921, -616, 581, 1386, 1781, 134, -668, -1835, -2634, -2678, -538, -487, -469, -753, 212, 1514, 2092, 1772, 922, 66, -500, -1164, -1336, -1162, -985, -799, -310, 299, 1240, 2551, 3933, 3932, 3663, 3924, 919, 622, 79, -250, 56, 441, 700, 465, 134, -360, -598, -373, 332, 945, 1402, 1537, 1282, 355, -557, -1754, -3298, -3072, -2230, -2526, -1779, -903, -246, 69, -38, -296]
9931b96l10m79d47A91K39n1n7A5PL23K19n6a97j038L18F03J248M23o50D74c01
9909d05C1M81M90J62j06k59k17k12a2p04n56o18l02Q57l02j78N18L37Q3l95p44
9888b016r95q64l15b074g90D6L17J37N7k52j40e4k94l28k9b39C87L94m5C56a20
9866c45j20Np9r5j20p1a59D26N35K9l53h6n50n95k11n3K23l0j64o7q9k62m16o8
9842b368k59M67L25K71M55kK58k51l10n71n61K28j09M48f19H55J041J8m61n45
9822I08k63L97M23K70k45m05n40I0a39e8D62O62L63J26K5j04E96a17k05n24l48
9801a194J9M04K92a35B48K91J39k97f0IQ3bl03k93p44q98l8L53h28c2H45O55L94
9778A894P0n83E25d49r10k70m1l04j495k4Q80R38M11f19A02N79L00P5l60j78m
$$ y = [-296, -606, -1085, -447, 191, 430, 379, 322, 15, 22, 345, 564, 508, -197, -1235, -917, 603, 1851, 2274, 1624, 474, -301, -405, 31, 512, 1002, 1164, 1058, 799, 582, 370, -12, -716, -1272, -1890, -2192, -1335, -1637, -1815, -1297, -960, -877, -1272, -2016, -3011, -3875, -4190, -2074, -790, 46, 363, 500, 557, 305, 165, -54, -348, -676, -705, -239, 387, 781, 736, 356, -120, -345, -465, -460, -539, -634, -754, -825, -159, 426, 961, 990, 637, -86, -636, -1231, -1442, -1495, -1272, -1302, -1466, -1533, -1622, -1884, -2300, -2368, -2627, -2160, -1835, -1564, -1109, -1111, -853, -1104, -1414, -1985, -2546, -2318, -2427, -1979, -619, 855, 1896, 1914, 1453, 908, 645, 1042, 1465, 1735, 1490, 1085, 545, 90, -139, -58, 462, 1124, 1487, 1613, 1638, 1534, 596, -117, -322, -846, -1194, -1175, -771, -479, -135, 248, 539, 678, 381, -60, 9, 92, -2, -305, -598, -1342, -2240, -2278, -1925, -828, -32, 845, 1500, 1894, 1964, 1381, 525, -449, -1359, -1629, -1670, -1974, -3469, -3493, -2613, -1675, -1264, -619, 102, 681, 981, 1056, 696, 518, 514]
9757E14L96P9N45o83a32p87k58j02Jj24r5J43f53A00M17n1j26j53J50L82P20k1
9735A418l23m85J48R2k87c1j157j194j080J463h22A33P95O30l62D54@A95O84M65
9715A344k9o18b69l11k15o9K87b69B72J19j90Ha06B94R03L90n74C45H3C3b08n41
9693g49m77f09C54m9a09n55k03Q1J68b64B75M96K92O0J98K16L17L27k50o54b1
9671a280n41b06l5E55M79k5D55f9k53J37D31Q90P19R02J74n28A232E5a119n35
9651a654M06d61A12M01P1j27B19e3A5K39J23rJ45M73R94J116N76J99j326r33o61
9630I51N3K6J80J65o5nJ22j29j93k23l63A09R3K20N3J65P7L56O0J35k42D91B35
9606b32m09k97c89C73J57Nj49A89a79k05l08R2J9p7p90q57o21n19m5h88J12k34
$$ y = [514, 910, 989, 1534, 851, -132, -919, -1177, -1279, -1278, -1402, -1497, -1354, -653, 100, 517, 466, 340, 187, 337, 719, 1439, 1418, 1095, 610, 758, 850, 563, -31, -1188, -2382, -3462, -1999, -822, 133, 928, 1558, 1196, 454, 0, 195, 879, 1344, 1315, 697, -269, -580, -795, -864, -577, -269, 272, 391, 201, 8, -106, 294, 1197, 1587, 1013, 345, 83, 33, -208, -749, -1226, -609, 354, 305, -109, -664, -867, -786, -618, -264, 275, 771, 1063, 1123, 1321, 1537, 1854, 2181, 1931, 1277, -21, -1280, -1821, -206, -241, 555, 1034, 1009, 455, -69, -322, -185, 431, 1321, 2040, 2942, 3116, 2588, 1232, 55, -1119, -1654, -1248, -461, 112, 513, 584, 457, 219, -53, 15, 254, 377, 368, 513, 986, 1980, 3096, 3672, 3871, 2545, 1612, 951, 1004, 1030, 1210, 1375, 1310, 1305, 1427, 1298, 1105, 882, 519, 109, 202, 422, 475, 640, 717, 1073, 1133, 1268, 1026, 491, 235, -232, -641, -938, -389, 373, 530, 535, 386, 189, -179, -384, -692, -600, -581, -658, -1448, -2305, -2926, -3445, -3490, -888, -776, -1010]
9584a010P4e2C04Db60k38l91L13E45Q47J33o24A32e06E39R31M1N839J743q38M15
9563H670m0J52k83q57j510j484k096g08k01c44B49L50M6K71n4K26k87j80J24K73
9543A018O51N88L78J546l14j509A081l45j96k0K7B64A08c5m0o0j156m43j378K65
9523b847J290a67E02m1A45a71B62o3j4p3J17A01c71q01m94l35K25N94c44EK84
9502B89a97q10p59L33J96j6R2L42c53E12O75M85l79E88e44q24m63k8L73M43J83
9481h60J08p6J82L0k2Nb54j335j316k338p39p11M09M27P96J012a776Q59b8A5M53
9460D68J490K628J955K201O73n92j664k472I63B18M76O59p8j68j30l77A32B7J2
9441C9b16n02o71m58m79j40J33K94k57n36n51J158P86K3o04p13J190a38F46p5
$$ y = [-1010, -936, -52, 304, 4, -260, -498, -889, -576, 545, 1392, 1525, 901, 132, -506, 539, 1470, 1511, 7350, 9093, 8255, 8670, 8630, 8782, 8499, 7642, 6132, 4648, 2552, -708, -909, -344, 249, 599, 645, 916, 862, 1088, 801, 621, 745, 1018, 1669, 2257, 2635, 4181, 3867, 2358, 1081, 736, 540, 520, 547, 264, 108, -35, -75, -135, -1291, -1734, -3112, -2847, -1557, -167, 502, 461, 145, -171, 262, 199, 185, 112, 229, 101, -371, -1172, -1666, -2001, -1776, -1182, -344, 5, 289, -197, -1007, -1766, -1433, -1237, -1253, -1161, -819, -353, 512, 1187, 1672, 1293, 588, -544, -1368, -1831, -1859, -1486, -1043, -860, -752, -828, -646, -616, -638, -633, -254, -1589, -2905, -5243, -5982, -6693, -6284, -5857, -5061, -4049, -1776, -917, -28, 15, 468, 1958, 4586, 6541, 8742, 9415, 8823, 7159, 4687, 963, 218, 694, 1353, 1275, 1107, 977, 600, 132, 27, 39, -216, -718, -1389, -1847, -2326, -2466, -2333, -2039, -2296, -2832, -3383, -2225, -1439, -1416, -2020, -2733, -1543, -138, 646, 571]
9421E71J047p76C18c6n52p68l35b57I88a6785A995N59p54E7c22a15F30J03C42
9401b88l36K71B62N85M6k23b83p42r95n88N29N91e91A25R9b50p53J59L52J96Q9
9380b07Ia25A38L49O51L40K381L3A045D29j13L16O50K75J30N4l42k90m17B71d32
9358b55k0J36A54K65J91K21N9j24j48A19g37q76n15N7N21O32a85D69L80J2C76
9336d51l98L66D77R68Q45P84q92k22c02j89R0f6K7l32c6F05j17B44b42l74b12
9314B86I2d24m67b53A123M90m57n46K36N84n6o31E2e50k58C24M58p0l42b7l75
9293d02m7E4L8e6m24n10o11K20e23j03q07k35a47A234J428P15J709j098j947F29
9272D1b19g1D99M99K76N45M97m49n48o10d5l60J6J60P3F12J19B91a25D67M18O46
$$ y = [571, 1618, 842, 318, -36, -588, -1356, -1691, -257, 988, -16785, 1995, 2554, 1800, 57, -322, -115, 630, 733, 342, -288, -624, -353, 262, 847, 893, 670, -283, -1025, -2020, -2608, -2079, -1488, -591, 125, 224, -250, -1003, -844, -492, -296, -207, 9, -125, 138, 487, 1138, 1478, 3859, 3892, 1045, 429, 316, 632, 1282, 1557, 1687, 1741, 1399, 1109, 692, 271, -432, -255, -275, -139, 154, 419, 610, 831, 890, 766, 618, 119, -737, -1613, -2128, -2071, -1550, -918, -185, 469, 849, 861, 376, -451, -849, -483, 477, 1445, 2290, 3074, 2182, 1960, -302, -491, -401, -66, -39, -371, -36, 605, 488, 244, -242, -616, -212, 286, 92, -424, -891, -253, 1123, 1613, 1156, 610, 846, 1430, 1374, 743, 52, -550, -808, 324, 782, 712, 370, -27, -402, -449, 54, 92, -56, -480, -990, -1601, -1381, -523, -626, -1433, -1668, -147, 1234, 2662, 3377, 5086, 3988, 2041, 629, 41, -219, -71, 499, 998, 1274, 1819, 2316, 1867, 1319, 709, -45, -405, -389, -229, -156, 612, 731, 291, -125, 467, 885, 1531]
9250A531J411P90j13j288A075b29q92j58L21a41E84N28E53j52a40p57o91m39P5
9231a952O60e22e6j40B35Q8M4D6e31j64K7Q4j70j7K31d6B71i7m51r6k80Q0J65
9208f79a32E15O65Jl69k76B59J97i4o81k94D74j02A50a77g1B19J62K95K77K52
9187A205n9n63a7p51r68Q7e44D56M32L23K13J55l75E45b55o89A48J330Q64J915
9167D257j974j053C01b11m4n7l41n90j91L56J23k9L35J66j86m49m29k7f09B54
9146I04N2k28B87D0b60l02l78l00J35N13a21A68P5A1g0r4l4O6F78K35k71E6b98
9122c87h4B44K77J33B43G6d12a62H0O1b57p28O0L53g1E04L38R4P5k75l25a4m33
9099d47o88o20o26L43Q14d79d9j8k78o84O7K47K41K19j80m85m89l23C5J532R46
$$ y = [1531, 2942, 3732, 3619, 2331, 1075, -229, -1121, -1279, -958, -141, 584, 1112, 553, 401, -140, -897, -1588, -2027, -1952, -1292, -522, -56, -196, 235, 323, 367, 46, -531, -695, -668, -584, -754, -771, -540, -46, 271, -97, -548, -644, -924, -844, -679, -132, 515, 1180, 1181, 812, 536, 259, 456, -94, -775, -1069, 474, 372, 150, -177, -71, 219, 381, 676, 953, 1205, 1146, 583, -17, -768, -1736, -1649, -544, 456, 888, 1211, 1424, 1579, 1204, 545, -255, -944, 148, 1478, 2342, 4257, 2283, 1230, 301, -211, -255, -312, -653, -1243, -1434, -1078, -955, -984, -649, -483, -669, -1118, -1547, -1574, -609, 254, 904, 956, 728, 287, 40, -260, -562, -940, -1240, -1105, -592, -121, 168, 243, 11, -70, -164, -198, -132, 678, 913, 642, 56, -298, -387, -84, 244, 521, 654, 243, 76, -412, -162, 80, 141, -257, -985, -925, -572, -71, 504, 842, 936, 1011, 736, 411, -14, -447, -1135, -1755, -2381, -2038, -1224, -479, -49, -67, -345, -1029, -962, -715, -474, -255, -435, -920, -1409, -1732, 35, 1567, 2513]
9078B513N94p82q12D92f96q11j04N92C25M58J96j99l50c37k41k35l27m71l75J60
9058a826L54L79K9n6e23B5M42P6b86p49M4A849J647J358j030A065b26n60L07D96
9037A282L69D5e96p37r30o28J89Q67R15H4Q44L75r5k4j19B17h70p32j245KJ22
9016b723n0J35R93g31e1B42qC3c45C45A67e20q60o25O2O06e50a74j74j58j27c1
8993D57O86N68J88j94J44L5l03p64d8j008l27a35A091Q20J055A114g4p90m04l
8973a271K14J04j2l32m39k82m36k55M66R86a91b6C28Q49j00B06h32k17C54O58
8953A012L20j28n32C08D3b17n73m87L06D29J462J640R25l40q69j006o85p21A45
8933b47N1B69M95Q17M29k28H58B35D6c04j79A06O64O00L83j53m29m19E2d58a13
$$ y = [2513, 3107, 2325, 1513, 492, -696, -1507, -1611, -1019, 325, 783, 979, 780, 430, -337, -578, -813, -1140, -1611, -1986, -1826, -1472, -1093, -1064, -1120, -523, 25, 467, 543, -286, -1035, -991, 1849, 3496, 4854, 3824, 1065, -226, -786, -479, 496, 1282, 1651, 45, -596, -1333, -2263, -2891, -2702, -1835, -920, 84, 928, 1303, 1208, 1184, 1065, 217, -870, -1602, -2847, -2845, -2723, -2773, -2638, -1645, -731, -51, 242, 234, 33, -345, 345, 167, -520, -1380, -2005, -1943, -1337, -550, -174, -348, -506, -633, -31, 457, 1143, 1711, 1899, 1705, 1849, 1884, 1581, 817, -48, -1056, -1383, -135, 1091, 1911, 2966, 1114, -74, -864, -1268, -1271, -1057, -953, -965, -1297, -1736, -2018, -2454, -2709, -2243, -1257, -191, -26, 328, 1177, 1077, 206, -832, -1049, 354, 1012, 1332, 1204, 672, 308, 43, -217, -790, -1277, -971, 429, 1891, 3531, 4456, 4116, 3247, 2241, 1556, 835, 145, -247, -196, 269, 764, 1581, 2010, 1782, 858, 235, 46, -304, -483, 106, 770, 1370, 1753, 1600, 1171, 752, 52, -458, -113]
8911A63M66N23M34M26m6n11F32I2R01J228J038J431k78j510A103m03J7J9B38i56
8890a429N64eG00O51N33J32m84o87C21I2J56F3c90m32A07R85N88J2n51C86f69
8868a215q9N53C30R03L28j09k22m46j44k36b86e1C19L94K19K53J76j61j34k76
8848G90B85c12r75j60k41o11J43N60O48c91J63R1k32I0Q14O63M65J90k90l82n19
8827A031k60r8mj60B38d22p67q28P7e13A49J4b46l90b51B54N88P4k82l06b69l64
8805f33j36J45b29a12J0C3M03N44L36M74J4n39D37b17k89B01N56O07k06n9K12
8784A311N08M38J15j12l84n40j75J84K08J36k40m61l77J47O00k39D8a276j254
8765b530N96i46c42h2l00o54j447k61N22N86J44f80j126Q7L1A77P64J140N26P18
$$ y = [163, 629, 1152, 1586, 2012, 1966, 1455, 632, 92, 993, 2221, 3259, 4690, 4412, 2902, 1103, 700, 717, 736, 238, -956, -1429, -865, -5, 700, 1351, 1884, 2016, 1532, 845, 321, 92, 248, 63, -390, -822, 107, 1092, 1680, 1692, 1141, 386, -669, -1215, -1304, -751, 330, 1233, 1561, 1452, 1230, 784, 640, 404, -286, -51, 319, 713, 932, 1185, 1361, 1200, 1066, 790, 285, -312, -1287, -1447, -1688, -2299, -2156, -1596, -948, -391, -228, -137, -369, 90, 904, 1567, 2032, 2222, 1932, 1550, 1031, 771, 673, 669, 509, 238, -422, -1189, -2017, -1940, -513, 149, 163, -246, -636, -251, 254, 842, 916, 634, 328, -269, -633, -769, -624, -229, -112, -102, 33, 436, 980, 1316, 1790, 1804, 1265, 437, -217, -506, 201, 757, 1364, 1158, 1099, 1311, 1819, 2257, 2372, 2260, 1876, 1336, 1161, 1345, 1553, 1689, 1449, 988, 611, 758, 1358, 1119, 48, -1276, -2530, -1934, -946, -342, -82, -382, -1036, -2483, -2744, -2222, -1636, -1492, -680, -1806, -1719, -1688, 177, 941, 2081, 2607, 3325]
8745C325m1j148p41k03k48M30r1E03g69l45a09E6J2d32m00F21K365J170A671m08
8725A263g74j08A328e94o766a03D627J608P29l477A725D57a762n291n326L186
8709i193L65K508e98p0A330J07K25l40E11c90j133j215O03Q96Ab074k59j024J076
8690b281L02n57J59h41E42P30M83o0l47o42c6j120m43K77O01F3Q72L39n35c4l22
8669c56O5a4B84j09f1m8Mj211j632j359l440n09N43K422j063K670J293i30C31
8649F15J56j3m9K52K96J9l16m73a67q80n22k80K49N23L58K42K13J26Qp04p20n02
8627b056h50c8E95J54A14K22l8A29a31l13j58p7P5A13L91P1a92n37r6K90j65m15
8605a115n30k94m00O1N26N92J87j21l20K2K16M31K25A6L77o1A09h9l80j99Q6b89
$$ y = [3325, 3284, 2136, 1395, 1192, 944, 1374, 1283, 503, -769, -1114, -109, 56, 68, -432, -832, 621, 2986, 4156, 1671, 1263, -774, -882, 1328, -594, -7360, -103, 4627, 6235, 6964, 3487, 1725, 457, -1762, -7053, -12379, -9193, -8828, -6320, -598, -668, 1330, 1437, 1662, 1322, 511, -390, -1523, -2738, -2135, -1239, 1, -2074, -2333, -3357, -2281, -1979, -2536, -2377, -841, 542, 1272, 1755, 1695, 1348, 706, -36, -1156, -1599, -1322, -721, 63, 935, 1274, 739, -34, -356, -291, -14, 284, 175, -61, -109, -105, -1316, -2948, -4307, -7747, -8256, -7713, -5291, -6354, -3684, -2391, -930, 331, 615, 771, 758, 709, 961, 1257, 1276, 960, 487, -167, -1047, -1569, -1849, -1600, -1077, -719, -477, -264, -138, -130, -834, -1554, -2056, -850, -38, 595, 749, 114, 336, 298, 129, -131, -444, -602, -679, -604, 113, 504, 575, -192, -729, -825, -535, -700, -1115, -1645, -1939, -2339, -2278, -1752, -1160, -973, -1094, -1414, -1392, -1176, -745, -520, 16, 393, 332, 109, -89, -469, -668, -582, -289]
8582A6K05L64L22L23L9j33J021M16j041n19j30l05b78p34m09e87QR2p14K65L84
8561e52A35O54N12J63m26J51n15h2p48M12G03O90M13j70o80g7p90o42K41L69L10
8540e89C17R66L53m39E41b65p63l83m00o6Q9P63b0I52Q06P46P6p27o88n25k11
8519D29n1K36O87L52j70n42B92d32n91m06j12K38N62e3F42oB71I9J26J35J188
8498A548j65o2D13f69j811n15a466d13f1j15m16n03L15q2k81k11d92B16O09kl59
8477D64b67o84l84c20C93K72k16A42E4a97l76o39o33j26N72L73K88J50N1c6a4
8455b93o30K71m77L20b8F53N54m94k93a2A41N18B97f76j168j726j418k32c44C15
8434B12f79j465j535J722b02A70e72j147J74G94J318L91k48L502J371K123J289
$$ y = [16, 221, 585, 907, 1230, 1269, 1136, 2157, 2573, 1532, 1013, 883, 578, -278, -1012, -1421, -587, -579, -487, -1201, -936, -552, 135, 789, 1301, 1464, 1038, 1189, 674, -82, -830, -418, 703, 1393, 1806, 1636, 956, -77, -867, -1509, -1268, -899, -589, 317, 1283, 1636, 1197, 541, -265, -1028, -1411, -1811, -1877, -1788, -1025, -20, 952, 1758, 2504, 2580, 1853, 1165, 640, 429, 378, 614, 1301, 1653, 1483, 941, 292, -432, -1023, -1429, -1541, -1303, -741, -53, 642, 636, 271, 99, 225, 360, 1548, 1383, 1321, 413, -669, -2480, -2995, -1466, -413, -61, -176, -592, -1095, -780, -862, -1143, -1354, -492, 216, 825, 823, 464, -267, -951, -1335, -320, 393, 665, 449, 142, 54, -197, -573, -1212, -1845, -1971, -1399, -1026, -738, -588, -537, -36, -14, -293, -923, -652, -1129, -809, -28, 653, 1207, 713, 420, -12, 141, 659, 297, -676, -1844, -3570, -4988, -5220, -344, 315, 212, -679, -2144, -3679, -1957, -202, 170, -572, -1719, -1545, 794, 2112, 2503, 2255, 5757, 7128, 9251, 10540]
8417A0540J230J200K418L934M469L194J32k980o631o216l414M756n19D918N185
8402A0103K677j018k605k341k316B065b844k073K27K197A203Q66n55g34a94A194
8385A794m87e5j093b45A955J150j02k05o95q16a753L07k19m26K2M84b26E89Q0
8366F69k31Bd68n63m54j92M91e06a4j08m72m13o10j11N8J01rA29Q57O72l69D89
8343f27j007j352j378J381P68e21F08P55O2E29d74m77k67K92K26c47K1k99l42
8324i67M18E28R15K96l15r6J91M66L4k69m74l32D31a78o21m26M10f1B57r8a05
8302e46k03J69J40o06j071j753L56L88j80J365P89g4H15j29A75d85m57n79L21
8283a200e52J46k25l09k27j01J13J01K30K66J79M8J01j11K8R9B37L95RB59f3F
$$ y = [10540, 11770, 12970, 15388, 19322, 23791, 26985, 27117, 24137, 17506, 11290, 7876, 12632, 12113, 4918, 10103, 12780, 11762, 9157, 6816, 4500, 2065, -2844, -4917, -4690, -2493, 1203, 2069, 1514, -734, -194, 1194, 1794, 1307, -55, -1148, -245, 1955, 3105, 3003, 2798, 2103, 1287, -1753, -1446, -1665, -2091, -2069, -1585, -226, 589, 669, 438, 2, -468, -1031, -1485, -1677, -1186, -506, -14, -122, -594, -1007, -1617, -1728, -1670, -1569, -1578, 129, 986, 1658, 1289, 489, -627, -1634, -2986, -4364, -2983, -2215, -521, 608, 1363, 1425, 529, -474, -951, -1218, -926, -700, -347, -326, -625, -967, -549, 528, 1443, 1739, 1424, 1328, 1519, 1985, 2019, 1750, 1276, 944, 431, -178, -799, -1225, -815, -61, 257, 159, -105, -546, -749, -580, -440, -1046, -2117, -3870, -3514, -3126, -3306, -1941, -1152, -74, 815, 686, 175, -485, -942, -1521, -1200, -552, -406, -631, -940, -1167, -1268, -1155, -1054, -824, -558, -379, -331, -230, -341, -313, -214, 237, 632, 641, 259, -63, 6]
8260E52M12N58N21L41N42M12O21M4k06r76j213p49C87j10b15r40j599k953j798
8241g505P41L076J006P44J68j6N7J04J75J57l19n09P84b16I91R09O22K01m72o21
8221A630G54b71r45k73L18k26e27K04f2F0K20R6M74N02j14n29a31n12o13L38k0
8200i38K60j52L58K8N9k8j05j12K34g6D97Q14N59N43j72q90B44F8O89J94B99e92
8177a625n3Q25d17j92l34N5D10J019M35k63k88m78A25f07J39G21N58M0r5m93A1
8155e4B55N05Q07L80k38m62D95b19q30l14j95Q8L28L17b66e5A50a0q26j072p72
8134b680M2J28N27M83K89L1k28l07j41j1M1k70l69J036J19M31l70p76o33k38M17
8113b479N42P26e66o1m04m45j75L27d22G95O00M4m26j68k19l7M9j64R5O96J83
$$ y = [552, 964, 1522, 2043, 2384, 2926, 3338, 3959, 4003, 3797, 2821, 1608, 859, 387, 277, -215, -1155, -2754, -5707, -7505, -6764, -3688, -2682, -1938, -1770, -1786, -1729, -1625, -1450, -1293, -1612, -2121, -1337, -216, 991, 1900, 2522, 2723, 2251, 1630, 754, -271, -1216, -1489, -1171, -1397, -527, -323, -62, 60, 280, 376, 850, 1352, 1238, 709, -131, -643, -1256, -918, -938, -678, -830, -472, -444, -385, -413, -518, -630, -396, -76, 497, 1311, 1870, 2413, 2241, 1351, 244, 68, 757, 951, 299, -592, -1625, -1678, -853, -417, -609, -943, -888, 410, 1429, 1864, 1601, 1313, 835, 125, -607, -468, 721, 1279, 1319, 1224, 731, 11, -54, 255, 760, 1567, 1947, 1709, 1247, 495, -219, -1049, -1363, -1558, -1470, -1142, -825, -266, -55, 150, -10, -836, -1908, -2680, -2638, -2510, -1983, -1500, -1211, -1180, -1408, -1715, -1856, -1867, -1826, -2096, -2465, -1429, -1310, -879, -1249, -2025, -2658, -2896, -2479, -1937, -1211, -566, -627, -1031, -1476, -1651, -1324, -422, 795, 1395, 1439, 1013, 845, 626, 589, 638, 474, 569, 1265, 1448]
8092A448j60R0l98k38J06K53m69i3l40m04J25a6E06L71j81a56q71L71D90Q06O9
8071A365o03E6g8E07M22J83l63B93j9jP0A49J29N50K01J76k36k14l1j0J7C09a28
8047f17j79Q2b03E78M74C0g82n05l01J81M03c71f2A31a21n32p37q48p57O12J154
8026a229b05A05J80j36J15R1N01M13K09J78j82l76m73f4q01k9E47J098L77m33
8006A589o92C6d80k95b17C99I9e61j609L9P92E57J496K02A125d52j126N94C20
7986C78b02p78q32n83n35O56f88A135J738Q86P0j072j084l26J077J085p8o88A240
7966A8a408q66K30i54B52R42K72Rk57d49j112N12A372J439J212P51M17ql33q91
7946C959j488r71c79n28K48j55E32d73r65o22j14M14P23J44M8l76k38j91k45m852
$$ y = [1448, 1288, 1378, 980, 742, 848, 1101, 632, -93, -433, -837, -712, -16, 506, 877, 696, -156, -1027, -656, 490, 1296, 1365, 762, 56, -78, 507, 929, 1112, 749, 293, 274, 273, 343, 149, 278, 828, 1029, 1205, 969, 755, 724, 714, 731, 309, -128, -617, -796, -714, -203, 578, 1052, 30, -782, -1287, -1588, -1407, -1004, -371, -62, 131, -121, -653, -1390, -2238, -2995, -2383, -1229, -205, 105, 285, 149, 264, 355, 856, 1269, 1478, 1656, 1474, 1098, 625, -64, -865, -894, 547, 1645, 2022, 1589, 897, 36, -480, -775, -217, 399, 99, -561, -2170, -2131, -1339, 557, 2053, 2255, 1125, -452, -1578, -984, 320, 378, -202, -980, -1812, -2395, -2930, -2274, -688, 1135, 2873, 3759, 3829, 2757, 1673, 1347, 2424, 3509, 3431, 2743, 1240, 18, -1408, -2274, -2044, -954, 252, 1194, 1466, 1475, 1218, -449, -1561, -1049, 1372, 2811, 4023, 4774, 5191, 5183, 4850, 3959, 2471, 1500, -379, -907, -659, -814, 532, -473, -1438, -2060, -2174, -1760, -1037, -893, -845, -1221, -1459, -1650, -1895, -6747]
7926f747O74K06J005N76J541K22J178K67j36K19J85e5p4G3L4E1c93J58D88Q65
7906A353L89K1k87m84D48b50j048o6K50K0r2J83d80A07P96P09J132j55j64l42
7886B083m12p94i6r79m89J42M50K02K54b06D41p7b53n86R9J88J02a35D6J380J549
7865B975N16l08r70j082C42a254k358O44j67E39P58Pp0o5o8K84k50B99K33K30
7845G62J1k85I2g45D59N47N0C14d58M9A08J99d57k15k44d31A9c19o55m51j144
7824b569p07j872K355d32I86k90j27M40J05N8E54g35j167e23A808N06q5j46L75
7805B458P36Q67O0q20A276m91M4O03R78J220O87j39A969C26f83q64p84j79L05
7786b205L74O81j63M45l58o35g71A341r5l57B95a572J33j133L58i44D49c02k188
$$ y = [-6747, -6073, -5867, -4862, -4286, -2745, -2523, -1345, -1078, -1214, -995, -810, -55, -129, 73, 107, 51, -393, -235, 488, 1353, 1742, 1763, 1476, 992, 448, -250, -1298, -1364, -1114, -1094, -1186, -1003, -480, 107, 903, 1612, 2744, 2589, 2425, 2083, 1671, 877, -96, -1075, -1564, -1422, -972, -770, -516, -206, 441, 364, -253, -839, -740, -552, -450, -135, 46, 1426, 2975, 3491, 3183, 2213, 1131, 342, -1254, -3612, -2968, -3135, 539, 1297, 1304, 1234, 1169, 1101, 1385, 1135, 299, 532, 762, 773, 488, 92, -745, 459, 1006, 1056, 314, -458, -409, 108, 307, -457, -672, -916, -431, 19, -319, -974, -1425, -2569, -3276, -5148, -2793, -432, 986, 696, 569, 1009, 1114, 1172, 554, -735, -1902, -523, 1808, 2314, 2229, 2083, 2458, 3194, 4061, 4121, 3301, 1276, 785, 829, 1432, 2410, 3630, 4317, 4178, 1969, 326, -683, -1547, -2331, -2510, -2205, -1831, -1150, -1313, -868, -1226, -1861, -771, 1341, 1246, 889, 295, -1572, -1439, -2572, -2214, -944, 449, -302, -2490]
7767b490j528M27l08J12L63J238Q99l97M7l51L81K73j407O14f06l2n36r4J24J91
7747i53d76j7k98L37a76j0j69j86j8K04i9G6d25KJ35l29m2b24E88L25p2A65g67
7723a567j144L14J133K08J13q47n26J79h91A07M10L25J47j26J01K4j43A43g83
7703a996j324J555L15e56B20M40oa09p26j050j303n47R37a070A0K31j5b81n63
7684h44l30e08k85l79b07C343K610N769L634J374q13o339A556a454l556B251J682
7667C933L185l143A000K11k20n8k12A96M16R84L64l51l18M57L89p06n43j74C44
7647F60M22r1k88k4K39D17b06q58J73C62J365J93m43F73A21h97n27J65M41a51
7626F75r8h0q05q15f11E84L38L09l9m71e0n87q88L85c83B69N38K91n10a27o78
$$ y = [-2490, -4018, -3591, -3899, -3787, -3424, -2186, -1287, -1684, -1637, -1988, -1607, -1334, -2741, -2127, -606, -638, -1174, -1268, -1144, -953, -476, -493, -791, -454, -176, -186, -355, -541, -559, -355, -99, 76, -425, -423, -288, -617, -659, -224, 588, 913, 841, 165, -767, -1567, -2711, -2397, -1264, -1056, -943, -1790, -2316, -2137, -891, 107, 517, 842, 989, 863, 964, 988, 845, 143, -783, -1996, -3320, -1765, -1450, -556, 220, 660, 654, -109, -835, -1885, -3188, -3735, -2798, -1070, 10, 241, 226, -281, -844, -1174, -508, -793, -1172, -207, 3343, 5953, 11722, 15356, 16730, 15917, 9578, 1556, -1454, -5010, 2251, 3933, 7118, 3975, 1000, 1211, 991, 933, 721, 196, 612, 1596, 1960, 1609, 1291, 1748, 2137, 1431, 888, 714, 344, 660, 1082, 991, 703, 679, 918, 417, -206, -1064, -891, 362, 1727, 1920, 1477, 673, 121, -897, -1424, -1259, -818, -151, 675, 577, -80, -885, -1700, -611, 584, 922, 1231, 1192, 721, -50, -637, -1525, -1140, -383, 269, 807, 1098, 588, -127, -805]
7605h05m85o85K95O18c29E74J001K07p17hj635q77J5K54J125l03g14A32O17L08
7585A057J37m91d3q35o41j175j362l36K046Q87a37A094n1m78d28p22n39l00L73
7566a616J87d82E17j78b46k37j21A82J217J385J214J260k55j487j675I01B38I8
7547B72A13g18m22j62k24m20k91l3N90M1K99n6j77M0k2k69l36k67j01K63M52K96
7525a517N85A30J023K20o51a97j205K84c24H1M46J20K36L68J2k16Q9L3M02L98
7505A969J13L30j61j24n59ML04N54l2m66p35m82l02Dc51l49j16n9J9q5J72o4L39
7482d94EL64L34RL79J02K26J26j44o44b84r97k90P72C77J337Q16N9q90B41a181
7460b329O41f58K92Rm63n26p25k82l16N53L4L89l88h81E33Q88J54j78j78K66M71
$$ y = [-805, -1290, -1975, -1680, -1062, -329, 574, 1575, 1782, 1065, -8, -1643, -2520, -2505, -2251, -1126, -1429, -714, 132, 749, 1057, 1194, 703, -43, -878, -1519, -2694, -4056, -4392, -2346, -1459, -137, 1094, 1043, 565, -428, -1150, -1689, -1989, -1616, -1429, -482, 517, 339, -246, -483, -604, 182, 1399, 2784, 3998, 5258, 5003, 3516, 1841, 901, 238, 98, 272, 113, -718, -1140, -1302, -1526, -1946, -2237, -2270, -1680, -1639, -1340, -1396, -1573, -1533, -1555, -1824, -2160, -2427, -2528, -2265, -1813, -1517, -932, 130, 1153, 1373, 722, -197, -1402, -1118, -324, 81, 527, 647, 883, 1251, 1263, 1047, 1136, 1169, 1571, 1969, 2082, 2412, 2251, 2127, 1568, 1572, 1876, 2430, 2398, 1932, 1197, 715, 413, 4, -351, -700, -816, -875, -856, -941, -769, -833, -494, 5, 369, 703, 712, 1091, 1193, 1419, 1545, 1401, 757, -284, -1281, -1571, -799, 377, 1714, 2530, 2589, 1699, 241, -1181, -2329, -1688, -658, -366, -357, -820, -1346, -2071, -2353, -2669, -2116, -2082, -1693, -2081, -881, 533, 1421, 1575, 1397, 1219, 1485, 1956]
7439A956K80l6n28G99E0a20A5a64k93j40C24J297J632K084l25j988a13k021j749
7420c883J268i66F77A90a024m50p08p43j47a532A37J128J121N22J781J432K6j144
7402E003K79j191a070q57l11N52f41p4l38j9L78A94q0a393j113N15Q34b34A399
7382A664P03k58o05L660k255a595j189J109A236J416J322N2P84L98l27B197A14
7364f45a10G32R04J177m1n95n02j23J180L303M751K094j491E426b066A158O332
7347G490K320J165j008M313M467N982j852r913c491j0421d307j882B0145K4887
7333D5032K1016J3727j0240k6418Q2567R8333J01431J08054P3532N015n2064r3847
7321C66138j15687j04936F9196l1017j912j0525p989J2050K107L959A6811d029
$$ y = [1956, 2236, 2200, 1672, 799, 50, -120, 15, -164, -457, -597, 324, 1621, 3253, 5337, 5012, 3024, -113, -2134, -3883, -2615, -966, 677, 190, -1024, -1474, -2182, -2925, -3072, -1532, 137, 1265, 2386, 2908, 4689, 6121, 6147, 5003, 5282, 4091, -1070, -1927, -2238, -1686, -641, -715, -1053, -1072, -694, 194, 114, -1393, -2506, -1991, -1157, -234, 1399, 1664, 2367, 2109, 1504, 5164, 2909, -1595, -2784, -1675, 1236, 2652, 3974, 4026, 4810, 5208, 4881, 2197, 114, -645, -110, 732, 1636, 2813, 2772, 2177, 1675, 1552, 2732, 6035, 10786, 12880, 11389, 5426, -2066, 1158, 7490, 9810, 10975, 9967, 14280, 18747, 24729, 22877, 12964, -3491, -13912, -4307, -6189, 20145, 45032, 66048, 79775, 69535, 43117, 125684, 224017, 325448, 433502, 507034, 512049, 459985, 366138, 250451, 145515, 69196, 38179, 36267, 25742, 17753, 29803, 31910, 35869, 16811, -4029]
7308a897P50B283L748O38r19A530B34h75r08k629j27H27L529N11J3J738n03j586
7290D529j69R7k177n00L037K977L07k099B742g44k967N64p542c858B095J639j194
7273B540D07f89m30n94K61f75A969J793J45J349M9N66j445n90r65G41c271j29
7255c400p44j488j58L84n12K567J430Q01D22L663J302L025j83k933k318a064j505
7238b569o094j659p899o757i119J2n783l425O276c204C952P689Q580P289K004
7223B9514L422N142k252j113o621j2579j586c193P51A534J009p2A38J742K6650
7208B8530B479J8404J5904O124j7863p411Q13J201K3564J3667l312r878L505R261
7194E6458Q3223J47477J97912K29665K43345J97233J42994N6987l7020j16759
$$ y = [-1897, -1147, 2283, 6031, 6669, 5750, 1530, 234, -875, -1783, -4412, -4539, 827, 4356, 4867, 4880, 6618, 6115, 4529, 4360, 4457, 2280, 1780, 4817, 7794, 8101, 6002, 2742, -744, -3711, -3147, -10689, -3858, 2095, 3734, 2540, 407, -689, -1119, -1713, -1452, -675, 1969, 3762, 3907, 5256, 5305, 5871, 4426, 3836, 2871, 741, -3271, -3400, -4144, -5632, -5790, -5406, -5918, -3351, -1921, -1120, 422, 4085, 5387, 8412, 8229, 5296, 2978, -1064, -2569, -8663, -10322, -18221, -24978, -9119, -9107, -14890, -18315, -12039, -3204, 3952, 11641, 20221, 27510, 29514, 32936, 38078, 35826, 34713, 28092, 15513, 13927, -3193, -2442, 1534, 2543, 2471, 138, 1880, 28530, 2479, 20883, 36787, 42911, 25048, 17637, 18450, 19651, 43215, 56882, 53570, 43692, 47197, 56458, 139681, 287158, 485070, 714735, 958080, 1155313, 1298307, 1355294, 1318274, 1201515]
7184A201515j86598k20348k29062k11962j68970G7948j7182J8483K885p208j1203
7173F3723J229j5440A5406A651g946q605p090d608J313m654j397K780A351d414
7158a5628e770d44G914M833k558Q844l708E543G09c181l721k313J228L973F08
7142E141J574P23L62l843K05M58n63b05A708O35l0q7A020b99F9a015D2b9q57m59
7122a345q65j945m85J84a868K24F73O95L11h33l019j147N81a251q87A953l54L458
7104E057L853l166j947L58j209j87i42j749l10a347B263K229J776j023j566A557
7087e59p80J89k174R07L18A309P04j4N48J299K65J553j9q85k146B27c092j940
7069e032A82N648J863M6k133j464J770R905n023k383l659h74k913j518e96G843
$$ y = [1201515, 1014917, 794569, 565507, 353545, 184575, 77948, 60766, 79249, 82134, 74926, 63723, 64952, 49512, 15406, 1651, -7946, -16551, -23641, -4608, -3295, -7949, -9346, -6566, 1351, -4414, -15628, -5770, -444, 7914, 12747, 10189, 19033, 15325, 5543, 709, -3181, -6902, -9215, -7987, -4014, 608, 5141, 6715, 7438, 7800, 3957, 4162, 4620, 4057, -205, 1708, 2343, 2313, 2226, 1020, -299, 69, -1015, 42, -29, -886, -1345, -2210, -4155, -4640, -4456, -1868, -1644, 673, 1368, 1679, -833, -3852, -4999, -4418, -1251, -2138, 1953, 1599, 5057, 8910, 5744, 3797, 4155, 2946, 2759, -942, -2691, -3001, -1347, 2263, 4492, 6268, 5245, 3679, 1557, -559, -1339, -1150, -3324, -2417, -2099, 1309, 2013, 1999, 2547, 3846, 4111, 5664, 5645, 4760, 2614, 227, -3092, -5032, 182, 5830, 7693, 7739, 5606, 4142, 5912, 15817, 10794, 8411, 4752, -874, -3787, -5305, -596, 7843]
7052B1072J5281J5898L8287P4073J20928P7629J02576L8267j0109p4540q1468
7041C37894j06168r7388E8433B2469A720Q555J0229K896H539J2204n07b283I24
7027B752J0775k196O74m12B141b033n09P4J093A876K759J421j413k73J193m33
7011E130j695j308D76a768P41A335o4O66R29n36F1a040k610J156k25H95K072l01
6993B666B46a723G89J028L018R62j652r67M08o19l0l20n46H98K84a076k245O74
6975b647J014O94l66o5p30d19A474J307l89o48B43Q48a676P21L02I68A79e21j09
6956f30m42A46a89F92J023H39O05J32N81r37l73B62h2p20q15L57j69O5k59J14
6936a509J16d83A176J113j19I27j48a05q47R0c57D60M09k68k94K69L69M69L71
$$ y = [21072, 36353, 52251, 90538, 164611, 285539, 363168, 465744, 504011, 493902, 419362, 337894, 231726, 134338, 58433, 22469, 1720, 10275, 20504, 23400, 8539, 20743, 20236, -2283, 924, 2752, 13527, 11331, 12005, 11593, 2141, -2033, -2542, -2468, -1375, 1876, 4635, 6056, 4643, 4370, 5563, 5130, 3435, 2127, 476, -1768, -1027, 1335, 1271, 1937, 2866, 2330, 61, -1040, -3650, -2494, -2719, 895, 2967, 2666, 246, -1723, 789, 1817, 4835, 5797, 4145, 3178, 3586, 2967, 2937, 2617, 2071, 898, 1182, -1076, -3321, -2647, -1633, -939, -1305, -1370, -2100, -419, 1474, 2781, 2392, 1744, 243, 1091, -1676, -955, -653, 968, 179, -521, -630, -1072, 146, -189, 692, 1715, 839, 1444, 1576, 2157, 1220, 847, 262, -82, -802, -1617, -1260, -1429, -1364, -1623, -1509, -1393, -483, 1176, 2289, 2170, 927, 779, -105, -952, -862, -357, 460, 869, 601, 307, 576, 945, 1414, 1785]
6917A785j12m34k98H4a39j39m4M5j03a74p6k68n80j12e87K62A24K86O1O3J61j11
6895E84I0e67m53j98K41j10L66J65b03C0L40J8j26b01n45j05L45C62R78P33L57
6874B430j8J77L12M28P94p43F48e96n75n08m64J9L29Q49I1P35M97k93D91k13j9
6853B59g96K63k34K68C18J89j88d12q67l19a44A200M22j22n82Eg39k35L33K95
6833c46f4A46R6H8a91r4E85N33l19A48n9b15q96q44r51Q15d6F79k60e14p98L70
6811i42A11N26K15K38q6k33N3L85N62K60j17j95p31j5l16M6J08j23k73D9i43j183
6789b126j165q45O4J139J317P96b94F02J005J051R6o83n12n62m78A02D0J3f3j87
6769b50d6A62K19R9j91H8a32j29l4M6k32e2D70M44K67J5J76L49K0K4j50k03M1
$$ y = [1785, 1673, 1239, 941, 84, -139, -278, -322, -277, -380, -174, -250, -518, -1098, -1210, -587, -325, 124, 410, 471, 534, 695, 584, 90, -567, -1020, -1218, -977, -1087, -721, -556, -203, 30, 370, 388, 262, -201, -746, -851, -506, 362, 1340, 2073, 2430, 2412, 2589, 2901, 3329, 4123, 3380, 648, -596, -1171, -1679, -2143, -2124, -1795, -946, 91, 826, 1323, 1030, 491, 278, 259, -796, -533, -767, -499, 318, 507, 319, -412, -1279, -1598, -144, 1200, 1622, 1500, 918, 5, -739, -974, -641, -346, -64, 146, 242, 88, -191, -285, 585, 1118, 799, 148, 89, -215, -1111, -1955, -2906, -2091, -46, 679, 419, -514, -1312, -942, 111, 637, 852, 1090, 1004, 771, 824, 1209, 1771, 2031, 1914, 1719, 988, 973, 657, 703, 811, 688, 415, 49, -943, -2126, -3291, -4136, -4072, -2933, -1616, -820, -294, 602, 1607, 2658, 2754, 2071, 1559, 997, 519, 102, 40, 53, -63, -250, -46, 162, 381, 480, 289, 88, -132, -261, -295, -249, -481, -52, 470, 914, 1181, 1196, 1372, 1721, 1741, 1765, 1615, 1412, 1453]
6746A453k2l8j24l57o1k99F1g4cj01l02l35K82A27K89q9c09o66o59M57J58j62
6724a181l28j24J01M04K59J75c16A44p1e52M6C59R06M79J06j84m17r5D59d67j148
6703a615p36m03J18Q11O63d46D76P29M34L09r8m19G10fp86n02K35d11c1F03J0
6682F13L43g59k654o25j132J740k9e68I53J149Q58O4q21a203l68m694K13J589
6664d463K204a086E1c69j63j6b18O7F3L91J48J89P3k20k8M6J98C92b9j22j60a6
6641F8J55F0b72m02j31K4J19d3G49M42m29B11g72r36l09M53P55b81bE30J46N60
6619A236Q11M40j74k57n8j12n93B08e77l07a83F71K74O6l01a21r57k14l44m48
6599b084q69J143J12K10J30J79Q5C1O29L36L93N18O3p72B71e53d8H90N21m5LA15
$$ y = [1453, 1431, 1393, 1269, 912, 851, 552, 61, -74, -3, -104, -406, -741, -459, 127, 416, 327, -309, -975, -1634, -1177, -1019, -1181, -1509, -1633, -1532, -1128, -869, -694, -316, 144, 73, -552, -506, 359, 1265, 1744, 1850, 1666, 1249, 1154, 459, -467, -1615, -2351, -2754, -2636, -1825, -1162, -446, 476, 1205, 1639, 1948, 1850, 1431, 710, -6, -792, -1294, -1059, -411, -31, 603, 613, 956, -759, -3413, -4038, -5170, -3430, -3459, -568, 953, 2102, 2960, 3024, 2203, -1203, -1571, -6265, -6052, -4463, -2259, -1086, 51, -369, -532, -548, -218, -151, 63, 454, 602, 791, 864, 644, 616, 662, 860, 392, -29, -151, -311, -16, 68, 223, 60, -272, -674, -805, -781, -662, -43, 749, 1191, 762, 211, -772, -1708, -2017, -1564, -809, -281, -2, 530, 676, 1236, 2047, 2487, 2313, 2056, 1998, 1886, 1293, 208, -577, -884, -183, 671, 945, 1011, 710, -121, -1078, -1292, -1636, -2084, -2953, -1810, -1698, -1488, -1358, -1179, -1094, 31, 660, 996, 1389, 1907, 1970, 1198, 271, -553, -48, 890, 1411, 1366, 1369, 115]
6576g38j284e70A033J021o0p88B18b75k6A76P51L75E06j29h9k24l84k61n0c89
6555I40R28J95k06l85j86m23H6e63j03c11a1C85K28J0L95k71l71d32o72p29P57
6534a076b94c1q9G9L69N13j94J41l17b15r01j313n09M99a061c92B94p2f50j054
6514a704n58L57P82d79q4m23m15k00L56d79A47Q60N77N9m83c98r85k31R8e10A0
6492B73F3g82l50k72n64p25L3m7J189N90J95n55C96J295L04j6l74n49l87k20r5
6471C54A61lf1l72n90n83K48b28A290J413N57J11o14j195E27c98q32p36R76a87
6450C66L79M91O57J87o76D04b03m60l84j45j04n6d36C24N53M27J06r3j97m57B55
6428f2k66j84k07c49k60b59C49P94P45Q2F34a126j380l78L10a286c42C6K83f8
$$ y = [-738, -2022, -570, 1033, 2054, 1994, 1206, 218, -275, -301, 176, 927, 1302, 506, 377, -89, -313, -697, -958, -1008, -389, 940, 1868, 2063, 1857, 1472, 1286, 863, 86, -563, -666, -311, -11, 385, 613, 623, 1018, 747, 376, -432, -1104, -1833, -1076, -294, -31, -120, 79, 448, 961, 767, 908, 591, -215, -1116, -2429, -2938, -2439, -1061, -392, 294, 222, -650, -1704, -2262, -1905, -1123, -479, -563, -986, -1401, -1601, -1245, -479, 147, 1007, 1584, 1643, 1160, -398, -1383, -1614, -1516, -510, 10, 273, 63, -782, -1132, -1404, -1968, -2693, -2660, -2707, -1518, -928, -733, -1288, 396, 1691, 1995, 1979, 1605, 1056, 669, 449, 354, 161, 158, -61, -433, -1023, -1606, -1358, -228, 1290, 2703, 3260, 3371, 2757, 1562, 527, -398, -1230, -1966, -990, -187, 366, 745, 1236, 1893, 2080, 1404, 404, -203, -663, -1047, -1192, -1296, -1352, -436, 324, 877, 1304, 1410, 1317, 1120, 663, 255, -62, -328, -512, -719, -349, -609, -259, 349, 1143, 1888, 1970, 634, -1126, -2506, -2884, -2574, -1286, -342, 36, 319, -68]
6407d85q95m68e39D93N06k73B55d65m58k37M40c15j86F6Q08Q94L2n96C23i08n75
6386a483e76F24M87j56K0M2j22C29P2l8b09o20C84N65Q49O25j29l24m61B61a068
6364a291m33l20R60d67m53k67n67J66M11c10D35J92o7B17e04A34P78K51B00i45
6343c844K77J186Q74n80M33P20L40b07E08N12j4M49P28M04J77A302k40j42c41
6323a092r21Q62E81K86j40J69k20C10fk14n51k9o19J30l2l60m7E29K07q8b976
6301e428K203a5A3a81o01l67j670j60L35J65a091A45P50Q61k80k75B74a557k609
6282d166j278J130a696c28C6M70a5l37a76r80p95M01j71h40b25A362L36k65F68
6262c77o91j35j59L39l99j87k90b82j035j004a010a12A164K48O15K52j04n01H02
$$ y = [-485, -1380, -1848, -539, 493, 999, 726, 255, -465, -923, -1160, -720, -315, -501, 66, 874, 1768, 1800, 1204, 323, -908, -1483, -576, 624, 1111, 955, 975, 1017, 895, 329, 401, 363, -209, -829, 384, 949, 1798, 2423, 2294, 1970, 1509, 261, -1068, -1291, -1724, -2044, -1084, -467, -920, -1187, -1754, -1588, -1177, -310, 435, 627, 560, 217, -504, 134, 912, 1163, 200, -945, -3844, -3567, -2381, -1507, -2087, -1654, -934, -594, -207, 508, 1020, 1006, 1455, 2183, 2587, 2764, 1302, 1062, 920, -341, -1092, -2013, -1151, 581, 867, 727, 896, 676, 310, -6, -220, -771, -800, -1419, -1289, -1321, -1681, -1728, 529, 736, 648, -2976, -5428, -3225, -15, 13, -181, -782, -1149, -2819, -2979, -2644, -2479, -1091, 145, 895, 1756, 1476, 1201, 274, -1557, -4166, -5444, -4314, -1696, -328, 36, 506, -15, -352, -176, -1156, -1951, -1550, -1721, -840, -225, 1362, 1698, 1433, 668, -377, -1068, -1203, -1362, -1023, -1422, -1609, -1899, -282, -1317, -2321, -1010, -112, 1164, 1412, 2027, 2279, 2175, 1674, 802]
6242f6p98o96n9o8k64l81j35p32n18L92p4r52j086j590j121n25O72R77K115K338
6222b571a103L24j95m2L36K91a53B45K61A92f14n25k42L72K28K58K45B91P96O41
6202A728K95K01o1%K1O59L35k51j425k7F53A06c77n36m38n70NM20N61M08P6j32
6180e83j23k12n0L66A87J068J003J45p32A88a448j152N45N24l04m86L23M76f58
6160H55Q00R02k40m07q44d9j104l62K23l60k29p31j114p92p25K397B7J990J450
6141C467p68A252A19e70j93K39a37D00r4i8j167M73b16r3r32k9j147l83O11i41
6120a58p43j166j534j058k22L09M12J10j116l44L78b112k45R00n50R5o39P64M02
6101a385j210o44o71L07M39J291Q54a37p27j311j926n22J621B89Q470O462L366
$$ y = [-66, -864, -1560, -1619, -1687, -1951, -2332, -2467, -3199, -3717, -3325, -3399, -4351, -5437, -7027, -8148, -8673, -8001, -7024, -4909, -2571, -1103, -779, -974, -1016, -680, -389, -153, 245, 506, 192, -614, -1139, -1381, -1009, -781, -523, -278, 291, 1087, 1728, 2023, 2224, 2163, 2163, 2184, 2843, 3178, 2927, 1502, 1475, 653, 106, -377, -913, -1351, -1921, -1916, -1496, -935, -527, -451, -583, -706, -918, -968, -602, 187, 1255, 2258, 2403, 1671, 188, -1448, -2600, -2055, -1531, -1835, -2321, -1998, -1522, -658, 855, 1655, 2557, 2317, 1910, 1066, -49, -1153, -1515, -1292, -1652, -1881, -2612, -3726, -4518, -5243, -2846, 27, 2017, 3467, 2699, 1252, 119, -570, -763, -524, -137, 400, 306, -98, -1265, -792, -216, -309, -1241, -1270, -2417, -2800, -2189, -941, -158, -901, -2067, -3601, -4659, -4881, -4572, -4160, -4050, -5166, -5510, -5132, -2112, -2357, -1457, -2007, -1912, -2551, -1787, -1385, -2595, -3239, -3910, -3603, -3164, -1873, -1019, -137, -864, -2175, -4101, -4623, -3002, 289, 8759, 15221, 18587]
6084A8587j115o57l829D902A394c296m941P51L300O58o19P14N49l87J385L16O11
6067i59K08c31r0O1D90J83J92mO50P90R60O53J821M0j604k000I35B26a79m99m28
6046a106j7K42Mj72j19H4K11a6m72n51p76k15O68L45K16J46b80E67M4b67j208
6025a475q75l9O15d87D13P35C13r4L34e0m98m02m05P3K66J66NJ41j32j20j50j66
6003a272m31n64J89h10G44R71K18n12E29c06l08nL05kk25j09l20m23j92nM78b38
5980F71k03a93j260k6N24J59n45q41j416n08J061J060P53M78J61j71K70A98K94
5961D92k4N3n7L51K69K09o18g07j203r74J46R35O19N44k5k45j201n06n63a353
5940G86J507Q40Q10J95l28j265j026Da237q56m48J19N45R00b87c9D19j59e56j13
$$ y = [18587, 17472, 16815, 12986, 4902, 1394, -3296, -8237, -7486, -4186, -3528, -4147, -3433, -2884, -3271, -1886, -1570, -959, -751, -331, -421, -360, 490, 673, 865, 861, 1511, 2301, 3261, 3914, 5735, 5775, 4171, 2171, 935, 226, -179, -678, -1106, -1123, -881, -877, -1049, -1168, 84, 295, -16, -488, -1039, -1815, -2030, -1362, -1017, -801, -655, -280, 567, 611, -267, -1475, -2350, -2389, -1774, -487, 413, 1148, 313, 219, 553, -50, -548, -950, -1355, -1282, -1016, -850, -845, -704, -836, -956, -1106, -1272, -1703, -2267, -2078, -810, 744, 1715, 1933, 1421, 529, -306, -614, -619, -314, -316, -541, -650, -970, -1393, -1585, -1590, -1112, -238, 671, 468, -193, -1453, -1479, -955, -796, -1341, -2182, -3598, -4106, -3045, -1985, -1232, -754, -593, -764, -494, 198, 492, 468, 521, 464, 815, 1084, 1293, 675, -707, -1910, -2884, -2738, -1803, -1184, -640, -665, -910, -2111, -2617, -3180, -1353, 786, 2293, 3133, 3943, 4138, 3810, 2545, 1519, 4, -1237, -2093, -2541, -2422, -1877, -977, -287, -39, 419, 260, -556, -669]
5920f69D59J447L83E74a740j729j486n21Q54N62j93J06J115O61R47d40a12l47
5902d59q36j135j219j72J784i71A15P21J46j61B10i70j416j195J338g64b61L0
5884b31m60P5F27J013J01p72b18j116n40M36c77G04O68E65d21j462p71M71M17
5865a766J28j58P7i4A325M57k82F49c13n51k36F41J647O17l14o47n63j14j0O10
5845A867n03F52j04L27J151J277M98L15M46Q55o89N98m27j489j295A003g44r88
5827a732O9L95p75R62n70k23J24g93C38P11L24J37k4m4j47l60l34K34R4k72q4
5806E73a44j063d19j413M94L47l774l069j699j207r43J095J41J828Q88J807P30
5789e194q45k21j58M02K131O02m83O13Q28j11M12d79B76R86k3J27D43d29j072
$$ y = [-669, 459, 1906, 2289, 574, -1740, -3469, -4955, -5476, -4622, -4060, -4253, -4147, -3032, -2371, -1424, -440, -112, -459, -1295, -2430, -3649, -3821, -2037, -971, 115, 836, 982, 821, 210, -970, -2386, -3581, -2243, -764, -261, -231, -691, -616, 627, 1640, 1741, 969, -218, -1334, -1874, -1438, -377, 704, 1372, 565, -421, -1883, -2654, -2183, -1766, -1638, -1796, -1719, -94, 1325, 1782, 1500, 649, -313, -864, -1100, 641, 2288, 2905, 2591, 1944, 1381, 1267, 1257, 1867, 1364, 652, 548, 875, 2026, 3303, 3801, 4116, 4562, 5417, 4728, 5326, 4899, 3410, 2115, 1003, -744, -1732, -1663, -1268, -2043, -1081, -1651, -1874, -1750, -793, 338, 1049, 1373, 1510, 1486, 1442, 1295, 935, 601, 835, 929, 657, 573, -144, -1207, -419, -1832, -1338, -991, -4765, -7834, -9533, -10740, -11683, -10588, -10447, -8619, -7731, -5924, -5194, -6039, -6260, -6418, -6016, -3885, -3283, -3766, -3153, -2325, -2436, -2024, -479, 276, 1262, 1239, 1366, 443, -429, -1501]
5770a501J54O59A12P34K21j32B32f14n08hA253N75M7m30n16A08h34j033n06K18
5750b155h83D86R88O77J99k54n55F97a48p07l55l62j079j089k5L77P99L77l68
5731b580L17M63O43d08D05J14k43h3r0C31J29j27O1O2A33e62m11L43d3G69j81
5710E88c66j064p47J19N25g55G6O86Q34L69l87n55n7K71rq5J39M04l30M7J74k0
5688A557j69j72l30C78r6b00OA99C6i0A247J003O18L42k23r06q18B68e97j74c44
5666d40J07L1k2j0J55j98Q9j53J24a35A20K53A63E3K15N7J24J95k11j15K11L53
5644H82M12J00M0n04C23b70k85b67c4p05p92o85L80g25B91P14NC62g87Q0D25J111
5622A536J21G52e81j341R07F61P94k7B40g22l46M53B30L48R09O15R6r75e7r34
$$ y = [-1501, -1347, -688, 112, 846, 1067, 935, 232, -614, -1122, -8, 1253, 1828, 1875, 1445, 929, 108, -834, -1867, -2373, -2155, -883, 486, 1474, 2151, 2350, 2096, 1541, 697, -148, -855, -1210, -1572, -2651, -3740, -3765, -3388, -2589, -2212, -2580, -2263, -1800, -1157, -408, 405, 519, 276, -83, -173, 331, 460, 333, 394, 456, 133, -562, -973, -630, -43, 769, 588, -366, -1430, -2177, -2058, -1533, -755, 76, 762, 1596, 1965, 1578, 1023, 966, 1237, 1228, 1143, 1282, 1686, 1356, 1403, 1577, 1557, 1388, 1216, 886, 378, 282, -200, -194, 199, 36, -90, 1247, 2250, 2868, 3210, 2987, 2081, 1263, 268, -597, -771, -344, -440, -333, -302, -324, -334, -179, -377, -288, -441, -317, -135, 120, 373, 163, 53, 268, 325, 449, 644, 433, 318, 529, 882, 1294, 1394, 1434, 930, 323, -270, -555, -267, -34, -739, -1531, -2216, -1836, -725, 291, 1005, 1010, 362, -787, -707, 425, 1536, 1657, 752, -581, -1922, -1015, 661, 1455, 1428, 240, -722, -1068, -615, 230, 578, 1487, 2102, 2198, 1223, -57, -991]
5602i91M86C8a12p23l44M62FM10K84k19b38j030o81N1K14%N17d1A566R77O2n88
5580B017D75a606j535J409g09a0C37N63O74L73o0p01C95Gb50L4R7p41n44q52l40
5559b596b77A581O24r44B79e04B01J198N07P53Q22m0k83n34J423m19j516h71j754
5540b625j544J839J35k057j0444l471J275J678N280d826gB015J260A527c026m989
5524h015j073R5K921b773Q07j037J388I96j87c11A789M79L045o11k184j062d21
5506b370L77C514L96k91r53j083d6I84B52a78n55k10L20E98Q88L01n94C70J35
5487E05a23l93a62C38O95J092O43J44k24m80L69A265E26d14p92n24g43A1M14J75
5467F00JA04b32l29n19q4l9e85B75F3K04R96m08C99l2L72P68p6l00n25b83o64
$$ y = [-991, -505, 38, -112, -835, -1179, -717, 6, 416, 700, 481, -238, -1268, -1949, -1898, -1684, -1684, -1167, -41, 1566, 2543, 2605, 2017, 475, -1606, -3141, -1732, -709, -10, 337, 900, 1574, 1947, 1887, 1186, 395, 7, -250, -216, -119, -860, -1404, -2256, -2596, -277, 1581, 2205, 1261, 279, -504, 201, 1399, 1906, 2659, 3481, 3441, 3158, 2624, 4047, 3628, 2112, -871, -2625, -4169, -2330, -2195, -4252, -14696, -18167, -16892, -15214, -9934, -4826, -7, 2015, 3275, 1527, -3026, -8015, -9088, -8993, -6072, -2773, -1966, -3003, -1615, 996, 809, -311, 1789, 2268, 5313, 4702, 2518, 1456, -421, -2370, -1993, 3514, 3910, 3619, 2666, 1583, -46, 984, 252, -178, -733, -943, -623, 598, 1486, 1787, 1193, 370, 505, -123, -516, -162, 338, 1033, 2125, 2768, 2912, 2688, 2208, 2577, 1265, 526, -414, -1206, -1730, -743, 11, 425, 600, 601, 104, -232, -561, -1080, -1164, -1203, -585, 275, 63, 267, 1263, 855, 399, 367, 739, 1507, 1431, 1131, 606, -283, -947]
5445i47j62r61m95k02O95R78M74b48G88P60O56L99l52o64F45d39j866j311r82
5426d598J477a263c39H8Fb67p57o69o92k87p2J76L49O69K88L86J77j13d05m12
5406h17l83j34r10r1J44L82K73M10L26K92Ro12p58p17n1J257f73c15m73p63j46
5385a697l12n9h76K31a66A62G0c52j62m54M16A48N27qj50A84c38n58l49m25m06
5364b076k38l95j77j39R3J219l6n87m85K30J262c47D64P72L23k35n44B01e70n87
5344a157n92o28l27M52R89C7J338J394J194M07j713j096B14f59m05k26k84j57
5326a731q57J150k51l67j28R29A50J198K90l75k36j06O7R8j60l10A75b41o77q09
5306a727n60k07K10O25O57M30K80m6n38L25F75M70k34D5c75r91n35m61j810J398
$$ y = [-947, -1109, -2070, -2565, -2767, -2072, -1094, -620, -248, 788, 1548, 2204, 2603, 2251, 1587, 645, -439, -2305, -3616, -4598, -3121, -1263, -339, 88, 6, -267, -1024, -1693, -2385, -2672, -2744, -2568, -2219, -1550, -1262, -876, -699, -812, -405, -817, -1200, -1334, -2244, -2335, -2191, -1809, -1536, -1126, -800, -508, -499, -1111, -1869, -2586, -2637, -1380, -673, -315, -788, -1551, -1697, -2009, -2068, -876, -645, -166, 162, 70, -352, -514, -968, -552, 148, 675, 667, 517, 184, -338, -896, -1245, -1670, -2076, -2314, -2709, -2886, -3025, -2932, -1713, -1749, -2336, -2821, -2591, -1329, -347, 464, 1236, 1559, 1324, 780, 201, -570, -1157, -1749, -2377, -2704, -2252, -1263, 37, 1375, 2769, 3963, 4370, 2657, 1561, 214, -659, -1064, -1290, -1574, -1731, -2588, -1438, -1689, -2056, -2184, -1255, 150, 1348, 1638, 1263, 1027, 921, 988, 1086, 926, 616, 175, -241, -918, -1727, -2287, -2494, -2284, -1659, -1002, -572, -292, -338, -876, -551, 675, 1145, 911, 45, -375, -1366, -1901, -2362, -4172, -2774]
5286b774j518a953g0A75O83K41j31j66K08B93r9L14qA3f55q44j29d25E99R39j78
5265A360F58b03g2H6d36p60k54e86A40N34k57f59j979g39A995K793J832J581j622
5246F579k452c08j962j392J062a087C05J342M999R19P11l678K83j052f32k96A137
5228F373j304M486p50k885K211a777r06q027J399K785K616J465P62Q39m2K79D2
5210f1A51Kc3A07Q33J075r6I48h55j188p90J321C90P87N10k93a15I9a198m68O53
5189a013M52A256m86j80M87J497J859K098J40k75r48B677G9e30j84L00A93Q53
5171A046P32J4q51B24d99m75Q6k701L03J160a48D6R81L7Q3m84e5k84l76I41k34
5150G07B60e09C01L99J52J136n53E06b86o39q17j209J401L98L75c69A0Q94L60
$$ y = [-2774, -4292, -1953, -70, 175, 858, 1099, 968, 802, 1010, 293, 194, 508, 500, 13, -655, -1499, -1628, -425, 599, 1538, 1360, 658, -203, -72, 86, -436, -1196, -1450, -586, 140, 674, 417, -659, -2638, -739, 1995, 4788, 6620, 8201, 6579, 4127, -308, -2270, -3662, -2600, -1087, 305, 1647, 6646, 7565, 8276, 4598, 4881, 3829, -632, -928, 1137, 6373, 5069, 9555, 8805, 5920, 8131, -1777, -2683, -10710, -9311, -6526, -3910, -2445, -1683, -844, -886, -607, 42, -61, 151, 153, -33, 107, 940, 2015, 1919, 948, -855, -2043, -2833, -1512, 390, 1177, 1687, 1394, -115, 99, -1198, -1666, -1013, -561, 1256, 770, 590, 1077, 2574, 4433, 6531, 6671, 6396, 5448, 2677, 79, -530, -714, -414, 193, 1046, 1778, 1792, 941, 224, -499, -974, -888, -3589, -3286, -2126, -148, 46, 1027, 1064, 1147, 663, -55, -339, -715, 941, 707, 260, -509, 301, 700, 852, 1988, 1435, 506, -286, -925, -1742, -2951, -1550, -1152, -777, -369, 10, 904, 1264]
5131A264o22f93j743j660j081J310P53R36N54L84j5n55r00k024j156m32K016K055
5113b251d70A22f45o02j239q51J59R31P67L66L29L47J62C3f09m61p36k51J10P21
5093a226e17C79N27J74j3m9K80j23k15m06Fb93l61k78J49c83D8L33J63n0K39K26
5071I59J92q1j20k57j42D9d76k61J71A81Q29P72K55Ll04m48E84B11i5k9o2K5c5
5047f9j74k59m38o83l84j14l20k24R63L79m18l91L51O89k46k3m89K10N90a33F76
5025A268m8r1E24a07l74lk86l85l96N48M58B29O65N09N2n18A81d44q48j4A32J194
5003A326O54K2o11n14l51A57C9O3L3N6j7J3J99J71K94J34N3j49N2j52l24d1m98
4980e39a31I28J713J462R45n6p09j334B20j01J23L60j07j04RjA34b62n60m68l42
$$ y = [1264, 642, -693, -2436, -4096, -5177, -3867, -3114, -2178, -1624, -1240, -1255, -1810, -2710, -4734, -5890, -6322, -4306, -2251, -470, 122, -645, -1247, -2486, -3337, -3178, -2247, -1480, -1114, -785, -438, -276, 33, -609, -1070, -1806, -2057, -1947, -1226, -517, 379, 906, 1080, 1067, 1018, 1298, 1175, 960, 554, 6, -293, -654, -932, -783, -383, 48, 381, 544, 494, 733, 959, 1151, 1070, 950, 693, 551, 49, -476, -737, -566, 181, 1010, 1782, 2037, 2040, 1736, 1288, 584, 211, -95, -124, -186, -161, -35, -69, -243, -502, -940, -1623, -2007, -2121, -2441, -2665, -1702, -1323, -1741, -2132, -1781, -1092, -1338, -1361, -1850, -1640, -1050, -133, 676, 1268, 1220, 1129, 524, -107, -481, -484, -770, -1155, -1551, -1003, -545, 229, 894, 1403, 1455, 937, 181, -444, -1292, -1306, 132, 1326, 1980, 2002, 1391, 877, 526, 157, 39, 102, 135, 191, 174, 187, 386, 557, 851, 985, 1038, 889, 941, 789, 465, -41, -539, -131, 928, 2641, 4103, 5048, 4992, 4283, 2949, 220, 119, 242, 602, 495, 391, 400, 399, 134, -262, -822, -1290, -1632]
4959a632K73L31K80Q1l3l35m51O58J7k73L20r51j691J34a158d87K24k18r67j148
4939b596j382J826a052K64K70n5q03o27j00R70M78b62A03K93M00J11M17L45l89
4920A280j72D21a80a9F52K75k67k96b20n73m08M2Q1M35c7D52M05J41J65K25K53
4899A641L7M7j12l52l54p0J66O94M26k47o39D93n9O38P03K20Kk31ok9N35k08o8
4876A990q92K031d26l84j61J98L11a48pj95M1B16knb53g2A88J1J04A29a87n52
4854g39Q3c6A133J040P65J370q07A606o11m59k50@c5A71K12O51j6k88B99aB53
4832F96P14j38L4j41P1M45J32k92p25a70n51n74r9L68l88J37O9o2p9K36C5J117
4810A152L73M5o41C54a67j50J2E9L15L8P9r7J77k65j7A20d42m37m50k83j91o1
$$ y = [-1632, -1359, -1028, -748, -667, -700, -1035, -1486, -828, -811, -1084, -764, -1715, -3406, -3272, -1158, -487, -263, -481, -1448, -2596, -3978, -2152, -1052, -788, -518, -573, -1376, -2003, -2103, -1133, -655, -262, 103, 396, 796, 907, 1324, 1669, 1280, 1108, 421, -180, -19, 652, 927, 660, 364, -220, -793, -1201, -1159, -1078, -643, -37, 452, 857, 998, 1163, 1388, 1641, 1678, 1725, 1613, 1261, 907, 837, 1003, 1697, 2123, 1876, 1237, 493, 434, 1072, 1775, 1995, 1997, 1766, 1760, 1731, 2266, 2058, 1990, 1098, 3129, -426, -810, -971, -773, -462, -148, -155, -350, -309, 216, 214, 209, -253, -72, 188, 199, 303, 129, -187, -739, -656, -36, 1133, 2173, 2938, 4308, 3501, 1606, 995, 536, 286, 0, -35, 171, 383, 1034, 1018, 730, 299, -1, 253, 696, 1410, 1272, 1306, 1165, 1236, 1681, 1813, 1521, 796, -170, -721, -1295, -1394, -1026, -1414, -1277, -1208, -1270, -1349, -1113, 35, 1152, 1525, 1570, 929, 354, -167, -317, -305, 59, 374, 412, 491, 394, 571, 306, 289, 120, -442, -879, -1329, -1612, -1803, -1864]
4788a864K14M19L65k25p83M21c21F54O26Q2A26c15l12j44i6D85j32b37m09E23
4767A658N61Qm75n83E20D4b87l03l87o27O8N3J27N80B10J084O66r3o85ij069m29
4745a507M51K53K32i4B33J79J45J29l36c34o95m80j4M45e05A33N59R95P78Q00
4725C265K41L14j147j045p10C32J58K88C66a63GL97O2J52A56i5K7B80J91L90N55
4704A416O50N57O04l68A339F65a41l18J95C43P12P36O41N2o27q77a86l65B65J590
4684A855J430N97K11o17j185j087C52g6F51P93M58K76l61l40m49m71D8d68l82
4665h50j246O39L0L79M24PJ88j67j11j18J27j12m16P6k16j35J27K71e20F7L75
4644D42K9A06J06H1b24q1a51r0j20K3j27MJ53A75P71Q95N41j08n19o84m57b8o61
$$ y = [-1864, -1650, -1231, -866, -1091, -1874, -1453, -321, 654, 1280, 1362, 126, -315, -627, -771, -96, 485, 353, -237, -646, 523, 1658, 2219, 2227, 1752, 1169, 520, 44, -287, -590, -977, -1604, -1536, -1483, -1356, -776, 210, 1294, 1960, 1867, 1182, -9, -1078, -1507, -1056, -803, -571, -94, 233, 412, 557, 686, 350, -334, -1029, -1509, -1523, -1078, -505, 133, 692, 1687, 2465, 3265, 3506, 3820, 2673, 1628, 918, 332, 490, 778, 366, -163, 7, 404, 466, 618, 156, -95, -68, 280, 471, 861, 1416, 2066, 2623, 3227, 2859, 1339, 665, -141, -459, -264, 343, 1055, 1791, 2432, 2484, 1857, 980, -186, -551, 265, 1855, 3285, 3882, 4093, 3476, 2291, 1204, 352, -76, 651, 1444, 1902, 2178, 1817, 1477, 1028, 557, 48, -468, -850, -2096, -1457, -1427, -1048, -624, -617, -429, -596, -707, -825, -698, -810, -1226, -1150, -1366, -1501, -1374, -1103, -520, 67, 442, 471, 106, 212, 81, -224, -305, -151, -241, -361, -338, -465, -461, -308, 175, 946, 1841, 2382, 2274, 1755, 1071, 614, -28, -689]
4621f89l82l66j55p1N65c19h6A30K0e1l99m87m98l50j27L16L13L80hD10J95M84
4599A089Q30J13Rj49o15D08d40j237j417J464B05R54n1A31d16l54m33o48k52d34
4578C57P69l29B42j06J93M22J52M5l62k75B6b56h6H37K87l98C63j07D4K15J83
4557D42p0l4A43a259L58n85d30A067J053N96J048K29j00k56o44J61q53m43j38
4538A720k84K04L94J25j078h79H63R4K728K495N2B512c29n03L59j509d87F1f957
4518B188L2058M4926M6713M4041L3168J7609p696k8476m3623m5137l9098B6882
4505A1308B197K331M778L976p74j652m209I14b626a160I92J458L81o67I17c54
4488a439n50A81R62L98N28I51l05E2f10j50J67gG27Q9O56Q43p92a17r22m78L0
$$ y = [-689, -1071, -1437, -1592, -1663, -1098, -319, -86, 130, 150, -51, -450, -937, -1435, -1785, -1912, -1596, -1283, -903, -8, 410, 605, 1089, 1919, 2032, 2041, 1892, 1277, 408, -440, -1677, -3094, -1630, 205, 1159, 1108, 131, -416, -770, -1203, -1851, -2103, -434, 357, 1126, 797, 242, 136, 329, 751, 903, 948, 586, 311, 26, -256, -86, 837, 1124, 726, 363, 256, 44, 259, 442, 372, 338, 143, -1259, -901, -1486, -430, 1067, 2120, 2716, 3764, 3993, 3893, 3637, 2993, 3154, 2301, 1858, 1720, 1436, 1640, 2034, 2159, 1081, -879, 863, 957, 3685, 6180, 6232, 2512, -329, -832, -473, -1982, -487, 61, -6957, 2188, 34246, 79172, 125885, 169926, 203094, 220703, 213007, 184531, 140908, 95771, 56673, 26882, 11308, 2197, 4528, 9306, 13282, 12508, 10856, 6647, 914, -2626, -1160, 992, 2450, 2831, 2164, 917, -354, -1439, -1989, 181, 1143, 1541, 2069, 951, 646, 52, -610, -760, -593, -7, 727, 816, 1472, 2315, 1523, -117, -1039, -1517, -1487]
4467a487k28Q7N19e45F93J5M08m4A12g95B07O86L62E41k27j25J326L63k56o19
4447A003B56c78J14r2f1l33p32k64O34a23I75N45C34gp09o58k44J27p4o9M20A70
4424A156N9L6K20k22C67d55q46c13B028N56r53F11A6cH92O24P15L70K70J53j71
4403B853m25p13E55f12r26q91M84g4A227P33O38p85D64a270j983j343o37a9A360
4383A546K67n12n12j37j21A59e58p60m20k4k20o66j257r2K50J608J016c26C34
4363E12A70h3l09J8a49k8K3m9G2N49N65N21L96l5n82D82b79l80J25a89C16M21
4341G37M84J36l9l98j58q8k43j37C1d89l82n12p69J075M27a00l81j009o26j339
4321c455J408Q74k14O37j272k451P91i66d2C54J76J9g6o29m28J1J73M1J36J88
$$ y = [-1487, -1715, -1628, -1109, -545, 693, 708, 1116, 1072, 112, -795, 207, 893, 1255, 541, 314, 189, 1515, 1878, 1622, 1003, 256, -378, -264, -356, -61, -394, -1126, -1390, -756, -123, 975, 1520, 334, -7, -716, -1374, -1618, -1491, -1565, -1634, -1214, 170, 1156, 1215, 1251, 1471, 1249, 367, -455, -1301, -313, 2028, 2584, 1631, 611, 16, -3, 892, 1516, 2231, 2601, 2871, 3024, 2853, 2428, 1715, 555, -612, -1538, -2429, -1945, -74, 1227, 1960, 2598, 1813, 464, -1270, -3253, -4596, -5233, -19, 1360, 1546, 1813, 1301, 789, 652, 531, 159, -558, -1318, -1738, -1762, -1982, -2648, -3905, -3997, -3747, -2139, -1123, -326, 334, 512, 170, -83, -392, -374, -149, -177, -154, -203, 72, 621, 1186, 1707, 2103, 2068, 1486, 482, -279, -659, -534, -189, 316, 737, 1221, 1357, 1318, 920, 762, 674, 431, 294, 31, -489, -871, -1383, -2152, -1077, -650, -100, -481, -1490, -2116, -3455, -2047, -1173, -1387, -750, -2022, -4473, -3682, -966, -42, 354, 530, 549, -76, -705, -1133, -1122, -949, -908, -772, -584]
4301e84J72h8B73Ra09l77B59Q12l9l95H7c69j58B91J296N16o79a56H65A12M56
4280E68j14A82a43n04j95N9nJ42O1l2m4j86j57l0j06m8J78N0c28F83J462J786
4258C931J858N22k74o89j994I63j12D19c6l22l72j25N5K06j35R7p5r2l91n77g78
4236B38P30K82k65D62d76o78o25j34M68L29M69J66k29m43m29L06d45H5L2b90O0
4215b30e6k7a9D89L40L06L02n59a18j20F8b41li1D91O40J99J13k35C61e98j017
4193a615j054j02L74J21K46K82J96o8m7J31N70b92A31b20p00c64j681j194O35
4174b604g8G95C45b41j97l0R4l98n77n84o2K01Q09E9J77K9b72p5l02o6J79A4Q64
4151H78N37pj17k12l33k59A04d1A4R77P13K31l13p95a68j038o71k92J61J08M53
$$ y = [-584, -412, -88, 273, 282, -109, -486, 259, 1071, 1032, 637, 87, -369, -527, 291, 1587, 2103, 1424, -156, 865, 112, 568, 454, 182, -143, -647, -842, -783, -788, -646, -585, -617, -661, -847, -1004, -1034, -1140, -1188, -1010, -960, -328, 683, 2145, 3931, 5789, 6311, 6037, 5348, 3354, 963, 851, 419, -36, -358, -730, -855, -800, -594, -729, -632, -707, -799, -1190, -1767, -778, 238, 968, 1250, 985, 462, -476, -1154, -1779, -1913, -1445, -1116, -647, -481, -710, -1153, -1582, -1276, -445, 85, 117, -290, -230, -56, -83, -19, 489, 829, 1135, 1437, 878, -118, -238, 68, -241, -244, -91, 491, 1131, 1330, 1443, 1208, 361, -598, -1615, -2669, -2771, -2397, -2276, -2030, -1748, -1552, -1620, -1667, -1536, -966, -292, 131, -220, -920, -364, -2045, -3239, -2604, -78, 795, 345, -241, -438, -468, -374, -772, -1349, -1933, -1995, -1794, -985, 59, 236, 265, -272, -347, -649, -715, -536, 14, 878, 1415, 1408, 1291, 1079, 746, 487, 104, -41, 14, 991, 1704, 1935, 1622, 827, -168, -1206, -1877, -2169, -2008, -1900, -1447]
4130a447M23a2G44M23J90j47l45B46d14m62j73K00c23i0p1j69N9C5M03K1G5d38
4107i39L9k51j45M2J73M02A58O24k72d66j101r26P35b64D22N2A50b39l60K98C54
4085I31K09l94J8l07I3c92o37o82j46n556L64N06J354J778a305a96C86J43j09
4066D20k3J15L23M83L67M60J16j95o03n78B27f26q18m78m4L63f04D43P89Q5k78
4045A039l91l7J05K86Q0j43j4J64J21L66M4k41m39l14k9B85d03p2l31n26p16j390
4023c438n61a532F39J418Q29q08H37h40j717Q26K27M86M12A23Q10O91l79B75g30
4003F30J221Q00m2k00M37L58J111J12A838B21c90A214J923O46j8A837a64n10f6
3983E25L49j79j65P0K5q9Ie25n34d32A049R96J00o33D98d02o04k28R0a47D80H8
$$ y = [-1447, -1024, -12, 744, 1167, 1357, 1210, 865, 246, -414, -876, -1049, -849, -323, -90, -161, -330, -271, 35, 438, 459, 75, -438, -939, -900, -1151, -1296, -1254, -1081, -679, 158, 782, 510, -466, -1567, -2493, -1758, -264, 422, 474, 150, -239, -599, -301, 354, 931, 1140, 746, 764, 457, 93, -392, -1029, -1711, -1857, -7413, -7049, -6543, -5189, -3411, -1305, -196, 386, 529, 420, 397, 512, 835, 1318, 1685, 2145, 2261, 2066, 1463, 885, 227, -626, -1444, -1922, -1966, -1603, -604, 443, 1232, 1317, 1039, 648, 611, 716, 1002, 1082, 939, 925, 1089, 1210, 1576, 1620, 1379, 940, 626, 597, 285, -403, -475, -806, -1332, -2048, -3438, -3999, -1532, 639, 2057, 2886, 2078, 837, -840, -2557, -1731, -1504, -1018, -606, 123, 933, 1624, 1245, 275, -730, 630, 1851, 2651, 2609, 2409, 2846, 3204, 4315, 4427, 1838, 221, -390, 1214, 3137, 3783, 3765, 1837, -164, -674, -66, 525, 874, 695, 530, 600, 625, 536, 9, -525, -1059, -432, 1049, 2045, 2145, 1512, 498, -402, -1006, -1234, -1144, -147, 480, 88]
3960e92M6b49j75J73F20Q56Q78J044L12J77l66j089o99o51m12c0o27j6a73Fb62
3938i10n14e7E07B47f01l66B44H5g87q12J09a24G62O3k68j5q1J62M40P61L80k99
3916A905n40F78k36k06NplP9j15G7a95l25k58N4L44C69Q14J088J560N90o52A003
3893d75p95L21a65E53K53K60K76N16N31Q04j5p83p75F34c35r21j002q54l61J133
3873b340J048a34F52k2h9n54K25a06d2m29j069j140O1J99Q28L42n96j043O94Q95
3853a300N00a38E42M26l9j12C13G5f93m41L9m61K44e77M5k07K3l46L46J12J0l19
3831i13Q5k49j09k06m55P09N06e1C86j4A08b38h2C13N86J35k20M87K04M14L962
3810E881A760A4b156p07O09P59d90C16o9L24L64lJ395g8k46j78j1q0l05m05p3
$$ y = [-592, -546, -249, -424, -251, 620, 1476, 2354, 3398, 3710, 3887, 3521, 2432, 1733, 1082, 670, -30, -657, -673, -173, 6, -262, -910, -1424, -57, 507, 247, -601, -967, 244, 85, -787, -1599, -1490, -124, 762, 825, 557, 542, 461, 623, 1063, 1824, 2204, 1905, 1365, 678, 442, 236, 241, 234, 231, 310, 195, 77, -195, -520, -778, -724, -380, 369, 1183, 2271, 3831, 4421, 3769, 1003, -475, -1270, -949, -165, 553, 806, 1066, 1342, 1858, 2389, 3193, 3178, 2395, 1620, 634, -335, -1256, -2258, -3112, -3473, -2340, -1292, -134, 652, 630, -89, -643, -418, -106, -42, -471, -1540, -2680, -2619, -2420, -1592, -1250, -1846, -2889, -2195, -1300, -800, -138, 542, 968, 929, 817, 313, 75, -693, -1134, -1095, -1556, -1312, -577, -532, -739, -716, -1062, -716, -604, -594, -913, -828, -1077, -1186, -1392, -1847, -1138, -632, -51, 386, 372, 108, -238, -82, 313, 899, 1034, 814, 1301, 1505, 1919, 5881, 1760, 14, -2156, -2863, -2254, -1495, -490, 316, 247, 571, 935, 932, 2327, -78, -324, -502, -513, -593, -898, -1303, -1376]
3789a376o8M05f0F05j68b72q30m84r46J154b06E18A90I0b31k96J03J77Q6L6e2
3767c5j39f5A79MG5d76n16l03l36l39j37l93J096e33A85L41K81K25K31j33l30
3746H00j63K65N21N45Q7J198j369o30A20e28k23h6F34L26K05K60K37p1l00l03
3726I88j60J18L99L97o8n74c3r74o11e93E9Hb36l09j12K55b4E46A25d35n59M05
3704e89b22B47K93K26J25k97r0j81A45M2J36K80j9B71a34D7L85J08A30c26n39
3683h65k0a75A028O99j97p07b5n66K18Ro5D8R31R85P76K08p61H40al73J81B98
3660F72jo6LL56L28K09k61n31k48L17jB24d25m08j45l16Rf06f3C13O8J38q7m2
3636C90j48J05j7A06c95n18J12B91Q50K43k95m89d62q13m35K72M77c38A2f4j30
$$ y = [-1376, -1444, -1039, -60, 605, 437, -272, -1102, -1586, -2532, -1378, -206, 518, 190, 90, -231, -527, -424, -247, -161, -125, -52, -35, -174, -65, 179, 183, 75, -476, -992, -1295, -1631, -1970, -2107, -2500, -1404, -533, 185, 526, 807, 1032, 1263, 1130, 800, 637, 902, 1423, 1968, 2055, 3253, 1884, 1254, 120, -528, -751, -86, 634, 960, 1165, 1425, 1662, 1591, 1291, 988, 828, 946, 1345, 1742, 1674, 1100, -33, -1007, -1618, -593, 59, 8, -236, -545, -657, -402, -24, 546, 125, -435, -994, -589, -222, 247, 540, 766, 891, 594, 504, 323, 145, 187, 323, 603, 584, 271, -134, 47, 432, 540, 130, -326, -865, -885, -175, 1028, 1727, 1530, 823, -25, -591, -373, -364, -429, 48, 979, 1964, 2740, 2948, 2187, 840, -1, -374, -193, 298, 672, 671, 605, 608, 964, 1292, 1501, 1240, 709, 461, 778, 777, 224, -425, -833, -978, -1294, -1285, -606, -63, 313, 381, 519, 432, 390, 242, 347, 330, 106, -395, -913, -801, 291, 1141, 1384, 1089, 600, -462, -1275, -1710, -1438, -961, -338, 12, -64, -194]
3615a94k96J19m50N2J28b18D01m6a8n12r4a51F32J70k45k48E7a15j99q7J31g7
3592D84K64K90N8C32g04j07a91A56c77p43q98M31M10P5q1j02j34K30L33a54e4
3570A37Q1q2J68L9j13g9m46l78l31m39J15M6e39a33A51N12J16J95j27k98H7d78
3547a186l60o0J53J40L62a39D55N61m6k06C17d18j024HJ388J308N77oj32K48k23
3526C168M49P18d75q97o95o57P1Q36O75e69E9J99B3b37P2C26M09L46K63N35N18
3505B397j67l96k09j04j21q2k55l64B34b9C3L94J74J3j25A95a12k7b9p5j87o12
3483i03k77FP49K20j73C04e33q22r19K56O06N51c05B89K22A60d38B2K32l6c40
3461h19q99r0e12l36B28J177L98q58B12g18p26n3r9N06j45k47n68k60Q78O98J61
$$ y = [-194, -490, -371, -821, -769, -641, -218, 401, 355, -18, -530, -624, -151, 632, 802, 557, 309, 57, -115, -314, -401, -270, -77, 484, 748, 1038, 1096, 332, -704, -811, -191, 156, -377, -1120, -2018, -1587, -1177, -1102, -1183, -1285, -1419, -1189, -856, -154, -54, 137, 218, 136, 304, 343, 230, -79, -525, -903, -1234, -1673, -1558, -1512, -539, -133, 151, 663, 779, 974, 847, 549, 87, -478, -1186, -1546, -1606, -1453, -1313, -951, -139, 455, 1016, 970, 764, 317, -418, -1442, 8, 1396, 2704, 3281, 3275, 3143, 3391, 3168, 3617, 4335, -475, -1372, -2067, -2724, -2653, -1817, -1142, -569, 59, 258, 23, -237, -165, 326, 735, 1081, 1344, 1879, 2397, 2230, 1834, 1625, 1521, 1400, 1318, 1063, 699, 234, -29, 33, 427, 601, 614, 489, 195, -112, -139, -29, -104, -291, -903, -1180, 6, 755, 975, 802, 304, -533, -1355, -2274, -2018, -1412, -861, -305, 289, 511, 160, -438, 22, 254, 218, -340, -819, -1718, -1808, -512, -848, 228, 1405, 1803, 945, 212, -718, -1444, -1497, -1596, -1090, -1235, -1482, -2050, -2310, -1432, -734, -573]
3440e73k18l10j66l6J03d59D34N03K91n1p0J22K50k71l98G0d92m79n22O02a28
3418F32O30L39k99K09l90k95m02C5f01o34n79p30K16N89M40M01j37l07o33j059
3398c034K3a477K20J40J13M34fj85n06L19g6B73L41O6k71m9q5l8J61P73P87J324
3376C282Q62O95L16J03l82j236A180J65j37l48j79j06K16A64a193j551J090a10
3357I16J013L03J7j20k88K08J90L63J53J61k0n07p35F82B49a98k7d7B82L91J04
3336G77J64q3j47k56Q5J50L04j22B47b9m22p16e15E20O56K55rj76j27j14o8j33
3314H04l28B26h2B288J639L80Q32J88j488A181e95B9K47M3j42b8l66m45l9c85
3293H3O7J09C5hj30j75p16l62k02L85N65B15O34K04k26C49a6I3M47L05l37L35
$$ y = [-573, -791, -1101, -1267, -1303, -1200, -459, 434, 937, 1228, 1177, 1107, 1229, 1479, 1208, 810, 70, -492, -971, -1493, -891, -128, 632, 1262, 1601, 1302, 1511, 1121, 826, 424, 35, -601, -1235, -1814, -2544, -2328, -1739, -1299, -898, -1035, -1342, -1975, -3034, -3011, -1477, -1257, -1117, -1004, -570, -6, -191, -697, -378, -76, 273, 614, 680, 409, 360, 275, 237, 398, 1171, 1958, 3282, 4144, 4839, 5155, 5258, 4876, 3640, 1180, 1345, 1208, 860, 681, 575, 791, 164, -1193, -2744, -1654, -110, 916, 1929, 2232, 2249, 2129, 1841, 2049, 2239, 2602, 2755, 2916, 2896, 2389, 1654, 682, 249, -198, -225, -47, 282, 673, 777, 941, 858, 711, 455, 540, 690, 994, 872, 247, -29, -451, -1167, -515, 520, 1176, 1431, 1422, 1246, 1119, 1005, 937, 804, 476, 226, -82, 2288, 3927, 4307, 5139, 5327, 3839, 1181, -595, 29, 276, 319, 177, -28, -394, -839, -878, -385, 83, 150, 259, 35, -8, -138, -313, -1029, -1391, -1593, -1208, -643, 215, 849, 1053, 827, 349, -16, 93, 540, 845, 508, 843]
3271H43q2j17K02N22K85O4J59o3m85F29e32j021M3l11m99k67j48P78L79M7P8N56
3249h97k003a040L55m1n62p55n63r2Q74N30J71k13l61J9J53K82f06E55R30K69
3229A754q35c3l74la82l7n5n59n80k56L07f33K78j34q9J00m23b66d7k36D26j47
3207B79R6j46E1a35j87p0j6J78h8L8j65l47j66I6Q77P52M25K1k82p55A11i39q13
3184a752l50L56N30c03G44R91O72O41M2N3R53J97o53j811p47J35L23Or7k49D71
3162A24K75N57N36M57K14r9m33q04a33o91k70J70c7G84O02K34j91m14j81K80M2
3141A156l03a85j206j136M27e13B20b1m36l49K31J42k10p01O54A054J197M07j72
3122B486o29r05F8g12J09B1L57M00R0m4l11A47h1o00j056o70O67h55C7M67J25
$$ y = [843, 761, 644, 846, 1368, 1653, 1717, 1876, 1813, 1328, 629, -532, -1553, -1510, -1821, -2320, -2587, -2735, -1957, -1578, -1531, -1453, -897, -2900, -1040, -685, -726, -1288, -2043, -2606, -2698, -1824, -1294, -1123, -1336, -1697, -1678, -1525, -1243, -606, 555, 1485, 1754, 919, -33, -407, -410, -182, -219, -274, -833, -1413, -1669, -1362, -633, -355, -489, -578, -478, -901, -266, -47, -283, 426, 279, 375, 229, 51, -135, -322, -392, -408, -230, -88, -50, -215, -562, -728, 96, 973, 1725, 2150, 2171, 1889, 1134, 111, -939, -1752, -2102, -1746, -1216, -303, 744, 1735, 2407, 3048, 3090, 3143, 4096, 4293, 3640, 1829, 1082, 1217, 1540, 1546, 1449, 1200, 471, 124, 399, 956, 1492, 1949, 2163, 2064, 1631, 827, -133, -824, -1094, -924, -37, 784, 1386, 1620, 1429, 1015, 834, 1114, 1156, 853, -185, -1391, -2527, -2100, -513, 220, -21, -457, -806, -575, -433, -643, -1344, -690, 1054, 2251, 2658, 2486, 1857, 952, 68, -712, -603, 21, 378, 778, 868, 824, 513, 147, -81, -681, -1737, -2407, -1740, -855, 37, 504, 629]
3101F29j58P15c28j565j77j97Q54P06J90N9R3k4k38k19j11J77b09A56L81j25j47
3080B65J0J01M44K31j27l26A30a04p4l00k95K01c0gA60K43N5L7j60b46n60n95
3058a401j48M61q2J58k13l90O3l30r24m76p03j73L59P41J119P84K19n83l00J8
3038a801L31M02d06A50K51j21c21p08k13m28L01O04rj19l94k58J59N32M18a16
3017B05lJ5O2J4M5M0A11b20q9M7c4j72o14Qa84C66L50L0L31k19C84L55N68k2M77
2992A762k19l18J78m13m25j74K13L47J43l48C9e51J52F98J217pF33i87j271j386
2972c644M43d35B82P89K01j68l16r4j91K78M57L91j20J52J1m88E09b05r8p43k06
2951a252k53j63L22N73b33C59M29K9j79A2g62p34R0N49J0l45o60j41f13E71N83
$$ y = [629, 471, 1186, -328, -1893, -2070, -2267, -1413, -707, -517, -458, -365, -389, -627, -846, -957, -780, -209, 156, 537, 412, 265, 275, 376, 820, 1051, 924, 598, 130, -104, -178, -478, -773, -572, -30, -7, 160, 403, 458, 495, 335, -246, -806, -1401, -1549, -1088, -1170, -1012, -1225, -1615, -1552, -1882, -2806, -3282, -3985, -4158, -3799, -3058, -1939, -1155, -936, -1519, -1819, -1801, -1470, -1068, -406, 150, 401, 280, -321, -1029, -1242, -1670, -1369, -765, -774, -893, -1287, -1545, -1386, -854, -436, -116, 205, 202, 217, 279, 293, 338, 378, 111, -220, -309, -262, -34, -206, -820, -812, -184, 366, 716, 746, 1077, 858, 384, 739, 1307, 1285, 1762, 1543, 1225, 1403, 990, 565, 391, 604, 951, 1094, 746, 39, -551, -399, 698, 1915, 1908, 633, -987, -2258, -3644, -3201, -435, 282, 1071, 1272, 1104, 788, 694, 503, 781, 1238, 1629, 1509, 1661, 1672, 1184, 509, -205, -303, -1046, -1252, -1505, -1668, -1346, -773, -233, 359, 788, 817, 638, 12, -762, -1496, -1406, -857, -847, -1192, -1852, -1993, -613, 571, 1154]
2930A154K3k85b1j210j022R39L63L38k7o7N4G9N34K41j27B29c58m85J17a34H90
2908A806K646J115Q2o95B087a687J22c72g2C58f12o66e99H18J126P91O59k59j037
2889B098A011B46a06j72K8E74J11m8K41M44M22J74J861A031A90e40m28M25A34
2869G92L05lr9k02C64A26n8M57M25K50K22J90N58l24l13l86E65a28o70m37m26
2848a661L05b43I26P69Q1m52E77b65lI4M51M10N26k50l10C32A66M1d3o76q96l69
2826a984P13K17k64o64j006o61r79P96a162A75J100L76K76n64j46B42e90Q3E2
2806A82K58g8j41a9D10N27N50K55l69m49m01A72b79j79F9M50J7A86b44n72j73
2785i89j46K77g7G18N76K53n0j69l08C92d58C72J073L22k94o12A82N07M0C26d98
$$ y = [1154, 1177, 892, -21, -1231, -2253, -1314, -951, -613, -640, -707, -653, 79, 613, 854, 727, 229, -358, -843, -726, -134, 890, 1806, 4452, 5567, 5649, 4954, 2087, -1687, -1565, -372, -72, 358, -612, -1278, -599, 818, 1944, 2735, 3394, 3135, 2098, 1011, 246, -106, -278, -250, 574, 685, 637, 878, 1322, 1744, 1918, 3779, 1031, 190, -540, -968, -543, 134, 792, 1097, 1094, 995, 793, 364, 126, 68, 525, 950, 1200, 1422, 1612, 2170, 1846, 1533, 1147, 565, -128, -798, -1235, -1661, -1356, -243, 926, 1695, 1776, 1324, 577, -265, -268, 94, 545, 955, 1481, 1231, 921, 332, 166, 207, -43, -719, -1615, -1984, -1271, -1054, -1318, -1982, -2988, -3649, -4628, -3832, -1162, 175, 1275, 1651, 1927, 1363, 1217, 242, -590, -507, 52, 182, 440, -78, -219, -19, 410, 937, 1487, 1742, 1373, 924, 523, 172, -279, -458, 69, 519, 536, 186, -244, -816, -989, -1135, -858, -77, 718, 1294, 1547, 1497, 1328, 1020, 392, -458, 372, 1445, 1767, 1473, 861, 182, 689, 729, 326, -498]
2763a189o81L85O67N6j3j97l7M16B01P80N47J41m24D30c58n86m49K53c07a8k6
2742d4q2j06M2B0M93P02P70Q13o61q29C04e47p82k73L06f00C88J048Q15K02k50
2721B203m87m49j87k17k65j95K01K44J47L01l19b48j08l58A57P33m09B20M42m6
2701F16a452o56l19L30M89M42N58J06J73n7j48or9R0e8G25L03J23l19p7m9l2B04
2677c44m59n3a51F77O52K33o05C85A5N9R20J390R56N13l4k59m8j23o20n96l12
2656A861n80m59D6d84j71J44a75j02o19q1a89I4i48m52J82l92N11e49J20k69n84
2635a282l95m98o72K02d06l32K94J47A35%b95n89p62p64k96M48R27b65A094J336
2615B430J241M07j49j562H47a11o11m13J34L3L65E21R31O54M15N58Q01j483o86
$$ y = [-1189, -1870, -1485, -818, -762, -775, -972, -1009, -593, 201, 981, 1528, 1669, 1245, 430, -358, -944, -1393, -1140, -307, -18, -44, -126, -232, -190, 20, 513, 1215, 1985, 2798, 2137, 1308, 304, -547, -1329, -1602, -1296, -600, 388, 1436, 2251, 2453, 2203, 1716, 1267, 1080, 863, 598, 403, 604, 848, 995, 1296, 977, -248, -356, -714, 157, 890, 481, 220, 662, 616, -1452, -2108, -2427, -2097, -1608, -1166, -608, -502, -329, -386, -534, -540, -639, -549, -58, 725, 1028, 1151, 832, 755, 706, 674, 204, -344, -803, -856, -151, 677, 1329, 1562, 957, 385, 15, 74, 994, 2384, 3340, 3853, 3819, 3560, 3512, 3389, 2769, 2173, 1861, 1281, 822, 46, -484, -655, -511, -175, -277, -896, -977, -189, 94, -948, -1400, -1218, -1610, -1099, -549, -429, -698, -1282, -1677, -2175, -2847, -2645, -406, -738, -444, -297, 135, 135, -295, -884, -1646, -2410, -2706, -2258, -1331, -265, 1094, 2430, 3671, 4078, 3929, 2367, 847, -111, -722, -1135, -1001, -968, -603, 521, 1452, 2106, 2521, 3079, 3880, 2397, 1711]
2596A711m61l64l34j33l7J29J06O72M55j2m65k40jM94O57J106J522k249J95J235
2576C986J312J30m33m52A203n46A94C5K00J3b41l06j15O0K59g6C7b63p21o66g38
2554C06K46k28q6b0m13l55l38m01m06l30R7M49h36a55A51h6j69j51b5A9b95l10
2532f05k63j11M59B17M36J1k55r7gj5B69K32j49j15j08J95L90m3A85c72l42L14
2510d00b3A26Bf74l04m48c18Cd38m49k12n9K14N9K09A2Q09M25k17B89f62j171
2488a833j144p0J405e70I1J60N6k6%Q@d01l13m36Q1d01F07J16Q3q0j84j22A21
2464c16J00Oq5j22j53J7G4J058Q98L56j48p30E72a58o27j81n8l06k17L5j14J30
2442a496N69B88J240O30m6p48E12f28r42f51a8E74K52j12C17A5e53l96l93m61
$$ y = [1711, 1250, 886, 552, 419, 382, 511, 617, 1289, 1744, 1732, 1267, 1027, 1026, 1520, 2177, 3283, 4805, 2556, 2751, 3986, 5298, 5428, 4995, 4543, 1203, 657, 194, 35, 235, 248, -241, -547, -662, -602, -343, -76, 37, -263, -984, -1650, -738, 306, 552, 324, 238, -20, -433, -788, -1126, -1527, -1933, -2263, -2166, -1717, -836, -155, 151, -86, -255, -406, -25, 19, -295, -605, -868, -979, -520, 217, 653, 664, 409, 312, -7, -22, 269, 501, 352, 237, 129, 324, 714, 671, 185, -372, -714, -400, -23, 126, 2, -674, -978, -1426, -318, 3, -438, -887, -1099, -1158, -944, -885, -676, 12, 821, 1246, 1029, 289, -662, -1833, -2977, -3047, -1642, -570, 91, 251, 307, 281, 281, 289, 0, -401, -714, -1150, -1069, -401, 607, 723, 806, 726, 542, 420, 121, -316, -216, -210, -295, -417, -570, -553, 74, 1132, 2030, 2386, 2238, 1508, 572, -158, -785, -966, -1024, -1330, -1547, -1512, -1626, -1496, -927, 288, 1528, 2158, 2112, 1364, 512, -628, -1570, -651, -18, 574, 826, 714, 317, 15, -553, -949, -1342, -1803]
2422a803m09p9K41O03O68b43B0L14m7c10j034n09j75O86K30J00K21j48q3P7K32
2401g13K59a59G0A0@B45f3m74p37N33A73Q19J025J063N90j441q34C72h10j112
2381a922j691j240a795O14N80k19k23m24l48p25O65i30a60B85R6A78i4m77o43
2362a214n68k73K74O72L91j6r7o4R2L96J91l17p77j172Q57d10D66j44b10k91p44
2341a245J4B11R60N63j08m28n20A73i9m92o97m82j45R29a9H13O25J07l08q8Km04
2319G47C17b80o17j91L28K14K23A9K57P8L59Ll15a1n54m00J18c23C38K82k7A16
2296b16k55j03k9R9j84J98J31R9n0n6q8K4j46m7f1k57j48o9k84L36H06J064K5
2273A895l56n34C17C1K15I2J66J00J89l3A40b03k26j24K04J39C2K91K78K1j68
$$ y = [-1803, -2212, -2291, -2050, -1447, -779, -243, 20, 334, 287, -310, -1344, -1853, -2028, -1342, -1112, -1012, -791, -939, -1022, -945, -713, -454, -159, 70, 10, 0, 245, -63, -537, -1274, -741, 173, 992, 2017, 3080, 3670, 2229, 1395, 372, -810, -1922, -3613, -4853, -1795, -1181, -601, -820, -1043, -1467, -1815, -2540, -1875, -930, -160, 285, 381, 178, -94, -571, -1214, -1782, -2055, -1781, -1109, -718, -734, -831, -895, -803, -407, -216, -533, -1310, -2482, -1625, -410, 466, 322, -210, -501, -1245, -1231, 211, 1171, 1734, 1626, 1198, 678, 173, -99, -591, -1288, -1770, -1915, -986, -19, 813, 1438, 1545, 1237, 1149, 1151, 747, 317, -280, -897, -1088, -760, -546, -323, 19, 276, 354, 713, 716, 401, -11, -565, -965, -847, -323, 338, 620, 593, 116, -216, -471, -574, -603, -504, -688, -490, -359, -260, -310, -366, -454, -430, -576, -623, -61, -318, -466, -535, -819, -483, 806, 1870, 1895, 1539, 1005, 317, 31, 246, 92, 258, 358, 547, 514, 140, -203, -429, -553, -349, -210, 32, 323, 601, 622, 454]
2252D54j40p8J97L45l83a13n93n94n49j29K40J56K30N42H0R06M93J60N9J01L8
2231A837n9k61k80m09j63j38B34e6j46rA9N67K69J9l93k8K04K78K13K47ol41m80
2208E68a29r30q23O01b89H00P15M42j39n87C93d27q84m64L71M05L61J71J68j70
2188d69m64n40k60Q6K25N84P6J98J96D4O17O81N48M05J64l72n57m18n0L84O01
2167B047Q18Q56J69A2i41j383j362R55J170f91J88K15a27d6j06F2O42O27N2j56
2147A227m29K3K63L1J40l0l18D03a19o05p76r73l57R20A76J089L97m35D99g2l08
2126c80J82C69O94M17j34m71d3r69p66r0h60a19E35N8Q5J59j42B05e58m82l24
2105a364J50M95K88g9D8b65p74q29o56m94R73K86K41g10A57Q36K89Pl46j95P2
$$ y = [454, 314, 236, 433, 778, 395, -113, -706, -1300, -1849, -1978, -1738, -1582, -1352, -810, 80, 986, 1479, 1639, 1698, 1799, 1837, 1778, 1517, 1237, 828, 665, 527, 234, -56, -202, -211, 19, 586, 855, 874, 481, 453, 657, 935, 1148, 1395, 1389, 1048, 568, -129, -1059, -1882, -1281, -289, 800, 1515, 1957, 1818, 1231, 393, -427, -1311, -1775, -1404, -999, -638, -467, -299, -469, -933, -1473, -1733, -1647, -1422, -838, -762, -564, -368, 44, 661, 1342, 1890, 2295, 2459, 2087, 1530, 1112, 1062, 1446, 2047, 2865, 3721, 3890, 12, -941, -2324, -3686, -2731, -1561, -691, -503, -288, -127, -46, -152, 62, 704, 1331, 1383, 1227, 798, 821, 1084, 1115, 1255, 1225, 907, 403, -119, -724, -1500, -2473, -2830, -1910, 176, 1265, 1662, 1227, 499, -72, -380, -198, 369, 1063, 1480, 1346, 875, -43, -1012, -1778, -1868, -860, -119, 535, 593, 678, 837, 695, 205, -558, -1040, -1364, -1214, -719, -431, -79, 48, -265, -1039, -1868, -2524, -3018, -2045, -1759, -1518, -710, 157, 993, 1282, 1289, 943, 748, 820]
2084H20J22J09D74d54r57n90j42K50N47f11A88O23L68k58l11C9g85r61p87j06
2064b639J255B57R98J613J217k66o18F40k52J56N53L84P2n31B53c46j25h7D7e9
2043A55K47M82k89PR24J090M01j58j097B66h48m47a77A132N47K28qJ174pK61o68
2022B659j282j40L6J92Jk53m82C53a03n8B30Q21K42r4n13G8e12m22K18b49A67
2000A46c9j55m32k83m71m47J83d37G84M96k97B02g22n70N42A69Cc86l22l41J30
1979i19K89K75a9A17K8m9J72K93k2A58c08n22m13O3L17A39O3J25lD9c30m47j06
1956h83J93b24A41K27QA75a74k10j19O1C7N13L56J0D29a30n07l62k02e31D47R77
1934A424Q94J288J514l07p16A485n44B23a057o51k18J92K43L06L73J28k05l87
$$ y = [820, 942, 1051, 474, -454, -1411, -2001, -2143, -1893, -1346, -611, 188, 811, 1179, 921, 610, 39, -785, -1746, -2533, -2639, -1384, 257, 1255, 2868, 4085, 3819, 3201, 640, 388, 544, 1097, 1481, 1553, 1022, 253, -346, -471, -87, 47, -59, 155, 402, 884, 595, 602, 1526, 2616, 3017, 2859, 1762, 266, -848, -1295, -177, 1132, 1679, 1907, 1899, 3073, 3066, 3327, 2659, 1377, 1237, 1273, 1465, 1466, 1213, 731, 353, -103, -161, 230, 1051, 1293, 1199, 686, 78, -512, -934, -716, -249, 167, 146, -39, -194, -626, -909, -1380, -1827, -1644, -437, 784, 1280, 983, 202, -722, -1292, -750, 169, 3, -386, -708, -1049, -919, -630, -355, -19, 117, 145, 96, 268, 561, 539, 158, -308, -830, -1243, -1180, -863, 139, 202, 327, 324, 49, -330, -777, -883, -690, -224, 141, 368, 376, 175, -174, -384, -503, -442, 37, 550, 906, 916, 429, -130, -637, -999, -1201, -531, 447, 1424, 2318, 3606, 5120, 4813, 4097, 1485, 941, 223, -1057, -1708, -1926, -1734, -1491, -1185, -812, -684, -889, -1276]
1916a276K56B77Q59L61k83E10h9n60lj62j03j70n2J54K06C27j25a066j122J058
1896a130i7C66K5a90o73p21m04a09E08B47b91l79n5K07K22N4j69m48K22f1E52
1874I71j04B71A8N17N55M29m1n82g0j102q48m26J64N80rn4J57P54G68L99M5j30
1852A082m48E9e92k14J33e4H88J294L63L68m34n96q00E8e21k68j9J04Q4L05k58
1831e73l73p06o29q82l94J24L71J022O61L03Q6L7O0j00k33J13J51J85j22R8n1
1810h52a63G79P50P47J03r0m98l06n51C40b8A20L19M12n4k42k57B4c0H0J09J54
1788C43M2k9jJ79J25J35m5r5C12A44c5l79j77m19k86j54j38K02N17c44J12k42
1766d74k26m9c43F6A7b69m89m18N46i6E91P80L54l94n80i5m80m32p7K37A27R04
$$ y = [-1276, -1020, 277, 1136, 1497, 1214, 510, -89, -649, -652, -814, -917, -1087, -1139, -985, -779, 327, 202, -1066, -2188, -1130, -97, 366, 391, -190, -863, -1584, -1988, -109, 508, 247, -291, -670, -725, -518, -296, -242, -411, -859, -637, -61, 552, 971, 867, 271, 18, 535, 1090, 1519, 1478, 896, -70, -1172, -2020, -2446, -2282, -1702, -1711, -1765, -1608, -854, 768, 1167, 1212, 1082, 634, 59, -592, -806, -673, -54, 888, 2182, 2545, 2913, 2479, 1883, 1083, 58, -521, -789, -808, -704, -620, -315, -573, -946, -1652, -2281, -3163, -3557, -3433, -3062, -2040, -1379, -1076, -990, -953, -893, -993, -1226, -1113, -962, -777, -899, -801, -852, -163, 779, 1529, 2276, 2379, 2289, 1791, 1485, 934, 340, -28, 120, 439, 851, 797, 555, 298, 24, -30, 80, 189, 343, 385, 356, 355, 534, 659, 794, 749, 654, 312, 144, -35, -414, -591, -1010, -1296, -1450, -1588, -1386, -869, -344, -232, -474, -700, -749, -343, 66, 17, -269, -758, -1176, -630, -96, 591, 1371, 1725, 1331, 751, -95, -575, -1007, -1084, -847, 127, 1031]
1744A031K52j3J08K61L02k2o62C31e40q76k84J42N22d49Q0l43n84p97o13L65e87
1722G72O00j35n88H0c00o26q89K1b02A258N82j50p60g6l68b2E54L91K78k00l94
1701F29k86j51J08J6n3b4k58k16j0a77C48Q27M20P3K03K36m21l40D93d07p93n51
1679a751j74P09b23H34Q24P4m48o35a1F2Q9a078n27r51q73J563P20q2j3m54K42
1658a453K53L53K39b55K9l75N2a59e4l87l26j79L34K64O3j90n07k74j44j17q0
1637a597PL50N05L66e6Qo71m83q30l69h14c62H68Q6j6A46e63o7E58M90n3l32j52
1614E11j94e39p89m29L1M72p7d62E48Q17M35o2k21n42C16a66q83m35k57e94B88
1592A159l5C33a224q80q29N64O95P13J07O7m25J06d48A31L06K53B99b6l70M6c6
$$ y = [1031, 1283, 1270, 1378, 1639, 1941, 1919, 1257, 331, -540, -1416, -1700, -1558, -1036, -449, -369, -712, -1296, -2093, -2706, -2341, -587, 772, 1372, 1237, 649, 80, -300, -926, -1815, -1794, -202, 1258, 1840, 1690, 930, -76, -444, -22, 554, 945, 1223, 1023, 629, 343, 192, 300, 316, 263, -24, -282, -498, -508, -177, 348, 1175, 1595, 1668, 1871, 2107, 1686, 1346, 493, -407, -1200, -1751, -1925, -1216, -223, 834, 1658, 1732, 1284, 649, -11, 62, 151, -1078, -1605, -2556, -3429, -1866, -1146, -1228, -1241, -1695, -1453, -1200, -847, -608, -255, -226, -601, -549, -159, -54, -441, -767, -946, -612, -348, -285, -475, -982, -1256, -1400, -1517, -1597, -1590, -1240, -735, -369, -56, -48, -719, -1202, -2032, -2401, -814, -362, 868, 954, 938, 146, -563, -630, 558, 1048, 995, 663, 511, 317, -539, -1328, -1757, -1726, -1254, -1331, -462, 548, 1365, 1800, 1738, 1517, 975, 316, -166, -1049, -1484, -1741, -594, 288, 1159, 1124, 333, -1224, -2104, -2933, -2369, -1674, -961, -854, -787, -1212, -1106, -448, 131, 437, 690, 299, -26, -396, -350, -36]
1570C54L32K76J67k12C00c75l54l40k62k31O0M75L53L33i7D6P09J11j28J06m0
1549H04P3j09J32l90h3j071k94N8N71b29C69L29L5k28B47JJ69O2J59n1j00K95
1527G82l39r3r5a15n26l79m75j14J92c52I62O64K39Q3N3J11q30B71f19n64j84
1506a367L82J61j29n94p24M36P84C72O91l91e9j146j173n89O00R57j23k65o35
1487b433N00N00M16K06k1k26l46p3J58L77K96R4k10m35j40Mk45o16j115r37j134
1466e380b052K05d27k97o65j131m33a309c85F55M35l41J9l8j50B74a76m98n69
1447a243m25k73O31f9j35p22j095k69M41R09a16B38e6E4M17K25l06c82r51j735
1427c068p57a649GR92k09@i54p15j91L06K73jj42O6f04A39P59K52l39A89h36q22
$$ y = [354, 686, 962, 1129, 917, 300, -375, -729, -1069, -1331, -1562, -1502, -1027, -674, -341, -97, 46, 755, 866, 738, 844, 804, 877, 768, 900, 510, -83, -1154, -1448, -1390, -819, -229, 369, 698, 733, 505, 247, 248, 417, 479, 638, 587, 487, 782, 443, 350, 255, -115, -641, -1020, -1495, -1609, -1417, -352, 962, 1626, 1865, 1948, 2001, 2112, 1282, 271, -619, -1183, -1367, -985, -824, -953, -1547, -2271, -1835, -1051, 372, 1063, 672, -59, -1205, -2378, -2967, -2367, -1410, -1533, -1798, -2433, -1933, -1433, -1017, -811, -832, -1058, -1404, -1477, -1319, -942, -646, -552, -762, -1197, -1337, -1333, -1578, -2194, -3309, -4246, -5380, -2052, -1847, -427, -724, -1389, -2520, -2953, -1309, -385, 655, 1090, 749, 768, 730, 580, 274, -176, -674, -1243, -1668, -1941, -1310, -69, -204, -926, -2021, -2290, -1849, -940, -116, 238, -56, 54, 471, 696, 390, -382, -1333, -3068, -3825, -1649, 7, 999, 790, 0, -954, -1669, -1860, -1554, -1281, -1282, -1424, -1358, -604, 139, 898, 1150, 811, 189, -836, -1658]
1405a658l34R2i25B04J084N38M9n93D73g44p54J79N35b49B42K42B34g5m03j14
1385e92b73D53N48J61m42G5d01m79l55m27j38J86L69K32p6O2K28K54k41N4m47
1364a179j88Q0k3k83m23k54J66R54E28J445J699J996J391L39n49j720A638D53
1345H83O65l02B94f97L12m06j66L16K90A05O21q8l12a63k86H4J036J048Q83l6
1325C015j124p07B42a57p69o87g11Mm23m98M46N77G0K21q3b02A58J086P5E87h52
1303a786r56n31L2L98N98J039c8I00N10J9m74B25e51q39f71d9A94oL67K20L06
1282A081P2l52B24c32n53J62J1O9P1j28c50r0j34M7l4a25B66J02A53a70j130j25
1260a425R9M23c80D86Q18L51K60n81l37m14J17A9i55l68p5M98AN66L70k76N7@
$$ y = [-1658, -1992, -1900, -925, 204, 1288, 1826, 1875, 1282, 473, -744, -1498, -1319, -784, -249, 242, 484, 234, -75, -478, -592, -273, 453, 1001, 1162, 720, 75, -401, -880, -1235, -1662, -1800, -1614, -1245, -1013, -1089, -1027, -799, -545, -786, -732, -1179, -1367, -1287, -1310, -1593, -2016, -2270, -2104, -1150, 528, 1973, 3672, 5668, 7059, 7398, 6849, 5129, 1638, 453, 883, 1548, 1246, 294, -697, -385, -791, -957, -641, -351, 105, 726, 638, 326, -163, -449, 84, 1120, 2168, 3051, 3015, 1891, 1184, 242, -157, -926, -1613, -711, -707, -1130, -1628, -1182, -605, 70, 291, 208, -202, 158, 1244, 1319, 587, -852, -1786, -2742, -3273, -3241, -2843, -2245, -1206, -38, 900, 1410, 1429, 955, 225, -551, -1390, -671, -49, 194, 188, 555, 775, 1081, 1153, 801, 224, -332, -885, -723, -712, -643, -572, -700, -350, -440, -574, -527, -561, -125, 266, 368, 153, -170, -1300, -1425, -1326, -903, -380, 486, 1304, 1655, 1915, 1334, 997, 583, 700, 19, -955, -1323, -1398, -900, 1, 567, 937, 661, 718, 0]
1237f00m94l19O67A91L41k38c54p31p45K81L05N23h1D67M00m1B88e42q81M15c15
1215b46p5j10j35o63j53K34M34M2j32m46k44j31K85C4Q33O63J86k94D17F3b75
1193b36C53M5K4q3a72j16F33P49L17J37J85k56K04L36J03l2j56m4k80o40C14f85
1170a222M48A65O30Q68j86G28a39p15l45K36a31H16O69L71l58E73F0a59L7A41
1149A68b34j652O06f8j04r50j033m55M02K31J22M88C23J302M57q05C96e66o51
1130a217m10R0N25b46D55K79J8k40E2d86m67J12k74K62d23a77A63M51k38b36r88
1109a224j512m98J049P27L44l0k53m08m06J38i01F83P28J20M19K01n1n77o04l62
1089E57M7L31M34M88j72k25E80c91r09p70N02f28C70N94K63k37C48d33o05j50
$$ y = [-600, -1094, -1413, -746, 191, 532, 294, -354, -1085, -1830, -1549, -1244, -721, -81, 467, 867, 826, 288, -542, -1423, -1008, -315, -246, -321, -431, -566, -1229, -1382, -1148, -714, -672, -804, -1250, -1494, -1625, -1340, 34, 867, 1530, 1716, 1422, 417, 63, -275, -236, 353, 398, 422, 339, -172, -288, 633, 1382, 1699, 1836, 2021, 1765, 1969, 2305, 2408, 2376, 2220, 2176, 1896, 1256, 314, -685, -1222, -774, 165, 795, 1663, 1477, 728, -139, -854, -1199, -963, -131, 816, 1485, 1856, 1498, 573, 60, -159, -122, 141, 168, -234, -1886, -1280, -68, -172, -1122, -2155, -2610, -2208, -1977, -1855, -1367, 323, 1625, 2082, 1277, 396, -566, -1217, -1627, -1537, -1012, -246, 455, 734, 752, 512, 52, -486, -953, -841, -1115, -853, -423, -177, 163, 614, 376, -236, -1224, -2736, -3234, -2185, -1458, -1114, -1144, -1397, -1805, -2211, -2073, -901, 683, 1411, 1531, 1950, 2151, 2100, 1523, 919, 557, 604, 935, 1369, 1857, 1685, 1460, 580, -391, -1300, -2070, -1568, -628, 370, 964, 1227, 990, 348, -433, -1038, -1188]
1069a188K87b34D83M74K29n1k44l63a54q52r20M87K02L1l98L47K6j66J1K38k4
1048a172k76k65k88k71j110l07K18Q88N46J10l45j032R86k85k622J755a667e98
1029E5K20g7o52p70m31r5K68K12K36J83L42J8K6b63E91N03L79K32j84n28k94C15
1006B05A5c06A66L85M18K53p2j32k37k46j06j0j73i6o3o1B03L31J69k08B08e6
983b8B62k5j14o0K09J44P0J67J31L79M47K31j3qn33Fa056n92N0M12e09io0m45
959e14p2K86B64N17L79J68jk19k83m08c51p20q67Q39c70d9B55J86c8j291L86r02
937a845P88K49K59K32n66O1K86k45o94A82P72L32J0M36N66L24k72l83k55K03K87
916B202M84l8j042l61n17B94b04n47m04k92m6L18L22K94b48G0K17J86K82P6j37
$$ y = [-1188, -901, -234, 483, 957, 1186, 1135, 891, 528, -154, -1006, -1926, -1439, -1237, -1206, -1604, -1257, -1231, -1397, -1386, -1148, -1172, -1448, -1713, -2001, -2272, -3382, -3689, -3471, -2583, -2037, -1927, -2272, -3304, -2318, -2603, -5225, -3470, -1667, -598, 55, 275, -77, -729, -1499, -1930, -2025, -1757, -1545, -1309, -1126, -784, -766, -740, -263, 591, 1094, 1473, 1705, 1521, 993, 699, 315, 205, 15, -306, 166, 551, 969, 1222, 1150, 1018, 781, 535, 429, 419, 246, -96, -159, -220, 203, 534, 703, 495, 208, -56, -28, 262, 237, 123, 63, 272, 416, 486, 653, 784, 1163, 1610, 1841, 1828, 1820, 1287, 6, -1056, -1648, -1598, -1186, -509, -9, -69, -514, -586, -300, 264, 781, 1160, 1328, 1327, 1108, 825, 417, -351, -1071, -1938, -1099, -370, -49, 255, 441, -38, -1329, -943, -1845, -1057, -808, -549, -317, -883, -822, -536, -781, -1475, 182, 954, 1286, 1296, 1732, 2298, 2622, 2350, 1967, 1712, 1915, 2202, 2686, 2648, 1606, 1245, 728, 294, -204, -751, -1155, -1447, -1493, -1175, -853, -559, -248, 70, 287, 473, 755, 831, 694]
895F94B66c73o89m1F46K273N94j92j218q64D89a73k67K4A20M58B84g17q50I82
874d2q50q53g13B33P11K47m49a84p59B1J398Q56K41p75n49l51q9K19J93k41C76
852d28c9A7a04A25c31o95n38l08K48P59a13B42j01e49r40f54C14Q11J040Q25J032
831D022k84j670o67F17a60p82n01j52P9L24L27J43j23m53k87p6K14L92M39a20
810C67K32J58J14J57J62Q2p5l84C12b22j25E08Q09K57j18l31E60k58K01J93J41
789H37n6j73j69I9e88J42o59j40M36a72A01m3a85l89j2b93H8M44L36N1k83k38
767C98j62l4K53K38kk04B21J62d81j042j656p28a674G7K04N1Ca62j95k10J81h9
744D10L05M81L50K06L345O27m23q27b32F59J61K23L85L81q3l92F55a34q16n96
$$ y = [694, 266, -373, -1062, -1103, 646, 2919, 3513, 3321, 2103, 1239, 489, -173, -440, -416, 120, 578, 284, -717, -1567, 982, -42, -892, -1745, -713, 233, 944, 1191, 742, -184, -943, 21, 1419, 2275, 2516, 1741, 1192, 841, 752, 971, 1164, 923, 376, -428, -39, 17, -104, 125, -331, -1026, -1564, -1872, -1624, -865, -113, 242, 141, -549, -1489, -654, 314, 1125, 2165, 2990, 4022, 3738, 2068, 1401, 617, -160, -942, -1443, -1595, -1516, -1192, -865, -722, -845, -1298, -1585, -1661, -1447, -1055, -616, -120, 367, 599, 757, 871, 1028, 1190, 1272, 1197, 813, 312, -222, -347, 508, 1317, 1574, 1456, 1125, 560, 302, 503, 696, 837, 781, 608, 439, 99, -588, -446, -1105, -1245, -809, -172, 101, 58, -185, -574, -586, -293, 88, 532, 868, 919, 636, 398, 236, 202, 455, 693, 691, 487, 221, 383, -481, -1523, -3179, -3907, -1674, 77, 281, 332, 3, -162, -357, -567, -386, -89, 410, 715, 1196, 1546, 1752, 5097, 5724, 5301, 4474, -232, 659, 820, 1043, 1428, 1809, 1726, 1334, 655, -134, -950, -1546]
724a546l43L20O10c21A26K11j01b04p46q03j031p54K77J591b61A100J350J071
706C521j326j085b50r11b66E81K3A79g61n75m18M75f18a85B23L19%q7j98b8m52
685d80j83b37A89I4Hb49p1A3a74f8F1K41K62k4L0B13b35m3B62P04L59K25j77n48
661H25D02a53p05o6c67m41m58j049j288o32m90P80a169F11J016j12n82F7a72J7
641a55A53M3r0a15p9G0N27N32N37N41R56R62R12l37j566A066B07e72j6e3E87P11
619A298L35j76n90C92A42L79l0J76l4l3N8L44K91j27n12Q54M82k73j71n41j46
598H59j44j12J06K49k18j04k25F1d28p59K14C6Q18N98M27j0k05L30E18B11L20
577E31q9Hi38m33j74L38M74a81A20c3l95l34b92G58P32J21l09m01B61b83n08j24
$$ y = [-1546, -1889, -1569, -959, -321, 126, 337, 236, -204, -950, -1753, -2784, -3538, -3261, -1670, -261, 1100, 2450, 3521, 2195, 1110, -250, -1161, -266, 581, 604, 179, -761, -1336, -1754, -1279, -618, -185, 223, 542, 542, 455, 257, -28, -480, -663, -237, 189, 94, 8, -249, -320, 13, -174, -68, 61, 302, 564, 540, 570, 213, -235, -278, 262, 966, 1325, 1550, 1373, 825, 402, -153, -858, -924, -367, -808, -1266, -2315, -3603, -4235, -4725, -3945, -1169, 611, 1627, 1515, 933, 67, -172, -155, 153, 196, 106, -115, -194, 70, 597, 1129, 1666, 2207, 3163, 4125, 5037, 4700, 3134, 1066, 207, -572, -588, -53, 587, 1298, 1633, 1457, 867, 392, 142, 521, 491, 667, 633, 600, 658, 1002, 1293, 1166, 654, 1508, 1990, 1717, 1546, 1005, 859, 715, 603, 709, 958, 740, 636, 411, 61, -428, -1187, -973, 36, 854, 1452, 1879, 1869, 1664, 1994, 518, 211, 531, 442, 8, -938, -1371, -1545, -1207, -733, -181, 120, -33, -428, -762, -292, 758, 1490, 1611, 1302, 901, 261, -283, -791, -915]
555i15j28j56k63J25L89J67j0o0j20J4O3k7P5J31J54C58j26a17o55l04r19l87
533b382r8K45O41N43M39a94B22J66A32f40o77m77j96M85f03C66Q50L90k53m62
513H91C10b56j62k0j93j92n1JK53b21J04B7A0e9j40j57j23n01l42r0M48c24D49
489F32k75d99j48A91N24L2k68A55b59j06J39A2K15K89K00P7k61b00q91c09A86
467D02r2h1m31l38n27j84JL81M33B34J026N48N65Q42J164M60J93r93H73l98j6
446D59o7J39R6o8K8j12B21c02l95j43L39h1G0b51n72l06e51C46R46N48L04l55
424A789o65D95B10R2k5G0lJ83N79O48L7k47n45a55r06p54n98j43N44g93B67P08
402I75J72j62D58a27n58m49l9l32n04o10R21d37E02Q29M68j26p13A83d63l27l85
$$ y = [-915, -1043, -1199, -1462, -1337, -948, -781, -791, -851, -971, -957, -894, -921, -846, -715, -561, 358, 232, -117, -772, -1076, -1995, -2382, -2480, -2235, -1594, -1051, -612, -194, 222, 388, 132, -640, -1317, -1794, -1990, -1505, -603, 366, 1216, 1606, 1353, 891, 310, -256, -418, -438, -631, -823, -874, -873, -620, -221, -117, 27, 10, -59, -199, -356, -479, -980, -1322, -1412, -964, -324, 449, 632, 357, -499, -647, 191, 715, 747, 479, 155, -259, -365, -226, 12, 227, 516, 716, 793, 532, -200, -1091, -309, 186, 402, 310, -81, -512, -850, -1377, -1561, -1560, -1179, -746, 234, 1260, 1808, 2373, 3215, 4379, 4839, 5032, 4039, 873, 475, 459, 392, 531, 627, 559, 587, 475, 221, -302, -697, -840, -501, -81, 70, -251, -823, -1129, -551, 346, 1292, 1840, 2144, 1789, 1124, 495, 210, 302, 277, 70, 67, 250, 829, 1477, 1514, 1267, 722, -155, -1061, -1815, -2413, -2556, -2012, -793, 267, 975, 1147, 985, 458, -127, -685, -1134, -1173, -1505, -2009, -2619, -1698, -437, 502, 1331, 1799, 1673, 960, 183, -463, -790, -1175]
381a175o00h14B8N33L91J50L7m99B26c58k22k85N5J37l65o08j515j069j373j128
361f731b747k91J354J23K03L2J9e65C70o1N3J9j76a7o47j24j13K24c37A71J73
340C44K7A12b15l16k51J27J00K51G5N74M12K80L07N7J13Kl84F53h2j108m71P9
318a582M36N61a7C61M8I2f09q65n80Q68A64J365N74k51m02E21a23l34l36R6c26
296B7N79K49L81p1k83B65E1K53J41J71K00K26J27J6D67d2l91a75C86P72Q75K84
274B317j79A017i7j393o59J038DM86Pj20j61D5e47n86l44M66d96c6p6o83m58j42
252a395e77B96L53J1r9Q9N4L93K1L68L10l80j67E96a37n31k31J77K61b21K2l47
230e46p08p61j297q10L53a643A38J100N94m61C88j48E2L15N33L70M0q2m21E5e16
$$ y = [-1175, -1775, -814, 28, 561, 952, 1102, 1139, 640, 226, -358, -580, -865, -810, -673, -1038, -1646, -3161, -4230, -5603, -6731, -2747, -3038, -1684, -1561, -1358, -1326, -1307, -565, 370, 309, 362, 381, 205, -17, -664, -788, -901, -677, -337, 171, 344, 371, 112, -215, -531, -782, -655, -555, -304, 75, 649, 1061, 1341, 1648, 1705, 1818, 1820, 1436, 653, -82, -1190, -1661, -1582, -1146, -585, -17, 361, 409, 92, -609, -1474, -2054, -1186, 164, 1529, 2103, 1852, 1450, 521, -123, -457, -793, -697, -326, 27, 606, 855, 1236, 1165, 882, 265, 51, 304, 445, 616, 816, 1042, 1169, 1185, 467, -42, -433, -175, 386, 1158, 2033, 2317, 2138, 1017, -97, -1490, -2149, -1111, 4, 490, 497, 377, 216, 45, -547, -1133, -1477, -1011, -496, -36, -112, -795, -1253, -1395, -577, 296, 649, 660, 561, 650, 704, 1097, 1118, 1486, 1796, 1416, 1249, 596, -137, -668, -899, -722, -461, -221, -199, -546, -1254, -2015, -3312, -4122, -3769, -1643, 138, 1238, 1832, 1371, 388, 240, 52, 367, 900, 1270, 1310, 1228, 807, 55, -516]
208f81L09B68N31K61j7l78d0m72r2P5J08j29K08k77l45j92k30k35k77R30J47n4
186h75j45l10l00K67M13c67h5A16a21k12m72p81j63O02k70J95j15L77c60a45j20
165b65j92Q4a45A50K39J19j40I9c70j18J27A04Q93M38o7n16k90k29j53Cb09j50
143c59k79o33jP8M87A98L82J83K35j20j85A0f00l33q6r4O5J42J27j5k73k31p7
120a375K08L08L40C8Qd32k09oJ07A27Q06L93j87E29c2m60r2a85O9d0l19J53j43
97c49a65o0a05C8M5a70l56j07J51P5J20p5QA67M16J32j46B49A13j4K58K23J12
74F92j91B43b2n95k75K44a25A10K29K63K08J37m1k41C17H6c0E55N00p3k72B22
51b14n15q06p37a071D48J181O47M52q36b2l61l63l69oD17R56L47O9G39k52D7b88
$$ y = [-681, -372, 268, 799, 1060, 1043, 665, -40, -512, -604, -529, -421, -550, -342, -619, -964, -1156, -1386, -1621, -1898, -968, -821, -875, -1020, -1330, -1630, -1363, -950, -367, -85, 116, -121, -333, -805, -1586, -1749, -1147, -1417, -1222, -1337, -960, -360, -145, -265, -457, -373, -145, 150, 389, 508, 368, 99, -370, -488, -361, 104, 997, 1435, 1368, 852, 562, 333, 180, 3, -209, -359, -638, -1271, -1272, -1194, -707, 198, 580, 763, 998, 878, 693, 10, -600, -933, -1019, -1113, -1048, -906, -779, -794, -1067, -1298, -1375, -1167, -859, -519, 38, 46, -432, -641, -647, -540, 127, 933, 1326, 1139, 529, -32, -492, -584, -185, -116, -40, -359, -206, -349, -165, -225, -105, 38, 83, -170, -526, -633, -482, -407, -287, -362, -354, 167, 583, 715, 569, 249, 113, 99, 357, 580, 692, 501, 243, -22, -617, -892, -648, -125, 110, 339, 602, 810, 947, 906, 665, 317, 86, -30, 555, 1055, 982, 710, 222, -214, -729, -1535, -2272, -1071, 448, 1629, 2276, 2728, 1892, -22, -383, -746, -1115, -1121, 417, 1373, 1720, 1789, 739, 487, 47, -288]
28B99J027L18p87e8q87KK41j48k7n27p44O56N73b85a6j22l7B27K59r5b41B30A00
4c87j79N5m35k92
0a238
$$ y = [299, 1326, 1644, 857, -58, -945, -943, -702, -850, -877, -1404, -2148, -1492, -919, -285, -16, -138, -175, 227, 486, 391, -241, 230, 100, -387, -566, -511, -946, -1238]
##PAGE= F1=25.89129138603
##FIRST=     25.9928259484165, 8223.18227667557, -1114
##DATA TABLE= (F2++(Y..Y)), PROFILE
16383a114L0d51C95O60K7B20i95n40r62e28m43p40r0K48L23L81J23j23m07N96
16363f60b44A8c84n57m80K04d16K7p02j102N61M53c90q87j40L46J38NK45J95k59
16342g47K71B10K80r6A0b47f2A34L19K62K02j71a7j305l65P71k72L2e05A19J8
16321A37M05B08h39q07O98b9E86L03j07N2n9c82n37P7L78c2C00L5J3j2j5j28a94
16297a024L91a40C74K95Rk90Q4L03C04b3k08j76m69o3o26l7o62Q47d82O6j6n12
16275i44k85j68M02Q4j114i34a97O7J6B2g4m5o5k18R5A04N07K19P9k1m29b03j77
16252c80l97K69am27m03K43O9j26j05J34o7J69m7p8K9K11l4m2R5J67q9a45I7m
16228I3d4j88m15n25O2F4J8d48O9A08e37q48k06O83p51d37J32E77Q84D13a525
$$ y = [-1114, -1084, -451, 395, 1055, 1082, 220, -995, -1535, -2497, -528, -971, -1711, -1801, -1553, -1230, -849, -726, -849, -1256, -660, -244, 18, -384, -941, -1421, -1217, -416, -389, -1091, -2193, -1632, -1179, -390, -1277, -1417, -1071, -933, -928, -683, -488, -747, -476, 210, 490, 394, 10, -247, -62, 134, 453, 715, 917, 746, -17, -1322, -1687, -916, -1188, -1156, -505, 119, 137, 542, 208, -839, -1646, -948, -29, 586, 889, 782, 834, 775, -382, -919, -842, -464, -32, 300, 335, 348, 336, 321, 193, -194, -1024, -633, -140, 374, 669, 678, 388, 472, 775, 304, -23, -231, -407, -876, -939, -1565, -1602, -2264, -1417, -482, -416, -432, -944, -1229, -1397, -995, -911, -2025, -934, -197, -130, -114, 22, -74, -119, -184, -402, -307, 104, 611, 830, 909, 888, 459, -203, -380, -777, -508, -1, -428, -831, -588, -519, -645, -750, -616, -683, -514, -561, -639, -610, -399, -433, -475, -380, -213, -302, -145, 97, 93, -44, -232, -647, -1172, -1110, 64, 82, -448, -379, 108, -537, -1385, -1591, -908, -1659, -437, -305, 577, 1461, 413, -1525]
16206a486n25n03j92Q06g53c24C13L79nk5E7h3p6j9l9n79r23n09q33Q84M20m7
16184a804f35A36n9aj88q1l22p7MJ12Q3o9Mn5J96C1M64k4A32A0K78L00M09l80
16160F17B51A9kK75M31N20J22m44D01g6j41R1n2M2m7k59K08l84j68r2N6c46D26
16136E70F9a09m6j77j5j21o8Q1k5j56M0K6q3k56m30k91k23K8M95N31b95A92a59
16112a024j96M34b73a24A37J76G1QJ06b42n63j084n73K7K90R74M17o90r47J161
16092a230d72A35O3m3a20m30p75k291j076j97m4R07J351i61F92J631o1D37c34
16072a182j080l14a086M5d97a56d1D43L94J91l86k11N90D69a089M98K62o6j14
16053e09j52q0n6K89a7D28m6b33o36o38l24j01M56b53B85r0A6a88j3d2A96J36
$$ y = [-1486, -2011, -2514, -2706, -1900, -753, -324, 313, 692, 687, 662, 57, -83, -159, -178, -217, -796, -1719, -2228, -3061, -2177, -1757, -1804, -635, 136, 77, -1, -189, -270, -592, -669, -665, -553, -470, -539, -535, -590, -394, 31, 495, 471, 132, 10, 288, 588, 997, 617, 251, 19, 17, 292, 723, 1243, 1365, 921, 401, -76, -217, -126, -178, -136, -183, -442, -234, -618, -786, -878, -822, -346, 426, 570, 69, -109, -155, -332, -347, -468, -536, -455, -480, -636, -596, -570, -653, -909, -1339, -1630, -1853, -1825, -1330, -799, -295, 192, -159, -1024, -1220, -786, -273, -124, 137, 313, 71, 79, 185, -242, -805, -1889, -2462, -2435, -2145, -1171, -754, -1444, -2391, -1230, -472, 135, 198, 155, -120, -550, -1325, -3616, -4692, -4889, -4933, -4026, -2675, -961, 692, 2323, 2262, 437, -334, -1182, -2262, -2576, -1086, -1041, -497, -156, -41, 443, 837, 1028, 642, 431, 1021, 469, -1089, -591, -329, -395, -509, -661, -741, -797, -508, -17, 428, 382, -233, -869, -1507, -1831, -1932, -1476, -253, 285, 195, 16, -188, -201, -42, 196, 332]
16031C32j45c68p29J93L56Q7b00q1n00p04n73l24J6K45K66L55j63K11n7k66j56
16010a931k4J63J87L53L64d36n92j060q83r16j382b014L34P2j3J95N74J31l26
15991a047k23l20m54n90k95J9a293e57N9j52l93M44K60I52J284J118m99o68q94
15972A293D44F2j2b95rn17m70j25N4f70a37A02k0mJ8M61k6b7r21J5C55R10n10
15949G55L4k05k72ek80k00j8K51J01l95m42k29M35a09D93r0a62q85p34q21r4O37
15927b059R52O9q62lJ07J86L55f15R2k89n55j33L80b79a0j034l44k56O74c85M6
15906c39l99k38k81p30k08j01k76m55J28P34P03L71M16c26N8j16j44l30j92K08
15886h42L43a47P1m21j18K40A26J3R6g9p20j375k64R12g9H93N18J20l61D49g24
$$ y = [332, 187, -368, -1097, -904, -548, -461, -200, -281, -781, -1485, -2058, -2382, -2366, -2121, -1855, -1500, -1663, -1452, -1509, -1775, -1931, -1955, -1792, -1605, -1252, -888, -436, -1028, -2088, -2971, -3887, -5269, -2014, -1680, -1608, -1621, -1426, -852, -721, -1047, -1270, -1590, -2044, -2634, -2929, -2910, -1293, -557, -498, -650, -1043, -599, -339, 952, 2236, 3354, 2855, 2187, 1293, 444, 62, 50, -295, -304, -821, -1291, -1416, -1362, -670, -137, 102, 82, 78, 96, 557, 531, -27, -948, -933, 355, 1265, 755, 789, 584, 312, -5, -285, -485, -503, -252, -151, -546, -988, -1217, -782, -109, 493, 403, -162, -1047, -1781, -2602, -2696, -2059, -1107, -1038, -1900, -1903, -1796, -1610, -1255, -615, -523, -812, -1367, -1500, -1120, -279, -10, -1044, -1388, -1644, -970, -385, -339, -738, -976, -1257, -1987, -2195, -2296, -2572, -3027, -2899, -2165, -1462, -1091, -675, -326, -268, -384, -528, -858, -1050, -842, -499, -147, -76, -497, -615, -375, 126, 139, 235, -79, -799, -2174, -2438, -1526, -79, 893, 1411, 1531, 1170, 449, -724]
15864a531M13K4J93L27e6o68j325q85a311b18C66j31C5N02B60a14fD71i38l99
15844a337J72J59J44p95j425j936n38j21J488a923f95p52M5j13R6K5J30J72L23
15825g69K23b72j29p41j58f16a93C95K29j0j53E5c19j30l5K25A04J56J54@b53
15803a10j21n95J93a65F08j28K60K83Lj36N7k44E1c42J30GK93r0a70p34P3k69
15781a100j48K53n87b18R4j28k76j73J20a32j017j352M46g97C78m8e07k42a90
15761d81j78D44L75K1j22a52q31l46O7L51L78J40J86f7A15O20P35p6m37l48j69
15740D40p2A25b12k96c3A018C39d55p40p34k82M25M81f36k74k22m8K18L95D35
15719A511R38k99p17m16N37L21n72a149p97k22n81Q00K53J85j12O0p22Q07k01
$$ y = [-1531, -1118, -1094, -901, -574, -56, -724, -2049, -2934, -1311, -218, 366, 235, 35, 537, 260, -114, -6, 471, -938, -1337, -1165, -1006, -862, -1657, -3082, -5018, -5556, -5677, -4189, -1923, -695, -1447, -1402, -1515, -1419, -1394, -1264, -1092, -769, -546, -272, -401, -1142, -1300, -616, -193, 395, 624, 614, 461, 55, -319, -449, -484, -259, 104, 260, 414, 0, -253, -110, -231, -826, -633, -165, 608, 480, 740, 1023, 1026, 890, 947, 703, 51, -342, -212, 7, 300, 210, -170, -904, -831, -1100, -1248, -995, -1582, -218, -124, -252, -528, -701, -581, -132, -1149, -2501, -2055, -797, 378, 330, -507, -749, -190, -481, -659, 444, 819, 840, 718, -152, -983, -1329, -1262, -911, -533, -393, -207, -67, 115, 735, 1470, 1394, 957, 609, 440, 368, 125, -212, -508, -33, 1018, 339, -455, -1195, -1929, -2211, -1786, -1305, -636, -910, -1132, -1180, -962, -567, 435, 1511, 2449, 2150, 1433, 1017, 1554, 1875, 1303, -1149, -1946, -2168, -2749, -1949, -1696, -1511, -1623, -1563, -2285, -1478, -1679]
15700a679L78N83C11P76M80m33A00c15A01Q97J039O05G72C2a204j18lj35MPk42
15679a691P4b58I19a547l606J469J229a045A74O19P57E40f97q44k22N44M11o74
15661a482L00K7o02j7M15N98b0B12E1d28n20l60j44N3J43K02M2o5nJ32c33B24
15638b04o44p57m20L36Q36c21a59B11l2a4D68j56P4a13E2f7n73j04K59K23j34
15617c96m85k55L10K60a20A82J35j18E7P8M10B14b6a2E2J70a25j26j45C6J76P7
15595B89nQ0O01N79k8l44D30d96o23P8M46K46k21J99j71k58b94l37m43m24r4P65
15573h27B9O43n7J2B40j05l6a61k03j54ni7F99K16a370k077M16a464f56d7l17
15552c64n00l34O9M59K07j047p43j67J65M4J27L13M31O30a6C97J074P71R4l25
$$ y = [-1679, -1301, -718, 311, 1087, 1567, 1134, 100, -315, 101, 998, 2037, 2642, 772, 32, -1204, -1322, -1325, -1460, -1456, -1449, -1691, -1617, -258, 919, -1547, -5153, -3684, -2455, -1045, 174, 793, 1550, 540, -697, -1541, -1763, -1219, -808, -1482, -1182, -1155, -1757, -1774, -1359, -761, -20, 212, 51, -428, -948, -1308, -1452, -1399, -1256, -1054, -1012, -1077, -1082, -950, -333, 224, -204, -848, -1605, -2025, -1689, -853, -321, -159, 211, 179, -14, 468, 312, 386, -113, 52, -67, -640, -744, -485, -262, -396, -881, -1136, -826, -566, -120, 182, 317, 199, 57, 135, 545, 214, -26, -12, 52, 222, -125, -251, -396, 36, 212, 289, 284, 364, 965, 1544, 1516, 1172, 430, -496, -1119, -1041, -595, -349, -570, -371, -542, -800, -294, -631, -1074, -1498, -1592, -827, 29, 672, 615, 627, 240, 135, 99, -161, -364, -518, -523, -97, 699, 915, -1370, -3447, -3031, -1464, -656, -47, -364, -864, -1198, -1129, -670, -463, -1510, -2253, -2420, -2255, -2211, -2084, -1771, -1340, -710, -16, 397, 1471, 2242, 2336, 2011]
15532B011n72E96B3b60G1J35b63n59l91q6Q7J48J15m6k77k29J27N2l83m70l61
15511b536O16N45N18K21A62R2b92m62m2K25K50a29Nk7n6M0H7J79a24o03k05j16
15489a048K69c49f1B37K13j04g24n08K29Nq40q95J43P59h32B75R59K03o15j05
15469G17K17%k24j40P7P54L45l74F84b18j317J52j671j77R07Q56c12F57J42k84
15449E15k52D1g4m9k62m23p90n08R01M40a0D74B24K42j30G5e8D75O9J48j67q8
15427D37e2o82j001r90J73J092O75K51r8h0l15o40j98l90M79l69P9J68K84L3K07
15406g42e6A98J20K04A70f15m69j41Q6K09b80D15J39m4j80j48J91A84h38l91e14
15384b03bn8l48J89K0H4a58A27N88P56L01m01m64C46h3l94k75K8J74K29J60c9
$$ y = [2011, 1439, 596, 23, -260, 71, 206, -263, -822, -1213, -1299, -1212, -1064, -949, -995, -1272, -1501, -1374, -1322, -1705, -2175, -2536, -1920, -1375, -857, -636, 162, 254, -292, -754, -796, -571, -321, -129, -124, -151, -207, -167, 87, 266, -124, -727, -932, -1048, -779, -349, -61, 237, 450, 346, -724, -1232, -1003, -998, -1838, -2733, -2590, -1831, -832, 275, 1234, 1437, 822, 717, 934, 934, 710, 570, 647, 1401, 1746, 1372, 684, -218, -1535, -1383, -3054, -3231, -2324, -1468, -312, 657, 799, 515, 263, 41, -74, -123, -385, -808, -1598, -2106, -1205, -765, -10, 474, 224, 466, 336, 75, -58, 475, 544, 692, 525, 437, -52, -734, -1735, -2725, -2552, -1460, -785, -534, -632, -80, -395, -1035, -1233, -1623, -1144, -1513, -1434, -1266, -982, -949, -742, -56, 198, 318, 522, 170, -615, -1084, -1225, -1139, -930, -280, 415, 554, 510, 330, 182, 373, 184, -838, -1229, -514, -203, -2, -60, -408, -219, -199, 84, -158, 127, 715, 1471, 1772, 1371, 907, 346, -83, -477, -752, -724, -550, -321, -161, -39]
15361c24k59n34o79n9jM52f67a37j059j90j008M83R47B4b98n42n85k97P45a60
15340f57k69L25b09C2J9P4d3j64l47k97j91M8o68m10K99N22N23L15gj629p89J65
15318b260K9o9M87P05N38J16K9j112j006Q62N29k10K56M99R5l21K00A64Q56K33
15298A253L6k94D27c90q67n45k05O23J27e53b64J17K3k15j58m39b01H2d0j97m16
15277f53l88l74o1L86M46k04k32K71L76J39k1m17p32m81c08B38O22J96k98d6p03
15256g49j088O9M04K92K65K2j19k83k14m7f42K62k4k86k53n14J30d16F33K38C14
15234f88l46K35Q9R5K26c6B29J60j68c53j093q05m6J80N29L99M25K62j54q4l43
15213a083r4L46b02C05J12m5q9J36M64C56f38P3j124j819n53M12J229J165K09
$$ y = [-324, -583, -1117, -1796, -1855, -1856, -1404, -667, -137, -1196, -1386, -2394, -1911, -964, 24, -298, -840, -1425, -1722, -977, -160, -657, -926, -601, -209, 32, 51, 125, -43, -207, -554, -851, -1042, -994, -1662, -2072, -1773, -1251, -728, -413, -7, -1636, -2425, -2260, -2231, -2300, -1813, -1108, -570, -454, -425, -1537, -2543, -1681, -1152, -1362, -1106, -607, -512, -833, -633, 164, 1020, 1253, 1289, 995, 427, -390, -1257, -1802, -2007, -1384, -1257, -553, -264, -147, -124, -339, -497, -936, -201, 82, -40, -237, -653, -1041, -1415, -1476, -1090, -644, -848, -1080, -809, -433, -294, -315, -732, -1464, -1945, -308, 238, 860, 1056, 758, -46, -749, -1837, -1768, -1364, -1072, -807, -785, -904, -1187, -1401, -1448, -642, -380, -404, -690, -943, -1457, -1327, -416, 633, 871, 314, -688, -1034, -799, -710, -615, -389, -36, 229, 389, 221, -353, -1446, -2251, -2297, -2117, -1588, -1189, -764, -502, -656, -740, -1083, -1177, -831, -202, 305, 417, 372, 283, 419, 883, 356, -638, -565, -1689, -3508, -4061, -3649, -2420, -1255, -1046]
15194a046K7d15C25O32l64I0k5J06q2b74l34qj47Q0b06k72n59m35k64J88M39r8
15172a207R9L97N0J1k60j23K72k19k82o88j07r37l76m17N59J515h12a50C9b62
15151g59n74m62l05l30L53N36c44A16K55g39l68L71J18K25m28n44m4n91i27C20
15130E05l9B07p6Q68D70K99K31L61L93o7l54o35f36j82l69l98j69L51n14m88k38
15109b643k31J53M17M04N00O18K72J41a21e9j90m11m07K8d29F57R04J48K0E89
15088c63J52p2C65O03K02E39b27r79L80c76o89k12m5M75r8m72e58l78C8O00k56
15067C82b32o59q57O9Q08M26j07m86m50K52e84R3o19r80p24K10N70j62K03K47
15047a746R4K34p5k85j23P1P65b11A25f75K7k61m56m76p99P10h71j165J89N72
$$ y = [-1046, -1019, -415, 325, 957, 593, 90, 65, 171, 89, -274, -608, -616, -763, -683, -206, -478, -1037, -1472, -1736, -1548, -1109, -1207, -1108, -711, -661, -650, -910, -1033, -761, -980, -1262, -1950, -2057, -2994, -3370, -3787, -3228, -1713, -812, -150, 39, -262, -759, -1333, -1795, -2100, -2430, -2077, -1541, -344, 116, 371, -739, -1107, -736, -618, -393, -821, -1365, -1409, -2000, -927, 320, 505, 466, 207, 131, 999, 470, 769, 1000, 1361, 1754, 1687, 1333, 698, -636, -818, -1187, -1585, -1754, -1403, -1917, -2405, -2643, -2874, -2721, -2304, -1900, -1400, -782, -510, -369, -121, -59, -249, -660, -1067, -1039, -429, 657, 1561, 1709, 1729, 589, -363, -211, -283, 365, 968, 1170, 539, -227, -1206, -826, -376, -1065, -1277, -1322, -847, -945, -1417, -558, -936, 38, 638, 382, -232, -891, -1748, -1679, -871, -445, -552, -1038, -1488, -1236, -584, -491, -1110, -2090, -2814, -2604, -2034, -2196, -1993, -1746, -1652, -1418, -1493, -1778, -1901, -1830, -1065, -211, 125, -675, -648, -909, -1365, -1841, -2640, -1930, -871, -2036, -1847, -1275]
15027a275M14L51j87q61k66Q78b89m8A5M66a98q25p75l12M20Q01K11k26L37M4
15007e23l32K48b51a4j40j72k77m85m66n07m16L36q69R20P82d22C77J98k13c62
14986g73l32j25K36k40d24C19Q45N34H27b58J22E06k07d28l01j3l42j38L80J21
14966g21b02h9j28n05l849J119Q88R05K31n5J9L37L85a88l9o7Nk66q60p20m38
14945b573J207c15i2A4b15b1B21b32j065j292J8J063k53N30J30k0j421j20M4p18
14925c336a537K64L21J66m1l25l37k37r8K74K77J78J64j28J45L59j98J92b71E9
14904C06O2K11J22p6B40d64o58n22k05J28L69M45d34J94j32k57j66j81j66k32
14884a374K74j928P89l9O85P39b70j98J19A95K99k45c41q26m61q2j48j44P7K60
$$ y = [-1275, -861, -510, -697, -1558, -1824, -946, -289, -337, 15, 481, -198, -1023, -1798, -2110, -1690, -889, -678, -904, -567, -523, -855, -607, -251, -14, -154, -326, -603, -1088, -1554, -2061, -2477, -2141, -3010, -2090, -1308, -422, 377, 575, 362, -362, -773, -1105, -1230, -994, -1234, -424, 319, 1164, 1698, 827, -258, -136, 506, 299, -428, -729, -742, -1084, -1222, -842, -721, -202, -89, -217, -722, -4571, -3452, -2564, -1659, -1428, -1483, -1464, -1127, -742, -188, -227, -294, -289, -555, -1415, -2135, -2573, -1366, -315, -92, 14, -215, -21, 221, -232, -1297, -2589, -2571, -1508, -1761, -1231, -1101, -1121, -2542, -2662, -2618, -3336, -1537, -1273, -952, -786, -827, -1152, -1489, -1726, -1824, -1550, -1273, -1095, -931, -1059, -914, -555, -753, -561, -271, 59, 306, 368, 579, 701, 625, 240, -464, -1122, -1644, -1849, -1721, -1352, -907, -434, -240, -372, -629, -795, -976, -1142, -1374, -1100, -3028, -2239, -2278, -1593, -854, -270, -468, -349, 195, 494, 249, -341, -1167, -1628, -1710, -1858, -2002, -1925, -1665]
14864a665M60m17g50L18k67K4J56a96B84M66k33a15l35M5l0a81D85a48p65n05
14844a418mK26p30M11f44B07K13i1q28L22K09o44j859N29R64c07B81a1q07q91
14824a709j019k59K79N13O77J71J17J14j04j7J59J59J4q6l94f04K34j99m31l76
14804a376m37l38N39j05O12a69D05K120L84j048m23m83D12j58a66n04j004L18
14786a356M7O09b85k47q43p32r64j191J302J168f76K42J37a09F7J32K88Q7p4F5
14765h30l45K16j5n71m11J32K0pK22M27M43K32o89o55K89O10b97F68K95C72g46
14743a771q50Q4O35M85M46M19j90m20p02r07l79R7P93J001e08k58j73O3J41l6
14723g71l6J02J71b48kA39M19RI1e06l69l38o7Q3q5p3m52n49N98h74c68J38p64
$$ y = [-1665, -1205, -1622, -750, -432, -699, -675, -519, -196, 284, 750, 517, -115, -450, -405, -435, -181, 485, -148, -913, -1418, -1422, -1196, -1926, -1515, -644, 207, 420, -91, -919, -597, -388, -1032, -2891, -2362, -1398, -307, 281, -11, -818, -1709, -2728, -2987, -2708, -2195, -1518, -1347, -1230, -1116, -1220, -1237, -1078, -919, -905, -991, -1385, -604, -370, -569, -1000, -1376, -1813, -2151, -1612, -1717, -1105, -169, 405, 2525, 2909, 1861, 1438, 955, 412, 254, -166, -670, -1674, -1356, -1309, -700, -285, -532, -1375, -2107, -3071, -4262, -2960, -1792, -676, -434, -297, -109, 67, 199, 487, 574, 500, 65, -830, -1175, -959, -974, -1545, -1956, -1824, -1804, -1811, -1589, -1162, -719, -487, -1176, -1831, -1542, -932, -297, 668, 963, 372, -746, -1771, -2621, -2537, -1902, -1417, -971, -552, -742, -1162, -1864, -2771, -3150, -3053, -2260, -1259, -508, -766, -939, -876, -735, -771, -807, -705, -534, -248, -250, 139, 558, 567, 91, -506, -875, -1213, -1280, -1197, -1282, -1355, -1807, -2356, -1758, -874, -368, -230, -994]
14700i94j963J327g95c39C08J83j43A10c83m88k35n38k28K48N44m78j317j60J018
14681b017Q04L82J83q0J93j54j296J8N94O34L29a0H8a60k97L6q61q17j091j69
14661c359J635c14D68M21R7m57G1c14k05K48f3C78N4h74j53J40K43f1K4m50p82
$$ y = [-994, -2957, -1630, -795, -339, 308, 491, 348, 110, -383, -871, -1106, -1644, -1872, -1624, -1080, -1558, -2875, -3035, -2017, -1213, -831, -648, -728, -535, -689, -1985, -1967, -1373, -739, -410, -10, 88, -160, -457, -421, -1282, -2099, -3190, -3359, -1724, -314, 468, 889, 986, 529, 71, -314, -519, -271, -63, 378, 432, -874, -1027, -887, -644, -61, -37, -487, -1269]
$$ [...]