##TITLE=AC1406_BRAA12215_7653149_5PJ1xK5njd
##JCAMPDX= 6.0         $$ Bruker NMR JCAMP-DX V2.0
##DATA TYPE= NMR SPECTRUM
##DATA CLASS= NTUPLES
##ORIGIN= BRUKER
##OWNER= Administrator
$$ 1.72 TOPSPIN		Version 2.1
$$ 2013-04-11 14:58:41.812 -0700  Administrator@X
$$ Compression mode = diff/dup
##.OBSERVE FREQUENCY= 400.02188249412
##.OBSERVE NUCLEUS= ^1H
##.ACQUISITION MODE= SIMULTANEOUS (DQD)
##.ACQUISITION SCHEME= undefined
##.AVERAGES= 8
##.DIGITISER RES= 22
##SPECTROMETER/DATA SYSTEM= spect
##.PULSE SEQUENCE= zg30
##.SOLVENT NAME= COFFEE_meoh
##.SHIFT REFERENCE= INTERNAL, COFFEE_meoh, 1, 14.98509
##AUDIT TRAIL= $$ (NUMBER, WHEN, WHO, WHERE, PROCESS, VERSION, WHAT)
$$ ##TITLE= Audit trail, TOPSPIN		Version 2.1
$$ ##JCAMPDX= 5.01
$$ ##ORIGIN= Bruker BioSpin GmbH
$$ ##OWNER= Administrator
$$ $$ E:\/data/COFFEE/nmr/AC1406_BRAA12215_7653149_5PJ1xK5njd/30/pdata/1/auditp.txt
$$ ##AUDIT TRAIL=  $$ (NUMBER, WHEN, WHO, WHERE, PROCESS, VERSION, WHAT)
(   1,<2013-04-11 14:58:36.484 -0700>,<Administrator>,<X>,<go>,<TOPSPIN 2.1>,
      <created by zg
	started at 2013-04-11 14:57:30.749 -0700,
	POWCHK enabled, PULCHK disabled,
       configuration hash MD5:
       33 CF 6A 21 5C D3 B9 40 6C 15 AA 8D 27 A2 4F 13
       data hash MD5: 64K
       85 68 DB DB BC DE 15 90 A3 98 9F 67 E7 96 DF D2>)
(   2,<2013-04-11 14:58:39.640 -0700>,<Administrator>,<X>,<proc1d>,<TOPSPIN 2.1>,
      <Start of raw data processing
       efp LB = 0 FT_mod = 6 PKNL = 1 PHC0 = 0 PHC1 = 0 SI = 32K 
       data hash MD5: 32K
       2F CD 4D B2 C0 9D 1B 80 12 F6 0C 10 84 40 1B FE>)
(   3,<2013-04-11 14:58:40.093 -0700>,<Administrator>,<X>,<proc1d>,<TOPSPIN 2.1>,
      <pk PHC0 = 49.89441 PHC1 = 0 
       data hash MD5: 32K
       EF 51 D2 C1 DA AC 7E 86 A7 BD 13 C2 2D F1 A4 41>)
(   4,<2013-04-11 14:58:40.312 -0700>,<Administrator>,<X>,<proc1d>,<TOPSPIN 2.1>,
      <abs ABSG = 1 
       data hash MD5: 32K
       BC 08 88 69 7F 9C AA F4 00 6B 6C 59 F3 A5 E0 F0>)
(   5,<2013-04-11 14:58:40.452 -0700>,<Administrator>,<X>,<proc1d>,<TOPSPIN 2.1>,
      <abs ABSG = 2 
       data hash MD5: 32K
       A9 AD 1C F7 15 39 F3 BE FE E8 83 8C 83 AA 4C EB>)
(   6,<2013-04-11 14:58:40.593 -0700>,<Administrator>,<X>,<proc1d>,<TOPSPIN 2.1>,
      <abs ABSG = 3 
       data hash MD5: 32K
       3B F5 AC A6 2D 4B 7F 19 C2 14 1B A6 51 DD E6 BB>)
(   7,<2013-04-11 14:58:40.749 -0700>,<Administrator>,<X>,<proc1d>,<TOPSPIN 2.1>,
      <abs ABSG = 4 
       data hash MD5: 32K
       5D 7D 2B C2 81 22 3D CF C5 9F 6F 16 8E 01 56 D1>)
(   8,<2013-04-11 14:58:40.890 -0700>,<Administrator>,<X>,<proc1d>,<TOPSPIN 2.1>,
      <abs ABSG = 5 
       data hash MD5: 32K
       A1 4C 67 0B A6 21 BB 0E 19 74 C6 D0 31 DF E0 39>)
$$ ##END=
$$ 
$$ $$ hash MD5
$$ $$ 54 BE 38 87 DC B6 4A 29 9C FE CF 0A 36 16 62 CB
##$RELAX= 
##$RELAX= 
##$RELAX= 
##$RELAX= 
##$RELAX= 
##$RELAX= 
##$RELAX= 
$$ Bruker specific parameters
$$ --------------------------
##$DU= <E:\>
##$EXPNO= 30
##$NAME= <AC1406_BRAA12215_7653149_5PJ1xK5njd>
$$ [...]
150 150 150 150 150 150 150 150
##$TP07= 0
##$TPNAME0= <>
##$TPNAME1= <>
##$TPNAME2= <>
##$TPNAME3= <>
##$TPNAME4= <>
##$TPNAME5= <>
##$TPNAME6= <>
##$TPNAME7= <>
##$TPOAL= (0..7)
0.5 0.5 0.5 0.5 0.5 0.5 0.5 0.5
##$TPOFFS= (0..7)
0 0 0 0 0 0 0 0
##$TUNHIN= 0
##$TUNHOUT= 0
##$TUNXOUT= 0
##$USERA1= <user>
##$USERA2= <user>
##$USERA3= <user>
##$USERA4= <user>
##$USERA5= <user>
##$V9= 5
##$VALIST= <valist>
##$VCLIST= <CCCCCCCCCCCCCCC>
##$VD= 0
##$VDLIST= <DDDDDDDDDDDDDDD>
##$VPLIST= <PPPPPPPPPPPPPPP>
##$VTLIST= <TTTTTTTTTTTTTTT>
##$WBST= 2048
##$WBSW= 25
##$XGAIN= (0..3)
0 0 0 0
##$XL= 0
##$YL= 0
##$YMAX_a= 2006
##$YMIN_a= -2102
##$ZGOPTNS= <>
##$ZL1= 120
##$ZL2= 120
##$ZL3= 120
##$ZL4= 120
##$ABSF1= 14.98509
##$ABSF2= -5.573092
##$ABSG= 5
##$ABSL= 3
##$ALPHA= 0
##$AQORDER= 0
##$ASSFAC= 0
##$ASSFACI= 0
##$ASSFACX= 0
##$ASSWID= 0
##$AUNMP= <proc_prof1d_extract_pilot.lims>
##$AXLEFT= 0
##$AXNAME= <>
##$AXNUC= <1H>
##$AXRIGHT= 0
##$AXTYPE= 0
##$AXUNIT= <>
##$AZFE= 0.1
##$AZFW= 0.1
##$BCFW= 0
##$BC_mod= 0
##$BYTORDP= 0
##$COROFFS= 0
##$CY= 15
##$DATMOD= 1
##$DC= 0
##$DFILT= <>
##$DTYPP= 0
##$F1P= 0
##$F2P= 0
##$FCOR= 0.5
##$FTSIZE= 32768
##$FT_mod= 6
##$GAMMA= 0
##$GB= 0
##$INTBC= 1
##$INTSCL= 1
##$ISEN= 128
##$LB= 0
##$LEV0= 0
##$LPBIN= 0
##$MAXI= 10000
##$MC2= 0
##$MEAN= 0
##$ME_mod= 0
##$MI= 0
##$NCOEF= 0
##$NC_proc= -15
##$NLEV= 6
##$NOISF1= 0
##$NOISF2= 0
##$NSP= 0
##$NTH_PI= 0
##$NZP= 0
##$OFFSET= 14.98509
##$PC= 1
##$PHC0= 49.89441
##$PHC1= 0
##$PH_mod= 1
##$PKNL= yes
##$PPARMOD= 0
##$PPDIAG= 0
##$PPIPTYP= 0
##$PPMPNUM= 2147483647
##$PPRESOL= 1
##$PSCAL= 4
##$PSIGN= 0
##$PYNMP= <proc.py>
##$REVERSE= no
##$SF= 400.02
##$SI= 32768
##$SIGF1= 0
##$SIGF2= 0
##$SINO= 400
##$SIOLD= 32768
##$SPECTYP= <>
##$SREGLST= <1H.CDCl3>
##$SSB= 0
##$STSI= 32768
##$STSR= 0
##$SW_p= 8223.68421052631
##$SYMM= 0
##$S_DEV= 0
##$TDeff= 65536
##$TDoff= 0
##$TI= <>
##$TILT= no
##$TM1= 0
##$TM2= 0
##$TOPLEV= 0
##$USERP1= <user>
##$USERP2= <user>
##$USERP3= <user>
##$USERP4= <user>
##$USERP5= <user>
##$WDW= 1
##$XDIM= 32768
##$YMAX_p= 361401082
##$YMIN_p= -137638363
##$CURPLOT= <Network HP LaserJet P1505>
##$CURPRIN= <$Network HP LaserJet P1505>
##$DFORMAT= <normdp>
##$LAYOUT= <+/1D_H.xwp>
##$LFORMAT= <normlp>
##$PFORMAT= <normpl>
##$SURQMSG= 1
$$ End of Bruker specific parameters
$$ ---------------------------------
##NTUPLES= NMR SPECTRUM
##VAR_NAME=  FREQUENCY,     SPECTRUM/REAL,   SPECTRUM/IMAG
##SYMBOL=    X,             R,               I
##VAR_TYPE=  INDEPENDENT,   DEPENDENT,       DEPENDENT
##VAR_FORM=  AFFN,          ASDF,            ASDF
##VAR_DIM=   32768,         32768,           32768
##UNITS=     HZ,            ARBITRARY UNITS, ARBITRARY UNITS
##FACTOR=    0.250966925370066, 1,           1
##FIRST=     8223.43324360094, -2130887,     6337943
##LAST=      0,             -7394512,        -37513785
##MIN=       0,             -137638363,      0
##MAX=       8223.43324360094, 361401082,    0
$$ Real data points
##PAGE= N=1
##DATA TABLE= (X++(R..R)), XYDATA
$$ [...]
##PAGE= N=2
##DATA TABLE= (X++(I..I)), XYDATA
24159 17754809 36260607 -6622912 -1424240 13530761 14197509 48744297 20192395 -12962010
24150 -5188378 -35162801 20193942 -4110862 -3567566 -6033028 16016695 17400107 -42860383
24141 -11043646 164995 22953743 4731844 10947910 -15878679 27553435 -38048129 33825845
24132 18193214 21700531 -13090790 1588049 -19683610 19067634 -36058249 -13140533
24124 -5863724 15781291 -17842643 10680549 31249236 16379669 52665523 28610812
24117 28610812 -282502 -1654612 -11557981 -22247751 -22198564 17346423 -6689628 25942055
24108 -49230635 15567044 -11886496 -30672923 35817403 2821484 -20593542 -4598936
24100 -5602822 -1541662 110741 -33002105 49639511 -33024577 15317211 -12160039 30023756
24091 -1255079 9926585 236297 6688830 9830237 61425773 -10228094 46925763 10774248
24082 -13798524 8103170 4413923 -3869209 -3871283 13011673 20367595 -288707 7886290
24073 -7317428 -2888734 10159245 -17681 -22304542 1826953 -2799696 -49336732 -34808703
24065 -34808703 28373936 -32830446 -41451308 39912522 -14958674 -1263167 -19214351
24058 -19214351 -10147066 -15397475 41709543 35337932 -28681342 -3650487 61039593 -8809560
24049 17014358 -15831876 -22434007 -12097677 40649780 -23104702 4516743 185549 11071716
24041 11071716 10862592 -15770211 12029144 13004665 -24080128 16404729 8954220 13469545
24033 13469545 24731276 13508706 -5363358 -7009373 -15697420 29058971 31324204 -62529931
24024 9123778 -21768278 -14639562 11178337 29079423 -9829526 5604989 39248246 10290510
24015 16802663 -45307801 -4521814 7698436 -52723373 -23050688 -31355150 9956060 -5984933
24006 840100 17405649 13605892 16767033 22846015 1325992 -6168564 -23303985 -24276128
23998 -24276128 -2700493 14399482 -14180097 -1527085 -890167 -13785377 -22798681 31354986
23989 -9672628 26513623 4860437 13318356 -19036040 8349554 -5304070 -1561613 31055316
23980 -16956491 -40477830 -22120033 11299140 23123995 -8223753 34328434 6016775
23972 -510642 2145650 14600009 -8380407 14774906 -16153074 3978596 32971762 -26899554
23963 2637129 -4787345 2887891 -32103466 20982357 1903082 8967 34503782 19426942
23955 19426942 52598990 -2044350 555090 -26307549 -13282374 16916868 4635000 -5138003
23946 23270556 -42059016 -57102277 717950 -2951258 -30086348 9486644 -13686817 35770868
23937 16196509 28252693 -28752856 11503430 -8023274 11214674 -34129259 -23600690
23930 -23600690 -4649715 -19936074 30182182 25799222 -7610756 31057556 1005588 -22074289
23921 -5000495 896294 26485584 22032323 -222293 -15842386 5297531 26060356 -2788222
23912 -9081788 23712377 -15663550 -7355162 9701151 -25128297 10448382 -2638212 -2796524
23904 -2796524 11192229 -16325615 24934780 11652231 -5584964 8710644 -24067877
23896 6750380 -34713079 -17955002 -56800339 18243176 15393413 -18907343 2989648
23888 -52549699 -1184773 39344686 1976743 2306140 6037600 352623 11271739 -6203520
23879 -17340206 -2524549 21076327 -25069665 13934170 -3118153 16602664 35266165
23872 35266165 -2860794 -8571392 -27822996 19137145 -3179771 -19336891 48743852
23864 -21297502 39901910 -75481160 -36921321 -7674083 13584106 -33178475 2890679
23856 -27251324 -11629066 21287806 7086782 8657729 -8304394 5937266 -13875757 -9585421
23848 -9585421 -5776076 -17246304 9852 10569390 35499279 -56248107 -8376541 7457345
23839 -3440908 22265609 -7276672 3326794 1087496 1391087 8606115 24111824 -8860618
23830 29145438 17835795 24297170 15753708 -445049 32431708 31392797 -11318785 -38759456
23822 -38759456 -3779123 18664524 -19558192 34821913 35081706 23712856 35102425
23815 35102425 2559422 16260804 64672879 28953916 2337915 -24747640 29585811
23807 11759593 24740923 25035654 25771483 33968611 17290117 -22403512 38351806 -19478769
23798 -33691007 1825676 -2862511 1061908 -18134345 -18274143 2053210 -3438138 3838617
23789 -6063446 8169449 -27597974 -39988520 17470316 7541229 -25287532 11469501
23781 16364591 27918819 -14940399 31431077 -54964991 -933789 29055035 -2464414
23773 -13468816 21948132 -26142575 -21877054 -22447756 -10030630 17167139 -3266755 34932656
23764 17891790 -2123843 -14630832 13224439 17715994 44485420 10214761 38670049
23757 38670049 -13595898 20857395 5693091 -15931617 -4261886 -30662941 22804958
23749 12944540 19601989 9340450 31568850 29607744 28320224 -7644735 51703700 -3599735
23740 -5292889 -24273787 3726056 4793624 19964072 -18255623 17399112 -10098965
23732 27105793 29025199 -10747966 -13713064 -15078234 18085083 -16217226 11333917
23724 -14108500 -19971585 13370620 -2083913 2787094 -32805965 16665105 -24500280
23716 3035697 -45880244 -14231088 4224597 -18235476 -5477769 -5690 5434209 -33028397
23707 24502189 -31519396 10328124 20278872 -2986483 -11782205 46740806 -8220035 -3767106
23698 -25672115 15426071 5813118 13557389 13945614 21031437 5298005 -9608981 -36951390
23690 -36951390 45738638 11468240 6732634 591260 -14719467 -6477723 9976510 10486508
23682 10486508 9064207 -17586606 13814891 28534551 -53854407 -770075 -36621594
23675 -36621594 3795315 11476294 -29179690 -1630128 6163644 227679 9763706 -1353831
23666 -7032967 -16355506 -22910348 18344658 -13414889 13235177 9746558 431851 -745047
23657 -7105298 -3956909 -12287497 10298603 -41605488 -592227 -33079478 -2784550 -5326884
23649 -5326884 12552091 -14805268 43540913 11051122 -30781190 23833247 -21580558
23641 -34426861 -13439272 -24395383 -7727427 16913449 -17445529 -25880722 21984831
23633 21324116 41114210 30940673 -52419608 -13958434 39091590 -18840413 34785237
23625 -14136295 -1098783 -3928126 -36943817 -6070345 -23505851 -18869596 -11685184 22327543
23616 11815862 -207166 -35625921 46706418 4791177 -12243002 -36402373 16383455
23608 8000598 -8208091 -6731794 -22650873 -41396482 14287609 -2310332 -17302085 -3323291
23599 -4143516 34545560 -42729794 28025068 7600526 -28165581 12088483 -11064044
23591 52235610 2840524 26331279 8845547 2755070 -26449159 18717825 -10327984
23583 -5426155 14600515 -6377368 -19049114 1295206 -21106803 -6407682 4112784 2956905
23575 2956905 9035245 13634578 22883918 -22590943 -5148755 6473465 -17621726 49063486
23566 469219 -13474356 -14750024 9540754 -21982393 4470051 -479460 -31535960 16794018
23557 16901737 14700698 -13119734 18979370 3125555 20426647 15638735 -17509088
23549 -6734174 4206737 21277643 21378081 -50299 10272452 10652960 -25524131 4026682
23540 1089597 -214235 57928383 25239436 12989227 10823958 -2053153 16823271 -33228724
23531 -2796030 -2046790 -19077771 -17039437 23185715 -6226966 10845735 6209492 -35808200
23522 -11269926 35213278 -30521484 39397497 6418224 9973169 43246520 23578598
23515 23578598 -38428565 3054592 21335204 -29708074 27186295 -15435084 -57750683
23508 -57750683 18277817 4897688 18424879 4031970 2373635 -20434172 -17265197 13172721
23499 28003503 -32008638 1858945 -20694144 19884197 -17527216 26836825 37097563
23492 37097563 -30727089 4677823 -11362385 12532607 -30517685 -15364442 -16494528
23485 -16494528 -3627784 -28852042 -6747537 27604518 26395662 21346940 4359804 -581927
23476 32904809 5134407 -13201156 10634979 -4184460 23082354 -9702146 -23965841
23469 -23965841 -11622298 -13678855 8322086 3410861 -60535041 1637878 3046817 -2515122
23460 12071592 -34347894 16492483 -12233867 -17984267 -15889745 -27200207 -29115450
23453 -29115450 19467954 -11669204 -33158683 -25461 -49060562 11976043 -10974813
23445 -8617085 19848777 4863411 32773814 -8066250 -7628409 -13053974 -30740325 27871564
23436 -29585984 12908766 30456174 18350990 -27587495 33392715 13650111 8670338
23429 8670338 8522175 19749808 26939885 -8059621 -18018176 -1617640 -12069615 -22526435
23421 -22526435 -803081 -5270013 34029100 -9386904 10592844 -18157905 -10913054 -4340359
23412 23610543 -2282858 14582658 8772614 -10392460 -14137355 15675887 26717252
23405 26717252 -3779857 22168476 16928823 16802508 -13184927 -14974253 17620975 -7173388
23396 -9108149 22517723 13124380 -30998374 -4259276 -10484412 15599672 11916139 -14584710
23387 31788460 47970239 -11641442 -28051516 -40634141 -11817391 11196387 43511017
23380 43511017 32208637 34842053 41751829 -8740658 4002910 30738962 -45329368 -18389318
23371 42088187 -40110291 -1504463 -186092 -11669837 32355839 -6044536 25464766 3763804
23362 3318910 30496509 -5313392 -8390627 -20310559 31406559 -154073 -17459522 6429730
23353 -288658 -22202663 -16169542 11434382 -8222157 -35002666 -7043503 30054507 281459
23344 -31189287 -8421980 -27583174 -1567621 -10380766 -10909000 -19730818 -17113135 22336948
23335 -17576505 -33787318 16813035 -39170176 -33258972 -49706088 25483242 3311718
23327 47183292 19661091 28699673 10151007 41559302 -9433947 -15815585 -16745352 7110796
23318 -9650948 14700655 1963009 -19539261 -2899752 -15919797 -10260742 20124981 36802962
23310 36802962 -21428040 6510043 -51339287 7596773 46279598 -13903353 9012973
23302 17628439 9619609 -47138670 -24105130 23492912 -3994577 12994401 21452896
23295 21452896 -3980615 -21908120 16107852 4117538 -5820568 50353182 6035205 38741833
23287 38741833 -7019101 -23956108 -4284415 -26135377 22901980 -6051887 22718485
23279 -8067397 37478939 18190808 -21451780 499428 -12004660 26725242 20343181 560854
23270 -17340732 13474794 -12168823 35557643 3149908 -1691998 42273386 10109492
23262 11272838 6766993 -16411302 6757874 -10637225 -11744886 30916187 -22134548
23254 47638821 22795203 27320270 4859891 27160465 32555103 -19384073 13728679
23246 23013578 -28918692 31082837 163742 27575581 7911070 2632840 25984592 -29376569
23237 -13654621 -11162745 10153928 -8360844 1366903 5543176 15877442 15151509 -11764987
23228 4520216 15104849 7754351 -18775177 11339320 -11204800 -13523105 -33793026
23221 -33793026 48141367 -9620724 9887503 15919209 -9007074 -9354242 -31221459 -43702525
23213 -43702525 11281968 -14871718 12251120 -6262486 -16075419 31845468 35055691
23206 35055691 -10423390 15623358 -19778426 -20123974 -7868563 4409674 9415501 -22626609
23197 -9163693 -25365184 -4183972 -4280543 33649409 12406939 10791966 -13089812 -2630102
23188 -24030752 31361403 41184693 23794323 -11832598 -1021881 6860035 24906347
23181 24906347 13941281 -47014782 -1495091 -38106560 -10262627 14246857 -5275585
23173 -44606907 -334450 11631469 25723665 -14298793 11584479 31963719 -23795406
23165 -4379493 9005365 6185114 27235203 -31307176 23857276 289287 607369 -19501230
23156 11881515 -715153 -8151990 12451572 -19951495 24287979 601956 18641836 23103784
23148 23103784 -7350359 23720211 19236889 -16833995 -7251282 -3315883 10636077 -58688913
23139 -24100584 596815 3921729 -43355376 6633211 24256241 9249606 20916247 16860525
23131 16860525 35451335 -15648299 9550240 -20276338 -6223038 -38173127 -61002224
23124 -61002224 -19757762 -2346972 49200331 -27891634 -27015019 -13988411 -15348665 -4701329
23115 39012696 -55957608 -13366364 3586662 -15486387 46037585 -19674943 -2482730
23107 -135528 906174 28473578 -14644260 -30314392 3129 -15178196 -4337150 -18238572
23099 -18238572 -27129664 -1850177 10974446 7015920 32203651 24393846 -4528466 -8565403
23091 -8565403 24883877 -12562923 18563204 -26003673 14862142 -1608274 13642634
23083 2530897 8073073 -5135699 49055660 -17495959 -9726085 -19059083 -34035663 -21975780
23075 -21975780 35754589 34436840 -2241602 11895939 17019827 -18842828 -33826522
23068 -33826522 -19784429 -34582018 3989104 16389638 25811458 -7459400 -6704807 30694394
23059 46990448 14151807 17662688 -12979555 -67464 -23039735 55735238 -7449983 -23078703
23051 -23078703 -9899520 -1133386 61662369 12996187 21893772 19233177 -18867694 5289556
23042 -4899292 -21262521 -1360700 40356404 20693688 10835256 -1995054 9051464 18815319
23034 18815319 24594331 -17506594 -43892029 1535429 -9377180 -26060115 5701462 18624115
23026 18624115 6746585 18929249 37304050 13012562 16240949 -44146080 -21696524
23018 5417480 38862398 15415803 21527464 -39544500 -839842 -11484252 -32026165 -9633519
23009 -2662693 7676875 17317075 -2206482 -5519244 24498152 -18122402 12719160 -25725518
23000 -26491651 19243618 -5197084 -13378721 -10665117 6037508 -12738968 9577979 -2997446
22991 -1755797 -25493126 736727 778868 23582424 45513486 14859397 -32703797 -48214989
22983 -48214989 -6776293 -40388685 -24247468 -36330553 14295666 -139110 14021609
22975 -26880086 155653 -24435399 26447515 2959960 -6142885 30611240 14370035 1147067
22966 33408262 -4530310 -15088630 -33131452 26075025 15307115 -19731575 -28619111
22959 -28619111 -1497448 20296339 -32470626 -17216828 34886105 -877289 -28798048
22952 -28798048 -13157383 3803266 34921944 -13196999 17569909 21650709 -6633627
22944 13812755 -33677017 15030079 -15009966 19226144 -7911703 -23363944 22353115
22936 -48428789 14908804 31819660 -14361589 -23440017 -49465603 11241391 16147588
22929 16147588 -18168209 3475531 -17380301 9359206 18576280 816706 -29877832 -20113624
22921 -20113624 -48109202 -9893758 54127724 -295969 -1904679 6525783 17592207 -33176084
22912 33645819 11752339 6380664 57140576 -4184275 903913 -17092268 -5321959 -3220499
22904 -3220499 -19626680 -7853100 -13221238 9318618 8414264 23870910 -68640961 12851839
22895 -51171930 -3754681 21344581 -23498934 21107379 -39252446 -6908150 -8946498
22888 -8946498 -1566194 -13228150 -25139871 -5029904 -5593000 19427358 -25185076 -11940553
22879 -2889977 -22229253 3016094 -16608497 -1980566 -18351932 8242244 -4103603 3925909
22870 -18441197 27837559 5922355 7896011 -28076539 -158438 17889472 1253245 13927892
22862 13927892 -4777033 -14703431 28543642 48358926 6346790 -10829414 10509641
22854 5767128 14792196 -16806010 32252120 1121069 2968331 -1017899 -9258189 -15427675
22846 -15427675 -5132966 2919159 36857735 -23042569 12183829 20781621 35104294
22839 35104294 12169134 -41384133 -4852631 -9157519 29508928 -22624708 34030334
22831 31033151 -25713069 -31695675 14827791 -35946621 -10571586 14084350 40501360
22824 40501360 29721857 -13964231 30101490 20866890 -1662008 14107815 -14218762
22816 -18349407 17879264 -54102361 16100024 -8746954 4052857 25017203 -37099004
22808 -713610 15820898 8406735 28061313 10650389 -23786187 28422522 1582378 18545951
22800 18545951 -12029959 -2597793 -14128540 2152756 4210547 22614669 461624 -12453464
22791 17148117 -16552676 5914781 -25952377 -3267726 -20943322 20661105 -10986922
22783 -59128901 -25210594 -43056074 -10487798 7382510 21649672 34954212 -5833345
22775 2935122 4881320 -50059170 -25381252 13716969 14215738 181143 -31778139 -12642832
22766 -5404977 -27687737 22794682 -15166157 -4755615 -49383299 -26908144 -14442859
22759 -14442859 7805717 17364953 -3039871 32196707 -10341597 -951113 -29720068 -35039240
22751 -35039240 -11999443 1154796 -18142103 -15204540 -13513397 -637145 16034328 -36595977
22742 3137695 -29989774 18075517 -35299405 50854209 348893 23463653 -19961642
22734 -20347427 43169719 -6952806 23474420 -712462 -41195852 -23838617 -6308685 -3154511
22726 -3154511 1359847 -1794009 -19585094 1705368 -38266698 16308749 -6361790 24901094
22717 13086109 -8729241 19004535 781281 2249987 -9738287 -47353041 6358511 -4742822
22708 31332713 -1865260 2364131 -12108421 -1428195 -13534684 -10903164 6849048 12726670
22700 12726670 -33111155 -24832429 -5837058 -15712224 -7245383 12188529 14888028 8638981
22692 8638981 -43825844 -5914073 18520900 -8136935 -13640231 -7861829 4118237 -2665189
22683 -20125676 -282756 29786499 11591792 -34663482 22453265 9213320 13770265 -24875417
22674 -77726787 888992 30951019 21482721 5162006 -14722380 29680156 -15784935 13672970
22665 -25673008 45978455 -1838852 -14584381 -3748626 2241702 8260772 11492428 18754304
22657 18754304 -24410117 31549656 -26401352 16543138 -21205667 -13523416 31235576
22649 -2638150 -7560902 -62140 -20035181 13194247 -51722803 25309616 6910299 10960906
22641 10960906 -68981680 33950350 -7436280 5297769 29139235 17549813 22757089
22634 22757089 30410193 26534085 -37709133 9855834 -8683877 12338752 18586654 15321279
22626 15321279 2092101 -6713052 -9457831 -11680588 -23567848 3582457 8830822 -28492311
22617 -5681740 9072076 4987452 3545009 9673130 16397647 1964919 31536218 -17132695
22608 20243535 25750241 14637554 44484 -587847 -13598020 9124341 9834111 -35090293
22599 -9970825 -6466562 39697257 19283373 -11932451 -20393088 14620135 34911308
22592 34911308 -4029374 -5614627 297569 -42981527 -17861555 9308292 -5330970 -7843916
22584 -7843916 -18309655 22316828 -47006008 12526290 -18744541 10112160 80647089
22577 80647089 -195781 35770039 -7308485 -4804928 7256701 -19943413 568699 -36293546
22568 -11959162 -23995791 6273192 -12602075 -17885009 9083189 42194685 -19023417
22560 25964046 -15610254 7012538 -11717520 13498920 27887548 1317698 13228689
22553 13228689 -37412951 -6988894 2776466 21907046 -35892642 2026431 -36414913
22545 17794255 -9239466 4413908 10296350 25269567 31684401 801073 -15003393 -23908819
22537 -23908819 -3570645 -19017719 -42455778 -4858785 -13770532 -31751929 18527448
22529 12619967 -2098519 -9763210 -13105164 3758970 21646373 -14778188 -25007139 6114679
22520 -7123010 21539256 -4994648 -17723345 -1927797 -12635325 12957666 -7923725 28727033
22511 -23912115 -16918291 -6805246 -14237496 -17729675 23999895 19954024 29894289 -5522041
22502 5227758 32627260 -18496439 -1494019 -16840371 36839682 -18845795 15082636
22494 -7900226 -6856395 44651340 -7136854 -15720642 21785902 -18009778 13678283 18485984
22486 18485984 -35874474 25762318 -3250496 7854172 -55961530 -14213639 15152686
22478 19570499 8343336 5260202 32651975 -29154795 -20308757 8731778 -16285805 22706071
22469 -25584337 -591868 8457861 17547684 -22097421 -16924540 -7644784 -22306224 -26157684
22461 -26157684 19251263 7965718 -8702397 15306024 -7252435 -23330718 -56953153
22454 -56953153 13461962 42378174 -12928937 23253368 11230174 -7248370 -2743354
22446 7645799 -23306710 12866322 6659088 23079128 10199759 -33199693 -7109771
22438 35442128 -46573957 12619785 -11400748 10064273 -70912727 47621521 182520
22430 19374333 -1451593 -3535885 -28599858 -2839812 30680194 -5408450 -29872918 -18055631
22422 -18055631 3881864 13051579 -17070983 -6044844 -7627169 -8720046 -4380994 38674150
22413 11466776 14183184 -2207085 11074912 9573058 -4694275 10371426 8830596 15617517
22405 15617517 12272372 -13885445 3201523 15359639 24968924 27036899 -22207331 -18415211
22397 -18415211 8881024 17537365 -2384467 -31291850 -19857303 -23438861 10557671 -33557393
22388 -4632040 -620508 -6022173 -12430549 3734648 -17371655 -17085436 -6114689 -9305760
22380 -9305760 -5364936 7880644 20586948 -5858426 35429016 -32656592 -2090930 -19128974
22372 -19128974 -8193415 13771373 39046450 -1201349 38338922 24025889 -11441602
22364 -23015974 13332708 4027596 -18776712 18826044 -67776607 -15470512 -11786129
22357 -11786129 13222005 -36085666 8930718 26979073 -31284220 15762040 -34033359
22349 -14099131 32618568 33901261 34795810 -17757881 -2434718 19408875 7559302 28336616
22341 28336616 14109864 -12036200 12698525 19162621 5938938 12899143 -17387743
22333 -77731 17279299 4859612 24232182 -47733485 28258508 25416008 8363072 -6478687
22324 1932292 -16293716 -42947583 -532077 -6688195 -28702144 3169950 4157012 5965021
22316 5965021 -8003973 -12217847 14378523 21988884 -43168239 -4947687 -17131856 20340005
22307 35550850 6455747 26278355 11194187 -17038699 -23304209 49513934 13247148
22299 4423511 -40741105 -4252403 11380478 -12610471 5120525 -32485259 12584092
22291 7819062 7070909 -20919017 8603472 6943249 -9653661 -25659285 16838945 -36263
22282 16650712 32847791 34985899 -18302989 -6204839 1104120 -14524252 24178428
22274 -8273162 -23346114 13930729 2784842 -3857719 -15739819 -20686597 24794706 -26458750
22265 11418455 30091284 30499136 -4538708 5364104 6368883 24752632 -4860454 -29047418
22257 -29047418 8497294 50124834 -23242099 7784832 4721817 28925045 -12115447
22249 17268615 20534732 33588138 -17797555 -2109572 4032448 -29845897 -20908491 -11637250
22241 -11637250 1884891 10488802 34751693 -5721486 34918528 -13578505 31224417
22233 712489 -4363120 20020475 -13132941 -15497026 -4393468 32273219 -29912813 -2350832
22224 -4328278 6682673 -4994258 -20872880 -15818890 -31135724 -7811730 -8306717 12633886
22215 -16147978 22090219 -8289392 -57522426 -6853092 -13267611 9646455 -16191136 34308390
22206 29346623 -6892492 10214375 -1494840 -8085267 -38255337 27796999 -3545376 5276675
22197 14580368 53082477 -25177655 -32251531 -16724037 19841133 14826669 7959667
22190 7959667 -8601521 -6540441 -20793162 761852 -7216689 16921868 39439204 -12382467
22181 -2429332 22464 -10394184 -17249012 14703886 2411099 14562503 15907380 39567251
22173 39567251 -17358648 7200024 -12895862 -19400539 36935070 -36563169 7649324
22165 -9456889 -29942860 58477544 13049365 -4294113 -4252977 23016904 3845901 -16994412
22156 -17282880 5349302 -49175317 11692216 -54491687 -29393451 21265866 11084445
22149 11084445 25919981 26375650 9293385 6128829 -15055794 -3842112 25095294 5526469
22140 13962853 10368384 3083861 32629263 -7543882 30902344 3062641 -4179022 15620463
22131 -23663523 15367855 -3857206 -6080363 3162222 12058967 6056329 -25634921 17529879
22122 -8030688 64899367 14060966 -16419724 40206266 -1295545 -25502814 -39950898
22115 -39950898 -51173304 -10737642 10255270 -33133019 13730949 -18785060 11789193
22107 -21617083 -33351793 -3738385 -493819 -4933940 26373629 -25989873 28551057 2032720
22098 -7732751 -1657732 32982372 17486679 -1423161 3266 33074164 -27396224 43832959
22089 -19148222 -7460317 -11765518 20793039 -5323063 -14547377 -12604669 -8520707 42276910
22080 -8343959 -1507754 50125979 -4004302 912274 7598026 -500883 -14332716 7396422
22071 7222117 36104114 2603516 22410456 -5499443 6940796 1368106 9686454 38316902
22063 38316902 3274811 -14260997 17445972 -3423397 -18257617 10652831 6897719
22056 6897719 20499782 10421779 -3087821 -2946027 -1184761 4817468 4590752 -25695288
22047 -9735861 -18434505 -19811972 17097685 21979150 24706102 38876008 -12794912 296509
22038 -1188964 -7917619 -6994976 -15411705 -18923950 -48083418 926117 -4646000 -595972
22029 25208668 -16844085 11726192 32644487 48585047 42727109 26214464 -27532374
22021 -23412203 14843607 10821639 3484519 22568577 -24652248 28969530 -38804596
22013 26774612 -26370233 -2320672 33826435 18392536 -9156648 13604959 35052007
22006 35052007 -1092582 68664150 4683166 -8184633 -1417733 -9484543 -28020193 -27398026
21998 -27398026 -129667 -6334223 9916446 -27773339 12908335 -5526546 -9155760 36529887
21989 -45821264 -1293759 -172932 -6113352 10163764 -19317804 -9709922 -7730797 6962063
21980 -7321027 6060408 -16045505 -1392040 -7181507 -1558296 -15058098 -6683512 -17561032
21972 -17561032 -19860820 970183 -24042840 25709335 -13817861 -14930902 25596602 -15130683
21963 4421322 19175253 -6900797 29663716 -11193123 23349732 -25538532 -9082051
21955 -41000191 2085325 14334844 -7061299 -35484680 -9173157 8551698 23718985 21813169
21947 21813169 -11546423 -13265968 28525388 -16975452 35902057 -8925273 14541083
21939 36658404 -3934388 66763668 36567315 -2266730 -4458547 -27706651 -51055909
21932 -51055909 -24408334 -2113935 -48454417 51996179 -34102037 -5918880 -27569673
21925 -27569673 26430398 -7785329 30646760 4416023 14064419 1217552 -3805771 -4383793
21917 -4383793 16596233 33037364 27811226 8449753 -10205893 -17623204 2842163 -2316226
21908 13107558 27890585 -37283350 1847106 -10328291 -3523890 -26973500 20534462
21900 -17702378 -7002087 -19041671 1826520 -23847817 -18738373 1458835 14833582 -9835625
21891 45707486 -13119622 -19496147 12773779 26888130 -21251430 18558184 19712731
21884 19712731 20385890 16778696 8760167 -12008397 -9814801 11011806 -12593568 23147868
21875 -16849687 -5430949 -16560254 14648882 -15929737 2262258 29309437 -5873333
21867 17309693 -5268395 -16610072 6438987 -14344556 -24545458 -23550310 -1023136 14163625
21858 -583421 -7501574 25242863 -17395021 23144854 -10485438 37239376 -29409741
21850 16776606 -13222052 15441270 2089030 42229251 33496654 -1414075 -6575483 42306611
21841 29218786 -9463723 -4879858 -15410050 7174132 -58549340 9999298 5675779 14829317
21833 14829317 20845047 41444131 -28480039 -6681038 -18509979 9159983 11873232 15126852
21825 15126852 27067429 -10836779 28880616 -4519859 -16183971 -38870 -2751789 -311679
21816 -27657472 -15410706 2460599 -7469056 4737751 2485690 -13219256 -6331894 7287556
21807 -30140515 -26022694 -38032295 -5941485 21667703 2753430 -9607628 16076675 -13399861
21798 -14729466 -2917103 -21682659 11956046 11389515 55677716 -52253527 13555289
21790 10102843 -26290428 9140823 38788886 -8730507 3394395 29262434 -2886664 -6119936
21782 -6119936 -17552447 3834730 11839542 9671208 28866938 -15660103 -3717303 8258835
21773 -20210655 30801952 25556292 -2357072 -33684523 -16792826 14085547 3203761
21765 22148177 -5973793 5463844 -23448828 2019768 6713721 3466021 -16265024 2648778
21756 -31801366 -6805793 -24812974 -20444625 -4761248 -28231973 19857848 8568915 11654420
21748 11654420 10142757 -7205666 32134819 27347806 22668792 -4338660 7684320 -34122565
21739 14630912 -17038250 -18698670 20022331 -16559605 23673407 -26206943 -44621775
21732 -44621775 12834659 -16898526 -3870485 10622339 -8588375 16504694 -6466490
21724 15896502 22416296 21805081 -33421060 2898435 30781668 25211007 5725709 25815426
21716 25815426 6361225 10055605 11035782 14197050 18914950 -1056866 43136344 27122497
21708 27122497 -11997716 -9322128 -11909430 -9199940 -35096057 15523844 30867820
21701 30867820 30610202 -32991287 -30072078 12183070 7313600 -27433651 -26291926 -50103360
21693 -50103360 37822118 17746421 -4547114 6329739 -8878002 11588531 -27692852
21685 15589751 20232286 -33722696 -2998947 -689673 36144636 30455787 9741550 -17026484
21676 49648955 -40774730 -7829880 15879566 18285461 42345905 14154549 25489700
21669 25489700 8142299 19637032 985840 -19516715 -36431263 -44239784 -3425987 -2794054
21661 -2794054 42809312 573479 15273962 -18580013 -10771545 11584009 -30149795 22030213
21652 31857101 33571950 -25079512 -18847264 -17085240 8025767 27519261 3851676 14847465
21644 14847465 4318311 -25073254 12527146 12400868 -19062153 -27571889 30217322 -27631735
21635 -7107467 -15893820 -11879129 33375711 -9617333 47587156 -19742673 27569606 16643165
21627 16643165 832086 -13256424 -10046233 -21562898 -18929899 14865032 -3751323 -19115161
21619 -19115161 14591103 7271807 10353712 -24501413 1645913 -24611681 -1957289 23217832
21610 -4977500 -20222267 34452302 13044498 -904409 24453890 -22471679 -2845022 4874748
21601 40093075 16324228 11579661 24192703 -36276961 -20155867 10631976 -13575288
21593 -5086137 -15123372 -43262539 7287794 10465163 -33114107 -17477225 23185893
21585 -28967768 -3329167 -18538859 -21336270 4910346 32841619 11812437 -2717672 -10202427
21577 -10202427 29326501 -18882060 29198256 -51209 -3557005 -16428063 29981142 7822754
21568 -7186909 20874287 -7160368 12679846 -33686951 44484261 -6317098 -10405608 6773609
21559 26601778 16902477 -627338 25418557 -10899827 -13928868 2067320 -25578356 -7529961
21550 21104193 5618162 7479647 -536911 8304556 -20244475 24270851 -11183887 -20711315
21542 -20711315 31655377 -61564002 -28441125 -32612684 -20817251 19873772 8408679
21534 15228379 23665041 5294902 5004536 5533913 -29050614 10158239 -675136 -13554713
21526 -13554713 -25033261 23677975 -20061680 -43061048 -23347831 14442602 -32795646
21518 -2408666 -2726034 36551891 5132944 -43949338 -14613688 -17591561 4983624 -35438466
21509 14829713 -17967589 -13873034 28912562 -4500673 -10489261 28591998 45492701
21502 45492701 487494 6488756 12580724 -5940118 11436541 26150743 8845485 30559754
21494 30559754 -27262667 -15946123 28513551 -11273626 34394909 13392986 -23402679
21486 -21514815 -3923352 -4425315 -30689789 22967587 -4593238 22358061 31376663 -2009803
21477 30449716 -16943729 27077420 4824422 36644555 12891813 -11383182 -21257295
21470 -21257295 6497705 6958215 18343353 15223394 2869662 -44117823 15009467 -9447928
21461 907695 3829319 6942067 25215267 25131040 -29694174 -14621258 7299788 -6741986
21452 -6760990 -8732176 -21376178 -21338267 1543216 12548229 -29248807 1017207 3384423
21444 3384423 -10342295 39660407 17202609 230433 -6971272 -9098636 26156301 16164781
21436 16164781 -10924885 -14995018 -15370188 3345062 11093741 -15237577 411931 -6347730
21427 -111424 11039363 30076841 43930101 6188239 20970560 -459745 1492728 3614563
21419 3614563 59369357 -15414669 -14563386 15766729 -54083286 33739770 6831045 -11052619
21410 -4746079 -19633784 14034415 -22473010 -8149926 -4515937 -5451716 -18845390 -20413375
21402 -20413375 3029025 18415746 20311637 -23026105 -14757519 -2624811 19814318 14476730
21394 14476730 5476683 2721927 12829991 29770492 16272634 -7437388 -35227269
21387 -35227269 -15552110 -5906061 34417993 19165648 -11066299 11853966 -2847750
21379 6080988 6105864 1873063 26264106 12448177 10486476 -3106974 -343326 1537727
21370 -7605882 -8782960 6177608 -23692968 -6929356 -5333614 -5782394 -1870118 -5133949
21362 -5133949 31132163 3008332 -13699698 -16643268 23911441 -16693808 15745156
21354 -25529527 -3434217 19688406 24362376 1411166 24554335 -16423853 19101163
21346 -19723483 9527960 22108402 -1229345 -29811926 -38124395 -43318358 16919801 -9294135
21337 -6755820 19688114 20352230 -47713055 11195375 -6239352 -4370884 -23622286 4776043
21328 277061 23556205 -30955818 5186017 26762695 -15657406 16781974 -20080967
21320 8160067 2426601 -30821362 -11602466 -31882807 -30698815 -25862409 1516111 7655600
21312 7655600 5991813 -33436160 -15402003 -15023496 2152253 -15762428 22521639 3118599
21303 -4578650 23657420 15923819 -33184405 1042688 17474017 9357304 -6338543 43291220
21294 -23110357 9519306 -27545536 -19197478 42823846 -20744125 8224363 252787 21153242
21286 21153242 -39924258 9898161 30424032 26062744 2029879 36710421 37065137 -14973299
21277 11453077 -3478464 3618842 21157700 -3982937 -2047892 28685776 11098467 17247133
21269 17247133 20087343 9874108 -40928484 -5423729 11134151 -307194 24200592 -37874886
21260 48413107 1235562 -11881376 18572205 12873803 47886133 11246993 23260601
21253 23260601 9931123 -4307912 -28648210 -38226433 -33477294 15181993 -40410825 26828328
21244 -18165111 26279764 28003283 11899314 -7750476 2947092 36472608 5381021 10452531
21236 10452531 1770548 6323242 14456833 11063103 9910486 7491396 -20051969 23234348
21227 -21962939 -37541903 29411790 7410822 5406948 4099618 16588421 -12921630
21219 51054775 12759293 -6291291 1982815 -58608384 12705523 6669792 -27112618
21211 -7673249 -12027062 91315 40948890 20990491 -28124532 7190167 -14612691 -1137001
21202 -36680860 20711815 4758837 2820689 -30152635 10361813 16210924 -9055083 -15834037
21194 -15834037 51981405 -3943816 -28360185 -23067565 13460527 6830116 -9863255 7571859
21185 36960144 -23538149 17221315 17769836 17872387 9916013 6581163 8017360 19646078
21177 19646078 5444648 -25448607 -33168742 -26892409 3590243 2027483 15200082 -20199195
21168 -13063827 -5043961 -22662875 -2678972 15584779 -8966109 -20762823 -14759690 28002254
21159 -20875614 -8764190 5113321 17858068 -18387310 -26933979 35395231 -36089848
21151 -11679712 4723866 -20699721 22117698 -28811082 39139138 -5349647 13859797
21143 5163943 -10509093 -17298973 -22545161 -52003559 -28219668 -2632094 1690943 32003020
21135 32003020 3901669 -12421476 -5624656 14978824 39431557 -24556782 14957067
21127 28591632 21185492 -19291044 -6706182 -12134655 3640981 -33382886 -19618912 25045046
21118 -41367715 -20382042 12354924 -1118578 -15316024 514342 2633645 -43343415 7087645
21109 -24861441 2694830 40625721 -3504504 -14264089 31808925 -9689543 32377891
21101 5130624 1005292 -8284276 2265573 30314836 -3671834 -13096506 -22022547 11886337
21092 -13025946 8302230 4658059 9704613 -37952099 8096817 -8233249 -39308357 -16337845
21083 -9222752 -9857984 -374926 12076601 27750855 -16073405 -7833620 10999892 25479536
21075 25479536 -15946556 31204892 28862576 13547578 26462142 52432 11825776 11842683
21067 11842683 9918393 -32210475 10299564 28170466 12300723 12392462 -2184121 -10135037
21059 -10135037 -20612779 -16289613 -17249861 -6583887 -2329467 17484147 4383851 -15981472
21050 18443655 -15225935 -8797931 -36325264 -1526546 13919771 -19276805 -21490373
21043 -21490373 46090546 32430527 11539063 -18080402 7413183 28363272 9497756
21035 -11319475 7148784 6863962 36853336 -32161777 -8132569 -36409025 6900657 -9687758
21026 40112997 -17599080 18465111 24403671 16151907 3942349 17409458 12544405 32287124
21018 32287124 -1885073 29877313 41117797 19998204 -22338079 -39269164 21206624
21010 2796951 -7831372 -3903930 10106588 10999912 -10058228 -21938686 41317454 -16743836
21001 -32912643 -4045582 -1168389 7011721 15503320 -1754335 -37539217 -25551004 8013900
20992 20535470 20546579 -21869410 -30917451 20920269 27228333 6782183 20828450 -18240229
20983 -25889964 -13606973 -24229234 3446832 -5672414 -6599700 -39217893 4481001 11036692
20975 11036692 9502516 39693737 13294681 -37047596 -6785180 41651542 7099834
20967 20712207 4730946 7739899 53292445 6667423 23691224 3529929 16710799 -23959063
20958 10054777 6431265 32516044 -9458930 -26029228 25446964 11522589 -3126369
20950 -33043598 31345158 -33149256 13508643 -9264099 20231612 -16435299 2785462
20942 43769844 16384852 -5688337 34183329 -4004458 -28635675 7648490 25812191
20935 25812191 43877253 48632657 -42678996 3704171 44886881 651546 -10348115 33375476
20926 19840522 -4339477 -13828357 -27278078 -3486534 -8479225 2852326 35810506 21574384
20918 21574384 -11560007 4625733 -14915695 -35029355 13820493 -10772663 -3863449
20910 -9631645 -10322135 15217337 -19537717 -50008330 -3609761 16031466 -983429 -9246422
20902 -9246422 17005763 29097999 50539775 -34705435 -11972965 10037650 -27925038
20894 5207516 4139617 -19108837 26943255 -33312063 -2621343 -12712802 -9857515 -146831
20885 -2421263 36172078 19969808 -16734856 25835660 15483523 1521248 -10305000
20877 8601819 -28617703 8821622 -15339072 -43852019 -29934744 12788251 -33217201
20869 17419425 -1445360 6605974 32322527 7025145 28000757 15062071 -41551543
20861 -676960 -13165563 -39579070 24620829 -4228909 -14578084 28954283 28749467 -10554636
20852 40836 -33680087 -8420195 11267969 -13818421 -27893528 1784485 19427598 27395294
20844 27395294 -34163318 4136775 -7387960 -13479596 -26751103 -16414439 18412012
20836 31270449 12075907 -1593906 -10235297 -13951666 -20748665 -14657693 -19707440 24237640
20827 -24061518 -17977040 7647027 31101315 -29700462 5072369 1310334 29064609 10311275
20818 9139403 -21189605 -2410436 -34882709 22904973 -814721 2111917 -9485892 12893543
20809 33575865 13848277 12041009 2167541 43821191 -6124058 5924698 -11630892 2856330
20800 41996101 -17022296 6711933 -25411430 10977410 20500691 406430 2330269 339040
20791 -18904560 -18356672 53241122 26052678 -14733170 8797734 23791711 -24308919
20783 9610506 -13051260 4194747 -28519214 -18866515 -26459228 -1926508 28574848 16564395
20775 16564395 2473734 -35062084 12180172 29880041 -39195828 -28358078 25013341
20767 -42542873 22079346 18701873 48191775 -286324 19458407 27312103 -3580794 -18124304
20759 -18124304 -5331688 -23678669 9679409 -46197785 -28202783 -27681768 21651004 -3951426
20750 -6909890 18264158 -32446593 19174992 7879371 -3279342 -21006049 -12001692 -9877711
20742 -9877711 27226079 -26801363 17755481 18030004 23040700 35710674 34542768 4336074
20733 -22819342 14189189 -48132601 -25509432 4584574 -4089910 -17620541 -19351542
20726 -19351542 -13498144 11878612 -1046095 -5559066 -18851164 12949898 -20547200
20718 -36179148 -9803494 3159427 18857477 -8923670 4484867 -17515083 -8146633 -2570778
20709 -10757507 8052275 8170583 -38344929 -20862322 -11057007 -27537165 -9697030 -19313789
20701 -19313789 24766719 -1126912 -389447 11412999 18544059 20729348 -118482 -20319694
20693 -20319694 -11511532 15041641 -16990090 -21793794 27938297 20737466 16566786 2939098
20684 18656251 -53315845 21324263 712529 -20501468 -12741779 8036818 15930024 1156071
20675 17024988 -11367623 -28535940 21222218 -34305210 30649724 33451257 3299092
20667 -22252209 24092586 12376920 15078758 -6372712 -3371836 -34626385 22832000
20659 6043234 11256731 11283881 26818695 6384580 -15730593 -5408372 21279616 -20559729
20650 30060888 -13956519 23341412 -5577569 25703084 25462884 -9490010 -2949723 5680136
20641 17777315 -27946422 13125938 69879550 -5454351 6482731 -934956 11884123 -8320422
20632 -29684337 -18790511 -3821971 3669766 -13961815 -25526415 -9320922 -3243599 653876
20623 17233277 -7564266 -13083115 -1982125 12594632 7828176 -24926467 6458230 -18727726
20614 -8166508 1467062 -7516054 22958819 -31660050 7589496 -6846637 -6880119 -1202458
20605 -7898390 22671632 18897088 -2063883 11682814 -39296585 25087020 31084273 27550629
20597 27550629 21795501 -9711596 -1394650 -21776681 5199585 -25837823 13910886 12930906
20589 12930906 -8148165 40760605 18468113 30496574 -27337550 -5511003 25201375
20581 -5993545 -18252510 -3677769 19228576 7269497 -37989483 -25880427 4342667 1175939
20572 -9270081 -3628727 10813093 60467502 9885000 15665656 2051551 34024728 -3836060
20563 8066947 -33173922 6391344 -9927243 11576844 46021207 -8346491 -3227111 -12173319
20555 -12173319 -12438503 2823538 -34136113 -9492572 -3710387 16947760 -8011260 1429442
20546 -13680184 -30301969 -54178087 23992565 6253257 -9131315 -33519656 -2920945
20538 13335491 12970565 819146 -23127975 -13117156 21437848 18501564 -22853530 -31906572
20530 -31906572 -34715707 -40934213 -3648390 8777281 -1007002 -17492878 7312601 -22634302
20521 -27603626 -1495712 31725821 -26255930 4808119 -4592364 -2712993 -13069773 43984608
20512 -13583094 -46513825 -9528374 11886901 6853746 -4847249 18850581 -20569364
20504 -2199281 5563427 -18444137 2602212 -20998548 4137711 -12882990 45445437 7018776
20495 -11848087 -6808722 29893518 40761484 18157356 -15356615 -29747133 40649569
20487 12725102 -17677022 -28896357 55251632 8469344 5398588 18169269 34702448
20480 34702448 10236776 -45501298 -35137124 -33253652 -22556817 19916223 30507850
20473 30507850 -17578519 44485001 -5670684 -23253865 2765012 -11271097 -37796016
20466 -37796016 903077 -24921196 16510347 -26401762 -7524097 36922032 -8976939 47952
20457 -19233196 8456661 -7186215 -5403054 7429493 8625640 41414284 -26619772 27674488
20448 23328100 -10895997 15060204 -28462437 13113175 -15676808 -3041423 11630627
20440 27853804 -39928284 -11045321 41223111 -14583817 838473 2603244 -23740665
20432 19577475 4092862 35955910 -6673262 -5252699 -1018820 -24285089 16238777 -25867841
20423 15598151 -31754667 5710629 -1687278 -7724642 10439798 -24673860 28387439
20415 -27893483 132804 -23825266 -22947831 40024965 -18354349 21259546 12125779 10288931
20407 10288931 -18514569 8296583 4397486 7630966 22288832 6427904 -24931594 -4283437
20398 4812540 -14279568 4450720 24296457 -13748412 -2146147 -19226832 -18696442 36437252
20389 -37910554 9904755 -13061056 8943184 -35846311 14739017 -18088615 -3364899
20381 -13662209 -4542399 -7336514 4011553 -1142618 -10139637 36012364 9859772 -38439624
20372 49242639 21992495 18264566 -1395168 -38912562 -1741170 -25845634 -25980183 3592417
20363 8250054 6198636 -8925659 -13796909 10309582 -1785159 -12252253 -22395551 -36061868
20355 -36061868 32242800 17922114 8782647 23763388 -37972925 -1281344 -18342128
20348 -18342128 41345687 15044215 -1860454 41828099 28429609 15199594 -18708937
20340 33736342 14739263 12486329 -8043800 20833845 -19438030 -15354401 -16539823 18699405
20331 16186876 -11562844 2745081 30341199 -471882 -6022515 11234597 -13774476 39837566
20322 -21020579 -15855443 8219020 21204538 3782968 -27281891 -6850003 -26844715 22412348
20313 -27317415 31762757 25552402 6706804 25641848 3468174 1279440 -35259887 -39622796
20305 -39622796 7314221 11426056 -37904046 1782452 18468568 -22524527 -4449837 27559880
20296 -8543809 18431326 -25996541 2037664 -63570091 5486523 -28205422 -29905065 12209657
20287 -41174507 24875570 18960012 41022837 6744684 -8822358 -6743148 6371789 -18409068
20278 -2704357 -4866191 -4736766 14836671 25599470 31977656 4126600 21112917 1151903
20269 15625002 -3780845 21997423 -7137808 19936099 -36233218 13592217 -49129573
20261 16243879 21701520 -47719883 -8450992 -7674298 2449620 12586552 7063717 -18963128
20252 -30674383 25479426 968773 -8908207 21472030 -4798502 -918413 5205459 2671919
20244 2671919 12097627 -8349228 -18159136 -12360667 9852649 -8825785 -1291904 -21740450
20236 -21740450 -19443935 39277582 56666547 -5739837 28052216 9467930 -25087074
20228 305405 12953713 7240680 -7961413 -34871466 -13165662 -29936632 10407448 26142853
20220 26142853 22029061 23554596 -24701628 -2073959 25663413 13878244 -22424477
20212 34264065 18157555 -34659278 -37275966 -6488284 8488741 26361274 -14840832
20204 44158427 -31847888 23390357 -52388968 -4194251 9401723 614403 -363182 8334947
20195 2113817 14948245 17552792 9098253 33372285 12944113 -15079780 -30861823
20188 -30861823 -1826790 35391459 2868395 14510484 23238336 -12422024 28038950
20180 5956726 19920133 9146876 4261961 -13607652 1450675 -42904967 -2034055 -9270081
20172 -9270081 -13479729 2447546 5540493 -2689607 34277016 -19114599 -6677597 -34609107
20164 -34609107 15437762 -13911179 -3374596 -30485041 -396313 19366859 -4956812 -38744263
20156 -38744263 33810782 3518950 -28512847 -4582548 33706238 15854299 12705919
20149 12705919 -38530088 -24938221 21884353 -13527319 -4074099 -9353557 15429396
20141 -32952275 -14500333 -6979431 279953 34812683 5592255 -12965975 -7029571 36806581
20132 -8690282 -8115772 -19047879 10997482 33359013 -2652210 22121591 -20725665 20079974
20123 4111779 28601152 665053 32127473 10700269 -8651016 -1272147 31802139 29897255
20115 29897255 35207904 13284685 -23470432 6692464 10599598 -32191388 -19629607
20108 -19629607 30794050 -3146987 114984 20714491 -27834732 20022496 -3839797 429962
20099 8132215 7378279 -29300715 -17960972 3785012 -36258290 16033298 33140221 -9877140
20090 19799138 -74310931 4003958 14919112 24076547 64924078 -19777869 3797933
20082 22011315 -12023739 -15052869 -7783709 586226 -23711140 -8354142 -2763613 -18396841
20074 -18396841 -28013472 3368881 -15288161 -10434440 14755513 -14195807 20495211
20066 -4953585 -21666214 -762526 -10268984 -7025367 23380569 -3616194 17083221 5637281
20057 -15796084 14016468 12020703 -5016155 -20714740 -11751622 -7579476 32190433 -16646353
20048 -32457098 -11159436 2110124 10391398 11810505 -20465959 3581528 25016062 -22402212
20039 46234311 18670946 24584273 26509324 3814218 -15989841 14429152 8384682 17341965
20031 17341965 22028515 11800431 1737179 31652049 -18036264 2673143 31139713
20024 31139713 19847679 -3262972 -3465642 -19882588 1966062 -10153951 -18758210 9523131
20015 12019873 -494711 -14961248 -18270378 1032638 -6492523 -20927872 14952329 -7466307
20006 -15979058 12994135 7890377 -10913 44728004 4938226 243517 47071666 25669915
19998 25669915 -12719121 -14163031 -45907538 14957402 -18291314 -42802090 -20948774
19990 -33669482 5309221 26020237 5591408 -3731410 -63118029 9233206 37715477 -25333746
19981 9199887 18326732 -15118341 41763221 15383811 -27497615 33742801 22005536
19974 22005536 12577396 -13249518 29696828 4121825 -24080542 -23013019 18195701
19966 51158701 -12319170 28999805 24934502 49281086 9891132 5539959 38856820
19959 38856820 7059027 -10881255 13977841 8257464 -20350171 21097861 14306564
19952 14306564 -17435416 -9324977 33294938 -39172923 25215328 -43435058 -16837163
19944 -10294671 -11489028 27154065 -16064302 20820815 -803512 -2543575 -1210107 -15039700
19936 -15039700 -23076299 -22915908 -9210781 -5449839 -18419335 -54564472 45606259 3477923
19927 10560466 7550149 5343431 -17121892 13501557 -5300968 -3604578 -2661359 1871978
19918 -6688624 14479356 6997651 -22084874 4163563 -72617036 -7828123 42142012 -4251455
19909 -18439877 8197295 24523678 32670270 -5243751 -20391387 28837841 -12809820
19901 -35649981 -5077128 -19274821 27140384 -8541317 -42244215 200554 13355389 356056
19892 -6146602 19482868 -26567321 15581782 20097959 31948454 1929632 -6657099 5437342
19883 -9667255 -20515247 7282575 18429611 35008202 32034325 -22728967 27344186
19875 921177 -10258186 36603064 3506095 5293895 30046507 -14233328 44044691 -13159171
19866 -27390038 9228046 -1703170 -8678541 9472142 -56434065 7234365 -38514495 -27118450
19858 -27118450 3254921 24292591 -20578249 -12729838 -21147167 -22459776 -34378988 8648657
19849 49149756 -24818833 -23655704 -8612301 -8444908 -3914083 28660652 -9510996 9768614
19840 -2261018 -9544174 -1428071 -37565081 -11566811 -5361174 -17189539 -54635889 12069214
19831 -29748633 -26169473 15909897 -23304086 -21242281 20570798 -9589013 10349976
19823 -5446811 -10092336 20001234 12236092 25291798 9094773 31713576 20861439 -10184377
19814 1470692 18667906 48747666 24528520 -3910136 -14238106 17664049 6017017
19806 -16653764 -1026953 15553854 18650354 51909243 -34616532 31563229 60124735
19799 60124735 10726225 -23538515 -5416744 14873734 3763717 -41822830 30786210
19791 -21310330 24209488 -23761031 21636138 5829227 -29244765 8532743 -28222535
19783 -25373058 -12996408 3893259 -27578581 14033428 26336040 -21114441 27328488
19775 -21628231 -19939512 4215900 22831830 -7184442 30995165 -15134405 -5760245 48343681
19766 -15348024 7236613 4045958 -12917194 50286697 -30520977 -2795532 19855101
19758 -7075325 5199394 -40420194 -2130205 10065174 1115409 10594668 11401189 32172903
19750 32172903 7584438 25682657 6071962 21382802 29532371 -31471674 27181187
19742 24462665 38797286 14780822 26935483 1924503 -17984814 33436524 -14465744
19734 30556950 8720702 3653203 -12221931 680931 -399970 22025983 25345766 19309136
19726 19309136 2413722 -10071947 23262004 56773571 16230496 -20424878 -47341449
19719 -47341449 17762827 -16868660 -30416498 -2939124 46114619 2533811 5040635
19712 5040635 -7869831 -7374381 -21893003 -31450954 8668872 -37915612 -1003078 12319506
19703 -17128881 -20714254 30736855 32393461 4412599 3862168 9870266 -24062703 -12389417
19695 -12389417 -10723627 41119298 -789426 806973 -15905586 10762016 43658044 -5246408
19686 -43472181 -18984710 -17406771 36245883 13051985 19582394 -32110292 21364873
19678 2767859 32985130 -24556969 1346165 -11737937 -7904632 -17174037 6453839 7233931
19670 7233931 12837390 9601966 -6405402 36975758 -36681983 4647845 -29391527 41923892
19661 32805912 -34496445 -7215736 24759896 2962389 37571286 19965878 26813686
19654 26813686 5352141 9456930 6954010 19796219 -1258891 -27836752 30635320 -36190212
19645 -25800552 41656469 18107014 -10912228 2569964 34178606 14404487 -14206392
19637 -363591 -18778350 33577886 -55606715 -24620383 22082038 24649874 -5441693 22133285
19628 -52665318 14952887 13096156 -7261112 -25921276 -38236518 23859406 -26360933
19620 -35190696 10399726 8946739 -15374667 -11457898 -122838 2141891 -25476994 16897285
19611 -5875716 7678435 40183 -9084789 8943037 21720918 -11748179 -16287399 -11351045
19603 -11351045 1437719 35775974 -8777718 4145447 -11254704 -5900676 777567 42301663
19595 42301663 33081400 -11078567 47443794 -2324593 -21758823 29468726 53889406
19588 53889406 -29166690 13484538 27107513 42341220 -19529294 -26061989 -3512196
19580 -28851179 -3399713 58213458 -22609745 5795551 -9681332 -8782879 -5169878 21775357
19571 -33804507 18816123 -3257768 2764922 8940896 7741836 -17770046 61247636 -5525600
19562 -10008234 4892749 13282580 -23431998 -5721233 731930 -15480789 -1045965 32547499
19553 -1591321 41677845 -32341639 -34551600 -28268383 -41112033 -15886306 8493768 -25653825
19544 8535081 -15332007 -21330641 -40159820 -29850038 -17020337 4251905 -23053630
19536 1277687 10499895 2434449 4841148 31418477 14115123 12037623 -9773357 10405929
19527 6293857 30480623 17732093 33975866 -35880434 34581100 -23663565 6067809
19519 -40018420 -37636214 31330914 13160933 -7633966 -34523009 -4580964 16577770
19511 -34882655 -8795721 -3495191 13493522 -30038466 45506576 1219460 -12634296
19503 22901319 -1758447 -41720204 -12506675 -23232506 8805847 6949172 25771224
19496 25771224 22643883 9691093 -17818931 -11942448 -12277913 -28663082 34951211 3282133
19487 -7442050 12438924 43490790 -29388631 14467055 -12022362 -3348428 -33207387
19480 -33207387 -34155564 -13748124 15216105 -17054213 38140608 -23794647 1465719
19472 -22694474 -9572156 -29729300 -10617805 -17730065 7363012 28815995 -24538261
19464 18181301 23842121 19126247 -30555353 -34759980 42708785 -7263201 28317065 -61821066
19455 -13882585 42043481 15104224 45632742 -1071433 27637081 -4253970 -4480452 -2019681
19446 -14020126 42289717 -16962323 -17794434 7544451 -15705990 35515579 -40854663
19438 20766324 -9542303 29048097 8512106 15072669 -17039030 -4137601 -16088497 -4781683
19429 -41562206 39837586 380924 -13740347 -18466212 -19003155 10210577 -16353562 14763599
19420 -553459 -4190769 2465287 -24921260 9740718 18301332 -19287637 -20536856 -21492759
19412 -21492759 -17359559 3801951 -18250276 8077445 4335454 7594316 -4719179 6979006
19403 -5024648 -11221440 -8152099 -19533642 4345332 10727227 -2171360 17540951 -19939405
19394 44398320 -20037184 1773843 -27388968 -8999381 13541514 19850800 2174954 23927280
19386 23927280 16467628 14774790 5788320 6618676 2675057 10354498 2724664 -2018498
19377 15214203 32591323 5504337 13031266 5399597 620967 9529517 -29055215 -13848560
19368 -31974151 35422664 -16328019 -10847558 16465667 1504508 -11921492 26611804
19360 7755953 7542850 18327534 11893363 -3395878 -6836871 5039488 -17861035 -4788503
19351 -1061066 29831264 -29094343 -20207386 -11867007 -22995714 -40250173 18767464
19343 10298626 -22625238 7370345 -20783996 38568616 995645 23292299 30000868 -4084729
19334 -6549241 26840268 3127264 3547203 19652762 -8989388 16000819 -23985731 -9916602
19325 35406774 -12618213 1936394 6937849 -11023965 16742811 8956870 -16907236
19317 2683845 5100686 5469901 19757913 -47928996 6439966 4507917 -14785811 7791771
19308 17718506 -18691601 7611739 7833635 -4505149 19709082 8247524 -46373474 13805067
19299 -4782139 19034836 -23689109 21890327 6251567 28100271 -17827208 -22865716
19292 -22865716 -18637231 30885010 -34177941 -24643483 -20174491 -11032844 -8240121 1288766
19283 -27645203 2582053 -32494844 24040599 -7984460 23216697 35971033 -28365779
19275 -13309472 -15401936 9665826 13233197 -12623781 -10427303 1982867 -23130551 -28355211
19267 -28355211 8244592 -8459603 -30322813 -16736820 -23372942 22030007 17112912 -1270618
19258 11987199 -17858168 -17215111 3349041 -35031433 27782308 32566849 -637684 -9765470
19250 -9765470 -3961242 -25145766 -51232597 2045080 61465711 -9535050 13472522 -8518750
19241 -17360972 13920067 1088331 -16622969 -22868380 -5821905 11507687 -31894849
19233 -14817583 4066344 13448294 -21976 37571085 -22626282 -20299581 31766059 -179190
19224 17379420 20175089 45291878 7627088 35462691 5121428 8765076 26090578 1210867
19215 16188229 5367312 -9729614 8142626 -12493490 988934 -9599736 -25379953 17468271
19206 1003926 -6587824 -16839338 21822245 -10156924 -12874429 23294042 -16301777
19198 1771 34763020 -22284587 18725119 -6700931 28173195 -2947587 -39989075 -17654783
19189 -30901191 -4226333 -5613566 -17119763 -11329845 9511077 -7042399 -25054368 16879893
19180 -19365698 -14344051 18712310 -7624652 -6916647 -18280016 -5036278 7608644 5056737
19172 5056737 21634046 376616 20078361 -41480796 4080399 -15564690 -29940109 24332838
19163 -32551829 538825 6880149 -28658886 18252245 -9694029 35411115 18724169 6528035
19154 2536244 5620973 20517849 -23231457 54024148 17381784 34968351 6554316
19146 -28747412 -7810038 16860444 -25099266 31767693 -19438614 29933402 -21241132
19138 -9452108 4517883 20893154 10261688 9832133 -45987669 32842599 11682164 -1108984
19129 17026956 15236526 -376714 19450796 32427192 16092885 28757952 -7450843 -3001067
19120 -8463788 206274 44167111 -9891389 43696739 -25328889 -16646587 -42885483 3384564
19111 -20445522 15262467 -14583417 6887933 -41794847 -1946288 5137107 -7012061 784703
19102 -42258880 -10076562 -6764404 1173814 2908059 -21752834 9711437 -1542952 -13765959
19094 -13765959 4682766 -4495565 -12526464 -20499714 21649924 38327151 35089413 -19217253
19085 18501214 -17374939 -21398233 15003204 -11655987 30406208 19879021 42077339
19078 42077339 -44069584 38620415 7178333 -10400133 34901098 -30434760 12150223
19070 -15344392 -12361447 -30867171 4529771 7547141 -48221489 22545224 -20494902
19062 -30450364 10660884 55556592 17100330 13149946 13770854 -35551646 -29966719 -48224952
19054 -48224952 14958025 -3223810 5443123 -35583874 14623301 13253747 -10302944
19046 5282004 -7470563 6806991 -5536862 -11983851 -13219094 14781246 5095315 -9982612
19037 67731261 -12608327 -21332646 9408023 -25794465 -17829243 -5752968 35792533 -2210865
19028 21883972 26922913 22639151 26952973 9101208 -23319789 -10969554 2240029 4323452
19020 4323452 -18937312 18443832 -20871162 -47040504 6790219 -775932 -10768213 -9386528
19012 -9386528 3116878 20623598 5567914 -22181183 -23856796 15114836 -35230229 9121784
19003 6606701 10026307 -22867968 20913035 10434134 14404985 -10943863 11716605
18995 56359114 -15019692 -7952200 -4537572 8241004 -23803967 16038957 8769574 -9835606
18986 -30082940 -31624498 -52863751 34810888 -8298612 -5793608 -31592835 18541840
18978 17222693 -9061037 20035854 -15111650 26385316 40407705 27863072 11592778
18970 17276664 23002180 -7092433 18887725 -2830216 -25031910 -683833 -890603 -6684776
18962 -6684776 -24846727 -26732742 10508975 12010902 -3576913 2641335 13795791 -14274396
18953 -16840782 18177846 31176317 8831112 -13167866 -5882700 -9873139 6397499 12530462
18945 12530462 6372681 13982523 10467749 4377404 13204156 -30532986 20158345 -22479093
18936 -11462167 -11504706 2839590 -18225480 -1248621 -36280322 -4866086 -11686232 28837718
18927 -5077572 21820530 -21633386 -9228083 46969889 11223209 35988677 -16416733
18919 41053944 -6552162 22685525 4133189 -17478871 -3877448 -8440775 -6831134 -8059160
18911 -8059160 12515153 961810 16777832 32056079 12646093 1944371 20445193 -8566019
18902 -17043948 -7616002 32526327 12216711 -746225 18058486 -37282869 -27553273 -14196422
18894 -14196422 -1077881 40636738 2432050 5984880 -3773336 14995230 -20865862 16428957
18885 -34797805 -9724244 8422329 19413805 -24797597 4343645 -20138686 -8615450 -24329947
18877 -24329947 6206170 6246682 5154647 -7284099 -23196073 3471512 -27308256 -19405604
18869 -19405604 10246590 -4339646 -5140684 10246613 18841687 2058211 22001320 -21957669
18860 10732711 -9247877 36636872 20343681 -6627745 -15013414 -31601435 7251622 -5508799
18851 17088269 -36101246 16914297 27237440 250380 -6935848 -2033354 -6708170 -14366799
18843 -14366799 -1858558 787087 26638286 7079863 3376506 49926284 17083565 14737167
18835 14737167 -24428808 1443820 -31825398 -1833369 26280853 -26549189 -25736766 16055961
18826 -702269 39575595 -6802371 -19800734 -7343159 17013962 -14428544 40682934 -17317024
18817 -15535270 20728758 40252735 -27601472 6096294 9240422 -11023622 32052537
18809 -1400587 -2061279 -8956652 -3850158 20465187 -34913999 -3383749 -6316176 6075337
18800 3366007 10246678 -9322647 7626263 -19589820 -4929365 -106294 10870575 -16306741
18791 -14717122 12111426 -31493271 9231775 -14003008 -22440064 -30107830 13805733
18783 -20775469 19437242 -12708394 18900291 12996337 2465299 -8499410 -25473362
18776 -25473362 6608689 17898958 784020 -5660067 -8319837 22483061 3006547 -28300717
18767 9603282 22346418 3702268 -68803 -2811113 33168984 -7768656 23523717 -21433147
18758 25092640 6347133 25534809 14757798 27394002 -22629141 -729112 25345822
18750 -31528910 -7151609 -3759559 -22947296 -42041137 290275 -12237711 13358816 16779104
18742 16779104 -29853201 -21751225 19904073 -43999426 18946410 -11435043 -3690906
18734 -19295114 39686277 -4613732 -10995163 -7335563 -66551128 -17631491 7944773 5618442
18726 5618442 7486956 -16878103 -50089111 9634165 20037944 15100832 12250988 22079383
18718 22079383 5771970 16969340 -45403028 -2062893 -14275205 1999614 2336770 -6374686
18709 4762059 -25247470 22900729 27302466 37876350 -14014943 -24413531 6225755
18701 -12801781 -35351919 25165582 -22644439 51937629 -11389263 4204 -120916 45106897
18692 -16941829 -1538933 -5561706 -9589917 34705658 9675926 -13112098 7862209 9452184
18684 9452184 8514293 7379060 4337526 30630561 -29431248 -17495359 43752751 6561917
18675 -10092277 4757763 -11377845 -43058527 -7759311 49006487 17294108 -14374982
18667 13053204 16816975 37130044 -22658790 -1160856 -21986174 14772759 -13223834
18659 19264171 -13185158 1041528 18202816 23620316 -56507849 31875557 22586899
18652 22586899 6623573 -33904462 -7540457 -33911846 -5258768 -18638839 -29412155
18645 -29412155 18418898 -19142741 9762438 2396913 41405335 28718431 13308350
18637 47239162 -11244660 -33649220 19144645 -37411191 -22079770 7525232 -19729245
18629 64145085 -12980211 8377943 -37364818 -16757298 23068141 -3355950 -27539614
18622 -27539614 9676151 24551975 13960685 20429769 5270335 7093067 17333925 10133163
18614 10133163 10342779 14063764 -14059470 -7527789 -23002898 10527832 -5167223 -27942931
18606 -27942931 4756724 -14509254 -27519969 -10693738 32303148 13826190 32649704
18599 32649704 30930961 11985816 7459114 23489262 10596655 -35964621 17581460
18591 9967925 -17040260 4847820 -14908797 20874067 -44063435 -16248630 8581120
18583 8131659 46861846 -45498382 34534882 4293357 19219435 36024625 33177872
18576 33177872 -17156738 -31394317 11359161 -8783581 7578608 -47727498 -1318795
18568 12956490 -22166749 -16667653 17034016 14509386 -10936767 -40099391 5641699
18560 67403648 -8084218 31714411 -24982856 -5386470 -52510011 -22603482 5151707
18552 -25187118 -27735409 15054386 10169192 18201560 -22602931 9307963 726293 80133592
18544 80133592 -31668484 -13386384 -19345540 -10502873 21378729 1397649 -7078904 -5005744
18536 -5005744 -13811709 -11310043 3982145 -16621495 908549 8306113 16411867 -3253214
18527 -21907663 17587057 -35261852 20935250 18284833 -29732388 36782634 41024740
18520 41024740 9010157 27613044 33350197 9392189 9248565 9494863 18702026 53213822
18512 53213822 13470286 -25465557 26991651 19312718 -2409740 -32347513 2626637
18504 -10367214 -8995091 -28189363 19345829 -35587281 7101284 -6833456 -15808755 -20801184
18496 -20801184 17616595 30863892 -7578755 -2267971 -14067224 3009905 2222119 1852541
18488 1852541 48658293 -11909656 -21668068 -2520853 -27749705 21096643 -21787141
18480 5139566 9795546 471953 26795795 15328297 55678583 19201132 20422497 2521707
18471 -11768022 -16832170 -9364781 7245385 20826833 -56408161 10886697 -13542899
18463 21344463 -3891420 9760877 16895385 -3405700 10059544 -25001093 11183350 -11975436
18454 -28511743 -14959965 6104683 44000551 26530939 -1968368 -9674065 -27207360
18447 -27207360 30308708 17364199 -287385 5428188 44206601 -12057356 -10921994 17125916
18438 -22018809 -1183013 20459466 26361459 -760904 10182939 4484897 19143052 3836598
18429 -5292312 -5534740 -9702746 25212515 -49455369 24839890 8744627 17359506 33877792
18421 33877792 15617699 4995137 -59350517 18949889 -4248716 37879796 205095 16943826
18413 16943826 -29102340 -33326882 18056150 29158391 -11534732 21700318 18107696
18406 18107696 -11353658 40204689 -26288455 20010957 51076952 -66391879 9174952
18398 34654508 19168204 -6343850 -8328114 -23284732 5403618 1541430 12553788 6587967
18390 6587967 -13808420 17506597 -1652762 -22628290 -3032027 36532013 -2870617 22559219
18381 -23292694 -26247509 -28774275 5565721 -14315 -19205228 29080735 15812956 -19940219
18372 16657475 -7113815 -25671789 42326985 -6269029 -27402325 25134598 33560937
18365 33560937 -3691121 4748901 -22125070 23987687 -312781 9630043 25999723 -7301172
18356 -47606658 19324988 10703878 36231082 -36645434 -43093614 -11611036 17272921
18348 -30418742 140182 2475437 32687771 2954013 -8028582 9821945 -4659200 -22230654
18340 -22230654 -3723917 -47535979 8859617 1567522 9603874 12871476 31125962 41250065
18332 41250065 -9027993 19617654 7524301 29389498 -11336210 4427644 -4854397 -7170885
18324 -7170885 -6081055 -12444029 3661832 8828518 16463613 29935550 -31275486 -29255590
18316 -29255590 39187957 48203376 19551984 706599 505339 25362279 -899877 -21726680
18308 -21726680 -34497030 15705034 -2996393 -22683653 -9508817 5984008 -31943875
18300 10021761 11506785 32175899 -12787251 42136062 7554302 -32830232 67151861
18292 1984158 15291226 16363500 35336854 -3932756 -13915241 -7077297 -11119952 12896060
18283 6914836 6139020 3638262 -51584380 -4326016 31567150 -350735 -19469072 -17513395
18275 -17513395 -35105408 -19141381 7813042 -30838843 -1293126 16384757 -11680164
18267 24780407 -15604572 19783431 -10014051 22448827 25426265 -17503554 -13592390
18260 -13592390 17577638 -8976407 -14896071 42565452 40832886 19577298 6159891 -34112362
18251 -11166654 -22959756 -26021950 -18283298 -374531 -27616766 37155807 -12883406 -26348230
18243 -26348230 25273724 34401444 23913035 -14060908 9453431 20333115 -20198425
18235 -2657184 8310405 -5376075 11273120 -15255679 15397876 19933450 -26125561 -5917293
18226 -566604 -4957852 34863484 5218214 37060041 -23360426 17395004 34417769 14094738
18217 16381625 8476214 1007302 13031807 -51673332 3545289 2802214 -19589796 -403295
18208 9346906 10717209 9656153 43930756 4181113 53450302 18894876 14585430 -22678694
18199 -13112549 -44510749 24526893 8834136 31573838 13164233 14156496 -1729286 -33105328
18191 -33105328 -7370906 6536937 11153226 -7371546 -15251216 12249108 10414971 -31534265
18182 16572236 11042648 3721173 18807163 23466749 -27141186 27631809 26301280 5452669
18173 20419738 -14417343 14433204 16554538 -20837868 -5314506 -11287990 -30057082
18166 -30057082 28728356 8329755 2113718 12165288 -8002629 -24300160 42834266
18158 -17738086 -24583558 16950950 -13093957 -3488971 -22256103 -9392708 47547412
18150 24494224 -15051777 27558273 -14031668 -10632758 11653611 32238194 -5563055
18142 -14339123 -37748967 -15896303 27790474 2574501 36409435 29299251 -27591392
18134 -22899763 -5044849 -4962461 3410196 19458271 -20351380 -48849176 422696 -28524081
18125 21746721 22185687 38928187 61497298 4502668 -4694927 17836785 -1881929 37413777
18116 2324220 -21905576 15508436 2995784 1362877 -24092230 -8911533 6315153 -18983372
18107 -10331588 21320117 -28095024 21900861 6134653 42597334 -592679 -11784815
18100 -11784815 12880102 -7470921 -7358489 17877174 12620911 -9346094 24542041 23036609
18092 23036609 6993176 13625848 13350497 -17321055 -15433670 -43552020 18262768 -12153594
18083 -49039762 -8124762 4849520 -32971731 -19420723 3482466 -14735817 -16907716 -32437968
18075 -32437968 -6237731 -10491260 6155491 -3141891 52637341 -18993729 93162 -29725397
18066 -31222130 9011319 3331243 27049694 -16689030 -6832501 11740797 11546342 -34609884
18057 5624865 -12996862 -24020994 15283726 -29975989 -29351742 -3743615 26990608 -2232354
18048 750529 29746885 -25779634 -22733 -14988541 -9915638 -29907424 -17756436 6577791
18039 -13927487 -2543664 2551421 -20800400 -7108219 7959708 -15580372 7552702 -22967818
18030 831340 9514524 -25834551 4492775 8847796 7912992 -11022101 16911272 18665217
18022 18665217 -33193118 -45684358 -40649820 -5809413 -11767448 -12521789 -17560834 -1424794
18013 26649937 -28223033 9729146 -29202250 -13903639 -1733724 -20761353 996741 -3182553
18004 21598894 22208809 20165777 22777061 -37284377 -27146533 29323202 -26964443 -3680262
17995 15078540 -28492896 -15427674 14740331 9431883 907638 -10456392 39151219
17987 -19936582 -644200 26413034 793031 -10356788 5110630 21366031 29830044 -11609261
17978 -1512182 -15011600 11466172 15471132 739211 6200874 29424173 46588802 22167702
17969 2558756 2408019 -39458207 24245483 6533998 10291735 17007170 3604580 -19835315
17960 21905760 -11951124 30912151 30369639 13881232 8438307 -9862708 -2158626 -25993445
17952 -25993445 6817511 -221182 -32981868 1488305 4536427 -7599824 261734 17888521
17944 17888521 -3840615 -19256595 16030839 61906718 -742402 -8718031 -22174696 -2761991
17935 -21321130 -5347812 49529837 -19481350 -20034686 23451528 8219780 -14746118 16251027
17926 43778404 -9395506 7364699 -49600139 29789589 -26118397 5610810 -21189414
17918 -25964024 2762375 8608544 -11500227 5454400 -17251345 -31191125 -452016 -14808251
17910 -14808251 -10742932 1542019 5941469 8841185 -10619587 10826878 10424014 11345929
17902 11345929 -32071139 -40466992 8003190 33571737 15557722 34216669 6202914
17894 -12128663 14512843 -34871369 -10568772 7225625 11157933 6656358 -36323205
17886 -9233399 -33944096 34734171 24998312 -29452847 -8026171 -7585572 -7268578 -9669558
17878 -9669558 10619931 13948037 -11092258 -2015547 -11367778 -29674480 -4174613 -4945387
17870 -4945387 22752414 26380984 -15280231 1612506 -6271360 -9551818 14283579 -19264703
17861 6617816 29629417 -152433 -17057749 21963502 -18583891 -5926402 19490009 18409459
17853 18409459 -1728890 -5409718 6519520 -21215247 3390438 -25819061 11778694 12019920
17845 12019920 8185389 51496914 -36561021 3261676 -6724857 -22217533 -23136660 1978107
17836 8059000 5798005 -24774880 -11335686 -16380743 -19112531 174324 -25956094 44749265
17827 -7208967 30552327 -40854687 -6513084 5185082 -8070178 11810303 -28314008 -6824921
17818 28561762 6404653 16760321 23269534 -9526256 36962385 -10606887 9781686 14162595
17810 14162595 -2167782 1598755 -4931805 -18325150 8741250 -15322865 -1855449 31729831
17801 -13557311 6743071 27736302 7507157 -13037351 -9175517 -11039223 8399407 31180386
17793 31180386 29713039 -14078585 6519313 -33196824 16569608 -15258100 -21196371
17786 -21196371 14566092 -41716848 -5626822 6786217 16428659 17722922 14583648 5219152
17777 -1534474 -15151770 16538150 -5099438 -30430247 28289152 25887606 -8041477 34665668
17768 18512772 20399553 15970010 12347309 16329441 23047222 18345852 -738006 8120899
17759 -18136148 16881657 30318578 -15379973 1189110 7914071 -36545218 -43074507
17752 -43074507 17547553 -1256716 -29419311 58236362 -791371 22472262 11561796
17745 11561796 -599168 -4480045 8973389 8531800 51334691 11009990 19073720 -3633997
17736 16382852 -35097742 23115232 3598020 -26936254 -559205 -11508449 -29537770
17729 -29537770 -6178716 3076584 -46740016 -35082177 49266275 -29274121 3590251
17721 -5524793 -53042403 -9186392 -18277843 -3347304 -15126709 4335744 -11367027 -1138937
17712 18887823 2755575 -8634805 27771554 35064168 -16849492 -14528206 29865433 5351108
17703 3309171 19891107 12763169 906030 -19464837 -5621027 13965078 30960769 -3649261
17694 39854420 -10292246 -53685042 25671186 4408325 -17039934 -32127099 -5899789
17686 12969230 -4007674 -12712148 28273421 21727973 -2972545 14400440 235722 1302903
17678 1302903 -5676414 10785102 -15936331 27497529 -8558246 47896663 -26029006
17670 -2495191 33995494 41387090 -4725689 -3968644 6945994 -16045474 -20295068 658711
17661 9128935 602922 19127897 -11136030 -20323422 24528360 -15782535 41541434 -867551
17652 52890877 -18359988 920920 9147080 4148765 2609130 -50227163 -12566859 29320121
17643 -25327319 -39196554 -756785 -7222698 62160387 20357997 -1669278 -2812181 -18175330
17635 -18175330 10500170 -11559934 2925132 14170551 -4017221 6278256 -19968127
17627 39646872 21413293 -3964608 18040963 5200198 -38802667 45904387 14024852
17619 -10471539 1970194 9099428 -5897586 11743151 -19432984 -471818 35303873 -7694133
17610 26177783 -835316 25447632 -10161161 33899850 15033343 17384754 -22601284
17602 28258268 -5425585 -2740903 7708049 18715994 56014208 20665820 -10706704
17594 -2890640 -47979229 15976859 23366985 37621487 -2200426 -52017678 -26744179
17587 -26744179 -18150395 59371576 72223661 -11502419 37077071 -9817855 25970383
17579 27457923 -20605349 56832450 -8809672 -2426459 -15729982 10753306 -3891253
17571 27026434 2208411 -24326095 -42376946 30113703 4783729 -6551998 -4351024 10929142
17562 34275665 10699580 -26010340 -19190042 39913948 27666182 1832965 -10181155
17554 11231149 -26275895 23945404 -44034662 -28391323 -14460992 -4277581 23265405
17546 4883530 -14840735 24918466 9621698 10033974 34568097 29046608 19350293 2882825
17537 -21164092 -24152051 41423948 -4766449 16591003 -6889993 -22421543 -22916414 3239910
17528 51937210 34977456 -22292870 -20748330 -12711256 -33364489 4290796 -1900999 -5991312
17520 -5991312 25333568 -30023017 12937111 33123680 26044685 7291972 20666075
17513 20666075 -7052004 11049930 12339862 -16212577 33239711 -19188754 -20386477
17506 -20386477 11387893 -40279716 3715635 14521535 34745919 2285894 24674891
17499 24674891 -23668800 439608 4976254 32061048 16329410 -1857022 981931 2881111
17491 2881111 -300146 -16699774 -7438821 -48013215 6130394 16091640 -7016855 13432978
17482 48875210 7797487 -47554768 14044351 27163384 -17139158 1975635 16863717
17475 16863717 -836866 5887195 -4986525 32397364 -7862147 10447899 -124655 45152754
17466 -27642478 29949861 -2869356 -31485581 21977697 -41210536 -28975155 42230848
17458 -28976241 19107352 -7608010 -20273230 -1803404 -6016444 -27212676 52057067
17450 -9029454 -380607 2834730 17594564 487088 -42786294 -21827537 2341555 23736680
17442 23736680 34108746 21904543 -16683680 22560270 3158668 6207432 6994524 -18692018
17433 12553610 39995494 29990572 -1641542 -11310944 -12777045 -13704295 8636634 -7782867
17424 -22099846 30551280 -802288 -30590099 -6453177 -10318564 -14228960 -1239495 -1121496
17416 -1121496 7168749 -40831604 -5481177 28360588 13889900 20510643 -29511054 -26032650
17408 -26032650 -863479 47616379 -19363565 2950374 3700765 -9469272 -49358837 11599250
17399 34247570 -2222536 8661601 -23547874 32333734 -25723051 -27839663 45226565
17391 33236931 3991659 -32426700 33953877 51901178 -4347247 1059210 -12814348
17383 16018474 -11970872 -13461692 -41873102 -36587921 -20398006 23196983 23621695 15865666
17375 15865666 27822162 -16471531 20686891 10227891 33354502 43088367 -11009474
17367 30677084 -13015083 7634132 -24658723 21212662 15042409 -55393053 31616267
17359 14548845 -11751193 -10986983 21574638 7814891 -17221491 23403506 21632459 18797286
17351 18797286 12835501 1431818 21287367 10697264 -14971938 -2970629 -3209091 10025119
17342 32687512 15771610 -13023174 27513218 -17178627 9026083 -223907 24831535
17334 27984760 8237303 34864215 27876955 16394474 15448319 5475057 -29947320 43948878
17325 -6189100 -580626 -6870576 -234036 -16957151 -9756670 3801015 15012328 -23954577
17316 41311722 -16200881 45450870 -10666243 3478895 -13063104 1406853 -21579420
17308 -3272340 18296478 3281547 -35314206 -11275030 3638810 335759 -20714750 -24949511
17300 -24949511 20340751 1674779 37829125 21010866 5762268 -43699775 -1447687
17292 -21207439 -6057678 14506734 -38352409 -28097485 28847059 36924381 6754900
17284 21329955 -7398311 -16041197 -145812 953265 2007404 19243529 1434700 34956961
17276 34956961 31155576 12726013 8990217 20858270 12695191 -9277602 12078577 19328120
17268 19328120 -11010179 636059 44353061 29790937 -22552763 4480788 3278994 543695
17259 -265808 3360560 38072240 6141350 9491673 32718354 15070941 -16183463 25586958
17250 29917783 -4251581 -9592406 9544060 -23914477 33028762 -13568145 -28551964
17243 -28551964 6907463 -15736479 37348916 22756076 -39917953 -1110779 518218 11364073
17235 11364073 7653297 2065028 -22665708 -33593392 -8050064 9628432 7004848 1152792
17226 -4391226 -30702233 -26594704 19008324 8642389 12482586 -31912732 10393700 10456850
17218 10456850 39483724 -6612976 9341281 30425378 -2981840 34580334 18341397
17211 18341397 2607704 -12447010 -41249955 34470650 7220084 -21646076 4879502
17203 -21030576 -8266265 16726676 -19525365 -18391670 -20726389 -1504537 -21419974 -29226312
17195 -29226312 -7089695 25482087 15811122 50918470 52059848 15179209 -4090031 11861529
17186 -27583539 -1435426 -32239401 -14614267 28984668 4930571 64591337 -10884407
17178 -10152611 -6800804 -30496215 3882054 3637923 35058172 -13869149 -3483305 -10189584
17170 -10189584 -7485505 12241168 -21176370 28276593 -12466164 -7375103 22382565
17162 19641296 26672557 -35678000 13754254 -20563841 1308816 26486208 -9384422
17154 21600445 -1835109 15822876 8166248 45583939 8130007 19809447 38867867
17147 38867867 -37923764 29219084 -26370745 10763130 35688447 -1599076 48396825
17139 -39805905 13057428 1387939 12287368 8635662 12475484 17068404 42523341 16360847
17130 -23076781 -22676887 -4155166 -10652849 -25467135 -26198841 6462653 11383975 -8507671
17121 31353584 18113145 -12466298 15084802 2111758 10430820 -15289449 -25172230
17114 -25172230 -5671993 -62456320 -18466954 26978088 7658218 -17130601 -8459708
17106 21714202 -11217679 32943096 -37508048 15291660 17292706 -20441544 22402694
17098 -6956103 10085272 -7564945 19426742 16005109 20203670 9537875 5661013 -9819747
17089 2437125 6012954 -22030399 15587035 -2932371 -2563813 -18269032 -12268911 44300124
17080 -4719342 20296535 25859645 -8427819 43882111 5636400 -20143838 22889782 1134381
17071 -3113949 -10061438 -16762046 11000100 635741 6255305 -44326374 51465865 10990639
17062 20297265 16110747 28043609 -12637458 24234635 36619030 31754549 46280899
17055 46280899 -8694757 31392073 -3846821 -25362206 -22291278 -17651906 8182409 23588177
17047 23588177 -6597018 -25302765 275894 17568195 16002288 -13921304 4905324 -815402
17038 6808992 7706038 18626709 16032650 33799330 19048700 15586444 -31813367 3134375
17029 33027197 -7808773 -18215081 -21749142 20806866 -6048172 10204009 15389598 -22887982
17020 8993798 6316145 34719634 1065770 -27261321 3875166 25117894 11286049 21798573
17012 21798573 30931864 -25829894 -31507118 434910 55420708 -9816728 -8845271 -7894073
17004 -7894073 5285430 10138728 2215578 22185010 -14682529 34045427 -9098430 33135265
16995 43725383 25245260 15760664 -43756814 -43563426 -25019579 30605502 -17458022
16987 20764216 -48763800 24038114 22051415 -36537304 14755846 -16065815 27839548
16979 -7077251 -11408082 -37426553 25637318 9277525 -22249319 -834175 -7628201 13215883
16970 14468402 -17909230 10100358 -35853863 -4439483 19946869 18430375 -1747690
16962 29062348 11683978 -23256889 2322145 -5333186 -2533899 31139427 -5984988 8838563
16953 9876119 23527283 32160432 995572 -1974263 4806575 37903277 9228772 -42229768
16944 51446178 -35725981 -2113087 -26844676 -13021211 13395328 -1069866 10291394
16936 4288496 -12794178 5894216 3961019 -4962606 18532266 -25245450 -32879342 -26912159
16928 -26912159 -3746883 8449066 -25448753 4547937 -34048926 -6272094 15866214 -17447117
16919 33041916 -19189713 24671232 -22580090 -28465246 -13120127 14004212 61298287
16912 61298287 -46138145 15254054 -1643614 -362035 -15060920 8331540 8228773 11331747
16904 11331747 53555073 17889121 -8245473 -4559003 43747059 -17815829 19715166
16896 2314411 24333860 541421 44253212 29572310 11373792 -11767468 -15403864 32457729
16887 -9214930 17568751 5881687 -6322053 16143327 35696290 18744006 2206455 -4482541
16878 17537343 10737516 26773019 -5406059 -9793495 -48994466 -1631255 4334742 36375755
16870 36375755 9116833 19395386 38378955 -49513509 -39807957 4544467 -13120266
16862 8379749 8958917 -22698156 18456105 -4176113 -2374834 -17688255 8491721 21674634
16854 21674634 19296126 31874373 -12883900 36122682 13895625 -28216511 -11133742
16846 21125132 35550594 12532625 -17917260 27501123 18836496 37535460 23634916
16839 23634916 26644178 -21991225 32161908 29998392 -3996144 25092852 5008062 -15728453
16830 -10454578 18106217 -6950993 3347413 120536 4099956 -22878896 -9627481 18245961
16821 23429159 1637399 23004680 19113679 16754031 -9139886 -28059929 36664091 -6754879
16812 22981881 42262919 26374917 38108385 -44704478 -7642705 3760735 5435727
16805 5435727 -20472092 9093251 -12959072 -677672 24786690 20292306 24867835 -2451041
16796 -1455905 54876582 -5209527 12071498 39986148 35347617 32693208 14742260 23463804
16788 23463804 9296502 -14602696 35953089 10769499 -2530149 -14059888 -29863604
16781 -29863604 -3687206 -2151929 19053362 -10370213 32682806 -3644671 8532456 40250305
16773 40250305 -11428133 26388845 6931722 14620597 6516744 20717789 -14900407
16765 -26305625 1799369 28484723 15421952 13031673 15174422 6327649 -10435098 16509548
16756 27575056 30782439 -7037207 46998999 11772193 -29568638 13312258 -6488592
16748 18753752 -13111511 26515286 -344181 29584955 -13244801 -13317530 14429577 -8285132
16739 30189978 6178421 17157600 -5916038 -18726363 16853322 -869884 17768739 34786335
16731 34786335 13416892 -10230186 25748120 35494771 -2624702 19266617 -15824626
16723 29016794 23629963 13723254 16310928 -4063014 21208932 11961460 -12443117 2603601
16714 -3835512 -10627558 6903589 12281169 14369746 11521620 32688706 -25967128 11888477
16705 12365753 14444938 -12160935 -23073227 4002768 -4557108 5764945 14809613 22257404
16697 22257404 39841351 16556708 25643270 29479790 13439983 39398174 -4221939
16689 20590378 10474532 14318281 -4653752 4759090 -15937380 26876738 13990621
16682 13990621 -3613524 9388555 18459485 21902617 3332922 58043761 45559321 -11676369
16673 10694086 36180214 608813 -25718171 36149204 -31645670 9559384 55520454
16666 55520454 1616903 6588904 32863261 19574297 40366996 3588702 10982915 6192907
16658 6192907 7075292 32328642 52522549 74261841 68077529 22345649 72628008 32597854
16649 46849713 66619482 79109194 90590119 83747340 70370171 80995234 114381203
16642 114381203 93986988 65751059 70011280 35370707 4109510 -48733367 -70806044
16635 -70806044 -192448953 -243159266 -324779794 -361062494 -384071078 -391426930 -340179114
16628 -340179114 -303122513 -243073948 -206560637 -196636869 -163971916 -129366699 -149797648
16621 -149797648 -109962674 -90869848 -106629890 -90076572 -60421668 -26919689 -79697876
16614 -79697876 -44509617 -56970593 -45082561 -37400875 -65464548 -54693834 -73321870
16607 -73321870 -13347869 538644 -33269542 -34833366 -32837233 -23779175 -33078028 -60737137
16599 -60737137 -11415209 -40500834 -42506929 -36268310 -30982985 -37299676 -27982073 -39774011
16591 -39774011 -7642834 -29709329 -58660823 -53613309 -50834800 -5857595 2545306 14030196
16583 14030196 -23119006 -8886864 -42119487 -40812913 9376490 -29493579 43646463
16575 -38937836 -14688929 -8591585 1916954 -12835084 27578201 -49929561 14888217
16567 -22025566 -1878015 -40426365 -37247208 -20545341 -29807854 -10148371 -7805467 -3418609
16558 -3102071 24252765 -29422906 -34636238 15292137 -20267987 -25714313 -8969815 7028566
16549 -6516292 -15373383 -17469653 -15195034 -39632969 -12599637 -12546860 2771124 9376703
16541 9376703 2507368 -36855605 -5908550 -22802108 7498014 -44337724 23514537 35584916
16533 35584916 17339885 15742631 17520548 -42388454 -31615978 3719038 -18356167
16525 -31048821 -5052930 -24265055 28156199 15271781 14270317 1926627 -8787198 6942699
16516 21803915 51215005 -17130790 -4875353 10806672 -21608479 2542926 -22519508
16508 -3462155 17552901 -10291075 -14927904 -21339198 17445948 14655205 -41952026 -5371292
16499 45886102 -18913223 -25696627 9659568 -4506001 13134048 -38714483 -56208908
16492 -56208908 -34878432 -16553922 -33606492 -3152500 35046281 26024086 -9217479
16484 6894354 -35994987 12342763 -9561761 2971841 14193734 -11536423 11382688
16476 -29420395 -36805075 -14182857 2275101 34499899 -25941156 -7635958 -35085094
16469 -35085094 -12868950 6150070 -40297521 -48179856 -34454143 22694349 -9030920
16461 -22444791 14061231 42584033 22556273 18449078 -28994762 -27619337 15635559
16453 19777865 4102333 -7537109 -24876292 -10834195 30720018 16566470 14284458
16446 14284458 20640244 -1150406 -3265320 1698222 -7910314 -46479245 930818 1593124
16438 1593124 24278690 11495136 14586460 13336998 12547202 10138560 -27457272 -10864134
16429 -18383764 16564892 -27850756 4501915 11519631 16929305 35679337 -14532510
16421 -11538538 6368839 -20573798 -36684453 -14912156 6503307 -3634771 20831312
16413 27580375 -1056081 1367643 -1887582 -8615716 -18709821 15356313 -25339090 -31744171
16405 -31744171 6158546 -7522455 -27214206 -17997652 -12654589 43395392 5533323 -4186256
16396 -1032645 -8574280 24420734 -33194001 16661350 9474332 8358797 -4758302 29314479
16387 23494191 -16903156 -7428151 -16720212 -51012820 1063345 44171977 4609432 1290294
16378 -7319156 1291599 -5446145 -24445178 3246077 -23622285 -29157094 15966713 -18522576
16369 -17051054 -3230057 21130466 14912513 7477567 -58702276 -20282693 -34796787
16362 -34796787 8738868 19605564 7813661 -29906131 8307771 3864061 8058717 -23533492
16353 -15305201 -8680791 -16138391 4251907 -28657824 -38653598 -37568029 -30006113 -27552765
16345 -27552765 -5854948 -27235131 -9502007 -11070657 -9136366 -17369335 -14613759 -4975722
16336 1681910 -9532427 -20135628 -3608836 -49483204 -6488591 5602873 -16412817 -389734
16327 -36809693 -9478352 -37115454 -15523100 28690547 -15395257 12689424 21880161
16320 21880161 -26515809 -13738277 28588960 8247627 -2275068 22710253 8661898
16312 3889496 21372860 656987 13636504 -18481621 25537010 41328133 -2508667 -32535184
16304 -32535184 -9254842 -5411354 -32097247 -10085555 18971511 7113399 11999366 -2286350
16295 18125633 3686019 9186101 -2320457 -32606751 6120862 20568416 13535857 1594235
16286 14311522 -1788286 -11906098 -8254479 1681938 24572140 1663519 47378194 -28204070
16277 -1437370 5606026 10899427 -6094409 26092974 -35612659 -13186257 15480625 -5434201
16268 -12161902 3365875 18912928 -28954636 20483235 8143550 11187567 14654579 -39338143
16259 -19649856 14003441 5615784 -4218624 -12527698 49842574 9003346 -1371615 -33861157
16251 -33861157 4684269 -33295242 5758671 10217941 -37952575 -27921180 -29643305 -5573848
16242 -4211162 -18893704 -4140445 38661430 5614399 -8066598 1341471 28408814 34927675
16234 34927675 12083711 12860723 11064494 -42955896 56563945 -634028 -25056683 -650649
16225 -15760648 8194236 25280351 -18915481 -17530213 20418305 13101934 12411914 21479828
16217 21479828 -30370521 -17296137 22460698 -1011769 2260996 -15553478 -36079440
16210 -36079440 -16682123 12053414 -3139328 -36612046 5443586 4957671 16366814 21369510
16202 21369510 -7914839 -9543550 -5802192 24273768 29895476 -27903183 -16474359 -2727842
16193 -27531901 44780768 17250057 -36422066 -12883197 -27621637 10524426 -16985887
16185 5232543 6411645 -35110095 6817961 -31392797 33234440 17122238 -5371283 29434761
16176 55138714 6857511 12976025 7334419 -10707854 -9761620 -28522028 12088288 -14009361
16167 -18243254 -14989993 18476991 -27118922 -22570271 -21262952 8344651 -7317164 6380047
16158 15691475 40354441 -3017501 15822629 -39694983 8259897 -10167337 23249771
16150 21999253 6451937 -30724046 52664517 4106447 14849816 12804644 46595743
16143 46595743 36115060 -13526023 -2361121 -4023195 129239 41884205 1950288 20594663
16135 20594663 -33723319 12928413 -5703787 18271446 5413925 -84365 7489545 -32742649
16126 6329542 -21800112 -43091832 -18592620 13661397 17703145 38595371 -10703499
16118 30743245 -6467200 -28243331 22689068 7876748 4191119 -1654980 -25109745 -12527857
16109 146769 204243 -28434754 12868496 7437497 -19982297 -44811508 -26728397 -29126942
16101 -29126942 16148698 16326334 -15097127 -7236470 -39180175 -36133679 4317510 39758448
16093 39758448 -16857943 7042477 16214218 5542716 10161482 5495328 -4895454 16754392
16084 21894569 -20581166 19291174 -22168505 -20120867 42881693 11688115 11769975 31337336
16076 31337336 -16824510 -19518739 27571948 12385311 -30762767 21906348 -8436015
16068 -8714693 -19796541 14080672 22949980 -16477643 39187827 -14823763 13526535
16060 -20776637 7860791 -19373623 20379439 28619283 26920940 19602196 48427658 8913279
16051 -43038004 17594154 -25676675 44108658 -22491165 15627048 6964843 -7239907
16043 54580523 39150414 21050469 -59103149 -8789890 9639137 6295333 -8197883 6140282
16034 5460106 6306145 -1329724 2742415 -512674 -2708648 17910496 -11477478 -24975504
16026 -24975504 -56795437 7436463 7485112 -15681556 -51738519 15359564 1286487 4554915
16018 4554915 22907427 9466938 -38893853 -17305594 -9409644 3660345 7540320 4476713
16010 4476713 -2843211 41217098 14028943 -2651186 -24887509 -10302233 30408522
16002 18707979 -5827375 13093856 16822565 -2939340 -16100554 -34239450 -350765 -30383842
15994 -30383842 22818012 1453655 21772941 -41079170 7856465 -409007 -5283527 -2764666
15986 -2764666 5263984 -24688258 -8507985 7534670 -26904284 -31111879 4020655 40482733
15978 40482733 19966482 -18405673 -56193440 47768341 -22011105 -20433722 -24341120
15971 -24341120 -3794036 6278114 -10699052 24261271 -43952615 -29789421 3192264
15963 -8397646 -6007307 20116507 5935530 37843256 -27191442 -3897914 5539784 -13952760
15954 -5482640 -10246918 12194292 17928986 -24884346 7145013 -33791095 -36775756 -13674210
15945 -37399235 32704505 6556886 -8458477 -6594941 23212368 12535873 -25062745
15937 -19761083 42418882 -4757237 9734875 -8887484 -13647116 -10113771 -8372392 23155825
15928 -12168183 7143461 -3703284 -26019974 -5269369 -18610600 72709 -26980378 39135053
15919 12648011 -13103373 -324865 -40405681 -40043218 9185746 20874673 -7817028 42942989
15910 -2484812 47794192 -17944388 -26239650 18975555 8864786 -15015686 -8953388 -9150021
15902 -9150021 6361968 18015300 -30208320 10633619 -42340306 36249966 3966251
15894 8916923 16558956 -19110624 42907254 -5074314 -18346030 -14841419 -1270406 -3977020
15886 -3977020 49645 -20387466 6603216 -10200865 -24728434 -9540411 -19451100 -32319106
15878 -32319106 2190321 38366753 -5201141 -5923710 24472729 9674199 10677507 11226541
15870 11226541 22069604 -16603030 -3160727 7391125 12626525 40785492 9751083 25452274
15862 25452274 -21175080 10003369 -17724554 2665067 7970306 33386238 -4300235
15854 -36101681 -16103435 27323777 26104627 11533047 -15369193 -10643071 -8961328
15847 -8961328 -63389887 -20887371 -23207636 -1714822 -15189840 -12561834 9818314 29380341
15839 29380341 37335443 21380070 7637480 -7607436 -14254870 49255150 -12731505 -23501687
15831 -23501687 28851514 -8168442 -45445073 39712262 36117523 -30293741 -31479225
15824 -31479225 17265053 -5473456 22344543 13655518 -7298993 -2584908 -3817795 -21699847
15816 -21699847 9439869 -27854216 -44363243 -42808755 -15679354 -31410089 -21148861
15809 -21148861 -7086704 33548847 1594045 13222273 -9968194 -24202414 18116340
15801 7613535 -21182800 -7931906 -32314201 23146334 -4047175 19424298 19951438 -14013684
15792 -2177792 -9728569 12349340 -6070017 25057701 645181 -1008417 -14184761 -18490879
15784 -18490879 -7724303 -24610920 -16620136 1932008 50537770 -19730249 -27277408 28201130
15775 -29651744 42076664 40676699 -7381633 21223741 -6271553 1833031 5957061 15722659
15767 15722659 4792954 14318260 -19709119 -11309922 -33023318 19687110 18963441 38815224
15759 38815224 34677789 -9055128 24522196 19083058 -39942157 -11819 2648077 1483481
15751 1483481 6749044 -4533680 22679094 -8358617 -26949833 2012631 9956201 36883045
15743 36883045 -32756469 -10735845 3053351 42419146 16653343 -28723981 7610693
15735 12461326 -3523701 36210198 -41905217 2768410 -10363325 3475335 -27764894
15727 20221790 -7897656 38051195 -10003281 -15750978 -43898074 -8679611 -18382887 -6105904
15718 -1931049 -10873564 -21900140 -9637194 28107335 24493124 -27003347 23517697 -26734031
15709 40085132 4669754 -30110475 -45954276 5822773 1946739 -21864189 -2396749 -15009918
15701 -15009918 6094766 -5028531 28874196 34163693 -2370224 26409719 17050046 19274696
15693 19274696 -9223710 32761883 27194192 -387964 21806588 6045767 38101904 -11712270
15684 16268590 19007110 10744607 15187397 -19051782 -1035651 -28547445 25803001 -4857812
15675 20628053 35428747 -22160072 -5070550 5315195 3887032 -23836442 -26773785 5914242
15666 31783543 -16093121 -2269529 -7270136 57581 23024392 -9603502 -33267641 20474455
15657 22501888 -17586942 29381225 -42939035 17452969 15516522 -12343731 -12136291
15650 -12136291 -1608899 -17231645 -8334342 -15790962 4163502 -8504991 -5330497 7463844
15641 -8309459 824916 -7447371 -24023101 -13972565 16884654 3305148 -17245978 3908438
15632 18899018 -6497757 -1626156 -21190839 -29317985 -403085 -43768485 11198344 -2928174
15623 -11056773 -26670379 -25509695 -53021810 9825011 508199 -13657951 27591738 -14303785
15614 40316871 31656516 -49983741 -17750859 8450123 16469867 6624039 14676756 5642624
15605 -7674657 11398694 -30012068 21496788 -44710473 -32095509 -18647293 25502202
15597 -35526099 1993775 19765377 26369547 -17172106 -49466591 -41335672 -5496053 -10195539
15589 -10195539 -37561724 4512828 2508585 -7151804 -15827638 8668229 28947529 -12715807
15580 29807619 -5775518 31107491 20629147 3935477 34932048 18819773 2766001
15572 35521614 36994050 4820553 -12451171 -36679692 14113295 11270399 -36078441
15564 -23954081 -21349065 17577716 10302406 9883608 16387924 3758011 25822453 -7627275
15555 -58907627 -560277 28018676 11194601 16926276 83638 38560680 5536068 -46235871
15546 -26906772 -6947714 42680843 -14876916 4045811 1982380 14311802 6185 -19123168
15537 -22286051 426516 3076710 28401144 -44105650 -17320758 47877545 -12356420
15529 2126618 2591308 31883843 -35362562 -21413947 2029360 -4524654 -13534235 -10256
15520 23213549 -2975161 -17792636 24396143 22609307 4640813 10439134 -38550363 7943528
15511 17619314 -5560720 -9707555 -21417780 -918217 32078442 7937334 -16512832 -29971492
15503 -29971492 -15234298 1129772 -1371220 25142578 -18185191 -6491298 -465780 -8915777
15495 -8915777 -1882136 24658438 39881189 -22212844 -21375887 17953132 -18778219 -11227257
15487 -11227257 8510724 -18157392 -15510259 -26102887 -5709543 -28471931 -39578645
15480 -39578645 -22438071 27980264 -6385124 41528759 -10982514 -18268310 -13529151
15473 -13529151 559078 -36339425 27665429 12729271 -4414947 20106683 -47970712
15465 13826858 -18329430 13371078 -49618242 39498500 19175318 -1016841 18831624
15457 -47691611 48141122 23739029 -24317527 -8320242 -32727507 571690 18420534
15450 18420534 -19346200 3315428 -23011410 20885780 -6788849 -8470285 27517112
15442 32879711 -5453629 -18377672 -11198675 26655328 -5512998 34372022 20040392
15435 20040392 -34080594 17958232 -44610728 -17228264 -59187286 5681008 16813205
15428 16813205 7622226 -45131723 -29324012 -22771729 -16566589 17564285 42353273
15421 42353273 3190372 9844521 35568618 -3215164 17405319 26177226 2686259 21878664
15413 21878664 11657874 -32055229 5524502 10901293 -1251818 10004009 31413481
15406 31413481 -24132351 26910610 5336904 -4041184 20002767 2080839 -26136607
15398 -16485491 -1265138 27256810 -14482482 37180252 -19611447 -6878989 -1991235
15390 23146292 23218587 13439908 6980854 6400054 21453160 16338125 -9759082 6398458
15381 1619957 -9039587 18940997 -7742599 14918079 40660495 -2449445 -24422791 -8986343
15372 19531429 -7257955 21067024 17217179 -19691857 -12246871 -5683258 2174412 31875646
15364 31875646 -7723062 -18518147 20147805 -11987070 15738407 2573199 -3868899
15356 10031027 10756063 -3776651 1737765 -30288993 5364449 8444128 21857567 5315675
15347 15857994 36232907 -9259831 3850284 1727315 -16365504 -42852995 -3878781 -4844305
15339 -4844305 22199888 17498957 21314447 -9713507 4249009 -37317023 4154408 42186728
15331 42186728 -30442937 -13538260 8013718 8085139 -33485476 2919432 -1578533 26065789
15322 -42032697 -29413408 10982081 -55348770 -13569258 10737752 -18692657 31342142
15314 -16604967 2221466 -14806068 69836120 42061457 39885913 13058610 9234468
15307 9234468 -16456973 10586575 -3899387 -15212220 -20474714 -18528719 -10069524 1660973
15298 37937209 -3429822 -34261785 26525772 17189772 12336590 27342648 -20780454
15290 -16775578 7182527 -25407465 11673936 -19990883 5606003 -60546354 -44177218
15283 -44177218 23807238 29840349 11771124 -51057185 -12726449 27297080 -17092635
15275 6028738 24016237 15305920 -26354100 -14900543 -18991055 5845144 20656161 -36221197
15266 -10194214 15315272 -19316592 14820439 -19207230 -3865815 -42715184 23852986
15258 -7477007 41231648 -10688438 -12459542 -16905427 3644310 -20029323 13608483 10873810
15250 10873810 34187946 -8228912 -11256638 -8783781 65177916 41230336 11692035
15242 -14680918 13361200 -29490335 6128205 120193 -9556564 -9106601 -7738819 13647774
15233 6364694 -53603416 -7401908 14957863 20015537 -7018954 -3273193 19200368 30220388
15225 30220388 24340346 23477610 29575009 2301113 -2567924 -32389677 30147105 -25153893
15216 14947098 40531026 11763065 4014257 35116228 23313256 -8166024 -32645619
15209 -32645619 14102044 -9924679 -10348066 -5750741 2381800 4107639 1437283 -13248404
15200 -47646185 -22154011 5507144 24489650 12469304 5015618 -573751 -10261403 20690654
15191 -9409170 -10186668 26222369 -34049637 -9640981 18775603 -6038919 1999179 -33587984
15182 3095917 45571425 -7989409 34939189 -31883246 22559130 -1638996 20660225
15174 -12238474 334137 -21734795 9803964 4851676 -31557846 -14039081 -5078620 -10885309
15166 -10885309 21596844 7096823 -29468043 -42781095 -12961774 26758398 46283031
15159 46283031 -34309212 566476 6551678 -38574592 -1657051 1202778 -20708956 -9401788
15150 -29872320 6811342 58154046 -5049922 -28391995 29658860 -25247705 -22895309
15143 -22895309 25649004 -14759896 16656415 17443221 -2864646 -37677781 -26228593
15136 -26228593 -35363065 -4253821 -11692994 -22838780 -16708105 15661493 19124522 3778565
15127 -10720323 -32881823 -14640046 -10631793 -31080178 -20902103 -29093707 -16332202
15120 -16332202 -12395171 -24876360 -13126173 19402972 11531022 -7646844 -31289955
15113 -31289955 -22942425 23314465 8691650 29576518 6393390 7329596 1991104 -18879423
15104 33203420 -5866426 35306078 4123245 3002468 23202461 -3308376 -17586361 21958913
15095 2932458 49005327 -9718519 25112971 23628457 -771437 11520366 16863766 16266098
15087 16266098 -34261211 -23927805 30373644 6901474 24091655 4003321 1490302
15079 9259358 -12434603 14189166 -12450378 -11756027 -6556037 16150735 -20817639 51604637
15070 23406275 -1035899 9844489 -17759151 49591550 -4424052 77621912 -9141979 6068993
15061 16308673 6593798 53805984 19283618 23198049 31787367 10392235 -8173177 61590405
15052 3535529 6792319 -38862972 -18925569 -11071166 -14910421 5941098 7853951 15259362
15044 15259362 -14126740 6498836 -5843716 38456756 -40600637 -26991474 18930509
15036 34086309 32908756 32711673 32422252 20435863 -4461594 -4651817 1913358 -2432639
15027 -17247265 20399556 17458015 17177442 -10410621 34876342 8668238 9687267 11175301
15019 11175301 -27256984 -31659492 23555319 6937587 -9699124 -8506981 -14943393 133264
15010 15699019 38965903 27122723 -3850500 -5318174 51398910 -23048550 -4770796
15002 -18186123 11602107 28206612 4708755 4224045 -948345 36630464 -17429715 -5017923
14993 -2940980 -9094370 -11817040 32642816 13148934 -13154896 -23663345 1617306 -30426343
14984 28383503 8896613 -2760690 23671681 2987008 -5145607 18447558 -19847373 -18431490
14976 -18431490 8349145 23389554 822945 -19055887 32581629 -14010335 -17370202 -18850526
14968 -18850526 -570744 -7778784 28396932 14347072 7880874 -11341830 16987760 40008569
14960 40008569 8056183 45403581 22994858 42352297 7556685 13810936 -14485445
14952 2628767 19258219 19749498 19450431 -1498251 23522662 -45926205 29930755 -17052816
14943 29273641 54481036 26276980 6108150 32562479 -24022425 25540761 -5006911
14935 7498399 -12591338 -1486713 -48496804 -487700 -703662 -24878708 -16386519 -21477123
14927 -21477123 40942136 14970693 -4685680 2060734 -17384249 -18194088 -4307526 15681225
14918 -33337099 -26855537 -26290480 -1067460 3265322 11809302 11350307 4861738 -4588780
14909 2799981 -46598720 -15751758 -5053029 -17976087 22518902 8868770 6705169 -20338276
14900 -24127439 -11905786 -9053864 4319133 -23690592 -20913682 38122011 1351120 20823844
14892 20823844 37024770 -15147173 22233068 8462934 -47097273 779284 -17893731
14884 -15910466 26712326 30225535 2929411 -1536325 -16473882 5875352 -3835386 9875826
14875 21038352 -27641567 -44848702 -15255424 -2244588 -25824318 4881360 12988301
14868 12988301 10691095 28442181 42551938 9011012 8917176 27526224 1776693 9183618
14860 9183618 -18226790 -3656651 20768985 5650674 12146936 -3621504 12902823 1266254
14851 7337023 2026579 -21346392 37438097 20388558 37574003 -27228928 -10424715
14843 5203782 13524541 23257044 -201055 149341 10847465 -27695040 32692331 -10752233
14834 -31975420 8380808 6717245 6362520 8202758 -7653198 -5562070 -314324 16180919
14825 -8279527 -36658957 -16901655 -7734363 612460 26657165 5931355 -20966126 3282760
14816 -13000618 48887245 11750663 31581518 -10884656 -29556155 17451966 24384058
14809 24384058 -6647426 22019361 -23451782 -6545879 -3607829 9399917 -2032925 -14462851
14801 -14462851 18582428 -6278604 22536480 -3670526 376072 6846767 -1232539 24545593
14792 17905143 -12752492 -11722252 18490886 -29160871 29394822 27823564 -6883382
14784 64535 -17267854 4360641 17102503 15622593 21004810 -21648578 -408637 18228817
14775 -26658932 32523147 19377824 16962255 5134262 26258044 10792007 -50356624
14767 26112021 -857621 12063248 5412185 34208248 -461699 -23072537 -2792852 -46646080
14759 -46646080 -3450856 48616 -13461409 29192466 36329959 -5011613 13017090 16232285
14751 16232285 41273984 -30724535 -776155 19224913 -758240 28757490 9715195 10790836
14743 10790836 49410675 -9798850 -1939019 -51203124 7913209 39799156 -9123719 3243751
14734 6458519 -45324986 -5833867 12693562 -15738316 108368 -24419399 11719214 -38534132
14725 -8999412 19724489 -4341918 -366124 14221775 24949510 22033735 8507337 -10024299
14716 8574310 43511333 16439644 -3721388 -21608596 -6254881 22661826 18803115 -14213301
14707 -3231330 -26500367 -7258975 -3822226 19276368 -10764402 -7272505 24931960 2772227
14698 -14933664 43549419 41084898 6261114 13746156 -15545064 24293815 891910 -7000021
14689 6405242 7427209 -29831177 16508387 -2122941 10922601 30597537 40613061
14682 40613061 27308780 -12228635 -11510834 28432818 -13941238 5898222 -26059479
14674 -16160143 42601095 20003956 26704420 5120115 19425212 28729633 5985572 -2293691
14665 -8073976 -1369549 10705614 6260902 23525518 -8310687 16514068 691636 9477351
14657 9477351 27020163 -28412181 5048313 7108125 -2417895 17604646 -1085987 9808032
14648 4110298 11123784 -27395945 18967097 9429095 8486876 5229809 -19937170 20940575
14639 3923709 27444245 -25925399 55218121 17414184 -12968083 -19971658 6295121
14631 -4593573 -14708762 29894422 7785140 6109639 7122008 5974857 -4432714 16309938
14622 1969123 -12840561 4258696 -483913 36038406 37423228 1032759 2285078 -12899439
14613 54148791 -3930496 32017789 -24223168 34322643 -24990599 -15272999 -10562040
14606 -10562040 8558101 -2893403 15760351 29282060 -28863197 20331455 -23068716
14598 1158744 -17116193 -9135307 -29620568 -5584923 -10727214 9558361 -39548993 27692823
14589 27298023 -8865015 2957986 -440223 1421982 24181564 -7063837 -11180610 -23792554
14581 -23792554 17456054 -13768532 3949252 30261281 -14923256 -50349688 19158883
14573 28028629 -7283907 -31234246 -1368326 16377090 28074243 4155788 14807066
14566 14807066 -8831750 -6009166 49410911 -11969734 15467188 16450045 -29599727 30160320
14557 13662370 10730211 -17597486 6003873 17604156 48016453 34281681 -49210904
14549 23593771 15436288 33653929 -6837699 -11800145 -13439157 13260833 4311047 30407998
14541 30407998 -13258966 17784025 16628335 48485079 -16741220 -18817581 -11624454
14534 -11624454 1712111 -8836450 -14971244 -25991807 -3106454 -525999 7791130 6249576
14526 6249576 11990092 -5224689 25864230 1802442 -8593575 14958541 -8086666 6855771
14517 -15612005 14996513 32679788 2704452 3801933 10683994 -18837224 -22576199 25343216
14508 13679127 12276845 44624500 -5319873 10965820 60848502 5152371 -33293560
14500 18227824 31899534 -20395700 19481265 -4525108 29298265 -19399892 -2171377
14492 11659566 -9551278 16325531 -5161435 -17314488 -11812686 -11120963 16206 11168778
14484 11168778 -37355923 -9505033 -6076724 -16199135 11431243 -3486225 -25125736
14477 -25125736 -15999800 -39346694 -18176920 534559 14451549 111199 -19577611 -2556788
14468 -18863474 -32070501 -7337154 -10227606 -11190678 -7527613 16011183 -47100297 -3373438
14459 -22949513 36180393 12594817 3214007 14915645 12028955 14852678 30084313
14452 30084313 -9928566 18736641 11601971 -12499756 40318409 16633442 32241719
14445 32241719 -30447878 58634898 9647352 28467156 -15370973 -8841384 42523061
14437 1168794 27373479 30226666 -14571754 -31952618 -13178836 -5949739 -2167594 14839368
14428 -22445278 8156680 15074074 19578032 34513435 34925463 -11121738 -24575635 -11690830
14419 5614511 -22698679 14474976 -3577844 -27532179 -32454795 1306435 -16014494 -32734647
14411 -32734647 7940391 -11715367 -37989026 5620884 16470618 18414386 -779770 18781161
14402 -5626102 -16164857 22826924 -18165103 -6806443 34709531 1441168 70193 -13376858
14393 -807382 13560848 6295405 62713937 -3943747 -467912 34324420 9551028 6750880
14385 6750880 7143438 -31150572 18270847 -64166705 5894773 16905792 3357602 -5988197
14376 -1543007 36694538 -15697283 22850714 21203672 26625869 20878103 17699940 4326910
14367 3311347 45424486 16854487 18994287 45437422 -2978738 15602909 3321298 3945462
14359 3945462 5454235 -26168756 -16647187 540147 39736684 11485514 7625670 7970444
14351 7970444 29797373 19515252 16024398 -23453328 -25946985 12726545 68320143
14344 68320143 -9066775 -5888603 21211429 26668444 6838328 55902635 -44771589 49722133
14335 -14789434 8803211 45940744 -38383078 31108314 18862867 -1040733 57936590
14327 -41560548 -24759657 -1580055 46630239 3564472 37241158 -4391148 60837175
14319 52805512 14463755 -6745467 11275521 41465419 53198474 -11926065 16420766
14311 29408832 26578335 -6021918 37002199 -14224160 -3125954 26769670 3874224 15251082
14303 15251082 10407888 29924572 -8588626 -14623646 10462010 36625987 10533761
14295 42869399 -43022009 -14953572 4818151 28261493 39804891 -11093378 5985088
14287 42766074 37610993 6212459 23290851 1806251 41893912 4636798 21656489 58941821
14279 58941821 24641169 23687567 -28126801 50566519 14829591 60340015 39901612
14272 39901612 28565861 -23035047 16489590 27984442 3164447 26799703 7587827
14264 12998100 -20572989 -25011890 14400566 77938350 62111344 9808769 16515351
14257 16515351 59476465 53379632 -7901751 39229298 21383261 57387282 55450983
14250 55450983 -11916885 20309309 24212593 54682002 45193670 61595935 21526266
14242 37838695 25083769 35806378 54796319 40855068 17231748 622070 47031891
14235 47031891 58900230 73372289 61878466 29379582 62492802 68480336 54721599
14228 54721599 56547531 64377772 107779886 89496582 67420987 60499695 50965215 44277498
14220 44277498 -14128365 -10480942 -25910764 10702238 54656760 -16485420 -86307967
14213 -86307967 -158253152 -175350965 -114316411 -110244508 -113378595 -186628559 -326438433
14206 -326438433 -337391799 -316411969 -259890882 -235727238 -198988807 -252239938 -333526417
14199 -333526417 -311125691 -282947487 -211410251 -200587112 -154751551 -233262788 -215796610
14192 -215796610 -220585892 -124329552 -138051429 -105437471 -105338650 -69172737 -89305374
14185 -89305374 -115090968 -90530466 -72158532 -60522485 -85301798 -104491955 -47941905
14177 -83607092 -83273987 -38209248 -34941668 -59678169 -70664491 -26906076 -60574435
14170 -60574435 -31324854 -65433324 -23760470 -35964983 -25802891 12348931 -42239686
14162 -79967635 -23780175 -12565461 -27895456 -52504419 -37007239 -17283524 -70465522
14155 -70465522 -91752350 -34564110 -21938931 -22996196 -27592759 14035306 -58776100
14147 -39263164 -8198680 -47565886 -28402512 -2523375 5105705 -9369410 -27892481 -27069855
14139 -27069855 -34220303 -18204084 2992015 -37359989 -20310985 15771577 -49069194
14131 -24619060 -8886980 -28306891 -10619366 -34581273 -40596948 -33337731 14393156
14123 -50671202 -39839557 7218878 -26169094 -32114578 -6151641 6695527 -41290534 -45258893
14115 -45258893 -35837305 -16172710 -23642523 6508065 -17832672 4856547 16039105 -23337582
14106 5199207 -30235891 -47035946 -50264953 -29839330 -11057359 -16407747 320109 -20005376
14097 -17684753 -23918083 -61691073 -12373977 -31790430 -23296997 -14043879 -21220178 -11800379
14089 -11800379 -37979980 -8580200 -11328481 -12862307 -18527066 15442143 -41472966 -48237166
14081 -48237166 2129326 4210440 -3690542 -13351015 20789093 32961905 -17496126 -16012656
14073 -16012656 -28741815 -57609639 19018803 -6349280 -12504808 7000375 -10590259
14065 -3666477 -17294153 11928473 1056357 911328 -6051679 -4208292 8388933 -29031650
14056 -6479659 -9891391 -25679727 22156255 -38278716 -25332673 4327920 -28170726
14048 1473277 -21090530 2470885 13665254 -30660009 -41185593 5739824 -25187962
14040 -13394172 697777 -24882818 29094468 -31688901 -32160834 14022980 -28862647 18197397
14031 -13764720 10681981 -28575234 -30518384 19226231 1902669 -21086048 2332958
14023 -30111844 -9067900 151657 8745615 9915718 -15689993 -33897260 -13245183 -2510969
14014 -30756600 6888407 570121 7724214 -11475672 14466101 -15371684 -24206804 34421060
14005 -3192071 -3452896 -13986689 -29040855 13837217 -24662748 -28429713 -23538858 -22160363
13997 -22160363 16649266 2807863 29467134 -8348389 3761590 -1510736 -7192826 -2517279
13988 -20001830 -26315013 -24292154 4783207 -19200097 6001335 2247089 3742535 37124860
13980 37124860 1305277 46346440 -3689692 -23553029 -5950967 11316856 17085475 -29129258
13971 15784503 -295843 14771183 416368 12540688 -4702177 -19782907 10746154 -16365787
13962 -37160576 10277176 37619165 -17645174 -12598245 -36525481 9699418 1539657
13954 4345407 -32856508 -26040928 -22043920 -3270204 -44607610 -1490808 15773592 11491682
13946 11491682 31337432 -11957678 -19667804 -29923001 -23733647 -24951999 -28933226 -17282679
13938 -17282679 5117663 32671271 2864686 -12129614 -12915158 -34818602 -9357117 -20959900
13930 -20959900 -19187729 1393687 -9109784 10221785 -5556364 -17665663 16206107 -32978567
13921 -19996555 21972035 -23454470 20849219 -15838883 -10255905 25472363 10839698
13913 6370474 -39462124 -30719291 21033091 -18980140 -44339990 -3011457 18260574
13905 -47547950 -10441723 29507787 -22998818 14563381 -43063125 -19593377 41074237
13897 28714064 19769963 26527867 -30902876 -10417548 -7651139 -22715142 -35408235
13890 -35408235 -6672585 11222892 -13432676 9716060 20222911 -36680659 -18176110
13882 -3243210 -13563248 -30862341 -7797219 -38278003 -24992284 -18822933 -15998288 -391261
13873 -18519690 12332401 -50099333 -7447415 -17602974 8379373 -27744625 -11472683
13865 6895056 35062107 -41635813 608581 -7971329 14679279 6339178 -40515583 3923857
13856 -15426954 -12635826 -2960410 25957081 -38530810 -35358986 2214855 -12700326 -6355362
13848 -6355362 -3862617 27741494 18812622 13773519 -578800 9015452 15219021 -25360991
13839 -4178700 22202013 -23168191 -11121961 -5449154 -23087203 10332590 -11917129
13831 21912423 -31359476 6098662 -24892927 -3396919 -4546133 35871398 -28313275
13823 -11340164 10006770 -6415673 -8518188 -10841119 -10485398 -8106268 -4394176 10903334
13814 -15505844 -14535972 -53715643 -8141687 -1401255 3715800 46083829 -38647905 25801578
13805 3933127 36069958 8098055 -2775372 -13703487 29291177 -33805049 -21715605
13798 -21715605 20209883 -4863241 -9958403 -34693370 3707335 12172497 1823582 20524174
13790 20524174 -33268327 -18877999 -12604861 20720846 44054148 -18144180 476979
13782 4139031 14148822 -26648685 13419359 -55316645 -3158597 63458821 25995375
13774 7918245 4371911 3098482 24538855 353274 -8555764 14715677 -1662288 15608332
13765 -32158070 -8928231 16035237 6931082 -9319760 -1311396 14789448 -8978443 -33459192
13757 -33459192 -5703605 -8117346 15082356 -30982159 17868729 12143766 4806333 -4732082
13748 10584836 2503237 -21871190 7236554 -19184365 -21324668 -29380339 -3841379 2284495
13739 15750231 19441833 -23356588 -16693202 -40981475 51144374 -9361919 -48387898
13732 -48387898 -1516043 2420831 -2391413 9212589 21162717 44632241 29629184 333536
13723 -2131937 -3917499 4307303 18387952 -4887082 11987158 -6095987 21851456 9189612
13714 8403786 39661265 35318338 -32560999 1153768 4258748 9708490 -19951650 -42157335
13706 -42157335 13162851 6711947 -13700750 -26308009 25137452 -29630500 29571962
13698 37119259 -1525602 -11097142 6405287 1293785 2886119 -42975607 -10408825 7089837
13689 41361886 -14674226 -10733774 10360302 -25434635 17233497 25269599 -31149694
13681 -18442754 -17873905 -30414459 -18764150 -24528099 21778236 -7401811 -17897280 38321014
13672 -55787752 8262872 8605030 11184108 6570601 27533597 25267964 -16077373 -43368689
13664 -43368689 -25987433 25067708 19375240 -17000119 -20861163 -3672498 26561599
13656 4554707 -17780885 -16689088 -3414231 -3733978 -35275506 -5372593 26121757 -13622101
13647 -31096246 -5590578 -20820630 -11799994 -55044093 -21423891 2186050 29527667
13640 29527667 -8440186 5980777 -5348324 -23975994 -4722448 12889034 20593332 12171010
13632 12171010 -7934737 -7959831 -1731797 -15910800 19106004 12785637 -1132754 -10092087
13624 -10092087 -14712646 25692475 -2951502 -6349923 -1633664 1660232 7481910 572121
13615 20933064 -6833605 33219763 14474771 5994269 -31324054 -10700762 -3802751
13607 -11895426 -5499584 -1165676 2608396 3560708 -34405327 4043237 14498397 -47788489
13598 -18607739 7182779 -10556286 -19913016 -41372608 2961046 -32701220 -38536736 -978442
13589 11696147 -84168616 9302160 -7450446 -28154321 23722084 -43680578 -27636386
13582 -27636386 -23866556 -6356238 -17779866 3775520 -44271 -4946017 1373930 -21016227
13573 4481343 17273253 -1619324 -16477070 -23561012 31681329 -27276592 13384201
13565 26958574 -2714680 6043979 -45178175 -17544084 -28986686 -18153744 52436017
13557 -17852005 -35683213 469136 14107185 -9485898 36878682 -18033916 10835386
13549 4942352 15154688 -3581752 -17624941 21913979 20183177 31517150 -13653194
13541 -16023344 6737344 -4531876 -375846 -34156186 -1523735 12653826 12383066 -47989112
13532 -15495617 37327088 -18631563 -36985409 26243007 -30532133 4965984 -31103053
13524 4298158 14227658 -6433616 -40013506 719539 24575177 -7703835 498949 8516094
13516 8516094 -16457465 36361564 -20277460 60220950 31729654 4562784 -8173574
13508 4069813 -11016712 22908542 9802140 -2289410 -1031049 2822644 1939353 27968915
13500 27968915 -9953559 -33325288 11959255 16075671 -5737063 -19662319 13199422
13492 33596576 25059334 -8096990 19729764 23306010 -18843819 -2603042 33761799 19762923
13484 19762923 -6627177 -28118857 17263467 -24687822 -9350358 26804484 -14120879
13476 -22259553 5544831 -37404223 10766465 1189299 22051202 -9012636 -5832901 -1920283
13467 1806790 9005218 -12652029 11318233 1332118 -27166505 30582043 69812703
13460 69812703 33314851 -11821856 1288735 -26560398 -37331031 13242971 18675821
13453 18675821 25161438 -5011604 -46968478 -4203055 -31735953 -45223399 13620374
13445 -31999481 9588766 -36868509 -16834318 21783265 -14993380 -29240166 8796480
13437 30669593 30184551 -34289962 -16158706 -285154 -36151420 -844688 17127018 28928624
13429 28928624 11905246 -25409381 21825807 9394065 8910391 -7447718 60655984 -20455623
13420 -9958233 -22765906 -30824868 18327478 -52612985 9606383 44188290 -34352597
13412 32011985 28824191 8598007 -1574005 42768024 -18901403 -27678972 -528150 1615401
13403 33564199 -1424956 40701996 -26097284 -6342896 -21968483 -14601090 23830723
13395 33798364 25963392 -8063465 -24374023 9391886 14114304 -7831216 29495256 13432459
13386 40955850 23075425 17531417 24481507 -18995900 -71696702 4232656 24461047
13379 24461047 32451569 33798343 -33857391 28638310 -34131499 -43059575 4473723 -6457589
13370 -2283265 -20584905 36759404 49686678 14034881 23083580 -4625011 21221418
13362 20034503 13189293 9248827 18152054 13079089 30812220 -15385733 -20085338 1185555
13353 7516944 -3341095 3776184 -14186152 38479064 -14385065 -5846991 -14008557 -21565421
13345 -21565421 -42049537 33241641 -2992343 -64213607 -16956602 7359163 30093326
13338 30093326 -10926590 10884450 -27012400 3377942 32352261 -6668101 -21258243
13331 -21258243 -6924426 2560824 8762731 18556022 -29469181 -651817 23849567 6205505
13322 13044325 3130655 6008967 4186163 16222096 7949910 -14061370 -23880469 11935875
13313 1706662 -5460110 -16084011 37071092 -14267300 -7397593 -13992151 33979539 -33987924
13304 9067836 20667801 31181658 -8501471 -7868816 8460713 -1509309 21973022 23363480
13296 23363480 33467682 186962 -6052170 6871618 5450821 21975096 -3812739 -54918803
13288 -54918803 -2415131 28087840 25953053 -26077555 32621635 3436991 -2780019 17973225
13279 -21222358 -15948668 -1268289 25851575 16823832 -657588 -10461255 -25956724 -32246850
13271 -32246850 -4096664 -9137124 39167575 -2950412 -10865301 -32326755 18871726 -25009157
13262 -15554138 -48553175 18615068 37820202 1032281 7092971 -436558 11126971 17921621
13254 17921621 5829624 26142979 -15909089 10530329 -39081686 -3631468 6575066
13246 891585 -5988992 -8656136 26057782 -39124512 32535285 -30092271 -4961474 11706506
13237 -13288194 3313386 5167786 1652731 -27587353 34202622 1036701 -27781430 -10100315
13228 -34831629 -12945985 -8079202 28526905 -16570758 -23262284 2518988 -34916189
13220 -8484351 3015018 21257749 2552354 -15476405 -21834277 -3651698 4106509 -14786102
13211 2081602 -15859630 12201223 -862971 19131465 -4925392 -22019203 -12736156 -32607721
13203 -32607721 40923167 24680917 -10446989 -28861811 23996721 -11450079 -21865138
13196 -21865138 23936450 -8077528 -44359256 27221110 -5898521 -34344445 -1302114
13188 12197613 -28285043 -1942174 6191074 7064046 -21334015 -25068680 -4927766 25969443
13179 -14306250 16932852 60926409 -3585241 -25872212 9628845 -19479367 31382135
13171 -38432945 5131590 17325552 -27239556 30276770 15242958 15204573 14704341 20919850
13163 20919850 4029891 -10669198 -29047685 13676734 763480 -70034908 -8193011 20342727
13154 -4673987 13913030 -31598831 22885576 7591947 4022398 -9864878 -11447644 -10068170
13146 -10068170 -39784206 -33138243 -18898539 9924944 -9574199 7361931 -42753662 -11795916
13137 11370698 12385288 12298953 -24755676 -26986110 5494149 -24219015 3202176 17579655
13129 17579655 -17128316 -17580171 -18412583 -12010636 -33021039 4398952 -13340007 -15242058
13121 -15242058 -4829995 -10315081 16649445 -22680857 -28630324 14488810 -42253414
13113 -51683639 -6548994 35154617 10838122 15943989 -12020794 -35441352 21437414
13105 -914988 19440659 -4428444 18915496 3056616 15562516 10037156 -41511247 14118602
13096 -35442538 -10287934 -12944180 -10783949 19530181 -3990446 4712197 -22783596 -7482783
13087 -15491583 7715323 -11713547 -27008964 -10284529 15108494 -5993962 5474453
13079 38201632 -5451870 11155806 -46309692 4981929 -18925963 -30518078 3352210
13071 6647119 -44919642 -48098577 132565 13439381 -3897721 -21701612 21937575 17672780
13063 17672780 12434917 -27087948 -14603659 -22486077 -19549165 13036057 -20701700
13055 -3116700 -3831974 7388405 -7928254 -16229775 -14687409 -35706911 39905256 7888332
13046 11363363 -39073645 4166326 -11656779 -4893570 -40861429 16224621 1912742
13038 26577075 -5048928 -27529698 7915806 31979087 32683570 22790851 23527810 28847955
13030 28847955 14807793 20853709 1685948 -24299715 12769084 -26800410 37639490
13022 4074810 -6420120 -7682707 3069492 -14914988 1156310 13042667 -4761208 -12532488
13014 -12532488 -37617626 11357579 5129483 -13923131 3061018 -12543823 -12145799 21586794
13005 18900334 32604458 -21291876 -6116516 31804066 31267323 -13401160 -31055822
12998 -31055822 8042461 -73059 19053275 -6398739 10531393 -5259381 -26464953 -22557500
12990 -22557500 29110017 -2791486 26392150 -4569515 -34597520 12637450 14493375
12983 14493375 13932818 -8113447 14794378 48823933 -8252691 46432598 -23955256 29398447
12974 -10427908 -34792064 -2006681 34619119 25251851 -1491876 -19320199 -73576787
12967 -73576787 -13487569 30505137 4260876 -31347037 22396775 32406736 -14377539
12959 2054881 -42030892 13572944 -26865483 -37348151 -25678002 -10675207 5848759
12951 -31723179 15665455 -7712383 -297978 -30649763 -31574944 722311 -51699402 -6751887
12942 44134871 23071692 -423619 -30982178 18967826 -4747406 40468901 20158921
12934 16111905 23261690 3356485 -5440738 -17663199 -21944562 -381015 -1548779 -37674724
12926 -37674724 -9601041 -16329584 -37494625 -11637183 32503302 6033253 23960608
12919 23960608 -19882621 -794963 11033583 6701340 3396882 2880491 -24132850 15778592
12910 25965590 -159711 25716416 8801446 -10976990 -11693135 9099891 28494430 -9272617
12901 9348701 -26217600 -8452895 -13603242 -11803412 -11489349 21094588 13405091 12712088
12893 12712088 947411 -2441080 3980895 -12446058 -1489671 5289519 31332723 -35228154
12884 16509292 295111 -17325384 -5218415 -1818711 -31690513 -17103041 7968016 13121314
12876 13121314 17202140 -24041926 -15335519 -6847614 -31937272 34685353 1032011 15315955
12868 15315955 -15413139 -48270257 3276393 44638885 -7116117 29327868 19520989
12861 19520989 7758329 4107013 22746861 7435612 13250431 13057688 7123306 -10325726
12852 11825887 42657734 -91141 20894006 -10260897 987661 -7378635 -2247112 -1827315
12844 -1827315 13849131 -9040805 -26184867 7891777 -23071329 31991551 15396665
12836 69379654 7447440 -76977148 -29721570 17146410 -21511161 -6745477 -25903874
12829 -25903874 -9091116 -4949895 -41557600 -14283266 -49104688 -4116629 -8472652 -23441683
12821 -23441683 8450151 8162119 -32984649 -11141289 -45234517 -6587899 12088668 3159705
12812 8248846 12167048 -70553580 -20409854 -11273099 39355311 -32320875 -25639614 10351528
12803 5388329 -4820928 20876714 24239815 -11803873 6047190 -7219579 12617505 -37589374
12794 -36958748 44181522 5251633 9911009 30530563 27328733 17613740 4208637 -7024381
12785 12269926 11888027 -11802233 -19946317 -12074369 1860333 -34423048 16567696 23074688
12777 23074688 11623968 -5102592 -26826580 -10379893 -74095968 -1448463 4224063
12769 -20253508 -23592701 -8095209 8509217 -25285393 16106342 30543311 14787016
12761 -15908 -15471947 15104937 40839646 918067 6437131 13543023 1772245 18291758
12753 18291758 16046734 18590616 -10056563 20612892 -11342598 -1977353 -24531063
12746 -24531063 -13147103 -3046160 -13700208 12684878 37425049 2748282 -12170457
12738 -20303161 -6220827 -16698999 12455112 -24471558 32328302 180143 -3904621 -47040298
12730 -47040298 1410114 -25801174 8692997 -52197963 6071850 18612907 -18121912
12722 36950476 17038012 -1211405 -38194012 -4724979 10265443 -19214040 -47263009
12715 -47263009 16525752 30525563 -24116215 35716442 25737524 3685150 -1214552
12707 1019545 22415483 -19347199 -18784876 -28090643 13638342 57646234 30170944 -18010936
12698 -12575264 14860215 -9297743 -17980951 1352580 19735170 -33455568 -2947925 2976193
12689 -5307656 17571422 33616405 -18777146 -6148563 27259504 -8685690 9945910 27327798
12681 27327798 1412805 17598899 1126790 -7763692 -18021092 17321930 -42174157
12673 -2955513 975274 -22469911 -5696205 5656119 -1410964 14485091 -19924128 -6362166
12664 2891927 -27496673 -14243682 14474188 -63274829 -10269909 -30889048 -15446453
12657 -15446453 -33180351 10533582 -7832094 -35314892 -29952616 22416698 -25620378
12649 -29993567 -18435944 -32538266 4807453 7327624 10128617 -1034333 17403796 33395438
12641 33395438 3034533 -36625882 13817259 4849401 12269244 8722661 8686802 14432056
12633 14432056 13317579 -19284600 22774355 5420075 15378511 18439608 -15074962 39786499
12624 -10447097 24746809 4375761 -10244425 56885667 -27292182 -32060938 -20870550
12617 -20870550 1519836 -8267053 -6725000 18404173 -35901735 -6683889 2047848 -37669332
12608 -13137261 7101781 32729616 -38553081 36786244 -370369 35388443 16538304
12600 1048703 3812437 -10203898 -22839994 35060061 -19271309 25686115 -17211710
12592 15304097 -10238638 -8696881 -4097239 -3490213 -38316936 19848740 20279971 45143787
12584 45143787 25286450 -19665433 7746776 -36968122 -46836323 37599522 -11409142
12576 11435343 18127006 -15192744 -879857 -29874615 -6777784 -12077834 -2735737 -15409043
12568 -15409043 8773882 5002403 13660950 -20758171 11796693 -22022661 24803854
12560 -10627504 -42512651 -25832356 -23584723 4427434 -22732136 -23054789 -23720750 -20664862
12552 -20664862 -33180960 36823120 21642432 -40405254 14775165 -25762170 10721330
12544 4437138 32318684 -10015157 -8006889 -15887433 -12917806 -18845538 -17975310 17667544
12535 -28162184 29277020 -18892612 8883117 -22456449 39467847 -43600277 -39106018
12528 -39106018 14148726 1825299 -10779581 36758056 -374911 -11075688 15571529
12520 20237328 20648869 -3202153 5130837 -41330114 23609901 10364857 41910675 -21840920
12511 -4964121 -44540540 6348557 17202326 -29550426 1172527 -21200561 -29646101 -16749101
12503 -16749101 847576 8918210 12754706 31311410 -3460571 14374191 13672671 -24638113
12494 -33196437 9883148 37170314 -2681084 23584379 23885294 57641565 28144012 -8181952
12485 -1443362 -44568736 -10240084 -3896547 -42423800 29172053 -3895655 5920799 32087588
12477 32087588 -14250784 -40094359 -24989355 6060213 -12446837 38966479 5418843
12469 -14201618 13435160 5396440 50426282 1874105 47141812 16578938 -8232255
12461 -22700566 27505276 12594011 -31512401 3829478 -18391115 36885341 10269777
12453 -15577554 26660953 -10157353 -3057548 31880224 31013088 36266494 -19195410 -25318909
12445 -25318909 20606582 12542430 6334584 5881066 3842718 -5100500 16319312 2623781
12436 -20481499 -20959899 -35101050 -17757565 32033356 -22731875 7284628 -18793187
12428 -36675193 10256621 32170338 28465169 -47254585 -12005744 -11201834 10470865
12420 15410178 7961393 7807343 -17164435 -22555596 41324072 3982629 -45118598 10548055
12411 -20961384 -20411197 -30874843 -126782 1700762 74205924 10186228 14683247 -11914620
12402 2647452 -7724165 -37058400 -31232142 1065050 -3276864 -39622831 45078907 -1907763
12393 -47844886 21774771 29538134 19002374 -17401467 -23529492 -4715993 -30283756
12386 -30283756 -9961549 -20289703 -6069540 -16334245 -21106897 -16598304 6442541 4121116
12378 4121116 8545683 -47815088 -32650949 19632262 -6291027 -6772845 -25966946 -15850559
12370 -15850559 16899128 -16439895 8532753 16190217 380477 -31607603 869272 384535
12361 37321096 -14595336 29661581 -9210401 -9929107 24960705 -46589937 -23622218
12354 -23622218 39519699 41907893 -11148082 -10527514 12333211 13869089 -4274263 27356868
12345 73992008 13203865 -49488530 25178385 -20380446 -19044181 18388866 -9503759
12337 12885200 21017446 -22101312 21247094 64175758 29204966 -23668338 -13144189
12330 -13144189 -29281098 38706713 3419529 11740092 18643618 -1671401 -29482402 -12008356
12321 -26274603 -1249349 27696429 -18967282 17064376 468791 6381224 -5135818 -10865409
12313 -10865409 -17592194 -23710856 8159568 5425277 6890822 -31958149 -4860585 29332103
12304 -12655972 -26553526 5184929 -4469463 3010536 -5189520 -29457154 -21137621 -19379013
12296 -19379013 67476501 -26255201 30824383 -39860626 -13716294 4620755 -54129009
12288 -19836012 1067989 -3355888 9922853 19135783 -31711616 3902681 -17243402 -8261346
12279 19110219 21365723 604795 2838296 606901 6206504 21077575 17953595 10975010
12271 10975010 17659421 49116471 -21641139 20762804 3909086 17837361 -21513175
12263 20701892 16889074 73922172 12139221 5021136 -7770712 1153919 -18056308 4185156
12254 -11277271 -6476337 14999636 17529642 -43190753 21962980 -28651685 -20323692
12247 -20323692 -5586930 -22706687 -62172694 27818093 -36203657 17258244 3532743
12239 -1986015 59095886 6393215 -269594 28592414 -3591644 -2225301 10355190 43916651
12231 43916651 6972395 12436616 -21187166 28266318 62142298 -8057163 12816696
12223 -29079113 1151574 14930 4906916 -28226913 14527673 -26970507 -5714252 12071812
12214 -14207208 -20497571 -5102311 10381236 5838387 -8745907 28337788 33517209 -6859350
12205 -15185486 -9384097 15748816 -256429 7702391 -20245852 15421764 -26721129 6028012
12196 7748733 8447239 7910093 -1512772 6034112 -29466236 15902811 -1768884 55305551
12187 -44842117 -21375281 1057290 -26039540 20547548 -3321376 7063234 -2507605 940142
12178 -11308878 -4503372 11288549 1471206 23928149 -33527248 474913 6803247 -23574640
12169 -18321024 15876423 -8494886 5801143 -23305559 -23084649 -29663991 10502869 -19770467
12160 7132225 -30804456 13059511 10836693 29680239 -28298690 28272615 18730594
12153 18730594 870036 185035 -11153125 23059818 -2439490 4277317 -22958222 10030838
12144 18185211 16750633 -37287347 -5687598 -16769516 23356315 -10825226 -14956797
12137 -14956797 -30265147 29617698 27741334 -25371531 12296358 2099391 -1799456
12129 39494819 -9738035 55511649 2139540 -21525734 21955573 17512995 -13390293
12121 -27819351 -5507225 33541554 6240926 10888819 23411599 10103217 -23023880
12113 21007361 -26814130 -1246521 16230595 -47421458 -30141228 5116401 30306625
12106 30306625 7521347 -11611485 38738896 -40619768 -26827652 -17155984 -11204819
12099 -11204819 8968233 -14074833 11368075 32395501 -12259980 -6712119 3653002
12091 30237836 -12222393 -21391078 22951692 -3629327 44602622 24821758 3391405
12083 15714483 36728475 25584909 16435044 -3386538 -37951100 16010022 -19789950
12075 -6058870 21975649 -4691787 -11603467 10642334 29193490 -22601465 -43887954
12068 -43887954 -6088005 6701084 26242973 -4234058 9475859 -11709529 19095272 -4655611
12059 -14267147 -2613180 19955054 36358483 -13185092 7494278 12392508 30168767
12052 30168767 -20746275 31582392 -21831142 -11249843 -26702624 -66732277 -8691941
12044 8497905 -39478644 18558420 -8532388 -2419440 -40405829 -13905662 -4612768 -15490401
12036 -15490401 22258146 11131740 737628 -10003374 -10906899 -13942945 -6386320 29161529
12027 14834631 2816304 -5366539 -25557657 -6341621 45140461 -69065615 -3121854 -10137729
12019 -10137729 -7891728 3612797 -46267031 -22463329 -18801413 20803082 -25003694
12011 14902942 15563366 6355415 -3903957 -352848 -43566463 -21727145 -9956429 -24809908
12003 -24809908 2319960 13038945 -13457531 13925331 40279006 -27629099 1754391
11995 1874728 178864 4035680 -21243083 -52838242 -3607441 26739367 -27297385 9441884
11986 1847702 -4160581 32035745 -5432443 5199549 24358880 -46549860 15704360 10625012
11978 10625012 531643 -19108709 -9350648 -18611877 -10519286 -23049312 -25748680 27608416
11969 25828881 11595275 4770396 359443 -26718708 -2629562 36651349 10194872 8814744
11961 8814744 -23454307 -14760752 54640878 34677558 -15317059 -11957173 -3400187 -4983764
11953 -4983764 -3187937 52216269 40524602 28123508 -15043090 925460 -24644951 -28932907
11945 -28932907 -17612267 17130795 -4074438 -3891599 -206002 3836979 4194422 -21324987
11936 26147238 15425658 -2151996 -14073850 3645097 -928737 -10531371 12021867 -15227004
11927 9556421 32830971 12077640 12530886 -11959178 3084300 27300990 38953511 -6673032
11918 -1151938 -26500236 4608420 -26803739 -15311453 9073314 19778210 -30857418
11910 48150053 -11152333 -849684 28201350 22298543 -34214487 13914015 -33787302
11902 -12424542 -2810080 -23628019 -14644516 26031972 -10332970 17275684 -25175739
11894 -5159207 -1170387 24119797 553634 -25660326 15455541 19068671 4505342 62576671
11886 62576671 25601144 17480914 16890353 2185207 -9344681 -6684038 17492549 518052
11877 21462801 -20501785 12801355 22938899 24318024 5227566 -27077265 -40865046
11870 -40865046 17970414 2486770 9515217 -5257784 12865356 8697759 54343 14334240
11862 14334240 21700087 47667324 13647266 20434954 -4402045 -20675156 17968198
11854 4707115 -16780946 28361334 -9290383 -2236365 13347155 -17877676 9609134 6551507
11846 6551507 5713803 11020824 6494299 14466966 -13057321 -3991058 31345576 18215390
11838 18215390 191087 25409835 -2388869 -39020337 21582904 17610651 2272575 16036422
11830 16036422 -12347033 6008516 6392831 -11142331 21337087 4753958 16302696 2256253
11821 4641960 -34551137 -23480510 28815282 8279451 -806008 13150175 -11350527 -6043174
11813 -6043174 -6924951 -14485995 -30030380 10581091 -30186951 -50650908 14770696 -24644410
11804 -14518071 -8600535 -26610552 615458 3584433 22973448 -40659211 -10410955 12061822
11795 -4320260 2037320 12199706 -30847819 -3510013 -12806496 12510148 31235036 -95138
11786 -4998447 -2226301 -7121170 25703661 -8677277 -29806518 1025914 24570449 18570251
11778 18570251 1251493 -7724032 46556213 8988481 -5754984 30310897 -16036702 -9915773
11770 -9915773 -1623813 16813790 -21682198 -6866266 -21430488 25181235 -31002682
11762 201793 21904963 -35982684 -27088556 24734320 19734982 -50609671 -22808790 -7750681
11753 -5153735 -10033286 3316279 -12164333 -39324069 17590831 -8279150 32158321 14291525
11744 17757360 15732852 2235051 -2915447 -21453144 -20791466 45542157 9110393 -14267383
11735 931068 -17299711 -20648619 21988543 2226418 1953472 22097199 11581523 4294062
11726 -7955800 7264677 29723783 28304298 -26327309 -16231538 -4278268 -142750 18011664
11717 -5865345 -6589060 -33890453 22023309 -224920 -8556801 -5536949 -17818160 12350540
11708 786807 2648684 -20943654 434686 -1753440 -22552635 2881427 7441773 22526753
11700 22526753 -7119126 -2447330 -5756020 -20232 -16781390 32059369 22575164 16054557
11692 16054557 -3858404 17316173 6568628 3397843 5997610 -10913490 21830836 9025146
11683 -37617569 -34822932 -21740306 -24212854 9950714 10985566 -11624359 -7965289 -19359719
11675 -19359719 -5649535 -32795575 -39670011 -23967793 32874365 -8847163 -5983472 -15018287
11667 -15018287 12654999 -12821781 18256988 -16194604 5731328 -28336289 -27182300
11660 -27182300 -3959710 -9781792 14810113 10321099 7609470 -36865082 16881504 2155261
11651 -17454750 22994692 -9459711 -645352 -5483884 -18056973 13103233 58527476 -34347761
11642 11621131 37880537 30115996 5830457 -4497685 29489518 21903946 8995595 23909673
11634 23909673 -16465638 13068016 -27278039 4198448 -19317606 -9362964 -11131791
11627 -11131791 -14844778 50727808 12006069 16691633 -1941119 10203953 -38331979
11619 6116721 29910845 17979437 -18543985 16020461 6277243 23423031 -12076008
11611 -15198269 -7167188 -11168710 24811628 40054474 -17961523 -4346604 2501977 8098470
11603 8098470 -9355777 12407786 -39542253 8659238 -2967040 -21620261 17725602 -19490328
11594 3446015 -4655180 342706 6826861 14184406 -17607223 34828677 -37664318 5275312
11585 4021793 7881725 -6369154 -30335346 -22438598 11564347 12391933 25453041 25033224
11577 25033224 -3466908 9585911 34849869 -17747969 26760216 -51730158 -9434294
11569 2541640 -13335147 8779234 15472848 -4972518 -2134208 17182487 -4611715 38090361
11560 11683603 -26530943 34087350 36479864 -15025785 -24517686 3097915 -25070842
11552 -25527376 -24524563 -21321079 1751196 27757499 -32361869 -26515581 -1871647 -8163987
11544 -8163987 -4565661 1375542 7512159 -16629150 -33790231 19157590 -1892909 -68903750
11536 -68903750 -21704100 -24271631 -15063809 1344920 -10386744 -22393047 9946814 27900340
11528 27900340 28549223 11885980 12523207 22407411 -29911035 5787847 -34001063 -21914770
11520 -21914770 -21201632 -21237317 11591987 6391695 -16372178 24405605 -12564428 752869
11511 14693843 -40214244 7583076 -29637761 13816153 -9702576 38117828 -45234027
11503 -32538617 -10436557 -8675354 7090212 17827518 30070493 13611769 16350137
11496 16350137 -18857691 4272747 -10311767 6978948 5463936 -52638620 33568035
11488 -25465895 -32802476 15749478 6374784 -2076237 4189740 14063758 -12355111 9755991
11479 -9418548 9410236 -57075590 54838322 19522455 -28026094 34537473 -5509418
11471 -10303032 -27238134 -3069303 31615944 -9932726 15235817 7863037 -21946374
11463 24130257 -5294951 500101 -24209673 10900633 21250350 34280175 31792741 4935037
11454 -20801502 -34819522 7147838 -19509016 21311383 46939997 20818479 332487
11446 9518194 27460445 11878749 1123727 -28862298 11600339 3202124 -19613717
11438 -15590398 -23725837 2085628 1750663 -1106999 21467024 3407767 -18999201 21171535
11429 -33763284 -9783382 -23575878 -27911723 -18469848 -1197103 1864468 22217297 35176354
11421 35176354 -2244277 14444523 37898532 40183225 40579393 39974492 -8511833 36585392
11412 16667635 -3753091 21982607 -19613520 -19092433 14522004 -30553130 9195854 -3102716
11403 -7853999 28181136 5213701 -5757735 -60274343 -4215255 16847079 -19475834 19934491
11394 -35571085 1865409 -24191341 -5513876 7710528 -9106936 -3348281 -9743364 22430236
11385 -29933015 -46230553 -19502864 -18744750 3024627 10942922 9285298 9722546 4984999
11377 4984999 -28273925 -10149478 10219324 -12131127 10586083 -10531012 12417455
11369 39307243 -6343429 46377863 -6447114 47050343 -9646723 11063942 -24169277
11361 -13053442 39423922 15751439 1481309 28724820 12327487 8091482 5901817
11354 5901817 26359858 -31499406 35908712 -5949188 16776580 -280249 -3146849 -7905576
11346 -7905576 -17908313 -5295270 8323150 11191280 42976635 23649281 -18844181 -9464881
11338 -9464881 -14813850 -57807022 -13894283 13526821 -20595359 28161214 2428196
11330 28873213 -8055151 10019000 27882309 -12545827 -5735027 32210015 632166 11237501
11322 11237501 3178278 29582439 36751086 -15591097 19308587 15639822 23216656 -30810394
11313 16433064 2261005 6117582 15001247 -5240820 3103458 -21593436 19118555 23698329
11305 23698329 -10957515 -8225930 -3431316 10641411 37208473 8747237 -7655346 -29307377
11297 -29307377 1487698 -25537405 18164818 16704228 -60374355 18142707 8349618
11289 17098646 27022458 22861432 -29258878 1028827 -21561141 22590495 5822743 5485883
11281 5485883 27315790 -19526659 40337945 -36634404 -25000011 -34256419 -468033 315407
11272 11813772 53880022 -3583406 25487638 -6457456 7827598 -25281248 30549415
11264 12441076 1148568 14182740 11413590 -34043276 24130289 35361532 23373034
11257 23373034 -10394441 10096123 -57224224 -11603042 -22866986 17266341 -19910494
11249 12886347 -108403 18198675 -26658029 -2315188 1749750 -4528441 8792074 -523399
11240 42784014 40853380 -18334 7415936 23999389 12894045 26309654 -14198253 -6890310
11231 -5145464 -4642343 -9386722 6983587 12919446 -30119 -23159968 47609200 27591536
11223 27591536 -19735634 26106341 5498707 -19306056 1495778 -14854344 -28628859
11216 -28628859 -5244651 23107452 9120179 27983896 -7247978 -21629874 1590713 15553976
11208 15553976 18828768 -10268408 -6641663 12463550 1192495 -35441031 5677598 25829949
11200 25829949 -8664645 -14730698 20679483 13701593 -10844778 -11176751 944750 -32678994
11191 -5310075 -4814824 -28587871 -40120717 -16714606 -27788888 25121042 -6604107 -12026790
11183 -12026790 7614318 -10482215 -12836893 -2738641 46593398 445997 -1175688 -460454
11174 -22600709 -4705018 -31180908 -22276066 41698022 14090357 42108364 -5677207
11166 24390309 13872488 -20914695 -10207220 -13342020 -24840876 14090845 -38425695
11158 9419978 -9571206 5969541 42562514 -23402666 -51824572 33269269 -10258008
11150 54099358 -6953904 8489080 25600627 27731385 840722 -6971803 -18927214 -17262229
11142 -17262229 -9492938 -35805858 6277185 6535100 -37990974 -23594102 2982629 6958001
11134 6958001 -47485387 39539137 -8077420 -40444983 -23403944 13789986 14616835 22131456
11126 22131456 19291241 10314273 4936185 -35631773 1562159 -37887874 -4190878 19490973
11117 -34412548 37312679 13834599 -27090162 9539777 -275852 -40948513 3431392 20240591
11109 20240591 -4508586 -20655496 7702948 1146858 11769976 -6571970 8071926 -6754165
11100 2361959 9540608 -211752 9833058 27732442 30610546 -6145271 3401665 18577472
11092 18577472 2678300 22708193 -11456712 -20395718 56298084 -15110673 7165609
11084 -23843231 8281475 8919397 -29978574 21111144 29023534 4250834 8488036 1465162
11075 -2511141 -14121915 -2112324 8277139 -22270086 46313474 -54372184 15909290
11067 -10148678 -14167842 -15923350 -13019955 -61309932 25265664 -42835856 12915767
11059 -6909498 333325 15171696 -23051988 13452455 5912143 14945074 -7470174 32502778
11050 -5892982 -8619916 -24646429 -13754254 17794747 -1740218 -25784768 392075 456681
11042 456681 -33812342 -9898217 -22508426 -7138325 -16104926 -17043405 14411751 3140312
11033 2412461 38899016 23246203 -11136052 -4694106 -460306 -48819983 20221919 -22878173
11024 26244736 52361290 -15187310 599669 -9629409 31040660 5075168 2944258 17677069
11016 17677069 -58182339 8503387 -11619511 26009263 -15019633 24254079 -3914693
11008 14742961 29750223 -10122221 28122023 8765211 23701290 -25491525 -15362417
11001 -15362417 -24689257 -4965720 16578147 42890309 24434434 -7530253 -18448535
10994 -18448535 27441481 -30182930 -27614643 5890389 -14542206 -16334111 -29096255
10987 -29096255 7274493 -5403391 -28242455 -3913693 -1282429 -17138475 -41394136 4757521
10978 4985953 45053330 15503448 11238928 -4500367 -13623541 6865064 9505824 2174762
10969 -16996428 -21990286 -6944220 18457765 -8950246 -4067664 11812735 -25134390 12701782
10960 25873443 15107184 -2169332 14979606 33559788 -6049529 -25003021 7530210
10952 -17317245 25746294 -39436919 -12201781 5972269 77697 -10931199 9724015 -23662242
10943 -15734395 -14330200 40781296 -38676884 -24087190 -57604345 4940661 20943292
10936 20943292 5876976 -35186335 -4145874 15890607 -21506887 43397325 4829021
10928 -21295862 -19834679 49132839 36504358 -21427445 -18192232 3627428 37879493
10921 37879493 -829092 33571957 -53529961 317308 34272565 -12902089 16959527 -15492088
10912 -1400954 -15238812 -16457620 -9284725 -36629062 12996193 21631784 7103454 -12603150
10903 -29906861 -20751095 -5644329 14659733 -24300986 30186649 -38306404 -26790375
10896 -26790375 4992486 14864336 14439904 45987547 6076464 19173422 -28640215 14250291
10887 23115263 7373154 17636934 12109520 4419067 -2672821 29574698 8717711 -2535555
10878 27883208 -42489951 10828354 9942166 -2614952 -35552519 1022803 -31831140 36445187
10869 -31468278 14026631 32557616 22820065 -2030541 -17140065 3603305 14515530
10862 14515530 18574847 -5449051 1157784 -38359877 -7191027 -20083538 -2476047 -21273911
10854 -21273911 1338029 33696448 -5912261 35676601 23065807 27875375 3391149 8527429
10846 8527429 10308041 -22689890 15656517 7982931 20645012 20070108 -26209263 -17944751
10838 -17944751 3695382 -16329187 -27040159 2196397 -7419407 21324043 -6469238 -6863740
10830 -6863740 -23875584 -10633978 -21489325 -33957182 18294553 -13038983 -28295118
10823 -28295118 18941698 37021359 -8610741 -21328632 -22267157 8295085 7876689 -16440929
10814 29424504 7163085 -23385566 -7935749 2047203 5546879 39665412 2536863 -10965015
10805 -23822081 -3566358 -10661229 23527952 2419961 -17997469 -7111427 12441191 22714477
10797 22714477 -4293222 31375946 17700307 24087283 -8557537 -8937369 -10494254 -19287476
10789 -19287476 -5367105 16014103 13609859 -27228034 23633218 -24474185 28769552
10781 -26374133 -16957391 -7435563 -28925152 -24350824 25689255 -33470562 10433164
10773 -38948532 -45625197 28695155 -14520592 -6911988 30075436 -4491881 -59101462
10766 -59101462 20453033 -1419672 14090857 -39487336 -37627088 7635426 -22903856
10758 -27563310 47280024 -39538007 -11887641 -11431053 2121513 6721668 -28730899 -7257393
10749 11726 3064737 -11870433 9756391 23271168 -19324747 5210691 -15099347 8778111
10740 33630723 2110095 -25082566 -38599191 -8507953 -30264729 18652164 -5438970
10732 -25294738 20416563 33256035 25943615 -449509 17802919 22794088 -24808132 -65539
10723 4304580 6181415 -18603058 2055725 22593193 -27891589 37025001 -16666459
10715 -5977076 -7577501 13849961 -11020410 3394810 -26839807 6280956 1890874 32776640
10707 32776640 25659776 -34913671 -4982821 -51968178 -19176266 -27349018 668174 3535900
10699 3535900 -22682 -19902853 8220482 -34474555 11628615 16256378 -13753149 -43071880
10691 -43071880 2000029 -571585 -8799145 9995449 -11890871 13563806 18929343 23604985
10683 23604985 36808482 26404299 614723 30250897 9510029 19749955 -3632423 -11026555
10675 -11026555 -22491277 10623858 1406995 -7936235 -2286035 -1548721 22979890 -27850982
10666 -12072288 -16609802 -19710109 -23365299 4842012 -20137979 6398244 491188 10474676
10658 10474676 -33140388 -30386665 461746 -3556471 -9516028 -10319003 15701346 9415824
10650 9415824 19095774 594025 11497708 15649727 -9198448 29168071 22347341 17123966
10642 17123966 26511646 -17811872 10683983 -41579508 -10652455 -8762634 3444849
10634 10065195 38557223 -42615819 -28088121 15821375 6613626 -49822580 -1171452
10626 -22356085 -50841252 30305071 25196058 21602704 -17184696 -19279875 22920492
10618 44453781 12957641 7034073 6817731 -36333449 13774945 3032590 -12119602 -17983816
10610 -17983816 6294901 11123938 23060621 33026022 -29934974 -1411691 41053374 -5637613
10601 16389744 35403089 -16847362 -47686584 6980932 -14471290 34704653 9510921
10593 15061010 -6447928 -10060296 -32901082 -12919540 13656265 -1326621 -1652322 -21031041
10585 -21031041 5707518 22227714 -4441710 -51503864 825841 -6205063 -18594023 16847149
10576 9944216 -29872338 4082663 -14498297 -9156581 -21588031 11686891 8431906 -24876457
10567 -19085338 24482885 3830164 -9152834 15746986 36443814 7896134 -51511741
10559 16476446 -1151965 -19291745 16829045 -25097576 14943116 2777442 -15704174
10551 -24693950 8713881 -14013501 -27423916 20839003 -8901655 8475336 20808363
10544 20808363 -37987874 21999964 16181119 25896668 8417448 13054432 -6254260 21917793
10535 -15686620 14496925 -30562780 20040979 15950066 25979025 38646284 -30593690
10527 8773125 8697196 32238430 -8141935 2872234 16724212 12122757 26546395 -10095037
10518 5877922 -11875405 1169174 33237893 227889 17063748 2332310 -15528948 1792140
10509 37938376 -17198653 14913515 2430355 48410913 -53843327 42900086 12013184
10501 3574371 19139016 686911 46127649 -6736683 -13291285 -8158526 25654501 -5338447
10492 -25076130 26597046 15058323 12890431 -15660489 38741815 -16577399 -12807677
10485 -12807677 36094422 -10943598 27966286 19902737 13965612 -23812201 57079491
10477 13755636 -16793743 8540140 -11294329 4102289 15188680 -32552239 202672 34600167
10469 34600167 11044292 -21356414 -15449213 14090789 -18699691 16315799 25099724
10462 25099724 39843491 5954365 35755418 2648279 22470456 21118865 17768873 11037536
10454 11037536 13958037 697120 -10517784 14231054 3935764 -16961521 -18585704 16812012
10445 -12616811 -23247806 -15914783 14406729 5473500 -27953583 39818277 -764010 727452
10436 26931941 5600221 -11577295 -1742387 -7132290 -1315461 23555866 16171690 -5347057
10427 -40022219 2376630 -16634747 -26263348 -28156412 -21501860 26802541 4734121 -43981479
10418 -13745649 -10907430 -8274967 37037115 -1901148 7219915 19809533 12644060 39860496
10410 39860496 14978213 -15436485 4278244 1963420 29057246 -156261 -56126368 23169931
10401 -18225531 9881547 -20381110 -14314282 21363280 -21818964 15096206 5778065
10393 3995336 4878172 -13938117 -2355238 -3770054 20402311 -13305073 11505809 -30077685
10384 -20861525 -22339170 4059905 15414743 12500597 -4425975 9614904 32231062 -19230147
10375 32981875 -40426296 -8010840 12298795 3945213 11966367 19128934 22485454 17938523
10367 17938523 17026638 -60676269 2558202 564452 -39373162 16302936 569583 -3217882
10358 8673727 2408323 1773426 21199222 36576 -46811622 -26000526 -11659177 -10584680
10350 -10584680 958382 20160603 -2784819 30717633 -8514570 -2393715 7855326 -6427948
10341 -17064422 -5461286 -24071642 -9854523 -17867378 12986988 10000989 -25607114 -53616138
10333 -53616138 12557176 -27148047 -3626578 -14137948 -11593877 7398469 10846040 -7246536
10324 -8381920 31721578 -35099301 3709952 -4243674 10364732 -48550336 26581603
10316 7260893 39342004 30949976 -23677477 -12172430 9537057 -15384566 32801709
10308 -23704253 -4944460 10724864 -10103080 800357 -5096707 -12718814 4072205 -7555340
10299 -55154953 -5401868 -53694322 -2892854 1132215 -17741944 21033190 -48964881
10291 28057367 18011980 32597905 -46206521 -28474026 -22457750 -1537676 26212351
10283 36249565 -30165665 14923492 -16832439 18450981 -11167591 28680920 -22382733
10275 -16747584 -6004378 -25739816 -11187584 -6606231 -42197652 20575912 21416612 1702604
10266 -9259665 22914419 -26056089 -3422711 6605878 1665482 2266641 -11265789 -3801719
10257 42401310 4718490 29317804 -5760323 3838457 5114674 -10176700 29716012 15054751
10249 15054751 17605252 -24823808 -36544788 862455 35531267 380687 29843028 6746595
10240 -139228 62191691 6915263 -1766083 -13519304 30175181 12908601 -15168577 27658935
10231 58585 -22438630 -9875659 30394580 -1540132 -8783211 15971408 27050676 21234547
10223 21234547 -17949147 11045524 10562606 -24096478 -10191606 2883367 40377568
10216 40377568 55314673 2004756 37210832 -41437474 2770849 8310474 7784589 -2543919
10207 -6173316 41233250 -16697274 -15816426 -12874169 30041419 -2279983 11945742 -4000867
10198 20472351 9417261 13676043 -5270001 17410369 7332394 11395848 9356767 19420960
10190 19420960 -15155982 -37013295 6030027 -25082695 9495347 5487130 19716403
10183 19716403 25097428 -15449254 5258013 -14162872 -2310374 -18556402 17730972
10175 -8215166 -13434537 -5752686 -19962431 9548138 -32576290 -12676556 1722758 -21367562
10166 -16385103 2618034 8770521 -1894356 49430163 13170087 6627663 -14765158 34244543
10157 24655211 25101496 26955732 7247474 -27481444 -24654201 2237367 2883325 -22413571
10148 -2108220 28144020 2707793 -18135794 54153559 8244870 9040020 -23226402 40464864
10139 2239606 8122655 -26874010 11100394 -14499815 -20242399 7370411 -12112900 -19291395
10131 -19291395 -1775960 -22962460 -4647808 19665004 26489436 -34257211 47053266
10123 -21682331 -27745289 -11226280 -26983761 10968120 2432761 -16561208 43659714
10115 14357050 18031641 -25195757 -1641392 -12406538 -20052660 -5543160 -15636028 -19252308
10107 -19252308 -7250609 39357141 -7631091 12517726 -17137849 1984071 -15563502
10099 -44232080 18126198 6949249 34778959 -449617 22526465 -28217725 2802856 3194492
10091 3194492 -13350427 19777063 -47758547 24799495 -17119598 13819278 -32574021
10083 11073197 21342320 11630394 -11527543 -9235311 -26666079 29753468 -11236168
10075 -10500056 14390776 18496294 44064768 -6214645 39803600 -10332304 37246286
10067 7888996 -17804134 -35331859 -5613086 19618082 -3541343 22925159 -6380024 -4206332
10059 -4206332 -28528719 18120012 -18027753 -16843315 22712267 -4727597 8288560 1908081
10050 -22392500 18642765 -10655679 -4003853 -42769995 -25695115 -1095919 18225075
10042 10419326 552397 10780900 -22252728 -29368500 18731173 -10933012 6046637 -16415429
10033 -1068844 -14075748 1992273 -41845373 32945723 4866349 -15161491 -2325481 10339940
10024 -30813176 -22051772 39780999 14889845 -4154784 3697354 11882976 -11427520 7926231
10015 -956431 -29192432 1895698 26351526 -7054150 -6086904 3787136 34220904 -17021388
10006 -11123170 -19107509 46637546 11985420 -3098880 7110153 18817676 -11794193
9998 9562523 23592122 29437170 23634954 -10855199 -4530184 -39030623 2452085 34893690
9990 34893690 24474330 1274200 14124407 -3287759 28019023 17228252 -825004 -15738553
9982 -15738553 -22491832 11820997 12913290 18508757 -24002932 -10571692 35910374 -8491632
9973 -6006050 -27339867 -9020010 23621988 44682935 -8574811 -40849955 -16059759 -759734
9964 -9857676 40337844 -15484052 13954440 -56771718 -9358337 -4695223 -15294589 -9830622
9956 -9830622 7738015 19035398 6343565 879022 -35212348 11905318 -43533060 5681791
9947 2063442 21343816 -4544306 -7220288 -24102241 23225257 -14978410 -8933764 -45666719
9939 -45666719 17948011 -28012595 5689740 27489990 -15532275 26800807 -3848889
9931 -33222485 10711228 -2404794 -10827896 -386394 -31142903 10037226 -10176095 -2169686
9922 250410 -35796823 -4743352 -21080253 -17661099 -8031248 -3412094 -21767383 -15228458
9914 -15228458 -12619213 -19211836 18552731 -6115246 23285905 -7462796 -9879701 8848269
9905 31028689 -14277549 -16700785 -16783567 -2547447 391961 7289020 31092764 -4280287
9896 13510146 3871746 1486522 15833798 26939631 36875304 19205712 16266878 67808984
9888 67808984 12153739 -48818699 -16372425 -19662519 30901935 -18354433 10402911
9880 24176307 19029856 -10694795 15201736 -15531558 -28573036 12080959 -2231702
9872 25765600 -5304736 2285155 20406596 -2164035 29408990 -12993424 -25792473 14460091
9863 4012012 -19196199 -9192809 -53078922 -7476349 31323914 7185532 -4251012 -18559778
9855 -18559778 22566997 24365104 13876334 42346117 18221197 -62896410 12177433
9847 17170110 -11099095 11254053 4241035 26117290 -2758719 -6167214 8911307 -7722159
9838 -12382725 29713183 -16726458 24662735 -17833425 -10536843 8882851 -2939647 -16955128
9830 -16955128 7811327 16953623 -34274551 -9049260 6408992 13033002 -1802696 5762903
9821 683179 3330163 2604608 50164376 4113378 27678524 30461819 -13186062 13154340
9812 13300757 9889927 -14753772 -28731312 -1482155 25415946 2901128 18789295 -33274821
9803 -30333313 -22552150 18353503 -6898140 263550 36097494 5612579 -5764946 8238495
9794 28137681 3678277 22297427 39478824 -5067260 -2771813 -16131829 -17621455 38679614
9785 -2545183 -20360744 -20446444 -24359977 28031914 -3916295 -22090616 27817180 33871691
9777 33871691 -49338579 15943828 3702976 14456364 -14319825 -9337223 12630134
9769 -6506008 -6236940 -7974314 7719856 17691291 33452880 -11621332 -41264623 16632049
9760 3576517 1974304 19330337 -1514118 -22372134 -20843159 8791931 -21062519 -4458375
9751 10132004 8145169 2056985 22574277 -11109661 16749846 -13148941 12729387
9743 10467204 38239833 17395818 -4049052 -9290497 -20482083 -41323107 -23569006
9736 -23569006 18831791 -7050196 18860253 16267829 -38631670 -13103794 23936543
9728 29642379 -61494570 5466980 -4482053 18958427 32247271 11779881 -82556 -15017266
9720 -15017266 -9869962 4773298 -13390726 16409740 -4421011 25655121 -55359936 -14754394
9711 39462270 -56153320 -20756578 23620100 11893614 69116 12445103 6942733 10298951
9703 10298951 -49609497 3096634 -7148234 25105417 -34935160 6917212 23662828 -23592032
9694 1785405 56530101 -25803686 20142472 -1453575 -15208860 -5905043 9348884 10487453
9686 10487453 -19744429 18701695 -8044602 36532255 -30078760 7967960 59002659
9679 59002659 25991335 35958510 12769680 4855551 42202801 -15040109 3468579 -23312935
9670 -320285 -11741548 44003913 -14628562 18983173 6834256 -11862799 -38556313 6908996
9661 20683268 -10790214 -4382112 2316128 -29134397 -15324298 3362117 -4890780 25213016
9652 -25242525 -7669611 6805570 -4448802 -32165614 -5035858 6355544 -15457870 -4999431
9643 -3639552 -5390295 -18520473 5004930 -16057490 41185354 -22850752 34480811 -28852426
9634 -22057992 22393951 43448265 32811440 -26261352 2133532 -31495618 -7551387
9626 -268938 -4473298 50976724 -39215864 7209934 -27293746 -13096934 7395823 40999150
9618 40999150 -20605525 4181567 -21919433 -16469570 -45741339 16455358 7277013 -6142278
9609 -10543491 -29790375 4647785 36637360 -20902995 -1662882 -35441448 12248848
9601 -18447948 48087548 1675119 -36605482 2944685 846296 -4056196 34365039 -16170246
9592 10146689 -19688026 -34765076 -34581993 -26006959 6210526 33905677 -7375579 55316400
9583 2051844 -36840956 332373 17393349 -5150368 6518627 761346 -28286238 17148639
9574 -4585047 42929013 2343554 -7133563 -14639490 -7176287 -262724 13793940 22171759
9566 22171759 7993604 522094 -25929370 17876808 -8490076 -31634286 -14698922 -27941061
9558 -27941061 24587000 2804678 10369550 -8138268 -211656 -14525106 3189474 3216456
9550 3216456 269376 44275332 -14234414 32026829 -26435320 2949280 -1697857 642595
9541 -19743717 16367839 -29030076 6509405 -32723448 -29635288 8233452 -12212623 -10344295
9533 -10344295 -7615558 32424227 -19626212 12601171 14724461 -26889495 5081400 2130561
9524 -24303953 16738892 53504335 3083369 6818695 -14941730 -27803604 -58460642
9517 -58460642 -17604100 13449816 -13708505 -13957131 18483989 -33063331 32623280
9509 -9938071 25994266 12606013 15485858 -49573002 9436722 16427656 23558458 20847981
9501 20847981 12791350 -15634141 -28062406 10389777 28646605 -8943740 -34944789
9494 -34944789 1018787 -1761887 -4428495 25859929 528825 17887516 -5239441 12439754
9485 -20622114 40123801 33533666 10280207 -14493815 11773415 3701852 17998498
9478 17998498 13909437 -6636894 -35802439 -6639128 19997125 10338299 6017867 39044793
9470 39044793 -23776802 -23305862 48835941 -5864339 35338128 -5234538 -10543839 -7350929
9462 -7350929 -3165022 10677719 -12745080 6599478 51133401 -18241972 3023119 -17585459
9453 25981971 18882295 16874808 8015256 -30015666 -13769607 9948532 -12599209 8332466
9444 -1055897 2364320 -6525350 -39190913 9219288 19134795 28014296 -9455508 -28602358
9436 -28602358 -26108409 -13860685 -4741656 35290442 20439594 48245591 -22140655
9428 -18747140 70309118 -10661417 9178446 22963716 34014748 -37830024 27218783
9420 47699995 21994491 -452155 49542629 -12499976 -22445700 -14466598 57007440 921431
9411 -6249898 -10004670 19972292 -10266198 -39006530 -2267404 -38411036 -11150907 7985985
9402 3309492 30307926 17026813 -1212154 -20269878 -8263604 -10554850 15612988 43062405
9394 43062405 -9732876 4850518 33727653 7237053 -19942911 23912019 -20950869 18083790
9385 7276331 -19532631 28530428 16634821 -22266129 40542365 34687785 -27089543
9377 -3425084 1040390 1720487 -5582749 -7726794 11697574 -10665990 -80406 -40595584
9369 -40595584 -23908706 12319942 -50940991 -30936589 6919876 -9668231 29759204
9361 17924259 -27120062 -31600764 4599422 -20212487 -13273321 14128202 -7895292 12398361
9352 8233450 23190132 7218974 -45787356 26667707 17401848 27965918 -51616127 8974863
9343 -4550968 -9241537 -6112035 -45390587 -4236229 3695814 -27424305 11380879 -6378891
9334 -27855285 2204029 8878114 13593693 -11259198 -38423116 3017903 41653385 24095964
9326 24095964 -6712590 3743671 -918446 -8916109 13052420 -21397687 -3385903 -5000700
9318 -5000700 -44091592 -17308619 3882121 -19167332 12674538 -26943468 -23320503 -1328265
9309 22835760 14644260 -9430205 18666782 1008449 12426394 33957363 39516129 39399491
9301 39399491 17678176 15550051 -36691208 -5461842 -9559902 30616518 12230928 1893143
9292 25852005 -31202004 26647068 1702348 -45677357 13202846 -30537650 -13689701
9284 -23559676 -1624663 54506099 15818 13363166 -27573628 33349764 -60584361 -11004117
9275 -1595146 9511236 7769922 -41229878 6661204 -21710898 -30781613 -16117603 -24527141
9267 -24527141 9544887 16023279 -11425372 15811296 -19645175 39767639 2021433 155156
9258 -36694200 -243795 1115617 -5704304 -24471998 -19605466 3649019 -5758150 446044
9249 -19107725 -16085756 7959555 -32213506 15898553 8034540 -258620 21512596 -15897165
9240 -4221364 -9784403 -6398224 -33100027 -22166234 19625318 7092982 -12491537 657274
9231 -21658496 -2163361 -19534373 24104583 6425404 -21469481 -26492122 -6919721 8549825
9222 5985746 65033748 -8808238 2794482 -8189765 -31119133 -29418093 -9158757 -17107867
9214 -17107867 -301718 -9582796 -6306910 18998048 -7467870 8060317 11581478 15269968
9206 15269968 13841105 -48505335 16338544 6074122 14860993 -3547337 -43099732 23665210
9197 -7621879 -38679883 8338210 19569782 -13027823 -2374843 -26432643 11971740 5801415
9188 -7114988 -13223391 11127532 14124735 -6546364 -490993 -16121647 27112296 12899473
9179 -20981906 37267596 -1398798 9651225 37018053 -130816 10641657 30214672 -8573058
9170 30038784 -12335583 -12547364 -15210485 -17243509 18445033 4038976 19704642 -19100201
9161 -10178912 -8708566 -18228234 -3251361 17576172 -2635814 -24325392 -7165676 16266970
9152 -9988380 40620160 13091851 -42404047 -14949501 22362777 9696191 -1168419 -26138967
9144 -26138967 32769525 26005819 -4759739 -16099484 28509281 25876513 5478366 12446452
9136 12446452 -17768345 4122272 32147057 30428124 -26695902 -6188119 29302579 9343849
9127 20160514 -30204463 23023129 19378193 -7092348 2525419 5427018 -11795523 27959485
$$ [...]
##END NTUPLES=NMR SPECTRUM
##END=
