##TITLE=AC1406_BRAA12215_7653149_5PJ1xK5njd
##JCAMPDX= 6.0         $$ Bruker NMR JCAMP-DX V2.0
##DATA TYPE= NMR SPECTRUM
##DATA CLASS= NTUPLES
##ORIGIN= BRUKER
##OWNER= Administrator
$$ 1.72 TOPSPIN		Version 2.1
$$ 2013-04-11 14:59:26.656 -0700  Administrator@X
$$ Compression mode = diff/dup
##.OBSERVE FREQUENCY= 400.02188249412
##.OBSERVE NUCLEUS= ^1H
##.ACQUISITION MODE= SIMULTANEOUS (DQD)
##.ACQUISITION SCHEME= undefined
##.AVERAGES= 4
##.DIGITISER RES= 22
##SPECTROMETER/DATA SYSTEM= spect
##.PULSE SEQUENCE= zgpsd0
##.SOLVENT NAME= COFFEE_meoh
##.SHIFT REFERENCE= INTERNAL, COFFEE_meoh, 1, 14.98509
##AUDIT TRAIL= $$ (NUMBER, WHEN, WHO, WHERE, PROCESS, VERSION, WHAT)
$$ ##TITLE= Audit trail, TOPSPIN		Version 2.1
$$ ##JCAMPDX= 5.01
$$ ##ORIGIN= Bruker BioSpin GmbH
$$ ##OWNER= Administrator
$$ $$ E:\/data/COFFEE/nmr/AC1406_BRAA12215_7653149_5PJ1xK5njd/31/pdata/1/auditp.txt
$$ ##AUDIT TRAIL=  $$ (NUMBER, WHEN, WHO, WHERE, PROCESS, VERSION, WHAT)
(   1,<2013-04-11 14:59:21.359 -0700>,<Administrator>,<X>,<go>,<TOPSPIN 2.1>,
      <created by zg
	started at 2013-04-11 14:58:50.031 -0700,
	POWCHK enabled, PULCHK disabled,
       configuration hash MD5:
       33 CF 6A 21 5C D3 B9 40 6C 15 AA 8D 27 A2 4F 13
       data hash MD5: 64K
       90 12 E0 7D 71 13 42 43 CF DE B7 5E AD BE B5 FD>)
(   2,<2013-04-11 14:59:24.406 -0700>,<Administrator>,<X>,<proc1d>,<TOPSPIN 2.1>,
      <Start of raw data processing
       efp LB = 0 FT_mod = 6 PKNL = 1 PHC0 = 0 PHC1 = 0 SI = 32K 
       data hash MD5: 32K
       D7 34 1B 9F 16 53 BC 06 63 4C 57 7D 69 EC C3 43>)
(   3,<2013-04-11 14:59:24.890 -0700>,<Administrator>,<X>,<proc1d>,<TOPSPIN 2.1>,
      <pk PHC0 = -51.7511 PHC1 = 0 
       data hash MD5: 32K
       C0 91 D3 B8 D9 A8 92 61 C4 FF F1 76 B4 3D 7B 58>)
(   4,<2013-04-11 14:59:25.124 -0700>,<Administrator>,<X>,<proc1d>,<TOPSPIN 2.1>,
      <abs ABSG = 1 
       data hash MD5: 32K
       96 62 9D 54 61 9D E4 68 FE FA 1D 86 71 E3 2F 2A>)
(   5,<2013-04-11 14:59:25.265 -0700>,<Administrator>,<X>,<proc1d>,<TOPSPIN 2.1>,
      <abs ABSG = 2 
       data hash MD5: 32K
       EA 52 CD AA 52 D7 A6 28 2C 00 6A B3 19 1E C0 03>)
(   6,<2013-04-11 14:59:25.406 -0700>,<Administrator>,<X>,<proc1d>,<TOPSPIN 2.1>,
      <abs ABSG = 3 
       data hash MD5: 32K
       89 38 DA E6 4A 56 17 C1 AF 5C 43 A9 7A 06 35 59>)
(   7,<2013-04-11 14:59:25.562 -0700>,<Administrator>,<X>,<proc1d>,<TOPSPIN 2.1>,
      <abs ABSG = 4 
       data hash MD5: 32K
       8D 73 B8 F2 A1 54 D1 A5 F5 FA 64 90 8F D8 DE D2>)
(   8,<2013-04-11 14:59:25.702 -0700>,<Administrator>,<X>,<proc1d>,<TOPSPIN 2.1>,
      <abs ABSG = 5 
       data hash MD5: 32K
       27 C9 5C 22 04 8F 42 1C 9B BD 43 A4 B2 51 3B 9B>)
$$ ##END=
$$ 
$$ $$ hash MD5
$$ $$ 7A 1F 8F 9C 9C 12 9F 40 AF 5F A2 06 58 E8 B6 24
##$RELAX= 
##$RELAX= 
##$RELAX= 
##$RELAX= 
##$RELAX= 
##$RELAX= 
##$RELAX= 
##$RELAX= 
$$ Bruker specific parameters
$$ --------------------------
##$DU= <E:\>
##$EXPNO= 31
$$ [...]
##$TP= (0..7)
150 150 150 150 150 150 150 150
##$TP07= 0
##$TPNAME0= <>
##$TPNAME1= <>
##$TPNAME2= <>
##$TPNAME3= <>
##$TPNAME4= <>
##$TPNAME5= <>
##$TPNAME6= <>
##$TPNAME7= <>
##$TPOAL= (0..7)
0.5 0.5 0.5 0.5 0.5 0.5 0.5 0.5
##$TPOFFS= (0..7)
0 0 0 0 0 0 0 0
##$TUNHIN= 0
##$TUNHOUT= 0
##$TUNXOUT= 0
##$USERA1= <user>
##$USERA2= <user>
##$USERA3= <user>
##$USERA4= <user>
##$USERA5= <user>
##$V9= 5
##$VALIST= <valist>
##$VCLIST= <CCCCCCCCCCCCCCC>
##$VD= 0
##$VDLIST= <DDDDDDDDDDDDDDD>
##$VPLIST= <PPPPPPPPPPPPPPP>
##$VTLIST= <TTTTTTTTTTTTTTT>
##$WBST= 2048
##$WBSW= 25
##$XGAIN= (0..3)
0 0 0 0
##$XL= 0
##$YL= 0
##$YMAX_a= 2220
##$YMIN_a= -2718
##$ZGOPTNS= <>
##$ZL1= 120
##$ZL2= 120
##$ZL3= 120
##$ZL4= 120
##$ABSF1= 14.98509
##$ABSF2= -5.573092
##$ABSG= 5
##$ABSL= 3
##$ALPHA= 0
##$AQORDER= 0
##$ASSFAC= 0
##$ASSFACI= 0
##$ASSFACX= 0
##$ASSWID= 0
##$AUNMP= <proc_prof1d_extract_pilot.lims>
##$AXLEFT= 0
##$AXNAME= <>
##$AXNUC= <1H>
##$AXRIGHT= 0
##$AXTYPE= 0
##$AXUNIT= <>
##$AZFE= 0.1
##$AZFW= 0.1
##$BCFW= 0
##$BC_mod= 0
##$BYTORDP= 0
##$COROFFS= 0
##$CY= 15
##$DATMOD= 1
##$DC= 0
##$DFILT= <>
##$DTYPP= 0
##$F1P= 0
##$F2P= 0
##$FCOR= 0.5
##$FTSIZE= 32768
##$FT_mod= 6
##$GAMMA= 0
##$GB= 0
##$INTBC= 1
##$INTSCL= 1
##$ISEN= 128
##$LB= 0
##$LEV0= 0
##$LPBIN= 0
##$MAXI= 10000
##$MC2= 0
##$MEAN= 0
##$ME_mod= 0
##$MI= 0
##$NCOEF= 0
##$NC_proc= -14
##$NLEV= 6
##$NOISF1= 0
##$NOISF2= 0
##$NSP= 0
##$NTH_PI= 0
##$NZP= 0
##$OFFSET= 14.98509
##$PC= 1
##$PHC0= -51.7511
##$PHC1= 0
##$PH_mod= 1
##$PKNL= yes
##$PPARMOD= 0
##$PPDIAG= 0
##$PPIPTYP= 0
##$PPMPNUM= 2147483647
##$PPRESOL= 1
##$PSCAL= 4
##$PSIGN= 0
##$PYNMP= <proc.py>
##$REVERSE= no
##$SF= 400.02
##$SI= 32768
##$SIGF1= 0
##$SIGF2= 0
##$SINO= 400
##$SIOLD= 32768
##$SPECTYP= <>
##$SREGLST= <1H.CDCl3>
##$SSB= 0
##$STSI= 32768
##$STSR= 0
##$SW_p= 8223.68421052631
##$SYMM= 0
##$S_DEV= 0
##$TDeff= 65536
##$TDoff= 0
##$TI= <>
##$TILT= no
##$TM1= 0
##$TM2= 0
##$TOPLEV= 0
##$USERP1= <user>
##$USERP2= <user>
##$USERP3= <user>
##$USERP4= <user>
##$USERP5= <user>
##$WDW= 1
##$XDIM= 32768
##$YMAX_p= 387434885
##$YMIN_p= -3267878
##$CURPLOT= <Network HP LaserJet P1505>
##$CURPRIN= <$Network HP LaserJet P1505>
##$DFORMAT= <normdp>
##$LAYOUT= <+/1D_H.xwp>
##$LFORMAT= <normlp>
##$PFORMAT= <normpl>
##$SURQMSG= 1
$$ End of Bruker specific parameters
$$ ---------------------------------
##NTUPLES= NMR SPECTRUM
##VAR_NAME=  FREQUENCY,     SPECTRUM/REAL,   SPECTRUM/IMAG
##SYMBOL=    X,             R,               I
##VAR_TYPE=  INDEPENDENT,   DEPENDENT,       DEPENDENT
##VAR_FORM=  AFFN,          ASDF,            ASDF
##VAR_DIM=   32768,         32768,           32768
##UNITS=     HZ,            ARBITRARY UNITS, ARBITRARY UNITS
##FACTOR=    0.250966925370066, 1,           1
##FIRST=     8223.43324360094, -239366,      51335
##LAST=      0,             -393260,         540747
##MIN=       0,             -3267878,        0
##MAX=       8223.43324360094, 387434885,    0
$$ Real data points
##PAGE= N=1
##DATA TABLE= (X++(R..R)), XYDATA
$$ [...]
19270A282058E8668a409654F83090b77582c2695H88339C79028A26371i16941f0818
19259E0552a47125A402812D96380h33960b63083A26434b80297J1322h0718j284583
19249a365301e41578H27226a33275D0103d93756l95472L24275K35783A39161J131305
19239A270466i03161c31762h3003l95396q3337o5540A61522a38070m99805d0059
19228A293618c81895F97368K7995d39686D60035A45867C550a261814G71504A54448
19217b45012E29187c25980c8196B36477d01288A71678a275677j37726d45866b06627
19206C52572c6592G0785f11628D72413m0223a097524C10875a07764E95106h55978
19195E96688A83605I995M14164p9042j58431d94730a20819k79677A42350J157694
$$ y = [1282058, 58668, -1409654, 683090, -277582, -32695, 888339, 379028, 126371, -916941, -60818, 50552, -147125, 1402812, 496380, -833960, -263083, 126434, -280297, -268975, -80718, -1365301, -541578, 827226, -133275, 40103, -493756, -889228, -564953, -329170, 139161, 1270466, -903161, -331762, -83003, -478399, -561736, -627276, 161522, -138070, -637875, -40059, 1293618, -381895, 697368, 725363, -439686, 460035, 145867, 3550, -1261814, 771504, 154448, -245012, 529187, -325980, -38196, 236477, -401288, 171678, -1275677, -1413403, -445866, -206627, 352572, -36592, 70785, -611628, 472413, 432190, -1097524, 310875, -107764, 595106, -855978, 596688, 183605, 9995, 424159, 345117, 186686, -494730, -120819, -400496, 142350, 1300044]
19185A300044e47841r042H99010A49471b4509B141401a215368C45238a38746A60117
19174D32066i66534L41214b57302i6642E466K4381d28953o96468B84762J17158
19164D01920A67607J102038r4044c33523F20504a141368A55092Q9782O25057a82471
19153H2329e23011G83460A01676N56867a100952N39835k85013b78567B66008e68064
19142H5141f0255A079095c07757l12753k85610F83390c38264A43593J49868J95949
19132D89410A69470M8180J49297a181587A71152M25823a270157G56461l03936
19123D52525i48180L40762b27344A867863n32357C63667h68514c75001B17279
19113f4100E72261d94684E20856j00896J69453f24572N0708G96728k42094d80709
$$ y = [1300044, -547841, -556883, 899010, 149471, -24509, 2141401, -1215368, 345238, -138746, 160117, 432066, -966534, -625320, -257302, -96642, 5466, 29847, -428953, -1125421, 284762, 401920, 167607, 1269645, 1175601, -333523, 620504, -1141368, 155092, 244874, 869931, -182471, 82329, -523011, 783460, 101676, 658543, -1100952, -561117, -846130, -278567, 266008, -568064, 85141, -60255, 1079095, -307757, -620510, -906120, 683390, -338264, 143593, 293461, 489410, 169470, 217650, 366947, -1181587, 171152, 596975, -1270157, 756461, 452525, -948180, -607418, -227344, 1867863, 1335506, 363667, -868514, -375001, 217279, -64100, 572261, -494684, 520856, 419960, 589413, -624572, -573864, 796728, 554634, -480709]
19102b88631F7490a27652B38560O41126L7586k19615l44922l3519J68432e67140
19091f96049K90122H40474M05468B6260a8280j48155E29256A65545H500e1828
19080F52036k30540l5986h28347j20623A02056g92098j01816C4556c30571E53779
19069c92448K5570b1069m33177A486118c59872a7732B63152h20473D60722e72501
19058I94833O42512C60119d04494A44248M81802e91868C75886L2263h74287K35348
19048f38939D16171J379788G08481K54530k98361j7474g59237I6718R23491B65699
19037i95896A01166a308175L40656A51481L45249J15677b71472B47052m0511M28922
19027F35463b58498l60698J54288b20878j182755C42252o0955K87147a517066
$$ y = [-288631, 67490, -127652, 238560, 879686, 917272, 697657, 352735, 319216, 487648, -567140, -696049, -405927, 840474, 1245942, 26260, -18280, -166435, 529256, 165545, 8500, -51828, 652036, 421496, 385510, -828347, -948970, 102056, -792098, -893914, 34556, -330571, 553779, -392448, -366878, -21069, -454246, 1486118, -359872, -17732, 263152, -820473, 460722, -572501, 994833, 1637345, 360119, -404494, 144248, 626050, -591868, 375886, 408149, -874287, -638939, 416171, 1795959, 708481, 963011, 664650, 647176, -759237, 96718, 1020209, 265699, -995896, 101166, -1308175, -967519, 151481, 496730, 612407, -271472, 247052, 206541, 635463, -258498, -619196, -464908, -220878, -1403633, 342252, 281297, 568444, -1517066]
19017I3269J074681A90580F025a4027B88312K05496a78769r71170E64573f17723
19006b92451G75712C64858f26726A04307J5604O99186K33104a122092B19456R60187
18996A179643f4959m29573B96233R20445D79578d8934j07819k5215J965j234667
18986a414670K8433G76866C53987c13312C21268e39573C4741R66426D6879e16560
18975B7468K69942R48855m32298g01423a31348m5519l06348C27100P08711f4699
18964A03208M05228M04312a70868k98637o1225F24583G1584L036c22432j35942
18954d58374q21912b09459o8453j7203r10791B246614b26288k21823G8379a509227
18943a462347a60143A791806b61552j88038F7293a458264A09073a310384K92281
$$ y = [93269, 1167950, 190580, 6025, -14027, 288312, 493808, -178769, -1149939, 564573, -617723, -292451, 775712, 364858, -626726, 104307, 119911, 819097, 1052201, -1122092, 219456, 1179643, -64959, -494532, 296233, 1216678, 479578, -48934, -156753, -181968, -180003, -1414670, -1386237, 776866, 353987, -313312, 321268, -539573, 34741, 1001167, 46879, -516560, 27468, 297410, 1246265, 813967, -701423, -131348, -176867, -483215, 327100, 1035811, -64699, 103208, 508436, 912748, -170868, -469505, -530730, 624583, 71584, 74620, -322432, -458374, -1280286, -209459, -277912, -295115, -1205906, 2246614, -226288, -448111, 78379, -1509227, -1462347, -160143, 1791806, -261552, -449590, 67293, -1458264, 109073, -1310384, -1018103]
18934a018103I54402D12304c15316E39244J35885l24649L27136m0753R05154b89015
18923A014278B25490M46974a167187m3708G11144j67280P3814L44974A63652e20694
18912E33976H1731i18219k95390H26303b44894F18402a165494F46958h35643B72890
18901H02443B26582c98076E36965B9809a618255A814635D87453i51845q4914h5539
18890h92372I92097m20783f57101C60447D0877O01731g59392A79292O14124c88593
18879a14698A9851N61545A23084N92089I3326M41271E6866J086276l99670M79653
18869A223125C48299c20242C82801R8554e67729l88595b12365a6340j55577j69021
18859c40938j63363B61995c94660a56475O9522o25048K96955j25742A101191f44382
$$ y = [-1018103, 954402, 412304, -315316, 539244, 675129, 350480, 677616, 636863, 1542017, -289015, 1014278, 225490, 672464, -1167187, -1210895, 711144, 543864, 617678, 962652, 163652, -520694, 533976, 81731, -918219, -1213609, 826303, -244894, 618402, -1165494, 646958, -835643, 272890, 802443, 226582, -398076, 536965, 29809, -1618255, 1814635, 487453, -951845, -1036759, -85539, -892372, 992097, 571314, -657101, 360447, 40877, 642608, -759392, 179292, 793416, -388593, -114698, 19851, 581396, 123084, 715173, 93326, 534597, 56866, 1143142, 743472, 1223125, 348299, -320242, 382801, 481355, -567729, -956324, -212365, -16340, -171917, -340938, -504301, 261995, -394660, -156475, -86953, -712001, -415046, -540788, 1101191, -644382]
18848c32597a17085N3848B77049J53532j22423L7761d57016j8650Q2643C38438
18837d51753J1811B07495N9788d45816A138451a034085c68025A73502i43765c45388
18826d38180G26908d00475A689456a81186o60240K92510j119878c71376B18829
18816c00225C44703K07865J38169J36031R1171D49208K18876g81156j64260M34680
18806e10736J60547H29045b75353n78420j8110A529904e9375C38827b59262b4607
18795e02823F01588A34798K40335f36782I63062h77148D75408a174769H00578
18785a135608H6144J61384g4293n91020A44893P26321B98530Q74762B15290c91310
18774d39975I3519d58654k92560A78117a81435p52623D28494e5125I63965m22908
$$ y = [-332597, -117085, -63237, 277049, 430581, 308158, 345919, -457016, -475666, -393023, 338438, -451753, -439942, 207495, 267283, -445816, 1138451, -1034085, -368025, 173502, -943765, -345388, -438180, 726908, -400475, 1689456, -181186, -841426, -548916, -1668794, -371376, 218829, -300225, 344703, 552568, 690737, 826768, 917939, 449208, 668084, -781156, -945416, -510736, -350189, 829045, -275353, -853773, -871883, 1529904, -59375, 338827, -259262, -24607, -502823, 601588, 134798, 375133, -636782, 963062, -877148, 475408, -1174769, 800578, -1135608, 86144, 247528, -74293, -665313, 144893, 871214, 298530, 1173292, 215290, -391310, -439975, 93519, -458654, -751214, 178117, -181435, -934058, 428494, -55125, 963965, 541057]
18764E41057a97694G98669e4196k45801P5887j47627o67974K67884A37094b67905
18753b94199j20188E45316M9330k45621A2530b85081a32296E10199M55581O49891
18743A615671C21297A25828J87904Q67416b27818o94342C3848J77849J465245
18734A676942E18966E0853b51292F1064h49620l2502r8735K94421F9403f17857
18723a13327k60325F44467k23027L49955C5463N78887a1177n63952D83819a38792
18712f03908A09331K67273J126775n84665i42157I36868B66243h93800b69596
18702h8088j192939O30789j98232L05452D35170a040339A53035L67315j56211
18693C64139a32405m5858j61764F60616a63263r11871I95823B56082K65344a57157
$$ y = [541057, -197694, 798669, -54196, -299997, -224110, -371737, -1039711, -771827, 137094, -267905, -294199, -414387, 545316, 594646, 349025, 12530, -285081, -132296, 510199, 965780, 1615671, 321297, 125828, 313732, 1181148, -227818, -922160, 33848, 211697, 1676942, 518966, 50853, -251292, 61064, -849620, -882122, -980857, -686436, 69403, -617857, -113327, -373652, 644467, 421440, 771395, 35463, 614350, -11177, -575129, 483819, -138792, -603908, 109331, 376604, 1503379, 918714, -942157, 936868, 266243, -893800, -269596, -88088, -1281027, -650238, -848470, -543018, 435170, -1040339, 153035, 520350, 364139, -132405, -178263, -340027, 660616, -163263, -1075134, 995823, 256082, 521426, -157157]
18682I32067A31985b65433H23100B67887K11122A4760M16006A81460a628513h3753
18671I35328m27037c2278A98487N1421Q11317c11417A3022K86798b540028e29058
18660F29141a10145o8116E28417d54481f8913j194608J23701e14475j120491N79295
18650a055671B54187N79932d09319o80858a00048k99255F47242A13208a43212
18640D09195J68458R4170i17955A00061K97278p4859p6340r1989J7608f19836
18629a04342L9032n17920E21520i59809K96543A047243g0660A047397F6922a7318
18618G36435j66710K47411a870623c50384F77735g590D68618r0451b93030A55516
18607f14387k10915R1851K36740a01740q34628M22335D5577N76186e91348H25789
$$ y = [932067, 131985, -265433, 823100, 267887, 479009, 14760, 430766, 181460, -1628513, -83753, 935328, 508291, -32278, 198487, 249908, 1061225, -311417, 13022, 299820, -2540028, -529058, 629141, -110145, -178261, 528417, -454481, -68913, -1263521, -1139820, -514475, -1634966, -1055671, 254187, 834119, -409319, -1090177, -100048, -399303, 647242, 113208, -143212, 409195, 577653, 671823, -917955, 100061, 397339, 322480, 246140, 154151, 171759, -619836, -104342, -65310, -583230, 521520, -959809, -663266, 1047243, -70660, 1047397, 66922, -17318, 736435, 569725, 817136, -1870623, -350384, 677735, -7590, 468618, 378167, -293030, 155516, -614387, -825302, -733451, -496711, -101740, -936368, -514033, 45577, 621763, -591348, 825789]
18596d56138A473457f41307H00366A92415a173077c28886G31949f51524A083571
18586A86123M64367a44910j053396e15662F8998f0694j046476b80745G08802a001189
18575A066778B43532N0396J00395H1038e25747E15789n3403c81583A66169b41668
18564e19649A331233a13187l46037H57230b76399H33562K48851C96592M1599N38249
18554I76440m48433a06540k96148E27745J61291k50797a080590D67809f03721
18544a38808C42563H5271d38471D87644h26284b9410l02338n01408b6877l37997
18534c64874A26860e6234j37942e446C9225a055181b39867l40055B88479O78326
18524I66805e66697e8875C9695O67327a122152C36432N96897d34660Q0266A983109
$$ y = [-456138, 1473457, -641307, 800366, 192415, -1173077, -328886, 731949, -651524, 1083571, 186123, 650490, -144910, -1198306, -515662, 68998, -60694, -1107170, -280745, 708802, -1001189, 1066778, 243532, 293928, 394323, 81038, -525747, 515789, 462386, -381583, 166169, -241668, -519649, 1331233, -113187, -459224, 857230, -276399, 833562, 1082413, 396592, 438191, 976440, 528007, -106540, -402688, 527745, 689036, 438239, -1080590, 467809, -603721, -138808, 342563, 85271, -438471, 487644, -826284, -29410, -331748, -833156, -26877, -364874, 126860, -56234, -194176, -5446, 39225, -1055181, -239867, -579922, 288479, 966805, -566697, -58875, 39695, 707022, -1122152, 336432, 933329, -434660, -354394, 1983109]
18513G76198e55959A034174k39631L70011J56192C70130Q39751B42176i0910A390973
18502A067205e24051k59432E715a93028B05266a103436L25625M6745L04657A415244
18491f94346d7461C88164a09727B5906J11252J058051c40208o11920c44370D2141
18480d2663j117235e17994K44454k00559j121201D92574f94420c2344D75775i53643
18469a6363C01261d37764A50645a68346A194013g7939I4746O53478e22246b53931
18458e9558n41376C66869M60752A43557L42748d47030B78513d13767a81782F18850
18447C45142A45683L29766I3042i105j72357j71652N6992q44436D22633R6879
18437E19512J06090L35215J02960l80598B83839A12299a56799o32384J16590C84070
$$ y = [776198, -555959, 1034174, 794543, 1164554, 1320746, 370130, 1209881, 242176, -90910, 1390973, 1067205, -524051, -783483, 5715, -193028, 205266, -1103436, -777811, -731066, -426409, 1415244, -694346, -47461, 388164, -109727, 25906, 137158, 1195209, -340208, -952128, -344370, 42141, -42663, -1159898, -517994, -273540, -474099, -1595300, 492574, -694420, -32344, 475775, -953643, -16363, 301261, -437764, 150645, -168346, 1194013, -77939, 94746, 748224, -522246, -253931, -59558, -600934, 366869, 827621, 143557, 486305, -447030, 278513, -413767, -181782, 618850, 345142, 145683, 475449, 93042, -9105, -181462, -353114, -296122, -1140558, 422633, 519512, 625602, 960817, 1063777, 683179, 283839, 112299, -156799, -789183, -672593, 384070]
18426F7040O15026A96533f6335A245421c082j65198j7110G18729a126132D5469
18415d57750F82482J16944L32918C05212P35451B58137n3455A02339a49953j151040
18405a300993A2791P8509a008880M56995k03561a25084o6371h9260m67850k79808
18395h36918c67327A04017a76662p95282i2207n88426C11322d06646c6184p35563
18385g71747D44287f2511E86433P96837b96395A249814g23511K65226F16655B44304
18374a72451k47436E89989k57379a28009r62374M49597G38296j5173F5252g21817
18363g4340G6287J36069L59519g98202L50085B15332J409725i96610J47829E70815
18352D74776a13687A26269k7440K9219e1718D40584P35054f71261F41249L47435
$$ y = [67040, 682066, 196533, -66335, 1245421, -3082, -168280, -185390, 718729, -1126132, 45469, -457750, 682482, 799426, 1132344, 305212, 1040663, 258137, 204682, 102339, -149953, -1300993, 12791, 91300, -1008880, -551885, -755446, -125084, -191455, -89260, -557110, -836918, -367327, 104017, -176662, -971944, -92207, -680633, 311322, -406646, -36184, -771747, 444287, -62511, 586433, 1383270, -296395, 1249814, -723511, -458285, 616655, 244304, -172451, -419887, 589989, 332610, -128009, -1090383, -640786, 738296, 723123, 65252, -721817, -74340, 76287, 212356, 571875, -798202, -448117, 215332, 1625057, -996610, -848781, 570815, 474776, -113687, 126269, 98829, 128048, -51718, 440584, 1175638, -671261, 641249, 988684]
18342I88684b9413j599298i5216F48157A78126R53103a202392C22184C9135M32357
18332D71492k18536g53988A298938C09714R81725n02752d24050A793088g07116
18322a257822a64637F72138b79903C77514K45165l11302j45401J150522k94708
18313A021790a205961A010195k7385d12266l56988b13743m01137K56727q3205
18304d41358b6078D05713G8079Q33705e25688l20651b3068r9829l00491C2223
18293b71479K1693F01410P71968b65255a22827B5639M44469A02210L07551c29928
18282I76637Q2608a183747B38762O68137d04917m57107J18449q0809j49322F62426
18271D72051d3357A054557G7886M85328B55048h51800A55428g90115H35551B62890
$$ y = [988684, -29413, -1628711, -95216, 648157, 178126, 1131229, -1202392, 322184, 39135, 471492, 252956, -753988, 1298938, 309714, 1291439, 788687, -424050, 1793088, -707116, -1257822, -164637, 672138, -279903, 377514, 622679, 311377, 165976, 1316498, 1021790, -1205961, 1010195, 982810, -412266, -769254, -213743, -614880, -358153, -441358, -26078, 405713, 78079, 911784, -525688, -846339, -23068, -122897, -423388, 32223, -271479, -249786, 601410, 1373378, -265255, -122827, 25639, 470108, 102210, 409761, -329928, 976637, 1059245, -1183747, 238762, 906899, -404917, -862024, -743575, -824384, -973706, 662426, 472051, -43357, 1054557, 77886, 563214, 255048, -851800, 155428, -790115, 835551, 262890]
18260A09018e17874b19177o3908j56623P1429a84120G31649P92862A74860a294021
18249b24901G48361J22055h77687h9811G15595Q5041A05300N57317A46553N25109
18239F71662k80735j65648c45929A27433Q86658e99026f9658A82753K37822e50203
18228c48321b6787G53878d70254E13495k35142O22663l41556g61997A559146f23071
18217A636986d59716l20265F75393A2852M51408H2168K54728f09948H4168h90801
18206A07821K89121J30995b15864C90231M59554B47743b59281D66906K39600h0875
18195a43276o20115A268169a92808H44936C08047O25605k03073j45552c08199
18185D38985e19074a52984k98265C17634j05554h83756B87201i6389n63467l24170
$$ y = [109018, -517874, -219177, -283085, -439708, -368279, -184120, 731649, 1524511, 174860, -1294021, -224901, 748361, 870416, -877687, -89811, 715595, 800636, 105300, 662617, 146553, 671662, 390927, 225279, -345929, 127433, 1014091, -599026, -69658, 182753, 420575, -550203, -348321, -26787, 753878, -470254, 513495, 278353, 901016, 559460, -761997, 1559146, -623071, 1636986, -459716, -779981, 675393, 12852, 464260, 82168, 336896, -609948, 84168, -890801, 107821, 396942, 527937, -215864, 390231, 849785, 247743, -259281, 466906, 706506, -80875, -143276, -763391, 1268169, -192808, 844936, 308047, 933652, 730579, 585027, -308199, 438985, -519074, -152984, -451249, 317634, 212080, -883756, 287201, -96389, -659856, -984026]
18175i84026o11156C51081a123268H03609q0064g4301I61696M99756a76507r44410
18165a120917D58713M86043l20250B24730Q69616l28416k50016p5911b61104A417598
18154i90732M74363B34033b85773I32547k9577E4668J177807C93172c98813I33688
18143A602043c91964J37211A276224d07546p4852A26083a605207B119353a29671
18133I34141D53836a68584m2780n31416L18975A13194a281265K10295b94251J9549
18123b74702D59218P40820k43977a14294A15580Q02057b78658A235225j64233
18114A070992A51232c31107j168202G81817G6371g34502B87231A33176J349116
18105A482292j43837a72643F02177c60537E4250L69456n7701A52644c20274E41872
$$ y = [-984026, -1595182, 351081, -1123268, 803609, 723545, -74301, 961696, 1461452, -176507, -1120917, 458713, 944756, 624506, 224730, 1094346, 765930, 515914, 440003, -261104, 1417598, -990732, -516369, 234033, -285773, 932547, 902970, 54668, 1232475, 393172, -398813, 933688, 1602043, -391964, -254753, 1276224, -407546, -482398, 126083, -1605207, 2119353, -129671, 934141, 453836, -168584, -211364, -742780, -423805, 113194, -1281265, -1070970, -294251, -274702, 459218, 1200038, 956061, -114294, 115580, 917637, -278658, 1235225, 1070992, 151232, -331107, -1499309, 781817, 76371, -734502, 287231, 133176, 1482292, 1338455, -172643, 602177, -360537, 54250, 423706, 366005, 152644, -320274, 541872]
18094I53019i38341F89027k41723j99904c74599l21916A040209L92652c52512
18084B91777Q28994B37232a11384l80000A251878F12468c34997a40778a2843k09206
18074b22049l57377c9456E44941a4646A431054C15500c8528n13395B60675a88152
18063d84735D86053K76704c32850A30615J41548J010660L46538n58622n22873
18054E47866b67290n40126Q5759c13448m64775K19098C53499e69336r20141f32148
18043h37309A10493J115820m38640Q11726a478776M404H42672k73437A51115e96338
18032b67274G2219J048167B29900a24712A015554c61207m43275b12107J5735c6365
18021a150189e9431o64100j7727F50020g4457o41539c896q01574J36848L08313
$$ y = [953019, -938341, 689027, 447304, 247400, -374599, -696515, 1040209, 1432861, -352512, 291777, 1120771, 237232, -111384, -491384, 1251878, 612468, -334997, -140778, -12843, -222049, -579426, -39456, 544941, -14646, 1431054, 315500, -38528, -551923, 260675, -188152, -484735, 486053, 762757, -332850, 130615, 272163, 1282823, 1629361, 1070739, 547866, -267290, -807416, -721657, -313448, -778223, -559125, 353499, -569336, -1489477, -632148, -837309, 110493, 1226313, 787673, 1599399, -1478776, -1474372, 842672, 569235, 151115, -596338, -267274, 72219, 1120386, 229900, -124712, 1015554, -361207, -804482, -212107, -196372, -36365, -1150189, -59431, -723531, -741258, 650020, -74457, -715996, -3896, -805470, -668622, -360309]
18011c60309C3838R52157f2295l88152F25013a35849C80142a132034B16207d26925
18000A054084j4031f58217j43891K10523D81552M01903l73494f94712G68725f83932
17989E33695a135537A049617m79168a79251F72643f49832F0064J358478a07837
17979f22704B2585O25527d74221j33617C69823a464963H22929b46661A79477h41355
17968D01267N51139a274976N67502c53611D38313b57336B31649J326723e66895
17958a43447K3823A199894A84836J07184J59100H9495N60231E4680N79430L11054
17948I45164e3656n49933k68422L98969F51178m7101J25897b08977B9934i81077
17937B69057N80215M17925e70145l61488q2006e05741a99784R1708A56632M07383
$$ y = [-360309, 33838, 985995, -62295, -450447, 625013, -135849, 380142, -1132034, 216207, -426925, 1054084, 1040053, -658217, -802108, -591585, 481552, 883455, 509961, -694712, 768725, -683932, 533695, -1135537, 1049617, 570449, -179251, 672643, -649832, 60064, 1418542, -107837, -622704, 22585, 648112, -474221, -607838, 369823, -1464963, 822929, -246661, 179477, -841355, 401267, 952406, -1274976, -707474, -353611, 438313, -257336, 231649, 1558372, -566895, -143447, -119624, 1199894, 184836, 292020, 451120, 89495, 649726, 54680, 634110, 945164, -53656, -603589, -872011, -473042, 651178, 604077, 729974, -208977, 29934, -981077, 269057, 849272, 1267197, -570145, -931633, -1013639, -505741, -199784, -108076, 156632, 564015]
17927E64015J55536C05506f83406D84589h92606E74949a167434D8914b14171D75785
17916a33186E72720h8780A326143F27177g19062K0341f416o74993k22170F84546
17905B11274J040852l21427l53400c52585A399247a23666B03421L83093a154052
17895b09269A244266i6303I19440f71574a48526q09416M29691F28624q9834L3793
17885E72583g1615q11493J23244K33723F20424b84231n412F13889B70235d81668
17874F61526h26326b07053C94111L17945A37935Q56903a41386A028229d34836
17864D04392c71293l29301b42405I42848D20662K85025k4762h40331B54203Q16634
17854A070837g62967a05303p59267j56376d47461J68392p23836K80368E99346
$$ y = [564015, 719551, 305506, -683406, 484589, -892606, 574949, -1167434, 48914, -214171, 475785, -133186, 572720, -88780, 1326143, 627177, -719062, -698721, -6416, -681409, -903579, 684546, 211274, 1252126, 930699, 577299, -352585, 1399247, -123666, 203421, 586514, -1154052, -209269, 1244266, -96303, 919440, -671574, -148526, -957942, -528251, 628624, 538790, 572583, -71615, -883108, -759864, -526141, 620424, -284231, -289643, 613889, 270235, -481668, 661526, -826326, -207053, 394111, 712056, 137935, 994838, -141386, 1028229, -434836, 404392, -371293, -700594, -242405, 942848, 420662, 705687, 680925, -840331, 254203, 1070837, -762967, -105303, -864570, -1020946, -447461, -279069, -1002905, -722537, 599346]
17844A15536f81726A41971d81020C52790b60947D16451j80773l2930g6712A225501
17833h15793J73803A31262M26602d80872m61372G98633A58145L19718a80972A73993
17822C75660A0059P63476c40159A004485M92814E22488G8291i52339C53935e5745
17811A81200O0766N29200j39926A70393a579005i2741a2774r58902l9361c31730
17800a23762C48416j26160i89957A242864c73646E37662A46854c15299O0880D85981
17789a15285l04862J08299g7333C72283J62063h0673L7493k30097E96923a016691
17778F21678c28151o19661b13958L8556A63335D8810d17848E49556l496o6813
17768D79247N12026a26233B77532l6823f68447A73456Q07868b25610I4a007423
$$ y = [115536, -681726, 141971, -481020, 352790, -260947, 416451, 235678, 202748, -76712, 1225501, -815793, -641990, 131262, 557864, -480872, -942244, 798633, 158145, 477863, -180972, 173993, 375660, 10059, 773535, -340159, 1004485, 1497299, 522488, 78291, -952339, 353935, -55745, 181200, 241966, 771166, 631240, 170393, -1579005, -92741, -12774, -971676, -1011037, -331730, -123762, 348416, 222256, -989957, 1242864, -373646, 537662, 146854, -315299, -254419, 485981, -115285, -420147, -311848, -77333, 372283, 534346, -80673, -43180, -273277, 596923, -1016691, 621678, -328151, -947812, -213958, -175402, 163335, 48810, -417848, 549556, 546060, 479247, 991273, -126233, 277532, 240709, -668447, 173456, 981324, -225610, 94, -1007423]
17757G35073b34745F4494P24938C48682J7237b42069j13624e7687I67c26603A78756
17745G72217C10715h82513A236831b93194A426136G2356N30986k02135h9047A99534
17734a35211H85881B31954e53353A194162L00283e7253A144403O4498g59177j13989
17724h73166D7437c93896C52274f58666A8434N83851h82434G93395a5246A85416
17713A148292n25971H451f64421D94370I6830i24548A019910F0034c47592n55009
17703i02601H89883a78965f3606A041650r1020l90374O48220J80b90710G7520
17692D63307B25188a227971d59956A301210p9241g75261C87908L64254a50564
17682A754542D98996f90366j99995a88788o94237j13224a40466G19d88281B90522
$$ y = [735073, -234745, 64494, 789432, 348682, 365919, -242069, -355693, -57687, 967, -326603, 178756, 772217, 310715, -882513, 1236831, -293194, 1426136, 72356, 603342, 401207, -89047, 199534, -135211, 885881, 231954, -553353, 1194162, 1494445, -57253, 1144403, 1208901, -759177, -873166, 47437, -393896, 352274, -658666, 18434, 602285, -882434, 793395, -15246, 185416, 1148292, 622321, 8451, -664421, 494370, 96830, -924548, 1019910, 60034, -347592, -902601, 889883, -178965, -63606, 1041650, 950630, 560256, 1208476, 1208656, -290710, 77520, 463307, 225188, -1227971, -459956, 1301210, 1221969, -775261, 387908, 752162, -150564, 1754542, 498996, -690366, -890361, -188788, -883025, -996249, -140466, 719, -488281, 290522]
17671B09141E5200c27613C51013R2198L30744k19282a123361c90127n75812D0818
17660I16390f1353k187H66498G2376j6732R34190A27545c00649I10200A85759
17649A257479a42988m97132F75006B76057d29148e0865H58090P69036E39200J75673
17639G14873J831852D52330g14041E73731d31415C56369J047212l57631B41181
17629b36551A052150A18678j4589J56716J048512f59326D84953j78230E5464L63883
17619D19347J47101B19043M57166a002969a85671A601505a83567f3502k57958
17610c21460B24419m9852c14975q5973F71726a603293C33994h12486b92103j42731
17600d34834a93847H03393N7715d96229e094o11000M153A9277f92026A246472
$$ y = [209141, 55200, -327613, 351013, 443211, 773955, 554673, -1123361, -390127, -965939, 40818, 916390, -61353, -63540, 866498, 72376, 55644, 989834, 127545, -300649, 910200, 185759, 1257479, -142988, -640120, 675006, 276057, -429148, -50865, 858090, 1627126, 539200, 714873, 2546725, 452330, -714041, 573731, -431415, 356369, 1403581, 1045950, 241181, -236551, 1052150, 118678, 104089, 260805, 1309317, -659326, 484953, 306723, 55464, 419347, 566448, 219043, 676209, -1002969, -185671, 1601505, -183567, -63502, -321460, 224419, 174567, -314975, -400948, 671726, -1603293, 333994, -812486, -292103, -434834, -193847, 803393, 861108, -496229, -5094, -616094, -611941, 19277, -692026, 1246472]
17589D23188d72982j5661a70562N931C90292j59380d51302J09969H56660C85315
17578C8765O08261b50535H32020a49714g4051j875k38277p84760E30300A68980
17567A14630A8714L03378O05971f12508K10226J05996m56308A340816m43398f82268
17556a01951m65627F8342P38813R785e57362A03472b91413A53795K05156J77193
17546E36144f91542D67291K84535b17832A81316M05068a64630k01686E16426e39651
17535A139549e73828A91451B9516K87968F098h06091A01579a06871F50937J036604
17525A687541o20522g77143K39671C97141e62074G45545i88915j66956b37542
17515i34326C52697j2159h56232j08308F384c24929A058041k87953f80772I32250
$$ y = [423188, -472982, -488643, -170562, -164631, 390292, 230912, -451302, -341333, 856660, 385315, 38765, 647026, -250535, 832020, -149714, -74051, -75926, -314203, -1098963, 530300, 168980, 114630, 18714, 322092, 928063, -612508, -402282, -296286, -752594, 1340816, 897418, -682268, -101951, -567578, 68342, 807155, 816940, -557362, 103472, -291413, 153795, 358951, 536144, -691542, 467291, 751826, -217832, 181316, 586384, -164630, -366316, 516426, -539651, 1139549, -573828, 191451, 29516, 317484, 6098, -806091, 101579, -106871, 650937, 1687541, 1067019, -777143, -537472, 397141, -562074, 745545, -988915, -1155871, -237542, -934326, 352697, 340538, -856232, -964540, 6384, -324929, 1058041, 770088, -680772, 932250]
17504D3374K34757K05410f14749G26445b42595D03505a11915B0911d24376d5544
17493a32542A8862a122712M93368B6489N88344e20168a33165A001216D9906P439
17483E7345a99508n6156C62673j49363a562302f5429E4107d37555E55911h15783
17472C38704L99563J046026a73058B71113g55858B1305R15747m51806Q83668d75169
17461B56594M09827B02687J04628e26407n30816d76391a71236F0145L47210f7776
17450g56130o98880C13512A41452E9755g49303G25193d40253m78178a30636H68629
17439b3302B13746N69905B84719a8996A35391P68372K32413B54466q0476K76742
17429D50732A8422f47864C73223b36663j154247B58753J497378F33308d62494
$$ y = [43374, 278131, 483541, -614749, 726445, -242595, 403505, -111915, 20911, -424376, -45544, -132542, 18862, -1122712, -629344, 26489, 614833, -520168, -133165, 1001216, 49906, 57345, -199508, -255664, 362673, 213310, -1562302, -65429, 54107, -437555, 555911, -815783, 338704, 738267, 1784293, -173058, 271113, -755858, 21305, 937052, 485246, 1368914, -475169, 256594, 666421, 202687, 307315, -526407, -1057223, -476391, -171236, 60145, 407355, -67776, -756130, -1455010, 313512, 141452, 59755, -749303, 725193, -440253, -918431, -130636, 868629, -23302, 213746, 783651, 284719, -18996, 135391, 903763, 1136176, 254466, 173990, 450732, 18422, -647864, 373223, -236663, -1390910, 258753, 1756131, 633308, -462494]
17419A198707B35574J88350f714B15104a658176C63087J07019M40497B57319L88048
17409F45367i55754k86574C85816R20107B54413b24262f3195o0564C85062P4964
17399D60026p8482K32824j15358Q71422D65158J082197d91321A02588P62717g8067
17388C42040J96042e91200B62243O24163a36517I59514p8889P16717M0185A78312
17377E81953K03393B88329O5445M09738C41322H9648i71363D31297M5153a59366
17366B89548c00567P6244I13939c04091Q0787E87864a167554N48799F8980L59244
17356D28224g28813a47139A17629L01431N69621A40902C7493K11915J025329l39107
17346I35630C38195c46269j007695L71597a38785e6367q4469m94364H76810A66935
$$ y = [1198707, 235574, 423924, -6714, 215104, -1658176, 363087, 470106, 910603, 257319, 645367, -955754, -1242328, 385816, 1305923, 254413, -224262, -63195, -123759, 385062, 460026, 381544, 614368, 499010, 1370432, 465158, 1547355, -491321, 102588, 865305, -78067, 342040, 538082, -591200, 262243, 886406, -136517, 959514, 880625, 1597342, 1637527, 178312, 581953, 785346, 288329, 353774, 763512, 341322, 89648, -971363, 431297, 476450, -159366, 289548, -300567, -224323, 913939, -304091, -223304, 587864, -1167554, -618755, 68980, 428224, -728813, -147139, 117629, 419060, 988681, 140902, 37493, 249408, 1274737, 935630, 338195, -346269, -1353964, -982367, -138785, -56367, -140836, -635200, 876810, 166935]
17335D08310b92352k76169A338068A75492i62749G91714j50190g01798F09305
17325A85320M03012M97259m64095A72139L92516R5959d86787l03536b4847A338860
17314C09699g27929E32119A68679q3906P26987E3928e01081j2018K48441C65882
17303H71757a078971H13627L88394D2546N37934d0489H11259l94985f6528B63101
17292F57857o651B10234J551667o98137K64893c137j49275j144610F32224b53375
17281h70614A63080f55218C25265j58341c1555A358371D9967a26154k79104D53798
17270a21351l29306c3317l11184F38529J00750h8466D18697O44842c19385B99243
17259b80496E23393M99821B96577J004926D8240M46044M71707b00821m76927a84449
$$ y = [408310, -292352, -568521, 1338068, 175492, -962749, 791714, 641524, -701798, 609305, 185320, 588332, 1085591, 621496, 172139, 564655, 660614, -486787, -790323, -24847, 1338860, 309699, -727929, 532119, 168679, 84773, 811760, 53928, -501081, -513099, -264658, 365882, 871757, -1078971, 813627, 1202021, 42546, 580480, -40489, 811259, 416274, -66528, 263101, 657857, 651206, 210234, 1761901, 1063764, 1328657, -3137, -152412, -1297022, 632224, -253375, -870614, 163080, -655218, 325265, 166924, -31555, 1358371, 49967, -126154, -405258, 453798, -121351, -450657, -33317, -344501, 638529, 739279, -88466, 418697, 1063539, -319385, 299243, -280496, 523393, 1023214, 296577, 1301503, 48240, 494284, 965991, -200821, -677748, -184449]
17248i05044a23736E00397M04908i81178a53455H89375a137817L38483A168271
17238i01849A121848d08628j210316C72199A56724f17445F54533l14250h6352
17228b76198l2896k6314H67663M68093m09576e81593H9166M54805P06197K24018
17218A474186h3762G86752A4631J057069l18520J02828d88245H30762a656455
17208C64044c4722F19941P95247k65318b65713R7477A294104F6455P8177A97O10109
17197F10306K93000C93251D8070e45542a64713C11171J91q6558O42293b84088
17186a63806G03105n7625B09227o4629a50157k58817F09839j11418j95546a62453
17175D06629J87028a53513j71344J60597j70548A252631E51111O08785c83316
$$ y = [-905044, -123736, 500397, 905305, -981178, -153455, 889375, -1137817, -799334, 1168271, -901849, 1121848, -408628, -1618944, 372199, 156724, -617445, 654533, 340283, -86352, -276198, -309094, -335408, 867663, 1335756, 926180, -581593, 89166, 543971, 1250168, 1474186, -83762, 786752, 14631, 1071700, 753180, 856008, -488245, 830762, -1656455, 364044, -34722, 619941, 1415188, 1149870, -265713, -168236, 1294104, 66455, 144632, 197, 610306, 903306, 393251, 48070, -545542, -164713, 311171, 311362, 224804, 867097, -284088, -163806, 703105, 645480, 209227, 144598, -150157, -408974, 609839, 498421, 302875, -162453, 406629, 593657, -153513, -324857, -164260, -334808, 1252631, 551111, 1159896, -383316]
17165b75200A052293B24500M42702a138779c7121p70911l43595d46978C2700a4251
17154A574988n93793a38111j71588e8718A05318J297228i19123H8640g50559n92155
17144a342714b81074l47668A911786I03403d62936j358866G89916l69952Q32863
17135A252827A17533P81593k2866C21203g40752A084120D120a4578C98354A21121
17124A251477h2862E97847M42442a13029j742A128087f93515H91875a58465E8304
17113E63011c80620D31176j65036a11062k38922F40044l01666K25681M23702n1098
17103I36663Q1247e3393E7622R58423e12726H83306L75254D55088J85853B61942
17092e6682A23515K31763Q43727P22871a915288I45946g37793A204871E24960
$$ y = [-275200, 1052293, 224500, 667202, -1138779, -37121, -808032, -1151627, -446978, 32700, -14251, 1574988, 981195, -138111, -309699, -58718, 105318, 1402546, -919123, 88640, -750559, -1342714, -281074, -628742, 1911786, 903403, -462936, -1821802, 789916, 419964, 1252827, 117533, 899126, 876260, 321203, -740752, 1084120, 4120, -14578, 398354, 121121, 1251477, -82862, 597847, 1040289, -113029, -114771, 1128087, -693515, 891875, -158465, 58304, 563011, -380620, 431176, 266140, -111062, -349984, 640044, 338378, 564059, 987761, 936663, 1017910, -53393, 57622, 1016045, -512726, 883306, 1258560, 455088, 640941, 261942, -56682, 123515, 355278, 1199005, 1921876, -1915288, 945946, -737793, 1204871, 524960]
17082b66016k97913K43032l37163C43395g33569G02357J99827L96229d18245k89621
17072g07866E2161Q06831C60416M20337j1311L82087i60008A364371l98843a224660
17061F63734c09612k94756F46347f71598g6763r7098E56325e925D77378i71625
17050b9215D02082a048635G36424O03203m57850O54046i72562C60654H2853a202606
17039g648j94825b1166A106920k57445h4922n55394N8468A78781K67562a463269
17028a92397l95846J99809m77071A201513D44216j41370R23525m25545d77187
17018A112993e53598A00225M52228n3326a02004a9194E57582P42228n48608e44270
17007F64896O35250C96052J46531N6850J52417C60531q3276J64628c96209C53966
$$ y = [-266016, -563929, -320897, -658060, 343395, -733569, 702357, 902184, 1298413, -418245, -707866, 52161, 858992, 360416, 780753, 769442, 1151529, -960008, 1364371, 965528, -1224660, 663734, -309612, -604368, 646347, -671598, -76763, -173861, 556325, -5925, 477378, -971625, -29215, 402082, -1048635, 736424, 1339627, 881777, 1535823, -972562, 360654, 82853, -1202606, -7648, -202473, -21166, 1106920, 849475, -84922, -640316, -581848, 178781, 446343, -1463269, -192397, -588243, -388434, -865505, 1201513, 444216, 302846, 1226371, 800826, -477187, 1112993, -553598, 100225, 552453, 499127, -102004, -19194, 557582, 1299810, 751202, -544270, 664896, 1300146, 396052, 542583, 599433, 751850, 360531, 277255, 441883, -396209, 353966]
16996i57072A968727g4442E10206A72613J878875a259787A565274c73745A190670
16986C40572J66150O99400n83027B3714N93970J00535d73596G31638j95589Q40560
16976A376609B49108L03098b80934A158225n0882K16611G0469K3469K00027O88978
16966I82943A22404c45957D18147a17126N4876G26181d13326D09613e07202E26932
16955D93794O96467c6708I11367a38497n43671I77720f1020A111439D42367J72096
16945F14463d77283D93941d51837F59574B19718L58224J82732g27928A340991
16935F4073L09822J073177m9474b65651F03097J98625J93221B80086J432516F58533
16924I62134m9781D09441N03908C33153N06631C86684i64626A102059m55721C08830
$$ y = [-957072, 1968727, -74442, 510206, 172613, 2051488, -1259787, 1565274, -373745, 1190670, 340572, 506722, 1206122, 623095, 23714, 617684, 718219, -473596, 731638, 536049, 1376609, 249108, 552206, -280934, 1158225, 1107343, 1323954, 70469, 93938, 293965, 982943, 122404, -345957, 418147, -117126, -62250, 726181, -413326, 409613, -507202, 526932, 493794, 1190261, -36708, 911367, -138497, -682168, 977720, -61020, 1111439, 442367, 614463, -477283, 493941, -451837, 659574, 219718, 577942, 760674, -727928, 1340991, 64073, 373895, 1447072, 1397598, -265651, 603097, 801722, 994943, 280086, 1712602, 658533, 962134, 912353, 409441, 913349, 333153, 839784, 386684, -964626, 1102059, 646338, 308830]
16913A627301A32203M38723j50383K2170a129410C5394a16347G67612G2881K67444
16903C40325A001O22850B44126J384637p87105m7081b20740E47141a61016G8891
16892g39830E87298N07666D22750N51066B45170P13642k95854Q5891b31210C08291
16881E12314b18339F50990k99527A10726J80687J348933D61389M33420B63703
16871H39126E5540b948D09274N47287k20688C04166J68480Q51413C65296h4936
16860B4912J37775P84617l56420k09870O94513L24131n35426j90057B83031m5488
16850B37543Q34319B55585P87884k99741J724412b98625G73162J67150k13512
16841G26800b36A017589l13268J51199M11443m58858b72079F70226K17526l40890
$$ y = [1627301, 132203, 570926, 420543, 442713, -1129410, 35394, -116347, 767612, 72881, 340325, 1001, 623851, 244126, 1628763, 841658, 794577, -220740, 547141, -161016, 78891, -739830, 587298, 1094964, 422750, 973816, 245170, 958812, 662958, 748849, -231210, 308291, 512314, -218339, 650990, 351463, 110726, 291413, 1640346, 461389, 894809, 263703, 839126, 55540, -2948, 409274, 956561, 735873, 304166, 472646, 1324059, 365296, -84936, 24912, 162687, 947304, 590884, 381014, 1075527, 1399658, 864232, 674175, 283031, 237543, 1071862, 255585, 1043469, 743728, 2468140, -298625, 773162, 940312, 726800, -236, 1017589, 704321, 855520, 1266963, 808105, -272079, 670226, 887752, 546862]
16831E46862B59179N38965B73062g02860L16928A91167P60822j19660j60999C16328
16820G95565C16991j29094J516748b78473B97556A37948J145036D97824j61844
16811C35980N90402e5476A380973m79952b28268B69396R7378q0267O69873b18191
16800A955925C10595L88173A04381B8745e1377E86044h3549A842515j57198G29976
16789G65996P22300D53140Q36316H8146R52246k73190J45538l09877P37635E56231
16778F93307d6864A018981j96483h1035A003909n7967r2931L86688K58080B44560
16767H77766P87128l76537a84008A398532d3155A036942e80804A560708J69865
16758A730573j75973C04750R97873B97531a09819A498963k50233D79118L03553
$$ y = [546862, 259179, 798144, 273062, -702860, -385932, 191167, 951989, 832329, 671330, 316328, 795565, 316991, 187897, 1704645, -278473, 297556, 137948, 1282984, 497824, 335980, 926382, -55476, 1380973, 901021, -228268, 269396, 366774, 286507, 956380, -218191, 1955925, 310595, 698768, 104381, 28745, -51377, 586044, -83549, 1842515, 1685317, 729976, 765996, 1488296, 453140, 1289456, 88146, 1040392, 767202, 912740, 602863, 1340498, 556231, 693307, -46864, 1018981, 822498, -81035, 1003909, 945942, 853011, 1239699, 1497779, 244560, 877766, 1664894, 1288357, -184008, 1398532, -43155, 1036942, -580804, 1560708, 1730573, 1554600, 304750, 1302623, 297531, -109819, 1498963, 1248730, 479118, 782671]
16749G82671k60034f0190G31407b27770D6876L18969L19363A56316a83833B25338
16738D64596J054521j41832J88747p79317P11401G03886O57184l01639J500483
16729B559914G3941d1370A266449l47431J138582H81020l38490N82571L16070
16720A441171o85602J116056E44914J381319q53086L86594n19029l7776M19444
16711A322380D77020L91251L17863K92836a46261A522561l67120q0505l07801
16702G67135J767946E41850J694281G53326K76587B10238Q89563R62056C47573
16692B163805I80709j30809M82177L29013O6527J04620l70663P54578n00886P1514
16682A786780q34460J86585P97487j48183J74730M10475o90346Q21770P33054
$$ y = [782671, 522637, -60190, 731407, -227770, 46876, 365845, 685208, 156316, -183833, 225338, 464596, 1519117, 1377285, 1566032, 786715, 1498116, 703886, 1361070, 1059431, 2559914, 73941, -41370, 1266449, 919018, 2057600, 881020, 542530, 1125101, 1441171, 755569, 1871625, 544914, 1926233, 1073147, 1459741, 940712, 902936, 1322380, 477020, 868271, 1186134, 1478970, -146261, 1522561, 1155441, 1074936, 767135, 2535081, 541850, 2236131, 753326, 1029913, 210238, 1099801, 2061857, 347573, 2163805, 980709, 849900, 1332077, 1661090, 1727617, 1832237, 1461574, 2216152, 1715266, 1786780, 952320, 1138905, 1936392, 1788209, 1962939, 2373414, 1683068, 2504838, 3237892]
16673C237892j129075P08502r8153J89953O11360o47358p66472J818157o20389
16664C304417j196553P65868J390825j322788J747823J28357m81793q05881J289041
16655D819316m89780J319488L61648J58714P88994K75772J281165j62696K296211
16646A0648832L377148J686366O446165N226587Q996412J1514225J4354514J8115408
16638H0365657K3604250K6272504K9258838K6888187K1734414P759548r066744
16631B06816654k2102949k5946437k8034067k9298745k0337915j6727934j3650064
16624E0718543j1055423r100747n452499o553447l500418k709733l123770k183429
16616G039077n36835k633970q52500m19502m52433r74667K70652e01364j74350
$$ y = [3237892, 2108817, 2817319, 2719166, 2909119, 3520479, 2873121, 2106649, 3924806, 3304417, 2107864, 2873732, 4264557, 2941769, 4689592, 4817949, 4336156, 3530275, 4819316, 4329536, 5649024, 6010672, 6169386, 6958380, 7234152, 8515317, 8352621, 10648832, 14025980, 15712346, 22158511, 27385098, 36381510, 47895735, 62250249, 80365657, 103969907, 130242411, 159501249, 186389436, 208123850, 215883398, 206816654, 184713705, 158767268, 130733201, 101434456, 81096541, 64368607, 50718543, 39663120, 30562373, 25109874, 18556427, 15056009, 12346276, 9222506, 7039077, 6502242, 3868272, 3015772, 2596270, 2143837, 1169170, 1439822, -501364, -675714]
16607f75714a84126r76691d05281q52770p8511N39056j166108j30985e53776l59073
16597i12849j026580N29741O74135c64762J7164j18527j617182P22114j048778
16588b409971N45850h02861b86149j387896m79130P34237l48798M68637q01870
16579b100969q12761h10051j679800J062513D84192a541301a19984o79654c20182
16569f62229l58764a38835m46167p17010j10171M08651J21055c3734j50841r78179
16559a162754c09117j41693r30510B52118d69936H486d43801d8515p57147H7466
16548a229296c73272j21098o81635n82433j69739Q7977h25856n43131d36392B21666
16537a637849C67910a036481p87808g13298a41087B97644e44728q89469n96458
$$ y = [-675714, -184126, -1160817, -405281, -1258051, -1336562, -797506, -1963614, -2094599, -553776, -912849, -1939429, -1409688, -735553, -364762, -347598, -466125, -2083307, -1361193, -2409971, -1864121, -802861, -286149, -1674045, -2153175, -1418938, -1767736, -1299099, -2100969, -2913730, -810051, -2489851, -1427338, 484192, -1541301, -119984, -799638, -320182, -662229, -1020993, -138835, -585002, -1302012, -1412183, -1003532, -882477, -33734, -184575, -1162754, -309117, -450810, -1381320, 252118, -469936, 8486, -443801, -48515, -805662, 87466, -1229296, -373272, -494370, -1176005, -1758438, -1928177, -1840200, -825856, -1368987, -436392, 221666, -1637849, 367910, -1036481, -1824289, -713298, -141087, 297644, -544728, -1434197, -2030655]
16528b030655f63671K8568q1872B95018a048573M52519j83618B00512f38487k305442
16518b943929a453703b3174k22570j239663b34965D7147f23526c7683k98677l88431
16508g24791K41303n02877C86641f42056n05166d88180j62000G36563h09962c4277
16497A9501c15377a15671j366790I01540C08026a698066e49485A81597h16548
16487a123660N24209Q3475a78236m42639R1078R5858o67911b40175I61340B45266
16476f40465l85977E3404g31319B57836a363591b0792A415554B23602e59580q09451
16466a369031N83034K94247j45064l71688M39641F43644d43894a67127r03517
16457a070644L56170A014514G4409a308218A86695E7236h95869j3360K79644D37981
$$ y = [-2030655, -663671, -635103, -716975, 295018, -1048573, -596054, -779672, 200512, -638487, -2943929, -1453703, -23174, -245744, -1485407, -234965, 47147, -623526, -37683, -336360, -724791, -483488, -986365, 386641, -642056, -1147222, -488180, -650180, 736563, -809962, -34277, 19501, -315377, -115671, -1482461, 901540, 308026, -1698066, -549485, 181597, -816548, -1123660, -599451, -515976, -178236, -620875, -529797, -433939, -1101850, -240175, 961340, 245266, -640465, -1026442, 53404, -731319, 257836, -1363591, -20792, 1415554, 223602, -559580, -1369031, -785997, -491750, -636814, -1008502, -568861, 643644, -443894, -167127, -1070644, -714474, 1014514, 74409, -1308218, 186695, 57236, -895869, -909229, -629585, 437981]
16446b06219I76841b099977a2791q61365e4774m02024H48961C45400R25116m83094
16436G87422A31062d28554H51489a08644D16843D3745K42602f43162a90375j13304
16426c03679k19915E53328g13489A70850N3480N4246I5212K74411e17902k20434
16416g38336a33847n7760A76607a035118D79441a333088R8826c64003j75520A533781
16405d25368j59821E59672e57313k99891O9028K16431A27901b67392k30347J41131
16395c56608A4665d15106F03312H7190a063130P1477j22234a00630p54942a65952
16384f64677A502430c0941p68245b55j225787b41413n46211B68370Q3297J37297
16374D88964g32789l05193m2548P396E8068d82918q61064N20939K98433B7839
$$ y = [-206219, 976841, -2099977, -12791, -874156, -54774, -456798, 848961, 345400, 1270516, 787422, 131062, -428554, 851489, -108644, 416843, 43745, 286347, -643162, -190375, -303679, -523594, 553328, -713489, 170850, 224330, 278576, 95212, 369623, -517902, -738336, -133847, -191607, 176607, -1035118, 479441, -1333088, -1234262, -364003, -539523, 1533781, -425368, -585189, 559672, -557313, -857204, -788176, -571745, 127901, -267392, -497739, -356608, 14665, -415106, 603312, 87190, -1063130, -991653, -1113887, -100630, -855572, -165952, -664677, 1502430, -30941, -799186, -255, -1226042, -241413, -787624, 268370, 351667, 488964, -732789, -1037982, -1080530, -1073134, 58068, -482918, -1343982, -823043, -524610, 27839]
16363B21797M48875g42223l07283l62325A539785a96161j64151D16110c88263
16353e67504m8271p10895Q0718F62020c99662A94706g88927K20659H2545c96321
16342D96377M02146a113075A83609h54794c30895A21605M2158J98212a125551
16332i92374L85460H58601d78815F28766B718e2826k30113m23969E16744Q8204
16322F04948M12663i79199L37095g2613q31737B1186L86329A27011Q36392e43457
16311E33643A435b21256J8079j52519B74373K07263a913740I14353C40813a87527
16300e44185h9902A069086c74358D18766a039165B1449c42401H10799a24724B65734
16289C6761a22142k42610C4052J848606A59352o7410a582795e42991B24997a001237
$$ y = [221797, 670672, -742223, -1049506, -1411831, 1539785, -196161, -360312, 416110, -388263, -567504, -615775, -1326670, -1245952, 662020, -399662, 194706, -788927, -568268, 82545, -396321, 496377, 898523, -1113075, 183609, -854794, -330895, 121605, 163763, 361975, -1125551, -992374, -606914, 858601, -478815, 628766, 2718, -52826, -282939, -706908, 516744, 604948, 1017611, -979199, -642104, -72613, -904350, 21186, 407515, 127011, 963403, -543457, 533643, 1435, -221256, -203177, -355696, 274373, 481636, -1913740, 914353, 340813, -187527, -544185, -89902, 1069086, -374358, 418766, -1039165, 21449, -342401, 810799, -124724, 265734, 36761, -122142, -364752, 34052, 1882658, 159352, 91942, -1582795, -542991, 224997, -1001237]
16278d3817j346983H50453a76879o07008D74155e15154j276719e87233m22024
16269a009257a10384B21478P55706d69321D60288A56947a149512A01273a018612
16259b49618k86109B40295J8574d67273i7721E62171A13779D4406P17014l48542
16249D12878d33223A052421c03451k49567o0772J88065E83764h6352j164371j39122
16239a389845L29353f8155F05359i29325K07254G8002c58917A404309c73007A54844
16228E68991b8328p09630B31341J534052d0826j045358M20699L23385p04545b34881
16217f47389E23495N08734G9638f2371D84788J90067a09987J0519j73100k59522
16207e32090I41482b44579A65438J78384c6901j038939A24882M71644a207683
$$ y = [-43817, -1390800, 850453, -176879, -783887, 474155, -515154, -1791873, -587233, -1009257, -110384, 221478, 977184, -469321, 460288, 156947, -1149512, 101273, -1018612, -249618, -535727, 240295, 258869, -467273, -97721, 562171, 113779, 44406, 761420, 412878, -433223, 1052421, -303451, -553018, -613790, -425725, 583764, -86352, -1250723, -1389845, -1060492, -68155, 605359, -929325, -722071, 78002, -358917, 1404309, -373007, 154844, 568991, -28328, -737958, 231341, 1765393, -40826, -1086184, -665485, -342100, -1046645, -234881, -647389, 523495, 1032229, 79638, -62371, 484788, 674855, -109987, -99468, -272568, -532090, 941482, -244579, 165438, 343822, -36901, -1075840, 124882, 596526, -1207683]
16197e48655B37415h67775c18834A226976n70607k53012b66128i8095m238B20555
16186C08193a048968d51544a54809j45674a21978q87756H74328j35497h08356
16176F28068R5165g47055b51166E8692c55039a5862H26625L43414d87329A242655
16165e45054A87484h09578L11123l18061A56418a14535A071764c23240M3940C32780
16154F65750A63820f63665a05068F77425A00256f14065l35559b60476A43773c93245
16143e14125I71254m25179a61050A89006a490039A028955a24765E67221a54224
16133A001800B71357K60295R20056o78046r868B31003a113220A166198j80869
16124I85329E0345J439728a079846M67395a44799l622M2324C47892h99733j00986
$$ y = [-548655, 237415, -867775, -318834, 1226976, 656369, 403357, -266128, -98095, -102333, 220555, 308193, -1048968, -451544, -154809, -300483, -121978, -1009734, 874328, 738831, -808356, 628068, 723233, -747055, -251166, 58692, -355039, -15862, 826625, 1170039, -487329, 1242655, -545054, 187484, -809578, -498455, -816516, 156418, -114535, 1071764, -323240, -279300, 332780, 665750, 163820, -663665, -105068, 677425, 100256, -614065, -949624, -260476, 143773, -393245, -514125, 971254, 546075, -161050, 189006, -1490039, 1028955, -124765, 567221, -154224, 1001800, 271357, 531652, 1451708, 773662, 763794, 231003, -1113220, 1166198, 985329, 50345, 1490073, -1079846, -612451, -144799, -148421, -106097, 347892, -899733, -1000719]
16114a000719O1806C63982K75754g15600c49690N5676E09041P23904A81290a55412
16103f11910n18251I96080h01993G63485a120896B92600M05176J47594d36568
16093i88345H15743c2730E41046b70530l18401l5909D56800A71003M34929I8822
16082E8902O91676f99260E42315L01982a61551C55671a25282k79922B03974c47343
16071b77465j12195C67461a503426f60372G18263d30304k08217G15848b06450
16061a062252A04114i2367k91907B18254A09005M39800d1527C28715P05905l79682
16051F54938J207847b69247j185430i1475B57741d26314j094570B03812R4867
16042B98679M20775B74389e92553K12991R5126E91516c92266C31085e6940E41497
$$ y = [-1000719, -938913, 363982, 639736, -715600, -349690, -294014, 509041, 1232945, 181290, -155412, -611910, -1130161, 996080, -801993, 763485, -1120896, 292600, 697776, 845370, -436568, -988345, 815743, -32730, 541046, -270530, -588931, -624840, 456800, 171003, 605932, 98822, 58902, 750578, -699260, 542315, 844297, -161551, 355671, -125282, -405204, 203974, -347343, -277465, -389660, 367461, -1503426, -660372, 718263, -430304, -638521, 715848, -206450, -1062252, 104114, -92367, -384274, 218254, 109005, 548805, -41527, 328715, 1034620, 654938, 1862785, -269247, -1454677, -91475, 257741, -426314, -1520884, 203812, 298679, 719454, 274389, -592553, -379562, -284436, 591516, -392266, 331085, -56940, 541497]
16031e16683M2733k34743b11107o768A651614d8050B3199N44884i83135A94226
16020c14115F34910j56206L894R22229g65563D99128h05226o15248a1925n47992
16010e59917F134L26614c14756H04236c66597j191067C88158J55483K80564E3980
15999a83515q24159A115347H2380h64240A33440e37491A87578J467427G24310
15989b59482l94643A50546i21665c12418a13296r92282B19145m7502d34910I82651
15978g96188I14197B85505J220058I3375b32348e7807o45609D62431i36626Q8581
15968h48045D81270O59105a09497M6023q44789l11958l96231e01041m63367D97150
15957F71291k21079e0980o04255k24224d27396B69422c36865B17916L7284L91141
$$ y = [-516683, -473950, -708693, -211107, -217875, 1651614, -48050, 23199, 568083, -983135, 194226, -314115, 634910, 478704, 482598, 1404827, -765563, 499128, -805226, -1420474, -11925, -559917, 6134, 332748, -314756, 804236, -366597, -1557664, 388158, 543641, 824205, 53980, -183515, -1007674, 1115347, 82380, -864240, 133440, -537491, 187578, 1655005, 724310, -259482, -654125, 150546, -921665, -312418, -113296, -1105578, 219145, 171643, -434910, 982651, -796188, 914197, 285505, 1505563, 93375, -232348, -57807, -703416, 462431, -936626, -848045, 481270, 1140375, -109497, -63474, -908263, -1220221, -1616452, -501041, -964408, 497150, 671291, 450212, -50980, -655235, -879459, -427396, 269422, -336865, 217916, 255200, 646341]
15947F46341J62826M87619k64442d27576k03332F50238g78023c73144E78378K35665
15937H14043b07504j24113B94026J07999J21268a71696A98317J00088K7924b07212
15926g73796G45441C57347J6456c03208a4021q07997I2648g40379b22750l35484
15916e58234H02651e55634R2560K19959D06023a9077j093558G62101i3069k01561
15906b94630E75067j90090a55015j793475A236627h5357J0763k19942D78935I1349
15895c23948A1321J132915e76837b52781J08859k8802G19421d89926D6226Q56120
15885I02346A042c45454Q8564k28427A283621c93268A321875a843156f26936b80785
15874E09318a46299F01066a73136G03889J48886h53645D44447f90232L28920B77225
$$ y = [646341, 809167, 1296786, 1032344, -427576, -630908, 650238, -778023, -373144, 578378, 814043, -207504, -331617, 294026, 402025, 523293, -171696, 198317, 298405, 326329, -207212, -773796, 745441, 357347, 373803, -303208, -14021, -822018, 92648, -740379, -222750, -558234, 802651, -555634, -463074, -243115, 406023, -19077, -1112635, 762101, -93069, -294630, 575067, 384977, -155015, -1948490, 1236627, -85357, -74594, -294536, 478935, 91349, -323948, 11321, 1144236, -576837, -252781, -143922, -172724, 719421, -489926, 46226, 902346, 1042, -345454, -256890, -485317, 1283621, -393268, 1321875, -1843156, -626936, -280785, 509318, -146299, 601066, -173136, 703889, 852775, -853645, 444447, -690232, -361312, 277225]
15863G0280A1381h8843r18009c73611B1996e98641F0779a71281f8594k03036m31184
15852g02814m27453B92955g68639G05909q5244C02706c8985j1116n63904H91176
15841a62940A011530c22295B2807g99969B8942J000575E795b67812C15621j13592
15831B02029e24271a20935D45694b58372I380a080858A070397a524919a08262
15821a77672F95539J28700f83313b17150H82340J63504a103503L64106L68510
15812c70887G53400p5279c41903A86640d12433D60340a068938d22122d3543A146213
15801B8339O17246d41542E62537d1018r83649K25793F7498B8937e42833A477874
15790e10731N5310A33314M80055g37643C29029O23913i91042D04408f21280r9555
$$ y = [70280, 11381, -88843, -1006852, -373611, 21996, -598641, 60779, -171281, -68594, -271630, -702814, -1130267, 292955, -768639, 705909, 620665, 302706, -38985, -50101, -614005, 891176, -162940, 1011530, -322295, 22807, -799969, 28942, 1029517, 5795, -267812, 315621, 202029, -524271, -120935, 445694, -258372, 9380, -1080858, 1070397, -1524919, -108262, -177672, 695539, 824239, -683313, -217150, 882340, 1045844, -1103503, -739397, -370887, 753400, 678121, -341903, 186640, -412433, 460340, -1068938, -422122, -43543, 1146213, 28339, 645585, -441542, 562537, -41018, -1024667, -798874, 67498, 28937, -542833, 1477874, -510731, -455421, 133314, 613369, -737643, 329029, 952942, -991042, 404408, -621280, -720835]
15780g20835o425I60104A34192a51905j50544d9009q94048H13991h2947B80128
15769A044777h1413G8073f98040j00608D38371c61404k24268I71071C68312e09454
15758h60481H29980B81035a130817H39778C53068f2488r8572j77876I0266b34570
15747A08293C9700O52415C1720g75758d6835C22059f65153D41195F256K92057
15737B98313h40484c27833H91220B14053M22254A88083L53293f36120a87810A017603
15726A30669R815g8709A208993a074904c69465B5658J83162P87977K03367d48205
15715a94323p10730C27955I9126P95722j88337J29964E7462J763141c0316l6205
15705f6521E15956f55660K68310j12790l6728b14306k46105G50231C41643J1801
$$ y = [-720835, -727260, 960104, 134192, -151905, -302449, -49009, -943057, 813991, -82947, 280128, 1044777, -81413, 78073, -698040, -798648, 438371, -361404, -585672, 971071, 368312, -509454, -860481, 829980, 281035, -1130817, 839778, 353068, -62488, -161060, -338936, 90266, -234570, 108293, 39700, 692115, 31720, -775758, -46835, 322059, -665153, 441195, 6256, 298313, -840484, -327833, 891220, 214053, 636307, 188083, 541376, -636120, -187810, 1017603, 130669, 140484, -78709, 1208993, -1074904, -369465, 25658, 208820, 996797, 1200164, -448205, -194323, -905053, 327955, 99126, 894848, 706511, 836475, 57462, 1820603, -30316, -66521, 515956, -655660, -387350, -500140, -536868, -214306, -460411, 750231, 341643, 353444]
15695C53444P0382j28694c26279K3239B33437R4484c31978J04893E31368j6695
15685E14673k07911b05323F00059c46006E68877J0855j9477L52719a195304e93648
15674B06680c97313H85166B99690h87182B87640M00697k42917a61146A402080
15664A194952l3267P6940b98680j107518c45918k61817j10989k15677b92297C91842
15653f53207B80137e0726l64261H80087C82049g61416l90631A272243A86887P10427
15643H97314A73111K22897I4084J40355f74041E62519M53934e97451A106337j44244
15633I62093g31090G11920B65821C5795O59538B3266R90550q1615O49155i70415
15622h6238A390215A47004Q80224d07397A812615C65930j72833P09054P00016
$$ y = [353444, 423826, 295132, -326279, -303040, 233437, 327921, -331978, -227085, 531368, 514673, 306762, -205323, 600059, -346006, 568877, 579732, 560255, 912974, -1195304, -593648, 206680, -397313, 885166, 299690, -887182, 287640, 688337, 445420, -161146, 1402080, 1194952, 1161685, 1238625, -298680, -1406198, -345918, -607735, -718724, -934401, -292297, 391842, -653207, 280137, -50726, -414987, 880087, 382049, -761416, -1152047, 1272243, 186887, 897314, 173111, 396008, 94084, 234439, -674041, 562519, 1016453, -597451, 1106337, 962093, -731090, 711920, 265821, 35795, 695333, 23266, 1013816, 932201, 1581356, -970415, -86238, 1390215, 147004, 1027228, -407397, 1812615, 365930, 193097, 902151, 1602167]
15613A602167B14203a72603p7658p44933A74250c48344A052529d21512O4704G77805
15602A673995b09526F701b27323A26940a188947B0045e40275A419116d87113b15306
15591D68265b31535B48653b11816D93021O68875E7978b849q3877A069453b42736
15580g61674A52687J00514L30547A29927h60608B18218A0255J189349m94691e10308
15569A01083O19204a104562b02959H01258a020387G51800J32572K6319B00804
15559G47230l21120b93691B080231B49829J72877J161152m98729B7923a213038
15549A287113d0709n6036j433962B1239d40556A98328g17330J9259E49642D0749
15538H8627N52993g63495D96519A61279a178654d19987H28654b74535H51143C43933
$$ y = [1602167, 214203, -172603, -250261, -995194, 174250, -348344, 1052529, -421512, -356808, 777805, 1673995, -209526, 6701, -227323, 126940, -1188947, 20045, -540275, 1419116, -487113, -215306, 468265, -231535, 248653, -211816, 493021, 1161896, 57978, -2849, -86726, 1069453, -242736, -761674, 152687, 253201, 583748, 129927, -860608, 218218, 10255, 1199604, 704913, -510308, 101083, 720287, -1104562, -202959, 801258, -1020387, 751800, 884372, 910691, 200804, 747230, 426110, -293691, 2080231, 249829, 422706, 1583858, 1085129, 27923, -1213038, 1287113, -40709, -96745, -1530707, 21239, -440556, 198328, -717330, -698071, 549642, 40749, 88627, 641620, -763495, 496519, 161279, -1178654, -419987, 828654, -274535, 851143, 343933]
15527a286665b27592D65578a66710A304843A33438d56430E90522a092284L29097
15518g63187b37051G0288b18432B358761a40248E53628A14530B6139O11753A15317
15507B032954a252354O18719b38240a5529k25820J15138I24135d4432j85311g8620
15496I4917Q54265c92201A287745C56052g24910a39885o20250I6304J139848o07042
15486F29110l08062L62293p1356k66456a284663c76427A202913g07762a06068
15476A41059N97486H6979N7905a170382N79635m07187J82733e0549A289368C88038
15465a49675C33433J93560A02933K67255g14326I98722L63545e14948q0442C76192
15454A64403c89825A015849m5176B92081A03554P93661A28447Q59424g40640C28303
$$ y = [-1286665, -227592, 465578, -166710, 1304843, 133438, -456430, 590522, -1092284, -763187, -237051, 70288, -218432, 2358761, -140248, 553628, 114530, 26139, 637892, 115317, 2032954, -1252354, -633635, -238240, -15529, -241349, -126211, 924135, -44432, -229743, -78620, 94917, 949182, -392201, 1287745, 356052, -724910, -139885, -760135, 96304, 1236152, 629110, 321048, 683341, 611985, 345529, -1284663, -376427, 1202913, -707762, -106068, 141059, 738545, 86979, 144884, -1170382, -590747, -997934, -815201, -50549, 1289368, 388038, -149675, 333433, 526993, 102933, 370188, -714326, 998722, 1362267, -514948, -595390, 376192, 164403, -389825, 1015849, 970673, 292081, 103554, 897215, 128447, 987871, -740640, 328303]
15443H13446l75283o1602A15430K36546A64104J174329E56505d015H47389a5434
15432C02186J219945a91714n46230D90708p9743M43900l71027d04849A355126
15422G53767J77046d80020j121770A694155I224g52010A21742a059120K09798
15413h49322D08670j82629e2217C60971A03286a08446j308880D18678J80011b50527
15402c58480l84097b29460F99693d55171D65480B8197Q11500d78261B89778j40464
15392A49314P05337J32284a85798I17515l94538J106805F15495c00721F08648
15382F60357b54585p93858J95599B50976J604351H64433b24774F0541R44013B8484
15371f30486A396343f52011A101059B08132a1420p05614f6678J3252J7400m70979
$$ y = [813446, 438163, 376561, 115430, 351976, 164104, 1338433, 556505, -4015, 847389, -15434, 302186, 1522131, -191714, -737944, 490708, 410965, 854865, 483838, -404849, 1355126, 753767, 930813, -480020, -1601790, 1694155, 9224, -752010, 121742, -1059120, -849322, 408670, 226041, -52217, 360971, 103286, -108446, -1417326, 418678, 598689, -250527, -358480, -742577, -229460, 699693, -455171, 465480, 28197, 839697, -478261, 289778, 149314, 854651, 986935, -185798, 917515, 522977, 1629782, 615495, -300721, 608648, 660357, -254585, -1048443, -852844, 250976, 1855327, 864433, -224774, 60541, 1004554, 28484, -630486, 1396343, -652011, 1101059, 208132, -11420, -717034, -66678, -53426, -36026, -507005]
15361e07005a24304F87209B01745P54330H2157i7259E7420J81955q7140K18009
15351C70244a163640a42380A18463N9528n6922K13867a74354q91613D51645C359
15340g23972K32330Q743A876053a365623e85558D66591e6985l34220A57931e67449
15329E72663c25879I29119B78475J34804J24722j58041K43817f55515B357620
15319A67026a29454I35564k2031j67036c49755G340K55522g51034G33444a26848
15308A657909D6813O83370Q27704c21330m36517B56270a42594B68265R66838b87349
15297a39393C76348J241551f01938G49675i36453A207503b86726B41295b7540
15287B67551F4927R29415a555481G70836j84520M13916d31362G02853h24086L23889
$$ y = [-507005, -124304, 687209, 201745, 956075, 82157, -97259, 57420, 239375, 152235, 370244, -1163640, -142380, 118463, 177991, 121069, 334936, -174354, -1065967, 451645, 3359, -723972, -491642, -482899, 1876053, -1365623, -585558, 466591, -56985, -391205, 157931, -567449, 572663, -325879, 929119, 278475, 413279, 538001, 379960, 623777, -655515, 2357620, 167026, -129454, 935564, 913533, 746497, -349755, 7340, 262862, -751034, 733444, -126848, 1657909, 46813, 730183, 1557887, -321330, -757847, 256270, -142594, 268265, 1235103, -287349, -139393, 376348, 1617899, -601938, 749675, -936453, 1207503, -286726, 241295, -27540, 267551, 64927, 994342, -1555481, 770836, 586316, 1000232, -431362, 702853, -824086, -500197]
15277e00197A08389J236657n76268A70310g33378L0339H00330j83096a29764B66931
15266e66211D54057K95774o6802B71083H3866d12305G58329c26779d0222C38478
15255i66640k92425E27224d6542A74282a119373e1123I9730b66100j378933A47745
15244A94398c23495H82604k24145h7959q20145J02568F80531e37306A448275g38805
15233G4949R3873k8573c37369a51030m5919B68540a383482e29472F25757B51781
15222G3569O65016J16456j77194a69547F72898b39785K81F23045K7272b29291
15211A07443J46621N87085J059891I6498a20517A62938J0584J311710n57768f70809
15200f28493A02895d20992C51352N66011k59056d72652E51881i07897H33481A24211
$$ y = [-500197, 108389, 1345046, 768778, 170310, -733378, -703039, 800330, 617234, -129764, 266931, -566211, 454057, 749831, 683029, 271083, 83866, -412305, 758329, -326779, -40222, 338478, -966640, -1259065, 527224, -46542, 174282, -1119373, -51123, 99730, -266100, -1645033, 147745, 194398, -323495, 882604, 658459, -87959, -908104, -805536, 680531, -537306, 1448275, -738805, 74949, 168822, 140249, -337369, -151030, -196949, 268540, -1383482, -529472, 625757, 251781, 73569, 738585, 855041, 677847, -169547, 672898, -239785, -239504, 623045, 650317, -229291, 107443, 254064, 841149, 1901040, 96498, -120517, 162938, 173522, 1485232, 927464, -670809, -628493, 102895, -420992, 351352, 917363, 658307, -472652, 551881, -907897, 833481, 124211]
15189A115138B22590G1280K71619a41988B09644b53088n26927E66852M7225J043832
15179A657909p38582H3444N56557R0337e30379D37535A92058J25050G9263e85834
15168D37980R49632N12691C58988e3269C47973f32554A002496g9867I6807M78187
15158E74994L20129A20007e18819J14534C46957E6462R05572d55948D50132c81609
15147f64670k37319b95374J5783J01024C1290b09095r81650N45825C14823M49
15137C15272d29323k81946E93013j51759a76299F03919L5215M04677l10916A08357
15126E33898j77212A76988m4762K96968c5642E96923L25781K6021l20032K15018
15116H43711m5363E0932e72518G85747K75647c8139A705313a155720A189927g1737
$$ y = [1115138, 222590, 71280, 342899, -141988, 209644, -253088, -780015, 566852, 614077, 1657909, 919327, 83444, 640001, 730338, -530379, 437535, 192058, 317108, 79263, -585834, 437980, 1387612, 1900303, 358988, -53269, 347973, -632554, 1002496, -79867, 96807, 574994, 895123, 120007, -518819, -404285, 346957, 56462, 962034, -455948, 450132, -381609, -664670, -901989, -295374, -279591, -178567, 31290, -209095, -1190745, -644920, 314823, 315272, -429323, -711269, 593013, 441254, -176299, 603919, 639134, 1043811, 732895, 108357, 533898, 356686, 176988, 132226, 429194, -35642, 596923, 922704, 948725, 628693, 843711, 798348, 50932, -572518, 785747, 1061394, -38139, 1705313, -1155720, 1189927, -71737]
15105a536j56955F03623r9974m9033B0402N2033N33232c23623a43667B35753d91901
15093b28857l05338B90407J228355O770G23298a33969q0979q58439k87572N85736
15083g75223F99447A89713P13030d9015I87887K91134e55385A052598B48753n1589
15073A97164O49650B44723L57655a132400K48620C6011O69963O05784n97675K89082
15063A003165G0641J109266a66081H4007A458c705A185480A27527J526829a222387
15052I19970b19366j0283m42652C24470a72154n19085a43093H17988k81391a48718
15041B51918K80670O33777A37959N87397K29948c69958I83607e12914I01569e03303
15030F32256M04086l30717C03625R7866e35992A279679e28872G72152C9985Q72284
$$ y = [-1536, -158491, 603623, 503649, 454616, 20402, 72435, 605667, -323623, -143667, 235753, -491901, -228857, -534195, 290407, 1518762, 1525532, 723298, -133969, -214948, -1073387, -1360959, -775223, 699447, 189713, 902743, -49015, 987887, 1279021, -555385, 1052598, 248753, 197164, 846814, 244723, 602378, -1132400, -883780, 36011, 705974, 1311758, 714083, 1003165, 70641, 1179907, -166081, 84007, 1458, -3705, 1185480, 127527, 1654356, -1222387, 919970, -219366, -229649, -672301, 324470, -172154, -691239, -143093, 817988, 536597, -148718, 251918, 532588, 1166365, 137959, 725356, 955304, -369958, 983607, -512914, 901569, -503303, 632256, 1036342, 705625, 303625, 401491, -535992, 1279679, -528872, 772152, 39985, 912269]
15020I12269l9554C53700B2643R29033g23407C60024b36195B91072O28755C56024
15009C4009b83474P7856q90773H07650K99478M83145h48086A498356o99776a90405
14998a56884k78182C11855J154658c7907A068488j71160j70207A62886P19080
14989H81966l56412a51553A206605h45271a84424B07085c30318A93406i29868
14979E7445c06734k37336i4204A656362c34910a41008l07780F74196e52275q4701
14969f36976E99741a485169d1594C89485P36582f35302A197485E75377f30752
14959f10846F54371b30954Q0933A290037m42982B84614R37969A65454R93584D67946
14948C02794L85303N06471F609b71766A789567b35004A079278k5398o6812c03916
$$ y = [912269, 872715, 353700, 22643, 951676, -723407, 360024, -236195, 291072, 919827, 356024, 34009, -283474, -205618, -1096391, 807650, 1107128, 1590273, -848086, 1498356, 798580, -190405, -156884, -435066, 311855, 1466513, -37907, 1068488, 897328, 727121, 162886, 881966, 525554, -151553, 1206605, -845271, -184424, 207085, -330318, 193406, -929868, 57445, -306734, -544070, -94204, 1656362, -334910, -141008, -448788, 674196, -552275, -636976, 599741, -1485169, -41594, 389485, 1126067, -635302, 1197485, 575377, -630752, -610846, 654371, -230954, -150021, 1290037, 847055, 284614, 1222583, 165454, 1159038, 467946, 302794, 688097, 1194568, 6609, -271766, 1789567, -235004, 1079278, 1053880, 987068, -303916]
14937A05482a281287c06578b9342D5376J56451a38339q03066C49489M04689l00212
14927D53966B8817J190536a56845F91069a29335A242324E31976J899697D65425
14917a98796q37836G82555N2113b36569l80198a70050A68601J709338G51258J95272
14907I46530a086808c23371l68627K62576q72777c39379A269622A49607k8507
14898A21100a65089j71771B395d82813a59551A503928E2491O08721j18685M59855
14888A002382N5052o0733j57643a413142B36289P53420d55556H11062J26558C42127
14877A701831A86640e05061C299b37985k76377D60012Q53188d14338D66616J91484
14867F58100K1536P70376n18245j45197a04275E3878O21732b84731A026578A57895
$$ y = [105482, -1281287, -306578, -29342, 45376, 201827, -138339, -941405, 349489, 754178, 453966, 28817, 1219353, -156845, 691069, -129335, 1242324, 531976, 2431673, 465425, -198796, -1036632, 782555, 834668, -236569, -616767, -170050, 168601, 1877939, 751258, 946530, -1086808, -323371, -691998, -429422, -1302199, -339379, 1269622, 149607, 121100, -165089, -336860, 2395, -482813, -159551, 1503928, 52491, 661212, 542527, 1002382, 1057434, 996701, 839058, -1413142, 236289, 989709, -455556, 811062, 937620, 342127, 1701831, 186640, -505061, 3299, -237985, -514362, 460012, 1313200, -414338, 466616, 658100, 679636, 1450012, 931767, 786570, -104275, 53878, 675610, -284731, 1026578, 157895]
14856A402179D51539J4867a607773g25471E61464e9987n21424n84295b56264C57656
14845A042423B28522L71110A651i1784A68773o2210J85160R43103D15416H4951
14834E84361A72922J00110M70487d95789e2943G38156G684d6185j29808f6397
14823c97304B96126j01297J47009R48148j63155G6693a117772G03202b09489D82193
14812h04551F74974k19356a107932I60783e02301I52088B37882c09751a30005
14802A695004D01276K05928A97121c71531m73913A21992c90606H20273k7152A82998
14791A279962k16333l00930Q14401e48718A015351B59374O3139J076805d60839
14781b76064A071092m09484f9236A131870n19731L51660i4290A98996K71786n2456
$$ y = [1402179, 451539, 466406, -1607773, -725471, 561464, -59987, -581411, -1165706, -256264, 357656, 1042423, 228522, 599632, 1651, -91784, 168773, 106563, 291723, 1234826, 415416, 84951, 584361, 172922, 273032, 743519, -495789, -52943, 738156, 7684, -46185, -175993, -66397, -397304, 296126, 194829, 341838, 1289986, 1126831, 76693, -1117772, 703202, -209489, 482193, -804551, 674974, 455618, -1107932, 960783, -502301, 952088, 237882, -309751, -130005, 1695004, 401276, 607204, 197121, -371531, -845444, 121992, -390606, 820273, 793121, 182998, 1279962, 1063629, 762699, 1577100, -548718, 1015351, 259374, 322513, 1399318, -460839, -276064, 1071092, 661608, -69236, 1131870, 612139, 963799, -94290, 198996, 470782, 418326]
14771D18326A5407g60272G71503A98569O15267a92176Q6163C9090L92162P2485
14761E03737j15451J338390o14726A0357R187L03440i62636B61604d48695G99700
14750B60269b20686M540A778867o92819j57054C14800F8773a16602H50052g42694
14739E56145P57970a112106A203619l36553M2735P07232A26329J531515j42568
14730A515276P33004b55637A31922J452578f28106D40288j82514b43490A667661
14720e35234G05334A31505K66390J56508j72647g76295K22392J89608B10323K69034
14710D79357P27629E73111i24357G75362a439850I58433a44630P1470D3825J219914
14700A263739m49170b01358A027369E4937N72413M29179c17811o4459A623467
$$ y = [418326, 15407, -760272, 771503, 198569, 813836, -192176, -106013, 39090, 431252, 503737, 388286, 1726676, 1111950, 10357, 19544, 322984, -962636, 261604, -448695, 799700, 260269, -220686, -216146, 1778867, 1086048, 928994, 314800, 68773, -116602, 850052, -742694, 556145, 1314115, -1112106, 1203619, 867066, 909801, 1617033, 126329, 1657844, 1515276, 2248280, -255637, 131922, 1584500, -628106, 440288, 257774, -243490, 1667661, -535234, 705334, 131505, 397895, 554403, 381756, -776295, -553903, -364295, 210323, 479357, 1206986, 573111, -924357, 775362, -1439850, 958433, -144630, -73160, 43825, 1263739, 814569, -201358, 1027369, 54937, 627350, 1056529, -317811, -382270, 1623467]
14690f70209D85111K62779g93294A086303j75801A09237K776781e13620q66743
14681a380363C66629e19481A56345b75234A2262J923168r55099a387245G32355
14671D03377c78676r94322E11881b04067G63483j88954J036014a85688j60851
14662c46539E85248e16913n33815A376455c24131G30042J615036a36238A48957
14652B10501l6718P28972j6255A34013c97657j018330E15103i09845d34643F03483
14641A164003j75402g77164a29157F67929L89630m65742J65136L89292E48169
14631b46138A452107D03808K32482B21842M71778k25651M46198C46519o4119c43802
14620A022704B60949M26880g80478n6316a78990H13906C67371b60954A162710
$$ y = [-670209, 485111, 747890, -793294, 1086303, 910502, 109237, 2886018, -513620, -1380363, 366629, -519481, 156345, -275234, 12262, 1935430, 980331, -1387245, 732355, 403377, -378676, -1372998, 511881, -204067, 763483, 574529, 1610543, -185688, -346539, 585248, -516913, -1050728, 1376455, -324131, 730042, 2345078, -136238, 148957, 210501, 173783, 902755, 886500, 134013, -397657, -1415987, 515103, -909845, -434643, 603483, 1164003, 988601, -777164, -129157, 667929, 1057559, 591817, 756953, 1146245, 548169, -246138, 1452107, 403808, 636290, 221842, 693620, 467969, 914167, 346519, 282400, -343802, 1022704, 260949, 687829, -780478, -836794, -178990, 813906, 367371, -260954, 1162710]
14610A335828K45620m31259a41803I29546C80733i98794j91149A290363m64463
14601H25900A0535Q10332d85631A116026N53791K3317b70358G93912C68650J56447
14591E25097j24682c67616J43354B63986N65978O4265O74220b82042G90646o8618
14581G22028a35943G47075H2233J502341o51629P2615i41842F39151k70710L3438
14571D01879j73733g472D23755a05168F22666O46894l11669K66760D72506c10124
14560C55750L71359M27485K69964m59181J99032m44142J153770n06781C06255
14550c2239j067169A75773O61947g88070G77304M33306B78362P06618C36870b00197
14539G00537J89478J10364k1596d660A020424M54096o77626g71991A7804O28246
$$ y = [1335828, 1581448, 1150189, -141803, 929546, 380733, -998794, -1189943, 1290363, 825900, 10535, 820867, -485631, 1116026, 1669817, 1693134, -270358, 793912, 368650, 525097, 400415, -367616, -224262, 263986, 829964, 894229, 1568449, -282042, 790646, 722028, -135943, 747075, 82233, 1584574, 932945, 1005560, -941842, 639151, 368441, 401879, 228146, -7472, 423755, -105168, 622666, 1269560, 957891, 1224651, 472506, -310124, 355750, 727109, 1154594, 1424558, 965377, 1164409, 720267, 1874037, 1367256, 306255, -32239, -1099408, 175773, 837720, -788070, 777304, 1210610, 278362, 984980, 336870, -200197, 700537, 890015, 1000379, 978783, -4660, 1020424, 1474520, 796894, -771991, 17804, 646050]
14529F46050P6385k70601P18558Q5226D84112g3333A424149A1202N61553A72591
14518A179964M82842d2575A512594o28636a03545G06062g49979m07877E45137
14508B29681J19938O70388d11669A835352N0311H69568j00105J85273B07793R2457
14498C00250N62431N31368J261272p57054R73855E92469J072403n05364m86915
14489F72593J010370n08352J043261E04356J173334J148860A151353J430685n01989
14480B080049G97683J637563p54674q01164j59606R58355o63575l04700H9003
14470F79866K05561L5210K8993P42155R84518b17952I17284O10804m45022C59814
14459A415938F2056Q97749j21479C85664b14950I09496k74126J549425I29812
$$ y = [646050, 722435, 451834, 1170392, 1255618, 484112, -73333, 1424149, 11202, 572755, 172591, 1179964, 1662806, -42575, 1512594, 883958, -103545, 706062, -749979, -1157856, 545137, 229681, 349619, 1020007, -411669, 1835352, 1885663, 869568, 769463, 954736, 207793, 300250, 862681, 1394049, 2655321, 1898267, 2872122, 592469, 1664872, 1159508, 672593, 1682963, 1174611, 2217872, 504356, 1677690, 2826550, 1151353, 2582038, 2080049, 797683, 2435246, 1680572, 879408, 719802, 1678157, 1014582, 709882, 89003, 679866, 885427, 920637, 949630, 1691785, 2676303, -217952, 917284, 1528088, 1083066, 359814, 1415938, 62056, 959805, 838326, 385664, -214950, 909496, 635370, 2184795, 929812]
14449A180615k21090a34960H93440O78622e62405C13028L89147B04162D9667L32770
14439C82437b21997B26774J96145a80090E50086N47119M48399o31358L76036n65701
14429G24581Q40419J9707L33777f54728G62537c91974G51838L1804D6865J197568
14419A244433k41760i01051F23188O70266b20249E75257K18311a54540I84369
14409a09956F01916j98717N62766a73250A24395N67177j21213O02456k29449B95680
14398A015802O17219b94805I62520I9072P44409l45044J058567E92861K27417
14389H20278A31206J13096J386931F50780h16868A402506D804J23231O03500A17584
14378f7249D98023J634547A046129O34215e5750F17180j81438c03869F27211Q30880
$$ y = [1180615, 959525, -134960, 893440, 1572062, -562405, 313028, 702175, 204162, 49667, 382437, -221997, 226774, 422919, -180090, 550086, 1097205, 1545604, 914246, 1290282, 724581, 1565000, 1584707, 1918484, -654728, 762537, -391974, 751838, 783642, 46865, 1244433, 1002673, -901051, 623188, 1293454, -220249, 575257, 793568, -154540, 984369, -109956, 601916, 403199, 965965, -173250, 124395, 691572, 570359, 1172815, 943366, 295680, 1015802, 1633021, -294805, 962520, 99072, 843481, 498437, 1557004, 592861, 820278, 131206, 244302, 1631233, 650780, -816868, 1402506, 4804, 128035, 731535, 117584, -67249, 498023, 2132570, 1046129, 1680344, -55750, 617180, 435742, -303869, 627211, 1458091]
14368A458091G19111k12595N49829n25864P75090k33343L06984a79846E82804
14358H47154Q26982G08046Q79795f31484F76817n5169K688418A262864C65741
14348D70873L92521M77752n58700l54186Q60023k56438B22822J61077K096610
14339B480509E71983d36218I01743N91858J6962p23006k69302C7787J897594G71302
14328D78745J36009a4866I93526J257405n17257M78023E52337j44023J023859
14319A432173B49388P69931J112184M28463q34160N28405l93553p69652P17443
14310A808449E52702J888836l89849p60411H9935J234031J065475q33092D41032
14300A407703J039917o55279q30456P01419J71394L24843J44867j66874i7061
$$ y = [1458091, 719111, 506516, 1056345, 530481, 1305571, 1072228, 1379212, -179846, 582804, 847154, 1674136, 708046, 1587841, -631484, 676817, 621648, 3310066, 1262864, 365741, 470873, 863394, 1341146, 782446, 428260, 1288283, 1031845, 222822, 383899, 2480509, 571983, -436218, 901743, 1493601, 1510563, 787557, 518255, 37787, 1935381, 771302, 478745, 614754, -14866, 993526, 2250931, 1733674, 2211697, 552337, 408314, 1432173, 249388, 1019319, 2131503, 2559966, 1725806, 2254211, 1860658, 1091006, 1808449, 552702, 2441538, 2051689, 1291278, 89935, 1323966, 2389441, 1556349, 441032, 1407703, 2447620, 1792341, 961885, 1663304, 1834698, 2159541, 2304408, 2137534, -97061]
14290I82519J354679L87637r30802p32714J463208A200936l84741J262828j86878
14281A892145P16226q17745O85073M95776F95744K121634n28386I26319J093466
14272B019785r36693J761404j388090P93365L07017q16756K5844J36748J124204
14263C026828j093765j18218O95606k1821K40336j05320l4404A170348J493495
14254B663843L63939j405917J131548Q00164r8034o3385Q69641r74445O68202
14245C955556R66293J368471j545243Q49508n04115R07405L05450k53979J079127
14236G128473M42019k39577m11159O63898J197715J982073m81816J632386k79284
14227A1634728L129519M080605N424996J0460225J7640935K5673687L3630403
$$ y = [982519, 2337198, 2724835, 1794033, 1061319, 2524527, 1200936, 816195, 2079023, 1892145, 2608371, 1790626, 2475699, 2971475, 695744, 2817378, 2288992, 926319, 2019785, 1083092, 2844496, 1456406, 2249771, 2556788, 1740032, 1765876, 1902624, 3026828, 1933063, 1814845, 2510451, 2488630, 2728966, 2623646, 2589242, 1170348, 2663843, 3027782, 1621865, 2753413, 3553577, 3455543, 3392158, 4261799, 3287354, 3955556, 4921849, 6290320, 4745077, 5594585, 5090470, 5997875, 6303325, 6049346, 7128473, 7570492, 7330915, 6919756, 7583654, 8781369, 10763442, 10281626, 11914012, 11634728, 14764247, 18844852, 24269848, 34730073, 52371008, 78044695, 111675098]
14220A11675098K7195224j189785j5481908p25607K2817910M7396304N9821618
14213B51508854K4435797l5963818l3509688j390143M0319071P5977852O6056960
14206C87434885k0004568q0334143o5131475k0535652J8874576M2232479J4752898
14199B77289000m5662236n9655897l7405818j2847592R296952J2863559q766317
14192A35111651l4857263l1200891k3286397j4212619r318212n492706m506634
14185A2236929k321235k932819j707599J178886k871158A515996N31143n8414
14177A988725D91425e93276k78587q58195k574J10807m66571l03086o44228M77102
14167b558608P90552j411161a513278j037500l0077O92056j161485J199925m78270
$$ y = [111675098, 138870322, 137680537, 122198629, 121473022, 144290932, 191687236, 251508854, 275944651, 239980833, 206471145, 205081002, 245400073, 321377925, 387434885, 367430317, 287096174, 221964699, 201429047, 220303623, 262536102, 277289000, 231626764, 171970867, 134565049, 121717457, 131014409, 143877968, 135111651, 100254388, 69053497, 45767100, 31554481, 22236269, 16743563, 12236929, 9915694, 6982875, 5275276, 6454162, 3583004, 1515996, 2047139, 1988725, 491425, -593276, -871863, -1730058, -1732632, -1621825, -2088396, -2391482, -3035710, -2558608, -1768056, -3179217, -1513278, -2550778, -2580855, -1888799, -3050284, -1850359, -2328629]
14158b328629a087163o55769k60319m05328j29282r7728N87240j80346J51233
14149b077462j32209P60976m73493j04247L86898p17836R08715q89806N15326
14140a823138m07223K02026j072494N23559a058639n97392N57209q04221O03013
14131a300030r19936R69146N18729j241441M78664j96130l27950q87820a447182
14121b280029J105787m74172O92875j041742M46672J73909l91576k43999L85085
14112a627190m47813f84608k72971p45429L8637M75902d51567j220759p30040
14103b402366a127277g0701j488957b81839p27032n09060f3895j304780A6896
14093a559380j09114M97277P534N64163p43515L14475l41034j066553d706r51961
$$ y = [-2328629, -1087163, -1742932, -2003251, -2408579, -2537861, -2635589, -2048349, -2228695, -2077462, -2209671, -1448695, -1922188, -2026435, -1639537, -2357373, -1448658, -2338464, -1823138, -2230361, -2028335, -3100829, -2577270, -1058639, -1656031, -1098822, -1903043, -1300030, -2219966, -1250820, -732091, -1973532, -1494868, -1690998, -2018948, -2906768, -1447182, -2280029, -1174242, -1648414, -955539, -1997281, -1550609, -1376700, -1768276, -2012275, -1627190, -2075003, -684608, -957579, -1703008, -1664371, -1188469, -451567, -1672326, -2402366, -1127277, -70701, -1559658, -281839, -1008871, -1517931, -63895, -1368675, 16896, -1559380, -1668494, -1171217, -1163683, -599520, -1343035, -1028560, -1369594, -2436147, -4706, -956667]
14083i56667o58850b15150m22761K91245q29317e09754j074687C1416f64142l15536
14073i79678j139537g66890A46392a247987L21279p38854d23424g1920j137905
14064a209825d55792J40903j36796L1029j014065O21117p8617K67589q27310B94908
14053b162045P32734e81934K68154j346924K04465N5685K38460j84961A49702
14043a393831O26475a70731p06817l84123k12301J17540n14382L7537D78842a030542
14032g85574L86542a1435l68460l58180J50588C63734A61290g51787q80670O94534
14022i37923n60292j7842d00872j114502C15283f76059l09990p58126Q49549k8623
14012i23249M36965o42509A72081L17395a483613i3276k94552k0309l63098b09703
$$ y = [-956667, -1615517, -215150, -637911, -346666, -1175983, -509754, -1584441, 31416, -664142, -979678, -2119215, -766890, 146392, -1247987, -926708, -1665562, -423424, -71920, -1209825, -455792, -314889, -451685, -420656, -1434721, -813604, -892221, -624632, -1451942, 294908, -2162045, -1429311, -581934, -313780, -1660704, -1456239, -1400554, -1162094, -1347055, 149702, -1393831, -767356, -170731, -877548, -1261671, -1473972, -1356432, -1870814, -1833277, 478842, -1030542, -785574, -399032, -11435, -379895, -738075, -587487, 363734, 161290, -751787, -1632457, -937923, -1498215, -1516057, -400872, -1515374, 315283, -676059, -986049, -1744175, -894626, -923249, -486284, -1128793, 172081, 489476, -1483613, -93276, -387828, -408137, -771235, -209703]
14001H8649c05327j31805j013188J57821L91470L1889c98570r12025p50059d82896
13990D46086K45503b213310A34948c36055A717340B75350f41420R4943D94383
13980b75116F24541b18542o59813L15138E44248h35951a55079q72167A462739
13970C12008e06358C1786c56708r44843N47205a05989A424399c78708j61166b15207
13959a373446E6204a49497k98925D59580d43747f6384j531613c91250P3863A059713
13948h42526m09125N85345G65464f13090F1005O11499h7798l81753G82579g91415
13937a175416b33438L5461l79074l43402D21162J007430C79246J438843C84476
13927A545443A05552M46398M37682h98120H51969e3016C48474a180945b65509
$$ y = [88649, -305327, -437132, -1450320, -1292499, -901029, -869140, -398570, -1310595, -2060654, -482896, 446086, 691589, -2213310, 134948, -336055, 1717340, 275350, -641420, -546477, 494383, -275116, 624541, -218542, -878355, -563217, 544248, -835951, -155079, -1027246, 1462739, 312008, -506358, 31786, -356708, -1301551, -754346, -105989, 1424399, -378708, -539874, -215207, -1373446, 56204, -149497, -448422, 459580, -443747, -66384, -1597997, -391250, -317387, 1059713, -842526, -1251651, -666306, 765464, -613090, 61005, 672504, -87798, -469551, 782579, -791415, -1175416, -233438, -197977, -577051, -920453, 421162, 1428592, 379246, 1818089, 384476, 1545443, 105552, 551950, 989632, -898120, 851969, -53016, 348474, -1180945, -265509]
13917B231331n09306H20040C88642f13548A244636f38935F76866j09143P1492
13908F39215a478539P3964c69331k56190a82078p6972a2221o61955j89580C52834
13897b18969n836J06387A29327a136365b68110p37905M34795J2483A89998d77401
13886a13527o92229A916389a135437D7275e77175l72507J71401j90854G48109
13876a222178d26463n81566D69730h26178m45426k46791e44955l12843k12579
13867a070377C41058e18682j07156F22635c76598j74922k15765c6362H7848c34735
13856C94520R64421F70840f54954j329466D34361b19521m30771A74422K53753
13847D28175j13475h18799A046151C88878j91780c6896B66363f77596n32784e41395
$$ y = [2231331, 1722025, 820040, 388642, -613548, 1244636, -638935, 676866, 567723, 639215, -1478539, -1404575, -369331, -625521, -182078, -259050, -12221, -674176, -863756, 352834, -218969, -224805, -118418, 129327, -1136365, -268110, -1006015, -571220, -558737, 189998, -477401, -113527, -805756, 1916389, -1135437, 47275, -577175, -949682, -778281, -969135, 748109, -1222178, -426463, -1008029, 469730, -826178, -1271604, -1518395, -544955, -857798, -1070377, 341058, -518682, -625838, 622635, -376598, -551520, -767285, -36362, 87848, -334735, 394520, 1358941, 670840, -654954, -1984420, 434361, -219521, -650292, 174422, 428175, 314700, -818799, 1046151, 388878, 197098, -36896, 266363, -677596, -1210380, -541395]
13836g92088n61291d47848F09512J0835j91643g61648L23213B03432a98942q88569
13826a087511b21868G69888A81217d88173F0169M60940k47571g74355q6583l57938
13816a218876A25541d40604n59765A56798A9731Q53235A05731e72950F62387e94998
13805G3634a955069E80434f09683J59003Q5681m8656k84086o30006L54025F8160
13794a82657j530462c51404A98623c44481A91418L88986d50557j194493Q19592
13785h25458l38965H7903c31023e698k44518F50299b79112b6025r896p94015F25702
13773i41020H18137a195876B210476a18904p71386D12987a126545M84917B4644
13763f52825h7418o29268L02382G46502f47656J4518A68506g09685J2544H08368
$$ y = [-792088, -1353379, -447848, 609512, 620347, 428704, -761648, -438435, 203432, -198942, -1087511, -221868, 769888, 181217, -488173, 60169, 521109, 273538, -774355, -860938, -1218876, 125541, -440604, -1000369, 156798, 19731, 872966, 105731, -572950, 662387, -594998, 73634, -1955069, 580434, -609683, -450680, -364999, -413655, -697741, -1327747, -973722, 68160, -182657, -1713119, -351404, 198623, -344481, 191418, 580404, -450557, -1645050, -825458, -1164423, 87903, -331023, -5698, -250216, 650299, -279112, -26025, -35921, -829936, 625702, -941020, 818137, -1195876, 2210476, -118904, -890290, 412987, -1126545, -641628, 24644, -652825, -87418, -716686, -414304, 746502, -647656, -633138, 168506, -709685, -697141, 808368]
13752a553380c53409E06055a315901b6585B62270A8106l054a429266e98779o01622
13742a200401i526l30221m37691M9293J55763n31735C05083c04396a49868o10566
13732g60434H59472A05267O55801f52472b18019j016268A09469b03332j5825j84351
13722d03508n51259E74063a533799G8860e2845n82331l31399a50675l92224M1504
13712e01395h6254A29487a65255E5909a675801e32265n571l13259I98832f18794
13701D37833a215270E58890a148710D59013A87389K81384M54314i72100j78196
13692a150296A111005d73787K00875f3251n27119j33981A19634f14781n37841
13683a152622l55464f1336B03414N7263q6948i69949H46557d74196B22937F905
$$ y = [-1553380, -353409, 506055, -1315901, -26585, 262270, 18106, 15052, -1429266, -598779, -1200401, -9526, -339747, -777438, -728145, -572382, -1104117, 305083, -304396, -149868, -760434, 859472, 105267, 761068, -652472, -218019, -1234287, 109469, -203332, -219157, -403508, -954767, 574063, -1533799, 78860, -52845, -635176, -966575, -150675, -542899, -501395, -86254, 129487, -165255, 55909, -1675801, -532265, -537836, -851095, 998832, -618794, 437833, -1215270, 558890, -1148710, 459013, 187389, 468773, 923087, -972100, -1150296, 1111005, -473787, -272912, -63251, -590370, -724351, 119634, -614781, -1152622, -1508086, -61336, 203414, 260677, 173729, -969949, 846557, -474196, 222937, 6905]
13672a118430B50462e61632m41568B03685J46116c77254l37313m72422j96654
13663a383643D48877e06975j64550B78050f44837N8993K67894I07805a47222A03114
13652I02874a51053o05622f476n43461l72533L75291k2468K18426C9149h2297
13641a01538r75459F9705i92816C16224c00948F73993g88932j21285A18662J132907
13631A251569a992007b27094J6330F42597A88961Q72209d40147l58885C63277
13621i14089d11681k73678b67550A227738a102260c69270j78192G60303h58229
13611i46830M07378E9718f44028n27347C34467L0958i1134m10006b11346n23092
13601g34438B16736P61951g63054K65723h4656D91459k0159g84036H03987a56909
$$ y = [-1118430, 250462, -561632, -1003200, 203685, 349801, -377254, -714567, -1186989, -1383643, 448877, -506975, -671525, 278050, -644837, -585844, -317950, 907805, -147222, 103114, 902874, -151053, -756675, -6476, -549937, -922470, -547179, -569647, -351221, 39149, -82297, -101538, -1076997, 69705, -992816, 316224, -300948, 673993, -788932, -910217, 118662, 1251569, -1992007, -227094, -210764, 642597, 188961, 1061170, -440147, -799032, 363277, -914089, -411681, -685359, -267550, 1227738, -1102260, -369270, -547462, 760303, -858229, -946830, -539452, 59718, -644028, -1171375, 334467, 365425, -91134, -501140, -211346, -734438, 216736, 978687, -763054, -497331, -84656, 491459, 471300, -784036, 803987, -156909]
13590e80499B40873c00531a22774A94616e96713k88354c10418l48730G63791d41712
13579F3385a237121m53596d53490a14812B31466Q2698a598973A0403J031928f11456
13568e04233a78991n65465B89921d70684a69647k71255A31653L31356c48376l62510
13558g10886j457283C04228a38541q89047M93200K23119a04546k5054D8724M6785
13548I5509d3734a3470A71697e00962l42651D56504A08208J36300g27631D44887
13537G96074B84011Q22516i23574d31798m24901b96153A26871a0709m14087j295013
13527a719809B42949a08503m51150K53033l8840A107737K17324C0466L77493M9199
13517D57158A53525O4438a138208A89561b29425o16648L60434a24014A46702C840
$$ y = [-580499, 240873, -300531, -122774, 194616, -596713, -885067, -310418, -659148, 763791, -441712, 63385, -1237121, -1690717, -453490, -114812, 231466, 314164, -1598973, 10403, 1042331, -611456, -504233, -178991, -744456, 289921, -470684, -169647, -440902, 131653, 463009, -348376, -710886, -2168169, 304228, -138541, -1027588, -534388, -311269, -104546, -129600, 48724, 95509, -43734, -13470, 171697, -500962, -843613, 456504, 108208, 244508, -727631, 444887, 796074, 284011, 1106527, -923574, -431798, -856699, -296153, 126871, -10709, -424796, -1719809, 242949, -108503, -559653, -306620, -345460, 1107737, 1325061, 30466, 407959, 457158, 153525, 217963, -1138208, 189561, -229425, -846073, -485639, -124014, 146702, 3840]
13506a250896A130954a406467A53830P00628B65100b30990I94530a06064A72507
13496F63211k15453n1896a451074e80595B66529E0011R78609n12062j29518g29835
13485i98149j39557C13893J35039B05540f55598k77687J40583E2008f91321B03843
13474b06593m47007q95981e99372E44102c84571j28990A417699B08838d00655
13464a370894f49055a95436m13177J91118E0704O19262K43219i175j57454E45321
13453b37862e1247G2071f34251A539335B51288e75272K45336l14975K20170j6941
13443d41682l49134c05689j49237a16057m1213m12211A022304m87170B637h7848
13432G81490a99654A210684b33372E81946a29453q4412A08859a200717D02843
$$ y = [-1250896, 1130954, -1406467, 153830, 854458, 265100, -230990, 994530, -106064, 172507, 663211, 447758, 395862, -1451074, -580595, 266529, 50011, 1028620, 516558, 387040, -729835, -998149, -1137706, 313893, 448932, 205540, -655598, -933285, -792702, 52008, -691321, 203843, -206593, -653600, -1549581, -599372, 544102, -384571, -513561, 1417699, 208838, -400655, -1370894, -649055, -195436, -608613, -417495, 50704, 669966, 913185, -9175, -166629, 545321, -237862, -51247, 72071, -634251, 1539335, 251288, -575272, -329936, -644911, -424741, -441682, -790816, -305689, -454926, -116057, -157270, -569481, 1022304, 535134, 2637, -87848, 781490, -199654, 1210684, -233372, 581946, -129453, -213865, 108859, -1200717, 402843]
13422B55898a30115C24168c42065a35230r04672a81093n67664k71916D84884A27460
13411d18932j11442I07972C8791f96345c21539D6120L69772K14518c23427l28700
13401f52127o75231a3382H37347a15596j210454G62610b21039r26858G52544j19582
13391F32962k93644F2014M18734i18447h4362F68343c55969A166131I2201f2808
13380f30558K63652J55672p65456M43293A60021Q37845I0103O20970f71175h1367
13369d20085j11829k30085a29701j123549L57728E3929i28025A391604A16458
13359D22915K8981J11241a774345f821j54021A9151a24413a9221p65301c48738
13348F70698f57209G48477a80603B75237e26091r6393D45807d99977q74651i2134
$$ y = [255898, -130115, 324168, -342065, -135230, -1039902, -181093, -748757, -1020673, 484884, 127460, -418932, -530374, 907972, 38791, -696345, -321539, 46120, 415892, 630410, -323427, -652127, -1327358, -13382, 837347, -115596, -1326050, 762610, -221039, -1147897, 752544, 632962, 339318, 62014, 480748, -918447, -84362, 668343, -355969, 1166131, 92201, -62808, -630558, -366906, -211234, -976690, -533397, 160021, 997866, 90103, 711073, -671175, -81367, -420085, -531914, -761999, -129701, -1253250, -895522, 53929, -928025, 1391604, 116458, 422915, 451896, 563137, -1774345, -6821, -160842, 19151, -124413, -19221, -784522, -348738, 670698, -657209, 748477, -180603, 275237, -526091, -622484, 445807, -499977, -1374628, -92134]
13337a86926n02831a16975q72526c83080C36846g17827a77817C31301i331F62590
13326d8352I435N54069c43j497689H6248L37780g75829a46473j143494e65314
13315c17596p52642N07920l2410b69704C7949L01425L9637J80329B14467Q0967
13305B95434a393726H47312D00964g17592b39295A7467L38151d19936H51711k98863
13295E52848a082361F66057C26142a018524M5084A94037B0700J09975e48174P5778
13285d72396n48436A175596b95674k75292A954615H43001c13386j08766j028154
13276a450306B56872e20565j5967b40299H49445d4022n96805j25276K98949o29869
13266a097023b9643m72256b28277N6207j706650G61597A49467a181565B38848
$$ y = [-186926, -689757, -116975, -989501, -383080, 336846, -717827, -177817, 331301, -9331, 662590, -48352, 9435, 563504, -343, -1498032, 86248, 424028, -775829, -146473, -1289967, -565314, -317596, -1070238, -562318, -594728, -269704, 37949, 339374, 379011, 559340, 214467, 295434, -1393726, 847312, 400964, -717592, -239295, 17467, 355618, -419936, 851711, 552848, -1082361, 666057, 326142, -1018524, -973440, 194037, 20700, 130675, -548174, -472396, -1020832, 1175596, -295674, -570966, 1954615, 843001, -313386, -422152, -1450306, 256872, -520565, -536532, -240299, 849445, -44022, -640827, -766103, -467154, -1097023, -29643, -501899, -228277, -172070, -1878720, 761597, 149467, -1181565, 238848]
13256c24179o58036b99216k45664D00619k9007A48631Q97522h99922B39328a138057
13245i9287A535423f3459r94633A04208a180690A327590F20372k86505A28054
13235f58476E81311i20585A028274g04762a30816j26506i4313J4670j10797B9099
13224a073656C83486R7147A79579M24017b8400n62662H715O42572k0404Q5028
13214G15911j20802a193251b57830p30150b11213q5267k41748B03405K47846i9535
13203h40208G9896a170348a10965j331377A88029b25838B73023J3809N98168l89005
13193D95995h33943c63659D34962e76820R480K3250B66166c05719D98173A98818
13182C22189b41309H05807f02885B98564h31934L82482F6313K50055f40857r82419
$$ y = [-324179, -982215, -299216, -544880, 400619, 371612, 148631, 1046153, -899922, 239328, -1138057, -99287, 1535423, -63459, -1058092, 104208, -1180690, 1327590, 620372, 333867, 128054, -658476, 581311, -920585, 1028274, -704762, -130816, -257322, -94313, -79643, -190440, 29099, -1073656, 383486, 480633, 179579, 603596, -28400, -591062, 8715, 651287, 630883, 715911, 595109, -1193251, -257830, -987980, -211213, -296480, -538228, 203405, 451251, -99535, -840208, 79896, -1170348, -110965, -1442342, 188029, -225838, 273023, 286832, 885000, 495995, -833943, -363659, 434962, -576820, -567340, -544090, 266166, -305719, 498173, 198818, 322189, -241309, 805807, -602885, 298564, -831934, -449452, 66313, 316368, -640857, -1623276]
13172a623276d69184F67296f0261B39078F6230a240636d06225A237339a35527
13162A86879L49062J81730a454176H37870b89830d786D94632e72071a61441r69352
13152a130793B19884c14628I30677h18803E04757K41324A18247M20977i2898j087483
13142a180381A155740g9446G65476g84742I27472l51266e3412j572798B35131
13132a10727K6095A41024j9482b99508j57133q8208D55402a043985A48873E4666
13121a335344M93083G11339b75735E11545g77040E7738L72584a93611A257424
13111a28712k2469D54611i73681Q684B99392M84544r0393c08158G0440g02124
13100F30096k28715j16122R72130a290994K27778D75357q6838F6190J88022O0021
$$ y = [-1623276, -469184, 667296, -60261, 239078, 66230, -1240636, -406225, 1237339, -135527, 186879, 535941, 717671, -1454176, 837870, -289830, -4786, 494632, -572071, -161441, -1130793, 219884, -314628, 930677, -818803, 504757, 746081, 118247, 539224, -92898, -1180381, 1155740, -79446, 765476, -784742, 927472, 576206, -53412, -1626210, 235131, -110727, -84632, 141024, 121542, -299508, -456641, -544849, 455402, -1043985, 148873, 54666, -1335344, -842261, 711339, -275735, 511545, -777040, 57738, 430322, -193611, 1257424, -128712, -151181, 454611, -973681, -964997, 299392, 783936, 693543, -308158, 70440, -702124, 630096, 401381, 285259, 1257389, -1290994, -1063216, 475357, 388519, 66190, 254212, 314233]
13090C14233g98101L13846I829e30775B02152e42861a19669o73883c5294C7852
13079a201933e83070o06467l21752e27587A86971K66112q8653a219153L01990
13070i17163e8552k34282p3876n86771M64179j29628E45387B19249O92172a046867
13059E96497b25528Q5879A17929O063d52810k26805j64398C44845J461417I5094
13048d75804b02389n41888K92498D75122f80953D15744J19472a4232E09251h22635
13037a331547a23262H33883a63064I45890e09499A010947h82755J93904A195738
13027a9986C43928r1798j23789i00312H51142e48390K02153q73483B65368e43215
13016e5159l66155A23768a088159b5765m84161A414h17075b68171l09207D16785
$$ y = [314233, -798101, -484255, 9829, -530775, 202152, -542861, -119669, -793552, -35294, 37852, -1201933, -583070, -1189537, -1511289, -527587, 186971, 453083, 364430, -1219153, -917163, -58552, -292834, -366710, -953481, -489302, -618930, 545387, 219249, 911421, -1046867, 596497, -225528, -139649, 117929, 123992, -452810, -679615, -844013, 344845, 1806262, 95094, -475804, -202389, -744277, -451779, 475122, -680953, 415744, 535216, -14232, 509251, -822635, -1331547, -123262, 833883, -163064, 945890, -509499, 1010947, -882755, -688851, 1195738, -19986, 343928, 252130, 128341, -900312, 851142, -548390, -346237, -1219720, 265368, -543215, -55159, -421314, 123768, -1088159, -25765, -509926, 1414, -817075, -268171, -577378, 416785]
13005a96256k68263A030323m16002b5574B45591P23663B27896P97273A46742h83570
12994h81551E73871d02159l65886L2241E60386b79789P0262m40182C68255d83134
12983a027874B18783i62636A46659K80431a72983H18801k81216h2271p01729p18090
12973a502090D06153K34179A12071b42807A399272A92150R52209f1420K3912j240430
12963a277938e59292A78935K303O55167l08063A03312J02970c56799l36385K83417
12953d09767f5816J9937p48187a09165n204C03450a94568E23056J005442c91218
12942c37632j26511K07293I12572a74330R664j23441G9602b50213m55765m32840
12932a138818B44559c12818a37414e2583a9811A221115e95441a24037j321565
$$ y = [-196256, -464519, 1030323, 614321, -25574, 245591, 969254, 227896, 1025169, 146742, -883570, -881551, 573871, -402159, -768045, -735804, 560386, -279789, -209527, -649709, 368255, -483134, -1027874, 218783, -962636, 146659, 427090, -172983, 818801, 537585, -82271, -784000, -1502090, 406153, 640332, 112071, -242807, 1399272, 192150, 1144359, -61420, -37508, -1277938, -559292, 178935, 181238, 836405, 528342, 103312, 206282, -356799, -693184, -409767, -65816, -45879, -794066, -109165, -114369, 303450, -194568, 523056, 1528498, -391218, -337632, -464143, -256850, 912572, -174330, -164666, -288107, 79602, -250213, -705978, -1138818, 244559, -312818, -137414, -52583, -19811, 1221115, -595441, -124037, -1445602]
12923a445602K96770A164634E53536c24531I54172h74134J86149e954j520780
12914a526734A43421J93082f30101r2127N6492a41572j99878I5657c1944r46810
12904i78754M86876a85037M3432m41509j83524m73777C58071a254960b21389A78882
12893I08173h88087K83613K18285k49C09774a315133J8438D88282g70720L47339
12883d23381D11815d88455g5961j503635N97598C01480J34326O0827d25486C7436
12872B14952J83510c17202G9543L55941M41938L98128a014097k6767F96165a36412
12861h71241A69958Q1543K01420a321421e4356B78960P20139a55892B66710g42313
12850B09247J39005K26895k48403O4444e76237a28283b9011A2956b04454B87642
$$ y = [-1445602, -1148832, 1164634, 553536, -324531, 954172, -874134, -687985, -5954, -1526734, 143421, 336503, -630101, -722228, -665736, -141572, -341450, 95657, -31944, -978754, -491878, -185037, -141605, -583114, -766638, -1240415, 358071, -1254960, -221389, 178882, 908173, -888087, -604474, -386189, -386438, 309774, -1315133, -1296695, 488282, -770720, -423381, 411815, -488455, -75961, -1579596, -981998, 301480, 435806, 496633, -425486, 37436, 214952, 398462, -317202, 79543, 435484, 877422, 1275550, -1014097, -1040864, 696165, -136412, -871241, 169958, 251501, 452921, -1321421, -54356, 278960, 999099, -155892, 266710, -742313, 209247, 348252, 575147, 326744, 391188, -576237, -128283, -29011, 12956, -204454, 287642]
12839B4382J576045n67903B54792c56115B45465a435798D11292g42030B47527
12829A04760a270073L75903j42292L30016j86788I88531A53786b4037m12586J11904
12819c24719D3521a64090j18169c1796D56353b29861A265995D06635f46912G65155
12808A39029O33930a150089J04060c94187C14795O0870d14269A640734a028886
12798E84326J270876A57197P43100A53669M62335c37356B09396L46476i426q77171
12788h86597M41057a34215n47106b45547L2626C18668q496b26486l60013a17337
12777i4849n63752J33508B37307h46134H79134B04027f01760K66136o03841E62502
12766d06841l96912E4895h99656M42242I70333a036421a63589l06031D13287a095
$$ y = [24382, 1600427, 1032524, 254792, -356115, 245465, -1435798, 411292, -742030, 247527, 104760, -1270073, -894170, -1036462, -706446, -893234, 988531, 153786, -24037, -436623, -324719, 43521, -164090, -282259, -31796, 456353, -229861, 1265995, 406635, -646912, 765155, 139029, 772959, -1150089, -1046029, -394187, 314795, 375665, -414269, 1640734, -1028886, 584326, 1855202, 157197, 900297, 153669, 616004, -337356, 209396, 555872, -9426, -886597, -445540, -134215, -681321, -245547, -212921, 318668, 310172, -226486, -586499, -117337, -94849, -658601, -525093, 237307, -846134, 879134, 204027, -601760, -335624, -939465, 562502, -406841, -803753, 54895, -899656, -457414, 970333, -1036421, -163589, -469620, 413287, -1095]
12755c70867C15624K66097B19470a267638d62449F99719a083935a87214k44514
12746d31728F4690h55812D16311K32560h0007D23133D2071a15411B5200c99713
12735A399940M82213h52056l26225A63552e5218E79606c3687o53484a6667A58358
12724e3946I17554c08163q30804D71457a214061c79760l12474b92538j156752
12715a449290A64610a68995E63519e79074A466125b01362A128088b08112G13117
12705B19626c90440p47271b28136l72646i6622o85756m45276e86615G08869C404
12694h20950J52343H39036d16853o35379a77391p7739A0894L90638a152689M30874
12684g21815o82380N77584K81325b45350G9586a087545b39696l42428C93722j72534
$$ y = [-370867, 315624, 581721, 219470, -1267638, -462449, 699719, -1083935, -187214, -431728, 64690, -855812, 416311, 648871, -80007, 423133, 42071, -115411, 25200, -399713, 1399940, 1882153, -852056, -1178281, 163552, -55218, 579606, -33687, -687171, -16667, 158358, -53946, 917554, -308163, -1138967, 471457, -1214061, -379760, -692234, -292538, -1449290, 164610, -168995, 563519, -579074, 1466125, -201362, 1128088, -208112, 713117, 219626, -390440, -1137711, -228136, -600782, -96622, -782378, -1227654, -586615, 708869, 3404, -820950, -668607, 839036, -416853, -1052232, -177391, -255130, 10894, 401532, -1152689, -721815, -1404195, -826611, -545286, -245350, 79586, -1087545, -239696, -582124, 393722, 221188]
12674B21188f46834G37457g5234l37203C00426d43153r52593e9738j88326I99192
12663B90203b44467F95960a284044m73372F90075g31549c15024p39791c53089
12653C14286c68251b1732h830l97652j388878f13292J45008N1405a40097e3661
12642b27347m97031A146948g81223J4580l58766H3958a67316C60508N32550m01686
12632D91372O51186l79518l56318e89463l03075A187193e21010E88796O48383
12623A237179g25605C02518M73772k77416f41364j098558k49405P54840H46458
12613A177345d95537A014831i13666L85184A15858K27880e67832J51535A7789
12603a48310n13785A331131M68052c84519g2627l05993o22278H9323h45657l11677
$$ y = [221188, -646834, 737457, -75234, -412437, 300426, -443153, -1395746, -59738, -248064, 999192, 290203, -244467, 695960, -1284044, -1757416, 690075, -731549, -315024, -1054815, -353089, 314286, -368251, -21732, -8830, -406482, -1795360, -613292, -468284, -416879, -140097, -53661, -227347, -724378, 1146948, -781223, -766643, -1125409, 83958, -167316, 360508, 893058, 491372, 1142558, 763040, 406722, -589463, -892538, 1187193, -521010, 588796, 1237179, -725605, 302518, 776290, 498874, -641364, -1739922, -1989327, -1234487, 846458, 1177345, -495537, 1014831, -913666, -528482, 115858, 343738, -567832, -416297, 17789, -148310, -662095, 1331131, 1799183, -384519, -72627, -378620, -1000898, 89323, -845657, -1157334]
12593a157334C38547d10363F29119N23894m64815g24015J45871C31467J62249
12584D93716l4996a535614A008237b5406n57139A135847a36443A438182h42066
12574a14593E78688i33232a81108p7073A36611O24134c13537e1144r88682C03440
12563C13022k7657A08688b11546H44451c47459E18765j12819j96266K15959h69270
12552g57535G56187A43387D9298M98151g68723I9353R78278B41366a83936l24308
12542e08244A799h72475c87251G25839l04885J94129e34672n67431a34152l04305
12532d38457q26721e00095l0557a43298E77799R72759p73457l07999b63j020132
12522a020395d67311I29930i2461A336027A95084f74849h618j45783F45333k94739
$$ y = [-1157334, 338547, -410363, 629119, 1153013, 688198, -724015, -578144, 331467, 493716, 458720, -1535614, 1008237, -25406, -582545, 1135847, -136443, 1438182, -842066, -114593, 578688, -933232, -181108, -258181, 136611, 760745, -313537, -51144, -1039826, 303440, 313022, 285365, 108688, -211546, 844451, -347459, 518765, 405946, 209680, 425639, -869270, -757535, 756187, 143387, 49298, 547449, -768723, 99353, 1077631, 241366, -183936, -508244, 1799, -872475, -387251, 725839, 420954, 615083, -534672, -1102103, -134152, -438457, -1265178, -500095, -530652, -143298, 577799, 1550558, 777101, 469102, -263, -1020395, -467311, 929930, -92461, 1336027, 195084, -674849, -8618, -154401, 645333, 350594]
12512C50594J7124K14453K47068b94112B02488M27252e21569K13406c9358C6098
12501c06290j12230G12522b26007j321147b89603F30872a074326J2500B82144
12491b08729a584H9329N02995m25Q5521f62034D04732J45942i55839c2036L875
12480b8161o59206H77198b56912C54113K40195h71231E43691D0585J1543J25002
12470A77130b47253F23773a011612A8368M25492H7375c10923G36534d60473a60835
12459c30894a30258D07636d75956C19318j31269K9852h58684I72809A7524K11875
12449B29399J020274G2649a321770L46917H47971e47984A224871A58101a25686
12439d28760D63795c00199O6278D18649a69918k110189d36685q79792G48050a00356
$$ y = [350594, 367718, 582171, 829239, -294112, 202488, 629740, -521569, -308163, -39358, 36098, -306290, -418520, 712522, -226007, -1547154, -289603, 630872, -1074326, -1061826, 282144, -208729, -1584, 89329, 592324, 591899, 677420, -662034, 404732, 550674, -955839, -32036, -28161, -687367, 877198, -256912, 354113, 594308, -871231, 543691, 40585, 52128, 177130, -247253, 623773, -1011612, 18368, 443860, 87375, -310923, 736534, -460473, -160835, -330894, -130258, 407636, -475956, 319318, 188049, 217901, -858684, 972809, 17524, 229399, 1249673, 72649, -1321770, -974853, 847971, -547984, 1224871, 158101, -125686, -428760, 463795, -300199, -233921, 418649, -169918, -2280107, -436685, -1316477, 748050, -100356]
12428I18765b9679j631314D60266M30679a274058G66954f0071C92011a78571l52348
12418e30919g1254A82757P18954A55786L68606o4149a95880B37099m902c04507
12407a372029C41379M80986a300316a83102I23259A3657Q891L04121I2719M15746
12397E08465M20808A83558i17812J39032B68089L93717K22078a50567j40016O2981
12387b27602k34387b01590k98319l40423H53297D20941K39033f09660E72494K07329
12377G79823C50574A55663a000142A152611A95659g94327b76443m39651C97044
12367g82146k45075A066585C85275b60564G18217c34714B46298a391958J36252
12358a255706a35881C56354N31341l03355K1894c06169F99075f31530n18732I36058
$$ y = [918765, -29679, -1660993, 460266, 890945, -1274058, 766954, -60071, 392011, -178571, -530919, -71254, 182757, 901711, 155786, 524392, 460243, -195880, 237099, 232197, -304507, -1372029, 341379, 822365, -1300316, -183102, 923259, 13657, 22548, 326669, 92719, 508465, 929273, 183558, -917812, -778780, 268089, 661806, 883884, -150567, -290583, -227602, -461989, -201590, -499909, -840332, 853297, 420941, 659974, -609660, 572494, 779823, 350574, 155663, -1000142, 1152611, 195659, -794327, -276443, -716094, 397044, -782146, -1027221, 1066585, 385275, -260564, 718217, -334714, 246298, -1391958, -1255706, -135881, 356354, 887695, 584340, 606234, -306169, 699075, -631530, -1150262, 936058]
12347c02400B01281a102504o80030c13281C80107f40083a85248j48047A060234
12337B26578a54153C38239a258194F49861f11338C7294e0027O40p30379b43172
12326A280853a310853A112785h38676j91740L09817K90035G3317P43211e27709
12316b91991A561763A97707p8612O03590k6701i5830n06940C23036M37045P23873
12306A483954n19400a370364H81596d61966m496R0210J76820m35727a19883B93464
12295A565194g55437e4898q56370d6344j82768A75041O0082a071295D76780b74549
12284H54900l11800N60599l45796B39039c03271i4792m68313j296431d36983H13903
12273a385591O20369F78915Q601a311902E34803N3434k19209A06765L4477o3722
$$ y = [-302400, 201281, -1102504, -1782534, -313281, 380107, -640083, -185248, -333295, 1060234, 226578, -154153, 338239, -1258194, 649861, -611338, 37294, -50027, -49387, -779766, -243172, 1280853, -1310853, 1112785, -838676, -1030416, -720599, -430564, 73317, 816528, -527709, -291991, 1561763, 197707, 119095, 722685, 695984, -95830, -602770, 323036, 760081, 1483954, 964554, -1370364, 881596, -461966, -466462, -376252, -199432, -635159, -119883, 293464, 1565194, -755437, -54898, -911268, -46344, -229112, 175041, 235123, -1071295, 476780, -274549, 854900, 543100, 1103699, 757903, 239039, -303271, -94792, -563105, -1859536, -436983, 813903, -1385591, -765222, 678915, 687516, -1311902, 534803, 588237, 369028, 106765, 141242, 77520]
12263G7520J413069h11410H6675e94070j60559B44462b05687D56279A05588R49
12253A06537e45869a58411j290710A58007d5956m51838j06469d1410G7848c50619
12242D94592c98370m08093D44501a11353F05398L70741i2730F40958A14204A0924
12231F16166N9416a204470b40689k86709b7749r40765A0898K14295g81184A60741
12220a146390c6071E58061a40757j01268a360m86214q09395G786K74558c3223
12209D72420d81577J10534l64862E95672A4907g86074b65758l48017C162i2652
12198a73865A079348i7225o52361L19033K8517A962926B88037R5485n1768d85918
12187c49534G07063a07899F00311a09623B28731b90533j78126B67722a106304
$$ y = [77520, 1490589, -811410, 86675, -594070, -754629, 244462, -205687, 456279, 105588, 106537, -545869, -158411, -1449121, 158007, -45956, -497794, -604263, -41410, 77848, -350619, 494592, -398370, -806463, 444501, -111353, 605398, 976139, -92730, 640958, 114204, 10924, 616166, 675582, -1204470, -240689, -527398, -27749, -968514, 10898, 225193, -781184, 160741, -1146390, -36071, 558061, -140757, -242025, -1360, -487574, -1296969, 7786, 282344, -33223, 472420, -481577, -371043, -735905, 595672, 14907, -786074, -265758, -613775, 3162, -92652, -173865, 1079348, -97225, -749586, -430553, -402036, 1962926, 288037, 383522, 331754, -485918, -349534, 707063, -107899, 600311, -109623, 228731, -290533, -468659, 267722, -1106304]
12177f1458G0154a47623a1460k58745a32914k49540G75308a98518G96961e72463
12166B07353f2808B02170n8595e14024k56692j6817J31743K70957n10571B83819
12155F87018d94971C98975R2530D3477L4974N26250f38822E28760c94110k29822
12145f23932G5188a262930M28420b28511B69984e28427B41511K28041a38534C30890
12134a63353D39256e17750j067249D22753c00427C6461c41864o90656F23893b00531
12123d48158C70498K06617c20063Q8094B7771g35282d7592B6667a216101o08735
12113a824836c30587R3761J11823j090091K59834l1397k6207c93436i0336p47903
12103h38239b51863J13024n84096A283285c20760R4733M8594F675N45361K21028
$$ y = [-61458, 70154, -147623, -11460, -270205, -132914, -382454, 775308, -198518, 796961, -572463, 207353, -62808, 202170, 143575, -514024, -770716, -787533, -655790, -384833, -895404, 283819, 687018, -494971, 398975, 491505, 43477, 78451, 604701, -638822, 528760, -394110, -623932, 75188, -1262930, -834510, -228511, 269984, -528427, 241511, 469552, -138534, 330890, -163353, 439256, -517750, -1584999, 422753, -300427, 36461, -341864, -1032520, 623893, -200531, -448158, 370498, 577115, -320063, -231969, 27771, -735282, -47592, 26667, -1216101, -1824836, -330587, -236826, -125003, -1215094, -955260, -986657, -1012864, -393436, -90336, -838239, -251863, -138839, -722935, 1283285, -320760, -226027, -177433, 6675, 552036, 773064]
12093G73064j61238A25094i29520H12327b70263N9515l188A36126e86787f2044
12082C29541K84494j73449g0989A45935c99074C71699b213736g36778A393167
12072C45938a028063o26269e27120E88792b63784E92570a25431k17399F00867
12062A82759K71498A82263H1331Q17547b40379p01374K47393h4067k59638I01880
12051e69201G82052d48560j619429J013686d45310E86642k37764f62696l36190
12042i98886a85097j166541b34912A7245b60181A53037b78240B73056J25994j51321
12032B47729h12769A112947e8065F58307A00850B9778J91639d4278r11410a81550
12021E74473f88328G8063g48113e7380n8950q48496E03700b4611F41347J95366
$$ y = [773064, 611826, 125094, -929520, 812327, -270263, -210748, -213936, 136126, -586787, -62044, 329541, 614035, 440586, -70989, 145935, -399074, 371699, -2213736, -736778, 1393167, 345938, -1028063, -1654332, -527120, 588792, -263784, 592570, -125431, -342830, 600867, 182759, 454257, 182263, 81331, 898878, -240379, -941753, -694360, -84067, -343705, 901880, -569201, 782052, -448560, -2067989, -1054303, -445310, 586642, 348878, -662696, -998886, -185097, -1351638, -234912, 17245, -260181, 153037, -278240, 273056, 399050, 247729, -812769, 1112947, -58065, 658307, 100850, 29778, 221417, -44278, -955688, -181550, 574473, -688328, 78063, -748113, -57380, -116330, -964826, 503700, -24611, 641347, 836713]
12011H36713c81384a3763E12213i15880A73496J500929a781194c24129m3728c6013
12000H88658a002824H64344d04690g0680I77887k69487b2961C57036f84784j48186
11990h32970l67021b75259l78022A439353d29399I88730J84688e69687b20807
11980d41711r9778k9583o6849E645O6158c42280D09316a62241E61934j81767N27679
11969I07846c06595f9428n30316K31659I33641e62127B77083J103603n43111C77854
11958c81285l28202J8839N3952c04340a39734D78935g26054c02416D81040d12992
11947A19546N41956c02804k48870A66542e89513I71758A28981N13292K40109a82719
11936a159761I48172m875c95887J88807H04810a35978B5104K72309N60485f09551
$$ y = [836713, -381384, -13763, 512213, -915880, 173496, 1674425, -1781194, -324129, -367857, -36013, 888658, -1002824, 864344, -404690, -70680, 977887, 708400, -22961, 357036, -684784, -832970, -1199991, -275259, -653281, 1439353, -429399, 988730, 1173418, -569687, -220807, -441711, -541489, -571072, -637921, 5645, 71803, -342280, 409316, -162241, 561934, 380167, 907846, -306595, -69428, -599744, -368085, 933641, -562127, 277083, 1380686, 837575, 377854, -381285, -709487, -690648, -636696, -304340, -139734, 478935, -726054, -302416, 481040, -412992, 119546, 661502, -302804, -551674, 166542, -589513, 971758, 128981, 642273, 882382, -182719, -1159761, 948172, 943297, -395887, -207080, 804810, -135978, 25104, 297413, 857898, -609551]
11925d79824K3522I9605d12703G18191H6783h01047G2747f9960o87341G27904
11914d65433G51564c3353q41177c12290A59548h53234F84539M18299B10683c54924
11903D53652g71881I51599a86103A271181a81802k310443a79740A445100h43745
11893c23799C79383C453a184728A70808f8098C6492M71940a267772G57609b93172
11882b67587p54469F33276A27162K83429h32302C08174n6868A13083J07802i9918
11871h64617K81458a10429G84376d43875c9207o12603n287J4400L13979q4776
11861d13494D53829a204156d81876a44939j73188D92471B27064J62488g09665
11851C46025P45831g2803l19674A1527P20809j44897j5694j99035d06976D32667
$$ y = [-479824, -456302, 99605, -412703, 718191, 86783, -801047, 72747, -69960, -757301, 727904, -465433, 751564, -33353, -874530, -312290, 159548, -853234, 684539, 1102838, 210683, -354924, 453652, -771881, 951599, -186103, 1271181, -181802, -2492245, -179740, 1445100, -843745, -323799, 379383, 3453, -1184728, 170808, -68098, 36492, 508432, -1267772, 757609, -293172, -267587, -1022056, 633276, 127162, 410591, -832302, 308174, 251306, 113083, 220885, -99918, -864617, -583159, -110429, 784376, -443875, -39207, -651810, -657097, -642697, -328718, -413494, 453829, -1204156, -481876, -144939, -318127, 492471, 227064, 389552, -709665, 346025, 1091856, -72803, -392477, 11527, 732336, 587439, 571745, 372710, -406976, 432667]
11840D80696O60224l32271b21522n96055q93353b44162A34467g62083B98319c5330
11829g13986a82202B78792i7939r1213j37918I21964b86958B32335d13335F5346
11818C28443a90278C8798g70165o74597f70976j63654H20103d64735J32569p36925
11808a069091C58698B6144e04396J27035a27799E17057i99069A48674c99632C99525
11797h13249c3328E95553K37138k4541A67832a010429J86681l63583M11766D0221
11786A40853c37683A43330M59548f12342J28056D13013e75734A010742m18875
11777E91867g2426F12708k03234O84044h4254I70822i21288M54601b05834H67689
11766A186728A33583g6617B51500g45100B53814c21327C1773R18391d46027I74102
$$ y = [480696, 1140920, 808649, -221522, -817577, -1710930, -244162, 134467, -762083, 298319, -35330, -713986, -182202, 278792, -97939, -189152, -327070, 921964, -286958, 232335, -413335, 65346, 328443, -190278, 38798, -770165, -1444762, -670976, -834630, 820103, -464735, -332166, -1069091, 358698, 26144, -504396, -377361, -127799, 517057, -999069, 148674, -399632, 399525, -813249, -33328, 595553, 832691, 808150, 167832, -1010429, -823748, -1187331, -775565, 40221, 140853, -337683, 143330, 602878, -612342, -484286, 413013, -575734, 1010742, 591867, -72426, 612708, 409474, 1093518, -84254, 970822, -921288, -466687, -205834, 867689, 1186728, 133583, -76617, 251500, -745100, 253814, -321327, 31773, 950164, -446027, 974102]
11755g55004b62155E07530A41212a8870r26428a32576j22093G33842K69259D08660
11744G00211k73698c09403F4633f4462l10093p91328c41270B46027a015906m4074
11734a059980J33290D10116b23171D70805j35621A918a290906A98600L60484A69130
11723A601725p53849a175338c69820j22579j541213a09997G95131k02427E0483
11713B87733j36044a118026b0087A06348h66005c46888G53362n1048k26638Q6860
11703E62536h83482L73120F19972A92308L38438a388416G8333d35210l2114g6455
11692B87033j16285i94981c09932j385281h19180c55416H93283E1060K50398A00791
11681A53897d27287r36144a04981B23865a134120M24213e8718l75551B31279i33207
$$ y = [-755004, -262155, 507530, 141212, -18870, -945298, -132576, -254669, 733842, 1003101, 408660, 700211, 426513, -309403, 64633, -64462, -374555, -1165883, -341270, 246027, -1015906, -1059980, -926690, 410116, -223171, 470805, 335184, 1918, -1290906, 198600, 559084, 169130, 1601725, 847876, -1175338, -369820, -492399, -2033612, -109997, 795131, 592704, 50483, 287733, 151689, -1118026, -20087, 106348, -866005, -346888, 753362, 702314, 475676, 562536, -883482, -510362, 619972, 192308, 530746, -1388416, 78333, -435210, -467324, -76455, 287033, 170748, -994981, -309932, -1695213, -819180, -355416, 893283, 51060, 301458, 100791, 153897, -427287, -1363431, -104981, 223865, -1134120, -709907, -58718, -434269, 231279, -933207]
11670A41736a4180n96892A011698B4903d96410p9910a53229n21975l00661B61933
11659h8578A83956d85433f488m13318j64529F59178e37074C33796f70157i7199
11648f16749B78100K03980a043976c11718A005427d05582e537C7216a73773E69650
11637B51106Q73991B82352M05059f46345K96698F08426N2859a03558M458j35865
11627b34965j092967E63770h65861B35753M27019L05874a02022l84818D16037
11617a48957n23956N4032J30999F96248e05211E24464A48769e14093C58721H120
11606f94589K5443g7050C93521b78087j120088c67964A56454P14891a41057m0168
11596a81225C70340j58728e76112G98162j31780j07718a52865B28028a195679
$$ y = [141736, -14180, -611072, 1011698, 24903, -496410, -576320, -153229, -675204, -975865, 261933, -88578, 183956, -485433, -6488, -419806, -584335, 659178, -537074, 333796, -670157, -97199, -616749, 278100, 482080, -1043976, -311718, 1005427, -405582, -5537, 37216, -173773, 569650, 251106, 1125097, 282352, 687411, -646345, -349647, 608426, 661285, -103558, -99100, -234965, -1327932, 563770, -865861, 235753, 662772, 968646, -102022, -486840, 416037, -148957, -672913, -618881, -487882, 696248, -505211, 524464, 148769, -514093, 358721, 8120, -694589, -669146, -77050, 393521, -278087, -1398175, -367964, 156454, 871345, -141057, -181225, 370340, 211612, -576112, 798162, 666382, 558664, -152865, 228028, -1195679]
11586A101007A41228L7348d64552G9861L00427a82257A199520b23748j09389o3357
11576c96494A62860c55160o55546A366163D04287a065178J95027L83463G6576
11566E74415J508854G65141A79047Q26407K09302b19227b5887n80619h2922G29618
11555d29322J21095k80601B06837J39982a116336e11240o39129I68889a387235
11545a74060n51500H93688A88789a614430g38398N3318j67262F4744L31237a426595
11534f62940k39082G4932J37628e36063G70838d13855C09655a372491D60074O116
11524D66190N92845a33557L6274k23117p76136M98562C52513b98962h2259q71425
11514i53684A034874e00242P8855J05657F29602K91379l07433b84756m80501B22194
$$ y = [1101007, 141228, 178576, -464552, 79861, 380288, -182257, 1199520, -223748, -333137, -396494, 162860, -355160, -1010706, 1366163, 404287, -1065178, -870151, -486688, 76576, 574415, 2083269, 765141, 179047, 1005454, 1214756, -219227, -25887, -606506, -82922, 729618, -429322, -308227, -588828, 206837, 346819, -1116336, -511240, -1150369, 968889, -1387235, -174060, -725560, 893688, 188789, -1614430, -738398, -685080, -852342, 64744, 395981, -1426595, -662940, -902022, 74932, 212560, -536063, 770838, -413855, 309655, -1372491, 460074, 466190, 1059035, -133557, -97283, -320400, -1096536, -597974, 352513, -298962, -82259, -953684, 1034874, -500242, -421387, -315730, 629602, 920981, 613548, -284756, -765257, 222194]
11503a05407C60929b16687a03961j14860j90024j27702A65999e22001C20521m2867
11493B77654P05599b77080n71881A43997i18011D36230g75625b48614c785D85251
11482C73765c37177d8230j576787C98108j06267J45750a110999j05411F53717
11472a628671D6683a235585B28791c55420j05721j28775C21291M7096a93804o84039
11462h77843a0646r3759E10413k14144F5158f73133j059521H6523d5566m361n52840
11451f02767K98676E99106d86964A148054f9863p94239b95776n85498L8276l55153
11441a198151q46270A3499R22174g44133k92983c46868J8058E74870i55242d72751
11430g78904o93450m3133A0610J177774e2794j52163C42939b06413o40484b38597
$$ y = [-105407, 360929, -216687, -103961, -218821, -408845, -536547, 165999, -522001, 320521, 277654, 983253, -277080, -848961, 143997, -918011, 436230, -775625, -248614, -3785, 485251, 373765, -337177, -48230, -1625017, 398108, 291841, 437591, -1110999, -1216410, 653717, -1628671, 46683, -1235585, 228791, -355420, -461141, -589916, 321291, 368387, -193804, -877843, -10646, -104405, 510413, 296269, 65158, -673133, -1732654, 86523, -45566, -49927, -602767, -304091, 599106, -486964, 1148054, -69863, -864102, -295776, -881274, -842998, -1198151, -2044421, 13499, 935673, -744133, -1037116, -346868, -328810, 574870, -955242, -472751, -778904, -1472354, -1515487, 10610, 1188384, -52794, -204957, 342939, -206413, -846897, -238597]
11419E73994N64957c59950N2368A128126a66691F97062i42928E86906a380927
11409d41589J97522G15153J009850G61379c54207H65450e06273Q3085H18849A30303
11398H99944f51340A86998f25904f1661C10148J08554a05741D26127A94471e89466
11387a444388B00668f1260H99981f25942A294269e88436J381b36648G91042i18380
11376H77607m07496b48823I40118d54660l52465b30466E02906e28688E06559c7306
11365E0867K06732L30305d66996G50524d14410C20045J09926A96030c2695C04173
11354e59644o37908a93439k25207H80637d9543B49602g45013L41140C03486b66447
11343C29889d71043m67920C4568M60537J16129r6240c04055A58828N05625a84914
$$ y = [573994, 1138951, -359950, -307582, 1128126, -166691, 697062, -942928, 586906, -1380927, -441589, -244067, 715153, 1725003, 761379, -354207, 865450, -506273, -423188, 818849, 130303, 899944, -651340, 186998, -625904, -61661, 310148, 418702, -105741, 426127, 194471, -589466, -1444388, 200668, -61260, 899981, -625942, 1294269, -588436, -587055, -236648, 791042, -918380, 877607, 470111, -248823, 940118, -454660, -807125, -230466, 502906, -528688, 506559, -37306, 50867, 257599, 587904, -466996, 750524, -414410, 320045, 429971, 196030, -32695, 304173, -559644, -1197552, -193439, -418646, 880637, -49543, 249602, -745013, -403873, 303486, -266447, 329889, -471043, -938963, 34568, 495105, 611234, 514994, -304055, 158828, 664453, -184914]
11332c98499i3442k76295E6103a432425f24969C4213e69972E90424M50508a91730
11321d34211J61362O1072j32555C68956L31545e35462B06038b19200G68547O44013
11311A412560o25534p4123M51287D28274P41593g21048k93583F990e44952l08714
11301h53666n3960c28522a15831G22165i03765b7776p961n34037j09409c07641
11290A178880M3289d11526k58498D95050k24216K35402b60107F99701e80690k59132
11280h39822r89305A859685e35840m94240j02150b69534l7967O8255A74728b28998
11269F38600L21163j49379E0942J243458g58881j071392A07216d24601j387097
11260a811698d59066D55329L1888B18502e48926b12640n9246l27307C50444M27180
$$ y = [-398499, -93442, -369737, 56103, -1432425, -624969, 34213, -569972, 590424, 1040932, -191730, -434211, -272849, -211777, -344332, 368956, 700501, -535462, 206038, -219200, 768547, 1412560, 787026, 712903, 1164190, 428274, 1169867, -721048, -1014631, 6990, -544952, -853666, -907626, -328522, -115831, 722165, -903765, -27776, -35737, -569774, -679183, -307641, 1178880, 1222169, -411526, -670024, 495050, 270834, 506236, -260107, 699701, -580690, -839822, -1829127, 1859685, -535840, -1030080, -1132230, -269534, -307501, -239246, 174728, -228998, 638600, 959763, 810384, 50942, 1294400, -758881, -1830273, 107216, -424601, -1811698, -459066, 455329, 487217, 218502, -548926, -212640, -271886, -599193, 350444, 777624]
11250G77624b113538I6188J422679E95199R3808f36962H10101A10718M50072J67556
11240G28346a20772p0205p43048c21155a9306k96743l04864l42645A32409a39630
11229E45462A47544g48233n67314E82368c75191B55437d19968R8847F60746d52074
11218b68935C6150a051053r7428d14352A92119E4276Q23214f39862A066284i4459
11207C41443K00590a54294k05029j052606O68163A72753J45201b02762C265L8070
11197D1335g62214B9437h66910k07314o7769a89347D3894f62413E30364F8235
11186a230022B25406J38016A10637K02860L4301g1425k88815n14651A58a038825
11175e93977A021697B59723A04203J62337a12760F18385k15843a60225B69487
$$ y = [777624, -2113538, 96188, 1518867, 595199, 689007, -636962, 810101, 110718, 560790, 728346, -120772, -190977, -934025, -321155, -19306, -316049, -620913, -963558, 132409, -139630, 545462, 147544, -748233, -1315547, 582368, -375191, 255437, -419968, -321121, 660746, -452074, -268935, 36150, -1051053, -1148481, -414352, 192119, 54276, 877490, -639862, 1066284, -94459, 341443, 542033, -154294, -359323, -1411929, -743766, 172753, 317954, -202762, 3265, 41335, -762214, 29437, -866910, -1074224, -1141993, -189347, 43894, -662413, 530364, 68235, -1230022, 225406, 363422, 110637, 313497, 347798, -71425, -360240, -874891, 158, -1038825, -593977, 1021697, 259723, 104203, 266540, -112760, 618385, 402542, -160225, 269487]
11165E55579h74701A191361k42595N8134j58351M09295b65338F43743a180716
11155A10886c5833A566658f0122F07389f53009E86153I4556K00934J64397a02210
11144e22934e8015A080882i7379p77383o49749A19060b47657F39560g02329i7209
11133A848119h32573A748232o19663e24862A106942B67868h8277A051518O5934
11124A117452c2925F9513h47363B89963P13481k97957a732252c49729p96464K0026
11114a126167b24804j18683a30083A011793b26338l79897j82169H75870B01812
11104b70167A364263F16235e34955j96463k12554m17917a17290q99055F46138
11094a301263C58958e86590b6267D11149g91887L62080m6735H66f18244l18051
$$ y = [555579, -874701, 1191361, 948766, 1006900, 848549, 1257844, -265338, 643743, -1180716, 110886, -35833, 1566658, -60122, 607389, -653009, 586153, 94556, 295490, 459887, -102210, -522934, -58015, 1080882, -97379, -874762, -1524511, 119060, -247657, 639560, -702329, -97209, 1848119, -832573, 1748232, 1128569, -524862, 1106942, 267868, -88277, 1051518, 1117452, -32925, 69513, -847363, 289963, 1003444, 705487, -1732252, -349729, -1146193, -1126167, -224804, -343487, -130083, 1011793, -226338, -606235, -788404, 875870, 201812, -270167, 1364263, 616235, -534955, -731418, -943972, -1361889, -117290, -1016345, 646138, -1301263, 358958, -586590, -26267, 411149, -791887, -429807, -476542, 866, -618244, -936295]
11084i36295P2828J80438B89192d11477B26256N66755J55887a393566a42566D97661
11073f83812J39334K34042r9920a32629n38798j025330a00712A82791P7843c4063
11062F41009b64653A55223M69760l00578N31654k11153a87831B14260o6725o2071
11052H5464b89938A420120c17647D55187N44527C07938i74270J09321C81160d50405
11041e22090b34902o94846l74252b32871C50582c85172C54432O48016A64993g50773
11030C10677a00487H68845a144313A125499m46051e06730A302168D52162H0096
11020e28898l66153C19847e15058G69767d31079B53999d52867G4688L47415K30336
11010F52439A33294b64103d6722B69049L37969J39783A17708C0524c89063G66103
$$ y = [-936295, -863467, -683029, 289192, -411477, 226256, 793011, 948898, -1393566, -142566, 497661, -683812, -544478, -310436, -410356, -132629, -671427, -1696757, -100712, 182791, 260634, -34063, 641009, -264653, 155223, 624983, 324405, 856059, 644906, -187831, 214260, 147535, 85464, -289938, 1420120, -317647, 455187, 999714, 307938, -974270, -864949, 381160, -450405, -522090, -234902, -929748, -1304000, -232871, 350582, -385172, 354432, 1002448, 164993, -750773, 310677, -100487, 868845, -1144313, 1125499, 679448, -506730, 1302168, 452162, 80096, -528898, -895051, 319847, -515058, 769767, -431079, 253999, -452867, 74688, 422103, 652439, 133294, -264103, -46722, 269049, 607018, 746801, 117708, 30524, -389063, 766103]
10999D82180g57476G6259R71736a298521B8434J64316b56721E84155M79088C04370
10988G08800i18159B0731J127035n38943a07684l54077A23675i48585b88503B0820
10977B47585k3196b81840i3557A46508b69742h1641j38195C94285J6118e340m45044
10966d50384D17777a01791F67834g3741j225556K85504D46716j32957c2644I88648
10955B30357b90690b5213j46932o8485I53225c22694C17751j18930a90428A70320
10944H07411d87197D37475A74569M97021k22028J319929g0456n61418A267146
10934a310164E5240N5379d55747q49398N67255g4230B41996L04982L14211a267304
10923C98401L75988j93259f53371a44361I86707g8961n28232H6514j6094J90999
$$ y = [482180, -757476, 76259, 1047995, -1298521, 28434, 192750, -256721, 584155, 1063243, 304370, 708800, -918159, 20731, 1147766, 608823, -107684, -461761, 123675, -948585, -288503, 20820, 247585, 224389, -281840, -93557, 146508, -269742, -81641, -219836, 394285, 410403, -5340, -450384, 417777, -101791, 667834, -73741, -1299297, -1013793, 446716, 313759, -32644, 988648, 230357, -290690, -25213, -172145, -240630, 953225, -322694, 317751, 198821, -190428, 170320, 807411, -487197, 437475, 174569, 671590, 449562, 1769491, -70456, -631874, 1267146, -1310164, 55240, 110619, -455747, -1305145, -737890, -74230, 241996, 546978, 861189, -1267304, 398401, 774389, 581130, -653371, -144361, 986707, -78961, -607193, 86514, 70420, 261419]
10913B61419J79765a70653A100657D02689a570224P22558K2796D68c03945h4098
10902A473456E12374a723749E31976c73736J2514o6903A09058g07577A70942j4018
10892A56924K66506a107082d57439n44620D22747B05588a29581n0537k42711J16944
10882c05885C04346P60291c07242a15375k22815A612683b23757p08996d28355
10872i85390B46N62507a221679F67922a399687e43482m4753a72056c8796q70946
10862i09742K2365D75858g32544F72624K30022c87087j26991K12741p75913D30493
10851c91418A37987g67373E81344e76276B35464K02392f59873a06544m13352e3878
10840A25190e61205n48149C50845f86856A60655a501696E0877a57431p12886D2263
$$ y = [261419, 441184, -170653, 1100657, 402689, -1570224, -847666, -824870, 468, -303945, -84098, 1473456, 512374, -1723749, 531976, -373736, -361222, -428125, 109058, -707577, 170942, 156924, 423430, -1107082, -457439, -1002059, 422747, 205588, -129581, -180118, -422829, -305885, 304346, 1064637, -307242, -115375, -338190, 1612683, -223757, -932753, -428355, -985390, 246, 562753, -1221679, 667922, -1399687, -543482, -588235, -172056, -38796, -909742, -887377, 475858, -732544, 672624, 902646, -387087, -514078, -301337, -1077250, 430493, -391418, 137987, -767373, 581344, -576276, 235464, 437856, -659873, -106544, -519896, -53878, 125190, -561205, -1109354, 350845, -686856, 160655, -1501696, 50877, -157431, -870317, 42263]
10829G38986f04008k53573G32232k69496A67917K76722E6127o376e81736a80547
10818a027897B66861a31605H05226h85058A56855R16892i05274A056592a33009
10808d40930B89143h1004F92763e83057B85540c72876o95001b13997D2520c34045
10797b92585l87520C38751a54704A177680g74243c53738A240356f95613j68499
10788h64112L95567n73010D41208L30945J71895a87540D19507a09527B39632a376317
10777D27982h6935H20551H347a245432b19825A28731f6062A21131a098446M32880
10767f65566J24253B31998P8600b61595A376508a305644d20002E22970e45483
10757c66044J16528O7347j069691C22923I7017a89391l97351K31693L3026a14249
$$ y = [738986, -604008, -857581, 732232, 462736, 167917, 444639, 56127, 49751, -581736, -180547, -1027897, 266861, -131605, 805226, -885058, 156855, 1073747, -905274, 1056592, -133009, -440930, 289143, -81004, 692763, -583057, 285540, -372876, -1067877, -213997, 42520, -334045, -292585, -680105, 338751, -154704, 1177680, -774243, -353738, 1240356, -695613, -864112, -468545, -1041555, 441208, 772153, 944048, -187540, 419507, -109527, 239632, -1376317, 427982, -86935, 820551, 8347, -1245432, -219825, 128731, -66062, 121131, -1098446, -665566, -541313, 231998, 310598, -261595, 1376508, -1305644, -420002, 522970, -545483, -366044, -249516, -182169, -1251860, 322923, 97017, -189391, -586742, -355049, -322023, -114249]
10746b751l96845F63693k53728D9696i45776k82972C77223H8088N05096P472B22088
10734a010250d14139F93415A60713i02495A37820e24819A42587K76265N1337b82053
10723B83738c61859m23895O9079A31158J1883i25456m99819D77188d83j038827
10713a039310K45997E41932R22749C33008c968j08433n08540I0875q320g0540
10702a254606F15270j69357G0620M03935G1021d09669q5395B86118N18881l49311
10692D55688i01585l44597N22685F07564g67064g7402D05020b16475C60860A79643
10681a115052L09160k40260M95159A043067a038445c51620r82195G67791A05587
10671A193173b27402A35693c45963A036091g10580l94389C6647J30402f09320
$$ y = [-2751, -399596, 663693, 409965, 49696, -945776, -1228748, 377223, 88088, 593184, 600656, 222088, -1010250, -414139, 693415, 160713, -902495, 137820, -524819, 142587, 418852, 470189, -282053, 283738, -361859, -785754, -716675, 131158, 143041, -925456, -1425275, 477188, -483, -1039310, -793313, 541932, 1464681, 333008, -3968, -112401, -620941, 90875, 82555, -70540, -1254606, 615270, 445913, 70620, 474555, 71021, -409669, -495064, 286118, 804999, 455688, -901585, -1246182, -723497, 607564, -767064, -77402, 405020, -216475, 360860, 179643, -1115052, -805892, -1046152, -550993, 1043067, -1038445, -351620, -1333815, 767791, 105587, 1193173, -227402, 135693, -345963, 1036091, -710580, -1104969, 36647, 167049, -609320]
10661e66652E89841g7278l07521p5221A79184i35435c42570H98553a40857j81591
10651c22448k47508b293o34541A707790E61768j0072a251403e82399B98411b50889
10640A042817c77738J86215A84696J45774d17849J78430m34167K62672B69908
10630g17004a36547G16146H7414b25789A359663C69815d86044E05747N45692d22380
10619C1633h57497H8339a063563b91042n03200B95876F9562c19501C4472c46147
10608A001031l49331G7930a187127H37180B9025L68756f02548B23777p9492a335649
10597D89854e6986n70216C47066g13432b65548p40710b4238o15300K71694j35787
10587e03631K40833m14651C41053e3524n62895A93878a562068N91598K14922G35648
$$ y = [-566652, 589841, -77278, -384799, -460020, 179184, -935435, -342570, 898553, -140857, -322448, -569956, -2293, -636834, 1707790, 561768, 551696, -1251403, -582399, 298411, -250889, 1042817, -377738, -191523, 184696, 330470, -417849, -239419, -673586, -410914, 269908, -717004, -136547, 716146, 87414, -225789, 1359663, 369815, -486044, 505747, 1051439, -422380, 31633, -857497, 88339, -1063563, -291042, -794242, 295876, 69562, -319501, 34472, -346147, 1001031, 651700, 77930, -1187127, 837180, 29025, 397781, -602548, 223777, 144285, -1335649, 489854, -56986, -627202, 347066, -713432, -265548, -1006258, -24238, -639538, -367844, -503631, -262798, -677449, 341053, -53524, -616419, 193878, -1562068, -970470, -755548, 735648]
10576G59377f04799E24649a498118a43658o75994j0772B64858o4407N65185A88817
10565C66439a110232a41434k59515A62699N23824B58468J142012B26231L21396
10556E47627J04283c83103C86244k8586J08459a12178D99095a44430l17169E71430
10545B36363c61575D51393b42657m17941d3390k56752P9807E45730q1203e26276
10534c40342B74845d58270j44119A39225M76142a341419B25846f19467C30089
10524F76302c56745r35968O00002i2413o84148A009782e34004j73727H27699f35749
10513D54630g01483L0744o27822E84303K7595b89619D07800e97082A45741a20859
10502a247682f02371A19878c32335B96260K02508H1329P07151k5432f94879K89398
$$ y = [759377, -604799, 524649, -1498118, -143658, -819652, -830424, 264858, 200451, 765636, 188817, 366439, -1110232, -141434, -400949, 162699, 686523, 258468, 1400480, 226231, 547627, 651910, -383103, 386244, 357658, 466117, -112178, 499095, -144430, -461599, 571430, 236363, -361575, 451393, -242657, -660598, -43390, -300142, -220335, 545730, 464527, -526276, -340342, 274845, -458270, -602389, 139225, 615367, -1341419, 225846, -619467, 330089, 676302, -356745, -1292713, -692711, -92413, -776561, 1009782, -534004, -707731, 827699, -635749, 454630, -701483, -670739, -1298561, 584303, 611898, -289619, 407800, -597082, 145741, -120859, -1247682, -602371, 119878, -332335, 296260, 498768, 81329, 788480, 763048, -694879, -405481]
10492d05481A809066b69007P2048k45271F59528e10503E39777B23476O54894k95224
10482E83146f17258J35657C51558a37015j243879f83165B89011N51180J09119
10473I49310k29908i39138C09086c4744q80040d04761I8254d75594R6769A355876
10462e56431C54049b58259J4823A124138a065633j28196J79638b03990J4173r05602
10452a095419D89341i1573D66253A36964q027d09196C01786A43687b30093I62897
10441c80967C42534A40860a211638A03392a321320H10167J51621c43073c9148
10431C01102L77533n8938B6926h5810D4706O14501A6318a553108b07370B96198
10420b00591A015h356A104247d49556m81458A52937a039833L23384a13249D49729
$$ y = [-405481, 1809066, -269007, -196959, -442230, 659528, -510503, 539777, 223476, 878370, 583146, -617258, -481601, 351558, -137015, -1380894, -683165, 289011, 840191, 949310, 719402, -939138, 309086, -34744, -914784, -404761, 98254, -475594, -378825, 1355876, -556431, 354049, -258259, -243436, 1124138, -1065633, -1193829, -1014191, -203990, -189817, -1095419, 489341, -91573, 466253, 136964, 128937, -409196, 301786, 143687, -230093, 962897, -380967, 342534, 140860, -1211638, 103392, -1321320, 810167, 961788, -343073, -39148, 301102, 678635, 619697, 26926, -85810, 44706, 659207, 16318, -1553108, -207370, 296198, -200591, 1015, -8356, 1104247, -449556, -931014, 152937, -1039833, -716449, -113249, 449729]
10409e2812m92531d1093m5059B38890L13100d63273j151213F0001K78829K87160
10399F25990e25282h4801l01115J29749A77006d70626b09454h9486o33820D04252
10388a10135j38737D96565a222875D38222h2808F52846b68286j599278E27308
10378F69307a070710l56667E07476f05662F31813Q1100e14172j03759C34054q3347
10368B50707K36567b32871b0609l67300k55659A39543P83134A69622h56742D73042
10357d23812J90435B261285j50620B93917i9406j201888h3277n5952L8262o73381
10347g74348b64753a24989l09036m34828D80197i5790E39299d73996D62918f96662
10336A11136K56226q4350g64227D37413G8233O37452a204520F50259a53374m17378
$$ y = [-52812, -545343, -41093, -86152, 238890, 551990, -463273, -1614486, 60001, 338830, 625990, -525282, -84801, -385916, -256167, 177006, -470626, -209454, -89486, -723306, 404252, -110135, -248872, 496565, -1222875, 438222, -82808, 652846, -268286, -1867564, 527308, 669307, -1070710, -1427377, 507476, -605662, 631813, 712913, -514172, -617931, 334054, 250707, 487274, -232871, -20609, -387909, -643568, 139543, 922677, 169622, -856742, 473042, -423812, -233377, 2261285, 2110665, 293917, -99406, -1301294, -83277, -139229, -100967, -774348, -264753, -124989, -434025, -868853, 480197, -95790, 539299, -473996, 462918, -696662, 111136, 367362, 283012, -764227, 437413, 78233, 715685, -1204520, 650259, -153374, -570752]
10326e70752l33096B5446K47043g09842F75220d08981Q8567m73138F05049g94901
10315C72078R8684c43706F6559a8518D80012J165888a141428E1452a000074A651771
10304f93358F30646c18077A323840h5761m46707A58612b15829A53770f94500F48383
10293A19682J95530b4524o08536C07862h28329C50218J41299j97724Q94786a68461
10282a413136A91261e44436A018357k26248a298680A625474F32892a278870D37308
10272D11287j00166b87782A064542l12683e35354n2475p48464A74122n3073i5884
10261A158588A00026B3568d1099l86853C26289f13821l09044B27958k1823F4690
10250i85866a73161B44214h67904b20929q17788c69301H29543b64025a29428D58630
$$ y = [-570752, -903848, 25446, 272489, -709842, 675220, -408981, -320414, -793552, 605049, -794901, 372078, 470762, -343706, 66559, -18518, 480012, 1645900, -1141428, 51452, -1000074, 1651771, -693358, 630646, -318077, 1323840, -85761, -532468, 158612, -215829, 153770, -694500, 648383, 119682, 315212, -24524, -633060, 307862, -828329, 350218, 491517, 293793, 1188579, -168461, -1413136, 191261, -544436, 1018357, 792109, -1298680, 1625474, 632892, -1278870, 437308, 411287, 311121, -287782, 1064542, 751859, -535354, -587829, -1336293, 174122, 121049, -95884, 1158588, 100026, 23568, -41099, -427952, 326289, -613821, -922865, 227958, 206135, 64690, -985866, -173161, 244214, -867904, -220929, -1038717, -369301, 829543, -264025, -129428, 458630]
10239C27723Q8899e51169J10620o21135A197548b84130A72434c16305F68820b1257
10228a36237o38687j041588b1628E38089k13690h40651E06730l2816G9796n641
10218G4155e92474A82249d37685n35660i265n39688f7568H65002a24278j59072
10208b83350A59581a044813K93785B1498c67250k03033m64658B99358R60319F05619
10197i52606D44496b95569j062666D1301c77246k74551l98359I03163a783m17411
10187d19194k44211A054261d81923n09520d22526K5376m51644I3863K97813a63304
10176f77788A046849k22222A07916i1956m36756H05160a51579m86928m01936M16082
10166f24361B56824j1304f91048D59902b54264j292229D40500g4160l11227D71872
$$ y = [327723, 416622, -551169, -440549, -1061684, 1197548, -284130, 172434, -316305, 668820, -21257, -136237, -774924, -1816512, -21628, 538089, 324399, -840651, 506730, 473914, 79796, 74155, -592474, 182249, -437685, -973345, -9265, -548953, -67568, 865002, -124278, -283350, 159581, -1044813, -751028, 21498, -367250, -570283, -1034941, 299358, 1259677, 605619, -952606, 444496, -295569, -1358235, 41301, -377246, -651797, -1050156, 903163, -1783, -419194, -663405, 1054261, -481923, -991443, -422526, -397150, -848794, 93863, 391676, -163304, -677788, 1046849, 824627, 107916, -91956, -528712, 805160, -151579, -638507, -1040443, -624361, 256824, 245520, -691048, 459902, -254264, -1546493, 440500, -74160, -385387, 471872]
10155f23773p2461J0623e2098B92048M58966a819781a51499D08848f24996k51128
10145h76124j18987r7214d01335n6011k24968A64304a017835M19154a60194n00631
10135f60825b77813D66560e72904B00270g03121c16285n8551p1064B88890b76229
10124D04852J47479B17151d39907A102024k43610d37943j063506E76514h14763
10114e70845C90483J334612D41708e72264h2861o48607p9621c8672o74836j3775
10104g27283a68465p30767M06164j49078C98119N86098a452321a49304o71514
10095h20818p0125M5277n14697O06463A83061b016092e97525J78379l03038H00414
10084c25493o77706H32502a52491H39862C95685g35874J79624b22888k82172B30771
$$ y = [-623773, -696234, -685611, -52098, 292048, 751014, -1819781, -151499, 408848, -624996, -876124, -995111, -1092325, -401335, -457346, -682314, 164304, -1017835, -598681, -160194, -660825, -277813, 466560, -572904, 200270, -703121, -316285, -374836, -445900, 288890, -276229, 404852, 552331, 217151, -439907, 1102024, 858414, -437943, -1501449, 576514, -814763, -570845, 390483, 1725095, 441708, -572264, -82861, -731468, -811089, -38672, -713508, -727283, -168465, -899232, -493068, -642146, 398119, 984217, -1452321, -149304, -820818, -890943, -845666, -1360363, -753900, 183061, -2016092, -597525, -419146, -722184, 800414, -325493, -1003199, 832502, -152491, 839862, 395685, -735874, -556250, -222888, -505060, 230771]
10073E44713a066622c64857n48233H3039J127341d35799J07653C85680h92008
10063F69589A0315e084o36154b78345I04568a297272K67076c94626A587003A65052
10052A80899g93127h2348K8144n38760H03630a220837A308426g45268b85055D06708
10041E14371d39817n66577k79587A07635J07577N36272h95862K3270a70559p84673
10031i55232d70859A616997a792583A42737B3340f68277l58058b23452L0930j983816
10021b176338E06356m2161a758428d79551F33222a285273c5012j38197B77143
10011E72058A16980a124018e42166k21387b07727A81736H9706g23960h9770c5230
10000F24701a7364F97719q9101c7456F22447i77793C04067a29600j0435D20406
$$ y = [544713, -1066622, -364857, -913090, 83039, 1210380, -435799, -328146, 385680, -892008, 669589, 10315, -5084, -641238, -278345, 904568, -1297272, -1030196, -394626, 1587003, 165052, 180899, -793127, -82348, -54204, -592964, 803630, -1220837, 1308426, -745268, -285055, 406708, 514371, -439817, -1006394, -1285981, 107635, 215212, 751484, -895862, -872592, -170559, -955232, -470859, 1616997, -1792583, 142737, 23340, -668277, -1026335, -223452, -192522, -2176338, 506356, 464195, -1758428, -479551, 633222, -1285273, -35012, -173209, 277143, 572058, 116980, -1124018, -542166, -763553, -207727, 181736, 89706, -723960, -89770, -35230, 624701, -17364, 697719, 608618, -37456, 622447, -977793, 304067, -129600, -140035, 420406]
9989E10787a55807n95414D63181g6777j062188H188M84010K9322a359569r126
9979a368695o0942f46436l11108d69908D7072N98494O15203k87834G5357g22158
9968d07447D63938A52032c44004M7610B57803n3945a166968d88423K22277e0098
9957B4770d71726I32889D15491N75872D02395i6644j124090a96957A480155A30055
9946E5216K40243f21633a59409A602652A48279e67220j43641A182805a86543D28124
9935b44480A28672c19562o13773G9524f98444A6677d24449m59696F52036C2730
9924A028960h52564b88834B13413i6347l41728H31942e22111a32476r9983A22253
9913d12746N961A44031d35967D83564a003399L65725b52468h2162o92511j57372
$$ y = [510787, -155807, -751221, 463181, -76777, -1138965, 8188, 492198, 521520, -1359569, -1368695, -1429637, -646436, -957544, -469908, 47072, 645566, 1260769, 972935, 75357, -722158, -407447, 463938, 152032, -344004, -296394, 257803, 203858, -1166968, -488423, -266146, -50098, 24770, -471726, 932889, 415491, 991363, 402395, -96644, -1220734, -196957, 1480155, 130055, 55216, 295459, -621633, -159409, 1602652, 148279, -567220, -710861, 1182805, -186543, 428124, -244480, 128672, -319562, -933335, 79524, -698444, 16677, -424449, -884145, 652036, 32730, 1028960, -852564, -288834, 213413, -96347, -438075, 831942, -522111, -132476, -232459, 122253, -412746, -406785, 144031, -435967, 483564, -1003399, -637674, -252468, -82162, -774673, -932045]
9903i32045Q1156A9369J68094M68946h2236j042155A43684b552061F31240B15634
9892d75623D01341h4242H52385g45085D33116J147047a219857m09816L75524e91822
9881F987c83570G78646a364394a76486j350278C03982b23861j360470a03064k7623
9871a30687m58152j65155E0021J91633a425360N41899h4690q82851f3712q4488
9861a48200o32194A579341E45984i71180O5843c41202k76954l14499C90378Q8373
9851D78751g93127o728G90390k5348b82933F09946a043674M82846l89839B41738
9840g40842j07337D28346i4842j085701C60756M02691C58121j25697o2537e21736
9829e46386A040903C70711a467504E90413b5989A281594d21421m42045C84878
$$ y = [-932045, -850889, 19369, 187463, 656409, -82236, -1124391, 143684, -2552061, 631240, 215634, -475623, 401341, -84242, 852385, -745085, 433116, 1580163, -1219857, -1629673, -1254149, -591822, 6987, -383570, 778646, -1364394, -176486, -1526764, 303982, -223861, -1584331, -103064, -130687, -588839, -753994, 50021, 241654, -1425360, -883461, -84690, -967541, -63712, -148200, -780394, 1579341, 545984, -971180, -905337, -341202, -618156, -932655, 390378, 478751, -793127, -799855, 790390, 765042, -282933, 609946, -1043674, -560828, -950667, 241738, -740842, -848179, 428346, -94842, -1180543, 360756, 763447, 358121, 232424, 169887, -521736, -546386, 1040903, 370711, -1467504, 590413, -25989, 1281594, -421421, -863466, 384878]
9819f96783A012765c27289A94392a773957F77273a029685C42026f3426r31533
9810i94959A92541c73181o23178A12447c8352n32033A3077e80666H18685k63506
9800E55179a2678A13891a006234A30878a81862P6762p16425B3407a388799O92405
9790f96394L45422b6466j080248d65979E34308j62832f50898G28650B58382c35000
9779a046001c3321D0136J628076E19996B51235e66125J22087A386498D70975a387347
9768a83210n97800c6311G3212f04506b53100m99835A73054l1870b15230m082j7463
9757b36775E13562f94235j219534D75091f69539D64786e39559A61794i16019A8778
9746D21119A92590G8306b57810A063256L56745C1652e43170J66400J44209E15876
$$ y = [-696783, 1012765, -327289, 194392, -1773957, 677273, -1029685, 342026, -63426, -994959, 192541, -373181, -996359, 112447, -38352, -570385, 13077, -580666, 818685, 555179, -12678, 113891, -1006234, 130878, -181862, -105100, -821525, 23407, -1388799, -696394, -350972, -26466, -1106714, -465979, 534308, 371476, -650898, 728650, 258382, -335000, -1046001, -33321, 40136, 1668212, 519996, 251235, -566125, -444038, 1386498, 470975, -1387347, -183210, -781010, -36311, 73212, -604506, -253100, -752935, 173054, 141184, -215230, -219312, -236775, 513562, -694235, -1913769, 475091, -669539, 464786, -539559, 161794, -916019, 18778, 421119, 192590, 78306, -257810, 1063256, 1420001, 31652, -543170, -376770, -232561, 515876]
9735A03550P5044c62961k50032D48130j9843f21101C67084G1313e61831j01869
9725f63700J25975A003885g47254D07795a82217k55666M8670m97494D28958A28331
9714f09998n89868K87305E86539L99030c99109j61019D73081d81722m21116J60485
9704g42353a88167E16587d86201a5791m0420E2749g31095a65531j207709b67105
9693I4406a110104e52428d556B91128a096457A46057d6664n66968E05747g44850
9682c65584A241125n92525d78917A20398L85457K39836O45079o42418f19665F09496
9671d80047k0980D42857c50988C87861I8038g85089D8188a45945l22847j481247
9661a950039Q06663G88161k36632q7682a23339A302232g68025K77527l00254n7138
$$ y = [103550, 178594, -362961, -612993, 448130, 428287, -621101, 367084, 71313, -561831, -663700, -537725, 1003885, -747254, 407795, -182217, -437883, -389213, -886707, 428958, 128331, -609998, -1199866, -912561, 586539, 985569, -399109, -560128, 473081, -481722, -902838, -742353, -188167, 516587, -486201, -15791, -56211, 52749, -731095, -165531, -1373240, -267105, 94406, -1110104, -552428, -4556, 291128, -1096457, 146057, -46664, -613632, 505747, -744850, -365584, 1241125, 648600, -478917, 120398, 505855, 745691, 1390770, 748352, -619665, 609496, -480047, -501027, 442857, -350988, 387861, 98038, -785089, 48188, -145945, -468792, -1950039, -1143376, 788161, 551529, 463847, -123339, 1302232, -768025, -490498, -790752, -847890]
9651h47890I60086g3375j0880m12979B23935L48547E8051N4208b26965D49554
9640f68938G54297C51640J16002d16592o60107E50754A42264f29763j2156a06657
9629A007996a348291M49695M41814m54616C66587g30103q26148b94033a36539
9619a636713d78721R1289m99533m6599c3967G0899a320763a07583p44430c42352
9608c73396J45662j29673o28969G86425c87618L9102d8428D85475K30719B33880
9597A21111A1788a328251d0902A016749a87371A98461J164181n34765f06726a22880
9586a36975j2701k70917A80550c31323j02272B80600a4567j142806E07946f90870
9575g20757J68192f8043E50491h32798p93234h0634j031615d26720l11891c44144
$$ y = [-847890, 960086, -73375, -84255, -497234, 223935, 572482, 58051, 112259, -226965, 449554, -668938, 754297, 351640, 467642, -416592, -1076699, 550754, 142264, -629763, -641919, -106657, 1007996, -1348291, -898596, -456782, -911398, 366587, -730103, -1556251, -294033, -136539, -1636713, -478721, -387432, -886965, -933564, -33967, 70899, -1320763, -107583, -852013, -342352, -373396, -227734, -357407, -986376, 786425, -387618, -348516, -48428, 485475, 716194, 233880, 121111, 11788, -1328251, -40902, 1016749, -187371, 198461, 1362642, 827877, -606726, -122880, -136975, -149676, -420593, 180550, -331323, -433595, 280600, -14567, -1157373, 507946, -690870, -720757, -552565, -68043, 550491, -832798, -1626032, -80634, -1112249, -426720, -738611, -344144]
9564g70696H41300f78452e0253C56179a405337e88256l66166A778068c79123A26626
9553c99854P495D3494Q71622e43617h6319n15122i2742D10133b03308B98230L3334
9542C31564i8841B53590j04831g89444h7418m31516A088479b48481k39742O4757
9532d23466A084347D62342a174481c88369j2462J78730A59454d8790H04556a504288
9521d49517k53533A00862d61013i1418B20460a15374C47993f62305F39118c25199
9510C52762a564575b9178l65369Q3602e8001j56426o38429K40248a5584E69860
9499A584852a033791a00183r48023G19906a230269b57258J10771j65968n52667
9490h65122j14521a53999A11835g56239c36373q02613d29954J21259N2866m15040
$$ y = [-770696, 841300, -678452, -50253, 356179, -1405337, -588256, -954422, 1778068, -379123, 126626, -399854, -392359, 43494, 915116, -543617, -86319, -601441, -92742, 410133, -203308, 298230, 331564, -98841, 253590, 148759, -789444, -87418, -518934, 1088479, -248481, -488223, -423466, 1084347, 462342, -1174481, -388369, -400831, -222101, 159454, -48790, 804556, -1504288, -449517, -703050, 100862, -461013, -91418, 220460, -115374, 347993, -662305, 639118, -325199, 352762, -1564575, -29178, -394547, -310945, -58001, -214427, -852856, -612608, -15584, 569860, 1584852, -1033791, -100183, -1048206, 719906, -1230269, -257258, -146487, -312455, -865122, -979643, -153999, 111835, -756239, -336373, -1138986, -429954, -308695, -255829, -670869]
9480f70869K62854o18146A81986N4243c62884H41318A96543L6387J79641e5713
9469E69269k47049f36401C97585L03555i5739A19576d17974E0695e95799a25295
9458C81530h79589B45601a227348e44315E84122N4624a110877H18977k64822K99204
9448H53359A45338f91605j48183E87680a09214G39474a17537k98736j92599F6661
9437a56422o90241o7962G04691B11544L86493e41882g1964l42968C05597h51769
9426E92256a68636q74783c00930o34108c76107r00650e78755C26916M2412r2873
9416B76455j35672a52801J9256q82817D06738c54389A379019a426485c70983n03836
9406h74819c77803G68549m7114g42436K34425D38711a56514l68466C35995a5699
$$ y = [-670869, -408015, -1026161, 181986, 236229, -362884, 841318, 196543, 232930, 412571, -55713, 569269, 322220, -636401, 397585, 701140, -95739, 119576, -417974, 50695, -595799, -125295, 381530, -879589, 245601, -1227348, -544315, 584122, 638746, -1110877, 818977, 554155, 853359, 145338, -691605, -839788, 587680, -109214, 739474, -117537, -416273, -608872, 66661, -156422, -846663, -914625, 704691, 211544, 598037, -541882, -71964, -414932, 305597, -851769, 592256, -168636, -1043419, -300930, -935038, -376107, -1276757, -578755, 326916, 369328, 276455, 140783, -152801, -133545, -1016362, 406738, -354389, 1379019, -1426485, -370983, -874819, -377803, 768549, 721435, -742436, -508011, 438711, -156514, -524980, 335995, -15699]
9395a28130b2133m42859N2171D69319a023876A86672L60807e24800J40490C73914
9384F21466a097513H4151L97709J91146K68973e42361E8554J018750f76941A53639
9373c02218k23767q4496A166102h82904B49499J160079c80069A17826b31002j046743
9363a277745e29654n59602b96060m29375K53190a42864j44150q89168J38729D56362
9352g54794L31904J76517j714505P13161F07280e58654j37920j379728a12428
9342B72908L6505g7582H7535a64934k38493m42866d20301I86601f05309B38430
9331d40336l69373l3664a71886p4292B54082f41736G55477a609998C11723M60024
9321G71747k92742O14924a31949q5759B10299e67531A27911e64405J80154I8151
$$ y = [-128130, -22133, -464992, -412821, 469319, -1023876, 186672, 547479, -524800, -384310, 373914, 621466, -1097513, 84151, 481860, 673006, 941979, -542361, 58554, 1077304, -676941, 153639, -302218, -525985, -610481, 1166102, -882904, 249499, 1409578, -380069, 117826, -231002, -1277745, -529654, -1089256, -296060, -725435, -472245, -142864, -287014, -1176182, -1037453, 456362, -754794, -422890, -246373, -1960878, -1247717, 607280, -558654, -696574, -2076302, -112428, 272908, 309413, -77582, 87535, -164934, -403427, -846293, -420301, 986601, -605309, 238430, -440336, -809709, -843373, -171886, -246178, 254082, -641736, 755477, -1609998, 311723, 771747, 479005, 1093929, -131949, -217708, 210299, -567531, 127911, -564405, -384251, 98151]
9310c86524I39947o6637g93666E90485g2280l26417j83962I79747e73809J17479
9300d56330C21147g69122E3799b32482f6849m65104b6636l06464B29076P36321
9290I65397q0767h7730H26311d96685f0028r41296m88325e83758E66192g95820
9279a38667I3727c56012o08972l51420e35626A90236f92981E9038J60943b27921
9268c59614r73931e31588o32480i7894m84674J75124E10699J66380c4904o03932
9258f38836A335381D24498M54958c14215I38071d60705e2907B36962d37115D93570
9247A182530g75986H40108b45356j609744C87637j15503c81812o37276M31548
9238e87540g180j50898m53281A04825K15428a669011f60182J33356q71696D42195
$$ y = [-386524, 939947, 873310, -793666, 590485, -72280, -398697, -582659, 979747, -573809, -456330, 321147, -769122, 53799, -232482, -66849, -531953, -26636, -333100, 229076, 965397, 884630, -87730, 826311, -496685, -60028, -1001324, -1489649, -583758, 566192, -795820, -138667, 93727, -356012, -964984, -1316404, -535626, 190236, -692981, 59038, 219981, -227921, -359614, -1333545, -531588, -1164068, -97894, -582568, -407444, 510699, 677079, -34904, -638836, 1335381, 424498, 879456, -314215, 938071, -460705, -52907, 236962, -437115, 493570, 1182530, -775986, 840108, -245356, -1855100, 387637, 272134, -381812, -1019088, -587540, -7180, -158078, -611359, 104825, 320253, -1669011, -660182, -526826, -1398522, 442195]
9227C58119c16630C62233J13604c17977r28297A023267g56479K36155H11083k05053
9217F06030g51689Q9240b98918k50204c7060G12873a813642H42610M385h95860
9206A486457a266839e1290o22412A019386e12504m47206D8580f8311G1815d18849
9195H55456F7282e50117l0544a64696o8409A2781d36906A214138a190500a89006
9184B15216a311923A206783b17808m29626a05031r74999i3373F33783E9328J64154
9174B23482h10103A87259Q9149O38102r3313M21820f05569b00102B24277O93547
9164I17824A04948e68795E36237b65760l53439E86706h83646E08285c09498j97433
9154e06931B13803a38162q65261o01758b55887A546283b20104j062190L59592
$$ y = [358119, -316630, 362233, 475837, -317977, -1246274, 1023267, -756479, -520324, 811083, 606030, -751689, -662449, -298918, -549122, -37060, 712873, -1813642, 842610, 846995, -895860, 1486457, -1266839, -51290, -673702, 1019386, -512504, -959710, 48580, -68311, 71815, -418849, 855456, 67282, -550117, -580661, -164696, -233105, 12781, -436906, 1214138, -1190500, -189006, 215216, -1311923, 1206783, -217808, -647434, -105031, -1080030, -93373, 633783, 59328, 223482, -810103, 187259, 276408, 914510, 821197, 1243017, -605569, -200102, 224277, 917824, 104948, -568795, 536237, -265760, -619199, 586706, -883646, 508285, -309498, -506931, 213803, -138162, -1003423, -1605181, -255887, 1546283, -220104, -1282294, -922702]
9145i22702A284096A1019e01958k60428b85186j094650F4552O67907h81739c11655
9134f85113K3706A71033c19092f3247j30562G14406g84517c74612l35352K88848
9124d21116a14156D03271A48730O19632c62077J75964j07146j206189c37075r7985
9114d35060D43488a026438A121632j73629a01805j091005G18581e5606H9470b98786
9103a93677o09042I9385g85601H16275h80166M38576A91507L39110b62201l7689
$$ y = [-922702, 1284096, 11019, -501958, -762386, -285186, -1379836, 64552, 732459, -881739, -311655, -685113, -661407, 171033, -319092, -63247, -193809, 714406, -784517, -374612, -709964, -421116, -114156, 403271, 148730, 768362, -362077, -186113, -293259, -1499448, -337075, -435060, 443488, -1026438, 1121632, 948003, -101805, -1192810, 718581, -55606, 89470, -298786, -193677, -802719, 99385, -785601, 816275, -880166, -441590, 191507, 530617, -262201, -299890]
$$ [...]
##END NTUPLES=NMR SPECTRUM
##END=
