##TITLE=AC1406_BRAA12215_7653149_5PJ1xK5njd
##JCAMPDX= 6.0         $$ Bruker NMR JCAMP-DX V2.0
##DATA TYPE= NMR SPECTRUM
##DATA CLASS= NTUPLES
##ORIGIN= BRUKER
##OWNER= Administrator
$$ 1.72 TOPSPIN		Version 2.1
$$ 2013-04-11 15:08:19.176 -0700  Administrator@X
$$ Compression mode = diff/dup
##.OBSERVE FREQUENCY= 400.02188249412
##.OBSERVE NUCLEUS= ^1H
##.ACQUISITION MODE= SIMULTANEOUS (DQD)
##.ACQUISITION SCHEME= undefined
##.AVERAGES= 8
##.DIGITISER RES= 22
##SPECTROMETER/DATA SYSTEM= spect
##.PULSE SEQUENCE= zg30
##.SOLVENT NAME= COFFEE_meoh
##.SHIFT REFERENCE= INTERNAL, COFFEE_meoh, 1, 14.98509
##AUDIT TRAIL= $$ (NUMBER, WHEN, WHO, WHERE, PROCESS, VERSION, WHAT)
$$ ##TITLE= Audit trail, TOPSPIN		Version 2.1
$$ ##JCAMPDX= 5.01
$$ ##ORIGIN= Bruker BioSpin GmbH
$$ ##OWNER= Administrator
$$ $$ E:\/data/COFFEE/nmr/AC1406_BRAA12215_7653149_5PJ1xK5njd/30/pdata/1/auditp.txt
$$ ##AUDIT TRAIL=  $$ (NUMBER, WHEN, WHO, WHERE, PROCESS, VERSION, WHAT)
(   1,<2013-04-11 15:08:08.015 -0700>,<Administrator>,<X>,<go>,<TOPSPIN 2.1>,
      <created by zg
	started at 2013-04-11 15:07:02.546 -0700,
	POWCHK enabled, PULCHK disabled,
       configuration hash MD5:
       33 CF 6A 21 5C D3 B9 40 6C 15 AA 8D 27 A2 4F 13
       data hash MD5: 64K
       3A 59 30 FF 36 22 01 1E AE 76 B1 B0 3E B0 B8 C3>)
(   2,<2013-04-11 15:08:11.218 -0700>,<Administrator>,<X>,<proc1d>,<TOPSPIN 2.1>,
      <Start of raw data processing
       efp LB = 0 FT_mod = 6 PKNL = 1 PHC0 = 0 PHC1 = 0 SI = 32K 
       data hash MD5: 32K
       90 20 CF 75 C5 73 E0 4A 7B D1 6D FF E7 45 B5 27>)
(   3,<2013-04-11 15:08:11.812 -0700>,<Administrator>,<X>,<proc1d>,<TOPSPIN 2.1>,
      <pk PHC0 = 104.5129 PHC1 = 0 
       data hash MD5: 32K
       5D 92 A1 A5 AA 19 E8 B7 2E 3E 05 58 F9 83 DA 9E>)
(   4,<2013-04-11 15:08:12.124 -0700>,<Administrator>,<X>,<proc1d>,<TOPSPIN 2.1>,
      <abs ABSG = 1 
       data hash MD5: 32K
       A5 7F C6 97 CB 73 D4 78 6B 10 98 E8 78 D6 70 5A>)
(   5,<2013-04-11 15:08:12.374 -0700>,<Administrator>,<X>,<proc1d>,<TOPSPIN 2.1>,
      <abs ABSG = 2 
       data hash MD5: 32K
       BE 33 D8 77 14 DE 7F D2 C8 3E 4D E0 64 AA 99 7B>)
(   6,<2013-04-11 15:08:12.577 -0700>,<Administrator>,<X>,<proc1d>,<TOPSPIN 2.1>,
      <abs ABSG = 3 
       data hash MD5: 32K
       AE 68 9A 67 6D BB F5 D7 60 9E 24 E6 38 8A F7 39>)
(   7,<2013-04-11 15:08:12.827 -0700>,<Administrator>,<X>,<proc1d>,<TOPSPIN 2.1>,
      <abs ABSG = 4 
       data hash MD5: 32K
       B8 CE 1C 48 55 6A 98 08 F4 73 BA FB A4 9D B0 CF>)
(   8,<2013-04-11 15:08:13.062 -0700>,<Administrator>,<X>,<proc1d>,<TOPSPIN 2.1>,
      <abs ABSG = 5 
       data hash MD5: 32K
       A0 F2 B2 FE 32 58 AE 16 D0 B9 73 77 E4 70 F9 2A>)
$$ ##END=
$$ 
$$ $$ hash MD5
$$ $$ B0 C1 AB 77 06 FA 54 9F 70 39 8D C1 A0 CC 11 DC
##$RELAX= 
##$RELAX= 
##$RELAX= 
##$RELAX= 
##$RELAX= 
##$RELAX= 
##$RELAX= 
$$ Bruker specific parameters
$$ --------------------------
##$DU= <E:\>
##$EXPNO= 30
##$NAME= <AC1406_BRAA12215_7653149_5PJ1xK5njd>
$$ [...]
150 150 150 150 150 150 150 150
##$TP07= 0
##$TPNAME0= <>
##$TPNAME1= <>
##$TPNAME2= <>
##$TPNAME3= <>
##$TPNAME4= <>
##$TPNAME5= <>
##$TPNAME6= <>
##$TPNAME7= <>
##$TPOAL= (0..7)
0.5 0.5 0.5 0.5 0.5 0.5 0.5 0.5
##$TPOFFS= (0..7)
0 0 0 0 0 0 0 0
##$TUNHIN= 0
##$TUNHOUT= 0
##$TUNXOUT= 0
##$USERA1= <user>
##$USERA2= <user>
##$USERA3= <user>
##$USERA4= <user>
##$USERA5= <user>
##$V9= 5
##$VALIST= <valist>
##$VCLIST= <CCCCCCCCCCCCCCC>
##$VD= 0
##$VDLIST= <DDDDDDDDDDDDDDD>
##$VPLIST= <PPPPPPPPPPPPPPP>
##$VTLIST= <TTTTTTTTTTTTTTT>
##$WBST= 2048
##$WBSW= 25
##$XGAIN= (0..3)
0 0 0 0
##$XL= 0
##$YL= 0
##$YMAX_a= 1585
##$YMIN_a= -1676
##$ZGOPTNS= <>
##$ZL1= 120
##$ZL2= 120
##$ZL3= 120
##$ZL4= 120
##$ABSF1= 14.98509
##$ABSF2= -5.573092
##$ABSG= 5
##$ABSL= 3
##$ALPHA= 0
##$AQORDER= 0
##$ASSFAC= 0
##$ASSFACI= 0
##$ASSFACX= 0
##$ASSWID= 0
##$AUNMP= <proc_prof1d_extract_pilot.lims>
##$AXLEFT= 0
##$AXNAME= <>
##$AXNUC= <1H>
##$AXRIGHT= 0
##$AXTYPE= 0
##$AXUNIT= <>
##$AZFE= 0.1
##$AZFW= 0.1
##$BCFW= 0
##$BC_mod= 0
##$BYTORDP= 0
##$COROFFS= 0
##$CY= 15
##$DATMOD= 1
##$DC= 0
##$DFILT= <>
##$DTYPP= 0
##$F1P= 0
##$F2P= 0
##$FCOR= 0.5
##$FTSIZE= 32768
##$FT_mod= 6
##$GAMMA= 0
##$GB= 0
##$INTBC= 1
##$INTSCL= 1
##$ISEN= 128
##$LB= 0
##$LEV0= 0
##$LPBIN= 0
##$MAXI= 10000
##$MC2= 0
##$MEAN= 0
##$ME_mod= 0
##$MI= 0
##$NCOEF= 0
##$NC_proc= -15
##$NLEV= 6
##$NOISF1= 0
##$NOISF2= 0
##$NSP= 0
##$NTH_PI= 0
##$NZP= 0
##$OFFSET= 14.98509
##$PC= 1
##$PHC0= 104.5129
##$PHC1= 0
##$PH_mod= 1
##$PKNL= yes
##$PPARMOD= 0
##$PPDIAG= 0
##$PPIPTYP= 0
##$PPMPNUM= 2147483647
##$PPRESOL= 1
##$PSCAL= 4
##$PSIGN= 0
##$PYNMP= <proc.py>
##$REVERSE= no
##$SF= 400.02
##$SI= 32768
##$SIGF1= 0
##$SIGF2= 0
##$SINO= 400
##$SIOLD= 32768
##$SPECTYP= <>
##$SREGLST= <1H.CDCl3>
##$SSB= 0
##$STSI= 32768
##$STSR= 0
##$SW_p= 8223.68421052631
##$SYMM= 0
##$S_DEV= 0
##$TDeff= 65536
##$TDoff= 0
##$TI= <>
##$TILT= no
##$TM1= 0
##$TM2= 0
##$TOPLEV= 0
##$USERP1= <user>
##$USERP2= <user>
##$USERP3= <user>
##$USERP4= <user>
##$USERP5= <user>
##$WDW= 1
##$XDIM= 32768
##$YMAX_p= 420795307
##$YMIN_p= -90380382
##$CURPLOT= <Network HP LaserJet P1505>
##$CURPRIN= <$Network HP LaserJet P1505>
##$DFORMAT= <normdp>
##$LAYOUT= <+/1D_H.xwp>
##$LFORMAT= <normlp>
##$PFORMAT= <normpl>
##$SURQMSG= 1
$$ End of Bruker specific parameters
$$ ---------------------------------
##NTUPLES= NMR SPECTRUM
##VAR_NAME=  FREQUENCY,     SPECTRUM/REAL,   SPECTRUM/IMAG
##SYMBOL=    X,             R,               I
##VAR_TYPE=  INDEPENDENT,   DEPENDENT,       DEPENDENT
##VAR_FORM=  AFFN,          ASDF,            ASDF
##VAR_DIM=   32768,         32768,           32768
##UNITS=     HZ,            ARBITRARY UNITS, ARBITRARY UNITS
##FACTOR=    0.250966925370066, 1,           1
##FIRST=     8223.43324360094, -791363,      -20732552
##LAST=      0,             27558326,        14727858
##MIN=       0,             -90380382,       0
##MAX=       8223.43324360094, 420795307,    0
$$ Real data points
##PAGE= N=1
##DATA TABLE= (X++(R..R)), XYDATA
$$ [...]
$$ plain form
20763 20040540 -22618437 4554467 21956909 44158988 -16536684 25637684 -23748948
20755 -8663833 33324925 630790 20554248 -22904105 -43411471 33824170 5919732 28129215
20747 28129215 -2805668 -32330271 17435215 24798857 16637944 44752176 -858454 -11097676
20739 -11097676 -25297539 2047468 -29009723 42124480 -5186965 15722316 -23902694
20731 12166741 -8605751 -40860104 -29608970 9549377 -27405875 19698512 -9728978
20723 8991875 6145487 2053350 -57756614 -20051213 1278814 -28611169 -585582 4767401
20714 29006105 -36762805 2010405 6784843 20367932 16399974 3825185 24842536 -8340484
20705 17233709 11019596 -6822161 30365233 -19881987 -30681549 -1068610 12107083
$$ packed form
20763B0040540b2618437D554467J7402442K2202079a6536684B5637684b3748948
20755h663833C3324925F30790J9923458b2904105k0507366C3824170E919732K2209483
20747B8129215b805668k9524603A7435215P363642q160913K8114232h58454j0239222
20739a1097676j4199863B047468b9009723D2124480e186965A5722316b3902694
20731A2166741h605751l2254353J1251134I549377b7405875A9698512i728978
20723H991875k846388B053350e7756614b0051213A278814b8611169e85582D767401
20714B9006105c6762805B010405M774438J3583089l967958C825185K1017351h340484
20705A7233709o214113f822161C0365233a9881987j0799562a068610A2107083
$$ plain form
20697 46279286 -25558270 -10204405 15129275 -1549803 -30521258 -49167210 8501348
20689 24214489 33315574 1027251 -9103060 12586482 1705166 13722196 -463917 10173818
20680 10102839 16909444 -5419782 -48234662 -17193457 -24778863 29918316 19804716
20673 19804716 -49473546 15189336 6112076 11540025 -9189166 11064625 14059619 14603038
20665 14603038 15672398 -6203385 10175635 -20798312 33199923 -23650890 -12152665
20658 -12152665 -17774834 23457817 35909611 -2929706 -9370609 14187986 25268285
20651 25268285 1984675 -10158712 -9276332 -262581 -5987161 -17916626 -2372786 -28043348
20643 -28043348 -9531442 -14500252 -287894 -1663769 -6090780 39850924 -42509686 14232010
$$ packed form
20697D6279286b5558270a0204405A5129275a549803k8971455j8645952H501348
20689B4214489R101085A027251i103060A2586482A705166J2017030d63917A0173818
20680A0102839O806605e419782m2814880a7193457p585406B9918316j0113600
20673A9804716d9473546A5189336F112076N427949i189166A1064625K994994N43419
20665A4603038J069360f203385A0175635b0798312C3199923b3650890J1498225
20658a2152665n622169B3457817J2451794b929706o440903A4187986J1080299
20651B5268285A984675a0158712Q82380b62581n724580j1929465b372786k5670562
20643b8043348i531442m968810b87894j375875m427011C9850924d2509686A4232010
$$ plain form
20634 -10468199 -12713220 -11230273 26192296 11222621 -2567416 -15376682 -3795134 12166215
20625 14306437 38424204 -18706684 13245930 2840898 -27533694 8444582 -7140562
20617 -17448333 -4842030 7012733 -39747760 -5269300 -24745507 49112716 -36398379
20609 25894495 1524368 -50847401 20804622 -8972500 57953499 -23179495 18474160
20601 2305876 -37810891 -30453688 -16607083 -20530138 19353025 -19436369 -19911961 -6501929
20592 -12603584 -2408448 15339176 39976311 -6621027 -4130827 -15184734 -8748550 -31066425
20584 -31066425 5198862 14524352 6588691 -28170904 -26119009 -1720064 59180186 -54472464
20575 10398798 48616815 -23037195 -7056188 -19428814 3499032 -19890050 -7207770
$$ packed form
20634a0468199k245021J482947B6192296A1222621b567416j2809266c795134A2166215
20625A4306437K4117767a8706684A3245930B840898b7533694H444582g140562
20617a7448333d842030G012733c9747760e269300j9476207D9112716c6398379
20609B5894495A524368e0847401B0804622h972500E7953499b3179495A8474160
20601B305876c7810891P357203J3846605l923055A9353025a9436369m75592f501929
20592a2603584b408448A5339176K4637135f621027K490200j1053907O436184k2317875
20584c1066425E198862R325490F588691b8170904K051895a720064E9180186e4472464
20575A0398798L8218017b3037195g056188j2372626C499032a9890050g207770
$$ plain form
20567 3504741 13217696 -13388506 -29204996 -7041132 -7850829 10376700 6479135 25377687
20559 25377687 -24325524 -9953936 2221450 -29104324 -14441225 -12142917 16544385
20551 -7336148 -20472462 22016426 -5441816 3670796 -8132961 20915952 11402406 15865243
20543 15865243 -12697625 -1103311 -1532084 -10267169 39141883 9248463 -3936662 7477090
20534 2402307 30870984 34932684 -18843939 -5170982 -14218422 11556634 -18701625 2843340
20525 -50386742 -26485130 11907173 -10181258 1929904 -33856712 -21028676 71847621
20517 -4077772 49945605 17963260 14942436 -1788811 -9413618 -26390630 12703619 28975755
20509 28975755 9234288 -16936139 12189976 4152625 -2486050 -45528926 -4551373 -1144430
$$ packed form
20567C504741R712955a3388506j5816490g041132q09697A0376700l897565J8898552
20559B5377687b4325524i953936B221450b9104324a4441225K298308A6544385
20551g336148j3136314B2016426e441816C670796h132961B0915952r513546M462837
20543A5865243a2697625a103311m28773q735085C9141883I248463c936662G477090
20534B402307K8468677M061700a8843939e170982r047440A1556634a8701625B843340
20525e0386742K3901612A1907173a0181258A929904c3856712J2828036G1847621
20517d077772D9945605A7963260l020824a788811p624807j6977012A2703619J6272136
20509B8975755I234288a6936139A2189976D152625b486050m3042876d551373a144430
$$ plain form
20500 -25734956 15846181 -15982502 -21654606 46984276 -3474179 -31906629 8061155
20492 -12614760 -11147626 16970285 247851 22093625 2387420 -26501290 -3135418 5946994
20483 22980874 52568255 -23609924 -2903908 11889930 6961664 -14112933 -8549608
20476 -8549608 -9963860 -28344167 5352815 -31521171 -20169181 -17712886 32730869 -3652166
20467 18536459 -13072503 -13006959 7949145 -14662240 18642497 -54438139 10922040 10025554
20459 10025554 14338819 -9744324 -11607531 19615696 -2099855 7702505 -22910857 8829910
20450 -16108423 37721237 -18481585 8338873 21503342 19149290 13766349 -10791420
20442 21135024 -43807501 11373296 15903164 -6854215 6685473 -16507674 44311399
$$ packed form
20500b5734956A5846181a5982502n672104D6984276c474179k8432450H061155
20492a2614760J467134A6970285B47851K1845774B387420b6501290c135418E946994
20483B2980874K9587381b3609924b903908A1889930m928266a4112933N563325
20476h549608j414252j8380307E352815c1521171J1351990K456295C2730869c652166
20467A8536459a3072503O5544G949145a4662240A8642497e4438139A0922040q96486
20459A0025554M313265i744324j863207A9615696b099855G702505b2910857H829910
20450a6108423C7721237a8481585H338873J3164469k354052n382941a0791420
20442B1135024d3807501A1373296M529868f854215F685473a6507674D4311399
$$ plain form
20434 -4015568 -19821730 33405103 50535944 -7493824 44169112 42733560 -9777019 2440181
20425 -2483752 31487741 -16189045 47398202 43707561 3900916 -32671636 -9718048 -7740373
20417 -7740373 9763961 1975751 9937011 -2307703 -13159604 1669690 11186986 -27002934
20408 -11038163 -9223273 -28204251 7845518 -16566453 -21337670 -12727108 -43197110 11257614
20399 -53042011 -12685708 31596147 18218341 -30468082 2392720 9171850 4345329
20391 -7209664 45978352 1139542 12291450 27837945 11398017 -12036766 444032 -13416905
20382 11337444 17178721 -7903780 -16829022 5029713 4820234 -3058524 29340283 -13542678
20373 -3701965 12097666 -14568027 -14045318 16481543 8419465 -5946747 -22613564 -13283698
$$ packed form
20434d015568j5806162C3405103J7130841g493824D4169112j435552i777019B440181
20425b483752C1487741a6189045D7398202l690641C900916c2671636i718048J977675
20417g740373I763961A975751P961260b307703j0851901A669690R517296b7002934
20408a1038163J814890j8980978G845518a6566453m771217Q610562l0470002A1257614
20399e3042011a2685708C1596147j3377806c0468082B392720O779130D345329
20391g209664D5978352A139542J1151908J5546495A1398017a2036766D44032a3416905
20382A1337444N841277g903780q925242E029713k09479c058524B9340283a3542678
20373c701965A2097666a4568027N22709A6481543q062078e946747j6666817R329866
$$ plain form
20365 -13283698 2917463 4183314 -2471508 15859035 -33467467 -29697846 -8171139 35131583
20356 23846509 19106116 -44567290 7909350 -32240206 16532785 31334142 7527767
20348 -4862457 2216036 24513435 19283835 -13586338 -11280958 34124406 19428353 22228351
20340 22228351 3147506 -2333350 -10640972 -20746272 17728941 51039108 -3709470 -7492224
20332 -7492224 -12294525 14759715 41212557 1559698 14320215 95456 20602883 -2044705
20323 18502500 10269237 -23650735 5039184 32371483 -5129255 -2099232 14261319 -706134
20314 -3595261 2589255 30500396 9961554 17045283 -16097318 185054 517125 29674993
20306 29674993 4834141 15384852 973983 14004986 -6689556 -13749961 -18342029 -2161737
$$ packed form
20365a3283698B917463J265851b471508A5859035c3467467L769621h171139C5131583
20356B3846509m740393d4567290G909350c2240206A6532785J4801357G527767
20348d862457B216036K2297399n229600a3586338K305380C4124406j4696053K799998
20340B2228351C147506b333350q307622j0105300A7728941L3310167c709470l782754
20332g492224m802301A4759715K6452842A559698J2760517I5456K0507427b044705
20323A8502500q233263b3650735E039184K7332299e129255b099232A4261319g06134
20314c595261B589255K7911141I961554P083729a6097318A85054L32071K9157868
20306B9674993D834141J0550711I73983J3031003f689556p060405m592068b161737
$$ plain form
20297 -8909290 3213925 -7046489 2073710 -39217009 9047149 -13331164 -5887543 12115239
20288 -17273283 16725200 33675566 6792046 2041137 20115662 458939 35996632 35214354
20280 35214354 9571054 8459000 -9838247 -23804831 823567 19934330 -26388143 -12280970
20271 9434771 -32296079 -8556906 -21248687 -20883059 -41503970 3653129 1683612 4036846
20263 4036846 -16049592 2741603 -7427911 -4645304 51781389 -9420526 -14152365 -22246581
20255 -22246581 -25362597 -54140595 29643373 -39968226 4606250 -39736769 -9344651
20247 10212355 -17799840 16690939 789092 24697533 -15227108 -32237342 5279725
20239 -24173352 28223449 10538912 12033171 -497029 8796845 28287791 -36825817 -21806210
$$ packed form
20297h909290C213925g046489B073710c9217009I047149a3331164e887543A2115239
20288a7273283A6725200J6950366F792046B041137J8074525D58939L5537693p82278
20280C5214354I571054j112054i838247j3966584H23567J9110763b6388143a2280970
20271I434771c2296079h556906j2691781L65628k0620911C653129A683612K353234
20263D036846a6049592B741603g427911K782607E1781389i420526m731839q094216
20255b2246581l116016k8777998B9643373c9968226D606250c9736769i344651
20247A0212355a7799840A6690939G89092K3908441a5227108j7010234E279725
20239b4173352B8223449A0538912J494259d97029H796845J9490946c6825817J5019607
$$ plain form
20231 -21806210 -40111944 41005098 300979 43548431 28365836 708060 9331967 7200476
20223 7200476 -4983436 -31612375 6909459 14138245 -5507239 -42495844 6558811 30389012
20215 30389012 272317 -15777444 -34650046 21162359 17456763 -16037203 -8850875 27515059
20206 -32512850 -18502234 276328 -12496481 485935 -67764826 8018521 16809392 -20979782
20197 -22481233 -22240573 5045316 -7333119 8691638 16278791 5156801 2362326 4419492
20189 4419492 11918185 -15881300 13036944 -55246685 -6567497 36951991 -12632469
20181 -15949651 7098035 1573181 23810722 11574779 -56719864 31735613 -6082771
20173 -18503982 4344497 1882624 83423 -6777431 -16949843 -32663533 -18562451 32970005
$$ packed form
20231b1806210j8305734D1005098C00979M3247452j5182595G08060Q623907k131491
20223G200476d983436k6628939F909459P228786e507239l6988605F558811K3830201
20215C0389012B72317a5777444j8872602B1162359l705596a6037203P186328B7515059
20206c2512850J4010616B76328a2496481D85935f7764826H018521Q790871b0979782
20197b2481233K40660E045316g333119H691638P587153E156801B362326K057166
20189D419492P498693a5881300A3036944e5246685f567497C6951991a2632469
20181a5949651G098035A573181K2237541A1574779e6719864C1735613f082771
20173a8503982D344497A882624H3423f777431j0172412j5713690J4101082C2970005
$$ plain form
20164 -4196553 13154996 -16704667 -2172365 -12933274 5457318 37578986 -16178518
20156 451549 -33481654 -35436207 -7523419 27598201 -700590 13736589 2278266 -342350
20147 17848638 -42623473 30056382 15914600 -33588274 -5658576 35676917 -18260651
20139 18935985 23902276 23847186 -5439096 5625473 52152985 6972395 8493119 -18559938
20130 -10675862 -30463081 20294623 -6735023 8445204 36038469 26156292 30412126 12365328
20121 3917763 11317118 29949370 23566480 -15705153 1114422 -16555326 12620772 -31781202
20112 -10517397 -14583176 -12375684 17284201 1886328 16897926 18672442 -21733064 39195691
20103 5254176 37518396 -20451507 -7296750 -9898864 27571210 6809941 2171388 -664364
$$ packed form
20164d196553A3154996a6704667b172365j0760909E457318L2121668a6178518
20156D51549c3481654j954553g523419B7598201g00590A3736589B278266c42350
20147A7848638d2623473C0056382j4141782c3588274e658576C5676917a8260651
20139A8935985M966291n5090e439096E625473M6527512F972395J520724a8559938
20130a0675862j9787219B0294623f735023H445204K7593265r882177M255834A2365328
20121C917763P399355J8632252o382890a5705153A114422a6555326A2620772c1781202
20112a0517397m065779K207492A7284201A886328J5011598J774516b1733064C9195691
20103E254176L2264220b0451507g296750k602114B7571210F809941B171388f64364
$$ plain form
20094 -35793003 -10421793 2680726 -1141884 -13496227 1770786 4195247 -8579561 -11600489
20086 -11600489 -7274353 14751116 31662796 11188002 21479842 -9341008 -3102466
20078 -22344171 8315250 11487528 -1100849 -16592899 25527615 2489450 15297626 -7164743
20069 -39346010 24174968 30762782 -21656319 -22519885 -24163590 -23145342 20812074 -8176464
20060 -40972348 30991062 -13935849 20908286 21275994 14794806 48608389 41362041 -12352154
20051 -817506 29705558 9472899 -62848 -5922794 20512355 14319475 -1606756 10177067
20042 -10292720 -46072258 -12434945 -32183023 -35783567 -9970013 -45962167 -17245734
20034 16719189 -25336875 47537384 15258994 -38226364 -5189296 17189081 -17042456
$$ packed form
20094c5793003a0421793B680726a141884j2354343A770786K424461h579561l020928
20086a1600489M326136A4751116J6911680A1188002J0291840i341008c102466
20078b2344171H315250L172278a100849j5492050B5527615B489450J2808176g164743
20069c9346010B4174968O587814b1656319q63566j643705J018248B0812074h176464
20060d0972348C0991062a3935849B0908286L67708o481188L3813583p246348a2352154
20051h17506B9705558I472899f2848n859946B0512355o192880a606756A0177067
20042a0292720l5779538a2434945j9748078l600544i970013l5992154a7245734
20034A6719189b5336875D7537384A5258994c8226364e189296A7189081a7042456
$$ plain form
20026 22866411 -3328586 -31472268 -13502237 -10838112 -11892372 -21077476 37328684 9825915
20017 4509477 15204523 -8731781 -48142088 12203792 12293340 -11078236 15694703 -394898
20008 5633206 3447896 66404 -42714105 18135472 -3410366 25751530 503991 -23181482
19999 1770252 -1000719 -36668914 -21868244 12943377 -9557084 -10685757 20121579 44982409
19991 44982409 -7059124 9537663 15407525 -1005918 29388989 -46921524 -7852219 1325519
19982 5089891 -6475566 6222319 -6150695 21941879 40581461 22172172 28529832 -20645963
19973 105721 -11036961 -7831378 32634031 -9537950 21911882 12775803 10239305 2326303
19964 -2497008 2124761 1060831 29069759 -22942070 -10844414 13076334 -8123023 20920181
$$ packed form
20026B2866411c328586k8143682a3502237K664125j054260r185104C7328684I825915
20017D509477J0695046h731781l9410307A2203792Q9548a1078236A5694703c94898
20008E633206k185310F6404d2714105A8135472c410366B5751530E03991b3181482
19999A770252a000719l5668195J4800670A2943377i557084j128673B0121579K4860830
19991D4982409g059124I537663N869862a005918B9388989d6921524g852219A325519
19982E089891f475566F222319f150695B1941879J8639582j8409289O357660b0645963
19973A05721a1036961L205583C2634031i537950B1911882r136079k536498B326303
19964b497008B124761A060831K8008928b2942070a0844414A3076334h123023B0920181
$$ plain form
19955 -12911514 -22286548 23919947 -23724880 2145618 -7084822 -6558515 3538761 26507494
19947 26507494 -932111 4434527 32911120 -27906398 -28906394 11896967 -52575399 -9648291
19938 -24442511 -8192471 -25310846 -6747129 16164056 -28121183 -5199200 -31630457
19931 -31630457 33646735 -30274541 16507808 2158225 38927458 9667735 -4126577
19923 -7024698 11150976 16013542 50021301 -5216729 -13200665 -12436952 -7325196 28042398
19914 51132764 -31662449 1820411 16821406 9094535 2112973 7232256 -7912645 -7548586
19906 -7548586 -3689726 11020311 9001009 26432239 -17741977 604646 -18031428 14002016
19897 20471650 28218402 -7535521 -2237992 -8039788 954652 31468157 -32957293 2319887
$$ packed form
19955a2911514r375034B3919947b3724880B145618g084822N26307C538761K2968733
19947B6507494i32111D434527K8476593b7906398r99996A1896967e2575399i648291
19938b4442511h192471j7118375f747129A6164056b8121183e199200k6431257
19931c1630457C3646735c0274541A6507808B158225L6769233I667735d126577
19923g024698A1150976M862566L4007759e216729p983936P63713N111756B8042398
19914E1132764c1662449A820411J5000995p726871B112973N119283g912645L64059
19906g548586c689726A1020311k019302J7431230a7741977F04646a8031428A4002016
19897B0471650P746752g535521b237992n801796I54652L0513505c2957293B319887
$$ plain form
19888 -15420804 30093260 16290151 13671196 -1391855 14265945 -25882454 278859 -6093077
19879 10401397 -47701827 -37641602 21807533 -5272434 -933001 15306295 -5255489 32146359
19870 3516331 22397641 -12716782 8046320 17212285 -2020248 21457418 5620362 15809329
19862 15809329 8562246 32082258 41980060 -717795 -19468317 4392763 28753933 -11177440
19853 -3281065 1198947 4714895 -7126679 -328214 -15708435 -32283210 17655800 -1618387
19844 4356229 19955819 -8234635 7368854 -19388121 -8341884 -47646158 -21319186 -9278729
19835 16736374 -21434632 -18021862 -6727253 -4122484 34867809 15974253 6753634 16769311
19827 16769311 -30647652 5878819 -16988428 2607129 -32743776 40943738 -9404873
$$ packed form
19888a5420804C0093260j3803109k618955a391855A4265945b5882454B78859f093077
19879A0401397d7701827J0060225B1807533e272434i33001A5306295e255489C2146359
19870C516331J8881310a2716782H046320R165965b020248B1457418E620362J0188967
19862A5809329p247083K3520012R897802g17795j8750522D392763K4361170a1177440
19853c281065A198947L515948g126679c28214j5380221j6574775A7655800a618387
19844D356229J5599590h234635G368854a9388121h341884l9304274b1319186i278729
19835A6736374b1434632L412770f727253K604769C4867809A5974253F753634J0015677
19827A6769311c0647652E878819a6988428B607129c2743776D0943738i404873
$$ plain form
19819 -29213532 15717831 -10960282 18764146 -22157125 -24259240 -23126367 6560708
19811 14408136 8538597 -7786023 50939837 41879917 2439900 9187045 -13321243 -3394212
19802 19193168 1009454 -5188746 34686871 -43398626 -16478900 33600463 -6919464
19794 37817491 38695189 1721831 -20863000 -24052537 31293563 -5078094 24545020 -20213029
19785 11013897 -18059575 -30530549 26612624 31102110 -49955778 -7670299 39389851
19777 -11115980 13175842 206153 13394882 6634746 -2842589 -17225633 33542382 16392365
19768 -4883429 17008699 -51805969 -12803320 -2903364 32059662 19296453 -10255376
19760 22668242 -42971846 -28519089 33838489 27321227 -19048638 26271000 -20279385
$$ packed form
19819b9213532A5717831a0960282A8764146b2157125k102115J132873F560708
19811A4408136n869539g786023E0939837r059920B439900O747145a3321243c394212
19802A9193168A009454e188746C4686871d3398626a6478900C3600463f919464
19794C7817491Q77698A721831b0863000l189537C1293563e078094B4545020b0213029
19785A1013897a8059575j2470974B6612624M489486d9955778g670299C9389851
19777a1115980A3175842B06153J3188729F634746b842589j4383044C3542382A6392365
19768d883429A7008699e1805969a2803320b903364C2059662j2763209a0255376
19760B2668242d2971846J4452757C3838489o517262a9048638B6271000b0279385
$$ plain form
19752 48557295 7424040 -11047697 14153718 -34246320 22333936 30633389 2215294
19744 9930672 -10871934 -1952345 -18198405 -30112033 -29437064 17412712 -35162050 -10944349
19735 -25552548 20142699 46307162 -16893463 3452958 14914514 -23170369 7840539
19727 -30924367 7579151 20886234 537596 -17959604 -27032107 34945750 -7281838 23060504
19718 -4691864 24541745 -11152768 25241338 32808876 -3935078 22405983 -6840514 22789695
19709 22221833 31766560 7767474 -54682794 12400176 23762973 -21854260 -23860370
19702 -23860370 45467637 -2756593 -7009168 14091078 -17075504 -5512013 21803231
19694 -1514013 -16809560 2904162 2925464 -7585731 -26624544 7259771 -28482886 31478970
$$ packed form
19752D8557295G424040a1047697A4153718c4246320B2333936Q299453B215294
19744I930672a0871934a952345j6246060j1913628O74969A7412712c5162050a0944349
19735b5552548B0142699K6164463a6893463C452958J1461556b3170369G840539
19727c0924367G579151J3307083E37596a7959604r072503C4945750g281838B3060504
19718d691864B4541745a1152768B5241338P567538c935078B2405983f840514B2789695
19709B2221833R544727G767474e4682794A2400176J1362797b1854260k006110
19702b3860370D5467637b756593m252575A4091078a7075504e512013B1803231
19694a514013j5295547B904162K1302g585731j9038813G259771b8482886C1478970
$$ plain form
19685 -31941823 7505630 7829424 -20078505 10721094 15293999 10340981 -4340255 -31873798
19677 -31873798 4586680 -848336 -30135109 -39763849 -741501 18943661 30952913 26759442
19669 26759442 7039944 -46601349 2354012 -3969060 -24861402 -5702162 40141930 8272982
19660 -21057133 -1706324 -24413120 26568878 -40718799 43025145 1194903 -11015144
19652 11013749 14966831 -26629112 20021528 -21906161 23807585 -12649786 10157426
19644 18958785 -20176234 -1505796 16596354 -9806699 13060374 47273074 -211976 16266193
19635 1935122 -14969477 -21140733 11696473 -14624431 -10509190 5334701 24882941 40421279
19627 40421279 -2936623 10903835 -50333482 -5293258 -40663814 37717569 -22993957
$$ packed form
19685c1941823G505630L23794b0078505A0721094M572905m953018d340255k7533543
19677c1873798D586680h48336k9286773r628740g41501A8943661J2009252m193471
19669B6759442G039944d6601349B354012c969060k0892342e702162D0141930H272982
19660b1057133a706324k2706796B6568878d0718799D3025145A194903a1015144
19652A1013749L953082b6629112B0021528b1906161B3807585a2649786A0157426
19644A8958785b0176234a505796A6596354i806699A3060374L4212700b11976A6266193
19635A935122a4969477o171256A1696473a4624431M115241E334701J9548240J5538338
19627D0421279b936623A0903835e0333482e293258l5370556C7717569b2993957
$$ plain form
19619 -30226675 -30489939 -49979327 6938762 -24776977 -12244301 5590655 10618394 8421241
19611 8421241 -33992040 -11942837 -16615144 -75564 -25736061 13481136 52963511 21452298
19602 -790303 10818594 17990840 -1739458 5665406 -27217698 -9617885 -17607496 57205064
19593 22585822 12749030 14037754 -11985695 25701632 8697868 -11667237 -22037346
19586 -22037346 -6225790 3990862 16993414 1766662 35709417 7157234 -28028504 -6170652
19577 21940552 -46863093 -16611493 -3264478 2911797 15730544 12855416 -27488394
19569 -34501769 -3867119 -27029892 32866817 -45619229 -12632226 -14895167 3356553
19561 9018302 -22127787 -16190189 28130942 -10138467 -39277939 -4718267 43516471
$$ packed form
19619c0226675k63264j9489388F938762b4776977a2244301E590655N027739k197153
19611H421241c3992040a1942837m672307g5564k5660497A3481136L9482375B1452298
19602g90303A0818594P172246a739458E665406b7217698i617885p989611E7205064
19593B2585822r836792J288724a1985695B5701632H697868a1667237j0370109
19586b2037346f225790C990862J3002552A766662L3942755G157234b8028504f170652
19577B1940552d6863093a6611493c264478B911797J2818747k875128b7488394
19569c4501769c867119k3162773C2866817d5619229a2632226k262941C356553
19561I018302b2127787N937598B8130942a0138467k9139472d718267D3516471
$$ plain form
19553 7968709 36640151 5304076 -7402919 -13215246 5143247 -54359044 9891609 30242771
19545 30242771 -14659347 23558883 -4540817 27032005 -15712321 10733257 -22097815
19537 -5757146 20518553 20261180 11094403 -38472693 -13730216 31174420 13837880 14077938
19529 14077938 -22249615 36594198 -5853113 -17298060 3940729 7494483 10578222 -30731750
19520 -18818968 -10142325 -10746809 14443657 -10129664 15580253 -16033194 -21019447 42369211
19511 20688031 3228406 -54872777 2599554 17770620 11836300 24210274 10071333
19503 -3912502 -12042856 -18885857 40682039 -27403766 44166917 14640679 -31351008
19495 36402132 -40146616 35902916 9358940 26960608 -6606091 931416 -10845305 -17246804
$$ packed form
19553G968709K8671442E304076g402919n812327E143247e4359044I891609K0351162
19545C0242771a4659347B3558883d540817B7032005a5712321A0733257b2097815
19537e757146B0518553k57373r166777c8472693a3730216C1174420A3837880K40058
19529A4077938b2249615C6594198e853113j1444947C940729L553754L083739c0731750
19520a8818968Q676643o04484A4443657a0129664A5580253a6033194m986253D2369211
19511B0688031C228406e4872777B599554J5171066n934320J2373974A0071333
19503c912502q130354o843001D0682039b7403766D4166917A4640679c1351008
19495C6402132d0146616C5902916I358940J7601668f606091I31416a0845305o401499
$$ plain form
19487 -17246804 15628406 -1912102 26288704 11187665 -7723053 -1837669 31799580
19479 1469764 -23892975 1581772 14764854 5426147 16641475 5991022 6694024 -17634516
19470 -13297413 -14066480 25802678 27382351 19122208 14781798 -21967818 16432168 -11131147
19461 6729983 -15200716 -29133284 7526222 20110714 6334338 -5402830 -21903527 3124773
19452 29015640 21660687 1892596 -3195935 43219498 13628607 10650307 -31711982 -40679176
19444 -40679176 -12191319 -25359532 -3619704 2923614 27894874 -15729247 -2804593
19436 2526557 12995004 11370716 1061204 -4872506 34972652 -16649747 -7902498 -10001879
19428 -10001879 -12334964 21852399 -5633968 4684703 -27311304 20413424 5301685 2604160
$$ packed form
19487a7246804A5628406a912102B6288704A1187665g723053a837669C1799580
19479A469764b3892975A581772J3183082E426147J1215328E991022P03002a7634516
19470a3297413p69067B5802678J579673q260143m340410b1967818A6432168a1131147
19461F729983a5200716j3932568G526222J2584492F334338e402830j6500697C124773
19452B9015640p354953A892596c195935D3219498A3628607k978300c1711982q967194
19444d0679176a2191319j3168213c619704B923614K4971260a5729247b804593
19436B526557J0468447j624288A061204d872506C4972652a6649747g902498k099381
19428a0001879k333085B1852399e633968D684703b7311304B0413424E301685B604160
$$ plain form
19419 -38286541 -12274238 -10052195 -67474935 7757222 5400643 -16291170 -14847459 2754744
19410 17748436 -23861178 -8342274 37511974 22814549 8232498 -15704203 10726930
19402 -30628743 -8484641 -2365570 -28982487 15852733 5714886 -10026397 -7457091 -26716
19393 -21328805 -1593889 -15665790 17983085 24534699 -4341657 -12060849 -10853561 -2251290
19384 -14099236 23718164 34438888 -9929493 12956542 -39145200 -24649128 17798921
19376 50055153 31957793 12086637 1249238 2265372 -48017084 -17634423 28305460
19368 44337320 25973874 7259897 40623898 12726154 1766649 -12011147 -24313849
19361 -24313849 -18254759 -2609550 -10641533 -22957529 15470348 -19092431 7804606 -21641213
$$ packed form
19419c8286541a2274238K222043n7422740G757222k356579a6291170J443711B754744
19410A7748436b3861178h342274C7511974j4697425H232498a5704203A0726930
19402c0628743h484641b365570k6616917A5852733E714886a0026397K569306b6716
19393b1328805a593889j4071901A7983085O551614d341657p719192J207288b251290
19384a4099236B3718164J0720724i929493A2956542c9145200J4496072A7798921
19376E0055153j8097360A2086637A249238J016134d8017084a7634423B8305460
19368D4337320j8363446G259897L3364001A2726154A766649a2011147j2302702
19361b4313849O059090b609550q031983j2315996A5470348a9092431G804606b1641213
$$ plain form
19352 -27015856 -8509521 1688232 1088949 -29044343 7307266 28566640 41197311 -25784173
19343 20101969 -16464462 -18363481 8081696 -43759302 -21988864 -50952250 -23460778
19335 -25933361 -26438133 -19390905 -2307026 -12436665 15373491 -476181 21640044 -2983639
19326 -1162857 21982141 47112700 5425249 -2450174 -14724718 1672459 -2352830 -10922662
19318 -10922662 -24272294 -8565484 -185554 4942178 14906539 37138258 9163869 -20352509
19309 21409797 -25126109 -4388192 46784188 3265031 -18979364 20466371 8566685
19301 18044572 -31118208 -19924732 15551104 -15909966 7121192 -7750354 21773995
19293 3973990 32184881 1697718 -11421633 -4049163 -443161 6412626 -5988299 20754605
$$ packed form
19352b7015856h509521A688232n99283b9044343G307266K1259374J2630671b5784173
19343B0101969a6464462j899019H081696d3759302K1770438k8963386b3460778
19335b5933361n04772P047228b307026j0129639A5373491d76181B1640044b983639
19326a162857B1982141K5130559E425249b450174j2274544A672459b352830q569832
19318a0922662j3349632h565484a85554D942178R964361K2231719I163869b0352509
19309B1409797b5126109d388192D6784188C265031a8979364B0466371H566685
19301A8044572c1118208J1193476A5551104a5909966G121192g750354B1773995
19293C973990K8210891A697718a1421633d049163d43161F412626e988299B0754605
$$ plain form
19284 -25204832 18056336 -7220838 33355110 -16750669 37590730 16688556 2489639
19276 6283153 5775812 -22553365 -24020544 9522430 -3033436 -47998336 360823 43839904
19268 43839904 26290874 29185996 3970914 -27544876 24192772 19653231 10498252 15989300
19260 15989300 5199897 1226330 14566525 -33211756 -17575050 -14916844 -28729337
19253 -28729337 -24902258 -4156496 -721314 13630692 -57424740 1349295 -16426763 25189690
19244 13105866 -12562186 -47854008 -30207302 -12286591 8712936 -23359095 -1032760
19236 -42903882 7747490 120772 -37399978 52770840 -4831088 4002083 38598236 -26259435
19227 -12968750 -8613888 21949471 3846183 3756863 55227794 -6768986 8002918 -9274961
$$ packed form
19284b5204832A8056336g220838C3355110a6750669C7590730A6688556B489639
19276F283153n07341b2553365j467179I522430c033436m4964900C60823M3479081
19268D3839904j7549030K895122C970914b7544876B4192772m539541r154979N491048
19260A5989300E199897A226330J3340195c3211756J5636706K658206j3812493
19253b8729337L827079d156496g21314A3630692e7424740A349295a6426763B5189690
19244A3105866a2562186l5291822J7646706a2286591H712936b3359095a032760
19236d2903882G747490A20772c7399978E2770840d831088D002083L4596153b6259435
19227a2968750M354862B1949471C846183q9320N1470931f768986H002918i274961
$$ plain form
19218 -31495183 -7005538 -15784653 -24659099 -21842889 30069582 -32268823 27220711 38854479
19210 38854479 53683022 -33784979 -21432425 -7340909 -14965679 15121108 -11649563
19202 9129836 2229902 13470454 -19791176 24004166 -669763 22181390 -27029939 -5678831
19193 -5604377 -10078858 4806227 26350730 -3299943 -21725897 -9342639 -21260451 8458935
19184 -517595 17579320 11509564 21045350 6638377 12643482 21394271 9133767 297907
19175 -40594009 -39266043 -17671650 8747414 21953314 -4548208 3042422 12390726 -38011978
19166 -2468381 -6657755 -2619376 10612095 15715644 258700 -648348 -2128570 -1429703
19158 -1429703 -227354 33227792 -40117083 36859090 -28581723 -23319725 15025408 -5278237
$$ packed form
19218c1495183g005538q779115q874446K816210C0069582c2268823B7220711J1633768
19210C8854479J4828543c3784979J2352554g340909p624770A5121108a1649563
19202I129836B229902J1240552a9791176B4004166f69763B2181390b7029939e678831
19193e604377m474481D806227K1544503c299943j8425954i342639j1917812H458935
19184e17595A7579320o069756R535786F638377O005105Q750789I133767B97907
19175d0594009J327966a7671650H747414J3205900d548208C042422R348304c8011978
19166b468381m189374b619376A0612095N103549B58700f48348j480222O98867
19158a429703b27354C3227792d0117083C6859090b8581723N261998A5025408e278237
$$ plain form
19149 12418643 -15668833 -7696893 -17131645 -33076740 -46635899 10953550 -8029799
19141 -11344633 30344041 11201951 -6358644 27432747 5220752 -17898215 -46319566
19134 -46319566 7679278 13648140 -7106203 8856737 13997967 53800823 -6269371 -8242448
19126 -8242448 -29270897 -2410561 7217294 23576372 -30741992 13830639 9811981 -14220886
19117 15121912 -35075825 4797435 -7095472 8124164 -2428312 -25437469 -12970464 15292084
19108 -9339757 -11722744 -23455084 -29738390 11707990 -12993912 -32612431 9880530 26832966
19100 26832966 4318035 -883163 34417222 37410672 -44382685 -1583313 17448679 12396524
19092 12396524 27696035 21566341 -9468847 18033151 29738361 21759803 35623437
$$ packed form
19149A2418643a5668833g696893r434752j5945095j3559159A0953550h029799
19141a1344633C0344041A1201951f358644B7432747E220752a7898215k8421351
19134d6319566G679278N968862g106203H856737N141230L9802856f269371j973077
19126h242448k1028449b410561G217294J6359078c0741992A3830639m018658a4220886
19117A5121912c5075825D797435g095472H124164b428312k3009157J2467005A5292084
19108i339757k382987j1732340o283306A1707990a2993912j9618519I880530J6952436
19100B6832966D318035h83163C4417222K993450d4382685a583313A7448679n052155
19092A2396524J5299511o129694i468847A8033151J1705210p978558J3863634
$$ plain form
19085 35623437 705523 -15666663 -6337013 -48374346 -35018746 2651315 -27114275 15525341
19076 21890246 27275282 -17367245 -46126780 27028917 28736765 7324018 966814 11441462
19068 11441462 40370110 9019414 -7784351 -4567574 -7331700 983539 31052731 -5458794
19059 -17788811 -11319805 10229579 9176351 16376160 33012970 -34066474 20544119
19051 -25082355 -375544 21501844 20265969 -30711501 37281224 37005846 24820987 8071581
19042 -10336450 -12948034 -12522369 13037799 -5795291 21946467 17548404 37491677 -3035423
19033 13222504 42420354 -6680621 -17156676 -12686020 16912756 -4301058 8300394 40246797
19025 40246797 -28325757 3948395 8824436 39114415 -23356569 -30562490 -11572682
$$ packed form
19085C5623437G05523a5666663f337013m2037333J3355600B651315b7114275A5525341
19076B1890246N385036a7367245k8759535B7028917J707848G324018I66814J0474648
19068A1441462K8928648I019414g784351L216777k764126I83539L0069192e458794
19059a7788811O469006A0229579j053228P199809J6636810c4066474B0544119
19051b5082355c75544B1501844j235875c0711501C7281224k75378j2184859H071581
19042a0336450k611584M25665A3037799e795291B1946467m398063J9943273c035423
19033A3222504K9197850f680621j0476055M470656A6912756d301058H300394L1946403
19025D0246797b8325757C948395M876041L0289979b3356569p205921a1572682
$$ plain form
19017 2193563 -28988532 10400080 -50925968 4545380 -53536273 33061272 28229879
19010 28229879 -14237305 18899181 21449471 38425561 -2182018 -7103932 -17242393
19003 -17242393 -12871486 27337592 1208666 -36444106 24725341 24642802 -18900934 -36708346
18995 -36708346 27192825 -18939053 1580260 -1926797 22656360 5499763 4427602 -45237237
18986 4642312 -8888572 19142584 -3246113 15902522 27549383 4269150 5349786 -1274257
18977 18227088 4668009 32168222 -33516457 -9215600 -30164202 54525451 18271004
18969 -21984996 13612797 9543933 -16822493 5987186 20231636 2698045 25763851
18962 25763851 -8270957 -1697166 36095379 -7593582 -38188485 4821030 -41578152 23969345
$$ packed form
19017B193563b8988532A0400080e0925968D545380e3536273C3061272m831393
19010B8229879a4237305A8899181K550290J6976090b182018m921914j0138461
19003a7242393M370907B7337592A208666c6444106B4725341q2539a8900934j7807412
18995c6708346B7192825a8939053A580260a926797B2656360E499763j072161d5237237
18986D642312h888572A9142584c246113A5902522J1646861D269150J080636a274257
18977A8227088D668009K7500213c3516457i215600k0948602E4525451A8271004
18969b1984996A3612797m068864a6822493E987186J4244450B698045K3065806
18962B5763851h270957a697166C6095379g593582l0594903D821030d1578152B3969345
$$ plain form
18953 -12617743 3836604 -10515788 -41163231 5483430 36282133 -20254232 -3748500
18945 3180161 -19733121 11342155 28165266 -6635960 10615219 -39982325 -2582484
18937 -20429966 -14299377 9025489 -20958768 -4402399 436170 14475546 30816540 -23165950
18928 19515842 -19563993 -29476368 -13664779 45575407 -21635037 11334033 -26930210
18920 7213784 -10108950 -29981201 -46394888 11221826 -9799597 -34314052 -19960656
18913 -19960656 -11133054 -1465530 -7077536 9759492 21261112 -9120555 -14220263 25407339
18904 -1244185 -8202494 -13159434 30754156 3306259 8942915 6524309 -11946605 -5156019
18895 32902316 12858839 15749719 25568528 5935923 -18483076 -21746921 -17556173 11174429
$$ packed form
18953a2617743C836604a0515788l0647443E483430L0798703b0254232c748500
18945C180161a9733121A1342155J6823111f635960A0615219c9982325b582484
18937b0429966O130589I025489b0958768d402399D36170J4039376J6340994b3165950
18928A9515842a9563993r912375a3664779D5575407b1635037A1334033b6930210
18920G213784a0108950j9872251j6413687A1221826i799597k4514455J4353396
18913a9960656Q827602a465530n612006I759492J1501620i120555n099708B5407339
18904a244185o958309m956940C0754156C306259N636656k418606a1946605e156019
18895C2902316A2858839K890880R818809E935923a8483076l263845M190748A1174429
$$ plain form
18886 -15483521 28053984 -37304167 6783785 -10729699 30850134 20527293 -24133767
18878 -39439277 4702175 -42515513 7464403 -20086312 25256196 20087513 -35467202
18870 4396581 19010212 -27248652 16236814 -30183565 -24493886 -11988621 41121619
18862 2285969 -4959318 6794156 36316271 10187656 -4048390 5316079 -3781990 41224734
18853 -27445625 8340926 -9962338 3921114 6095326 44596082 14702304 16425579 3597516
18844 -1646899 -16823572 11070396 16297929 -17474870 4785725 -36895626 31004050
18836 -33642673 -47141718 -21187807 39951730 -8740601 1883988 21685876 -22362795
18828 -22294142 41603093 6276076 30894144 9513882 -4012085 19985902 -17790264
$$ packed form
18886a5483521B8053984c7304167F783785a0729699C0850134j0322841b4133767
18878c9439277D702175d2515513G464403b0086312B5256196n168683c5467202
18870D396581J4613631b7248652A6236814c0183565N689679a1988621D1121619
18862B285969d959318F794156K9522115A0187656d048390E316079c781990D1224734
18853b7445625H340926i962338C921114K174212L8500756A4702304J723275C597516
18844a646899j5176673A1070396N227533a7474870D785725c6895626C1004050
18836c3642673j3499045b1187807C9951730h740601A883988J9801888b2362795
18828b2294142D1603093F276076K4618068I513882d012085A9985902a7790264
$$ plain form
18820 30652672 -19423007 20010016 1646081 29634896 2256080 1201901 -29624014
18812 878404 28718264 -22356745 43987030 8194911 -23683479 1893216 38003159 -25348201
18803 -34052075 -22891010 1255484 3874233 2984890 -54508207 12658279 6607393 -21506970
18794 -37344176 25526200 -22774768 4670303 -24386150 10088957 23382595 5924199
18786 9668079 14475955 4395082 -22806629 -11268419 15363936 -4746547 -13825509 -18157456
18778 -18157456 4041744 -19960509 7826525 3131429 32422500 -6188702 14292590 15586353
18770 15586353 -13824172 -1321317 -7176321 13568722 -41267394 28272474 -5038356
18762 24950914 22751360 -25574951 10816103 15681200 -26764982 -34208311 31347751
$$ packed form
18820C0652672a9423007B0010016A646081K7988815B256080j054179b9624014
18812H78404K7839860b2356745D3987030H194911b3683479A893216L6109943b5348201
18803c4052075J1161065A255484K618749q89343e4508207A2658279o050886b1506970
18794c7344176B5526200b2774768D670303b4386150A0088957J3293638E924199
18786I668079M807876D395082b2806629a1268419A5363936d746547r078962m331947
18778a8157456D041744a9960509G826525C131429K9291071f188702A4292590J293763
18770A5586353a3824172a321317n855004A3568722d1267394B8272474e038356
18762B4950914k199554b5574951A0816103M865097b6764982p443329C1347751
$$ plain form
18754 -8484689 42496211 -6462925 -4619634 -7880180 -35976819 -34171662 10325038 5051234
18745 -7336474 -24485856 3014251 -20074961 7048632 10636798 8908806 3305778 -27704020
18736 -11768929 7811484 11051972 2438843 -4253343 -8721928 -33960401 9373583 -10207938
18727 40769177 -4778537 9342940 -7268115 -8445659 -40443032 40959767 13482873 20669674
18719 20669674 9223868 21345282 -21795730 -23123400 -1433945 -18022288 6751832 18911780
18711 18911780 15507982 19603455 2164317 -17880064 -5475456 10099574 43436160 31257122
18703 31257122 -24219514 -8737329 18762276 -3349795 -4374440 -12644494 -22082797 -10308452
18694 -7502631 -3125623 -5884914 -12464466 -23464215 -4357640 11703028 -38449088 -15291696
$$ packed form
18754h484689D2496211f462925J843291l260546k8096639J805157A0325038E051234
18745g336474j7149382C014251b0074961G048632L588166j727992C305778b7704020
18736a1768929G811484L240488B438843d253343m468585k5238473I373583a0207938
18727D0769177d778537I342940g268115j177544l1997373D0959767A3482873P186801
18719B0669674I223868J2121414b1795730j327670a433945j6588343F751832J2159948
18711A8911780l403798M095473B164317a7880064e475456A0099574L3336586j2179038
18703C1257122b4219514h737329A8762276c349795j024645q270054r438303a0308452
18694g502631c125623k759291o579552j0999749d357640A1703028c8449088a5291696
$$ plain form
18685 -31352159 9918656 22719073 -4780775 -7474094 -453331 -8114449 -41528101 3167198
18676 25289992 41514566 21057585 -60282281 5210550 9829350 -30260334 6252238
18668 -631861 27265766 -33950076 -955505 -10308553 28750566 20619723 -12352159 -2180285
18659 -1135762 37590004 -11857551 -18732414 14837822 -252137 24208173 -24929095 -15956789
18651 -15956789 -11270663 23990677 5449386 29957611 17398158 18814503 1633188 24680752
18643 24680752 -4281215 39657509 8246384 2373486 50532946 4523402 27198622 -25706545
18634 -30327483 6561039 -20752115 8308817 -6272194 543850 -6568756 31507050 -20653047
18625 9128979 -15787293 -6974668 -27350548 -23013592 -31504531 -4314061 -1974212 20322909
$$ packed form
18685c1352159I918656J2800417d780775k693319d53331p661118l3413652C167198
18676B5289992J6224574k0456981f0282281E210550M618800c0260334F252238
18668f31861B7265766c3950076i55505r353048B8750566q130843a2352159b180285
18659a135762C7590004a1857551o874863A4837822b52137B4208173b4929095Q972306
18651a5956789M686126B3990677E449386K4508225j2559453J416345A633188K3047564
18643B4680752d281215C9657509H246384B373486M8159460D523402K2675220b5706545
18634c0327483F561039b0752115H308817f272194E43850f568756C1507050b0653047
18625I128979a5787293f974668k0375880M336956q490939d314061a974212B0322909
$$ plain form
18616 -24241102 39074244 -13786649 -11710176 5673966 11907515 3791987 -721950 31391227
18607 -37767661 1282872 14502501 -802285 -15243848 14254061 16194590 -5249134 13592094
18598 34002240 -1756370 -3766493 -18599342 24308144 10406119 36243476 -4775872
18590 -18449088 42191377 21252043 15710592 32700956 -5662901 2610546 -6995103 -6408234
18582 -6408234 21287515 -4838936 -35259023 -2667838 -53316578 -2665149 24351966 -14688686
18573 31618517 -16538183 27820375 4569106 9823075 -7613992 27072847 48757225
18566 48757225 1162057 -32258413 16763168 29964372 43517811 252816 -9820860 -37540863
18558 -37540863 19816203 -5316021 49992363 7058456 -39771866 7858180 32901779
$$ packed form
18616b4241102C9074244a3786649K076473E673966O233549C791987g21950C1391227
18607c7767661A282872J3219629h02285j4441563A4254061J940529e249134A3592094
18598C4002240a756370k010123j4832849B4308144A0406119K5837357d775872
18590a8449088D2191377k0939334n541451J6990364e662901B610546f995103N86869
18582f408234B1287515d838936l0420087b667838n0648740b665149B4351966a4688686
18573C1618517a6538183B7820375D569106N253969g613992B7072847K1684378
18566D8757225A162057c2258413A6763168J3201204J3553439B52816i820860k7720003
18558c7540863A9816203e316021D9992363G058456c9771866G858180K5043599
$$ plain form
18551 32901779 1632469 31430344 -17520259 18885936 -29081871 -8116790 -29018978
18544 -29018978 -22305047 -4656830 1290886 -31673059 -13236599 -18459973 35674558 -32380747
18535 -29666887 -37839699 -37218316 4073953 -20623283 -22334130 -35930163 -23646999 2800706
18526 40720901 -1634794 55911201 10867226 -38984323 15604504 14246370 -15391142
18518 -7089219 -7863804 -26559578 18938603 16912119 -15681197 -4423908 29749924 -15624183
18509 15080937 -18682864 -12328403 -25611489 -8982752 8661425 -22431138 42447861
18501 -30903480 3778231 25158586 21310621 24990742 673411 30116739 -6254891 27752811
18492 -23640720 11856506 -38184055 27770063 -25911206 -200421 -189910 -54708041 -901682
$$ packed form
18551C2901779A632469K9797875a7520259A8885936b9081871h116790k0902188
18544b9018978O713931d656830A290886c1673059a3236599n223374C5674558c2380747
18535b9666887q172812O21383D073953b0623283j710847j3596033J2283164B800706
18526D0720901a634794E5911201A0867226c8984323A5604504j358134a5391142
18518g089219p74585j8695774A8938603k026484a5681197d423908B9749924a5624183
18509A5080937a8682864O354461j3283086h982752H661425b2431138D2447861
18501c0903480C778231K1380355l847965L680121F73411K9443328f254891B7752811
18492b3640720A1856506c8184055B7770063b5911206b00421J0511n4518131i01682
$$ plain form
18483 27888245 -17743248 -31451072 4720418 -4542347 -10828627 -16827942 -7142030 11591743
18474 -8231591 -9508580 7507148 30500519 -11773420 30910173 -21381479 7624429 44291767
18466 44291767 11777986 -10229249 16693862 -14815428 -2997242 -21997798 22817796
18458 -3383880 -5959890 17038225 31123069 -24530418 -7374378 29584565 15989650
18451 15989650 6683026 -15474440 -38826753 -746118 -6508172 -6016150 7109270 -10247325
18442 20526616 -34668451 5311493 -10509550 19141893 -22641773 8288081 17433884
18435 17433884 11254445 20706575 5647263 30439592 17284682 -14615352 -28936240
18428 -28936240 25877070 -5420650 -24897193 34705913 -13310363 26761211 18295312
$$ packed form
18483B7888245a7743248j3707824D720418d542347o286280n999315g142030A1591743
18474h231591j276989G507148K2993371a1773420C0910173b1381479G624429L6667338
18466D4291767A1777986a0229249A6693862a4815428b997242j9000556B2817796
18458c383880k576010A7038225J4084844b4530418g374378B9584565j3594915
18451A5989650F683026a5474440k3352313g46118n762054M92022G109270a0247325
18442B0526616c4668451E311493a0509550A9141893b2641773H288081R145803
18435A7433884o179439R452130E647263K4792329j3154910a4615352j4320888
18428b8936240B5877070e420650j9476543C4705913a3310363B6761211q465899
$$ plain form
18421 18295312 423046 10308461 -14935068 -4531485 -4360213 1717905 24531308 7762978
18412 4289147 -13636940 -3745727 671204 17616387 -12052466 18747754 -5845210 31890316
18403 16577537 21301120 14324063 15930995 -16656555 -5919466 18722143 20203042 5203782
18394 27322132 5756313 -13624395 -7862235 -3459878 42550798 -205835 -16178760 13788126
18385 -11106716 10576010 -17277086 9043907 -5524410 21385454 -26525117 -21782492
18378 -21782492 21527183 7449495 -33895672 49631355 18966803 -12437319 1812851
18370 -11074340 -5177834 -23561379 -36216248 -22826050 18425644 15397323 -36554674
18362 35089803 18119348 346075 -35139257 19330616 4149913 -26824523 -13737893
$$ packed form
18421A8295312D23046R885415a4935068d531485J71272A717905K2813403G762978
18412D289147a3636940c745727F71204J6945183a2052466A8747754e845210C1890316
18403A6577537M723583o977057J606932a6656555e919466A8722143J480899E203782
18394B7322132E756313a3624395N762160c459878D2550798b05835j5972925A3788126
18385a1106716A0576010a7277086I043907e524410B1385454b6525117M742625
18378b1782492B1527183G449495c3895672D9631355A8966803a2437319A812851
18370a1074340e177834j8383545j2654869J3390198A8425644l028321c6554674
18362C5089803j6970455C46075c5139257A9330616D149913b6824523J3086630
$$ plain form
18355 -13737893 9731115 51492367 -15405876 9590841 13048541 46664262 -15770152
18347 11235032 -11755181 2174132 -18219510 20379674 535515 35332890 -39200972
18339 20307845 9894210 -1475517 237439 54342838 -20697527 55433750 -19935642 -6278542
18330 -10577544 26770141 -2751432 2245961 3093003 2522735 -11183071 -59542095 -16546062
18321 -27576912 19320041 -6556313 -16625521 -12782257 -19794338 -10174025 -46701325 -17111212
18312 20854261 26847120 -16986698 -12771603 1529506 -6437292 37990585 2448017 42012752
18304 42012752 -19293933 -14320451 -22539946 -12410561 -8919083 25840350 14329863
18297 14329863 -16480106 -32426047 36035726 -15722582 9529059 -11675868 4918683
$$ packed form
18355a3737893I731115M1761252a5405876I590841L457700L3615721a5770152
18347A1235032a1755181B174132a8219510B0379674E35515L4797375c9200972
18339B0307845I894210a475517B37439N4105399b0697527E5433750a9935642f278542
18330a0577544B6770141b751432B245961Q47042n70268a1183071m8359024a6546062
18321b7576912A9320041f556313j0069208L843264p012081R620313l6527300a7111212
18312B0854261N992859a6986698M215095A529506f437292C7990585B448017L9564735
18304D2012752a9293933M973482q219495J0129385L491478B5840350j1510487
18297A4329863a6480106j5945941C6035726a5722582I529059a1675868D918683
$$ plain form
18289 6176564 28796616 12326129 -19960876 -11321943 -62019654 13889845 -3216506
18281 29313072 -8509082 -4557829 24043117 -19991161 -13105351 -35675198 -23555717
18274 -23555717 22386776 17999879 10941740 -23668267 42418874 -5358749 -6525326 9083873
18265 -10129262 43598298 6997228 -12340412 13118665 -24408738 -10191190 -21642742
18258 -21642742 16083590 25987318 7894851 39282949 -31062032 -23487722 -640940 -8567888
18250 -8567888 -23495634 -31642525 36991413 6165664 20269049 -5686592 23244087 3231806
18241 32666929 -25397671 -32851245 -17624415 -10531080 229574 -217446 39644937 661482
18232 -2362627 22897004 -561675 -2987852 37691008 39044647 -756517 -15062068 -31016650
$$ packed form
18289F176564K2620052A2326129a9960876Q638933n0697711A3889845c216506
18281B9313072h509082L951253B4043117a9991161O885810k2569847J2119481
18274b3555717B2386776m386897p058139b3668267D2418874e358749j166577I083873
18265a0129262D3598298F997228a2340412A3118665b4408738a0191190j1451552
18258b1642742A6083590R903728G894851L1388098c1062032P574310f40940p926948
18250h567888j4927746q146891C6991413F165664J4103385e686592B3244087C231806
18241C2666929b5397671p453574J5226830P093335B29574b17446C9644937F61482
18232b362627B2897004e61675k426177C7691008J353639g56517j4305551j5954582
$$ plain form
18224 -31016650 6266384 -22287808 5321338 32736190 -30454974 -31305939 30478913 -15385235
18215 10246062 2171305 2625217 2126596 -47969939 7680978 35334940 -6708158 -1239695
18206 -52329731 -13499825 144850 -9266048 -15760139 25112086 10169219 1877282 -2911406
18197 -21773663 -10603253 33123063 -18065400 -8553152 9084170 29848607 -5427120
18189 17891236 -3300819 -11306440 -13168316 -17325050 -848262 1095075 -6081377 9736020
18180 -18016929 -50766923 48575003 16164160 -17411398 11137449 -9493402 11876780
18172 47893780 38802319 46688432 -28718671 -30302733 -31988656 -11102668 10634787 -15362961
18163 23713465 -25175705 19871484 -12585270 -15108719 855985 13996579 17622853 -3780287
$$ packed form
18224c1016650F266384b2287808E321338K7414852c0454974q50965C0478913a5385235
18215A0246062B171305M53912m98621d7969939G680978K7653962f708158a239695
18206e2329731a3499825A44850i266048o494091B5112086A0169219A877282b911406
18197b1773663a0603253C3123063a8065400h553152I084170K0764437e427120
18189A7891236c300819q005621j861876m156734h48262A095075f081377I736020
18180a8016929l2749994D8575003A6164160a7411398A1137449i493402A1876780
18172D7893780r091461P886113b8718671j584062j685923a1102668A0634787a5362961
18163B3713465b5175705A9871484a2585270k523449H55985J3140594L626274c780287
$$ plain form
18154 34629317 -24642455 3314037 28606121 -11671780 -42211049 -30840275 -17884784
18147 -17884784 18058406 -13130115 -6027139 -36969877 -4217359 28239661 -8214871
18139 -24910905 -21497409 17885322 35257038 11570434 13512539 -49000031 4381470
18131 2140938 -12815460 -1242676 -14257628 6690625 31847211 -9411364 3167504 -22841543
18122 19574331 -13352211 14734481 15091964 -3781302 -14586547 13289487 -11646340
18114 -20052323 7232375 -29623168 9432557 13487970 24708669 -4377757 -15810548 -35802690
18106 -35802690 1333993 48518 -2220127 2163003 -55296673 15669848 -42715914 24081392
18097 42576397 -21104937 -1800575 -43709148 -14430351 7431983 809624 1041379 21892170
$$ packed form
18154C4629317b4642455C314037K5292084a1671780l0539269J1370774J2955491
18147a7884784A8058406a3130115f027139l0942738d217359B8239661h214871
18139b4910905L413496A7885322J7371716A1570434J942105d9000031D381470
18131B140938a2815460a242676j3014952F690625K5156586i411364C167504b2841543
18122A9574331a3352211A4734481L57483c781302j0805245A3289487a1646340
18114b0052323G232375b9623168I432557M055413J1220699d377757j1432791j9992142
18106c5802690A333993D8518b220127B163003e5296673A5669848d2715914B4081392
18097D2576397b1104937a800575m1908573a4430351G431983H09624K31755K0850791
$$ plain form
18089 21892170 7394381 -8521147 14433802 -17138786 6450058 -1232069 -53680128 -25848320
18080 -12542812 40256052 -1677731 -27848553 18555817 19421630 11462934 10344409 -1474193
18071 2055498 -21478419 -33631068 22533268 -1151019 14897032 30387671 15118778
18063 6032348 810880 -23482711 -11301128 31467940 -46115161 17708970 -10913086
18055 6806696 29252022 -6283691 -47652045 28090756 34718593 -41722903 -7359478 -49605715
18047 -49605715 -39265762 671272 -42896482 31741653 12815124 -9670511 -4462686 -3207686
18039 -3207686 -15742238 52088925 22402473 -10923402 -24120429 8113791 663974 29587193
18031 29587193 -24147432 9943927 -25596989 -23620029 46423571 34837409 -1667139
$$ packed form
18089B1892170G394381h521147A4433802a7138786F450058a232069n2448059b5848320
18080a2542812D0256052a677731k6170822A8555817Q65813p958696j118525a474193
18071B055498b1478419j2152649B2533268a151019A4897032J5490639A5118778
18063F032348H10880b3482711a1301128C1467940d6115161A7708970a0913086
18055F806696K2445326f283691m1368354B8090756O627837d1722903g359478m2246237
18047d9605715J0339953F71272d2896482C1741653A2815124i670511d462686J255000
18039c207686j2534552E2088925B2402473a0923402j3197027H113791F63974K8923219
18031B9587193b4147432I943927b5596989J976960D6423571j1586162a667139
$$ plain form
18023 -18283464 -19251977 12814845 -15982961 -31741586 -3208760 14412671 17550550 24467569
18015 24467569 -25997482 -18667669 -28089738 -8404959 -28752176 -20049640 1191281 -24843718
18006 -5194865 -7707340 -15250330 17446229 34338205 -12241368 1026448 9666909 7203399
17998 7203399 22472213 17345728 23105427 -13893587 -28710756 31648047 4817259 28954092
17990 28954092 -43656044 -3027577 -4164495 -48474282 -2732552 -10201250 -6358965 26429443
17981 13033409 17829489 20124174 1227570 -5313482 -24545757 -10663416 -40190361 19728516
17972 -6134982 45269921 -23842486 -6585709 -4026556 9416992 -13612740 3918331 20976771
17964 20976771 12506949 52935443 20454729 -15935349 -17933303 -61919570 3336952
$$ packed form
18023a8283464r68513A2814845a5982961j5758625c208760A4412671L137879O917019
18015B4467569b5997482P329813r422069h404959k0347217Q702536A191281b4843718
18006e194865k512475p542990A7446229J6891976a2241368A026448Q640461k463510
17998G203399J5268814n126485N759699a3893587j4817169C1648047D817259K4136833
17990B8954092d3656044c027577j136918m4309787b732552p468698L842285B6429443
17981A3033409M796080K294685A227570e313482j9232275a0663416k9526945A9728516
17972f134982D5269921b3842486f585709K559153I416992a3612740C918331J7058440
17964B0976771q469822M0428494B0454729a5935349j997954m3986267C336952
$$ plain form
17956 4258427 9920593 21033962 41754478 20485871 -3515088 -11663749 -15655444 -5751046
17947 47176361 39925503 19406464 29895005 7198262 -17471329 -7191135 -9357967 -21978157
17939 -21978157 -7430135 7083706 -27158770 -1318879 15905874 -26747288 -5176449 20178622
17930 25089044 44746213 5186205 -15911416 -41587224 12922325 -7250174 -39851552
17923 -39851552 -10572641 31298627 14474738 51583345 10853714 -20296343 2701937
17915 23774198 -8317848 -61864182 7975957 -16716603 8952258 5586365 5042491 -17033136
17906 4302095 41634344 1886218 -48181359 2956458 14056106 -7654178 -59473708 1394866
17897 497155 27411719 13267417 -18891193 11560741 734950 26790372 -17601684 46903455
$$ packed form
17956D258427N662166J1113369K0720516B0485871c515088q148661l991695e751046
17947D7176361p250858A9406464J0488541G198262a7471329g191135k166832j2620190
17939b1978157g430135G083706b7158770a318879A5905874b6747288e176449B0178622
17930B5089044J9657169E186205a5911416k5675808A2922325g250174l2601378
17923c9851552a0572641C1298627A4474738L7108607A0853714b0296343B701937
17915B3774198h317848n3546334G975957a6716603H952258l365893n43874a7033136
17906D302095L7332249A886218d8181359B956458J1099648g654178n1819530A394866
17897D97155K6914564A3267417a8891193A1560741G34950K6055422a7601684D6903455
$$ plain form
17888 1586337 9996774 -39199169 -4214160 -27394545 -985285 22827122 -6228958 24936895
17879 -20491122 -8287110 12647872 -18144150 11281087 35340619 16916616 -6129096
17871 7061926 -22549865 9334747 -45870636 7386135 35396422 2293002 35673133 -43863664
17862 -50894381 22166720 19727985 -13009818 19971245 13537432 -6469025 -4504692 1060443
17853 4156681 -29181569 -28844722 -52696978 37523230 3567921 7468405 -2339858 62305585
17844 -5460274 -20918370 -24388154 -3481153 4808328 25503762 21198535 -18617324 -24124473
17836 -24124473 -25513155 -17287850 963507 1543211 39226036 47614166 -23669375 -28743063
17828 -28743063 -13446524 23394824 -21723527 -7720288 4248713 -48391912 9811615
$$ packed form
17888A586337Q410437c9199169d214160k3180385i85285B2827122f228958B4936895
17879b0491122h287110A2647872a8144150A1281087K4059532A6916616f129096
17871G061926b2549865I334747d5870636G386135K8010287B293002L3380131d3863664
17862e0894381B2166720k438735a3009818A9971245o433813f469025J964333A060443
17853D156681b9181569L36847k3852256C7523230C567921L900484b339858F2305585
17844e460274j5458096l469784c481153D808328K0695434m305227a8617324n507149
17836b4124473j388682Q225305I63507N79704L7682825Q388130b3669375n073688
17828b8743063a3446524B3394824b1723527g720288D248713d8391912I811615
$$ plain form
17820 -12388436 -41995162 -600654 33135319 42752839 9932318 1932715 -8189081 -18194353
17812 -18194353 -21782897 -37237375 -12667810 -18717225 -7364865 27012803 2296864 -2020624
17803 12474051 9519962 5639596 3132140 36669990 -59568864 35510278 24927534
17796 24927534 -3425897 37747980 -33348244 3496929 35164293 86742 -1454395 14210705
17787 -20401045 4490469 -16998117 -8124008 17849667 -45233344 -8223175 4382004 13816543
17779 13816543 -46913385 -9880938 7739368 -6448259 -40682552 -32095788 -8066610 15349163
17770 -12220335 20491334 16419774 -11406207 17860034 -20863975 15570508 -9001154
17762 4080314 -28559697 13946580 -19636783 -17076280 21769515 -4989044 12676982
$$ packed form
17820a2388436k9606726f00654C3135319R617520I932318A932715h189081j0005272
17812a8194353l588544j5454478a2667810o049415g364865B7012803B296864b020624
17803A2474051k954089l880366k507456L3537850e9568864C5510278j0582744
17796B4927534c425897C7747980c3348244C496929L1667364H6742a454395A4210705
17787b0401045D490469a6998117h124008A7849667d5233344h223175D382004R434539
17779A3816543d6913385i880938G739368f448259l4234293Q586764h066610A5349163
17770a2220335B0491334m071560a1406207A7860034b0863975A5570508i001154
17762D080314b8559697A3946580a9636783K560503B1769515d989044A2676982
$$ plain form
17754 14976455 -8116578 9307894 -50572429 17262581 -28351607 16592427 -19050589
17746 -23312035 40080602 -110848 -15855775 23140998 -1517935 -44283595 -6371932 -24805829
17738 -24805829 -971006 7152138 13195195 13798510 -29173800 55489710 -2936890 -63168316
17730 -63168316 29887759 9874940 -8671306 3731861 7483565 6338091 -16110383 6245164
17721 16772371 -25165038 64711132 18722597 -13591325 10317286 -2285604 62598866
17713 -9410921 8738582 -17512683 30527969 -22691376 4933552 -2555547 -32309587 13374339
17704 -10308052 -24673426 -13430461 14167358 8664069 -21887094 20299343 25968720
17697 25968720 7287516 22458806 -14248565 7662904 1242426 -39689445 -39243748 1066769
$$ packed form
17754A4976455h116578I307894e0572429A7262581b8351607A6592427a9050589
17746b3312035D0080602a10848j5744927B3140998a517935m2765660f371932j8433897
17738b4805829i71006G152138O043057O03315b9173800E5489710b936890o0231426
17730f3168316B9887759I874940h671306C731861L751704j145474a6110383F245164
17721A6772371b5165038F4711132A8722597a3591325A0317286b285604F2598866
17713i410921H738582a7512683C0527969b2691376D933552b555547k9754040A3374339
17704a0308052j4365374J1242965A4167358n503289b1887094B0299343N669377
17697B5968720G287516J5171290a4248565G662904A242426c9689445M45697A066769
$$ plain form
17688 -19843182 -4715317 -9833598 -15404642 -18815132 18382105 -24124151 -5294589 -64306242
17680 -64306242 -24289690 10685357 40624915 38074184 6636264 3970144 -1810197 13319120
17671 -6149172 11680368 14136218 52100483 40838892 -5265770 -3536479 -19561706 10888993
17662 -23231565 8597913 12899012 27461671 -13854816 -20070277 -43075654 -6338158 19085940
17653 8592043 -26795792 -5170765 7662560 591083 415901 7755168 4991715 -23751563
17644 10932704 7215568 -7583447 27204690 -4789462 -37030887 29150164 33638094 18844547
17636 18844547 -9928867 -34995651 7861999 -24478089 24903478 -21234156 -43800279
17629 -43800279 18904152 -17627293 33373291 37554557 7996705 -20183425 -7644796
$$ packed form
17688a9843182d715317n118281n571044l410490A8382105b4124151e294589n9011653
17680f4306242b4289690A0685357K9939558k550731F636264k666120a810197A3319120
17671f149172A1680368K455850L7964265j1261591e265770J729291j6025227A0888993
17662b3231565H597913M301099J4562659a3854816o215461k3005377f338158A9085940
17653H592043b6795792e170765G662560E91083j75182P339267k763453b3751563
17644A0932704l717136g583447B7204690d789462l2241425B9150164M487930j4793547
17636A8844547i928867k5066784G861999b4478089B4903478b1234156k2566123
17629d3800279A8904152a7627293C3373291M181266G996705b0183425g644796
$$ plain form
17621 -8565987 27369762 11375135 8455343 -16882471 4773395 14595887 7368592 34209674
17613 34209674 -22214185 6787300 -525369 5330095 -19737307 12406551 -20619100 33558415
17604 -13187970 16092819 -10490309 -5257162 -8810479 -845223 16065241 11131163 24779459
17596 24779459 2250628 2593971 21282823 10730220 10336184 -6212212 17640369 -13721780
17587 -20206471 -13792514 10805536 -8529815 4698942 14717264 -8476027 29022081 -17891111
17578 -25807303 18290707 11067985 -25995988 -14411458 -3809776 -25447897 14604546
17570 16756528 844896 42759874 -1362965 26129475 -11365055 -2000438 37153849 17623871
17561 -39927820 -2119374 9920511 -25190605 -4258017 1809744 -22933518 -22332759 7353764
$$ packed form
17621h565987B7369762A1375135k919792a6882471D773395R822492p227295K6841082
17613C4209674b2214185F787300e25369E330095a9737307A2406551b0619100C3558415
17604a3187970A6092819a0490309N233147l553317h45223A6065241m934078J3648296
17596B4779459B250628L43343J8688852j0552603l94036f212212A7640369a3721780
17587b0206471O413957A0805536h529815D698942J0018322h476027B9022081a7891111
17578b5807303A8290707p222722b5995988J1584530c809776k1638121A4604546
17570A6756528H44896M1914978a362965B6129475a1365055b000438C7153849A7623871
17561c9927820b119374I920511b5190605d258017A809744b2933518O00759G353764
$$ plain form
17552 -5129245 12040453 -1231687 18167040 -3649487 -6448949 6174361 -25662274 -23766452
17544 -23766452 -25430824 -7518486 5941542 20159138 7170074 35796885 -34477153 13549969
17535 -7351140 19951648 36038286 -2344161 25516380 11121309 18595888 -35832471
17527 18129712 -6774576 -7284874 -14874526 -31713544 -13621709 -32582490 11031786 25632855
17519 25632855 -16230922 -21658346 2359686 23589940 28689549 -39815955 8486615 -9181272
17510 -45630948 29366673 7555938 16205639 4927932 14884194 -53426002 -18147613 -12016219
17502 -12016219 -6345958 -5950598 2723869 11056026 -20701082 16104683 38099230 -20800322
17493 -2634889 -5273857 9036350 -11930888 4728988 10981667 -28258940 -8283461 -24081300
$$ packed form
17552e129245A2040453a231687A8167040c649487k799462F174361b5662274J895822
17544b3766452j664372g518486E941542J4217596G170074K8626811c4477153A3549969
17535g351140A9951648J6086638b344161B5516380A1121309P474579c5832471
17527A8129712f774576n10298p589652j6839018a3621709j8960781A1031786J4601069
17519B5632855a6230922n427424B359686K1230254N099609c9815955H486615i181272
17510d5630948B9366673G555938Q649701D927932R956262e3426002a8147613O131394
17502a2016219N670261L95360B723869Q332157b0701082A6104683K1994547b0800322
17493b634889k638968I036350a1930888D728988O252679b8258940h283461j5797839
$$ plain form
17485 -24081300 2219522 14496906 -25408359 19501788 18529985 -21588893 -2872409 27831182
17476 7977029 32169147 -21667311 24506111 -4516295 8912146 34564015 12630447
17468 37440157 -2932493 -9346592 2651255 644445 -3534181 7278380 -14857119 -15746613
17460 -15746613 -37297042 8692358 -30278174 -17010010 -7441010 -17118477 -2285887 1229550
17451 2303535 19063109 -22444871 2638094 27999714 -17984799 -21611129 -17549410 15684252
17442 22120204 -9502162 1353069 2141845 15030249 -53360535 4064771 -10532154 5498716
17433 12137360 -1784352 -1096868 -11041116 -25113627 3386141 -15610074 47681159 -42601550
17424 8526543 4501431 15171617 20622288 -5984276 11423926 40655522 -41976899 -62295336
$$ packed form
17485b4081300B219522J2277384b5408359A9501788r71803b1588893b872409B7831182
17476G977029K4192118b1667311B4506111d516295H912146K5651869A2630447
17468C7440157b932493o414099B651255F44445c534181G278380a4857119q89494
17460a5746613k1550429H692358c0278174J3268164g441010r677467b285887A229550
17451B303535J6759574b2444871B638094K5361620a7984799l626330M061719A5684252
17442B2120204i502162A353069P88776J2888404e3360535D064771a0532154E498716
17433A2137360a784352O87484r944248j4072511C386141a5610074D7681159d2601550
17424H526543m025112J0670186N450671e984276A1423926K9231596d1976899k0318437
$$ plain form
17416 -62295336 -11958139 40193219 -3703442 3133820 13408105 45047213 9490905
17408 48254643 3421531 32342379 13359053 -47696218 13851473 5123145 -25553932
17400 -4567706 7411499 1035282 -36767792 -10640307 -5166469 26299122 30051541 42323844
17392 42323844 -6243967 -1087660 11341986 -2762885 6288617 3792423 -53283453 -16902003
17383 -11317353 11493055 -8880047 11290807 -4035425 -51508744 -41606216 26066533
17375 6224967 11141607 -15637744 25275148 3735458 -12251728 3270465 -25791193 2493469
17366 -3264962 -11814951 -16005042 31129886 -50303956 11202631 13396858 38081701 19800742
17358 19800742 -6914551 -23845427 17537364 26763855 -10304728 41356868 2874441
$$ packed form
17416f2295336a1958139D0193219c703442C133820J0274285L1639108I490905
17408D8254643C421531K8920848A3359053d7696218A3851473E123145b5553932
17400d567706G411499A035282c6767792a0640307e166469B6299122L752419J2272303
17392D2323844f243967a087660A1341986b762885F288617k496194e3283453a6902003
17383a1317353A1493055h880047A1290807d035425m7473319R902528B6066533
17375F224967M916640a5637744B5275148C735458a2251728C270465b5791193B493469
17366c264962q549989m190091C1129886e0303956A1202631K194227K4684843j8280959
17358A9800742f914551j6930876A7537364R226491a0304728D1356868B874441
$$ plain form
17350 2368655 18910909 58410407 -10484246 9890586 -20143257 -14036951 -41213330
17343 -41213330 -6452466 -5486387 -31875387 15930628 35341520 -14661476 -22758485 -25414602
17335 -25414602 -17627178 -18903193 11342826 12428251 -4538780 -9269665 -15045134 -15417103
17327 -15417103 -9978416 6585109 194266 19499916 16032753 -3307155 13040141 12817082
17319 12817082 -27244238 -40859417 650364 -7578430 -40627476 -3386740 34031368 -6626542
17310 6237957 8577069 -15079676 -11901972 13115995 21009763 -2110615 -7224041 10478913
17301 -13449383 -13200930 -16165638 28193385 -34408116 10591224 -27485041 4657329 18938575
17293 18938575 32933401 6490121 -35903595 -30145978 -19996707 5286594 40059589
$$ packed form
17350B368655J6542254L9499498a0484246I890586b0143257O106306k7176379
17343d1213330f452466R66079k6389000A5930628J9410892a4661476q097009k656117
17335b5414602P787424j276015A1342826J085425d538780m730885n775469l71969
17327a5417103N438687F585109A94266J9305650l467163c307155A3040141k23059
17319A2817082b7244238j3615179F50364g578430l3049046c386740C4031368f626542
17310F237957K339112a5079676L177704A3115995P893768b110615n113426A0478913
17301a3449383K48453k964708B8193385c4408116A0591224b7485041D657329J4281246
17293A8938575J3994826F490121c5903595N757617J0149271E286594L4772995
$$ plain form
17286 40059589 38806193 -8850369 22447446 33422245 2466204 14476406 -21679643
17278 -8455455 15935438 15635440 15558697 -44767415 30870316 10307334 -17794700 -35659902
17270 -35659902 18525621 6211897 -9280478 34363819 7619808 19482959 -9057549 2584527
17261 -9399865 10479800 17875037 6861813 5618453 24137800 22626138 22816641 -599626
17252 -3299917 -1425933 22255419 -8720962 5207484 19835434 37282009 -11555919 4887579
17243 -21392009 -25067035 1916740 -18352172 -45083413 -11568116 57955568 -41886588
17235 22767389 -2347867 4614235 -21159334 46397485 18600500 -4984405 -18752850
17228 -18752850 -22981791 -18483668 15245113 11960065 -940009 2734296 24413444 -8579835
$$ packed form
17286D0059589j253396h850369B2447446J0974799B466204J2010202b1679643
17278h455455A5935438k99998p6743d4767415C0870316A0307334a7794700j7865202
17270c5659902A8525621F211897i280478C4363819G619808J1863151i057549B584527
17261i399865A0479800P395237F861813j243360J8519347j511662J90503e99626
17252c299917a425933B2255419h720962E207484J4627950J7446575a1555919D887579
17243b1392009l675026A916740a8352172k6731241a1568116E7955568d1886588
17235B2767389b347867D614235b1159334D6397485A8600500d984405j3768445
17228a8752850m228941M498123A5245113l285048i40009B734296K1679148h579835
$$ plain form
17219 -19554470 -30948337 16655988 20089384 -6367701 38181826 -20113252 -30425126
17212 -30425126 39083651 -22289271 -52658170 -9469646 5001106 2452371 -17030028
17204 12324279 14291769 20414110 13773118 9473573 47750242 -42800875 2804568 44059423
17196 44059423 -40740980 5884025 12619139 27707841 -2871050 2662438 19459926 -26648617
17187 10692109 31266457 9805115 17296473 -11176009 14590264 9215053 -22519420
17179 -39121372 8536900 6346996 5516586 -35787059 -22579860 -652529 -42289668 19976835
17170 -44895849 -17084978 10970161 14969515 17294603 -18414782 -25882509 404131 -11268907
17161 6408176 -9320301 23740765 31586922 -39880635 7241127 -4269554 20337490 13651740
$$ packed form
17219a9554470j1393867A6655988L433396f367701C8181826b0113252j0311874
17212c0425126C9083651b2289271l0368899i469646E001106B452371a7030028
17204A2324279J967490O122341o640992m299545L8276669d2800875B804568M1254855
17196D4059423d0740980E884025O735114J5088702b871050B662438J6797488b6648617
17187A0692109K0574348I805115P491358a1176009A4590264n375211b2519420
17179c9121372H536900k189904q30410c5787059J3207199f52529m1637139A9976835
17170d4895849a7084978A0970161L999354K325088a8414782p467727D04131a1268907
17161F408176i320301B3740765P846157c9880635G241127d269554B0337490o685750
$$ plain form
17153 13651740 24263466 27450327 49008659 3004417 -383624 -1739279 -3311574 9330594
17144 -15822415 24969649 -29051069 7766394 31708177 8906634 39768441 -34770935
17136 27749276 9071227 15803587 9759129 -39174310 -13432971 5254511 35723523 31049449
17128 31049449 42403231 9425754 12919950 14741255 14942931 3951178 25417201 -12962900
17119 -27525417 -55113919 4792097 67233500 -16681422 -18390351 -44116584 26866271
17111 8693457 38602761 3215785 -8357423 -8957932 -78788127 19770677 -34473105 -30389555
17103 -30389555 -11231583 -28676116 -3641915 10443202 5263183 -1606658 10581673
17095 -7131433 -27761513 -17349907 -4312562 29956644 -13219393 4431905 -3060971 2085141
$$ packed form
17153A3651740J0611726L186861K1558332C004417c83624j355655j572295I330594
17144a5822415B4969649b9051069G766394K3941783H906634L0861807c4770935
17136B7749276I071227O732360o044458c9174310a3432971E254511L0469012m674074
17128C1049449J1353782I425754L494196J821305K01676C951178K1466023a2962900
17119b7525417k7588502D792097O2441403a6681422j708929k5726233B6866271
17111H693457K9909304C215785h357423o00509o9830195A9770677c4473105M083550
17103c0389555a1231583j7444533c641915A0443202n180019a606658A0581673
17095g131433k0630080J0411606d312562B9956644a3219393D431905c060971B085141
$$ plain form
17086 -38226392 23276183 11493327 19563505 12550823 15254958 43817391 2369339 -27496018
17077 17025195 -298162 3420706 18408181 34608824 14313707 -12640514 -1003089 7268616
17068 19422446 8977890 -21746300 -381001 14036346 -25396774 -42056611 7741439 16085944
17060 16085944 -11756178 -27282404 10368084 5512360 4211169 20944287 -43427880
17052 -28311909 51489995 11130514 -5874794 -32514658 -16552790 16503128 -15822320
17044 -16366370 -4495120 -26377364 -14152637 -915409 -29260389 -26543851 8560206 5089779
17036 5089779 -1400509 12338816 -4289204 -20671496 36334514 -15078944 17423539
17028 -8465689 2177577 12673027 25513880 -9435197 -3128647 -20757139 10868909 3412055
$$ packed form
17086c8226392B3276183A1493327Q070178p012682K704135K8562433B369339b7496018
17077A7025195b98162C420706J4987475J6200643A4313707a2640514a003089G268616
17068A9422446H977890b1746300c81001A4036346b5396774j6659837G741439Q344505
17060A6085944a1756178j5526226A0368084m855724j301191J6733118d3427880
17052b8311909E1489995A1130514e874794k6639864J5961868A6503128a5822320
17044a6366370d495120k1882244J2224727i15409k8344980K716538H560206l470427
17036E089779a400509A2338816d289204j6382292C6334514a5078944A7423539
17028h465689B177577J0495450J2840853i435197c128647j7628492A0868909C412055
$$ plain form
17019 -27702495 -9359048 -6772706 18982591 -34027157 -26235619 -3901383 198239 -28209134
17010 14212386 -25909346 -27192261 -11569215 27695733 24665016 16312002 -8842017 -27683358
17002 -27683358 -33436565 -45692441 8355076 -6639596 -21429993 6213731 -9093726 18321430
16993 3529766 6738685 12448369 40123631 -12928149 -28999434 -15042083 -21976736 -17087184
16985 -17087184 11378835 20170968 -19769337 9382808 9034782 -20970023 24507257 679413
16976 -17802805 -3224937 -11571768 -3548291 14987515 7065952 -29921838 -20277250 28405477
16967 -5377899 -1608553 2072205 -31379360 53273344 10220531 -2262337 -26717003 -5944895
16958 17665494 -31659245 -3381037 -11969917 3625672 -20304034 12848761 6007411 25686486
$$ packed form
17019b7702495i359048K586342A8982591c4027157P791538c901383A98239b8209134
17010A4212386b5909346j282915a1569215B7695733l030717q353014h842017j8841341
17002b7683358n753207j2255876H355076f639596j4790397F213731i093726A8321430
16993C529766L208919N709684K7675262a2928149j6071285J3957351o934653M889552
16985a7087184A1378835Q792133a9769337I382808l48026b0970023B4507257F79413
16976a7802805c224937q346831c548291A4987515G065952b9921838R644588B8405477
16967e377899a608553B072205c1379360E3273344A0220531b262337k4454666e944895
16958A7665494c1659245c381037q588880C625672b0304034A2848761F007411J9679075
$$ plain form
16950 25686486 22163145 -16433881 -8356682 3558766 -17442762 3949726 -96113 27308642
16941 39994278 1824612 -23041708 -25574524 -31301893 -35385436 10324133 -15790238 -12717797
16933 -12717797 14157121 -17397139 30792718 6588461 -15559855 -8540905 6867903
16925 28303533 -11678474 -574894 -2615800 -20829924 -7105993 41153588 -8177757 -6168841
16917 -6168841 -24126292 -21514000 -3477570 -34867130 9183788 16860098 2065270 8020234
16909 8020234 -11504238 12048119 -20416935 -3887595 88573 43358115 6332206 -8247019
16900 3343029 -5229038 -43373949 11128447 -11853935 27072177 -6975115 -801296 6259160
16891 30717941 -5656335 -3606042 3813115 -16424838 -11104483 11888503 -42726069 -25277390
$$ packed form
16950B5686486l523341a6433881Q077199C558766a7442762C949726i6113B7308642
16941C9994278A824612b3041708k532816n727369m083543A0324133a5790238L072441
16933a2717797A4157121a7397139C0792718F588461a5559855P018950F867903
16925B8303533a1678474e74894k040906j8214124g105993D1153588h177757K008916
16917f168841j7957451K612292c477570l1389560I183788P676310B065270N954964
16909H020234a1504238A2048119b0416935c887595H8573M3269542F332206h247019
16900C343029e229038l8144911A1128447a1853935B7072177f975115h01296F259160
16891C0717941e656335K050293C813115a6424838N320355A1888503d2726069J7448679
$$ plain form
16883 -25277390 -24208980 40722 8707989 -18563930 -7838835 3131879 29564614 13618450
16874 15356512 23847975 -4026742 11136013 -11732975 3877487 23383175 -469489 -8456161
16866 -8456161 -21625856 21069162 15140212 31130890 6559740 3197165 6407561 11200759
16858 11200759 25559229 27881289 7494778 -10475913 38115551 20577662 21219887 -16602266
16849 -3416591 13600202 30295085 -27230337 35488142 -20859246 -9045081 -3617558
16841 5744659 -38859281 -2376588 -5754459 -35406659 -19554308 1949536 -30386160 14576267
16832 -896313 45660100 -6047521 -5868419 -18512266 -26409476 24746205 12297022 -30534033
16823 20660574 36785408 -13577154 335065 23178267 18791083 -15228680 -30946241
$$ packed form
16883b5277390J068410D0722Q667267a8563930g838835C131879K6432735A3618450
16874A5356512Q491463d026742A1136013a1732975C877487J9505688d69489p986672
16866h456161j3169695B1069162n928950J5990678F559740C197165L210396M793198
16858A1200759J4358470K322060G494778a0475913C8115551j7537889O42225a6602266
16849c416591A3600202J6694883b7230337C5488142b0859246i045081c617558
16841E744659c8859281b376588l377871k9652200J5852351A949536c0386160A4576267
16832h96313D5660100f047521J79102j2643847p897210B4746205A2297022c0534033
16823B0660574J6124834a3577154C35065K2843202m387184a5228680j5717561
$$ plain form
16816 -30946241 36311981 -19323681 26965326 -23733876 13459581 -5909948 -38706376
16809 -38706376 7559962 -17051974 -33491141 -13920640 15112844 -9963854 -705875 10001351
16800 -1809926 -37621350 27195833 -20228110 18426545 13995581 27398317 -36380766
16792 -20126620 8157037 -1995153 -39383243 91314 1539774 -33208706 -3503822 42860442
16783 4020636 -11161439 7407233 -6524194 10266361 -28493633 -22737436 8497409 52323299
16775 52323299 26804986 -168744 11816872 -38228137 9755820 -20963317 -56591277
16768 -56591277 -35488377 19848908 4726367 -3534338 9110143 20186993 -887518 24638913
16759 -22631310 14415702 824346 -18739179 21709496 23176714 3975635 -19477819 7140006
$$ packed form
16816c0946241C6311981a9323681B6965326b3733876A3459581e909948l2796428
16809c8706376G559962a7051974j6439167a3920640A5112844i963854g05875A0001351
16800a809926l5811424B7195833b0228110A8426545m430964J3402736c6380766
16792b0126620H157037a995153l7388090I1314J448460c3208706c503822D2860442
16783D020636a1161439G407233f524194A0266361b8493633N756197H497409M3825890
16775E2323299k5518313a68744A1816872c8228137I755820b0963317l5627960
16768e6591277K1102900A9848908D726367c534338I110143J1076850h87518B4638913
16759b2631310A4415702H24346a8739179B1709496J467218C975635a9477819G140006
$$ plain form
16750 13388274 -7306561 3133202 16490515 -21837733 -25101879 4584617 -38537680 22547672
16741 -33550945 -30260044 66446025 -25186855 16291058 20850698 11311623 -4606072 -6704480
16733 -6704480 8811164 13446342 15573991 -7015306 -49544359 -9421123 -18630146 5400190
16724 17711135 5225084 -13363235 30419974 -14000103 -1348182 -7824321 -5147233 -13906337
16716 -13906337 -14003515 1169649 8299373 34939063 -9031412 -14745913 -14971955 27551955
16707 13714766 18289092 -16244780 -10034911 5699155 -17304789 36457045 32826308 6092118
16698 -4063775 -17469452 43790809 29032824 -24369738 -23775757 28276731 -1450304 27219705
16689 3637407 45942756 -36875429 -26801711 -44634169 -40153143 19977995 -37792961
$$ packed form
16750A3388274g306561C133202J3357313b1837733l264146D584617c8537680B2547672
16741c3550945L290901F6446025b5186855A6291058M559640r539075d606072k098408
16733f704480H811164M635178K127649g015306m2529053i421123r209023E400190
16724A7711135E225084a3363235C0419974a4000103a348182o476139K677088q759104
16716a3906337r7178A169649P129724K6639690i031412n714501k26042B7551955
16707A3714766M574326a6244780O209869E699155a7304789C6457045l630737F092118
16698d063775j3405677D3790809j4757985b4369738N93981B8276731a450304B7219705
16689C637407M2305349c6875429J0073718j7832458M481026A9977995c7792961
$$ plain form
16681 -17973029 -34232109 -34268737 1947204 7153001 4438544 37776776 -15289096 2455488
16672 -43491731 13334728 43153381 -4650574 7479824 -14814153 15569629 13870195
16665 13870195 -1977185 -11053910 3729974 -10667058 -28308445 -48756789 -20425096
16657 11363184 30589877 5098426 9838647 13545589 -5264575 15299707 -17403317 -14751919
16649 -14751919 3066181 29232806 31034682 16621310 32140747 22930167 98798754
16642 98798754 92302014 119225587 146702660 221932524 274868046 302171405 403353792
16635 403353792 408032704 420795307 379725554 344895646 246781520 209473946 171384885
16628 171384885 90326200 108263893 78844169 60188241 31810658 20800573 11704272
$$ packed form
16681a7973029j6259080l6628A947204N205797k714457L3338232a5289096B455488
16672d3491731A3334728K9818653d650574G479824a4814153A5569629j699434
16665A3870195a977185r076725C729974a0667058j7641387k0448344b0425096
16657A1363184J9226693E098426M740221L706942e264575A5299707a7403317K651398
16649a4751919C066181K6166625J801876j4413372J5519437r210580P5868587
16642I8798754o496740K6923573K7477073P5229864N2935522K7303359J01182387
16635D03353792M678912J2762603m1069753l4829908r8114126l7307574l8089061
16628A71384885q1058685J7937693k9419724j8655928k8377583j1010085r096301
$$ plain form
16621 11704272 5381029 35681757 11251725 10561563 18222271 7778592 -7804996 35827629
16612 22577253 -21398676 -2458 20935633 -725518 -47768121 6768585 -49875 23183983
16603 -3761431 8846231 -10442051 6669676 41671072 9904118 -11922464 31273360 -3757975
16594 3140502 -38953 21550980 3134974 7376159 -9583908 -19773966 37749533 -11349273
16585 42409378 6787654 19959269 11980845 -13385597 -20434819 -33210462 -4893742 7012392
16576 -25819912 13444955 5171530 572735 -10138096 13099588 49038317 -3399103 43142924
16567 -39693311 19475099 32291625 36408082 22304279 14288785 -35060396 770175 -26851870
16558 16838398 3545665 15114098 -48917 -5677364 -55554995 -15870176 -23797812 41027122
$$ packed form
16621A1704272E381029L0300728A1251725o90162P660708G778592g804996C5827629
16612B2577253b1398676b458B0935633g25518m7042603F768585d9875B3183983
16603c761431H846231a0442051F669676L5001396I904118a1922464C1273360c757975
16594C140502c8953B1550980C134974M241185i583908j0190058C7749533a1349273
16585D2409378F787654J3171615p978424a3385597p049222j2775643d893742G012392
16576b5819912A3444955E171530E72735a0138096A3099588L5938729c399103D3142924
16567c9693311A9475099J2816526M116457j4103803q015494c5060396G70175b6851870
16558A6838398C545665J1568433d8917n628447m9877631a5870176p927636D1027122
$$ plain form
16549 -45158524 27196950 -10330157 21030554 23626040 -15298118 15920701 -32870807
16541 6414100 -16867877 21692039 -22466266 10158612 5348435 -38998330 -22656333
16534 -22656333 2141378 -10080055 -16333097 -6876389 -9351688 -29612167 -1106135 -9330621
16526 -9330621 -24114705 32917594 21662205 -26216877 -18198926 16959602 -33596080
16518 13657097 51044944 -18008897 -12518010 15580800 17000124 39040590 8784283
16510 -1708225 -11233361 -17829873 9893972 -1294763 -8933896 12665795 37550326 5931586
16501 12112694 2946940 -7489728 13649307 1773391 15800363 30946483 3414473 -4666706
16492 -15097646 61808483 -10599520 -5108285 2062310 -33579139 25730751 -10038832
$$ packed form
16549d5158524B7196950a0330157B1030554K595486a5298118A5920701c2870807
16541F414100a6867877B1692039b2466266A0158612m810177c8998330J6341997
16534b2656333B141378a0080055o253042f876389k475299k0260479a106135q224486
16526i330621j4784084C2917594j1255389b6216877Q017951A6959602c3596080
16518A3657097L7387847a8008897N490887A5580800J419324K2040466H784283
16510a708225r525136o596512I893972a294763p639133A2665795K4884531E931586
16501A2112694B946940g489728A3649307A773391J4026972J5146120C414473d666706
16492a5097646F1808483a0599520e108285B062310c3579139B5730751a0038832
$$ plain form
16484 14232365 17967215 41770816 -41263020 29124067 -67435822 -10723442 33031613
16476 -21240275 -12416935 10373575 34559435 -20670613 -27940057 -7505123 14243130
16468 -3762142 13358193 -8235994 15359079 -14725740 -2096776 4103308 -18818594 -23071179
16460 -23071179 -2914332 12360267 -10229988 -27202150 25141960 19525665 4947144
16452 34423421 20941022 -50397002 -2743909 -39287357 -7298855 17800174 50822778
16445 50822778 16309286 13145569 42552123 14560359 5804560 -19340096 38548910
16437 5933278 -29570737 -8811937 244831 30154352 -35298212 33882425 -43932300 19771675
16428 12637640 1965027 35022420 17229731 11200299 7612425 -49588198 7637694 36553
$$ packed form
16484A4232365L734850K3803601d1263020B9124067f7435822a0723442C3031613
16476b1240275Q823340A0373575K4185860b0670613p269444g505123A4243130
16468c762142A3358193h235994A5359079a4725740b096776D103308a8818594m252585
16460b3071179b914332A2360267a0229988j6972162B5141960n616295D947144
16452C4423421j3482399e0397002b743909l6543448g298855A7800174L3022604
16445E0822778A6309286l163717K9406554A4560359E804560a9340096C8548910
16437E933278b9570737h811937B44831K9909521c5298212C3882425d3932300A9771675
16428A2637640A965027L3057393A7229731o029432l587874d9588198G637694C6553
$$ plain form
16419 -47202828 -21188301 -6713152 20530489 35098064 29409402 26638716 -32385464
16411 -6178277 10458638 -22182065 -4237329 19519135 6715035 -23228948 28007248
16403 30642735 25335664 15148630 -15193663 6547999 4833104 -28287918 50473561
16395 -5032004 31631452 12152562 -19902974 15510617 17820326 39878467 -3741688
16387 7918781 -15357136 39047758 27504222 42167091 -27372657 -16342697 -36382515
16380 -36382515 -3535645 -3648835 -5902011 34924860 18470855 10579058 -8269068 14543340
16371 14445932 -37762059 -24148456 2537543 -11331224 -13122430 -23811406 18746341
16363 -21236712 34995955 33229218 -1317955 -24619125 19276734 9554464 10916860 3580040
$$ packed form
16419d7202828b1188301f713152B0530489J4567575n688662k770686c2385464
16411f178277A0458638b2182065d237329A9519135F715035b3228948B8007248
16403C0642735n307071j0187034a5193663F547999j714895b8287918E0473561
16395e032004C1631452A2152562a9902974A5510617K309709K2058141c741688
16387G918781a5357136C9047758j1543536J4662869b7372657J1029960k0039818
16380c6382515c535645j13190k253176C4924860j6454005p891797h269068A4543340
16371A4445932c7762059J3613603B537543a1331224j791206j0688976A8746341
16363b1236712C4995955j766737a317955k3301170A9276734I554464J362396C580040
$$ plain form
16354 -2884515 6573060 -25115500 2427016 -6520112 -4618123 -29645858 -17160238 -8301585
16345 -10454293 -28857347 7536308 738417 3611049 33352458 2296251 -13311943 -2371918
16336 -16873405 19439204 -18016212 -2399529 8552657 -10052253 -23945340 -14945 -2301017
16328 -2301017 4004376 -8235681 13192847 16190478 -49350805 -984423 30580716 -12669357
16319 21029923 -7968742 14762484 -2905653 -15124316 -33714722 -23826354 -30609298 13614094
16310 -11401010 -45775450 37716188 -11144141 -4485950 16387357 -3567473 -4230079 -28156386
16302 -28156386 -4682168 -10943064 -1854531 -17182293 -11153513 -20857234 -13963996 2323463
16293 -23463639 2147548 -9475722 -30304030 -3528243 10596872 -14038914 26188507
$$ packed form
16354b884515F573060b5115500B427016f520112J901989k5027735J2485620h301585
16345a0454293j8403054G536308G38417K872632K9741409B296251a3311943b371918
16336a6873405A9439204a8016212b399529H552657a0052253j3893087a4945k286072
16328b301017D004376h235681A3192847K997631d9350805i84423C0580716a2669357
16319B1029923g968742A4762484b905653j2218663j8590406R888368o782944A3614094
16310a1401010l4374440C7716188a1144141d485950A6387357c567473o62606k3926307
16302b8156386d682168o260896a854531j5327762O028780r703721O893238B323463
16293b3463639B147548i475722k0828308c528243A0596872a4038914B6188507
$$ plain form
16285 2332006 -21294905 44658610 33467165 -379746 -39790447 -5085155 -487600 5411546
16276 -12378408 -37192411 19354675 -743332 -59987060 -8370393 3714202 6651888 -4245821
16267 13279908 42403182 10759634 -4880838 32688483 -32864886 11864385 -35227048
16259 -34614207 30539787 32970039 44264561 -32769416 -21163620 5304365 -21169486
16251 -16069111 -10991245 -522985 8672383 -2087442 -9377902 13395564 -297709 -14745687
16243 -14745687 22865898 51249267 2633043 17055448 -10035893 -16595151 1265681
16235 -33000802 1576463 34235386 -2981256 -10636978 -8919316 318003 -17450838 -23059827
16227 -23059827 6607387 -3762914 -22072678 -42325541 33120736 20004968 -6402419
$$ packed form
16285B332006b1294905D4658610j1191445c79746l9410701e085155d87600E411546
16276a2378408k4814003A9354675g43332n9243728h370393C714202K937686d245821
16267A3279908K9123274A0759634d880838C2688483c2864886A1864385c5227048
16259c4614207C0539787K430252J1294522c2769416J1605796E304365b1169486
16251a6069111N077866e22985H672383b087442p290460A3395564b97709j4447978
16243a4745687B2865898K8383369B633043J4422405a0035893o559258A265681
16235c3000802A576463L2658923b981256p655722J717662C18003a7450838n608989
16227b3059827F607387c762914j8309764k0252863C3120736j3115768f402419
$$ plain form
16219 27067442 12601866 578496 -22177578 3650651 -31036245 5048251 -24224407 20421272
16210 -4411686 -14351380 -6143115 -10089830 -18866390 -17401205 169595 11352034 -16409590
16201 -12828812 -14369125 2401561 17342057 10241967 30052609 27273904 22492629 38377180
16193 38377180 -13649209 50912137 749221 -35763761 489543 -3798180 21452939 -18252600
16184 -5873852 -27930774 26860938 -27578100 -30403840 -2335908 37618735 -31683758
16176 -15984839 -25076298 25266347 9878118 4574200 -6052062 22697299 -32192866 5229635
16167 23176316 21764583 -14938942 996618 27853659 -21916148 13480157 38946529
16160 38946529 -9244438 17184877 -30903574 3132255 21663676 -36018064 -20949379
$$ packed form
16219B7067442A2601866E78496b2177578C650651c1036245E048251b4224407B0421272
16210d411686r939694f143115l946715q776560J465185A69595J1182439a6409590
16201a2828812j540313B401561J4940496p100090J9810642k778705m781275J5884551
16193C8377180a3649209E0912137G49221c5763761D89543c798180B1452939a8252600
16184e873852k2056922B6860938b7578100k825740b335908C7618735c1683758
16176a5984839r091459B5266347I878118D574200f052062B2697299c2192866E229635
16167B3176316j411733a4938942I96618K6857041b1916148A3480157K5466372
16160C8946529i244438A7184877c0903574C132255J8531421c6018064J5068685
$$ plain form
16153 -20949379 -15029261 12798549 51902068 30011047 53133405 -7977283 -16682438
16146 -16682438 -38116083 -6137569 -12580961 -54539806 38376296 -8013123 10652468
16138 11693526 -11254970 -26608185 3692792 -19104197 31188988 7079481 4378312
16131 4378312 -14066380 23216402 -2478450 14502864 -9122984 3927146 -46548276 18585085
16122 -54832051 -10188909 39815528 -7619760 1352024 36788359 8224931 -20731658
16114 -1138465 -11086971 -45243043 32215480 12399996 -32939388 -3215012 15998673
16106 23558113 -11465983 29883987 20679313 23566414 -19939300 -16329228 9199721 -456915
16097 -7450679 -8698441 -15104423 -37296863 27035703 -19022544 4122996 -14450967 5745704
$$ packed form
16153b0949379N920118A2798549L9103519k1891021K3122358g977283q705155
16146a6682438k1433645f137569o443392m1958845C8376296h013123A0652468
16138A1693526a1254970j5353215C692792a9104197C1188988G079481k701169
16131D378312a4066380B3216402b478450A4502864i122984C927146d6548276A8585085
16122e4832051a0188909C9815528g619760A352024L5436335H224931b0731658
16114a138465r948506l4156072C2215480A2399996c2939388c215012A5998673
16106B3558113a1465983B9883987r204674K887101a9939300L610072I199721d56915
16097g450679j247762o405982k2192440B7035703a9022544D122996a4450967E745704
$$ plain form
16088 -35433797 -19392247 -40839617 9726256 -11246696 15090970 -14624458 -5765097
16080 -66012895 41405981 -54314852 2813748 -28927822 40514848 -23003314 8411991
16072 -39235730 -2854199 -7158509 -10298210 -9003995 -12049317 4174160 -6580733 667443
16063 -2929582 -16601114 36240852 15557933 22713760 -4754378 -29627096 30767116
16055 -17236275 -17217769 7763401 8729471 -14672554 -15894720 -22558410 44302336 25477250
16047 25477250 6208461 4194729 -3802196 5334465 -9538487 23287074 11322640 -20327619
16038 9110176 1654705 6226862 84017 25092411 4612630 16788952 3257555 -5664056
16029 -11801540 29407019 -12031818 -31534579 34020828 -15417844 -13147783 -18152388
$$ packed form
16088c5433797J6041550k1447370I726256a1246696A5090970a4624458e765097
16080f6012895D1405981e4314852B813748b8927822D0514848b3003314H411991
16072c9235730b854199m304310l139701J294215l045322D174160f580733F67443
16063b929582j3671532C6240852A5557933P155827d754378k4872718C0767116
16055a7236275J8506G763401R66070a4672554j222166o663690D4302336j8825086
16047B5477250F208461k013732c802196E334465i538487B3287074A1322640b0327619
16038I110176A654705M572157H4017K5008394D612630J2176322C257555e664056
16029a1801540B9407019a2031818j9502761C4020828a5417844K270061n004605
$$ plain form
16022 -18152388 1956209 -47226499 -16412623 8590873 -4370479 14848763 8258050 -17981337
16013 -1875854 -11020025 -1539861 15022671 -18441390 13193991 -21931448 -2899382 -4405384
16005 -4405384 -20224437 2748913 -2063616 -22302729 5859686 -5494680 -32528333 -13168034
15996 3963706 -1291513 -9297704 7255451 5644894 10186671 -17595558 8471470 6952392
15988 6952392 -3300402 -31294690 -20075897 -18999925 -24661076 13777345 -2831893 5032908
15979 -7183124 2628314 -19978045 -17427217 -1318122 2422065 4604054 12348088 35045202
15971 35045202 -18537111 -23947003 6322239 -24377321 -21665330 9147030 37608831 -47988
15962 38237880 31457017 -8178113 6665594 15221462 16095949 11224293 12228913 -20718332
$$ packed form
16022a8152388A956209d7226499a6412623H590873d370479A4848763o590713a7981337
16013a875854r144171a539861A5022671a8441390A3193991b1931448b899382j506002
16005d405384j5819053B748913b063616k0239113E859686e494680k7033653a3168034
15996C963706a291513q006191G255451j610557M541777a7595558H471470j519078
15988F952392c300402k7994288J1218793J075972n661151A3777345b831893E032908
15979g183124B628314a9978045K550828a318122B422065K181989P744034K2697114
15971C5045202a8537111n409892F322239b4377321K711991I147030K8461801d7988
15962C8237880o780863h178113F665594Q555868Q74487m871656J004620b0718332
$$ plain form
15953 -3827964 -5918221 -15444231 26091170 -377788 31233962 -7653365 16982720 18557576
15945 18557576 -18658530 20198871 -11105828 3611211 -3098069 -51727561 7671914
15937 -2265190 -15723420 -9320004 33746862 16938172 -6439055 16593142 -6595890 11625536
15928 -2903318 31544425 12000616 5841287 -20037864 -6526340 -517436 -38424880 16738213
15919 71024327 7661861 -23260268 13958482 3979917 25912007 31408864 -29412727
15911 -7684999 2258711 38700458 -5084133 -4490891 3812035 18451731 8432154 23339542
15903 23339542 9737237 43809127 51870842 34521585 -9755898 7408313 672790 -26503039
15894 5737653 2958045 -29411050 -15116410 20670089 10209116 -49967626 35815023
$$ packed form
15953c827964k090257r526010B6091170c77788C1233962g653365A6982720J574856
15945A8557576a8658530B0198871a1105828C611211c098069m8629492G671914
15937b265190j3458230O403416C3746862j6808690f439055A6593142f595890A1625536
15928b903318C1544425A2000616E841287b0037864f526340e17436l7907444A6738213
15919G1024327G661861b3260268A3958482C979917K1932090N496857b9412727
15911g684999B258711L6441747e084133N93242C812035J4639696H432154J4907388
15903B3339542I737237L4071890Q061715j7349257i755898G408313F72790b6503039
15894E737653k779608b9411050J4294640B0670089A0209116d9967626C5815023
$$ plain form
15886 -27920249 -16531725 7117042 20516805 -16184998 -46841168 32577467 -536121
15878 -17663853 -11852907 2365988 -21315508 19682710 -1152503 8850767 56680036 -9765538
15869 -41041775 -12900310 5999066 20862297 -1374650 -17157779 -10562371 -560060 -9426514
15861 -9426514 21458706 35320207 4681352 -35887388 -12003349 6337889 2246435 -6462994
15852 -7320274 -15472302 6184607 -8548517 -13146857 -6980158 -8124754 -6763067 31169434
15843 -10699218 -35164996 -10718463 8400322 -23703545 20887234 -20221170 11501493
15835 -12460671 29669006 -23512436 -2839539 19652920 -23528270 -24189477 -5302360 -36824681
15827 -36824681 15128249 -16984498 40703809 5619961 5726729 17809595 -13126432
$$ packed form
15886b7920249J1388524G117042J3399763a6184998l0656170C2577467e36121
15878a7663853N810946B365988b1315508A9682710a152503H850767M7829269i765538
15869d1041775a2900310E999066J4863231a374650j5783129O595408e60060q866454
15861i426514B1458706J3861501D681352c5887388a2003349F337889B246435f462994
15852g320274q152028F184607h548517m598340O166699j144596J361687C1169434
15843a0699218k4465778a0718463H400322b3703545B0887234b0221170A1501493
15835a2460671B9669006b3512436b839539A9652920b3528270o61207e302360l1522321
15827c6824681A5128249a6984498D0703809E619961J06768J2082866a3126432
$$ plain form
15819 -2910463 17329263 -10700630 8505409 -21696214 6961554 1105336 -9173545 16737687
15810 5816558 49416888 -8516119 2358947 50216583 -13149480 21616205 28828378 -24308243
15801 14388246 4106764 8933368 6961685 1902322 33861797 19455461 -509834 -8373999
15793 -8373999 -11340293 -10353477 5069988 -15407581 -29577927 14013983 7066690 -1967313
15784 11544870 7960891 -10402566 21417758 3082917 -20506228 -6071765 -17923073
15777 -17923073 2443509 2149484 2104078 -8419806 -2650100 -13061361 -27911878 16424441
15768 1863098 -45308435 -39189754 -20767091 23371904 -34326342 -31688611 20759234
15760 -14539582 42874181 1452397 22125806 35169778 7719929 -8796231 17848347
$$ packed form
15819b910463A7329263a0700630H505409b1696214F961554A105336i173545A6737687
15810E816558M3600330h516119B358947M7857636a3149480B1616205P212173b4308243
15801A4388246D106764M826604j971683A902322L1959475j4406336e09834p864165
15793h373999k966294R86816E069988a5407581j4170346A4013983o947293a967313
15784A1544870l583979a0402566B1417758C082917b0506228f071765j1851308
15777a7923073B443509k94025m5406h419806b650100j0411261j4850517A6424441
15768A863098d5308435O118681J8422663B3371904c4326342K637731B0759234
15760a4539582D2874181A452397K0673409J3043972G719929h796231A7848347
$$ plain form
15752 -16913342 -16814940 -7213107 12472180 -16051630 -13925689 52782691 24025160 -36115682
15743 13808784 8414337 4522587 -49154501 -5914894 23029865 36348387 9154496 -49724031
15734 -27959466 11206088 -30822578 21305737 -8785501 -20025567 42478570 11675295
15726 -23362637 -13371598 -1765876 6058294 7950085 18604248 -20429034 19101010 -20771893
15717 394570 23178962 8596878 -2679326 -23819010 13489519 -8127582 16997323 -17989081
15708 643517 -1506655 -25653348 -28862924 -20789490 -3941916 -28949741 10472649 -33024081
15699 -7242488 12236448 8730558 -918046 -17273056 10822734 922392 -22821986 9588096
15690 -17511354 13658360 7617180 8780319 -14659824 -10563388 21118710 69819970
$$ packed form
15752a6913342R8402g213107A2472180a6051630K125941E2782691B4025160c6115682
15743A3808784n394447l891750d9154501e914894B3029865J3318522I154496d9724031
15734b7959466A1206088c0822578B1305737h785501j1240066D2478570A1675295
15726b3362637R991039a765876F058294J891791J0654163b0429034A9101010b0771893
15717C94570K2784392H596878b679326k1139684A3489519h127582A6997323a7989081
15708F43517a506655k4146693l209576Q073434c941916k5007825A0472649c3024081
15699g242488A2236448l505890i18046j6355010A0822734I22392b2821986I588096
15690a7511354A3658360o041180J163139a4659824M096436B1118710M8701260
$$ plain form
15683 69819970 -3704973 -14366793 -6658145 16535526 -18260767 4370698 7326068 793467
15674 -4920089 12536793 -27259410 11400648 -7189924 -10130983 -883250 -24016810 -29268265
15666 -29268265 -13155609 -7989720 -27744986 -46596731 40535239 1001097 18891786
15659 18891786 -15570807 25110501 -24257502 8919281 -22576343 27680196 -23526260
15651 -37978179 -11179077 17356937 7123049 -11098555 9169314 -33347273 -15747799
15643 -38685862 1685730 -14777374 -6844687 -7795014 -7163974 20513416 1222871 10325839
15635 10325839 20917628 -16133203 18855191 34795721 44491733 -6269035 36403583
15627 15979695 -30826806 1141395 33566465 -25935446 -4595657 20073794 8107684
$$ packed form
15683F9819970c704973j0661820f658145A6535526a8260767D370698K955370G93467
15674d920089A2536793b7259410A1400648g189924k941059h83250k3133560n251455
15666b9268265a3155609N165889j9755266j8851745D0535239A001097J7890689
15659A8891786a5570807B5110501b4257502H919281b2576343B7680196b3526260
15651c7978179a1179077A7356937G123049a1098555I169314c3347273a5747799
15643c8685862A685730a4777374f844687r50327O31040B0513416A222871R102968
15635A0325839J0591789a6133203A8855191J5940530R696012f269035C6403583
15627A5979695c0826806A141395L2425070b5935446d595657B0073794H107684
$$ plain form
15619 -35851521 -9091598 17724554 -49764516 -853890 1987321 -11503049 25635986 14537829
15611 14537829 4138535 -43949828 -18392904 -41472360 -201171 27083627 25051043 10769598
15602 -42408453 -2753444 -14086945 7290051 -8960633 -21888096 7396910 -32413496 -23627229
15594 -23627229 17910977 -4561732 -2394318 15991805 9092373 33228834 1418091 -13619923
15585 14004965 -37913443 43249973 9309300 60163584 -12446054 12941387 -18462012
15577 30787031 25690832 20210692 5212799 -8821791 4361922 -10333886 -16458479 32121149
15568 -5748009 -23724690 24158486 13427654 21062601 -15047932 11875418 12106012 -30295788
15559 835878 6262710 16764409 36870584 38136914 5010701 9255173 28254051 -19396851
$$ packed form
15619c5851521i091598A7724554d9764516h53890A987321a1503049B5635986j1098157
15611A4537829D138535d3949828a8392904k3079456b01171B7083627k032584A0769598
15602d2408453b753444j1333501G290051h960633j2927463G396910c2413496Q786267
15594b3627229A7910977d561732K167414A5991805o899432K4136461A418091a3619923
15585A4004965c7913443D3249973I309300N0854284a2446054A2941387a8462012
15577C0787031n096199n480140E212799h821791D361922a0333886o124593C2121149
15568e748009j7976681B4158486j0730832P634947a5047932A1875418K30594c0295788
15559H35878N426832J0501699K0106175J266330E010701M244472J8998878a9396851
$$ plain form
15550 19937649 -17126601 24709219 18958683 -14814904 -37766017 -21855327 -14970867
15543 -14970867 4411635 -25191253 -7801427 14173492 -8464867 5607196 -4026481 6104792
15534 25411774 -19927502 -20511657 -33815703 16800513 -10297279 23603619 5633392
15526 38119223 21009803 12521226 -15037983 -12712645 9108240 -31624594 -874838 34158617
15517 8896484 22837715 -13897815 32012860 -49089871 -8509581 -7996932 2861070 -14200647
15508 -6136554 414689 -9687193 -17706857 -18073871 8017862 -34209829 10202806 -7189859
15499 -3256880 6346892 18432422 12028394 -6962933 6735172 22034967 -2555563 -13087074
15491 -13087074 685864 -9030273 -41025159 -34428929 4450776 48393010 -33848109 -15709587
$$ packed form
15550A9937649a7126601B4709219n750536a4814904k2951113J5910690O884460
15543a4970867D411635b5191253g801427A4173492h464867E607196d026481F104792
15534B5411774a9927502n84155j3304046A6800513a0297279B3603619E633392
15526C8119223j7109420q488577a5037983K325338I108240c1624594h74838C4158617
15517H896484J3941231a3897815C2012860d9089871h509581N12649B861070a4200647
15508f136554D14689i687193q019664l67014H017862c4209829A0202806g189859
15499c256880F346892J2085530o404028f962933F735172J5299795b555563j0531511
15491a3087074F85864i030273l1994886O596230D450776M3942234c3848109a5709587
$$ plain form
15482 23344958 -932024 -5464516 17924741 -16548667 -18387720 -26738088 20393385 -6996576
15473 21154974 -15182093 -16963000 -10058802 -37521191 2925554 -27610642 15338634
15465 3885477 -14639740 4201477 -1595806 8243092 -24907987 36095312 31293027 -44184832
15456 46797918 4329527 -21190040 18322140 -6645648 -18771790 3973713 1144611 -11407026
15447 -9548821 1517684 31494342 18191379 -22985895 17961657 7625401 -663507 -16791216
15439 -16791216 5043681 3217119 19223527 3546164 -21294823 22023634 -20368570
15431 15788227 16168890 -11946614 13540477 -47413134 -8348640 16327713 -30892524
15423 -7261939 22528798 -19368161 -4391110 7966118 -16963285 20675956 -10592523
$$ packed form
15482B3344958i32024m532492A7924741a6548667j839053q350368B0393385f996576
15473B1154974a5182093j780907O904198k7462389B925554b7610642A5338634
15465C885477a4639740D201477a595806H243092b4907987C6095312m802285d4184832
15456D6797918D329527b1190040A8322140f645648j2126142C973713A144611a1407026
15447i548821A517684K9976658j3302963b2985895A7961657G625401f63507j6127709
15439a6791216E043681j826562J6006408C546164b1294823B2023634b0368570
15431A5788227L80663a1946614A3540477d7413134h348640A6327713c0892524
15423g261939B2528798a9368161d391110G966118a6963285B0675956a0592523
$$ plain form
15415 10874317 47881224 3790908 -10959242 -17653705 -15957687 -4394173 38350833 -19336868
15406 14586329 6357168 -8170604 -15063263 -2496990 -37807976 13662555 32935117 16767223
15398 16767223 14410212 5460362 -21865419 -8316286 -7740118 13567094 -17147872 18131481
15389 -208483 17453654 -1689389 26590981 -54276595 -34098830 5663776 -22729215 -45130579
15381 -45130579 -35976972 24862169 28592214 24818783 -11223442 -1751399 -10373640 -40159196
15373 -40159196 20665977 5563088 14560474 6815169 -6916423 123571 22269909 2687036
15364 -7421416 -41780968 1388281 29110778 458137 -12880738 26551481 -4977450 2543014
15355 -32354741 28271491 9180372 -44794098 12960035 8941099 39089519 -24867678
$$ packed form
15415A0874317L7006907C790908a0959242o694463J696018d394173C8350833a9336868
15406A4586329F357168h170604o892659b496990l5310986A3662555J9272562j6167894
15398A6767223k357011E460362b1865419h316286N76168A3567094a7147872A8131481
15389b08483A7453654a689389B6590981e4276595K0177765E663776b2729215k2401364
15381d5130579R153607B4862169L730045l773431a1223442a751399q622241k9785556
15373d0159196B0665977E563088Q997386F815169f916423A23571K2146338B687036
15364g421416l4359552A388281K7722497D58137a2880738B6551481d977450B543014
15355c2354741B8271491I180372d4794098A2960035m018936L0148420b4867678
$$ plain form
15347 56387342 36078186 5777483 22850476 3900751 -19614016 -8648933 -254448 -14571870
15339 -14571870 7215332 14592895 11064832 -15220241 13078633 -28712836 -19627009 11099568
15330 -32696129 4863201 -9867857 -17352019 -46757782 65562969 1257184 22695917 -12421443
15321 -26920740 59511 -19240906 57813124 -32401980 -27150294 4354765 -37982200 -28260886
15313 -28260886 -8035458 18984196 -17224497 -33863399 34733315 -10844894 24405066
15305 12037038 -61659697 9949335 19095687 5750517 -6312050 11190054 6497409 2761565
15296 21707402 6454123 13444436 -18876268 -543810 -16396428 -9398581 29995644 20987084
15288 20987084 -4800038 -28293230 -5945294 11287199 -38083726 27713513 22052061
$$ packed form
15347E6387342k0309156E777483J7072993C900751a9614016h648933b54448j4317422
15339a4571870G215332P377563l528063a5220241A3078633b8712836R085827A1099568
15330c2696129D863201i867857p484162k9405763F5562969A257184K1438733a2421443
15321b6920740E9511a9240906E7813124c2401980N251686D354765c7982200R721314
15313b8260886h035458A8984196a7224497j6638902C4733315a0844894B4405066
15305A2037038f1659697I949335R146352E750517f312050A1190054m692645B761565
15296B1707402F454123O990313a8876268e43810j5852618O997847B9995644r008560
15288B0987084d800038k3493192e945294A1287199c8083726B7713513n661452
$$ plain form
15281 22052061 -8532738 23472101 5813403 -767955 3248842 -27302594 -13445404 -3859337
15272 1058862 -23782185 7264280 23239814 61966425 -35734263 27059635 -878739 -5826879
15264 -5826879 -35841170 9027532 -2840872 14546413 3760890 6638006 19012175 40400099
15256 40400099 -7130063 38308730 -40937440 11152284 28386957 -5662464 22168043
15248 -17266544 14649683 6405209 -18764364 -22956622 23813374 -23536101 51329771
15240 -27848360 21064981 8707172 3220626 740987 -26095598 17207914 31490644 -22601141
15231 5457532 -1402626 22179561 -13149056 -24163401 -19843235 -16158443 -8939755 26456700
15222 14302653 27207788 2408000 20406235 27912539 -20823194 -16901119 -8167469 2165257
$$ packed form
15281B2052061h532738B3472101E813403g67955C248842b7302594a3445404c859337
15272A058862b3782185G264280J5975534L8726611c5734263B7059635h78739m948140
15264e826879l0014291I027532b840872A4546413C760890K877116J2374169K1387924
15256D0400099g130063C8308730d0937440A1152284J7234673e662464B2168043
15248a7266544A4649683F405209a8764364m192258B3813374b3536101E1329771
15240b7848360B1064981H707172C220626G40987b6095598A7207914J4282730b2601141
15231E457532a402626B2179561a3149056j1014345M320166L684792P218688B6456700
15222A4302653J2905135B408000J7998235P506304b0823194L922075h167469B165257
$$ plain form
15213 -14637252 40277027 19061190 -2261869 7003980 17310093 21444010 -27812539
15205 1999918 -17486051 5303571 -5599099 40619386 -3307815 -41896549 6869921 20545693
15197 20545693 -424711 6893449 -2173391 11290550 -20457987 15117703 -4523412 -13533626
15189 -13533626 11911131 19619422 539965 -168308 15358020 50992359 -26790356 -2517394
15180 495815 11962033 23263714 -10641939 -30389 -10840903 -9614156 -32308262 -10336173
15171 -15754703 -20747852 -43025556 10574344 1425079 -30521355 -668095 45877959 -8431810
15162 9041240 -17679474 7162121 29955385 39216326 -57041502 12946360 -7965927 -27980950
15154 -27980950 -18200213 -286274 25419168 19303307 10815553 20481607 -13475936 -43745750
$$ packed form
15213a4637252D0277027A9061190b261869G003980J0306113M133917b7812539
15205A999918a7486051E303571e599099D0619386c307815l8588734F869921J3675772
15197B0545693d24711F893449b173391A1290550b0457987A5117703d523412r010214
15189a3533626A1911131P708291E39965a68308A5358020L5634339b6790356b517394
15180D95815J1466218J1301681a0641939c0389j0810514J226747k2694106a0336173
15171a5754703m993149k2277704A0574344A425079c0521355f68095D5877959h431810
15162I041240a7679474G162121K2793264R260941e7041502A2946360g965927k0015023
15154b7980950R780737b86274B5419168o115861q487754R666054a3475936l0269814
$$ plain form
15146 -43745750 -7471775 25161357 -9682023 47915504 -21828664 1987717 -4950175 -3034406
15138 -3034406 1339445 -53098206 -41036161 20116363 7592998 -27011434 6946314 10019973
15130 10019973 16784687 2799281 -22800861 21949344 -18051693 -9812721 -10558392 25427986
15121 48682650 -8653731 -21101602 -29697946 21048977 -21646732 9679717 -4631480 23656255
15112 9452016 -51976749 22758193 -4745774 20909 -3589705 20646348 28191755 2952698
15103 -29053523 -8985245 9901606 5892483 38070671 10306142 -1114330 13658917 17894387
15095 17894387 10447047 -14916170 -32952861 -18172648 19529752 -19028665 -3480646
15087 -25127488 36399999 -37304566 -1887484 7707454 29329005 -15667901 -2982665
$$ packed form
15146d3745750g471775B5161357i682023D7915504b1828664A987717d950175J915769
15138c034406A339445e3098206J2062045B0116363G592998b7011434F946314L073659
15130A0019973O764714B799281b2800861B1949344a8051693Q238972p45671B5427986
15121D8682650h653731j2447871q596344B1048977b1646732I679717d631480B3656255
15112I452016e1976749B2758193d745774B0909c589705B0646348P545407B952698
15103b9053523h985245I901606m009123L2178188A0306142a114330A3658917M235470
15095A7894387p447340a4916170j8036691J4780213A9529752a9028665c480646
15087b5127488C6399999c7304566a887484G707454K1621551a5667901b982665
$$ plain form
15079 11734097 -29973936 4778667 11347442 -20415819 -19524150 -22271998 4322041 16595524
15071 16595524 -878194 -16245484 17984950 6770637 22800694 -25468152 34990308
15063 -9969076 -7083969 -21592023 37848410 -11840404 34857321 56243500 14904632
15055 -25599703 25171380 21540378 39102711 -8330721 -20961479 -22244704 7491977 -35207597
15046 17995754 70388838 -24758271 23803385 -22947724 -46894564 1895293 5800300
15039 5800300 5021538 -14006684 15252919 8013723 -12753415 3260532 5506519 -34357212
15030 -16601543 -13991795 1090480 -37518915 -31876207 19042013 -37686737 37113542
15022 -20221146 -17912493 -14904391 4527808 -1834112 -12698728 -13070278 12636467 21532590
$$ packed form
15079A1734097b9973936D778667O568775b0415819Q91669k747848D322041J2273483
15071A6595524h78194j5367290A7984950F770637J6030057b5468152C4990308
15063i969076K885107j4508054C7848410a1840404C4857321K1386179A4904632
15055b5599703B5171380l631002J7562333h330721j2630758j283225G491977c5207597
15046A7995754N2393084b4758271B3803385b2947724k3946840A895293L905007
15039E800300p78762a4006684A5252919p239196a2753415C260532K245987c4357212
15030a6601543K609748A090480c7518915N642708A9042013c7686737C7113542
15022b0221146K308653L008102D527808a834112j0864616l71550A2636467Q896123
$$ plain form
15014 21532590 5550979 -1512651 -3401159 6040603 14554071 -10433170 -15610125 11789206
15005 -5367150 -767221 12109907 11342914 -9448545 19197286 -2007232 -56748917 39002970
14996 -14923754 25357674 2603997 -26982088 20710652 -11143480 6377023 16583974
14989 16583974 5031855 -12941569 2191860 -11834496 -493465 14445023 -26352327 -1194711
14980 -1197736 10167101 -11256724 485884 -11522232 -21302990 -27320042 39648694 791502
14971 16385684 -38401074 26259357 -31741843 52451647 -13079759 -8815115 -11429907
14964 -11429907 13169095 27783716 33619561 -23976077 9886719 6059982 -42738071
14956 -20695905 -3506630 7267369 1709403 -5545550 -17622081 -9960439 -42230771 -22422912
$$ packed form
15014B1532590E550979a512651j888508F040603Q513468a0433170n176955A1789206
15005e367150g67221A2109907p66993i448545A9197286b007232n4741685C9002970
14996a4923754B5357674B603997b6982088B0710652a1143480F377023J0206951
14989A6583974E031855a2941569B191860a1834496d93465A4445023b6352327a194711
14980a197736A0167101a1256724D85884a1522232r780758o017052C9648694G91502
14971A6385684c8401074B6259357c1741843E2451647a3079759M264644k614792
14964a1429907A3169095J4614621N835845b3976077I886719l826737d2738071
14956b0695905c506630G267369A709403e545550j2076531P661642l2270332J9807859
$$ plain form
14948 -22422912 -12623671 -7294102 -21484447 29589155 -49469606 -43931227 -16571636
14940 -38315943 -8213637 -30288137 10108235 6882015 -34174903 11107314 28539925
14933 28539925 11616460 -16119953 -10719561 71942605 -37593922 11456566 -5441632
14925 40296167 17265853 -15426072 -748694 5918641 -19022550 -15939130 4630921 -32219796
14916 10813318 9252799 -23247582 -32345859 15206756 -30253007 -6132161 -17127143
14909 -17127143 35844 -6803954 20774728 -29877332 -14618410 -17914328 19576658 38497894
14901 38497894 -29365220 -4016404 5651958 29970935 12498671 11357599 23596233
14894 23596233 17626244 32017508 10624763 11874639 6443691 12421484 -21198009 -15160795
$$ packed form
14948b2422912R799241N329569j4190345B9589155d9469606N538379a6571636
14940c8315943h213637k2074500A0108235l226220c4174903A1107314J7432611
14933B8539925A1616460a6119953N400392G1942605c7593922A1456566e441632
14925D0296167A7265853a5426072g48694E918641a9022550L083420D630921c2219796
14916A0813318j560519b3247582r098277A5206756c0253007f132161j0994982
14909a7127143C5844f803954B0774728b9877332a4618410l295918A9576658J8921236
14901C8497894b9365220d016404E651958K4318977A2498671j141072J2238634
14894B3596233n969989J4391264A0624763J249876n430948N977793b1198009O037214
$$ plain form
14886 -15160795 36071133 8349040 -5310177 9991759 15989845 -3325453 19546531 -18123927
14877 -10910340 7671483 -3600353 -41175460 -18507202 20491538 -14561554 -32231183
14870 -32231183 30153744 -32878954 12398360 -29909196 -43202277 2143618 9767841
14863 9767841 -13260464 -9729253 13382786 -15110078 -180833 -27657728 22612538 -25154515
14854 34425182 -24120271 -274967 7980952 46420176 28608396 -28291295 -8462414 11396272
14845 25503435 -22016006 -26262999 -2248004 36156648 -17654103 -39857592 49960719
14837 3860833 17219421 -46129355 6415777 -9219715 8218708 4909158 11170964 -8604632
14828 -10712060 43923366 -5548452 7008898 -17506443 5008925 -12530221 29408629
$$ packed form
14886a5160795C6071133H349040e310177I991759N998086c325453A9546531a8123927
14877a0910340G671483c600353l7575107a8507202B0491538a4561554j7669629
14870c2231183C0153744c2878954A2398360b9909196j3293081B143618P624223
14863I767841a3260464L531211A3382786a5110078a80833k7476895B2612538b5154515
14854C4425182b4120271b74967G980952L8439224j7811780b8291295h462414A1396272
14845B5503435b2016006m246993b248004C6156648a7654103k2203489D9960719
14837C860833J3358588d6129355F415777i219715H218708l309550O261806h604632
14828a0712060D3923366e548452G008898a7506443E008925a2530221B9408629
$$ plain form
14820 -39648609 -28157034 41534622 43756218 14041931 -3857148 10817676 11699894 12753437
14812 12753437 -6179089 19048200 -21542898 -22100300 -2265806 5257712 -16726248 -19520654
14804 -19520654 5308822 -40693537 -7376740 3839161 5901050 22880810 16997617 -36962935
14795 -13308976 22829471 2981212 -3261844 15998025 -11889560 -7554915 -20403933
14788 -20403933 -10971014 25208404 -366141 24747327 -8685541 8646028 -48207619 -7056338
14779 10267541 19565403 31447775 4250263 2920589 -4223190 8047569 -8559795 44561615
14770 -9851989 32456784 -18748702 27068416 8859314 -42997420 -10894524 20590572
14762 -8135183 28687647 26288188 -6582317 35281882 -7830568 -6320402 -26395710 -5025880
$$ packed form
14820c9648609J1491575D1534622K221596A4041931c857148A0817676Q82218J053543
14812A2753437f179089A9048200b1542898n57402b265806E257712a6726248k794406
14804a9520654E308822d0693537g376740C839161K061889J6979760n883193c6962935
14795a3308976B2829471B981212c261844A5998025a1889560M334645j2849018
14788b0403933R432919B5208404c66141B4747327h685541H646028d8207619g056338
14779A0267541R297862J1882372D250263j329674d223190H047569h559795D4561615
14770i851989C2456784a8748702B7068416H859314d2997420a0894524B0590572
14762h135183B8687647k399459f582317C5281882g830568J510166k0075308e025880
$$ plain form
14753 2044382 2844131 -19204139 6116842 6190101 15389617 -30537096 699790 -3029004
14744 -6468484 220592 8853570 17755606 -4128869 -30160549 -33418598 -8964037 41781896
14735 13415424 -23990604 48180035 10972642 -37678574 -6542 -24924935 -1334614 15472317
14726 -1374519 28514797 44697884 -29524365 20628192 38492469 19309361 -25156516
14718 -33990984 -16581802 2604733 -2724341 1230663 546376 -6743711 -22664242 -11265105
14709 -6308782 -23680901 -10748014 -7540228 -34701848 12863031 -30990262 24325996
14701 51091783 19222220 -4049960 14851443 12974341 -19296657 -6678044 -38521387
14694 -38521387 29852369 13032232 36368274 56471937 29323309 -13607521 1757500
$$ packed form
14753B044382P99749a9204139F116842P3259R199516c0537096F99790c029004
14744f468484B20592Q632978Q902036d128869k6031680l258049h964037D1781896
14735A3415424b3990604D8180035A0972642c7678574f542k4918393a334614A5472317
14726a374519B8514797J6183087b9524365B0628192J7864277j9183108b5156516
14718c3990984a6581802B604733b724341A230663E46376f743711j5920531a1265105
14709f308782j7372119a0748014L207786k7161620A2863031c0990262B4325996
14701E1091783A9222220d049960A4851443j877102a9296657f678044l1843343
14694c8521387B9852369A3032232K3336042K0103663k7148628a3607521A757500
$$ plain form
14686 -15074098 -22805258 -9560148 -17957771 64362338 9922066 4028507 -12819791 14647101
14677 -20769109 -27381193 24991205 17229985 -23977330 -10074533 2566524 21212722
14670 21212722 -14945012 42624 26450532 18338019 28337017 -22201863 34477478 50110631
14662 50110631 -8063346 658558 -13663969 -18402099 -8056555 3675843 2076232 10714053
14654 10714053 -38230565 35164301 -1194303 -13971329 -11081232 9618315 -14443594
14646 5928393 33850850 41989101 -9706704 -8928991 10343760 -7214353 -7292939 31561842
14637 -25813550 11494750 -27252472 28096972 -26323303 -9419269 19970300 -25765181
14629 -37787379 -44480 -25318274 -11880367 24473625 -7348981 -5073246 -14027075 -11189605
$$ packed form
14686a5074098p731160i560148q397623F4362338I922066D028507a2819791A4647101
14677b0769109o612084B4991205p761220b3977330a0074533B566524J8646198
14670B1212722a4945012D2624K6407908q112513R998998b2201863C4477478J5633153
14662E0110631h063346F58558a3663969m738130h056555C675843j599611Q637821
14654A0714053c8230565C5164301a194303j2777026K890097I618315a4443594
14646E928393K7922457Q138251i706704P77713A0343760g214353p8586C1561842
14637b5813550A1494750b7252472B8096972b6323303i419269A9970300b5765181
14629c7787379d4480k5273794a1880367B4473625g348981K275735q953829K837470
$$ plain form
14621 -11189605 19447764 16586625 -28892211 23126572 -32167794 -20541654 -24682996
14614 -24682996 -10634181 5279143 3557417 4180993 -28235468 17091978 15508389 -5847243
14605 -8854417 4588423 -3929760 1906240 -9481909 -12953795 991479 54480575 20656050
14596 27122328 -33845224 -11802555 -21816554 -13207467 13145306 12146744 -27189898
14588 -21542349 -5542863 24557049 -160383 -11813018 -148879 -8192819 31429648 27905181
14580 27905181 8935779 -29897938 22704795 16725990 -16341229 8296670 6563254 4402221
14572 4402221 -32243693 8675543 -6338878 -12089306 -26565509 -24590868 29047544 23842963
14564 23842963 -5462790 -8918779 -28181404 -17418851 17801683 -34075934 1476057
$$ packed form
14621a1189605A9447764k861139b8892211B3126572c2167794J1626140m141342
14614b4682996a0634181E279143j721726O23576b8235468A7091978j583589e847243
14605h854417D588423c929760A906240i481909l471886I91479N3489096B0656050
14596B7122328c3845224a1802555j0013999Q609087A3145306r98562b7189898
14588b1542349e542863B4557049a60383j1652635a48879q043940C1429648l524467
14580B7905181H935779b9897938B2704795n978805a6341229H296670j733416k161033
14572D402221c2243693H675543f338878n750428j4476203J974641B9047544n204581
14564B3842963e462790l455989j9262625J0762553A7801683c4075934A476057
$$ plain form
14556 -9255788 5955382 5307652 -2059607 -11463610 -29790207 18759242 6503834 17362072
14548 17362072 -13851294 -12640566 -2520894 -26036933 -16923208 6293346 5138448 756407
14539 19911078 -29214975 10376413 1170046 -20877843 18808459 7749517 -49948456
14531 -15909717 19962448 13909263 14454273 -13299800 -8183688 -3075255 14249935 -19642310
14522 -31993461 22934090 -5576480 4320522 -19327485 14461761 28619465 943842 13780577
14514 13780577 37738902 27932407 17393368 25306925 -52356720 2742762 9901127 8125323
14506 8125323 -26264971 -5273872 -5332681 -3818758 -4723943 27242911 6073331 1341471
14497 -15560402 25294107 -10661288 -25087344 33461036 -16015097 27238270 -13421159
$$ packed form
14556i255788E955382o47730b059607r404003j8326597A8759242F503834J0858238
14548A7362072a3851294J210728b520894k3516039R113725F293346j154898G56407
14539A9911078b9214975A0376413A170046b0877843A8808459G749517d9948456
14531a5909717A9962448o053185N45010a3299800N116112c075255A4249935a9642310
14522c1993461B2934090e576480D320522a9327485A4461761J4157704I43842J2836735
14514A3780577K3958325r806495j0539039P913557e2356720B742762P158365j775804
14506H125323b6264971e273872n8809J513923r05185B7242911F073331A341471
14497a5560402B5294107a0661288j4426056C3461036a6015097B7238270a3421159
$$ plain form
14489 -15635138 -31740836 -21108128 -9211270 -18344635 17516650 27887396 785208 24568353
14481 24568353 32847409 -4088378 1568822 229618 -11994377 12570527 -13765183 -41050512
14473 -41050512 -33189310 53431 -17074789 -12528122 13506541 -6720376 32036126 16294557
14465 16294557 9386480 2224482 -2560360 12004798 30328085 4119284 12581228 41366279
14457 41366279 -21553892 27609868 -3648377 -4342239 17873020 11797658 -3577156 12346137
14448 -13074548 28724361 1983952 18839241 -9609150 2383850 12198654 22747293 7773829
14439 -1580934 47593357 6236593 38161217 -10089738 -16395800 -23926949 1475038 -1549316
14430 -20619670 -20996282 14666634 -2623524 -10417091 13476190 47071183 4375386 -1343829
$$ packed form
14489a5635138j6105698J0632708i211270r133365A7516650J0370746G85208K3783145
14481B4568353Q279056d088378A568822B29618a1994377A2570527a3765183k7285329
14473d1050512P861202E3431a7074789M546667A3506541f720376C2036126j5741569
14465A6294557o908077B224482b560360A2004798J8323287D119284Q461944K8785051
14457D1366279b1553892B7609868c648377o93862A7873020o075362c577156A2346137
14448a3074548B8724361A983952J6855289i609150B383850R814804J0548639G773829
14439a580934D7593357F236593L1924624a0089738o306062p531149A475038a549316
14430b0619670l76612A4666634b623524p793567A3476190L3594993D375386a343829
$$ plain form
14421 -19254551 -23494217 -35669547 35402815 -14471946 -8352661 -7739206 44319531 17130784
14412 32578516 -2239707 -20922523 14573752 -41756589 5489494 -40464838 -8800974
14404 -10407405 -35070136 -1631490 34148432 42593898 6465262 8147620 17406141 -23646973
14395 -20052758 -1788138 69611557 -34918074 -38460037 -10487765 11587773 14767608
14388 14767608 -37530478 -26519786 13876766 -48628158 5739942 -451878 -24654887
14381 -24654887 1006588 -32731840 4226694 6444856 -30660209 -18329357 -31438119
14374 -31438119 23221586 -12680426 -55204097 6456364 129379 -12076543 -6800422 -10798493
14366 -10798493 -23523798 -5163404 14481434 16896900 16970039 -11021560 -3518212 10462531
$$ packed form
14421a9254551m239666j2175330C5402815a4471946O119285O13455D4319531A7130784
14412C2578516b239707j8682816A4573752d1756589E489494d0464838h800974
14404a0407405k4662731a631490C4148432Q445466F465262J682358R258521b3646973
14395b0052758a788138F9611557c4918074l541963a0487765A1587773L179835
14388A4767608c7530478J1010692A3876766d8628158E739942d51878k4203009
14381b4654887A006588c2731840D226694K218162c0660209J2330852j3108762
14374c1438119B3221586a2680426m2523671F456364A29379a2076543N276121l998071
14366a0798493j2725305e163404A4481434K415466P3139a1021560c518212A0462531
$$ plain form
14357 -2969085 -16759644 -12833613 -6553087 -17286276 2298402 -39435358 3857675 39901833
14349 39901833 -30300264 -1098812 -22644322 36098190 -2557699 -3620079 -14110958
14342 -14110958 -12202458 3187145 -6725331 -30276600 5707225 -33021891 243930 -12062550
14333 -15262302 -56438551 -2627014 47647831 -35809259 22514199 -9833282 8755499
14325 12986678 2496043 35191163 -3009913 29402618 21818432 29753650 -17664674 -7786081
14316 -36181483 35979372 2184611 26393606 19167452 -4562917 -19299458 -3214647 16079018
14307 -8224229 -9406764 -21488922 -9354885 -27816960 20510511 -14621296 22893779
14299 5000029 11108072 20266311 5686402 -11183458 -11530411 -33437389 9823585 13650198
$$ packed form
14357b969085j3790559L926031O280526j0733189B298402c9435358C857675L6044158
14349C9901833c0300264a098812k1545510C6098190b557699j062380j0490879
14342a4110958J908500C187145f725331k3551269E707225c3021891B43930a2062550
14333a5262302m1176249b627014D7647831c5809259B2514199i833282H755499
14325A2986678B496043L2695120c009913B9402618p584186P935218a7664674g786081
14316c6181483C5979372B184611K4208995p226154d562917j4736541c214647A6079018
14307h224229j182535j2082158i354885j8462075B0510511a4621296B2893779
14299E000029O108043R158239E686402a1183458l46953k1906978I823585L826613
$$ plain form
14291 13650198 -11153366 -16681912 -37171428 -8611932 -42305663 -11854307 20921628
14283 4027414 -29851605 51099367 -2469812 2857898 -6180074 -5336904 9973110 -34678561
14274 7705932 -25746940 -5608142 -1470907 30871533 -14816005 -36508343 -55408417
14267 -55408417 7730977 -17879859 -3537603 4673370 -8435378 -11180347 14661418 -25012466
14258 -26980679 -26916791 -8917879 25294050 -67738175 -53437206 -13971499 39014654 4671412
14249 27142480 -17410954 11179298 8083868 -3495792 18161017 13779867 9851145 -13823855
14240 8517107 1731503 -20393839 23781546 20906334 6464055 24729536 29846136 -18628585
14231 -26449050 -13218294 7318421 -13609450 -7369012 11807607 64936885 70790580
$$ packed form
14291A3650198a1153366n528546k0489516h611932l3693731a1854307B0921628
14283D027414b9851605E1099367b469812B857898f180074Q43170I973110c4678561
14274G705932b5746940e608142a470907C0871533a4816005k1692338j8900074
14267e5408417G730977a7879859c537603D673370h435378k744969A4661418b5012466
14258b6980679O3888h917879B5294050f7738175J4300969a3971499C9014654D671412
14249B7142480a7410954A1179298l095430c495792A8161017m381150l928722a3823855
14240H517107A731503b0393839B3781546k875212F464055J8265481N116600a8628585
14231b6449050a3218294G318421a3609450O240438A1807607N3129278N853695
$$ plain form
14224 70790580 68599372 44536224 136023270 123961342 157504054 132444868 155701542
14217 155701542 118992553 220848805 245912412 271218130 252131773 239858186 243491188
14210 243491188 265334694 299510178 365813286 374153353 358496684 286661766 265679327
14203 265679327 205431004 249756110 271021853 274029973 196643126 169620130 152400294
14196 152400294 158884488 134242587 161292397 112132339 82028298 53288101 11858962
14188 -3778270 -14252019 49063669 -17150041 24889095 -15934767 36826355 5655976
14180 -7329482 6006056 -4313356 -4701950 -8059553 -20192876 17096408 -834357 21653175
14171 -31143426 -5806987 11877846 8197837 22662235 9350606 -1218560 22419095 -25212210
$$ packed form
14224G0790580k191208k4063148R1487046j2061928L3542712k5059186K3256674
14217A55701542l6708989J01856252K5063607K5305718j9086357j2273587L633002
14210B43491188K1843506L4175484O6303108Q340067j5656669p1834918k0982439
14203B65679327o0248323M4325106K1265743L008120p7386847k7022996j7219836
14196A52400294O484194k4641901K7049810m9160058l0104041k8740197A1858962
14188c778270j0473749D9063669a7150041B4889095a5934767C6826355E655976
14180g329482F006056d313356l88594l357603j2133323A7096408h34357B1653175
14171c1143426e806987A1877846l680009J4464398I350606a218560B2419095b5212210
$$ plain form
14162 -2579195 -12776573 19802968 -2873479 19026331 -9627871 -4151125 -3931288 -32522652
14154 -32522652 10843274 5684276 49170894 24199619 -27755703 14054636 6309709
14146 16890489 -5648785 3403910 20141401 -1063902 19985816 27195070 -21827329 -12500559
14138 -12500559 -2058857 8788735 36747757 1819738 -21031411 6675996 -25362760 -1437437
14129 12253415 19302824 -1734256 -40766332 -18328542 -7943521 21229630 17263635 6945760
14120 392890 17051570 -17460807 21132841 37666158 17591651 6021781 -13718688
14112 -9813548 28689672 -43350570 -16885000 -2397357 20200957 -4531460 -29477656
14105 -29477656 -39140142 7626503 16304741 13937320 344657 -3349823 -50033911 774689
$$ packed form
14162b579195j0197378A9802968b873479A9026331i627871d151125K19837k8591364
14154c2522652A0843274n158998M3486618B4199619b7755703A4054636F309709
14146A6890489e648785C403910J6737491a063902A9985816P209254b1827329R326770
14138a2500559b058857H788735K7959022A819738b1031411F675996b5362760a437437
14129A2253415P049409a734256l9032076a8328542g943521B1229630l965995F945760
14120C92890J6658680a7460807B1132841J6533317A7591651F021781a3718688
14112i813548B8689672d3350570a6885000b397357B0200957d531460k4946196
14105b9477656r662486G626503Q678238k367421C44657c349823m6684088G74689
$$ plain form
14096 -18535900 -12211105 8617463 -135982 22243445 -23947181 -7009827 3609109 -38010068
14087 -20638439 9753976 -11049084 16723067 -2782063 9499237 1943741 34479280 -17292735
14078 -19284678 122293 -3621653 13056935 -17668412 2626579 14774306 3435195 14004933
14070 14004933 25813390 -11003448 -52356538 -2595923 -3044005 -25328384 5247445 7143934
14062 7143934 -15577341 5963560 -18121318 20825573 23281029 -6520604 632240 28772390
14054 28772390 22316254 21945067 10705773 20781730 22666452 -19878522 -335355 -6912468
14046 -6912468 -13614456 -8379614 -1397829 5832572 19656155 32268296 2998564 26026027
14038 26026027 -11729392 2897691 -3647955 -4738272 -21555455 13123144 11049440 21087229
$$ packed form
14096a8535900O324795H617463a35982B2243445b3947181g009827C609109c8010068
14087b0638439I753976a1049084A6723067b782063I499237A943741L2535539a7292735
14078a9284678A22293c621653A3056935a7668412B626579J2147727C435195J0569738
14070A4004933J1808457a1003448m1353090b595923m48082k2284379E247445J896489
14062G143934a5577341E963560a8121318B0825573K455456f520604F32240K8140150
14054B8772390o456136l71187A0705773J0075957J884722a9878522c35355o577113
14046f912468o701988N234842a397829E832572J3823583J2612141B998564K3027463
14038B6026027a1729392B897691c647955j090317j6817183A3123144k073704J0037789
$$ plain form
14030 21087229 -7674459 -22024649 -11025027 -25095193 -29699761 2965383 19953664
14023 19953664 25313699 -20897017 41502197 -15277513 36961189 8972892 21388628
14016 21388628 -4769501 46051958 12693208 -36605561 5365694 902998 -14375653 39337768
14007 -11364811 -33305512 16840286 6633075 -16360868 18659955 -19291449 27507042
13999 -14867444 -21242353 4596882 54713541 -514176 -12876461 -10105086 -37353987 -11733773
13990 -9458184 29244312 41619542 -18730699 4291985 -26731518 -6990186 8060716 -26642746
13981 -37609277 -2308407 37292444 -18982239 16485558 26033814 19859459 2815626 24146522
13973 24146522 32081922 8274505 14640228 -11153572 4380505 -5838490 -3802418 5954423
$$ packed form
14030B1087229g674459j4350190J0999622j4070166m604568B965383J6988281
14023A9953664N360035b0897017D1502197a5277513C6961189H972892J2415736
14016B1388628d769501D6051958A2693208c6605561E365694I02998a4375653C9337768
14007a1364811k1940701A6840286F633075a6360868A8659955a9291449B7507042
13999a4867444o374909D596882N0116659e14176j2362285K771375k7248901a1733773
13990i458184B9244312J2375230a8730699D291985b6731518f990186H060716b6642746
13981c7609277b308407C7292444a8982239A6485558R548256o174355B815626K1330896
13973B4146522P935400H274505O365723a1153572D380505e838490K036072E954423
$$ plain form
13964 12788761 -45495230 4762611 22397529 38195427 -28577031 9087482 2123636
13956 30481301 -11681828 -17446728 24095518 38941911 2310120 24608227 3119994
13948 48918968 28826956 -328768 27465563 36703466 27007259 4020013 16841137 37183253
13940 37183253 -11323583 -23885723 689623 -5068128 3612680 -8477592 -24405449 -28404495
13932 -28404495 11168719 34385440 -6388612 7583798 -6912705 20792481 -217220 6730115
13923 -8972355 13594608 -34895279 -651695 -26602911 -10920670 24239238 -28700386
13915 21513888 18988688 18101956 2275615 18273611 -4309290 -4288913 -19664794 35100173
13906 -45130912 -35328501 19053405 11089364 -59088555 -43146328 10884673 -25122799
$$ packed form
13964A2788761d5495230D762611J7634918J5797898b8577031I087482B123636
13956C0481301a1681828n764900B4095518J4846393B310120K2298107C119994
13948D8918968k0092012c28768B7465563R237903r696207D020013J2821124K0342116
13940C7183253a1323583j2562140F89623e068128C612680h477592j5927857l999046
13932b8404495A1168719K3216721f388612G583798f912705B0792481b17220F730115
13923h972355A3594608c4895279f51695k5951216a0920670B4239238b8700386
13915B1513888k525200q86732B275615J5997996d309290K0377j5375881C5100173
13906d5130912R802411A9053405p964041e9088555J5942227A0884673b5122799
$$ plain form
13898 -24762393 -7044772 13423783 -6871057 -23292865 23940451 15042763 9347002 359913
13889 20444657 11236063 43614388 -17510747 27192985 14900938 9181071 -736160 28013579
13880 -12280829 -15422543 15430662 13528614 -16241352 -16107439 45355383 24297385 -22802986
13871 6989134 13960378 -5414733 -3285016 -7364065 6375726 29989190 -13572044 -50732298
13863 -50732298 -34482473 -25201022 -731493 -10307724 5197566 32165156 16714243 -2128935
13854 -27141975 14017979 6076834 -1431487 29243634 -10968681 -18028173 -11093858 24455086
13845 -10910052 1215663 7030731 4510976 3361744 -10834490 -16202326 -6798582 3493305
13836 1398054 13386990 40702437 13341484 13482996 -90081 -17364812 2477955 -7286595
$$ packed form
13898b4762393g044772A3423783f871057j6421808B3940451q897688n695761C59913
13889B0444657r208594L2378325a7510747B7192985j2292047n719867g36160B8013579
13880a2280829l141714A5430662j902048a6241352J33913D5355383k1057998b2802986
13871F989134O971244e414733K129717m079049F375726K3613464a3572044l7160254
13863e0732298J6249825R281451g31493r576231E197566K6967590j5450913b128935
13854b7141975A4017979F076834a431487B9243634a0968681p059492O934315B4455086
13845a0910052A215663N815068k519755j149232a0834490n367836f798582C493305
13836A398054J1988936K7315447A3341484J41512i0081j7274731B477955g286595
$$ plain form
13827 2113757 -15219486 -5369457 31964924 1745959 1685747 13191481 8110752 19092188
13819 19092188 -4594421 19134723 -2581108 10915016 13546069 31330315 -20063015
13811 -22856506 3142494 -18753029 1435659 -27106706 6048896 -2014367 9740995 13985568
13803 13985568 -3417940 13885438 31238706 -22372957 -3290854 1777495 11478182 -34675102
13794 -12952534 -18525242 -4593388 -17323228 21641588 -29122679 -2870964 495523 -29826622
13785 -5781186 -39937678 13667737 -22154605 -14791047 13027659 -15281792 28069339
13777 -9126881 9094146 -8088352 6481335 39950852 -14480248 -9339828 -9443537 -22348736
13769 -22348736 -16270309 -51093562 49904500 33392900 -8012435 20453773 16994684
$$ packed form
13827B113757a5219486e369457C1964924A745959o0212J1505734n080729J0981436
13819A9092188d594421A9134723b581108A0915016K631053J7784246b0063015
13811b2856506C142494a8753029A435659b7106706F048896b014367I740995M244573
13803A3985568c417940A3885438J7353268b2372957c290854A777495R700687c4675102
13794a2952534n572708d593388j2729840B1641588b9122679b870964D95523b9826622
13785e781186l4156492A3667737b2154605P363558A3027659a5281792B8069339
13777i126881I094146h088352F481335L3469517a4480248N140420j03709j2905199
13769b2348736O078427l4823253D9904500j6511600h012435B0453773l459089
$$ plain form
13762 16994684 16362866 28221921 -27647694 -23458202 7564747 -43296484 2236078 45008079
13754 45008079 10713221 -840802 -13895782 18972718 12919332 -17584019 3254703 56047140
13746 56047140 37202003 80940426 -23788996 -24383553 3859705 20197559 -23364445
13738 32165649 20196383 -18388786 -14028942 30605761 -51607108 -13056207 50989097
13730 27913661 6831659 3755546 26748674 2058135 3417779 26068693 -20603800 -43510243
13722 -43510243 14449511 -1319084 -27711390 -73828517 4987604 -21567299 -34382553
13715 -34382553 -3563308 -14086772 11758843 17511247 -4891032 23768494 5050105 -82743
13706 -3402186 -16398549 31554298 -4031078 -6920552 -28357802 -50998341 23351906
$$ packed form
13762A6994684o31818J1859055b7647694M189492G564747d3296484B236078M2772001
13754D5008079A0713221h40802j3054980A8972718o053386a7584019C254703N2792437
13746E6047140j8845137M3738423b3788996n94557C859705J6337854b3364445
13738C2165649j1969266a8388786M359844C0605761e1607108a3056207E0989097
13730B7913661F831659l076113K2993128B058135J359644K2650914b0603800k2906443
13722d3510243A4449511a319084k6392306m6117127D987604b1567299j2815254
13715c4382553c563308j0523464A1758843N752404d891032B3768494E050105h2743
13706c402186j2996363C1554298d031078k889474k1437250k2640539B3351906
$$ plain form
13698 -33296897 -393254 -6557120 -11006134 15558143 9459593 -5620742 -7888006 -7374368
13690 -7374368 -11064514 6817753 -21613804 13178986 -415087 33160641 -77315434 22895576
13681 -3775489 -2336100 21380858 21866634 16081709 -68356 -20359512 3057069 -19002647
13672 -13722277 3858447 -23234103 -13051100 33654320 3422836 2572861 22548773 10796027
13663 51328720 -5646541 33569374 51852556 28743965 -3555428 11942727 -19402546
13655 10484047 -26018530 36392885 -20664317 407951 3136192 29736282 -33254537
13647 -20199785 -9022646 -31339423 52678553 4690735 28343974 -6591117 32183069
13639 -37844600 11793749 44934493 11788336 -36351596 -2325073 723303 2103489 -2484234
$$ packed form
13698c3296897c93254o163866m449014A5558143o098550e620742k267264N13638
13690g374368l690146F817753b1613804A3178986d15087C3160641g7315434B2895576
13681c775489J439389B1380858M85776n784925f8356k0291156C057069a9002647
13672a3722277C858447b3234103J0183003C3654320C422836q49975J9975912A0796027
13663E1328720e646541C3569374J8283182k3108591c555428A1942727a9402546
13655A0484047b6018530C6392885b0664317D07951K728241K6600090c3254537
13647b0199785i022646k2316777E2678553D690735K3653239f591117C2183069
13639c7844600A1793749L3140744A1788336c6351596b325073G23303J380186b484234
$$ plain form
13630 -8860833 -6361615 -17118636 15584922 8810125 -14403537 15562793 -29980791
13622 -5881317 47365389 37583003 -40101387 -9094056 6879580 -15445488 -40934934 13209153
13613 33796748 -5906989 23613870 26050386 6669127 -26886382 2181368 -6643259 17166065
13604 1245211 4472970 -19685442 -762494 -15765481 -7277101 5612402 27427889 -13428182
13595 -24276387 39992127 10631922 3715506 17114447 31545597 -31688805 5828769
13587 5577976 -40387004 35169777 3268070 922321 16520123 -1234512 -9547662 -20035450
13579 -20035450 12550186 -14390989 29683059 -9780048 8018076 3878685 12197414 43758285
13571 43758285 -1958937 4163883 7206448 -23404043 -20560135 -40080643 -14714639 -17685602
$$ packed form
13630h860833K499218j0757021A5584922o774797a4403537A5562793b9980791
13622e881317D7365389r782386d0101387i094056F879580a5445488k5489446A3209153
13613C3796748e906989B3613870K436516F669127b6886382B181368f643259A7166065
13604A245211L227759a9685442g62494j5002987g277101E612402K1815487a3428182
13595b4276387C9992127A0631922C715506J3398941J4431150c1688805E828769
13587E577976d0387004C5169777C268070I22321J5597802a234512q313150j0487788
13579b0035450A2550186a4390989B9683059i780048H018076C878685Q318729L1560871
13571D3758285a958937D163883L042565b3404043K843908j9520508a4714639k970963
$$ plain form
13563 -17685602 2262664 36829955 7877958 1999481 16073345 -3543943 -61973475 -49516416
13555 -49516416 -4835212 -11910022 3551842 9845311 -41762635 20205308 -6502867 -3211091
13546 -24267430 26536684 10020149 5009670 15732802 -5785594 38937164 28246866
13539 28246866 -23136604 -3808545 -30070477 -20282960 6708753 39078267 -17071866
13531 15420868 -3220094 -5802343 -4463163 13453200 20229793 -22331122 -3510118 -13660290
13523 -13660290 4315340 806847 27748454 -19676906 -8033851 9329121 -8843609 -24881240
13515 -24881240 -23028519 27272961 -23620413 -22305185 -20958797 9015968 -4789573 8284424
13506 -19248962 -14104452 2427890 15007197 -11928952 13997602 -5457717 14380067
$$ packed form
13563a7685602B262664L4567291G877958A999481J4073864c543943n8429532J2457059
13555d9516416d835212p074810C551842O293469d1762635B0205308f502867c211091
13546b4267430B6536684A0020149E009670J0723132e785594C8937164j0690298
13539B8246866b3136604c808545k6261932R787517F708753L2369514a7071866
13531A5420868c220094k582249J339180A3453200O776593b2331122c510118j0150172
13523a3660290D315340H06847K6941607a9676906h033851I329121h843609j6037631
13515b4881240J852721B7272961b3620413J315228J346388I015968d789573H284424
13506a9248962N144510B427890J2579307a1928952A3997602e457717A4380067
$$ plain form
13498 -14117826 51355771 -4324252 48616562 19418755 6090951 -33376415 -2926196
13490 27935549 13649101 25539242 -5693427 -37653480 4748822 -35772584 -8782860
13482 19011269 38068845 -9276718 -30482160 -23584220 -23768247 -18786681 -42633845 -25732581
13474 -25732581 -10543908 7948011 31620996 7026829 28274746 10345909 -24791687
13466 23302490 -5620136 -4874304 656034 14119839 -32470816 -3825445 -853787 19228339
13457 12015224 1033347 29647318 27677882 -339934 -18892745 -28626720 14138392 7604161
13449 7604161 662584 -4270825 41427198 22554506 -24003222 -9754146 -12800457 5672628
13440 -28365004 12101740 8138931 -12322379 -15408445 -854146 -6079215 -18163592 -5860828
$$ packed form
13498a4117826E1355771d324252D8616562A9418755F090951c3376415b926196
13490B7935549A3649101J1890141e693427l1960053D748822c5772584h782860
13482A9011269J9057576i276718k1205442O897940j84027M981566k3847164J6901264
13474b5732581a0543908G948011K3672985G026829K1247917A0345909b4791687
13466B3302490e620136P45832F56034J3463805c2470816c825445h53787A9228339
13457A2015224A033347K8613971j969436c39934j8552811r733975A4138392o534231
13449G604161F62584d270825D1427198j8872692b4003222i754146l046311E672628
13440b8365004A2101740l962809a2322379l086066h54146n225069j2084377e860828
$$ plain form
13431 -25789495 21609732 -16492233 -10758534 -16778931 10199357 472635 -27572106 2877900
13422 -5768277 -28330195 -31039373 7187071 -27696110 -28931037 25333244 -1805471 -53509
13413 -12142752 2621604 26965338 -43236962 26144672 1122730 -9523069 -21147138
13406 -21147138 -17520480 1607823 5649989 37850553 866016 1141163 756442 6790397
13398 6790397 -1835705 14289052 13146911 -23783082 -14643849 -23966471 20045620 15802486
13390 15802486 45747618 11646367 -19342448 -2736528 20754674 7546688 -425511 3805756
13381 -24084292 -10178410 -19346420 28262819 4852408 -3013373 8034822 -25300693 18057980
13372 15232872 -21490923 -24532987 17287033 -5353714 -40859449 -26336919 630185 -14047430
$$ packed form
13431b5789495B1609732a6492233N733699o020397A0199357D72635b7572106B877900
13422e768277k2561918k709178G187071b7696110j234927B5333244a805471e3509
13413a2142752B621604K4343734d3236962B6144672A122730i523069j1624069
13406b1147138L626658A607823M042166L2200564H66016K75147l84721O033955
13398F790397a835705A4289052j142141b3783082R139233r322622B0045620m243134
13390A5802486K9945132A1646367a9342448b736528B0754674G546688d25511C805756
13381b4084292a0178410r168010B8262819D852408c013373H034822b5300693A8057980
13372A5232872b1490923l042064A7287033e353714l5505735J4522530F30185a4047430
$$ plain form
13363 -7026600 41977620 11468319 -15048611 6971079 -16108843 38549727 -28099540
13355 7026671 3697982 -16010287 -9620591 3008262 -20377191 -13950588 -16957325 -2785823
13346 5750330 -2227904 -13048767 -31889381 -54655595 -20039258 20883371 11895222
13339 11895222 21544888 1979922 -2710287 -3532000 10445662 -18677888 -1025257 24739949
13330 5425470 -29693830 14631554 -2007164 -9932442 17168862 28129719 -376203 68219246
13321 19945439 -8236888 14515938 -12622261 21015722 1026898 -35332264 -1448429
13313 6096866 -11391294 -19879460 -15384562 11438610 -32502408 -4106662 -10290684 -10561141
13305 -10561141 -22685515 -31104825 50419646 -7164913 11602328 30771562 11240519
$$ packed form
13363g026600D1977620A1468319a5048611F971079a6108843C8549727b8099540
13355G026671l328689a6010287O389696C008262b0377191O426603l006737b785823
13346E750330b227904j0820863j8840614k2766214b0039258B0883371q988149
13339A1895222R649666A979922b710287q21713A0445662a8677888a025257B4739949
13330E425470b9693830A4631554b007164p925278A7168862J0960857c76203F8219246
13321A9945439h236888A4515938a2622261B1015722A026898c5332264a448429
13313F096866a1391294q488166M494898A1438610c2502408d106662o184022k70457
13305a0561141j2124374q419310E0419646g164913A1602328J9169234A1240519
$$ plain form
13297 16999608 -14543316 3301019 22112356 5732743 7434450 -15559484 23304786
13289 -32303439 -13682316 -29721634 -16528623 -11363324 -2726407 -16905536 26266400
13281 -12066236 21826323 34737715 -2678507 8548738 -35910197 967228 -33060169 -1960402
13272 -13912972 -6983964 4369008 -13390008 5611653 30639889 -4420406 5481934 -8976120
13263 -14473108 -16167483 1216723 13671147 -6321808 7958829 36593916 21460339 -18232815
13254 10336211 -10412092 -15314224 -1361522 -17564066 15446928 7548926 -8814359 19705316
13245 3070440 -6324881 25788249 -25152697 12833718 -53890418 43436157 -12259589
13237 -32239558 -44684829 1062633 7611458 20399406 1388036 -13021072 5995659 -20032258
$$ packed form
13297A6999608a4543316C301019J8811337E732743J701707a5559484B3304786
13289c2303439a3682316j6039318J3193011N165299b726407j4179129B6266400
13281a2066236B1826323J2911392b678507H548738c5910197I67228c3060169a960402
13272a3912972O929008D369008a3390008E611653K5028236d420406E481934h976120
13263a4473108j694375A216723J2454424f321808G958829K8635087j5133577a8232815
13254A0336211a0412092m902132a361522j6202544A5446928G548926h814359A9705316
13245C070440f324881B5788249b5152697A2833718e3890418D3436157a2259589
13237c2239558j2445271A062633O548825J2787948A388036a3021072E995659b0032258
$$ plain form
13228 22192306 30979485 17853586 -29237292 -249340 -12014224 26723134 650272 473610
13220 473610 69666469 -26823609 19682224 7608548 -9784413 -9949622 -8021271 -7298459
13212 -7298459 21990520 34281196 22501701 28746064 9605677 -4813306 -5039570 43432698
13203 -14440094 2865203 38495404 -46334524 37647934 27315277 -14445863 30707288
13195 -32258408 -10159475 95950 14939345 -16163900 -8572203 18558368 14005316 13938169
13187 13938169 -3545746 4477081 -16846168 13079435 29937035 19026874 -2354348
13179 -1231066 44344843 23376000 -23616815 -20704283 -41827563 2307783 46331594
13172 46331594 -14703921 -30149263 28732450 22640054 16785141 -30294793 -40419254
$$ packed form
13228B2192306Q787179j3125899b9237292b49340j1764884B6723134F50272j76662
13220D73610O9192859b6823609A9682224G608548i784413j65209J928351P22812
13212g298459B1990520J2290676j1779495O244363I605677d813306k26264D3432698
13203a4440094B865203L5630201d6334524C7647934j0332657a4445863C0707288
13195c2258408a0159475I5950J4843395a6163900P591697A8558368m553052o7147
13187A3938169c545746D477081a6846168A3079435J6857600j0910161b354348
13179a231066D4344843k0968843b3616815K912532k1123280B307783M4023811
13172D6331594a4703921j5445342B8732450o092396n854913c0294793j0124461
$$ plain form
13165 -40419254 -15413821 -9279302 12826692 48284500 -2287940 4953026 46232624
13158 46232624 -14908397 -7142103 17020724 13558987 6418462 -23701142 -21543553 -32751529
13150 -32751529 -1638645 -18656168 -21494895 16964413 -21797656 17282818 -9590551
13142 26860264 9115745 -3362617 -17023846 15297276 -17538354 -11660866 31055211
13134 17407456 -43663822 -20939124 -3593423 -12281829 -366443 7717891 -6455595 29608753
13125 -13566507 21445729 21944418 33693029 45610920 -17483511 31658574 13087282
13117 44858657 -41591820 -24250204 27067283 3335602 -6252374 -6000528 10715535 -45920575
13108 1549915 14259046 -11446901 988949 402002 26622909 24186654 -36688446 11720329
$$ packed form
13165d0419254a5413821O134519A2826692L5457808b287940D953026M1279598
13158D6232624a4908397g142103A7020724l461737F418462b3701142K157589j1207976
13150c2751529a638645j7017523k838727A6964413b1797656A7282818i590551
13142B6860264I115745c362617j3661229A5297276a7538354N877488C1055211
13134A7407456d3663822b0939124c593423q688406c66443G717891f455595B9608753
13125a3566507B1445729M98689J1748611J1917891a7483511C1658574A3087282
13117D4858657d1591820J7341616B7067283C335602f252374K51846A0715535d5920575
13108A549915J2709131a1446901I88949D02002K6220907k436255c6688446A1720329
$$ plain form
13099 -34887618 -14781474 16410525 -26565077 -45956694 -43524628 7167763 13229179
13092 13229179 -29611898 20794976 24521209 10507275 22762666 -6642300 36259922
13084 29216952 -4892976 -24288384 -39628976 3598406 12641827 -22766263 -8475496 -239093
13075 23151173 1042791 -25731185 5462336 -17866649 2204276 -3947051 -10094153 63087542
13066 24453461 13313579 21017417 22226093 -26998426 -421418 23527204 -14957510 4027647
13057 20153805 -49980075 2060568 -10197661 -2643155 -16927178 -32256973 22665578
13049 -16958373 -6553137 1665247 -18511099 3760415 4330700 -50287116 31380437 37499724
13041 37499724 23736709 -35572104 4651190 2821133 6913016 51607873 21644523
$$ packed form
13099c4887618a4781474A6410525b6565077j9391617K432066G167763O061416
13092A3229179b9611898B0794976L726233A0507275J2255391f642300C6259922
13084B9216952d892976j9395408j5340592C598406R043421b2766263h475496b39093
13075B3151173A042791b5731185E462336a7866649B204276c947051o147102F3087542
13066B4453461j1139882P703838J208676b6998426d21418B3527204a4957510D027647
13057B0153805d9980075B060568a0197661b643155j4284023j5329795B2665578
13049a6958373f553137A665247a8511099C760415N70285e0287116C1380437O119287
13041C7499724j3763015c5572104D651190j830057M091883M4694857B1644523
$$ plain form
13033 -26603906 -7881833 -7430835 -44103718 56392883 -15799160 -162289 14146495 4173625
13024 -32847645 34861390 29951387 -24871466 10809946 -15482907 -16697022 3249781
13016 14756305 -839817 7794839 -1292910 -22161032 1907376 -13963790 -37417142 1972200
13007 13725126 3153374 -13458877 7943599 -1985032 -31482995 5801882 -1530938 -51482801
12999 -51482801 31982653 -21275296 -20193247 28405877 -45404503 28799905 -12500194
12991 -17474601 11676225 18015827 9429126 26602749 -13966847 5386783 13225097 -47968011
12982 -13113635 -975167 14110782 26456084 28265663 -18595086 -16637290 -22969774 -29592363
12974 -29592363 -17337525 18217001 23955612 -7111779 2884722 -789014 -14084586 31641658
$$ packed form
13033b6603906g881833M50998l6672883E6392883a5799160a62289A4146495D173625
13024c2847645C4861390m910003b4871466A0809946a5482907j214115C249781
13016A4756305h39817G794839a292910k0868122A907376a3963790k3453352A972200
13007A3725126C153374a3458877G943599a985032k9497963E801882a530938m9951863
12999e1482801C1982653b1275296J082049B8405877d5404503B8799905a2500194
12991a7474601A1676225O339602q586701J7173623a3966847E386783P838314d7968011
12982a3113635i75167A4110782J2345302J809579a8595086J957796o332484o622589
12974b9592363J2254838A8217001N738611g111779B884722g89014j3295572C1641658
$$ plain form
12965 -10711267 -20237710 -43697743 -32162677 -10466027 -6478489 24372102 39213308
12958 39213308 -23396378 -765481 -8695469 8825615 4508362 28502321 -21971920 15899098
12949 -3510477 17696338 21027120 -22935770 -23640543 -7753064 9556698 -3281885 16983396
12940 30726738 8520535 -12670689 661524 26287043 19386500 36930482 24739259 -17575665
12931 -7148116 -22706095 -5354586 13136207 -36601248 -16594139 -3181545 -22080905
12924 -22080905 -2797500 30952484 5257502 -17538450 -54547311 -21406803 -11347564
12917 -11347564 -13291742 12511668 38938911 16304604 -9198173 9116160 -39249752
12909 -5561544 21545039 47377 -31697244 -17873746 -9022241 -20882290 -33239917 27302814
$$ packed form
12965a0711267r526443k3460033J1535066a0466027L987538B4372102J4841206
12958C9213308b3396378g65481p929988H825615m317253K3993959b1971920A5899098
12949c510477A7696338L330782b2935770p04773g753064I556698c281885A6983396
12940C0726738H520535a2670689F61524K5625519o900543J7543982j2191223a7575665
12931g148116j5557979e354586A3136207c6601248a6594139c181545j8899360
12924b2080905b797500C0952484E257502a7538450l7008861b1406803J0059239
12917a1347564j944178A2511668K6427243A6304604i198173I116160c9249752
12909e561544B1545039D7377c1697244J3823498Q851505j1860049j2357627B7302814
$$ plain form
12900 5341723 -35778261 -931618 33585638 9258029 76713 33280563 32767417 -2638704
12891 -4850257 46863596 31247247 -14526350 25621519 4064139 3920770 -26445645 -16909129
12883 -16909129 -20574195 -14898047 -32876630 -5689208 26521442 21694836 -13261805 9078660
12874 5042933 19673589 14454253 2179757 -7459239 -14134903 19251565 8215188 -43095043
12865 -2635602 4935820 -8935140 -6181407 20704273 983743 -42031567 29857872 6211785
12856 -14547177 -25968063 70588497 67777531 -8429830 12596356 -6030803 12777607
12848 1030396 7707958 -17431239 -19298070 20038605 12210395 13110998 5327908 -18870880
12839 30789788 9273689 -6522212 23855229 -10966793 23943655 34168990 -16369102
$$ packed form
12900E341723c5778261i31618C3585638I258029G6713L3203850n13146b638704
12891d850257D6863596j5616349a4526350B5621519D064139j43369b6445645R536516
12883a6909129l665066N676148j7978583e689208B6521442m826606a3261805I078660
12874E042933J4630656n219336B179757g459239o675664A9251565H215188d3095043
12865b635602D935820h935140K753733B0704273I83743d2031567B9857872F211785
12856a4547177j1420886G0588497k810966h429830A2596356f030803A2777607
12848A030396O677562a7431239j866831B0038605p828210R00603E327908a8870880
12839C0789788I273689f522212B3855229a0966793B3943655J0225335a6369102
$$ plain form
12831 -18878397 13932272 26373155 45864601 -4408014 18286831 35413502 9897277
12823 48682828 10638658 17532564 27265872 -9786298 -3179058 18488261 22401091 -9744266
12814 42343805 -19842664 26374523 27694344 1782145 32288442 15903364 -13872129
12806 2949049 -707901 -11511407 -53051892 -24021440 19955632 42295346 37602543 -30505177
12797 -63250572 -19571702 9849775 17509711 -23890388 -9256759 8030263 -34986548 19655159
12788 -39100030 10608903 2702316 3488566 1430550 11907406 6099582 9603931 -5818509
12779 -31583159 15612707 -4498112 10488989 -9538244 42403806 38266066 1898892 -22831205
12770 -3574393 13890883 12007074 5554474 5290718 -7846807 -5417325 -20318831 -36622609
$$ packed form
12831a8878397A3932272J2440883J9491446d408014A8286831J7126671I897277
12823D8682828A0638658O893906R733308i786298c179058A8488261L912830i744266
12814D2343805a9842664B6374523J319821A782145L0506297A5903364a3872129
12806B949049g07901j0803506m1540485b4021440A9955632K2339714m692803c0505177
12797f3250572a9571702I849775P659936b3890388i256759H030263c4986548A9655159
12788c9100030A0608903B702316P86250A430550J0476856n807824L504349e818509
12779c1583159A5612707d498112A0488989i538244D2403806m137740A898892b2831205
12770c574393A3890883j883809E554474k63756g846807K429482j4901506j6303778
$$ plain form
12762 -36622609 -12817839 6402801 -10411120 26836749 -21022575 -30489313 -4861478
12754 4754413 45576803 -22457610 -16258299 -789833 -33923878 17370158 20856191 -75055245
12745 34252552 49778007 -4035947 -19844064 -7982625 30181676 36684369 -19256292
12737 8709255 -37313 26438961 -6747786 -12611374 18535506 19212822 -3915000 -657036
12728 -20152450 10385947 18397275 -13699686 8215615 -12482851 -40293606 549946 -10919431
12719 8082304 23401469 28860415 -21972336 37676453 8658827 530727 -17725102 -181698
12710 14319200 -31047488 -10583402 -2891951 41177185 52083239 -4439022 6399905
12702 -9929712 -8723620 -25329566 5784315 -10293544 -24058349 5955404 27523160 6340731
$$ packed form
12762c6622609a2817839F402801a0411120B6836749b1022575r466738d861478
12754D754413M0822390b2457610O199311g89833l3134045A7370158L486033g5055245
12745C4252552J5525455d035947j5808117g982625C0181676O502693a9256292
12737H709255c7313B6438961f747786n863588A8535506O77316c915000f57036
12728b0152450A0385947Q011328a3699686H215615a2482851k7810755E49946a0919431
12719H082304J5319165N458946b1972336C7676453H658827E30727a7725102a81698
12710A4319200c1047488a0583402b891951D1177185J0906054d439022F399905
12702i929712J206092j6605946E784315a0293544j3764805E955404K1567756F340731
$$ plain form
12693 7583171 6847025 14005317 -4887897 3529914 -28803877 10366778 -32203008 14948859
12684 -39951749 -15112419 -31214632 2254175 -39957886 -10549378 -22569047 -28277715
12677 -28277715 -26105414 -15575126 -2269042 29105328 23402213 225344 8175277 -2721227
12668 12732569 -10838239 16317083 -17747050 -9823117 22354450 39925742 -5171475
12660 21296759 21219655 7017394 40551100 17839110 40346999 2946991 -20846379 -21282211
12652 -21282211 -8333510 -30897321 6960232 -20828216 -49608868 28998937 14694251
12645 14694251 -39135050 7109495 -3412532 592306 -36016165 36312761 10600772 -12452705
12636 -10054844 -34706149 -6239382 -19418602 28516042 6469918 -9258497 4493722 -1758214
$$ packed form
12693G583171p36146P158292d887897C529914b8803877A0366778c2203008A4948859
12684c9951749a5112419j6102213B254175c9957886a0549378j2019669n708668
12677b8277715K172301J0530288b269042B9105328n703115B25344P949933b721227
12668A2732569a0838239A6317083a7747050P923933B2354450J7571292e171475
12660B1296759p7104G017394L3533706A7839110K2507889B946991b0846379m35832
12652b1282211h333510k2563811F960232b0828216k8780652B8998937j4304686
12645A4694251c9135050G109495c412532E92306c6016165C6312761A0600772a2452705
12636a0054844k4651305f239382j3179220B8516042F469918i258497D493722a758214
$$ plain form
12627 17709463 13872279 461607 28436210 23748788 -4166482 8372799 -14827203 995786
12618 10330374 -17495189 -16342696 -6255258 -43664506 -4496583 -1437964 16045055 20215295
12610 20215295 6411799 -2834787 258629 38970469 -2797558 -6076336 20646838 -28512800
12601 48938524 -17596375 -7328178 -670421 13301857 -4170350 28191811 389292 6882841
12593 6882841 -25993325 -28744962 -41731475 -3347472 2318970 21563676 5509433 -36317901
12584 -40050412 23643961 22711025 -17899866 12543017 -34436359 -16231604 13519070
12576 -10565393 -2063069 21830610 19612152 -11132906 -18933955 2144974 -263547 -33487834
12568 -33487834 -17041732 -26393171 -12528648 -6099920 20332156 -40343582 -15658207
$$ packed form
12627A7709463l837184D61607K7974603m687422d166482H372799a4827203I95786
12618A0330374a7495189J152493f255258l7409248d496583a437964A6045055M170240
12610B0215295F411799b834787B58629L8711840b797558l278778B0646838b8512800
12601D8938524a7596375g328178f70421A3301857d170350B8191811C89292O493549
12593F882841b5993325k751637j2986513c347472B318970J9244706E509433c6317901
12584d0050412B3643961r32936a7899866A2543017c4436359a6231604A3519070
12576a0565393b063069B1830610k218458a1132906p801049B144974b63547l3224287
12568c3487834J6446102r351439a2528648f099920B0332156d0343582a5658207
$$ plain form
12560 -21824473 15874819 -3472429 42923744 -5466922 -15678390 10892323 8837680
12553 8837680 -18581129 28662043 -39391993 2466698 -3430070 -383780 -16870385 7396477
12544 -11391743 -3401411 3796399 -1958902 27629764 9843519 -2432284 3191866 352452
12535 885651 -3760416 38670941 12380716 13529639 -1145104 26518429 -25088757 -18098719
12527 -18098719 -20140680 -19922314 22008824 7068184 -27018874 -17549960 36284622 -29423133
12518 -13464011 -7069281 20868552 -14068407 -4317222 -26510361 51350716 6824076
$$ packed form
12560b1824473A5874819c472429D2923744e466922j0211468A0892323k054643
12553H837680a8581129B8662043c9391993B466698c430070c83780j6486605G396477
12544a1391743c401411C796399a958902B7629764I843519b432284C191866C52452
12535H85651c760416C8670941A2380716J148923a145104B6518429b5088757O990038
12527a8098719k041961K18366B2008824G068184b7018874R468914C6284622b9423133
12518a3464011O394730B0868552a4068407d317222k2193139E1350716F824076
$$ [...]
##END NTUPLES=NMR SPECTRUM
##END=
