##TITLE=AC1406_BRAA12215_7653149_5PJ1xK5njd
##JCAMPDX= 6.0         $$ Bruker NMR JCAMP-DX V2.0
##DATA TYPE= NMR SPECTRUM
##DATA CLASS= NTUPLES
##ORIGIN= BRUKER
##OWNER= Administrator
$$ 1.72 TOPSPIN		Version 2.1
$$ 2013-04-11 15:09:42.361 -0700  Administrator@X
$$ Compression mode = diff/dup
##.OBSERVE FREQUENCY= 400.02188249412
##.OBSERVE NUCLEUS= ^1H
##.ACQUISITION MODE= SIMULTANEOUS (DQD)
##.ACQUISITION SCHEME= undefined
##.AVERAGES= 4
##.DIGITISER RES= 22
##SPECTROMETER/DATA SYSTEM= spect
##.PULSE SEQUENCE= zgpsd0
##.SOLVENT NAME= COFFEE_meoh
##.SHIFT REFERENCE= INTERNAL, COFFEE_meoh, 1, 14.98509
##AUDIT TRAIL= $$ (NUMBER, WHEN, WHO, WHERE, PROCESS, VERSION, WHAT)
$$ ##TITLE= Audit trail, TOPSPIN		Version 2.1
$$ ##JCAMPDX= 5.01
$$ ##ORIGIN= Bruker BioSpin GmbH
$$ ##OWNER= Administrator
$$ $$ E:\/data/COFFEE/nmr/AC1406_BRAA12215_7653149_5PJ1xK5njd/31/pdata/1/auditp.txt
$$ ##AUDIT TRAIL=  $$ (NUMBER, WHEN, WHO, WHERE, PROCESS, VERSION, WHAT)
(   1,<2013-04-11 15:09:33.738 -0700>,<Administrator>,<X>,<go>,<TOPSPIN 2.1>,
      <created by zg
	started at 2013-04-11 15:08:24.985 -0700,
	POWCHK enabled, PULCHK disabled,
       configuration hash MD5:
       33 CF 6A 21 5C D3 B9 40 6C 15 AA 8D 27 A2 4F 13
       data hash MD5: 64K
       5B 28 4B 2E AC A3 EE 54 98 4A 9A B8 53 96 BD 3E>)
(   2,<2013-04-11 15:09:36.662 -0700>,<Administrator>,<X>,<proc1d>,<TOPSPIN 2.1>,
      <Start of raw data processing
       efp LB = 0 FT_mod = 6 PKNL = 1 PHC0 = 0 PHC1 = 0 SI = 32K 
       data hash MD5: 32K
       50 96 B3 51 E2 FB A3 D5 AB 57 7A 75 05 1A D0 3D>)
(   3,<2013-04-11 15:09:37.296 -0700>,<Administrator>,<X>,<proc1d>,<TOPSPIN 2.1>,
      <pk PHC0 = 240.6171 PHC1 = 0 
       data hash MD5: 32K
       71 A9 CE 95 0A D9 AB 4F FF 14 DE 71 4D 73 E7 F7>)
(   4,<2013-04-11 15:09:37.637 -0700>,<Administrator>,<X>,<proc1d>,<TOPSPIN 2.1>,
      <abs ABSG = 1 
       data hash MD5: 32K
       DE 8D B8 6C DB 7E 26 75 3B AF 45 0F 7F 13 87 66>)
(   5,<2013-04-11 15:09:37.869 -0700>,<Administrator>,<X>,<proc1d>,<TOPSPIN 2.1>,
      <abs ABSG = 2 
       data hash MD5: 32K
       A6 33 74 84 C7 7A AE 0A 97 B6 9F E3 3C 37 BD D7>)
(   6,<2013-04-11 15:09:38.116 -0700>,<Administrator>,<X>,<proc1d>,<TOPSPIN 2.1>,
      <abs ABSG = 3 
       data hash MD5: 32K
       79 7B E6 CB 10 D1 15 E0 F3 3F 77 D4 2D 2F 60 54>)
(   7,<2013-04-11 15:09:38.333 -0700>,<Administrator>,<X>,<proc1d>,<TOPSPIN 2.1>,
      <abs ABSG = 4 
       data hash MD5: 32K
       5F 7A 9C 24 E7 34 3A 82 B0 22 0E 70 74 50 D0 E5>)
(   8,<2013-04-11 15:09:38.534 -0700>,<Administrator>,<X>,<proc1d>,<TOPSPIN 2.1>,
      <abs ABSG = 5 
       data hash MD5: 32K
       FC 3A ED 15 11 4F F6 0A 44 F1 D7 A2 C3 24 E6 AF>)
$$ ##END=
$$ 
$$ $$ hash MD5
$$ $$ F7 D9 22 8C 9E 07 A9 3B 85 04 B1 F0 68 57 B1 C4
##$RELAX= 
##$RELAX= 
##$RELAX= 
##$RELAX= 
##$RELAX= 
##$RELAX= 
##$RELAX= 
##$RELAX= 
$$ Bruker specific parameters
$$ --------------------------
##$DU= <E:\>
##$EXPNO= 31
$$ [...]
150 150 150 150 150 150 150 150
##$TP07= 0
##$TPNAME0= <>
##$TPNAME1= <>
##$TPNAME2= <>
##$TPNAME3= <>
##$TPNAME4= <>
##$TPNAME5= <>
##$TPNAME6= <>
##$TPNAME7= <>
##$TPOAL= (0..7)
0.5 0.5 0.5 0.5 0.5 0.5 0.5 0.5
##$TPOFFS= (0..7)
0 0 0 0 0 0 0 0
##$TUNHIN= 0
##$TUNHOUT= 0
##$TUNXOUT= 0
##$USERA1= <user>
##$USERA2= <user>
##$USERA3= <user>
##$USERA4= <user>
##$USERA5= <user>
##$V9= 5
##$VALIST= <valist>
##$VCLIST= <CCCCCCCCCCCCCCC>
##$VD= 0
##$VDLIST= <DDDDDDDDDDDDDDD>
##$VPLIST= <PPPPPPPPPPPPPPP>
##$VTLIST= <TTTTTTTTTTTTTTT>
##$WBST= 2048
##$WBSW= 25
##$XGAIN= (0..3)
0 0 0 0
##$XL= 0
##$YL= 0
##$YMAX_a= 265
##$YMIN_a= -391
##$ZGOPTNS= <>
##$ZL1= 120
##$ZL2= 120
##$ZL3= 120
##$ZL4= 120
##$ABSF1= 14.98509
##$ABSF2= -5.573092
##$ABSG= 5
##$ABSL= 3
##$ALPHA= 0
##$AQORDER= 0
##$ASSFAC= 0
##$ASSFACI= 0
##$ASSFACX= 0
##$ASSWID= 0
##$AUNMP= <proc_prof1d_extract_pilot.lims>
##$AXLEFT= 0
##$AXNAME= <>
##$AXNUC= <1H>
##$AXRIGHT= 0
##$AXTYPE= 0
##$AXUNIT= <>
##$AZFE= 0.1
##$AZFW= 0.1
##$BCFW= 0
##$BC_mod= 0
##$BYTORDP= 0
##$COROFFS= 0
##$CY= 15
##$DATMOD= 1
##$DC= 0
##$DFILT= <>
##$DTYPP= 0
##$F1P= 0
##$F2P= 0
##$FCOR= 0.5
##$FTSIZE= 32768
##$FT_mod= 6
##$GAMMA= 0
##$GB= 0
##$INTBC= 1
##$INTSCL= 1
##$ISEN= 128
##$LB= 0
##$LEV0= 0
##$LPBIN= 0
##$MAXI= 10000
##$MC2= 0
##$MEAN= 0
##$ME_mod= 0
##$MI= 0
##$NCOEF= 0
##$NC_proc= -19
##$NLEV= 6
##$NOISF1= 0
##$NOISF2= 0
##$NSP= 0
##$NTH_PI= 0
##$NZP= 0
##$OFFSET= 14.98509
##$PC= 1
##$PHC0= 240.6171
##$PHC1= 0
##$PH_mod= 1
##$PKNL= yes
##$PPARMOD= 0
##$PPDIAG= 0
##$PPIPTYP= 0
##$PPMPNUM= 2147483647
##$PPRESOL= 1
##$PSCAL= 4
##$PSIGN= 0
##$PYNMP= <proc.py>
##$REVERSE= no
##$SF= 400.02
##$SI= 32768
##$SIGF1= 0
##$SIGF2= 0
##$SINO= 400
##$SIOLD= 32768
##$SPECTYP= <>
##$SREGLST= <1H.CDCl3>
##$SSB= 0
##$STSI= 32768
##$STSR= 0
##$SW_p= 8223.68421052631
##$SYMM= 0
##$S_DEV= 0
##$TDeff= 65536
##$TDoff= 0
##$TI= <>
##$TILT= no
##$TM1= 0
##$TM2= 0
##$TOPLEV= 0
##$USERP1= <user>
##$USERP2= <user>
##$USERP3= <user>
##$USERP4= <user>
##$USERP5= <user>
##$WDW= 1
##$XDIM= 32768
##$YMAX_p= 243654157
##$YMIN_p= -367892898
##$CURPLOT= <Network HP LaserJet P1505>
##$CURPRIN= <$Network HP LaserJet P1505>
##$DFORMAT= <normdp>
##$LAYOUT= <+/1D_H.xwp>
##$LFORMAT= <normlp>
##$PFORMAT= <normpl>
##$SURQMSG= 1
$$ End of Bruker specific parameters
$$ ---------------------------------
##NTUPLES= NMR SPECTRUM
##VAR_NAME=  FREQUENCY,     SPECTRUM/REAL,   SPECTRUM/IMAG
##SYMBOL=    X,             R,               I
##VAR_TYPE=  INDEPENDENT,   DEPENDENT,       DEPENDENT
##VAR_FORM=  AFFN,          ASDF,            ASDF
##VAR_DIM=   32768,         32768,           32768
##UNITS=     HZ,            ARBITRARY UNITS, ARBITRARY UNITS
##FACTOR=    0.250966925370066, 1,           1
##FIRST=     8223.43324360094, 2434927,      -2688541
##LAST=      0,             10629984,        -30649255
##MIN=       0,             -367892898,      0
##MAX=       8223.43324360094, 243654157,    0
$$ Real data points
##PAGE= N=1
##DATA TABLE= (X++(R..R)), XYDATA
$$ [...]
18318h08155m707890A5997590F175240J1822159h481857j0807969I73419J3416559
$$ -808155 -5516045 15997590 6175240 17997399 -8481857 -19289826 973419 14389978
18310A4389978a3779227A075365J851626L0258223b7563760A3922197b642284
$$ 14389978 -13779227 1075365 2926991 33185214 -27563760 13922197 -2642284
18302B536049a4182102B6077979a2322054o423005f635336q570472e41488E9085630
$$ 2536049 -14182102 26077979 -12322054 -18745059 -6635336 -15205808 -541488 59085630
18293a5402021d178917r43514n415604b219193A8086319h256068C2720584c1925616
$$ -15402021 -4178917 -5122431 -10538035 -2219193 18086319 -8256068 32720584 -31925616
18284a454567k7527328B0624333Q880168c218154p888657A0151350b6126758H080089
$$ -1454567 -28981895 20624333 29504501 -3218154 -11106811 10151350 -26126758 8080089
18275D9062002a6694406A7553886a3345135K941990o582435B707829b0718574
$$ 49062002 -16694406 17553886 -13345135 -10403145 -16985580 2707829 -20718574
18267B5421978l074847m780873b0448249B833931a20833B1619803i695610m905403
$$ 25421978 22347131 17566258 -20448249 2833931 -120833 21619803 -9695610 -14601013
18259a4601013J698748A4516342J733903B729649J8468882A390383R98525a3993801
$$ -14601013 -12902265 14516342 16250245 2729649 21198531 1390383 2388908 -13993801
18250a958950o745440A781610m92205a5118317D985925h503095j0129853A8243304
$$ -1958950 -8704390 1781610 1289405 -15118317 4985925 -8503095 -18632948 18243304
18241b4883855A7221605N820961o637262b3409107a45804A6289643J3441900c0872881
$$ -24883855 17221605 23042566 16405304 -23409107 -145804 16289643 29731543 -30872881
18232i347169F26326a5704948i75536C2139919h567078A1134376J1049770a2672923
$$ -9347169 626326 -15704948 -975536 32139919 -8567078 11134376 22184146 -12672923
18223C2980577b8057118B6859313j3372992A862420c890963j6583658J0215566
$$ 32980577 -28057118 26859313 13486321 1862420 -3890963 -20474621 -10259055
18216a0259055J03250H677648A948617g296626A1027181f1487848B2910806a014051
$$ -10259055 -10155805 8677648 1948617 -7296626 11027181 -61487848 22910806 -1014051
18207C912694c4059773M035075g397992j4523174a0769160D7882164E845043N916997
$$ 3912694 -34059773 -30024698 -7397992 -21921166 -10769160 47882164 5845043 11762040
18199A1762040M188139N563941m437713a4107921N193067D1459055D219289B85432
$$ 11762040 15950179 21514120 17076407 -14107921 -8914854 41459055 4219289 285432
18190g234985A7863676o061640D796686b8144773R673140C7643837f410651r211647
$$ -7234985 17863676 11802036 4796686 -28144773 -18471633 37643837 -6410651 -15622298
18182a5622298m399727B206076c1205840R191637f265577C2203597a0376784F727938
$$ -15622298 -20022025 2206076 -31205840 -22014203 -6265577 32203597 -10376784 6727938
18173C0020263a5103248H476458a1533149M253386l0077859b619392p567342B1607009
$$ 30020263 -15103248 8476458 -11533149 -7279763 -37357622 -2619392 -10186734 21607009
18164C9340811D611452K384365J1619656p763537K4170345F49919a5076225B3802389
$$ 39340811 4611452 6995817 18615473 10851936 35022281 649919 -15076225 23802389
18155B6172451J506343A0007323g533017j7908665F234022d2794220i803623A6199083
$$ 26172451 27678794 10007323 -7533017 -25441682 6234022 -42794220 -9803623 16199083
18146a3287637m781500B4685998b3051371O467103E321420a5201385l812309A0879624
$$ -13287637 -18069137 24685998 -23051371 -16584268 5321420 -15201385 -19013694 10879624
18137a528265A9196976a1110735A0612395K9063138d691247l2583327C0495238
$$ -1528265 19196976 -11110735 10612395 39675533 -4691247 -37274574 30495238
18129B0841241a0329832A3958095f5356883E092622a0925041j8953751a2715561
$$ 20841241 -10329832 13958095 -65356883 5092622 -10925041 -29878792 -12715561
18121b1806671D0253377A05389L378328K1968649c3324868C2800909i341813m1377680
$$ -21806671 40253377 105389 3483717 25452366 -33324868 32800909 -9341813 -50719493
18113e0719493a5512251d467052m834403H149210b5763968E955469K2033812h611379
$$ -50719493 -15512251 -4467052 -9301455 8149210 -25763968 5955469 27989281 -8611379
18104H512635J1115404E639806O639332K9894a803122q45001M38234j5501149
$$ 8512635 19628039 5639806 12279138 12309032 -1803122 -2648123 -2209889 -17711038
18096a7711038A505286J9830508J153121j864096b5679129g242298B7274157A2316504
$$ -17711038 1505286 21335794 22488915 20624819 -25679129 -7242298 27274157 12316504
18087C3745469d3259549J9776649l658733C3324588a4191112A7282999q406184
$$ 33745469 -43259549 -23482900 -27141633 33324588 -14191112 17282999 8876815
18080H876815L8356618A7011423c0366566o686545G223055M2035571j5739712
$$ 8876815 47233433 17011423 -30366566 -37053111 7223055 49258626 33518914
18073C3518914H664801P162815b3734524e265878j2395346D0153698i447385P08553
$$ 33518914 8664801 15827616 -23734524 -5265878 -17661224 40153698 -9447385 -8738832
18065h738832k0480481j2675127A1776317J0729324a3603497K472632B2825505
$$ -8738832 -29219313 -41894440 11776317 22505641 -13603497 -11130865 22825505
18057D875037P30037N281812j204700L0403015a6505562q112538h045691l9029378
$$ 4875037 5605074 10886886 9682186 40085201 -16505562 -24618100 -8045691 -47075069
18049d7075069E091615A292733R460071J1797230b719641q982294A6715280J9495694
$$ -47075069 5091615 1292733 10752804 22550034 -2719641 -11701935 16715280 36210974
18041C6210974B695884M8144451A2124225J6709788A2593692a62142k2263521
$$ 36210974 2695884 50840335 12124225 28834013 12593692 -162142 -22425663
18034b2425663a1183983K879661A9334850h640341E0384892A4592774F253834
$$ -22425663 -11183983 -8304322 19334850 -8640341 50384892 14592774 6253834
18026d1540779f360817k0011723h546861A5459238f54621G634449K6365962C793276
$$ -41540779 -6360817 -26372540 -8546861 15459238 -654621 7634449 34000411 3793276
18017a0748113J172112b561123B44004c2095383A4906552c9162849A4053700e3012643
$$ -10748113 -9576001 -2561123 244004 -32095383 14906552 -39162849 14053700 -53012643
18008D2541294k0108781h952764C9071644A3427129p00028g350736l1656660B1313508
$$ 42541294 22432513 -8952764 39071644 13427129 12727101 -7350736 -39007396 21313508
17999G548416J8328965L1842478B5297935b3187013a1134127A5693919L06327
$$ 7548416 25877381 57719859 25297935 -23187013 -11134127 15693919 16000246
17992A6000246J8371256J8169093c7557207a4436248F367643c1741991E518656
$$ 16000246 34371502 52540595 -37557207 -14436248 6367643 -31741991 5518656
17984C5106422A5526547M419625a6608219A8878812q031815M050344K9283676
$$ 35106422 15526547 19946172 -16608219 18878812 10846997 14897341 44181017
17977D4181017g122285A9592229d8795792B0148496a897847k4517923D896729
$$ 44181017 -7122285 19592229 -48795792 20148496 -1897847 -26415770 4896729
17969h304369Q26025j0412151c527119m31858B822602K480091K844032J1094706
$$ -8304369 -7478344 -17890495 -3527119 -3958977 2822602 5302693 8146725 19241431
17961A9241431K238631a1978963j285912o573450d940297C977471a2394637k6861092
$$ 19241431 21480062 -11978963 -13264875 -19838325 -4940297 3977471 -12394637 -39255729
17953c9255729A7656804J519525b5199454b706094k5920948m79142A4469719k468407
$$ -39255729 17656804 19176329 -25199454 -2706094 -28627042 -29106184 14469719 12001312
17945A2001312b5246898B8658317b1187297A4617697n862854d264105C388252
$$ 12001312 -25246898 28658317 -21187297 14617697 8754843 -4264105 3388252
17937A4377985K687341h499809b709294o6690m275544H67219f030421K682292
$$ 14377985 17065326 -8499809 -2709294 -2775984 -7051528 867219 -6030421 -3348129
17929c348129C2924127b0002202B1874069i632190L204431o278607C7122270J899628
$$ -3348129 32924127 -20002202 21874069 -9632190 -6427759 -12706366 37122270 39021898
17921C9021898b9339559B3411473E092159c22064H909526R342059J3388705L33086
$$ 39021898 -29339559 23411473 5092159 -322064 8909526 18251585 31640290 31973376
17913C1973376j4844137e649290A5284945F191591f176125r964933M801984A3260234
$$ 31973376 17129239 -5649290 15284945 6191591 -6176125 -16141058 -11339074 13260234
17904D1754482j6939687a3633789F006150e6794040D3112653C402157L4489381
$$ 41754482 24814795 -13633789 6006150 -56794040 43112653 3402157 37891538
17897C7891538b2604886k2750828A4065222b6425352K920315D975936i651655
$$ 37891538 -22604886 -45355714 14065222 -26425352 -23505037 4975936 -9651655
17889A728401F88214R508527L52508h648719j468884A606247J2328556E513224
$$ 1728401 688214 10196741 10549249 -8648719 -10117603 1606247 13934803 5513224
17880a508549j59634j6401781A4867075a0912663J059743K479965A0122425a7667564
$$ -1508549 -1668183 -18069964 14867075 -10912663 -9852920 -7372955 10122425 -17667564
17871I827200J3823458A1273314Q584271G253011c0517263i289799D3503263b4026806
$$ 9827200 23650658 11273314 19857585 7253011 -30517263 -9289799 43503263 -24026806
17862A5764611b9861265C104016L4887416c709013j3022956j8415143a1135700
$$ 15764611 -29861265 3104016 37991432 -3709013 -16731969 -35147112 -11135700
17854B3042029b9458325A5627107J5286630I09971J8474357l085883e297553k1528949
$$ 23042029 -29458325 15627107 30913737 909971 19384328 16298445 -5297553 -26826502
17846b6826502h723619J48171I795986g41027C7366596d0183542A207869J7917883
$$ -26826502 -8723619 -8575448 9795986 -741027 37366596 -40183542 1207869 19125752
17838A9125752K7614670b3710157C260601O049358C289189a944219j279543A0280382
$$ 19125752 46740422 -23710157 3260601 9309959 3289189 -1944219 -3223762 10280382
17829A4896740h04210C278440L567805J5791058a5318898K521887B3902258c902894
$$ 14896740 -804210 3278440 6846245 22637303 -15318898 -12797011 23902258 -3902894
17820b7795821O939431e877115r532844N388531b679725B1539820b5519111k3268441
$$ -27795821 -20856390 -5877115 -15409959 -10021428 -2679725 21539820 -25519111 -48787552
17812d8787552C2053840a180019k997057k5908471J3691307A4312632b7495264
$$ -48787552 32053840 -1180019 -4177076 -30085547 -16394240 14312632 -27495264
17804A0959086e9933838F308413a3555728k3362578B6878527J3688938b3594325
$$ 10959086 -59933838 6308413 -13555728 -36918306 26878527 40567465 -23594325
17796A7851186a7740999d851804A8441165p341372c058525F678689P290885R48272
$$ 17851186 -17740999 -4851804 18441165 11099793 -3058525 6678689 13969574 14917846
17788A4917846j109091a0530612C3500473r821102a4202399A1938516a8328885
$$ 14917846 13808755 -10530612 33500473 23679371 -14202399 11938516 -18328885
17780h930217H600944A1245d239020A5564314o254863A149082a1235326N33504
$$ -8930217 8600944 11245 -4239020 15564314 9309451 1149082 -11235326 -10701822
17772a0701822F130107a931205A9647590a0797464E0073524c695171C301309e908259
$$ -10701822 6130107 -1931205 19647590 -10797464 50073524 -3695171 3301309 -5908259
17763g779963F44658J7805024a5936619A3653610c385959k5412406b448623H581611
$$ -7779963 644658 18449682 -15936619 13653610 -3385959 -28798365 -2448623 8581611
17754A7089862K134525a071581B3445087J0736282A2751950F003243a840307f95605
$$ 17089862 19224387 -1071581 23445087 34181369 12751950 6003243 -1840307 -695605
17745b1371420P210616B551435L1981302F462377d5714939l2054055C238313B2487
$$ -21371420 -14160804 2551435 34532737 6462377 -45714939 -77768994 3238313 22487
17736B3910436F918841A605643J3024413e256672B2724297h692133k041244I974749
$$ 23910436 6918841 1605643 14630056 -5256672 22724297 -8692133 -10733377 9974749
17727D6208484D290405d515026B2567713a4514588j3080844A3646139a0952738
$$ 46208484 4290405 -4515026 22567713 -14514588 -27595432 13646139 -10952738
17719b248375C9225998C31722i523402m819397A722501K9695910g934916A6897150
$$ -2248375 39225998 331722 -9523402 -14342799 1722501 31418411 -7934916 16897150
17710c2253164o219812J7624846A8313455G116775K3106352b3543264A5698016
$$ -32253164 -38472976 -20848130 18313455 7116775 30223127 -23543264 15698016
17702d671586k4617503B654532K6479176L174332a4113573B7497744j1714120
$$ -4671586 -29289089 2654532 29133708 32308040 -14113573 27497744 15783624
17695A5783624b4183334B294163L0979912i725178L259672j0333696Q209627D8985490
$$ 15783624 -24183334 2294163 33274075 -9725178 -6465506 -16799202 -8589575 48985490
17686c895409b19809B7082031g158387E100299N1680757a5550482B6226527A1667127
$$ -3895409 -219809 27082031 -7158387 5100299 56781056 -15550482 26226527 11667127
17677c2564609a4026017q753228p535195a1544685C9087479c5289282a371999
$$ -32564609 -14026017 -22779245 -30314440 -11544685 39087479 -35289282 -1371999
17669D4482254a3659262B0131135g840368B824293J7676270D849658a6581399
$$ 44482254 -13659262 20131135 -7840368 2824293 20500563 4849658 -16581399
17661F1461233b0250081A6409163d16718k1700532k4056533g191240B3051737
$$ 61461233 -20250081 16409163 -416718 -22117250 -46173783 -7191240 23051737
17653a3097371E40740J9815729e209611l392700C9527330C093065J3530349e302863
$$ -13097371 540740 20356469 -5209611 -8602311 39527330 3093065 16623414 -5302863
17644d700158C5568914a1658916A0149972a3000454A0750114b510689A419057
$$ -4700158 35568914 -11658916 10149972 -13000454 10750114 -2510689 1419057
17636a1173372j885415I131101m145283c9570538G487931b6321870B3610806a3948401
$$ -11173372 -13058787 9131101 4985818 -39570538 7487931 -26321870 23610806 -13948401
17627A8706408a5494481C0655543c6219621a0478625C689430J4584002K6475667
$$ 18706408 -15494481 30655543 -36219621 -10478625 3689430 18273432 44749099
17620D4749099G735566k896669c1302127B1106503h139971j8693453B1593572
$$ 44749099 7735566 4838897 -31302127 21106503 -8139971 -26833424 21593572
17612A681646b4409689A9869486q222248R393930n814425J7992760a9506988L894897
$$ 1681646 -24409689 19869486 11647238 21041168 15226743 33219503 -19506988 -15612091
17604a5612091A5540338J6234269j2797382l645590J0073244B867054b2809928
$$ -15612091 15540338 31774607 18977225 15331635 25404879 2867054 -22809928
17596A2922871f623225O37770C8875458b4373322M746155d823978B0822971K8009335
$$ 12922871 -6623225 -5985455 38875458 -24373322 -19627167 -4823978 20822971 48832306
17588D8832306A8302831J4769150a8825084C4480675F399022k29262J1329528
$$ 48832306 18302831 33071981 -18825084 34480675 6399022 6169760 17499288
17581A7499288a4498417B8380382K506203c0707593B1636551a3366565k0412260
$$ 17499288 -14498417 28380382 30886585 -30707593 21636551 -13366565 -33778825
17574c3778825J1978061B1570573F44976i485610k9762312B3714691b1508657
$$ -33778825 -21800764 21570573 644976 -9485610 -39247922 23714691 -21508657
17566E66507c899470l453400B7585862a8683822e817338I52923L1459738D79884
$$ 566507 -3899470 -7352870 27585862 -18683822 -5817338 952923 32412661 479884
17557B0383419b895210A056998h321253B714489O862762J034911a5302300N214552
$$ 20383419 -2895210 1056998 -8321253 2714489 9577251 10612162 -15302300 -10087748
17549a0087748l6419727g046932b370083k849118C7121792D395910P67140B000297
$$ -10087748 -46507475 -7046932 -2370083 -5219201 37121792 4395910 5163050 2000297
17540A9826746K3190880f238583B1151176J3712996g795407k2376335B4595695
$$ 19826746 43017626 -6238583 21151176 34864172 -7795407 -30171742 24595695
17532B9096631i229088D3264836A4562964a6876674A1482200N933217m009398
$$ 29096631 -9229088 43264836 14562964 -16876674 11482200 17415417 13406019
17525A3406019i229907j3737444f220237A2775846a4107969h23174l68506j5703486
$$ 13406019 -9229907 -22967351 -6220237 12775846 -14107969 -823174 -1191680 -16895166
17517a6895166B9367642A2565448a3844745F610972b6957033C160455K6036702
$$ -16895166 29367642 12565448 -13844745 6610972 -26957033 3160455 29197157
17510B9197157F429569b764389A7075682c891282B2162669L087807o971226e292552
$$ 29197157 6429569 -2764389 17075682 -3891282 22162669 25250476 18279250 -5292552
17501A0659888a8499417F310813J0453793A512512J2237275c3909174A8169638
$$ 10659888 -18499417 6310813 16764606 1512512 13749787 -33909174 18169638
17493a9524575Q202312d38752m864722A1523050B526070a4268715B2303380d167386
$$ -19524575 -11322263 -438752 -5303474 11523050 2526070 -14268715 22303380 -4167386
17484A3457856d332010A6403861E469133Q965669G049599J7611545I917357K0493172
$$ 13457856 -4332010 16403861 5469133 14434802 7049599 24661144 9917357 30410529
17476C0410529i595929A419199J0778309J7892351c6995151C7108144A3853e447474
$$ 30410529 -9595929 1419199 12197508 30089859 -36995151 37108144 13853 -5447474
17467g091515A7993616C572400c891781k0320095d849755A2765941N008804c5901752
$$ -7091515 17993616 3572400 -3891781 -24211876 -4849755 12765941 17774745 -35901752
17458B2353504l880901I154806A508251O001351K34326a0899937D8430798a2780169
$$ 22353504 18472603 9154806 1508251 7509602 7743928 -10899937 48430798 -12780169
17449E543429R49932K6699539a0992686l8694442a7487591A547599e3111920J8038712
$$ 5543429 6493361 33192900 -10992686 -49687128 -17487591 1547599 -53111920 -35073208
17441c5073208J4055496Q867158A3837517c603846J711122A2449968J746424K2854172
$$ -35073208 -21017712 -12150554 13837517 -3603846 -1892724 12449968 14196392 37050564
17433C7050564b437884D983343a7369976O09127A0751615C0480a4783675j3597978
$$ 37050564 -2437884 4983343 -17369976 -16760849 10751615 30480 -14783675 -28381653
17425b8381653k842659D001850a0362774E3312305E539225f526313B15657M1186136
$$ -28381653 -31224312 4001850 -10362774 53312305 5539225 -6526313 215657 41401793
17417D1401793d1333055c340098l1728205a5642985P571883b662714k2813623
$$ 41401793 -41333055 -3340098 -35068303 -15642985 -8071102 -2662714 -25476337
17410b5476337a1100516J842759F878935f759284A8511175c7250926G884200a6433671
$$ -25476337 -11100516 -9257757 6878935 -6759284 18511175 -37250926 7884200 -16433671
17401E360244P808877F158752K4346488J2317576b48608j0469602K091545E155093
$$ 5360244 13169121 6158752 30505240 42822816 -248608 -10718210 -8626665 5155093
17392b854949B6562690A3033826C261772A195988K5142843B656150K425470a434265
$$ -2854949 26562690 13033826 3261772 1195988 26338831 2656150 5081620 -1434265
17383I440117f2242183J3902834B7652146r221197J3096400j5215234m609259
$$ 9440117 -62242183 -48339349 27652146 18430949 31527349 16312115 11702856
17376A1702856c013017j4151412q364783A3811423J709325a327556B661024J2799084
$$ 11702856 -3013017 -17164429 -25529212 13811423 15520748 -1327556 2661024 15460108
17368A5460108j938015b6362112A7026885E122726L0166883j4918485c394498
$$ 15460108 13522093 -26362112 17026885 5122726 35289609 20371124 -3394498
17360A2345126C607472j093562R364428f691511k9157222B1085586i291812B5749354
$$ 12345126 3607472 2513910 11878338 -6691511 -35848733 21085586 -9291812 25749354
17351A9183295a345581A6393087N163941a8847052C1044821i38652p476720A5535956
$$ 19183295 -1345581 16393087 21557028 -18847052 31044821 -938652 -8415372 15535956
17342A3976603M3804868a4440688A1222352J4564299i24554B8156258j3989576
$$ 13976603 57781471 -14440688 11222352 25786651 -924554 28156258 14166682
17335A4166682i474177a893900G566167c7059772A495451R921532R672989N450896
$$ 14166682 -9474177 -1893900 7566167 -37059772 1495451 11416983 21089972 26540868
17327B6540868A2186103d84591D510365b4890333B9175796j2760760j739171E006713
$$ 26540868 12186103 -484591 4510365 -24890333 29175796 16415036 14675865 5006713
17318D0825970A5568577a3823440A0490180b092292C082425f34480C873863b52247
$$ 40825970 15568577 -13823440 10490180 -2092292 3082425 -634480 3873863 -252247
17309b1893069A3264540B485616N127880K1880778H448813c4128335I389791d1119606
$$ -21893069 13264540 2485616 7613496 29494274 8448813 -34128335 9389791 -41119606
17300C3970552c6695059A040253J2851770G69783K8199629a9938174G140767b0530386
$$ 33970552 -36695059 1040253 13892023 769783 28969412 -19938174 7140767 -20530386
17291c1903125J3776657E932934a4295714J080931b51081j1876029E9932659B2778636
$$ -31903125 -18126468 5932934 -14295714 -13214783 -251081 -12127110 59932659 22778636
17282a2155945B1118911a6683020F478200J022763d39408B9689821R824017b1247963
$$ -12155945 21118911 -16683020 6478200 7500963 -439408 29689821 39513838 -21247963
17273D9084311c9517747B540440K878081K6385639A801658K7157485I563026L4544594
$$ 49084311 -39517747 2540440 5418521 31804160 1801658 28959143 9563026 44107620
17265D4107620f824471C2000784j4832624d439183m2999947a564598E335896b1663639
$$ 44107620 -6824471 32000784 17168160 -4439183 -47439130 -1564598 5335896 -21663639
17256g813132j6184330M101319C6886776a725064j5499170A2347140c3032202
$$ -7813132 -23997462 -19896143 36886776 -1725064 -17224234 12347140 -33032202
17248C8364812b986524B1557054J5402624c0229016B0634036J5928372A6712379
$$ 38364812 -2986524 21557054 36959678 -30229016 20634036 36562408 16712379
17240b6058382i034092F9442839I170260f477216F237628k844185J6009135b013746
$$ -26058382 -9034092 69442839 9170260 -6477216 6237628 3393443 19402578 -2013746
17231B8277753h902350B2761412l288210J9514470j8782675m813203J317431a744152
$$ 28277753 -8902350 22761412 19473202 38987672 20204997 15391794 16709225 -1744152
17222G693409B561185P225541b1804379O813035A0501099h107273a158015A7201290
$$ 7693409 2561185 9786726 -21804379 -14991344 10501099 -8107273 -1158015 17201290
17213A3034255b667188A6606274b5861878a0072222B4353730L4779949A7867512
$$ 13034255 -2667188 16606274 -25861878 -10072222 24353730 59133679 17867512
17205a7862564j748710f181382A5461656A634888P148258J9659904g562272H133564
$$ -17862564 -19611274 -6181382 15461656 1634888 8783146 28443050 -7562272 8133564
17196I140272a0400650l0732902A452302K4691583h028064j6070241a810877B0584192
$$ 9140272 -10400650 -41133552 1452302 26143885 -8028064 -24098305 -1810877 20584192
17187H907258N9213944k3729545A8396437a735274A071558a7931860e886866j8086078
$$ 8907258 68121202 44391657 18396437 -1735274 1071558 -17931860 -5886866 -23972944
17179b3972944A1353575N81110g415066a420537B0412734b8059375A1654519b045640
$$ -23972944 11353575 11934685 -7415066 -1420537 20412734 -28059375 11654519 -2045640
17170C223411K8013770m433930C072030j210794d0496238a5048949j7755676e090578
$$ 3223411 31237181 26803251 3072030 1861236 -40496238 -15048949 -32804625 -5090578
17161A669075P608002a0575266k234541C14803K5273276c239460G932175c3843090
$$ 1669075 9277077 -10575266 -12809807 314803 25588079 -3239460 7932175 -33843090
17152D871546r52411O291438K5684164A1459703N220388J0917893a0457183C4579083
$$ 4871546 3919135 10210573 35894737 11459703 16680091 27597984 -10457183 34579083
17143d6489129A0231087K1939189A002316f682588l0311893a3725955F983607
$$ -46489129 10231087 32170276 1002316 -6682588 -36994481 -13725955 6983607
17135D0505441i049980E353357b0606884A7976153a0431958C46122K8221611a8475046
$$ 40505441 -9049980 5353357 -20606884 17976153 -10431958 346122 28567733 -18475046
17126b5063370B1689976a4630295H90579g54041m664907B1751317K980171g969928
$$ -25063370 21689976 -14630295 890579 -754041 -5418948 21751317 24731488 -7969928
17117b9431681g644992j5459612m901347A1017750b2997779C6418477E009866
$$ -29431681 -7644992 -23104604 -28005951 11017750 -22997779 36418477 5009866
17109b6383393d64945m259317j1222175A8812391c5333820A6088216m715145d0575338
$$ -26383393 -464945 -4724262 -15946437 18812391 -35333820 16088216 11373071 -40575338
17100i778455B5752983k057827F760095P752178c557310j4449500k790470l1848495
$$ -9778455 25752983 23695156 6760095 14512273 -3557310 -18006810 -20797280 -52645775
17092e2645775f11227A7934556H316764M0092698A874860J8130404n024126A871521
$$ -52645775 -611227 17934556 8316764 48409462 1874860 20005264 14981138 1871521
17083f1349313b0272503C3783460a8891861A0313051l794562f373464C459432
$$ -61349313 -20272503 33783460 -18891861 10313051 6518489 -6373464 3459432
17075C5023921D376027E52592M978739J3642165g428713L258969J314524C2358599
$$ 35023921 4376027 552592 5531331 19173496 -7428713 -4169744 -2855220 32358599
17066e550043b155885j7747681A0021400L425121Q94587h480566k3032754A9406266
$$ -5550043 -2155885 -19903566 10021400 13446521 14341108 -8480566 -31513320 19406266
17057D0787447a6825206B7125578n698734a250102k5711630A6810678k59188b5136786
$$ 40787447 -16825206 27125578 21426844 -1250102 -26961732 16810678 16551490 -25136786
17048B9492610B724600K071236a8360171d678677L62252o520392j0958577C7613428
$$ 29492610 2724600 4795836 -18360171 -4678677 -4316425 -10836817 -21795394 37613428
17039b625045E613677A254978c9605844h388444B110641N840856a2605105D9281357
$$ -2625045 5613677 1254978 -39605844 -8388444 2110641 7951497 -12605105 49281357
17030i907684G928190J2164380a7710797A2153036K1035190b7103671A515076
$$ -9907684 7928190 20092570 -17710797 12153036 33188226 -27103671 1515076
17022G16725J744526O100530a6558342F143193J6460245J6272191A878709b0592718
$$ 716725 2461251 8561781 -16558342 6143193 22603438 38875629 1878709 -20592718
17013A193992d108126m121155k5677992D236899c7962185D4122779j8500241j1649789
$$ 1193992 -4108126 -8229281 -33907273 4236899 -37962185 44122779 25622538 13972749
17005A3972749m143484b7259415I307122b3981193A1097515N510476b0634635
$$ 13972749 9829265 -27259415 9307122 -23981193 11097515 16607991 -20634635
16997b0159125A9603430F907712J3368081c6236533E7799594a1131114o984179
$$ -20159125 19603430 6907712 20275793 -36236533 57799594 -11131114 -18115293
16990a8115293q244845b527972m293679B3497149a4495195D6946201a3421801
$$ -18115293 -26360138 -2527972 -6821651 23497149 -14495195 46946201 -13421801
16982A2963370Q800377i279853L258168J835491A5161574A593066Q698970i045296
$$ 12963370 21763747 -9279853 -6021685 -4186194 15161574 1593066 10292036 -9045296
16973F357280b8054219C3254879F125033J4917512o888947i954254A2720633f135249
$$ 6357280 -28054219 33254879 6125033 21042545 14153598 -9954254 12720633 -6135249
16964a9178230h884967j5496789C1100070a6544561k2770265H742063J803169
$$ -19178230 -8884967 -24381756 31100070 -16544561 -39314826 8742063 10545232
16957A0545232i208299q919436B9969562J6033976p738542m928347A2430491b1214837
$$ 10545232 -9208299 -18127735 29969562 46003538 38264996 33336649 12430491 -21214837
16948A7431032a6060098C1317443a3774450k2971848A1207526J8350292b1190292
$$ 17431032 -16060098 31317443 -13774450 -36746298 11207526 29557818 -21190292
16940F023030J4858683o365434m493112a8772865B3901288K432306L000393c1490263
$$ 6023030 20881713 14516279 10023167 -18772865 23901288 26333594 29333987 -31490263
16931C3441853E845124L9026418d4385761B1757258R033696A3241783J984716
$$ 33441853 5845124 44871542 -44385761 21757258 30790954 13241783 15226499
16924A5226499d1595596H880705b741232G943353o06784A556285d7555866A3440778
$$ 15226499 -41595596 8880705 -2741232 7943353 7336569 1556285 -47555866 13440778
16915A590246c8223497a7043961d273879l3538070b136768D9072078d242133G796374
$$ 1590246 -38223497 -17043961 -4273879 -37811949 -2136768 49072078 -4242133 7796374
16906i113824B3795274D567873K673508J5762500J1110435g950886A65197J6839383
$$ -9113824 23795274 4567873 7241381 23003881 34114316 -7950886 165197 17004580
16898A7004580F721957h468153A466445K9818439b0824182n034747A2858874J8052477
$$ 17004580 6721957 -8468153 1466445 31284884 -20824182 -25858929 12858874 30911351
16890C0911351J6841691e374034k0471825D3053496a2824126L048471c491505
$$ 30911351 47753042 -5374034 -25845859 43053496 -12824126 -9775655 -3491505
16882a1556902A2685514g641637k373854A9167250b2168285A2244083a1191329
$$ -11556902 12685514 -7641637 -10015491 19167250 -22168285 12244083 -11191329
16874f43495n4460224A0286172b5091775A2676876b24557D407314b6021202m8629544
$$ -643495 -55103719 10286172 -25091775 12676876 -224557 4407314 -26021202 -74650746
16866g4650746a7414091C158506J3764597a1254204b989267j2353109O238162
$$ -74650746 -17414091 3158506 16923103 -11254204 -2989267 -15342376 -9104214
16859i104214m167873e552611A7552040g248216B0262819a4089188C9329738A7612037
$$ -9104214 -13272087 -5552611 17552040 -7248216 20262819 -14089188 39329738 17612037
16850c9571580A0006283K8574835i695497j1654870I638266f569549e55051I03424
$$ -39571580 10006283 38581118 -9695497 -21350367 9638266 -6569549 -555051 903424
16841a008406k6807052a1859042C5199999a9340269d763498D470136J8123507
$$ -1008406 -27815458 -11859042 35199999 -19340269 -4763498 4470136 22593643
16834B2593643B403647J463261C08529c3945232A5274379h355967A1424815a5790815
$$ 22593643 2403647 3866908 308529 -33945232 15274379 -8355967 11424815 -15790815
16825D478717K1766015c1998843B2510040E990721G72873c4796110f585667E894014
$$ 4478717 26244732 -31998843 22510040 5990721 772873 -34796110 -6585667 5894014
16816B8003462a1234544B9331239c805542C0797669a3340910k8477361E607250
$$ 28003462 -11234544 29331239 -3805542 30797669 -13340910 -41818271 5607250
16808c1386135f01439A2210542b4496513H060237a9341989k2774383D055035M400842
$$ -31386135 -601439 12210542 -24496513 8060237 -19341989 -42116372 4055035 8455877
16800H455877a7858219E8975228A1676374N904676K383230O855478a1110570A4661105
$$ 8455877 -17858219 58975228 11676374 17581050 19964280 26819758 -11110570 14661105
16791B4853002b3720908B8162809a838736k0129003a464025n0784003D2645368
$$ 24853002 -23720908 28162809 -1838736 -21967739 -1464025 -52248028 42645368
16783d498785R96066m891314A6833975K6470055k0753992b5258633d134254K56687
$$ -4498785 -3502719 -8394033 16833975 43304030 22550038 -25258633 -4134254 -3877567
16775c877567A4088203a2085134d471675A6069602B916942J4284621b4274727
$$ -3877567 14088203 -12085134 -4471675 16069602 2916942 17201563 -24274727
16767E06365K0999399a2066142D472497h746498B1225047F283987J4267656m718336
$$ 506365 21505764 -12066142 4472497 -8746498 21225047 6283987 20551643 15833307
16759A5833307d374033k895606D941006c169826l0168944O083661A417157o72174
$$ 15833307 -4374033 -7269639 4941006 -3169826 -33338770 -27255109 1417157 744983
16751G44983R246811C347517a1826723l015867C609955b0027310E146264L7156197
$$ 744983 9991794 3347517 -11826723 -14842590 3609955 -20027310 5146264 42302461
16743D2302461a5119676b84692C7208686A741945f637316C6846992j7174709g588486
$$ 42302461 -15119676 -284692 37208686 1741945 -6637316 36846992 19672283 -7588486
16734a020074I612019b4693001F383159d0776791J7326074d66468j3337152j7222079
$$ -1020074 9612019 -24693001 6383159 -40776791 -23450717 -466468 -13803620 -31025699
16726c1025699H284015M145067e5014806a3818690A6223475n009603n247983L905982
$$ -31025699 8284015 12429082 -55014806 -13818690 16223475 11213872 5965889 9871871
16718I871871J707355c314795F12909a9355213J870914n248580j534179J011105
$$ 9871871 11579226 -3314795 612909 -19355213 -17484299 -22732879 -24267058 -23255953
16710b3255953k311539e053828A431115b1547734m648927G954233J256506a5362893
$$ -23255953 -25567492 -5053828 1431115 -21547734 -26196661 7954233 9210739 -15362893
16701f525776B0344115e6501663d241324q201682M020175A8225066H842534A266186
$$ -6525776 20344115 -56501663 -4241324 -12443006 -8422831 18225066 8842534 1266186
16692a8075630B407983J0818843a7037246F25396c477987j1338601A6831069J2583863
$$ -18075630 2407983 13226826 -17037246 625396 -3477987 -14816588 16831069 29414932
16684B9414932j2837769d309124j2088836A0826681R126042c73388H837281b5598490
$$ 29414932 16577163 -4309124 -16397960 10826681 19952723 -373388 8837281 -25598490
16675A2554751c4323335A726182i094587B276333a1137115r528654k7050059H947795
$$ 12554751 -34323335 1726182 -9094587 2276333 -11137115 -20665769 -47715828 8947795
16666a0324698k527723j1564837j0804407M732291a0755720j2229191A1867934
$$ -10324698 -12852421 -24417258 -35221665 -30489374 -10755720 -22984911 11867934
16658b1780423b024501k874910l4604967h36550B590499c6158698g094417j3607341
$$ -21780423 -2024501 -4899411 -39504378 -836550 2590499 -36158698 -7094417 -20701758
16650b0701758q341913l78529j4035122j8434257K2932543l7336842l349916R215125
$$ -20701758 -29043671 -29422200 -43457322 -61891579 -38959036 -76295878 -79645794 -70430669
16642g0430669q8106719j1454391J2826987K832401n4111584P6555886o436709
$$ -70430669 -158537388 -169991779 -157164792 -154332391 -208443975 -131888089 -138324798
16635a38324798N4994313p933405b2120682C2456298N3630334K4767813J7000172
$$ -138324798 -83330485 -91263890 -22120682 32456298 86086632 110854445 127854617
16628A27854617j5281834m9526032M6586509l0225975J5026241l3859814j446481
$$ 127854617 112572783 63046751 109633260 79407285 94433526 60573712 59127231
16621E9127231P582993j1419281B3872736j0039372K3783380j8566968k033415
$$ 59127231 66710224 55290943 23872736 13833364 37616744 19049776 17016361
16614A7016361a3366805F9317223c228269E695116L940046A310864M8893251j5969372
$$ 17016361 -13366805 69317223 -3228269 5695116 9635162 1310864 50204115 34234743
16606C4234743f050987C5694212j7215008E44944K0828682m798940M3446649j2224144
$$ 34234743 -6050987 35694212 18479204 544944 21373626 16574686 60021335 47797191
16598D7797191a2636531C1119248l429136a6384287D7164258a6981168l426414
$$ 47797191 -12636531 31119248 27690112 -16384287 47164258 -16981168 -20407582
16591b0407582D3229229a174358j696010D4534903j2793982j5733810J0764117
$$ -20407582 43229229 -1174358 -2870368 44534903 31740921 16007111 26771228
16584B6771228g591335B1516817K1131751o479720A7403380p839606i30329A9200102
$$ 26771228 -7591335 21516817 42648568 36168848 17403380 9563774 -930329 19200102
16575A5294344j445244a0363592B9412130q739245q9650b152919B1098577d784740
$$ 15294344 13849100 -10363592 29412130 20672885 20583235 -2152919 21098577 -4784740
16566H84599b4087652A8664467a7446138A120117N4885479d489402A4217069D138039
$$ 884599 -24087652 18664467 -17446138 1120117 56005596 -4489402 14217069 4138039
16557B0047872e1443725a6140742C5601911c128383j7565600C4600790a2887141
$$ 20047872 -51443725 -16140742 35601911 -3128383 -20693983 34600790 -12887141
16549B1951899q445596C613842a1565105p848519g601664C7890458c013001A6248837
$$ 21951899 13506303 3613842 -11565105 -19413624 -7601664 37890458 -3013001 16248837
16540A7828619K4366242A3424123J8210472l357494A0707889L3759892c757846
$$ 17828619 42194861 13424123 31634595 28277101 10707889 44467781 -3757846
16532b1131578Q401491H251952a4128833C6944007l624174m096011l729547H246395
$$ -21131578 -12730087 8251952 -14128833 36944007 33319833 29223822 25494275 8246395
16523A6051499J1028780j1671332D062718J5798011I628567J6388796a4918843
$$ 16051499 27080279 15408947 4062718 19860729 9628567 26017363 -14918843
16515A5670741A349720a4412192A9760302I225485J8460928e115983B1747900
$$ 15670741 1349720 -14412192 19760302 9225485 27686413 -5115983 21747900
16507A3881893K0720253c261636C315093J4833720K8113656k2060699a5056224
$$ 13881893 34602146 -3261636 3315093 18148813 46262469 24201770 -15056224
16499b771186I706141J1930591N543141j0098544J4100439g861557j1945968F350052
$$ -2771186 9706141 21636732 27179873 17081329 31181768 -7861557 -19807525 6350052
16490C6703728b4364608E838R387984R451001p460998K0850009p13256F583341
$$ 36703728 -24364608 5838 9393822 18844823 11383825 32233834 31520578 6583341
16481G914418b3249519B5181613H080510h330093J263383j3252082A6981872j450946
$$ 7914418 -23249519 25181613 8080510 -8330093 -7066710 -20318792 16981872 15530926
16473A5530926K1124324d401919E150771h617067a773728B1025286E338505j446445
$$ 15530926 36655250 -4401919 5150771 -8617067 -1773728 21025286 5338505 3892060
16465C892060a2095567b684696k3516082g289806B3878481e7129j0853344H429938
$$ 3892060 -12095567 -2684696 -26200778 -7289806 23878481 -57129 -10910473 8429938
16456C6772494j7473382i0339496e276053B2704176j189075e3382940a4360575
$$ 36772494 19299112 -90339496 -5276053 22704176 21515101 -53382940 -14360575
16448i279735l684568a512011C3457304C275959b1125152B277226J7009770a0827655
$$ -9279735 -12964303 -1512011 33457304 3275959 -21125152 2277226 19286996 -10827655
16439a0734079I298526K0423845d1448555A3130338a078580k080585n861162C2374200
$$ -10734079 9298526 29722371 -41448555 13130338 -1078580 -3159165 -9020327 32374200
16430c978220p697510j77497j1864770o011939J3201454F523585b5503492K222047
$$ -3978220 -11675730 -11853227 -23717997 -29729936 -16528482 6523585 -25503492 -23281445
16422b3281445A0461768k4438Q702423f859992c061738m1466835r700912C3202208
$$ -23281445 10461768 10437330 19139753 -6859992 -3061738 -44528573 -54229485 33202208
16413c8650519a6471414f237965p173587A6567764n134242J3948576j148954m232890
$$ -38650519 -16471414 -6237965 -13411552 16567764 11433522 25382098 24233144 20000254
16405B0000254f07212F662223J1413501K519726q809988L390755O696550b178197
$$ 20000254 -607212 6662223 18075724 20595450 11785462 15176217 21872767 -2178197
16396D779773Q810773o12950m504022N295526g6648A0444712N392716b3819072
$$ 4779773 13590546 12977596 8473574 13769100 -76648 10444712 15837428 -23819072
16387A4702915o055418a196381j154650B08174250c086523m227407r018079A2760755
$$ 14702915 8647497 -1196381 -2351031 208174250 -3086523 -7313930 -16332009 12760755
16378a3454131k1153686I356666L1257099d812732A050811K4198334a2522578
$$ -13454131 -34607817 9356666 40613765 -4812732 1050811 25249145 -12522578
16370B4766319L796334A2917640o17075h458390C1029242f564877F637733K3893962
$$ 24766319 28562653 12917640 12300565 -8458390 31029242 -6564877 6637733 30531695
16362C0531695A4507173J0546947j834921A0579841N345849a3493292A3153651
$$ 30531695 14507173 25054120 23219199 10579841 15925690 -13493292 13153651
16354H271328c2872598e170463j739839K076039r583227G710629B838848e2066771
$$ 8271328 -32872598 -5170463 -6910302 -4834263 -14417490 7710629 2838848 -52066771
16345A4419033f246231D282089b9844202B9773688A237785b5276049R878666k191238
$$ 14419033 -6246231 4282089 -29844202 29773688 1237785 -25276049 -15397383 -17588621
16337a7588621a102628D5196629k657198b2675261I446214e328481D4869875b6237113
$$ -17588621 -1102628 45196629 42539431 -22675261 9446214 -5328481 44869875 -26237113
16328B6295981b8201333B0383292K2148135b938372A8896208A528333a126178
$$ 26295981 -28201333 20383292 42531427 -2938372 18896208 1528333 -1126178
16320B8139282c2812044e326940r649267l609027C153191A008997o4200J1101934
$$ 28139282 -32812044 -5326940 -14976207 -18585234 3153191 1008997 944797 12046731
16312A2046731K4014799A3803754N280223H317456a676439A2890698E708675B131511
$$ 12046731 36061530 13803754 19083977 8317456 -1676439 12890698 5708675 2131511
16303a6579955h080583j7006389m056449B3286202D362098i05048A6671866c3094275
$$ -16579955 -8080583 -25086972 -29143421 23286202 4362098 -905048 16671866 -33094275
16294c8485307B419794R743015L3562892j5198995J7664087i982792A5097672
$$ -38485307 2419794 12162809 45725701 30526706 48190793 -9982792 15097672
16286c2747639B4929201j667491b1618128C5381739A5162826N501849k69580n788245
$$ -32747639 24929201 23261710 -21618128 35381739 15162826 20664675 20395095 14606850
16278A4606850a9732451D5223608b0187779D2653605k0105318a9779519L668626
$$ 14606850 -19732451 45223608 -20187779 42653605 22548287 -19779519 -16110893
16271a6110893C9794903n89950c1316747b510164I499353K2545213r043211P803117
$$ -16110893 39794903 39204953 -31316747 -2510164 9499353 32044566 23001355 30804472
16263C0804472a3455169b021681l5552307L081345L329663B627255K2800504A808426
$$ 30804472 -13455169 -2021681 -37573988 -34492643 -31162980 2627255 25427759 1808426
16254a5631851D3088095G025151b0897568A3085656b953857I051582c420373k2240979
$$ -15631851 43088095 7025151 -20897568 13085656 -2953857 9051582 -3420373 -25661352
16246b5661352C8922525a9508617A3582271E28786b4871909j7611360A7570451
$$ -25661352 38922525 -19508617 13582271 528786 -24871909 -42483269 17570451
16238E583219J6474175j0291965K7071369i865849E901021O690284b9616277a739806
$$ 5583219 22057394 11765429 38836798 -9865849 5901021 12591305 -29616277 -1739806
16229b1773209B9475601A0079477C52435J8913836R806565b411745H611834L0715580
$$ -21773209 29475601 10079477 352435 19266271 29072836 -2411745 8611834 39327414
16221C9327414j5555159c0248789B935900a966974B8237036e17059E688333J9823853
$$ 39327414 23772255 -30248789 2935900 -1966974 28237036 -517059 5688333 25512186
16213B5512186p997582j609021J2735148j2072072m287870d441471n341498L138771
$$ 25512186 17514604 15905583 28640731 16568659 12280789 -4441471 -9782969 -6644198
16205f644198A0306814M0088061a2729733j5805112o02275c155770l538869A9274285
$$ -6644198 10306814 50394875 -12729733 -28534845 -29137120 -3155770 -6694639 19274285
16196F663898K2492665c3130313B3324680j0323640A053263f388328C5007303
$$ 6663898 29156563 -33130313 23324680 13001040 1053263 -6388328 35007303
16188b8676685A3945672a4928016a450608A6599261b8233063c898660A9304040
$$ -28676685 13945672 -14928016 -1450608 16599261 -28233063 -3898660 19304040
16180A4138833c4627416e478755j2380289f342561k5567652I190096e635249j2442457
$$ 14138833 -34627416 -5478755 -17859044 -6342561 -31910213 9190096 -5635249 -18077706
16172a8077706A5359079B957891a8916459D2444585a71601H27109L4209463i392353
$$ -18077706 15359079 2957891 -18916459 42444585 -171601 827109 35036572 -9392353
16163d018182C1532715a0769578D6584J3839281J2865593h483015A069890J2456894
$$ -4018182 31532715 -10769578 46584 13885865 26751458 -8483015 1069890 13526784
16155A3526784H76618N3856360b5983922b42270j3025355D8097293h46771j5737714
$$ 13526784 876618 54732978 -25983922 -242270 -13267625 48097293 -846771 -16584485
16147a6584485D397983d365220k4251147I15847c597515F884147b0300741A2935023
$$ -16584485 4397983 -4365220 -28616367 915847 -3597515 6884147 -20300741 12935023
16138B7965498a3699488D5269864c4992349G617078c5950205B8256324A1590815
$$ 27965498 -13699488 45269864 -34992349 7617078 -35950205 28256324 11590815
16130b2517301N932421D1786680a2735920j1172839b665055q398632H598438b6374453
$$ -22517301 -16584880 41786680 -12735920 -23908759 -2665055 -11063687 8598438 -26374453
16121B0311118J470743n035653h690482c000369C4644864H364733B974697K0470156
$$ 20311118 21781861 16746208 -8690482 -3000369 34644864 8364733 2974697 23444853
16113B3444853d317795A5846227a0498393d504511A9905594k842467e379661k1954052
$$ 23444853 -4317795 15846227 -10498393 -4504511 19905594 17063127 -5379661 -27333713
16105b7333713B1513707H223019L585176R64207L6307369F965290b4526166I265302
$$ -27333713 21513707 8223019 11808195 12772402 49079771 6965290 -24526166 9265302
16096b5532149A613459J3403262p92338F4357d3191598B4350903m096418B675850
$$ -25532149 1613459 15016721 14224383 64357 -43191598 24350903 20254485 2675850
16087B9344435I94235g818710B143045O915789e0433424F146327J3014638E450189
$$ 29344435 994235 -7818710 2143045 9058834 -50433424 6146327 19160965 5450189
16078a9582584q722117C333878a5426838m847237c449418l0502234A2170404M04586
$$ -19582584 -28304701 3333878 -15426838 -20274075 -3449418 -33951652 12170404 12574990
16070A2574990a942970j7030404c702302A010305b9253291i991521j5348194A4236977
$$ 12574990 -1942970 -18973374 -3702302 1010305 -29253291 -9991521 -25339715 14236977
16061a9141825A1385220b2273489J0113737C756815e990858A94659h112768a348168
$$ -19141825 11385220 -22273489 -12159752 3756815 -5990858 194659 -8112768 -1348168
16052B2286178j386131Q496554O934661B693149d6131481C5529934j6679682K8024365
$$ 22286178 20900047 29396601 36331262 2693149 -46131481 35529934 18850252 46874617
16044D6874617A6408050J5775512a720004B9241277E112543P033980k341526J4508373
$$ 46874617 16408050 32183562 -1720004 29241277 5112543 12146523 9804997 24313370
16036B4313370d0377290C7229127a55693C883135K5814015b0889339f472475A6496281
$$ 24313370 -40377290 37229127 -155693 3883135 29697150 -20889339 -6472475 16496281
16027C597962a5973820D4176887G986776d605310q022411J443036H863890J3248074
$$ 3597962 -15973820 44176887 7986776 -4605310 -12627721 -11184685 8863890 22111964
16019B2111964j100780K0176692j5234492a611720A4703634b5513131N647057
$$ 22111964 21011184 41187876 25953384 -1611720 14703634 -25513131 -19866074
16012a9866074Q745532n423990A6593390F94294c831267k550532H150210N286463
$$ -19866074 -11120542 -16544532 16593390 694294 -3831267 -6381799 8150210 13436673
16004A3436673c946902B610730P508037J3964531d330392j6535978r945015A1196873
$$ 13436673 -3946902 2610730 10118767 24083298 -4330392 -20866370 -30811385 11196873
15995f3485513a5252137B8851302A4132634i672457r129345H251519e402409D4029850
$$ -63485513 -15252137 28851302 14132634 -9672457 -18801802 8251519 -5402409 44029850
15986B6256471k06999b1258819C0757661d849327C3146561q200684K5498384c8352871
$$ 26256471 26049472 -21258819 30757661 -4849327 33146561 24945877 50444261 -38352871
15977G818145b4301098C6812036I763926K39877b342217C4017722A6586765K5088811
$$ 7818145 -24301098 36812036 9763926 10003803 -2342217 34017722 16586765 41675576
15969D1675576h20263A1007231b9039902g045811J75996B676020K4767954B321047
$$ 41675576 -820263 11007231 -29039902 -7045811 -6869815 2676020 27443974 2321047
15960F689905J4773199a643685C0199888l764801c0470613c34948j0243753o467426
$$ 6689905 21463104 -1643685 30199888 26435087 -30470613 -334948 -10578701 -17046127
15952a7046127C320683b8946018A5561027c777831g99703B7796421a1686871N435708
$$ -17046127 3320683 -28946018 15561027 -3777831 -799703 27796421 -11686871 -6251163
15944f251163D2279620j3751132a6524600B8859554C392348a669863l32582C9769863
$$ -6251163 42279620 28528488 -16524600 28859554 3392348 -1669863 -2002445 39769863
15935A1031259J9380614a0992451A728344J4834428a872784F175852a3687778
$$ 11031259 30411873 -10992451 1728344 16562772 -1872784 6175852 -13687778
15927B9883128a2488072B1647855a1978688C3992738A0771860G64798b5456006
$$ 29883128 -12488072 21647855 -11978688 33992738 10771860 764798 -25456006
15919g171691E464940H88337c6075014i892735a854679m0202351h161568B8334544
$$ -7171691 5464940 888337 -36075014 -9892735 -1854679 -42057030 -8161568 28334544
15910A5277824J659859f308269D1413329A8386685H682931d504793A3523848P291942
$$ 15277824 16937683 -6308269 41413329 18386685 8682931 -4504793 13523848 20815790
15902B0815790c013319r127825R70946C754705M5075426A4037515J533033e461997
$$ 20815790 -3013319 -12141144 -11170198 3754705 48830131 14037515 15570548 -5461997
15893f8326391a0248200K707672A4602717c4769350a6582900O920696A2108792
$$ -68326391 -10248200 -7540528 14602717 -34769350 -16582900 -9662204 12108792
15885F251388h819215k3583621D8079831g268263J204396k9859492A5505885n015994
$$ 6251388 -8819215 -32402836 48079831 -7268263 -6063867 -35923359 15505885 10489891
15877A0489891N570917a382268A4585448e313601B0193427b8586250I325765Q05175
$$ 10489891 16060808 -1382268 14585448 -5313601 20193427 -28586250 9325765 10130940
15869A0130940l823420b096761A4711182c2660697i03473o1290378A3829531b301029
$$ 10130940 6307520 -2096761 14711182 -32660697 -903473 -62193851 13829531 -2301029
15860c9452922E544967K4224168c2923208B1630140I969264a891538B4619790
$$ -39452922 5544967 29769135 -32923208 21630140 9969264 -1891538 24619790
15852A1782880E531823i066060B6270399E860675K1372674C724698L1698206e405750
$$ 11782880 5531823 -9066060 26270399 5860675 27233349 3724698 35422904 -5405750
15843A712867Q534994J6783322k542937H332012C317216B35736a785773k9922798
$$ 1712867 10247861 27031183 24488246 8332012 3317216 235736 -1785773 -31708571
15835c1708571B9937765p435229b8700022J1278416F031444J7708781q04824a1342073
$$ -31708571 29937765 22502536 -28700022 -17421606 6031444 23740225 22935401 -11342073
15826B02192L3626350a06147A3749695m559043a4050502A8034941A699573P583013
$$ 202192 33828542 -106147 13749695 9190652 -14050502 18034941 1699573 9282586
15818I282586e318427B9978922l814448A0239028k12100Q575130b3156719f319657
$$ 9282586 -5318427 29978922 26164474 10239028 10026928 18602058 -23156719 -6319657
15809H76552J5134577i535369F308666a7621665l236496A578775f100425H200791
$$ 876552 16011129 -9535369 6308666 -17621665 -20858161 1578775 -6100425 8200791
15800b6076995G191654L3510853c0205096A9911331O549227p448067b4533903
$$ -26076995 7191654 40702507 -30205096 19911331 26460558 19012491 -24533903
15792a4157077m0813301C4964753d7787777J5975289K199716J2732323c760334
$$ -14157077 -54970378 34964753 -47787777 -31812488 -29612772 -16880449 -3760334
15784c863153A9037765m557337c5364841A7084137J716810m870203i461865E017956
$$ -3863153 19037765 14480428 -35364841 17084137 18800947 13930744 -9461865 5017956
15775c352277D3258727g690594I860794B965667J8020932b2045547j3869050A0094455
$$ -3352277 43258727 -7690594 9860794 2965667 20986599 -22045547 -35914597 10094455
15766c008550l2355489J6260375B4968165k293485a2873381j5899822J3313526
$$ -3008550 -35364039 -19103664 24968165 22674680 -12873381 -28773203 -15459677
15759a5459677G823817J7606021e1411425b092038j5200574O493992A2425603
$$ -15459677 7823817 25429838 -51411425 -2092038 -17292612 -10798620 12425603
15751b4574669A5859373a4839325D0876907I491180a3451256C0369071i389633
$$ -24574669 15859373 -14839325 40876907 9491180 -13451256 30369071 -9389633
15743b0518142o84001B7170369l514356E12927b5173361K052354b162476l8106538
$$ -20518142 -21202143 27170369 23656013 512927 -25173361 -23121007 -2162476 -40269014
15735d0269014a569714G380e703547A0383544J113253g578668c539141h7960A42315
$$ -40269014 -1569714 7380 -5703547 10383544 11496797 -7578668 -3539141 -87960 142315
15725g516911i48403A474833J5123212Q897371m635321L964548b815661j9998977
$$ -7516911 -948403 1474833 16598045 25495416 20860095 24824643 -2815661 -22814638
15717b2814638B1437247B012022J6409906B24943a0522618C7288924c2865564
$$ -22814638 21437247 2012022 18421928 224943 -10522618 37288924 -32865564
15709C9857403E372993a3921642A3313099K0208468g541903I632927Q375542o730994
$$ 39857403 5372993 -13921642 13313099 33521567 -7541903 9632927 18008469 11277475
15701A1277475D582443Q825179J8776987e649286A8174515J8465356A6081988
$$ 11277475 4582443 13407622 32184609 -5649286 18174515 36639871 16081988
15693F275162J1629373c6215799D370544f609930k3169589B8389642a1508262
$$ 6275162 17904535 -36215799 4370544 -6609930 -29779519 28389642 -11508262
15685b1386559j6341442a6730341D9420459B2168403c7100373b306714o900902
$$ -21386559 -37728001 -16730341 49420459 22168403 -37100373 -2306714 -9207616
15678i207616E968351J6097496L269380L816L528519a276164D208272K642063
$$ -9207616 5968351 22065847 25335227 25339043 28867562 -1276164 4208272 6850335
15670F850335b3401117C8310491i907089D099548J3346174a2439660B3698433
$$ 6850335 -23401117 38310491 -9907089 4099548 17445722 -12439660 23698433
15662a1042453B6484242a6735454I770453R285423C691868L759560K2014553a8751854
$$ -11042453 26484242 -16735454 9770453 19055876 3691868 7451428 29465981 -18751854
15653A4426811K7340812m587840H014534b8693922d225695k1827975j6418373
$$ 14426811 41767623 37179783 8014534 -28693922 -4225695 -26053670 -42472043
15646d2472043i55945M76808j8687878H889496c2513381a4269329A684446K0053565
$$ -42472043 -955945 -479137 -19167015 8889496 -32513381 -14269329 1684446 21738011
15638B1738011J477321a6644362K287455a489773B5982452c7056491h802565a137180
$$ 21738011 23215332 -16644362 -14356907 -1489773 25982452 -37056491 -8802565 -1137180
15629a021420j7629623k632392I820474N888564o698267c6997728i064426g56010
$$ -1021420 -18651043 -21283435 9820474 15709038 9010771 -36997728 -9064426 -756010
15620A778597a3504641d303982D536745Q53348d1090015B4896481c2003494A1948776
$$ 1778597 -13504641 -4303982 4536745 5390093 -41090015 24896481 -32003494 11948776
15611a9212579J214066P119535j4547125H746228j884552b1221735d660967j3095928
$$ -19212579 -17998513 -10878978 -25426103 8746228 6861676 -21221735 -4660967 -17756895
15603a7756895A37868J7107875b1022178L174157F403964f677923A0890095K7879169
$$ -17756895 137868 17245743 -21022178 -17848021 6403964 -6677923 10890095 38769264
15595C8769264d445829a46478H684839a3169156B6955028p597502R650296a2197629
$$ 38769264 -4445829 -146478 8684839 -13169156 26955028 19357526 29007822 -12197629
15586A8389510C462569M256478J1585201c6949099A0721146c0284509A3521219
$$ 18389510 3462569 7719047 19304248 -36949099 10721146 -30284509 13521219
15578a3376550k4598225Q464647i79958A8474645c8416244d112460l4902069a1704107
$$ -13376550 -37974775 -29510128 -979958 18474645 -38416244 -4112460 -39014529 -11704107
15569C486154d130485B5400991C470082J22077L2361796b9334994d22944p240121
$$ 3486154 -4130485 25400991 3470082 3592159 35953955 -29334994 -422944 -7663065
15561g663065A4712713g805614B5322337a8795835N585388D0782014N632338A1420917
$$ -7663065 14712713 -7805614 25322337 -18795835 -13210447 40782014 46414352 11420917
15552A0093631D020391a3706241k1785887J5670688P223842b004222H330676a8213354
$$ 10093631 4020391 -13706241 -35492128 -19821440 -12597598 -2004222 8330676 -18213354
15543d716761Q21842j2426313C970648J768606k140501J9166458a0357204C102364
$$ -4716761 -3894919 -16321232 3970648 5739254 3598753 22765211 -10357204 3102364
15534C4350110q099568H264941K6510334b2624164a699891D791862K3302568k189392
$$ 34350110 26250542 8264941 34775275 -22624164 -1699891 4791862 28094430 25905038
15526B5905038f566343r534859A8461428n614538B477138M0681143A5017795K2366262
$$ 25905038 -6566343 -16101202 18461428 12846890 2477138 43158281 15017795 37384057
15518C7384057j5530570i902149A2009008n296456k574155a6699106D193913f243739
$$ 37384057 21853487 -9902149 12009008 6712552 4138397 -16699106 4193913 -6243739
15509A2767193G28217K795067i27373k9570219B4486611I90677b1500220q471707
$$ 12767193 728217 3523284 -927373 -30497592 24486611 990677 -21500220 -29971927
15501b9971927o25164a4924045n674191K640506B8455629j2204631B055382K9604795
$$ -29971927 -30597091 -14924045 -20598236 -17957730 28455629 16250998 2055382 31660177
15493C1660177e771625b318038j3804985B5384395J9427851A5927731c8084535
$$ 31660177 -5771625 -2318038 -16123023 25384395 44812246 15927731 -38084535
15485a6558336G515563j861229Q575315a5142219j1114729A9015370c2044941
$$ -16558336 7515563 5654334 14229649 -15142219 -26256948 19015370 -32044941
15477a0641362F090244N9140452b964413q255261L660938A8195713I078908L2813886
$$ -10641362 6090244 65230696 -2964413 -11219674 -7558736 18195713 9078908 41892794
15469D1892794b844307B9120519a493035H284177a6221596R74354D712975b9175356
$$ 41892794 -2844307 29120519 -1493035 8284177 -16221596 -15247242 4712975 -29175356
15460B7227581b0114130j7704962B7029946q190313K3423602r157414b0911010
$$ 27227581 -20114130 -37819092 27029946 18839633 42263235 33105821 -20911010
15452A1019405m468905M8548253A8768798a2810525c30668j3567450A3995784
$$ 11019405 6550500 55098753 18768798 -12810525 -330668 -13898118 13995784
15444f690289j555744B7626006F430847h482794A1561782a0592137E905634c063617
$$ -6690289 -8246033 27626006 6430847 -8482794 11561782 -10592137 5905634 -3063617
15435C4883311e53123I841675b039536E3762553H429030c851080j9950877b314825
$$ 34883311 -553123 9841675 -2039536 53762553 8429030 -3851080 -23801957 -2314825
15426A5007496D317102i39703j2581035f065369C465689a5673971c117228j2134461
$$ 15007496 4317102 -939703 -13520738 -6065369 3465689 -15673971 -3117228 -15251689
15418a5251689j3450819E827473J5381135G005505J5643874o958311h378454l4390979
$$ -15251689 -28702508 5827473 21208608 7005505 22649379 15691068 -8378454 -42769433
15410d2769433D2551543G847049J9008695A3066638J427098A820607J5952770
$$ -42769433 42551543 7847049 26855744 13066638 14493736 1820607 17773377
15403A7773377a4849487H383314b4462093A0398910b384158B0167438C293536
$$ 17773377 -14849487 8383314 -24462093 10398910 -2384158 20167438 3293536
15395a2219826Q68238C4531971A4356951l791073h377913j6144669H863158d6241349
$$ -12219826 -11351588 34531971 14356951 10565878 -8377913 -24522582 8863158 -46241349
15386g674538l9184654a4378777F483205b8890636R130688C7235912d400675J076895
$$ -7674538 -46859192 -14378777 6483205 -28890636 -19759948 37235912 -4400675 -3323780
15378c323780C03390J3960773c6319271B2771766r619800e099647q057678L280538
$$ -3323780 303390 14264163 -36319271 22771766 13151966 -5099647 -13157325 -9876787
15370i876787E44093M5813692a800411E618178N398959K4887634a6306876I848691
$$ -9876787 544093 46357785 -1800411 5618178 11017137 35904771 -16306876 9848691
15361H752470c9784585A253702b5113845F692244N816942n756694J7574261a3369689
$$ 8752470 -39784585 1253702 -25113845 6692244 12509186 6752492 24326753 -13369689
15352A9367614D116586L331223b7445429A412097i102725c304725n9752612e661850
$$ 19367614 4116586 7447809 -27445429 1412097 -9102725 -3304725 -63057337 -5661850
15343A4893763m244931K7143180a4202225A4176246A073942J0579494i948787
$$ 14893763 10648832 37792012 -14202225 14176246 1073942 11653436 -9948787
15335f274396C2465561a1119590m036798H630641C537912M385781N532724b9586749
$$ -6274396 32465561 -11119590 -15156388 8630641 3537912 7923693 13456417 -29586749
15326b0328887A3612034f493791B9274423J6267221A9477638M445690K56648K5822365
$$ -20328887 13612034 -6493791 29274423 45541644 19477638 23923328 24179976 50002341
15318E0002341f973101D8980058B1307057L165729I772257b2828977Q313242j120415
$$ 50002341 -6973101 48980058 21307057 24472786 9772257 -22828977 -14515735 -15636150
15310a5636150C2949571n7140q635152L287044a855304r92477A8384046k545370
$$ -15636150 32949571 32892431 24257279 27544323 -1855304 -2847781 18384046 15838676
15302A5838676e183890C0979335c1322688A973253N294042b5517781a0317571
$$ 15838676 -5183890 30979335 -31322688 1973253 7267295 -25517781 -10317571
15294g89535B373017Q803924e2250452c300274j1405274A0681554j687129K4579081
$$ -789535 2373017 11176941 -52250452 -3300274 -14705548 10681554 8994425 33573506
15286C3573506C78187c9619734i138931C855798b993991C893944j131273J9088708
$$ 33573506 378187 -39619734 -9138931 3855798 -2993991 3893944 2762671 21851379
15278B1851379b0903310I456718b342554l1657279i131763C8936814o291211H260410
$$ 21851379 -20903310 9456718 -2342554 -33999833 -9131763 38936814 32645603 8260410
15269H5142a7135740c459458k1663590A6321319a196384A532740K1822126R11504
$$ 85142 -17135740 -3459458 -25123048 16321319 -1196384 1532740 23354866 24266370
15261B4266370j551375d817095A0328891K9182777j6340955A1548602N373235
$$ 24266370 22714995 -4817095 10328891 39511668 23170713 11548602 16921837
15254A6921837a344927D733758e510366k0086821K666366O905105A752267R900683
$$ 16921837 -1344927 4733758 -5510366 -25597187 -22930821 -16025716 1752267 11652950
15246A1652950c5525460O282317R689869j540643A8799759b2096104B697310J7948366
$$ 11652950 -35525460 -29243143 -19553274 -21093917 18799759 -22096104 2697310 20645676
15238B0645676b2400817k434570P108794E8976795H135633c0764032D569671a9496533
$$ 20645676 -22400817 -24835387 -17726593 58976795 8135633 -30764032 4569671 -19496533
15229c7930188q642937J7432492h948170c022839G905143e553019k9457545B8284981
$$ -37930188 -46573125 -29140633 -8948170 -3022839 7905143 -5553019 -35010564 28284981
15220A2915086l989970b8796784A4246894C366194J2457135i325422B4706880
$$ 12915086 8925116 -28796784 14246894 3366194 15823329 -9325422 24706880
15212g652825k941370n721612C8583105b8977547j1621346a5869017C9565028
$$ -7652825 -10594195 -16315807 38583105 -28977547 -40598893 -15869017 39565028
15204i183347A8332763H86785K4030613f860238p480545E350044i357968j0823118
$$ -9183347 18332763 886785 24917398 -6860238 -14340783 5350044 -9357968 -20181086
15196b0181086L571404N728864A2661122d2128271a6473477B4086702b3698060
$$ -20181086 -16609682 -10880818 12661122 -42128271 -16473477 24086702 -23698060
15188C3173353m490814e323362j2960457l9325860d145890B524769c0625073J2770813
$$ 33173353 28682539 -5323362 -18283819 -57609679 -4145890 2524769 -30625073 -17854260
15180a7854260E64341J9979950d4295259J6481850c415244m1905085B6012467
$$ -17854260 564341 20544291 -44295259 -27813409 -3415244 -45320329 26012467
15172d0011884E088343J7515921c5598633E638702K0136491h653293B4603129
$$ -40011884 5088343 22604264 -35598633 5638702 25775193 -8653293 24603129
15164a8345969M735903B8735672b3067699B3430255D215542M79749M7006356F593274
$$ -18345969 -13610066 28735672 -23067699 23430255 4215542 4695291 51701647 6593274
15155C2297380q766292L132802c9314252A6422954K8882725a0814070C6123607
$$ 32297380 23531088 26663890 -39314252 16422954 45305679 -10814070 36123607
15147B3828839b0685323A2091485N638667J4341162A0495755a4431807E876673
$$ 23828839 -20685323 12091485 17730152 32071314 10495755 -14431807 5876673
15139a9329587D4837051a912274k3176923i159241r237815j5580453l326583B4424203
$$ -19329587 44837051 -1912274 -25089197 -9159241 -18397056 -33977509 -37304092 24424203
15130b3595563J0181215C166105K3305734a3174303e996622B9275643e576104
$$ -23595563 -13414348 3166105 26471839 -13174303 -5996622 29275643 -5576104
15122B1761440I690502D188705q16728O430913N074120d931295J468591A9683193
$$ 21761440 9690502 4188705 3371977 9802890 14877010 -4931295 -3462704 19683193
15113a9185903b438511j3172452b732914j0507538A8195521B892847b0102891
$$ -19185903 -2438511 -15610963 -2732914 -13240452 18195521 2892847 -20102891
15105A3227078R254402r25619O484919a4054671n357430f564018B037024M275048
$$ 13227078 22481480 21555861 28040780 -14054671 -19412101 -6564018 2037024 6312072
15097F312072B756072a6735386C005272b9034876F843619A460290a0364755L656834
$$ 6312072 2756072 -16735386 3005272 -29034876 6843619 1460290 -10364755 -6707921
15089f707921j662516C3360181j2983492E454173d50205D453077O99651F74996
$$ -6707921 -8370437 33360181 20376689 5454173 -450205 4453077 5152728 674996
15080f88220k2113973A2673382a7306899k778982j0193481a559226k2290909B1317712
$$ -688220 -22802193 12673382 -17306899 -20085881 -30279362 -1559226 -23850135 21317712
15071B8431994a5439520A3739000d0290208B2366237L1209580B0239665B551501
$$ 28431994 -15439520 13739000 -40290208 22366237 53575817 20239665 2551501
15063b3501237d520479A9295467H204182K3193207j2488027H304779M1234582
$$ -23501237 -4520479 19295467 8204182 31397389 18909362 8304779 49539361
15056D9539361d876096B119066Q00500c0419790d66478k2544031C2417979P466196
$$ 49539361 -4876096 2119066 2919566 -30419790 -466478 -23010509 32417979 39884175
15048C9884175b3901052B4186681l777484a4148612A3707777o688571Q639294
$$ 39884175 -23901052 24186681 20409197 -14148612 13707777 7019206 15658500
15041A5658500L686156b0516450A4475676P323892r879144a4581538j4234902
$$ 15658500 19344656 -20516450 14475676 21799568 11920424 -14581538 -28816440
15034b8816440G226866J18265L4371691g296996k2445635J1646339A4127549i173583
$$ -28816440 7226866 7345131 41716822 -7296996 -29742631 -18096292 14127549 -9173583
15025G561969c5433317F441566d5698490a8364219I218485h98644m108051I567634
$$ 7561969 -35433317 6441566 -45698490 -18364219 9218485 -898644 -5006695 9567634
15016F625776j310948L2140438A1036840J9139245b2983865C5909388c620895
$$ 6625776 5314828 37455266 11036840 30176085 -22983865 35909388 -3620895
15008b1108585A4058815a6290998C932286L3747501G626480f188073A1482555
$$ -21108585 14058815 -16290998 3932286 37679787 7626480 -6188073 11482555
15000A8325910D186916G17115a0797472A6100439d16935C0058124a2092129B9672345
$$ 18325910 4186916 717115 -10797472 16100439 -416935 30058124 -12092129 29672345
14991a0637866C5308334A536082O847315d7107428a2701248d086846j171620j8572910
$$ -10637866 35308334 1536082 8383397 -47107428 -12701248 -4086846 -5258466 -23831376
14983b3831376N12835A3224448d060178k7986963F608415R122919E962550b5851188
$$ -23831376 -23318541 13224448 -4060178 -32047141 6608415 15731334 5962550 -25851188
14974a4428817A7482748b77899E0150978b9152204g399849B489137b497562k6932861
$$ -14428817 17482748 -277899 50150978 -29152204 -7399849 2489137 -2497562 -29430423
14966b9430423J0630164E002603d283602o65157r007105N876396k747377B1069328
$$ -29430423 -18800259 5002603 -4283602 -4948759 -13955864 -8079468 -10826845 21069328
14957I628004a5124533d456903F13371h489967F293210a50116j1571808a773296
$$ 9628004 -15124533 -4456903 613371 -8489967 6293210 -150116 -11721924 -1773296
14948H255813M7323157j7992885b7760300A6961462a5307261f857455l0122886
$$ 8255813 55578970 37586085 -27760300 16961462 -15307261 -6857455 -36980341
14941c6980341B776642j322562L8150786C354606a4624003p54658G904397L4621686
$$ -36980341 2776642 1454080 39604866 3354606 -14624003 -15378661 7904397 42526083
14933D2526083A6743231c3631988e961486l6916783O753499B4552296e750687
$$ 42526083 16743231 -33631988 -5961486 -42878269 -36124770 24552296 -5750687
14925b6058079j0943759a1569148e436150d91301l4593240A0428467b5374092
$$ -26058079 -37001838 -11569148 -5436150 -491301 -35084541 10428467 -25374092
14917c5196087A5896051K0653705a5960176e335254j274833B5015582b8361459
$$ -35196087 15896051 36549756 -15960176 -5335254 -6610087 25015582 -28361459
14909a5925629l801836f063723B6764016g156394n7538125B2675561q671794a5905966
$$ -15925629 -19727465 -6063723 26764016 -7156394 -64694519 22675561 14003767 -15905966
14900b3927111A8852113J0990676f208874A3954884j917611l442516f555019m234657
$$ -23927111 18852113 29842789 -6208874 13954884 12037273 8594757 -6555019 -10789676
14892a0789676E469207a2359225A2701956b1545315a65034B696493Q410497g384262
$$ -10789676 5469207 -12359225 12701956 -21545315 -165034 2696493 11106990 -7384262
14883b1902513A1486971C402988K6459006a8214146j1938389C5602787a6228121
$$ -21902513 11486971 3402988 29861994 -18214146 -30152535 35602787 -16228121
14875g93006j1917135D477639f769359B785170L3761061E757772b5641385C909693
$$ -793006 -12710141 4477639 -6769359 2785170 36546231 5757772 -25641385 3909693
14866A6451386a2627485C2214018A4339083e038107F366322A828202a8839735
$$ 16451386 -12627485 32214018 14339083 -5038107 6366322 1828202 -18839735
14858A3581650a2038234l1351984C359421b2036586Q312862N486748j1120112
$$ 13581650 -12038234 -43390218 3359421 -22036586 -13723724 -8236976 -19357088
14851a9357088D358289b1673633E389388K988348a2435350B2507242K678773j0098507
$$ -19357088 4358289 -21673633 5389388 8377736 -12435350 22507242 25186015 15087508
14843A5087508e512880f25189A5329398K82909c2290287e675385B1627757l852078
$$ 15087508 -5512880 -625189 15329398 15612307 -32290287 -5675385 21627757 17775679
14835A7775679k870489a2234821q353710A2108490B899655J983428b7165147a2651291
$$ 17775679 14905190 -12234821 -20588531 12108490 2899655 4883083 -27165147 -12651291
14826d470768j6485941k3018989c106959p606055A7996586H631673c6287980I869110
$$ -4470768 -20956709 -43975698 -3106959 -10713014 17996586 8631673 -36287980 9869110
14817G43439c5508234e627931B3856971H904960A386711K0326150B312355a1048176
$$ 743439 -35508234 -5627931 23856971 8904960 1386711 21712861 2312355 -11048176
14808G852021K3655536h615564A999177R031216C409745J536968A530048J3878360
$$ 7852021 31507557 -8615564 1999177 11030393 3409745 4946713 1530048 15408408
14800A5408408h610434j5363781j5725346J8985624R799045B2370511J0269098
$$ 15408408 -8610434 -23974215 -39699561 -20713937 -10914892 22370511 32639609
14793C2639609j777253a0447929a150093j555375I71063L4206489c0712737B8639141
$$ 32639609 30862356 -10447929 -1150093 -2705468 971063 35177552 -30712737 28639141
14784c5419491c321716j6168447l032110E55833J2089452o237069J2766443c2801133
$$ -35419491 -3321716 -19490163 -22522273 555833 12645285 6408216 19174659 -32801133
14775c4085254e954043J127942G02020Q93402R473306e311024j3487869C2928877
$$ -34085254 -5954043 -4826101 702020 1595422 11068728 -5311024 -18798893 32928877
14766a0386089F98458a5327482k6383784J8265916B6592465c766376F0981617
$$ -10386089 698458 -15327482 -41711266 -23445350 26592465 -3766376 60981617
14758a3407175L61025b996076k5370300h711725l0169796a4773771H727888b767160
$$ -13407175 -13046150 -2996076 -28366376 -8711725 -38881521 -14773771 8727888 -2767160
14749I408205J074963a1645707n859081a513700A2538626d8652823A4533824D691610
$$ 9408205 10483168 -11645707 -17504788 -1513700 12538626 -48652823 14533824 4691610
14740E1994177f844636r464848I039115J397187a1607956j1989171q231923f579736
$$ 51994177 -6844636 -16309484 9039115 10436302 -11607956 -23597127 -31829050 -6579736
14731h93678q02061H791361a3420394j7577772q459794I35210L2356403A2453838
$$ -893678 -1695739 8791361 -13420394 -30998166 -39457960 935210 33291613 12453838
14722b1748495C3578136n015166a7026952l5824504f613990A0347365Q433486
$$ -21748495 33578136 28562970 -17026952 -52851456 -6613990 10347365 18780851
14715A8780851a9254868A5967089a2237653E230235J2854411c2418380R307410
$$ 18780851 -19254868 15967089 -12237653 5230235 18084646 -32418380 -23110970
14708b3110970e957168j8657967A4698535D638797a7256955B2634284a8089626
$$ -23110970 -5957168 -24615135 14698535 4638797 -17256955 22634284 -18089626
14700c1976933A0950787a9126944g162392n656032A1400304b0218065A9656582
$$ -31976933 10950787 -19126944 -7162392 -12818424 11400304 -20218065 19656582
14692A6875995b8765621a3661882a262615A4486865e149953J41998A334898h96909
$$ 16875995 -28765621 -13661882 -1262615 14486865 -5149953 -5007955 1334898 -896909
14683c7726058H981443J2649474b1225492R451130r437419D732280j889279a8722074
$$ -37726058 8981443 21630917 -21225492 -11774362 -21211781 4732280 2843001 -18722074
14674b9919051p627446C1930359C055907Q406615N990501J6297967d041050A02939
$$ -29919051 -37546497 31930359 3055907 11462522 17453023 33750990 -4041050 102939
14665E001366c505827B8848440j3773717c755443p316160J465688c528977k0642824
$$ 5001366 -3505827 28848440 15074723 -3755443 -11071603 -9605915 -3528977 -24171801
14657b4171801R366651H815153a5026787G158423K8623191c4704003E30686a3188108
$$ -24171801 -14805150 8815153 -15026787 7158423 35781614 -34704003 530686 -13188108
14648A4987554h033045k4124858C791790a4223651B0122200E449062b8590138
$$ 14987554 -8033045 -32157903 3791790 -14223651 20122200 5449062 -28590138
14640B32022K053013g98004l957492r223932k663196B4376495M796685f629644
$$ 232022 2285035 -798004 -4755496 -13979428 -16642624 24376495 29173180 -6629644
14631a8820004A2529821D083318e0663726B2799623A0869362l081913J0613750
$$ -18820004 12529821 4083318 -50663726 22799623 10869362 7787449 18401199
14624A8401199D501227a9297907B7392673a3641885A5534860J7673434a2903687
$$ 18401199 4501227 -19297907 27392673 -13641885 15534860 33208294 -12903687
14616H843379k754794B450989i70489l73566C5206814j4933543b0921843f521739
$$ 8843379 6088585 2450989 -970489 -1344055 35206814 20273271 -20921843 -6521739
14607C0057243A3645852a839647j7165757O835079d383468A680555b681716A1614784
$$ 30057243 13645852 -1839647 -19005404 -12170325 -4383468 1680555 -2681716 11614784
14598d8708177D2116715g237818B5682241d2426698a020432o680024p474470n95558
$$ -48708177 42116715 -7237818 25682241 -42426698 -1020432 -7700456 -15174926 -15770484
14590a5770484A1656447e008702j1703371g914005I753477b823453o749928k296734
$$ -15770484 11656447 -5008702 -16712073 -7914005 9753477 -2823453 -9573381 -11870115
14582a1870115B1205524G146326R088798J539232K6488771F4931R971798c8589284
$$ -11870115 21205524 7146326 16235124 17774356 44263127 64931 10036729 -38589284
14573D187936a5980422A4731036a9295572A509676J8926354m2205n713220J7606762
$$ 4187936 -15980422 14731036 -19295572 1509676 20436030 20393825 14680605 32287367
14565C2287367J3570424A7919811b544949A8027317c212546l1976012b509599
$$ 32287367 45857791 17919811 -2544949 18027317 -3212546 -35188558 -2509599
14557a8416952j3464343F904991c15365E569118g807727o0444741A537764K009241
$$ -18416952 -31881295 6904991 -315365 5569118 -7807727 -68252468 1537764 3547005
14549C547005a5322063E84907J0068895J3549759J9799283B1136069e1448394
$$ 3547005 -15322063 584907 10653802 24203561 44002844 21136069 -51448394
14541d4470507Q663729B026485L829904a5018554m223700F5571546d0105103B8402782
$$ -44470507 -35806778 2026485 5856389 -15018554 -19242254 65571546 -40105103 28402782
14532d248013j40021A4618434b4004032C1097106b4385419M220557g860034c65883
$$ -4248013 -4388034 14618434 -24004032 31097106 -24385419 -20164862 -7860034 -365883
14523E4423c2483241A6250011P262838c094796B0338163q750306L2985642F311001
$$ 54423 -32483241 16250011 23512849 -3094796 20338163 11587857 44573499 6311001
14514B7839970n126104g507923j7010901D284384M796954d264716D713364J4444700
$$ 27839970 22713866 -7507923 -24518824 4284384 9081338 -4264716 4713364 19158064
14506A9158064N647140f328344c036827a39703j8612151H218650M0930464A8843363
$$ 19158064 24805204 -6328344 -3036827 -139703 -18751854 8218650 49149114 18843363
14497d528923C3029851A0743658E274797a1256950D723463M6383338k4393718
$$ -4528923 33029851 10743658 5274797 -11256950 4723463 51106801 26713083
14490B6713083J22961j0136377p636058B631997K5228384L10149a243354G909551
$$ 26713083 26836044 16699667 9063609 2631997 27860381 28170530 -1243354 7909551
14481a6114594j1292805K949746j2591237a4567105G384446b4970415P444104
$$ -16114594 -27407399 -24457653 -37048890 -14567105 7384446 -24970415 -17526311
14474a7526311O894687j1092316i476177k4544323l04682I11253b2498484j8436504
$$ -17526311 -10631624 -21723940 -9476177 -34020500 -34325182 911253 -22498484 -40934988
14466d0934988J9490108r795642J3973209B91907a0974997e203401k0554968J882966
$$ -40934988 -21444880 -31240522 -17267313 291907 -10974997 -5203401 -25758369 -23875403
14458b3875403k4923602h139422D251720i895951G874657b8000853c631725q554412
$$ -23875403 -48799005 -8139422 4251720 -9895951 7874657 -28000853 -3631725 -12186137
14450a2186137B228741d973563I838877h071716j7081177m0132859G511843B239000
$$ -12186137 2228741 -4973563 9838877 -8071716 -25152893 -65285752 7511843 2239000
14441c775768k2159501D623994c507212j1870732k419835A7955668b1467896B1026547
$$ -3775768 -25935269 4623994 -3507212 -15377944 -17797779 17955668 -21467896 21026547
14432d7681635e04727j107352F813610j137327b5510108A5682709a3409959l154814
$$ -47681635 -504727 -1612079 6813610 5676283 -25510108 15682709 -13409959 -16564773
14424a6564773Q161160k3457812b933353C166479R664172a4692628m844129A4530685
$$ -16564773 -8403613 -31861425 -2933353 3166479 12830651 -14692628 -19536757 14530685
14415b6510235a980912m757844k3296051l021273a5826903A096670L1981244b9082205
$$ -26510235 -1980912 -6738756 -30034807 -33056080 -15826903 1096670 33077914 -29082205
14406C0710034a7737865k4264406A7948178P449224b0974475n539515a2218411
$$ 30710034 -17737865 -42002271 17948178 25397402 -20974475 -26513990 -12218411
14398b3889875A5152521b5250383L311877p534930E30931a4317154G559736b159908
$$ -23889875 15152521 -25250383 -21938506 -29473436 530931 -14317154 7559736 -2159908
14389i207142c58892k4153267D114301L2402456c0971701g558998k74329j6890440
$$ -9207142 -358892 -24512159 4114301 36516757 -30971701 -7558998 -7833327 -24723767
14381b4723767C879226a287365M49863l4689294A1649567j689757c3144368J4743747
$$ -24723767 3879226 -1287365 -837502 -35526796 11649567 9959810 -33144368 -18400621
14373a8400621G520981Q302944K1989714c777471n53352K73394A7817643J2614195
$$ -18400621 7520981 15823925 37813639 -3777471 -4330823 -4057429 17817643 30431838
14365C0431838g960324k026950B1043399a6139994J333840K833122k1408104Q751275
$$ 30431838 -7960324 -9987274 21043399 -16139994 -14806154 -11973032 -33381136 -24629861
14357b4629861B2969759a2791634j9809113J4379409I881195a8799002j8624455
$$ -24629861 22969759 -12791634 -32600747 -18221338 9881195 -18799002 -37423457
14350c7423457G451276e8190581b7074m7579476C14348K2227236j0898695p14114
$$ -37423457 7451276 -58190581 -27074 -47606550 314348 22541584 11642889 10928775
14342A0928775i744804c015434j9986297e514286j6320149J175306Q471263e87107
$$ 10928775 -9744804 -3015434 -23001731 -5514286 -21834435 -20659129 -12187866 -587107
14333f208095k1718548k2301824B7704735a2682410A6715512c1938013o282434
$$ -6208095 -27926643 -50228467 27704735 -12682410 16715512 -31938013 -38220447
14326c8220447C371782J2173086a5884651o900960A943558o45803a2396750e333291
$$ -38220447 3371782 15544868 -15884651 -22785611 1943558 1297755 -12396750 -5333291
14317h909097o692863O366149c792469k5752584i03560A7468208e574815A9775092
$$ -8909097 -15601960 -9235811 -3792469 -29545053 -903560 17468208 -5574815 19775092
14308b6855861F23857J3440993b5812818D0751900b3186387A2225262e6508550
$$ -26855861 623857 14064850 -25812818 40751900 -23186387 12225262 -56508550
14300B478724O401255c864801n7235893c816753D093165d2462023a9725069A2922674
$$ 2478724 8879979 -3864801 -61100694 -3816753 4093165 -42462023 -19725069 12922674
14291A5605614c69899p2491921a4524416A1981628E757383A294212e8611193a3076331
$$ 15605614 -369899 -72861820 -14524416 11981628 5757383 1294212 -58611193 -13076331
14282C1180978e662851J111670C4286569f989422H171202J3621084B604737K9566892
$$ 31180978 -5662851 -4551181 34286569 -6989422 8171202 21792286 2604737 32171629
14274C2171629d3336066J4809182J0071866l9962963B035543c1176836E351073
$$ 32171629 -43336066 -28526884 -18455018 -58417981 2035543 -31176836 5351073
14266H442849a3936305A6022445B794702K8413054c6833874a1412882j3225973
$$ 8442849 -13936305 16022445 2794702 31207756 -36833874 -11412882 -24638855
14259b4638855A1503393k899033e252200k7842411B288184J0999999f2605806
$$ -24638855 11503393 8604360 -5252200 -33094611 2288184 13288183 -62605806
14251b8256826Q139469k0625647P684016k4156323K2897378N84985l7170617a7590649
$$ -28256826 -20117357 -40743004 -33058988 -57215311 -34317933 -33732948 -70903565 -17590649
14242f0819845q933984i109359C216932d8807423N473921e92250m5300255L238829
$$ -60819845 -69753829 -9109359 3216932 -48807423 -43333502 -592250 -45892505 -42653676
14234d2653676L550803j9300002K1496765m623185k4419954k3693589K2630774
$$ -42653676 -39102873 -58402875 -36906110 -41529295 -65949249 -89642838 -67012064
14227f7012064J6603931J0356867q4985135M0219888k998515r4159407l2114191
$$ -67012064 -50408133 -40051266 -125036401 -84816513 -87815028 -181974435 -214088626
14220b14088626L5206448k6014109k6905485r7711825K6253211o4632512N1909308
$$ -214088626 -178882178 -204896287 -231801772 -329513597 -303260386 -367892898 -315983590
14213c15983590M4601745J1395693M627087m6527170k3985825J14201866g4730557
$$ -315983590 -271381845 -259986152 -255359065 -301886235 -325872060 -211670194 -74730557
14205A2390321J00191478K9582785j8498873K7630254L6543639J3520872M2293681
$$ 12390321 112581799 142164584 123665711 151295965 187839604 201360476 243654157
14198B43654157l0520277K8120659j2040771j9651613q2200357k493912D9033251
$$ 243654157 213133880 241254539 229213768 209562155 127361798 124867886 49033251
14190C6354954G477614Q0548304l8622473k2601118J4424202C849313N3500217
$$ 36354954 7477614 88025918 49403445 26802327 41226529 3849313 57349530
14183E7349530k5374934j5773522K2759030B042478L8122451j5184381a1314778
$$ 57349530 31974596 16201074 38960104 2042478 40164929 24980548 -11314778
14175G0979016B7446317p499578p397987b0052057D2783090b5397461C1200591
$$ 70979016 27446317 19946739 12548752 -20052057 42783090 -25397461 31200591
14167B6955659j2434609a437557A524087K4017917a8179504G3918859C3055628
$$ 26955659 14521050 -1437557 1524087 25542004 -18179504 73918859 33055628
14159A6129201J4229808J1473748n584725A3716272g552483A71866K6775087N794573
$$ 16129201 30359009 41832757 36248032 13716272 -7552483 171866 26946953 32741526
14151C2741526N941849I743481J5757029h412833E027506a2743692B7758953K142053
$$ 32741526 38683375 9743481 25500510 -8412833 5027506 -12743692 27758953 29901006
14143B9901006B921856f256101B6410812n627190c184122B4781481a5978565F842829
$$ 29901006 2921856 -6256101 26410812 20783622 -3184122 24781481 -15978565 6842829
14134G48616R918807a3097016G206943R540872B398731J0995043N153733b3025687
$$ 748616 10667423 -13097016 7206943 16747815 2398731 13393774 18547507 -23025687
14125a7988989d798944n322180e52494A1356302D248654J7401704H847382L141726
$$ -17988989 -4798944 -10121124 -552494 11356302 4248654 21650358 8847382 11989108
14117A1989108C98051J6734214a02525A5201181L6018402M667390A5432615L9772713
$$ 11989108 398051 17132265 -102525 15201181 51219583 55886973 15432615 55205328
14109E5205328A888124i257466A9007060R373902r483747b86259E332874J8519335
$$ 55205328 1888124 -9257466 19007060 28380962 18897215 -286259 5332874 23852209
14101B3852209g240004B1929835K3662288j5983383d845312A7667471F484744
$$ 23852209 -7240004 21929835 45592123 29608740 -4845312 17667471 6484744
14093A1742819a6472405e357225j3046317r384044P758372I074348J1632029K6249471
$$ 11742819 -16472405 -5357225 -18403542 -27787586 -20029214 9074348 20706377 46955848
14085D6955848g670531D4778504a5936299C622156b87830C6863078j4830289c1383904
$$ 46955848 -7670531 44778504 -15936299 3622156 -287830 36863078 22032789 -31383904
14076C217333a6808673j0922941A3982343R127642a5744729A7473186a8315689
$$ 3217333 -16808673 -27731614 13982343 23109985 -15744729 17473186 -18315689
14068B2311872F446779b4132283B981489J3541255n875583J4353480c5815306
$$ 22311872 6446779 -24132283 2981489 16522744 10647161 25000641 -35815306
14060a408598N35596H379857b7517537D1862777q261789A433194M2448108a2073333
$$ -1408598 -873002 8379857 -27517537 41862777 33600988 1433194 43881302 -12073333
14051F967269J4920615k602324p840202K921240K4880961h907558L646965B4603971
$$ 6967269 21887884 19285560 11445358 14366598 39247559 -8907558 -5260593 24603971
14042A595232M1039235j408515i45081j2914094A0271020m519444r53356j711290
$$ 1595232 42634467 41225952 -945081 -13859175 10271020 5751576 4798220 3086930
14034C086930G53862K6947203I190726a5411534B0754759h92676C4859901f163763
$$ 3086930 753862 27701065 9190726 -15411534 20754759 -892676 34859901 -6163763
14025E059726L1340879j3043809b491410B85675a0343203B9795701H972235J2607018
$$ 5059726 36400605 23356796 -2491410 285675 -10343203 29795701 8972235 21579253
14017B1579253B446621M6908972j8226575F80752K075953K386223f487927j4547300
$$ 21579253 2446621 49355593 31129018 680752 2756705 5142928 -6487927 -21035227
14009b1035227A5411292a1057740A172141a15165D7396104j9037352M546047G560364
$$ -21035227 15411292 -11057740 1172141 -115165 47396104 28358752 32904799 7560364
14000h938488a099327l079870A283558a7025845k85364B4559491K6268010A4030742
$$ -8938488 -1099327 -4179197 1283558 -17025845 -17311209 24559491 50827501 14030742
13991h485584A5033248C563130K798864Q082231K9980998A2717827b1239525D466304
$$ -8485584 15033248 3563130 6361994 14444225 44425223 12717827 -21239525 4466304
13982I063331a0457417C7884970n691194j3107277A898281L3244462j1481886
$$ 9063331 -10457417 37884970 32193776 19086499 1898281 35142743 23660857
13975B3660857A1424827m801972P948781F89877K124769O799797l3730P698774
$$ 23660857 11424827 6622855 14571636 689877 2814646 9614443 9580713 17279487
13967A7279487d4115218B546948a3518378l255080k0650696C2381477A2672751
$$ 17279487 -44115218 2546948 -13518378 -16773458 -37424154 32381477 12672751
13959B8730492f497364l379144j144422c990259A3587825H72296J8189288b2594300
$$ 28730492 -6497364 -9876508 -11020930 -3990259 13587825 872296 19061584 -22594300
13950A6686435k460248k917546K9816289C666437L0290853j4553107g968115q093222
$$ 16686435 14226187 11308641 41124930 3666437 33957290 19404183 -7968115 -16061337
13942a6061337C2993352A5898428h727612c563219j5077147D4083944j9223279
$$ -16061337 32993352 15898428 -8727612 -3563219 -18640366 44083944 24860665
13935B4860665g383383d76404A0296892B834727K1423610b9503230C6900443b847186
$$ 24860665 -7383383 -476404 10296892 2834727 24258337 -29503230 36900443 -2847186
13926c4190350C4483214g020773k6220795b680691B642450J3280639g492685m2714458
$$ -34190350 34483214 -7020773 -33241568 -2680691 2642450 15923089 -7492685 -50207143
13918e0207143A5065525D048557b0115972I040189K0874240a7524939n257640
$$ -50207143 15065525 4048557 -20115972 9040189 29914429 -17524939 -22782579
13911b2782579p398863B2954271j0826861K5366668g675949C1335735f3194340
$$ -22782579 -30181442 22954271 12127410 37494078 -7675949 31335735 -63194340
13903b6403044B2659246i87704n750411A4969735a7369276j7070352R919314A3028726
$$ -26403044 22659246 -987704 -6738115 14969735 -17369276 -34439628 -24520314 13028726
13894A2589852B299622c609488l2353405p96034A4619735a1877674b900627k2306871
$$ 12589852 2299622 -3609488 -35962893 -36758927 14619735 -11877674 -2900627 -25207498
13886b5207498a22954j94664C9688837g942711o191253H11851R243197c6066996
$$ -25207498 -122954 -317618 39688837 -7942711 -14133964 811851 10055048 -36066996
13877b0137165B1222181d1462931K0361510Q863147J075403d27445p102305j0190085
$$ -20137165 21222181 -41462931 -21101421 -12238274 -11162871 -427445 -7529750 -17719835
13869a7719835A1230427Q518556c0488174j2649294a1517933H563169A39299c2431177
$$ -17719835 11230427 19748983 -30488174 -43137468 -11517933 8563169 139299 -32431177
13860c6723287D1398551G489241b1276564A2661009b0716240n992033b411763
$$ -36723287 41398551 7489241 -21276564 12661009 -20716240 -26708273 -2411763
13852F707928b0598090c218500r497987C2754716c229220k1490556J037325n420623
$$ 6707928 -20598090 -3218500 -12716487 32754716 -3229220 -24719776 -23682451 -29103074
13844b9103074j4995714f605201k8706925k45850i137966B8196149L835008E628174
$$ -29103074 -44098788 -6605201 -35312126 -35557976 -9137966 28196149 32031157 5628174
13835F450825A308153n3726a7787818H83980h98257m692497l0357354A8570630
$$ 6450825 1308153 1254427 -17787818 883980 -898257 -5590754 -35948108 18570630
13826A0916746E155065b0816006E388970J0019027D260183j933014c6220392B9661974
$$ 10916746 5155065 -20816006 5388970 15407997 4260183 2327169 -36220392 29661974
13817B9760746b1683559C6026964b0224624J928686A8504546d5580799I305372
$$ 29760746 -21683559 36026964 -20224624 -18295938 18504546 -45580799 9305372
13809a0761737L769858j7701644A5106012M430158e569711j1562365j5121379
$$ -10761737 -6991879 -24693523 15106012 19536170 -5569711 -17132076 -32253455
13802c2253455a1406406B1412201Q963915i273502E9847M8332026j5023392a2694882
$$ -32253455 -11406406 21412201 30376116 -9273502 59847 48391873 33368481 -12694882
13793b7629715e671570r953256H530419M724951J2710044c6569878B2144994q242413
$$ -27629715 -5671570 -15624826 8530419 13255370 25965414 -36569878 22144994 13902581
13785A3902581J668024G475539M8841667d0938396F532969b519734o030567p885284
$$ 13902581 15570605 7475539 56317206 -40938396 6532969 -2519734 -8550301 -16435585
13777a6435585j4494071E2810728A4853867n459815g19157p58484C143539f603997
$$ -16435585 -30929656 52810728 14853867 9394052 -719157 -1477641 3143539 -6603997
13768B45885J0927652b8396118A5477258C783026h49738k7174499d717254B2959863
$$ 245885 11173537 -28396118 15477258 3783026 -849738 -28024237 -4717254 22959863
13759b7175093B2416500b8437330a2246544A9126062C93698K0143999a7950459
$$ -27175093 22416500 -28437330 -12246544 19126062 393698 20537697 -17950459
13751i815166D375047L428645a2025648C5613580r118127M473959b5961115R111867
$$ -9815166 4375047 7803692 -12025648 35613580 26495453 30969412 -25961115 -16849248
13743a6849248K386775A0283915c140659B323665R414406n78531a3792320j8309141
$$ -16849248 -14462473 10283915 -3140659 2323665 11738071 11159540 -13792320 -32101461
13735c2101461A9722427m713289J6946302a1027803j5031084B2311200b2544348
$$ -32101461 19722427 15009138 31955440 -11027803 -26058887 22311200 -22544348
13727a8327317A0988609c2511509J6117108J842145n136306A9382195a3749590
$$ -18327317 10988609 -32511509 -16394401 -14552256 -19688562 19382195 -13749590
13719B4334943b1077158A3575164c6581666e656991B7274003J3508783j0813810
$$ 24334943 -21077158 13575164 -36581666 -5656991 27274003 40782786 29968976
13712B9968976c6189539D883885L159973b1857508C497279c1033553J2315486
$$ 29968976 -36189539 4883885 8043858 -21857508 3497279 -31033553 -18718067
13705a8718067c815736j9271857A593054c5563535r071923A7480120G387026i008748
$$ -18718067 -3815736 -23087593 1593054 -35563535 -44635458 17480120 7387026 -9008748
13696a7192700J096138F737717N920385d8269515I507235B727692J2977589c727827
$$ -17192700 -16096562 6737717 12658102 -48269515 9507235 2727692 15705281 -3727827
13687d5149688M861161R053858f718454r162672g70432o390265H630159a4707434
$$ -45149688 -40288527 -31234669 -6718454 -15881126 -770432 -7160697 8630159 -14707434
13678d6961526A2691355a5327755A9975441f5316285a1698607m6600408c166202
$$ -46961526 12691355 -15327755 19975441 -65316285 -11698607 -58299015 -3166202
13670D9664358I435819c9164357i791905K723626C3724122c2664586M424444D6015090
$$ 49664358 9435819 -39164357 -9791905 -7068279 33724122 -32664586 -28240142 46015090
13661B6841139c4881956H020214A189689b3657562B9860325c2385705L110885
$$ 26841139 -34881956 8020214 1189689 -23657562 29860325 -32385705 -29274820
13654b9274820B5220014e77431A950694R071236j680281o14129N0831a0543856
$$ -29274820 25220014 -577431 1950694 11021930 9341649 8727520 8778351 -10543856
13645c9547483C5528409C886796J975308b5884437f71867J30486q981593A9447448
$$ -39547483 35528409 3886796 5862104 -25884437 -671867 -541381 -9522974 19447448
13636E86309b2374766A7518689L6968406b2531925B226216L2535651a8522870
$$ 586309 -22374766 17518689 54487095 -22531925 2226216 34761867 -18522870
13628A6512166d7150806a9570824P549353n518700k8167592b2195037F068807
$$ 16512166 -47150806 -19570824 -12021471 -17540171 -45707763 -22195037 6068807
13620a7842161A974301O057947L7469036b9677631B5137980e37526E528328a169826
$$ -17842161 1974301 8032248 45501284 -29677631 25137980 -537526 5528328 -1169826
13611A1360804Q247535f119531j0168226N881708A8943694m387805b3876576k748855
$$ 11360804 19608339 -6119531 -16287757 -10406049 18943694 14555889 -23876576 -26625431
13603b6625431B7116037b923965a391742j014454k9673864E543922J3585870K034257
$$ -26625431 27116037 -2923965 -1391742 -2406196 -32080060 5543922 19129792 21164049
13595B1164049c5491310J6551557k3145142C4872793b5493405j4128883C6790815
$$ 21164049 -35491310 -18939753 -42084895 34872793 -25493405 -39622288 36790815
13587B0363472b0059813D0782733a4291555H226251M581252J1344257b3309554
$$ 20363472 -20059813 40782733 -14291555 8226251 12807503 24151760 -23309554
13579c0686557J3531555I771962K2185093F383807A22816a3224571D5656826b773757
$$ -30686557 -17155002 9771962 31957055 6383807 122816 -13224571 45656826 -2773757
13570A5544526J4320699a2163975B4036820R301809Q080029e7135465B3408295
$$ 15544526 29865225 -12163975 24036820 33338629 41418658 -57135465 23408295
13562B0564244a8895056O806035m319129B0078623p121926R191075a4529858k2939976
$$ 20564244 -18895056 -12089021 -16408150 20078623 12956697 22147772 -14529858 -37469834
13554c7469834a8055303J975207j1983945A366669R914550d2262911B5139644
$$ -37469834 -18055303 -16080096 -28064041 1366669 11281219 -42262911 25139644
13546A5176735a4536566B1828372e997480p8485A5241628b5552170a2567713D889669
$$ 15176735 -14536566 21828372 -5997480 -6075965 15241628 -25552170 -12567713 4889669
13537A1621158K0358935a1567219j5414205J0456769o958500m730187B1531211
$$ 11621158 31980093 -11567219 -26981424 -16524655 -23483155 -28213342 21531211
13529b2180469L86896o863701e512849F4996693d4153026i072115k2865189B3597372
$$ -22180469 -21793573 -28657274 -5512849 64996693 -44153026 -9072115 -31937304 23597372
13520e857679j7597432E83832K1279810c992092j881379O56614l1209860L988985
$$ -5857679 -23455111 583832 21863642 -3992092 -5873471 -5216857 -36426717 -32437732
13512c2437732I51669J3344449a2411126B2454779c118971F776717B077167J7985047
$$ -32437732 951669 14296118 -12411126 22454779 -3118971 6776717 2077167 20062214
13504B0062214P057416j3437458a9822795A2685987d4474978I714061g501101
$$ 20062214 27119630 13682172 -19822795 12685987 -44474978 9714061 -7501101
13496c6877691i187860j1763474g984198J905350l9160464b807043C264656j606495
$$ -36877691 -9187860 -20951334 -7984198 -6078848 -45239312 -2807043 3264656 1658161
13488A658161K2357411d0581158B1495377p608198c1903499A5202876b790601
$$ 1658161 24015572 -40581158 21495377 13887179 -31903499 15202876 -2790601
13480a2662217e852382j2204208C6826310a9267320B8513857n915980B033157
$$ -12662217 -5852382 -18056590 36826310 -19267320 28513857 22597877 2033157
13472c257387j211019b032971k2812559i510887D2260116A0772916J5791832I602683
$$ -3257387 -4468406 -2032971 -24845530 -9510887 42260116 10772916 26564748 9602683
13463a7640017P819977m625713I297385a6514561F986495f9899582e295513B03699
$$ -17640017 -9820040 -14445753 9297385 -16514561 6986495 -69899582 -5295513 203699
13454c114478q497192A2676241j039387c0781821B822733J7911889B110997d6081751
$$ -3114478 -11611670 12676241 11636854 -30781821 2822733 20734622 2110997 -46081751
13445F329369Q913675J6970924c280766A9847299h109368C945505b556178D865280
$$ 6329369 15243044 32213968 -3280766 19847299 -8109368 3945505 -2556178 4865280
13436b7360895o19310O796259Q086242E835292L007655A765359J0124507a2296771
$$ -27360895 -27980205 -21183946 -13097704 5835292 8842947 1765359 11889866 -12296771
13427D3234956d4428495i003876L212181j8417271A9611916b4265015D362794
$$ 43234956 -44428495 -9003876 -5791695 -24208966 19611916 -24265015 4362794
13419A2858334c9998474C7227567G048993B393632O050561J0230579F058317a4733307
$$ 12858334 -39998474 37227567 7048993 2393632 8444193 18674772 6058317 -14733307
13410A9055017p770263e330646m2584982E8569776g427900A9967257L2081162
$$ 19055017 11284754 -5330646 -47915628 58569776 -7427900 19967257 52048419
13403E2048419a8187117B8020826b8560072g436465n782011j3809885e535458
$$ 52048419 -18187117 28020826 -28560072 -7436465 -13218476 -27028361 -5535458
13395I595166g624925j5154090i434116D0643514j7965385E415509J0594640a7182025
$$ 9595166 -7624925 -22779015 -9434116 40643514 22678129 5415509 16010149 -17182025
13386A2810153B36514b6622398L416397e418181A7581063a7262275c678175m040300
$$ 12810153 236514 -26622398 -23206001 -5418181 17581063 -17262275 -3678175 -7718475
13378g718475j081860D891617c2382428J1310555A1985576d632783E436402a4170612
$$ -7718475 -8800335 4891617 -32382428 -21071873 11985576 -4632783 5436402 -14170612
13369B2325807a1976546C4174568A2038755b50133j9159467j3825601I578572
$$ 22325807 -11976546 34174568 12038755 -250133 -19409600 -33235201 9578572
13361b0425720E2852234d2097534a565951B0472059C567687N196361d6203948
$$ -20425720 52852234 -42097534 -1565951 20472059 3567687 8764048 -46203948
13353b6655525D0763641A590318h76281A9109609O321295C433506a789677k9882367
$$ -26655525 40763641 1590318 -876281 19109609 25430904 3433506 -1789677 -31672044
13345c1672044a5732438C8985552j8498752f0088582c966677A8493449J9738561
$$ -31672044 -15732438 38985552 20486800 -60088582 -3966677 18493449 38232010
13338C8232010a7912192j2347096H467038O959878a3974536J240530F106264L40164
$$ 38232010 -17912192 -30259288 8467038 15426916 -13974536 -12734006 6106264 6446428
13330F446428R548794J0146958b1841246O284950Q11856A5170675F709454b7583010
$$ 6446428 15995222 26142180 -21841246 -15556296 -14744440 15170675 6709454 -27583010
13321A3026928a4974215B6346749J2627506F020307M7123513I28535b1179728
$$ 13026928 -14974215 26346749 38974255 6020307 53143820 928535 -21179728
13313a3066214b427615A0774224P542557H060800K9820649a9645263O541733A8047962
$$ -13066214 -2427615 10774224 18316781 8060800 37881449 -19645263 -13103530 18047962
13304a395931D5485540G957137c3552389a3998210j798080J822034k1904891b079156
$$ -1395931 45485540 7957137 -33552389 -13998210 -15796290 -13974256 -35879147 -2079156
13295C1009605f360367A6631706a297724n44626k0986273A4647260a6888003A8965030
$$ 31009605 -6360367 16631706 -1297724 -1842350 -22828623 14647260 -16888003 18965030
13286i157713A5112006d892030A571991b6117543a2445428k6615580I327630K4684916
$$ -9157713 15112006 -4892030 1571991 -26117543 -12445428 -39061008 9327630 34012546
13278C4012546a2283264k9808533A4489293B519098K5564308b131845A9221039
$$ 34012546 -12283264 -42091797 14489293 2519098 28083406 -2131845 19221039
13270b0233182B4608826q857886e8894284a3526656m6038656A2759355D77321
$$ -20233182 24608826 15750940 -58894284 -13526656 -59565312 12759355 477321
13262B4701262B524482a9506028b268094k8189948C263718K7838056a1490341
$$ 24701262 2524482 -19506028 -2268094 -30458042 3263718 31101774 -11490341
13254A0308228c5029999C1573544i975776B5028414a6735773J310183b532706
$$ 10308228 -35029999 31573544 -9975776 25028414 -16735773 -15425590 -2532706
13246H475936h274110l832075B5484696e382510q641470J24819d918651j7589524
$$ 8475936 -8274110 -12106185 25484696 -5382510 -14023980 -13899161 -4918651 -22508175
13238b2508175j994289A4237306f178233q256195k3710803a1632790A2440163
$$ -22508175 -24502464 14237306 -6178233 -14434428 -38145231 -11632790 12440163
13230D293212P051503K7099490A8408713K9455986a277560j7993894A959501M4748606
$$ 4293212 11344715 38444205 18408713 47864699 -1277560 -19271454 1959501 46708107
13222D6708107c6548672h924027a689645j6369398k301117C1879732a662783k1028315
$$ 46708107 -36548672 -8924027 -1689645 -18059043 -20360160 31879732 -1662783 -22691098
13214b2691098A613280J9271435F311961a7951420H883807J8715892d3244264
$$ -22691098 1613280 20884715 6311961 -17951420 8883807 27599699 -43244264
13206A6329305h940755p209410E2255620k5534031a5364285o416619Q396667H217532
$$ 16329305 -8940755 -16150165 52255620 26721589 -15364285 -21780904 -13384237 8217532
13197b9365822B0247612o881616i106665D746364a6989641r39194b366478A1949863
$$ -29365822 20247612 13365996 -9106665 4746364 -16989641 -17928835 -2366478 11949863
13188a1675170j574573N686142l7532589D8572571C692671Q123855O973800B796897
$$ -11675170 -13249743 -7563601 -45096190 48572571 3692671 11816526 18790326 2796897
13179a324925k6280276m277771a2304512I323721d7524749a5475665f938331j3089236
$$ -1324925 -27605201 -31882972 -12304512 9323721 -47524749 -15475665 -6938331 -20027567
13171b0027567b717815k2965093M9644A3518696O606394J7464862c876909D937684
$$ -20027567 -2717815 -25682908 -25633264 13518696 20125090 37589952 -3876909 4937684
13162a7659977A7043054k716235M3551130k8715007c865143A5034481O886387
$$ -17659977 17043054 14326819 57877949 29162942 -3865143 15034481 21920868
13155B1920868a3501686A0480873a747248p457714I125328d068891l4696183k7809190
$$ 21920868 -13501686 10480873 -1747248 -9204962 9125328 -4068891 -38765074 -66574264
13147f6574264a4572381p545830h483808j6310405j0599164j2133859A492352
$$ -66574264 -14572381 -22118211 -8483808 -24794213 -35393377 -47527236 1492352
13139b1957843E366299h121888A3001212d177199A2225600Q171446N8620H355988
$$ -21957843 5366299 -8121888 13001212 -4177199 12225600 20397046 20455666 8355988
13130E686146c2864963k083022b835590B2225373r707383c9648425a9397153e484071
$$ 5686146 -32864963 -34947985 -2835590 22225373 12517990 -39648425 -19397153 -5484071
13121B2279178B984664M7912638b5134908A3628413L7852874C212260Q21013Q643938
$$ 22279178 2984664 50897302 -25134908 13628413 51481287 3212260 4033273 12677211
13113A2677211b1280910j0998884A7905214e322471F336475h797459C0853618
$$ 12677211 -21280910 -32279794 17905214 -5322471 6336475 -8797459 30853618
13105f172566C2309800b5221484j455978A4357411h341948B2979348J126649F950046
$$ -6172566 32309800 -25221484 -26677462 14357411 -8341948 22979348 24105997 6950046
13096C1152844o837364R683562d3383837a4354082b645262A5337398a4767973
$$ 31152844 24315480 33999042 -43383837 -14354082 -2645262 15337398 -14767973
13088B715548J6869311b37238B0544597a4019112B2543460C805918c541963B4929288
$$ 2715548 19584859 -237238 20544597 -14019112 22543460 3805918 -3541963 24929288
13079D101833a1878782n041810l698410J600596n593853c526642m617135J295086
$$ 4101833 -11878782 -16920592 -20619002 -19018406 -24612259 -3526642 -8143777 -6848691
13071f848691j1858504P017998M787368m70429D0510540b3931525g625275l3922855
$$ -6848691 -18707195 -11689197 -6901829 -7372258 40510540 -23931525 -7625275 -41548130
13063d1548130C3672287b2708868g9398k704858j1588813d576958B4403695g398813
$$ -41548130 33672287 -22708868 -79398 -2784256 -14373069 -4576958 24403695 -7398813
13054A2060772f465524q029827c526800r627803A9119433L9887056B6443081m351882
$$ 12060772 -6465524 -14495351 -3526800 -13154603 19119433 59006489 26443081 22091199
13046B2091199c6476596A1109750c4726322C4562122J423565J5258338j2138952
$$ 22091199 -36476596 11109750 -34726322 34562122 35985687 51244025 39105073
13039C9105073a2000495B1626165a5481826G867693a566614l8311482D0058659
$$ 39105073 -12000495 21626165 -15481826 7867693 -1566614 -39878096 40058659
13031d470628q001836I495869D700051h430797j8628461J1082680e511993j0391322
$$ -4470628 -12472464 9495869 4700051 -8430797 -27059258 -15976578 -5511993 -15903315
13023a5903315l8461991b5927610D003413b7918577A032350K579751M342798f946691
$$ -15903315 -54365306 -25927610 4003413 -27918577 1032350 3612101 7954899 -6946691
13014a111355B0291611E19636b7589624a2325706q099307A0859013a4499944l0810678
$$ -1111355 20291611 519636 -27589624 -12325706 -20425013 10859013 -14499944 -45310622
13006d5310622J6574149J2591119q888207J2071165C6635747h859073A5751557
$$ -45310622 -28736473 -16145354 -25033561 -12962396 36635747 -8859073 15751557
12998b1712156g806501k5086254F252251a9028296P083062b151987j0338707G250083
$$ -21712156 -7806501 -32892755 6252251 -19028296 -11945234 -2151987 -12490694 7250083
12989a9552727D116000P820070M4114231a3090869A451600J3883996Q09381b3719626
$$ -19552727 4116000 11936070 56050301 -13090869 1451600 15335596 16144977 -23719626
12980e461378A4882845a067326A6966605a9678965B2923748d2787768B1196049
$$ -5461378 14882845 -1067326 16966605 -19678965 22923748 -42787768 21196049
12972A887J866695a2663596B0848660A676670d4605141b1101307D4036273j8611386
$$ 1887 1868582 -12663596 20848660 1676670 -44605141 -21101307 44036273 25424887
12964B5424887J2888618h3456m2890970a442340p35919O13873A7987622M043282
$$ 25424887 38313505 -83456 -42974426 -1442340 -2178259 -1564386 17987622 22030904
12956B2030904i632116k0717817a5132199k3768262a6511214P871719o499409
$$ 22030904 -9632116 -30349933 -15132199 -38900461 -16511214 -8639495 -15138904
12949a5138904B6706530c5406773a1438022I085039l777666b0657677H561636
$$ -15138904 26706530 -35406773 -11438022 9085039 5307373 -20657677 8561636
12941b8003072G507556K0749569n069696D5768a9569023k1921597A6310108a2783088
$$ -28003072 7507556 28257125 23187429 45768 -19569023 -41490620 16310108 -12783088
12932C322380J0518860b7750247B7239906b003409G915582c2689280E310163R00771
$$ 3322380 13841240 -27750247 27239906 -2003409 7915582 -32689280 5310163 6210934
12924F210934c942091m483920k7032477M034618H534862d0016172a6090991a151472
$$ 6210934 -3942091 -8426011 -35458488 -31423870 8534862 -40016172 -16090991 -1151472
12915A2825633b3818773c054418a091908j5278995g948372k7992358a1922910
$$ 12825633 -23818773 -3054418 -1091908 -16370903 -7948372 -35940730 -11922910
12907A722620a8510244g107786B7353972I510489b5418390G524773a3691937A539181
$$ 1722620 -18510244 -7107786 27353972 9510489 -25418390 7524773 -13691937 1539181
12898b0522547D8084238c7279373b909205A4200477E154441N419113a4263515
$$ -20522547 48084238 -37279373 -2909205 14200477 5154441 10573554 -14263515
12890B5795784c4673351A3149046g275495I195232K4645801J0743233g119934
$$ 25795784 -34673351 13149046 -7275495 9195232 33841033 44584266 -7119934
12882A7322370b5699678O886617j1498803a3436846K827160C264376b4926259
$$ 17322370 -25699678 -18813061 -30311864 -13436846 -10609686 3264376 -24926259
12874D9065431a4496434E172030a0990036M307670j9547280g52389B1147148o815200
$$ 49065431 -14496434 5172030 -10990036 -6682366 -26229646 -752389 21147148 14331948
12866A4331948j426123f509739k877875A8174565a55374l5015385a2894732a833092
$$ 14331948 12905825 -6509739 -9387614 18174565 -155374 -35170759 -12894732 -1833092
12857f9015395D1496375a0292849B0080360r922030b5912983L948518D0936385
$$ -69015395 41496375 -10292849 20080360 10158330 -25912983 -21964465 40936385
12849B0564422C600998Q572133E535480c7528664h930767B4641723I772046R816179
$$ 20564422 3600998 12173131 5535480 -37528664 -8930767 24641723 9772046 19588225
12841A9588225D021369b5790389P251797D007662c107898B1419459r331038J2393367
$$ 19588225 4021369 -25790389 -18538592 4007662 -3107898 21419459 12088421 24481788
12833B4481788d693207E5517116p479805c954749k2960724N216067Q530224F7014438
$$ 24481788 -4693207 55517116 48037311 -3954749 -26915473 -21699406 -13169182 67014438
12824B1597657b6298283a1293691A1610794a811148o09297k7809621i510764C0547723
$$ 21597657 -26298283 -11293691 11610794 -1811148 -2420445 -30230066 -9510764 30547723
12815b5959921j0071965J2748424G496840l523964a7872606g06232k822112H28678
$$ -25959921 -36031886 -23283462 7496840 3972876 -17872606 -706232 -3528344 828678
12806e813815B7899694c509233j6729306j0935922J1631759P56727g085011j4433833
$$ -5813815 27899694 -3509233 -20238539 -31174461 -19542702 -18785975 -7085011 -21518844
12798b1518844m919151A5801983K0505589E500337c0933489A8051339a9062967
$$ -21518844 -26437995 15801983 36307572 5500337 -30933489 18051339 -19062967
12790A5155854f502637k8857629A2536525N046344b4912552K099027b811087l5099269
$$ 15155854 -6502637 -35360266 12536525 17582869 -24912552 -22813525 -2811087 -37910356
12782c7910356c493586j6053672A4843231m034643J0681236c3749716C446213
$$ -37910356 -3493586 -19547258 14843231 10808588 21489824 -33749716 3446213
12774A739427e857180A020784K8282657j0415456b075657B9511929c0204976h472874
$$ 1739427 -5857180 1020784 29303441 18887985 -2075657 29511929 -30204976 -8472874
12765c5584167A5739891o122050e5761211a7910624j6289865a2337399l86891
$$ -35584167 15739891 9617841 -55761211 -17910624 -34200489 -12337399 -12724290
12758a2724290F026629c9320397D2016954G48625c1402135h43689k6138272B3981494
$$ -12724290 6026629 -39320397 42016954 748625 -31402135 -843689 -26981961 23981494
12749b2546948a102042k9505307F344945j477842c329507k4650046A6035484P076176
$$ -22546948 -1102042 -30607349 6344945 4867103 -3329507 -27979553 16035484 23111660
12741B3111660b956488l620842F219457A631494c4075239b606314A6287546C739023
$$ 23111660 -2956488 -6577330 6219457 1631494 -34075239 -2606314 16287546 3739023
12732a2069455B8561580b808937j6370035C6788674a532547A9075876b4440559
$$ -12069455 28561580 -2808937 -19178972 36788674 -1532547 19075876 -24440559
12724b3181870A1495319C441010a0171694j5161370H851258f562140q58751j019227
$$ -23181870 11495319 3441010 -10171694 -25333064 8851258 -6562140 -7420891 -8440118
12716h440118I466059j56831j836995b2611856A5961776e218300F315648J8076645
$$ -8440118 9466059 9309228 7472233 -22611856 15961776 -5218300 6315648 24392293
12708B4392293G612846b2697956J0800398C925008a0915578E844070J2230707
$$ 24392293 7612846 -22697956 -11897558 3925008 -10915578 5844070 18074777
12701A8074777q856412L167090m57282D107515h087181B774701P206969Q322706
$$ 18074777 9218365 12385455 11928173 4107515 -8087181 2774701 9981670 18304376
12693A8304376h806367K452394C0926244a4938781a96172F400381a535192E211726
$$ 18304376 -8806367 -6353973 30926244 -14938781 -196172 6400381 -1535192 5211726
12684H227740c8529040f189671J035013B6206972K7308294c0183558A1946026
$$ 8227740 -38529040 -6189671 -5154658 26206972 53515266 -30183558 11946026
12676E04245J4763632a3315729H396530l441825b056751k9758825J2412759j3505978
$$ 504245 15267877 -13315729 8396530 4954705 -2056751 -31815576 -19402817 -32908795
12668c2908795L363510B2586020p481385G335803a8979996d990946n021952C7229382
$$ -32908795 -29545285 22586020 15104635 7335803 -18979996 -4990946 -10012898 37229382
12659B002871e842274B6954849q567963c0950177a880056m0194911I199461J262322
$$ 2002871 -5842274 26954849 18386886 -30950177 -1880056 -42074967 9199461 10461783
12651A0461783M0331741f593763D7276331I793913a6938617j846391J245682L398683
$$ 10461783 50793524 -6593763 47276331 9793913 -16938617 -18785008 -17539326 -14140643
12643a4140643b820945k6860445R29963A2568325n042465b3109459G103464H71699
$$ -14140643 -2820945 -29681390 -28751427 12568325 7525860 -23109459 7103464 871699
12634A520731c69066j4001714B9114107b0986437A9498645g638769C980249c4290980
$$ 1520731 -369066 -14370780 29114107 -20986437 19498645 -7638769 3980249 -34290980
12625c3646266J0526437M542785J718288B619503a5924766r740719P758496l530980
$$ -33646266 -23119829 -18577044 -16858756 2619503 -15924766 -25665485 -17906989 -21437969
12617b1437969A1037411e776805A0118136A307207e487065B1695738J0580455
$$ -21437969 11037411 -5776805 10118136 1307207 -5487065 21695738 32276193
12610C2276193c8035868a2945906A1517727J252788M964244b3600982A3060931
$$ 32276193 -38035868 -12945906 11517727 12770515 17734759 -23600982 13060931
12602f949891B4448222e2505097A4375506a1818881F517898a1340548M054711
$$ -6949891 24448222 -52505097 14375506 -11818881 6517898 -11340548 -7285837
12595g285837A4389902e5793085J9400679J2755378E980396a4014129B6826008
$$ -7285837 14389902 -55793085 -36392406 -23637028 5980396 -14014129 26826008
12587B796154R094419c717875k397268I247849k715254a2455957n10013k3665946
$$ 2796154 11890573 -3717875 -6115143 9247849 6532595 -12455957 -12965970 -36631916
12579c6631916A7942448c117703R7134C3448814b5601592l68746J414132b913791
$$ -36631916 17942448 -3117703 -3020569 33448814 -25601592 -25970338 -24556206 -2913791
12570A2859130J268752N853729a6944711G398826j36666a7753766B092346c46364
$$ 12859130 14127882 19981611 -16944711 7398826 7262160 -17753766 2092346 -346364
12561a2555303A3639946c8324664Q247733c634228j9646354k303723d224915B6295009
$$ -12555303 13639946 -38324664 -30076931 -3634228 -23280582 -25584305 -4224915 26295009
12552B3791815E758828K6441442J2070322d178480C612397L7165978f582292m326783
$$ 23791815 5758828 32200270 44270592 -4178480 3612397 40778375 -6582292 -10909075
12544a0909075k7238445d32876E838158J6540413a3110176C799323c2232693f432786
$$ -10909075 -38147520 -432876 5838158 22378571 -13110176 3799323 -32232693 -6432786
12535d6119989b1034668i042231C8092307C201934E22208J0277844Q303285I068937
$$ -46119989 -21034668 -9042231 38092307 3201934 522208 10800052 19103337 9068937
12526e831042J679786G261044J0092381a5835225D1950956C620795e5623533B0367276
$$ -5831042 -4151256 7261044 17353425 -15835225 41950956 3620795 -55623533 20367276
12517b0297737A684699a7676238A5879303E34411o5383b0354377C0086133r869799
$$ -20297737 1684699 -17676238 15879303 534411 469028 -20354377 30086133 20216334
12509B0216334M5252142b0627410J723998B3310133E189173J9377499d456497
$$ 20216334 65468476 -20627410 -18903412 23310133 5189173 24566672 -4456497
12501b0595972K313414p385444D710211j962701b23680C9552861A742247a7998492
$$ -20595972 -18282558 -25668002 4710211 2747510 -223680 39552861 1742247 -17998492
12492a3663619B7509479M592997c945641k952806E600338a9680864C2845955h159672
$$ -13663619 27509479 32102476 -3945641 -6898447 5600338 -19680864 32845955 -8159672
12483A3140463d1371115A066681c6770220a1304414j0259892H206901N532777
$$ 13140463 -41371115 1066681 -36770220 -11304414 -21564306 8206901 13739678
12476A3739678Q871517b7558820A6609287m870103O074708e567863C5576804Q037877
$$ 13739678 22611195 -27558820 16609287 11739184 17813892 -5567863 35576804 43614681
12468D3614681A7143122j49956a7812194c097716B992594a2789079c369391B6774486
$$ 43614681 17143122 16993166 -17812194 -3097716 2992594 -12789079 -3369391 26774486
12459A6297669J3619587J2444987b4342814A0430367a1997106o514232b004944
$$ 16297669 29917256 42362243 -24342814 10430367 -11997106 -18511338 -2004944
12451c5323023A4670117e1637339i291879B6071101f054586m9475724B725688
$$ -35323023 14670117 -51637339 -9291879 26071101 -6054586 -55530310 2725688
12443F671103M7409182d3996063J9005110a755252G587820O945581K7410642e234514
$$ 6671103 54080285 -43996063 -24990953 -1755252 7587820 14533401 41944043 -5234514
12434A140424N634141b9349976G414484d553943B7150806A446594K6595847b1177870
$$ 1140424 6774565 -29349976 7414484 -4553943 27150806 1446594 28042441 -21177870
12425A1051594d5033240a4691443C7137447F374896b5681242A7573615p350187
$$ 11051594 -45033240 -14691443 37137447 6374896 -25681242 17573615 10223428
12418A0223428e036798k4269449b702457l0730963P906083E218976I07246c3011116
$$ 10223428 -5036798 -29306247 -2702457 -33433420 -25527337 5218976 907246 -33011116
12409A4830090a9316935B1287171r305211a0054660A2064927A22578d369924A022885
$$ 14830090 -19316935 21287171 11981960 -10054660 12064927 122578 -4369924 1022885
12400B3361520c7951260B524652e239384C084515b3042509B7714598a3894611
$$ 23361520 -37951260 2524652 -5239384 3084515 -23042509 27714598 -13894611
12392d7862349B8759053i007122k258119A9170665a2094900D7989123e691637
$$ -47862349 28759053 -9007122 -11265241 19170665 -12094900 47989123 -5691637
12384B4107910g820990a285637k2973756k2468081b1003361B619103M1976435
$$ 24107910 -7820990 -1285637 -24259393 -46727474 -21003361 2619103 44595538
12377D4595538c0685595A7078890h822799j2521705f161121G609585b8012170
$$ 44595538 -30685595 17078890 -8822799 -21344504 -6161121 7609585 -28012170
12369C393644i047745B8901657a3507914A1605539c0056019j6974262i266032
$$ 3393644 -9047745 28901657 -13507914 11605539 -30056019 -47030281 -9266032
12361B7521940d575611k6670996N507719j4512181L378666f071657r442102P753370
$$ 27521940 -4575611 -31246607 -25738888 -40251069 -36872403 -6071657 -15513759 -7760389
12353g760389F3100J9456731b7308778k137014J3184056j919025j5997866a2072342
$$ -7760389 63100 19519831 -27308778 -29445792 -16261736 -18180761 -34178627 -12072342
12344A1346930R266309b5028270p156466k406418e152857l6714618E460889a098781
$$ 11346930 20613239 -25028270 -32184736 -34591154 -5152857 -41867475 5460889 -1098781
12335B4959710f1078476f490712j1878806I090701a819745A9469491a9637522
$$ 24959710 -61078476 -6490712 -18369518 9090701 -1819745 19469491 -19637522
12327c1861193J2381242P916909G608106Q859565b1096245f033514k297255N94924
$$ -31861193 -19479951 -11563042 7608106 16467671 -21096245 -6033514 -8330769 -7735845
12319g735845p274979g489526j1548677q69811Q823648I934892b2566784D432810
$$ -7735845 -15010824 -7489526 -19038203 -19908014 -11084366 9934892 -22566784 4432810
12310a9098038b965508j5497752A3409785A642741B50100M794838a1277299G933531
$$ -19098038 -2965508 -18463260 13409785 1642741 250100 5044938 -11277299 7933531
12301a510177k2058541A4924343c7438423h283206D7324069B598820b2024349
$$ -1510177 -23568718 14924343 -37438423 -8283206 47324069 2598820 -22024349
12293F763958j595432M6238205f0419644h622081j284874j1436815K652166D432123
$$ 6763958 5168526 51406731 -60419644 -8622081 -9906955 -21343770 -18691604 4432123
12284b553619E2955113B183754L1876310j1995269a455082B6693824b1911764
$$ -2553619 52955113 2183754 34060064 22064795 -1455082 26693824 -21911764
12276D750883J8239637a8430456L616810B568687J482043J3161963d808433j2519026
$$ 4750883 22990520 -18430456 -14813646 2568687 4050730 17212693 -4808433 -17327459
12268a7327459h81137r182355m410056D753636i498070j130683B5455445b6339986
$$ -17327459 -881137 -10063492 -14473548 4753636 -9498070 -10628753 25455445 -26339986
12259a2764264o794528k329777b658445B969643b8141875B6009090a6323298A7767211
$$ -12764264 -19558792 -21888569 -2658445 2969643 -28141875 26009090 -16323298 17767211
12250a8012371e391358a239763j1038108n994534j8122539a5646641l5987472
$$ -18012371 -5391358 -1239763 -12277871 -18272405 -36394944 -15646641 -51634113
12243e1634113b1734797D1139536k570980A7148553C240781M2149532A038700
$$ -51634113 -21734797 41139536 38568556 17148553 3240781 45390313 1038700
12235C851414c0668600J4905098a363713A9382640d1137804a5526448j5231322
$$ 3851414 -30668600 -15763502 -1363713 19382640 -41137804 -15526448 -30757770
12228c0757770J1128973A2094710d7223386I786238C929800e4968131J5306176
$$ -30757770 -19628797 12094710 -47223386 9786238 3929800 -54968131 -39661955
12221c9661955A8077371c5329968a4729895O760537k695146B558550b219465k4119532
$$ -39661955 18077371 -35329968 -14729895 -7969358 -10664504 2558550 -2219465 -26338997
12213b6338997n180250J4157222A3206043b0412949C0264526j2273776b5342709
$$ -26338997 -31519247 -17362025 13206043 -20412949 30264526 17990750 -25342709
12205B1122112I305176L4178268j2640229d0010818a6782522B2135398H005792
$$ 21122112 9305176 43483444 30843215 -40010818 -16782522 22135398 8005792
12197A0104836l366015c800277D4118850b2475803P827254O736155c747703q616519
$$ 10104836 6738821 -3800277 44118850 -22475803 -14648549 -7912394 -3747703 -12364222
12189a2364222C566540O199414b4452402d861176I338158b5177383A6637373b5852568
$$ -12364222 3566540 9765954 -24452402 -4861176 9338158 -25177383 16637373 -25852568
12180c6137404M345503a5530735C7362136e606735B8326379f854809q120246j7848440
$$ -36137404 -31791901 -15530735 37362136 -5606735 28326379 -6854809 -14975055 -32823495
12172c2823495H330775P586262b5331877B3209113c2061494n275247a7876605
$$ -32823495 8330775 15917037 -25331877 23209113 -32061494 -37336741 -17876605
12164H558964a32678C2697875b1471342k3212082A946462K4475332a1587396A4086920
$$ 8558964 -132678 32697875 -21471342 -44683424 1946462 26421794 -11587396 14086920
12155a7177345j0270622B3351957b153998j1541901C1133618c1335454o72167
$$ -17177345 -27447967 23351957 -2153998 -13695899 31133618 -31335454 -32007621
12148c2007621a2929170E467481b2338676g512274j8123054A8362678b081290
$$ -32007621 -12929170 5467481 -22338676 -7512274 -25635328 18362678 -2081290
12140f124583A4733426G276002M162913m818419J7725854b7209061e483966r538850
$$ -6124583 14733426 7276002 11438915 6620496 24346350 -27209061 -5483966 -15022816
12132a5022816C55034a5256035A0128551C896685N404498b3121049F926792M3779946
$$ -15022816 355034 -15256035 10128551 3896685 9301183 -23121049 6926792 50706738
12124E0706738A26001M692992i985285E456311e053332A9095461g665817b828733
$$ 50706738 126001 4818993 -9985285 5456311 -5053332 19095461 -7665817 -2828733
12115A4290722c707764A0030174P804222a1433519o598037K930345l774425h608071
$$ 14290722 -3707764 10030174 17834396 -11433519 -18031556 -15101211 -18875636 -8608071
12106B6105881B863000f9319A0034832h383185A1078985c371985B2958216b0253152
$$ 26105881 2863000 -69319 10034832 -8383185 11078985 -3371985 22958216 -20253152
12097A1241783c4236263b156897C0009278a0361910H848474P492869O768404B62432
$$ 11241783 -34236263 -2156897 30009278 -10361910 8848474 16341343 23109747 262432
12088F481300A60671K3933420m987447B125813a4789377F860852h865976r051560
$$ 6481300 160671 24094091 19106644 2125813 -14789377 6860852 -8865976 -17917536
12080a7917536C8113637E047888d3981251E746K8880627n237871b8800885A5618904
$$ -17917536 38113637 5047888 -43981251 5746 28886373 23648502 -28800885 15618904
12071f647864B3925921b561725l7882583B7436466f663084k2406725g669378k9236328
$$ -6647864 23925921 -2561725 -40444308 27436466 -6663084 -29069809 -7669378 -36905706
12063c6905706C8193809g921297b767260A590306K174083a650919A6067821n690914
$$ -36905706 38193809 -7921297 -2767260 1590306 3764389 -1650919 16067821 10376907
12055A0376907b4642126r84846C041291G67032d891413A3959087i27868A8907504
$$ 10376907 -24642126 -25626972 3041291 767032 -4891413 13959087 -927868 18907504
12046c6791900C1745589m687558b5401779A6536312b2166159A6010502b0355610
$$ -36791900 31745589 27058031 -25401779 16536312 -22166159 16010502 -20355610
12038b6898523d079187B1812894b5405222D438344B212510a7317378c448428C406331
$$ -26898523 -4079187 21812894 -25405222 4438344 2212510 -17317378 -3448428 3406331
12029A2637398c1222680g151299K795938j87136m965008L114788J116954F773992
$$ 12637398 -31222680 -7151299 -4355361 -4542497 -9507505 -6392717 -5275763 6773992
12020b6960349h874413b676937B0349308k177808a0527095N004858j6527242g763787
$$ -26960349 -8874413 -2676937 20349308 18171500 -10527095 -5522237 -22049479 -7763787
12011b0489927c272459A3278936g722895j3386841O283344j9311284i581414j8168102
$$ -20489927 -3272459 13278936 -7722895 -21109736 -14826392 -34137676 -9581414 -27749516
12003b7749516b147740j6232136r15249N226935q818313c754288G266469a0863358
$$ -27749516 -2147740 -18379876 -19295125 -14068190 -22886503 -3754288 7266469 -10863358
11994I992453b8523802A9371156m628884L96378f590087m970543k2783545k899811
$$ 9992453 -28523802 19371156 14742272 15138650 -6590087 -11560630 -34344175 -37243986
11986c7243986e840980D605293i443319B9011019A3962419l910118b635787J073382
$$ -37243986 -5840980 4605293 -9443319 29011019 13962419 10052301 -2635787 -1562405
11978a562405o995816L222249I15284h551089k1141412L003940g128956m248736
$$ -1562405 -8558221 -5335972 915284 -8551089 -29692501 -26688561 -7128956 -11377692
11970a1377692j0742707D493161L462204a143981p683970l3494930H038025L154654
$$ -11377692 -22120399 4493161 7955365 -1143981 -8827951 -42322881 8038025 11192679
11962A1192679a697046j0352674B8419149r648045b2841365Q019603k2498681
$$ 11192679 -1697046 -12049720 28419149 18771104 -22841365 -14821762 -37320443
11955c7320443A1677238f628271B4667537a9981061E578264A309248i511592j9338912
$$ -37320443 11677238 -6628271 24667537 -19981061 5578264 1309248 -9511592 -28850504
11947b8850504C0265370B194849a510712D3172638A3215524M121534b6771821
$$ -28850504 30265370 2194849 -1510712 43172638 13215524 17337058 -26771821
11939B110090a7326363G960334M0577630j2357210b4017436b447475q236459A4167905
$$ 2110090 -17326363 7960334 48537964 36180754 -24017436 -2447475 -10683934 14167905
11930C4742247b0816170D628572J9091604c3895620A9872826B944202M090236
$$ 34742247 -20816170 4628572 23720176 -33895620 19872826 2944202 7034438
11923G034438A997717f219318k301779B920166N477330c8869301h907203B3645726
$$ 7034438 1997717 -6219318 -8521097 2920166 8397496 -38869301 -8907203 23645726
11914B4326890a4281253B2974811e186303E0257533a1841686b696000p865481
$$ 24326890 -14281253 22974811 -5186303 50257533 -11841686 -2696000 -10561481
11907a0561481A616234a9587876F61177c2280600a1676030r900808I174826g916092
$$ -10561481 1616234 -19587876 661177 -32280600 -11676030 -21576838 9174826 -7916092
11898I378405a3626122A0663125l176095i519323m527222N59033d800215k004820
$$ 9378405 -13626122 10663125 7487030 -9519323 -14046545 -13487512 -4800215 -6805035
11890f805035B5568893e2386742H862913L436584d469904H735736b9286207R184424
$$ -6805035 25568893 -52386742 8862913 12299497 -4469904 8735736 -29286207 -20101783
11882b0101783q673532e941665p143121A2168389b4110896H592364P952676l639528
$$ -20101783 -28775315 -5941665 -13084786 12168389 -24110896 8592364 16545040 12905512
11874A2905512c274666l4474285P954268F122314b1125578F12397d232728m612396
$$ 12905512 -3274666 -37748951 -29794683 6122314 -21125578 612397 -4232728 -8845124
11866h845124l9931501A3853312h083567k3207632g603667H291199M573550A789793
$$ -8845124 -48776625 13853312 -8083567 -31291199 -7603667 8291199 12864749 1789793
11857A8217099e3635849A7492900r59052a1119698B631877d6894343C0924829
$$ 18217099 -53635849 17492900 16533848 -11119698 2631877 -46894343 30924829
11849c1248303J5155358j684287P906111A1241826j380330b9663346d378956j2942047
$$ -31248303 -16092945 -17777232 -9871121 11241826 9861496 -29663346 -4378956 -17321003
11841a7321003j2511872B0938648B15600a6927463B3198478a2802548a227010
$$ -17321003 -29832875 20938648 215600 -16927463 23198478 -12802548 -1227010
11833I65603c836729m362805B382429L869158I79858M936858J5275501a173106
$$ 965603 -3836729 -8199534 2382429 6251587 979858 5916716 21192217 -1173106
11824A1479164d2753642A3839258P958792a2164782C1025105g128673E3327240
$$ 11479164 -42753642 13839258 21798050 -12164782 31025105 -7128673 53327240
11816A6253719o706345l693158M421215J8324082a7511511A7261983a0063169
$$ 16253719 9547374 5854216 10275431 28599513 -17511511 17261983 -10063169
11808F737806a1356788k8434181J1863938f763917A5537650o580619h122741L409542
$$ 6737806 -11356788 -39790969 -27927031 -6763917 15537650 8957031 -8122741 -4713199
11800d713199k8838173A3787696g503456A44541K5651617b9143246f545197o602126
$$ -4713199 -33551372 13787696 -7503456 144541 25796158 -29143246 -6545197 -13147323
11792a3147323C2651780q962619M497433B844512J8983760a3580849D10212a423462
$$ -13147323 32651780 23689161 28186594 2844512 21828272 -13580849 410212 -1423462
11783D864843K6991135j4621925b8643162M79332B3512895a1306232a744131P08106
$$ 4864843 31855978 17234053 -28643162 -28163830 23512895 -11306232 -1744131 -1036025
11775a036025n822663B584970O529267A70508K6716166F245803a7161515B4115659
$$ -1036025 -6858688 2584970 9114237 170508 26886674 6245803 -17161515 24115659
11766C54101i828994k2563021n168946R324290B8269236H952641J4538226a0388106
$$ 354101 -9828994 -32392015 -37560961 -28236671 28269236 8952641 23490867 -10388106
11757a1933160B4543451B632889J4807889i690714l4841750C3851287b6111080
$$ -11933160 24543451 2632889 17440778 -9690714 -44532464 33851287 -26111080
11749b8301101Q885081B711699c9138263N998117J5572186B3382886f341988k2937951
$$ -28301101 -19416020 2711699 -39138263 -33140146 -17567960 23382886 -6341988 -29279939
11741b9279939C0229406D868040j999247M0587369j0453364a7874481G740548
$$ -29279939 30229406 4868040 2868793 43456162 33002798 -17874481 7740548
11733c1277490M109027a2857949M400088G725285f594978E046547g197731K858828
$$ -31277490 -27168463 -12857949 -8457861 7725285 -6594978 5046547 -7197731 -4338903
11725d338903I946043e528822A7100644F453858K833291o35317I98708m18544
$$ -4338903 9946043 -5528822 17100644 6453858 9287149 8651832 998708 580164
11717E80164f369300B5451226d3372257B400384a2857774D7792875c733319B0555775
$$ 580164 -6369300 25451226 -43372257 2400384 -12857774 47792875 -3733319 20555775
11708b5490245A950783K3121600D947895K1539439c2141066D782850J8353306
$$ -25490245 1950783 25072383 4947895 26487334 -32141066 4782850 23136156
11701B3136156g1280236c2450619f83617k9539949A3837752a3086994k0594483
$$ 23136156 -71280236 -32450619 -683617 -30223566 13837752 -13086994 -33681477
11694c3681477A7056423A699127a5231425E065847K7216148b5309841i690683
$$ -33681477 17056423 1699127 -15231425 5065847 32281995 -25309841 -9690683
11686D071057e0146808d233571I422141c2043048a2833599L129062q9096C3580177
$$ 4071057 -50146808 -4233571 9422141 -32043048 -12833599 -9704537 -9793633 33580177
11677A5015978G502787a2063473d824923H1941456E368797b0009148k536248A8449928
$$ 15015978 7502787 -12063473 -4824923 81941456 5368797 -20009148 -22545396 18449928
11668B3153164C515781b8997363I557819O435670A506870K3912263K434974c673979
$$ 23153164 3515781 -28997363 9557819 15993489 1506870 25419133 27854107 -3673979
11659B7630625E028413K6569045a2006115e157257A2753374b1297591e801594
$$ 27630625 5028413 31597458 -12006115 -5157257 12753374 -21297591 -5801594
11651c603514E945714M226258a7781375Q467574k8592494G068765K2502619A1983196
$$ -3603514 5945714 10171972 -17781375 -9313801 -37906295 7068765 29571384 11983196
11642a1645408C34200i89243j5657043D303537Q74213L8256541c170402p580987
$$ -11645408 334200 -989243 -16646286 4303537 5177750 43434291 -3170402 -10751389
11634a0751389m8327162d399238A7503492a6142074A243654h870980j3086967
$$ -10751389 -59078551 -4399238 17503492 -16142074 1243654 -8870980 -21957947
11627b1957947j5373642a3201311O375199r389310f730364r893598m9047011B0176520
$$ -21957947 -37331589 -13201311 -6826112 -16215422 -6730364 -16623962 -65670973 20176520
11618b963752l2997886a2721687C0142248b404849B2113410b6310632D614038
$$ -2963752 -35961638 -12721687 30142248 -2404849 22113410 -26310632 4614038
11610D0051559o674135d741738A200910c5028924a209032k9702120j1297926a2181161
$$ 40051559 33377424 -4741738 1200910 -35028924 -1209032 -30911152 -42209078 -12181161
11601A1290720a5175330q556955m210582h001737l1256810J479841C248609a2520430
$$ 11290720 -15175330 -23732285 -27942867 -8001737 -39258547 -37778706 3248609 -12520430
11592F168035e774191C4572934a745851m699536k6448457a0057958b938403l1178162
$$ 6168035 -5774191 34572934 -1745851 -6445387 -32893844 -10057958 -2938403 -34116565
11584c4116565O857673C826272Q164769m621775e6816416J5409266J7638737o358327
$$ -34116565 -27258892 3826272 11991041 7369266 -56816416 -41407150 -23768413 -30126740
11576c0126740A5345162F758161K406113J4547123c8534364a0119637n4437844
$$ -30126740 15345162 6758161 9164274 23711397 -38534364 -10119637 -64557481
11569f4557481a7213398B5428614k612562F443838a8833751B0270830K9830410
$$ -64557481 -17213398 25428614 22816052 6443838 -18833751 20270830 50101240
11562E0101240A0423741B217870a5327926f173637j0774941j1927282C22797J0819120
$$ 50101240 10423741 2217870 -15327926 -6173637 -16948578 -28875860 322797 11141917
11554A1141917a6300572b57686C946197K2099045B057123J8882831b443538j811131
$$ 11141917 -16300572 -257686 3946197 26045242 2057123 20939954 -2443538 -4254669
11546d254669l8072958a4035439A3215711k145773e503558l013255C2455697j5413361
$$ -4254669 -42327627 -14035439 13215711 11069938 -5503558 -8516813 32455697 17042336
11538A7042336c2121509a3594044d505187A4020373B506832K1281810b0995291
$$ 17042336 -32121509 -13594044 -4505187 14020373 2506832 23788642 -20995291
11530C0495847a5339052M838696A3715073J5214376H840191l155279M994965c8972367
$$ 30495847 -15339052 -10500356 13715073 28929449 8840191 5684912 10679877 -38972367
11521A9941453A822096a7960886q024340A5787346A197436K0189343c7308089
$$ 19941453 1822096 -17960886 -25985226 15787346 1197436 21386779 -37308089
11513A9036737e250194A7682513a5769562C2927557g410234A2919061G9775K4023861
$$ 19036737 -5250194 17682513 -15769562 32927557 -7410234 12919061 79775 24103636
11505B4103636F125554N517018a4131493A9703202f478158E876806e1882530K3815578
$$ 24103636 6125554 11642572 -14131493 19703202 -6478158 5876806 -51882530 -28066952
11497b8066952f134814A0688529d766208F80905J3945039a0657138n966829F28183
$$ -28066952 -6134814 10688529 -4766208 680905 14625944 -10657138 -16623967 628183
11488A7285166c7506411a8352922i071899C598990b3863362k302317o30439C0751347
$$ 17285166 -37506411 -18352922 -9071899 3598990 -23863362 -26165679 -26796118 30751347
11479C9475176b4285391F730660K7913522a0835464C0095851e55726k560299F192612
$$ 39475176 -24285391 6730660 34644182 -10835464 30095851 -555726 -3116025 6192612
11470A9670529b8456472A5694398i378516A4219587a9172615A8552178a1804523
$$ 19670529 -28456472 15694398 -9378516 14219587 -19172615 18552178 -11804523
11462e404917p428359f100137A0054391J8824801h005622j6523354A7437228j537054
$$ -5404917 -12833276 -6100137 10054391 28879192 -8005622 -24528976 17437228 15900174
11454A5900174J2676678a8258017k7714788G186135i178384A050268b2558491
$$ 15900174 28576852 -18258017 -45972805 7186135 -9178384 1050268 -22558491
11446C0618604b455987m2902631g724846A4102400a7362082C1320281a8221447
$$ 30618604 -2455987 -45358618 -7724846 14102400 -17362082 31320281 -18221447
11438a3280827A4389066c612615j9826176C6154388D30289a3994743l0145818
$$ -13280827 14389066 -3612615 -23438791 36154388 430289 -13994743 -44140561
11431d4140561h865711g52039m3631586e790797j9020316C5798478d2046189C2266923
$$ -44140561 -8865711 -752039 -44383625 -5790797 -24811113 35798478 -42046189 32266923
11422B0845882C26032b0663949C4072395j2593743r285131D779298J7630510a5151009
$$ 20845882 326032 -20663949 34072395 21478652 12193521 4779298 22409808 -15151009
11413C8950830A1291399b640986I355840a5143349P447549B4180803d2489955
$$ 38950830 11291399 -2640986 9355840 -15143349 -7695800 24180803 -42489955
11405b8900318F3847086d1316609B1714209Q632139H178680J9446962b6125529
$$ -28900318 63847086 -41316609 21714209 30346348 8178680 27625642 -26125529
11397a1766719k2717673F900547L144135c3135551A4493484c3104094C1984909
$$ -11766719 -34484392 6900547 10044682 -33135551 14493484 -33104094 31984909
11389A3723810a6915774B9679525r9865a9509258h005491J311131q779871H747182
$$ 13723810 -16915774 29679525 29579660 -19509258 -8005491 -6694360 -15474231 8747182
11380d1090047g278726F947728Q289026F28589h604501a734472A312970J0755438
$$ -41090047 -7278726 6947728 15236754 628589 -8604501 -1734472 1312970 12068408
11372A2068408J4679645c959049j332214B4830197D822170b4782952A7950859
$$ 12068408 26748053 -3959049 -5291263 24830197 4822170 -24782952 17950859
11364A9750272h192249j535986m542614k91274A7530076B990628K3247986c3837079
$$ 19750272 -8192249 -9728235 -14270849 -14562123 17530076 2990628 26238614 -33837079
11355a4896713j4737500M337180A7823329a7879509d526279l3163082B8679332
$$ -14896713 -29634213 -25297033 17823329 -17879509 -4526279 -37689361 28679332
11347A0650036a177411j6504746C529724R059658F087149J986052b4656391J0150653
$$ 10650036 -1177411 -17682157 3529724 12589382 6087149 8073201 -24656391 -14505738
11339a4505738a469395A8695687c5576199h40125r704164j0947870A8449389e056494
$$ -14505738 -1469395 18695687 -35576199 -840125 -10544289 -21492159 18449389 -5056494
11330a2294519A7571039e114462j9478772R317793r227662J0011510K594978K846591
$$ -12294519 17571039 -5114462 -24593234 -15275441 -24503103 -14491593 -11896615 -9050024
11322i050024k7242665C742983c6220734g732551D431476L2944110b6593673A4309714
$$ -9050024 -36292689 3742983 -36220734 -7732551 4431476 37375586 -26593673 14309714
11313e248015c52634q077998n998524C2427877b03355j1449511p867149Q069791
$$ -5248015 -352634 -8430632 -14429156 32427877 -203355 -11652866 -19520015 -11450224
11305a1450224k2806738I887967J336497k711694L5412899D354677L043555b828022
$$ -11450224 -34256962 9887967 11224464 8512770 43925669 4354677 7398232 -2828022
11296e283036n601885B659308a3704157c136120B8265636a5508776D642854a1691967
$$ -5283036 -10884921 2659308 -13704157 -3136120 28265636 -15508776 4642854 -11691967
11287b7969741A5213007A476669K5588810c275212K15568A954101b2189069f18758
$$ -27969741 15213007 1476669 27065479 -3275212 -3059644 1954101 -22189069 -618758
11278D0184293m072077c548942g25581j030999B219801J0304332b2247040g660013
$$ 40184293 36112216 -3548942 -725581 -1756580 2219801 12524133 -22247040 -7660013
11269B9984818A027264L2322750Q170795d979015l8648421A1386706h12029n241223
$$ 29984818 1027264 33350014 41520809 -4979015 -43627436 11386706 -812029 -6053252
11261f053252B154687a7048241L392700E961347i352357G279391K5795634A3425753
$$ -6053252 2154687 -17048241 -13655541 5961347 -9352357 7279391 33075025 13425753
11252A6307153g265378D8099668j8597585b7990430A67712Q981515c1124354n838524
$$ 16307153 -7265378 48099668 29502083 -27990430 167712 9149227 -31124354 -36962878
11244c6962878a1258180K229965A0705151a6232084C1790406F599187N741746
$$ -36962878 -11258180 -9028215 10705151 -16232084 31790406 6599187 12340933
11237A2340933l464156J578746a5011001A3506490J4089476d333485j1631159
$$ 12340933 8876777 10455523 -15011001 13506490 27595966 -4333485 -15964644
11230a5964644B3938416e611626A2403061a2812162C224295L2288249a4387732
$$ -15964644 23938416 -5611626 12403061 -12812162 3224295 35512544 -14387732
11222a3264263D315262J650149R481811g349260C4058548d1163979A7843268E222362
$$ -13264263 4315262 5965411 15447222 -7349260 34058548 -41163979 17843268 5222362
11213F344466a697317r3955B4566192Q125950b297897A0617194K4145887a3139198
$$ 6344466 -1697317 -1791272 24566192 32692142 -2297897 10617194 34763081 -13139198
11204D5168853B095330O182075J029957c2284517L026569R365762a762617F614452
$$ 45168853 2095330 8277405 9307362 -32284517 -29257948 -19892186 -1762617 6614452
11195B3981218a1629099C9146109A572166c0120395H710222f346277A893192N110021
$$ 23981218 -11629099 39146109 1572166 -30120395 8710222 -6346277 1893192 7003213
11187G003213a1422117A1921687a0155683H305940b6044570A7838136J7241808
$$ 7003213 -11422117 11921687 -10155683 8305940 -26044570 17838136 35079944
11180C5079944a8277561f417067B144622a2075865M695499j8093086h535036A5725873
$$ 35079944 -18277561 -6417067 2144622 -12075865 -7380366 -25473452 -8535036 15725873
11171B6177825c0124879B6026280a3680882G492779A266644J0444576i622872
$$ 26177825 -30124879 26026280 -13680882 7492779 1266644 11711220 -9622872
11163A7428940a6586856f775890j0682836B8074077h404440B3266343b473353
$$ 17428940 -16586856 -6775890 -17458726 28074077 -8404440 23266343 -2473353
11155e104838q713020q645833e741220a062405j3167741k514492B445291J7912999
$$ -5104838 -13817858 -22463691 -5741220 -1062405 -14230146 -16744638 2445291 20358290
11147B0358290b1053922G545872c5897420b771430n9757530B9947085m555806
$$ 20358290 -21053922 7545872 -35897420 -2771430 -62528960 29947085 25391279
11140B5391279a3377718D5829653a4817748B1391592H312988a3772377A9343391
$$ 25391279 -13377718 45829653 -14817748 21391592 8312988 -13772377 19343391
11132I025777R867838b3190016o713970G337180p49408a9316975j4675393j5932382
$$ 9025777 18893615 -23190016 -29903986 7337180 6587772 -19316975 -33992368 -49924750
11124d9924750d890006j7478134A3030670f118878r540270j1210334o964295J2770737
$$ -49924750 -4890006 -22368140 13030670 -6118878 -15659148 -26869482 -33833777 -21063040
11116b1063040M597936A2006734a0848336k243239I983306P969602p094552a4093626
$$ -21063040 -16465104 12006734 -10848336 -13091575 9983306 17952908 10858356 -14093626
11107B9672704c2411410B3504545G975615l49908a7589286K065833A8099421b8637672
$$ 29672704 -32411410 23504545 7975615 7625707 -17589286 -15523453 18099421 -28637672
11098b8593520a0139172c627215A7422674B150120J4444916n692052D676390J1227203
$$ -28593520 -10139172 -3627215 17422674 2150120 16595036 10902984 4676390 15903593
11090A5903593A516346J5682113f757845a311460B8207499c2575645j568296R923739
$$ 15903593 1516346 17198459 -6757845 -1311460 28207499 -32575645 -34143941 -24220202
11082b4220202m922835A9771014A416062L0476390b515029j8088660k5705344
$$ -24220202 -29143037 19771014 1416062 31892452 -2515029 -20603689 -46309033
11075d6309033b2223632D822610a6767323E0655299a6225954N369427A4866602
$$ -46309033 -22223632 4822610 -16767323 50655299 -16225954 -10856527 14866602
11067B7620194b2539286c582310m0679944M643712E914076c3886488A3125674
$$ 27620194 -22539286 -3582310 -44262254 -39618542 5914076 -33886488 13125674
11059A0145685a7326507n898120H983440h023954A0885110f776454j7023588o466854
$$ 10145685 -17326507 -23224627 8983440 -8023954 10885110 -6776454 -23800042 -30266896
11051c0266896A0850818a7371929B9466178a1505494p04388G018113d3409350
$$ -30266896 10850818 -17371929 29466178 -11505494 -12209882 7018113 -43409350
11043A0812485A974359h644356j1835614B3659013p52621d790098C1419464d0245111
$$ 10812485 1974359 -8644356 -20479970 23659013 22906392 -4790098 31419464 -40245111
11034A06392b4775740C5008656j1792492Q916734j4094794k682181K107886j544099
$$ 106392 -24775740 35008656 23216164 32132898 18038104 15355923 17463809 15919710
11026A5919710h260228E903748k33416g679451A3650071g120432b079035G095184
$$ 15919710 -8260228 5903748 5670332 -7679451 13650071 -7120432 -2079035 7095184
11017A1059299L925198p21658o186754e116975C9785970d128250j2986744O304938
$$ 11059299 14984497 14262839 8076085 -5116975 39785970 -4128250 -17114994 -10810056
11009a0810056k845080A0996818f700568G864100g45111m040271r605197f050769
$$ -10810056 -13655136 10996818 -6700568 7864100 -745111 -4785382 -14390579 -6050769
11000b8416464g943712j4569228H201858b0223552C4313323G712000J3248333
$$ -28416464 -7943712 -22512940 8201858 -20223552 34313323 7712000 20960333
10993B0960333a5710569A753352L1023373j5215208K6423417j9943568q611707
$$ 20960333 -15710569 1753352 32776725 17561517 43984934 24041366 15429659
10986A5429659n247580J646261b4171415B798773e36395k8395725O763385l8583912
$$ 15429659 10182079 11828340 -24171415 2798773 -536395 -28932120 -22168735 -60752647
10978f0752647a7388270k1789669a5836860j8919100c191771A0265821b2129239
$$ -60752647 -17388270 -39177939 -15836860 -34755960 -3191771 10265821 -22129239
10970a0220735m940931a794687F087571i741362R86998r386181l9417863A2162398
$$ -10220735 -15161666 -1794687 6087571 -9741362 -8754364 -18140545 -57558408 12162398
10961c503334I436360b8681o395305r426695G776903c1171987a2997812A6452497
$$ -3503334 9436360 -28681 -6423986 -15850681 7776903 -31171987 -12997812 16452497
10952A5821176a197481l7924649G217910K1156684D764497R569170a2219518B4074373
$$ 15821176 -1197481 -39122130 7217910 28374594 4764497 14333667 -12219518 24074373
10943A4107063a8863914C201233a2065386k4503329c247859E128903d6215845
$$ 14107063 -18863914 3201233 -12065386 -36568715 -3247859 5128903 -46215845
10935c678321C581106A632721b8285703D628662b262043a075930j1099884A6400685
$$ -3678321 3581106 1632721 -28285703 4628662 -2262043 -1075930 -12175814 16400685
10926B501527a5360125A7907821i100591k187957A1125000h597174F896093a9517933
$$ 2501527 -15360125 17907821 -9100591 -11288548 11125000 -8597174 6896093 -19517933
10917A0099532m613935a8193448D968583b5304628a1416307d404440q327433A7528442
$$ 10099532 5485597 -18193448 4968583 -25304628 -11416307 -4404440 -12731873 17528442
10908A1432515B301461h609620b311018j0819764j5336609a59348r773419E369463
$$ 11432515 2301461 -8609620 -2311018 -13130782 -28467391 -159348 -9932767 5369463
10899f1722423A4071997a9258796k0009258R083581a819069r579011B2386949
$$ -61722423 14071997 -19258796 -39268054 -30184473 -1819069 -11398080 22386949
10891b2312097j0133901J4930390A0728076b0828639M047294N860206m241232
$$ -22312097 -32445998 -17515608 10728076 -20828639 -16781345 -10921139 -15162371
10884a5162371L950179F8928961c0461295d220164C382321j446718N329272e75401
$$ -15162371 -11212192 68928961 -30461295 -4220164 3382321 1935603 7264875 -575401
10875A8034802a4119237O993613j2126634l284869k589381B5333834b0832997
$$ 18034802 -14119237 -7125624 -19252258 -22537127 -25126508 25333834 -20832997
10867a0483049I171227h761286J631171J558159j498269j1144329j3589439N991889
$$ -10483049 9171227 -8761286 -7130115 -5571956 -7070225 -18214554 -31803993 -25812104
10859b5812104f825404D5066342b4800712L061261F7012520b6290508f345266
$$ -25812104 -6825404 45066342 -24800712 -21739451 67012520 -26290508 -6345266
10851h374815I309143D33663b410084j9612644A653361M812833a5879774n43569
$$ -8374815 9309143 433663 -2410084 -22022728 1653361 6466194 -15879774 -16423343
10843a6423343K875389F67581M112983b1618709J881446r981335C5895063c4629736
$$ -16423343 -13547954 667581 4780564 -21618709 -19737263 -29718598 35895063 -34629736
10834a0835395B1067224a0795957m374031k3471284a0832245B4583942B810593
$$ -10835395 21067224 -10795957 -15169988 -38641272 -10832245 24583942 2810593
10826A8810251b3626873B264413c2693188A5978619P049661b5503935R124663
$$ 18810251 -23626873 2264413 -32693188 15978619 23028280 -25503935 -16379272
10819a6379272A3406943m609982b5073052g507982A4295129D817240a9153766
$$ -16379272 13406943 8796961 -25073052 -7507982 14295129 4817240 -19153766
10811C1024113n828204f998619A2407109a6163305b220548j0461116j1795173
$$ 31024113 25195909 -6998619 12407109 -16163305 -2220548 -12681664 -24476837
10804b4476837A2434373a828223m5557350P479302d564072C1247099e986303J508125
$$ -24476837 12434373 -1828223 -47385573 -39906271 -4564072 31247099 -5986303 -4478178
10796d478178C5898090j5550553F738581d1976801b0381774E304052a1510343
$$ -4478178 35898090 20347537 6738581 -41976801 -20381774 5304052 -11510343
10788a8187274l282506A7623435a5462109M068977A922242L4436416O749286c4758156
$$ -18187274 -21469780 17623435 -15462109 -11393132 1922242 36358658 43107944 -34758156
10779B3561277a6847371B346676a0676424A8395770A059257e024681j9813313
$$ 23561277 -16847371 2346676 -10676424 18395770 1059257 -5024681 -24837994
10772b4837994a0527429c041035j1190030p516284g14276j2792790B8627525J5704067
$$ -24837994 -10527429 -3041035 -14231065 -21747349 -714276 -13507066 28627525 44331592
10764D4331592A5252725b2257750l3220438a0280084B3361661c796544k5150187
$$ 44331592 15252725 -22257750 -55478188 -10280084 23361661 -3796544 -28946731
10757b8946731B8315465j3771460J88721b1598637A1995270M852673a3269437
$$ -28946731 28315465 14544005 14732726 -21598637 11995270 16847943 -13269437
10749d3685550B6186736b5701489A6241749i410943k6902699e102755B6535739
$$ -43685550 26186736 -25701489 16241749 -9410943 -36313642 -5102755 26535739
10741c920840a794569m761000m4434629A4144426l059749a169001j6310247A4238037
$$ -3920840 -1794569 -6555569 -50990198 14144426 11084677 -1169001 -17479248 14238037
10732g947006r916721j2843966c367885B7425728o367555p287279c4609465K888600
$$ -7947006 -17863727 -30707693 -3367885 27425728 21058173 13770894 -34609465 -31720865
10724c1720865a0411052k1201159M438457a0850613A1332587b1297958j4437184
$$ -31720865 -10411052 -31612211 -27173754 -10850613 11332587 -21297958 -35735142
10717c5735142f474298m051944k921689A2848615h128360E875326a765137r741417
$$ -35735142 -6474298 -10526242 -13447931 12848615 -8128360 5875326 -1765137 -11506554
10709a1506554k809194a944319A4390107l210282b1634634k689527a1074214J460973
$$ -11506554 -14315748 -1944319 14390107 11179825 -21634634 -24324161 -11074214 -9613241
10701i613241D5498507A1066876e94540C1809246j404275A4275355c922117j3939194
$$ -9613241 45498507 11066876 -594540 31809246 30404971 14275355 -3922117 -17861311
10693a7861311p571805B415264i194903l1297379D475463E231M7534182G656440
$$ -17861311 -25433116 2415264 -9194903 -40492282 4475463 5231 47539413 7656440
10684B3726230K3560449a1916184C445486a3686808J536471q308078J0088771
$$ 23726230 47286679 -11916184 3445486 -13686808 -12150337 -20458415 -10369644
10677a0369644H307159a6370001A2750321D379127G83460a4571060j2087412J0970738
$$ -10369644 8307159 -16370001 12750321 4379127 783460 -14571060 -26658472 -15687734
10669a5687734j0841198e121617m080968B0066660c4445703F065437J6117117
$$ -15687734 -26528932 -5121617 -9202585 20066660 -34445703 6065437 22182554
10662B2182554n921370C237639N952498d769694C672266g642542j1635841B7837938
$$ 22182554 16261184 3237639 9190137 -4769694 3672266 -7642542 -19278383 27837938
10653a7607815H384315J9219193a1408700i17946B1159080K1080567a2823014
$$ -17607815 8384315 27603508 -11408700 -917946 21159080 42239647 -12823014
10645a8846460r18783f20170A6067836i468511D182358b757189j890043B9819491
$$ -18846460 -19765243 -620170 16067836 -9468511 4182358 -2757189 -4647232 29819491
10636H197360a7194641A3026441M487098b5406401A419136c2757702E587705J2833407
$$ 8197360 -17194641 13026441 17513539 -25406401 1419136 -32757702 5587705 18421112
10628A8421112c4159474d731941j3701124j8481375r197255d969832B565749h835748
$$ 18421112 -34159474 -4731941 -18433065 -36914440 -46111695 -4969832 2565749 -8835748
10619a0140393F781589a5162342F298287b6733973a1609176A9122658J4984833
$$ -10140393 6781589 -15162342 6298287 -26733973 -11609176 19122658 34107491
10612C4107491g496004C9372134D962707b6863323j1331484c280716C518106L6012364
$$ 34107491 -7496004 39372134 4962707 -26863323 -38194807 -3280716 3518106 39530470
10604C9530470b0524769a688535B50361K46337a5437443L05469n984382A9089767
$$ 39530470 -20524769 -1688535 250361 496698 -15437443 -15131974 -21116356 19089767
10595g650017A6414152b6858102J0763347D188553j025753L2418717a2275943
$$ -7650017 16414152 -26858102 -16094755 4188553 3162800 35581517 -12275943
10587E441465b2848917a0139755A8220374D129697d74662j9857662G737021n55838
$$ 5441465 -22848917 -10139755 18220374 4129697 -474662 -20332324 7737021 7181183
10579G181183b7424625J2550751b627473l6665086a7352145o104467I33224b0545212
$$ 7181183 -27424625 -14873874 -2627473 -39292559 -17352145 -23456612 933224 -20545212
10570A5164512c552832J545587A6076687b1676906B469867N265751a3349396P10693
$$ 15164512 -3552832 -2007245 16076687 -21676906 2469867 7735618 -13349396 -12638703
10562a2638703A6275178g734956a491047k2642884F931687b3878327A3204391
$$ -12638703 16275178 -7734956 -1491047 -24133931 6931687 -23878327 13204391
10554a2258222F119677b5143748b817798A2570912c3320108B361514K4141388
$$ -12258222 6119677 -25143748 -2817798 12570912 -33320108 2361514 26502902
10547B6502902A559289a8583082j7306860E559378a4769801E650672J0418554
$$ 26502902 1559289 -18583082 -35889942 5559378 -14769801 5650672 16069226
10540A6069226j649153A906926J1371180R97565a7423912k3835314D915305b021929
$$ 16069226 14420073 1906926 13278106 14275671 -17423912 -41259226 4915305 -2021929
10531e7582779b110046j6435997g461350k4488766A261713K152100a2041666B6209116
$$ -57582779 -2110046 -18546043 -7461350 -31950116 1261713 3413813 -12041666 26209116
10522F047105i316563j9255811B478707c188066I196231M189978c6204014A1622752
$$ 6047105 -9316563 -28572374 2478707 -3188066 9196231 13386209 -36204014 11622752
10513a2608979B935886a7273207n988903J0960101A1274087c8692831J6694685
$$ -12608979 2935886 -17273207 -23262110 -12302009 11274087 -38692831 -21998146
10506b1998146K353839M330187k827985C039187b8097295I688615b1271800N939898
$$ -21998146 -19644307 -15314120 -18142105 3039187 -28097295 9688615 -21271800 -15331902
10498a5331902A5458816D080271d643142j9472102a306295j1526556j5367861
$$ -15331902 15458816 4080271 -4643142 -24115244 -1306295 -12832851 -28200712
10491b8200712k3648647J1220143a3756349q291159r690926l9739723a6312518
$$ -28200712 -51849359 -40629216 -13756349 -22047508 -31738434 -71478157 -16312518
10483C2225137A179688c0788650e607369D2420697a6579046A6371429b730353
$$ 32225137 1179688 -30788650 -5607369 42420697 -16579046 16371429 -2730353
10475b038284B3376080a2112454d858602B1095792a2368275l108275D1141450
$$ -2038284 23376080 -12112454 -4858602 21095792 -12368275 -15476550 41141450
10467E593745c4271376J3532069B725069i443350l0147974G120714a7216246H254719
$$ 5593745 -34271376 -20739307 2725069 -9443350 -39591324 7120714 -17216246 8254719
10458a0108762K225532b696539j2230017K297824A476684K24773M621900b7321185
$$ -10108762 -7883230 -2696539 -14926556 -12628732 1476684 1701457 6323357 -27321185
10449B875695R857901A472123e614730A2820017J9392785a2083847L953374D4027949
$$ 2875695 12733596 1472123 -5614730 12820017 32212802 -12083847 -8130473 44027949
10440i790758b875928A2374664o075041c502648D4863956i977235B4243455e792311
$$ -9790758 -2875928 12374664 6299623 -3502648 44863956 -9977235 24243455 -5792311
10431F983192J0993372J6956294j5828506o914980g680179j2363452C6486943
$$ 6983192 17976564 34932858 19104352 12189372 -7680179 -20043631 36486943
10423G663238K7164994f390812E813567a2482976J094216A0270566a1295211l003746
$$ 7663238 34828232 -6390812 5813567 -12482976 -11388760 10270566 -11295211 -14298957
10415a4298957e103499A6906413a1917391A4231030b6159126d231799j8005704
$$ -14298957 -5103499 16906413 -11917391 14231030 -26159126 -4231799 -22237503
10408b2237503a0785958A4220065L3318251A6801267C253071a2965172e936465
$$ -22237503 -10785958 14220065 47538316 16801267 3253071 -12965172 -5936465
10400C0880172a2604241f062268B0043225E465687N80064d8803311K0701466r196388
$$ 30880172 -12604241 -6062268 20043225 5465687 6045751 -48803311 -28101845 -37298233
10392c7298233a1623810I441957N977676a9537061L793122k863124n946036A9196938
$$ -37298233 -11623810 9441957 15419633 -19537061 -15743939 -18607063 -24553099 19196938
10383b2462625n134178C0875981b8662319R719207A341368b4433665A1636923
$$ -22462625 -27596803 30875981 -28662319 -18943112 1341368 -24433665 11636923
10375a6713117o346158K625611g017639C94400P652753f333410k650998k1580634
$$ -16713117 -23059275 -20433664 -7017639 394400 8047153 -6333410 -8984408 -30565042
10367c0565042c751084k0799802d075342J056612k5221371c460264A0378223k13440
$$ -30565042 -3751084 -24550886 -4075342 -3018730 -28240101 -3460264 10378223 10164783
10359A0164783b8913679A3121105b6378405A7438069b1066973b529469k104319
$$ 10164783 -28913679 13121105 -26378405 17438069 -21066973 -2529469 -4633788
10352d633788C9941060c3149128n175291a1728629A0647952f375105l858592A7636996
$$ -4633788 39941060 -33149128 -38324419 -11728629 10647952 -6375105 -10233697 17636996
10343b1733266j3941250b29661C0577717A547000a0305102j9923196J178879B26794
$$ -21733266 -35674516 -229661 30577717 1547000 -10305102 -30228298 -29049419 226794
10334B0303917a1704164m092278A6409803a41513C498675J2717817k777779d3427816
$$ 20303917 -11704164 -15796442 16409803 -141513 3498675 16216492 13438713 -43427816
10325c6699533A34904d8215091A2258415J141231K559703d5586280j0409355b0595527
$$ -36699533 134904 -48215091 12258415 13399646 15959349 -45586280 -55995635 -20595527
10316d8848129A5322492G416187d2808300D393284O780480K719495Q73977J1624236
$$ -48848129 15322492 7416187 -42808300 4393284 11173764 13893259 14767236 26391472
10308B6391472E059750b3461031A1320987c1230364j1972171B1075130Q932725
$$ 26391472 5059750 -23461031 11320987 -31230364 -43202535 21075130 30007855
10301C0007855m66558G168815d115460k552502p421884B127302a2774664p654338
$$ 30007855 29541297 7168815 -4115460 -6667962 -14089846 2127302 -12774664 -20429002
10293b0429002k5370199i446359k5124946B7028624b9106958A6905704b7033241
$$ -20429002 -45799201 -9446359 -34571305 27028624 -29106958 16905704 -27033241
10285a9992137D16269J8207956g492180j0680493P364393c200249m866590k1591560
$$ -19992137 416269 18624225 -7492180 -18172673 -10808280 -3200249 -8066839 -29658399
10277b9658399P972558D7249469A4893772J6559878e21962I282496a0384507l1643802
$$ -29658399 -21685841 47249469 14893772 31453650 -521962 9282496 -10384507 -42028309
10269d2028309a5980789j6194246F548283B650177J8260082d7400812J0747681
$$ -42028309 -15980789 -32175035 6548283 2650177 20910259 -47400812 -36653131
10262c6653131C9106154e916239k752248r229977d460680m3440002E0107254H93917
$$ -36653131 39106154 -5916239 -8668487 -17898464 -4460680 -47900682 50107254 893917
10253d9159955d650015F196285b7735725C6243784b6177015d314547B1480488
$$ -49159955 -4650015 6196285 -27735725 36243784 -26177015 -4314547 21480488
10245a651232j4846875N433467n120468l009389B2387057a5984596f413763f06098
$$ -1651232 -16498107 -11064640 -16185108 -19194497 22387057 -15984596 -6413763 -606098
10236d952307A442485d58896p627087G655059J9533437a3306447p762673c872701
$$ -4952307 1442485 -458896 -8085983 7655059 27188496 -13306447 -21069120 -3872701
10227c2908185C793830a9515822q111560B38157N154991J8109837d0338788A3413823
$$ -32908185 3793830 -19515822 -27627382 238157 5393148 23502985 -40338788 13413823
10218c7102103a6529954A3766912Q909106a4575542D171941c2735547k290714
$$ -37102103 -16529954 13766912 22676018 -14575542 4171941 -32735547 -35026261
10211c5026261h359890B3701258I322842l57271b4271778A230594a9380040k2197136
$$ -35026261 -8359890 23701258 9322842 8965571 -24271778 1230594 -19380040 -41577176
10203d1577176A1269876K83062d5367134C7209896j2231665I039999b2825328
$$ -41577176 11269876 11552938 -45367134 37209896 24978231 9039999 -22825328
10195C2914027b6733919e362075a372542A7112263J596151c5251153j8471823
$$ 32914027 -26733919 -5362075 -1372542 17112263 18708414 -35251153 -53722976
10188e3722976a1455220j539054A068347L3439487b4386459f634156n591385k7740717
$$ -53722976 -11455220 -12994274 1068347 34507834 -24386459 -6634156 -12225541 -39966258
10180c9966258a551894I140947K9746311b8767820R433740N248659e162667A4717343
$$ -39966258 -1551894 9140947 38887258 -28767820 -19334080 -14085421 -5162667 14717343
10171E726377c118090G583451P290473d963427D239669L1908299E865250b5520934
$$ 5726377 -3118090 7583451 14873924 -4963427 4239669 36147968 5865250 -25520934
10162b6870273C1671667e5371816C4178402c1696467e586911o961364D340456
$$ -26870273 31671667 -55371816 34178402 -31696467 -5586911 -12548275 4340456
10154a5426726B5795881F888781P916361R251768j1874858m443046d4175637i859366
$$ -15426726 25795881 6888781 14805142 24056910 12182052 7739006 -44175637 -9859366
10145a1876978D383241b8322699L4231B2586744a5413872c854299l0797960l9283
$$ -11876978 4383241 -28322699 -28288468 22586744 -15413872 -3854299 -34652259 -34691542
10137c4691542J5374970m9248803a5623294C432808d3270062B888135K1485606
$$ -34691542 -19316572 -68565375 -15623294 3432808 -43270062 2888135 24373741
$$ [...]
##END NTUPLES=NMR SPECTRUM
##END=
