##TITLE=AC1406_BRAA12215_7653149_5PJ1xK5njd
##JCAMPDX= 6.0         $$ Bruker NMR JCAMP-DX V2.0
##DATA TYPE= NMR SPECTRUM
##DATA CLASS= NTUPLES
##ORIGIN= BRUKER
##OWNER= Administrator
$$ 1.72 TOPSPIN		Version 2.1
$$ 2013-04-11 15:22:58.052 -0700  Administrator@X
$$ Compression mode = diff/dup
##.OBSERVE FREQUENCY= 400.02188249412
##.OBSERVE NUCLEUS= ^1H
##.ACQUISITION MODE= SIMULTANEOUS (DQD)
##.ACQUISITION SCHEME= undefined
##.AVERAGES= 8
##.DIGITISER RES= 22
##SPECTROMETER/DATA SYSTEM= spect
##.PULSE SEQUENCE= zg30
##.SOLVENT NAME= COFFEE_meoh
##.SHIFT REFERENCE= INTERNAL, COFFEE_meoh, 1, 14.98509
##AUDIT TRAIL= $$ (NUMBER, WHEN, WHO, WHERE, PROCESS, VERSION, WHAT)
$$ ##TITLE= Audit trail, TOPSPIN		Version 2.1
$$ ##JCAMPDX= 5.01
$$ ##ORIGIN= Bruker BioSpin GmbH
$$ ##OWNER= Administrator
$$ $$ E:\/data/COFFEE/nmr/AC1406_BRAA12215_7653149_5PJ1xK5njd/30/pdata/1/auditp.txt
$$ ##AUDIT TRAIL=  $$ (NUMBER, WHEN, WHO, WHERE, PROCESS, VERSION, WHAT)
(   1,<2013-04-11 15:22:48.791 -0700>,<Administrator>,<X>,<go>,<TOPSPIN 2.1>,
      <created by zg
	started at 2013-04-11 15:21:42.487 -0700,
	POWCHK enabled, PULCHK disabled,
       configuration hash MD5:
       33 CF 6A 21 5C D3 B9 40 6C 15 AA 8D 27 A2 4F 13
       data hash MD5: 64K
       5A E5 CA 2B FF 0A 37 60 23 5B 17 7F 13 F4 91 C8>)
(   2,<2013-04-11 15:22:51.819 -0700>,<Administrator>,<X>,<proc1d>,<TOPSPIN 2.1>,
      <Start of raw data processing
       efp LB = 0 FT_mod = 6 PKNL = 1 PHC0 = 0 PHC1 = 0 SI = 32K 
       data hash MD5: 32K
       D4 27 4E C0 BD 27 EF 17 B3 1E B3 1D C9 4F 72 F3>)
(   3,<2013-04-11 15:22:52.585 -0700>,<Administrator>,<X>,<proc1d>,<TOPSPIN 2.1>,
      <pk PHC0 = 100.7391 PHC1 = 0 
       data hash MD5: 32K
       40 A8 C4 6A 2F 1B 9B F1 24 28 7D E2 CD 32 69 61>)
(   4,<2013-04-11 15:22:52.922 -0700>,<Administrator>,<X>,<proc1d>,<TOPSPIN 2.1>,
      <abs ABSG = 1 
       data hash MD5: 32K
       13 D7 BA 7F FF 0B F1 D8 DD F1 76 BA C4 59 64 29>)
(   5,<2013-04-11 15:22:53.213 -0700>,<Administrator>,<X>,<proc1d>,<TOPSPIN 2.1>,
      <abs ABSG = 2 
       data hash MD5: 32K
       9F 45 BF C5 69 EE 00 4A D4 38 D3 78 33 E4 E6 1A>)
(   6,<2013-04-11 15:22:53.412 -0700>,<Administrator>,<X>,<proc1d>,<TOPSPIN 2.1>,
      <abs ABSG = 3 
       data hash MD5: 32K
       C3 69 11 34 98 98 11 A2 E5 09 D9 F9 2B A6 F8 EC>)
(   7,<2013-04-11 15:22:53.672 -0700>,<Administrator>,<X>,<proc1d>,<TOPSPIN 2.1>,
      <abs ABSG = 4 
       data hash MD5: 32K
       6E 10 EC 1B 09 E5 8C 15 D2 83 1E EC 4F AE 19 5C>)
(   8,<2013-04-11 15:22:53.902 -0700>,<Administrator>,<X>,<proc1d>,<TOPSPIN 2.1>,
      <abs ABSG = 5 
       data hash MD5: 32K
       37 9B AE C8 15 1A 47 67 92 7C BB 3E EC A4 E8 B7>)
$$ ##END=
$$ 
$$ $$ hash MD5
$$ $$ BF 5D 9D E1 5C 71 D0 D2 93 68 CA FA 68 42 B1 E0
##$RELAX= 
##$RELAX= 
##$RELAX= 
##$RELAX= 
##$RELAX= 
##$RELAX= 
##$RELAX= 
$$ Bruker specific parameters
$$ --------------------------
##$DU= <E:\>
##$EXPNO= 30
##$NAME= <AC1406_BRAA12215_7653149_5PJ1xK5njd>
$$ [...]
150 150 150 150 150 150 150 150
##$TP07= 0
##$TPNAME0= <>
##$TPNAME1= <>
##$TPNAME2= <>
##$TPNAME3= <>
##$TPNAME4= <>
##$TPNAME5= <>
##$TPNAME6= <>
##$TPNAME7= <>
##$TPOAL= (0..7)
0.5 0.5 0.5 0.5 0.5 0.5 0.5 0.5
##$TPOFFS= (0..7)
0 0 0 0 0 0 0 0
##$TUNHIN= 0
##$TUNHOUT= 0
##$TUNXOUT= 0
##$USERA1= <user>
##$USERA2= <user>
##$USERA3= <user>
##$USERA4= <user>
##$USERA5= <user>
##$V9= 5
##$VALIST= <valist>
##$VCLIST= <CCCCCCCCCCCCCCC>
##$VD= 0
##$VDLIST= <DDDDDDDDDDDDDDD>
##$VPLIST= <PPPPPPPPPPPPPPP>
##$VTLIST= <TTTTTTTTTTTTTTT>
##$WBST= 2048
##$WBSW= 25
##$XGAIN= (0..3)
0 0 0 0
##$XL= 0
##$YL= 0
##$YMAX_a= 613752
##$YMIN_a= -523246
##$ZGOPTNS= <>
##$ZL1= 120
##$ZL2= 120
##$ZL3= 120
##$ZL4= 120
##$ABSF1= 14.98509
##$ABSF2= -5.573092
##$ABSG= 5
##$ABSL= 3
##$ALPHA= 0
##$AQORDER= 0
##$ASSFAC= 0
##$ASSFACI= 0
##$ASSFACX= 0
##$ASSWID= 0
##$AUNMP= <proc_prof1d_extract_pilot.lims>
##$AXLEFT= 0
##$AXNAME= <>
##$AXNUC= <1H>
##$AXRIGHT= 0
##$AXTYPE= 0
##$AXUNIT= <>
##$AZFE= 0.1
##$AZFW= 0.1
##$BCFW= 0
##$BC_mod= 0
##$BYTORDP= 0
##$COROFFS= 0
##$CY= 15
##$DATMOD= 1
##$DC= 0
##$DFILT= <>
##$DTYPP= 0
##$F1P= 0
##$F2P= 0
##$FCOR= 0.5
##$FTSIZE= 32768
##$FT_mod= 6
##$GAMMA= 0
##$GB= 0
##$INTBC= 1
##$INTSCL= 1
##$ISEN= 128
##$LB= 0
##$LEV0= 0
##$LPBIN= 0
##$MAXI= 10000
##$MC2= 0
##$MEAN= 0
##$ME_mod= 0
##$MI= 0
##$NCOEF= 0
##$NC_proc= -8
##$NLEV= 6
##$NOISF1= 0
##$NOISF2= 0
##$NSP= 0
##$NTH_PI= 0
##$NZP= 0
##$OFFSET= 14.98509
##$PC= 1
##$PHC0= 100.7391
##$PHC1= 0
##$PH_mod= 1
##$PKNL= yes
##$PPARMOD= 0
##$PPDIAG= 0
##$PPIPTYP= 0
##$PPMPNUM= 2147483647
##$PPRESOL= 1
##$PSCAL= 4
##$PSIGN= 0
##$PYNMP= <proc.py>
##$REVERSE= no
##$SF= 400.02
##$SI= 32768
##$SIGF1= 0
##$SIGF2= 0
##$SINO= 400
##$SIOLD= 32768
##$SPECTYP= <>
##$SREGLST= <1H.CDCl3>
##$SSB= 0
##$STSI= 32768
##$STSR= 0
##$SW_p= 8223.68421052631
##$SYMM= 0
##$S_DEV= 0
##$TDeff= 65536
##$TDoff= 0
##$TI= <>
##$TILT= no
##$TM1= 0
##$TM2= 0
##$TOPLEV= 0
##$USERP1= <user>
##$USERP2= <user>
##$USERP3= <user>
##$USERP4= <user>
##$USERP5= <user>
##$WDW= 1
##$XDIM= 32768
##$YMAX_p= 430640476
##$YMIN_p= -667384
##$CURPLOT= <Network HP LaserJet P1505>
##$CURPRIN= <$Network HP LaserJet P1505>
##$DFORMAT= <normdp>
##$LAYOUT= <+/1D_H.xwp>
##$LFORMAT= <normlp>
##$PFORMAT= <normpl>
##$SURQMSG= 1
$$ End of Bruker specific parameters
$$ ---------------------------------
##NTUPLES= NMR SPECTRUM
##VAR_NAME=  FREQUENCY,     SPECTRUM/REAL,   SPECTRUM/IMAG
##SYMBOL=    X,             R,               I
##VAR_TYPE=  INDEPENDENT,   DEPENDENT,       DEPENDENT
##VAR_FORM=  AFFN,          ASDF,            ASDF
##VAR_DIM=   32768,         32768,           32768
##UNITS=     HZ,            ARBITRARY UNITS, ARBITRARY UNITS
##FACTOR=    0.250966925370066, 1,           1
##FIRST=     8223.43324360094, 137917,       -64552
##LAST=      0,             -997,            -340565
##MIN=       0,             -667384,         0
##MAX=       8223.43324360094, 430640476,    0
$$ Real data points
##PAGE= N=1
##DATA TABLE= (X++(R..R)), XYDATA
$$ [...]
19540g9231j20117J9625K3102j14594g1859m36283A35895J58055b4746o2674k42975
$$ -79231 -199348 -179723 -156621 -271215 -71859 -508142 135895 293950 -24746 -87420 -330395
19529c30395m0631D4013a55340A31373b19378h2715C6949a06842B43871b08510
$$ -330395 -371026 44013 -155340 131373 -219378 -82715 36949 -106842 243871 -208510
19518c1182F2982e009F0616b07706C78758e38270B69967A04709b90190O4137a82
$$ -31182 62982 -5009 60616 -207706 378758 -538270 269967 104709 -290190 -226053 -182
19506c78786h5387G5899f8995B34205a04222j10847j62069J69317A25756g9485
$$ -378786 -85387 75899 -68995 234205 -104222 -215069 -377138 -207821 125756 -79485
19495i6543M1242m6842A3483d8520k5808A50731a96473B36002F2210a26624c4632
$$ -96543 -55301 -102143 13483 -48520 -74328 150731 -196473 236002 62210 -126624 -34632
19483B01976E2108b8497D595a6024A4176b10017a01685j7837N0131A09868J91930
$$ 201976 52108 -28497 4595 -16024 14176 -210017 -101685 -119522 -69391 109868 301798
19472C01798g8203j44217g3308k06184o6610J72441Q3972B57678a81168A67051
$$ 301798 -78203 -222420 -73308 -279492 -346102 -173661 -89689 257678 -181168 167051
19461b9670k71583J26416E3812a29636k1607O7485A23922C8347M9882g4862o4980
$$ -29670 -301253 -174837 53812 -129636 -151243 -83758 123922 38347 88229 -74862 -139842
19450a39842A156J49190b90482B81181A17768g3350l6397F4184b62257J1666M833
$$ -139842 1156 150346 -290482 281181 117768 -73350 -109747 64184 -262257 -250591 -245758
19439b45758L3590H0846J14118g7707K8671j52264I8752b37829F5345b64550e4822
$$ -245758 -212168 80846 194964 -77707 -49036 -201300 98752 -237829 65345 -264550 -54822
19427a31918m43644F3128J7757a33473j37787p3003A67921a12878J1379E5297
$$ -131918 -575562 63128 80885 -133473 -271260 -344263 167921 -112878 -101499 55297
19416E9c5734E5843J55677I4073a72806A26794i2924L5626I3776f6401m22076
$$ 59 -35734 55843 211520 94073 -172806 126794 -92924 -57298 93776 -66401 -488477
19405d88477D563a4028m8952p438j26784N4464I1850J0417d36054F442J55994
$$ -488477 4563 -14028 -62980 -70418 -197202 -142738 91850 102267 -436054 6442 162436
19394A62436a64311d5337j0350G1008K29430c9301A72549e5410H379Q1748b67198
$$ 162436 -164311 -45337 -55687 71008 300438 -39301 172549 -55410 8379 90127 -267198
19382B6932b19874c9898h849n0464A78352b2890n4378J0451k03128I4343D6338
$$ 26932 -219874 -39898 -8849 -59313 178352 -22890 -77268 -66817 -269945 94343 46338
19370a19342j90708h6609K7662c444E3206b77931a34004e6974p1761e4508m6013
$$ -119342 -310050 -86609 -58947 -3444 53206 -277931 -134004 -56974 -128735 -54508 -100521
19359a00521L0912B27707g2152C6581d05129b4156F2033a27857k10917e5452j39795
$$ -100521 -69609 227707 -72152 36581 -405129 -24156 62033 -127857 -338774 -55452 -195247
19348a95247h3447F7245l3489a19515N0241c1139C7199J25523Q1992b87957J38997
$$ -195247 -83447 67245 33756 -119515 -69274 -31139 37199 162722 244714 -287957 -148960
19337a48960C45314a34743A22383a57343B5658J6646O5690J47062b17208B24277
$$ -148960 345314 -134743 122383 -157343 25658 42304 107994 255056 -217208 224277
19326d8314r3613k59649R5970A69906J8542b73385e7009H4451a25522A6585P2685
$$ -48314 -141927 -401576 -305606 169906 188448 -273385 -57009 84451 -125522 16585 89270
19315H9270a61696A06594n096b9454A27279a18073D3820c96422B44041a8594A2466
$$ 89270 -161696 106594 101498 -29454 127279 -118073 43820 -396422 244041 -18594 12466
19303A4331K823b77687F3397b80065N7809d1406j70367A45098m7450f2814P102
$$ 14331 17154 -277687 63397 -280065 -222256 -41406 -211773 145098 97648 -62814 -55712
19292e5712j63835p0775A83847C8124c28308C5366a562B3617K02839a74241J2984
$$ -55712 -219547 -290322 183847 38124 -328308 35366 -1562 23617 226456 -174241 -161257
19281a61257p6388M3902l4041B10644a52819j6393j45371B68381b18942i382k04262
$$ -161257 -237645 -193743 -227784 210644 -152819 -169212 -314583 268381 -218942 -9382 -213644
19270b13644q4139J3676A08507b23818K7487n8911c0284A1147K27962b9575A66381
$$ -213644 -297783 -284107 108507 -223818 -196331 -255242 -30284 11147 239109 -29575 166381
19258b2588o0827k16300r601k81018a01675j27484j90664d0640B06049e5317A01188
$$ -22588 -83415 -299715 -309316 -590334 -101675 -229159 -419823 -40640 206049 -55317 101188
19246E7290c26742e534j84296j279H0449a62853B32231d3675K1746l3393C9501
$$ 57290 -326742 -5534 -189830 -191109 80449 -162853 232231 -43675 -21929 -55322 39501
19234a91360c7943o6663A30734a73720a1696j36816G6774a75752A00704j8225
$$ -191360 -37943 -104606 130734 -173720 -11696 -148512 76774 -175752 100704 82479
19224H2479l1180K44087f4358j31067j31734E7169c23844q8315A51400f5171j60304
$$ 82479 51299 295386 -64358 -195425 -327159 57169 -323844 -412159 151400 -65171 -225475
19213b25475a7906A12896c45319A26727c18364M3580J0067I8867j7652d81866
$$ -225475 -17906 112896 -345319 126727 -318364 -274784 -264717 98867 81215 -481866
19202c2850j78214H5051k1841c94606d7376B49798p3742a98165O1216j24915o9139
$$ -32850 -211064 85051 63210 -394606 -47376 249798 176056 -198165 -136949 -261864 -331003
19191c31003I5515a31332B39947A03072a98118C951a78165Q3843C25484n8668
$$ -331003 95515 -131332 239947 103072 -198118 3951 -178165 -94322 325484 266816
19181B66816D6803f4058k61555H075a45921a1988j91592e1801A60696F4525j6689
$$ 266816 46803 -64058 -325613 8075 -145921 -11988 -203580 -51801 160696 64525 47836
19170D7836a56606q5824B39971q2229p87a30410o4596h749m31951a05740B57921
$$ 47836 -156606 -242430 239971 157742 156955 -130410 -195006 -8749 -440700 -105740 257921
19158e7739o0079b4131j60004G0224N1082a70672K0011k50960a09282A8201b0525
$$ -57739 -117818 -24131 -184135 70224 121306 -170672 -150661 -401621 -109282 18201 -20525
19146C9516a94505M6504A2818a80296A07341J31557h9673n1437p911A57998a38225
$$ 39516 -194505 -148001 12818 -180296 107341 238898 -89673 -141110 -149021 157998 -138225
19134c83334B06321m8842R6314c79412e2965A45867K270A7544b36678e7902O533
$$ -383334 206321 157479 253793 -379412 -52965 145867 148137 17544 -236678 -57902 -51369
19123e1369a4390I750J37563K3684b0738j076D2386g0949K9917l953o8501l91813
$$ -51369 -14390 9750 147313 170997 -20738 -21814 42386 -70949 -41032 -44985 -113486 -505299
19111e05299A58033b20370a740l0076E5066L29192A17018a7775l3181J8072j47400
$$ -505299 158033 -220370 -1740 -31816 55066 384258 117018 -17775 -50956 -32884 -180284
19100a80284C9836a29809B86070F9177b91610A58792a21351J3146F7935D113J710
$$ -180284 39836 -129809 286070 69177 -291610 158792 -121351 -108205 67935 4113 5823
19089E823K13c72738e9308j2075C8339b2076j49904a2218A24801D6358a52787
$$ 5823 6036 -372738 -59308 -71383 38339 -22076 -171980 -12218 124801 46358 -152787
19077f7848b0494C51852a98863Q6753A49485i1711b7586H3886k983a41952q892
$$ -67848 -20494 351852 -198863 -112110 149485 -91711 -27586 83886 80903 -141952 -150844
19066a50844L7494H8830M090b45493D3428a24713A19666E6670i8356E3457d12492
$$ -150844 -113350 88830 92920 -245493 43428 -124713 119666 56670 -98356 53457 -412492
19054g8073o6240j17397D0238b12623e0027k1988A10192d90457A99351H2905c91723
$$ -78073 -144313 -261710 40238 -212623 -50027 -72015 110192 -490457 199351 82905 -391723
19042c0512j77561R5675C7602J0040Q7423a64961P5504M2278A8097b00420j39274
$$ -30512 -208073 -112398 37602 47642 135065 -164961 -89457 -47179 18097 -200420 -339694
19031c39694D4906a6952A11913K47702a01570A05699j1038J91627L5842F3971
$$ -339694 44906 -16952 111913 359615 -101570 105699 94661 286288 322130 63971
19020c4917G0517f2810m3649k36397A45851b25470g5161H9131c65813A5249b7978
$$ -34917 70517 -62810 -106459 -342856 145851 -225470 -75161 89131 -365813 15249 -27978
19008I0839I590f0637J8750A44120e5817l76039a28508k85593f4344l9057k89702
$$ 90839 9590 -60637 -41887 144120 -55817 -431856 -128508 -414101 -64344 -103401 -393103
18997c93103A63547G363b023B8712a35523k7495f4946B02892m4271a41530A04606
$$ -393103 163547 7363 -2023 28712 -135523 -163018 -64946 202892 158621 -141530 104606
18985B5798a04288J6021B5732b20160C3663b73399B03722e8630B01791a23383
$$ 25798 -104288 -88267 25732 -220160 33663 -273399 203722 -58630 201791 -123383
18974C6318b92124N9026p1071O1442C83129d3695q7371c6086l66045d1453j63419
$$ 36318 -292124 -233098 -304169 -242727 383129 -43695 -131066 -36086 -402131 -41453 -204872
18963b04872j2943f5296B83773I1025d21568f4761A64859a73790B2605J48308
$$ -204872 -217815 -65296 283773 91025 -421568 -64761 164859 -173790 22605 170913
18953A70913i8120B89469d1166N047A81566b35120b6476j23245e0377A61887c26995
$$ 170913 -98120 289469 -41166 -36119 181566 -235120 -26476 -149721 -50377 161887 -326995
18941A13491c9635D9261L46782f6807j9735L1737I1999N2001F6917a20922e0656
$$ 113491 -39635 49261 396043 -66807 -86542 -54805 91999 144000 66917 -120922 -50656
18929B1324c25843j49291a87020B54635a41972j0701A47829b25267B05139a81795
$$ 21324 -325843 -475134 -187020 254635 -141972 -152673 147829 -225267 205139 -181795
18918b2555C6780h5060j29793b5282m4343B69168A7468e26469J78291J61760R0939
$$ -22555 36780 -85060 -214853 -25282 -69625 269168 17468 -526469 -348178 -186418 -95479
18907i5479j16970g2415A0234b15018P1091d5785o2624l35525C3530d427k32939
$$ -95479 -212449 -72415 10234 -215018 -143927 -45785 -108409 -443934 33530 -4427 -237366
18896b37366M3048F0421J01938m757N8691e5385n1010A98468A974J70406A5018
$$ -237366 -194318 60421 162359 157602 216293 -55385 -106395 198468 1974 172380 15018
18884b06326G1478c9343j37770k76470b15545c936B73202a46536B65785A6429
$$ -206326 71478 -39343 -177113 -453583 -215545 -3936 273202 -146536 265785 16429
18873g8941B5991d7865l49100G8459B1455a36893C2845c0375E8751a39310j43862
$$ -78941 25991 -47865 -396965 78459 21455 -136893 32845 -30375 58751 -139310 -283172
18862b83172G0414N3872e4585j27378H2814J67557f252n0883A07787D4525a68880
$$ -283172 70414 124286 -54585 -181963 82814 250371 -6252 -57135 107787 44525 -168880
18850G3112Q384K3294a4939A0168J79602c53324P4446I3992a64722l07514K08701
$$ 73112 81496 104790 -14939 10168 189770 -353324 -278878 93992 -164722 -472236 -263535
18839b63535q0082b9653A24008C0160f1132F5032K75449D0280b20658K4273B5156
$$ -263535 -343617 -29653 124008 30160 -61132 65032 340481 40280 -220658 -196385 25156
18827E836J17559C7768N4618b98989B1184K27674b20318m9206d1033a5391l55068
$$ 5836 123395 37768 92386 -298989 21184 248858 -220318 -269524 -41033 -15391 -370459
18816c70459J79930D5824k2018J52515h7581B54887b83357A43770O395m753J19201
$$ -370459 -190529 45824 23806 176321 -87581 254887 -283357 143770 150165 145412 264613
18805B64613f5396A1271c27310A37227c7839A47403A9198a15706I0237L8454c5695
$$ 264613 -65396 11271 -327310 137227 -37839 147403 19198 -115706 90237 128691 -35695
18793b67831c9751k33872A1350d3666B07682b00797N5276A31527f5893r9508q515
$$ -267831 -39751 -273623 11350 -43666 207682 -200797 -145521 131527 -65893 -165401 -173916
18782a73916I6990e3592l70138B05358a35612N0026k16520o8647c9039F1374d38773
$$ -173916 96990 -53592 -423730 205358 -135612 -85586 -302106 -370753 -39039 61374 -438773
18770c84104i6890k24341C3871j5274O411Q5491a19505m5936A47280b04152d0390
$$ -384104 -96890 -321231 33871 18597 25008 110499 -119505 -165441 147280 -204152 -40390
18758i1349C9505a52630m1362p254R4273b7730l8220B38439a93519A36155a52598
$$ -91349 39505 -152630 -193992 -201246 -106973 -27730 -65950 238439 -193519 136155 -152598
18746a74549r4393D1504K07987h8319k31928A8701a12193e618k2183k94910J9761
$$ -174549 -268942 41504 249491 -88319 -320247 18701 -112193 -5618 -27801 -322711 -302950
18735c02950A22531P0305a95109Q5312i338k24503A28105A9969a05271n6794D6021
$$ -302950 122531 192836 -195109 -109797 -9338 -233841 128105 19969 -105271 -162065 46021
18723G0088d4449k02164A3703P3803j7596b09151D6827K17830a47862k2581O4569
$$ 70088 -44449 -246613 13703 87506 69910 -209151 46827 264657 -147862 -170443 -105874
18712a05874q683d9274A75346l7854n7027o684f0462A92789b8308B12586b44959
$$ -105874 -114557 -49274 175346 137492 80465 73781 -60462 192789 -28308 212586 -244959
18700a51363K7469q1622O3575q308g856j59153l3677D6636f3233J6249q2428A93939
$$ -151363 -123894 -205516 -141941 -150249 -7856 -167009 -200686 46636 -63233 -46984 -129412 193939
18687c34708d3609k05218B19203a66840e7555m0574n1225j5969P6025B05627b95303
$$ -334708 -43609 -248827 219203 -166840 -57555 -98129 -149354 -165323 -89298 205627 -295303
18675H0145O5307E2018a03612j12702M1892b3037j26533G1451b62714j24622i5655
$$ 80145 145452 52018 -103612 -216314 -174422 -23037 -149570 71451 -262714 -387336 -95655
18663g7502G1661c80293a7209k1659k09430C0713P4084c23877C8244J65121J79155
$$ -77502 71661 -380293 -17209 -38868 -248298 30713 104797 -323877 38244 203365 382520
18652C82520E6485a02643b7880j50298D53399a08644K4671A7425a93005B1922
$$ 382520 56485 -102643 -27880 -178178 453399 -108644 -83973 17425 -193005 21922
18641C2044L00958b08056g9014C23875b92371E9346G810a80012A17134i963l56592
$$ 32044 333002 -208056 -79014 323875 -292371 59346 7810 -180012 117134 -9963 -366555
18630c66555F284a50527G2406N1718e8411o7843j0758B00380j795g7425c7776
$$ -366555 6284 -150527 72406 124124 -58411 -126254 -137012 200380 198585 -77425 -37776
18618a84548j6648D4665a05483A0549a65500m58183D620e27070b28628I207Q7020
$$ -184548 -201196 44665 -105483 10549 -165500 -623683 4620 -527070 -228628 9207 96227
18607I6227J07813b12797R7860q6719m7072p9180a30230j6203A24192J78702a00508
$$ 96227 204040 -212797 -114937 -201656 -248728 -327908 -130230 -146433 124192 302894 -100508
18595E0870b3448B12063d01697J16405L1283f9383L157J5972a8961j56539j33314
$$ 50870 -23448 212063 -401697 -285292 -254009 -69383 -66226 -50254 -18961 -175500 -308814
18584c08814A7704g6013j66845e0941E5914a04644G8381B2791b33403D9526B0120
$$ -308814 17704 -76013 -242858 -50941 55914 -104644 78381 22791 -233403 49526 20120
18572A70896k1076k2837d4205m73903D2474h1196A03833L6317O7000b94273c7975
$$ 170896 149820 126983 -44205 -518108 42474 -81196 103833 140150 207150 -294273 -37975
18560i1044A61487a88703d4562D5221d113k10983E8054c81227a12415E5958b90049
$$ -91044 161487 -188703 -44562 45221 -4113 -215096 58054 -381227 -112415 55958 -290049
18548a87729N7037k8360c6394l1322l58773a1068j17101N1194A82823d9405k5362
$$ -187729 -130692 -159052 -36394 -67716 -426489 -11068 -128169 -76975 182823 -49405 -74767
18537g4767I0513d9295o6439p6435d4513j784B20117F3475e31081a69044B55614
$$ -74767 90513 -49295 -115734 -192169 -44513 -46297 220117 63475 -531081 -169044 255614
18525i7921p0049J7884A99215m2897o0280J35454a80727A59789c7250j44103A75763
$$ -97921 -167970 -150086 199215 156318 96038 231492 -180727 159789 -37250 -181353 175763
18513A25857a21308k02763A0789b43853A86054f5920b5435A72483f9371G1799
$$ 125857 -121308 -324071 10789 -243853 186054 -65920 -25435 172483 -69371 71799
18502G1735b03748F9528f0786m1263A11753J90095H486J11325B8294r198a60995
$$ 71735 -203748 69528 -60786 -102049 111753 301848 8486 119811 28294 19096 -160995
18490A24064e8097K2593j08669F7167i4944j9214E4896a35409M7996A56583c5528
$$ 124064 -58097 -35504 -144173 67167 -94944 -114158 54896 -135409 -87413 156583 -35528
18478d3950C1523a33648j49661B8465J1364K75497B6797O8933a33202M9550N607
$$ -43950 31523 -133648 -283309 28465 39829 315326 26797 95730 -133202 -83652 -78045
18467g8045A82508f601k28198C1696a67342Q3110A7269a52214e7647A8858J84740
$$ -78045 182508 -6601 -234799 31696 -167342 -84232 17269 -152214 -57647 18858 203598
18456B03598B3024a58583j04142h2378J8874E3411Q5329a54608M2416l6090j25376
$$ 203598 23024 -158583 -262725 -82378 -63504 53411 138740 -154608 -112192 -148282 -273658
18445b73658K1874E6671e4906j20006m8329e0484A27284o0869a79860Q1842H1182
$$ -273658 -251784 56671 -54906 -174912 -223241 -50484 127284 66415 -179860 -98018 81182
18433h8672j18710g520j58471B722c06032J48610C8139c83476d014j23390K5563
$$ -88672 -207382 -7520 -165991 2722 -306032 -157422 38139 -383476 -4014 -127404 -101841
18422a01841A03562d25558a8103B93981B5137b72822B24356f4764b7925j32984
$$ -101841 103562 -425558 -18103 293981 25137 -272822 224356 -64764 -27925 -160909
18412a60909B66291c05956C06996b91223a8422l49901H0752a65706k7916c1722
$$ -160909 266291 -305956 306996 -291223 -18422 -368323 80752 -165706 -193622 -31722
18401B16296i5285k07972G31J11337J31280a30011I46a07839A83407h5046B45997
$$ 216296 -95285 -303257 731 112068 243348 -130011 946 -107839 183407 -85046 245997
18389A12493g2872B05890O2747b79285i23k72173j72694J86684J9685D7472h9478
$$ 112493 -72872 205890 268637 -279285 -923 -273096 -445790 -259106 -239421 47472 -89478
18377a97245d0819a9897n2848H9733d8367j07837G0101b51975Q7275d6481B57394
$$ -197245 -40819 -19897 -72745 89733 -48367 -156204 70101 -251975 -164700 -46481 257394
18365C06145a35804d1474A7952P8987e4237j10373J352F1728k6978J16829a54635
$$ 306145 -135804 -41474 17952 96939 -54237 -164610 -163258 61728 34750 151579 -154635
18353a04324J1849j23002G1638L5853f0026j84312G3328K476A9130b4951A63389
$$ -104324 -92475 -215477 71638 107491 -60026 -244338 73328 75804 19130 -24951 163389
18341d68496D6025J39235c16905m808D3419a84823Q5145m7239C31124g902n9153
$$ -468496 46025 185260 -316905 -321713 43419 -184823 -99678 -146917 331124 -7902 -67055
18330f7055I9469a47842f4051j36773Q6345A97602a06132j89727A02572D4432
$$ -67055 99469 -147842 -64051 -200824 -114479 197602 -106132 -295859 102572 44432
18319d48844b22608H4219J43916f36918g6214A83019a91759k42530i6816A20424
$$ -448844 -222608 84219 228135 -636918 -76214 183019 -191759 -434289 -96816 120424
18308a32011A28025a63244k7695c5066o7361B314P0505c74560b3091I1022a45423
$$ -132011 128025 -163244 -190939 -35066 -102427 2314 72819 -374560 -23091 91022 -145423
18296A47346g2849F6691H204A034a6737A9299K17941F244c19089f5946B69132
$$ 147346 -72849 66691 8204 1034 -16737 19299 237240 6244 -319089 -65946 269132
18284B9158f6575E3942a01265a6076A19889f1974B74760B917b6271l19980a48024
$$ 29158 -66575 53942 -101265 -16076 119889 -61974 274760 2917 -26271 -346251 -148024
18272b1076j43007D8141a09088c7208J928j40823j13527J14123H860b7544H306
$$ -21076 -164083 48141 -109088 -37208 -35280 -176103 -289630 -175507 8860 -27544 8306
18260A19331a41497C2077J89608a73630B39046A01864a64976E2664a62653N1507
$$ 119331 -141497 32077 221685 -173630 239046 101864 -164976 52664 -162653 -111146
18250a11146p0956F8631b1097A04822e0755C4881c63906a76038A21636a37950
$$ -111146 -182102 68631 -21097 104822 -50755 34881 -363906 -176038 121636 -137950
18239e5523j34675A03567c93845a47577E0332a27998d3150k95985i2389E8938
$$ -55523 -190198 103567 -393845 -147577 50332 -127998 -43150 -339135 -92389 58938
18228a81117O8219m4268A30028g5283D9910d3590H1060R0676q2046c03004i7083
$$ -181117 -112898 -157166 130028 -75283 49910 -43590 81060 171736 89690 -303004 -97083
18216B6087J37329b03315i1594B59717F6282A3320L5563a89992A26273J31869
$$ 26087 163416 -203315 -91594 259717 66282 13320 48883 -189992 126273 258142
18206B58142j26692a13252l03042B67890c3324j43309b213j16795B8501c93929
$$ 258142 131450 -113252 -416294 267890 -33324 -176633 -2213 -119008 28501 -393929
18195B9097a21962F2492J9480j3964f8071m91935a49239J6717A1718O5338g7204
$$ 29097 -121962 62492 81972 68008 -68071 -560006 -149239 -132522 11718 77056 -77204
18183A2758K68536g8260q2383k43880A22534l452C32d6882E5443P0518d97888
$$ 12758 281294 -78260 -160643 -404523 122534 119082 332 -46882 55443 125961 -497888
18171I9553B1691a19991B51482d74153A3286b9557j46104f6630J5021A45212a7976
$$ 99553 21691 -119991 251482 -474153 13286 -29557 -175661 -66630 -51609 145212 -17976
18159a0104j73357R1342A4038a70401p557Q8502j41887g5731K2952A22403a46966
$$ -10104 -183461 -92119 14038 -170401 -177958 -89456 -231343 -75731 -52779 122403 -146966
18147e66q5295j03595A35351C6516c02605A00803a03364k4502b043I6328A6144
$$ -566 -85861 -189456 135351 36516 -302605 100803 -103364 -127866 -2043 96328 16144
18135g2902a9736k06821a8850H6742b04101h5158D5977f5956k13141C8244J58857
$$ -72902 -19736 -226557 -18850 86742 -204101 -85158 45977 -65956 -279097 38244 197101
18124A97101e1878A1037a82312N4353I6722a29163A5532O848J85532b13683h6371
$$ 197101 -51878 11037 -182312 -127959 96722 -129163 15532 22380 207912 -213683 -86371
18112b17930b7874j00935B2074a37359m34324h6690A32712d16847J11895M133
$$ -217930 -27874 -128809 22074 -137359 -571683 -86690 132712 -416847 -304952 -300819
18102c00819h67A68159G4952b01696F6590b08043A20405J7169a88614k07826H3636
$$ -300819 -867 168159 74952 -201696 66590 -208043 120405 137574 -188614 -396440 83636
18090b94009d2914E8066J44421r3556c534l66266C0827b4462o7643j19993B59078
$$ -294009 -42914 58066 202487 108931 -3534 -369800 30827 -24462 -92105 -212098 259078
18078E6749a52250B78167a79946A4017c44375n8848F0208b71534o604B81787a04510
$$ 56749 -152250 278167 -179946 14017 -344375 -403223 60208 -271534 -278138 281787 -104510
18066B05666f7144j57742A71184H2234A4087Q4310L09232B070b8782k36006B97785
$$ 205666 -67144 -224886 171184 82234 14087 98397 407629 2070 -28782 -264788 297785
18054h7023c5803j60494A42181a45982G211P7126a10669A75485P0500e9829L361
$$ -87023 -35803 -196297 142181 -145982 7211 84337 -110669 175485 245985 -59829 -56468
18043e6468b2857j38222G1469J3924a631j85581A35531g9308C60383i2769H2207
$$ -56468 -22857 -161079 71469 85393 -1631 -187212 135531 -79308 360383 -92769 82207
18031D58253a09380b0168F6512a79516G7772f419j05047C6791a96352i2086K0988
$$ 458253 -109380 -20168 66512 -179516 77772 -6419 -111466 36791 -196352 -92086 -71098
18020g1098b3889C55000j10342d4738q7594j7052j51461J6392f8420A01879J625
$$ -71098 -23889 355000 244658 -44738 -132332 -149384 -300845 -284453 -68420 101879 103504
18009A03504a14912c3599B18610E8124a41627c6587a3738B4131b25015q6284c9230
$$ 103504 -114912 -33599 218610 58124 -141627 -36587 -13738 24131 -225015 -311299 -39230
17997a40457l5428e6243I5068P608g6516J5101k4135A51177a44822L0980B62551
$$ -140457 -175885 -56243 95068 102676 -76516 -61415 -85550 151177 -144822 -113842 262551
17985d36983d4262k94886J19421G6838i1369B08276h7045A11489e7960k02072
$$ -436983 -44262 -339148 -219727 76838 -91369 208276 -87045 111489 -57960 -260032
17975b60032Q0516a5757j21384A19972J38271i2895A60704D4633b10405A55457
$$ -260032 -179516 -15757 -137141 119972 258243 -92895 160704 44633 -210405 155457
17964b69040f4383l0370A63257n5554A2114a7028k16359m28705b55269j9314n6971
$$ -269040 -64383 -94753 163257 107703 12114 -17028 -233387 -662092 -255269 -274583 -331554
17953c31554O2327G303d8936k18907B61699G0075C0196b86403h2943f469E4656
$$ -331554 -269227 7303 -48936 -267843 261699 70075 30196 -286403 -82943 -6469 54656
17941A88469g8691A36233c53719g6303c1026l9408c935A06015k6238P0275l4896
$$ 188469 -78691 136233 -353719 -76303 -31026 -70434 -3935 106015 79777 150052 115156
17930A15156i2170m8694b2359j35641j25361B97979h6683D1174N0063J75598I7481
$$ 115156 -92170 -140864 -22359 -158000 -283361 297979 -86683 41174 91237 266835 97481
17918a00895g488j3836j77168e4823B8321G291i4145C0193d12112F5304h7254
$$ -100895 -7488 -21324 -198492 -54823 28321 7291 -94145 30193 -412112 65304 -87254
17906B70420a93810B74955f6252B5870b30438R497i4479j82734h8708A8819d7847
$$ 270420 -193810 274955 -66252 25870 -230438 -220941 -94479 -277213 -88708 18819 -47847
17894a69576g4276A12199J07074a30513C74193h6724c7242k8664k7751B20629
$$ -169576 -74276 112199 219273 -130513 374193 -86724 -37242 -65906 -93657 220629
17883g2616C9528M9506g6834B14417c47035A77297i8330C6494K268J33601n4164
$$ -72616 39528 89034 -76834 214417 -347035 177297 -98330 36494 38762 172363 118199
17872A18199i2817A37217L0307j3767J51150e7449B09277c0755I4406J41308g683
$$ 118199 -92817 137217 167524 153757 304907 -57449 209277 -30755 94406 235714 -7683
17860C7191K44926B8993a14603H7839J37250i2531j7971A05908f7789A61444c2464
$$ 37191 282117 28993 -114603 87839 225089 -92531 -110502 105908 -67789 161444 -32464
17848B52279E3969c373k91880J27490K2319k97196a83829A61631N6035a52896
$$ 252279 53969 -3373 -295253 -167763 -145444 -442640 -183829 161631 217666 -152896
17837f7187G9598B5537c2798l8885B88454a08807l3695b4732C91935E0132a48394
$$ -67187 79598 25537 -32798 -71683 288454 -108807 -142502 -24732 391935 50132 -148394
17825A71579c14239n3957a45881L1008G7669K80959B2895c00977A18250N785Q6611
$$ 171579 -314239 -368196 -145881 -114873 77669 358628 22895 -300977 118250 124035 210646
17814B10646n8006a93852d0022B27187b50333B48142e25268K49234I1644c55636
$$ 210646 152640 -193852 -40022 227187 -250333 248142 -525268 -276034 91644 -355636
17803A44123J8618c55951A36744F4197f6956A76653b5296j12783m7380B05136
$$ 144123 162741 -355951 136744 64197 -66956 176653 -25296 -138079 -185459 205136
17792a21517B57052a57573A54477Q0213b15739C45815a01598A25564g0236J9771
$$ -121517 257052 -157573 154477 234690 -215739 345815 -101598 125564 -70236 -50465
17782e0465H2782a72020A97667c9324j34652l38357A16454a19265A95521a31159
$$ -50465 82782 -172020 197667 -39324 -173976 -512333 116454 -119265 195521 -131159
17771A43957a39323g808C58433b81995J33994D21205b5497a0091j99151G067Q7142
$$ 143957 -139323 -7808 358433 -281995 -148001 421205 -25497 -10091 -209242 7067 94209
17760I4209C1150J66559r6924j981C2094a85282q7521A36488c13952e5598A29450
$$ 94209 31150 197709 100785 98804 32094 -185282 -272803 136488 -313952 -55598 129450
17748b61910J23181f8325B3400L1335e7261p7193G484Q2680a8810B01844a25432
$$ -261910 -138729 -68325 23400 54735 -57261 -134454 7484 90164 -18810 201844 -125432
17736A17551b24896Q4623j71455H4157K46356b44889j89880J96152H0883R1964
$$ 117551 -224896 -140273 -311728 84157 330513 -244889 -434769 -238617 80883 172847
17726A72847d576m26736J58953a06066b0786k9959A49742A6972K4005A5343a53099
$$ 172847 -4576 -431312 -272359 -106066 -20786 -50745 149742 16972 40977 15343 -153099
17714A7821K44958q5722j6040g1725A34387P8973b1750A78853G663O8459c61289
$$ 17821 262779 177057 161017 -71725 134387 213360 -21750 178853 7663 76122 -361289
17702B23874A7877e44F9247Q8988c09093b805k37841A43808K2756G66b0980A30367
$$ 223874 17877 -544 69247 158235 -309093 -2805 -240646 143808 166564 766 -20980 130367
17689D00969F6482B5007a34513A8810f552k50159j86621a53796R099j95825B88733
$$ 400969 66482 25007 -134513 18810 -6552 -256711 -443332 -153796 -144697 -340522 288733
17677A10533m8452O3003J5537b31634d4338k1404P979m9370A52431a77433j15917
$$ 110533 62081 125084 140621 -231634 -44338 -65742 -57763 -107133 152431 -177433 -293350
17666b93350F9213i0632B89025a1921j7687j84268H3512a608l02929R9896g2613
$$ -293350 69213 -90632 289025 -11921 -29608 -213876 83512 -1608 -304537 -204641 -72613
17654A20395d57115c9204G413K7301K32730b53515a3322l1818n5959L098r197
$$ 120395 -457115 -39204 7413 34714 267444 -253515 -13322 -45140 -101099 -98001 -107198
17643a07198b0384m1165k56456C49033a48562c3836J228A96066a70986A294J17175
$$ -107198 -20384 -61549 -318005 349033 -148562 -33836 -32608 196066 -170986 1294 118469
17632A18469j6590K44329a45998A05201a10533a4238C18616o5624b87081A13694
$$ 118469 101879 346208 -145998 105201 -110533 -14238 318616 252992 -287081 113694
17621a58713k8294E432h6829F7690a15715b4596C47350j67328h7781A09577J87124
$$ -158713 -187007 5432 -86829 67690 -115715 -24596 347350 180022 -87781 109577 296701
17610B96701I7546a51468c7398A94826a68430G432b93168A64101b59263a03993
$$ 296701 97546 -151468 -37398 194826 -168430 7432 -293168 164101 -259263 -103993
17599A79459a39112k79026a8597j1091k2632A81990d37235b16971A26995J56226
$$ 179459 -139112 -418138 -18597 -29688 -52320 181990 -437235 -216971 126995 283221
17589B83221A19933L332a63819B88411l8253d6757j58321e6450A5185b292l2145
$$ 283221 119933 123265 -163819 288411 250158 -46757 -205078 -56450 15185 -2292 -34437
17578c4437A59800E3504H540J06662n4725J71231a80249b1845o7406A29072i5628
$$ -34437 159800 53504 8540 115202 60477 231708 -180249 -21845 -89251 129072 -95628
17566d40315a87646Q2452d3381a161j23393p1493C09889g2318A59611a1953A13813
$$ -440315 -187646 -105194 -43381 -1161 -124554 -196047 309889 -72318 159611 -11953 113813
17554D6017J92143q6540c9597k33880L6883d3853A3909J93171E5231b33391a15416
$$ 46017 238160 151620 -39597 -273477 -236594 -43853 13909 207080 55231 -233391 -115416
17542D33210A2301L30636B0443b71244A81418J61031a04042H5358J85443A04248
$$ 433210 12301 342937 20443 -271244 181418 342449 -104042 85358 270801 104248
17531i8411d4242j7633b1256F7982e3334B80966a26140B33076b58803E25664B52789
$$ -98411 -44242 -61875 -21256 67982 -53334 280966 -126140 233076 -258803 525664 252789
17519c05217A95796d27247G7082K91897I6737a14500h710k882j24536E8086L17386
$$ -305217 195796 -427247 77082 368979 96737 -114500 -8710 -11592 -136128 58086 375472
17508C75472M8344k02485q7249d4818B20511C6297J7575d01045I3180i2529c695
$$ 375472 423816 221331 134082 -44818 220511 36297 53872 -401045 93180 -92529 -3695
17496H0087J3516L44831k03747c70818A99055J797j1522D44i9754E3811a8494
$$ 80087 93603 438434 234687 -370818 199055 200852 189330 444 -99754 53811 -18494
17484B29999o3890k7038k7180K38143A44820K43400j57372K9990M7981j15910
$$ 229999 166109 139071 111891 350034 144820 388220 230848 260838 308819 192909
17474A92909O3428k2093b27907H5452J45497j01523a55883j072F4086k4207a7994
$$ 192909 256337 234244 -227907 85452 230949 129426 -155883 -156955 64086 39879 -17994
17462B54143n9728J41806a05932k55984E39761H8022b69941B2026J42285R7881
$$ 254143 194415 336221 -105932 -361916 539761 88022 -269941 22026 164311 262192
17452B62192r0684J28540D7679J24908J80774P1693j74089i2202L2536A34523
$$ 262192 171508 300048 47679 172587 353361 425054 250965 -92202 -59666 134523
17441C1777K75316a0235E10880a14781B24212J85328p6949A50231o1716j4048
$$ 31777 307093 -10235 510880 -114781 224212 409540 332591 150231 88515 74467
17431G4467J26787g004A89110G1077L36232A28371J5812J90048p6821K4336D6964
$$ 74467 201254 -7004 189110 71077 407309 128371 144183 334231 257410 281746 46964
17419E07557B40060A12811a85323B24166k4642L18615j32817I8508K09674j8778
$$ 507557 240060 112811 -185323 224166 199524 518139 385322 98508 308182 289404
17409B89404A12961b69392E90927d8225D07826h1675j74262h3830B21576E2001
$$ 289404 112961 -269392 590927 -48225 407826 -81675 -255937 -83830 221576 52001
17398B24464G2450M6603a22610I5323P8866K8206J04410j07866I5667D4775N08537
$$ 224464 72450 119053 -122610 95323 174189 202395 306805 198939 95667 44775 553312
17387E53312b0503B56743b2143A88885C4328L15500c7576E2792a38303K8347A12264
$$ 553312 -20503 256743 -22143 188885 34328 349828 -37576 52792 -138303 -109956 112264
17375A36545j6349i7490m1042A58575o9381P84J55590B0275J90523a45499C26815
$$ 136545 120196 -97490 -138532 158575 89194 89978 245568 20275 210798 -145499 326815
17363e4271K2436r699B629J58104G5883a8955B56543m0888O6290M7905o4092e5352
$$ -54271 -31835 -41534 2629 160733 75883 -18955 256543 215655 281945 329850 265758 -55352
17350B67370m5454o918r0213j5277J05958m3349A0616a26659k0088B82669Q8932
$$ 267370 221916 214998 124785 109508 215466 172117 10616 -126659 -146747 282669 371601
17339C71601r8940g3576B07201D4979a7350B40476H5565k6630h7684B59296G2330
$$ 371601 272661 -73576 207201 44979 -17350 240476 85565 58935 -87684 259296 72330
17327A47807J11083g1481a5790C21479q6891N1486m4979b86861G8985J00242m7546
$$ 147807 258890 -71481 -15790 321479 234588 286074 241095 -286861 78985 179227 131681
17316A31681F3154K39637j01405O6382j16909E7976Q2491K18426H7646L62390
$$ 131681 63154 302791 201386 267768 150859 57976 140467 358893 87646 450036
17306D50036A69970G3212O9728G722J59939b1819C74708q3603M2892I7721l5021
$$ 450036 169970 73212 142940 7722 167661 -21819 374708 291105 333997 97721 62700
17295F2700B8846P174Q5144b6187I6902B1237K06336h215C67357I6380N702D6202
$$ 62700 28846 36020 121164 -26187 96902 21237 227573 -8215 367357 96380 102082 46202
17282B48403k9113J50822A42184J0214a37277D45532A41936g1816F4065J14766
$$ 248403 219290 370112 142184 152398 -137277 445532 141936 -71816 64065 178831
17272A78831e0595E5433L43345D8556L30203A78662C9564A4138a08302B38332
$$ 178831 -50595 55433 398778 48556 378759 178662 39564 14138 -108302 238332
17261C50342K3993A43333a34241A57030M7051f3851a4188A81250b55693d3851
$$ 350342 374335 143333 -134241 157030 204081 -63851 -14188 181250 -255693 -43851
17250c2771A63027A489a20630B14100C1786L12803a5280F6070J62456A07282K31103
$$ -32771 163027 1489 -120630 214100 31786 344589 -15280 66070 228526 107282 338385
17239C38385H4573J44281h7633B08210e2437A00771L10646j1531j37161N4133
$$ 338385 84573 228854 -87633 208210 -52437 100771 411417 399886 262725 316858
17229C16858L92872H2390J2930K30370J27399A86704J44901J46703A08397O3612
$$ 316858 709730 82390 95320 325690 453089 186704 331605 478308 108397 172009
17219A72009L40694A81488K7335a7283D69907A84217a25599A47426j152a88311
$$ 172009 512703 181488 208823 -17283 469907 184217 -125599 147426 146274 -188311
17208A20515M74692k66523j02708C0522K10706J18319P5786B06858e6668h159
$$ 120515 595207 328684 225976 30522 241228 359547 435333 206858 -56668 -8159
17197B85852m3906d4202E03668D9614K03313e9149D09343k963H9619B7565L45062
$$ 285852 241946 -44202 503668 49614 252927 -59149 409343 406380 89619 27565 372627
17186C72627K0159k5655j01373A5386P968D562L96773j76910P0414J44971A37198
$$ 372627 392786 367131 265758 15386 23354 4562 401335 224425 294839 439810 137198
17174a44003A46697J31551J49353A85891m9806a37576C19355N2765A25713M02863
$$ -144003 146697 278248 427601 185891 136085 -137576 319355 372120 125713 528576
17164E28576J07900B37312a09803B68678K18640m4544A9695K90935O723j54629
$$ 528576 636476 237312 -109803 268678 487318 442774 19695 310630 317353 162724
17154A62724L49119p7155A35160l1266K1446K78092n5754A09901l0390J66350
$$ 162724 511843 434688 135160 103894 125340 403432 347678 109901 79511 245861
17144B45861o1524L20704j55977j72208K22889A98056N2357J3555j04001L20853
$$ 245861 184337 505041 349064 176856 399745 198056 250413 263968 159967 480820
17134D80820k27284O7931j33837A57K33288M5754F7769J91459K8121a05918B72217
$$ 480820 253536 321467 187630 157 233445 279199 67769 259228 287349 -105918 272217
17122C63353A26599L34521A8783M53305B147J11804M04302A72517K24342q3099
$$ 363353 126599 461120 18783 472088 2147 113951 518253 172517 396859 313760
17112C13760K57781Q3488k64168d9950A30765J91337O3930N5728J41447n5645
$$ 313760 571541 655029 390861 -49950 130765 322102 386032 441760 583207 527562
17102E27562e704C06469E5906M64433k50364p2478J60735k2674j03667K18654
$$ 527562 -5704 306469 55906 520339 269975 197497 358232 335558 231891 450545
17092D50545r0970n4460J14161j51508j11766J80493j18462M11079k54102m6821
$$ 450545 359575 305115 419276 267768 156002 336495 218033 629112 375010 328189
17082C28189K69651I9357K61788j572J39395j08743J39222A20629L41359l1814
$$ 328189 597840 99357 361145 359573 498968 390225 529447 120629 461988 430174
17072D30174K52055K3188k75406j21876r1130C324L28359K3952L02892A92338
$$ 430174 682229 705417 430011 308135 217005 3324 331683 355635 658527 192338
17061C45181J6242L1056A25694O64535C55603J19621r4427p8274K34683K65672
$$ 345181 361423 392479 125694 790229 355603 475224 380797 302523 537206 802878
17051H02878j84899j43147N5859j88369Q4679k2068J07592K86999J6063l19186
$$ 802878 617979 474832 530691 342322 427001 404933 512525 799524 815587 496401
17041D96401L0594m7454J00843p9101J08093k33801A39555K85006J64575l7787
$$ 496401 526995 479541 580384 501283 609376 375575 139555 424561 589136 551349
17031E51349j53660L95083k97228j18170A85130L47101N2457B50012K31650M09175
$$ 551349 397689 792772 495544 377374 185130 532231 584688 250012 481662 890837
17021H90837D26770N3182M05931m3729C11817K65812l2435Q1472O3617p8950J92836
$$ 890837 426770 479952 885883 842154 311817 577629 545194 626666 690283 611333 804169
17010H04169k37375L9615J49977o4942m5400j71191L28226M6906k24826k24911
$$ 804169 566794 606409 756386 691444 646044 474853 803079 849985 625159 400248
17000D00248J31384J17163O7197j51081K48834l31736O7136J01040Q3509J84784
$$ 400248 531632 648795 715992 564911 813745 482009 549145 650185 733694 918478
16990I18478k41304K68227k81053K021K69227j78601J46309J56689k11700j57846
$$ 918478 677174 945401 664348 666369 935596 756995 903304 1059993 848293 690447
16980F90447j17695J07146R6061R5117L6006L7059n6818R8750k19084n8194J02256
$$ 690447 572752 679898 775959 871076 907082 944141 887323 986073 766989 708795 811051
16969H11051j3195L12495q5211k48245K35280n055j27358K81601k38223j30144
$$ 811051 797856 1110351 1025140 776895 1012175 1007120 879762 1161363 923140 792996
16959G92996K41782O1537j89990J46283k14148K98591k31054K6357J75911m26526
$$ 792996 1034778 1096315 906325 1052608 838460 1137051 905997 932354 1108265 681739
16949F81739N19870j83426J05136J47455j07108n6604j74452m4211J46423l62052
$$ 681739 1201609 1018183 1123319 1270774 1163666 1107062 932610 888399 1034822 672770
16939F72770O18209k27846L72846k16036q0977L7100J46259k06338r9356K30786
$$ 672770 1290979 1063133 1435979 1219943 1138966 1176066 1322325 1115987 1016631 1247417
16929A247417K91484j64236j16818k12045M78473n76915M2309L30294K86637l62087
$$ 1247417 1538901 1374665 1257847 1045802 1524275 947360 989669 1319963 1606600 1244513
16919A244513J708q9006L69593j77529n1295J83221N9940k51864J2380M23404
$$ 1244513 1246221 1157215 1526808 1349279 1297984 1481205 1541145 1289281 1301661 1725065
16909A725065p1443n30661N92998k63832j81657J57343J27375Q206J58456R8165
$$ 1725065 1653622 1122961 1715959 1452127 1270470 1427813 1555188 1563394 1721850 1820015
16899A820015p5567J34730l51640K92913j57136M8574j852L5502n7169q2995J73842
$$ 1820015 1744448 1879178 1527538 1820451 1663315 1711889 1710037 1745539 1688370 1605375 1779217
16888A779217J17125J4269q8305J26095Q8993k12760L45473L827j56828K06633
$$ 1779217 1896342 1910611 1822306 1948401 2037394 1824634 2170107 2173934 2017106 2223739
16878B223739Q3086j71748q4461N1655J69887j26621N6845P0759J15935J14328
$$ 2223739 2306825 2135077 2050616 2102271 2272158 2145537 2202382 2273141 2389076 2503404
16868B503404j67757R5854J09624J40078l06382O5995K42758k5326O7068M7123
$$ 2503404 2335647 2431501 2541125 2681203 2374821 2440816 2683574 2658248 2725316 2772439
16858B772439j01762K37697j66080p261N31182k63563L12469k90985J77825l67248
$$ 2772439 2670677 2908374 2742294 2735033 3266215 3002652 3315121 3024136 3201961 2834713
16848B834713M92808l01239K77933K71423l26106K3189L26769K81163l95653J41992
$$ 2834713 3327521 3026282 3304215 3575638 3249532 3272721 3599490 3880653 3485000 3626992
16838C626992J11483K99302j81120J38613o619K02804N3483j79479k5020J44769
$$ 3626992 3738475 4037777 3856657 3995270 3988651 4191455 4244938 4065459 4040439 4185208
16828D185208J45607M91136m03628K33437K68453J2600J05059j13056N30340m77282
$$ 4185208 4330815 4821951 4418323 4651760 4920213 4932813 5037872 4924816 5455156 4977874
16818D977874M29604n7534J49702M23843m1159l640K33265k82060L57335L06038
$$ 4977874 5407478 5349944 5499646 5923489 5882330 5878690 6111955 5829895 6187230 6493268
16808F493268J22422l96647O08284j07516O13860j16062K28840o3575M72000J51765
$$ 6493268 6615690 6219043 6827327 6719811 7333671 7217609 7446449 7382874 7854874 8006639
16798H006639M36501K01368J92111j66112R12N76940J68996J01057L47912J39214
$$ 8006639 8443140 8644508 8836619 8670507 8671419 9248359 9417355 9518412 9866324 10005538
16788A0005538P27863o0699M26932K73485J89759P46135n14J08515O39631O30699
$$ 10005538 10733401 10672702 11099634 11373119 11562878 12309013 12308499 12417014 13056645 13687344
16778A3687344K84473J92544M48031N93244O54752N17254M8330J060104O72866
$$ 13687344 13971817 14164361 14612392 15205636 15860388 16377642 16425972 17486076 18158942
16769A8158942M66435L05055Q86640Q51098Q22757O35092P08958Q42412Q76293
$$ 18158942 18625377 18930432 19817072 20668170 21490927 22126019 22834977 23677389 24553682
16760B4553682R19697J255171R10595J255965J608327J123374J351747J277329
$$ 24553682 25473379 26728550 27639145 28895110 30503437 31626811 32978558 34255887
16752C4255887J901048J093340K390498J525603K267275K018015K305222K928334
$$ 34255887 36156935 37250275 39640773 41166376 43433651 45451666 47756888 50685222
16744E0685222K319128K762342K831854L378329L300746L857669L749394M279434
$$ 50685222 53004350 55766692 58598546 61976875 65277621 69135290 72884684 77164118
16736G7164118M195950M953908N127901N121822N334768N929285O168567N999370
$$ 77164118 81360068 86313976 91441877 96563699 101898467 107827752 113996319 119995689
16728A19995689O400778O225212O576796O597415N501367N674112N232091M500432
$$ 119995689 126396467 132621679 139198475 145795890 151297257 156971369 162203460 166703892
16720A66703892L757417L112086J441254R30193o61228j603450k410317l163495
$$ 166703892 170461309 173573395 175014649 175944842 175283614 173680164 171269847 168106352
16712A68106352m861349m993277n466242o094135o364197o694465o423107o905747
$$ 168106352 163245003 158251726 152785484 146691349 140327152 133632687 127209580 120303833
16704A20303833o061376o196468o364166n513698n374771m861957n276969m321770
$$ 120303833 114242457 108045989 101681823 96168125 90793354 85931397 80654428 76332658
16696G6332658m159125m179738l490527m124019l134633k983021k737508k529866
$$ 76332658 72173533 67993795 64503268 60379249 57244616 54261595 51524087 48994221
16688D8994221k626772k373587k174699j856643j836709j727244j860270j550619
$$ 48994221 46367449 43993862 41819163 39962520 38125811 36398567 34538297 32987678
16680C2987678j425929j546318j055539j623590q48418j148664o11559j323909
$$ 32987678 31561749 30015431 28959892 27336302 26487884 25339220 24727661 23403752
16672B3403752q95476j066694m86488p91295j094713o25681p50030k92601p77690
$$ 23403752 22508276 21441582 20955094 20163799 19069086 18443405 17693375 17400774 16623084
16663A6623084n17552m23965o46953q35269j7314r01282k16543n08854l62007
$$ 16623084 16105532 15681567 15034614 14199345 14182031 13280749 13064206 12555352 12193345
16654A2193345k83871o24678o7440n0747o75908k35666j93820n05536p8410l56956
$$ 12193345 11909474 11284796 11217356 11166609 10490701 10255035 10061215 9555679 9477269 9120313
16644I120313K5839l9799o29913r6043k34027j92608j61737j5940m80221l59024
$$ 9120313 9146152 9106353 8476440 8380397 8146370 7953762 7792025 7776085 7295864 6936840
16634F936840M51173l08093l04923m25882J27648m01378j35575o5386p045J12923
$$ 6936840 7388013 7079920 6774997 6349115 6476763 6075385 5939810 5874424 5867379 5980302
16624E980302n89120q6381K35842n05725L13628j78062l68000m9619L59793k12910
$$ 5980302 5391182 5304801 5540643 5034918 5348546 5170484 4802484 4752865 5112658 4899748
16614D899748m13113J2444m37560O87625m85976l15957N3711p8628j63259L53356
$$ 4899748 4486635 4499079 4061519 4749144 4263168 3947211 4000922 3922294 3759035 4112391
16604D112391k71520k91797M9164j86381j11218J26851n9848j74544K01863o17982
$$ 4112391 3840871 3549074 3598238 3411857 3300639 3427490 3367642 3193098 3394961 2776979
16594B776979L12176P1868j97696J11479J9300m09451L91555l29614L84451k56809
$$ 2776979 3089155 3161023 2963327 3074806 3094106 2684655 3076210 2746596 3131047 2874238
16584B874238k49659m6848l9123L62551m81081K43624r9057j37895l68182J61768
$$ 2874238 2624579 2577731 2538608 2901159 2420078 2663702 2564645 2426750 2058568 2220336
16574B220336K95567o6794k67426L5152J79334j72626k42668j1088J16844K06320
$$ 2220336 2515903 2449109 2181683 2216835 2396169 2223543 1980875 1969787 2086631 2292951
16564B292951k39364k40732M30845k36961j94338O6638J59766j71260J28543p0734
$$ 2292951 2053587 1812855 2243700 2006739 1812401 1879039 2038805 1867545 1996088 1925354
16554A925354k1924k90296O5909o940J50597l24106K60692r1796J71202n02715
$$ 1925354 1903430 1613134 1679043 1672103 1822700 1498594 1759286 1667490 1838692 1335977
16544A335977O2940k11618M89844l51222j03369j09067R7156K78641l5833j98622
$$ 1335977 1398917 1187299 1677143 1325921 1222552 1113485 1210641 1489282 1453449 1254827
16534A254827J645j92669N20205k59021j72461l686R1252L3718O6029J90131j70100
$$ 1254827 1256472 1063803 1584008 1324987 1152526 1148840 1240092 1273810 1339839 1529970 1359870
16523A359870k78481k5030L4675j62872L19702p1482K8016j94324Q10J24035K0305
$$ 1359870 1081389 1056359 1091034 928162 1247864 1176382 1204398 1010074 1010884 1134919 1155224
16512A155224J88650n19732L31272j1357k0012k11690J19878p2558L54164k82580
$$ 1155224 1343874 824142 1155414 1144057 1124045 912355 1032233 959675 1313839 1031259
16502A031259l99238J73055J8052O9334J06673k55735L0274K89198p2735l75047
$$ 1031259 632021 805076 823128 892462 999135 743400 773674 1062872 990137 615090
16492F15090L52860P3827j39247J9015k75804C02231M79166J51519j99040R4164
$$ 615090 967950 1041777 902530 921545 645741 302231 781397 932916 733876 828040
16482H28040R6836j91618j37729J07321K43710j76500J52297k8725P8453j11636
$$ 828040 924876 733258 595529 702850 946560 770060 922357 893632 972085 860449
16472H60449j65117k27480L43997j46096j3630k56691L29613L4154k35552J90419
$$ 860449 695332 467852 811849 665753 652123 395432 725045 759199 523647 714066
16462G14066k93483L10457j51338m3884J34856K03879l81646M33859D49375K08744
$$ 714066 420583 731040 579702 535818 670674 874553 492907 926766 449375 658119
16452F58119M2784J52067C36352J99116M8589r3341P1320K93652D22293L13589
$$ 658119 700903 852970 336352 535468 584057 490716 562036 855688 422293 735882
16442G35882j77338J76414l36697q970O10083l85559B86267J16564J31138k16444
$$ 735882 558544 734958 398261 389291 999374 613815 286267 402831 533969 317525
16432C17525J91452l6370J4182j34595M85734n7809k60335J39234A98214L80997
$$ 317525 508977 472607 486789 352194 837928 780119 519784 659018 198214 579211
16422E79211B01596L35671H1071L28381J83384j53848o3854k0350J50639j57669
$$ 579211 201596 537267 81071 409452 592836 438988 375134 354784 505423 347754
16412C47754R4411M3659j60695j16042J41122J48683A42350N79085q5761j42143
$$ 347754 442165 485824 325129 209087 350209 498892 142350 721435 635674 493531
16402D93531n5536k11992J43050J39068j75215K56656A76428M44361j08184I4238
$$ 493531 437995 226003 369053 508121 332906 589562 176428 620789 512605 94238
16391B88828J21061O5247J44647j36527m5671K642j16600j08685o6549B5781K93970
$$ 288828 409889 475136 619783 483256 437585 440227 323627 214942 148393 25781 319751
16380C19751c2512B25936p4913L26144k01492Q7612j0689b16265A88242n2909
$$ 319751 -32512 225936 151023 477167 275675 363287 352598 -216265 188242 135333
16370A35333J67620R9359Q6145k37566N8727o9050k1785J09305K00892L436A40661
$$ 135333 302953 402312 488457 250891 309618 240568 218783 328088 528980 532416 140661
16358A83965K37022K92389B77536j1743P1186j04157K08490m1041j2209L1593
$$ 183965 420987 713376 277536 265793 336979 232822 441312 400271 388062 419655
16348D19655F5852B0491N20414q4022C1329L58278D4402Q1292c0259A48669K18619
$$ 419655 65852 20491 540905 456883 31329 389607 44402 125694 -30259 148669 367288
16337C67288m282j30806q4497P9725j6924J03247G5985L15349e8442C61286E9771
$$ 367288 363006 232200 147703 227428 210504 313751 75985 391334 -58442 361286 59771
16325h3032A48368K60548E8464k5031L70851A45032L27466j21812E8076K63457
$$ -83032 148368 408916 58464 33433 404284 145032 472498 350686 58076 321533
16315C21533j2576j45804J12382F9827R4428J11925C6786J98810b74182A44656
$$ 321533 308957 163153 275535 69827 164255 276180 36786 235596 -274182 144656
16304B5530J26214G3679N69241A43895K28153A60884j3948a25475F2781J66570
$$ 25530 151744 73679 642920 143895 372048 160884 146936 -125475 62781 229351
16294B29351a85504A73735K31879A78500J50001d8235A12459K03938B2993L54678
$$ 229351 -185504 173735 405614 178500 328501 -48235 112459 316397 22993 377671
16284C77671D7799L59656A41325P8076K33760p4658f7456B12802o9527O4720J68346
$$ 377671 47799 407455 141325 219401 453161 378503 -67456 212802 143275 207995 376341
16273C76341b20144B88711n2820J91250j78516G3410P7150J0934J58193b010A50845
$$ 376341 -220144 288711 235891 427141 248625 73410 150560 161494 319687 -2010 150845
16261a26188h211J283C5298K1361J28536H9134N7858E5243J54492k0299p2601
$$ -126188 -8211 -6928 35298 56659 185195 89134 146992 55243 209735 189436 116835
16250A16835K35068I8447m3608N3969D9505e3051A66009C4852P5388P3603N101
$$ 116835 351903 98447 54839 108808 49505 -53051 166009 34852 110240 183843 188944
16239A88944J4176M25283A64902L70699a16422H9874J85044n7386l7224b9162
$$ 188944 203120 628403 164902 535601 -116422 89874 274918 217532 180308 -29162
16228D92545A44717K46026a38294B94501b2471n6642A61286D192J33897L30851
$$ 492545 144717 390743 -138294 294501 -22471 -79113 161286 4192 138089 468940
16218D68940C874P0403J17130J21598j33052l2746n8494f9985F3158L9797a40393
$$ 468940 3874 74277 191407 313005 179953 147207 88713 -69985 63158 102955 -140393
16206D04194m3729j01092E7377J26558n9393K19009A35858h1152I5552a18129
$$ 404194 360465 259373 57377 183935 124542 343551 135858 -81152 95552 -118129
16195A64082C107K63741a65360A43849k4618d4027B22920K9312L11089c34881
$$ 164082 3107 266848 -165360 143849 119231 -44027 222920 252232 563321 -334881
16184c05771B3485J5383L69172a02560C5386O6015J2604a218I254a6752D21432
$$ -305771 23485 38868 408040 -102560 35386 101401 114005 -1218 9254 -16752 421432
16172I0273c6858j34176H6726b07257A8838e7377B42110A7189R8295h1519C7641
$$ 90273 -36858 -171034 86726 -207257 18838 -57377 242110 17189 115484 -81519 37641
16160D2420N2991a8639H6088a53884O3335D4706J61703K57a0094q9360J983r6135
$$ 42420 95411 -18639 86088 -153884 -90549 44706 206409 206666 -10094 -99454 -97471 -193606
16148a93606C20829a89092j16314a39018D03727G8105c57195a03313A18281J23142
$$ -193606 320829 -189092 -305406 -139018 403727 78105 -357195 -103313 118281 241423
16138B41423a56981C6260J4164a14978d4900A94520a80224g9528A28902B8422
$$ 241423 -156981 36260 50424 -114978 -44900 194520 -180224 -79528 128902 28422
16127A43329g5804D9114K23257J13845f1778l59320P5430c5838m5411B80517a42015
$$ 143329 -75804 49114 272371 386216 -61778 -421098 -345668 -35838 -81249 280517 -142015
16115d523k8800B47971j05164C3274a34067H6898i6695A4900R559O4497K47539
$$ -4523 -33323 247971 142807 33274 -134067 86898 -96695 14900 24459 88956 336495
16104C36495j14295i2842A28605P1978I9079J51139d9682C6091f9464b9889B20915
$$ 336495 222200 -92842 128605 200583 99079 250218 -49682 36091 -69464 -29889 220915
16092C8162R7591F7209b19425O7731c6545A80387K481d4E8223a31461N5477g33
$$ 38162 135753 67209 -219425 -151694 -36545 180387 182868 -44 58223 -131461 -75984 -733
16079A41256P8580c98180f7803Q466D4118a16021l3127j24887M6765N0526A48503
$$ 141256 219836 -398180 -67803 -59337 44118 -116021 -149148 -274035 -227270 -176744 148503
16067b5097l3459A9103a81832Q8659j22156n4932A01064a18370B00240I0565h7092
$$ -25097 -58556 19103 -181832 -93173 -215329 -270261 101064 -118370 200240 90565 -87092
16055b5129m71333a09536L4939j59915b0688k92119D4409J55294C5875K18699
$$ -25129 -496462 -109536 -74597 -234512 -20688 -312807 44409 199703 35875 254574
16045B54574a65775m0024A29980l9448L2681b70195Q6615j86613A09150J33920
$$ 254574 -165775 -205799 129980 90532 123213 -270195 -183580 -370193 109150 243070
16035B43070I0446P5927q1265D1517b27645a06923E20300a69288j47409d3460
$$ 243070 90446 166373 85108 41517 -227645 -106923 520300 -169288 -316697 -43460
16024a48143A75144A3944a90082N956J3148j43653g3467L4625l3534A97790q1535
$$ -148143 175144 13944 -190082 -184126 -170978 -314631 -73467 -38842 -72376 197790 116255
16013A16255c5252H5735a64929D419g7298J5569G7109d87280A43290b2511n3975
$$ 116255 -35252 85735 -164929 4419 -77298 -61729 77109 -487280 143290 -22511 -76486
16002g6486r7047J7523C2671a2154m2766k18180i4953M2492D0694a5554A92473
$$ -76486 -173533 -156010 32671 -12154 -54920 -273100 -94953 -52461 40694 -15554 192473
15990B2517a90068k48028b5965H6171O7987K35069j02225o601j06732K7417D1620
$$ 22517 -190068 -438096 -25965 86171 154158 389227 287002 280401 173669 201086 41620
15978A24597e42072G78b29937A34497J91724b82456C7977A5706a10689C5578J29031
$$ 124597 -542072 778 -229937 134497 326221 -282456 37977 15706 -110689 35578 164609
15967A64609J4189B7817a94015C19423G0626M2828f8784C65715f5535E4749c11278
$$ 164609 178798 27817 -194015 319423 70626 113454 -68784 365715 -65535 54749 -311278
15955a4214A06464b59865d2678j68478R1740q459A25846M5947H2401B7998a77752
$$ -14214 106464 -259865 -42678 -211156 -119416 -127875 125846 171793 82401 27998 -177752
15943C9100K80125M0046I087a19652A5221L6265b96178a27182M6435D4362a74240
$$ 39100 319225 359271 9087 -119652 15221 51486 -296178 -127182 -80747 44362 -174240
15931c52310e5922a324p9910D4845f176m5816j55343j46941A27647a72379A79875
$$ -352310 -55922 -1324 -81234 44845 -6176 -51992 -207335 -354276 127647 -172379 179875
15919A03181C4037K28927i9117H9401A7755Q493b1357H0209c99589A18644m1548
$$ 103181 34037 262964 -99117 89401 17755 26248 -21357 80209 -399589 118644 77096
15908G7096a25444l8912f4197k67832a18600L3347B7602e1523k52182a12842D3214
$$ 77096 -125444 -164356 -64197 -332029 -118600 -85253 27602 -51523 -303705 -112842 43214
15896A68098a51929A56934g0677F5390a9683j99980A53382n0105A8370a95297
$$ 168098 -151929 156934 -70677 65390 -19683 -219663 153382 103277 18370 -195297
15885D59697F3143a89204F9224a84094A02759f9825A78369h6426K0151b4016I480
$$ 459697 63143 -189204 69224 -184094 102759 -69825 178369 -86426 -66275 -24016 9480
15873E0198M343b86324A61216h1616d0752H0756b45217a14143g249j49837B1471
$$ 50198 54541 -286324 161216 -81616 -40752 80756 -245217 -114143 -7249 -157086 21471
15861a09531k09167H8804c34185A55170N982a5797n7764A0384J36638J01091J35843
$$ -109531 -318698 88804 -334185 155170 161152 -15797 -73561 10384 147022 248113 383956
15850C83956d2760j12516D78P6943a08030k46314J14379A6314a5858m5065p7079
$$ 383956 -42760 -155276 478 77421 -108030 -354344 -239965 16314 -15858 -60923 -138002
15839a38002B53044o9646a51592m7312f5396J7513q1637M4462o7084A62548Q5916
$$ -138002 253044 183398 -151592 -198904 -65396 -47883 -129520 -85058 -152142 162548 248464
15828B48464J3272i119j03015A19149a01693Q459k93898J69591d6230I6950N5922
$$ 248464 261736 -9119 -112134 119149 -101693 -93234 -387132 -217541 -46230 96950 152872
15817A52872N4340a33181j04872A50906d57172a9555B201h3212B03001J69823
$$ 152872 207212 -133181 -238053 150906 -457172 -19555 2201 -83212 203001 372824
15807C72824c07386a01723A3955i6699C1849b61175l0281J37942j8412A08756
$$ 372824 -307386 -101723 13955 -96699 31849 -261175 -291456 -153514 -171926 108756
15796b46365R3773H3013a39564B69717I4205b4628l66339a17598M2364r5596F1555
$$ -246365 -152592 83013 -139564 269717 94205 -24628 -390967 -117598 -75234 -170830 61555
15784C1790K25280D9119K00597L8428j28796R4020b37502A49149j9976b305A47381
$$ 31790 257070 49119 249716 288144 159348 253368 -237502 149149 129173 -2305 147381
15772b41996E9415a41281b5767A44423b60035i4554B3194K4979b51684E6805d64927
$$ -241996 59415 -141281 -25767 144423 -260035 -94554 23194 48173 -251684 56805 -464927
15760i3112k13067h0322b2010q0728J6531K6450C8455j4906h1591j06256j3467
$$ -93112 -306179 -80322 -22010 -102738 -86207 -59757 38455 23549 -81591 -187847 -201314
15749b01314p7057P6230O7707o2289H1573a94471A80432D2197E093K33830c94012
$$ -201314 -278371 -202141 -134434 -196723 81573 -194471 180432 42197 5093 238923 -394012
15737c8922j83662B25479I440e3088J3865j9985K538E6005h2448j28003A56368
$$ -38922 -222584 225479 9440 -53088 -39223 -59208 -56670 56005 -82448 -210451 156368
15725f3351A87498J10728J2176G9477K717c3402A41164i7496M561k86798e6198
$$ -63351 187498 298226 310402 79477 82194 -33402 141164 -97496 -92935 -379733 -56198
15713A7424a42707e9865B4909J375M1535a04135k06949H9769J47876a65907j28382
$$ 17424 -142707 -59865 24909 26284 67819 -104135 -311084 89769 237645 -165907 -294289
15702b94289g6225N449A85295g9498A85509e151B49095C922J33472K63F5272K5758
$$ -294289 -76225 -70776 185295 -79498 185509 -5151 249095 3922 137394 137657 65272 91030
15690I1030f81A5998L55320a39133M4198A4791b65059P708g2603j23455h4983
$$ 91030 -681 15998 371318 -139133 -94935 14791 -265059 -257351 -72603 -196058 -84983
15678b86520A6967J79832N1841d0754H8978a89088j910J9630G5606a07761j9915
$$ -286520 16967 196799 248640 -40754 88978 -189088 -190998 -171368 75606 -107761 -127676
15667a27676c85k7072D52L5900K12404c15905C05280c52534e1204k25974D3345
$$ -127676 -385 -27457 452 36352 248756 -315905 305280 -352534 -51204 -277178 43345
15655b58218d2230m751j4880D6040N154M4481b0367j25835b1095n1441B90592
$$ -258218 -42230 -46981 -61861 46040 51194 95675 -20367 -146202 -21095 -72536 290592
15643c726k16982A55694l3352C71h5536k8302a4449j09937C862K20323a74735
$$ -3726 -220708 155694 122342 371 -85536 -113838 -14449 -124386 3862 224185 -174735
15631A04025C5724c9566j33919B03965c28933a42607A08850b11589J01071A98009
$$ 104025 35724 -39566 -173485 203965 -328933 -142607 108850 -211589 -110518 198009
15620a2001j51588f1150A37545b33784O7404A12470a17682d4813j22302c2589
$$ -12001 -163589 -61150 137545 -233784 -166380 112470 -117682 -44813 -167115 -32589
15609b18941i8379j61603a0390A198a22344A8419b10126A81017a545C3178g9843
$$ -218941 -98379 -259982 -10390 1198 -122344 18419 -210126 181017 -1545 33178 -79843
15597b09275C7009K0699a94392d7293C3001N7549J23333D1193J58188a96803M2350
$$ -209275 37009 57708 -194392 -47293 33001 90550 213883 41193 199381 -196803 -154453
15586a54453A34702Q6886O2452J60721a70526E794e9659F0124f1113l9149m3363
$$ -154453 134702 221588 284040 444761 -170526 5794 -59659 60124 -61113 -100262 -143625
15575a43625n9454K5078p3241g3158A73202m8859a54326A9159M7301I560f8680
$$ -143625 -203079 -178001 -251242 -73158 173202 124343 -154326 19159 66460 9560 -68680
15563g6096C18333E7490a0317k46640i8388B99950a64695p8959A00479b79378
$$ -76096 318333 57490 -10317 -256957 -98388 299950 -164695 -243654 100479 -279378
15552a9355l00238J57066n4425a572A4331a28101q1632c7118k90040a47904l09623
$$ -19355 -319593 -162527 -216952 -1572 14331 -128101 -209733 -37118 -327158 -147904 -457527
15541d57527g1333A00381L1006J12519a59842j38025B0840a36824B2775O3990
$$ -457527 -71333 100381 131387 243906 -159842 -297867 20840 -136824 22775 86765
15531H6765a19704j35971F3652J27872F4967a1397l5149j29411q1438A71748F0303
$$ 86765 -119704 -255675 63652 191524 64967 -11397 -46546 -175957 -257395 171748 60303
15519c10801B5132J44982a14474N1196p0241H7134C6063N708a70625F457N3991
$$ -310801 25132 170114 -114474 -63278 -133519 87134 36063 41771 -170625 6457 60448
15508F0448J33396c7651k09235A5029J79400r3391a45118c6657E8137b70242B86207
$$ 60448 193844 -37651 -246886 15029 194429 101038 -145118 -36657 58137 -270242 286207
15496c4384A20845e3768q5708e4127C9273H807g1594A2086b72555n33j44179K04152
$$ -34384 120845 -53768 -139476 -54127 39273 8807 -71594 12086 -272555 -273088 -417267 -213115
15484b13115a00047B9783j4754O1724a49828A1087P1877l3752b62713g8322B0197
$$ -213115 -100047 29783 15029 76753 -149828 11087 82964 49212 -262713 -78322 20197
15472D8042K3086R3561a46221A57746f42253a42018c6943B4840h965G7019R2319
$$ 48042 71128 164689 -146221 157746 -642253 -142018 -36943 24840 -8965 77019 169338
15461A69338J125B1006M522a62949D69030A89513F3824R586i3740j70885d097
$$ 169338 170463 21006 25528 -162949 469030 189513 63824 73410 -93740 -264625 -4097
15449H506K51972b52424i5840B78066A5975g6068d800A08498P1516b46678g8804
$$ 8506 260478 -252424 -95840 278066 15975 -76068 -4800 108498 180014 -246678 -78804
15437d9770c49A56016o1273a35931A63594i8316A27037g8935A33117i2864c1438
$$ -49770 -349 156016 94743 -135931 163594 -98316 127037 -78935 133117 -92864 -31438
15425f8988j15061A25446f1424D5957e068C50984f3694A76212k1616f567j1266
$$ -68988 -184049 125446 -61424 45957 -5068 350984 -63694 176212 154596 -6567 -17833
15414a7833I6515a65881A50399a09889l5015j34107C27476j19368e1058A01583
$$ -17833 96515 -165881 150399 -109889 -144904 -279011 327476 208108 -51058 101583
15403b80155Q8550j9548b6205l0179l786k58001e1136H4890j4411a49897j34094
$$ -280155 -191605 -211153 -26205 -56384 -60170 -318171 -51136 84890 70479 -149897 -283991
15392b83991Q5234l609O7188c3284B7634a11833j60560a785A30145l6825J80739
$$ -283991 -198757 -202366 -135178 -33284 27634 -111833 -272393 -1785 130145 93320 274059
15381B74059i3601I0203c1698e549A44222h9322G9360b34092E2643a56425A85437
$$ 274059 -93601 90203 -31698 -5549 144222 -89322 79360 -234092 52643 -156425 185437
15369g6219A14103E6467a10419B75669c26003f6643j84806O5870B4710K20874
$$ -76219 114103 56467 -110419 275669 -326003 -66643 -251449 -185579 24710 245584
15359B45584A01544a3150r0555A72941a24066k02208B5941c20391a47030O9373
$$ 245584 101544 -13150 -103705 172941 -124066 -326274 25941 -320391 -147030 -77657
15349g7657A08602C9433a04967B33843A15744n3530l748J610b22893C28429A04846
$$ -77657 108602 39433 -104967 233843 115744 62214 58466 60076 -222893 328429 104846
15337A27440C2657g2610A74607H1087a88532E7142c4181C069J10066M375i9149
$$ 127440 32657 -72610 174607 81087 -188532 57142 -34181 3069 113135 117510 -99149
15325i7477c7524I2702k5885K47781a18697A86586n8832a62601d0755G2837K9409
$$ -97477 -37524 92702 66817 314598 -118697 186586 127754 -162601 -40755 72837 102246
15314A02246a9936I2110a542D23754a97444B1137L54837e6850B7761a7311j1854
$$ 102246 -19936 92110 -1542 423754 -197444 21137 375974 -56850 27761 -17311 -29165
15303b9165A20042C7771J1937R8693m6835Q5575f802k29109B00150K6538b408
$$ -29165 120042 37771 49708 148401 101566 187141 -6802 -235911 200150 226688 -2408
15291A651L16305b34637h3873e461A24890n2263f3905E3147a44511B10919b8864
$$ 1651 317956 -234637 -83873 -5461 124890 72627 -63905 53147 -144511 210919 -28864
15279B87755n8968D7474J297e9159A41489k7855K82783n339j49616I3204B8231
$$ 287755 228787 47474 48771 -59159 141489 113634 396417 391078 241462 93204 28231
15267B83607j30198m465n7796P1278a37594H6830a71879A78385h3573k98093A30296
$$ 283607 153409 148944 91148 162426 -137594 86830 -171879 178385 -83573 -381666 130296
15255A6947M441Q6597j2427i7584g88D57203A30052J004909O38156m83723N57856
$$ 16947 21388 107985 95558 -97584 -788 457203 130052 1134961 1773117 1289394 1847250
15244A847250m43057E56988B03666F2698K91224b83267I0436J13805d107j68474
$$ 1847250 1404193 556988 203666 62698 353922 -283267 90436 204241 -4107 -172581
15234a72581B26808l1238l4134b21765C23704A41409e368A02353a46488C63987
$$ -172581 226808 195570 161436 -221765 323704 141409 -5368 102353 -146488 363987
15223g4800A19034a78014F2961a53533D0725b6841j09115J0654A81716a0701j39006
$$ -74800 119034 -178014 62961 -153533 40725 -26841 -135956 -125302 181716 -10701 -149707
15212a49707B28603M5246b0181j11609C248J18855n1985J3565g220C16242a87722
$$ -149707 228603 273849 -20181 -131790 3248 122103 70118 83683 -7220 316242 -187722
15200b0175A41598M5616p9095J58227l3493a9597B01906p446E9045a15348H5940
$$ -20175 141598 187214 108119 266346 232853 -19597 201906 194460 59045 -115348 85940
15188H5951G579L33453j5684b81537a1653A59819A6166Q6119J1639J76676j28857
$$ 85951 7579 341032 325348 -281537 -11653 159819 16166 102285 113924 290600 161743
15177A61743E9791O8713j8018i7499j9527E1508J62300B9403L50174J84A48418
$$ 161743 59791 128504 110486 -97499 -117026 51508 213808 29403 379577 379761 148418
15165A1292f6958A45172J6980a93702r6429B14523a4777k87849B89080j14983
$$ 11292 -66958 145172 162152 -193702 -290131 214523 -14777 -302626 289080 174097
15155A74097L27741B02219b9820C8112c9666m2516C35665K3205C0886R0186R1317
$$ 174097 501838 202219 -29820 38112 -39666 -82182 335665 358870 30886 121072 212389
15144B12389j3074c9080q5938A92562a38175M3258B20404j04671a51244A43177
$$ 212389 199315 -39080 -125018 192562 -138175 -94917 220404 115733 -151244 143177
15133f9338A69286C553i1636a6643B04435i110j2165F1234K17253a10133H0983
$$ -69338 169286 3553 -91636 -16643 204435 -9110 -21275 61234 278487 -110133 80983
15121A4547g2085B85511J55060A42790F3892Q846a0732B25810A02560J35869o7943
$$ 14547 -72085 285511 440571 142790 63892 72738 -10732 225810 102560 238429 170486
15110A70486h0720K0964k19610a8356B23436q6601K27344B6964l322K54400C0360
$$ 170486 -80720 -59756 -279366 -18356 223436 136835 364179 26964 23642 278042 30360
15098B71921M1739J13255A21688m5625M36349j05785b5030A84999K09797A31479
$$ 271921 313660 426915 121688 76063 512412 406627 -25030 184999 394796 131479
15087C2850Q5786M6041Q2952G4667j2157L8421a771A22806K02161o9204j20214
$$ 32850 118636 164677 247629 74667 62510 100931 -1771 122806 324967 255763 135549
15076A35549R624L195N5858D1968i325A72204J34407I2966D818K26978K1047j20772
$$ 135549 145173 148368 204226 41968 -9325 172204 306611 92966 4818 231796 252843 132071
15064A32071Q6040H6836M08700B22824N181g3441A53903j2346J41890a96086B10437
$$ 132071 218111 86836 495536 222824 228005 -73441 153903 141557 283447 -196086 210437
15052B84064c6053D6730J20758k1719o0595J99587j21429o3073a30155A00335
$$ 284064 -36053 46730 167488 145769 85174 284761 163332 100259 -130155 100335
15041B60914a32589A96884k6566B5718J25300h5163J2647K4229C9218j5578K49050
$$ 260914 -132589 196884 170318 25718 151018 -85163 -72516 -48287 39218 23640 272690
15030B72690k2489B2041K27005F9987K20393I479L85344j88090K43848k20765
$$ 272690 250201 22041 249046 69987 290380 9479 394823 206733 450581 229816
15020B29816d2511A62227k6500j1264O4875M2081G5969M7094a8793o8821A40705
$$ 229816 -42511 162227 135727 124463 189338 231419 75969 123063 -18793 -87614 140705
15008a33470C15085r3740L6002p8476L31465H636L56682C7738J72805K4393J33556
$$ -133470 315085 221345 257347 178871 510336 8636 365318 37738 210543 234936 368492
14997C68492j60480r0911h5953l4012B22820C6433d8438A54627O6910A3026J08802
$$ 368492 208012 117101 -85953 -119965 222820 36433 -48438 154627 221537 13026 121828
14986A21828n4718j7393M15967A98140M1862E8431J800J86508N9343A23017P3034
$$ 121828 67110 49717 465684 198140 240002 58431 60231 246739 306082 123017 196051
14975A96051n5678J11639dB80242M8665L3489j61469l2168L01570r1694j24540
$$ 196051 140373 252012 -4 280242 328907 362396 200927 168759 470329 378635 254095
14964B54095j05769M8744G6279K96321l9351A47055L67040r2389a2442D43017
$$ 254095 148326 197070 76279 372600 333249 147055 514095 421706 -12442 443017
14953A72641J68721J41960b7149A66656m3571m5237J16606p7745j2626Q5115m1740
$$ 172641 341362 483322 -27149 166656 123085 77848 194454 116709 104083 189198 147458
14942A47458J89904J44190k23043r9622J62758F1836P08350C18800A47159K77479
$$ 147458 337362 481552 258509 158887 321645 61836 770186 318800 147159 424638
14932D24638A65229R7495L67695G4459P7469L93510J3106j28993c0478A43995
$$ 424638 165229 262724 630419 74459 151928 545438 558544 429551 -30478 143995
14921C29691A57455L77864A61351D5650K02307J24538n4948a49277B12751L93711
$$ 329691 157455 535319 161351 45650 247957 372495 317547 -149277 212751 606462
14911F06462B05739N393K37202j26928B1184L37185A27771K99665j17616P4649
$$ 606462 205739 211132 448334 321406 21184 358369 127771 427436 309820 384469
14901C84469O3912J76234k46032J60867j32740j88524J63588A10500C5115J98877
$$ 384469 448381 624615 378583 539450 406710 218186 381774 110500 35115 233992
14891B33992L85930F6477R2547J65265J40551J3256j37591J28459k06777J92085
$$ 233992 619922 66477 159024 324289 464840 478096 340505 468964 262187 454272
14881D54272B04080q91K21625j62319C5461K34581A26007K71902L7688j89060
$$ 454272 204080 203189 424814 262495 35461 270042 126007 397909 435597 246537
14871B46537J96321o8702H6281K21290K34080j83074H5038M67582j0074q7870
$$ 246537 442858 374156 86281 307571 541651 358577 85038 552620 542546 454676
14861D54676G7044N18254P1181C14674K73502k50005O178j22071J05383R5492
$$ 454676 77044 595298 666479 314674 588176 338171 344349 222278 327661 423153
14851D23153k3810A80462J62893J79296j71123K27125j46067O6937r6349F4340
$$ 423153 399343 180462 343355 522651 351528 578653 432586 499523 403174 64340
14840B63812k1911J67984A99291J01297J68885O1805A30096L87024l3211o9598
$$ 263812 241901 409885 199291 300588 469473 531278 130096 517120 483909 414311
14830D14311n1574K20744L1044k03478j08532Q5341p579K37487k48734j8511K15360
$$ 414311 362737 583481 614525 411047 302515 387856 380277 617764 369030 350519 565879
14819E65879K03371A98846K02916r925K13423q5635q1944q2216j70075n6822R0717
$$ 565879 769250 198846 401762 391837 605260 519625 437681 355465 185390 128568 219285
14808B19285J14231K09452e7562C92260L1858M9606L2616M7476B22086K6243M76036
$$ 219285 333516 542968 -57562 392260 424118 473724 506340 553816 222086 248329 724365
14797G24365C24689M38212k80633j14624j27721L76935j92752J67326k82127K38440
$$ 724365 324689 762901 482268 367644 239923 616858 424106 591432 309305 547745
14787E47745j40077J4132K69488B88817L05376j40536j50670J74367L7828r6602
$$ 547745 407668 421800 691288 288817 594193 453657 302987 477354 515182 418580
14777D18580L46941k60089B32403M09116q1595q2328o2039J57177j31355L2671
$$ 418580 765521 505432 232403 641519 559924 477596 415557 572734 441379 474050
14767D74050r867j06014p0777L23481J36454k31029j47649O86518l98718C28189
$$ 474050 464183 358169 287392 610873 747327 516298 368649 1055167 656449 328189
14756E47186J25530q5558J02974k47468M75910k93201o2405q8276m2673P9549
$$ 547186 672716 587158 690132 442664 918574 625373 562968 474692 432019 511568
14746E11568J95332J19333B72910L00541j49513N8750k1271M99273k19738l34139
$$ 511568 706900 826233 272910 573451 423938 482688 461417 960690 740952 406813
14736D06813M08586r0315j33741q0390M7400K0821j08687J10732J81264l4108
$$ 406813 815399 725084 591343 510953 558353 579174 470487 581219 762483 728375
14726G28375j84529J01266L28628m49434K46052p86l8356J08666K10521K9377
$$ 728375 543846 645112 973740 524306 770358 769572 731216 839882 1050403 1079780
14716A079780l58348j78553M31530m60373J99161P1030j47436l8847J76258J60061
$$ 1079780 721432 542879 974409 514036 713197 784227 636791 597944 774202 934263
14706I34263k50377p6571M10705D73544L96241l03198o1863J76571j79338L08080
$$ 934263 683886 607315 1018020 473544 869785 566587 504724 681295 501957 810037
14696H10037k47384K74493J66226C93498L19500O19236E68802J51199L06554j47720
$$ 810037 562653 837146 1003372 393498 712998 1332234 568802 720001 1026555 878835
14686H78835m5383K01318l49738L67074j47161l6757o7749N2228K12015k19257
$$ 878835 833452 1034770 685032 1052106 904945 868188 800439 852667 1064682 845425
14676H45425J48574k11079j8157K52894k8765p3384j18092K29269L60008j96532
$$ 845425 993999 782920 764763 1017657 988892 915508 797416 1026685 1386693 1190161
14666A190161r9266l94763K70875J86162j95821K66322k80460J93167m04032L10042
$$ 1190161 1090895 696132 967007 1153169 957348 1223670 943210 1136377 732345 1042387
14656A042387J13607j44626P5454O7557J06474k1373j21895J63076l27357L25361
$$ 1042387 1155994 1011368 1086822 1154379 1260853 1239480 1117585 1280661 953304 1278665
14646A278665l11758K60142j34660K87576l80217M05686k11752P4796k75564J33857
$$ 1278665 966907 1227049 1092389 1379965 999748 1405434 1193682 1268478 992914 1126771
14636A126771O3888m7146j31086K96752K3834l72490M01816l50537K15751m41998
$$ 1126771 1190659 1143513 1012427 1309179 1333013 960523 1362339 1011802 1227553 785555
14626G85555L72976M47297G71257L34601L66006J25773l46647K93572k09727q5160
$$ 785555 1158531 1605828 771257 1105858 1471864 1597637 1250990 1544562 1334835 1249675
14616A249675O2365N7388O0741J44365k83291J51148N3231J11230l75590K44055
$$ 1249675 1312040 1369428 1430169 1574534 1291243 1442391 1495622 1606852 1231262 1475317
14606A475317J15927m21146o2048J51701K53756l5214n4562R4514J91787L05151
$$ 1475317 1591244 1170098 1108050 1259751 1513507 1478293 1423731 1518245 1710032 2015183
14596B015183j62635L4344l65413l37787O11065k61291J75295q7270K48182q5062
$$ 2015183 1852548 1886892 1521479 1183692 1794757 1533466 1708761 1621491 1869673 1784611
14586A784611K71128l81528K70921j34035k4844k47596J40650j46032O37068p412
$$ 1784611 2055739 1674211 1945132 1811097 1786253 1538657 1679307 1533275 2170343 2162931
14576B162931j00436k27011j5981J82973K8100k8082L56952j35720j96338J27369
$$ 2162931 2062495 1835484 1819503 2002476 2030576 2002494 2359446 2223726 2027388 2154757
14566B154757K66797k83954L70994j48874n5057L2976R8916J49481j72870N93729
$$ 2154757 2421554 2137600 2508594 2359720 2304663 2337639 2436555 2586036 2413166 3006895
14556C006895L2638K54776J34475K80783J73661L15948R82623J475115K744034
$$ 3006895 3039533 3294309 3428784 3709567 3883228 4199176 5181799 6656914 9400948
14547I400948P662383J9023837R461209B2491337j0690050E059115k204757n07574
$$ 9400948 17063331 36087168 45548377 22491337 11801287 5059115 2854358 2346784
14539B346784l67200l13729O6801J61164k33870Q1096K69091j34884k4449J52558
$$ 2346784 1979584 1665855 1732656 1893820 1659950 1741046 2010137 1875253 1850804 2003362
14529B003362p8590K43248j66306M19836l81538J18518p4370M02129k6983N7116
$$ 2003362 1924772 2168020 2001714 2421550 2040012 2158530 2084160 2486289 2459306 2516422
14519B516422k40132k3117J15779q3366k29740L09539Q5737M1648K49543N7603
$$ 2516422 2276290 2253173 2368952 2285586 2055846 2365385 2451122 2492770 2742313 2799916
14509B799916j27303m2981J22982J70171k49380J2188j82055L90242p5816k03124
$$ 2799916 2672613 2629632 2752614 2922785 2673405 2685593 2503538 2893780 2817964 2614840
14499B614840L36979k6182J63151r3038j19052M210O4563J71477K32552Q8537
$$ 2614840 2951819 2925637 3088788 2995750 2876698 2880908 2945471 3116948 3349500 3438037
14489C438037k78626n7990q114K02355J27369O0662M29930k45495j73646K15905
$$ 3438037 3159411 3101421 3093307 3295662 3423031 3483693 3913623 3668128 3494482 3710387
14479C710387N4819r1792J18701j8665L33194l05450M2070k6731J09684j5469
$$ 3710387 3765206 3673414 3792115 3773450 4106644 3801194 3843264 3816533 3926217 3910748
14469C910748J86036r6077J89101J89685j35841N2574k067K06841o3803J61274
$$ 3910748 4096784 4000707 4189808 4379493 4243652 4296226 4294159 4501000 4437197 4598471
14459D598471k80972K62049J98038k92879J84310L79649k19875o7182J84208J18107
$$ 4598471 4317499 4579548 4777586 4484707 4669017 5048666 4828791 4761609 4945817 5063924
14449E063924M72471o8144l45044n7948J77480P278R1283M44909l32008J16224
$$ 5063924 5536395 5468251 5123207 5065259 5242739 5250017 5341300 5786209 5454201 5570425
14439E570425L85596P5139k88699L05400K3669j47917N01136l38751K17914K304
$$ 5570425 5956021 6031160 5742461 6047861 6071530 5923613 6424749 6085998 6303912 6306216
14429F306216m4622N25405O2145J08234K5989J38388Q6139R2466j21208M03204
$$ 6306216 6261594 6786999 6849144 6957378 6983367 7121755 7207894 7300360 7179152 7582356
14419G582356j92792K26168j68280M19500m5664L27373J88634p174J89999j72381
$$ 7582356 7389564 7615732 7447452 7866952 7821288 8148661 8337295 8330121 8520120 8347739
14409H347739L29413J64222J14979L31710l05229J69578L85035J85381K48562
$$ 8347739 8677152 8841374 8956353 9288063 8982834 9152412 9537447 9722828 9971390
14400I971390J04985j09298J86296k0731N99556L38350j28422j10574N25933J33739
$$ 9971390 10076375 9967077 10153373 10132642 10732198 11070548 10942126 10831552 11357485 11491224
14390A1491224L08586K10845j07533L59116m6981O34244K91401l16485O02299
$$ 11491224 11799810 12010655 11903122 12262238 12215257 12849501 13140902 12824417 13426716
14381A3426716L4376L09095L85321M57681Q7999J87457K36606M59947O13164M0322
$$ 13426716 13461092 13770187 14155508 14613189 14701188 14888645 15125251 15585198 16198362 16238684
14371A6238684J6738M57920L78564O57357R5417N90240M72278j01828R89602J4291
$$ 16238684 16255422 16713342 17091906 17749263 17844680 18434920 18907198 18805370 19794972 19809263
14361A9809263K68152O69418N51828M27494L97880M64475O14952J84931N96954
$$ 19809263 20077415 20746833 21298661 21726155 22124035 22588510 23203462 23388393 23985347
14352B3985347P11847M39001P61351N89447P31800R57826M34328N05918J143864
$$ 23985347 24697194 25136195 25897546 26486993 27218793 28176619 28610947 29116865 30260729
14343C0260729N51155Q47895O14621J028569J205776Q24305Q78054J059764J023004
$$ 30260729 30811884 31659779 32274400 33302969 34508745 35333050 36211104 37270868 38293872
14334C8293872J227859J200815J131582J267436J222790J501381J380602J380010
$$ 38293872 39521731 40722546 41854128 43121564 44344354 45845735 47226337 48606347
14326D8606347J457558K010796J429559J818468J902742J721906K017350K355665
$$ 48606347 50063905 52074701 53504260 55322728 57225470 58947376 60964726 63320391
14318F3320391K428227K160662K778677K372388K937538K919743K875750L385607
$$ 63320391 65748618 67909280 70687957 73060345 75997883 78917626 81793376 85178983
14310H5178983L219781L888285L905107L629366M304417M577723N131850M678407
$$ 85178983 88398764 92287049 96192156 99821522 104125939 108703662 113835512 118513919
14302A18513919N686813N615466N799862O500304O796621P093660P582280P889926
$$ 118513919 124200732 129816198 135616060 142116364 148912985 156006645 163588925 171478851
14294A71478851Q473455Q723459R283072J0219111R933954J1076055J1296320
$$ 171478851 179952306 188675765 197958837 208177948 218111902 229187957 240484277
14287B40484277J1706369J2301117J2862940J2846774J3737224J3261022J3764577
$$ 240484277 252190646 264491763 277354703 290201477 303938701 317199723 330964300
14280C30964300J3741569J3495354J3143176J2853471J1674979J0974660R802577
$$ 330964300 344705869 358201223 371344399 384197870 395872849 406847509 416650086
14273D16650086P405923M060226J519660J004581j154591j327123k371515l550631
$$ 416650086 424056009 428116235 429635895 430640476 429485885 428158762 425787247 422236616
14265D22236616o494684r234103j0527733j2031126j3081978j3607803j4473756
$$ 422236616 415741932 406507829 395980096 383948970 370866992 357259189 342785433
14258C42785433j4318042j4336145j4520755j4049534j2718975j2651211j3016520
$$ 342785433 328467391 314131246 299610491 285560957 272841982 260190771 247174251
14251B47174251j1705376j1972458j0624125j0530772r889767r606382q667071
$$ 247174251 235468875 223496417 212872292 202341520 192451753 182845371 174178300
14244A74178300p723161q231078p545116o958667o714701o149050n375286n409329
$$ 174178300 166455139 158224061 150678945 143720278 137005577 130856527 125481241 120071912
14236A20071912n301749m642652m986464m465120m007361l199379m157518l763039
$$ 120071912 114770163 110127511 105141047 100675927 96668566 93469187 89311669 85548630
14228H5548630k941907l403454k860686l263690k527807k711117k411721k293279
$$ 85548630 82606723 79203269 76342583 73078893 70551086 67839969 65428248 63134969
14220F3134969j479854k423928k256646j825170j941832j539963j428342j373535
$$ 63134969 61655115 59231187 56974541 55149371 53207539 51667576 50239234 48865699
14212D8865699j692448j521994j394896j507209j066467m53375j270694j430430
$$ 48865699 47173251 45651257 44256361 42749152 41682685 41229310 39958616 38528186
14204C8528186j298527r69767q80418r35909k82755j342807r28532r81652r10887
$$ 38528186 37229659 36259892 35379474 34443565 34160810 32818003 31889471 30907819 29996932
14195B9996932o91568p52574n08660q34909o34621o80040n75002o10014m67542
$$ 29996932 29305364 28552790 28044130 27209221 26574600 25894560 25319558 24709544 24242002
14186B4242002n77232n50865m39487j71608j029691n48576l30585l00033l64315
$$ 24242002 23664770 23113905 22674418 22502810 21473119 20924543 20593958 20293925 19929610
14177A9929610m41885o83575n30659o2769l63918l74148k49559J7219o46292q8676
$$ 19929610 19487725 18804150 18273491 18210722 17846804 17472656 17223097 17240316 16594024 16505348
14167A6505348n70788n97468j10045k26308j11596j58951n91679K17327n17891
$$ 16505348 15934560 15337092 15227047 15000739 14889143 14730192 14138513 14355840 13837949
14158A3837949k83277j14428m69048K0832j34108m14126m25904Q4016k48391J14555
$$ 13837949 13554672 13440244 12971196 12992028 12857920 12443794 12017890 12101906 11853515 11968070
14148A1968070n34559r4716k40748k24743l07849L90543l40447O8511k28871n85626
$$ 11968070 11433511 11338795 11098047 10873304 10565455 10955998 10615551 10684062 10455191 9869565
14138I869565J53101l80661k88483J64806j06665N6213n43025J53024n15624q5425
$$ 9869565 10022666 9642005 9353522 9518328 9411663 9467876 8924851 9077875 8562251 8476826
14128H476826L22826j16196n18395O233k56021J61273K717l70176L95249o46158
$$ 8476826 8799652 8683456 8165061 8171294 7915273 8076546 8079263 7709087 8104336 7458178
14118G458178J2725j25614P50j99535L3484o3288Q1471m46291q2768J15313j39681
$$ 7458178 7470903 7345289 7346039 7146504 7179988 7116700 7198171 6751880 6669112 6784425 6644744
14107F644744R259k75103k43591O3481l08269K00939K05062L6505m33255K74834
$$ 6644744 6654003 6378900 6135309 6198790 5890521 6091460 6296522 6333027 5899772 6174606
14097F174606l77894k86454k15358K66745K0611j42843J14025l12156J41376k30490
$$ 6174606 5796712 5510258 5294900 5561645 5582256 5439413 5553438 5241282 5382658 5152168
14087E152168k7902J3537j47411L35603n43471N0871K1557j39950N440j32914
$$ 5152168 5124266 5137803 4990392 5325995 4782524 4833395 4854952 4715002 4720442 4587528
14077D587528J14719j16218j0462J9442k06469J16874q1695k60329J56518J01194
$$ 4587528 4702247 4586029 4575567 4595009 4388540 4505414 4423719 4163390 4319908 4421102
14067D421102k10155j73014k07167J1030J80672R5171l36698k00583M86989k25029
$$ 4421102 4210947 4037933 3830766 3841796 4022468 4117639 3780941 3580358 4067347 3842318
14057C842318J70530j03543j93501m0502K53178k62525o9390K48088o65896Q5280
$$ 3842318 4012848 3909305 3715804 3675302 3928480 3665955 3596565 3844653 3178757 3264037
14047C264037K69637n90439L95955p8090J00486m61637K23316L39817j98299j91814
$$ 3264037 3533674 2943235 3339190 3261100 3361586 2899949 3123265 3463082 3264783 3072969
14037C072969J97226n1403l92162Q4032P7852J99149m4633M4788J34815k51424
$$ 3072969 3270195 3218792 2826630 2910662 2988514 3187663 3143030 3187818 3322633 3071209
14027C071209m2156K1033l65743o4754L9850K68429m75143J47998j64287O4398
$$ 3071209 3029053 3050086 2684343 2619589 2659439 2927868 2452725 2600723 2436436 2500834
14017B500834j82844P7183L49701k42138J14764J04413k53622o3173k34813J46748
$$ 2500834 2317990 2395173 2744874 2502736 2617500 2721913 2468291 2405118 2170305 2317053
14007B317053l4211j75325O8735L50426n27747M26190j45429l41647K73678j45224
$$ 2317053 2282842 2107517 2176252 2526678 1998931 2425121 2279692 1938045 2211723 2066499
13997B066499J02009j83501J47459j0148K13953k46270J28143Q1119P85548J884105
$$ 2066499 2168508 1985007 2132466 2122318 2336271 2090001 2218144 2299263 3084811 4968916
13987D968916N343839J7657060J9563528j9870326A3818190n871912k266181j101975
$$ 4968916 10312755 27969815 47533343 27663017 13818190 7946278 5680097 4578122
13979D578122m31857n54966k90055j62036j34682k28706M8413l34027J63785k05692
$$ 4578122 4146265 3591299 3301244 3139208 3004526 2775820 2824233 2490206 2653991 2448299
13969B448299k16753K76987p1782O8261m2689l19370p9840Q0545j75981J21441
$$ 2448299 2231546 2508533 2436751 2505012 2462323 2142953 2063113 2143658 1967677 2089118
13959B089118k5336j37971J84966k49070J00337J28203k63485K35209j44720l5802
$$ 2089118 2063782 1925811 2110777 1861707 1962044 2090247 1826762 2061971 1917251 1881449
13949A881449J21000k56221m9726J88421J22681j74653l79684K53018M651p361
$$ 1881449 2002449 1746228 1696502 1884923 2007604 1832951 1453267 1706285 1710936 1703575
13939A703575k41160K88137k45399j3750L9784j54594J307L5366J56723K3298
$$ 1703575 1462415 1750552 1505153 1491403 1531187 1376593 1377900 1413266 1569989 1593287
13929A593287q5403M143r0649Q0960J36787n9943L8854J39529k42499k80043M0762
$$ 1593287 1507884 1512027 1421378 1502338 1639125 1579182 1618036 1757565 1515066 1235023 1275785
13918A275785L56199j58552J94563l91609K03961K52722m23490K92154p0063L3153
$$ 1275785 1631984 1473432 1667995 1276386 1480347 1733069 1309579 1601733 1531670 1564823
13908A564823k35589J03822J35811m9374k33827R6419K13814k36536J04214k12472
$$ 1564823 1329234 1433056 1568867 1519493 1285666 1382085 1595899 1359363 1463577 1251105
13898A251105J93682j32508j36257J05089j34150k342k07022L86587r6944J48352
$$ 1251105 1444787 1312279 1176022 1281111 1146961 1144619 937597 1324184 1227240 1375592
13888A375592l0684J22996n26233L08330J72924l68442j02502M10584j01909r3808
$$ 1375592 1344908 1467904 941671 1250001 1422925 1054483 951981 1362565 1260656 1166848
13878A166848K74041J04551m90819K69341k89592N2084O7594J97767n9005j19008
$$ 1166848 1440889 1545440 1054621 1323962 1034370 1086454 1154048 1351815 1292810 1173802
13868A173802J41265m29379O2716R734J54938J27020l72186K73424n30409K65002
$$ 1173802 1315067 885688 948404 958138 1113076 1240096 867910 1141334 610925 875927
13858H75927L48528R1074n2081l26198j28251K46251J90376m18427J46568o4217
$$ 875927 1224455 1315529 1263448 937250 808999 1055250 1245626 827199 973767 909550
13848I09550M14046k55170l60593L55297n8628o6048O5534k52000J94909j85976
$$ 909550 1323596 1068426 707833 1063130 1004502 938454 1003988 751988 946897 760921
13838G60921J20929j9757L67973j83852o9430Q3611l23203K22248k95577q6992
$$ 760921 881850 862093 1230066 1046214 976784 1060395 737192 959440 663863 576871
13828E76871L19840L3124p7468J43428L7096j08360K18066k13165J72017m18973
$$ 576871 896711 929835 852367 995795 1032891 924531 1142597 929432 1101449 682476
13818F82476L58532j8969j49957j95738K75412l5924k83869K56120Q7263Q3120
$$ 682476 1041008 1022039 872082 676344 951756 915832 631963 888083 975346 1058466
13808A058466l16528J85269j8738p6418K89076l89803n2575J44885j64225K23869
$$ 1058466 741938 927207 908469 832051 1121127 731324 678749 823634 659409 883278
13798H83278J05903m75063M50834k07318m437k13535J86519K9071L6401r8278
$$ 883278 989181 514118 964952 757634 753197 539662 726181 755252 791653 693375
13788F93375l7966K36625J34769l15422P9830L04668m84136K8291K16380k16951
$$ 693375 655409 892034 1026803 711381 791211 1095879 611743 640034 856414 639463
13778F39463P9912K24622r1799k0790l04278q4288Q85322l90122k78630n6155
$$ 639463 719375 943997 852198 831408 527130 442842 1328164 938042 659412 603257
13768F03257L69243m33222J56726j20186J27086Q2042k43755K70162l57540L14557
$$ 603257 972500 539278 696004 575818 702904 784946 541191 811353 453813 768370
13758G68370K17280k55690k5656J20936k63372J08137J84827l89026O8077P6403
$$ 768370 985650 729960 704304 825240 561868 670005 854832 465806 533883 610286
13748F10286L45727m74263J26079j73188L09227j21238K59598C78290K56247n2723
$$ 610286 956013 481750 607829 434641 743868 622630 882228 378290 634537 581814
13738E81814j19401J71586j81200n3818j2402J55353n7879K98379j83071q1784
$$ 581814 462413 633999 452799 398981 386579 541932 484053 782432 599361 517577
13728E17577J18338J11445j46542k18336K45127j98275K25746K17516k99125O8597
$$ 517577 635915 747360 600818 382482 627609 429334 655080 872596 573471 642068
13718F42068k75549L58674l7432N7893L8568C71957L44022k88032n190p2281L49221
$$ 642068 366519 725193 687761 745654 784222 371957 715979 427947 422757 350476 699697
13707F99697j68721o7218j40416L15430L4806j36097J30633l32772K9079A77225
$$ 699697 530976 463758 323342 638772 673578 537481 668114 335342 364421 177225
13696D42397j89430L14706k03948J64724j13309J43714j53934j2773K57443l0549
$$ 442397 252967 567673 363725 528449 415140 558854 404920 392147 649590 619041
13686F19041j35360K04172j69257K08263A56608K63483L81324G2721N14527A93412
$$ 619041 483681 687853 518596 726859 156608 420091 801415 72721 587248 193412
13675D16264K67686l35827K69343k78247Q1857J17298o5338L1703k03403K56807
$$ 416264 683950 348123 617466 339219 421076 538374 473036 504739 301336 558143
13665E58143l7899J64900k79800M51881k91596j41466P3409k08636A32229O25146
$$ 558143 520244 685144 405344 857225 565629 424163 497572 288936 132229 757375
13655G57375l46420K08704P0648l15241J72090A09099N41574l19909L04992j81693
$$ 757375 410955 619659 690307 375066 547156 109099 650673 330764 635756 454063
13645D54063p959j49176L4588A03850L49914k00524J33084j47807K88490j73511
$$ 454063 446104 296928 331516 103850 453764 253240 386324 238517 527007 353496
13635C53496R4163K8056r7070J08323p2290j51652J49382A65387L76312k30227
$$ 353496 447659 475715 378645 486968 414678 263026 412408 165387 541699 311472
13625C11472K15438o2976j38299P0531A61738L99150j76782d1278E11217j39222
$$ 311472 526910 463934 325635 396166 161738 560888 384106 -41278 511217 371995
13615C71995K9951l4146p6597Q8744J78896J4717B75434L07197k45341K98073
$$ 371995 401946 367800 291203 379947 558843 573560 275434 582631 337290 635363
13605F35363r1104o854B61896J08721J08901k01315k7577J77589O9005A59365
$$ 635363 544259 537405 261896 370617 479518 278203 250626 428215 497220 159365
13594D63441A98632L39702j98641K21352l6135j78033M7996K30374k43916A22747
$$ 463441 198632 538334 339693 561045 524910 346877 394873 625247 381331 122747
13583E1155K13840j25394J94577j1387R0192j8466J7908j6856j397K68722j36428
$$ 51155 264995 139601 334178 322791 412983 394517 412425 395569 394172 662894 526466
13572E26466C1790N17476p9093j79212K7826D9607K59776J06019R0103j92107
$$ 526466 31790 549266 470173 290961 318787 49607 309383 415402 505505 313398
13562C13398L03024B23420P1171J34133A03713K58536j65977G3416J02348D9071
$$ 313398 616422 223420 294591 428724 103713 362249 196272 73416 175764 49071
13551C23559k4080A45842K37830m265p626J85236C6464K83279K3136h9016D69988
$$ 323559 299479 145842 383672 379407 371781 557017 36464 319743 342879 -89016 469988
13539A20551J94845P8407J87632k29157B2546K90759L0140A66751M24171n7003
$$ 120551 315396 393803 581435 352278 22546 313305 343445 166751 590922 533919
13529E33919j42069j94460N39385A10142J66239P784n6290E0144K98760K3505
$$ 533919 391850 197390 736775 110142 276381 284165 227875 50144 348904 372409
13519C72409A32300J79245J71406j75522C8556K37113J92043j23799K35950K18978
$$ 372409 132300 311545 482951 307429 38556 275669 467712 343913 579863 798841
13509G98841C72578j65844O3378J85329k02355B1649L0781L0882K26201j38778
$$ 798841 372578 206734 270112 455441 253086 21649 52430 83312 309513 170735
13499A70735L03476j21299A35584K10615j62793p7926L26869G5417L45015l8938
$$ 170735 474211 352912 135584 346199 183406 105480 432349 75417 420432 381494
13489C81494r8633j05883K3530O9499A31526K66543A85165K21914k00550M0689
$$ 381494 282861 176978 200508 270007 131526 398069 185165 407079 206529 247218
13479B47218r1904K04873j50397B5255K66108J18732P3599n7948j59541A31960
$$ 247218 155314 360187 209790 25255 291363 410095 483694 425746 266205 131960
13468A64860D3530K3141P5690K1328M66787j18846k24039A16601N1416L5844K87812
$$ 164860 43530 66671 142361 163689 630476 511630 287591 116601 168017 203861 491673
13457D91673O1260a07824H3205K381J30900H7944m0713K13965J7543Q1425J2815
$$ 491673 552933 -107824 83205 85586 216486 87944 47231 261196 278739 360164 372979
13446C72979B2448M22088B4829M29831A03381J15862C5787K34634o0713d1342
$$ 372979 22448 444536 24829 454660 103381 219243 35787 270421 209708 -41342
13435D02506A67556E4066J38997O533K4181D3911o27L0203K19421Q7165A25187
$$ 402506 167556 54066 193063 199596 223777 43911 43284 73487 292908 380073 125187
13423B84343J17120b58520B12179J49692J2818K2619A13628O3594N9459K64066
$$ 284343 401463 -258520 212179 361871 374689 397308 113628 177222 236681 500747
13413E00747A75990m816O4816A17899L22520A12139L51424A23727N8396L23313
$$ 500747 175990 171174 235990 117899 440419 112139 463563 123727 182123 505436
13403E05436k42917I2196J19266P3918G2468J70790h9944C4187K36146h227B25733
$$ 505436 262519 92196 211462 285380 72468 243258 -89944 34187 270333 -8227 225733
13391B02129M1459j00752d6343A07575K94173M4061C2030L87449n1306h0489j49138
$$ 202129 243588 142836 -46343 107575 401748 445809 32030 419479 368173 -80489 -229627
13380b29627A79319a90880a1149A68163J95591A60488J5280a9388B54067m5439
$$ -229627 179319 -190880 -11149 168163 363754 160488 175768 -19388 254067 208628
13370B08628J03222A54040K85325C6326K25767J95704k14490M4723A04741M66365
$$ 208628 311850 154040 439365 36326 262093 457797 243307 288030 104741 571106
13360E71106A52197J53148G0884M8769L62839A53085N8692A1410c854E5641K97694
$$ 571106 152197 305345 70884 119653 482492 153085 211777 11410 -3854 55641 353335
13349C53335j59422l4388M4095l666j9511m3959L13840n5767A67614g227B12962
$$ 353335 193913 159525 203620 199954 180443 136484 450324 394557 167614 -7227 212962
13337A59229J69442a09762G1329A3535N5604K13519a9775C42791h4842D8955K99843
$$ 159229 328671 -109762 71329 13535 69139 282658 -19775 342791 -84842 48955 348798
13326C48798A02547l8378J57049J25689A11123L50674A82283K47679J12274H7291
$$ 348798 102547 64169 221218 346907 111123 461797 182283 429962 542236 87291
13315a8501A76224P4330J7686I3406J30804K24808j56414b6054D42301d495j9827
$$ -18501 176224 250554 268240 93406 224210 449018 292604 -26054 442301 -4495 -24322
13304b4322C68001b3225A92885p3129h4127B94925A33065K76204j22168j23223
$$ -24322 368001 -23225 192885 119756 -84127 294925 133065 409269 287101 163878
13294A63878L37848k19674R0046l6212a42797B28237a25237k9956D7097K70502
$$ 163878 501726 282052 372098 335886 -142797 228237 -125237 -155193 47097 317599
13284C17599D2375j8680J07496m9566d13325d5504B62112m5753a92278D17992
$$ 317599 42375 23695 131191 81625 -413325 -45504 262112 216359 -192278 417992
13273D15171A12268a31399D34870j93094j3657o585o5598J22027r0792p4360N355
$$ 415171 112268 -131399 434870 241776 228119 221534 155936 277963 187171 112811 118166
13262A18166m5119J47313q7331J33747H2889Q8060L0251C9948L09724K33781a80304
$$ 118166 73047 220360 133029 266776 82889 170949 201200 39948 349672 583453 -180304
13250C80871A69451a4387p5566C85977G2748e6448C81023B962M0719J29329J7885
$$ 380871 169451 -14387 -89953 385977 72748 -56448 381023 2962 43681 173010 190895
13239A90895N9354A17722K23297l9116A6042J52690N1933a86718C35763e338A64720
$$ 190895 250249 117722 341019 301903 16042 168732 220665 -186718 335763 -5338 164720
13227D5544J3113P1113J81849i9790k65904B98418L4456G5288d9500K1657H299
$$ 45544 58657 129770 311619 -99790 -365694 298418 332874 75288 -49500 -27843 8299
13215A55967J77155a1331C1521K18466c18103F9627M3044M4924i5292A89971q1235
$$ 155967 333122 -11331 31521 249987 -318103 69627 112671 157595 -95292 189971 108736
13204A08736Q596a1138D70108C0360C838J96181i5422B17249J3103B8100L08996
$$ 108736 117332 -11138 470108 30360 3838 200019 -95422 217249 230352 28100 337096
13193C37096A0246L60679c0715H9351a7597j09498A60207K247a11154j4978H4213
$$ 337096 10246 370925 -30715 89351 -17597 -127095 160207 162454 -111154 -126132 84213
13181A79457b00876A17008l101d0863a5284A63925c7329B08060a03915C81543
$$ 179457 -200876 117008 113907 -40863 -15284 163925 -37329 208060 -103915 381543
13170a33803h957A85115e9178b426B21947j7149H5166a6506A88478l0403a65047
$$ -133803 -8957 185115 -59178 -2426 221947 204798 85166 -16506 188478 158075 -165047
13158B16410c12127f5851C11069I8283K07882b4938A53805J0333a18013K6265
$$ 216410 -312127 -65851 311069 98283 306165 -24938 153805 164138 -118013 -91748
13148i1748a3860j45748A71650n9253J84292j24804E1467b43006B15776a7259
$$ -91748 -13860 -159608 171650 112397 296689 171885 51467 -243006 215776 -17259
13137d4287D82693b4993A07357m4155M7982L5337a2663k3682k8826A27824k0842
$$ -44287 482693 -24993 107357 63202 111184 146521 -12663 -36345 -65171 127824 106982
13126A06982N324D9450L10139N434h0672b6365B53671A2953J6593c13163g4232
$$ 106982 112306 49450 359589 365023 -80672 -26365 253671 12953 29546 -313163 -74232
13114D9646P9292C1029c7303q4749D6802J46147B2838J44663g1725l8934C62046
$$ 49646 128938 31029 -37303 -122052 46802 192949 22838 167501 -71725 -110659 362046
13102A48721a66873P6918A81671J77186D32K04389a77483I7647h0061a7047B3470
$$ 148721 -166873 -89955 181671 358857 432 204821 -177483 97647 -80061 -17047 23470
13090D9897J87022p0216H512Q517h9208r014D2688a34821A71753a07051j48958
$$ 49897 236919 166703 8512 17029 -89208 -98222 42688 -134821 171753 -107051 -256009
13079b56009a19682A60028D3977L6964L80937B2149J43067K57419a1265B31077
$$ -256009 -119682 160028 43977 80941 461878 22149 165216 422635 -11265 231077
13068i2584C20058A32361e5677C1679J33569p8643p249K1086b35618A66071k6488
$$ -92584 320058 132361 -55677 31679 165248 86605 79356 100442 -235618 166071 139583
13057A39583a00623A8674N2521N6076k8228D0962A0219L38578n9797b34324C87524
$$ 139583 -100623 18674 71195 127271 99043 40962 10219 348797 289000 -234324 387524
13045A17a84951B11429q5846J08925A05160c8083B89421H5709L96594B25268P3075
$$ 117 -184951 211429 125583 234508 105160 -38083 289421 85709 482303 225268 298343
13034B98343D9273J32055a38562B23198m2712D6664J62004p3720L79804K7286
$$ 298343 49273 181328 -138562 223198 180486 46664 208668 134948 514752 542038
13024E42038A894J05275R3166I5742j605J46980J15228j42301o4637k1923A5958
$$ 542038 1894 107169 200335 95742 94137 241117 356345 214044 149407 127484 15958
13012B5277J8283M7346a2150p2297A83427I1542q919f1829A74827o7638P3682
$$ 25277 43560 90906 -12150 -84447 183427 91542 82623 -61829 174827 107189 180871
13001A80871b44516G6727K0913E414J63497J36530A11599J68796D0679f4321F313
$$ 180871 -244516 76727 97640 5414 168911 305441 111599 280395 40679 -64321 6313
12989f1633A20665f0784j13743B18820r3185P6929a0469A03685b01586B40853
$$ -61633 120665 -60784 -174527 218820 125635 202564 -10469 103685 -201586 240853
12978A05680J20112b15727I2086K29724E9180A854K37639G8653J4689C2635K32768
$$ 105680 225792 -215727 92086 321810 59180 1854 239493 78653 93342 32635 265403
12967B65403p7730K185p4602e245n5338q98K1191A58055P3024D1692J28068D7252
$$ 265403 187673 189858 115256 -5245 -60583 -61481 -40290 158055 231079 41692 169760 47252
12954B43918j10867J2838m9996K97605A29405e2542a0602A15206J25841g0112
$$ 243918 133051 145889 95893 393498 129405 -52542 -10602 115206 241047 -70112
12943C8585a73226A03803a20817B63571n6651q1558b99975b7721k6486J5442g11
$$ 38585 -173226 103803 -120817 263571 206920 125362 -299975 -27721 -54207 -38765 -711
12931E1099g3213J9391A17164E1094L6505l576L83457c30651A20092I643O7042
$$ 51099 -73213 -53822 117164 51094 87599 84023 467480 -330651 120092 9643 76685
12920G6685b96733C1633B476e1759A15436B4467L76610b3481E6510J74275o1263
$$ 76685 -296733 31633 2476 -51759 115436 24467 401077 -23481 56510 230785 169522
12909A69522c0605k42173C23351D2976a78114b7546B97607A26767n798h0361A00688
$$ 169522 -30605 -272778 323351 42976 -178114 -27546 297607 126767 120969 -80361 100688
12897a68022j52550J28981A58005a68367A71421e1615C20845C9824J86953R0875
$$ -168022 -320572 -191591 158005 -168367 171421 -51615 320845 39824 226777 317652
12887C17652A47468G0280a93959A39458K06918F4781b7908C46641B0445b11407
$$ 317652 147468 70280 -193959 139458 346376 64781 -27908 346641 20445 -211407
12876A11232D890h0522a5485A70450c5788l51275a00537D6e0231j70418g5893
$$ 111232 4890 -80522 -15485 170450 -35788 -387063 -100537 46 -50231 -220649 -75893
12864i9658L8641n945q2789c0871l56659d0208j93027F0668J72690a56320c1556
$$ -99658 -61017 -66962 -149751 -30871 -387530 -40208 -233235 60668 233358 -156320 -31556
12852b42160a2457B04370h9638n7602B49090a28124L490G765c571A69838N1499
$$ -242160 -12457 204370 -89638 -147240 249090 -128124 -124634 7765 -3571 169838 221337
12841B21337B2487L49992c9106A79832m0273F5823c16700a47272B38955E5156
$$ 221337 22487 372479 -39106 179832 139559 65823 -316700 -147272 238955 55156
12830c32973C34339a06840b5375A49698a91546A99300F7852J59602F2009K57358
$$ -332973 334339 -106840 -25375 149698 -191546 199300 67852 227454 62009 319367
12820C19367B8837J49236b62008I6534a97A5279L72125E866M7914a1727q60B31979
$$ 319367 28837 178073 -262008 96534 -197 15279 387404 5866 53780 -11727 -12587 231979
12807A49885C6293c2613B73758F4573J3864J28967p6729e2369C53894F8192f0230
$$ 149885 36293 -32613 273758 64573 78437 207404 130675 -52369 353894 68192 -60230
12795B65838H3840M969b27617d3262A866J50367a60401A21477R98m6064a05558
$$ 265838 83840 88809 -227617 -43262 1866 152233 -160401 121477 122475 76411 -105558
12783A17787l3510g3604e904n6032j19198j03499d0385k40647C14772L4861B2749
$$ 117787 84277 -73604 -5904 -61936 -181134 -284633 -40385 -281032 314772 349633 22749
12771B07607a14706A36368J0974a33645A68014A6680b38220M4221b5040j13544
$$ 207607 -114706 136368 147342 -133645 168014 16680 -238220 -193999 -25040 -138584
12761a38584C04820j52224d4357A46535a81649A11221F681L34038b41949B173
$$ -138584 304820 152596 -44357 146535 -181649 111221 6681 340719 -241949 2173
12750b87446i4448G1329K7454J86833H7636a55504F668K26619g5467E3417e6757
$$ -287446 -94448 71329 98783 285616 87636 -155504 6668 233287 -75467 53417 -56757
12738C512i9853C32009j46672B1531J6586J53014O2496q3738O0291M0181c3693
$$ 3512 -99853 332009 185337 21531 38117 191131 253627 169889 230180 270361 -33693
12726B03943i5364m550C3766b6942l352q8531C9809h3650D96099a82649b3444
$$ 203943 -95364 -99914 33766 -26942 -30294 -118825 39809 -83650 496099 -182649 -23444
12714a93279F9647N6036b54924A06772C1956K04679f7886k01268D35680l9284
$$ -193279 69647 125683 -254924 106772 31956 236635 -67886 -269154 435680 396396
12704C96396j14070A16193J86968A25580J26546O6469C5622g7621D48740A71140
$$ 396396 282326 116193 303161 125580 252126 318595 35622 -77621 448740 171140
12693c03951J06630D6056E025a67334h581B01738b27898Q7506B82881E78J5369
$$ -303951 -197321 46056 5025 -167334 -8581 201738 -227898 -140392 282881 578 15947
12682A5947h0976E027J14503J06548q0419J27331b439C20193a52558A32053J92308
$$ 15947 -80976 5027 119530 226078 145659 272990 -2439 320193 -152558 132053 324361
12671C24361a5427j39147A09613J1234a59083d2088m4252C21236A38774P3146
$$ 324361 -15427 -154574 109613 120847 -159083 -42088 -86340 321236 138774 211920
12661B11920E9686J65199O8928D5553K89244B5858a46178C3352M79735a27161
$$ 211920 59686 224885 293813 45553 334797 25858 -146178 33352 513087 -127161
12650B93410G6922j1547M2394f9321I5884Q7655I1634Q218J28754E8187J22506
$$ 293410 76922 65375 107769 -69321 95884 183539 91634 99852 228606 58187 180693
12639A80693b47521I5230f941B62407J03789j56812J61869b35702A17832J81228
$$ 180693 -247521 95230 -6941 262407 366196 209384 371253 -235702 117832 299060
12629B99060K4124o4504p5280K43757C7397j3011J85671K52816j82668C3141a96432
$$ 299060 323184 258680 183400 427157 37397 24386 210057 462873 280205 33141 -196432
12617A46920L399C7677K14095r3008B6465f0319a2085k56443J07657A56186k6419
$$ 146920 150319 37677 251772 158764 26465 -60319 -12085 -268528 -160871 156186 129767
12606A29767L53273H214J06182g507B32484b31525J02848D9793b66573A39442
$$ 129767 483040 8214 114396 -7507 232484 -231525 -128677 49793 -266573 139442
12595A12069l8104a55959N0282A35878Q6285J8069O1495a36512C23651a12976
$$ 112069 73965 -155959 -105677 135878 222163 240232 301727 -136512 323651 -112976
12584a05397G8896B7752e1808B91132b6189l6833a7837B62415b61208A27941b06987
$$ -105397 78896 27752 -51808 291132 -26189 -63022 -17837 262415 -261208 127941 -206987
12572A56114J65560a35820j09938B6759r743L5161f5840j07855b4336k06079A84294
$$ 156114 321674 -135820 -245758 26759 17016 52177 -65840 -173695 -24336 -230415 184294
12560B37748a60426G9148a37476A84986C6494a44282c690A52840b71949A03330
$$ 237748 -160426 79148 -137476 184986 36494 -144282 -3690 152840 -271949 103330
12549a23369G6307f6423c2383g201A56569J69342A52220b63852F1694K04498a65350
$$ -123369 76307 -66423 -32383 -7201 156569 325911 152220 -263852 61694 266192 -165350
12537c4388B35554g205E2175L82078b81963i6371j25396O6379k4932a657j89080
$$ -34388 235554 -7205 52175 434253 -281963 -96371 -221767 -155388 -180320 -1657 -190737
12526a90737A76444M2423H2981Q2135G2549J06729g7983j53100J09303A3562a76533
$$ -190737 176444 218867 82981 165116 72549 179278 -77983 -231083 -121780 13562 -176533
12514B04001H41J57058b20109B4488c71448A65841C3825e6226k35883G184b42609
$$ 204001 841 157899 -220109 24488 -371448 165841 33825 -56226 -292109 7184 -242609
12502B2225A731h2816j44205B01890b00384A72523a79845B11782D313R7903D30
$$ 22225 1731 -82816 -227021 201890 -200384 172523 -179845 211782 4313 102216 430
12490C30279h7092c0402G6154M6872C6739a95679Q0166B77279A8858N6076L1970
$$ 330279 -87092 -30402 76154 123026 36739 -195679 -115513 277279 18858 74934 106904
12479A06904h4518k16266C3666L4934A2931K32830F4945P9975C4319K04093a71388
$$ 106904 -84518 -300784 33666 68600 12931 245761 64945 144920 34319 238412 -171388
12467f6253j88214B22888m5297C2314d2803k9428h849m5328k4316k3436C16280
$$ -66253 -254467 222888 177591 32314 -42803 -72231 -8849 -54177 -78493 -101929 316280
12455f4225C88652b11725j11309I57P3569J10762l8550c53237a18132C6823b8677
$$ -64225 388652 -211725 -323034 957 74526 185288 146738 -353237 -118132 36823 -28677
12443C19258a17684K9975D5768j2890L5941k5520N3491H876J70529a70394H1470
$$ 319258 -117684 -87709 45768 32878 68819 43299 96790 8876 179405 -170394 81470
12431a02812l0090H6685m3301K5843a89143n5936L6999C39729b29906K3037B97150
$$ -102812 -132902 86685 43384 69227 -189143 -245079 -208080 339729 -229906 -206869 297150
12419A96451I0838h1025B33414i6726F7250c12503A4032Q2478b00388b4913n7672
$$ 196451 90838 -81025 233414 -96726 67250 -312503 14032 96510 -200388 -24913 -82585
12408h2585B3917c7488M262F6949M5985b70071C15058h8218c0356j91747n4486
$$ -82585 23917 -37488 -33226 66949 112934 -270071 315058 -88218 -30356 -222103 -276589
12397b76589H4810d6412j70420i1659A74220H6596N0506J14794h7722j30879B59340
$$ -276589 84810 -46412 -216832 -91659 174220 86596 137102 251896 -87722 -218601 259340
12385a20047A79014b69382B13862n2394E2619K56407k9196c67032h2876B02420
$$ -120047 179014 -269382 213862 161468 52619 309026 279830 -367032 -82876 202420
12374A236M0083R2681E9631b34267r8530D3150J32348P7108j06641J09987A05258
$$ 1236 41319 134000 59631 -234267 -332797 43150 175498 252606 145965 255952 105258
12362E0779a0667j23629r8346B75088a14325A27709b44490H7627a52898H0078
$$ 50779 -10667 -134296 -232642 275088 -114325 127709 -244490 87627 -152898 80078
12351a79556k51224a04554A13374c0903E3290f7861D51824A33979J27398m4725
$$ -179556 -430780 -104554 113374 -30903 53290 -67861 451824 133979 261377 216652
12341B16652a79589g6277A21379E8962a8885D67128d13536G3685d784k56774A92380
$$ 216652 -179589 -76277 121379 58962 -18885 467128 -413536 73685 -4784 -261558 192380
12329B10274a4779H9002a85003P7356k39210d6440l37814D34462b60980B63678
$$ 210274 -14779 89002 -185003 -107647 -346857 -46440 -384254 434462 -260980 263678
12318B58432B3214J56957j9709a69237B13691d5503F9564B0427J10986a61884
$$ 258432 23214 180171 160462 -169237 213691 -45503 69564 20427 131413 -161884
12307A40452a49496A45756m9571J48226J1232g7404m3483H4948B8605K8853a19015
$$ 140452 -149496 145756 96185 244411 255643 -77404 -120887 84948 28605 57458 -119015
12295D1235N88672B22301I3329e6620D2167a9692p5667n7476F7975J32368a53868
$$ 41235 629907 222301 93329 -56620 42167 -19692 -95359 -152835 67975 200343 -153868
12283a87712A96991b4174j53208A78155a13280B95820A43596k2101O501J18779
$$ -187712 196991 -24174 -177382 178155 -113280 295820 143596 121495 127996 246775
12273B46775p1577B9919P1215B2030J25361b8791l36610a78138j16372g1645B78188
$$ 246775 175198 29919 101134 22030 147391 -28791 -365401 -178138 -294510 -71645 278188
12261B34042C3330a3877H851J25984E8454L97284j71299A39388q028a98632B37146
$$ 234042 33330 -13877 8851 134835 58454 455738 284439 139388 131360 -198632 237146
12249A99558I2839C0577K55419A32054a26654B38920I2538c3443C52409A72041
$$ 199558 92839 30577 285996 132054 -126654 238920 92538 -33443 352409 172041
12238C9970L3367d4845C78392D1984c9272C6224O570J46242o8290a13154B13272
$$ 39970 73337 -44845 378392 41984 -39272 36224 42794 189036 120746 -113154 213272
12226B95548A05096a34820A82794J55020A00313L00077a80157J7853A65146K05806
$$ 295548 105096 -134820 182794 337814 100313 400390 -180157 -162304 165146 370952
12216C70952B2876L28496A41824L071a82213B35300o5221G7054j7462J3890N5523
$$ 370952 22876 351372 141824 144895 -182213 235300 170079 77054 59592 73482 129005
12205A29005N3245j8550N971J49425J11341j17040j6445A30198R4661N4732K7824
$$ 129005 182250 163700 169671 319096 430437 313397 296952 130198 224859 279591 307415
12194C07415l8103j22945A3091L86270A28262K58172K2683D9877k099J37055a27292
$$ 307415 269312 146367 13091 399361 128262 386434 409117 49877 47778 184833 -127292
12182D01322a77638C36890p1843a32449C78272c8063G2348g0431A41598k3552
$$ 401322 -177638 336890 265047 -132449 378272 -38063 72348 -70431 141598 118046
12172A18046f0232H6499J95600A07722M0899b14359K8145l9647B08883b7178j88177
$$ 118046 -60232 86499 282099 107722 148621 -214359 -186214 -225861 208883 -27178 -215355
12161b15355A3563l413O3588f0722B19292b19336f1268B15765C6988c22533C87017
$$ -215355 13563 10150 73738 -60722 219292 -219336 -61268 215765 36988 -322533 387017
12149A2042J44678b67223B29968i9178f807C06527h9126o9270A75229F1047K6552
$$ 12042 156720 -267223 229968 -99178 -6807 306527 -89126 -158396 175229 61047 87599
12138H7599h637l2708j95535A04261K07348A17800f2815r8035A76199f0173j0569
$$ 87599 -8637 -41345 -236880 104261 311609 117800 -62815 -160850 176199 -60173 -70742
12127g0742A47875J7155E6217k7886h6462k3179H935R6371b07677L0637l0607
$$ -70742 147875 165030 56217 28331 -86462 -109641 8935 105306 -207677 -177040 -207647
12116b07647M7322B65541r0745b45709C28953j34020k0064a35049b0080B8801
$$ -207647 -160325 265541 174796 -245709 328953 194933 174869 -135049 -20080 28801
12105c9293j08741H9504K64155A59581E0256Q428J77730i643C34083d26127A21512
$$ -39293 -148034 89504 353659 159581 50256 58684 236414 -9643 334083 -426127 121512
12093E2156J2744n339J29589a40590B59453e2241C84839H136h2222j45439G2547
$$ 52156 64900 59561 189150 -140590 259453 -52241 384839 8136 -82222 -227661 72547
12081B34143b3112I9125L88613e174E3602B2812e1389j51790Q0831d7448j5449
$$ 234143 -23112 99125 487738 -5174 53602 22812 -51389 -203179 -122348 -47448 -62897
12070f2897J5121A0934K14057J08603J1687J140844L0458o62589A45199M4228
$$ -62897 -47776 10934 224991 333594 345281 1486125 1516583 853994 145199 189427
12060A89427d5870D7686f3468C1234J74200m6589b23878L4032A92095b15203G7227
$$ 189427 -45870 47686 -63468 31234 205434 158845 -223878 -189846 192095 -215203 77227
12048B91202j44550E8658J81443n6104h5272A0844a04836q6061E3928a26525A87542
$$ 291202 146652 58658 240101 183997 -85272 10844 -104836 -190897 53928 -126525 187542
12036A61969b040k57536J8161B18011e3760j1930q5098G246b379n4371A42516
$$ 161969 -2040 -259576 -241415 218011 -53760 -65690 -150788 7246 -2379 -56750 142516
12024a71806P4425M7135j79448f7150E5906a98476I339a15777d8421J2774p1719
$$ -171806 -97381 -50246 -229694 -67150 55906 -198476 9339 -115777 -48421 -35647 -107366
12013a07366B0883L13476E8830b37252C05906j20720H5041a63803M1603a3582
$$ -107366 20883 334359 58830 -237252 305906 185186 85041 -163803 -122200 -13582
12002f9954j32277B26778B1577b36988F5964b39742D418K31435b42516a19989
$$ -69954 -202231 226778 21577 -236988 65964 -239742 4418 235853 -242516 -119989
11991A184a16080A99298a1843k1956o6050E3874a36470p1889K6787I26b43011
$$ 1184 -116080 199298 -11843 -33799 -99849 53874 -136470 -208359 -181572 926 -243011
11979b50936E7394e3900j18409j39698C3403a56196O6921B08139E8325J31581
$$ -250936 57394 -53900 -172309 -312007 33403 -156196 -89275 208139 58325 189906
11969A89906R245e853g82C5890a55820A11119c61096A34150K2737i967m20885
$$ 189906 199151 -5853 -782 35890 -155820 111119 -361096 134150 156887 -9967 -430852
11958d30852C23080d6923C09315l9112j15146o4057K82546H7162b23282E4556
$$ -430852 323080 -46923 309315 270203 155057 91000 373546 87162 -223282 54556
11947g7561k17787J16710q2374m578J27325E0783i2126L7880r2533N4324A66325
$$ -77561 -295348 -178638 -261012 -265590 -138265 50783 -92126 -54246 -146779 -92455 166325
11935B3071K43425j32377K51850b31042F4572K68299g9265p2785L1085b0079B76023
$$ 23071 266496 134119 385969 -231042 64572 332871 -79265 -152050 -120965 -20079 276023
11923a61838O670C7845J6783h1610D8015J43271B0158f4118j35783N8447J046
$$ -161838 -155168 37845 54628 -81610 48015 191286 20158 -64118 -199901 -141454 -140408
11912a40408G7132g6140l32567f1241k9511J2841A04274B4862a8500k32071K6416
$$ -140408 77132 -76140 -408707 -61241 -90752 -77911 104274 24862 -18500 -250571 -224155
11901b24155B92551a47846B8462h8521j28474f7143B0299K29543b0548A85367
$$ -224155 292551 -147846 28462 -88521 -216995 -67143 20299 249842 -20548 185367
11890A76466C1439b00653c1127j10443D8110J41425f1568k1592l10119g5451i366
$$ 176466 31439 -200653 -31127 -141570 48110 189535 -61568 -83160 -393279 -75451 -9366
11878a50012A73709R7655d2123C36004j06836b8326n1176B0922a86155B3665O9900
$$ -150012 173709 271364 -42123 336004 229168 -28326 -79502 20922 -186155 23665 93565
11867I3565R5673b36962b3320A2573a96699C8808J06060K93527j74717b17756
$$ 93565 189238 -236962 -23320 12573 -196699 38808 144868 438395 263678 -217756
11856a05682A65017F1383R213a14510F3905a47794A00729b513r6579B43945E818
$$ -105682 165017 61383 70596 -114510 63905 -147794 100729 -2513 -99092 243945 5818
11844B6250e3818m2780C10928a77410K2169b3450A67642b33906j9528a03616b8766
$$ 26250 -53818 -96598 310928 -177410 -155241 -23450 167642 -233906 -253434 -103616 -28766
11832b56400l98347C33905a66946I195c27110I3023c5657A4909a34595A59645
$$ -256400 -654747 333905 -166946 9195 -327110 93023 -35657 14909 -134595 159645
11821B3734g1597j5387k28684a0407C13796b31866J09829A93950j1214D3677D423
$$ 23734 -71597 -86984 -315668 -10407 313796 -231866 -122037 193950 182736 43677 4423
11809C43612e8074b004l39747J62815Q1666n8836A62283e0155j96265R6779j18987
$$ 343612 -58074 -2004 -341751 -178936 -97270 -156106 162283 -50155 -246420 -149641 -268628
11798b68628A995J65515a90261c5702p7817C08033j25730h5543a6017j99432B4481
$$ -268628 1995 167510 -190261 -35702 -113519 308033 182303 -85543 -16017 -215449 24481
11786A87055P7653q1127b17902A7533a8508G4180K7811a41975D5871a02190j30059
$$ 187055 264708 183581 -217902 17533 -18508 74180 101991 -141975 45871 -102190 -232249
11775b32249A60557c2034D07037j13734a57599b4907n1723A19533C282L59588
$$ -232249 160557 -32034 407037 293303 -157599 -24907 -76630 119533 3282 362870
11765C62870F9498a98423N8774A21519a57252A42855a38561G9486b85408A54914
$$ 362870 69498 -198423 -139649 121519 -157252 142855 -138561 79486 -285408 154914
11754b03941A29191a35456J4052c9211R576D6416a30111F9456C3433M7894h1548
$$ -203941 129191 -135456 -121404 -39211 -29635 46416 -130111 69456 33433 81327 -81548
11742A95109q6762R8444a63044F4684b39211a16946B29105A6335J7330O3885m8103
$$ 195109 108347 206791 -163044 64684 -239211 -116946 229105 16335 33665 97550 49447
11731D9447K7021g4920j4857B63577b17138g2167A16378O8627J21740c0694D2455
$$ 49447 76468 -74920 -89777 263577 -217138 -72167 116378 185005 306745 -30694 42455
11719c9231B4287a78727H294c15734F643f187j84145A24774a03206j01924O6622
$$ -39231 24287 -178727 8294 -315734 6643 -6187 -190332 124774 -103206 -205130 -138508
11708a38508d8276E0788J21753c6382j73241Q6430A70510p7579a77754A75200
$$ -138508 -48276 50788 172541 -36382 -209623 -123193 170510 92931 -177754 175200
11697a7324B141K57951a93636R6147A16269J95700A45207F4313b0777l8814D6104
$$ -17324 2141 260092 -193636 -97489 116269 311969 145207 64313 -20777 -59591 46104
11685a13490A21718O1439b36681B28141D6789h3049I7844P5370a09444d7147E9091
$$ -113490 121718 183157 -236681 228141 46789 -83049 97844 173214 -109444 -47147 59091
11673A59810b79424d5272p5302B76111A37616g7275B21794C9748L8891K11283
$$ 159810 -279424 -45272 -120574 276111 137616 -77275 221794 39748 78639 289922
11663B89922D8227b40780C95078a2832D6141i5300K336A88129B1968K26242B4779
$$ 289922 48227 -240780 395078 -12832 46141 -95300 -92964 188129 21968 248210 24779
11651a78734b7901H3499a21801b3101r6051C2133c2561k49790d3444C5453L96593
$$ -178734 -27901 83499 -121801 -23101 -119152 32133 -32561 -282351 -43444 35453 432046
11640D32046J5232A71453a3780D1669j3735c00778A1931R32R3718K47316A5828
$$ 432046 447278 171453 -13780 41669 27934 -300778 11931 12863 106581 353897 15828
11628a46005g0698e581A36754J41183a27780A59439j2047b11739A38498a68906
$$ -146005 -70698 -5581 136754 277937 -127780 159439 147392 -211739 138498 -168906
11617B77480J19015I1252a43059a6231A00975J5256b56264a2611j33921g950l62363
$$ 277480 396495 91252 -143059 -16231 100975 116231 -256264 -12611 -146532 -7950 -370313
11606c70313B08313o9788h686n0685r0791J2511B1097h118A30745h9254k69878
$$ -370313 208313 138525 -8686 -59371 -150162 -137651 21097 -8118 130745 -89254 -359132
11595c59132f6441E2423a59095a5253j77563h7959B73592G6239J93753j01647
$$ -359132 -66441 52423 -159095 -15253 -192816 -87959 273592 76239 269992 168345
11585A68345M0245a49137a1479A49094b27260C06571a86749K4995A52377l026
$$ 168345 208590 -149137 -11479 149094 -227260 306571 -186749 -161754 152377 149351
11575A49351J38902d9911A98852H4793L51727A05095b20603C34310A14360a97193
$$ 149351 288253 -49911 198852 84793 436520 105095 -220603 334310 114360 -197193
11564B72401j32868J77638q5312h2917l6005E7027J92140r2057P1262A2496b22458
$$ 272401 139533 317171 231859 -82917 -118922 57027 249167 157110 228372 12496 -222458
11552a61444d9831j24203A18585m8805N45J73577F1509G240c4383G3233J24533
$$ -161444 -49831 -174034 118585 69780 70325 243902 61509 7240 -34383 73233 197766
11541A97766C2362N4244J12025G0409K71992r9920F4092g2210j65023A62244e0662
$$ 197766 32362 86606 198631 70409 342401 242481 64092 -72210 -237233 162244 -50662
11529A40661n0397e4742j35166A57010i4850A77386n3443n2205O0851a43945C93079
$$ 140661 90264 -54742 -189908 157010 -94850 177386 123943 71738 132589 -143945 393079
11517c4664o6266m6620B14348o9792n8780K38704d8030A63422N3115I1635d162
$$ -34664 -100930 -147550 214348 144556 85776 324480 -48030 163422 216537 91635 -4162
11505b1345A71079a86000C23209c8383J6388A70070P7710C2494a44672f6256B78589
$$ -21345 171079 -186000 323209 -38383 -21995 170070 247780 32494 -144672 -66256 278589
11493B50416B7239a3079B57701q9033K42445j85875A07896J81563m6142h6302
$$ 250416 27239 -13079 257701 168668 411113 225238 107896 289459 243317 -86302
11482B61722j19794B0094d5520C81966j2393B7996a9139k9708C10296A01404a6644
$$ 261722 141928 20094 -45520 381966 369573 27996 -19139 -48847 310296 101404 -16644
11470C28751D2427K75950d9238C17934r4142A06587K1289n0372M3268L3363K98715
$$ 328751 42427 318377 -49238 317934 223792 106587 127876 77504 120772 154135 452850
11459D52850b31982C14728a26728B05166A5283N4381a59226A80925c47989B99410
$$ 452850 -231982 314728 -126728 205166 15283 69664 -159226 180925 -347989 299410
11448E8003b25887B79457j19660D5299a3436A54141e2382A33575J38830c222B98128
$$ 58003 -225887 279457 159797 45299 -13436 154141 -52382 133575 272405 -3222 298128
11436A53247i4549d5360k54792E4996J7841E697L02829A29270a24265D53877m8732
$$ 153247 -94549 -45360 -300152 54996 72837 5697 308526 129270 -124265 453877 405145
11425D05145d96735A00112l6337J38444b00567B48295k589b17611i794a911l8482
$$ 405145 -496735 100112 63775 202219 -200567 248295 245706 -217611 -9794 -1911 -40393
11414d0393A52035a34294B78221c40182B93607h561j70064E8129a61438A74585
$$ -40393 152035 -134294 278221 -340182 293607 -8561 -178625 58129 -161438 174585
11403A24682a87521A96566D7153a5431A34177n2964a26910A59001m6404m0633
$$ 124682 -187521 196566 47153 -15431 134177 81213 -126910 159001 112597 71964
11393G1964Q040d2213A63378G5717l7449a14807Ai1052A724b80317M3483M6375
$$ 71964 80004 -42213 163378 75717 38268 -114807 1 -91052 1724 -280317 -236834 -190459
11381a90459o2685g526C71929D1632L4390d199A22246N2305n8697P944A3868b11803
$$ -190459 -253144 -7526 371929 41632 76022 -4199 122246 174551 115854 123798 13868 -211803
11368D03997F1376c15021A25408j9259B1100K13409E7348J92995j2717D0728A3312
$$ 403997 61376 -315021 125408 106149 21100 234509 57348 250343 237626 40728 13312
11356b70n9773j76416A43476E3887Q5158b14050B81980O5552a02853l7610C0315
$$ -270 -60043 -236459 143476 53887 139045 -214050 281980 347532 -102853 -140463 30315
11344b56630B16408d3827d499I6752a85467C78742H818a38763B26701a06193a5721
$$ -256630 216408 -43827 -4499 96752 -185467 378742 8818 -138763 226701 -106193 -15721
11332A8150c44030a53436K8085A82868a01158B39267H1133l2127f5116D6788f9813
$$ 18150 -344030 -153436 -125351 182868 -101158 239267 81133 49006 -65116 46788 -69813
11320a26936D45780a27285j91984A25539K2901a46054M8530k36742P6821b4972
$$ -126936 445780 -127285 -319269 125539 148440 -146054 -97524 -334266 -257445 -24972
11309c3022k6228j8264C3375a50504f5476A7419d72513a48390O3860A00693R2802
$$ -33022 -59250 -77514 33375 -150504 -65476 17419 -472513 -148390 -84530 100693 193495
11298A93495G3080N7606B0665e3213D8367K5022L83624h5809J8801k8206j26349
$$ 193495 73080 130686 20665 -53213 48367 73389 457013 -85809 -67008 -95214 -221563
11287b21563C9451b08331i0578B48604m3409r2516C5076A223g8298J8027G7100
$$ -221563 39451 -208331 -90578 248604 205195 112679 35076 1223 -78298 -60271 77100
11275a56485B42979k7835c10715i515k53088A26495E5992d6180m709A9199f9383
$$ -156485 242979 215144 -310715 -9515 -262603 126495 55992 -46180 -50889 19199 -69383
11263b85337h7274D0652a75892k3409f4321J6493G5560a74793d0267C8787h4598
$$ -285337 -87274 40652 -175892 -199301 -64321 -47828 75560 -174793 -40267 38787 -84598
11251H282b45280f5596n867j4059k46486E2353j3043A2497b96915A96376b56394
$$ 8282 -245280 -65596 -71463 -85522 -332008 52353 39310 12497 -296915 196376 -256394
11239b46297R7437q0706D53175i5412A18232c95819h6302D9191a75970G2141J39413
$$ -246297 -148860 -229566 453175 -95412 118232 -395819 -86302 49191 -175970 72141 211554
11228B11554f5025E6529N4216c0863A15553c6791j49451o841D190h7515J1134
$$ 211554 -65025 56529 110745 -30863 115553 -36791 -186242 -193083 4190 -87515 -76381
11217g6381A55722m3253e0393k2042j60877N8366j09909J19681C12524B2182d0742
$$ -76381 155722 112469 -50393 -72435 -233312 -174946 -284855 -165174 312524 22182 -40742
11205d9696D39928c6846n5547k9489A22070a40311f1535C46408A60400F8269h447
$$ -49696 439928 -36846 -92393 -121882 122070 -140311 -61535 346408 160400 68269 -8447
11193A1552a86310B08935b54068j70960A36675b71590I9886c97436G2922R4393
$$ 11552 -186310 208935 -254068 -425028 136675 -271590 99886 -397436 72922 167315
11183A67315b18433b6468j25944a897q1222D02599a56130A21664o183g9713H8692
$$ 167315 -218433 -26468 -152412 -1897 -83119 402599 -156130 121664 115481 -79713 88692
11171b00629P1823Q919g124B8768J94261k4854b98560a33873f4733B48812d3422
$$ -200629 -128806 -119887 -7124 28768 223029 198175 -298560 -133873 -64733 248812 -43422
11159A50752a26571D6101K36241F2290c47760I1b903k7704k19539G4297O5645
$$ 150752 -126571 46101 282342 62290 -347760 91 -2903 -30607 -250146 74297 139942
11148A39942J5207r81P3418b1808H1102a31381N0383A66403b11452P3330I6458
$$ 139942 155149 154168 227586 -21808 81102 -131381 -80998 166403 -211452 -138122 96458
11136B0934J51568l5886L856L4461a26026A00011e8563m9551A17755d9064A30679
$$ 20934 172502 136616 140472 174933 -126026 100011 -58563 -108114 117755 -49064 130679
11124b2831C20933o330l8233a69765j11153A28424k3003d6837G3095M0926n2335
$$ -22831 320933 314603 276370 -169765 -280918 128424 105421 -46837 73095 114021 61686
11113F1686a48246D2076L9274K65326j70697g4496A33399a20906A19274J38351
$$ 61686 -148246 42076 81350 346676 175979 -74496 133399 -120906 119274 257625
11103B57625a22991A13552J72279o5688j9738N9334A23467q788k6791L98492B11416
$$ 257625 -122991 113552 285831 220143 200405 259739 123467 114679 87888 486380 211416
11091A82520M699O0757L1700C4844L8318P083K73455j37r5422O5248J57973j78415
$$ 182520 187219 247976 279676 34844 73162 80245 353700 353563 258141 323389 481362 302947
11079C02947D9316K93960j64743J4315G7185J45069P9223g5442F6590N15830A89522
$$ 302947 49316 343276 178533 192848 77185 222254 301477 -75442 66590 582420 189522
11067E15153r4155j62250J54245j38976A11341l1296M42520A71335K02837K34144
$$ 515153 420998 258748 412993 274017 111341 80045 522565 171335 374172 608316
11057F08316J28709l30555J35903J92192j75360p1404m6736L39074K7381k90258
$$ 608316 737025 406470 542373 734565 559205 487801 441065 780139 807520 517262
11047E17262J18213m2560K74984k30494l822K25346j27408K85003E04986K08557
$$ 517262 635475 592915 867899 637405 633583 858929 731521 1016524 504986 713543
11037G13543J68564k6417p8363m6454J18302j68739k07298n800J33679k00587
$$ 713543 882107 855690 777327 730873 849175 680436 473138 467338 601017 400430
11027D00430n0505K8036M31421M3433j17299k40722J92011k08376j77802M59163
$$ 400430 349925 377961 809382 852815 735516 494794 686805 478429 300627 759790
11017G59790r3171o2710p5414A72573M10442L09450k93214K66584j74950j30456
$$ 759790 666619 603909 528495 172573 583015 892465 599251 865835 690885 560429
11007E60429M3532k3305m6243P9609m0056J82024q0558k82168K33327J31749j8504
$$ 560429 603961 580656 534413 614022 573966 755990 675432 393264 626591 758340 739836
10996G39836l31496L01315p3062k04769K35086M1471L42298k75327Q275n1932
$$ 739836 408340 709655 636593 431824 666910 708381 1050679 775352 783627 731695
10986G31695k14979M59446J03417m25582K35870J00245K58119J17819L9747k51158
$$ 731695 516716 976162 1079579 653997 889867 990112 1248231 1366050 1405797 1154639
10976A154639Q49208m1260J11672R9351K50498M55453j45083J0263R4995n34831
$$ 1154639 2003847 1962587 2074259 2173610 2424108 2879561 2734478 2744741 2839736 2304905
10966B304905k67561j70583k30263o999k35670J54771j54020j13785O28N45825
$$ 2304905 2037344 1866761 1636498 1629499 1393829 1548600 1394580 1280795 1281423 1827248
10956A827248m64753J34865O8212k95930j8709E10610L01233J01638r4152l31919
$$ 1827248 1362495 1497360 1565572 1269642 1250933 510610 811843 913481 819329 487410
10946D87410n1298j54366K50843j25010A24726M4642K86357a41320C15401A38410
$$ 487410 436112 281746 532589 407579 124726 169368 455725 -141320 315401 138410
10935c6780F283J94143n7385E9192b1375B10356H560f2231B23980J5824J30664
$$ -36780 6283 200426 143041 59192 -21375 210356 8560 -62231 223980 239804 370468
10924C70468A02057J48630C3327P0259A5296K65978E6757k3956J71838k9534e9859
$$ 370468 102057 250687 33327 103586 15296 281274 56757 32801 204639 175105 -59859
10912a74729k7065b7547k01086L6272J3043h4980B4769A1568R0307a15817a6395
$$ -174729 -201794 -27547 -228633 -192361 -179318 -84980 24769 11568 101875 -115817 -16395
10900g8838A4047L1282a85058A40538i712k21314a6326I619j376J23247g7987
$$ -78838 14047 45329 -185058 140538 -9712 -231026 -16326 9619 8243 131490 -77987
10888g0081A82104a29536F9073O2494J82843A7000M719a55872A6665J503b61879
$$ -70081 182104 -129536 69073 131567 314410 17000 21719 -155872 16665 18168 -261879
10876C8325b54682B07203E7651J36500c2366k04357h6536B06224M2332c1136j05048
$$ 38325 -254682 207203 57651 194151 -32366 -236723 -86536 206224 248556 -31136 -136184
10865a36184M7317A22803c30641e1438A51344n6613b7401k20071B9298b5395I6352
$$ -136184 -88867 122803 -330641 -51438 151344 94731 -27401 -247472 29298 -25395 96352
10853E0438a02235C40660A21964D6618n864M6981d109j70065n3839l5256a18213
$$ 50438 -102235 340660 121964 46618 40754 87735 -4109 -174174 -228013 -263269 -118213
10841a43040a8753B5665K03141I8376P040e4976B2670a31268C3403M44022c0029
$$ -143040 -18753 25665 228806 98376 105416 -54976 22670 -131268 33403 477425 -30029
10829A95524c88977f0337j02012C0720d7946J888I312b16000G408P1936g1026
$$ 195524 -388977 -60337 -162349 30720 -47946 -46058 9312 -216000 7408 79344 -71026
10817F6154A366d5290k12722j31677a75487A08479b54180f2985r5837C1651j0248
$$ 66154 1366 -45290 -258012 -389689 -175487 108479 -254180 -62985 -158822 31651 21403
10806B1403m258K37376B6486K0893L9645i8521B6600a66731B02626o8331c7057
$$ 21403 17145 254521 26486 47379 87024 -98521 26600 -166731 202626 134295 -37057
10794A5381N2697h5130k97942a81759O1091D8010a50324q7713a03961M1629F4184
$$ 15381 68078 -85130 -383072 -181759 -120668 48010 -150324 -238037 -103961 -62332 64184
10782A03523a60659l3058J3071D0934a85591l5145A61440a65621H1947b1986j57547
$$ 103523 -160659 -193717 -180646 40934 -185591 -220736 161440 -165621 81947 -21986 -179533
10771a79533B18021K8511h4777l08255B6970a05688j19989O9487L0191B19471
$$ -179533 218021 246532 -84777 -393032 26970 -105688 -225677 -156190 -125999 219471
10760a05085l2975M9182r1860A1491L90097I5599d2358B8703b07677b7017r2025
$$ -105085 -138060 -88878 -180738 11491 401588 95599 -42358 28703 -207677 -27017 -119042
10749a19042l8441P4393A54139c3630I5601J27104q7106l310a19B23533a81465
$$ -119042 -157483 -83090 154139 -33630 95601 222705 135599 132289 -119 223533 -181465
10737A04510d4481j7103A23913b06031N4106D32518a68058N3335A04988O2971
$$ 104510 -44481 -61584 123913 -206031 -151925 432518 -168058 -114723 104988 167959
10727A67959G917b01084K9552C58688a47063F0127N7624C1856a52634a550A31029
$$ 167959 7917 -201084 -171532 358688 -147063 60127 117751 31856 -152634 -1550 131029
10715c9821k860D0889K4885b04051N6646j52607a35475j3224c2755B2089Q757
$$ -39821 -42681 40889 65774 -204051 -147405 -300012 -135475 -148699 -32755 22089 30846
10704C0846J62038H0725a57210b1107j00222a7225j9752j13882a9649j93450F8754
$$ 30846 192884 80725 -157210 -21107 -121329 -17225 -36977 -150859 -19649 -213099 68754
10692A04178a30579O1421C98340A76724a76996P1590m9842f592l5680j2328k30729
$$ 104178 -130579 -69158 398340 176724 -176996 -105406 -155248 -6592 -42272 -54600 -285329
10681b85329H3579J7604g975k26438N470h2932j57363A29387c36410h6351E7433
$$ -285329 83579 101183 -7975 -234413 -228943 -82932 -240295 129387 -336410 -86351 57433
10669B47297M0748j17210J01031a50754E0652a38628A56458c74368b892q7230
$$ 247297 288045 170835 271866 -150754 50652 -138628 156458 -374368 -2892 -90122
10659i0122m765l37775J53823J06683G916a40144D2730O8484a90289C6383J26004
$$ -90122 -94887 -432662 -278839 -172156 7916 -140144 42730 111214 -190289 36383 162387
10648A62387g8943H4627A5942b22759L4792C68437E3509b01195l738d0979l9987
$$ 162387 -78943 84627 15942 -222759 -187967 368437 53509 -201195 -204933 -40979 -80966
10637h0966p6902d1798h385G6449A9960J90459l2742b0814r631j14795L8701l59807
$$ -80966 -157868 -41798 -8385 76449 19960 210419 177677 -20814 -30445 -145240 -106539 -466346
10625d66346e66A0307M2794J74083b00846j31291A53588a98807C6989P7034P430
$$ -466346 -566 10307 53101 227184 -200846 -332137 153588 -198807 36989 114023 121453
10614A21453j982B3371R4601a15984J557j48563P3093j50469a28857j73581A23958
$$ 121453 119471 23371 117972 -115984 -114427 -262990 -189897 -340366 -128857 -302438 123958
10602A82870C3847d12387A75054a21287l3099j0329A17916J59665b5893n10318
$$ 182870 33847 -412387 175054 -121287 -154386 -164715 117916 277581 -25893 -536211
10592e36211a30315M1280N022n7766p6320A12993e8348C2872d5316A41581a97213
$$ -536211 -130315 -89035 -84013 -141779 -218099 112993 -58348 32872 -45316 141581 -197213
10580a37960B51614b06946D0041a81747A43844n5420a84308P4808r6483d4301
$$ -137960 251614 -206946 40041 -181747 143844 88424 -184308 -109500 -205983 -44301
10569c1413b4k14335e5343F7284k2216J85407C341J34922B0683L54892G3388c31706
$$ -31413 -24 -214359 -55343 67284 45068 230475 3341 138263 20683 375575 73388 -331706
10556b38480J14644A02176h0222K3217K3103G5488P1747a05243B26408C3554e5653
$$ -238480 -123836 102176 -80222 -57005 -33902 75488 147235 -105243 226408 33554 -55653
10544D7044L841M351K4345C8202A8988J98316K7391e9531k9877O086A7129L11751
$$ 47044 50885 55236 79581 38202 18988 217304 244695 -59531 -89408 -83322 17129 328880
10532C28880G8044O1855n1816J93203E7058c27453B55247A8992a34751A66958
$$ 328880 78044 139899 88083 281286 57058 -327453 255247 18992 -134751 166958
10521I2528a00682l5200I8583g4798r9113l5734B15935J03957j59046g1245j54948
$$ 92528 -100682 -135882 98583 -74798 -173911 -209645 215935 319892 160846 -71245 -226193
10510b26193a3149B40442b37762A15224J79240K9626a26700O493B35360c53977
$$ -226193 -13149 240442 -237762 115224 294464 324090 -126700 -120207 235360 -353977
10499A27288c9507m2986q6763O429k07814a66130a3795F0189J46109d249o5248
$$ 127288 -39507 -82493 -169256 -162827 -370641 -166130 -13795 60189 206298 -4249 -69497
10488f9497A15684P6543G5000J65438A3387M57911A47623a79079H0215m999L81140
$$ -69497 115684 192227 75000 240438 13387 471298 147623 -179079 80215 75216 456356
10477D56356d7638a4993E1338a48836d2751I398J78799J2170o8567J80060h7581
$$ 456356 -47638 -14993 51338 -148836 -42751 9398 188197 200367 131800 311860 -87581
10465a65439A73596G1041e1727j30469C39491a05465A700O4321B7801D535b6422
$$ -165439 173596 71041 -51727 -182196 339491 -105465 1700 66021 27801 4535 -26422
10453b14178e0071l6720A35375K9652a98178A8448J30859a25883e0764G598J89210
$$ -214178 -50071 -86791 135375 165027 -198178 18448 149307 -125883 -50764 7598 196808
10442A96808b14954i2784p2124O2441B50736h2146d442A383J83627F7363b00802
$$ 196808 -214954 -92784 -164908 -102467 250736 -82146 -4442 1383 185010 67363 -200802
10430A21760h5638A00994a30077B24318c02309N1807A60671c329l7610l14688
$$ 121760 -85638 100994 -130077 224318 -302309 -250502 160671 -3329 -40939 -355627
10420c55627C04610O481A3395J21219j0967f3800D6498B0971K38457I6898h5465
$$ -355627 304610 311091 13395 134614 123647 -63800 46498 20971 259428 96898 -85465
10408C12218d0612a9726m2836j09935p3873B7874J86630d0331q4400A2572J31544
$$ 312218 -40612 -19726 -62562 -172497 -246370 27874 214504 -40331 -124731 12572 144116
10397A44116K51088b9660B13221c71017A65042K0529K290J79754r8066E3645J96983
$$ 144116 395204 -29660 213221 -371017 165042 185571 187861 367615 269549 53645 250628
10386B50628n9660k4032f5160q6423B43676n6993J42244a40713G0746M6281M8118
$$ 250628 190968 166936 -65160 -151583 243676 186683 328927 -140713 70746 117027 165145
10375A65145D9738h0067B63839n900F9417K68028J05844j11338j12758K12544
$$ 165145 49738 -80067 263839 257939 69417 337445 443289 331951 219193 431737
10365D31737K18973A24986L52910A85375N67303A17436K26113a02685C40253A5823
$$ 431737 650710 124986 477896 185375 752678 117436 343549 -102685 340253 15823
10354B59626J06318J88768k43665J02306M8622J43447k82526J62779B38697k1389
$$ 259626 365944 554712 311047 413353 461975 605422 322896 485675 238697 217308
10344B17308J95003e6813A91449L56541k14989A34936L67149j07528g3298D32193
$$ 217308 412311 -56813 191449 547990 333001 134936 502085 394557 -73298 432193
10333a40282A16740M8477E9156a74712k41093B65031b99059P6310A74301f1918
$$ -140282 116740 165217 59156 -174712 -415805 265031 -299059 -222749 174301 -61918
10322I2729M7619l301j4333J72231D2376f7514A23030K45119f602m012H6910P55168
$$ 92729 140348 137047 122714 294945 42376 -67514 123030 368149 -6602 -10614 86910 842078
10310H42078B80723F0763a31395A33090a2121k02245I7002R6502c2307A17810
$$ 842078 280723 60763 -131395 133090 -12121 -214366 97002 193504 -32307 117810
10299D7217b98043q0236f292B02363k8172a32102a6570I6042b0051k92879n8054
$$ 47217 -298043 -378279 -6292 202363 174191 -132102 -16570 96042 -20051 -312930 -370984
10288c70984f2997j60620A2525a02579L6617j76764A86046a6335A26511A7465
$$ -370984 -62997 -223617 12525 -102579 -65962 -242726 186046 -16335 126511 17465
10277h4275d0312j35767j40165h3706b6695k11062B40778b21143C33940A27367
$$ -84275 -40312 -176079 -316244 -83706 -26695 -237757 240778 -221143 333940 127367
10266A1315K2825e6644A20515O9518a90702E34258A69517J43710J01579E1013
$$ 11315 34140 -56644 120515 190033 -190702 534258 169517 313227 414806 51013
10255D20084m8127j55978r6802d233B48954O194r322m9710M0975F2391h0666A14528
$$ 420084 371957 215979 119177 -4233 248954 255148 245826 196116 237091 62391 -80666 114528
10242c0578m0485j14225b128A91222q1234c28800I0382h9375c568j02279b0612
$$ -30578 -71063 -185288 -2128 191222 109988 -328800 90382 -89375 -3568 -105847 -20612
10230e2835A4878J72331q9046a58670K2999e096k73321G4252O5410n0790L9419
$$ -52835 14878 187209 98163 -158670 -135671 -5096 -278417 74252 139662 88872 128291
10219A28291O7278R4937a50183k5174O0075k682J3264D135a19947L1258o1637
$$ 128291 195569 290506 -150183 -175357 -115282 -117964 -104700 4135 -119947 -88689 -150326
10208a50326j11539P6362j41058f4815k67588A75702c11060I5352O47C9364N6242
$$ -150326 -261865 -185503 -326561 -64815 -332403 175702 -311060 95352 95999 39364 95606
10197I5606l3750c07165B22232e5552I2903K10789j44794b38512d1708E2074c65927
$$ 95606 61856 -307165 222232 -55552 92903 303692 158898 -238512 -41708 52074 -365927
10185A29498e27941b0991B2550a4100j13202B01681a89721J6021P9201j1573I4533
$$ 129498 -527941 -20991 22550 -14100 -127302 201681 -189721 -173700 -94499 -106072 94533
10173A51999O5046o7655c34649J34220j2017e490p8058B46631E8627J09338b4096
$$ 151999 217045 149390 -334649 -200429 -212446 -5490 -83548 246631 58627 167965 -24096
10161d9783j85869C8403a28036j8975B29770c10478E8047R6166a83729N2502a3160
$$ -49783 -235652 38403 -128036 -147011 229770 -310478 58047 154213 -183729 -131227 -13160
10149A42587a13962A25552a94023J1367a4952D3679a94661A50073Q1874a42382
$$ 142587 -113962 125552 -194023 -182656 -14952 43679 -194661 150073 231947 -142382
10138h6069A21869d4004j45931Q6503D9477J04638K2206m0259b47692I6031J13383
$$ -86069 121869 -44004 -189935 -103432 49477 154115 176321 136062 -247692 96031 209414
10127B09414R8632c0470a2026A57283E2259L0747A2849g5278C9748b09626j18158
$$ 209414 308046 -30470 -12026 157283 52259 83006 12849 -75278 39748 -209626 -327784
10116c27784A9631J45734p7487b13299F4527B9260h1390p0004H3822a96148L8247
$$ -327784 19631 165365 87878 -213299 64527 29260 -81390 -151394 83822 -196148 -157901
10105a57901k75018a48015M7569E5754f8139r9994M501A43107a15137j83586J01054
$$ -157901 -432919 -148015 -100446 55754 -68139 -168133 -163632 143107 -115137 -298723 -197669
10094a97669l557r0141k6221a02347k44379R6075q8251A0965J01004g2179H5831
$$ -197669 -201226 -291367 -317588 -102347 -346726 -250651 -338902 10965 111969 -72179 85831
10082c81248a69848J5437c924j68038Q4809o9615l3933B42451f6925J36j44492
$$ -381248 -169848 -154411 -3924 -171962 -87153 -156768 -190701 242451 -66925 -66789 -211281
10071b11281E6848A753J4674J92661b75439a09248M9822K3096B37097A10975q551
$$ -211281 56848 1753 16427 209088 -275439 -109248 -59426 -36330 237097 110975 102424
10060A02424a25058p386O281k82040A51156o1741a60168d0276n2525E9575c8820
$$ 102424 -125058 -132444 -126163 -408203 151156 89415 -160168 -40276 -92801 59575 -38820
10048b3845l30771P2409P0054E8605j1053b90964J05717M1251p9803E2967n744
$$ -23845 -354616 -282207 -212153 58605 47552 -290964 -185247 -143996 -223799 52967 47223
10037D7223b53950h1912A11933b47010B17685H4519a54456A95348c55220A60010
$$ 47223 -253950 -81912 111933 -247010 217685 84519 -154456 195348 -355220 160010
10026c05641a02845j1086A0026J47934c4986F2052b62944n19D09077a82103a9402
$$ -305641 -102845 -113931 10026 157960 -34986 62052 -262944 -263463 409077 -182103 -19402
10014I7286f9953A10966J7856c01348I5295C1407K02915b6718I6249a22684E1045
$$ 97286 -69953 110966 128822 -301348 95295 31407 234322 -26718 96249 -122684 51045
10002A45300a16808r0462I8752a93553m1147A34658a3507l96912A2656K71077
$$ 145300 -116808 -207270 98752 -193553 -234700 134658 -13507 -410419 12656 283733
9992B83733a21645r567A29993a12905j22811f0000n3031k9049l6167A99571b08367
$$ 283733 -121645 -131212 129993 -112905 -235716 -60000 -113031 -142080 -178247 199571 -208367
9980a39458k047j92430h3178A04456M4938e2272I5626C9931i3106p4064g0767
$$ -139458 -141505 -333935 -83178 104456 149394 -52272 95626 39931 -93106 -167170 -70767
9968a01670p6312d8265j12497A30837B6106i0320G8370A2085b43182A43569d75055
$$ -101670 -177982 -48265 -160762 130837 26106 -90320 78370 12085 -243182 143569 -475055
9956F3485B6137a79147E4560f5713j15685B43622c71391a35711C7012b03049K5364
$$ 63485 26137 -179147 54560 -65713 -181398 243622 -371391 -135711 37012 -203049 -177685
9945a77685L3240K7121M3937j25987J39d6375C8398J74673e4580j94151o9503
$$ -177685 -144445 -117324 -73387 -199374 -199235 -46375 38398 213071 -54580 -248731 -318234
9934c18234J19051H897b27648J10724B17524I0240h1388N519e875l63203a68203
$$ -318234 -199183 8897 -227648 -116924 217524 90240 -81388 -75869 -5875 -369078 -168203
9922a40521H9678a48527n948b5913p1315k78354J3699c7080F2916a26664d7198
$$ -140521 89678 -148527 -154475 -25913 -97228 -375582 -361883 -37080 62916 -126664 -47198
9910I7996b79829a31790A60256a25161j45991A32563E7527R7751a23602F5765
$$ 97996 -279829 -131790 160256 -125161 -271152 132563 57527 155278 -123602 65765
9899E1734B052b50542A1592c51740c5064k48150A41077c29169A38499b7763M450
$$ 51734 2052 -250542 11592 -351740 -35064 -283214 141077 -329169 138499 -27763 -23313
9888b3313B83223a78620d3362j68956A99533q2034b49126N5330f6447A04963a74449
$$ -23313 283223 -178620 -43362 -212318 199533 117499 -249126 -193796 -66447 104963 -174449
9876a66845P0394j6279A49150d6310K2777k62923C8591a89235A54413n9386o037
$$ -166845 -96451 -112730 149150 -46310 -23533 -286456 38591 -189235 154413 95027 88990
9865H8990b77092K1789E7587b76404A33651J00445g5559K7195D8273n666K202
$$ 88990 -277092 -255303 57587 -276404 133651 234096 -75559 -48364 48273 42607 44809
9854D4809L3930J89517q9038J79945A30659L2943a67315j41681c1794l59328Q4958
$$ 44809 78739 268256 179218 359163 130659 163602 -167315 -308996 -31794 -391122 -306164
9843c06164R8024g3396E7753K15575A1324J43293o111p1200a35497A30833c3453
$$ -306164 -208140 -73396 57753 273328 11324 154617 148506 77306 -135497 130833 -33453
9831A55505l5559D675a70632P505A2378J07867A2457J07854a11352E3072K21875
$$ 155505 119946 4675 -170632 -163127 12378 120245 12457 120311 -111352 53072 274947
9820B74947I9019J36841A11201e6251k16430g9094A89495b1020I3285j6877a57787
$$ 274947 99019 235860 111201 -56251 -272681 -79094 189495 -21020 93285 76408 -157787
9808A35726b2233j8446r8539k6894j19058a31346q0286H7954C2476b03212A83049
$$ 135726 -22233 -40679 -139218 -166112 -285170 -131346 -211632 87954 32476 -203212 183049
9796g739r9144B21735I9921A6032a30298L961m0249A32365a25448N5893j76943
$$ -7739 -106883 221735 99921 16032 -130298 -126337 -166586 132365 -125448 -69555 -246498
9785b46498o8969K2193J39367A5923h5123B2923J0181e4882A57422a19382A49672
$$ -246498 -315467 -293274 -153907 15923 -85123 22923 33104 -54882 157422 -119382 149672
9773c6435D26673D7808a33316p9130b5024n5544A84397q6827a43754l0105Q1965
$$ -36435 426673 47808 -133316 -212446 -25024 -80568 184397 97570 -143754 -173859 -91894
9762i1894j5238j97457a07977B7137b86440A44569h9870A2798J08097a54146j34425
$$ -91894 -107132 -304589 -107977 27137 -286440 144569 -89870 12798 120895 -154146 -288571
9751b88571G0740b56714d2770k82465a18441o3439A31197b1707E726g2469B8596
$$ -288571 70740 -256714 -42770 -325235 -118441 -181880 131197 -21707 5726 -72469 28596
9739G0137a46342C2974b23073c2338C4776a67003j33863B27750a41986j33118
$$ 70137 -146342 32974 -223073 -32338 34776 -167003 -300866 227750 -141986 -275104
9729b75104i0823j62612a06249c9422j20243B0086d49643D7512f6832k69811h0748
$$ -275104 -90823 -253435 -106249 -39422 -159665 20086 -449643 47512 -66832 -336643 -80748
9717c2745D15706a58294e8279j02483N4656q2509N2959G856a93184f7218A00762
$$ -32745 415706 -158294 -58279 -160762 -106106 -188615 -135656 7856 -193184 -67218 100762
9705e1052q4602L062K6575K9831A46963i439B08521H1188b32244b8784O704k06901
$$ -51052 -135654 -132592 -106017 -76186 146963 -9439 208521 81188 -232244 -28784 -22080 -228981
9693b28981b9137r4472k50638a41894B81206m1425C3711a19333e0338I9821a86543
$$ -228981 -29137 -123609 -374247 -141894 281206 239781 33711 -119333 -50338 99821 -186543
9681h3212D2035j901a86107I0354b14099R5122A8589b53719f4091E8498k0538
$$ -83212 42035 40134 -186107 90354 -214099 -118977 18589 -253719 -64091 58498 37960
9670C7960h1818o7574A9708b41429A10671a81596C50196a35202l07036A55761
$$ 37960 -81818 -149392 19708 -241429 110671 -181596 350196 -135202 -442238 155761
9659c9384n2941J8365k32284a8216j97219j49314C09213b52218P5019L7327J6836
$$ -39384 -92325 -73960 -306244 -18216 -215435 -364749 309213 -252218 -177199 -139872 -123036
9648a23036C3185N2592b91786J13731l2351A53656d8170j23126f1609B92698a14322
$$ -123036 33185 85777 -291786 -178055 -210406 153656 -48170 -171296 -61609 292698 -114322
9636B99701a3880j26685N9710a7377j47996A6361c33216L7456i9350A19805E2984
$$ 299701 -13880 -140565 -80855 -17377 -165373 16361 -333216 -295760 -99350 119805 52984
9624A16152f6000C3112j2382a23977K3049A18853b71087J7517D2934J40368E8564
$$ 116152 -66000 33112 20730 -123977 -100928 118853 -271087 -253570 42934 183302 58564
9612c58787J01840C7713a2409l22576g6448A9772a26993e4956G7384a51950p0410
$$ -358787 -256947 37713 -12409 -334985 -76448 19772 -126993 -54956 77384 -151950 -222360
9601b22360M4290l191M9186A42997a13404e1344k90657L4325b699q2364j40169
$$ -222360 -178070 -181261 -132075 142997 -113404 -51344 -342001 -307676 -2699 -85063 -225232
9590b25232j57669B84977c09235L6672P7162j11976a31609a1883k11570R3501
$$ -225232 -382901 284977 -309235 -272563 -195401 -307377 -131609 -11883 -223453 -129952
9580a29952j03222L9567a1394I5625c66026B1358d9482G279J256d10172b00356
$$ -129952 -233174 -193607 -11394 95625 -366026 21358 -49482 7279 8535 -410172 -200356
9568b25773q7106A62848q1284b74k01493A37031k4417b03765A42754B7866O899
$$ -225773 -312879 162848 81564 -274 -201767 137031 112614 -203765 142754 27866 34765
9557C4765A603N6450g9353C1739a50074A68908f4066J4280A20988d37739C92799
$$ 34765 1603 58053 -79353 31739 -150074 168908 -64066 -49786 120988 -437739 392799
9545a55914A78188b51148e6701A43644D5555L6828a91911f3043j42570A02254
$$ -155914 178188 -251148 -56701 143644 45555 82383 -191911 -63043 -205613 102254
9534b33831B5843b04909A21070a37795c8254l18955H4263b0319l2107E0149A5962
$$ -233831 25843 -204909 121070 -137795 -38254 -357209 84263 -20319 -52426 50149 15962
9522D8896b19989Q4017m36065a00358c0799D8488b634q210j51071k0521n5854
$$ 48896 -219989 -135972 -572037 -100358 -30799 48488 -2634 -10844 -161915 -182436 -238290
9511b38290G7963j4833c00148g9073A09964b96290J20958M9857B09266L7898j2410
$$ -238290 77963 63130 -300148 -79073 109964 -296290 -175332 -125475 209266 247164 234754
9500B34754a98568H9635B3865J30417e9504m4320K9883C11174c44494a71968B15620
$$ 234754 -198568 89635 23865 154282 -59504 -103824 -73941 311174 -344494 -171968 215620
9488A1420b19958A05964A8249b05920R9922D8796f8815j34696D4842a3564C81152
$$ 11420 -219958 105964 18249 -205920 -105998 48796 -68815 -203511 44842 -13564 381152
9476A83447i2135a4781A08231J14356B0006D6a60742l0780L9262A60831i3104
$$ 183447 -92135 -14781 108231 222587 20006 46 -160742 -191522 -152260 160831 -93104
9464b41038L5952K4170j407b448j88596A33642r300a23927K6194B5679R671l838
$$ -241038 -205086 -180916 -182323 -2448 -191044 133642 124342 -123927 -97733 25679 35350 31512
9452C1512c12000J5099B13842g3137a7274A26547b13744a0385p5840j03646c4971
$$ 31512 -312000 -296901 213842 -73137 -17274 126547 -213744 -10385 -86225 -189871 -34971
9440b61955a09433j08759A2042a48262P2550A44378b49395H0407J34833c067I1798
$$ -261955 -109433 -218192 12042 -148262 -75712 144378 -249395 80407 215240 -3067 91798
9428B20235E4115C744L0508P7099m147a54238K3968m4339A86158k1943c2059j84590
$$ 220235 54115 3744 34252 111351 107204 -154238 -130270 -174609 186158 164215 -32059 -216649
9416b16649g1123A29080m0300b29790i4318D7753f1939j54108g4314L5738C9287
$$ -216649 -71123 129080 88780 -229790 -94318 47753 -61939 -216047 -74314 -38576 39287
9404D81762E6859J4311J12136j0860M3219a66814E875J23120C6826J27629a57903
$$ 481762 56859 71170 183306 172446 215665 -166814 5875 128995 36826 164455 -157903
9392a49165L2802L4034l4646A20230b19442D3116b14817A49388J92035e3653A29176
$$ -149165 -116363 -82329 -116975 120230 -219442 43116 -214817 149388 341423 -53653 129176
9380a49470a7187j53922o9135j78009a19271d6454j47659e4218H3248R0590q1346
$$ -149470 -17187 -171109 -240244 -418253 -119271 -46454 -194113 -54218 83248 173838 92492
9369I2492b24221M7692n9724A76229g1097o439j33851P7779j8020n9387B31750
$$ 92492 -224221 -176529 -236253 176229 -71097 -77536 -211387 -133608 -151628 -211015 231750
9357E6571N7172b8935j44429c0760j46541B6138a86158j2549D156a35115O0401
$$ 56571 113743 -28935 -173364 -30760 -177301 26138 -186158 -198707 4156 -135115 -74714
9346g4714K4195A68871a46499O9353j69367d6010m6288j13389B18515g22l6425
$$ -74714 -50519 168871 -146499 -77146 -246513 -46010 -92298 -205687 218515 -722 -37147
9335c7147k12344L7820p8149a17187K9248K4905j81696C6694a53599e6283q8275
$$ -37147 -249491 -211671 -289820 -117187 -87939 -63034 -244730 36694 -153599 -56283 -144558
9324a44558A13954a25746j16122R4444f0972I0455c96634L3568A18474g6350G0987
$$ -144558 113954 -125746 -241868 -147424 -60972 90455 -396634 -363066 118474 -76350 70987
9312C52294i7755c0505k40051k3630a02213k38939a0094A82690J93302b02775
$$ 352294 -97755 -30505 -270556 -294186 -102213 -341152 -10094 182690 375992 -202775
9301e563G3623b27471N7410N2873L0980d0748j79638j78107C0621b84446N8672
$$ -5563 73623 -227471 -170061 -117188 -86208 -40748 -220386 -398493 30621 -284446 -225774
9290b25774i3108a9422j5729A76812G0959b8458i026j69971A3588R4861O1320
$$ -225774 -93108 -19422 -35151 176812 70959 -28458 -9026 -178997 13588 108449 169769
9279A69769E4282E278K2390e20240D1911a65112A53235f6001A95629a1117E3970
$$ 169769 54282 5278 27668 -520240 41911 -165112 153235 -66001 195629 -11117 53970
9267c67864d5859l8782b3196k71787G9520b98763B5215g0668o495H4740c39141
$$ -367864 -45859 -84641 -23196 -294983 79520 -298763 25215 -70668 -77163 84740 -339141
9255a8025B35662h4274j56270f8697F5350Q8895A7666J54904b7489Q228j0881
$$ -18025 235662 -84274 -240544 -68697 65350 154245 17666 172570 -27489 -19261 -30142
9244c0142D3155M5059D3192a62160A74393e21663J76743A18188b46750n776E7421
$$ -30142 43155 88214 43192 -162160 174393 -521663 -344920 118188 -246750 -252526 57421
9232A9257a62133P4291L6260B55772a12558o2899A20822J7352a98970B40823b31995
$$ 19257 -162133 -87842 -51582 255772 -112558 -175457 120822 138174 -198970 240823 -231995
9220I7391M954L3993e6673k3357n4226E7091K65477i3735q8965h1836m653j3641
$$ 97391 102345 136338 -56673 -80030 -134256 57091 322568 -93735 -182700 -81836 -86489 -100130
9208a00130L1359j27307R226p894A5031b7503n1982j32637O5599A11045c98389
$$ -100130 -68771 -196078 -186852 -194746 15031 -27503 -79485 -212122 -146523 111045 -398389
9196e7832k01387a09205b5543j33829A67926q0437R4947c57861g4819b0810m91125
$$ -57832 -259219 -109205 -25543 -159372 167926 87489 182436 -357861 -74819 -20810 -511935
9185e11935A9749a02519A96714r6608B8573J34161J0773c0516o7504B18957b56179
$$ -511935 19749 -102519 196714 100106 28573 162734 173507 -30516 -98020 218957 -256179
9173g6303o2222C6155L82863B2333O5705d6977B17412e8586A7434a70736B10786
$$ -76303 -138525 36155 419018 22333 88038 -46977 217412 -58586 17434 -170736 210786
9161C01871a36289A30408b39663A1697f2639B317b69495e2775b3120j29648C5706
$$ 301871 -136289 130408 -239663 11697 -62639 2317 -269495 -52775 -23120 -152768 35706
9149i42A23986k0814a87889Q8647j14818d5581p2433j15011l77204b45623k30040
$$ -942 123986 103172 -187889 -99242 -214060 -45581 -118014 -233025 -610229 -245623 -475663
9138d75663A40355b0995I2541A578a02940A19884a77645I9460m8417j5449L39900
$$ -475663 140355 -20995 92541 1578 -102940 119884 -177645 99460 51043 35594 375494
9127C75494A69392h2386D961O9499g8796l2321j05674R4904J9156E391K53712
$$ 375494 169392 -82386 4961 74460 -78796 -111117 -216791 -121887 -102731 5391 259103
9116B59103a67331e3773k53560J43089k97537A53544b2467k03642A74677P7769
$$ 259103 -167331 -53773 -307333 -164244 -461781 153544 -22467 -226109 174677 252446
9106B52446e9281A97681e4646B11554a71139P331J3215C8855P6670f1900j20226
$$ 252446 -59281 197681 -54646 211554 -171139 -163808 -150593 38855 115525 -61900 -182126
9095a82126L9019j68897J34171B7109a56805B05296E8796J95347b45212C8858
$$ -182126 -143107 -312004 -177833 27109 -156805 205296 58796 254143 -245212 38858
9084a18355p6857F4823J35147d2652J7898l55973C421f1764b617m05813a86359
$$ -118355 -195212 64823 199970 -42652 -24754 -380727 3421 -61764 -2617 -408430 -186359
9072b68315C1816b853j47651m4209C5649a82921r0675h9981b8056q7776a4873
$$ -268315 31816 -2853 -150504 -194713 35649 -182921 -273596 -89981 -28056 -115832 -14873
9060i5021l9440B9611K43357j18117I487b51133c6025R293j46212B43873n4746
$$ -95021 -134461 29611 272968 154851 9487 -251133 -36025 -26732 -172944 243873 189127
9049A89127f5972j44758A8665K20704d5661k58010a31171A16458e4207j03107
$$ 189127 -65972 -210730 18665 239369 -45661 -303671 -131171 116458 -54207 -157314
9039a57314r0906M733A31569d2982A14641a80935h9046j21263n5216N8493r0247
$$ -157314 -248220 -243487 131569 -42982 114641 -180935 -89046 -210309 -265525 -207032 -297279
9028b97279I3201l3823c09900a00751B35267h0617A20516L5152f1829K173k00694
$$ -297279 93201 59378 -309900 -100751 235267 -80617 120516 155668 -61829 -59656 -260350
9017b60350q7632B25697K19915b02710A51993e4721n9268n836j09442l818C2008
$$ -260350 -347982 225697 445612 -202710 151993 -54721 -113989 -119825 -229267 -233085 32008
9005C7294K39293b5122H7052g4902m2469e2187n8189k00058j75985B97145D7141
$$ 37294 276587 -25122 87052 -74902 -117371 -52187 -110376 -310434 -486419 297145 47141
8993A32314a14610n7831N8355B36164H3110c74388A96121E1731c9360q6278f2075
$$ 132314 -114610 -172441 -114086 236164 83110 -374388 196121 51731 -39360 -125638 -62075
8981h9832F8096B0691c18703i7091j79619J31378p8775B2296J99713b36164J10058
$$ -89832 68096 20691 -318703 -97091 -276710 -145332 -224107 22296 222009 -236164 -126106
8970a26106E2020L50644C1079a88084F7416o678f0518B9929b24416A85119Q5883
$$ -126106 52020 402664 31079 -188084 67416 60738 -60518 29929 -224416 185119 271002
8959B71002F129b7001l571I587m575J28900g3072B21523A02261O9333b80042K275
$$ 271002 6129 -27001 -30572 9587 5012 133912 -73072 221523 102261 171594 -280042 -277767
8947b77767f0884j14950C1829a22462N4633A59388a00880I5463C3114J81192f0707
$$ -277767 -60884 -175834 31829 -122462 -67829 159388 -100880 95463 33114 214306 -60707
8935d0358B16935k3724B6881h0815F9433b24289a07324A19233G248N82573k24622
$$ -40358 216935 193211 26881 -80815 69433 -224289 -107324 119233 7248 589821 365199
8924C65199r5646J120276M160052L801049B911271I93354B71697f123A00082J54573
$$ 365199 269553 1389829 5549881 9350930 2911271 993354 271697 -6123 100082 254655
8914B54655C7256a08639C22247i4073d1241q0077C80940A61982b24778h2720j63504
$$ 254655 37256 -108639 322247 -94073 -41241 -121318 380940 161982 -224778 -82720 -246224
8903b46224G2593J2565L9521a90109h837B30808A13647R406a75164E7117a87022
$$ -246224 72593 85158 124679 -190109 -8837 230808 113647 123053 -175164 57117 -187022
8891A08967e5325j9803j2135A82475h6829E644a18506I4171a25444B02543I1107
$$ 108967 -55325 -75128 -87263 182475 -86829 5644 -118506 94171 -125444 202543 91107
8879g2761B34355D278J23907m3843j894O695a21696G6886b3830k0852B83169C769
$$ -72761 234355 4278 128185 84342 82448 89143 -121696 76886 -23830 -44682 283169 3769
8866b25934Q4523A63538q761b41532D9591d59387K19106e2939m1837c3897j29932
$$ -225934 -141411 163538 154777 -241532 49591 -459387 -240281 -52939 -94776 -33897 -163829
$$ [...]
##END NTUPLES=NMR SPECTRUM
##END=
