##TITLE=AC1406_BRAA12215_7653149_5PJ1xK5njd
##JCAMPDX= 6.0         $$ Bruker NMR JCAMP-DX V2.0
##DATA TYPE= NMR SPECTRUM
##DATA CLASS= NTUPLES
##ORIGIN= BRUKER
##OWNER= Administrator
$$ 1.72 TOPSPIN		Version 2.1
$$ 2013-04-11 15:36:06.353 -0700  Administrator@X
$$ Compression mode = diff/dup
##.OBSERVE FREQUENCY= 400.02188249412
##.OBSERVE NUCLEUS= ^1H
##.ACQUISITION MODE= SIMULTANEOUS (DQD)
##.ACQUISITION SCHEME= undefined
##.AVERAGES= 64
##.DIGITISER RES= 22
##SPECTROMETER/DATA SYSTEM= spect
##.PULSE SEQUENCE= noesygpps1d.comp
##.SOLVENT NAME= COFFEE_meoh
##.SHIFT REFERENCE= INTERNAL, COFFEE_meoh, 1, 14.96101
##AUDIT TRAIL= $$ (NUMBER, WHEN, WHO, WHERE, PROCESS, VERSION, WHAT)
$$ ##TITLE= Audit trail, TOPSPIN		Version 2.1
$$ ##JCAMPDX= 5.01
$$ ##ORIGIN= Bruker BioSpin GmbH
$$ ##OWNER= Administrator
$$ $$ E:\/data/COFFEE/nmr/AC1406_BRAA12215_7653149_5PJ1xK5njd/32/pdata/1/auditp.txt
$$ ##AUDIT TRAIL=  $$ (NUMBER, WHEN, WHO, WHERE, PROCESS, VERSION, WHAT)
(   1,<2013-04-11 15:35:55.610 -0700>,<Administrator>,<X>,<go>,<TOPSPIN 2.1>,
      <created by zg
	started at 2013-04-11 15:24:25.662 -0700,
	POWCHK enabled, PULCHK disabled,
       configuration hash MD5:
       33 CF 6A 21 5C D3 B9 40 6C 15 AA 8D 27 A2 4F 13
       data hash MD5: 64K
       1A EC D3 2A 89 22 C4 8D 39 4E 1F 08 8B 8C 0E 31>)
(   2,<2013-04-11 15:36:00.798 -0700>,<Administrator>,<X>,<proc1d>,<TOPSPIN 2.1>,
      <Start of raw data processing
       efp LB = 0.3 FT_mod = 6 PKNL = 1 PHC0 = 0 PHC1 = 0 SI = 128K 
       data hash MD5: 128K
       FA 93 F4 DD 80 B1 BF 2C 08 0C 7B 86 23 39 E7 A5>)
(   3,<2013-04-11 15:36:02.348 -0700>,<Administrator>,<X>,<proc1d>,<TOPSPIN 2.1>,
      <pk PHC0 = -77.948 PHC1 = 0 
       data hash MD5: 128K
       14 7C 83 AE 88 7B 0F C0 5D 04 7E E8 99 C7 4E 9D>)
(   4,<2013-04-11 15:36:04.838 -0700>,<Administrator>,<X>,<proc1d>,<TOPSPIN 2.1>,
      <abs ABSG = 1 
       data hash MD5: 128K
       14 24 36 F9 E2 E7 AC 0D DE 40 91 F9 32 12 4A 9D>)
(   5,<2013-04-11 15:36:05.041 -0700>,<Administrator>,<X>,<proc1d>,<TOPSPIN 2.1>,
      <abs ABSG = 2 
       data hash MD5: 128K
       5D 1D 4A 16 6B 54 E2 97 25 45 06 6D 06 C9 B8 23>)
(   6,<2013-04-11 15:36:05.400 -0700>,<Administrator>,<X>,<proc1d>,<TOPSPIN 2.1>,
      <abs ABSG = 3 
       data hash MD5: 128K
       74 C8 4D B9 15 D4 DD 0B 45 B6 AE 78 FB 6E 7A 93>)
(   7,<2013-04-11 15:36:05.697 -0700>,<Administrator>,<X>,<proc1d>,<TOPSPIN 2.1>,
      <abs ABSG = 4 
       data hash MD5: 128K
       B1 91 58 39 55 35 A6 9F 18 2E 45 E2 F8 77 53 55>)
(   8,<2013-04-11 15:36:05.900 -0700>,<Administrator>,<X>,<proc1d>,<TOPSPIN 2.1>,
      <abs ABSG = 5 
       data hash MD5: 128K
       AD 1C 2E B8 24 AA 47 30 4A E7 65 7D 6F E6 67 AE>)
$$ ##END=
$$ 
$$ $$ hash MD5
$$ $$ CE 23 E9 99 A1 AA 38 6B FA 9B DE 4B 33 8F C0 E2
##$RELAX= 
##$RELAX= 
##$RELAX= 
##$RELAX= 
##$RELAX= 
##$RELAX= 
##$RELAX= 
##$RELAX= 
$$ Bruker specific parameters
$$ --------------------------
##$DU= <E:\>
##$EXPNO= 32
$$ [...]
##$TP07= 0
##$TPNAME0= <>
##$TPNAME1= <>
##$TPNAME2= <>
##$TPNAME3= <>
##$TPNAME4= <>
##$TPNAME5= <>
##$TPNAME6= <>
##$TPNAME7= <>
##$TPOAL= (0..7)
0.5 0.5 0.5 0.5 0.5 0.5 0.5 0.5
##$TPOFFS= (0..7)
0 0 0 0 0 0 0 0
##$TUNHIN= 0
##$TUNHOUT= 0
##$TUNXOUT= 0
##$USERA1= <user>
##$USERA2= <user>
##$USERA3= <user>
##$USERA4= <user>
##$USERA5= <user>
##$V9= 5
##$VALIST= <valist>
##$VCLIST= <CCCCCCCCCCCCCCC>
##$VD= 0
##$VDLIST= <DDDDDDDDDDDDDDD>
##$VPLIST= <PPPPPPPPPPPPPPP>
##$VTLIST= <TTTTTTTTTTTTTTT>
##$WBST= 2048
##$WBSW= 25
##$XGAIN= (0..3)
0 0 0 0
##$XL= 0
##$YL= 0
##$YMAX_a= 6115770
##$YMIN_a= -13195381
##$ZGOPTNS= <>
##$ZL1= 120
##$ZL2= 120
##$ZL3= 120
##$ZL4= 120
##$ABSF1= 14.96101
##$ABSF2= -5.597172
##$ABSG= 5
##$ABSL= 3
##$ALPHA= 0
##$AQORDER= 0
##$ASSFAC= 0
##$ASSFACI= 0
##$ASSFACX= 0
##$ASSWID= 0
##$AUNMP= <proc_prof1d_extract.lims>
##$AXLEFT= 0
##$AXNAME= <>
##$AXNUC= <1H>
##$AXRIGHT= 0
##$AXTYPE= 0
##$AXUNIT= <>
##$AZFE= 0.1
##$AZFW= 0.1
##$BCFW= 0
##$BC_mod= 0
##$BYTORDP= 0
##$COROFFS= 0
##$CY= 15
##$DATMOD= 1
##$DC= 0
##$DFILT= <>
##$DTYPP= 0
##$F1P= 0
##$F2P= 0
##$FCOR= 0.5
##$FTSIZE= 131072
##$FT_mod= 6
##$GAMMA= 0
##$GB= 0
##$INTBC= 1
##$INTSCL= 1
##$ISEN= 128
##$LB= 0.3
##$LEV0= 0
##$LPBIN= 0
##$MAXI= 10000
##$MC2= 0
##$MEAN= 0
##$ME_mod= 0
##$MI= 0
##$NCOEF= 0
##$NC_proc= -2
##$NLEV= 6
##$NOISF1= 0
##$NOISF2= 0
##$NSP= 0
##$NTH_PI= 0
##$NZP= 0
##$OFFSET= 14.96101
##$PC= 1
##$PHC0= -77.948
##$PHC1= 0
##$PH_mod= 1
##$PKNL= yes
##$PPARMOD= 0
##$PPDIAG= 0
##$PPIPTYP= 0
##$PPMPNUM= 2147483647
##$PPRESOL= 1
##$PSCAL= 4
##$PSIGN= 0
##$PYNMP= <proc.py>
##$REVERSE= no
##$SF= 400.020009633793
##$SI= 131072
##$SIGF1= 0
##$SIGF2= 0
##$SINO= 400
##$SIOLD= 131072
##$SPECTYP= <>
##$SREGLST= <1H.CDCl3>
##$SSB= 0
##$STSI= 131072
##$STSR= 0
##$SW_p= 8223.68421052631
##$SYMM= 0
##$S_DEV= 0
##$TDeff= 65536
##$TDoff= 0
##$TI= <>
##$TILT= no
##$TM1= 0
##$TM2= 0
##$TOPLEV= 0
##$USERP1= <user>
##$USERP2= <user>
##$USERP3= <user>
##$USERP4= <user>
##$USERP5= <user>
##$WDW= 1
##$XDIM= 131072
##$YMAX_p= 457710548
##$YMIN_p= -103960
##$CURPLOT= <Network HP LaserJet P1505>
##$CURPRIN= <$Network HP LaserJet P1505>
##$DFORMAT= <normdp>
##$LAYOUT= <+/1D_H.xwp>
##$LFORMAT= <normlp>
##$PFORMAT= <normpl>
##$SURQMSG= 1
$$ End of Bruker specific parameters
$$ ---------------------------------
##NTUPLES= NMR SPECTRUM
##VAR_NAME=  FREQUENCY,     SPECTRUM/REAL,   SPECTRUM/IMAG
##SYMBOL=    X,             R,               I
##VAR_TYPE=  INDEPENDENT,   DEPENDENT,       DEPENDENT
##VAR_FORM=  AFFN,          ASDF,            ASDF
##VAR_DIM=   131072,        131072,          131072
##UNITS=     HZ,            ARBITRARY UNITS, ARBITRARY UNITS
##FACTOR=    0.0627417313425164, 1,          1
##FIRST=     8223.62146879497, 3076,         -56606
##LAST=      0,             4390,            -56638
##MIN=       0,             -103960,         0
##MAX=       8223.62146879497, 457710548,    0
$$ Real data points
##PAGE= N=1
##DATA TABLE= (X++(R..R)), XYDATA
$$ [...]
$$ plain form
63881 663496 658513 655419 654361 655784 659991 666802 675920 687613 702646 721385 743404 768274 796368
63868 796368 828380 864214 902863 943374 985434 1028932 1073548 1118976 1165067 1211321 1256594
63857 1256594 1299749 1340377 1378386 1413005 1442647 1465743 1481326 1488879 1488172 1479424 1463268 1440336
63845 1440336 1411144 1376548 1337974 1296868 1253960 1209197 1162333 1113545 1063636 1013717 964584
63834 964584 916408 869173 823288 779464 738025 698862 662160 628550 598221 570410 544347
63823 544347 520368 499431 481696 466214 452002 438771 426492 414926 403973 394004 385387 377949
63811 377949 371274 365288 360128 355583 351144 346638 342396 338701 335399 332239 329312 326808 324492 321724
63797 321724 318079 313793 309545 305910 303040 300723 298654 296710 295053 293882 293009 291778 289590 286534
$$ packed form
63881F63496m983l094j058J423M207O811R118J1693J5033J8739K2019K4870K8094
63868G96368L2012L5834L8649M0511M2060M3498M4616M5428M6091M6254M5273
63857A256594M3155M0628L8009L4619K9642K3096J5583P553p07q748j6156k2932
63845A440336k9192l4596l8574m1106m2908m4763m6864m8788m9909m9919m9133
63834I64584m8176m7235m5885m3824m1439l9163l6702l3610l0329k7811k6063
63823E44347k3979k0937j7735j5482j4212j3231j2279j1566j0953r969q617p438
63811C77949o675n986n160m545m439m506m242l695l302l160k927k504k316k768
63797C21724l645m286m248l635k870k317k069j944j657j171q73j231k188l056
$$ plain form
63783 286534 283391 280964 279441 278355 277016 274988 272342 269635 267552 266403 265949 265783 265785 266042 266335 266080
63767 266080 264964 263505 262586 262395 262133 261000 259252 257936 257638 257952 258226 258388 258674 258904 258558 257543 256413
63750 256413 255742 255589 255673 255753 255710 255588 255681 256348 257510 258635 259475 260543 262536 265442 268580 271411 273935
63733 273935 276299 278488 280533 282708 285293 288261 291399 294633 298088 301876 305907 309905 313666 317367
63719 317367 321539 326529 331983 337088 341355 344963 348224 351019 352950 353805 353621 352432 350328 347746 345379
63704 345379 343633 342347 341115 339738 338363 337326 336961 337423 338619 340401 342790 345823 349172 352273 355018
63689 355018 358053 362042 366779 371341 375053 377897 379972 381019 380761 379453 377748 376073 374368 372435
63675 372435 370344 368440 367110 366581 366880 367905 369440 371111 372443 373210 373733 374554 375667 376358 376050 375077
$$ packed form
63783B86534l143k427j523j086j339k028k646k707k083j149m54j66KK57K93k55
63767B66080j116j459r19j91k62j133j748j316k98L14K74J62K86K30l46j015j130
63750B56413o71j53Q4Q0m3j22R3O67J162J125Q40J068J993K906L138K831K524
63733B73935K364K189K045K175K585K968L138L234L455L788M031L998L761L701
63719C17367M172M990N454N105M267L608L261K795J931Q55j84j189k104k582k367
63704C45379j746j286j232j377j375j037l65M62J196J782K389L033L349L101K745
63689C55018L035L989M737M562L712K844K075J047k58j308j705j675j705j933
63675C72435k091j904j330n29K99J025J535J671J332P67N23Q21J113O91l08r73
$$ plain form
63659 375077 374186 373410 371974 369441 366368 363470 360540 356794 352134 347412 343315 339630 335937 332596 330433
63644 330433 329577 329229 328693 328199 328477 329863 332124 334925 338096 341540 345219 349310 354061 359491 365356
63629 365356 371428 377600 383737 389705 395662 402137 409698 418626 428920 440427 452910 466212 480506
63616 480506 496278 513925 533457 554645 577342 601622 627716 655878 686147 718207 751590
63605 751590 785991 821086 855886 888503 916796 939194 954913 963754 965994 962428 954314 943292
63593 943292 931286 920051 910385 901780 892965 882739 870258 854886 836220 814308 789705 763311
63581 763311 736172 709270 683332 658978 636946 617863 601665 587618 575201 564693 556666 551253
63569 551253 548227 547436 548684 551388 554813 558579 562692 567295 572720 579454 587579 596419 605222 614048
$$ packed form
63659C75077q91p76j436k533l073k898k930l746m660m722m097l685l693l341k163
63644C30433q56l48n36m94K78J386K261K801L171L444L679M091M751N430N865
63629C65356O072O172O137N968N957O475P561Q928J0294J1507J2483J3302J4294
63616D80506J5772J7647J9532K1188K2697K4280K6094K8162L0269L2060L3383
63605G51590L4401L5095L4800L2617K8293K2398J5719Q841K240l566q114j1022
63593I43292j2006j1235r666q605q815j0226j2481j5372j8666k1912k4603k6394
63581G63311k7139k6902k5938k4354k2032j9083j6198j4047j2417j0508q027n413
63569E51253l026p91J248K704L425L766M113M603N425O734Q125Q840Q803Q826
$$ plain form
63555 614048 623635 634644 647523 662784 680756 701297 724495 751546 784217 823498 869400 921642
63543 921642 979025 1037635 1090742 1131573 1156296 1164664 1158966 1143077 1121620 1098699 1076965 1057833
63531 1057833 1042022 1029477 1019247 1010114 1001194 991554 979547 963139 940945 912748 879324 842164
63519 842164 803223 764439 727250 692405 659960 629427 600424 573401 549318 528414 509799
63508 509799 492647 477194 464001 452682 442149 431965 422757 415268 409530 405018 401168 397664 394515
63495 394515 391955 390082 388700 387658 387076 386916 386586 385463 383667 381887 380548 379641 379282 379836 381371 383482
63479 383482 385900 388903 392856 397585 402490 407167 411680 416205 420523 424032 426270 427357 427694 427297 425671
63464 425671 422472 418048 413173 408413 403893 399493 395138 391030 387693 385601 384781 385051 386531 389354 392826
$$ packed form
63555F14048R587J1009J2879J5261J7972K0541K3198K7051L2671L9281M5902N2242
63543I21642N7383N8610N3107M0831K4723Q368n698j5889k1457k2921k1734j9132
63531A057833j5811j2545j0230r133q920r640j2007j6408k2194k8197l3424l7160
63519H42164l8941l8784l7189l4845l2445l0533k9003k7023k4083k0904j8615
63508E09799j7152j5453j3193j1319j0533j0184r208p489n738m512l850l504l149
63495C94515k560j873j382j042n82j60l30j123j796j780j339r07l59N54J535K111
63479C83482K418L003L953M729M905M677M513M525M318L509K238J087L37l97j626
63464D25671l199m424m875m760m520m400m355m108l337k092q20K70J480K823L472
$$ plain form
63449 392826 395663 397487 399491 403147 408821 416131 425015 435568 447323 459693 473019 488367 506410
63436 506410 527359 551989 581856 618197 660965 708617 757903 803811 840945 865944 878701
63425 878701 881503 877675 870943 864900 862065 863577 869958 881808 899533 923048 952116 986519 1025324
63412 1025324 1066233 1106092 1141895 1171203 1192204 1204110 1207463 1203668 1194286 1181000 1165946 1151359
63400 1151359 1138537 1127167 1115689 1102240 1085390 1064232 1038134 1006767 970603 931239 890866
63389 890866 851274 813428 777807 744726 714302 686517 661434 639149 619543 602437 588005
63378 588005 576584 568011 561593 556910 554211 553769 555337 558543 563497 570552 579698 590574 602961 616981
63364 616981 632911 651025 671524 694425 719641 747268 777608 810742 846323 883967 923643
$$ packed form
63449C92826K837J824K004L656N674P310Q884J0553J1755J2370J3326J5348J8043
63436E06410K0949K4630K9867L6341M2768M7652M9286M5908L7134K4999J2757
63425H78701K802l828o732o043k835J512O381J1850J7725K3515K9068L4403L8805
63412A025324M0909L9859L5803K9308K1001J1906L353l795r382j3286j5054j4587
63400A151359j2822j1370j1478j3449j6850k1158k6098l1367l6164l9364m0373
63389H90866l9592l7846l5621l3081l0424k7785k5083k2285j9606j7106j4432
63378E88005j1421q573o418m683k699m42J568L206M954P055R146J0876J2387J4020
63364F16981J5930J8114K0499K2901K5216K7627L0340L3134L5581L7644L9676
$$ plain form
63353 923643 965372 1008570 1051687 1092258 1127291 1154172 1171743 1180535 1181840 1176838 1166799 1153614
63341 1153614 1139446 1125769 1113017 1101015 1089252 1076672 1061651 1042614 1018735 990149 957695
63330 957695 922569 886064 849373 813421 778896 746547 717585 693546 675511 663591 657466 657165
63318 657165 662541 671589 679801 681903 674586 657862 634337 607483 580070 553455 528049 504417
63306 504417 483652 466528 452628 440822 430496 421873 415138 409728 404675 399410 394063 389117 384875
63293 384875 381106 377169 372574 367535 362880 359310 356769 354576 352140 349475 347023 345128 343853 343241
63279 343241 343350 343824 343777 342601 340789 339512 339328 339770 340244 340780 341594 342403 342649 342230 341635 341457 341985 343125
63261 343125 344494 345750 347003 348766 351334 354504 358018 361930 366228 370496 374387 378175 382304 386592
$$ packed form
63353I23643M1729M3198M3117M0571L5033K6881J7571Q792J305n002j0039j3185
63341A153614j4168j3677j2752j2002j1763j2580j5021j9037k3879k8586l2454
63330I57695l5126l6505l6691l5952l4525l2349k8962k4039j8035j1920o125l01
63318F57165N376R048Q212K102p317j6724k3525k6854k7413k6615k5406k3632
63306E04417k0765j7124j3900j1806j0326q623o735n410n053n265n347m946m242
63293C84875l769l937m595n039m655l570k541k193k436k665k452j895j275o12
63279C43241J09M74m7j176j812j277j84M42M74N36Q14Q09K46m19n95j78N28J140
63261C43125J369J256J253J763K568L170L514L912M298M268L891L788M129M288
$$ plain form
63247 386592 390488 394094 398319 403862 410453 417329 424168 431323 439361 448563 458848 470032 482150
63234 482150 495369 509561 524225 539076 554549 571326 589469 608416 627766 647532 667481
63223 667481 686772 704679 721453 738122 755528 773795 792668 812004 831823 852064 872415
63212 872415 892268 910715 926624 938960 947152 951091 950654 945423 935102 920166 901748 880792
63200 880792 857585 832335 805899 779612 754564 731346 710394 692177 676992 664849 655634 649184
63188 649184 645241 643618 644563 648696 656339 666967 679468 693034 707715 724043 742061 760865 779265
63175 779265 796943 814653 833158 852212 870860 888540 905484 922110 938420 954115 968866
63164 968866 982100 992710 999336 1001049 997679 989482 976654 959203 937170 910921 881303 849622
$$ packed form
63247C86592L896L606M225N543O591O876O839P155Q038R202J0285J1184J2118
63234D82150J3219J4192J4664J4851J5473J6777J8143J8947J9350J9766J9949
63223F67481J9291J7907J6774J6669J7406J8267J8873J9336J9819K0241K0351
63212H72415J9853J8447J5909J2336Q192L939m37n231j0321j4936j8418k0956
63200H80792k3207k5250k6436k6287k5048k3218k0952j8217j5185j2143r215o450
63188F49184l943j623R45M133P643J0628J2501J3566J4681J6328J8018J8804J8400
63175G79265J7678J7710J8505J9054J8648J7680J6944J6626J6310J5695J4751
63164I68866J3234J0610O626J713l370q197j2828j7451k2033k6249k9618l1681
$$ plain form
63152 849622 817330 785479 754472 724500 696186 670452 647619 627065 608162 591220 576973
63141 576973 565335 555363 546428 538648 532002 525874 519959 514948 511577 509438 507489 505403 503674 502594
63127 502594 502040 502246 503834 506771 510026 512749 515341 518842 523599 528935 533986 538418 542406 546220 549936
63112 549936 553438 556662 559769 562961 566115 568847 570976 572708 574240 575439 576093 576290 576328 576327 576172 575822
63096 575822 575518 575570 575989 576444 576680 576993 578004 579828 581638 582380 581853 580817 580119 580099 580805 582231 584158
63079 584158 586130 587951 589906 592210 594543 596489 598260 600566 603865 608100 613141 619063 625886 633429
63065 633429 641554 650387 660120 670769 682244 694573 708048 723293 741159 762270 786504 813087
63053 813087 841416 871676 904591 940676 979912 1021923 1066182 1112100 1159180 1207114 1255587
$$ packed form
63152H49622l2292l1851l1007k9972k8314k5734k2833k0554j8903j6942j4247
63141E76973j1638r972q935p780o646o128n915n011l371k139j949k086j729j080
63127E02594n54K06J588K937L255K723K592L501M757N336N051M432L988L814L716
63112E49936L502L224L107L192L154K732K129J732J532J199O54J97L8jj55l50
63096E75822l04N2M19M55K36L13J011J824J810P42n27j036o98k0P06J426J927
63079E84158J972J821J955K304K333J946J771K306L299M235N041N922O823P543
63065F33429Q125Q833R733J0649J1475J2329J3475J5245J7866K1111K4234K6583
63053H13087K8329L0260L2915L6085L9236M2011M4259M5918M7080M7934M8473
$$ plain form
63042 1255587 1304116 1352319 1400256 1448124 1495666 1542347 1588185 1633866 1679711 1725044 1769068
63031 1769068 1811992 1854548 1896368 1935404 1969050 1995457 2013626 2022731 2021697 2009404 1985306 1950151
63019 1950151 1906089 1855657 1800480 1741219 1678790 1615197 1552893 1493719 1438742 1388787 1344689
63008 1344689 1307126 1276514 1252966 1236184 1225586 1220765 1221685 1228260 1239983 1256231 1276666 1300963
62996 1300963 1328325 1357656 1388159 1419524 1451620 1484330 1517546 1551022 1584299 1617057 1649383
62985 1649383 1681304 1712130 1740678 1766032 1787567 1804132 1813869 1815249 1808081 1793038 1770389 1739570
62973 1739570 1700148 1652974 1600185 1544070 1486031 1426667 1366667 1307370 1250443 1197185 1148216
62962 1148216 1103522 1062619 1024862 989855 957548 927834 900233 874179 849472 826225 804446
$$ packed form
63042A255587M8529M8203M7937M7868M7542M6681M5838M5681M5845M5333M4024
63031A769068M2924M2556M1820L9036L3646K6407J8169R105j034j2293k4098l5155
63019A950151m4062n0432n5177n9261o2429o3593o2304n9174n4977m9955m4098
63008A344689l7563l0612k3548j6782j0598m821R20O575J1723J6248K0435K4297
62996A300963K7362K9331L0503L1365L2096L2710L3216L3476L3277L2758L2326
62985A649383L1921L0826K8548K5354K1535J6565R737J380p168j5043k2649l0819
62973A739570l9422m7174n2789n6115n8039n9364o0000n9297n6927n3258m8969
62962A148216m4694m0903l7757l5007l2307k9714k7601k6054k4707k3247k1779
$$ plain form
62951 804446 783871 764161 745118 726758 709264 692735 676984 661758 647182 633637 621060
62940 621060 608827 596691 585395 575900 568211 561451 554883 548372 542014 535948 530548 526264 523155
62927 523155 520923 519406 518592 518123 517278 515652 513544 511569 510084 509024 508023 506687 505035 503617 502903
62912 502903 502640 502129 501037 499491 497526 494986 492014 489091 486517 484364 482894 482366 482269 481534 479868 478270
62896 478270 477810 478475 479704 481412 483693 485934 487173 487386 487627 488724 490440 492186 493924 495855 497581
62881 497581 498308 497923 497319 497368 497985 498600 499210 500318 501871 502965 502900 501976 500852 499564 497748 495444 493113
62864 493113 491055 489425 488598 488832 489633 490147 490176 490183 490246 489794 488575 487212 486447 486405 486821 487477 488081 488328 488460
62845 488460 489317 491369 494078 496536 498352 499544 500002 499539 498268 496592 495024 494200 494594 495859 496857 496815
$$ packed form
62951H04446k0575j9710j9043j8360j7494j6529j5751j5226j4576j3545j2577
62940F21060j2233j2136j1296r495p689o760o568o511o358o066n400m284l109
62927E23155k232j517q14m69q45j626k108j975j485j060j001j336j652j418p14
62912E02903k63n11j092j546j965k540k972k923k574k153j470n28r7p35j666j598
62896D78270m60O65J229J708K281K241J239K13K41J097J716J746J738J931J726
62881D97581P27l85o04M9O17O15O10J108J553J094o5r24j124j288j816k304k331
62864D93113k058j630q27K34Q01N14K9PO3m52j219j363p65m2M16O56O04K47J32
62845D88460Q57K052K709K458J816J192M58m63j271j676j568q24L94J265R98m2
$$ plain form
62829 496815 496195 496095 497071 498882 501006 502939 504298 505101 505783 506601 507311 507791 508588 510324 512777 515055
62813 515055 516546 517388 518224 519821 522636 526322 529936 532969 535826 538993 542296 545578 549482 554703 560878
62798 560878 567147 573535 580734 588663 596404 603657 611165 619462 628325 637895 649352 663781 681219
62785 681219 701534 725491 754014 786915 823371 863475 908391 958923 1014733 1075091 1139738
62774 1139738 1208680 1281549 1357471 1435233 1513227 1589385 1661423 1727141 1784467 1831467 1866626
62763 1866626 1889158 1898842 1895546 1879035 1849444 1807856 1756205 1696568 1630695 1560299 1487432 1414139
62751 1414139 1341726 1270758 1201857 1136146 1074686 1017708 964739 915419 869944 828689 791666
62740 791666 758479 728697 702085 678511 657738 639403 623189 608905 596366 585302 575464 566797
$$ packed form
62829D96815o20j00R76J811K124J933J359Q03O82Q18P10M80P97J736K453K278
62813E15055J491Q42Q36J597K815L686L614L033K857L167L303L282L904N221O175
62798E60878O269O388P199P929P741P253P508Q297Q863R570J1457J4429J7438
62785F81219K0315K3957K8523L2901L6456M0104M4916N0532N5810O0358O4647
62774A139738O8942P2869P5922P7762P7994P6158P2038O5718N7326M7000L5159
62763A866626K2532R684l296j6511k9591m1588n1651n9637o5873p0396p2867p3293
62751A414139p2413p0968o8901o5711o1460n6978n2969m9320m5475m1255l7023
62740G91666l3187k9782k6612k3574k0773j8335j6214j4284j2539j1064r838q667
$$ plain form
62728 566797 559378 553206 548150 544120 541182 539451 538900 539276 540203 541426 543042 545466 549121 554121 560281
62713 560281 567357 575226 583960 593861 605429 619186 635465 654366 675807 699582 725549 753971
62701 753971 785569 821020 860410 903364 949637 999331 1052590 1109449 1170073 1234746 1303249
62690 1303249 1374397 1446353 1517213 1584977 1647181 1701123 1744674 1776599 1796026 1801949 1793610 1771267
62678 1771267 1736312 1690631 1636028 1574162 1506764 1435793 1363435 1291836 1222479 1155766 1091494
62667 1091494 1029951 972359 920099 873621 832278 795022 761059 730029 701902 676698 654158
62656 654158 633743 615124 598531 584330 572292 561546 551208 540842 530416 520207 510771 502653
62644 502653 495968 490456 485960 482546 480126 478323 476850 475716 474922 474245 473509 472842 472483 472496 472781 473144
$$ packed form
62728E66797p419o172n056m030k938j731n51L76R27J223J616K424L655N000O160
62713E60281P076P869Q734R901J1568J3757J6279J8901K1441K3775K5967K8422
62701G53971L1598L5451L9390M2954M6273M9694N3259N6859O0624O4673O8503
62690A303249P1148P1956P0860O7764O2204N3942M3551L1925J9427N923q339k2343
62678A771267l4955m5681n4603o1866o7398p0971p2358p1599o9357o6713o4272
62667A091494o1543n7592n2260m6478m1343l7256l3963l1030k8127k5204k2540
62656F54158k0415j8619j6593j4201j2038j0746j0338j0366j0426j0209r436q118
62644E02653o685n512m496l414k420j803j473j134p94o77p36o67l59J3K85L63
$$ plain form
62628 473144 473230 472621 471180 469164 466895 464618 462714 461708 461787 462528 463366 464197 465333 467041 469291 471852
62612 471852 474558 477577 481419 486381 491977 497278 501920 506392 511314 516964 523726 532238 542626 554138
62598 554138 566263 579819 596209 615864 638178 662816 690185 720553 753569 788955 826864
62587 826864 866937 907437 945933 980694 1011051 1036624 1056738 1070632 1077767 1077770 1070429 1056099 1035991
62574 1035991 1011620 983856 952758 918555 882503 846429 811528 777972 745659 714894 686221
62563 686221 659965 636189 614847 595802 578884 564098 551505 540772 531189 522339 514413 507642
62551 507642 501729 496149 490723 485580 480825 476615 473269 470882 469039 467303 465829 465150 465551 466995 469403
62536 469403 472489 475427 477233 477534 476652 475095 473361 472152 472253 474015 477232 481570 486926 493421 501285
$$ packed form
62628D73144Q6o09j441k016k269k277j904j006P9P41Q38Q31J136J708K250K561
62612D71852K706L019L842M962N596N301M642M472M922N650O762Q512J0388J1512
62598E54138J2125J3556J6390J9655K2314K4638K7369L0368L3016L5386L7909
62587H26864M0073M0500L8496L4761L0357K5573K0114J3894P135Lp341j4330k0108
62574A035991k4371k7764l1098l4203l6052l6074l4901l3556l2313l0765k8673
62563F86221k6256k3776k1342j9045j6918j4786j2593j0733r583q850p926o771
62551E07642n913n580n426n143m755m210l346k387j843j736j474o79M01J444K408
62536D69403L086K938J806L01q82j557j734j209J01J762L217M338N356O495P864
$$ plain form
62521 501285 510669 521400 533118 545940 560705 578227 598529 621242 646459 674678 706092 740564
62509 740564 778096 818593 861095 904002 946223 987472 1027163 1063674 1095191 1120918 1140909
62498 1140909 1154909 1161894 1160934 1152396 1138165 1120684 1101805 1082673 1064499 1048865 1036895 1028530
62486 1028530 1023179 1020950 1022770 1029442 1041149 1057823 1079420 1105618 1135523 1167554 1199191 1227057
62474 1227057 1248130 1261306 1267488 1268006 1263205 1252408 1234541 1208622 1174325 1132657 1085893 1036520
62462 1036520 986265 936073 886536 838052 790942 745825 703804 666040 633174 605202 581777
62451 581777 562509 547011 534701 524656 515939 508259 502059 497731 495015 493474 493130 494071 495720 497237
62437 497237 498644 500868 504573 509443 514617 519273 522699 524407 524443 523217 520957 517684 513603 508984 503683
$$ packed form
62521E01285R384J0731J1718J2822J4765J7522K0302K2713K5217K8219L1414L4472
62509G40564L7532M0497M2502M2907M2221M1249L9691L6511L1517K5727J9991
62498A140909J4000O985r60q538j4231j7481j8879j9132j8174j5634j1970q365
62486A028530n351k229J820O672J1707J6674K1597K6198K9905L2031L1637K7866
62474A227057K1073J3176O182N18m801j0797j7867k5919l4297m1668m6764m9373
62462A036520n0255n0192m9537m8484m7110m5117m2021l7764l2866k7972k3425
62451E81777j9268j5498j2310j0045q717p680o200m328k716j541l44R41J649J517
62437D97237J407K224L705M870N174M656L426J708L6j226k260l273m081m619n301
$$ plain form
62422 503683 497436 490659 484264 478553 472965 467146 461626 457134 453706 450773 447718 444267 440702 437747
62408 437747 435784 434300 432695 431414 431346 432158 432335 431101 429211 427552 426158 425189 425638 428078 431563 434796
62392 434796 437724 441108 445045 448949 452552 456030 459404 462576 465749 469190 472930 477252 482894 490017
62378 490017 497549 504430 511073 518642 527336 536512 546128 556809 568529 580450 592233 604457 617505
62365 617505 631093 645272 661036 679511 701278 726859 757087 792513 832977 878204 928329
62354 928329 983417 1042968 1106169 1172063 1238887 1303628 1362837 1413814 1454867 1485027 1504218
62343 1504218 1513569 1514820 1509145 1496681 1477128 1450550 1417576 1379193 1336462 1290297 1241445 1190868
62331 1190868 1140260 1091907 1047624 1007753 971368 937625 906709 879333 855548 834342 814322
$$ packed form
62422E03683o247o777o395n711n588n819n520m492l428k933l055l451l565k955
62408D37747j963j484j605j281o8Q12J77j234j890j659j394r69M49K440L485L233
62392D34796K928L384L937L904L603L478L374L172L173L441L740M322N642P123
62378D90017P532O881O643P569Q694R176R616J0681J1720J1921J1783J2224J3048
62365F17505J3588J4179J5764J8475K1767K5581L0228L5426M0464M5227N0125
62354I28329N5088N9551O3201O5894O6824O4741N9209N0977M1053L0160J9191
62343A504218R351J251n675j2464j9553k6578l2974l8383m2731m6165m8852n0577
62331A190868n0608m8353m4283l9871l6385l3743l0916k7376k3785k1206k0020
$$ plain form
62320 814322 794440 774144 753244 731742 709594 686673 663321 640802 620554 602809 586521
62309 586521 570945 556690 544801 535275 527048 519157 511480 504624 499504 496662 495522 494594 492925 491068
62295 491068 490102 490078 490170 490166 490924 493190 496644 500402 504012 507655 511664 516120 520810 525445 529896 534130
62279 534130 537965 541177 543946 546769 549673 551972 553269 554348 556551 560553 566254 573555 582498 592813
62265 592813 604117 616682 631414 649045 669907 694585 724062 758922 798874 843410 892677
62254 892677 947453 1008416 1075434 1147154 1221001 1293640 1361623 1421868 1472048 1510980 1538542
62243 1538542 1555020 1560699 1556263 1543020 1522100 1493576 1456848 1411777 1359111 1300253 1237240 1172612
62231 1172612 1108503 1045972 985804 929585 878953 833886 792799 754607 719832 689482 663708
$$ packed form
62320H14322j9882k0296k0900k1502k2148k2921k3352k2519k0248j7745j6288
62309E86521j5576j4255j1889r526q227p891p677o856n120k842j140r28j669j857
62295D91068r66k4R2mP58K266L454L758L610L643M009M456M690M635M451M234
62279E34130L835L212K769K823K904K299J297J079K203M002N701P301Q943J0315
62265E92813J1304J2565J4732J7631K0862K4678K9477L4860L9952M4536M9267
62254H92677N4776O0963O7018P1720P3847P2639O7983O0245N0180L8932K7562
62243A538542J6478N679m436j3243k0920k8524l6728m5071n2666n8858o3013o4628
62231A172612o4109o2531o0168n6219n0632m5067m1087l8192l4775l0350k5774
$$ plain form
62220 663708 641920 623400 607303 592707 579186 566929 555941 545678 535807 526782 519187 512889
62208 512889 507222 501686 496162 490831 486228 483040 481504 481244 481821 483081 484871 486908 489203 492144 495951
62193 495951 500529 506018 512880 521087 529918 539027 549125 560971 574164 587634 601003 614789 629455
62180 629455 644883 660727 676731 692648 708221 723285 737733 751628 765607 780920 798705
62169 798705 819362 842904 869633 900098 934650 973443 1016633 1064040 1114638 1166719 1218430
62158 1218430 1267799 1312430 1349779 1377941 1396045 1404118 1402952 1394028 1379039 1359154 1334729 1305591
62146 1305591 1271486 1232481 1189283 1143209 1095700 1048013 1001444 957526 917574 882164 851347
62135 851347 825214 803805 786626 772734 761384 752253 744990 738992 733788 729376 726011 723840 722869
$$ packed form
62220F63708k1788j8520j6097j4596j3521j2257j0988j0263r871r025p595o298
62208E12889n667n536n524n331m603l188j536k60N77J260J790K037K295K941L807
62193D95951M578N489O862Q207Q831R109J0098J1846J3193J3470J3369J3786J4666
62180F29455J5428J5844J6004J5917J5573J5064J4448J3895J3979J5313J7785
62169G98705K0657K3542K6729L0465L4552L8793M3190M7407N0598N2081N1711
62158A218430M9369M4631L7349K8162J8104Q073j166q924j4989j9885k4425k9138
62146A305591l4105l9005m3198m6074m7509m7687m6569m3918l9952l5410l0817
62135H51347k6133k1409j7179j3892j1350r131p263n998n204m412l365k171r71
$$ plain form
62122 722869 723127 724746 727990 733288 741052 751327 763754 777973 793912 811365 829173 845033 856441
62109 856441 862075 862328 858708 852992 846952 842196 839493 838116 836260 832338 825790 816902 806428 795578
62095 795578 785838 778345 773499 771211 771204 772989 775999 780081 785562 792491 800107 807457 814383 821586 829872
62080 829872 839605 850803 863471 877873 894558 913936 935683 958825 982567 1006780 1031538 1056665
62068 1056665 1082136 1108467 1136181 1165119 1194881 1225725 1258326 1292658 1327644 1361942 1394425
62057 1394425 1423786 1448371 1466948 1479434 1486583 1489145 1487500 1481770 1471931 1457874 1439535 1416884
62045 1416884 1389683 1357436 1319868 1277514 1231833 1184786 1138185 1093125 1049729 1007497 966109
62034 966109 925991 888117 853354 822021 793956 768833 746450 726851 710187 696343 684651
$$ packed form
62122G22869K58J619L244N298P764J0275J2427J4219J5939J7453J7808J5860J1408
62109H56441N634K53l620n716o040m756k703j377j856l922o548q888j0474j0850
62095G95578r740p493m846k288pJ785L010M082N481O929P616P350O926P203Q286
62080H29872R733J1198J2668J4402J6685J9378K1747K3142K3742K4213K4758K5127
62068A056665K5471K6331K7714K8938K9762L0844L2601L4332L4986L4298L2483
62057A394425K9361K4585J8577J2486P149K562j645n730r839j4057j8339k2651
62045A416884k7201l2247l7568m2354m5681m7047m6601m5060m3396m2232m1388
62034I66109m0118l7874l4763l1333k8065k5123k2383j9599j6664j3844j1692
$$ plain form
62023 684651 674129 664118 654582 645674 637126 628377 619339 610682 603092 596435 589927 583050 576082 569871
62009 569871 565373 563216 563237 564389 565638 567137 570137 575424 582246 589167 595713 602618 610503 618831 626405
61994 626405 632506 637195 640559 642085 641033 637274 631422 624055 615081 604128 591408 577914 564815
61981 564815 552937 542735 534312 527287 520900 514518 507995 501542 495425 489803 484703 480061 475897 472348
61967 472348 469341 466397 463104 459680 456693 454238 451907 449608 447875 447152 447213 447541 447906 448280 448642 449202
61951 449202 450536 453110 456815 461202 465998 471278 477495 485479 495968 508827 523111 538245 554773
61938 554773 573591 594801 617687 641428 665390 689098 712501 735957 759432 781974 802571
61927 802571 821288 838838 855186 869262 880080 887404 891226 891305 887564 880503 870975 859972 848814
$$ packed form
62023F84651j0522j0011r536q908q548q749r038q657p590o657o508o877o968o211
62009E69871m498k157K1J152J249J499L000N287O822O921O546O905P885Q328P574
61994F26405O101M689L364J526j052l759n852p367q974j0953j2720j3494j3099
61981E64815j1878j0202q423p025o387o382o523o453o117n622n100m642m164l549
61967D72348l007k944l293l424k987k455k331k299j733p23O1L28L65L74L62N60
61951D49202J334K574L705M387M796N280O217P984J0489J2859J4284J5134J6528
61938E54773J8818K1210K2886K3741K3962K3708K3403K3456K3475K2542K0597
61927H02571J8717J7550J6348J4076J0818P324L822P9l741p061r528j1003j1158
$$ plain form
61914 848814 839065 831832 827316 825264 825637 828654 834524 843430 855617 871147 889539 909794 930684
61901 930684 950853 968677 982319 990184 991524 986665 976670 962732 945857 926880 906535 885360
61889 885360 863704 841889 820264 799131 778850 759992 743026 727749 713408 699619 686743
61878 686743 675017 663790 652241 640642 630239 621834 615035 609068 603820 599837 597591 597068 597945
61865 597945 599928 602881 606723 611289 616453 622434 629793 638972 649936 662396 676261 691742 709269
61852 709269 729541 753371 781031 811795 844488 878506 914046 951319 989783 1028112 1064670
61841 1064670 1098000 1127074 1151118 1169217 1180319 1183918 1180578 1171561 1158042 1140930 1121252 1100360
61829 1100360 1079823 1061473 1047403 1039430 1038323 1043669 1054503 1069818 1088500 1108980 1129128 1146559
$$ packed form
61914H48814r749p233m516k052L73L017N870Q906J2187J5530J8392K0255K0890
61901I30684K0169J7824J3642P865J340m859r995j3938j6875j8977k0345k1175
61889H85360k1656k1815k1625k1133k0281j8858j6966j5277j4341j3789j2876
61878F86743j1726j1227j1549j1599j0403q405o799n967n248l983k246n23Q77
61865E97945J983K953L842M566N164N981P359R179J0964J2460J3865J5481J7527
61852G09269K0272K3830K7660L0764L2693L4018L5540L7273L8464L8329L6558
61841A064670L3330K9074K4044J8099J1102L599l340r017j3519j7112j9678k0892
61829A100360k0537j8350j4070p973j107N346J0834J5315J8682K0480K0148J7431
$$ plain form
61817 1146559 1159308 1166295 1167005 1160685 1146379 1124042 1095131 1061582 1024505 984431 942484 900522
61805 900522 860130 822097 786929 755198 727140 702358 680148 659911 641325 624540 610120
61794 610120 598307 588360 579163 570490 563007 556919 551415 545822 540615 536686 534093 532221 530931 530842
61780 530842 532408 535202 538289 541039 543408 545568 547452 548717 549128 548881 548490 548447 549086 550612 552970 555695
61764 555695 558153 560038 561490 562815 564276 566115 568454 571134 573884 576679 579710 582966 586102 588729
61750 588729 590661 591872 592492 592834 593128 593150 592372 590507 587723 584295 580382 576223 572277 568952 566324 564181
61734 564181 562240 560378 558829 558128 558591 559839 561038 561706 562138 563043 564850 567316 569713 571514 573029
61719 573029 575144 578275 581827 584938 587456 589822 592323 594874 597308 599334 600392 600118 598789 596789
$$ packed form
61817A146559J2749O987P10o320j4306k2337k8911l3549l7077m0074m1947m1962
61805I00522m0392l8033l5168l1731k8058k4782k2210k0237j8586j6785j4420
61794F10120j1813r947r197q673p483o088n504n593n207l929k593j872j290q9
61780E30842J566K794L087K750K369K160J884J265M11k47l91m3O39J526K358K725
61764E55695K458J885J452J325J461J839K339K680K750K795L031L256L136K627
61750E88729J932J211O20L42K94K2p78j865k784l428l913m159l946l325k628k143
61734E64181j941j862j549p01M63J248J199O68M32R05J807K466K397J801J515
61719E73029K115L131L552L111K518K366K501K551K434K026J058k74j329k000
$$ plain form
61705 596789 593840 589395 583702 577725 571997 566268 560364 554665 549485 544593 539632 534614 529856 525784
61691 525784 522759 520561 518152 514644 510495 506953 504347 501831 498976 496517 495096 494324 493710 493579 494194
61676 494194 494697 493915 491821 489385 487328 485781 484871 484730 484995 484972 484370 483440 482487 481680 481223 481262 481665 482214
61658 482214 482876 483613 484202 484558 484994 485740 486511 486948 487210 487727 488632 489879 491690 494361 497837 501870 506338
61641 506338 510949 514971 517887 520112 522489 525151 527443 528806 529178 528619 527139 524920 522207 518985 515161
61626 515161 510917 506435 501456 495753 489953 485249 482245 480654 480065 480338 481172 482097 483127 484738 486807
61611 486807 488176 487737 485550 482377 478516 473651 467701 461221 454801 448438 441734 434605 427600 421441
61597 421441 416311 411764 407332 402961 398759 394622 390415 386294 382455 378680 374606 370372 366546 363420
$$ packed form
61705E96789k949m445n693n977n728n729n904n699n180m892m961n018m758m072
61691E25784l025k198k409l508m149l542k606k516k855k459j421p72o14j31O15
61676D94194N03p82k094k436k057j547r10j41K65k3o02r30r53q07m57L9M03N49
61658D82214O62P37N89L56M36P46P71M37K62N17R05J247J811K671L476M033M468
61641E06338M611M022K916K225K377K662K292J363L72n59j480k219k713l222l824
61626E15161m244m482m979n703n800m704l004j591n89K73Q34R25J030J611K069
61611D86807J369m39k187l173l861m865n950o480o420o363o704p129p005o159
61597D21441n130m547m432m371m202m137m207m121l839l775m074m234l826l126
$$ plain form
61583 363420 360840 358760 357380 356547 355566 353982 352174 350732 349520 347820 345284 342321 339558 337287 335515
61568 335515 334246 333492 333138 332942 332681 332229 331533 330588 329454 328270 327275 326768 326988 327946 329358 330826 332119
61551 332119 333242 334206 334849 334971 334586 333905 333193 332762 332962 333868 335030 335922 336681 338045 340444 343537 346814
61534 346814 350318 354445 359262 364290 368789 372099 373884 374254 373484 371529 368121 363530 358775 354733 351305
61519 351305 347862 344241 340860 338064 335857 334180 332970 332003 331080 330378 330275 330817 331594 332136 332131 331431 330181
61502 330181 328889 328006 327470 326968 326500 326286 326182 325683 324574 323218 322160 321738 322024 322746 323294 323227 322786 322537
61484 322537 322516 322305 321985 322354 323840 325706 326757 326624 326043 326079 327381 329912 332988 335615 337092 337429 337143
61467 337143 336746 336470 336290 336073 335786 335653 336001 336761 337260 336718 335068 333179 332170 332449 333501 334587 335492
$$ packed form
61583C63420k580k080j380q33r81j584j808j442j212j700k536k963k763k271j772
61568C35515j269p54l54j96k61m52o96r45j134j184r95n07K20R58J412J468J293
61551C32119J123R64O43J22l85o81p12m31K00R06J162Q92P59J364K399L093L277
61534C46814L504M127M817N028M499L310J785L70p70j955l408m591m755m042l428
61519C51305l443l621l381k796k207j677j210r67r23p02j03N42P77N42np00j250
61502C30181j292q83n36n02m68k14j04m99j109j356j058m22K86P22N48o7m41k49
61484C22537k1k11l20L69J486J866J051j33n81L6J302K531L076K627J477L37k86
61467C37143l97k76j80k17k87j33L48P60M99n42j650j889j009K79J052J086R05
$$ plain form
61450 335492 336400 337271 337797 337996 338348 339086 339816 340230 340770 342038 343858 345557 347055 349019 351941 355707
61434 355707 360126 365260 370988 376743 381942 386283 389487 391234 391691 391695 392069 392931 393895 394719 395547 396716
61418 396716 398453 400619 402664 404115 405143 406316 407772 409101 410075 410940 411685 411593 409983 407037 403478
61403 403478 399746 395918 392148 388642 385390 382391 380029 378767 378508 378701 378995 379369 379661 379513 378929 378469
61387 378469 378633 379270 379780 379768 379369 379068 379285 380036 380967 381820 382838 384550 387133 390195 393202 395956 398598
61370 398598 401379 404499 407958 411389 414226 416235 417828 419581 421499 423013 423838 424612 426487 430123 435230
61355 435230 440991 446760 452366 458028 464155 471120 479102 488134 498273 509526 521521 533460 544515
61342 544515 554136 561903 567450 570912 573215 575409 577641 579166 579457 578953 578513 578397 578077 576909 574741
$$ packed form
61450C35492R08Q71N26J99L52P38P30M14N40J268J820J699J498J964K922L766
61434C55707M419N134N728N755N199M341L204J747M57ML74Q62R64Q24Q28J169
61418C96716J737K166K045J451J028J173J456J329R74Q65P45r2j610k946l559
61403D03478l732l828l770l506l252k999k362j262k59J93K94L74K92j48n84m60
61387C78469J64O37N10j2l99l01K17P51R31Q53J018J712K583L062L007K754K642
61370C98598K781L120L459L431K837K009J593J753J918J514Q25P74J875L636N107
61355D35230N761N769N606N662O127O965P982R032J0139J1253J1995J1939J1055
61342E44515R621P767N547L462K303K194K232J525K91n04m40j16l20j168k168
$$ plain form
61327 574741 571816 568258 563862 558489 552580 547034 542460 538787 535740 533421 532077 531588 531690 532555 534594
61312 534594 537649 540999 544344 548240 553309 559566 566906 575791 586871 600163 615034 630765 646570
61299 646570 661175 672978 680908 684915 685652 683926 680429 675620 669691 662790 655316 647842 640728 633966
61285 633966 627350 620571 613236 605216 597135 590221 585405 582650 581315 581039 582072 584768 589002 594215
61271 594215 599966 606267 613300 620827 628104 634516 640226 645978 652226 658639 664630 670258 676499 684612
61257 684612 695275 708254 722620 737147 750628 762111 771053 777290 780875 782008 781102 778719 775199
61244 775199 770372 763832 755576 746248 736643 727083 717432 707665 698239 689832 682819 677128 672499 668719
61230 668719 665564 662716 659978 657571 656052 655895 657234 659958 663784 668136 672252 675746 679003 682751
$$ packed form
61327E74741k925l558m396n373n909n546m574l673l047k319j344m89J02Q65K039
61312E34594L055L350L345L896N069O257P340Q885J1080J3292J4871J5731J5805
61299F46570J4605J1803P930M007P37j726l497m809n929o901p474p474p114o762
61285F33966o616o779p335q020q081o914m816k755j335k76J033K696M234N213
61271E94215N751O301P033P527P277O412N710N752O248O413N991N628O241Q113
61257F84612J0663J2979J4366J4527J3481J1483Q942O237L585J133r06k383l520
61244G75199m827o540q256r328r605r560r651r767r426q407p013n691m629l780
61230F68719l155k848k738k407j519j57J339K724L826M352M116L494L257L748
$$ plain form
61216 682751 687263 692247 697443 702951 708811 714586 719664 723804 727157 729814 731667 732763 733578 734781
61202 734781 736803 739752 743698 748883 755552 763729 773375 784827 798924 816499 837712 861872 887745
61189 887745 913847 938568 960430 978469 992403 1002510 1009535 1014655 1019093 1023416 1027306 1030208 1032005
61176 1032005 1032825 1032376 1029939 1025094 1018102 1009501 999708 989211 978685 968423 957823 945894 932225
61163 932225 917095 900756 883188 864712 846184 828189 810486 792767 775679 760437 747508
61152 747508 736298 726279 717911 712199 709686 710097 712637 716232 719622 721600 721331 718399 712657 704118
61138 704118 693075 680298 667119 655103 645374 638141 632966 629420 627336 626630 627213 629208 633017 639045
61124 639045 647463 658151 670684 684493 699374 715838 734690 756304 780542 807191 835960 866119
$$ packed form
61216F82751M512M984N196N508N860N775N078M140L353K657J853J096Q15J203
61202G34781K022K949L946N185O669Q177R646J1452J4097J7575K1213K4160K5873
61189H87745K6102K4721K1862J8039J3934J0107P025N120M438M323L890K902J797
61176A032005Q20m49k437m845o992q601r793j0497j0526j0262j0600j1929j3669
61163I32225j5130j6339j7568j8476j8528j7995j7703j7719j7088j5242j2929
61152G47508j1210j0019q368n712k513M11K540L595L390J978k69k932n742q539
61138G04118j1043j2777j3179j2016r729p233n175l546k084p06N83J995L809O028
61124F39045Q418J0688J2533J3809J4881J6464J8852K1614K4238K6649K8769L0159
$$ plain form
61112 866119 896756 927531 958678 990157 1021357 1051805 1081538 1110449 1137805 1162850 1185442
61101 1185442 1205678 1223263 1237494 1247467 1252057 1250382 1242788 1230899 1216081 1198321 1177092 1152742
61089 1152742 1126263 1098184 1068602 1038091 1007663 977838 948558 920082 893203 868429 845497
61078 845497 823886 803385 784096 766320 750520 736945 725265 714920 705780 698107 691942 687081
61066 687081 683528 681454 680676 680720 681480 683265 686084 689392 692781 696522 701230 707272 714657 723214 732691
61051 732691 742896 753887 765969 779537 794966 812480 831926 852844 875015 898751 924421
61040 924421 951875 980700 1010808 1042446 1075766 1110643 1146731 1183488 1220429 1257704 1296152
61029 1296152 1336539 1379139 1424172 1472105 1523001 1576062 1630139 1684193 1737132 1788315 1839005
$$ packed form
61112H66119L0637L0775L1147L1479L1200L0448K9733K8911K7356K5045K2592
61101A185442K0236J7585J4231R973M590j675p594j1889j4818j7760k1229k4350
61089A152742k6479k8079k9582l0511l0428k9825k9280k8476k6879k4774k2932
61078H45497k1611k0501j9289j7776j5800j3575j1680j0345r140p673o165m861
61066F87081l553k074p78M4P60J785K819L308L389L741M708O042P385Q557R477
61051G32691J0205J0991J2082J3568J5429J7514J9446K0918K2171K3736K5670
61040I24421K7454K8825L0108L1638L3320L4877L6088L6757L6941L7275L8448
61029A296152M0387M2600M5033M7933N0896N3061N4077N4054N2939N1183N0690
$$ plain form
61018 1839005 1892546 1952264 2019925 2096876 2185344 2287115 2401633 2526999 2662704 2810893
61008 2810893 2976462 3167762 3396553 3675717 4017623 4435779 4946501 5567909 6321059
60999 6321059 7236591 8359146 9743251 11450241 13551010 16104824 19079259 22247875
60991 22247875 25180273 27398440 28616189 28876677 28490475 27861056 27351149 27231905 27636229
60982 27636229 28472684 29384872 29865378 29494847 28138453 25962789 23297197 20472439 17734040
60973 17734040 15229669 13026247 11132969 9527514 8178508 7054783 6124938 5357999
60965 5357999 4726997 4209591 3785256 3434305 3139843 2888833 2671374 2480547 2312486
60956 2312486 2164525 2033048 1914292 1806731 1710954 1627318 1555074 1493321 1440888 1395134
$$ packed form
61018A839005N3541N9718O7661P6951Q8468J01771J14518J25366J35705J48189
61008B810893J65569J91300K28791K79164L41906M18156N10722O21408P53150
60999F321059R15532J122555J384105J706990K100769K553814K974435L168616
60991B2247875K932398K218167J217749K60488l86202o29419n09907j19244M04324
60982B7636229Q36455R12188M80506l70531j356394k175664k665592k824758k738399
60973A7734040k504371k203422j893278j605455j349006j123725r29845p66939
60965E357999o31002n17406m24335l50951k94462k51010k17459j90827j68061
60956B312486j47961j31477j18756j07561r5777q3636p2244o1753n2433m5754
$$ plain form
60946 1395134 1352410 1310050 1266977 1222743 1177490 1132732 1090593 1051872 1015867 982011 950321
60935 950321 920321 891036 862435 835588 811084 788447 767406 748480 731826 716595 702071
60924 702071 688600 676866 666917 658280 650435 642947 635735 629336 624234 619923 615416 610717 606879 604472
60910 604472 602880 601377 600031 599210 598885 598756 598489 597683 596152 594315 592677 590936 588270 584512 580292
60895 580292 576044 571669 567163 562742 558291 553559 548923 545068 541899 538721 535549 533132 531565 529944
60881 529944 527718 525381 523511 522115 521162 520745 520369 519189 517422 516445 516980 518256 519599 521716 525495
60866 525495 530494 535637 540801 546690 553565 561024 568835 577273 586706 597234 608460 619305 628480
60853 628480 635527 641082 645889 650104 653887 657989 663138 669248 675652 681703 686739 690036 691343 691175
$$ packed form
60946A395134m2724m2360m3073m4234m5253m4758m2139l8721l6005l3856l1690
60935I50321l0000k9285k8601k6847k4504k2637k1041j8926j6654j5231j4524
60924G02071j3471j1734r949q637p845p488p212o399n102m311m507m699l838k407
60910F04472j592j503j346q21l25j29k67q06j531j837j638j741k666l758m220
60895E80292m248m375m506m421m451m732m636l855l169l178l172k417j567j621
60881E29944k226k337j870j396r53m17l76j180j767r77N35J276J343K117L779
60866E25495M999N143N164N889O875P459P811Q438R433J0528J1226J0845R175
60853F28480P047N555M807M215L783M102N149O110O404O051N036L297J307j68
$$ plain form
60839 691175 690171 688496 686180 683547 680826 677797 674327 670923 668317 666748 666050 666233 667647 670775 675969
60824 675969 683112 691464 700242 709483 719843 731481 743759 756217 769217 783386 799002 816125
60812 816125 834646 853916 872970 891442 909646 927591 944681 960645 975780 989805 1001487
60801 1001487 1010072 1016287 1021127 1024412 1025309 1023599 1019532 1013052 1004211 993903 983126 971728 958761
60788 958761 943990 928261 912481 896925 881470 865865 849827 833434 817320 802003 787175
60777 787175 772254 757437 743583 731054 719236 707280 694942 682680 671220 660993 651802 643108
60765 643108 634770 627193 620631 614718 608899 602868 596323 588872 580625 572327 564405 556377 547844 539485
60751 539485 532273 526012 519567 512441 505414 499554 495189 491944 489287 486892 484724 482828 480951 478574
$$ packed form
60839F91175j004j675k316k633k721l029l470l404k606j569o98J83J414L128N194
60824F75969P143Q352Q778R241J0360J1638J2278J2458J3000J4169J5616J7123
60812H16125J8521J9270J9054J8472J8204J7945J7090J5964J5135J4025J1682
60801A001487Q585O215M840L285Q97j710m067o480q841j0308j0777j1398j2967
60788I58761j4771j5729j5780j5556j5455j5605j6038j6393j6114j5317j4828
60777G87175j4921j4817j3854j2529j1818j1956j2338j2262j1460j0227r191q694
60765F43108q338p577o562n913n819o031o545p451q247q298p922q028q533q359
60751E39485p212o261o445p126p027n860m365l245k657k395k168j896j877k377
$$ plain form
60737 478574 475439 471741 467683 463307 459015 455619 453393 451580 449386 447014 445149 443947 443208 443063 443629
60722 443629 444343 444595 444874 446337 449146 452027 453599 453520 452253 450358 448240 446071 443630 440499 436511
60707 436511 431800 426491 420713 414881 409586 405138 401453 398337 395668 393395 391592 390374 389582 388786 387830
60692 387830 387036 386545 385801 384144 381625 378868 376379 374402 373086 372340 371859 371767 372788 375232 378257 380885
60676 380885 383388 386803 391305 396006 400250 404150 407739 410591 412628 414557 416981 419560 421442 422181
60662 422181 421959 421215 420431 420113 420688 422374 425127 428655 432522 436384 440067 443415 446392 449507 453723
60647 453723 459577 466573 473780 480696 487102 492376 495539 495932 493528 488801 482667 476295 470420 464959
60633 464959 459632 454683 450484 446741 442803 438611 434732 431492 428654 425915 423191 420440 417670 415148
$$ packed form
60737D78574l135l698m058m376m292l396k226j813k194k372j865j202p39j45N66
60722D43629P14K52K79J463K809K881J572p9j267j895k118k169k441l131l988
60707D36511m711n309n778n832n295m448l685l116k669k273j803j218p92p96r56
60692C87830p94m91p44j657k519k757k489j977j316p46m81r2J021K444L025K628
60676C80885K503L415M502M701M244L900L589K852K037J929K424K579J882P39
60662D22181k22p44p84l18N75J686K753L528L867L862L683L348K977L115M216
60647D53723N854O996P207O916O406N274L163L93k404m727o134o372n875n461
60633D64959n327m949m199l743l938m192l879l240k838k739k724k751k770k522
$$ plain form
60619 415148 413199 411880 411232 411541 412814 414137 414223 412650 410130 407650 405792 404712 404190 403715 402978 402222
60603 402222 401745 401339 400711 400196 400424 401425 402677 403819 404741 405222 405196 405125 405454 405902 406116 406661 408367 410890
60585 410890 413030 414445 415896 417665 418984 419427 419754 420789 422380 424113 426260 429260 432830 436288 439473
60570 439473 442847 446970 452218 458729 466379 475048 485049 496904 510573 525316 540310 554796 567643
60557 567643 577572 584095 587562 588036 584973 578493 570158 561855 554426 547954 542781 539459 537998 537927 539052
60542 539052 541721 546443 553594 563313 575378 589331 604985 622563 642036 662461 682161 699407
60530 699407 712857 721700 725735 725259 720861 713509 704619 695502 686679 678202 670614 664797 660706 657065
60516 657065 652837 648416 644868 642608 641384 641018 641382 641984 642350 642816 644399 647873 653296 660377 668973
$$ packed form
60619D15148j949j319o48L09J273J323Q6j573k520k480j858j080n22m75p37p56
60603D02222m77m06o28n15K28J001J252J142R22M81k6p1L29M48K14N45J706K523
60585D10890K140J415J451J769J319M43L27J035J591J733K147L000L570L458L185
60570D39473L374M123N248O511P650Q669J0001J1855J3669J4743J4994J4486J2847
60557E67643R929O523L467M74l063o480q335q303p429o472n173l322j461p1J125
60542E39052K669M722P151R719J2065J3953J5654J7578J9473K0425J9700J7246
60530F99407J3450Q843M035m76m398p352q890r117q823q477p588n817m091l641
60516F57065m228m421l548k260j224l66L64O02L66M66J583L474N423P081Q596
$$ plain form
60501 668973 679268 691804 707322 726510 749970 778463 812805 853355 899843 951766 1008478
60490 1008478 1068690 1130376 1191519 1250473 1305176 1352408 1388369 1409851 1414730 1402024 1372281
60479 1372281 1327802 1271934 1208169 1140063 1071350 1005232 943440 886481 834725 788760 748800
60468 748800 714342 684488 658220 634472 612568 592766 575904 562271 551139 541483 532801 525085
60456 525085 518378 512609 507593 502922 498043 492710 487257 482222 477786 473761 470001 466559 463400 460217
60442 460217 456710 453013 449752 447678 447181 447996 449262 449982 449681 448680 447661 446980 446516 446077 445649 445189
60426 445189 444509 443508 442310 441017 439602 438247 437530 437954 439440 441450 443457 445108 446285 447296 448698
60411 448698 450510 451869 451903 450818 449722 449501 450243 451562 452991 454167 455097 456160 457501 458638 459221 459903
$$ packed form
60501F68973J0295J2536J5518J9188K3460K8493L4342M0550M6488N1923N6712
60490A008478O0212O1686O1143N8954N4703M7232L5961K1482M879j2706k9743
60479A372281m4479n5868o3765o8106o8713o6118o1792n6959n1756m5965l9960
60468G48800l4458k9854k6268k3748k1904j9802j6862j3633j1132r656q682p716
60456E25085o707n769n016m671m879n333n453n035m436m025l760l442l159l183
60442D60217l507l697l261k074m97Q15J266P20l01j001j019o81m64m39m28m60
60426D45189o80j001j198j293j415j355p17M24J486K010K007J651J177J011J402
60411D48698J812J359L4j085j096k21P42J319J429J176R30J063J341J137N83O82
$$ plain form
60395 459903 461748 464778 467833 469951 471316 472711 474607 476972 479469 481691 483580 485644 488373 491452
60381 491452 494056 495870 497216 498300 499061 499779 500994 502587 503694 503881 503822 504469 506108 508439 511023 513304
60365 513304 514782 515507 515967 516290 516132 515511 515091 515328 516006 516927 518347 520353 522487 524517 526912 530001
60349 530001 533325 536495 540088 544871 550541 556059 561057 566125 571771 577702 583094 587127 589284 589569
60335 589569 588482 586468 583474 579310 574235 568869 563592 558349 553052 547946 543513 540022 537086 533865
60321 533865 529971 526053 523086 521208 519862 518948 519016 520133 521394 522022 522306 523049 524684 527357 531293 536536
60305 536536 542834 550310 559853 572372 588070 606770 628359 652347 677355 701577 723322 740733
60293 740733 751642 754565 749728 738721 723443 705649 686914 668323 650413 633762 619162 606808
$$ packed form
60395D59903J845L030L055K118J365J395J896K365K497K222J889K064K729L079
60381D91452K604J814J346J084P61P18J215J593J107J87n9O47J639K331K584K281
60365E13304J478P25M60L23j58o21m20K37O78R21J420K006K134K030K395L089
60349E30001L324L170L593M783N670N518M998N068N646N931N392M033K157K85
60335E89569j087k014k994m164n075n366n277n243n297n106m433l491k936l221
60321E33865l894l918k967j878j346r14O8J117J261O28K84P43J635K673L936N243
60305E36536O298P476R543J2519J5698J8700K1589K3988K5008K4222K1745J7411
60293G40733J0909K923m837j1007j5278j7794j8735j8591j7910j6651j4600j2354
$$ plain form
60281 606808 595927 585778 576530 568571 561609 555133 549169 543776 538309 532180 525925 520602 516404 512798
60267 512798 509713 507529 506048 504533 502783 501219 499811 497885 495241 492671 491033 490392 490264 490159 489712
60252 489712 488870 488166 488350 489532 491054 492256 492955 493119 492635 491660 490768 490467 490696 490914 490585 489610 488477
60235 488477 487903 488139 488780 489402 490163 491540 493764 496813 500645 505089 509782 514535 519406 524105 527853
60220 527853 530374 532486 535075 537960 540566 543291 547236 552705 558931 565211 571510 577884 584209 590604
60206 590604 597423 604647 611907 619100 626380 633494 639878 645498 650864 656096 660732 664656 668404 672160
60192 672160 675103 676275 675687 674124 672228 670126 667653 664526 660371 654902 648172 640693 633360 627053
60178 627053 621955 617353 612377 606877 601337 596228 591878 588772 587271 586971 586872 586317 585415 584530 583773 583058
$$ packed form
60281F06808j0881j0149r248p959o962o476n964n393n467o129o255n323m198l606
60267E12798l085k184j481j515j750j564j408j926k644k570j638o41j28j05m47
60252D89712q42p04J84J182J522J202O99J64m84r75q92l01K29K18l29r75j133
60235D88477n74K36O41O22P61J377K224L049L832M444M693M753M871M699L748
60220E27853K521K112K589K885K606K725L945N469O226O280O299O374O325O395
60206E90604O819P224P260P193P280P114O384N620N366N232M636L924L748L756
60192F72160K943J172n88j563j896k102k473l127m155n469o730p479p333o307
60178F27053n098m602m976n500n540n109m350l106j501l00r9n55r02q85p57p15
$$ plain form
60162 583058 582265 581296 580274 579596 579415 579192 578274 576888 576048 576411 577688 579224 580760 582519 584917 588221
60146 588221 592201 596181 599764 603393 607826 613196 619037 625049 631279 637657 643951 650233 656825 663723
60132 663723 670541 676976 682901 688081 692368 696083 699594 702519 703969 703722 702577 701423 700523 699829 699475
60117 699475 699662 700442 701743 703398 705110 706694 708205 709499 709937 709031 707168 705022 702467 698838 694160
60102 694160 689201 684195 678387 671211 663243 655645 649135 643756 639189 635076 631401 628687 627437 627364 627704
60087 627704 628283 629667 632193 635524 639312 643673 648723 654181 659704 665148 670195 674115 676167 676083 674144
60072 674144 671043 667489 663541 658475 651774 644019 636223 628603 620787 612927 605581 598615 591372 584099
60058 584099 578041 573771 570397 566846 563028 559304 555750 552524 550096 548512 547136 545756 545273 546696
$$ packed form
60162E83058p93r69j022o78j81k23r18j386q40L63J277J536J536J759K398L304
60146E88221L980L980L583L629M433N370N841O012O230O378O294O282O592O898
60132F63723O818O435N925N180M287L715L511K925J450k47j145j154r00o94l54
60117F99475J87P80J301J655J712J584J511J294M38r06j863k146k555l629m678
60102F94160m959n006n808p176p968p598o510n379m567m113l675k714j250p3L40
60087F27704N79J384K526L331L788M361N050N458N523N444N047L920K052q4j939
60072F74144l101l554l948n066o701p755p796p620p816p860p346o966p243p273
60058E84099o058m270l374l551l818l724l554l226k428j584j376j380m83J423
$$ plain form
60044 546696 550075 554978 561330 568977 576996 584405 591344 598778 607041 615207 621897 626335 628660 629472
60030 629472 629114 627390 624122 619795 615136 610097 603857 595932 586669 576590 566038 555645 546266 537977
60016 537977 529879 521394 513143 506030 500137 495108 491040 488238 486541 485549 485229 485693 486617 487444 487992 488454
60000 488454 489007 489747 490721 491717 492304 492430 492659 493570 495257 497626 500731 504459 508406 512525 517421 523460
59984 523460 529961 535867 541026 546221 551899 557214 560487 560670 558489 556030 554819 554379 553102 550347 547015
59969 547015 544180 542074 540633 540126 540776 542438 545004 548447 552155 555039 556784 558267 560248 562435 564297
59954 564297 565933 567518 568663 569081 569166 569178 568570 566931 564923 563369 562044 560285 558192 556179 553832 550369
59938 550369 545993 541676 537760 533749 529492 525572 522433 519944 517948 516580 515928 515942 516672 518038 519448
$$ packed form
60044E46696L379M903O352P647Q019P409O939P434Q263Q166O690M438K325Q12
60030F29472l58j724l268m327m659n039o240p925r263j0079j0552j0393r379q289
60016E37977q098q485q251p113n893n029m068k802j697r92l20M64R24Q27N48M62
60000D88454N53P40R74R96N87J26K29R11J687K369L105L728L947M119M896O039
59984E23460O501N906N159N195N678N315L273J83k181k459j211m40j277k755l332
59969E47015k835k106j441n07O50J662K566L443L708K884J745J483J981K187J862
59954E64297J636J585J145M18Q5J2o08j639k008j554j325j759k093k013k347l463
59938E50369m376m317l916m011m257l920l139k489j996j368o52J4P30J366J410
$$ plain form
59923 519448 520316 521003 522657 525990 530636 535681 540402 544482 547997 551313 554659 557833 560577 563114 566048
59908 566048 569874 574848 581012 587964 594844 600931 606118 610496 613889 616191 617718 618625 618269 615871 611735
59893 611735 607245 603652 601250 599682 598597 597997 598216 599563 601874 604633 607615 611070 615159 619684 624600
59878 624600 630252 636757 643649 650453 657046 663055 667608 670185 671185 671111 669841 667190 663558 659370 654539
59863 654539 649178 644180 640267 637048 633797 630554 627617 624611 621087 617533 614838 613250 612853 614324
59849 614324 617990 622748 627415 632830 641080 652702 665946 678651 689346 696628 699351 698104 695258
59836 695258 692956 692024 693009 696706 702742 708727 711844 710851 706106 698516 689213 679581 670635 662423 654387
59821 654387 646135 637712 629563 622372 616441 611120 605416 599384 594294 591164 589689 588805 587737 586256
$$ packed form
59923E19448Q68O87J654L333M646N045M721M080L515L316L346L174K744K537K934
59908E66048L826M974O164O952O880O087N187M378L393K302J527R07l56k398m136
59893F11735m490l593k402j568j085o00K19J347K311K759K982L455M089M525M916
59878F24600N652O505O892O804O593O009M553K577J000p4j270k651l632m188m831
59863F54539n361m998l913l219l251l243k937l006l524l554k695j588l97J471
59849F14324L666M758M667N415Q250J1622J3244J2705J0695P282K723j247k846
59836F95258k302r32R85L697O036N985L117r93m745p590r303r632q946q212q036
59821F54387q252q423q149p191n931n321n704o032n090l130j475q84j068j481
$$ plain form
59807 586256 584527 583025 582112 581498 580551 579245 578150 577426 576604 575490 574390 573091 570554 566198 560746
59792 560746 555176 549544 543549 537641 532681 528871 525755 523026 520625 518254 515562 512812 510729 509609
59778 509609 509024 508437 507713 506963 506309 505900 505879 506174 506576 507106 508087 509736 511899 514330 517032 520024 522912
59761 522912 525102 526623 528368 531202 535010 539039 542976 547147 551654 556044 560121 564565 570259 577296
59747 577296 584956 592344 598817 604154 608686 612947 616933 620070 622144 623731 625386 626991 628346 629731
59733 629731 631258 632324 632485 632371 632874 633863 634602 635066 635777 636607 636771 636039 634982 634036 633164 632487 632364 632728
59715 632728 633132 633558 634474 636005 637703 639149 640152 640481 640189 640174 641543 644314 647481 650332 652894 655214
59699 655214 657255 659678 663617 669220 675294 680850 686304 692662 700065 707479 713337 716271 715790 712616
$$ packed form
59807E86256j729j502r13o14r47j306j095p24q22j114j100j299k537m356n452
59792E60746n570n632n995n908m960l810l116k729k401k371k692k750k083j120
59778E09609n85n87p24p50o54m09k1K95M02N30R81J649K163K431K702K992K888
59761E22912K190J521J745K834L808M029L937M171M507M390M077M444N694P037
59747E77296P660P388O473N337M532M261L986L137K074J587J655J605J355J385
59733F29731J527J066J61j14N03R89P39M64P11Q30J64p32j057r46q72o77j23L64
59715F32728M04M26R16J531J698J446J003L29k92j5J369K771L167K851K562K320
59699F55214K041K423L939N603O074N556N454O358P403P414N858K934m81l174
$$ plain form
59685 712616 708040 702927 697705 693104 690098 689025 689371 690333 690911 689679 685707 679965 674765 671369 668876
59670 668876 665694 661177 655416 648429 640328 631741 623496 616221 610493 606795 604945 604060 603400 602875 602631
59655 602631 602751 603531 605444 608503 612180 616078 620156 624200 627689 630272 631786 631787 629807 626170 621831
59640 621831 617300 612419 607183 601942 596823 591864 587715 585144 583832 582760 581902 582275 584079 586139 587543
59625 587543 588523 589244 589096 587873 586295 584650 582197 578710 575295 572610 569533 564885 559445 554914 551664
59610 551664 548856 546206 544356 543808 544538 546382 548890 551111 552347 552824 553088 553222 553231 553429 553718 553220 551512
59593 551512 549576 548659 548896 549878 551721 554443 557075 558699 559799 561213 562255 561352 558338 554690 551458
59578 551458 548275 544517 540296 535982 531695 527526 523552 519516 515169 511000 507921 506132 504926 503655
$$ packed form
59685G12616m576n113n222m601l006j073L46R62N78j232l972n742n200l396k493
59670F68876l182m517n761o987q101q587q245p275n728l698j850q85o60n25k44
59655F02631J20P80J913L059L677L898M078M044L489K583J514Jj980l637m339
59640F21831m531m881n236n241n119m959m149k571j312j072q58L73J804K060J404
59625E87543R80P21j48j223j578j645k453l487l415k685l077m648n440m531l250
59610E51664k808k650j850n48P30J844K508K221J236M77K64J34RJ98K89m98j708
59593E51512j936r17K37R82J843K722K632J624J100J414J042r03l014l648l232
59578E51458l183l758m221m314m287m169l974m036m347m169l079j789j206j271
$$ plain form
59564 503655 502309 501160 500430 500300 500750 501405 501929 502336 502563 502213 501426 501485 503638 507474 511341 514290 516750
59547 516750 519370 522070 524493 526697 529125 532274 536519 542052 549090 558310 570807 587364 608031
59534 608031 632307 658627 683115 700196 706185 702326 693426 683792 675267 668481 664213 663155 665414
59521 665414 670646 678015 685998 692986 698246 701768 703408 702979 700958 698031 693902 687523 678601 667999
59507 667999 656572 644620 632687 621905 613015 605771 599634 594430 589975 585733 581292 576825 572872
59494 572872 570031 568867 569509 571236 573051 574803 577151 580351 583764 586800 589695 593057 597232 602428
59480 602428 608916 616721 625542 635367 646830 660691 677147 695746 715566 735162 752593 765836
59468 765836 773400 774836 770959 763469 753997 743572 733149 724191 718126 715422 715800 719215 725987 736043
$$ packed form
59564E03655j346j149p30j30M50O55N24M07K27l50p87N9K153L836L867K949K460
59547E16750K620K700K423K204K428L149M245N533P038R220J2497J6557K0667
59534F08031K4276K6320K4488J7081N989l859q900r634q525o786m268j058K259
59521F65414N232P369P983O988N260L522J640m29k021k927m129o379q922j0602
59507F67999j1427j1952j1933j0782q890p244o137n204m455m242m441m467l953
59494E72872k841j164O42J727J815J752K348L200L413L036K895L362M175N196
59480F02428O488P805Q821R825J1463J3861J6456J8599J9820J9596J7431J3243
59468G65836P564J436l877p490r472j0425j0423q958o065k704L78L415O772J0056
$$ plain form
59454 736043 748711 763331 779488 796689 814459 832887 852467 873329 895136 917671 940628
59443 940628 962400 979749 989314 989487 980864 965474 945880 924649 903998 885471 869519 855274
59431 855274 841144 826121 810394 794398 777740 759826 741374 724507 711172 702007 696818 695538
59419 695538 698432 705754 717426 732976 751829 773801 799188 828353 861678 899719 941899 983758
59407 983758 1016455 1031128 1024730 1001436 968969 934523 903357 878873 862899 856702 861808 878148
59395 878148 900508 918431 921733 906630 876588 838382 798223 760343 726902 698282 674082 654183
59383 654183 638650 626816 617294 609123 602395 597499 594182 591710 589749 588672 588923 590263 591816 592870
59369 592870 593487 594277 595680 597638 599898 602463 605616 609552 614025 618477 622665 627133 632784 639985 648405
$$ packed form
59454G36043J2668J4620J6157J7201J7770J8428J9580K0862K1807K2535K2957
59443I40628K1772J7349R565J73q623j5390j9594k1231k0651j8527j5952j4245
59431H55274j4130j5023j5727j5996j6658j7914j8452j6867j3335r165n189j280
59419F95538K894P322J1672J5550J8853K1972K5387K9165L3325L8041M2180M1859
59407I83758L2697J4673o398k3294l2467l4446l1166k4484j5974o197N106J6340
59395H78148K2360J7923L302j5103l0042l8206m0159l7880l3441k8620k4200j9899
59383F54183j5533j1834r522q171o728m896l317k472j961j077K51J340J553J054
59369E92870O17P90J403J958K260K565L153L936M473M452M188M468N651P201Q420
$$ plain form
59354 648405 657778 668399 680638 694400 709438 725880 744059 764065 785771 809057 833701 859343
59342 859343 885787 912906 939968 965526 988415 1008290 1024695 1036314 1041971 1041955 1037529 1029492 1018025
59329 1018025 1003534 986599 967331 945788 922940 900206 878066 856120 834593 814739 797506
59318 797506 782636 769344 757165 745913 735593 726559 719086 712607 706099 699405 693479 689096 686103
59305 686103 684215 683784 685308 688736 693642 699713 706847 715293 726011 740427 759484 782952 809316
59292 809316 835649 857689 871165 873899 866720 852457 834439 815603 797986 782503 769430 759091
59280 759091 751639 746445 742579 740062 739911 742766 748141 755196 763575 773246 784124 796149 809309 823440
59266 823440 838313 853723 868889 882032 891475 897132 900024 900292 896704 888316 875644 859978 842551
$$ packed form
59354F48405R373J0621J2239J3762J5038J6442J8179K0006K1706K3286K4644K5642
59342H59343K6444K7119K7062K5558K2889J9875J6405J1619N657j6m426q037j1467
59329A018025j4491j6935j9268k1543k2848k2734k2140k1946k1527j9854j7233
59318G97506j4870j3292j2179j1252j0320r034p473o479o508o694n926m383k993
59305F86103j888m31J524L428M906O071P134Q446J0718J4416J9057K3468K6364
59292H09316K6333K2040J3476K734p179j4263j8018j8836j7617j5483j3073j0339
59280G59091p452n194l866k517j51K855N375P055Q379R671J0878J2025J3160J4131
59266H23440J4873J5410J5166J3143R443N657K892K68l588q388j2672j5666j7427
$$ plain form
59253 842551 824645 807402 790904 774342 757694 742423 729867 719726 710853 702834 695995 690420
59241 690420 685947 682951 682314 684447 688693 693778 698753 703559 708722 714417 720038 724935 729190 733140
59227 733140 736412 738172 738063 736066 731701 724457 715021 704937 694863 684208 672675 661087 650363
59214 650363 640770 632534 626036 620938 616232 611792 608854 608285 609325 610765 612428 614703 617463 620321
59200 620321 623361 626838 630708 635046 640228 646042 651302 655144 658071 661047 664156 666932 669440 672190
59186 672190 675358 678769 682297 685808 689179 692845 697658 703608 709376 713796 717166 720414 723669 726539
59172 726539 729212 732315 736018 740043 744318 748969 754032 759735 766619 774753 783288 791485 799626 808173
59158 808173 816472 823182 827578 829661 829272 826026 820006 811773 801737 790117 777413 764435 751967
$$ packed form
59253H42551j7906j7243j6498j6562j6648j5271j2556j0141q873q019o839n575
59241F90420m473k996o37K133M246N085M975M806N163N695N621M897M255L950
59227G33140L272J760j09j997m365p244r436j0084j0074j0655j1533j1588j0724
59214F50363r593q236o498n098m706m440k938n69J040J440J663K275K760K858
59200F20321L040L477L870M338N182N814N260L842K927K976L109K776K508K750
59186F72190L168L411L528L511L371L666M813N950N768M420L370L248L255K870
59172G26539K673L103L703M025M275M651N063N703O884Q134Q535Q197Q141Q547
59158H08173Q299O710M396K083l89l246o020q233j0036j1620j2704j2978j2468
$$ plain form
59145 751967 740724 731295 723593 716664 709531 702087 694859 688308 682748 678455 675366 673072 671505 671121
59131 671121 671945 673080 673698 674013 674663 675753 677141 679134 682069 685652 689502 693939 699513 706079 713148
59116 713148 720873 729902 740374 751677 763085 774156 784730 795026 805477 816060 826050 834694
59104 834694 841770 847270 851239 854236 857141 859950 861561 861357 860133 858716 856570 852772 847572 841891
59090 841891 836008 829983 824768 821399 819278 816568 812335 807240 802096 796753 790532 782920 773779 763586
59076 763586 753398 743950 734847 725337 715651 706788 699143 692160 685295 678524 671932 665541 659618 654580
59062 654580 650544 647350 644814 642587 640103 637205 634394 631905 629058 625269 621198 617995 615813 614044
59048 614044 612673 612283 612818 613430 613657 613918 614726 616092 617782 619499 620802 621381 621410 621274 621120 621049 621348 622022
$$ packed form
59145G51967j1243r429p702o929p133p444p228o551n560m293l089k294j567l84
59131F71121Q24J135O18L15O50J090J388J993K935L583L850M437N574O566P069
59116G13148P725R029J0472J1303J1408J1071J0574J0296J0451J0583R990Q644
59104H34694P076N500L969K997K905K809J611k04j224j417k146l798n200n681
59090H41891n883o025n215l369k121k710m233n095n144n343o221p612r141j0193
59076G63586j0188r448r103r510r686q863p645o983o865o771o592o391n923n038
59062F54580m036l194k536k227k484k898k811k489k847l789m071l203k182j769
59048F14044j371l90N35O12K27K61Q08J366J690J717J303N79K9j36j54p1K99O74
$$ plain form
59030 622022 622576 622978 624360 627969 633801 641007 649273 658919 670028 682426 696246 711636 728122
59017 728122 745002 761941 778333 792630 803448 811032 816456 819652 819473 815559 808971 801037 792757
59004 792757 785298 779809 776511 774974 775368 778373 783785 790300 796899 803430 809673 814934 818951 822263
58990 822263 825267 827656 829072 829545 828982 826894 822965 817359 810348 802279 794043 786921 781726 778485 776952
58975 776952 776888 777947 779924 783140 788091 794897 803570 814369 827115 840624 853835 867160 881592
58962 881592 896760 911157 924191 936604 948682 959347 967429 972625 974745 973028 966888 956629
58950 956629 943038 926865 909013 890506 871930 853461 835582 819173 804811 792624 782849 775758
58938 775758 770965 767594 765193 763737 762740 761262 758886 755835 752062 747188 741464 735804 730637 725613
$$ packed form
59030F22022N54M02J382L609N832P206Q266R646J1109J2398J3820J5390J6486
59017G28122J6880J6939J6392J4297J0818P584N424L196j79l914o588p934q280
59004G92757p459n489l298j537L94L005N412O515O599O531O243N261M017L312
58990H22263L004K389J416M73n63k088l929n606p011q069q236p122n195l241j533
58975G76952o4J059J977L216M951O806Q673J0799J2746J3509J3211J3325J4432
58962H81592J5168J4397J3034J2413J2078J0665Q082N196K120j717o140j0259
58950I56629j3591j6173j7852j8507j8576j8469j7879j6409j4362j2187r775p091
58938G75758m793l371k401j456r97j478k376l051l773m874n724n660n167n024
$$ plain form
58924 725613 720647 716270 712617 709032 705115 701395 698547 696573 695076 693745 692385 691076 690391 690850 692157
58909 692157 693679 695600 698671 702897 707628 713101 720770 731726 745706 761917 779777 798452 816699
58896 816699 833804 849905 865004 878492 890144 900866 911952 924263 938486 955406 975379
58885 975379 997967 1022376 1047687 1072480 1095010 1114135 1129512 1140790 1147361 1149127 1146716 1140537
58873 1140537 1130297 1115744 1097296 1075777 1052237 1028178 1005159 983858 964103 945891 929579
58862 929579 914969 901178 887728 874995 863312 852440 842158 832560 823456 814260 804802 795558
58850 795558 786853 778593 770875 764033 757887 751784 745514 739335 733042 726071 718696 711917 705785 699012
58836 699012 690774 681875 673554 666109 659288 653165 647897 643350 639555 636932 635535 634725 634038 633792 634463
$$ packed form
58924G25613m966m377l653l585l917l720k848j974j497j331j360j309o85M59J307
58909F92157J522J921L071M226M731N473P669J0956J3980J6211J7860J8675J8247
58896H16699J7105J6101J5099J3488J1652J0722J1086J2311J4223J6920J9973
58885I75379K2588K4409K5311K4793K2530J9125J5377J1278O571J766k411o179
58873A140537j0240j4553j8448k1519k3540k4059k3019k1301j9755j8212j6312
58862I29579j4610j3791j3450j2733j1683j0872j0282r598r104r196r458r244
58850G95558q705q260p718o842o146o103o270o179o293o971p375o779o132o773
58836F99012q238q899q321p445o821o123n268m547l795k623j397q10o87k46O71
$$ plain form
58821 634463 636044 638337 641243 644523 647894 651490 655596 659870 663629 666888 670127 673017 674564 674710
58807 674710 674581 674781 674630 673579 672196 671132 670115 668551 666260 663145 659066 654516 650457 646991 643104
58792 643104 638178 632814 627754 623065 618839 615671 613871 613209 613941 616984 622443 629010 635483 641979 649039
58777 649039 656558 664283 672375 680693 688333 694448 698731 700619 699086 693910 686291 677630 668579 659680
58763 659680 651748 644902 638255 631347 624962 619909 615977 612814 610804 610335 611092 612775 615565 619215 622686
58748 622686 625388 627841 630466 632861 634998 638010 642885 649339 656753 665142 674360 683470 691921 700378
58734 700378 709485 718766 727695 736758 746411 755996 764828 773404 782295 790576 796628 800006 801419 801368 799857
58719 799857 797151 793956 790964 788707 787485 787165 787611 789424 793413 799146 805064 810199 814558 817579 817853
$$ packed form
58821F34463J581K293K906L280L371L596M106M274L759L259L239K890J547J46
58807F74710j29K00j51j051j383j064j017j564k291l115m079m550m059l466l887
58792F43104m926n364n060m689m226l168j800o62P32L043N459O567O473O496P060
58777F49039P519P725Q092Q318P640O115M283J888j533n176p619q661r051q899
58763F59680p932o846o647o908o385n053l932l163k010m69P57J683K790L650L471
58748F22686K702K453K625K395K137L012M875O454P414Q389R218R110Q451Q457
58734G00378R107R281Q929R063R653R585Q832Q576Q891Q281O052L378J413n1j511
58719G99857k706l195k992k257j222l20M46J813L989N733N918N135M359L021K74
$$ plain form
58704 817853 815026 810491 805331 798945 790447 779951 767519 752378 734403 715164 696415 678636
58692 678636 661924 646946 633906 621972 610839 601548 594620 588770 582663 576544 570899 565064 558639
58679 558639 552834 548762 545667 542483 539896 539137 539828 540788 541968 543981 546674 549868 554524 561458 569772
58664 569772 578249 587499 599030 612848 627417 641104 652245 658884 660296 658137 654578 650077 644305
58651 644305 638065 632471 627212 621449 615623 610627 606076 601165 596309 592156 587948 582784 577644 574102
58637 574102 571870 569723 568056 568356 570757 574243 578612 583963 588751 590771 589944 588083 586220 584271 582989
58622 582989 583904 587182 591502 596142 601428 607264 613139 619541 627532 636894 646491 656340 667427 679400
58608 679400 690241 698451 704111 707786 709822 710665 710523 708902 705723 702399 700212 698234 694519 688913
$$ packed form
58704H17853k827m535n160o386q498j0496j2432j5141j7975j9239j8749j7779
58692F78636j6712j4978j3040j1934j1133r291o928n850o107o119n645n835o425
58679E58639n805m072l095l184k587p59O91R60J180K013K693L194M656O934Q314
58664E69772Q477R250J1531J3818J4569J3687J1141O639J412k159l559m501n772
58651F44305o240n594n259n763n826m996m551m911m856m153m208n164n140l542
58637E74102k232k147j667L00K401L486M369N351M788K020q27j861j863j949j282
58622E82989R15L278M320M640N286N836N875O402P991R362R597R849J1087J1973
58608F79400J0841Q210N660L675K036Q43j42j621l179l324k187j978l715n606
$$ plain form
58594 688913 682913 677282 671738 666623 662886 660643 659520 660100 663210 668189 673865 680856 690824 703668
58580 703668 717536 731394 745525 759635 772606 784046 794068 801718 805796 807296 808943 812218
58568 812218 816793 822811 831540 843623 858683 876813 898578 923483 950422 979568 1011774 1045990
58556 1045990 1079321 1109648 1136234 1157876 1172882 1181260 1184896 1185261 1182786 1178406 1173477 1167861 1160222
58543 1160222 1150523 1140196 1129627 1117464 1102695 1085416 1065399 1042054 1016134 989461 962718
58532 962718 935484 908593 884255 863506 845561 829943 817187 807217 799208 793293 790325 789698 789583
58519 789583 789582 790920 793768 796638 798763 800780 802769 803964 804804 806820 809910 812038 812195 811430 810437 808468
58503 808468 805293 802016 799235 796412 793529 791278 789249 786084 781782 777660 773901 769643 765678 764193
$$ packed form
58594F88913o000n631n544n115l737k243j123N80L110M979N676O991R968J2844
58580G03668J3868J3858J4131J4110J2971J1440J0022P650M078J500J647L275
58568H12218M575O018Q729J2083J5060J8130K1765K4905K6939K9146L2206L4216
58556A045990L3331L0327K6586K1642J5006Q378L636L65k475m380m929n616p639
58543A160222r699j0327j0569j2163j4769j7279k0017k3345k5920k6673k6743
58532I62718k7234k6891k4338k0749j7945j5618j2756r970q009n915k968o27j15
58519G89583jJ338K848K870K125K017J989J195Q40K016L090K128J57p65r93j969
58503H08468l175l277k781k823k883k251k029l165m302m122l759m258l965j485
$$ plain form
58489 764193 765360 767014 768396 771322 776703 782813 788302 794401 802903 814177 828242 845586 865811
58476 865811 887481 910008 933539 956436 975479 989269 998894 1004550 1004411 997932 987450 975217
58464 975217 961418 946338 931795 918960 907170 896343 888278 884197 883222 884535 888851 896590 906827
58451 906827 919028 933442 948668 961345 969448 973534 973819 968845 958410 945148 931649 918295
58439 918295 905202 893695 884453 876597 870013 866195 865565 866476 868002 871073 875689 880002 883629 888990
58425 888990 897714 908508 920126 933535 949262 965351 979742 992114 1001724 1006344 1005358 1001290 996375
58412 996375 990106 981790 972703 963805 954125 943354 933287 924746 915895 905637 895928 888661 882981
58399 882981 877748 873899 872236 871631 871515 873427 877988 883161 887541 892417 898452 903411 905568 906405 907544
$$ packed form
58489G64193J167J654J382K926N381O110N489O099Q502J1274J4065J7344K0225
58476H65811K1670K2527K3531K2897J9043J3790R625N656j39o479j0482j2233
58464I75217j3799j5080j4543j2835j1790j0827q065m081r75J313M316P739J0237
58451I06827J2201J4414J5226J2677Q103M086K85m974j0435j3262j3499j3354
58439I18295j3093j1507r242p856o584l818o30R11J526L071M616M313L627N361
58425H88990Q724J0794J1618J3409J5727J6089J4391J2372R610M620r86m068m915
58412I96375o269q316r087q898r680j0771j0067q541q851j0258r709p267n680
58399H82981n233l849j663o05j16J912M561N173M380M876O035M959K157Q37J139
$$ plain form
58384 907544 908026 907004 906039 906173 905775 903893 902620 903451 904483 904117 904396 907557 912277 916512 921210 928057
58368 928057 936252 944658 954452 966618 979540 992074 1006141 1023203 1041135 1057800 1074691 1093599
58356 1093599 1112583 1128821 1142711 1155563 1165939 1171954 1174750 1176207 1175723 1172664 1169439 1168680 1169811
58343 1169811 1171604 1175288 1181865 1189322 1196054 1204140 1215721 1229152 1242330 1256660 1273941 1292495
58331 1292495 1310252 1328446 1348243 1367092 1382599 1396668 1411356 1424018 1431332 1434926 1438225 1440839
58319 1440839 1441063 1440885 1443266 1447035 1449544 1451824 1456299 1462062 1467320 1473839 1484044 1496425 1508662 1522366
58305 1522366 1539753 1558681 1576151 1593619 1613605 1634250 1652810 1671272 1692704 1715199 1735366
58294 1735366 1754737 1776611 1799640 1820819 1841824 1866014 1891999 1916562 1941019 1968206 1996260
$$ packed form
58384I07544M82j022r65J34l98j882j273Q31J032l66K79L161M720M235M698O847
58368I28057Q195Q406R794J2166J2922J2534J4067J7062J7932J6665J6891J8908
58356A093599J8984J6238J3890J2852J0376O015K796J457m84l059l225p59J131
58343A169811J793L684O577P457O732Q086J1581J3431J3178J4330J7281J8554
58331A292495J7757J8194J9797J8849J5507J4069J4688J2662P314L594L299K614
58319A440839K24j78K381L769K509K280M475N763N258O519J0205J2381J2237J3704
58305A522366J7387J8928J7470J7468J9986K0645J8560J8462K1432K2495K0167
58294A735366J9371K1874K3029K1179K1005K4190K5985K4563K4457K7187K8054
$$ plain form
58283 1996260 2022078 2047939 2077783 2109923 2140448 2170735 2204252 2238959 2270539 2300411 2332925
58272 2332925 2367420 2400852 2435489 2475850 2520573 2565350 2611407 2663021 2719345 2777055 2838398
58261 2838398 2908019 2984283 3062221 3142296 3227432 3314195 3396153 3473472 3550248 3625378 3695617
58250 3695617 3764607 3838941 3918112 3998163 4081934 4175177 4275950 4378936 4486942 4606586
58240 4606586 4735935 4868391 5005619 5154157 5312428 5474137 5641611 5822421 6015674
58231 6015674 6215343 6424268 6650697 6894028 7148749 7419468 7716622 8040179 8383454
58222 8383454 8749967 9149934 9583317 10043832 10536627 11074074 11657627 12282961 12959421
58213 12959421 13704451 14523039 15414195 16393458 17486299 18704454 20054028 21562727 23273472
$$ packed form
58283A996260K5818K5861K9844L2140L0525L0287L3517L4707L1580K9872L2514
58272B332925L4495L3432L4637M0361M4723M4777M6057N1614N6324N7710O1343
58261B838398O9621P6264P7938Q0075Q5136Q6763Q1958P7319P6776P5130P0239
58250C695617O8990P4334P9171Q0051Q3771R3243J00773J02986J08006J19644
58240D606586J29349J32456J37228J48538J58271J61709J67474J80810J93253
58231F015674J99669K08925K26429K43331K54721K70719K97154L23557L43275
58222H383454L66513L99967M33383M60515M92795N37447N83553O25334O76460
58213A2959421P45030Q18588Q91156R79263J092841J218155J349574J508699J710745
$$ plain form
58204 23273472 25217853 27426459 29961612 32910549 36354762 40383196 45133275 50787898
58196 50787898 57547037 65649085 75416147 87245535 101592126 119030331 140319316
58189 140319316 166345974 198017496 236141489 280909076 330639614 380516449 422937558
58182 422937558 450160576 457710548 446090102 419840591 385126573 347532526 310827504
58175 310827504 276676474 245158315 215782195 188341016 163083489 140377759 120418394
58168 120418394 103200519 88579691 76288511 65984102 57346734 50121799 44080329
58161 44080329 39000052 34701012 31056967 27958442 25297898 22996370 21007701 19285055
58153 19285055 17770551 16422774 15224967 14158314 13192134 12305989 11496931 10758537 10074640
$$ packed form
58204B3273472J944381K208606K535153K948937L444213M028434M750079N654623
58196E0787898O759139Q102048R767062J1829388J4346591J7438205K1288985
58189A40319316K6026658L1671522L8123993M4767587M9730538M9876835M2421109
58182D22937558K7223018P549972j1620446k6249511l4714018l7594047l6705022
58175C10827504l4151030l1518159k9376120k7441179k5257527k2705730j9959365
58168A20418394j7217875j4620828j2291180j0304409q637368p224935o041470
58161D4080329n080277m299040l644045l098525k660544k301528j988669j722646
58153A9285055j514504j347777j197807j066653r66180q86145q09058p38394o83897
$$ plain form
58144 10074640 9438852 8858792 8335056 7854925 7411237 7008756 6647345 6316659 6011844
58135 6011844 5737301 5490285 5256824 5028517 4808718 4598763 4393187 4192362 4005135
58126 4005135 3834354 3672988 3518123 3375595 3247158 3126159 3009882 2903685 2808837 2718286
58116 2718286 2628616 2544760 2468754 2394913 2320473 2250501 2188002 2128936 2071050 2018114 1971386
58105 1971386 1925868 1878792 1833253 1790153 1745251 1697596 1652391 1612059 1572549 1531625 1492703
58094 1492703 1457218 1421228 1383022 1346582 1314224 1283077 1251958 1224489 1202291 1182032 1162115
58083 1162115 1145337 1132127 1118133 1101464 1085524 1071858 1057016 1039406 1022346 1007233 990447
58072 990447 970377 950929 934577 918210 899464 881149 865756 851282 836165 822964 813495 805360
$$ packed form
58144A0074640o35788n80060n23736m80131m43688m02481l61411l30686l04815
58135F011844k74543k47016k33461k28307k19799k09955k05576k00825j87227
58126D005135j70781j61366j54865j42528j28437j20999j16277j06197r4848r0551
58116B718286q9670q3856p6006p3841p4440o9972o2499n9066n7886n2936m6728
58105A971386m5518m7076m5539m3100m4902m7655m5205m0332l9510m0924l8922
58094A492703l5485l5990l8206l6440l2358l1147l1119k7469k2198k0259j9917
58083A162115j6778j3210j3994j6669j5940j3666j4842j7610j7060j5113j6786
58072I90447k0070j9448j6352j6367j8746j8315j5393j4474j5117j3201r469q135
$$ plain form
58060 805360 796724 789682 785638 782020 776596 770473 764089 755039 742826 731089 722154 713793 704076 694882
58046 694882 687842 681305 674213 668629 665549 662329 656996 651173 646290 640973 634554 629000 624962 620011
58032 620011 613175 606990 602651 597386 589118 579594 570476 560554 549421 539647 532591 526043 518601 512279
58018 512279 508233 504103 498445 493658 491544 489998 487116 484657 484200 483672 481072 478244 477584 478155 478125 478005
58002 478005 478488 478107 476024 474150 473803 473285 471549 471036 473839 478093 481168 483576 486670 489341 490121 490030
57986 490030 490424 490435 489256 488375 488795 488582 485886 481957 478526 474785 469659 464549 461037 458207 454875 452061
57970 452061 450696 449350 446868 444790 444558 444780 443931 443156 443664 443972 442754 442003 444202 448450 452364 455758
57954 455758 459512 462820 464549 465603 467185 468489 468616 468828 470343 471994 472690 474009 477571 482022 485524
$$ packed form
58060H05360q636p042m044l618n424o123o384r050j2213j1737q935q361r717r194
58046F94882p040o537p092n584l080l220n333n823m883n317o419n554m038m951
58032F20011o836o185m339n265q268r524r118r922j1133r774p056o548p442o322
58018E12279m046m130n658m787k114j546k882k459m57n28k600k828o60N71l0j20
58002D78005M83l81k083j874l47n18j736n13K803M254L075K408L094K671P80r1
57986D90030L94J1j179q81M20k13k696l929l431l741n126n110l512k830l332k814
57970D52061j365j346k482k078k32K22q49p75N08L08j218p51K199M248L914L394
57954D55758L754L308J729J054J582J304J27K12J515J651O96J319L562M451L502
$$ plain form
57939 485524 489099 494534 501065 507284 514333 523875 534663 544409 553483 563417 573264 580736 585716 589328
57925 589328 590704 587951 581458 573183 563544 551937 539417 527880 517221 506047 494506 483785
57913 483785 473628 463065 452906 444897 438958 433711 429158 426459 425651 425873 427151 429765 432533 433963
57899 433963 434436 435124 435597 434609 432484 430555 429038 427523 426661 427219 428302 428720 429231 431273 434354 436904
57883 436904 438816 440904 442696 443015 441998 440435 437881 433586 428380 423413 417956 410770 402781 395888
57869 395888 389847 382847 374772 367460 362053 358221 355723 354649 354467 354653 355914 359047 363249 367250 371355
57854 371355 376489 382114 387093 391806 397384 403596 409372 414585 419391 422843 424285 425060 426642 428041
57840 428041 427356 424844 422053 418983 414779 410328 407316 405343 402797 400123 399466 401341 404321 407755 412150
$$ packed form
57939D85524L575N435O531O219P049R542J0788R746R074R934R847P472M980L612
57925E89328J376k753o493q275r639j1607j2520j1537j0659j1174j1541j0721
57913D83785j0157j0563j0159q009n939n247m553k699q08K22J278K614K768J430
57899D33963M73O88M73r88k125j929j517j515q62N58J083M18N11K042L081K550
57883D36904J912K088J792L19j017j563k554m295n206m967n457p186p989o893
57869C95888o041p000q075p312n407l832k498j074j82J86J261L133M202M001M105
57854C71355N134N625M979M713N578O212N776N213M806L452J442P75J582J399
57840D28041o85k512k791l070m204m451l012j973k546k674o57J875K980L434M395
$$ plain form
57825 412150 417035 421168 424878 429804 436199 442695 448574 454025 458414 460732 461565 462377 463148 463087 463148 464975
57809 464975 467474 467361 463258 456562 448155 437345 424637 412652 403185 395616 389041 383737 379627 375430
57795 375430 370450 365558 361568 358146 354924 352253 350327 348924 348342 349227 351402 354211 357876 362948 368687
57780 368687 373849 378835 385145 392876 400899 409275 419122 429964 439656 447272 453732 459237 462453 462822
57766 462822 461379 458599 453600 446238 437890 429382 420096 409870 399835 390535 381167 371464 362489 354719
57752 354719 347241 339781 333705 329992 327847 326347 325900 327017 329084 331311 333603 335714 336840 336823 336496
57737 336496 336226 335528 334693 335217 337767 341148 344047 346417 348354 349098 348147 346170 343881 341129 337860 334938
57721 334938 333223 332802 333694 336208 339980 343730 346617 349042 351724 354876 358468 362168 364899 365664 365015
$$ packed form
57825D12150M885M133L710M926O395O496N879N451M389K318Q33Q12P71o1O1J827
57809D64975K499j13m103o696q407j0810j2708j1985r467p569o575n304m110m197
57795C75430m980m892l990l422l222k671j926j403n82Q85K175K809L665N072N739
57780C68687N162M986O310P731Q023Q376R847J0842R692P616O460N505L216L69
57766D62822j443k780m999p362q348q508r286j0226j0035r300r368r703q975p770
57752C54719p478p460o076l713k145j500m47J117K067K227K292K111J126j7l27
57737C36496k70o98q35N24K550L381K899K370J937P44r51j977k289k752l269k922
57721C34938j715m21Q92K514L772L750K887K425K682L152L592L700K731P65o49
$$ plain form
57706 365015 364406 364044 362843 360622 358667 357816 357678 358111 359748 362535 365474 368379 372202 377031 381421
57691 381421 384324 385953 386151 383843 378985 373260 367844 362247 356332 351629 349312 348540 348254 349264 353122
57676 353122 360174 370103 383307 400447 421649 447487 479953 521407 573477 637822 716461 809078
57664 809078 909529 1005413 1081146 1122726 1122871 1084315 1018025 937089 851782 769147 694228 629674
57652 629674 575253 529427 491212 459977 434699 414590 399645 389527 382600 376988 371884 367127
57640 367127 362405 357682 353518 350145 347036 344034 341902 340997 340490 339736 339321 339744 340134 339391 337766 336225
57624 336225 334973 333551 331733 329448 326509 323193 320346 318282 316400 314513 313446 313488 313382 311913 309627
57609 309627 307937 307259 306946 306351 305090 303008 300652 299072 298543 298350 298325 299397 301916 304707 306727 308356
$$ packed form
57706C65015o09l62j201k221j955q51j38M33J637K787K939K905L823M829M390
57691C81421K903J629J98k308m858n725n416n597n915m703k317p72k86J010L858
57676C53122P052R929J3204J7140K1202K5838L2466M1454N2070O4345P8639R2617
57664H09078J00451R5884P5733M1580J45l8556o6290q0936q5307q2635p4919o4554
57652F29674n4421m5826l8215l1235k5278k0109j4945j0118o927n612n104m757
57640C67127m722m723m164l373l109l002k132r05n07p54m15M23L90p43j625j541
57624C36225j252j422j818k285k939l316k847k064j882j887j067M2j06j469k286
57609C09627j690o78l13n95j261k082k356j580n29j93k5J072K519K791K020J629
$$ plain form
57593 308356 309998 310712 309546 307163 304840 302817 300909 299736 299857 300541 300795 300909 301596 302294 301790 300063
57577 300063 298145 296574 295222 294224 293821 293631 293133 292508 292052 291297 289817 288352 287955 288460 288898 289014 289237
57560 289237 289549 289566 289526 290127 291579 293624 296173 299119 301974 304567 307608 311716 316407 320999 325871 331695
57544 331695 337870 342970 346520 349273 351974 354848 358111 362008 366399 370979 375654 379998 382759 382849 380617
57529 380617 377408 374119 370864 367749 365189 363579 363067 363336 363372 362108 359786 357880 357176 356792 355745 354466
57513 354466 353874 353937 354155 354553 355085 354977 353897 353016 353591 355121 356237 356771 357536 358542 358980 358764 358639 358798
57495 358798 358598 357670 356309 354810 353284 351976 350923 349479 347041 344045 341473 339667 338343 337410 336977
57480 336977 336919 337176 338048 339532 340925 341873 343069 345118 347399 349041 350222 351498 352607 353205 354027 355986
$$ packed form
57593C08356J642P14j166k383k323k023j908j173J21O84K54J14O87O98n04j727
57577C00063j918j571j352r98m03j90m98o25m56p55j480j465l97N05M38J16K23
57560B89237L12J7m0O01J452K045K549K946K855K593L041M108M691M592M872N824
57544C31695O175N100L550K753K701K874L263L897M391M580M675M344K761R0k232
57529C80617l209l289l255l115k560j610n12K69L6j264k322j906p04l84j047j279
57513C54466n92O3K18L98N32j08j080q81N75J530J116N34P65J006M38k16j25J59
57495C58798k00r28j361j499j526j308j053j444k438k996k572j806j324r33m33
57480C36977n8K57Q72J484J393R48J196K049K281J642J181J276J109N98Q22J959
$$ plain form
57464 355986 358652 360974 363072 366023 370263 375367 380901 386329 390673 393585 396208 399629 403051 405050
57450 405050 406071 407904 410934 413661 415002 415522 416257 417693 420043 423243 426527 429111 431313 434015 437270
57435 437270 440535 443953 448058 452454 456182 459256 462431 465594 467855 469209 470669 472643 474552 476205
57421 476205 478248 481082 484507 488453 492876 496995 499908 501972 504308 507021 509276 511080 513433 516658
57407 516658 520080 523549 527731 532540 536771 539728 541982 544207 546521 549286 553184 558088 563040 567699
57393 567699 572627 577929 582930 587595 592919 599439 606604 614058 622226 631058 639458 646643 653071 659434
57379 659434 665661 671485 677046 682458 687601 692737 698444 704627 710460 715543 720141 724210 727376 730130
57365 730130 733783 738806 744383 750029 756318 763527 770860 777784 784966 793026 801375 809116 816343 823711
$$ packed form
57464C55986K666K322K098K951M240N104N534N428M344K912K623L421L422J999
57450D05050J021J833L030K727J341N20P35J436K350L200L284K584K202K702L255
57435D37270L265L418M105M396L728L074L175L163K261J354J460J974J909J653
57421D76205K043K834L425L946M423M119K913K064K336K713K255J804K353L225
57407E16658L422L469M182M809M231K957K254K225K314K765L898M904M952M659
57393E67699M928N302N001M665N324O520P165P454Q168Q832Q400P185O428O363
57379F59434O227N824N561N412N143N136N707O183N833N083M598M069L166K754
57365G30130L653N023N577N646O289P209P333O924P182Q060Q349P741P227P368
$$ plain form
57351 823711 831346 838848 845862 852270 858376 865119 873326 882493 891126 898503 905331 912450 919905 927484
57337 927484 935124 942492 949235 955958 963861 973071 982429 991257 1000108 1009405 1018675 1027724 1037254 1047579
57323 1047579 1057846 1067342 1076493 1085916 1095523 1105301 1115879 1127456 1139158 1150318 1161521 1173624
57311 1173624 1186598 1200074 1214114 1228613 1242848 1256489 1270264 1284842 1299868 1314851 1330123
57300 1330123 1346046 1362105 1377758 1393437 1409782 1426548 1443198 1459915 1477059 1494209 1510740
57289 1510740 1526993 1543924 1561853 1580227 1598398 1616112 1633543 1651244 1669709 1688634 1707134
57278 1707134 1724889 1742453 1760256 1778198 1796473 1815684 1835642 1855249 1874258 1894025 1915594
57267 1915594 1938121 1960255 1982140 2004809 2028288 2051533 2073875 2095484 2116768 2138223 2160626
$$ packed form
57351H23711P635P502P014O408O106O743Q207R167Q633P377O828P119P455P579
57337I27484P640P368O743O723P903R210R358Q828Q851R297R270R049R530J0325
57323A047579J0267R496R151R423R607R778J0578J1577J1702J1160J1203J2103
57311A173624J2974J3476J4040J4499J4235J3641J3775J4578J5026J4983J5272
57300A330123J5923J6059J5653J5679J6345J6766J6650J6717J7144J7150J6531
57289A510740J6253J6931J7929J8374J8171J7714J7431J7701J8465J8925J8500
57278A707134J7755J7564J7803J7942J8275J9211J9958J9607J9009J9767K1569
57267A915594K2527K2134K1885K2669K3479K3245K2342K1609K1284K1455K2403
$$ plain form
57256 2160626 2184533 2209802 2236117 2263495 2291725 2319947 2347532 2374862 2402517 2430233 2457470
57245 2457470 2484442 2511708 2539132 2566087 2592418 2618512 2644635 2670816 2697156 2723806 2750900
57234 2750900 2778782 2807764 2837469 2867105 2896695 2927141 2958621 2989942 3020154 3049824 3079843
57223 3079843 3109815 3138558 3165468 3190452 3213312 3234303 3254806 3276412 3299595 3324012 3349473
57212 3349473 3375846 3402561 3429246 3456412 3484663 3513646 3542577 3571411 3600766 3631160 3663032
57201 3663032 3696856 3732406 3768419 3803869 3839073 3874823 3911019 3946949 3982199 4016352 4048501
57190 4048501 4078190 4106241 4133534 4159451 4182662 4203047 4221691 4239377 4256281 4272858 4289744
57179 4289744 4306886 4323813 4340768 4358597 4377598 4397342 4417500 4437925 4458036 4476968 4494324
$$ packed form
57256B160626K3907K5269K6315K7378K8230K8222K7585K7330K7655K7716K7237
57245B457470K6972K7266K7424K6955K6331K6094K6123K6181K6340K6650K7094
57234B750900K7882K8982K9705K9636K9590L0446L1480L1321L0212K9670L0019
57223C079843K9972K8743K6910K4984K2860K0991K0503K1606K3183K4417K5461
57212C349473K6373K6715K6685K7166K8251K8983K8931K8834K9355L0394L1872
57201C663032L3824L5550L6013L5450L5204L5750L6196L5930L5250L4153L2149
57190D048501K9689K8051K7293K5917K3211K0385J8644J7686J6904J6577J6886
57179D289744J7142J6927J6955J7829J9001J9744K0158K0425K0111J8932J7356
$$ plain form
57168 4494324 4510084 4524011 4535951 4546499 4556520 4566177 4575234 4584071 4593503 4603681 4613989 4624006
57156 4624006 4633799 4643310 4652170 4660171 4667412 4673973 4679751 4684356 4686893 4686377 4682841 4677470 4671071 4663001
57142 4663001 4652249 4639042 4624680 4610382 4596930 4584707 4573232 4561338 4548761 4537009 4527737
57131 4527737 4520798 4514760 4508623 4502077 4494792 4486686 4478351 4470097 4461095 4450611 4439547 4429641 4421777
57118 4421777 4416320 4414468 4417797 4426849 4441535 4462570 4491246 4528283 4574355 4631369 4701747 4786840
57106 4786840 4887559 5006402 5147603 5315986 5517635 5761790 6060782 6428675 6881925
57097 6881925 7441468 8132798 8984552 10028754 11301367 12838933 14672639 16825161 19309972
57088 19309972 22127934 25261584 28672606 32300651 36054962 39801120 43361419 46541813
$$ packed form
57168D494324J5760J3927J1940J0548J0021R657R057Q837R432J0178J0308J0017
57156D624006R793R511Q860Q001P241O561N778M605K537n16l536n371o399q070
57142D663001j0752j3207j4362j4298j3452j2223j1475j1894j2577j1752r272
57131D527737o939o038o137o546p285q106q335q254r002j0484j1064r906p864
57118D421777n457j852L329R052J4686K1035K8676L7037M6072N7014P0378Q5093
57106D786840J00719J18843J41201J68383K01649K44155K98992L67893M53250
57097F881925N59543O91330Q51754J044202J272613J537566J833706K152522K484811
57088A9309972K817962L133650L411022L628045L754311L746158L560299L180394
$$ plain form
57080 46541813 49173746 51146005 52413699 52988315 52916668 52254594 51045175 49313828 47082795
57071 47082795 44392688 41315224 37951213 34418788 30839364 27325553 23972227 20851124
57063 20851124 18009294 15470911 13240956 11309389 9655535 8252685 7071899 6083976
57055 6083976 5260179 4573442 4000058 3520341 3117741 2777908 2488689 2240411 2025593
57046 2025593 1838328 1673849 1528188 1398004 1280661 1174237 1077117 987772 905149 828921
57036 828921 758941 694769 636188 583672 537705 498012 464163 436581 416309 404180 400914 407714
57024 407714 426460 460359 514711 594103 694865 799747 883103 924022 915785 864990 784905
57013 784905 689873 591971 498762 413195 336077 268259 210354 161783 121232 87474 59068
$$ packed form
57080D6541813K631933J972259J267694N74616p1647o62074j209419j731347k231033
57071D7082795k690107l077464l364011l532425l579424l513811l353326l121103
57063B0851124k841830k538383k229955j931567j653854j402850j180786r87923
57055F083976q23797o86737n73384m79717m02600l39833k89219k48278k14818
57046B025593j87265j64479j45661j30184j17343j06424r7120q9345q2623p6228
57036H28921o9980o4172n8581n2516m5967l9693l3849k7582k0272j2129l266O800
57024D07714J8746L3899N4352P9392J00762J04882Q3356M0919q237n0795q0085
57013G84905r5032r7902r3209q5567p7118o7818n7905m8571m0551l3758k8406
$$ plain form
57002 59068 34174 11597 -8495 -25578 -39929 -52327 -63215 -72796 -81381 -89028 -95302 -99845 -102750
56989 -102750 -103960 -102845 -98758 -91537 -81137 -67299 -49919 -29432 -6927 15397 34027 45525
56977 45525 48729 45009 36379 24369 10661 -2737 -14716 -25419 -34807 -41891 -45978 -47551 -47147 -44420
56963 -44420 -39143 -32056 -23583 -12545 2770 22881 47329 75781 107237 138295 163561 178382
56951 178382 181042 172764 156419 135225 111919 88615 67082 48653 33722 21885 12845 6731
56939 6731 3477 2713 4633 10246 20307 34682 53260 76767 106047 140879 179570 218662 252455
56926 252455 274175 279310 268217 245153 215174 182245 149220 118140 90235 66106 45945 29382
56914 29382 15515 3584 -6535 -14744 -21286 -26703 -31542 -36254 -40874 -44655 -46570 -46458 -45148 -43298
$$ packed form
57002E9068k4894A1597h495j7083j4351j2398j0888r581q585p647o274m543k905
56989a02750j210J115M087P221J0400J3838J7380K0487f927A5397J8630J1498
56977D5525L204l720q630j2010A0661b737j1979j0703r388p084m087j573M04K727
56963d4420N277P087Q473J1038B770K0111K4448K8452L1456L1058K5266J4821
56951A78382K660q278j6345k1194k3306k3304k1533j8429j4931j1837r040o114
56939F731l254p64J920N613J0061J4375J8578K3507K9280L4832L8691L9092L3793
56926B52455K1720N135j1093k3064k9979l2929l3025l1080k7905k4129k0161j6563
56914B9382j3867C584f535q209o542n417m839m712m620l781j915J12J310J850
$$ plain form
56900 -43298 -40761 -37305 -33174 -28562 -23205 -16876 -9687 -1613 7686 18360 30337 44026 60211
56887 60211 79166 100754 125338 153032 181406 205347 220284 224870 220182 207783 189698 168934
56875 168934 148329 129190 112039 98064 88739 84492 84816 89344 97974 110448 126815 148047 175407
56862 175407 209543 250928 300697 359911 427547 499011 566032 618250 646865 648821 627847 591268
56850 591268 546164 498201 452020 410814 375891 347711 326995 314178 308677 309856 318239 334907
56838 334907 360472 395750 442798 504075 580889 673209 779373 893479 1002833 1090061 1139739
56827 1139739 1144584 1107371 1038684 952196 859717 768769 683667 607466 542141 488012 444528
56816 444528 411451 388587 375084 370235 374571 389070 413853 448913 495677 556202 630214 712947
$$ packed form
56900d3298K537L456M131M612N357O329P189a613G686J0674J1977J3689J6185
56887F0211J8955K1588K4584K7694K8374K3941J4937M586m688j2399j8085k0764
56875A68934k0605j9139j7151j3975r325m247L24M528Q630J2474J6367K1232K7360
56862A75407L4136M1385M9769N9214O7636P1464O7021N2218K8615J956k0974l6579
56850E91268m5104m7963m6181m1206l4923k8180k0716j2817n501J179Q383J6668
56838C34907K5565L5278M7048O1277P6814R2320J06164J14106J09354Q7228M9678
56827A139739M845l7213o8687q6488r2479r0948q5102p6201o5325n4129m3484
56816D44528l3077k2864j3503m849M336J4499K4783L5060M6764O0525P4012Q2733
$$ plain form
56804 712947 794922 863126 904331 910595 883037 829910 761160 685139 608736 537472 474337 419792
56792 419792 373526 335481 305233 281823 264739 254204 250252 252406 260499 275030 296596 325704
56780 325704 362765 406626 452413 491873 516957 523395 511467 484549 447342 404536 360073 317036
56768 317036 277497 241978 209564 179479 152452 129907 112129 97985 86182 75959 66788 58355
56756 58355 50814 44389 38793 33651 29109 25383 22163 19260 17236 16407 15795 14299 12399 11322 10887
56741 10887 9646 7088 4249 2119 835 447 1087 2109 2310 1348 0 -1052 -1690 -1640 -595 952 2106 2962
56723 2962 4355 6241 7588 8038 8302 8712 8779 8518 8789 9849 10861 11395 12167 13697 15402 16645 17672
56706 17672 18856 19997 20961 22127 23558 24615 24931 24992 25284 25684 26150 27177 29041 31267 33214 34511
$$ packed form
56804G12947Q1975O8204M1205O264k7558n3127o8750p6021p6403p1264o3135n4545
56792D19792m6266l8045l0248k3410j7084j0535l952K154Q093J4531K1566K9108
56780C25704L7061M3861M5787L9460K5084O438j1928k6918l7207m2806m4463m3037
56768C17036l9539l5519l2414l0085k7027k2545j7778j4144j1803j0223r171q433
56756E8355p541o425n596n142m542l726l220k903k024q29o12j496j900j077m35
56741A0887j241k558k839B119H35l88O40J022K01r62@a052o38N0e95I52J154Q56
56723B962J393J886J347M50K64M10O7k61K71J060J012N34P72J530J705J243J027
56706A7672J184J141R64J166J431J057L16O1K92M00M66J027J864K226J947J297
$$ plain form
56690 34511 34780 33878 32655 32437 33402 34421 34761 34846 35024 34854 34220 33905 34301 34593 33984 32805 31697 30619
56672 30619 29465 28733 28743 28913 28656 28254 28154 28104 27779 27551 27814 28158 28016 27594 27391 27293 26940 26580 26812 27812
56652 27812 29432 31704 34694 38150 41819 45803 50152 54407 57953 60576 62480 64124 66155 68934
56638 68934 71905 73997 74831 74904 74465 73085 70685 68048 65803 63696 61434 59448 58126 56901 54821
56623 54821 51597 47524 42915 38199 34118 31189 29216 27719 26438 25169 23650 22082 21307 22006 24040
56608 24040 26835 29976 33196 36337 39572 43179 46906 50145 52934 56060 59905 63869 67259 70065
56594 70065 72541 74714 76654 78591 80447 81880 82991 84278 85733 86817 87583 88850 90951 93288 95500
56579 95500 97963 100583 102174 101936 100697 99865 99860 100320 101126 102376 103845 105283 106836 108617 110313 111740
$$ packed form
56690C4511K69r02j223k18R65J019L40Q5J78j70o34l15L96K92o09j179j108j078
56672C0619j154p32J0J70k57m02j00n0l25k28K63L44j42m22k03r8l53l60K32J000
56652B7812J620K272K990L456L669L984M349M255L546K623J904J644K031K779
56638F8934K971K092Q34P3m39j380k400k637k245k107k262j986j322j225k080
56623E4821l224m073m609m716m081k929j973j497j281j269j519j568p75O99K034
56608B4040K795L141L220L141L235L607L727L239K789L126L845L964L390K806
56594G0065K476K173J940J937J856J433J111J287J455J084P66J267K101K337K212
56579I5500K463K620J591k38j239q32nM60Q06J250J469J438J553J781J696J427
$$ plain form
56563 111740 113300 115434 118194 121780 126882 133965 142680 152307 162067 170652 176425 178811 178965 178526 178235
56548 178235 178143 178354 178858 179237 179107 178450 177253 175477 173657 172609 172147 170968 168340 165040 162092 159493
56532 159493 156745 153748 150534 146991 143485 140909 139505 138475 137314 136513 136312 135880 134575 132949 131586
56517 131586 129932 127357 124436 122077 120140 118033 115958 114444 113274 111971 110843 110449 110481 110155 109358
56502 109358 108568 108082 108104 109123 111334 114093 116651 119031 121530 123880 125601 126710 127506 128134 128702 129205
56486 129205 129064 127731 126097 126041 127965 130099 130976 131189 131673 131888 131137 130325 130635 131492 131602 131219 131602 132863
56468 132863 134146 135511 137854 141058 143868 145580 146575 147207 147440 147499 147792 148202 148430 148878 150238 152381
56452 152381 154475 155955 156603 156154 154687 152960 151529 150149 148841 148655 150240 152476 153848 154460 155304
$$ packed form
56563A11740J560K134K760L586N102P083Q715R627R760Q585N773K386J54m39k91
56548A78235r2K11N04L79j30o57j197j776j820j048m62j179k628l300k948k599
56532A59493k748k997l214l543l506k576j404j030j161q01k01m32j305j626j363
56517A31586j654k575k921k359j937k107k075j514j170j303j128l94L2l26p97
56502A09358p90m86K2J019K211K759K558K380K499K350J721J109P96O28N68N03
56486A29205j41j333j634n6J924K134Q77K13M84K15p51q12L10Q57J10l83L83J261
56468A32863J283J365K343L204K810J712R95O32K33N9K93M10K28M48J360K143
56452A52381K094J480O48m49j467j727j431j380j308j86J585K236J372O12Q44
$$ plain form
56437 155304 156225 156216 155283 154438 154087 153875 153875 154497 155346 155545 155104 154732 154469 153725 152468 151132 149540 147195 144489
56418 144489 142372 140927 139441 137793 136638 136374 136989 138725 141780 145570 149331 153129 157189 160708 162612
56403 162612 163181 163621 164326 164805 164958 165088 164934 164085 163132 163094 163996 165300 167311 170592 174331 176940 178188
56386 178188 179210 180568 181948 183714 186932 191633 196580 201065 205508 210038 213837 216267 217480 217697
56372 217697 217037 216130 215748 215745 215474 215185 215788 217238 218437 218755 218458 217726 216547 215497 215268 215390 214711 213116
56354 213116 211533 210416 209534 209103 209567 210418 210761 210979 212213 214210 215387 215183 214665 214620 214705 214831 215737 217674
56336 217674 219873 221704 223165 224073 224156 224099 225051 226895 228385 229145 230046 231509 232996 234401 236343 238808
56320 238808 241091 243359 246646 250947 254909 257804 260215 262455 263988 264839 265884 267172 267646 267211 267472
$$ packed form
56437A55304R21rr33q45l51k12%O22Q49J99m41l72k63p44j257j336j592k345k706
56418A44489k117j445j486j648j155k64O15J736L055L790L761L798M060L519J904
56403A62612N69M40P05M79J53J30j54q49r53l8R02J304K011L281L739K609J248
56386A78188J022J358J380J766L218M701M947M485M443M530L799K430J213K17
56372B17697o60r07l82lk71k89O03J450J199L18k97p32j179j050k29J22o79j595
56354B13116j583j117q82m31M64Q51L43K18J234J997J177k04n18m5Q5J26R06J937
56336B17674K199J831J461R08Q3n7R52J844J490P60R01J463J487J405J942K465
56320B38808K283K268L287M301L962K895K411K240J533Q51J045J288M74m35K61
$$ plain form
56305 267472 269646 273175 277165 281728 287162 293135 299564 307062 315653 324032 330750 335261 337459 337372 335889
56290 335889 334646 334567 335315 336450 338140 340579 343759 347935 353243 358813 363535 367674 372451 378110 383901
56275 383901 389837 396752 404531 412096 419369 427503 436904 446797 457029 468519 481573 495590 510784
56262 510784 528230 547766 567854 588233 610853 637490 668171 702615 741388 784904 833057
56251 833057 886706 947798 1017171 1093736 1176531 1265971 1362347 1464622 1571387 1681508 1793194
56240 1793194 1903866 2011357 2113733 2207749 2289355 2356080 2407048 2440592 2454271 2447844 2423890
56229 2423890 2384821 2331613 2266145 2192041 2111973 2026420 1936260 1844269 1752749 1661994 1572545
56218 1572545 1486766 1406584 1331525 1260465 1193531 1131008 1072320 1017530 967950 923827 883230
$$ packed form
56305B67472K174L529L990M563N434N973O429P498Q591Q379O718M511K198q7j483
56290C35889j243p9P48J135J690K439L180M176N308N570M722M139M777N659N791
56275C83901N936O915P779P565P273Q134R401R893J0232J1490J3054J4017J5194
56262E10784J7446J9536K0088K0379K2620K6637L0681L4444L8773M3516M8153
56251H33057N3649O1092O9373P6565Q2795Q9440R6376J02275J06765J10121J11686
56240A793194J10672J07491J02376R4016Q1606O6725N0968L3544J3679o427k3954
56229B423890l9069n3208o5468p4104q0068q5553r0160r1991r1520r0755q9449
56218A572545q5779q0182p5059p1060o6934o2523n8688n4790m9580m4123m0597
$$ plain form
56207 883230 844615 808710 776570 747692 721460 698517 679154 662060 646095 631627 618847
56196 618847 606632 594467 583628 575063 567834 560899 554588 549060 543390 537504 532951 530357 528207
56183 528207 525539 523576 523118 522670 520934 518966 518043 517555 516862 517103 519187 522022 524645 528014 532763 537313
56167 537313 540282 542776 546249 550133 553675 558047 564416 571885 579476 588177 598920 610548 621973
56154 621973 634352 648900 664629 680547 698045 718790 742241 767513 795570 827390 862355
56143 862355 901008 946983 1003448 1069965 1145762 1233627 1337244 1456534 1588544 1730441 1877747
56132 1877747 2021426 2151100 2261096 2351344 2424435 2485069 2540424 2596549 2654000 2708805 2756275
56121 2756275 2791760 2810368 2810173 2795093 2771605 2743323 2710433 2671804 2623990 2560124 2474080 2365683
$$ packed form
56207H83230l8615l5905l2140k8878k6232k2943j9363j7094j5965j4468j2780
56196F18847j2215j2165j0839q565p229o935o311n528n670n886m553k594k150
56183E28207k668j963m58m48j736j968r23m88o93K41K084K835K623L369M749M550
56167E37313K969K494L473L884L542M372O369P469P591Q701J0743J1628J1425
56154F21973J2379J4548J5729J5918J7498K0745K3451K5272K8057L1820L4965
56143H62355L8653M5975N6465O6517P5797Q7865J03617J19290J32010J41897J47306
56132A877747J43679J29674J09996R0248P3091O0634N5355N6125N7451N4805M7470
56121B756275L5485J8608j95j5080k3488k8282l2890l8629m7814o3866q6044j08397
$$ plain form
56109 2365683 2239698 2101650 1957624 1815902 1684319 1566257 1461840 1371604 1295996 1233024
56099 1233024 1180021 1136603 1102858 1076242 1053716 1035428 1022847 1014747 1008520 1003893 1001753 1000841
56087 1000841 999302 998025 998791 1000599 1001533 1002645 1006125 1011221 1015898 1020922 1028189 1036594 1043778 1050534
56073 1050534 1059187 1069085 1078054 1086887 1097897 1110416 1122325 1134776 1150656 1169446 1188231 1206745
56061 1206745 1226851 1248187 1268971 1289964 1312878 1335993 1356134 1373872 1391962 1409946 1425433
56050 1425433 1439507 1455596 1473829 1491647 1509014 1527925 1547877 1567101 1587204 1611184 1637927
56039 1637927 1664003 1689663 1717525 1746737 1774374 1801365 1830972 1862643 1893571 1925069 1960927
56028 1960927 2000586 2040490 2081061 2125501 2172851 2219393 2265963 2316541 2370524 2423946 2477600
$$ packed form
56109B365683j25985j38048j44026j41722j31583j18062j04417r0236p5608o2972
56099A233024n3003m3418l3745k6616k2526j8288j2581q100o227m627k140r12
56087A000841j539j277P66J808R34J112L480N096M677N024P267Q405P184O756
56073A050534Q653R898Q969Q833J1010J2519J1909J2451J5880J8790J8785J8514
56061A206745K0106K1336K0784K0993K2914K3115K0141J7738J8090J7984J5487
56050A425433J4074J6089J8233J7818J7367J8911J9952J9224K0103K3980K6743
56039A637927K6076K5660K7862K9212K7637K6991K9607L1671L0928L1498L5858
56028A960927L9659L9904M0571M4440M7350M6542M6570N0578N3983N3422N3654
$$ plain form
56017 2477600 2536184 2599856 2664450 2729546 2798382 2870212 2941086 3012167 3089053 3172891 3260153
56006 3260153 3350817 3448266 3551516 3656433 3764435 3880989 4005837 4134064 4266354 4408351
55996 4408351 4560060 4716109 4876426 5046180 5225259 5408800 5598296 5801024 6018384
55987 6018384 6246410 6487729 6750801 7037166 7342226 7668616 8025377 8413810 8828394
55978 8828394 9272027 9755565 10282159 10847994 11458961 12129868 12866843 13668642 14546198
55969 14546198 15522012 16609872 17816140 19162422 20685532 22415325 24378367 26626521
55961 26626521 29237643 32289393 35864667 40088537 45133051 51189638 58476651 67278895
55953 67278895 77948682 90887081 106590737 125722440 149081114 177507887 211804608
$$ packed form
56017B477600N8584O3672O4594O5096O8836P1830P0874P1081P6886Q3838Q7262
56006C260153R0664R7449J03250J04917J08002J16554J24848J28227J32290J41997
55996D408351J51709J56049J60317J69754J79079J83541J89496K02728K17360
55987F018384K28026K41319K63072K86365L05060L26390L56761L88433M14584
55978H828394M43633M83538N26594N65835O10967O70907P36975Q01799Q77556
55969A4546198R75814J087860J206268J346282J523110J729793J963042K248154
55961B6626521K611122L051750L575274M223870N044514O056587P287013Q802244
55953F7278895J0669787J2938399J5703656J9131703K3358674K8426773L4296721
$$ plain form
55946 211804608 252374062 298158416 345292282 386941437 415369001 425256505 415894497
55939 415894497 390800008 355538107 315568880 275131214 236994720 202614219 172483194
55932 172483194 146558725 124561657 106088168 90661931 77814412 67135639 58259768
55925 58259768 50853070 44640563 39415825 35008106 31261474 28052014 25295082 22919782
55917 22919782 20854278 19042318 17450876 16050518 14805404 13689187 12691780 11801899
55909 11801899 10998745 10267223 9605053 9007714 8461003 7954835 7490279 7066581 6674361
55900 6674361 6307418 5968570 5657986 5367790 5093670 4840147 4608813 4392536 4186770
55891 4186770 3995818 3822315 3660746 3507019 3364796 3236680 3118087 3005373 2901785
$$ packed form
55946B11804608M0569454M5784354M7133866M1649155K8427564R887504r362008
55939D15894497k5094489l5261901l9969227m0437666l8136494l4380501l0131025
55932A72483194k5924469k1997068j8473489j5426237j2847519j0678773q875871
55925E8259768p406698o212507n224738m407719l746632l209460k756932k375300
55917B2919782k065504j811960j591442j400358j245114j116217r97407q89881
55909A1801899q03154p31522o62170n97339n46711n06168m64556m23698l92220
55900F674361l66943l38848l10584k90196k74120k53523k31334k16277k05766
55891D186770j90952j73503j61569j53727j42223j28116j18593j12714j03588
$$ plain form
55882 2901785 2810183 2727772 2653017 2590060 2541136 2501147 2463863 2426770 2386300 2335859 2273256
55871 2273256 2203797 2132215 2057814 1980826 1906400 1838005 1773201 1710019 1651482 1599783 1551842
55860 1551842 1504704 1459903 1418684 1378304 1336921 1297081 1260657 1225156 1188546 1152958 1120269
55849 1120269 1088575 1056286 1025146 996156 967061 936873 908443 883697 860768 838505 819081
55838 819081 803309 788147 771937 757421 746445 736248 724295 712338 702286 692368 680969 670221
55826 670221 662238 655496 648375 642584 639533 636679 630978 623013 614671 605805 596072 586961 579089 570496
55812 570496 560345 551214 545127 540526 535728 531995 530391 529048 526600 525122 526662 529955 533515 538799
55798 538799 547144 556581 564858 572682 580733 586351 586705 582796 577038 569262 558395 545819 533779 522461
$$ packed form
55882B901785r1602q2411p4755o2957m8924l9989l7284l7093m0470n0441o2603
55871B273256o9459p1582p4401p6988p4426o8395o4804o3182n8537n1699m7941
55860A551842m7138m4801m1219m0380m1383l9840l6424l5501l6610l5588l2689
55849A120269l1694l2289l1140k8990k9095l0188k8430k4746k2929k2263j9424
55838H19081j5772j5162j6210j4516j0976j0197j1953j1957j0052r918j1399j0748
55826F70221p983o742p121n791l051k854n701p965q342q866r733r111p872q593
55812E70496j0151r131o087m601m798l733j604j343k448j478J540L293L560N284
55798E38799Q345R437Q277P824Q051N618L54l909n758p776j0867j2576j2040j1318
$$ plain form
55784 522461 511675 503335 499001 496674 492964 486931 479376 470427 460577 452297 447895 447324 450340 458808
55770 458808 474472 496396 522604 551553 579286 598074 601826 591588 572946 549900 524099 497796
55758 497796 473503 451567 431186 412990 397975 385040 372341 360134 349683 340445 330855 320988
55746 320988 312013 304003 296525 290341 286247 283313 280452 278543 278781 280165 280918 281149 281725 281734 279637 275970
55730 275970 272444 269188 265155 260478 256180 252277 248125 243860 239733 235033 229520 224659 221597 219308
55716 219308 216767 215386 216936 220574 224484 229152 236215 245188 254163 262780 271542 278915 282192 281036
55702 281036 277505 272716 266056 257554 248513 239587 230340 220862 211957 203792 196110 189578 185196 182591
55688 182591 180522 178683 177462 176552 175586 175515 177462 180794 184253 188321 194377 202046 209504 215967 221719
$$ packed form
55784E22461j0786q340m334k327l710o033p555q949r850q280m402n71L016Q468
55770D58808J5664K1924K6208K8949K7733J8788L752j0238j8642k3046k5801k6303
55758D97796k4293k1936k0381j8196j5015j2935j2699j2207j0451r238r590r867
55746C20988q975q010p478o184m094k934k861j909K38J384P53K31N76Rk097l667
55730B75970l526l256m033m677m298l903m152m265m127m700n513m861l062k289
55716B19308k541j381J550L638L910M668P063Q973Q975Q617Q762P373L277j156
55702B81036l531m789o660q502r041q926r247r478q905q165p682o532m382k605
55688A82591k069j839j221r10r66p1J947L332L459M068O056P669P458O463N752
$$ plain form
55673 221719 226119 227893 227252 225609 223348 219950 216096 213364 211761 209715 206741 204169 203002 202967 203909
55658 203909 206200 209316 211802 213180 214451 216333 218358 220043 221626 223250 224569 225437 225992 225978 224938
55643 224938 223005 220542 217287 212873 207846 202989 198026 192255 186017 180171 174496 168182 161650 156312
55629 156312 152598 149646 146914 144753 143358 142405 141713 141238 140615 139756 139460 140254 141127 140765 139557 138843 138581
55612 138581 137376 134644 131196 127796 124690 122482 121957 122843 123968 124627 124784 124271 123011 121679 120874 120037
55596 120037 118513 117089 116922 117403 116860 115049 113236 112060 111129 110587 111223 112903 114602 116103 118135 120798
55580 120798 123428 125969 128874 131720 133710 135523 138801 143673 148658 153305 159020 166880 176448 187244
55566 187244 199520 212753 224963 234421 240891 244694 245871 244778 242103 237698 230669 221195 210951
$$ packed form
55673B21719M400J774o41j643k261l398l854k732j603k046k974k572j167l5R42
55658B03909K291L116K486J378J271J882K025J685J583J624J319Q68N55j4j040
55643B24938j933k463l255m414n027m857m963n771o238n846n675o314o532n338
55629A56312l714k952k732k161j395r53o92m75o23q59k96P94Q73l62j208p14k62
55612A38581j205k732l448l400l106k208n25Q86J125O59J57n13j260j332q05q37
55596A20037j524j424j67M81n43j811j813j176r31n42O36J680J699J501K032K663
55580A20798K630K541K905K846J990J813L278M872M985M647N715P860R568J0796
55566A87244J2276J3233J2210R458O470L803J177j093k675m405p029r474j0244
$$ plain form
55553 210951 201127 191348 181186 171450 163155 156299 150471 145776 142400 140008 138147 136597 135005 133012
55539 133012 131040 130055 130228 130729 131078 131673 132597 132987 132082 130102 127654 125073 122674 120800 119217 117193
55523 117193 114432 111298 107982 104278 100278 96494 93148 90100 87481 85525 83834 81760 79518 77922
55509 77922 77058 76321 75753 76201 78090 81083 84924 89402 93501 95983 96985 97743 98666 99123 99357 100904
55493 100904 104460 108703 111950 113824 114690 114637 113843 113001 112579 112283 111719 110953 110159 109423 109078 109373 109712 109184
55475 109184 107936 107030 106833 106652 106041 105220 104020 101749 98471 95240 92765 90966 89969 90115 90744 90482
55459 90482 89230 88425 88843 89593 89826 89884 90009 89493 88086 86889 86793 87207 87334 87568 88591 90077 91315 92257
55441 92257 93013 93143 92418 91502 91014 90611 89747 88596 87569 86663 85902 85583 85513 84940 83837 83249 83720 84487
$$ packed form
55553B10951r824r779j0162r736q295o856n828m695l376k392j861j550j592j993
55539A33012j972r85J73N01L49N95R24L90r05j980k448k581k399j874j583k024
55523A17193k761l134l316l704m000l784l346l048k619j956j691k074k242j596
55509G7922q64p37n68M48J889K993L841M478M099K482J002P58R23M57K34J547
55493A00904L556M243L247J874Q66n3p94q42m22k96n64p66p94p36l45K95L39n28
55475A09184j248r06j97j81o11q21j200k271l278l231k475j799r97J46O29k62
55459I0482j252q05M18P50K33N8J25n16j407j197r6M14J27K34J023J486J238R42
55441I2257P56J30p25r16m88m03q64j151j027r06p61l19p0n73j103n88M71P67
$$ plain form
55423 84487 85008 86110 88602 91778 94339 96018 97303 98500 100057 103002 107834 113546 118671 122760 126008
55408 126008 128197 129005 128713 127704 125812 123027 120129 117758 115503 112780 109958 107728 105998 104336 102873
55393 102873 101871 101051 100197 99688 99550 98864 97229 95926 96325 97775 98515 98159 97775 97846 97738 97177 96760 96730
55375 96730 96483 95667 94798 94384 94226 94007 93861 93941 93814 92674 90034 86114 81762 77970 75292 73700 72909
55358 72909 72593 72339 71888 71536 71799 72598 73362 74038 75159 76699 77785 77987 77938 78169 78281 77977 77959 78859 80071
55339 80071 80633 80590 80474 80043 78710 76838 75469 74945 74749 74583 74702 75275 76151 77231 78445 79484 80066
55322 80066 80250 80050 79183 77736 76612 76553 77102 77240 76770 76370 76601 77547 79135 81082 82706 83494 83644 83607
55304 83607 83426 83093 83082 83766 84672 85096 85192 85684 86681 87473 87393 86319 84529 82646 81499 81469 82090 82749 83433
$$ packed form
55423H4487N21J102K492L176K561J679J285J197J557K945M832N712N125M089L248
55408A26008K189Q08k92j009j892k785k898k371k255k723k822k230j730j662j463
55393A02873j002q20q54n09j38o86j635j303L99J450P40l56l84P1j08n61m17l0
55375I6730k47q16q69m14j58k19j46Q0j27j140k640l920m352l792k678j592p91
55358G2909l16k54m51l52K63P99P64O76J121J540J086K02m9K31J12l04j8R00J212
55339H0071N62m3j16m31j333j872j369n24j96j66J19N73Q76J080J214J039N82
55322H0066J84k00q67j447j124n9N49J38m70m00K31R46J588J947J624P88J50l7
55304H3607j81l33j1O84R06M24R6M92R97P92q0j074j790j883j147l0O21O59O84
$$ plain form
55285 83433 84404 85559 86685 87912 89278 90258 90367 89926 89593 89474 89285 89013 88817 88603 88290 88112 88161 88084
55267 88084 87772 87773 88370 88871 88538 87684 87043 86671 86331 86388 87288 88600 89544 90162 90955 91786 92114 92070 92247 92694
55247 92694 93033 93320 93787 94015 93413 92338 91699 91509 90887 89502 88097 87521 88029 89439 91116 91918 91087
55230 91087 89224 87651 86894 86463 85909 85176 84125 82725 81643 81709 82747 83794 84429 85066 85987 86961 87789
55213 87789 88407 88516 87929 87179 86964 87201 87462 87995 89210 90444 90563 89735 89288 89709 90108 89839 89337 89025
55195 89025 88673 88296 88486 89266 89710 89304 88683 88451 88256 87745 87443 87867 88542 88841 89158 90289 92020 93247
55177 93247 93347 92714 91969 91242 90330 89198 88145 87564 87569 87934 88485 89361 90609 91753 92193 91929 91439 91006
55159 91006 90666 90646 91196 92076 92816 93432 94216 94965 95178 95037 95356 96413 97590 98308 98640 98777 98671 98451 98559
$$ packed form
55285H3433R71J155J126J227J366R80J09m41l33j19j89k72j96k14l13j78M9p7
55267H8084l12JN97N01l33q54o41l72l40N7R00J312R44O18P93Q31L28m4J77M47
55247I2694L39K87M67K28o02j075o39j90o22j385j405n76N08J410J677Q02q31
55230I1087j863j573p57m31n54p33j051j400j082O6J038J047O35O37R21R74Q28
55213H7789O18J09n87p50k15K37K61N33J215J234J19q28m47M21L99k69n02l12
55195H9025l52l77J90P80M44m06o21k32j95n11l02M24O75K99L17J131J731J227
55177I3247J00o33p45p27r12j132j053n81NL65N51Q76J248J144M40k64m90m33
55159I1006l40k0N50Q80P40O16P84P49K13j41L19J057J177P18L32J37j06k20J08
$$ plain form
55140 98559 99124 99693 99800 99369 98467 97149 95658 94328 93292 92738 93172 94738 96504 97331 97311 97378 97640 97335
55122 97335 96504 96314 97247 98274 98513 98552 99203 99966 99836 99001 98612 99128 99883 100216 100278 100650 101648 103066 104338
55103 104338 105044 105370 105888 106753 107429 107361 106675 106037 106166 107473 109704 111814 112684 112200 111264 110663 110385 110101
55085 110101 109708 109177 108449 107786 107715 108312 108917 108827 107924 106531 105075 103984 103440 103112 102630 102280 102626 103413
55067 103413 103684 103130 102509 102490 102879 103345 104014 104806 104998 104133 102839 102131 102293 102892 103391 103252 102015 99911
55049 99911 98011 97124 96790 95910 94168 92300 91122 90711 90527 90034 89223 88628 88762 89560 90546 91387 91956 92093
55031 92093 91889 92080 93383 95445 97171 98124 98811 99542 100034 100363 101249 102872 104367 105105 105642 106683 107829
55014 107829 108158 107605 107031 107260 108487 110260 111611 111693 110640 109404 108476 107461 106187 105382 105645 106532 107310
$$ packed form
55140I8559N65N69J07m31r02j318j491j330j036n54M34J566J766Q27k0O7K62l05
55122I7335q31j90R33J027K39L9O51P63j30q35l89N16P55L33O2L72R98J418J272
55103A04338P06L26N18Q65O76o8o86o38J29J307K231K110Q70m84r36o01k78k84
55085A10101l93n31p28o63p1N97O05r0r03j393j456j091n44l28m82l50L46P87
55067A03413K71n54o21j9L89M66O69P92J92q65j294p08J62N99M99j39j237k104
55049I9911j900q87l34q80j742j868j178m11j84m93q11n95J34P98R86Q41N69J37
55031I2093k04J91J303K062J726R53O87P31M92L29Q86J623J495P38N37J041J146
55014A07829L29n53n74K29J227J773J351Q2j053j236r28j015j274q05K63Q87P78
$$ plain form
54997 107310 107926 108584 109037 109158 109583 110925 112791 114369 115596 116952 118474 119773 120742 121533 122042 122032 121510
54980 121510 120497 118840 116792 115271 114864 115039 115054 115182 116212 118175 120404 122471 124186 124981 124358 122816
54964 122816 121448 120681 120203 120019 120649 122243 124245 125992 127031 127008 126004 124942 124799 125369 125498 124643 123456
54947 123456 122752 122578 122545 122413 122118 121683 121329 121277 121400 121446 121580 122232 123375 124508 125366 126074 126534 126322 125516
54928 125516 125104 126119 128557 131494 134196 136959 140841 146607 154003 162192 170770 179942 189555 198550
54914 198550 205742 210702 213394 213464 210591 205337 198896 192040 184868 177551 170672 164712 159619 154960 150303
54899 150303 145573 141353 138506 137074 135876 133799 131233 129527 129256 129799 130527 131417 132349 132756 132516 132639
54883 132639 134412 138124 142949 147937 152794 157794 163192 168899 174769 181078 188329 196397 204191 210432
$$ packed form
54997A07310O16O58M53J21M25J342J866J578J227J356J522J299R69P91N09j0n22
54980A21510j013j657k048j521m07J75J5J28J030J963K229K067J715P95o23j542
54964A22816j368p67m78j84O30J594K002J747J039k3j004j062j43N70J29q55j187
54947A23456p04j74l3j32k95m35l54n2J23M6J34O52J143J133Q58P08M60k12q06
54928A25516m12J015K438K937K702K763L882N766P396Q189Q578R172R613Q995
54914A98550P192M960K692P0k873n254o441o856p172p317o879n960n093m659m657
54899A50303m730m220k847j432j198k077k566j706k71N43P28Q90R32M07k40J23
54883A32639J773L712M825M988M857N000N398N707N870O309P251Q068P794O241
$$ plain form
54869 210432 214481 216161 215254 211701 206017 199011 191343 183767 177291 172270 167716 162424 156683 151988
54855 151988 149065 147092 144972 142457 139779 137006 134206 131556 128973 126222 123681 122286 122266 122582 122148
54840 122148 121083 120150 119509 118801 118142 118054 118341 117850 115876 113326 111902 112198 113128 113384 112996 113035 114024 115335
54822 115335 116202 116592 116714 116339 115302 114267 114143 114840 115355 115162 114823 115056 115860 116851 117964 119345 120846
54805 120846 122056 122797 123336 124058 125004 125772 125986 125835 125945 126648 127659 128667 129775 130992 131678 131147 129598
54788 129598 127929 126710 125930 125621 126039 127112 128321 129306 130164 131053 131964 133021 134557 136709 139265 142016
54772 142016 144964 148131 151546 155466 160269 166066 172731 180295 188887 198338 208220 218198 227846 236147
54758 236147 241846 244502 244729 243222 240016 234868 227925 219742 210952 202127 193703 185909 178951 173137
$$ packed form
54869B10432M049J680r07l553n684p006p668p576o476n021m554n292n741m695
54855A51988k923j973k120k515k678k773k800k650k583k751k541j395k0L16m34
54840A22148j065r33o41p08o59q8K87m91j974k550j424K96R30K56l88L9R89J311
54822A15335Q67L90J22l75j037j035j24O97N15j93l39K33Q04R91J113J381J501
54805A20846J210P41N39P22R46P68K14j51J10P03J011J008J108J217O86n31j549
54788A29598j669j219p80l09M18J073J209R85Q58Q89R11J057J536K152K556K751
54772A42016K948L167L415L920M803N797O665P564Q592R451R882R978R648Q301
54758B36147N699K656K27j507l206n148o943q183q790q825q424p794o958n814
$$ plain form
54744 173137 168509 164535 160704 157326 155034 153558 151807 149369 147109 145896 145460 145028 144487 144266 144557
54729 144557 145329 146827 149362 152673 156054 159172 162420 166459 171670 178056 185399 193332 201232 208099
54715 208099 212771 214631 214096 212060 208809 203859 196923 188575 179725 170955 162775 156073 151616 149123
54701 149123 147353 145289 142997 141208 140286 139841 139239 138223 136930 135488 133949 132561 131712 131387 131036 130259
54685 130259 129336 128749 128528 128502 128811 129565 130191 129892 128692 127319 126066 124530 122634 121126 120639 120832 120890
54668 120890 120456 119759 119195 119103 119612 120373 120719 120330 119510 118709 118172 118160 119017 120712 122688 124430 125831 126838
54650 126838 127203 126920 126507 126447 126650 126801 126862 126936 126882 126485 125772 124917 124055 123432 123408 123949 124430 124304 123787 123534
54630 123534 123834 124447 125093 125677 126073 126012 125281 123975 122571 121715 121780 122563 123593 124696 125926 126960 127095
$$ packed form
54744A73137m628l974l831l378k292j476j751k438k260j213m36m32n41k21K91
54729A44557P72J498K535L311L381L118L248M039N211O386P343P933P900O867
54715B08099M672J860n35k036l251m950o936q348q850q770q180o702m457k493
54701A49123j770k064k292j789r22m45o02j016j293j442j539j388q49l25l51p77
54685A30259r23n87k21k6L09P54O26k99j200j373j253j536j896j508m87J93N8
54668A20890m34o97n64r2N09P61L46l89q20q01n37j2Q57J695J976J742J401J007
54650A26838L65k83m13o0K03J51O1P4n4l97p13q55q62o23k4N41M81j26n17k53
54630A23534L00O13O46N84L96o1p31j306j404q56O5P83J030J103J230J034J35
$$ plain form
54613 127095 126094 124679 123851 123915 124430 124916 125329 125926 126848 127866 128539 128667 128449 128048 127351 126509 126250 126972
54595 126972 127756 127258 125641 124646 125465 127431 129185 130264 130874 130942 130268 129166 128157 127281 126322 125459 125111
54578 125111 125380 126128 127365 129038 130740 132082 133086 133775 133794 133058 132377 132670 133713 134408 134152 133300 132358
54561 132358 131475 130806 130654 131012 131412 131460 131215 130948 130843 130953 131169 131163 130683 129871 129096 128538 128277 128687 130267
54542 130267 133013 136291 139435 142187 144511 146296 147430 148073 148669 149616 150840 151748 151810 151187 150478 149873
54526 149873 149026 147893 147124 147203 147689 147791 147302 146453 145270 143810 142768 142964 144167 145083 144687 143130 141329
54509 141329 140157 140070 140952 142058 142506 142045 141178 140561 140549 141244 142482 143678 144100 143523 142373 141202 140289
54492 140289 139770 139760 140132 140425 140170 139267 138049 137129 137039 137765 138700 139341 139962 141200 143003 144444 144739 144125
$$ packed form
54613A27095j001j415q28O4N15M86M13N97R22J018O73J28k18m01o97q42k59P22
54595A26972P84m98j617r95Q19J966J754J079O10O8o74j102j009q76r59q63l48
54578A25111K69P48J237J673J702J342J004O89J9p36o81K93J043O95k56q52r42
54561A32358q83o69j52L58M00M8k45k67j05J10K16om80q12p75n58k61M10J580
54542A30267K746L278L144K752K324J785J134O43N96R47J224R08O2o23p09o05
54526A49873q47j133p69P9M86J02m89q49j183j460j042J96J203R16l96j557j801
54509A41329j172q7Q82J106M48m61q67o17j2O95J238J196M22n77j150j171r13
54492A40289n19j0L72K93k55r03j218r20r0P26R35O41O21J238J803J441K95o14
$$ plain form
54474 144125 143546 143702 144612 145979 147683 149799 152170 154140 155058 155064 155038 155515 156015 155795 154940 154252 154244 154806 155756
54455 155756 157073 158493 159428 159511 158928 158074 157203 156454 155828 155067 153954 152865 152548 153128 153759 153612 152877 152354
54437 152354 152328 152342 152018 151549 151221 150883 150211 149323 148754 148766 149034 149150 149128 149137 148965 148243 147176 146603 147112 148496
54417 148496 150191 151902 153482 154625 155109 155124 154967 154561 153664 152435 151427 151021 151144 151479 151722 151751 151807 152376
54399 152376 153637 155178 156491 157555 158635 159768 160819 161834 162887 163693 163862 163475 163006 162714 162538 162503
54383 162503 162824 163594 164763 166329 168084 169265 169041 167495 165618 164222 163277 162415 161588 160953 160538 160292
54367 160292 160239 160352 160508 160777 161499 162866 164615 166313 167799 169182 170468 171401 171676 171337 170891 170893 171297 171423
54349 171423 170781 169721 168973 168694 168357 167545 166495 165740 165510 165570 165567 165501 165848 167053 168850 170434 171507 172709
$$ packed form
54474A44125n79J56R10J367J704K116K371J970R18Ok6M77N00k20q55o88qN62R50
54455A55756J317J420R35Q3n83q54q71p49o26p61j113j089l17N80O31j47p35n23
54437A52354k6J4l24m69l28l38o72q88n69J2K68J16k2Rj72p22j067n73N09J384
54417A48496J695J711J580J143M84J5j57m06q97j229j008m06J23L35K43K9N6N69
54399A52376J261J541J313J064J080J133J051J015J053Q06J69l87m69k92j76l5
54383A62503L21P70J169J566J755J181k24j546j877j396r45q62q27o35m15k46
54367A60292n3J13J56K69P22J367J749J698J486J383J286R33K75l39m46KM04J26
54349A71423o42j060p48k79l37q12j050p55k30O0lo6L47J205J797J584J073J202
$$ plain form
54331 172709 174642 176909 178654 179632 180130 180108 179326 178126 177191 176449 175080 172831 170475 168689 167258 165828
54315 165828 164687 164181 163885 163093 161850 160883 160568 160483 160076 159407 159058 159364 159884 159773 158772 157614 157207 157672
54297 157672 158534 159581 160861 161999 162319 161788 161096 160639 160136 159513 159313 159717 159943 159339 158550 158733 159979
54280 159979 161341 162250 163042 163998 164631 164294 163097 161891 161500 162119 163328 164524 165328 165643 165460 164845 164139
54263 164139 163839 164049 164294 164147 163934 164506 166325 168930 171323 172797 173441 173947 174913 176328 177721 178667 178956
54246 178956 178434 177074 175253 173646 172694 172344 172285 172134 171386 169632 167028 164313 162219 161058 160832 161325
54230 161325 162016 162352 162314 162322 162493 162440 162037 161800 162170 162831 163195 163208 163212 163343 163517 163814 164382 165038 165366 165142 164372
54209 164372 163060 161269 159368 157862 157032 156879 157311 158140 159051 159809 160424 160952 161266 161212 160830 160309 159883 159877
$$ packed form
54331A72709J933K267J745R78M98k2p82j200r35p42j369k249k356j786j431j430
54315A65828j141n06k96p92j243r67l15q5m07o69l49L06N20j11j001j158m07M65
54297A57672Q62J047J280J138L20n31o92m57n03o23k00M04K26o04p89J83J246
54280A59979J362R09P92R56O33l37j197j206l91O19J209J196Q04L15j83o15p06
54263A64139l00K10K45j47k13N72J819K605K393J474O44N06R66J415J393R46K89
54246A78956n22j360j821j607r52l50n9j51p48j754k604k715k094j161k26M93
54230A61325O91L36l8QJ71n3m03k37L70O61L64J3MJ31J74K97N68O56L28k24p70
54209A64372j312j791j901j506q30j53M32Q29R11P58O15N28L14n4l82n21m26o
$$ plain form
54191 159877 160527 161616 162596 163279 164081 165330 166707 167673 168082 167995 167308 166020 164607 163586 162896 162190 161493
54174 161493 161064 160770 160201 159346 158610 158120 157561 156761 156030 155759 155973 156374 156598 156417 155899 155399 155211 155336 155750
54155 155750 156600 157804 158773 159054 159014 159323 159870 159883 159098 158081 157200 156079 154402 152691 151786 151967 152995
54138 152995 154650 156685 158537 159697 160361 161281 162929 165092 167245 168931 169780 169587 168613 167566 167010 166906
54122 166906 166855 166623 166234 165713 165093 164699 165074 166431 168365 170269 171863 173159 174128 174659 174718 174270 173202
54105 173202 171684 170454 170238 170849 171350 171141 170401 169360 167800 165671 163625 162374 161849 161514 161253 161363
54089 161363 161826 162214 162355 162598 163268 164215 165088 165816 166678 167914 169284 170045 169655 168595 168157 169125 170999
54072 170999 172847 174472 176156 177667 178398 178510 179018 180454 182094 182886 182627 181823 180896 180015 179423 179379 179834
$$ packed form
54191A59877O50J089R80O83Q02J249J377R66M09q7o87j288j413j021o90p06o97
54174A61493m29k94n69q55p36m90n59q00p31k71K14M01K24j81n18n00j88J25M14
54155A55750Q50J204R69K81m0L09N47J3p85j017q81j121j677j711r05J81J028
54138A52995J655K035J852J160O64R20J648K163K153J686Q49j93r74j047n56j04
54122A66906n1k32l89n21o20l94L75J357J934J904J594J296R69N31N9m48j068
54105A73202j518j230k16O11N01k09p40j041j560k129k046j251n25l35k61J10
54089A61363M63L88J41K43O70R47Q73P28Q62J236J370P61l90j060m38R68J874
54072A70999J848J625J684J511P31J12N08J436J640P92k59q04r27q81n92m4M55
$$ plain form
54055 179834 180493 181099 181495 181606 181668 182241 183627 185413 186964 188294 190017 192500 195534 198929 202937 207741
54039 207741 212931 217963 222985 228826 236217 245405 256463 269480 284265 300316 317316 335217 353307
54026 353307 369402 380585 384959 382673 375502 365837 355795 346498 337850 329237 320623 312715 306147
54013 306147 300884 296507 292570 288560 283982 278782 273323 267777 262013 256264 251335 247692 244802 241875
53999 241875 238863 236239 234135 232340 230876 229875 228995 227633 225796 224195 223390 223208 223052 222359 220768
53984 220768 218306 215550 213301 211974 211442 211365 211298 210597 208767 206044 203303 201253 199989 199340 199278 199818 200785
53967 200785 201825 202515 202510 201844 201129 201133 202064 203405 204524 205234 205767 206399 207212 208140 209224 210783 213073 215725
53949 215725 217894 219258 220538 222666 225702 229013 232175 235150 237839 240190 242685 246028 250272 254792
$$ packed form
54055A79834O59O06L96J11O2N73J386J786J551J330J723K483L034L395M008M804
54039B07741N190N032N022N841P391R188J1058J3017J4785J6051J7000J7901J8090
54026C53307J6095J1183M374k286p171r665j0042r297q648q613q614p908o568
54013C06147n263m377l937m010m578n200n459n546n764n749m929l643k890k927
53999B41875l012k624k104j795j464j001q80j362j837j601q05j82j56o93j591
53984B20768k462k756k249j327n32p7o7p01j830k723k741k050j264o49o2N40R67
53967B00785J040O90no66p15MR31J341J119P10N33O32Q13R28J084J559K290K652
53949B15725K169J364J280K128L036L311L162K975K689K351K495L343M244M520
$$ plain form
53935 254792 259094 263088 266602 269356 271541 273650 275544 276442 276205 275967 276998 279439 282555 285700 288529
53920 288529 290774 292484 294294 296952 300680 305296 310643 316454 322160 327386 332517 338210 344427 350431
53906 350431 355726 360507 365109 369481 373377 376701 379431 381465 382891 384293 386382 389172 391729 393032
53892 393032 393027 392551 392120 391128 388521 383943 377831 370604 362394 353537 344710 336366 328541 321463 315806 311983
53876 311983 309585 308017 307444 308665 312324 318716 328174 340885 356003 371197 383331 389672 388805 380980
53862 380980 367946 352199 335894 320112 305068 290943 278422 268298 260644 254603 249138 243827
53850 243827 238794 234142 229785 225785 222457 220059 218520 217443 216230 214447 212352 210843 210458 210560 210027
53835 210027 208610 207024 205781 204803 204228 204676 206198 207766 208410 208356 208403 208662 208578 207893 206926 206113 205845 206528
$$ packed form
53935B54792M302L994L514K754K185K109J894Q98k37k38J031K441L116L145K829
53920B88529K245J710J810K658L728M616N347N811N706N226N131N693O217O004
53906C50431N295M781M602M372L896L324K730K034J426J402K089K790K557J303
53892C93032nm76m31r92k607m578o112p227q210q857q827q344p825p078n657l823
53876C11983k398j568n73J221L659O392R458J2711J5118J5194J2134O341q67p825
53862C80980j3034j5747j6305j5782j5044j4125j2521j0124p654o041n465n311
53850B43827n033m652m357m000l328k398j539j077j213j783k095j509l85J02n33
53835B10027j417j586j243r78n75M48J522J568O44n4M7K59q4o85r67q13k68O83
$$ plain form
53817 206528 208163 209971 211038 211338 211588 212208 212935 213478 214005 214936 216685 219616 223701 228105 231638 233883
53801 233883 235611 237913 241202 245149 249202 252995 256537 260277 264741 269879 274827 278567 280824 282314
53787 282314 284101 286667 289517 291727 292880 293317 293417 293021 291861 290275 288904 287824 286492 284583 282316
53772 282316 279844 276953 273673 270666 268513 266910 265035 262542 259784 257174 254728 252223 249416 246119
53758 246119 242404 238793 235925 233922 232335 230814 229500 228604 227907 226974 225674 224159 222476 220588 218773
53743 218773 217598 217354 217783 218463 219173 219742 219905 219601 219120 218675 218043 217045 216187 216337 217769 219913 222069
53726 222069 223984 225727 227464 229518 232247 235574 238904 241705 244004 246175 248460 250812 252932 254361
53712 254361 254878 254966 255520 256879 258488 259729 260701 261781 262860 263580 264159 265350 267449 269802 271520 272509
$$ packed form
53817B06528J635J808J067L00K50O20P27N43N27R31J749K931M085M404L533K245
53801B33883J728K302L289L947M053L793L542L740M464N138M948L740K257J490
53787B82314J787K566K850K210J153M37J00l96j160j586j371j080j332j909k267
53772B82316k472k891l280l007k153j603j875k493k758k610k446k505k807l297
53758B46119l715l611k868k003j587j521j314q96o97r33j300j515j683j888j815
53743B18773j175k44M29O80P10N69J63l04m81m45o32r98q58J50J432K144K156
53726B22069J915J743J737K054K729L327L330K801K299K171K285K352K120J429
53712B54361N17Q8N54J359J609J241R72J080J079P20N79J191K099K353J718R89
$$ plain form
53696 272509 273680 276187 280411 285604 290554 294618 297916 300562 302177 302437 301695 300583 299277 297687 296171
53681 296171 295435 295664 296311 296878 297413 298086 298738 299186 299585 300056 300154 299134 296821 293931 291471 289908 288991
53664 288991 288225 287441 286902 286978 287743 288839 289690 289874 289411 288665 287922 287098 285964 284513 282931 281335 279814
53647 279814 278663 278123 277925 277570 277176 277498 278792 280240 280971 281250 282039 283693 285760 287887 290189 292596
53631 292596 294564 295757 296550 297519 298737 299868 300794 301810 303258 305169 307368 309824 312718 316066 319420
53616 319420 322263 324698 327389 330695 334299 337925 341883 346442 351096 355095 358454 361757 365184 368486
53602 368486 371792 375510 379330 382234 383862 385083 386725 388444 389480 389970 390743 392080 393444 394348 394810
53587 394810 394858 394202 392649 390556 388618 387359 386951 387279 387978 388468 388238 387203 385762 384417 383332 382368
$$ packed form
53696B72509J171K507M224N193M950M064L298K646J615K60p42j112j306j590j516
53681B96171p36K29O47N67N35O73O52M48L99M71R8j020k313k890k460j563r17
53664B88991p66p84n39P6P65J096Q51J84m63p46p43q24j134j451j582j596j521
53647B79814j151n40j98l55l94L22J294J448P31K79P89J654K067K127K302K407
53631B92596J968J193P93R69J218J131R26J016J448J911K199K456K894L348L354
53616C19420K843K435K691L306L604L626L958M559M654L999L359L303L427L302
53602C68486L306L718L820K904J628J221J642J719J036M90P73J337J364R04M62
53587C94810M8o56j553k093j938j259m08L28O99M90k30j035j441j345j085r64
$$ plain form
53571 382368 381550 381317 382152 384050 386620 389658 393354 397811 402545 406615 409230 410153 409590 407788 404857
53556 404857 401054 397087 393756 391179 388746 386091 383713 382251 381574 381184 381187 382033 383424 384499 385272 386909
53540 386909 390122 394135 397885 401509 405763 410547 415061 419353 424680 432067 441151 450739 460019 469012
53526 469012 478280 488552 500333 513441 526998 540103 552529 564762 577461 591036 605618 621278
53514 621278 638170 656463 676184 697209 719421 742765 767161 792474 818647 845642 873160
53503 873160 900593 927430 953527 978817 1003061 1026245 1049013 1072155 1095685 1118869 1141256
53492 1141256 1163202 1185219 1207303 1229315 1251603 1274616 1297954 1320343 1340777 1359411 1377248
53481 1377248 1395177 1413404 1431555 1449098 1465812 1482017 1498186 1514144 1528837 1541169 1550915
$$ packed form
53571C82368q18k33Q35J898K570L038L696M457M734M070K615R23n63j802k931
53556D04857l803l967l331k577k433k655k378j462o77l90LQ46J391J075P73J637
53540C86909L213M013L750L624M254M784M514M292N327P387R084R588R280Q993
53526D69012R268J0272J1781J3108J3557J3105J2426J2233J2699J3575J4582J5660
53514F21278J6892J8293J9721K1025K2212K3344K4396K5313K6173K6995K7518
53503H73160K7433K6837K6097K5290K4244K3184K2768K3142K3530K3184K2387
53492A141256K1946K2017K2084K2012K2288K3013K3338K2389K0434J8634J7837
53481A377248J7929J8227J8151J7543J6714J6205J6169J5958J4693J2332R746
$$ plain form
53470 1550915 1558477 1563891 1566610 1566319 1563377 1558169 1550465 1539864 1526574 1511296 1494574 1476762 1458437
53457 1458437 1440221 1422107 1403430 1383644 1362706 1340636 1317250 1292615 1267405 1242494 1218349
53446 1218349 1195024 1172382 1150134 1128009 1106258 1085778 1067366 1050998 1036099 1022391 1010163
53435 1010163 999859 991662 985351 980312 975875 972003 969525 969326 971356 974846 979417 985472 993381 1002788
53421 1002788 1013047 1024079 1036487 1050905 1067485 1085934 1105821 1126823 1148833 1171943 1196384
53410 1196384 1222447 1250341 1279984 1310995 1343113 1376638 1412284 1450485 1491015 1533387 1577469
53399 1577469 1623566 1672083 1723291 1777296 1833872 1892251 1951371 2010607 2070194 2130778 2192574
53388 2192574 2255062 2317416 2379011 2439482 2498532 2555842 2611094 2663947 2714067 2761198 2805129
$$ packed form
53470A550915P562N414K719k91k942n208p704j0601j3290j5278j6722j7812j8325
53457A458437j8216j8114j8677j9786k0938k2070k3386k4635k5210k4911k4145
53446A218349k3325k2642k2248k2125k1751k0480j8412j6368j4899j3708j2228
53435A010163j0304q197o311n039m437l872k478j99K030L490M571O055P909R407
53421A002788J0259J1032J2408J4418J6580J8449J9887K1002K2010K3110K4441
53410A196384K6063K7894K9643L1011L2118L3525L5646L8201M0530M2372M4082
53399A577469M6097M8517N1208N4005N6576N8379N9120N9236N9587O0584O1796
53388B192574O2488O2354O1595O0471N9050N7310N5252N2853N0120M7131M3931
$$ plain form
53377 2805129 2845468 2881673 2913432 2940925 2964476 2984103 2999682 3011435 3019770 3024466 3024262 3017469
53365 3017469 3002864 2979956 2948722 2909387 2862468 2808931 2750365 2688887 2626443 2563892 2500955
53354 2500955 2437270 2373401 2310638 2250020 2191866 2136084 2082541 2031038 1981141 1932167 1883302
53343 1883302 1833899 1783904 1733974 1684984 1637455 1591637 1548013 1507260 1469612 1434610 1401739
53332 1401739 1371059 1343013 1317804 1295291 1275411 1258276 1243701 1230844 1218542 1205984 1192982
53321 1192982 1179757 1166664 1154162 1142769 1132787 1124070 1116185 1108893 1102434 1097371 1094231 1093219 1094111
53308 1094111 1096366 1099437 1103162 1107844 1113957 1121722 1130924 1141127 1152151 1164412 1178703 1195533 1214793
53295 1214793 1236135 1259426 1284500 1310670 1337139 1364037 1392537 1423542 1456568 1490216 1523296
$$ packed form
53377B805129M0339L6205L1759K7493K3551J9627J5579J1753Q335M696k04o793
53365C017469j4605k2908l1234l9335m6919n3537n8566o1478o2444o2551o2937
53354B500955o3685o3869o2763o0618n8154n5782n3543n1503m9897m8974m8865
53343A883302m9403m9995m9930m8990m7529m5818m3624m0753l7648l5002l2871
53332A401739l0680k8046k5209k2513j9880j7135j4575j2857j2302j2558j3002
53321A192982j3225j3093j2502j1393r982q717p885p292o459n063l140j012Q92
53308A094111K255L071L725M682O113P765R202J0203J1024J2261J4291J6830J9260
53295A214793K1342K3291K5074K6170K6469K6898K8500L1005L3026L3648L3080
$$ plain form
53284 1523296 1555024 1584481 1610749 1633688 1653996 1672275 1688469 1702406 1714312 1724303 1731724 1735571
53272 1735571 1735547 1732296 1726575 1718554 1707992 1694753 1678981 1660948 1640861 1618642 1593850 1566031
53260 1566031 1535367 1502816 1469398 1435478 1400917 1365783 1330558 1295700 1261354 1227598 1194671
53249 1194671 1162817 1132162 1102834 1074924 1048082 1021483 994520 967346 940399 913606 886566
53238 886566 859462 833261 808843 786287 765205 745452 727228 710708 695866 682596 670751
53227 670751 660059 650101 640447 630846 621327 612047 602933 593550 583501 572887 562132 551422 540563
53214 540563 529327 517604 505295 492504 479939 468604 458897 450361 442517 435430 429131 423052 416655
53201 416655 410311 404882 400493 396295 391514 386199 380787 375327 369440 362830 355610 348246 341298 335126
$$ packed form
53284A523296L1728K9457K6268K2939K0308J8279J6194J3937J1906R991P421L847
53272A735571k4l251n721q021j0562j3239j5772j8033k0087k2219k4792k7819
53260A566031l0664l2551l3418l3920l4561l5134l5225l4858l4346l3756l2927
53249A194671l1854l0655k9328k7910k6842k6599k6963k7174k6947k6793k7040
53238H86566k7104k6201k4418k2556k1082j9753j8224j6520j4842j3270j1845
53227F70751j0692r958r654r601r519r280r114r383j0049j0614j0755j0710j0859
53214E40563j1236j1723j2309j2791j2565j1335r707q536p844p087o299o079o397
53201D16655o344n429m389m198m781n315n412n460n887o610p220p364o948o172
$$ plain form
53187 335126 329802 325284 321598 318698 316237 313645 310505 306848 303149 300093 298111 297009 296168 295225 294404
53172 294404 294084 294320 294946 295803 296498 296312 294911 292994 291679 291249 291036 290505 289834 289272 288515 287106 285068
53155 285068 282805 280608 278515 276460 274329 272123 270207 269088 268711 268328 267366 266108 265152 264512 263823 263226
53139 263226 263311 264091 264677 264384 263677 263530 264060 264340 263576 262042 260703 260253 260702 261597 262357 262572 262375 262436 263285
53120 263285 264598 265492 265546 265212 265119 265367 265758 266318 267112 267729 267505 266316 264783 263578 262812 262200 261561 260915
53102 260915 260240 259347 258071 256561 255309 254719 254604 254312 253485 252468 251738 251179 250270 248817 247082 245319
53086 245319 243672 242536 242414 243204 244064 244260 243807 243097 242349 241787 241948 243252 245387 247527 249106 250100 250664
53069 250664 250896 250951 251014 251106 251158 251275 251669 252295 252812 253070 253398 254203 255372 256199 255974 254647 252933 251712 251225
$$ packed form
53187C35126n324m518l686k900k461k592l140l657l699l056j982j102q41r43q21
53172B94404l20K36O26Q57O95j86j401j917j315m30k13n31o71n62p57j409k038
53155B85068k263k197k093k055k131k206j916j119l77l83r62j258r56o40o89n97
53139B63226Q5P80N86k93p07j47N30K80p64j534j339m50M49Q95P60K15j97O1Q49
53120B63285J313Q94N4l34r3K48L91N60P94O17k24j189j533j205p66o12o39o46
53102B60915o75q93j276j510j252n90j15k92q27j017p30n59r09j453j735j763
53086B45319j647j136j22P90Q60J96m53p10p48n62J61J304K135K140J579R94N64
53069B50664K32N5O3R2N2J17L94O26N17K58L28Q05J169Q27k25j327j714j221m87
$$ plain form
53050 251225 250935 250245 249269 248678 248859 249504 250099 250569 251200 252082 252892 253209 252847 251854 250424 248938 247903 247591
53032 247591 247728 247729 247308 246684 246135 245547 244612 243397 242422 242147 242522 243167 243859 244688 245753 246790 247230 246734
53014 246734 245695 245081 245592 247002 248461 249387 249878 250278 250658 250883 250959 251019 251019 250734 250131 249598 249676 250600 252109
52995 252109 253678 254845 255377 255231 254538 253644 253048 253101 253787 254871 256174 257607 259030 260349 261791 263757
52979 263757 266208 268470 269875 270493 270941 271551 272090 272316 272461 272954 273839 274728 275292 275648 276264 277545 279507
52962 279507 281775 283908 285714 287164 288067 288069 287142 285822 284682 283719 282580 281272 280174 279284 278015 275996
52946 275996 273641 271542 269677 267698 265710 264186 263265 262735 262636 263208 264186 264798 264697 264318 264062 263699 262906
52929 262906 261813 260602 259180 257828 257623 259370 262308 264654 265414 265070 264559 264272 264103 263828 263239 262416
$$ packed form
53050B51225k90o90r76n91J81O45N95M70O31Q82Q10L17l62r93j430j486j035l12
53032B47591J37Jm21o24n49n88r35j215r75k75L75O45O92Q29J065J037M40m96
53014B46734j039o14N11J410J459R26M91M00L80K25P6O0%k85o03n33P8R24J509
52995B52109J569J167N32j46o93q94n96N3O86J084J303J433J423J319J442J966
52979B63757K451K262J405O18M48O10N39K26J45M93Q85Q89N64L56O16J281J962
52962B79507K268K133J806J450R03Kr27j320j140r63j139j308j098q90j269k019
52946B75996k355k099j865j979j988j524r21n30r9N72R78O12j01l79k56l63p93
52929B62906j093j211j422j352k05J747K938K346P60l44n11k87j69k75n89q23
$$ plain form
52913 262416 261975 262542 263831 264758 264677 264045 263637 263586 263511 263145 262459 261497 260509 259993 260191 260691 260861 260533 259977
52894 259977 259379 258707 258001 257417 256966 256538 256256 256524 257543 258892 259746 259588 258649 257600 256829 256112 255077
52877 255077 253810 252789 252282 252069 251742 251083 250160 249304 248978 249395 250228 251014 251881 253515 256307 259877 263547
52860 263547 266902 269666 271492 272254 272306 272098 271712 271055 270233 269357 268187 266398 264113 261723 259249 256298
52844 256298 252755 249148 246138 243920 242310 241213 240706 240675 240598 239936 238746 237776 237769 238715 239909 240735 241191
52827 241191 241654 242379 243312 244122 244336 243669 242411 241267 240623 240126 239253 238122 237473 237886 239182 240638 241708
52810 241708 242612 244262 247509 252375 258035 263379 267391 269152 268170 264941 260762 256662 252813 249177 246122
52795 246122 243832 241525 238144 233840 230098 228172 227860 228029 227938 227724 227824 228336 228966 229435 229745 229998 230050
$$ packed form
52913B62416m41N67J289R27q1o32m08n1p5l66o86r62r88n16J98N00J70l28n56
52894B59977n98o72p06n84m51m28k82K68J019J349Q54j58r39j049p71p17j035
52877B55077j267j021n07k13l27o59r23q56l26M17Q33P86Q67J634K792L570L670
52860B63547L355K764J826P62N2k08l86o57q22q76j170j789k285k390k474k951
52844B56298l543l607l010k218j610j097n07l1p7o62j190r70pR46J194Q26M56
52827B41191M63P25R33Q10K14o67j258j144o44m97q73j131o49M13J296J456J070
52810B41708R04J650L247M866N660N344M012J761r82l229m179m100l849l636l055
52795B46122k290k307l381m304l742j926l12J69r1k14J00N12O30M69L10K53N2
$$ plain form
52778 230050 229625 228847 228425 228958 230217 231399 232097 232714 233889 235704 237588 238862 239330 239385 239507 239693 239519
52761 239519 238765 237714 236778 236114 235821 236124 236985 237776 237857 237353 236894 236602 235892 234476 233090 232859 234089 236021
52743 236021 237680 238731 239446 240120 240743 241231 241657 242085 242397 242606 243141 244409 246141 247687 248997 250708
52727 250708 253126 255803 258425 261343 264572 266898 266936 264770 261806 259116 256773 254732 253435 253265 253971
52712 253971 254938 255667 255975 256062 256361 256873 256804 255374 252966 250811 249591 248961 248475 248188 248201 248356 248680 249472
52694 249472 250624 251481 251714 251786 252216 252912 253570 254192 254838 255415 256051 257158 258706 260003 260639 261047 261675 262233
52676 262233 262412 262735 263870 265523 266802 267386 267515 267142 266025 264522 263394 262738 261956 260843 259959 259776
52660 259776 260193 261064 262435 263979 264958 265186 265484 266734 269020 272111 276156 281159 286090 289375 290329 289577
$$ packed form
52778B30050m25p78m22N33J259J182O98O17J175J815J884J274M68N5J22J86j74
52761B39519p54j051r36o64k93L03Q61P91Q1n04m59k92p10j416j386k31J230J932
52743B36021J659J051P15O74O23M88M26M28L12K09N35J268J732J546J310J711
52727B50708K418K677K622K918L229K326L8k166k964k690k343k041j297j70P06
52712B53971R67P29L08Q7K99N12o9j430k408k155j220o30m86k87J3J55L24P92
52694B49472J152Q57K33P2M30O96O58O22O46N77O36J107J548J297O36M08O28N58
52676B62233J79L23J135J653J279N84J29l73j117j503j128o56p82j113q84j83
52660B59776M17Q71J371J544R79K28K98J250K286L091M045N003M931L285R54p52
$$ plain form
52644 289577 288033 286054 283761 281579 279928 278573 276811 274364 271788 269861 268819 268408 268449 269022 270148
52629 270148 271711 273770 276529 279746 282467 283690 283180 281446 279091 276486 273853 271283 268722 266249
52615 266249 264310 263374 263390 263933 264799 266036 267402 268275 268325 267960 267896 268467 269429 270209 270281 269567 268573 267912 267692
52596 267692 267653 267865 268728 270130 271182 271200 270543 270074 270116 270483 271164 272283 273489 274118 274122 274328 275503 277548
52578 277548 279760 281527 282571 282866 282627 282106 281197 279515 277134 274898 273596 273017 272251 270844 269222 268024
52562 268024 267474 267464 267800 268103 267859 266908 265781 265271 265697 266653 267359 267177 266011 264388 263057 262375 262198 262373
52544 262373 262990 263929 264550 264316 263570 263170 263393 263704 263685 263624 263909 264293 264232 263757 263537 264068 265145 266220 267033
52525 267033 267712 268358 268776 268764 268581 268861 269877 271041 271457 270979 270466 270872 272377 274543 277050 279976 283465
$$ packed form
52644B89577j544j979k293k182j651j355j762k447k576j927j042m11M1N73J126
52629B70148J563K059K759L217K721J223n10j734k355k605k633k570k561k473
52615B66249j939r36J6N43Q66J237J366Q73N0l65o4N71R62P80P2p14r94o61k20
52596B67692l9K12Q63J402J052J8o57m69M2L67O81J119J206O29MK06J175K045
52578B77548K212J767J044K95k39n21r09j682k381k236j302n79p66j407j622j198
52562B68024n50j0L36L03k44r51j127n10M26R56P06j82j166j623j331o82j77J75
52544B62373O17R39O21k34p46m00K23L11j9o1K85L84o1m75k20N31J077J075Q13
52525B67033O79O46M18j2j83K80J016J164M16m78n13M06J505K166K507K926L489
$$ plain form
52508 283465 287431 291596 295661 299357 302426 304574 305418 304613 302146 298482 294340 290324 286746 283639 280884
52493 280884 278445 276584 275662 275580 275581 274836 273187 271228 269722 269119 269483 270623 272258 274236 276600 279299
52477 279299 281926 283999 285516 286985 288775 290644 292139 293239 294327 295532 296448 296741 296815 297498 299120
52462 299120 301314 303825 306971 310849 314501 316629 317097 316929 316604 315172 311625 306585 301820 298306 295487
52447 295487 292431 288965 285476 282185 279035 276048 273448 271488 270293 269803 269853 270370 271451 272998 274394
52432 274394 274854 274172 272858 271531 270444 269599 268923 268170 267026 265606 264605 264691 265863 267543 269106 270218
52416 270218 270949 271767 273153 274971 276502 277366 278154 279795 282582 286233 290689 296270 303218 311642 321858
52401 321858 333950 346729 357752 364857 367401 365842 360790 353070 344217 335979 329172 323482 318430
$$ packed form
52508B83465L966M165M065L696L069K148Q44q05k467l664m142m016l578l107k755
52493B80884k439j861r22q2Jp45j649j959j506o03L64J140J635J978K364K699
52477B79299K627K073J517J469J790J869J495J100J088J205R16K93P4O83J622
52462B99120K194K511L146L878L652K128M68j68l25j432l547n040m765l514k819
52447B95487l056l466l489l291l150k987k600j960j195m90N0N17J081J547J396
52432B74394M60o82j314j327j087q45o76p53j144j420j001Q6J172J680J563J112
52416B70218P31Q18J386J818J531Q64P88J641K787L651M456N581O948Q424J0216
52401C21858J2092J2779J1023P105K544j559n052p720q853q238o807n690n052
$$ plain form
52388 318430 314055 310642 308284 306871 306092 305293 303840 301846 300203 299593 299818 300341 301147 302665 305113 308370
52372 308370 312331 316920 321815 326586 331137 335675 340218 344351 347496 349224 349388 348269 346562 344945
52358 344945 343697 342858 342520 342577 342442 341601 340392 339655 339674 340087 340869 342518 344965 347126 348163 348593 349517
52341 349517 351205 353148 355133 357460 360242 363292 366714 370944 376092 381768 387690 393942 400529 407250
52327 407250 414270 422373 432272 443923 456741 470187 483883 497370 510201 522257 533795 545160
52315 545160 556555 568053 579702 591593 603867 616667 630052 643911 657963 671977 686136
52304 686136 701042 717053 733604 749647 764930 780325 796566 813089 828631 842597 855179
52293 855179 866361 875616 882576 887275 889622 889439 887244 884239 881069 877197 871993 865951 860170 855017
$$ packed form
52388C18430m375l413k358j413p79p99j453j994j643o10K25N23Q06J518K448L257
52372C08370L961M589M895M771M551M538M543M133L145J728J64j119j707j617
52358C44945j248q39l38N7j35q41j209p37J9M13P82J649K447K161J037M30R24
52341C49517J688J943J985K327K782L050L422M230N148N676N922O252O587O721
52327D07250P020Q103R899J1651J2818J3446J3696J3487J2831J2056J1538J1365
52315E45160J1395J1498J1649J1891J2274J2800J3385J3859J4052J4014J4159
52304F86136J4906J6011J6551J6043J5283J5395J6241J6523J5542J3966J2582
52293H55179J1182R255O960M699K347j83k195l005l170l872n204o042n781n153
$$ plain form
52279 855017 849986 844755 839717 835434 832128 829864 828790 828870 829620 830414 831157 832555 835606 840764 847711
52264 847711 855920 865174 875203 885108 893870 901611 909800 919804 931654 944538 957986 972022 986542
52251 986542 1001282 1016217 1031246 1045470 1057587 1067203 1075084 1081753 1086475 1088207 1087115 1084463 1081125
52238 1081125 1076960 1071773 1066204 1061150 1056560 1051356 1044649 1036694 1028506 1020741 1013238 1005551 997687 990160
52224 990160 983447 977476 971695 965655 959542 954045 949612 945943 942450 939147 936775 935885 936040 936228 936011
52209 936011 936102 937795 941907 948168 955438 962399 968159 972391 975214 977115 978866 981197 984414 988453 993309
52194 993309 999150 1005936 1013230 1020610 1028104 1035942 1044000 1051700 1058402 1063705 1067438 1069533 1069879 1068160
52180 1068160 1063922 1057055 1048164 1038288 1028229 1018304 1008682 999699 991752 984988 979155 973696 968139 962601
$$ packed form
52279H55017n031n231n038m283l306k264j074Q0P50P94P43J398L051N158O947
52264H47711Q209R254J0029R905Q762P741Q189J0004J1850J2884J3448J4036J4520
52251I86542J4740J4935J5029J4224J2117R616P881O669M722J732j092k652l338
52238A081125m165n187n569n054m590n204o707p955q188p765p503p687p864p527
52224I90160o713n971n781o040o113n497m433l669l493l303k372q90J55J88k17
52209I36011R1J693M112O261P270O961N760M232K823J901J751K331L217M039M856
52194I93309N841O786P294P380P494P838Q058P700O702N303L733K095L46j719
52180A068160m238o867q891r876j0059r925r622q983p947o764n833n459n557n538
$$ plain form
52166 962601 957895 954970 954182 955187 957399 960391 963931 967937 972388 976995 980909 983146 983502 982811 982076
52151 982076 981570 981013 980396 980146 980502 981179 981829 982558 983714 985255 986619 987222 986920 985959 984660 983219 981735
52134 981735 980366 979434 979345 980301 982142 984655 988040 992924 999840 1008947 1020309 1034127 1050405 1068646
52120 1068646 1088248 1108997 1130768 1152904 1174461 1195152 1215527 1236030 1256360 1275976 1294701
52109 1294701 1312425 1328632 1342750 1354841 1365572 1375721 1386094 1397629 1410886 1425386 1439906
52098 1439906 1453541 1466135 1477733 1488155 1497180 1504548 1509427 1510340 1506097 1496774 1483570 1467918 1450944
52085 1450944 1433438 1415833 1398184 1380576 1363687 1348733 1336614 1327197 1319500 1312560 1306081 1300334
52073 1300334 1295603 1291917 1289321 1288243 1289302 1292667 1297718 1303494 1309484 1315938 1323452 1332361 1342587 1353902
$$ packed form
52166I62601m706k925p88J005K212K992L540M006M451M607L914K237L56o91p35
52151I82076n06n57o17k50L56O77O50P29J156J541J364O03l02r61j299j441j484
52134I81735j369r32q9R56J841K513L385M884O916R107J1362J3818J6278J8241
52120A068646J9602K0749K1771K2136K1557K0691K0375K0503K0330J9616J8725
52109A294701J7724J6207J4118J2091J0731J0149J0373J1535J3257J4500J4520
52098A439906J3635J2594J1598J0422R025P368M879R13m243r323j3204j5652j6974
52085A450944j7506j7605j7649j7608j6889j4954j2119r417p697o940o479n747
52073A300334m731l686k596j078J059L365N051N776N990O454P514Q909J0226J1315
$$ [...]
##END NTUPLES=NMR SPECTRUM
##END=
