##TITLE=AC1406_BRAA12215_7653149_5PJ1xK5njd
##JCAMPDX= 6.0         $$ Bruker NMR JCAMP-DX V2.0
##DATA TYPE= NMR SPECTRUM
##DATA CLASS= NTUPLES
##ORIGIN= BRUKER
##OWNER= Administrator
$$ 1.72 TOPSPIN		Version 2.1
$$ 2013-04-11 16:11:20.240 -0700  Administrator@X
$$ Compression mode = diff/dup
##.OBSERVE FREQUENCY= 400.02188249412
##.OBSERVE NUCLEUS= ^1H
##.ACQUISITION MODE= SIMULTANEOUS (DQD)
##.ACQUISITION SCHEME= undefined
##.AVERAGES= 8
##.DIGITISER RES= 22
##SPECTROMETER/DATA SYSTEM= spect
##.PULSE SEQUENCE= zg30
##.SOLVENT NAME= COFFEE_meoh
##.SHIFT REFERENCE= INTERNAL, COFFEE_meoh, 1, 14.98509
##AUDIT TRAIL= $$ (NUMBER, WHEN, WHO, WHERE, PROCESS, VERSION, WHAT)
$$ ##TITLE= Audit trail, TOPSPIN		Version 2.1
$$ ##JCAMPDX= 5.01
$$ ##ORIGIN= Bruker BioSpin GmbH
$$ ##OWNER= Administrator
$$ $$ E:\/data/COFFEE/nmr/AC1406_BRAA12215_7653149_5PJ1xK5njd/40/pdata/1/auditp.txt
$$ ##AUDIT TRAIL=  $$ (NUMBER, WHEN, WHO, WHERE, PROCESS, VERSION, WHAT)
(   1,<2013-04-11 16:11:10.913 -0700>,<Administrator>,<X>,<go>,<TOPSPIN 2.1>,
      <created by zg
	started at 2013-04-11 16:10:04.535 -0700,
	POWCHK enabled, PULCHK disabled,
       configuration hash MD5:
       33 CF 6A 21 5C D3 B9 40 6C 15 AA 8D 27 A2 4F 13
       data hash MD5: 64K
       38 4F FA E2 A8 14 12 C4 F9 CD BF AC EB 2D C6 38>)
(   2,<2013-04-11 16:11:14.036 -0700>,<Administrator>,<X>,<proc1d>,<TOPSPIN 2.1>,
      <Start of raw data processing
       efp LB = 0 FT_mod = 6 PKNL = 1 PHC0 = 0 PHC1 = 0 SI = 32K 
       data hash MD5: 32K
       5D A9 37 7C 90 BA BA BE 05 00 2B 29 04 36 1C 58>)
(   3,<2013-04-11 16:11:15.810 -0700>,<Administrator>,<X>,<proc1d>,<TOPSPIN 2.1>,
      <pk PHC0 = 99.66248 PHC1 = 0 
       data hash MD5: 32K
       D0 6D 21 80 E7 46 9C 7C D3 87 98 37 D5 0D 91 33>)
(   4,<2013-04-11 16:11:16.037 -0700>,<Administrator>,<X>,<proc1d>,<TOPSPIN 2.1>,
      <abs ABSG = 1 
       data hash MD5: 32K
       D3 EC E0 CC 0B 8B BD C7 E5 0A 8F 6B 02 F5 A5 80>)
(   5,<2013-04-11 16:11:16.174 -0700>,<Administrator>,<X>,<proc1d>,<TOPSPIN 2.1>,
      <abs ABSG = 2 
       data hash MD5: 32K
       C6 26 E0 17 C3 BC A6 BE CD 2D 37 A4 7E 6C 08 44>)
(   6,<2013-04-11 16:11:16.325 -0700>,<Administrator>,<X>,<proc1d>,<TOPSPIN 2.1>,
      <abs ABSG = 3 
       data hash MD5: 32K
       6D 00 CD 8B DC A4 9D 3E BC 11 15 26 1C 02 7B 2C>)
(   7,<2013-04-11 16:11:16.462 -0700>,<Administrator>,<X>,<proc1d>,<TOPSPIN 2.1>,
      <abs ABSG = 4 
       data hash MD5: 32K
       26 51 06 5F 22 AE 51 4E FB DE FA 8C C6 73 71 E9>)
(   8,<2013-04-11 16:11:16.600 -0700>,<Administrator>,<X>,<proc1d>,<TOPSPIN 2.1>,
      <abs ABSG = 5 
       data hash MD5: 32K
       D9 62 7E E7 42 E8 47 9D B6 5A 8F C2 2D CD 5A 47>)
$$ ##END=
$$ 
$$ $$ hash MD5
$$ $$ DE 86 5B CA 68 BA AE B2 59 1B A0 7A 4B 25 24 2C
##$RELAX= 
##$RELAX= 
##$RELAX= 
##$RELAX= 
##$RELAX= 
##$RELAX= 
##$RELAX= 
$$ Bruker specific parameters
$$ --------------------------
##$DU= <E:\>
##$EXPNO= 40
##$NAME= <AC1406_BRAA12215_7653149_5PJ1xK5njd>
$$ [...]
150 150 150 150 150 150 150 150
##$TP07= 0
##$TPNAME0= <>
##$TPNAME1= <>
##$TPNAME2= <>
##$TPNAME3= <>
##$TPNAME4= <>
##$TPNAME5= <>
##$TPNAME6= <>
##$TPNAME7= <>
##$TPOAL= (0..7)
0.5 0.5 0.5 0.5 0.5 0.5 0.5 0.5
##$TPOFFS= (0..7)
0 0 0 0 0 0 0 0
##$TUNHIN= 0
##$TUNHOUT= 0
##$TUNXOUT= 0
##$USERA1= <user>
##$USERA2= <user>
##$USERA3= <user>
##$USERA4= <user>
##$USERA5= <user>
##$V9= 5
##$VALIST= <valist>
##$VCLIST= <CCCCCCCCCCCCCCC>
##$VD= 0
##$VDLIST= <DDDDDDDDDDDDDDD>
##$VPLIST= <PPPPPPPPPPPPPPP>
##$VTLIST= <TTTTTTTTTTTTTTT>
##$WBST= 2048
##$WBSW= 25
##$XGAIN= (0..3)
0 0 0 0
##$XL= 0
##$YL= 0
##$YMAX_a= 650254
##$YMIN_a= -553652
##$ZGOPTNS= <>
##$ZL1= 120
##$ZL2= 120
##$ZL3= 120
##$ZL4= 120
##$ABSF1= 14.98509
##$ABSF2= -5.573092
##$ABSG= 5
##$ABSL= 3
##$ALPHA= 0
##$AQORDER= 0
##$ASSFAC= 0
##$ASSFACI= 0
##$ASSFACX= 0
##$ASSWID= 0
##$AUNMP= <proc_prof1d_extract_pilot.lims>
##$AXLEFT= 0
##$AXNAME= <>
##$AXNUC= <1H>
##$AXRIGHT= 0
##$AXTYPE= 0
##$AXUNIT= <>
##$AZFE= 0.1
##$AZFW= 0.1
##$BCFW= 0
##$BC_mod= 0
##$BYTORDP= 0
##$COROFFS= 0
##$CY= 15
##$DATMOD= 1
##$DC= 0
##$DFILT= <>
##$DTYPP= 0
##$F1P= 0
##$F2P= 0
##$FCOR= 0.5
##$FTSIZE= 32768
##$FT_mod= 6
##$GAMMA= 0
##$GB= 0
##$INTBC= 1
##$INTSCL= 1
##$ISEN= 128
##$LB= 0
##$LEV0= 0
##$LPBIN= 0
##$MAXI= 10000
##$MC2= 0
##$MEAN= 0
##$ME_mod= 0
##$MI= 0
##$NCOEF= 0
##$NC_proc= -8
##$NLEV= 6
##$NOISF1= 0
##$NOISF2= 0
##$NSP= 0
##$NTH_PI= 0
##$NZP= 0
##$OFFSET= 14.98509
##$PC= 1
##$PHC0= 99.66248
##$PHC1= 0
##$PH_mod= 1
##$PKNL= yes
##$PPARMOD= 0
##$PPDIAG= 0
##$PPIPTYP= 0
##$PPMPNUM= 2147483647
##$PPRESOL= 1
##$PSCAL= 4
##$PSIGN= 0
##$PYNMP= <proc.py>
##$REVERSE= no
##$SF= 400.02
##$SI= 32768
##$SIGF1= 0
##$SIGF2= 0
##$SINO= 400
##$SIOLD= 32768
##$SPECTYP= <>
##$SREGLST= <1H.CDCl3>
##$SSB= 0
##$STSI= 32768
##$STSR= 0
##$SW_p= 8223.68421052631
##$SYMM= 0
##$S_DEV= 0
##$TDeff= 65536
##$TDoff= 0
##$TI= <>
##$TILT= no
##$TM1= 0
##$TM2= 0
##$TOPLEV= 0
##$USERP1= <user>
##$USERP2= <user>
##$USERP3= <user>
##$USERP4= <user>
##$USERP5= <user>
##$WDW= 1
##$XDIM= 32768
##$YMAX_p= 454814532
##$YMIN_p= -772845
##$CURPLOT= <Network HP LaserJet P1505>
##$CURPRIN= <$Network HP LaserJet P1505>
##$DFORMAT= <normdp>
##$LAYOUT= <+/1D_H.xwp>
##$LFORMAT= <normlp>
##$PFORMAT= <normpl>
##$SURQMSG= 1
$$ End of Bruker specific parameters
$$ ---------------------------------
##NTUPLES= NMR SPECTRUM
##VAR_NAME=  FREQUENCY,     SPECTRUM/REAL,   SPECTRUM/IMAG
##SYMBOL=    X,             R,               I
##VAR_TYPE=  INDEPENDENT,   DEPENDENT,       DEPENDENT
##VAR_FORM=  AFFN,          ASDF,            ASDF
##VAR_DIM=   32768,         32768,           32768
##UNITS=     HZ,            ARBITRARY UNITS, ARBITRARY UNITS
##FACTOR=    0.250966925370066, 1,           1
##FIRST=     8223.43324360094, -71026,       -182599
##LAST=      0,             -127855,         42197
##MIN=       0,             -772845,         0
##MAX=       8223.43324360094, 454814532,    0
$$ Real data points
##PAGE= N=1
##DATA TABLE= (X++(R..R)), XYDATA
$$ [...]
19560d4770L841p4069j75782Q1362g4611G4152C5580b60839k6196A12203b48744
$$ -44770 -40929 -114998 -290780 -209418 -74611 74152 35580 -260839 -287035 112203 -248744
19548c32491g6550m7308j54900q5496C31142a83993F8340c69579F6708b50938
$$ -332491 -76550 -123858 -278758 -364254 331142 -183993 68340 -369579 66708 -250938
19537A26724b07115k8486A7289e6186H7937J46664a08327A30205A406e9762B29898
$$ 126724 -207115 -235601 17289 -56186 87937 234601 -108327 130205 1406 -59762 229898
19525B7786b04151B88156b4120o3379j18080D8706J43995E4677b69452J33300
$$ 27786 -204151 288156 -24120 -87499 -205579 48706 192701 54677 -269452 -136152
19515a36152e6561A67466b34876A44236a14100N0692F822Q2223a52808A88073
$$ -136152 -56561 167466 -234876 144236 -114100 -63408 6822 89045 -152808 188073
19504e630j06472H6143K17691B5903a80878A08293a22131B9880K8533b88437A73364
$$ -5630 -112102 86143 303834 25903 -180878 108293 -122131 29880 58413 -288437 173364
19492d5998o6881o1156A03278i8877j49455M3d8759J5790G3456b01213l4857I6556
$$ -45998 -112879 -174035 103278 -98877 -248332 -248289 -48759 -32969 73456 -201213 -236070 96556
19479D08163a60865j22254A3115L3565M4610h0370J4277G661a75962A20115c7262
$$ 408163 -160865 -283119 13115 46680 91290 -80370 -66093 7661 -175962 120115 -37262
19467G1492c3908D6941a24755D578a3046A31782B4980L0923a68624m1924d2347
$$ 71492 -33908 46941 -124755 4578 -13046 131782 24980 55903 -168624 -210548 -42347
19455f077F1170f3637c1277l9285k63645A98336c9413m86917c5602A53706a60030
$$ -6077 61170 -63637 -31277 -70562 -334207 198336 -39413 -526330 -35602 153706 -160030
19443A3331R8711L4101c19671D5302K38749A4757N495K54671j7573b37422C1232
$$ 13331 112042 146143 -319671 45302 284051 14757 20252 274923 257350 -237422 31232
19431a3386b969k80479H1227c42340b0933A21828B3746d1581k99373A92476h3288
$$ -13386 -2969 -283448 81227 -342340 -20933 121828 23746 -41581 -340954 192476 -83288
19419A65652a95185M9045M9463j19890O559j02450B37033A11795a07566l8238
$$ 165652 -195185 -146140 -96677 -216567 -210008 -312458 237033 111795 -107566 -145804
19409a45804H9847J7571a31827j44653J32724b5821r789B07076d33016a77496
$$ -145804 89847 107418 -131827 -276480 -143756 -25821 -35610 207076 -433016 -177496
19398B8828a64660j26301J39410O6848j45909h6592C1786g6127J1647A78823l4675
$$ 28828 -164660 -290961 -151551 -84703 -230612 -86592 31786 -76127 -64480 178823 144148
19387A44148a681k5862A12395B7026b03729E0833c89463a56980e8186k06731a5888
$$ 144148 -1681 -27543 112395 27026 -203729 50833 -389463 -156980 -58186 -264917 -15888
19375A30430c29296F4109a23547A87213c16644a36580B51696A3443a29643E9339
$$ 130430 -329296 64109 -123547 187213 -316644 -136580 251696 13443 -129643 59339
19364C1902g5095A61087p3476c59589E7425N7813a53283m0552B4174O1029i2986
$$ 31902 -75095 161087 87611 -359589 57425 115238 -153283 -193835 24174 85203 -92986
19352H1783b41543F2882c69263L1643A20458b8580m3885j7270B0568a44559A30273
$$ 81783 -241543 62882 -369263 -337620 120458 -28580 -72465 -89735 20568 -144559 130273
19340b43319P5753C36387a7795E3651O849a03468j9485j17438J2791g0386l2315
$$ -243319 -167566 336387 -17795 53651 60500 -103468 -122953 -240391 -227600 -70386 -102701
19329a02701l6814m4056B7103i2512A25617a61892H3538a26144e106j96499k52750
$$ -102701 -139515 -183571 27103 -92512 125617 -161892 83538 -126144 -5106 -201605 -454355
19318d54355J27534a59681g8006A61523a02048B74726c56476h798k01526G4085
$$ -454355 -326821 -159681 -78006 161523 -102048 274726 -356476 -8798 -210324 74085
19307i893B33818d2803C60259A12391g1001A38335l2598d01549a22092L3353A6766
$$ -9893 233818 -42803 360259 112391 -71001 138335 105737 -401549 -122092 -88739 16766
19295a23956F5066M5085J62732c00555A08118c6224l49400a72403F4838h643j9112
$$ -123956 65066 110151 272883 -300555 108118 -36224 -385624 -172403 64838 -8643 -27755
19284b7755k96444P3467R9473H962K9867a70688o3529A46594b27406I9271a33304
$$ -27755 -324199 -250732 -151259 8962 38829 -170688 -234217 146594 -227406 99271 -133304
19272A45021d7313L884C30272b44324C1517d09488f296l8658G0052a40880L0328
$$ 145021 -47313 -43429 330272 -244324 31517 -409488 -6296 -44954 70052 -140880 -110552
19261a10552B38134a02036l2043j56830A9206a08470k29396H7584m0271b17184
$$ -110552 238134 -102036 -134079 -290909 19206 -108470 -337866 87584 47313 -217184
19250B5794b32607j77268R7296a44876I6760c95477e6376p4550B06946c12722
$$ 25794 -232607 -409875 -312579 -144876 96760 -395477 -56376 -130926 206946 -312722
19239C17725b4205k34839A41906J03982l8030p7788g0786j76969j50255C6655
$$ 317725 -24205 -259044 141906 245888 207858 130070 -70786 -247755 -398010 36655
19228B17877a07954d0651G4247N3191g1909C0230a48658j20829J15568K8326q6369
$$ 217877 -107954 -40651 74247 127438 -71909 30230 -148658 -269487 -153919 -125593 -211962
19217b11962j42964a51159C4783c77537D039L44896A62380m4198a30698K2017
$$ -211962 -354926 -151159 34783 -377537 4039 348935 162380 118182 -130698 -108681
19207a08681G380J61986n9737a00581j06174A43798C3658L2282d52390H0165d2052
$$ -108681 7380 169366 109629 -100581 -206755 143798 33658 65940 -452390 80165 -42052
19195a56570d7664k03472B75373C841a23240b2950A44795p0457c10318L7359D6140
$$ -156570 -47664 -251136 275373 3841 -123240 -22950 144795 74338 -310318 -272959 46140
19183A90181a45903A20823a40532a4916l4193r1269l11244a25161B09471n7949
$$ 190181 -145903 120823 -140532 -14916 -49109 -140378 -451622 -125161 209471 151522
19173A51522g2367j9213K5674C7332b51612A6098e7571j16027L043g0028j60958
$$ 151522 -72367 -91580 -65906 37332 -251612 16098 -57571 -173598 -170555 -70028 -230986
19162b30986g467l7366k41279g3871j51651O8221J1995j02139I5868J3266j1939
$$ -230986 -7467 -44833 -286112 -73871 -225522 -157301 -145306 -247445 95868 109134 97195
19151I7195b59379B13966a52345G9145b42942Q9314A86947c45976a29923D0539
$$ 97195 -259379 213966 -152345 79145 -242942 -153628 186947 -345976 -129923 40539
19140b6853k88204A4494a19023A20779n3800K50536A35245b07858M7063G3702
$$ -26853 -315057 14494 -119023 120779 66979 317515 135245 -207858 -160795 73702
19129D9062k474b23926I6413f9747A01186b55894i4256J8213A18020D9146J13495
$$ 49062 46588 -223926 96413 -69747 101186 -255894 -94256 -76043 118020 49146 162641
19118A62641E6363O6604e6351r4819D3099e1580j40166A5483a15640q7579M6633
$$ 162641 56363 122967 -56351 -151170 43099 -51580 -191746 15483 -115640 -203219 -156586
19107a56586c665j51732j13388A20116h1314B01709a58104f819H528L1736a129
$$ -156586 -3665 -155397 -268785 120116 -81314 201709 -158104 -6819 8528 40264 -1129
19095C7785c60044a70673M5326O1029l21104D9765j634a39675L968j75140G4217
$$ 37785 -360044 -170673 -125347 -64318 -385422 49765 48131 -139675 -135707 -310847 74217
19083A11894e9971m6644k73811A79224j4556N300n9818a88308Q5069c7110j210
$$ 111894 -59971 -106615 -380426 179224 164668 169968 110150 -188308 -103239 -37110 -38320
19072c8320B8885K26145B0889c0714j94682F2021b59293B13993c10992A82804
$$ -38320 28885 255030 20889 -30714 -225396 62021 -259293 213993 -310992 182804
19061a62154B3580h3964m6762c9115J4634j19043p5068C982b73809C9361J15480
$$ -162154 23580 -83964 -130726 -39115 -24481 -143524 -218592 3982 -273809 39361 154841
19050A54841K27904b51677B14905g2321I577e3971l3594D4152a18147C139J970
$$ 154841 382745 -251677 214905 -72321 9577 -53971 -87565 44152 -118147 3139 5109
19039E109b63891j0424J18503M6330A5677f3888R529A95616g9905n3168L7929
$$ 5109 -263891 -274315 -155812 -109482 15677 -63888 -54359 195616 -79905 -133073 -95144
19028i5144B56141A13568e5951A54113M7464a00661n1638A2845J65398a40494
$$ -95144 256141 113568 -55951 154113 201577 -100661 -152299 12845 178243 -140494
19017a65965F3500d221B73620a44727J5190G3895a09702J0193A33801f2410G258
$$ -165965 63500 -4221 273620 -144727 -129537 73895 -109702 -99509 133801 -62410 7258
19005b20357a5843j44909a6688A75772G6863a74067B80458A083J11009i8190A21255
$$ -220357 -15843 -160752 -16688 175772 76863 -174067 280458 1083 112092 -98190 121255
18993A42129a38933m0188I41c38190H6068d991j51671j22165A58869b4239B64141
$$ 142129 -138933 -179121 941 -338190 86068 -4991 -156662 -278827 158869 -24239 264141
18981b26128E3972F805J74994p6843f7833L747n6256G5140k9465a54147A39743
$$ -226128 53972 6805 181799 104956 -67833 -64086 -120342 75140 45675 -154147 139743
18969E7412J05232R1803m5825i2731q171j42422Q9979A91512a11342J7234m2481
$$ 57412 162644 254447 208622 -92731 -100902 -243324 -153345 191512 -111342 -94108 -136589
18958a36589N3053k19744A6896a50847j9427F1818J48163b61756C00500a21606
$$ -136589 -83536 -303280 16896 -150847 -170274 61818 209981 -261756 300500 -121606
18947b2416J212q0132I3426a69753K6079m8571B15366F1454a86506M7319K7036
$$ -22416 -21204 -101336 93426 -169753 -143674 -192245 215366 61454 -186506 -139187 -112151
18936a12151c0619p1193A70033p6103J14763f2434d152A70285J6373a18325A98033
$$ -112151 -30619 -101812 170033 93930 208693 -62434 -4152 170285 186658 -118325 198033
18924E8907O869b10933C360c2594A67990K8096c95858F8887a02707F5834c01849
$$ 58907 65776 -210933 3360 -32594 167990 196086 -395858 68887 -102707 65834 -301849
18912I5374a18231d0279A14412a38405j79738J32511A93937a09808k37322Q7248
$$ 95374 -118231 -40279 114412 -138405 -318143 -185632 193937 -109808 -347130 -259882
18902b59882L5325P6099A9149b2955A54905B5934b58461m3793A17151J79764a76626
$$ -259882 -224557 -148458 19149 -22955 154905 25934 -258461 -302254 117151 296915 -176626
18890b74648R4604k0840Q2071j09006K8305C08466b73652H0764c0020E8436b02656
$$ -274648 -180044 -200884 -118813 -227819 -199514 308466 -273652 80764 -30020 58436 -202656
18878c5765j54127a6955A38901b26123E8178a95453B19074j02776c23732a44155
$$ -35765 -189892 -16955 138901 -226123 58178 -195453 219074 116298 -323732 -144155
18867B03138F831b25767J12474M2855l0569A14371D0082a19781e1202p7682j49152
$$ 203138 6831 -225767 -113293 -70438 -101007 114371 40082 -119781 -51202 -128884 -278036
18856b78036F5568b4032r4453k98218C67273d89156a05339A75485M7847G0573
$$ -278036 65568 -24032 -118485 -416703 367273 -489156 -105339 175485 223332 70573
18845i861B13695a20402d4145I5012J59177d3352k59624a42635p2252p8500n5325
$$ -9861 213695 -120402 -44145 95012 254189 -43352 -302976 -142635 -214887 -293387 -348712
18834c48712R9056G9799b53931J07042e8028k73612H0934f9183C010N8587G364
$$ -348712 -249656 79799 -253931 -146889 -58028 -331640 80934 -69183 3010 61597 7364
18822A23802A9526q230R1234R6308n2168J5028b49923G3080b19285H2379d07158
$$ 123802 19526 11296 102530 198838 146670 161698 -249923 73080 -219285 82379 -407158
18810D12314b5205k42493i1022K8139B6881J21694c51049K7721A64806j3757c0872
$$ 412314 -25205 -267698 -91022 -62883 26881 148575 -351049 -323328 164806 151049 -30872
18798e6855A44158c04659B0981J41397a84923n4509j06603A02035a54125P1766
$$ -56855 144158 -304659 20981 162378 -184923 -239432 -346035 102035 -154125 -82359
18788h2359G6382b12819j3722c2559l0099k42613H4935b2775j09794B59669L5270
$$ -82359 76382 -212819 -226541 -32559 -62658 -305271 84935 -22775 -132569 259669 294939
18777B94939a50533L8667A38173a75983f8014A26108c38937B27948a59252A97935
$$ 294939 -150533 -111866 138173 -175983 -68014 126108 -338937 227948 -159252 197935
18766a37770l3638M6633A04622j8603b86211b7507i129A06098a75608B29827a00543
$$ -137770 -171408 -124775 104622 86019 -286211 -27507 -9129 106098 -175608 229827 -100543
18754B514a34238o009A57502d57767a19414k19540c4992p3356N3605j0981j15634
$$ 2514 -134238 -140247 157502 -457767 -119414 -338954 -34992 -108348 -54743 -65724 -181358
18743a81358M188A4934b5878j7093R090j11576f3698j17466A03231d18988a13145
$$ -181358 -177170 14934 -25878 -42971 -33881 -145457 -63698 -181164 103231 -418988 -113145
18731A84719d914j43114M0855C3680K00643a36634B13654a7847m3616n3490F4998
$$ 184719 -4914 -148028 -107173 33680 234323 -136634 213654 -17847 -61463 -114953 64998
18719a03533B32878a50503f3894m5371a0814n0671f61l06308b6490j86931L5500
$$ -103533 232878 -150503 -63894 -109265 -10814 -61485 -661 -306969 -26490 -213421 -177921
18708a77921j24618G6985i1516g252n6243k19307n7984G6569b2443H9522K42981
$$ -177921 -302539 76985 -91516 -7252 -63495 -282802 -340786 76569 -22443 89522 332503
18697C32503I0514K4373a63949d7368k1785k9419C3726f4005b3999G5966a37604
$$ 332503 90514 114887 -163949 -47368 -69153 -98572 33726 -64005 -23999 75966 -137604
18685h3858B51993i0811A09138a27341A05125a50459f3433m0541M539m3881L5072
$$ -83858 251993 -90811 109138 -127341 105125 -150459 -63433 -103974 -99435 -143316 -108244
18674a08244C9691J11332b82521D7316b13604M2915A1223a55768c9629j01762
$$ -108244 39691 151023 -282521 47316 -213604 -170689 11223 -155768 -39629 -141391
18664a41391K6448p3972L5914C1944a1115j56621j33341L4839e8526H2690g8913
$$ -141391 -114943 -188915 -153001 31944 -11115 -167736 -301077 -266238 -58526 82690 -78913
18652E1463J0378b69874a971H890P862e3565o8254C9254b23906i2573A08494a60441
$$ 51463 61841 -269874 -1971 8890 16752 -53565 -121819 39254 -223906 -92573 108494 -160441
18639a2120A53166D3515A4588M2341L1905b03740C1229K14735c7819j55386P6118
$$ -12120 153166 43515 14588 56929 88834 -203740 31229 245964 -37819 -193205 -117087
18628a17087q7088A69111F2047r667J68885a46495D39324b01749f73D3343h4895
$$ -117087 -204175 169111 62047 52380 221265 -146495 439324 -201749 -673 43343 -84895
18616A15670D4523b5244E37864i983k07194h5976a0826m37084B39216a93078n6710
$$ 115670 44523 -25244 537864 -9983 -217177 -85976 -10826 -447910 239216 -193078 -249788
18605b49788k7351B87288a22665A77889a72122A33473a87700J5454f1684j60324
$$ -249788 -277139 287288 -122665 177889 -172122 133473 -187700 -172246 -61684 -222008
18595b22008E8007J09101d9594A44491M1484a05473j86234c5712C87149A68899
$$ -222008 58007 167108 -49594 144491 185975 -105473 -291707 -35712 387149 168899
18584a1101k62353B45113c2146k9452q7971F2094A3456b71803A34559l5974a3288
$$ -11101 -273454 245113 -32146 -61598 -149569 62094 13456 -271803 134559 98585 -13288
18572a21577l6115A30300b7239j37460C5205L92033A62693C0040a01353j80620
$$ -121577 -157692 130300 -27239 -164699 35205 427238 162693 30040 -101353 -281973
18562b81973a36291c8823D9517P2044c3883C1914i9194B24481a82171p7825j0265
$$ -281973 -136291 -38823 49517 121561 -33883 31914 -99194 224481 -182171 -259996 -270261
18551b70261g789j50127k1637B81182f6708b0128C2722n179a9226j54469o5761
$$ -270261 -7789 -157916 -179553 281182 -66708 -20128 32722 27543 -19226 -173695 -239456
18540b39456f2207j72218P2685C5935b12595C3632c21017L4275i8714a1356A88098
$$ -239456 -62207 -234425 -161740 35935 -212595 33632 -321017 -286742 -98714 -11356 188098
18528C990K3697J22889a31228j16707A12837B2919J2160b1368H2638c2719H6381
$$ 3990 27687 150576 -131228 -247935 112837 22919 35079 -21368 82638 -32719 86381
18516a20137q468j37712a0467A74327a76136N7343A90558a43598D12085a80251
$$ -120137 -128605 -266317 -10467 174327 -176136 -118793 190558 -143598 412085 -180251
18505c65713J68428p4829P2445Q4365B5678e2806j05614c1497m2602a0113q8068
$$ -365713 -197285 -272114 -199669 -115304 25678 -52806 -158420 -31497 -74099 -10113 -98181
18494i8181p2849C8038K483a32005f3616A79330G0802b15561c5745l3310I2924
$$ -98181 -171030 38038 40521 -132005 -63616 179330 70802 -215561 -35745 -69055 92924
18482H8682c04947E2978d1342k1656m03649A0325a53303A80957a55627B21360
$$ 88682 -304947 52978 -41342 -62998 -466647 10325 -153303 180957 -155627 221360
18471a86119h6076j38271d8556j21904H0495c03128L9868A10512a06897C7281
$$ -186119 -86076 -224347 -48556 -170460 80495 -303128 -263260 110512 -106897 37281
18460E6870A3427F206c9933j05523c4219j3137a8067k47804J07786i487o32373
$$ 56870 13427 6206 -39933 -145456 -34219 -47356 -18067 -265871 -158085 -9487 -641860
18449f41860d2942n3921b7755l0932J5032C86474i0947J3825q9902e0373o1870
$$ -641860 -42942 -96863 -27755 -58687 -43655 386474 -90947 -77122 -167024 -50373 -112243
18438a12243C0246J65161a95387c4582A28771J96788A40902K0438a9171O703l12227
$$ -112243 30246 195407 -195387 -34582 128771 325559 140902 161340 -19171 -12468 -324695
18427c24695J28280E49b88431B81738a42171j08524I0220a3464D9778J87466G7411
$$ -324695 -196415 549 -288431 281738 -142171 -250695 90220 -13464 49778 237244 77411
18415b2549o7632j82589a32209k8430A06010b62320O6793m0179A10454K8015a72294
$$ -22549 -90181 -272770 -132209 -160639 106010 -262320 -195527 -235706 110454 138469 -172294
18403a70125A5436M5490d98868C3131c8999E8893K50190h7919B50370i8789B13498
$$ -170125 15436 60926 -498868 33131 -38999 58893 309083 -87919 250370 -98789 213498
18391B7614f9898A66493a85066B12615a20355q9698a7906j30383G156J03576c16719
$$ 27614 -69898 166493 -185066 212615 -120355 -210053 -17906 -148289 7156 110732 -316719
18379c76703a10049A44264Q8324H6339l5892J44459c37664A68510E7803a17479
$$ -376703 -110049 144264 232588 86339 50447 194906 -337664 168510 57803 -117479
18368b82097j29999i7530A0062f6646A19080J15537a00022E7397J71364B4683
$$ -282097 -412096 -97530 10062 -66646 119080 234617 -100022 57397 228761 24683
18357A100a48909m9204g0147A46641f2179K8719r0136b9236l0418F3698k4728
$$ 1100 -148909 -198113 -70147 146641 -62179 -33460 -123596 -29236 -59654 63698 38970
18346C8970a09630d7191B45948b4084H0355h510k82967J25022j6650I7623c59646
$$ 38970 -109630 -47191 245948 -24084 80355 -8510 -291477 -166455 -183105 97623 -359646
18334b5371I8798a94614d9118A55074b66849a16524H2317O558l9135b19955r6100
$$ -25371 98798 -194614 -49118 155074 -266849 -116524 82317 88875 49740 -219955 -316055
18323c16055K3204L4597i1383j21849A46442o1249e0202m7074c1880B5636J34325
$$ -316055 -292851 -258254 -91383 -213232 146442 85193 -50202 -97276 -31880 25636 159961
18312A59961l5529a17421c2249M443l42204a54645D1410L55772a79313e9795m06257
$$ 159961 124432 -117421 -32249 -27806 -370010 -154645 41410 397182 -179313 -59795 -466052
18301d66052A00e9402B66767a16872A8207h5850I4861a80692Q591l7080A06859
$$ -466052 100 -59402 266767 -116872 18207 -85850 94861 -180692 -172101 -209181 106859
18289c5820l899j46894A58024c47639A637a97764g8129o9707A68899a83702a5606
$$ -35820 -39719 -186613 158024 -347639 1637 -197764 -78129 -147836 168899 -183702 -15606
18277a0281C89487F3710a8345j51126H7088A8332a15486F8011a35532g635E4179
$$ -10281 389487 63710 -18345 -169471 87088 18332 -115486 68011 -135532 -7635 54179
18265a88045L5119k4566B43085c4434j09223J6298c7155m6221G3657a9739A53120
$$ -188045 -152926 -177492 243085 -34434 -143657 -127359 -37155 -83376 73657 -19739 153120
18253G2070K11853b6937E1595a91127P4750k99368b0727B10931f9224j47029P4958
$$ 72070 283923 -26937 51595 -191127 -116377 -415745 -20727 210931 -69224 -216253 -141295
18242a41295a6015L986j89866b0957o3646n9760b7413l05076a60361b895B17333
$$ -141295 -16015 -12029 -201895 -20957 -84603 -144363 -27413 -332489 -160361 -2895 217333
18230D9971e0103E8696b40844B2390N4799L1414E17h9846B0262c7208j12885C04314
$$ 49971 -50103 58696 -240844 22390 77189 108603 517 -89846 20262 -37208 -150093 304314
18217I0654h7297C60422A70258m3818c2376F4656b6967j96021l62931A8225a16404
$$ 90654 -87297 360422 170258 126440 -32376 64656 -26967 -222988 -585919 18225 -116404
18205A66776a02815E8360O5515b8039E9752a57302f5415A57569a17112k8188E2241
$$ 166776 -102815 58360 123875 -28039 59752 -157302 -65415 157569 -117112 -145300 52241
18193a19113j49790a29063B61279f8268j14373A56512O8290I5526b9542j21335
$$ -119113 -268903 -129063 261279 -68268 -182641 156512 224802 95526 -29542 -150877
18183a50877D7071b92632B24039g2028G1960R2716b66901b7967n9178B1272c1720
$$ -150877 47071 -292632 224039 -72028 71960 164676 -266901 -27967 -87145 21272 -31720
18171b66122A35949k1529a22674G0252l3510K41218b22400Q5471A02591J8193
$$ -266122 135949 114420 -122674 70252 36742 277960 -222400 -136929 102591 120784
18161A20784D1665b65461a19412c3175A4548a52764B13015h8542A18442N9502
$$ 120784 41665 -265461 -119412 -33175 14548 -152764 213015 -88542 118442 177944
18151A77944e8607o0886K1938B08715a14532c6115k85966c1571j73215C063P9473
$$ 177944 -58607 -119493 -97555 208715 -114532 -36115 -322081 -31571 -204786 3063 82536
18140H2536a01638q4156N2286e5054b2572A5783b73257b0275l43089A07377f1560
$$ 82536 -101638 -185794 -133508 -55054 -22572 15783 -273257 -20275 -363364 107377 -61560
18128f0982A95458g985q7945J731a9975I0794L41869a67402b0762D0203P7421
$$ -60982 195458 -7985 -95930 -94199 -19975 90794 432663 -167402 -20762 40203 117624
18117A17624b04086B68347a20492B54042G6792b4116j65907D8768M1542k2511
$$ 117624 -204086 268347 -120492 254042 76792 -24116 -190023 48768 90310 67799
18107F7799a02572A20125K454a54932a4957H437a47972k96854f6047M698H2287
$$ 67799 -102572 120125 122579 -154932 -14957 8437 -147972 -444826 -66047 -61349 82287
18095c675B11667l946n3406D2634a07852j30407B42433B5160a34871k7136B61140
$$ -3675 211667 207721 154315 42634 -107852 -238259 242433 25160 -134871 -162007 261140
18083B0464b66514B9569a15013c6405k66721B6353a01176A41428k6133f0299k58964
$$ 20464 -266514 29569 -115013 -36405 -303126 26353 -101176 141428 115295 -60299 -319263
18072c19263A14001n5666I255a75192C1652O9551j2459j4114c389A58417b22851
$$ -319263 114001 58335 9255 -175192 31652 101203 88744 74630 -3389 158417 -222851
18060d7276l23533A22844j4578b4079a1510B29493A10260m7358Q5666b29651B32159
$$ -47276 -370809 122844 108266 -24079 -11510 229493 110260 62902 148568 -229651 232159
18048F3438h6988j26984N8889L6784A45177a46714e1604B78598a39933I013m387
$$ 63438 -86988 -213972 -155083 -118299 145177 -146714 -51604 278598 -139933 9013 4626
18037D626L1602P9351K04140H1934N704f8705A6144K54859c44349B65352B2775
$$ 4626 36228 115579 319719 81934 87638 -68705 16144 271003 -344349 265352 22775
18025a828q477j85184h359j01453e1269j84203i1170L0489C9266J70619b62621
$$ -1828 -10305 -195489 -8359 -109812 -51269 -235472 -91170 -60681 39266 209885 -262621
18013a64690K778A20003D5520a7991p2971B17666b81030n8027A45195p0127J3115
$$ -164690 -161912 120003 45520 -17991 -90962 217666 -281030 -339057 145195 75068 88183
18002H8183C7632K9553g8313B13528B4404h6386k43633A44853B7339J02350e223
$$ 88183 37632 67185 -78313 213528 24404 -86386 -330019 144853 27339 129689 -5223
17990G7967Q9528g602j53045L3993n6245A84900b4217j71617A21987l2464b61365
$$ 77967 167495 -7602 -160647 -126654 -182899 184900 -24217 -195834 121987 89523 -261365
17978i0194A56213c611I1888g5913J1671A90157b27685c6540k22583h5564j34061
$$ -90194 156213 -3611 91888 -75913 -64242 190157 -227685 -36540 -259123 -85564 -219625
17967b19625L3424a9082j09038A5923g5626j93679L2306O8399I0218C6031a59518
$$ -219625 -186201 -19082 -128120 15923 -75626 -269305 -236999 -168600 90218 36031 -159518
17955H6776c0188p8699A27455C3424K04324i8966k26299a27174p3867b0931B66245
$$ 86776 -30188 -108887 127455 33424 237748 -98966 -325265 -127174 -201041 -20931 266245
17943b28638I5208a40376H8674K9484c96643c2110D2360i7780e928o2884k38907
$$ -228638 95208 -140376 88674 118158 -396643 -32110 42360 -97780 -5928 -68812 -307719
17932c07719A70735o4514J8749a66822f9123I5924M9047F8563L815d1864A65994
$$ -307719 170735 106221 124970 -166822 -69123 95924 144971 68563 72378 -41864 165994
17920B38801B0617d6055F70R1150J72519J1970D8944L71170a37340D9658b91708
$$ 238801 20617 -46055 670 91820 264339 276309 48944 420114 -137340 49658 -291708
17908a08383r5377D8033a46464A50509A5223L57650D6494a20588G256a09346k82361
$$ -108383 -203760 48033 -146464 150509 15223 372873 46494 -120588 7256 -109346 -391707
17897c91707a13894p8862j68829H0853B0498d4083j55159d9212k85457j42188
$$ -391707 -113894 -192756 -361585 80853 20498 -44083 -199242 -49212 -334669 -476857
17887d76857a27795I7956a41887l8476C8126a51183j5070b3641i915l15371C30104
$$ -476857 -127795 97956 -141887 -180363 38126 -151183 -166253 -23641 -9915 -325286 330104
17875a19186j56250A2218b15404H9087b34017d9679k05566A1025a43082L2314
$$ -119186 -275436 12218 -215404 89087 -234017 -49679 -255245 11025 -143082 -110768
17865a10768d0607I3188i2845j00148D1399J05846m3791l6584g9642A11896g8660
$$ -110768 -40607 93188 -92845 -192993 41399 147245 103454 66870 -79642 111896 -78660
17853F6190J48791d0336C4326b78964a10460j49530E2516J8624c12322H640h7273
$$ 66190 214981 -40336 34326 -278964 -110460 -259990 52516 71140 -312322 8640 -87273
17841I7261b59039f517F2080g8595G3452b77350H0421g2665A18942h3629J4495
$$ 97261 -259039 -6517 62080 -78595 73452 -277350 80421 -72665 118942 -83629 -69134
17830f9134j49027b0068j78998B366a97714l621P147A71102o6206E539e3170E7071
$$ -69134 -218161 -20068 -199066 2366 -197714 -201335 -194188 171102 104896 5539 -53170 57071
17817D45705e8833K8467l1175G2948d9938A52432a33362A67951a63242k0768b7519
$$ 445705 -58833 -30366 -61541 72948 -49938 152432 -133362 167951 -163242 -184010 -27519
17805b4465e842A08579D9316q678N4859J1017a05620M5749m38227B28391B1913
$$ -24465 -5842 108579 49316 40638 95497 106514 -105620 -59871 -498098 228391 21913
17793a59837A05066L4117g8599B9947J99574F1321a37714G14b3057A14738B3736
$$ -159837 105066 139183 -78599 29947 229521 61321 -137714 714 -23057 114738 23736
17781H8557G488K52910H834e1175D63088r3769A0007K01189a44703G2676a09445
$$ 88557 7488 260398 8834 -51175 463088 369319 10007 211196 -144703 72676 -109445
17769F6713L93386b5210A26985k3355m8256k0526a55233J7893A42842I16d33164
$$ 66713 460099 -25210 126985 103630 55374 34848 -155233 -137340 142842 916 -433164
17757a5894k48639H3676a7183k15716e1484A69247a9100B44906A06354a96621
$$ -15894 -264533 83676 -17183 -232899 -51484 169247 -19100 244906 106354 -196621
17746d24578B70570a13847M4727B1916J15164d940j86743C15930d5738B12931
$$ -424578 270570 -113847 -69120 21916 137080 -4940 -191683 315930 -45738 212931
17735a81446C7778A7139K66683b99977B9363L36228j67410n3068m5752P9738m9437
$$ -181446 37778 17139 283822 -299977 29363 365591 198181 145113 99361 179099 129662
17724A29662a9972m3687G4811P3157c69128i642A58116L5386A3640a3809j39572
$$ 129662 -19972 -63659 74811 147968 -369128 -9642 158116 193502 13640 -13809 -153381
17713a53381l02397K18883C8083h130l92555a5881n8135k15446C16085a59354
$$ -153381 -455778 -236895 38083 -8130 -400685 -15881 -74016 -289462 316085 -159354
17702A30202Q7128a51440A5517J76327a51091B4920O4537f5409n8971B14753e6155
$$ 130202 217330 -151440 15517 191844 -151091 24920 89457 -65409 -124380 214753 -56155
17690a77441A13996n861E686L6888a07286m957H5853K0044Q4292G0788b11785
$$ -177441 113996 108135 5686 42574 -107286 -112243 85853 105897 190189 70788 -211785
17678C77631E8504a13012k1088j22427B0964K59736i8285C39246A24783P0901
$$ 377631 58504 -113012 -134100 -256527 20964 280700 -98285 339246 124783 195684
17668A95684A9600K7794b74507d1041B91091A32772J16147a29307K305n018A8677
$$ 195684 19600 47394 -274507 -41041 291091 132772 248919 -129307 -127002 -132020 18677
17656a8480n768B6833L0645a29968G2791a8766A94993C9801J65414b07360R621
$$ -18480 -24248 26833 57478 -129968 72791 -18766 194993 39801 205215 -207360 -197739
17645a97739D02592b25262P2066c8400C3111J02083c5623n5340B1943J52042e6845
$$ -197739 402592 -225262 -153196 -38400 33111 135194 -35623 -90963 21943 173985 -56845
17633A91010K55159b9892k16368a20749B15680O5008i9177n5284A14565j0772
$$ 191010 446169 -29892 -246260 -120749 215680 280688 -99177 -154461 114565 103793
17623A03793J08332k5442F8818O7650K71958k4488a22865A93268K6867a01861
$$ 103793 212125 186683 68818 136468 408426 383938 -122865 193268 220135 -101861
17612D655b12463A53522d154A15864J8770A6864b48299a3113A67789J22293G2120
$$ 4655 -212463 153522 -4154 115864 134634 16864 -248299 -13113 167789 290082 72120
17600b58319k29738C5359a51587r4651F8702A3892b0329B17138a28501B74006
$$ -258319 -488057 35359 -151587 -246238 68702 13892 -20329 217138 -128501 274006
17589A62860g700A73163D3621b85552f2879B66310b40550M9943A4377J20520h3527
$$ 162860 -7700 173163 43621 -285552 -62879 266310 -240550 -190607 14377 134897 -83527
17577A59500a3106B22403e2017A9169J73716I5135J15208b4853A53933a1652B73000
$$ 159500 -13106 222403 -52017 19169 192885 95135 210343 -24853 153933 -11652 273000
17565A35035b83298A04363a07021b5128B34913D2787j2819a72676A14466H010
$$ 135035 -283298 104363 -107021 -25128 234913 42787 29968 -172676 114466 8010
17554A36351F2047h8575k1726d266I4460L2050n6022R2849R9303C2405a36013
$$ 136351 62047 -88575 -110301 -4266 94460 126510 70488 163337 262640 32405 -136013
17542a19307B60520o5732K06230A82646K5630n2738b44031A4386b02218j06488
$$ -119307 260520 194788 401018 182646 208276 155538 -244031 14386 -202218 -308706
17532c08706A53513d6506p5973L754H2904J18197c28977D08613j78821g6373R898
$$ -308706 153513 -46506 -122479 -118725 82904 201101 -328977 408613 229792 -76373 -66475
17521f6475H3937K12565b35708A2121L68066H4313J8123L6369J22294j4590i0353
$$ -66475 83937 296502 -235708 12121 380187 84313 102436 138805 261099 246509 -90353
17509A86343D6379J15723d6782q6952A86430D7650N9333A587d9690j39146C3388
$$ 186343 46379 162102 -46782 -133734 186430 47650 106983 1587 -49690 -188836 33388
17497A04182a10370c1352A28717K6614f4203j07416B22212e8410j45526B17392
$$ 104182 -110370 -31352 128717 155331 -64203 -171619 222212 -58410 -203936 217392
17486B95039A37367A2542K42757a61949F2839L8058J89064e1608A74792K18217
$$ 295039 137367 12542 255299 -161949 62839 100897 289961 -51608 174792 393009
17476C93009i4767C91126j72092j99K08718a07226C6419J0780k1210K86413b09607
$$ 393009 -94767 391126 219034 218835 427553 -107226 36419 47199 25989 312402 -209607
17464A19121C5737A0081i9086b5766B85664r9308F1574a90212B06325J7016K28212
$$ 119121 35737 10081 -99086 -25766 285664 186356 61574 -190212 206325 223341 451553
17453D51553G7420R9150J12808m906j6938p5458j6926L65715A08475h989C21348
$$ 451553 77420 176570 289378 284472 267534 192076 175150 540865 108475 -8989 321348
17441A16590k7172J68069j02761K02529J65776k16269j3533j5870k3700F5365
$$ 116590 89418 257487 154726 357255 523031 306762 293229 277359 253659 65365
17430C61444A16904N5307l3604B7722J84249L82708k61000N3482A76851m390J43652
$$ 361444 116904 172211 138607 27722 211971 594679 333679 387161 176851 172461 316113
17419C16113g4518B57827J16604J55444k27801L739k49N5657h5073C33351j27554
$$ 316113 -74518 257827 374431 529875 302074 305813 305564 361221 -85073 333351 205797
17408B05797n9215B4622M40650j72597n3723a19560e5710B23976r5468K03948
$$ 205797 146582 24622 465272 292675 238952 -119560 -55710 223976 128508 332456
17398C32456a19826F35121h8577A34411i6145A71049a0036I060L61070A64857
$$ 332456 -119826 635121 -88577 134411 -96145 171049 -10036 9060 370130 164857
17387h0461B93349l1934j10417J55726P218J24752j4189A05424J24325G1461K16749
$$ -80461 293349 261415 150998 306724 313942 438694 424505 105424 229749 71461 288210
17376B88210J45453j52197J1747a9354A02111Q0025b00533A29488F2434K26806
$$ 288210 433663 281466 293213 -19354 102111 182136 -200533 129488 62434 289240
17366B89240C982K83437h2273A24320j132J01770a14208A09532K6257A3587K17004
$$ 289240 3982 287419 -82273 124320 123188 224958 -114208 109532 135789 13587 230591
17355B30591a24134C04463a59152B76028A19002R2595b55927I9485J15615m3427
$$ 230591 -124134 304463 -159152 276028 119002 211597 -255927 99485 215100 171673
17345A71673K51388A08678Q6756o1992J60608A44871L2936R1424L8529A44899
$$ 171673 423061 108678 195434 133442 294050 144871 177807 269231 307760 144899
17334F3005k9969g8582B24012R7364j28933a4934A99205r5258D1579R5751H242
$$ 63005 33036 -78582 224012 321376 192443 -14934 199205 103947 41579 137330 8242
17322F4595J42977G0165L14628B1419M9185h5960A92139K52849A48743l9991a04250
$$ 64595 207572 70165 384793 21419 70604 -85960 192139 444988 148743 108752 -104250
17310a21020i82A39145d8271B374J54708J99432j54340r4091K5315j2330J26238
$$ -121020 -982 139145 -48271 2374 157082 356514 202174 108083 133398 121068 247306
17299B47306b30234h4325A95264c5032A57901j3932h890A48196K02115A42895
$$ 247306 -230234 -84325 195264 -35032 157901 143969 -8890 148196 350311 142895
17288b25151C09186a95298C15254A41707E5421L04434I4291J69781f4909m6770
$$ -225151 309186 -195298 315254 141707 55421 359855 94291 264072 -64909 -111679
17278a11679r789A73788P8479J8737N7873R4510J3685b25233A06722J23589L9599
$$ -111679 -121468 173788 252267 271004 328877 423387 437072 -225233 106722 230311 269910
17267B69910a34478C3559l865L02621l0296F0882K75410n7829G8427L39535j97693
$$ 269910 -134478 33559 29694 332315 302019 60882 336292 278463 78427 417962 220269
17256B20269o0412n464n2836J20472J18598p7344P3346K68799a18258G4740K61286
$$ 220269 159857 154393 101557 222029 340627 263283 336629 605428 -118258 74740 336026
17245C36026b39083D0734R7438L3752H2006i854A00690D4053J58713P5407K49407
$$ 336026 -239083 40734 138172 171924 82006 -9854 100690 44053 202766 278173 527580
17234E27580F1240K11825J32822b8478A79313k4833J29667L3973A54282K32646
$$ 527580 61240 273065 405887 -28478 179313 154480 284147 318120 154282 386928
17224C86928L0284G9705R6978J23535j21655p9392F303E74L64365K7355A82017
$$ 386928 417212 79705 176683 300218 178563 99171 6303 574 364939 392294 182017
17212C92491A8426P4685J32967N1462K20519a66472L993B32574J77021I1495a09808
$$ 392491 18426 93111 226078 277540 498059 -166472 -162479 232574 409595 91495 -109808
17200B01010r7955N5559a8020q867A47849c2195A33395K15396A57380d9311A58365
$$ 201010 103055 158614 -18020 -26887 147849 -32195 133395 348791 157380 -49311 158365
17188C16777a69764D7722D389K56232K084p0909l1547j9107L46294A16313J43995
$$ 316777 -169764 47722 4389 260621 262705 191796 160249 141142 487436 116313 260308
17177B60308n0004l4665K0927H139K22174j7047o1177o170J5428K09038J16039
$$ 260308 210304 175639 196566 8139 230313 213266 152089 145919 161347 370385 486424
17166D86424F552J50153N7942L8511J24514p8614A39083J17232r3302K72155j35477
$$ 486424 6552 156705 214647 253158 377672 299058 139083 256315 163013 435168 299691
17155B99691M5860K5978j33804p2517K07481j77118p0073g7126A76065O2778j08153
$$ 299691 345551 371529 237725 165208 372689 195571 125498 -77126 176065 238843 130690
17144A30690R6129N9034C3843K68993A13098L99089j26760j77600K67238k30907
$$ 130690 226819 285853 33843 302836 113098 512187 385427 207827 475065 244158
17134B44158L47737B44690J37757K66106B34352J53620A56391K62502K4283J64966
$$ 244158 591895 244690 382447 648553 234352 387972 156391 418893 443176 608142
17124F08142B85296J7352K04052l7806A93869K03038K73153l24917A54112K71354
$$ 608142 285296 302648 506700 468894 193869 396907 670060 345143 154112 425466
17114D25466J04213k34056j7473J03991C5413M01072A32406K29906L76j59463
$$ 425466 529679 295623 278150 382141 35413 436485 132406 362312 362688 203225
17104B03225J08246L00059L7695k9247k92998J20530K7449j80970r6236H0701
$$ 203225 311471 611530 649225 619978 326980 447510 474959 293989 197753 80701
17093F25457k11764Q6718j01138j69497O6013P8797J35428j13576A64380J13798
$$ 625457 413693 500411 399273 229776 295789 374586 510014 396438 164380 278178
17083B78178j3422K51365j34016K61101a0929F12282j38121R6382k67612R5325
$$ 278178 264756 516121 382105 643206 -10929 612282 474161 570543 302931 398256
17073C98256J74457A78307M0669K63999L15535l25480J71298j40360p876K35120
$$ 398256 572713 178307 218976 482975 798510 473030 644328 503968 496092 731212
17063G31212l39l3571j72200k7249N3729k34400J87797J30305J51226k34844n8736
$$ 731212 730873 697302 525102 497853 551582 317182 504979 635284 786510 551666 492930
17052D92930j74683K01335j0866r581j17389K86046B53839K56911J80124m9456
$$ 492930 318247 519582 508716 499135 381746 667792 253839 510750 690874 641418
17042F41418j76596K78847k06657l4249J29521j64074Q6253K10300l2412k77917
$$ 641418 464822 743669 537012 502763 632284 468210 554463 764763 732351 454434
17032D54434K42880j06857L7233P2453k16740J32335k79428J50720N6348B42835
$$ 454434 697314 590457 627690 700143 483403 615738 336310 487030 543378 242835
17021H76244K5224Q7800C32292K67854k6599K48966k31258R4403k24017P5090
$$ 876244 901468 989268 332292 600146 573547 822513 591255 685658 461641 536731
17011E36731M4745j8195J44935K7973j66583L18359j9721n8346j14953R9541J64428
$$ 536731 581476 563281 708216 736189 569606 887965 868244 809898 694945 794486 958914
17000I58914m23700K91261n4148J45852k88513J54347k1972p5333K56646n1014
$$ 958914 535214 826475 772327 918179 629666 784013 762041 686708 943354 892340
16990H92340J9329J20308j64539Q3905k26838j32696j74234M88302j93573K14132
$$ 892340 911669 1031977 867438 951343 724505 591809 417575 905877 712304 926436
16980I26436m9920n9862L07727n16826L69038m6589J50130k13205J04758j45697
$$ 926436 876516 816654 1124381 607555 976593 930004 1080134 866929 971687 825990
16970H25990K07938J12506m09952L46500j32724K53843l54867l4576J72786R3927
$$ 825990 1033928 1146434 736482 1082982 950258 1204101 849234 814658 987444 1081371
16960A081371K30520m23832K79006m1793k94800J45824Q7072l68764M23563Q7351
$$ 1081371 1311891 888059 1167065 1125272 830472 976296 1063368 694604 1118167 1205518
16950A205518j3433p9703j62378K30908P7684j19025N8529K6992j3857k57773
$$ 1205518 1192085 1112382 950004 1180912 1258596 1139571 1198100 1225092 1211235 953462
16940I53462J96864o5653K02800J26001l08747k74774L56964r6761J94904P2660
$$ 953462 1150326 1084673 1287473 1413474 1104727 829953 1186917 1090156 1285060 1357720
16930A357720l4017j07025j5588J03674k71728K974o791O52364m42877j1858K68292
$$ 1357720 1323703 1216678 1201090 1304764 1033036 1036010 1029219 1681583 1238706 1226848 1495140
16919A495140J01559r011p2405j24652J94996M1957k94584M87007m60181J845
$$ 1495140 1596699 1587688 1515283 1390631 1585627 1627584 1333000 1820007 1359826 1361671
16909A361671K76607j11614J40898L5543k9530P2048J49800l81474J07645R2689
$$ 1361671 1638278 1526664 1667562 1703105 1673575 1745623 1895423 1513949 1621594 1714283
16899A714283j16406k134p312J26974Q8492L2363q4478K74887l13105q6401M52408
$$ 1714283 1597877 1595743 1588431 1715405 1803897 1836260 1751782 2026669 1713564 1627163 2079571
16888B079571m34102O19493k41977K9496j74095K22653R3348J7214j2518k36376
$$ 2079571 1645469 2264962 2022985 2052481 1878386 2101039 2194387 2211601 2199083 1962707
16878A962707L34899j32827J84308J00179j26611n246M6086K75831j62103j4384
$$ 1962707 2297606 2164779 2349087 2449266 2322655 2317409 2363495 2639326 2477223 2462839
16868B462839J12296L06618j9591k23031n8188K01991j34020k9060j60275J73752
$$ 2462839 2575135 2881753 2862162 2639131 2580943 2782934 2648914 2619854 2459579 2633331
16858B633331L07432J8645j74986O606K63191J56955k10903k35393N70005j34564
$$ 2633331 2940763 2959408 2784422 2791028 3054219 3211174 3000271 2764878 3334883 3200319
16848C200319J94281n3095O76194o41874O27140k20272k07565K32826M4008J62987
$$ 3200319 3394600 3341505 4017699 3375825 4002965 3782693 3575128 3807954 3851962 4014949
16838D014949K67453l22540J04562n6933K33046L24482j35163n6698L17977P5365
$$ 4014949 4282402 3959862 4064424 4007491 4240537 4565019 4429856 4373158 4691135 4766500
16828D766500k05719K23402R1012P8998K61369j18724M04693P7037j05593K71727
$$ 4766500 4560781 4784183 4875195 4954193 5215562 5096838 5501531 5578568 5472975 5744702
16818E744702n2722p5830j5419L12693O5553L49508k84569M4122O15695N056J59826
$$ 5744702 5691980 5616150 5600731 5913424 5978977 6328485 6043916 6088038 6703733 6708789 6868615
16807F868615p4471L75168J07714J82406L86819n64722O88737K7535M24506R4492
$$ 6868615 6794144 7169312 7277026 7459432 7846251 7281529 7970266 7997801 8422307 8516799
16797H516799J07782O08413L0051J42147P2643O59668P5267K17906J06525J72962
$$ 8516799 8624581 9232994 9263045 9405192 9477835 10137503 10212770 10430676 10537201 10710163
16787A0710163J39605N99898K57545j49129R27238M78639r2670L89817P06162
$$ 10710163 10849768 11449666 11707211 11558082 12485320 12963959 12871289 13261106 13967268
16778A3967268K98675N77662P44139q42N70600P12752K39297M10549R57342J61781
$$ 13967268 14265943 14843605 15587744 15586902 16157502 16870254 17109551 17520100 18477442 18639223
16768A8639223P01371R59271J125098M06760R90025L77229P48315J052454J137261
$$ 18639223 19340594 20299865 21424963 21831723 22821748 23198977 23947292 24999746 26137007
16759B6137007J048547J128683J178675J255179J286466J260834J563987J735798
$$ 26137007 27185554 28314237 29492912 30748091 32034557 33295391 34859378 36595176
16751C6595176J308755J828880J984172J730065J914315K549820K775928K175429
$$ 36595176 37903931 39732811 41716983 43447048 45361363 47911183 50687111 52862540
16743E2862540K866930L084272L006978L367808L422568L990014M250535M368614
$$ 52862540 55729470 58813742 61820720 65188528 68611096 72601110 76851645 81220259
16735H1220259M736751N060283M572047N463043N985785N885742O151922O764212
$$ 81220259 85957010 91017293 95589340 101052383 107038168 112923910 119075832 125840044
16727A25840044O851783O903596O643748O871146O141753O071855N577676M971375
$$ 125840044 132691827 139595423 146239171 153110317 159252070 165323925 170901601 175872976
16719A75872976M346261K983849K097387Q09636M5957j447435k367565l647730
$$ 175872976 180219237 183203086 185300473 186110109 186156066 184708631 182341066 178693336
16711A78693336m123324n929282n661377o409430o492791o974923o872398p213453
$$ 178693336 174570012 168640730 162979353 156569923 150077132 143102209 136229811 129016358
16703A29016358o530460o772238o495549o097815n771731n657677m756174n253493
$$ 129016358 122485898 115713660 109218111 103120296 97348565 91690888 86934714 81681221
16695H1681221m801787m282110l836259l583031l844054k910216l325520k938250
$$ 81681221 76879434 72597324 68761065 65178034 61333980 58423764 55098244 52159994
16687E2159994k538839k525151k148166k402330k126270k022200j560564j613131
$$ 52159994 49621155 47096004 44947838 42545508 40419238 38397038 36836474 35223343
16679C5223343j884497j292328j327969j366007j009986j260458j099829j232527
$$ 35223343 33338846 32046518 30718549 29352542 28342556 27082098 25982269 24749742
16671B4749742q86078r81492q63089q43164o59778o58343q51990r75775l47940
$$ 24749742 23863664 22882172 22019083 21175919 20516141 19857798 19005808 18030033 17682093
16662A7682093n91284m72720r92663k54526n29997k50764n25915m54481m42751
$$ 17682093 17090809 16618089 15625426 15370900 14840903 14590139 14064224 13609743 13166992
16653A3166992n87576l53178m82618J64843o84379j32460n21163l15759j8391
$$ 13166992 12579416 12226238 11743620 11908463 11224084 11091624 10570461 10254702 10236311
16644A0236311n35113l32785k06104q6920l69860k94024j3447k41220l43259K19893
$$ 10236311 9701198 9368413 9162309 9075389 8705529 8411505 8398058 8156838 7813579 8033472
16634H033472o13052l1403l45006l19258K16359k27398j57613L8040k61455j48021
$$ 8033472 7420420 7389017 7044011 6724753 6941112 6713714 6556101 6594141 6332686 6184665
16624F184665r6550k1463m94852j78384j44283J51368j8832l77679l49740J19745
$$ 6184665 6088115 6066652 5571800 5393416 5249133 5400501 5381669 5003990 4654250 4773995
16614D773995J77578k41729p9768j13439l12514o4683K95499j53639o3216k40363
$$ 4773995 4951573 4709844 4630076 4516637 4204123 4139440 4434939 4281300 4218084 3977721
16604C977721K2460J6513N3498j64955l70325J15758l86093R8860O3441k77683
$$ 3977721 4000181 4016694 4070192 3905237 3534912 3650670 3264577 3363437 3426878 3149195
16594C149195K29849q7363L7348j2085l20366J2368K39645k23464J37611k5717
$$ 3149195 3379044 3291681 3329029 3316944 2996578 3008946 3248591 3025127 3162738 3137021
16584C137021k09750L6397K5263k85139k76296K18558j227j73168K43448j62385
$$ 3137021 2927271 2963668 2988931 2703792 2427496 2646054 2644827 2471659 2715107 2552722
16574B552722j15605m5573o2621n6652M52434l86926R734p7807P2407l83716K85611
$$ 2552722 2437117 2391544 2328923 2272271 2724705 2337779 2347513 2269706 2342113 1958397 2244008
16563B244008j50684K33426k49441j95710L17304K27414k18775k20787k95115
$$ 2244008 2093324 2326750 2077309 1881599 2198903 2426317 2207542 1986755 1691640
16554A691640M90564k02073J34081m99213K11417k72976M73758n05889r6415L47975
$$ 1691640 2182204 1980131 2114212 1614999 1826416 1553440 2027198 1521309 1424894 1772869
16544A772869k21950k50849M42358l20699M603J04378K00747l65535m31421M36031
$$ 1772869 1550919 1300070 1742428 1421729 1426332 1530710 1731457 1365922 934501 1370532
16534A370532P121L98379p36980M01913j91592O3941l23720L87731P2338o7796
$$ 1370532 1377653 1776032 1039052 1440965 1249373 1313314 989594 1377325 1449663 1381867
16524A381867j70224k4174l2192K35808p0932N3773n24700J02568N3379L21520
$$ 1381867 1211643 1187469 1155277 1391085 1320153 1373926 849226 951794 1005173 1326693
16514A326693k31709j20252p6526L20104j06632k694k66944N39045m06432o3919
$$ 1326693 1094984 974732 898206 1218310 1111678 1108984 842040 1381085 974653 910734
16504I10734J30175k64926L59411j94075l5112K73404n83501N51975k36354K65857
$$ 910734 1040909 775983 1135394 941319 906207 1179611 596110 1148085 911731 1177588
16494A177588j33453j02851R0446q1274j14630m035J20224K41935j62159m200
$$ 1177588 1044135 941284 1031730 950456 835826 831791 952015 1193950 1031791 1027591
16484A027591k50424Q9070j7719Q517J36931j98090L7152p0297J6977J43986M3451
$$ 1027591 777167 866237 848518 857035 993966 795876 833028 762731 779708 923694 967145
16473I67145q6076Q6661J7342l35049n6063K44723p2448k40265J4678J05803J4257
$$ 967145 881069 967730 985072 650023 593960 838683 766235 525970 540648 646451 660708
16462F60708r2792K8348N0188r5441k58199K88912O3082P255j59940J32634J46820
$$ 660708 567916 596264 646452 551011 292812 581724 644806 652061 492121 624755 771575
16451G71575N9113l1000K8836k42229A86738M88742Q5842l49347R6520K3379J4407
$$ 771575 830688 799688 828524 586295 186738 675480 761322 411975 508495 531874 546281
16440E46281O3877J04802k9113k68354J10791R4682j55613K39444k04642n4947
$$ 546281 610158 714960 685847 417493 528284 622966 467353 706797 502155 447208
16430D47208J40094J43515j85927k2360J94498n9000j77434K81712k62446L6706
$$ 447208 587302 730817 544890 522530 717028 658028 480594 762306 499860 536566
16420E36566B36185L17205k54064l5887J70103p3372q2170K62349L31450k66875
$$ 536566 236185 553390 299326 263439 433542 360170 278000 540349 871799 604924
16410F04924k53420p0996K23463n2322J35621j37305j65144M99544k93936Q588
$$ 604924 351504 280508 503971 451649 587270 449965 284821 784365 490429 499017
16400D99017k26496J09868N9760m9626A72539N12683k37457m059r8687J98410
$$ 499017 272521 382389 442149 392523 172539 685222 447765 443706 345019 543429
16390E43429A87193L94945k79982R725R2288J09100j01893A65213J92896A75515
$$ 543429 187193 582138 302156 311881 404169 513269 411376 165213 358109 175515
16379D70003h2726C74395J62278A69884M31146k91110R699A43817N5570L18138
$$ 470003 -82726 374395 536673 169884 601030 309920 319619 143817 199387 517525
16369E17525k50750L40363Q5137A95654K25314j93159N87722l49167Q8408A52555
$$ 517525 266775 607138 692275 195654 420968 227809 815531 466364 554772 152555
16358D61475n8932K14315k36895L4804j18864m3146A09504J69791J95519D2404
$$ 461475 402543 616858 379963 414767 295903 252757 109504 279295 474814 42404
16347C30158A04492L56706e375G0736M53843o5660o846k17296L4632a8935A60637
$$ 330158 104492 461198 -5375 70736 524579 458919 452073 234777 269409 -18935 160637
16335C59778a64059D46822j80975J3630j00242P2978B4793K7707N80080j96464
$$ 359778 -164059 446822 265847 279477 179235 252213 24793 52500 632580 436116
16325D36116A09736J00222Q99r8872Q3590R6249r4752M5972J57420j20834l811
$$ 436116 109736 209958 210857 111985 195575 291824 197072 243044 400464 279630 275819
16314B75819j6704K4854L8676j32483J35560r8887J75711j68436r8973C5549L02892
$$ 275819 259115 283969 322645 190162 325722 226835 402546 234110 135137 35549 338441
16303C38441p4886q0302p969e5083J6721B70109B6241P9796R2650J41129A69707
$$ 338441 263555 183253 175284 -55083 -38362 270109 26241 106037 198687 339816 169707
16291H7788K7187B7752J08286K3771J81802n2331D3133O8965g4615A03458e2193
$$ 87788 114975 27752 136038 159809 341611 289280 43133 112098 -74615 103458 -52193
16279g4245I3252e1785A52747l2068K87282I1426b20912A73807n0637a63056C09785
$$ -74245 93252 -51785 152747 120679 407961 91426 -220912 173807 123170 -163056 309785
16267C76578c1766D06820A96927b13556B47538C701L62245E0906E331d6705E96664
$$ 376578 -31766 406820 196927 -213556 247538 3701 365946 50906 5331 -46705 596664
16255c2561E9368d2636A04615g7732G6023J0730J07157k9372K7236a56493I4804
$$ -32561 59368 -42636 104615 -77732 76023 86753 193910 164538 191774 -156493 94804
16243E1182Q2317Q1374a01638D0516J65179h2508B98250F7858a48914e1332A2821
$$ 51182 133499 214873 -101638 40516 205695 -82508 298250 67858 -148914 -51332 12821
16231B6522M1889e6656I3218K7978a57923C32431p0290l7382A09356j7978K09487
$$ 26522 68411 -56656 93218 121196 -157923 332431 262141 224759 109356 91378 300865
16220C00865A29840J25326l5292p7292E9369P219J48870B785L29347G2993B8338
$$ 300865 129840 255166 219874 142582 59369 66588 215458 2785 332132 72993 28338
16208F68a45508c9744B13430p0434b31517I9002B7331a62660B8376K14272a5871
$$ 668 -145508 -39744 213430 142996 -231517 99002 27331 -162660 28376 242648 -15871
16196A92005J1746a9973o3108A41525J1148J66211a22409A28516N6745b63874
$$ 192005 203751 -19973 -83081 141525 152673 318884 -122409 128516 185261 -263874
16185B9576K72304a24391j6275H3228J6399g0026C9641N0748g8339G9088j2897
$$ 29576 301880 -124391 -140666 83228 99627 -70026 39641 90389 -78339 79088 66191
16174F6191J1819L64087A10463A2341b4866F0842i187G1130J79098p4282a35211
$$ 66191 78010 442097 110463 12341 -24866 60842 -9187 71130 250228 175946 -135211
16162C38028p8426E8059M4177J7909L5163P7120a15092j26855G495R5300b0690
$$ 338028 259602 58059 102236 120145 155308 232428 -115092 -241947 7495 102795 -20690
16150e86374C2258A2982L2604b05495b7918o4964B54873J29192A72035b7756A03033
$$ -586374 32258 12982 45586 -205495 -27918 -92882 254873 384065 172035 -27756 103033
16138I8464i463A38895j7233L73791A18221a1860C2424b06343d910D58876m3434
$$ 98464 -9463 138895 121662 495453 118221 -11860 32424 -206343 -4910 458876 415442
16127D15442A48012F9799J40152J34181G8653J95726c30236a41480K1954J1928
$$ 415442 148012 69799 209951 344132 78653 274379 -330236 -141480 -119526 -107598
16117a07598B2699i001j09805j09914A96700a51803A14383A5500N3531a73359
$$ -107598 22699 -9001 -118806 -228720 196700 -151803 114383 15500 69031 -173359
16106H2454i8449k65248I0168c264j0406I8755K30535j00228h1403C5461O5838
$$ 82454 -98449 -363697 90168 -3264 -13670 98755 329290 229062 -81403 35461 101299
16095A01299k8701a47982B08630J23934D549L79131A1859E54Q069Q8626j0084
$$ 101299 72598 -147982 208630 332564 4549 383680 11859 554 8623 97249 87165
16084H7165K5241q184J3009K4945j9476c1817j22830P4706B32006p3292a29442
$$ 87165 112406 104222 117231 142176 122700 -31817 -154647 -79941 232006 158714 -129442
16072a01292q5153i306j18734C5112A4771b51524o044L9573k2589A02414b74560
$$ -101292 -186445 -9306 -128040 35112 14771 -251524 -257568 -217995 -240584 102414 -274560
16060c28665A40107E9394b55681g842C1917a16687c9142F17439B7233a2234A176
$$ -328665 140107 59394 -255681 -7842 31917 -116687 -39142 617439 27233 -12234 1176
16048E4411a60028b824k62635A05051h5987j30114R8453o5468A0323K5624a49008
$$ 54411 -160028 -2824 -265459 105051 -85987 -216101 -117648 -183116 10323 35947 -149008
16036A44953E7229J43012b07047e7480A42895c2183B13697i4284q0719M4431B4418
$$ 144953 57229 200241 -207047 -57480 142895 -32183 213697 -94284 -175003 -130572 24418
16024A1984J1890a89958N3677c5828A47852q188K8056L6196b64035k5501B21461
$$ 11984 23874 -189958 -136281 -35828 147852 139664 167720 203916 -264035 -289536 221461
16012b0448C100g9832A39684a82318F2433K44090a67037j45976H287a41040B9330
$$ -20448 3100 -79832 139684 -182318 62433 306523 -167037 -313013 8287 -141040 29330
16000b42707d4088A47026J63084a79865A52989e323k7338r5524e305m2061C8732
$$ -242707 -44088 147026 310110 -179865 152989 -5323 -32661 -128185 -5305 -47366 38732
15988a39724j41286b9568A35618a3584C31449J05442j89973B686L07600A16293
$$ -139724 -281010 -29568 135618 -13584 331449 436891 246918 2686 310286 116293
15977C54308p5648a8136k73379F9773a10345C77974a42778B17332d8001m1945
$$ 354308 278660 -18136 -291515 69773 -110345 377974 -142778 217332 -48001 -89946
15967h9946E6699Q9325h904B0348a51582e3031A20246g0641A81628J62788g9854
$$ -89946 56699 146024 -8904 20348 -151582 -53031 120246 -70641 181628 344416 -79854
15955C06287a13874M2857j43927B81057a7278k69225B8935L1973J21255L20939
$$ 306287 -113874 -71017 -214944 281057 -17278 -286503 28935 60908 182163 503102
15945E03102a22735B85394a16026C0744Q4506R5335a4975J381G2443g0926C21071
$$ 503102 -122735 285394 -116026 30744 115250 210585 -14975 -13594 72443 -70926 321071
15933B3089c0853j67353R5752K2799C8917b88836N8019Q0600C3967b34680A12441
$$ 23089 -30853 -198206 -102454 -79655 38917 -288836 -230817 -150217 33967 -234680 112441
15921g2372B92366b62062a13765G9224c1456l1199B72901A05037K1145c79355
$$ -72372 292366 -262062 -113765 79224 -31456 -62655 272901 105037 126182 -379355
15910E1104J04783F3474g5142J3230R512k42193I8231O0825b78717B93393c26186
$$ 51104 155887 63474 -75142 -61912 -52400 -294593 98231 159056 -278717 293393 -326186
15898A42285J19700H3645g467k1073l90482H1968c6309l90465H944i0015B52006
$$ 142285 261985 83645 -7467 -28540 -419022 81968 -36309 -426774 8944 -90015 252006
15886e3173r0034J4538M2624a4872j48910I181M5929a7439j36113k7827A22315
$$ -53173 -143207 -128669 -86045 -14872 -163782 9181 55110 -17439 -153552 -181379 122315
15874A25720J12868i8928I6642O6309a94841m7138A06659a31682I1786A3774P4722
$$ 125720 238588 -98928 96642 162951 -194841 -241979 106659 -131682 91786 13774 88496
15863H8496f2522k47573R5203c2741k58498P1469J8958A65294B9965P7175b67287
$$ 88496 -62522 -310095 -214892 -32741 -291239 -219770 -200812 165294 29965 107140 -267287
15851I759O4544a59472C0881a52887A90533d07422A5561c00253h8817m9363N036
$$ 9759 74303 -159472 30881 -152887 190533 -407422 15561 -300253 -88817 -138180 -133144
15840a33144B91209c03949J02957c0079A6206d12184B03207e1160k24097Q7022
$$ -133144 291209 -303949 -200992 -30079 16206 -412184 203207 -51160 -275257 -188235
15830a88235e306p6187E4342F650a19531n3171j3186F1143a15009B43398a19103
$$ -188235 -5306 -81493 54342 6650 -119531 -172702 -185888 61143 -115009 243398 -119103
15818g4860k18314A47556N1039b34127A27974g4486k61466A36298a64985B33636
$$ -74860 -293174 147556 198595 -234127 127974 -74486 -335952 136298 -164985 233636
15807b65649A40450N4317M5682H4308a10161F3469e02690C11J0268a19786E5068
$$ -265649 140450 194767 240449 84308 -110161 63469 -502690 311 10579 -119786 55068
15795d10427J13381c8123a7306B68943B350J38404D4330a46043E6764f0350n3822
$$ -410427 -297046 -38123 -17306 268943 2350 140754 44330 -146043 56764 -60350 -114172
15784a14172a7043n6271q0814G6138J23312a03518C1593h608A76678G3392A0017
$$ -114172 -17043 -73314 -154128 76138 199450 -103518 31593 -8608 176678 73392 10017
15772b7093j19080F9548R0567B0727f2926r4495I099d61951A63191b6953E7636
$$ -27093 -146173 69548 160115 20727 -62926 -157421 9099 -461951 163191 -26953 57636
15760A89833b51817G1152a32485i682H0734P8246A0731g9782K2680B7430c07897
$$ 189833 -251817 71152 -132485 -9682 80734 158980 10731 -79782 -57102 27430 -307897
15748A93562h2314B03719c3094A47529h2677c3049A47551p3389a4895j59730k9809
$$ 193562 -82314 203719 -33094 147529 -82677 -33049 147551 74162 -14895 -174625 -204434
15737b04434E14J83806G8971a22785j20621d4673j99692J09514C2943P1925f855
$$ -204434 514 184320 78971 -122785 -243406 -44673 -244365 -134851 32943 104868 -6855
15725A42136b66277K5504o5649A55756E667K2404c7092j77132b534B26629h7329
$$ 142136 -266277 -240773 -306422 155756 5667 28071 -37092 -214224 -2534 226629 -87329
15713C404P7977a35637B39544a8936m1474n9478q5305d7148A10043R8448e29176
$$ 3404 81381 -135637 239544 -18936 -60410 -119888 -205193 -47148 110043 208491 -529176
15701h462m1043j386A95753h5741e818r4387c8028B84977K5718a146m2323b0282
$$ -8462 -49505 -50891 195753 -85741 -5818 -100205 -38028 284977 310695 -1146 -43469 -20282
15688a29118B8769L88062f9942k47764e9767k26891J35824E1414O2254a65739
$$ -129118 28769 416831 -69942 -317706 -59767 -286658 -150834 51414 113668 -165739
15677a55206c2851A19674K45175B0155a07821D9610a19367D29260B2831h4793
$$ -155206 -32851 119674 364849 20155 -107821 49610 -119367 429260 22831 -84793
15666b4684B57131F2701c26800A27913R4187c62630m0837g3731E9758i6006G1908
$$ -24684 257131 62701 -326800 127913 222100 -362630 -403467 -73731 59758 -96006 71908
15654d00140A48999K28873b53499R6973O7085q4157a0649o7137E0728O7926C9393
$$ -400140 148999 377872 -253499 -156526 -89441 -173598 -10649 -77786 50728 118654 39393
15642B1836b07640D0475i7411l040b7016p4860o3161E2614b24957r6629m4604
$$ 21836 -207640 40475 -97411 -100451 -27016 -101876 -165037 52614 -224957 -321586 -366190
15631c66190a0428A75209b27903O8384A52768a73704A67643a46209N9524j06412
$$ -366190 -10428 175209 -227903 -159519 152768 -173704 167643 -146209 -86685 -193097
15621a93097A71652D2938J94077d0099A17368P7755G9184g8141k48131J09601
$$ -193097 171652 42938 237015 -40099 117368 195123 79184 -78141 -326272 -216671
15611b16671d7081N576l0229A60901b38694G1498G122J20265a68926C1906L47098
$$ -216671 -47081 -41505 -71734 160901 -238694 71498 7122 127387 -168926 31906 379004
15600C79004j39256b29084A6407d09655b00726k4805C42101j38114E8296b82519
$$ 379004 239748 -229084 16407 -409655 -200726 -225531 342101 203987 58296 -282519
15589D2331K28009C312K5471K84708B3243J50774J15833c6303B34599G5644f2074
$$ 42331 270340 3312 28783 313491 23243 174017 289850 -36303 234599 75644 -62074
15577a62167g691j06767A24958g1604l3853k25877a26876f0683B17483B1795c15074
$$ -162167 -7691 -114458 124958 -71604 -105457 -331334 -126876 -60683 217483 21795 -315074
15565d6891n7723j64338I0058a68704f131k28675B67390a03731E2096a59937B37232
$$ -46891 -104614 -268952 90058 -168704 -6131 -234806 267390 -103731 52096 -159937 237232
15553f5392B94298b35473A31091b66657A10464c15803A77348a86550j16929I8250
$$ -65392 294298 -235473 131091 -266657 110464 -315803 177348 -186550 -303479 98250
15542a27995C1382J35218J30457m5246G4849g7157K9396b0429k87957A99813i0598
$$ -127995 31382 166600 297057 251811 74849 -77157 -47761 -20429 -308386 199813 -90598
15530c8357o2863B23786b07599i708k24667h897k42011E7284a10248d8025K2695
$$ -38357 -101220 223786 -207599 -9708 -234375 -8897 -250908 57284 -110248 -48025 -25330
15519b5330k45846B49430n3434H9021a69686H2952K598C9820b42806G4145b4146
$$ -25330 -271176 249430 195996 89021 -169686 82952 85550 39820 -242806 74145 -24146
15507g9363p792I5641k2014b44371c0563k33251d465o8075B45376b40864A56151
$$ -79363 -87155 95641 73627 -244371 -30563 -263814 -4465 -72540 245376 -240864 156151
15495A46095g5524D8185A161M58041h3970k56605e2457j28927j15951R6378e3195
$$ 146095 -75524 48185 1161 459202 -83970 -340575 -52457 -181384 -297335 -200957 -53195
15483A56092N2742d09841J58983a3059k48020A74132A2631K31614a95059c4849
$$ 156092 208834 -409841 -250858 -13059 -261079 174132 12631 244245 -195059 -34849
15472c01292A54063B6650K55181a80381j84915a55201A5531J21539i6205A96860
$$ -301292 154063 26650 281831 -180381 -365296 -155201 15531 137070 -96205 196860
15461I8950H094a83704a3735j21605H5494a68452G1893b83196i9128A46556c21871
$$ 98950 8094 -183704 -13735 -135340 85494 -168452 71893 -283196 -99128 146556 -321871
15449a6933r3350B40851A8150d41922C326a2979H9613a2687A29218B3110K40334
$$ -16933 -110283 240851 18150 -441922 3326 -12979 89613 -12687 129218 23110 263444
15438B63444a06807k8839k55221B5148b43543J13789C4874N0816L7839b05470
$$ 263444 -106807 -135646 -390867 25148 -243543 -129754 34874 85690 123529 -205470
15427A40961a60908r0917B41342d7141l26606G3998c1779l78543A01850J3597
$$ 140961 -160908 -251825 241342 -47141 -373747 73998 -31779 -410322 101850 115447
15417A15447l2842f2343G0631c7227l74613a48953j7658a3311D7284b4675H0518
$$ 115447 82605 -62343 70631 -37227 -411840 -148953 -166611 -13311 47284 -24675 80518
15405A49364e9825D8299i8354a1905j77322A53046A0212P58f7397F4420J69502
$$ 149364 -59825 48299 -98354 -11905 -189227 153046 10212 10970 -67397 64420 233922
15394B33922a68326R338q4782A42035a48730a0102j78277B33720a39870O2066
$$ 233922 -168326 -158988 -243770 142035 -148730 -10102 -188379 233720 -139870 -77804
15384g7804G6448a84819A07392D9093P577b32602o3677J38926i83l27687J06848
$$ -77804 76448 -184819 107392 49093 56670 -232602 -296279 -157353 -983 -328670 -221822
15373b21822B88557q4684D1115a00616A57959a24892B6313f9139G5311K06914
$$ -221822 288557 203873 41115 -100616 157959 -124892 26313 -69139 75311 282225
15363B82225E9198d541E4650a83505D843b86044A9373J80259B3181i6686j34748
$$ 282225 59198 -4541 54650 -183505 4843 -286044 19373 199632 23181 -96686 -231434
15352b31434C8715K78197B0891f7162A9127a88584f2247n6944B26400b05587h6975
$$ -231434 38715 316912 20891 -67162 19127 -188584 -62247 -119191 226400 -205587 -86975
15340G0430J3129a52938M3521D49282a49366C62539H132c22135A65097O0617I5462
$$ 70430 83559 -152938 -109417 449282 -149366 362539 8132 -322135 165097 225714 95462
15328I7633K58462A1089g5304D1366O2621a63870J4552d8691B65878A00995i3759
$$ 97633 356095 11089 -75304 41366 103987 -163870 -149318 -48691 265878 100995 -93759
15316g074p4912B92655c8357B74266o5998a80466A09620N6901b90443a09737N1574
$$ -7074 -81986 292655 -38357 274266 208268 -180466 109620 166521 -290443 -109737 -58163
15305e8163n8241A80901n3579N6265k8484p5560a81654g5984A13899j6334m1229
$$ -58163 -116404 180901 127322 183587 155103 79543 -181654 -75984 113899 97565 56336
15294E6336R2989C4174d8435I7771a10639k9084h86l7283D3583a45412A02133
$$ 56336 149325 34174 -48435 97771 -110639 -139723 -886 -38169 43583 -145412 102133
15282c6248A26345a6694j19494P573O0360j14873A67665f5525a898j76001A10316
$$ -36248 126345 -16694 -136188 -128615 -68255 -183128 167665 -65525 -1898 -177899 110316
15270c03136A76755H1400a85615A4676J58684J33545A50969a52555A60799J01861
$$ -303136 176755 81400 -185615 14676 173360 306905 150969 -152555 160799 262660
15260B62660d1708a6403m5287B09534F1139R38R7855K50178a1624j80373D08857
$$ 262660 -41708 -16403 -61690 209534 61139 62077 159932 410110 -11624 -191997 408857
15248B66686P72773P39962m17564M01475l11213F96834C16921i1088A88231C6411
$$ 266686 1039459 1779421 1361857 1763332 1452119 696834 316921 -91088 188231 36411
15237c1536j51408B5180J6974c34200C0448J3522M8133O7051b0117F4217g3343
$$ -31536 -182944 25180 42154 -334200 30448 43970 92103 159154 -20117 64217 -73343
15225a65106A02043i0873C1284a61431B64802b134A87989a65029D00721A21311
$$ -165106 102043 -90873 31284 -161431 264802 -2134 187989 -165029 400721 121311
15214A66576a52044L9690c3262I963J4618a1150G2806c2123B13698a18543E4284
$$ 166576 -152044 -112354 -33262 9963 24581 -11150 72806 -32123 213698 -118543 54284
15202A24563a47761A35744i561r5293A82923A9307K22224b19425D3485h4625p9553
$$ 124563 -147761 135744 -9561 -104854 182923 19307 241531 -219425 43485 -84625 -164178
15191a64178K5633A98571b48151a6270A10613n1350d3423k19040P4142B14673
$$ -164178 -138545 198571 -248151 -16270 110613 59263 -43423 -262463 -188321 214673
15180b16312R9809M2451D06635R3618A27205a10223K6168l2993C084K29505f6545
$$ -216312 -116503 -74052 406635 500253 127205 -110223 -84055 -117048 3084 232589 -66545
15168G6425L2003D8296a41255f7091B71262h3306l7725k00692A64870h5649A2164
$$ 76425 108428 48296 -141255 -67091 271262 -83306 -121031 -321723 164870 -85649 12164
15156a20484D38523f1662A51311f6502A84985l143c5176A85506e2348J1494C97344
$$ -120484 438523 -61662 151311 -66502 184985 181842 -35176 185506 -52348 -40854 397344
15144A57808F3589b09332O1433a7848E3536b27329A55772K07480j27759a09157
$$ 157808 63589 -209332 -147899 -17848 53536 -227329 155772 363252 235493 -109157
15133A21124J45854O3407a59048O0480A44327J89213a41870c3868k17451A5334
$$ 121124 266978 330385 -159048 -98568 144327 333540 -141870 -33868 -251319 15334
15122c7641D64863A62176J47634A37308F4013L84444c2322A50206M7412A8675
$$ -37641 464863 162176 309810 137308 64013 448457 -32322 150206 197618 18675
15111B46635N6903j06574C6141e5904E74426B73709b30383K7467A82641L52207
$$ 246635 303538 196964 36141 -55904 574426 273709 -230383 -202916 182641 534848
15101E34848B36389B5637K39863j18119J06154j04700J102a8008k3374B0751J1428
$$ 534848 236389 25637 265500 147381 253535 148835 149937 -18008 -41382 20751 32179
15090C2179J5327J08630n6123K95998A3975a40115b3209B25253P7381j01993I8645
$$ 32179 47506 156136 100013 396011 13975 -140115 -23209 225253 302634 200641 98645
15078C5843J52850J72253A65195K25539b10389H8022J2763m77K03776B3230L97291
$$ 35843 188693 360946 165195 390734 -210389 88022 100785 100308 304084 23230 420521
15067D20521A73123l1595O0936K04926D2229L07583F6835R6516k3123L56222j37982
$$ 420521 173123 141528 202464 407390 42229 349812 66835 163351 140228 496450 358468
15056C58468M2053K1073j55530A08851K21841J2290G4305L50957k9830A68213
$$ 358468 400521 421594 266064 108851 330692 342982 74305 425262 395432 168213
15045e427A24368J15304j15896L043i4266B29323K22284b5614D25133r5180d06681
$$ -5427 124368 239672 123776 126819 -94266 229323 451607 -25614 425133 329953 -406681
15033B19804b70325A03665J43946I2872g168A1779M4913b5846C78605L2179I3585
$$ 219804 -270325 103665 247611 92872 -7168 11779 56692 -25846 378605 410784 93585
15021C80110A77667Q4072F0311K26136J08738K4755A80672b43999H0949k5186
$$ 380110 177667 261739 60311 286447 395185 419940 180672 -243999 80949 55763
15011E5763a8768C34949o6867Q2581m4982L769J5198a5666B55789f2024K5933
$$ 55763 -18768 334949 268082 350663 305681 309450 324648 -15666 255789 -62024 -36091
15000c6091A72787K7639J35610q2830a36513I5293b84991A97380P0934O7263E6763
$$ -36091 172787 200426 336036 253206 -136513 95293 -284991 197380 268314 335577 56763
14988C93533A68338M8095K13795j17816e371B13446o5738K37033K4500j68225
$$ 393533 168338 216433 430228 312412 -5371 213446 147708 384741 409241 241016
14978B41016k6415N530E0960L88600r3369j18245J59198j29751F5800P4554K34265
$$ 241016 214601 220131 50960 439560 346191 227946 387144 257393 65800 140354 374619
14967C74619q7380c4779D38148A16581K7440J42148A10975K84103P9547a81445
$$ 374619 287239 -34779 438148 116581 144021 286169 110975 395078 474625 -181445
14956c7501E6608K13949m5096K19945l8533j53281J4883F4818j0566L33371A62502
$$ -37501 56608 270557 225461 445406 406873 253592 268475 64818 54252 387623 162502
14944B10118p0954J81471C5091I128K30497O7576q0531D6496K49400N8283L2348
$$ 210118 139164 320635 35091 9128 239625 307201 226670 46496 295896 354179 386527
14933C86527M2302A64070A8596L67891J08838k15105J66356J08475k41300j02163
$$ 386527 428829 164070 18596 386487 495325 280220 446576 555051 313751 211588
14923B11588J4661G3285L58565j63116J50386A90996r1699J29426K84552j19104
$$ 211588 226249 73285 431850 268734 419120 190996 99297 228723 513275 394171
14913C94171j65007K94788A46287K28251j26267J90840j01999k8448P4277P4553
$$ 394171 229164 523952 146287 374538 248271 439111 337112 308664 382941 457494
14903D57494j40256O6508R0936B10535K06710j16982J20116j44409J06200K35138
$$ 457494 317238 383746 474682 210535 417245 300263 420379 275970 382170 617308
14893F17308j99446j9867k0655m7207d3430B59776J58296Q3860A02494K6474L36992
$$ 617308 417862 397995 377340 330133 -43430 259776 418072 501932 102494 128968 465960
14882D65960j84493j22923J97875O1039j15766J39669O4497k03433j49629K82759
$$ 465960 281467 158544 356419 417458 301692 441361 505858 302425 152796 435555
14872D35555L4429j68570O4537q07o1406k5902H4159L32476M6190B24196k4848
$$ 435555 469984 301414 365951 365144 303738 277836 84159 416635 462825 224196 199348
14861A99348P9036K68461k68163J13405K64464B95237j26521N8076L21025j5804
$$ 199348 278384 546845 278682 392087 656551 295237 168716 226792 547817 532013
14851E32013j3795O1100B12763K10342J46375j7130B02676P030M45648B27880
$$ 532013 518218 579318 212763 423105 569480 552350 202676 209706 655354 227880
14840B80296g360D03175J2086J17163L754d4832E34329n7274K46028k32140B05395
$$ 280296 -7360 403175 415261 532424 536178 -44832 534329 477055 723083 490943 205395
14828D98859m6240A73581R8625K64128J38431B86718K18390j18070j47799B3073
$$ 498859 452619 173581 272206 536334 674765 286718 505108 387038 239239 23073
14817D52613j52904K09786p5935J25313B20715J33633P1049J19547J08392k72331
$$ 452613 299709 509495 433560 558873 220715 354348 425397 544944 653336 381005
14807C81005J16456J72339B09148M48593j74989q196j11856J44821K79412j72146
$$ 381005 497461 669800 209148 657741 482752 474556 362700 507521 786933 614787
14797F14787j78847K56281M5343l11521J75505J8374A43295N29060j24613j13216
$$ 614787 435940 692221 737564 426043 601548 619922 143295 672355 547742 434526
14787D34526J19960k5034M992L17515l27081m7716Q4343j61851L79677A01722
$$ 434526 554486 529452 534444 851959 524878 477162 561505 399654 779331 101722
14776C43626L78697r7688Q2777q2417j22378O0008J1551R8804B09884K09527K08294
$$ 343626 722323 624635 707412 624995 502617 562625 574176 672980 209884 419411 627705
14765F27705j3129k35532M40783k43846K16787J47216k13392k3400L361C12064
$$ 627705 614576 379044 819827 575981 792768 939984 726592 703192 706553 312064
14754G85553n0858J24923C67467M47865k83900R9576k58726J41708J91726j30682
$$ 785553 734695 859618 367467 815332 531432 631008 372282 513990 705716 575034
14744E75034K46717L4098l82128K50924J17908j16590J04267J55691D76290J80221
$$ 575034 821751 855849 473721 724645 842553 725963 830230 985921 476290 656511
14734F56511p4176j02229J34292K28514k6617k4847j6014C85426L74741j83498
$$ 656511 582335 480106 614398 842912 816295 791448 775434 385426 760167 576669
14724E76669L24150l21227L21404r0531k14757M01553m59203K91395l5534P1566
$$ 576669 900819 579592 900996 810465 595708 997261 538058 829453 793919 865485
14714H65485m3940L48100j36706k47823n2158J12878k54623L51911k48367K02332
$$ 865485 821545 1169645 1032939 785116 732958 845836 591213 943124 694757 897089
14704H97089J16682n4998k6337L7874K31656m84305p0409K19699K37196l28016
$$ 897089 1013771 958773 932436 970310 1201966 717661 647252 866951 1104147 776131
14694G76131Q043J2534K73119L9531k22509m0987L13030j76627J28515r9033j23836
$$ 776131 784174 796708 1069827 1109358 886849 845862 1158892 982265 1110780 1011747 887911
14683H87911q9200O9325j37077M24170m58836K75023L30906l40084M04801j30570
$$ 887911 798711 868036 730959 1155129 696293 971316 1302222 962138 1366939 1236369
14673A236369k1091L2491k06191j8660n6570P8683O0300J42347k13641k19508
$$ 1236369 1215278 1247769 1041578 1022918 966348 1045031 1105331 1247678 1034037 814529
14663H14529Q8855J20339l01967O99569r9875n22437L05698q057j75219K74329
$$ 814529 903384 1023723 721756 1421325 1321450 799013 1104711 1096654 921435 1195764
14653A195764l836J11178k53451K76454j79160J40056p7999O1776k083p3113L18357
$$ 1195764 1191928 1303106 1049655 1326109 1146949 1287005 1209006 1270782 1268699 1195586 1513943
14642A513943l37899j30082M9554K39125J66238o33856L26931K38188k25535K43796
$$ 1513943 1176044 1045962 1095516 1334641 1500879 867023 1193954 1432142 1206607 1450403
14632A450403n3774J7794j70638K33264j81690M2150O48310o10609j14667M28881
$$ 1450403 1396629 1414423 1243785 1477049 1295359 1337509 1985819 1375210 1260543 1689424
14622A689424n98907L46055m8944K59329k61510O6115N7918k87765L5782N15417
$$ 1689424 1090517 1436572 1387628 1646957 1385447 1451562 1509480 1221715 1257497 1772914
14612A772914l23343m79242M22427j74567K58242L43245k79036N6014n9406r2680
$$ 1772914 1449571 970329 1392756 1218189 1476431 1819676 1540640 1596654 1537248 1444568
14602A444568K4045J17746j59022M62873l11054J41759j15887J22088L98090m99242
$$ 1444568 1468613 1586359 1427337 1890210 1579156 1720915 1605028 1727116 2125206 1625964
14592A625964Q0380P0659M17982m92762N19161m58915j84191J40834J39567L8204
$$ 1625964 1706344 1777003 2194985 1702223 2221384 1762469 1578278 1719112 1858679 1896883
14582A896883q5724J71700j79905K45015J75847m5190l34451J83277K04629N3815
$$ 1896883 1811159 1982859 1802954 2047969 2223816 2178626 1844175 2027452 2232081 2285896
14572B285896j60616K26821l51455m140K25811L61178m0876J09298j3587j7116
$$ 2285896 2125280 2352101 2000646 1996506 2222317 2583495 2542619 2651917 2638330 2621214
14562B621214j47320P9071L76553k04687L15062L2227L18955j90635L30465j53781
$$ 2621214 2473894 2552965 2929518 2724831 3039893 3072120 3391075 3200440 3530905 3377124
14552C377124M24605N94143Q68962J438264L230754R503827J7060177Q391703
$$ 3377124 3801729 4395872 5264834 6703098 9933852 19437679 36497856 44889559
14544D4889559j9333206j1718224F567823l146956j066042k75917l14918P4354
$$ 44889559 25556353 13838129 6567823 3420867 2354825 2078908 1763990 1838344
14536A838344l15323K11974L20885J04471n0188l2080o9143L12651o3028O2337
$$ 1838344 1523021 1734995 2055880 2160351 2110163 2078083 2008940 2321591 2258563 2320900
14526B320900K23603m06445L02534R5911j0850p3768j7656K13806P0721l48653
$$ 2320900 2544503 2138058 2440592 2536503 2525653 2451885 2434229 2648035 2718756 2370103
14516B370103j8900L88516j83365K67876o6899J28067o2950j24688J9271J79121
$$ 2370103 2351203 2739719 2556354 2824230 2757331 2885398 2822448 2697760 2717031 2896152
14506B896152J30401k2264n2965K87782j55565O6568k9625J89454j85047L97989
$$ 2896152 3026553 3004289 2951324 3239106 3083541 3150109 3120484 3309938 3124891 3522880
14496C522880m13393K27965m1781Q1976j49139R2424K11664J82423j48360k6087
$$ 3522880 3109487 3337452 3295671 3377647 3228508 3320932 3532596 3715019 3566659 3540572
14486C540572n2207K38644j67883J37446J34249K69650o1534R6816l46247J09838
$$ 3540572 3488365 3727009 3559126 3696572 3830821 4100471 4038937 4135753 3789506 3899344
14476C899344K64605p5844R0228l324j19741J00425K79199j898N8095k28384L34046
$$ 3899344 4163949 4088105 4178333 4175009 4055268 4155693 4434892 4432994 4491089 4262705 4596751
14465D596751k8150j07262J91391J00518n0976L21944l84532N57909m80712M12264
$$ 4596751 4568601 4461339 4652730 4753248 4702272 5024216 4639684 5197593 4716881 5129145
14455E129145k56576M50140R4453k90153L12531J08258k49882M27684k11514q4309
$$ 5129145 4872569 5322709 5417162 5127009 5439540 5547798 5297916 5725600 5514086 5429777
14445E429777K84750Q3109K57501O9112N6945J9442j99820L46555P2623j42271
$$ 5429777 5714527 5797636 6055137 6124249 6181194 6200636 6000816 6347371 6419994 6277723
14435F277723M46202l85884K05432K77109J96923K56049l30236l0679K39391K48012
$$ 6277723 6723925 6338041 6543473 6820582 7017505 7273554 6943318 6912639 7152030 7400042
14425G400042L02582k03986N9834J91604l5965P1946K35425p4069K87140o6275
$$ 7400042 7702624 7498638 7558472 7750076 7714111 7786057 8021482 7947413 8234553 8168278
14415H168278K61164J75775J96413J72736o458K18735J29841k857M11458j59644
$$ 8168278 8429442 8605217 8801630 8974366 8967908 9186643 9316484 9313627 9725085 9565441
14405I565441N26650j85786K30219M54810j78041k0160K45633K62772M6938L43552
$$ 9565441 10092091 9906305 10136524 10591334 10413293 10393133 10638766 10901538 10948476 11292028
14395A1292028K16152L12554N00284j49735L89731k181K01883J59126K70802J71060
$$ 11292028 11508180 11820734 12321018 12171283 12561014 12558833 12760716 12919842 13190644 13361704
14385A3361704N30574J17646J86411J86622N27879L52254k11966O01469K9009
$$ 13361704 13892278 14009924 14196335 14382957 14910836 15263090 15051124 15652593 15681602
14376A5681602L28505N96620J08933L39965M13823j57680O70314Q84804L86548
$$ 15681602 16010107 16606727 16715660 17055625 17469448 17311768 17982082 18866886 19253434
14367A9253434k94635P05759M67670K94719L65109N48270M19328P37784M93918
$$ 19253434 18958799 19664558 20132228 20426947 20792056 21340326 21759654 22497438 22991356
14358B2991356N0965Q22575K98018P61174N21892N05535M63013Q92318N00946
$$ 22991356 23042321 23864896 24162914 24924088 25445980 25951515 26414528 27306846 27807792
14349B7807792P04948N17245P93067J069536M76658J008612Q28092P42359Q61590
$$ 27807792 28512740 29029985 29823052 30892588 31369246 32377858 33205950 33948309 34809899
14340C4809899R36871J236224R13190J033553Q24105J287613J393712J234241
$$ 34809899 35746770 36982994 37896184 38929737 39753842 41041455 42435167 43669408
14332D3669408J220112R41344J655184J602002J615864J148207K014567J343166
$$ 43669408 44889520 45830864 47486048 49088050 50703914 51852121 53866688 55209854
14324E5209854K152779J672670K094579J678270K526847K244616K747542K149249
$$ 55209854 57362633 59035303 61129882 62808152 65334999 67579615 70327157 72476406
14316G2476406K856825K784592L176472K778641L462081L571941L374124L953009
$$ 72476406 75333231 78117823 81294295 84072936 87535017 91106958 94481082 98434091
14308I8434091L900521M447417M471332M565608N490349N241808N725723N760861
$$ 98434091 102334612 106782029 111253361 115818969 121309318 126551126 132276849 138037710
14300A38037710O493591O716520P070845P454527P929417Q494891Q719220R594235
$$ 138037710 144531301 151247821 158318666 165773193 173702610 182197501 190916721 200510956
14292B00510956R759802J0251484J0838433J1406566J1938465J2534139J2921894
$$ 200510956 210270758 220522242 231360675 242767241 254705706 267239845 280161739
14285B80161739J3401284J3640670J4202625J4196302J4378536J4736230J4529995
$$ 280161739 293563023 307203693 321406318 335602620 349981156 364717386 379247381
14278C79247381J3768732J3726897J2484815J1761156J0408281Q484923M885465
$$ 379247381 393016113 406743010 419227825 430988981 441397262 449882185 454767650
14271D54767650M6882j481341j483764j900208n68319l385177n760981q494911
$$ 454767650 454814532 453333191 451849427 449949219 449380900 445995723 440234742 431739831
14263D31739831j0576284j2540259j4258298j4776139j4994531j5385880j5558251
$$ 431739831 421163547 408623288 394364990 379588851 364594320 349208440 333650189
14256C33650189j5217231j4971650j3828839j3337850j3416126j3117837j2029618
$$ 333650189 318432958 303461308 289632469 276294619 262878493 249760656 237731038
14249B37731038j1622277j1388565j0749809r697452r000689q977035q040507
$$ 237731038 226108761 214720196 203970387 194272935 185272246 176295211 168254704
14242A68254704q330897p443404p144650o525040o068284n130778n893974n420582
$$ 168254704 159923807 152480403 145335753 138810713 132742429 127611651 121717677 116297095
14234A16297095n191020m599274l950620l752213m375019l586745l648780l758816
$$ 116297095 111106075 106506801 102556181 98803968 94428949 90842204 87193424 83434608
14226H3434608l228237k717841k597154l152321k768038j940054j990470k074665
$$ 83434608 80206371 77488530 74891376 71739055 68971017 67030963 65040493 62965828
14218F2965828k354907k301654k073751j433244j679902j594793j557864j781551
$$ 62965828 60610921 58309267 56235516 54802272 53122370 51527577 49969713 48188162
14210D8188162j362310j503651r23275j027201r91975j261071j605496j203660
$$ 48188162 46825852 45322201 44398926 43371725 42379750 41118679 39513183 38309523
14202C8309523j202892l03305j141704p38124j202283j011646p86408q26989n20594
$$ 38309523 37106631 36803326 35661622 34923498 33721215 32709569 31923161 31096172 30575578
14193C0575578q73682n95451p17001o39172j188129l55154n53767q10084m44860
$$ 30575578 29701896 29106445 28389444 27750272 26562143 26206989 25653222 24843138 24398278
14184B4398278n87127l38259o24360o05545n64343l82216k96935n40442l96208
$$ 24398278 23811151 23472892 22848532 22242987 21678644 21296428 20999493 20459051 20062843
14175B0062843l23465l06815m78751n19940j40317o78547j79255n46527l14139
$$ 20062843 19739378 19432563 18953812 18433872 18293555 17615008 17435753 16889226 16575087
14166A6575087k75870k84073k7129n73879r0604l49522k32932p9154l94664j98529
$$ 16575087 16299217 16015144 15988015 15414136 15323532 14974010 14741078 14661924 14267260 14068731
14156A4068731m11635k88476l81207K18652m82814j8360j83138l03715j8900j2235
$$ 14068731 13657096 13368620 12987413 13206065 12723251 12704891 12521753 12218038 12199138 12186903
14146A2186903o89229n0555q009k72202P5846l52028k54049J31769m08644Q3669
$$ 12186903 11497674 11447119 11439110 11166908 11242754 10890726 10636677 10768446 10359802 10443471
14136A0443471o4305l77844o1409k94408o1522k68853k26219L22026m45234j58469
$$ 10443471 10379166 10001322 9939913 9645505 9583983 9315130 9088911 9410937 8965703 8807234
14126H807234N1200o14619j89574N24788j32987m13101k21214L43217l45888p5807
$$ 8807234 8858434 8243815 8054241 8579029 8446042 8032941 7811727 8154944 7809056 7733249
14116G733249K0745j04885l71641p5129L28612l66537l74359J80343r5530j92628
$$ 7733249 7753994 7649109 7277468 7202339 7530951 7164414 6790055 6970398 6874868 6682240
14106F682240j70430K35394k80548j84675N9396K94930m45096J61021k59122k4292
$$ 6682240 6511810 6747204 6466656 6281981 6341377 6636307 6191211 6352232 6093110 6068818
14096F068818l01495N07026m87419l31460L38105j87964p32l8054k3781m9097
$$ 6068818 5767323 6274349 5786930 5455470 5793575 5605611 5604879 5566825 5543044 5493947
14086E493947j86867O8198N5817m91418k5344J95318j48546J37555m67319K33673
$$ 5493947 5307080 5375278 5431095 4939677 4914333 5109651 4961105 5098660 4631341 4865014
14076D865014o6990J18382k79482j01636K52663l21872k16879M54129o06186M17418
$$ 4865014 4798024 4916406 4636924 4535288 4787951 4466079 4249200 4703329 4097143 4514561
14066D514561k21322k65612j9883J55016Q9535J7855N2064j49085O5618k21620
$$ 4514561 4293239 4027627 4007744 4162760 4252295 4270150 4322214 4173129 4238747 4017127
14056D017127r9915J21254k78027r6344m8281K56459p5602n01596N30637j48124
$$ 4017127 3917212 4038466 3760439 3664095 3615814 3872273 3796671 3295075 3825712 3677588
14046C677588r5198k80821p8703J52654N3690j63461J76628l33555J19823l18401
$$ 3677588 3582390 3301569 3222866 3375520 3429210 3265749 3442377 3108822 3228645 2910244
14036B910244M58379m05706K67310m2014J40846k79961J69111J15251k33165J8878
$$ 2910244 3368623 2962917 3230227 3188213 3329059 3049098 3218209 3333460 3100295 3119173
14026C119173m00554O0130K42975J84226k98817j5385l5247k49566R2700k20627
$$ 3119173 2718619 2778749 3021724 3205950 2907133 2891748 2856501 2606935 2699635 2479008
14016B479008J87027N944R7574l9536n5514m7356p1654k14375Q0518O50335o32327
$$ 2479008 2666035 2671979 2769553 2730017 2674503 2627147 2555493 2341118 2421636 3071971 2439644
14005B439644j84140J78466q9421J18170j28101M8809j28208P789m74480M17691
$$ 2439644 2255504 2433970 2344549 2462719 2334618 2383427 2255219 2263008 1788528 2206219
13995B206219j92579K38565K35514k71263J51858J91844M27906J894782P202948
$$ 2206219 2013640 2252205 2487719 2216456 2368314 2560158 2988064 4882846 12085794
13986A2085794J7701507J5437627j5383812j3361886o745230l483905j136928
$$ 12085794 29787301 45224928 29841116 16479230 9734000 6250095 5113167
13979E113167j234400j0505n10663p6716k27531k82193M14084l12325l23177q4998
$$ 5113167 3878767 3868262 3357599 3280883 3053352 2771159 3185243 2872918 2549741 2464743
13969B464743o9538K40005n11134M58122m78339M29021j82627l14797K47693K20105
$$ 2464743 2395205 2635210 2124076 2582198 2103859 2532880 2350253 2035456 2283149 2503254
13959B503254k18007N6517J69343j87011m01525J17809k21978M9233K61520j07155
$$ 2503254 2285247 2341764 2511107 2324096 1922571 2040380 1818402 1867635 2129155 2022000
13949B022000K26799l19954k683r0218K30828j58202l62853L80040j12519M3767
$$ 2022000 2248799 1928845 1926162 1835944 2066772 1908570 1545717 1925757 1813238 1857005
13939A857005p4396r1765J36558m2758k6126k28995L15450q2486K3080J11576
$$ 1857005 1782609 1690844 1827402 1784644 1758518 1529523 1844973 1762487 1785567 1897143
13929A897143j03862M1853m0161k04744k16732J38906M61906k94135J91938l55846
$$ 1897143 1793281 1835134 1794973 1590229 1373497 1512403 1974309 1680174 1872112 1516266
13919A516266J60894n2907l64835O36451k4386n95553K53637J98235j71747R8277
$$ 1516266 1677160 1624253 1259418 1895869 1871483 1275930 1529567 1727802 1556055 1654332
13909A654332l59466L27702o52032L27621j19269q3139L97890j60909Q4375O9799
$$ 1654332 1294866 1622568 970536 1298157 1178888 1095749 1493639 1332730 1417105 1486904
13899A486904k80316K57080O8596N2181o84244P59966l39291j61430L06572k53332
$$ 1486904 1206588 1463668 1532264 1584445 900201 1660167 1320876 1159446 1466018 1212686
13889A212686j28037N587K13157o6921N0488J2883l19928N07261l40699J77386
$$ 1212686 1084649 1090236 1303393 1236472 1286960 1299843 979915 1487176 1146477 1323863
13879A323863k84265l2281K88499n2244o3773L62614o06058L75478j26682J8047
$$ 1323863 1039598 1007317 1295816 1243572 1179799 1542413 936355 1311833 1185151 1203198
13869A203198l65986K49865J05611l37485l3600o9819N70954p3040j61165j65342
$$ 1203198 837212 1087077 1192688 855203 821603 751784 1322738 1249698 1088533 923191
13859I23191J53078P2015K2625J18685k46041K72610r4194j4762k61962L803J15902
$$ 923191 1076269 1148284 1170909 1289594 1043553 1316163 1221969 1207207 945245 949048 1064950
13848A064950K61888j6963l63205J01498l03741J63519L58626m76601L35317R8243
$$ 1064950 1326838 1309875 946670 1048168 744427 907946 1266572 789971 1125288 1223531
13838A223531l12799p7012K73647l0515j17540p9998K53987j54522L6941r6461
$$ 1223531 910732 833720 1107367 1076852 959312 879314 1133301 978779 1015720 919259
13828I19259K58736N2198j84502j77943k20633L46393m4736J26064l02526J08098
$$ 919259 1177995 1230193 1045691 867748 647115 993508 948772 1074836 772310 880408
13818H80408J07502Q079p9174j97901L74723j35149k1424n5331m8314K58652l80294
$$ 880408 987910 995989 916815 718914 1093637 958488 937064 881733 833419 1092071 711777
13807G11777J54100l11l34512m7118K43117K82702k88739j91904N69290p4119
$$ 711777 865877 865566 531054 483936 727053 1009755 721016 529112 1098402 1024283
13797A024283k27684K93354k31650R242j53709k2357L18333q1945m1163j04710
$$ 1024283 796599 1089953 858303 867545 713836 691479 1009812 927867 886704 781994
13787G81994j495r3441K21924N4567j95095J72721k9456J09587m10593Q4776J70008
$$ 781994 780499 687058 908982 963549 768454 941175 911719 1021306 610713 695489 865497
13776H65497n7748j59128J26636Q6710K02149k01968j16766J59818J72103m91755
$$ 865497 807749 648621 775257 861967 1064116 862148 745382 905200 1077303 585548
13766E85548J45075q4389L72793l80651p0390j09824L40260j5448j03708J21479
$$ 585548 730623 646234 1019027 638376 567986 458162 798422 782974 679266 800745
13756H00745k18467K10175j82322R8981J67075D23676L35883j95317J1291p2921
$$ 800745 582278 792453 610131 709112 876187 423676 759559 564242 575533 502612
13746E02612M65586l17566K8549j56738M4664K58782j27034Q2833l71991J01493
$$ 502612 968198 650632 679181 522443 567107 825889 698855 781688 409697 511190
13736E11190j68082M86847k57619J71406j01796K480L01261k04430k84711L82076
$$ 511190 343108 829955 572336 743742 641946 644426 945687 741257 456546 838622
13726H38622k59290J19793k15237J52025K57479j65985j53310j63022J16982j47384
$$ 838622 579332 699125 483888 635913 893392 727407 574097 411075 528057 380673
13716C80673J51571r7545M8175L20054B10475J12373K67686L87418n2858j91666
$$ 380673 532244 434699 482874 802928 210475 322848 590534 977952 925094 733428
13706G33428o0812k76852N1176J61049j79739L68017l35705J85332o9009j15250
$$ 733428 672616 395764 446940 607989 428250 796267 460562 645894 576885 461635
13696D61635L9162k12444R4729J59347B53133L65295G6032N77033o6820N2029
$$ 461635 500797 288353 383082 542429 253133 618428 76032 653065 586245 638274
13686F38274j16119j5564B12419K85405A97097K70456J5395K56984j34909k36583
$$ 638274 522155 506591 212419 497824 197097 467553 482948 739932 605023 368440
13676C68440O5213p6973J54407M7061j79053L31652k73920J44982J07788l05293
$$ 368440 433653 356680 511087 558148 379095 710747 436827 581809 689597 384304
13666C84304K06813J28057C28756J89145K72314k76581R7650j25218j63356R0349
$$ 384304 591117 719174 328756 517901 790215 513634 611284 486066 322710 413059
13656D13059j47455J47684L42743B81787K67297j84261J86680J20166l29400J85529
$$ 413059 265604 413288 756031 281787 549084 364823 551503 671669 342269 527798
13646E27798j23054K991j7425L52999k14585j05364J96377k52503j34465J60454
$$ 527798 404744 407735 390310 743309 528724 423360 619737 367234 232769 393223
13636C93223o9080L9952L73438A89480M22149k25688N4212K26716B77511I6056
$$ 393223 324143 364095 737533 189480 611629 385941 440153 666869 277511 96056
13625F04552B53273N36493B07357J81074J72933j28318J99224l06532q0263j10956
$$ 604552 253273 789766 207357 388431 561364 433046 632270 325738 245475 134519
13615A34519K14029j73159B7153M83218m0440j99751I2616J89422K86874B54647
$$ 134519 348548 175389 27153 510371 469931 270180 92616 282038 568912 254647
13604B06279c7146D52078J42858J75703B77108Q1965n2850K27979k39783K16327
$$ 206279 -37146 452078 594936 770639 277108 359073 306223 534202 294419 510746
13594E10746j58169j30096L95556K88635l73802k49293j8480J38942j81929J85546
$$ 510746 352577 222481 618037 906672 532870 283577 265097 404039 222110 407656
13584D07656O2672j88797A16751J26636j3394R2503I9685J49467O0410l6747P5799
$$ 407656 470328 281531 116751 243387 229993 322496 99685 249152 309562 272815 348614
13573C48614J13307j28230k1051K08137j32281j75667Q5016L86175k58704J07830
$$ 348614 461921 333691 312640 520777 388496 212829 297845 684020 425316 533146
13563E33146N2581B89819A41706N76178B70644K06452J0171R2274k21988k6615
$$ 533146 585727 289819 141706 717884 270644 477096 487267 579541 357553 330938
13553C30938G9148L94925r9362l9645H3012J25779k791J23921J15730j49530L2324
$$ 330938 79148 474073 374711 335066 83012 208791 206000 329921 445651 296121 328445
13542C28445L3400n7016m1172A15447K10397m2258o674K9883n4608A03927K30406
$$ 328445 361845 304829 263657 115447 325844 283586 276912 306795 252187 103927 334333
13531C34333E6290M92645A10733J70830o8168D6427L79907l3830j14108p6506
$$ 334333 56290 548935 110733 281563 213395 46427 426334 392504 278396 201890
13521B01890g5680D73561j85792P0302A78420L78095B75736P4357C2745O19205
$$ 201890 -75680 473561 287769 358071 178420 556515 275736 350093 32745 651950
13511F51950A34636J53842A23384M39231D8268K52670L12412B73048K115J34722
$$ 651950 134636 288478 123384 562615 48268 300938 613350 273048 275163 409885
13501D09885j35803J18396p7827L4494J91202D6166O27319k03965A68472N0378
$$ 409885 274082 392478 314651 349145 540347 46166 673485 469520 168472 218850
13491B18850E2996K52213K12035o7252A96872J47360p1725J592j09582L1753j0827
$$ 218850 52996 305209 517244 449992 196872 344232 272507 274099 164517 196270 185443
13480A85443K68889C0513L92212j03703H0472J59240L67272p4008j15524j75206
$$ 185443 454332 30513 422725 319022 80472 239712 606984 532976 417452 242246
13470B42246J77892A60131J55308P9028A86303H3409K61861K32479a9041A93406
$$ 242246 420138 160131 315439 394467 186303 83409 345270 577749 -19041 193406
13459E20836j17255B249K83492m1797J43131e488A73040k5556J75084j20644D087
$$ 520836 403581 2249 285741 243944 387075 -5488 173040 147484 322568 201924 4087
13447B39569j02728A5620L71737j20354G8115K08370J14034j98368H1205J84461
$$ 239569 136841 15620 387357 267003 78115 286485 400519 202151 81205 265666
13437B65666B7002B076i0608D63849m4268q5755j45781Q4252b80470C3N59614
$$ 265666 27002 2076 -90608 463849 419581 333826 188045 272297 -280470 33 559647
13426E59647j81704p7707f3106B21935n6791J68327K8138j42431I2187Q4908H0021
$$ 559647 377943 300236 -63106 221935 165144 333471 361609 219178 92187 177095 80021
13414A88010p1953J03134r3823J00427C0076K12393a06278B01668K96220D0511
$$ 188010 116057 219191 125368 225795 30076 242469 -106278 201668 497888 40511
13403B52628L0937b0154C48954G3651J56306K22349I8703K34557A34289D9147
$$ 252628 283565 -20154 348954 73651 229957 452306 98703 333260 134289 49147
13392C65069J59629b9264C39496A23957Q9331L23908k60856A4195a57093H2401
$$ 365069 524698 -29264 339496 123957 213288 537196 276340 14195 -157093 82401
13381E1438K01262K7344K4434G5560O9273N6196k4881q4281Q1868b0803E02359
$$ 51438 252700 280044 304478 75560 144833 201029 176148 91867 173735 -20803 502359
13369A71329K53428A9442L04240A40634d08959B98284j29904a23669B49118J17341
$$ 171329 424757 19442 323682 140634 -408959 298284 168380 -123669 249118 366459
13359C66459n7197Q0221A61899a31194D2465L23118J34896H5569K70693j69278
$$ 366459 309262 389483 161899 -131194 42465 365583 500479 85569 356262 186984
13349A86984l0711K69288a09406C59515J44919j65540F4718P9728J39770j02144
$$ 186984 156273 425561 -109406 359515 504434 338894 64718 144446 284216 182072
13339A82072J15727o4871O4546Q6275f3018B88453A41090a6616A54136J64838
$$ 182072 297799 232928 297474 383749 -63018 288453 141090 -16616 154136 318974
13329C18974j26447P4947K006b6393C92066J35413A66886M7770q124K60661A70650
$$ 318974 192527 267474 269480 -26393 392066 527479 166886 214656 206532 467193 170650
13317D13984O5148A14878J55294A03242c0966C19255J39654i8244c4252a0302
$$ 413984 479132 114878 270172 103242 -30966 319255 458909 -98244 -34252 -10302
13306D13728c1785A85816G9886J00633a27102I7714d8890B10891I2739K58430
$$ 413728 -31785 185816 79886 180519 -127102 97714 -48890 210891 92739 351169
13296C51169i4440A59787E4870M62058A21518J08513j14264K2860j357E9634a9911
$$ 351169 -94440 159787 54870 516928 121518 230031 115767 138627 137270 59634 -19911
13284A83093j6871o5436l4799J020B8640a28784j84526C09550a48964B49288j06908
$$ 183093 166222 100786 65987 67007 28640 -128784 -313310 309550 -148964 249288 142380
13273A42380C765L54331A40472L29881j67224j9785D7308L1140J26277Q4366a52188
$$ 142380 3765 358096 140472 470353 303129 283344 47308 78448 204725 289091 -152188
13261a90178B22255H2375K59909m6821j30953G1557Q3649b29338E1449J72828
$$ -190178 222255 82375 342284 295463 164510 71557 155206 -229338 51449 224277
13251B24277l4110K35269a4814B04123J49616n9800K7599H5219a34168B7448J64537
$$ 224277 190167 425436 -14814 204123 353739 293939 321538 85219 -134168 27448 191985
13240A91985J64629e8925D28139A73379L93719a5063o816n6157B08041G6103L22214
$$ 191985 356614 -58925 428139 173379 567098 -15063 -21879 -78036 208041 76103 398317
13229C98317A27401a5961A59961K17097A39540A4684c48551C03075A41939F7169
$$ 398317 127401 -15961 159961 377058 139540 14684 -348551 303075 141939 67169
13218g9845C39833d4700A23722J19653E6835K81999A03266J7154n3220P8202L39805
$$ -79845 339833 -44700 123722 243375 56835 338834 103266 120420 67200 145402 485207
13207D85207a61161B16556A473M2690Q4372K11905A15539r630j5290Q745D80L552
$$ 485207 -161161 216556 1473 44163 128535 340440 115539 105909 90619 99364 480 4032
13195D032h2992b8557p5069B24482b63996a14084B08156g2320k51844B59031h9791
$$ 4032 -82992 -28557 -103626 224482 -263996 -114084 208156 -72320 -324164 259031 -89791
13183B9429a06979D38353A37781a74467A19175J87928a54154K866C04568A43198
$$ 29429 -106979 438353 137781 -174467 119175 307103 -154154 -151288 304568 143198
13172C80201a87336r5338D0051d4663j47217F9432O0656P6741H1868a56374E3212
$$ 380201 -187336 -282674 40051 -44663 -191880 69432 130088 206829 81868 -156374 53212
13160B69608e4224H2602J94515a00292K7326B44092N9649J12141A34581J76350
$$ 269608 -54224 82602 277117 -100292 -72966 244092 303741 415882 134581 310931
13150C10931A42141M99P8489B1007K02445a13179B76984H48L38173I3536Q3426
$$ 310931 142141 142640 221129 21007 223452 -113179 276984 848 339021 93536 176962
13139A76962Q153g9103C5944K33385I7933M3393b71341A62338D7834K13448j21615
$$ 176962 185115 -79103 35944 269329 97933 141326 -271341 162338 47834 261282 139667
13128A39667E3550P4947b1647A78280b72021a7663A16514C7060J72705J7926i9031
$$ 139667 53550 128497 -21647 178280 -272021 -17663 116514 37060 209765 227691 -99031
13116A12120L3712a62955A5283O451a69190E3354B3849i3417j1772D6409J14865
$$ 112120 145832 -162955 15283 21734 -169190 53354 23849 -93417 -105189 46409 161274
13105A61274C5876J21565D5321K52944h1786H1710k7929b5666D06298E6998J73428
$$ 161274 35876 157441 45321 298265 -81786 81710 53781 -25666 406298 56998 230426
13094B30426e959D682K59660B9723J64968b1534F3668O82b5368A33675a86680
$$ 230426 -5959 4682 264342 29723 194691 -21534 63668 64350 -25368 133675 -186680
13082E8818K90361j48910b1559H1395a72670A02060R253P149K46378A0351a82673
$$ 58818 349179 200269 -21559 81395 -172670 102060 111313 118462 364840 10351 -182673
13070C79013E2698P0258A7322P6182J48088B1865e3648A49487o583B2802b7414
$$ 379013 52698 122956 17322 93504 241592 21865 -53648 149487 142904 22802 -27414
13058B61075H1804a01878k7948F3483c7336A61712a68633D1984N22172k81853
$$ 261075 81804 -101878 -129826 63483 -37336 161712 -168633 41984 564156 282303
13048B82303G7459J44304A3024L7531J21977d7271o6915B2162h1788D00669a31956
$$ 282303 77459 221763 13024 50555 172532 -47271 -114186 22162 -81788 400669 -131956
13036a4701C41407A66106n5846J73202K4734J52530A69734j2566J0953J0053K32952
$$ -14701 341407 166106 110260 283462 308196 460726 169734 157168 168121 178174 411126
13025D11126j09750A18383f1809C01943m2696E9853N8991J81314A449J66830b5237
$$ 411126 301376 118383 -61809 301943 259247 59853 118844 300158 1449 168279 -25237
13013A83539K92735k35132J25177l2864a25538C90784A30055j7874c24537D21751
$$ 183539 476274 241142 366319 333455 -125538 390784 130055 112181 -324537 421751
13002G236h3828A27911K05288d920J981C11258k1187A02014P4421E1225f049I9073
$$ 7236 -83828 127911 333199 -4920 -2939 311258 290071 102014 176435 51225 -6049 99073
12989e6965A09420E4685K45939G407K97818J92733B44646a3418B7820J29319p0947
$$ -56965 109420 54685 300624 7407 305225 497958 244646 -13418 27820 157139 86192
12978H6192i7902E013a33718A68398b08956d1042F9110J71424G1939B6333N1847
$$ 86192 -97902 5013 -133718 168398 -208956 -41042 69110 240534 71939 26333 78180
12967G8180J33605K5919A8113a9154E2703j9231b50460B64989h078C17457n3488
$$ 78180 211785 237704 18113 -19154 52703 33472 -250460 264989 -8078 317457 263969
12956B63969l0770A04110R8203K0282a48510k43958C31360c13454a38601G3721
$$ 263969 233199 104110 202313 222595 -148510 -392468 331360 -313454 -138601 73721
12945A57155d0932C05118H3497K21725a41268n5696G6471d0204A44657h3095B3080
$$ 157155 -40932 305118 83497 305222 -141268 -196964 76471 -40204 144657 -83095 23080
12933E3379P7038c03590A185b31933H9614R8982q0149b80201e4967k18001A14563
$$ 53379 130417 -303590 1185 -231933 89614 188596 108447 -280201 -54967 -272968 114563
12921C12450i5021J5946B17360J7268A08138k5689C6191a97289F7502b9009B84566
$$ 312450 -95021 -79075 217360 234628 108138 82449 36191 -197289 67502 -29009 284566
12909a82357H7824b07869A61392j1084D8917a98044B70941j16393a39748A58671
$$ -182357 87824 -207869 161392 150308 48917 -198044 270941 154548 -139748 158671
12898C15042I6264a13924D3281c34355A7073J23827J77981p3814a39377j05763
$$ 315042 96264 -113924 43281 -334355 17073 140900 318881 245067 -139377 -245140
12888b45140A75444c89026a04955A51233m9094C4511l736R0569A6573E884K76774
$$ -245140 175444 -389026 -104955 151233 102139 34511 30775 121344 16573 5884 282658
12877B82658a60599E810h2566C63628A41554e1408k45801J33907H7304A0095J3768
$$ 282658 -160599 5810 -82566 363628 141554 -51408 -297209 -163302 87304 10095 23863
12866B3863c35515A29940a30252j28874e4838A89653k8539n1914K19656j58217
$$ 23863 -335515 129940 -130252 -259126 -54838 189653 161114 109200 328856 170639
12856A70639H3252C2589p194O8966M0102b57786C0524O5991k7811b4030A36137
$$ 170639 83252 32589 25395 94361 134463 -257786 30524 96515 68704 -24030 136137
12844d333C26895j03366b276A31080J29313i901r1227j10575A46303o3295a95678
$$ -4333 326895 223529 -2276 131080 260393 -9901 -101128 -211703 146303 83008 -195678
12832a79204h2825j08147g1053A87953g8104B6256R1253E6643N3167l0495R742
$$ -179204 -82825 -190972 -71053 187953 -78104 26256 117509 56643 109810 79315 89057
12821H9057L66252c36348D3923k1780p793e7966B9781K77902C5201a51154b9244
$$ 89057 455309 -336348 43923 22143 14350 -57966 29781 307683 35201 -151154 -29244
12809A86669J36721A08037a33421H5898b16970C4129O964K38779j03702a18833
$$ 186669 323390 108037 -133421 85898 -216970 34129 41093 279872 176170 -118833
12798B34459F1787K0880b48740f6082H1229I48J82985b11162A32007O1618b62175
$$ 234459 61787 82667 -248740 -66082 81229 948 183933 -211162 132007 193625 -262175
12786D25894I6443j3970M7870b92731A36699b3781A12699a7404A01986a02136
$$ 425894 96443 82473 130343 -292731 136699 -23781 112699 -17404 101986 -102136
12775D202J7478a47154a5501e077B01487D2248O9537J25414A16968E5579a43471
$$ 4202 21680 -147154 -15501 -5077 201487 42248 111785 237199 116968 55579 -143471
12763a41085A33303m8205a32582O2019A72491a6033D3137a33203K8872A0324a34598
$$ -141085 133303 85098 -132582 -70563 172491 -16033 43137 -133203 -104331 10324 -134598
12751a94659B70385f4318p8270G6517i9459c4785j58718h4143G9804l0294e3034
$$ -194659 270385 -64318 -142588 76517 -99459 -34785 -193503 -84143 79804 49510 -53034
12739C1130b9081H1843j1340a53503D35847D1911a33469A19697K21917j67627
$$ 31130 -29081 81843 70503 -153503 435847 41911 -133469 119697 341614 173987
12729A73987F388K96290E4666b09902K8877B17677L9823k2025L474e3880B20032
$$ 173987 6388 302678 54666 -209902 -181025 217677 257500 235475 238949 -53880 220032
12717D0198J69913D5242a69778E52442A13014J0163J95448A23405o0887b9320
$$ 40198 210111 45242 -169778 552442 113014 123177 318625 123405 62518 -29320
12706F6618B8878J87624a37202c7420H1192a43122C48086A4977b14598B6798a44889
$$ 66618 28878 216502 -137202 -37420 81192 -143122 348086 14977 -214598 26798 -144889
12694A58284o1571K05584q9935q6293n4864K61939i9981A00630C8962J40023A0838
$$ 158284 96713 302297 212362 126069 71205 333144 -99981 100630 38962 178985 10838
12682G8652j6848e7830D1545J04460R7306b43276A01612a86207C06298C7007e5073
$$ 78652 61804 -57830 41545 146005 243311 -243276 101612 -186207 306298 37007 -55073
12670A07982R8617b178E7441J85170b35538A86927c9199C03831b67358A1901b2598
$$ 107982 206599 -2178 57441 242611 -235538 186927 -39199 303831 -267358 11901 -22598
12658g479H0339K38632j383A44676a34231C00070o1323m9964K32030j18518A25650
$$ -7479 80339 318971 317588 144676 -134231 300070 238747 188783 420813 302295 125650
12646B18798d2972G5170J17280a14958B35449I044b99860G7383a8625L611B79476
$$ 218798 -42972 75170 192450 -114958 235449 9044 -299860 77383 -18625 -15014 279476
12634A8238L57218A13486J94657l2389C7771K63078j21440J35360A08582E3092
$$ 18238 375456 113486 308143 275754 37771 300849 179409 314769 108582 53092
12623I760J73194J01388K4765q7496J28516B4629K37179h8204A62846K8832F3785
$$ 9760 182954 284342 309107 221611 350127 24629 261808 -88204 162846 191678 63785
12611e7293B24780k6743J16273B1308e0507B14897D7475J57375J21564a16014
$$ -57293 224780 198037 314310 21308 -50507 214897 47475 204850 326414 -116014
12600C94031A31177L69419j8946D0219K91384j09660a46082b6013C3991K5218
$$ 394031 131177 500596 481650 40219 331603 221943 -146082 -26013 33991 59209
12590E9209J67235j0067E2189N6808a55080A82120a82200a5326j76993c1161j88540
$$ 59209 226444 216377 52189 108997 -155080 182120 -182200 -15326 -192319 -31161 -219701
12579b19701N5210O8930A30601l0929a68438j29799J06571F0362B5966M795c2568
$$ -219701 -164491 -95561 130601 99672 -168438 -298237 -191666 60362 25966 30761 -32568
12567D9544d0635j11952I6637K35012B4690L1147f1885j09456B64835e2367a0730
$$ 49544 -40635 -152587 96637 331649 24690 55837 -61885 -171341 264835 -52367 -10730
12555c58815A0067h1349b233m9775B40644N7874o062B3682K8531H787K23606h6908
$$ -358815 10067 -81349 -2233 -52008 240644 298518 292456 23682 52213 8787 232393 -86908
12542a04108B27526p9331a59551O2660J2137j01513G7179a39397M111D9337g5978
$$ -104108 227526 148195 -159551 -96891 -84754 -186267 77179 -139397 -135286 49337 -75978
12530B30591a40438m89136A46294e0319D2292b4396n6546H6943a48479A72318
$$ 230591 -140438 -629574 146294 -50319 42292 -24396 -80942 86943 -148479 172318
12519A20269a51514C813Q4800B0180h029B15317C7488L10155A3473d1383A45575
$$ 120269 -151514 3813 88613 20180 -8029 215317 37488 347643 13473 -41383 145575
12507c0891l24A14319k9258J27789A1051a32295j88007M2168B9419a32388C27191
$$ -30891 -31215 114319 85061 212850 11051 -132295 -320302 -278134 29419 -132388 327191
12495c1297A6031J30994g2793C01259Q5740d06027a1309k75596i363k52683K1661
$$ -31297 16031 147025 -72793 301259 386999 -406027 -11309 -286905 -9363 -262046 -240385
12484b40385B74704a68680D1861j9743O5443c46398C42275I2011c387k54501D2612
$$ -240385 274704 -168680 41861 22118 87561 -346398 342275 92011 -3387 -257888 42612
12472G4131J42726B7514J88068d52030a17803A50024a45056B04928e865j0844
$$ 74131 216857 27514 215582 -452030 -117803 150024 -145056 204928 -5865 -16709
12462a6709r5356B80487a07511C17392A20660e2852B05959G6751P6830a07740
$$ -16709 -112065 280487 -107511 317392 120660 -52852 205959 76751 153581 -107740
12451B78589j13350K92986B26881B2204b34851M4338L4425J4920A18312b1376
$$ 278589 165239 458225 226881 22204 -234851 -190513 -156088 -141168 118312 -21376
12440C37351A15151d02254J17185I0418f393p5648B98604d4868I112a20946j0828
$$ 337351 115151 -402254 -285069 90418 -6393 -82041 298604 -44868 9112 -120946 -131774
12429a31774K794G0208J54338G5828i2272j11110R9198C8234a97867G5460N2875
$$ -131774 -128980 70208 224546 75828 -92272 -203382 -104184 38234 -197867 75460 128335
12418A28335e6664K757n3541A7497L25960a45463C02747E4069J14786j6723f110
$$ 128335 -56664 -53907 -107448 17497 343457 -145463 302747 54069 168855 152132 -6110
12406G4059J10426a78573e7604j49119B3533K65756G9423K3569P3218a05116A40651
$$ 74059 184485 -178573 -57604 -206723 23533 289289 79423 102992 176210 -105116 140651
12394I9482J251c02314l03996A65224h9749H2262h0602D5581R3919g5940C04483
$$ 99482 100733 -302314 -606310 165224 -89749 82262 -80602 45581 139500 -75940 304483
12382B28806b07421j16457c1726p5535A39850L62940B47059b49539J12875d3979
$$ 228806 -207421 -323878 -31726 -107261 139850 502790 247059 -249539 -136664 -43979
12371e3375A43619p378a38816f3992B36280J23903C7739e1489q1062j28562g3124
$$ -53375 143619 136241 -138816 -63992 236280 360183 37739 -51489 -132551 -261113 -73124
12359B35923c60330a106D01371E1336b00856i1141B82227d8508G2345a30724B4126
$$ 235923 -360330 -1106 401371 51336 -200856 -91141 282227 -48508 72345 -130724 24126
12347F0869R8551a35815A18972a64387n6532D3941b15564A0992a58836A24111
$$ 60869 159420 -135815 118972 -164387 -220919 43941 -215564 10992 -158836 124111
12336e3804k85693M5290f844B95594a10774B08940a39433G1144j8702g7266B12003
$$ -53804 -339497 -294207 -6844 295594 -110774 208940 -139433 71144 52442 -77266 212003
12324A31391N3471l9966p831a61486C74925a02731D07952a24436A60357b6526
$$ 131391 184862 144896 137065 -161486 374925 -102731 407952 -124436 160357 -26526
12313b46779A76170F3513d65B625L2993L72230A43775h6050C67166A73899a62141
$$ -246779 176170 63513 -465 2625 35618 407848 143775 -86050 367166 173899 -162141
12301A07632O6238G8593d24811a58286i418A85011b4298P46c711A17332P8227
$$ 107632 173870 78593 -424811 -158286 -9418 185011 -24298 -23552 -3711 117332 195559
12290A95559N3748c4883A97895E9169i6788q928A67268G2197a52576H301J98953
$$ 195559 249307 -34883 197895 59169 -96788 -105716 167268 72197 -152576 8301 207254
12279B07254J7381a17877G2115A0125J32723R8516C9413J26159n640e1168j6263
$$ 207254 224635 -117877 72115 10125 142848 241364 39413 165572 159932 -51168 -67431
12268f7431B15031N2292b3563j27055A38401a72930j90870D126R4122K19567E7853
$$ -67431 215031 267323 -23563 -150618 138401 -172930 -363800 4126 98248 317815 57853
12256G1189l4940Q1612E4569K77978G2364g0287F9223b40677A78820b8650B03794
$$ 71189 36249 117861 54569 332547 72364 -70287 69223 -240677 178820 -28650 203794
12244c3331a3158E6332k1613L88514a50814A66322J6546a48959B79612A05129
$$ -33331 -13158 56332 34719 423233 -150814 166322 182868 -148959 279612 105129
12233B28838H6683O1376F8597N9897B9272K37439m3859a50643A69615k0932f1861
$$ 228838 86683 148059 68597 128494 29272 266711 222852 -150643 169615 148683 -61861
12221D2120a478C91697r3255r2476d7863j59547D05245A17538Q3952E7031p101
$$ 42120 -1478 391697 298442 205966 -47863 -207410 405245 117538 201490 57031 49930
12210D9930J20244a18141G5382L725b2491B39326G4371J43216a37629N0495A74438
$$ 49930 170174 -118141 75382 79107 -22491 239326 74371 217587 -137629 -87134 174438
12198g9279A91554o0733M65098a27621h626E18911A95685B1610J22312J76445
$$ -79279 191554 130821 595919 -127621 -8626 518911 195685 21610 143922 320367
12188C20367J31937h2182I0997J50246J77200j21090h3340B30656J36561j66492
$$ 320367 452304 -82182 90997 241243 418443 297353 -83340 230656 367217 200725
12178B00725a33156E7990Q9252Q8602M92556B37908R5936e4089k1632B32893q4743
$$ 200725 -133156 57990 147242 235844 728400 237908 333844 -54089 -75721 232893 148150
12167A48150a8730A94669n6921a09353C5346J75020b3871I2697a28873j38088
$$ 148150 -18730 194669 137748 -109353 35346 210366 -23871 92697 -128873 -266961
12157b66961g8776C63420b79947B78225c26047C32085D6983R3005b39739k999
$$ -266961 -78776 363420 -279947 278225 -326047 332085 46983 139988 -239739 -242738
12147b42738b4581B81893a07160A53328F3977A98b8389p4071J9978C06057A5866
$$ -242738 -24581 281893 -107160 153328 63977 198 -28389 -102460 -82482 306057 15866
12135g6999m6420B89520E8472L8655i3317B87151I024J79303e5510j15675A0957
$$ -76999 -123419 289520 58472 97127 -93317 287151 9024 188327 -55510 -171185 10957
12123f0672B59640a78257A69597p4541c4346r296B79006a08786b3172l7870E7346
$$ -60672 259640 -178257 169597 95056 -34346 -43642 279006 -108786 -23172 -61042 57346
12111b75379e4059o4878b5153j53348Q4314B19464e8515A46616a02570E6249a02046
$$ -275379 -54059 -118937 -25153 -178501 -94187 219464 -58515 146616 -102570 56249 -102046
12099A02377b23915A09579M1283A5259P6432f2283j75835a04839B02371g4230
$$ 102377 -223915 109579 150862 15259 91691 -62283 -238118 -104839 202371 -74230
12088C17019j15372o4348a17582H2056b64780a05551B0420P4138j2745f8884j97164
$$ 317019 201647 137299 -117582 82056 -264780 -105551 20420 94558 81813 -68884 -266048
12077b66048A96756R701j3887D1690J44213G0588d7045l10273G1668l4322b97063
$$ -266048 196756 206457 192570 41690 185903 70588 -47045 -357318 71668 37346 -297063
12065E78149P53314M01054H33789k67337a06890L3490k70150C3848b30173A36084
$$ 578149 1331463 1732517 833789 566452 -106890 -73400 -343550 33848 -230173 136084
12054C1157a23109A50940b94337C45175d4635a860k6801H5528a25459A46796J65616
$$ 31157 -123109 150940 -294337 345175 -44635 -1860 -28661 85528 -125459 146796 312412
12043C12412D274K07708b35700n835f9553A69090a05576C38996B5809c25845E5245
$$ 312412 4274 211982 -235700 -241535 -69553 169090 -105576 338996 25809 -325845 55245
12031b11995O9339f6881o5538B35c28731J31959j49568A17926b84522f4264H9878
$$ -211995 -142656 -66881 -132419 235 -328731 -196772 -346340 117926 -284522 -64264 89878
12019A51177J24370i8343J3667C53311b76909A24336b7913r13j40501j5474E7673
$$ 151177 275547 -98343 -84676 353311 -276909 124336 -27913 -28826 -169327 -184801 57673
12007a33505c0761r1929C33508e2976A63861F7677J15809a94095h2292A10321
$$ -133505 -30761 -122690 333508 -52976 163861 67677 183486 -194095 -82292 110321
11996b90916D5870O3009B7854c5967A36415b48277F9732a59129c3178C6721L11083
$$ -290916 45870 108879 27854 -35967 136415 -248277 69732 -159129 -33178 36721 347804
11985C47804c3695I1274J77486d9404q7777M2089G5923K4106c79040N2216g1922
$$ 347804 -33695 91274 268760 -49404 -137181 -95092 75923 100029 -379040 -326824 -71922
11973d35l25211A67938G9134i0964I7542m3595b0022B9643a8342B24916a05579
$$ -435 -325646 167938 79134 -90964 97542 53947 -20022 29643 -18342 224916 -105579
11961A64108c9341m4565C1057a3823G0163c59326f6178j18019A89977b32588B72593
$$ 164108 -39341 -83906 31057 -13823 70163 -359326 -66178 -184197 189977 -232588 272593
11949d4334j3643J1876A37515b87386a39142A43971M32163g2346j65121g0016
$$ -44334 -57977 -46101 137515 -287386 -139142 143971 576134 -72346 -237467 -70016
11938G865Q4601j436A56K74963q1564a62681f857j94566d5574j09625C4897a53809
$$ 7865 92466 91030 156 275119 193555 -162681 -6857 -201423 -45574 -155199 34897 -153809
11925F757K06245o3412i9519C30730I3966K52467a40792O1857A53199a75126q6415
$$ 6757 213002 149590 -99519 330730 93966 346433 -140792 -78935 153199 -175126 -261541
11914b61541Q3972P2664M1074j159F1431a39992I8840k7406a77939l8935i5615
$$ -261541 -177569 -104905 -63831 -64990 61431 -139992 98840 71434 -177939 -216874 -95615
11902C65563j54125r7579i7643H5804Q5613a80546H8188k8871a39191A55697c17178
$$ 365563 211438 113859 -97643 85804 171417 -180546 88188 59317 -139191 155697 -317178
11890b30237J13077k30258a70041j46120E0244J78132f619j09158C75463b37426
$$ -230237 -117160 -347418 -170041 -316161 50244 228376 -6619 -115777 375463 -237426
11879f4883H4537b03821g0843A82548F5322P7950b15640k27i8371k83531F6201
$$ -64883 84537 -203821 -70843 182548 65322 143272 -215640 -215867 -98371 -381902 66201
11867a84787G7063a89102m5828h701j8680Q663B17696R9821h8499c7899E0675
$$ -184787 77063 -189102 -234930 -8701 -27381 -18718 217696 317517 -88499 -37899 50675
11855b74362B30004G2230n629a35876A80413H3093a21121C29996a46851j810p887
$$ -274362 230004 72230 66601 -135876 180413 83093 -121121 329996 -146851 -148661 -156548
11844a56548a8069F3415c2548j58772e4979A13053a48744r1097A27524b844k84373
$$ -156548 -18069 63415 -32548 -191320 -54979 113053 -148744 -239841 127524 -2844 -287217
11833b87217e622A67802b82467C32321a64457d1611j02235C95637f2865j67834
$$ -287217 -5622 167802 -282467 332321 -164457 -41611 -143846 395637 -62865 -230699
11823b30699C0572c01927M4528A25660a38733B547J06512K53149A695J7542g9698
$$ -230699 30572 -301927 -257399 125660 -138733 2547 109059 362208 1695 19237 -79698
11811F6776a97108k3647J8885A53451F5160Q2977a68918E007a71080I8771J85284
$$ 66776 -197108 -220755 -201870 153451 65160 148137 -168918 5007 -171080 98771 284055
11800B84055C824M7475M2036a83413B53203c11308C8971N6427K16442a66855Q595
$$ 284055 3824 51299 93335 -183413 253203 -311308 38971 95398 311840 -166855 -158260
11789a58260I5474e3210j12860F9767B6444i3304k5233D4394J17248D5661c75290
$$ -158260 95474 -53210 -166070 69767 26444 -93304 -118537 44394 161642 45661 -375290
11777A82992a63084j25908A02049a90946B7891J7523c3356j31299e5807q9215
$$ 182992 -163084 -288992 102049 -190946 27891 45414 -33356 -164655 -55807 -145022
11767a45022e1135b98j0068B67795G739a19205c3559j88976l5823O0862H7300
$$ -145022 -51135 -298 -10366 267795 7739 -119205 -33559 -222535 -258358 -197496 87300
11755B2180b98101k6956d4087B1984J8381c6420B18879r1145a22954A55879b67157
$$ 22180 -298101 -325057 -44087 21984 40365 -36420 218879 127734 -122954 155879 -267157
11743a35403c3281j84694g287E6820d25954A5861K061J42782i4149B85840G1425
$$ -135403 -33281 -217975 -7287 56820 -425954 15861 17922 160704 -94149 285840 71425
11731A45251b46079C5923c22250A20042q420N467d2369p3630k1152k14871a17047
$$ 145251 -246079 35923 -322250 120042 111622 117089 -42369 -115999 -137151 -352022 -117047
11719A36036L065h3754B9738b03515C02514j51202b5382G1315J7461a3734A51470
$$ 136036 139101 -83754 29738 -203515 302514 151312 -25382 71315 88776 -13734 151470
11707A53946J19489j09578a73448B74832a44019B83360q0286B3484c8603j11078
$$ 153946 273435 163857 -173448 274832 -144019 283360 203074 23484 -38603 -149681
11697a49681C4603c14670a5092A39066m818d868o976B17085r1253a83735F3706
$$ -149681 34603 -314670 -15092 139066 134248 -4868 -11844 217085 125832 -183735 63706
11685E05734a14405b7131A67746L1487r6199k8795L3808c9276C4716R6790E0038
$$ 505734 -114405 -27131 167746 199233 103034 74239 108047 -39276 34716 131506 50038
11673D8934b1626A2387b874A40029b8513C38773a88836L5018d3104j25734A12517
$$ 48934 -21626 12387 -2874 140029 -28513 338773 -188836 -153818 -43104 -168838 112517
11661A22648O5030e2223C65738j11045a20066A83256l7500n1023m6033a06271
$$ 122648 187678 -52223 365738 254693 -120066 183256 145756 94733 48700 -106271
11650I3669M8500M8956e6053M366G504c7874A55612f5577E3834a62825J5265d613
$$ 93669 142169 191125 -56053 -51687 7504 -37874 155612 -65577 53834 -162825 -147560 -4613
11637A23649K75591B7663c12702a24703k17959B3763J76435c14268b8573G1056
$$ 123649 399240 27663 -312702 -124703 -342662 23763 200198 -314268 -28573 71056
11626a37516B54937i4571B1974J93787h9101C41430c4843A22276R467n8995J47334
$$ -137516 254937 -94571 21974 215761 -89101 341430 -34843 122276 131743 72748 220082
11615B20082d49965B54811A01757D4427j3142a50170B36732i6751f431k16070
$$ 220082 -449965 254811 101757 44427 31285 -150170 236732 -96751 -6431 -222501
11605b22501A0997K510J75681C0785L22758a93576A36967G486c6508B81650B2487
$$ -222501 10997 13507 189188 30785 353543 -193576 136967 7486 -36508 281650 22487
11593C22752a0895B71482a81264C4690R4392E1525b17673A06712M17299E393J08446
$$ 322752 -10895 271482 -181264 34690 129082 51525 -217673 106712 524011 5393 113839
11582A13839n4376J08148c45782A42098o9097i8325C0010J0722a56648A91075
$$ 113839 59463 167611 -345782 142098 73001 -98325 30010 40732 -156648 191075
11571C96062a45429D6491A2999O7971B1089a84145I8438M5549B0349O5276Q167
$$ 396062 -145429 46491 12999 80970 21089 -184145 98438 143987 20349 85625 93792
11560I3792J5373L62146j37800b27644a4816l2551C48173b61291i8358I5106L16370
$$ 93792 109165 471311 333511 -227644 -14816 -47367 348173 -261291 -98358 95106 411476
11549D11476k01305c4131E8827a41381A14173J45098o9071N1783o0983b10802
$$ 411476 210171 -34131 58827 -141381 114173 259271 190200 241983 181000 -210802
11538A42910c56545a48184I9390a38706b2174m8784H0961K39898A06396K24318
$$ 142910 -356545 -148184 99390 -138706 -22174 -70958 80961 320859 106396 330714
11528C30714B6678J04309P2152j6356F3768K87457j26629J00852D3328R9198C4162
$$ 330714 26678 130987 203139 186783 63768 351225 224596 325448 43328 142526 34162
11516b94584A55651a20775A51208O5736p0961J24447q436p3435G6188b4543A11328
$$ -294584 155651 -120775 151208 216944 145983 270430 261994 188559 76188 -24543 111328
11504a0778B89546G1948J47114a13294A81558J79763a27372e4405K2091A97557
$$ -10778 289546 71948 219062 -113294 181558 361321 -127372 -54405 -32314 197557
11493I0916J840P4310J3551o5276N4529j4891n9051N8666P9027I5914N847k6353
$$ 90916 92756 167066 180617 115341 169870 154979 95928 154594 233621 95914 101761 75408
11481G5408b00896C36578b8236n9736H849J10001Q7223I1246j5487K7887L07157
$$ 75408 -200896 336578 -28236 -87972 8849 118850 206073 91246 75759 103646 410803
11470D10803i1355G2361J18409A2637a21949d3533B90213d0350B69947D4504L25303
$$ 410803 -91355 72361 190770 12637 -121949 -43533 290213 -40350 269947 44504 369807
11459C69807j13492A11574a73312E0950a35183L335N0521n9536A11055J42152
$$ 369807 256315 111574 -173312 50950 -135183 -131848 -81327 -140863 111055 253207
11449B53207J23728D0313P69h9673A9810J61374p8580d7479A64229B9119J25075
$$ 253207 376935 40313 41082 -89673 19810 181184 102604 -47479 164229 29119 154194
11438A54194N5155m4294f5795a9001B20143I6042a81919D59752J0675A3467f1086
$$ 154194 209349 165055 -65795 -19001 220143 96042 -181919 459752 470427 13467 -61086
11426B06733b8396H3782o997b44461Q4738d1332k05123f2720J1069j51425A78582
$$ 206733 -28396 83782 76785 -244461 -159723 -41332 -246455 -62720 -51651 -203076 178582
11414H4749d873C1181e7061I6784h4003C86932c00750I2142e6852B35008p8693
$$ 84749 -4873 31181 -57061 96784 -84003 386932 -300750 92142 -56852 235008 156315
11403A56315a08206k8552L9929N486B14377E6955J48786f1576o7492G8051O3060
$$ 156315 -108206 -136758 -96829 -91343 214377 56955 205741 -61576 -129068 78051 141111
11392A41111F4656M9988J6811a61632r5016i1409A26502J70991A27787J94975
$$ 141111 64656 114644 131455 -161632 -256648 -91409 126502 297493 127787 322762
11382C22762a78161H0705b19525D05617B1698f3551B39466j03904P6831l1672
$$ 322762 -178161 80705 -219525 405617 21698 -63551 239466 135562 212393 180721
11372A80721J09881c9974q4102A52842B5984a22471b8123j43453f31j09540A31323
$$ 180721 290602 -39974 -124076 152842 25984 -122471 -28123 -171576 -631 -110171 131323
11360C3563c25143G2564B0277a9001j11356C6030a08175M9643L095G9916c48405
$$ 33563 -325143 72564 20277 -19001 -130357 36030 -108175 -58532 -55437 79916 -348405
11348b48960a13757I8180N2112a30499L7650b2139k09863m0733R1498b5214G351
$$ -248960 -113757 98180 150292 -130499 -92849 -22139 -232002 -272735 -181237 -25214 7351
11336C07442j12769a08138d2881k69181A56798D9201b40290K9412A48186b70937
$$ 307442 194673 -108138 -42881 -312062 156798 49201 -240290 -210878 148186 -270937
11325b65611J14535A11302h0049k09560A66150g6558L4131A21345N152d38313
$$ -265611 -151076 111302 -80049 -289609 166150 -76558 -42427 121345 126497 -438313
11314C07022a30617I3897a14982G4084f1263A99500J31270E9969K40359r8722
$$ 307022 -130617 93897 -114982 74084 -61263 199500 330770 59969 300328 201606
11304B01606b12660I3672a67975O1608j69149o6678A1007a32154D0979a63785
$$ 201606 -212660 93672 -167975 -106367 -275516 -342194 11007 -132154 40979 -163785
11293g2303c2626j98668R3138C2045b63989e136j4834A08594r911R0416E9640
$$ -72303 -32626 -231294 -138156 32045 -263989 -5136 -19970 108594 98683 189099 59640
11281a75936A57067a45931B08631a69566A6460M6342a04363A14949a44138A00899
$$ -175936 157067 -145931 208631 -169566 16460 62802 -104363 114949 -144138 100899
11270b2655l53043A28703b52090G042b50280D6647J26643b6037j46830f7637G3856
$$ -22655 -375698 128703 -252090 7042 -250280 46647 173290 -26037 -172867 -67637 73856
11258A87996o2583E8846b57726m1279A50416g8427G5541a14041k0367C43101a69742
$$ 187996 125413 58846 -257726 -299005 150416 -78427 75541 -114041 -134408 343101 -169742
11246H8891e5566B63638j2641a09659F7567b45754c2314B796c08592Q4926B14336
$$ 88891 -55566 263638 250997 -109659 67567 -245754 -32314 2796 -308592 -223666 214336
11234d12760a30072r148A7946A980J31340c7512j68964f803E31090i1398o398
$$ -412760 -130072 -139220 17946 1980 133320 -37512 -206476 -6803 531090 -91398 -97796
11223i7796L3783K9881n67499B60305c39958B08474a0646a933n6291C1338c12189
$$ -97796 -64013 -34132 -601631 260305 -339958 208474 -10646 -1933 -58224 31338 -312189
11211d4238C96589f1833B03684A0398J4133J26422c65020E948f3131j19112E5779
$$ -44238 396589 -61833 203684 10398 24531 150953 -365020 5948 -63131 -182243 55779
11199b00703c2594A5119f8784j87989M0088B95746e9595p0448I7411k3905B3765
$$ -200703 -32594 15119 -68784 -256773 -216685 295746 -59595 -130043 97411 73506 23765
11187g1895D8055K05294d6390k5986n7456j4117I5874c88804g7419n8105j38114
$$ -71895 48055 253349 -46390 -72376 -129832 -143949 95874 -388804 -77419 -135524 -273638
11176b73638J34992F7170h3180l587c324B5117c6464j00745m4129d4901B0188
$$ -273638 -138646 67170 -83180 -86767 -3324 25117 -36464 -137209 -181338 -44901 20188
11164a01838M9363K5878H4424g1453L843A58704g9608A56317a96654O2647K5018
$$ -101838 -52475 -26597 84424 -71453 -67610 158704 -79608 156317 -196654 -134007 -108989
11153a08989a0235j98859B12241b64853F9513P6723b99390J13042A43170i1961
$$ -108989 -10235 -209094 212241 -264853 69513 146236 -299390 -186348 143170 -91961
11142g8311l2499a9122E7354b2002H9156c88211n45b5013B89292b72576A33253
$$ -78311 -110810 -19122 57354 -22002 89156 -388211 -388756 -25013 289292 -272576 133253
11130d8633C45206M1816e5228C03157r9448c2854D7419a42295B468L8501Q5997
$$ -48633 345206 387022 -55228 303157 203709 -32854 47419 -142295 2468 40969 126966
11119A26966j7218c9594I9773Q9481A6580k444J30550a2483E4033P2731M7369
$$ 126966 109748 -39594 99773 189254 16580 14136 144686 -12483 54033 126764 174133
11108A74133B0297a21188H5610K10515A26240D9462J82594l5734n7001g0363B15082
$$ 174133 20297 -121188 85610 296125 126240 49462 232056 196322 139321 -70363 215082
11096I4344P2968a22785B65727o2943K0295q4792J08728l2409C9893Q4640L64232
$$ 94344 167312 -122785 265727 202784 223079 138287 247015 214606 39893 124533 488765
11085D88765a8307j70035B96293j9977o0553k371o0708N1472D1711K1347M05625
$$ 488765 -18307 -188342 296293 276316 215763 213392 152684 204156 41711 63058 468683
11074D68683k24655A15001J65355J68939A76001L35363m901k992G8522L13630
$$ 468683 244028 115001 280356 449295 176001 511364 506463 503471 78522 392152
11064C92152j16162A34509J34814j30878L10319M4450p8383M33356L0129l36052
$$ 392152 275990 134509 269323 138445 448764 493214 414831 848187 878316 542264
11054E42264K28763n6505k05356N30439m79840m4332P1043j2565P4511J29103
$$ 542264 771027 714522 509166 1039605 559765 515433 586476 573911 648422 777525
11044G77525K38312k19686k13194K46529k66039J60316j59875J97055r4953J61182
$$ 777525 1015837 796151 582957 829486 563447 723763 563888 760943 665990 827172
11034H27172k91448L12615j46234K6263k55436L69723J50584D75858K37099J16306
$$ 827172 535724 848339 702105 728368 472932 842655 993239 475858 712957 829263
11024H29263l1669j7535M5709j0629Q0420Q3406r3695k20187K72171B10160L34969
$$ 829263 797594 780059 825768 815139 895559 978965 885270 665083 937254 210160 545129
11013E45129J82193l13271J61356J7523J53924C28663L05747M8335j58723L0372
$$ 545129 727322 414051 575407 592930 746854 328663 634410 682745 524022 554394
11003E54394o0986L06579k05260Q8199J5671k29773K2058J43091j88540M867B24909
$$ 554394 493408 799987 594727 682926 698597 468824 490882 633973 445433 450300 224909
10991H57484j49867m2926p1920R3621q2310J74997n0186M03178j97706J20989
$$ 857484 707617 664691 592771 686392 604082 779079 728893 1132071 934365 1055354
10981A055354K4490j36155M03952J04706K14605p1036K35312N69878q0652M80689
$$ 1055354 1079844 943689 1347641 1452347 1666952 1595916 1831228 2401106 2320454 2801143
10971B801143L04912J96463o36167J80627l62725m04022k02440P6513l56287j59077
$$ 2801143 3106055 3302518 2666351 2846978 2484253 2080231 1877791 1954304 1598017 1438940
10961A438940J34832L09680k94063L926Q8287j03199k60237O7567j30163k94037
$$ 1438940 1573772 1883452 1589389 1593315 1681602 1578403 1318166 1385733 1255570 961533
10951I61533J99290k84776m11038J88940B40883L39808k83786o1691L7737M1808
$$ 961533 1160823 876047 465009 653949 240883 580691 296905 235214 272951 314759
10941C14759J60139G9657L28368p9660m7150a99704B35200a96358B82298A29450
$$ 314759 474898 79657 408025 328365 281215 -199704 235200 -196358 282298 129450
10930C10824P7197A92853n2268C1004b28737C0635L9145R8356C8995c5211k31075
$$ 310824 388021 192853 140585 31004 -228737 30635 69780 168136 38995 -35211 -266286
10919b66286F5488b9090E2012P2198A7766J42956m7103d6062j70869a6546p6060
$$ -266286 65488 -29090 52012 124210 17766 160722 113619 -46062 -216931 -16546 -92606
10908i2606B36620d14839a18307b0549A19088J8365g514k10673G1785a3169A4706
$$ -92606 236620 -414839 -118307 -20549 119088 137453 -7514 -218187 71785 -13169 14706
10896A30562O0926e9493I0027b20799h4982B9316b9302B05620L8834G6063a90494
$$ 130562 191488 -59493 90027 -220799 -84982 29316 -29302 205620 244454 76063 -190494
10884b83069A800N1289a15465d496B35969q9695J13730j03227a9907D6604J02430
$$ -283069 1800 53089 -115465 -4496 235969 146274 260004 156777 -19907 46604 149034
10873A49034E8783B5696a21960A21697b30591J13134A00000d1144A2061b84221
$$ 149034 58783 25696 -121960 121697 -230591 -117457 100000 -41144 12061 -284221
10862a04116D2920a26922B58768a9756H2447l7816N2395b2315D2434a58318a8771
$$ -104116 42920 -126922 258768 -19756 82447 44631 97026 -22315 42434 -158318 -18771
10850b47100D4594a36258r2110g3949j27928a2554C13924a44139c2189j2554A51118
$$ -247100 44594 -136258 -228368 -73949 -201877 -12554 313924 -144139 -32189 -44743 151118
10838a0726H6803c49125f0356A11860J8956P3307b62362a17658l3963A04160a09052
$$ -10726 86803 -349125 -60356 111860 130816 204123 -262362 -117658 -151621 104160 -109052
10826A10518L5305a08731k34150a683j43525j9642k109j5064A6102N6309O3251
$$ 110518 145823 -108731 -342881 -1683 -145208 -164850 -166959 -182023 16102 72411 135662
10815A35662J1651h3058l61830a29956l8039c2957r7150A54236a05721k6628I568
$$ 135662 147313 -83058 -444888 -129956 -167995 -32957 -130107 154236 -105721 -132349 9568
10803B13851B8238b12848B96290b02706k05983C91512g5863a4089A64128b27675
$$ 213851 28238 -212848 296290 -202706 -408689 391512 -75863 -14089 164128 -227675
10792d4831B3545J03166J04443A13190K83869c34728A10399N3771o8975O8890
$$ -44831 23545 126711 231154 113190 397059 -334728 110399 164170 95195 164085
10782A64085d3032j08348A41297h8331C2887c54288d6724k99989a63276e6640
$$ 164085 -43032 -151380 141297 -88331 32887 -354288 -46724 -346713 -163276 -56640
10771G2329A9448J03830N2448K19485h6459C0810K60926B1956a00006j84188f5502
$$ 72329 19448 123278 175726 395211 -86459 30810 291736 21956 -100006 -284194 -65502
10759f308k85691C52270A8376P9602a63021B09067d1036l05884a45025l8053q1994
$$ -6308 -291999 352270 18376 97978 -163021 209067 -41036 -346920 -145025 -183078 -265072
10748b65072D01775a36694R722C7904b10155G5125i2872r539B25028a3672B30080
$$ -265072 401775 -136694 -126972 37904 -210155 75125 -92872 -102411 225028 -13672 230080
10736a60055A31123d032l35214J18660a03981L2317j92433q986B86140B9895b50602
$$ -160055 131123 -4032 -339246 -220586 -103981 -71664 -264097 -273083 286140 29895 -250602
10724A03554J8278m6672J15576r400h4239j73772g1991B14219r1257E0864p424
$$ 103554 121832 75160 190736 181336 -84239 -258011 -71991 214219 122962 50864 43440
10713D3440a19497L4106I4491a79777C8921b02496A07726b05442A95958F671a19944
$$ 43440 -119497 -85391 94491 -179777 38921 -202496 107726 -205442 195958 6671 -119944
10701A94526p2543a00488j78336h6050c0383m3414D717f5772B45920b32574A82063
$$ 194526 121983 -100488 -278824 -86050 -30383 -73797 4717 -65772 245920 -232574 182063
10689a77572A43072b14520N858N3343B8026O175a99902K8899D027a07320B00968
$$ -177572 143072 -214520 -208662 -155319 28026 34201 -199902 -171003 4027 -107320 200968
10677H8467e0391k84100J04564P6788A14532c66477a02509n7724E7469j5068a80038
$$ 88467 -50391 -334491 -229927 -153139 114532 -366477 -102509 -160233 57469 42401 -180038
10665c31610E6480e0802l1373C28786A49879d4748a0083C0505J32522F1645k051
$$ -331610 56480 -50802 -82175 328786 149879 -44748 -10083 30505 163027 61645 59594
10654E9594d03550J30708a9724k79483e3016E7722A7386a88583E4271e0838k25357
$$ 59594 -403550 -272842 -19724 -299207 -53016 57722 17386 -188583 54271 -50838 -276195
10643b76195I3938l0453c46619c0830j66813j17619b0375A83660a12662a9121
$$ -276195 93938 63485 -346619 -30830 -197643 -315262 -20375 183660 -112662 -19121
10632i0663C7837c01032h7247B1862c17845a24542B303a93373m9230a2836k13003
$$ -90663 37837 -301032 -87247 21862 -317845 -124542 2303 -193373 -242603 -12836 -225839
10621b25839m5958F3970d14654d0820A9933b0163B39995b12110a5357r2262I0615
$$ -225839 -271797 63970 -414654 -40820 19933 -20163 239995 -212110 -15357 -107619 90615
10609A18774a48538g3714A62128b42671P1440O0348k15604c6185F1350j9610a46837
$$ 118774 -148538 -73714 162128 -242671 -171231 -110883 -326487 -36185 61350 41740 -146837
10597a40538k3083A38415b22445b8254B9493a58055j1795k9694Q3344j13329A44291
$$ -140538 -163621 138415 -222445 -28254 29493 -158055 -169850 -199544 -116200 -229529 144291
10585A18706A8831a87532q5980A1050J15961a32596M9840k74280e0695B86454
$$ 118706 18831 -187532 -273512 11050 127011 -132596 -82756 -357036 -50695 286454
10574B38546p9784a5512m28069A20996J66571a6645k51075B75758h4094j01566
$$ 238546 158762 -15512 -443581 120996 287567 -16645 -267720 275758 -84094 -185660
10564a85660b7952a1448A68734a55924A22743a5146B73866f4568k49232a37655
$$ -185660 -27952 -11448 168734 -155924 122743 -15146 273866 -64568 -313800 -137655
10553C69631b23526A11198a20l82829D6552h3110L8339m00230a70188B15273Q4579
$$ 369631 -223526 111198 -120 -382949 46552 -83110 -44771 -445001 -170188 215273 299852
10542B99852a5519k1115k01652a3846C04909D1943b82805a27912B829N7008a41967
$$ 299852 -15519 -36634 -238286 -13846 304909 41943 -282805 -127912 2829 59837 -141967
10530F5718f4542C13147a05685C76621a0114k58824A22645I060R816J94112c57497
$$ 65718 -64542 313147 -105685 376621 -10114 -268938 122645 9060 18876 212988 -357497
10518a45459O5214A32821d72777b1406I0789J88208j00989b19714A63002c20933
$$ -145459 -80245 132821 -472777 -21406 90789 278997 178008 -219714 163002 -320933
10507G0950a24628O2017B24597I5474N0198Q389K9589J15637A47284r708D0182
$$ 70950 -124628 -62611 224597 95474 145672 154061 183650 299287 147284 137576 40182
10495e1372j39175H406a1581j20814L5859b4053A9663q846K45420i3426k71085
$$ -51372 -190547 8406 -11581 -132395 -96536 -24053 19663 10817 256237 -93426 -364511
10484c64511g4115A99895J1120K79745j43784J44946k06954B2438J66122H5887
$$ -364511 -74115 199895 211015 490760 346976 491922 284968 22438 188560 85887
10473a2182E3742O1659c23392p9845A19231E1186j6648i3208J9116H8592J01765
$$ -12182 53742 115401 -323392 -403237 119231 51186 34538 -93208 -74092 88592 190357
10462A90357m4824a41697o0239P6608A41472N4940b30915d9655A31187c67260
$$ 190357 145533 -141697 -201936 -125328 141472 196412 -230915 -49655 131187 -367260
10451a91301j00082a31988j43133C43612a92236f8166E1992d0657C9779a81813
$$ -191301 -291383 -131988 -275121 343612 -192236 -68166 51992 -40657 39779 -181813
10440d4605r1532B07020G334f9945j18405B65786D9672b76265a5667A34473O1385
$$ -44605 -136137 207020 7334 -69945 -188350 265786 49672 -276265 -15667 134473 195858
10429A95858F3593J45508p7298a16200G7195M6130a57332k7087b3235p9184j27725
$$ 195858 63593 209101 131803 -116200 77195 123325 -157332 -184419 -23235 -102419 -230144
10418b30144E3921Q0099d0507A33547b0797p9600q2111D07854a59440M8372j2179
$$ -230144 53921 134020 -40507 133547 -20797 -100397 -182508 407854 -159440 -111068 -123247
10407a23247j39456D7606J89075a21802B681J47981e9626q3449j24443J32071
$$ -123247 -262703 47606 236681 -121802 2681 150662 -59626 -143075 -267518 -135447
10397a35447l1066a146A73579p6360K02445I5947K17304C8254N2458K38931j158
$$ -135447 -166513 -1146 173579 97219 299664 95947 313251 38254 90712 329643 328485
10386C28485f260D40357F5206J69215J671b290n4797B36200j14512L04012r0140
$$ 328485 -6260 440357 65206 234421 236092 -2290 -57087 236200 121688 425700 335560
10375C35560J8487a24020F8203K91968p9368M7881k1895K19745J6252j52619n9305
$$ 335560 354047 -124020 68203 360171 280803 328684 306789 526534 542786 390167 330862
10364C30862K68543B66466N4184A39508C9358L80102b9967D93552A61732n5164
$$ 330862 599405 266466 320650 139508 39358 419460 -29967 493552 161732 106568
10354A06568J51248A03660L56096J24400N1059j23805j918A34679R2752j9391
$$ 106568 257816 103660 459756 584156 635215 511410 509492 134679 227431 208040
10344B08040N19431l51199j71920K5723A2693g8314A41507m662P2532p9918g214
$$ 208040 727471 376272 204352 230075 12693 -78314 141507 136845 209377 129459 -7214
10332A64163g2381I4681O3063e3010m5764M5437H0446d6448A57822n1938r029
$$ 164163 -72381 94681 157744 -53010 -98774 -53337 80446 -46448 157822 105884 96855
10321I6855O1757J06202J15189c0281B1499a42455F3139j5672a47340C88346a5084
$$ 96855 158612 264814 380003 -30281 21499 -142455 63139 47467 -147340 388346 -15084
10309D6339e21800d9525F2670i8792A98147g1260K6475A01354a04694A32325c9280
$$ 46339 -521800 -49525 62670 -98792 198147 -71260 -44785 101354 -104694 132325 -39280
10297B21867N5373i9333A66948A3285J46361p8252d6158d90j60110I815J34440
$$ 221867 277240 -99333 166948 13285 159646 81394 -46158 -490 -160600 9815 144255
10286A44255a24503E0902G877b34639R6622k89099B2715e621A82871D8648A5543
$$ 144255 -124503 50902 7877 -234639 -138017 -427116 22715 -5621 182871 48648 15543
10274i329H9045g3822D50490I0635B5927J70871B7908g5334F6911P3046A1260
$$ -9329 89045 -73822 450490 90635 25927 196798 27908 -75334 66911 139957 11260
10262a34719A02103D6031K35166H1629J36161l0620L40469A51123O0400r0387
$$ -134719 102103 46031 281197 81629 217790 187170 527639 151123 211523 121136
10252A21136a19206B64762e0245A05287a44763e5477q3077B92117h4987B7337
$$ 121136 -119206 264762 -50245 105287 -144763 -55477 -138554 292117 -84987 27337
10241b0670G8428b0010k19809f2386a9792B39891a38422o8976k3280f3737G7687
$$ -20670 78428 -20010 -239819 -62386 -19792 239891 -138422 -207398 -230678 -63737 77687
10229c02934R6822e3139A95976c02843i9364A16200f6417K069J1949j29210e0627
$$ -302934 -206112 -53139 195976 -302843 -99364 116200 -66417 -64348 -52399 -181609 -50627
10217b74492d6265k46691g7425d179C80819a41645f1546B17818q6411b2160k44863
$$ -274492 -46265 -292956 -77425 -4179 380819 -141645 -61546 217818 131407 -22160 -267023
10206b67023j09744j98169b3521D3519a1098A0011h5295p3684n1775h6156j17894
$$ -267023 -376767 -574936 -23521 43519 -11098 10011 -85295 -158979 -210754 -86156 -204050
10195b04050F1391c34983a0923G6439a62010d3455k4860l08510f801A85883r1952
$$ -204050 61391 -334983 -10923 76439 -162010 -43455 -68315 -376825 -6801 185883 93931
10184I3931i7507j06726F0918e8905G5329c24070a27399D939P4804a70421k820
$$ 93931 -97507 -204233 60918 -58905 75329 -324070 -127399 4939 79743 -170421 -173241
10173a73241I5744c46529J26027A7790J85675E0035d22176a00995l9362r5637
$$ -173241 95744 -346529 -220502 17790 203465 50035 -422176 -100995 -140357 -235994
10163b35994R4592j520F1778J00134K01528r6891c3689B90524b61119d6383B52446
$$ -235994 -141402 -142922 61778 161912 363440 266549 -33689 290524 -261119 -46383 252446
10151b47983R2261N5771a9171p53674b8672B5994a18100D66157a5758k33454O2836
$$ -247983 -155722 -99951 -19171 -772845 -28672 25994 -118100 466157 -15758 -249212 -186376
10140a86376R0673o2408B20436F6898b04868Q4228E5040e2203k3920A7118i3172
$$ -186376 -95703 -158111 220436 66898 -204868 -120640 55040 -52203 -76123 17118 -93172
10128B21310b61604L4850A20392f643k03997H1352f7826j18251j47278L5137C988
$$ 221310 -261604 -226754 120392 -6643 -210640 81352 -67826 -186077 -333355 -298218 3988
10116a62597A00566A4778b2754p0694E3177e9261q4138h154l0617o4180D2648
$$ -162597 100566 14778 -22754 -93448 53177 -59261 -143399 -8154 -38771 -102951 42648
10104A10280a84649j8894H6860e3564o6070A86646A7116b43268q1068A05606M1170
$$ 110280 -184649 -203543 86860 -53564 -119634 186646 17116 -243268 -324336 105606 146776
10093A46776i3654j88462e0574C8237A5180b47236a1496A55247D6714R5274a03442
$$ 146776 -93654 -282116 -50574 38237 15180 -247236 -11496 155247 46714 141988 -103442
10081A43121i9264k98842A21270n3221N7956a2847G0005J9185b23219a01569d7273
$$ 143121 -99264 -398106 121270 68049 126005 -12847 70005 89190 -223219 -101569 -47273
10069a5626j60166M8255m367e1684A10387g3274p1073M3351B63313G326e3401
$$ -15626 -175792 -127537 -131904 -51684 110387 -73274 -144347 -100996 263313 7326 -53401
10057a23752r6061h405k44156P0131e645k17228B42423a95625f1546A9691g0178
$$ -123752 -219813 -8405 -252561 -182430 -5645 -222873 242423 -195625 -61546 19691 -70178
10045C46654h3990B16711a64505m5764j51474f6294C9358A1973a51964j01293
$$ 346654 -83990 216711 -164505 -210269 -361743 -66294 39358 11973 -151964 -253257
10035b53257D1421P8936c25873d9644o5338p2517Q8254l05878C18655G8893i0387
$$ -253257 41421 120357 -325873 -49644 -114982 -187499 -99245 -405123 318655 78893 -90387
10023H243M7072a27099A48213c65789C01295a91052F5392K7708b45694f0253E5716
$$ 8243 55315 -127099 148213 -365789 301295 -191052 65392 93100 -245694 -60253 55716
10011b43289K6577Q062h1376B09321q7203E2639a16218A29518b50720i9762A7234
$$ -243289 -216712 -208650 -81376 209321 122118 52639 -116218 129518 -250720 -99762 17234
9999A82647b05898A32463g5509j34279f488I1077k7156c22687A10787a98516h5090
$$ 182647 -205898 132463 -75509 -209788 -6488 91077 63921 -322687 110787 -198516 -85090
9987a909C7526a65835k3586j6582b6524k35141e4463A5209a01548j10594J03424
$$ -1909 37526 -165835 -189421 -206003 -26524 -261665 -54463 15209 -101548 -212142 -108718
9976a08718j03836b8313I4658e9768E7815J04116c32316A71331a82305I1136d30952
$$ -108718 -212554 -28313 94658 -59768 57815 161931 -332316 171331 -182305 91136 -430952
9964g5460o5136l30166g1846l4587a1782k88633E4999a42202A57790b30810h5305
$$ -75460 -140596 -470762 -71846 -106433 -11782 -300415 54999 -142202 157790 -230810 -85305
9952a00937A99757c03210F914n46B20b25793j10800J23469A36327i5640k77424
$$ -100937 199757 -303210 6914 6368 220 -225793 -336593 -213124 136327 -95640 -373064
9941c73064b0033k01721N6073Q1948j88648F3685a46263A00816c982A59969b28446
$$ -373064 -20033 -221754 -165681 -83733 -272381 63685 -146263 100816 -3982 159969 -228446
9929b64736A10947e9904p6420A72562J3156b47140B73970a12970A10742a95960
$$ -264736 110947 -59904 -136324 172562 185718 -247140 273970 -112970 110742 -195960
9918e6231j40972E2173a55882C70898f6737b8198o6178L9574j23172A7969M154
$$ -56231 -197203 52173 -155882 370898 -66737 -28198 -94376 -54802 -177974 17969 22123
9907B2123g0177j38503C96290A06316m9378c93178A51625a05595a2215l0758E6320
$$ 22123 -70177 -208680 396290 106316 56938 -393178 151625 -105595 -12215 -42973 56320
9895e2047o2980Q506j41624J1738P1675p0845g8605A27105N9537C2001a13447
$$ -52047 -115027 -106521 -248145 -236407 -164732 -235577 -78605 127105 186642 32001 -113447
9883B1478a94025o0216g5564a737A2229g098j00425j17570g8194K8420I3207c94791
$$ 21478 -194025 -254241 -75564 -1737 12229 -7098 -107523 -225093 -78194 -49774 93207 -394791
9870b40622j34889a30991l023I4000J85445c67118i1858j7106C6158b37373B01800
$$ -240622 -375511 -130991 -134014 94000 279445 -367118 -91858 -108964 36158 -237373 201800
9858A12966i0550A81105B0263a12008I1700a35464d1284n9853k55454c6551k05888
$$ 112966 -90550 181105 20263 -112008 91700 -135464 -41284 -101137 -356591 -36551 -242439
9847b42439M5382q604a02189I1719a40465C7508A1409J4495a65171B97298c61033
$$ -242439 -197057 -205661 -102189 91719 -140465 37508 11409 25904 -165171 297298 -361033
9835a15152A5077a41777E6313c80980J70228q824o1661K5071f7193k88628b918
$$ -115152 15077 -141777 56313 -380980 -210752 -219576 -281237 -256166 -67193 -355821 -2918
9823A22724a01383I9831K8622l4851b03817G4912K35948a08152c2884G4573i3465
$$ 122724 -101383 99831 128453 93602 -203817 74912 310860 -108152 -32884 74573 -93465
9811D03091a11351A49308j4779m9133g1516j81287o2539A81839A6523a37785k79827
$$ 403091 -111351 149308 134529 85396 -71516 -252803 -315342 181839 16523 -137785 -417612
9800d17612I0111d6834H4002i5348n746n0022C41168c33916D6699a79448B8302
$$ -417612 90111 -46834 84002 -95348 -101094 -151116 341168 -333916 46699 -179448 28302
9788a66438j9143H084a73823j59585J08098A99466a38107q4704Q3539c4615q5812
$$ -166438 -185581 8084 -173823 -333408 -225310 199466 -138107 -222811 -139272 -34615 -120427
9777a20427K7748G8015a55382B73674c77023A79330a81601c6952D1010a82842
$$ -120427 -92679 78015 -155382 273674 -377023 179330 -181601 -36952 41010 -182842
9766D3215R0903c11854f9576k52879R529b9702j83560L8973j53143a10328c8632
$$ 43215 134118 -311854 -69576 -322455 -312926 -29702 -213262 -174289 -327432 -110328 -38632
9754a70488Q3607j84924A37739D7739A7953c74848a33919m6355A94325C7234b3282
$$ -170488 -86881 -271805 137739 47739 17953 -374848 -133919 -180274 194325 37234 -23282
9742A95526m7553B3373a13701I5272a69910f4804A8335i0680q5021j30384A11448
$$ 195526 147973 23373 -113701 95272 -169910 -64804 18335 -90680 -175701 -306085 111448
9730A24683c04682B55346c00715J27023A65298a81761H8564N281a68354l30464
$$ 124683 -304682 255346 -300715 -173692 165298 -181761 88564 93845 -168354 -498818
9720d98818A55344N8087r6081J46532b57936b3979C8632d7705o845E2309J15884
$$ -498818 155344 213431 117350 263882 -257936 -23979 38632 -47705 -54550 52309 168193
9709A68193b22963o5879R7834A24868a1386q3916j21546D6813J04893m6281b81334
$$ 168193 -222963 -288842 -191008 124868 -11386 -95302 -216848 46813 151706 105425 -281334
9697E1431K9203b08905Q1381j06638b3850c989j4647j61055j94860A80066J81895
$$ 51431 80634 -208905 -127524 -234162 -23850 -3989 -18636 -179691 -374551 180066 361961
9686C61961G6780i5099fE2775A1505J71340q5116a86262j08139a05733A13150
$$ 361961 76780 -95099 -6 52775 11505 182845 97729 -186262 -294401 -105733 113150
9674b4098k06860C05489a79498J2023A88281c6820l00623J25147m2068r0076a31678
$$ -24098 -230958 305489 -179498 -167475 188281 -36820 -337443 -212296 -254364 -344440 -131678
9662e7210D28609E8325N3248B5037N3446q997d0160k30297A71228b39075a12548
$$ -57210 428609 58325 111573 25037 78483 69486 -40160 -270457 171228 -239075 -112548
9650a86647q0568c8283n2962d2434A01833c38159B32778b76568J11612o2070G942
$$ -186647 -267215 -38283 -91245 -42434 101833 -338159 232778 -276568 -164956 -227026 7942
9638h559F6954J55824a72923A27920b31508E2034P2775a11243m9673j56275i8586
$$ -8559 66954 222778 -172923 127920 -231508 52034 124809 -111243 -160916 -317191 -98586
9626a42412A43653a78300J5028l02887B96494A46345n9521b88973M7562A65412
$$ -142412 143653 -178300 -163272 -466159 296494 146345 86824 -288973 -241411 165412
9615A63429a0462B07636H0612a3491o2868E1542c7210m29523e8311A89560m8066
$$ 163429 -10462 207636 80612 -13491 -76359 51542 -37210 -466733 -58311 189560 141494
9604A41494h2629G3816a52494c5596k42174a8979A26000b89625o4418F6388a79832
$$ 141494 -82629 73816 -152494 -35596 -277770 -18979 126000 -289625 -354043 66388 -179832
9592A28596F0888a16487E387b4138A51412e41329a02441j23263A68993c16423
$$ 128596 60888 -116487 5387 -24138 151412 -541329 -102441 -225704 168993 -316423
9581C35674a10674p5831F420K01295b07080j08989a35509i828j64183I0589L46619
$$ 335674 -110674 -186505 6420 207715 -207080 -316069 -135509 -9828 -174011 90589 437208
9570D37208d41170B58195m4910a65268C7417K2908c85396h8818j39147q1909a53533
$$ 437208 -441170 258195 213285 -165268 37417 60325 -385396 -88818 -227965 -309874 -153533
9558a07734r5579K9537N0006e5846o8025A14044g4344k1349m787j2622l02345
$$ -107734 -203313 -173776 -123770 -55846 -123871 114044 -74344 -95693 -100480 -113102 -415447
9547d15447a31435J7263b84l1721j52854N8140F1029a21793B57586c01627b6224
$$ -415447 -131435 -114172 -284 -32005 -184859 -126719 61029 -121793 257586 -301627 -26224
9535I6393J9887J9261c1394l62881L9185J21187l9098F8749d1546A00399a17809
$$ 96393 116280 135541 -31394 -394275 -355090 -233903 -273001 68749 -41546 100399 -117809
9523b20281A13579g0213p6393c5045B64441j23963m906L0524P2598d90757a19234
$$ -220281 113579 -70213 -146606 -35045 264441 140478 135572 166096 238694 -490757 -119234
9511h4494j09728Q9400q8875D4362L9696c19512A00702A1345a47032A6724a90882
$$ -84494 -194222 -104822 -193697 44362 84058 -319512 100702 11345 -147032 16724 -190882
9499A347d3935k72073G1062g8075j93909C43257d3831l06596a4412j39925B3115
$$ 1347 -43935 -316008 71062 -78075 -271984 343257 -43831 -350427 -14412 -154337 23115
9487h3583l47146D7847a33676D5008a78205j39523c1600B19803a25124j19343
$$ -83583 -430729 47847 -133676 45008 -178205 -317728 -31600 219803 -125124 -244467
9477b44467J03865A57133B4137E142a36540O5930B3249J09898B8904c53676G191
$$ -244467 -140602 157133 24137 5142 -136540 -70610 23249 133147 28904 -353676 7191
9465a91259B3220a74774L4542o7226g0162G8946C967K95865F0234c00831d6125
$$ -191259 23220 -174774 -140232 -207458 -70162 78946 3967 299832 60234 -300831 -46125
9453a88790j09832d9601k76433b7347q1586d8018E2307c96147c8153P616A52775
$$ -188790 -298622 -49601 -326034 -27347 -108933 -48018 52307 -396147 -38153 -30537 152775
9441B2461i9750A01036a45256A23716c8166m2730k9556d7134j5786C62020a9395
$$ 22461 -99750 101036 -145256 123716 -38166 -80896 -110452 -47134 -62920 362020 -19395
9429f7303j67291q0988I7751b93163C060a78501d8371n6374H665h5123f120k8715
$$ -67303 -234594 -315582 97751 -293163 3060 -178501 -48371 -104745 8665 -85123 -6120 -34835
9417c4835q427j35919e9676F8843i2867A37415a70745H8675b52822N6009E0349
$$ -34835 -43262 -179181 -59676 68843 -92867 137415 -170745 88675 -252822 -196813 50349
9405H9667D0444h8873G3704a30937m8517A56724C003J57772E9585K7840a33465
$$ 89667 40444 -88873 73704 -130937 -179454 156724 3003 160775 59585 87425 -133465
9393a30076B01619a02743B96932b54615A8448a33595D7135e9586m33683E3197
$$ -130076 201619 -102743 296932 -254615 18448 -133595 47135 -59586 -493269 53197
9382A10133J60767A04287b16642F7902M0556g972B2833a12656j3643l5040k57276
$$ 110133 270900 104287 -216642 67902 108458 -7972 22833 -112656 -126299 -161339 -418615
9371d18615I6271a49151M2542o4612c6591m1250E5888c4322A55233K5055a04555
$$ -418615 96271 -149151 -106609 -171221 -36591 -77841 55888 -34322 155233 180288 -104555
9359d0462j33281B2632O0569b2764A3726J8938b68j86229j08601A55982h6750
$$ -40462 -173743 22632 83201 -22764 13726 32664 -268 -186497 -295098 155982 -86750
9347e7094k77455D7280a54863A19719K14632a2040m9666j02254O1467H5555K1366
$$ -57094 -334549 47280 -154863 119719 334351 -12040 -61706 -163960 -102493 85555 106921
9336A06921c80614d1354j53129g4725D841K78744a79796c5742m3504D7910P6527
$$ 106921 -380614 -41354 -194483 -74725 4841 283585 -179796 -35742 -79246 47910 124437
9325A24437k5345b15642j2304b5450j72809N9134j11240f1043A04739m594b04372
$$ 124437 99092 -215642 -227946 -25450 -198259 -139125 -250365 -61043 104739 100145 -204372
9313B5773a72938d3854A35096b75635h0032l5288J883F3367K1294a26456H7997
$$ 25773 -172938 -43854 135096 -275635 -80032 -115320 -113437 63367 84661 -126456 87997
9301E0456B3596a25245J3508d1660B04742j1666g6873j81799i0341j0398D19311
$$ 50456 23596 -125245 -111737 -41660 204742 193076 -76873 -258672 -90341 -100739 419311
9289A24473c06770J41623e3342j5805A0512J10006d01078A09662b61499i8318
$$ 124473 -306770 -165147 -53342 -69147 10512 120518 -401078 109662 -261499 -98318
9278a00734o0392E029a00673B81815b10483k8888D2699g5549j57134A56130c9245
$$ -100734 -161126 5029 -100673 281815 -210483 -239371 42699 -75549 -232683 156130 -39245
9266a96316B3852J5413O5765b53293G0968P5391C5413a02177O083A2044L8127
$$ -196316 23852 39265 105030 -253293 70968 146359 35413 -102177 -96094 12044 50171
9255E0171c18745D4180A9003a03918E354a19906A28132a80688G3316h071j96761
$$ 50171 -318745 44180 19003 -103918 5354 -119906 128132 -180688 73316 -8071 -204832
9244b04832j450A61020L551j3885J2460q1169a35704k86991A07994K55265f4198
$$ -204832 -206282 161020 164571 150686 163146 81977 -135704 -422695 107994 363259 -64198
9232b19714D9919J52006c23886A3897b66452N7775H9735e3382B26845h4793p3914
$$ -219714 49919 201925 -323886 13897 -266452 -208677 89735 -53382 226845 -84793 -158707
9221a58707k25731a82557H2039L591d98554B47188J51220a61949L4403j49191
$$ -158707 -384438 -182557 82039 85630 -498554 247188 398408 -161949 -127546 -276737
9211b76737J00077j6927l30875a61785G6582K48766A44974b54277A54685a25526
$$ -276737 -176660 -193587 -524462 -161785 76582 325348 144974 -254277 154685 -125526
9200A19766d60343G351a30692M329m0078C3583b33741k158A528N1434j6374a17399
$$ 119766 -460343 7351 -130692 -126363 -166441 33583 -233741 -235899 1528 52962 36588 -117399
9187B07327A7229J6619d03504E8166I368c4490B07823G5703M4011L837G912L46307
$$ 207327 17229 33848 -403504 58166 9368 -34490 207823 75703 119714 123551 7912 354219
9175C54219I4040b98531e8413J3699l48894J93405A1841a44603L1901k72210g7905
$$ 354219 94040 -298531 -58413 -44714 -393608 -200203 11841 -144603 -112702 -384912 -77905
9163D8226Q3503O526f7167m36641b20182j80310a54386A396R6163d0212B8440
$$ 48226 131729 138255 -67167 -503808 -220182 -400492 -154386 1396 97559 -40212 28440
9151B9156N7791a18833e2688l216j77249q7468e5525k14601L2687j1368A27052
$$ 29156 86947 -118833 -52688 -55904 -233153 -320621 -55525 -270126 -237439 -248807 127052
9139I7718J59685a76146k98566A995c67636a08670b4767l0700A53134a806j46258
$$ 97718 257403 -176146 -474712 1995 -367636 -108670 -24767 -55467 153134 -1806 -148064
9128a48064p9312C00348A40835d3231q8803k1791A64781a40873n0980K8166A78407
$$ -148064 -227376 300348 140835 -43231 -132034 -153825 164781 -140873 -191853 -163687 178407
9116b02335k98130A31673a44352A5780c8365k2177D0615a24870M6596j50286f443
$$ -202335 -500465 131673 -144352 15780 -38365 -60542 40615 -124870 -78274 -228560 -6443
9104c17251J33888A95226a2286j57328D9010a00302F7762e10565b28827C53087
$$ -317251 -183363 195226 -12286 -169614 49010 -100302 67762 -510565 -228827 353087
9093B2477J23272c67715a8780k35850b9192p3198j75806F7206b39753G6801b35354
$$ 22477 145749 -367715 -18780 -254630 -29192 -102390 -278196 67206 -239753 76801 -235354
9081B26244i6288k79451B18632G3947g4654c236j06268C2940f9006E4519b04493
$$ 226244 -96288 -375739 218632 73947 -74654 -3236 -109504 32940 -69006 54519 -204493
9069A72367D1213a41051j06359A04968L39083a36010j36761E8139k7352b15580
$$ 172367 41213 -141051 -247410 104968 444051 -136010 -272771 58139 30787 -215580
9058f4391b7137J166j79916g8184k87389e1210F0015J32378p8501L19665j31993
$$ -64391 -27137 -25971 -205887 -78184 -365573 -51210 60015 192393 113892 433557 301564
9047C01564a05143B5249l160g0862H2513A1985f7995J5608n058j11382k42203
$$ 301564 -105143 25249 22089 -70862 82513 11985 -67995 -52387 -57445 -168827 -411030
9036d11030a80173o3446B29512M5104E7184a68739o1214B10084g6337A17228m7196
$$ -411030 -180173 -243619 229512 274616 57184 -168739 -229953 210084 -76337 117228 70032
9025G0032C4909M111b64846r552g5401K2092n720B79748a90547o1899N4844l5492
$$ 70032 34909 39020 -264846 -274398 -75401 -53309 -59029 279748 -190547 -252446 -197602 -233094
9013b33094L7831B25417A07488b91585p2463J00556j41734A57424b92888A7026
$$ -233094 -195263 225417 107488 -291585 -364048 -263492 -405226 157424 -292888 17026
9002b43722B60362a89356A17093D4088K01360g4455B39302a21541j48839r6931
$$ -243722 260362 -189356 117093 44088 245448 -74455 239302 -121541 -270380 -367311
8992c67311b9957A98649b4425C99194A8873J38245a74011H0762c53484a48904
$$ -367311 -29957 198649 -24425 399194 18873 157118 -174011 80762 -353484 -148904
8981a95434B39932n965a25449g533F5868a41396j12218A00455e0273C8417d8918
$$ -195434 239932 233967 -125449 -7533 65868 -141396 -253614 100455 -50273 38417 -48918
8969b05336o0851P8992L1927B46375c35955A69376c0565l24556h1213A77399a25678
$$ -205336 -266187 -187195 -155268 246375 -335955 169376 -30565 -355121 -81213 177399 -125678
8957a98000B61976a43067L9231K3047A6861J16741a5990k4999A309c15485C9881
$$ -198000 261976 -143067 -103836 -80789 16861 133602 -15990 -40989 1309 -315485 39881
8945G0094N3645a31626e6456j95776h0314G1689a61321c8263I3049c4479F20102
$$ 70094 123739 -131626 -56456 -252232 -80314 71689 -161321 -38263 93049 -34479 620102
8933C64201j64319F9841P9476a02152A60072G3217K41992A9804K50192J29245
$$ 364201 199882 69841 149317 -102152 160072 73217 315209 19804 269996 399241
8923C99241J315891L778698L705941C616534A253939E33470A83296J52344j19778
$$ 399241 1715132 5493830 9199771 3616534 1253939 533470 183296 335640 215862
8914B15862c18395a8031q2143c8269c566B15449H6685A128c3777B99114a07652
$$ 215862 -318395 -18031 -100174 -38269 -3566 215449 86685 1128 -33777 299114 -107652
8902b71814a31425k24270C16670b84188C46459A36070b6710j89836j11316F3251
$$ -271814 -131425 -355695 316670 -284188 346459 136070 -26710 -216546 -327862 63251
8891A5934a71451N7083E5191Q8760E6380J48610a0597A4691M3171b06956L7927
$$ 15934 -171451 -114368 55191 143951 56380 204990 -10597 14691 57862 -206956 -169029
8880a69029K01k0185g5581B48618A23907a27416C43942a75138m8540A16516f574
$$ -169029 -168828 -189013 -75581 248618 123907 -127416 343942 -175138 -223678 116516 -6574
8868A51716a44653d7238A19446F850L7118a23439j2229j93423d2527I1776b91725
$$ 151716 -144653 -47238 119446 6850 43968 -123439 -135668 -329091 -42527 91776 -291725
$$ [...]
##END NTUPLES=NMR SPECTRUM
##END=
