##TITLE=AC1406_BRAA12215_7653149_5PJ1xK5njd
##JCAMPDX= 6.0         $$ Bruker NMR JCAMP-DX V2.0
##DATA TYPE= NMR SPECTRUM
##DATA CLASS= NTUPLES
##ORIGIN= BRUKER
##OWNER= Administrator
$$ 1.72 TOPSPIN		Version 2.1
$$ 2013-04-11 16:24:30.022 -0700  Administrator@X
$$ Compression mode = diff/dup
##.OBSERVE FREQUENCY= 400.02188249412
##.OBSERVE NUCLEUS= ^1H
##.ACQUISITION MODE= SIMULTANEOUS (DQD)
##.ACQUISITION SCHEME= undefined
##.AVERAGES= 64
##.DIGITISER RES= 22
##SPECTROMETER/DATA SYSTEM= spect
##.PULSE SEQUENCE= noesygpps1d.comp
##.SOLVENT NAME= COFFEE_meoh
##.SHIFT REFERENCE= INTERNAL, COFFEE_meoh, 1, 14.96101
##AUDIT TRAIL= $$ (NUMBER, WHEN, WHO, WHERE, PROCESS, VERSION, WHAT)
$$ ##TITLE= Audit trail, TOPSPIN		Version 2.1
$$ ##JCAMPDX= 5.01
$$ ##ORIGIN= Bruker BioSpin GmbH
$$ ##OWNER= Administrator
$$ $$ E:\/data/COFFEE/nmr/AC1406_BRAA12215_7653149_5PJ1xK5njd/42/pdata/1/auditp.txt
$$ ##AUDIT TRAIL=  $$ (NUMBER, WHEN, WHO, WHERE, PROCESS, VERSION, WHAT)
(   1,<2013-04-11 16:24:24.156 -0700>,<Administrator>,<X>,<go>,<TOPSPIN 2.1>,
      <created by zg
	started at 2013-04-11 16:12:51.822 -0700,
	POWCHK enabled, PULCHK disabled,
       configuration hash MD5:
       33 CF 6A 21 5C D3 B9 40 6C 15 AA 8D 27 A2 4F 13
       data hash MD5: 64K
       25 CD 42 90 62 2C 27 72 77 FF 0A A6 41 38 D3 0E>)
(   2,<2013-04-11 16:24:27.230 -0700>,<Administrator>,<X>,<proc1d>,<TOPSPIN 2.1>,
      <Start of raw data processing
       efp LB = 0.3 FT_mod = 6 PKNL = 1 PHC0 = 0 PHC1 = 0 SI = 128K 
       data hash MD5: 128K
       8E B2 E4 17 1E 27 B5 27 73 7C 52 18 5D 28 17 58>)
(   3,<2013-04-11 16:24:28.323 -0700>,<Administrator>,<X>,<proc1d>,<TOPSPIN 2.1>,
      <pk PHC0 = -78.01392 PHC1 = 0 
       data hash MD5: 128K
       26 3F 46 22 A8 21 C8 52 F6 C6 1A 86 57 29 2B 1C>)
(   4,<2013-04-11 16:24:28.944 -0700>,<Administrator>,<X>,<proc1d>,<TOPSPIN 2.1>,
      <abs ABSG = 1 
       data hash MD5: 128K
       39 82 E2 63 BA F4 8F 17 10 92 04 C0 EE CF C5 8B>)
(   5,<2013-04-11 16:24:29.151 -0700>,<Administrator>,<X>,<proc1d>,<TOPSPIN 2.1>,
      <abs ABSG = 2 
       data hash MD5: 128K
       B0 B5 A6 03 04 A8 52 F4 D2 59 9B 54 64 C3 A1 D8>)
(   6,<2013-04-11 16:24:29.328 -0700>,<Administrator>,<X>,<proc1d>,<TOPSPIN 2.1>,
      <abs ABSG = 3 
       data hash MD5: 128K
       D3 F1 8F E2 E4 EC 3E D2 DB DA D0 C7 BD 57 EF F6>)
(   7,<2013-04-11 16:24:29.505 -0700>,<Administrator>,<X>,<proc1d>,<TOPSPIN 2.1>,
      <abs ABSG = 4 
       data hash MD5: 128K
       38 5D 1F 96 7A 28 F6 1C 0A AD 2B 43 40 EB F6 38>)
(   8,<2013-04-11 16:24:29.668 -0700>,<Administrator>,<X>,<proc1d>,<TOPSPIN 2.1>,
      <abs ABSG = 5 
       data hash MD5: 128K
       32 B3 2B A1 23 78 C7 7F DC 70 CA 2D 0D FF 6C 46>)
$$ ##END=
$$ 
$$ $$ hash MD5
$$ $$ 65 97 10 05 CF 10 A1 5C 17 C6 EE 71 CE 3D AC 1C
##$RELAX= 
##$RELAX= 
##$RELAX= 
##$RELAX= 
##$RELAX= 
##$RELAX= 
##$RELAX= 
##$RELAX= 
$$ Bruker specific parameters
$$ --------------------------
##$DU= <E:\>
##$EXPNO= 42
$$ [...]
##$TP07= 0
##$TPNAME0= <>
##$TPNAME1= <>
##$TPNAME2= <>
##$TPNAME3= <>
##$TPNAME4= <>
##$TPNAME5= <>
##$TPNAME6= <>
##$TPNAME7= <>
##$TPOAL= (0..7)
0.5 0.5 0.5 0.5 0.5 0.5 0.5 0.5
##$TPOFFS= (0..7)
0 0 0 0 0 0 0 0
##$TUNHIN= 0
##$TUNHOUT= 0
##$TUNXOUT= 0
##$USERA1= <user>
##$USERA2= <user>
##$USERA3= <user>
##$USERA4= <user>
##$USERA5= <user>
##$V9= 5
##$VALIST= <valist>
##$VCLIST= <CCCCCCCCCCCCCCC>
##$VD= 0
##$VDLIST= <DDDDDDDDDDDDDDD>
##$VPLIST= <PPPPPPPPPPPPPPP>
##$VTLIST= <TTTTTTTTTTTTTTT>
##$WBST= 2048
##$WBSW= 25
##$XGAIN= (0..3)
0 0 0 0
##$XL= 0
##$YL= 0
##$YMAX_a= 6053033
##$YMIN_a= -13287706
##$ZGOPTNS= <>
##$ZL1= 120
##$ZL2= 120
##$ZL3= 120
##$ZL4= 120
##$ABSF1= 14.96101
##$ABSF2= -5.597172
##$ABSG= 5
##$ABSL= 3
##$ALPHA= 0
##$AQORDER= 0
##$ASSFAC= 0
##$ASSFACI= 0
##$ASSFACX= 0
##$ASSWID= 0
##$AUNMP= <proc_prof1d_extract.lims>
##$AXLEFT= 0
##$AXNAME= <>
##$AXNUC= <1H>
##$AXRIGHT= 0
##$AXTYPE= 0
##$AXUNIT= <>
##$AZFE= 0.1
##$AZFW= 0.1
##$BCFW= 0
##$BC_mod= 0
##$BYTORDP= 0
##$COROFFS= 0
##$CY= 15
##$DATMOD= 1
##$DC= 0
##$DFILT= <>
##$DTYPP= 0
##$F1P= 0
##$F2P= 0
##$FCOR= 0.5
##$FTSIZE= 131072
##$FT_mod= 6
##$GAMMA= 0
##$GB= 0
##$INTBC= 1
##$INTSCL= 1
##$ISEN= 128
##$LB= 0.3
##$LEV0= 0
##$LPBIN= 0
##$MAXI= 10000
##$MC2= 0
##$MEAN= 0
##$ME_mod= 0
##$MI= 0
##$NCOEF= 0
##$NC_proc= -2
##$NLEV= 6
##$NOISF1= 0
##$NOISF2= 0
##$NSP= 0
##$NTH_PI= 0
##$NZP= 0
##$OFFSET= 14.96101
##$PC= 1
##$PHC0= -78.01392
##$PHC1= 0
##$PH_mod= 1
##$PKNL= yes
##$PPARMOD= 0
##$PPDIAG= 0
##$PPIPTYP= 0
##$PPMPNUM= 2147483647
##$PPRESOL= 1
##$PSCAL= 4
##$PSIGN= 0
##$PYNMP= <proc.py>
##$REVERSE= no
##$SF= 400.020009634283
##$SI= 131072
##$SIGF1= 0
##$SIGF2= 0
##$SINO= 400
##$SIOLD= 131072
##$SPECTYP= <>
##$SREGLST= <1H.CDCl3>
##$SSB= 0
##$STSI= 131072
##$STSR= 0
##$SW_p= 8223.68421052631
##$SYMM= 0
##$S_DEV= 0
##$TDeff= 65536
##$TDoff= 0
##$TI= <>
##$TILT= no
##$TM1= 0
##$TM2= 0
##$TOPLEV= 0
##$USERP1= <user>
##$USERP2= <user>
##$USERP3= <user>
##$USERP4= <user>
##$USERP5= <user>
##$WDW= 1
##$XDIM= 131072
##$YMAX_p= 414933787
##$YMIN_p= -53364
##$CURPLOT= <Network HP LaserJet P1505>
##$CURPRIN= <$Network HP LaserJet P1505>
##$DFORMAT= <normdp>
##$LAYOUT= <+/1D_H.xwp>
##$LFORMAT= <normlp>
##$PFORMAT= <normpl>
##$SURQMSG= 1
$$ End of Bruker specific parameters
$$ ---------------------------------
##NTUPLES= NMR SPECTRUM
##VAR_NAME=  FREQUENCY,     SPECTRUM/REAL,   SPECTRUM/IMAG
##SYMBOL=    X,             R,               I
##VAR_TYPE=  INDEPENDENT,   DEPENDENT,       DEPENDENT
##VAR_FORM=  AFFN,          ASDF,            ASDF
##VAR_DIM=   131072,        131072,          131072
##UNITS=     HZ,            ARBITRARY UNITS, ARBITRARY UNITS
##FACTOR=    0.0627417313425164, 1,          1
##FIRST=     8223.62146879497, -590,         -61851
##LAST=      0,             2001,            -62705
##MIN=       0,             -53364,          0
##MAX=       8223.62146879497, 414933787,    0
$$ Real data points
##PAGE= N=1
##DATA TABLE= (X++(R..R)), XYDATA
$$ [...]
61578C52580l674m227m262l708k646j634j276j279p61L39J150J257J113Q61l0
61563C33803j456k369k344k259k610k446r85Q42J664J558J445J372P84l7j76M50
61547C27236J032J161J151J165R64N18J58J33N30J396K471L184L407L736M382
61532C52624M538L530J918N93m66j477j797r70j34q00k553l669l735l881m411
61517C39310m176k738j366j062j125n66K71N81M84M98L97k66j100j337j047r72
61501C25786j363j736j663j231p32l77k40k53k96m31p75j105r68l22L36P04R73
61484C16307J256J258Q59M91N63R03J180J414J712J914J884J776J589R75r8r20
61468C33063q32r5N73R43J206J241P04k36r32j032p72m66k14j20k50l22J36J067
$$ y = [352580, 348906, 344679, 340417, 336709, 334063, 332429, 331153, 329874, 329113, 329452, 330602, 331859, 332972, 333833, 333803, 332347, 329978, 327634, 325375, 322765, 320319, 319334, 320176, 321840, 323398, 324843, 326215, 326999, 326962, 326786, 327236, 328268, 329429, 330580, 331745, 332709, 333227, 333385, 333518, 334048, 335444, 337915, 341099, 344506, 348242, 352624, 357162, 360692, 362610, 363203, 362737, 361260, 359463, 358493, 358359, 357559, 355006, 351337, 347602, 343721, 339310, 335134, 332396, 331030, 329968, 328843, 328277, 328548, 329129, 329613, 330111, 330508, 330242, 329142, 327805, 326758, 325786, 324423, 322687, 321024, 319793, 319061, 318684, 318444, 318191, 317895, 317464, 316689, 315584, 314616, 314294, 314630, 315334, 316307, 317563, 318821, 319680, 320171, 320734, 321637, 322817, 324231, 325943, 327857, 329741, 331517, 333106, 334081, 333983, 333063, 332231, 332136, 332709, 333652, 334858, 336099, 336803, 336567, 335635, 334603, 333831, 333365, 333151, 333031, 332781, 332459, 332595, 333662]
61450C33662J732J516O34k17o70q35p84k97O86J693K086J813J495J672K287L035
61434C49508L878M777N222M634L294K287K320L008L525L432K708J493K75j17O57
61419C90901J859K400K097J668J638J792J766J512J049K42p99j473j355q95j056
61404D01346k222l756m661m493l624k798k521k663k626j986j014m09m77q83j224
61389C65989j504j725j424j37J698K912K820J857R19M87O11J279K330L250L508
61374C82870L082K359J686J257J290J904K822L504L596L145K409J718J431J709
61360D14782K266K568K368K017K170L173M709O090O966P671Q617R549R853R521
61346D92320R257R413R466Q869P834O837N879M812L909L431L007K143J048K94
$$ y = [333662, 335394, 336910, 337544, 337327, 336657, 335822, 335038, 334741, 335427, 337120, 339206, 341019, 342514, 344186, 346473, 349508, 353386, 358163, 363385, 368019, 371313, 373600, 375920, 378928, 382453, 385885, 388593, 390086, 390361, 390244, 390901, 392760, 395160, 397257, 398925, 400563, 402355, 404121, 405633, 406682, 406924, 406125, 404652, 403297, 402402, 401346, 399124, 395368, 390707, 386214, 382590, 379792, 377271, 374608, 371982, 369996, 368982, 368573, 368096, 367213, 365989, 364485, 362760, 361336, 361199, 362897, 365809, 368629, 370486, 371405, 371892, 372503, 373782, 376112, 379362, 382870, 385952, 388311, 389997, 391254, 392544, 394448, 397270, 400774, 404370, 407515, 409924, 411642, 413073, 414782, 417048, 419616, 421984, 424001, 426171, 429344, 434053, 440143, 447109, 454780, 463397, 472946, 482799, 492320, 501577, 510990, 520456, 529325, 537159, 543996, 549875, 554687, 558596, 562027, 565034, 567177, 568225, 568519]
61332E68519j20n90j137j558k139l253m376m575l996l772m251m462l741k759k256
61317E25534j759n47Q87J458J166J101J846K920L854M957O596Q377R634J0434
61303E76458J1551J3332J4975J5227J3689J1120Q382N531K292r57l304m440n021
61290F58835n778o734p509p888p784p090n992n091m844n054n192m977m369l262
61276E77271j625K00J705K737L549M454N546O649P381P428O974O651O870P341
61262F43131P487P190O941P342Q598J0359J1897J2606J2427J1620J0154P775M804
61249G62331K326J049L40j013l263n487o848p469p912q293q298p816p233p026
61235F95388p251p453p118o215n212m506m035l480k666j588j56J689L638N012
$$ y = [568519, 568399, 567809, 566672, 565114, 562975, 559722, 555346, 550771, 546775, 543003, 538752, 534290, 530549, 527790, 525534, 523775, 523228, 524115, 525573, 526739, 527840, 529686, 532606, 536460, 541417, 548013, 556390, 566024, 576458, 588009, 601341, 616316, 631543, 645232, 656352, 664734, 670265, 672557, 671600, 668296, 663856, 658835, 653057, 646323, 638814, 630926, 623142, 616052, 610060, 604969, 600125, 595071, 589879, 584902, 580533, 577271, 575646, 575846, 577551, 580288, 583837, 588291, 593837, 600486, 607867, 615295, 622269, 628920, 635790, 643131, 650618, 657808, 664749, 672091, 680689, 691048, 702945, 715551, 727978, 739598, 749752, 757527, 762331, 764657, 765706, 766046, 765033, 761770, 756283, 749435, 741966, 734054, 725761, 717463, 709647, 702414, 695388, 688137, 680684, 673566, 667351, 662139, 657633, 653598, 650118, 647452, 645864, 645708, 647397, 651035, 656047]
61221F56047N290M585L579L041L259L882M326M404M396M520M593M428M248M312
61207G14910M286L528K057P65M42R39J620K366L671N787Q262J0499J2489J4698
61193G86319J7368K0180K2571K4059K4271K2967K0328J7031J3824J0996Q503O383
61181I94800M878M053L570K913J805L62j068k265l391m784o439p899q890r809
61167I67836j1179j2734j3599j3555j3512j4434j6139j7599j8128j7886j7299
61156H01772j6502j5431j4112j2630j0974r043o762m222j761J33J150J325P58
61143G13701p39l328o485r078j0385j0755j0976j1171j0745r293p110m768k658
61130F16210j068j82L54J443L645O437Q806J0432J1861J3612J5622J7563J9265
$$ y = [656047, 661337, 665922, 669501, 672542, 675801, 679683, 684009, 688413, 692809, 697329, 701922, 706350, 710598, 714910, 719196, 722724, 724781, 725546, 725988, 726927, 728547, 730913, 734584, 740371, 748633, 759132, 771621, 786319, 803687, 823867, 846438, 870497, 894768, 917735, 938063, 955094, 968918, 979914, 988417, 994800, 999678, 1003731, 1007301, 1010214, 1012019, 1012381, 1011313, 1009048, 1005657, 1000873, 994434, 986535, 977645, 967836, 956657, 943923, 930324, 916769, 903257, 888823, 872684, 855085, 836957, 819071, 801772, 785270, 769839, 755727, 743097, 732123, 723080, 716318, 712096, 710335, 710468, 711618, 712943, 713701, 712962, 709634, 703149, 694071, 683686, 672931, 661955, 650784, 640039, 630746, 623636, 618868, 616210, 615142, 614960, 615314, 616757, 620402, 626839, 635645, 646077, 657938, 671550, 687172, 704735, 724000]
61117G24000K0742K2186K3997K6363K8725L0145L0332K9950K9693K9550K9241
61106A024924K8864K8642K8252K6939K4240K0415J6197J2202Q410M219p65o042
61094A216497j0735j4702j8454k1978k4510k5828k6878k8371k9558k9338k8068
61083I58077k7120k6869k6266k4542k2353k0794j9962j9069j7597j5855j4450
61072G23200j3449j2261j0343p947n861m418l192j891r12n76k90Q09K577L999
61058F69445M504M577M963N871P035Q116Q970R800J1056J2948J5054J6699J7672
61045G96710J8306J9061K0308K2301K4967K7729K9890L1202L1914L2460L3221
61034A088069L4303L5402L6160L6766L7811L9500M1543M3871M6661M9508N1368
$$ y = [724000, 744742, 766928, 790925, 817288, 846013, 876158, 906490, 936440, 966133, 995683, 1024924, 1053788, 1082430, 1110682, 1137621, 1161861, 1182276, 1198473, 1210675, 1219085, 1223304, 1222539, 1216497, 1205762, 1191060, 1172606, 1150628, 1126118, 1100290, 1073412, 1045041, 1015483, 986145, 958077, 930957, 904088, 877822, 853280, 830927, 810133, 790171, 771102, 753505, 737650, 723200, 709751, 697490, 687147, 679200, 673339, 668921, 665729, 663838, 662926, 662350, 662060, 662869, 665446, 669445, 673949, 678526, 683489, 689360, 696395, 704511, 713481, 723281, 734337, 747285, 762339, 779038, 796710, 815016, 834077, 854385, 876686, 901653, 929382, 959272, 990474, 1022388, 1054848, 1088069, 1122372, 1157774, 1193934, 1230700, 1268511, 1308011, 1349554, 1393425, 1440086, 1489594, 1540962]
61023A540962N1798N1411N0877N0492N1070N4005N9692O7070P5349Q4851R5385
61012B232962J05559J15043J25941J40533J59408J83557K16405K61592L20736
61003C861736L96143M93824O20855P81890R81519J225687J512786J823921K128334
60994A3826695K394095K577806K602741K377258J873237J195654N51392J23835
60986B7522713l1429K2336J86394L74309M89363M08250M0448n82307j294925j896935
60976B5238217k270035k412713k387808k258591k067495j844965j615350j394260
60968H987000j189499j006040q46796p10422n93264m93754m12227l47259k95168
60959C092571k52840k18591j90646j67152j47422j31061j16353j01561q7385p5823
$$ y = [1540962, 1592760, 1644171, 1695048, 1745540, 1796610, 1850615, 1910307, 1977377, 2052726, 2137577, 2232962, 2338521, 2453564, 2579505, 2720038, 2879446, 3063003, 3279408, 3541000, 3861736, 4257879, 4751703, 5372558, 6154448, 7135967, 8361654, 9874440, 11698361, 13826695, 16220790, 18798596, 21401337, 23778595, 25651832, 26847486, 27398878, 27522713, 27491284, 27513620, 27700014, 28074323, 28563686, 28971936, 29012384, 28430077, 27135152, 25238217, 22968182, 20555469, 18167661, 15909070, 13841575, 11996610, 10381260, 8987000, 7797501, 6791461, 5944665, 5234243, 4640979, 4147225, 3734998, 3387739, 3092571, 2839731, 2621140, 2430494, 2263342, 2115920, 1984859, 1868506, 1766945, 1679560, 1603737]
60949A603737o6908n8853n1322m6107m4170m4122m4129m3615m2564m0712l8206
60938A083029l5844l4015l2281l0318k8376k6671k5154k3908k2987k1921k0321
60927G81233j8671j7551j6443j4498j2133j0563r905r224q295p786p652o860n108
60914F36544l439k694k570k592k863l347l402k605j413o05n29j033j610j690j345
60899F04807j486k626l900m199l813l830m300m328l748l279l079k558j739j376
60885E60546j604j735j625j911k628k930k532k229k537k929k849k483k088j523
60871E28943p17J97J417L174M848N422M962M581M851N357N917O851P923Q369Q270
60856F00365Q527R113Q824P305N875N632O040O179O172O518O993P054O551N370
$$ y = [1603737, 1536829, 1477976, 1426654, 1380547, 1336377, 1292255, 1248126, 1204511, 1161947, 1121235, 1083029, 1047185, 1013170, 980889, 950571, 922195, 895524, 870370, 846462, 823475, 801554, 781233, 762562, 745011, 728568, 714070, 701937, 691374, 681469, 672245, 663950, 656164, 648512, 641652, 636544, 633105, 630411, 627841, 625249, 622386, 619039, 615637, 613032, 611619, 611014, 610485, 609452, 607842, 606152, 604807, 603321, 600695, 596795, 592596, 588783, 584953, 580653, 576325, 572577, 569298, 566219, 563661, 561922, 560546, 558942, 557207, 555582, 553671, 551043, 548113, 545581, 543352, 540815, 537886, 535037, 532554, 530466, 528943, 528226, 528423, 529840, 533014, 537862, 543284, 548246, 552827, 557678, 563035, 568952, 575803, 583726, 592095, 600365, 608892, 618005, 626829, 634134, 640009, 645641, 651681, 657860, 664032, 670550, 677543, 684597, 691148, 696518]
60842F96518L283P54r85j350j172j519k477l472m004l716k621j494j159j171l31
60827F75084J382K751L456M620O739Q725R813J0736J2088J3047J3016J3048J4221
60814G88726J5807J6509J6484J6709J7219J7426J7400J7437J7040J5714J4158
60803I70629J3281J2567J0837Q137N522L335J046j430l585n363p199r094j0682
60790I88001j2031j3454j4700j5245j5236j5260j5393j5398j5484j5927j6257
60779H23616j5859j5172j5155j5700j5705j4710j3449j2601j2026j1400j0740
60768F71099j0023r020p804o854o427o326o348o505o740o853o834o888p105p393
60754E69979p621p673p443p042o806o800o680o196n531m834l958k923k187k018
$$ y = [696518, 699801, 700555, 699570, 698220, 697048, 695529, 693052, 689580, 685576, 681860, 679239, 677745, 676586, 675415, 675084, 676466, 679217, 682673, 687293, 694032, 702757, 712570, 723306, 735394, 748441, 761457, 774505, 788726, 804533, 821042, 837526, 854235, 871454, 888880, 906280, 923717, 940757, 956471, 970629, 983910, 996477, 1007314, 1015451, 1020973, 1024308, 1025354, 1023924, 1020339, 1014976, 1007777, 998683, 988001, 975970, 962516, 947816, 932571, 917335, 902075, 886682, 871284, 855800, 839873, 823616, 807757, 792585, 777430, 761730, 746025, 731315, 717866, 705265, 693239, 681839, 671099, 661076, 652056, 644252, 637398, 630971, 624645, 618297, 611792, 605052, 598199, 591365, 584477, 577372, 569979, 562358, 554685, 547242, 540200, 533394, 526594, 519914, 513718, 508187, 503353, 499395, 496472, 494285, 492267]
60740D92267k144k356k884l689m100l761l283l303l473l140k444j879j366o63
60726D53782k20o01j345j407n44N22J169J313R85K39n86j157j571k000k268k265
60710D44046k375k879l373l443l404l606l642l089k505k677l321l576l331l026
60696C99799k595j796j247j735k696k723j652p91r31j389j306q09m38l08k61j33
60680C78989L84J468K606L081K994L068L426L431K845K190J809J544J520K206
60666D11561L329L717K732J150J08j87k49m15o10n82j6J234K785M028M812N363
60650D38760N641N396M944N007N622N971N549M716L771K355K39j958l472m309
60636D78232m999n766o440o797o610n702m279k964k190j816j542j370j417j600
$$ y = [492267, 490123, 487767, 484883, 481194, 477094, 473333, 470050, 466747, 463274, 460134, 457690, 455811, 454445, 453782, 453562, 452961, 451616, 450209, 449665, 450187, 451356, 452669, 453654, 453893, 453307, 452150, 450579, 448579, 446311, 444046, 441671, 438792, 435419, 431976, 428572, 424966, 421324, 418235, 415730, 413053, 409732, 406156, 402825, 399799, 397204, 395408, 394161, 392426, 389730, 387007, 385355, 384564, 383633, 382244, 380938, 380129, 379691, 379383, 379122, 378989, 379373, 380841, 383447, 386528, 389522, 392590, 396016, 399447, 402292, 404482, 406291, 407835, 409355, 411561, 414890, 418607, 421339, 422489, 422597, 422410, 422161, 421746, 421136, 420554, 420538, 421772, 424557, 428585, 433397, 438760, 444401, 449797, 454741, 459748, 465370, 471341, 476890, 481606, 485377, 487732, 487971, 486013, 482541, 478232, 473233, 467467, 461027, 454230, 447620, 441918, 437639, 434675, 432485, 430669, 429127, 427757, 426340, 424740]
60622D24740j764j847j768j438j025q87j098j374j543j775k148k347j983j036
60608D02707J59J148J552J317Q06M04J17k33n86p96j005j373j492p00R24K389
60592D05338K790K116J068L72L27O93R55R51J073J607K199K367K197J997J606
60577D27656P99K5n3M05P81J178K282M044N576O556P626R167J0656J1656J2451
60562E00805J3185J3287J2465J1376J0587R466P053L582K42k292m278n886o638
60549E62954o105m702l381k661k227j455j41J523L493N955Q710J1085J2821J4556
60535F00425J6765J8682J9075J7833J5787J3197R530M905N86k405m306n721o573
60522F97780o581o098n751n614n364m924m495m098l572k898k244j791j627j590
$$ y = [424740, 422976, 421129, 419361, 417923, 416898, 416011, 414913, 413539, 411996, 410221, 408073, 405726, 403743, 402707, 402866, 404014, 405566, 406883, 407689, 408093, 408210, 407977, 407391, 406595, 405590, 404217, 402725, 402025, 402949, 405338, 408128, 410244, 411312, 411684, 412011, 412704, 413659, 414610, 415683, 417290, 419489, 421856, 424053, 426050, 427656, 428455, 428480, 428427, 428832, 429613, 430791, 433073, 437117, 442693, 449249, 456875, 466042, 476698, 488354, 500805, 513990, 527277, 539742, 551118, 561705, 571171, 578224, 581806, 582048, 579756, 575478, 569592, 562954, 556849, 552147, 548766, 546105, 543878, 542423, 542282, 543805, 547298, 553253, 561963, 573048, 585869, 600425, 617190, 635872, 654947, 672780, 688567, 701764, 711294, 716199, 716785, 714380, 710074, 704353, 697780, 691199, 685101, 679350, 673736, 668372, 663448, 658953, 654855, 651283, 648385, 646141, 644350, 642723, 641133]
60508F41133j189p3J465K827M032N688Q042J0638J3180J6039J9663K4007K8914
60495G74366L4459M0499M6395N1574N5943N9376O1197O0609N7225N0867M1351
60484A333861K9000J5014P45j3155k6463l8596m8623n5936o0446o2230o1445n8625
60472I53101n4648n0242m5667m0910l6096l1597k7730k4458k1509j8820j6593
60461E84831j4882j3413j2033j0873r835q382o480n114n138n934o131n434m700
60448D76482m326l763k746j899j677j692j575j607j987k258j993j395p91j64L32
60433D48941J90n99j201j011m53j25R1M28M35l55j452j960j732j266q22l94k01
60416D38514l73l75M35J737K494K259J543R09L76j06k47J58P84J101R96Q40Q79
$$ y = [641133, 639944, 639871, 641336, 644163, 648195, 653883, 661925, 672563, 685743, 701782, 721445, 745452, 774366, 808825, 849324, 895719, 947293, 1003236, 1062612, 1123809, 1184418, 1241643, 1292510, 1333861, 1362861, 1377875, 1378620, 1365465, 1339002, 1300406, 1251783, 1195847, 1135401, 1073171, 1011726, 953101, 898453, 848211, 802544, 761634, 725538, 693941, 666211, 641753, 620244, 601424, 584831, 569949, 556536, 544503, 533630, 523795, 515413, 508933, 503819, 498681, 492747, 486616, 481182, 476482, 472156, 468393, 465647, 463748, 462071, 460379, 458804, 457197, 455210, 452952, 450959, 449564, 448773, 448609, 448941, 449131, 448532, 447331, 446320, 445867, 445742, 445833, 446261, 446696, 446341, 444889, 442929, 441197, 439931, 439109, 438715, 438514, 438141, 437766, 438201, 439938, 442432, 444691, 446234, 447143, 447519, 447413, 447166, 447324, 448108, 449209, 450205, 451045, 451924]
60399D51924Q35L01m70n60M85J850K352J974J794K403L147L282L031K987L109
60384D78444K944K507K214K210K213K023J750J625J779K149K462K490K366K360
60370E09536K384K070J383O75Q8n34j064j086o12j19K83R79J832J932R09k92n50
60353E17814Q8Q39J337J693K018K546L762N656P278P771P449P135O766N643L778
60338E81573K119J336J056N09o72k327m024n305n916n859n194l988k628j845k049
60323E46786k847l513l668l398k999k832l045l206k644j368j21N97R92J267J278
60308E21279J352K497N070P943R902J1234J3056J5585J8078K0122K1878K3066
60296F71062K2665J9892J4917Q620K117l635q251j1972j4961j6881j7523j7329
$$ y = [451924, 452759, 453060, 452590, 452030, 452515, 454365, 456717, 458691, 460485, 462888, 466035, 469317, 472348, 475335, 478444, 481388, 483895, 486109, 488319, 490532, 492555, 494305, 495930, 497709, 499858, 502320, 504810, 507176, 509536, 511920, 513990, 515373, 516048, 516136, 515602, 514538, 513452, 512840, 512721, 513004, 513983, 515815, 517747, 518656, 518364, 517814, 517902, 518741, 520078, 521771, 523789, 526335, 530097, 535753, 543031, 550802, 558251, 565386, 572152, 577795, 581573, 583692, 585028, 586084, 586593, 585921, 583594, 579570, 574265, 568349, 562490, 557296, 553308, 550680, 548835, 546786, 543939, 540426, 536758, 533360, 530361, 527529, 524484, 521278, 518634, 517266, 517145, 517742, 518734, 520001, 521279, 522631, 525128, 530198, 538141, 548043, 559277, 572333, 587918, 605996, 626118, 647996, 671062, 693727, 713619, 728536, 737156, 739273, 735638, 727387, 715415, 700454, 683573, 666050, 648721]
60284F48721j6777j5630j3563j1051q977p577o589o068o216o646o670o260n909
60271E30788n679n177m423l883l650l342k888k640k608k291j462n29L2J31j57
60256D92222p32j234j140l28O72J120O45m13j113p38K86P42K33k67J6L85j55j144
60238D89057j309n46J01K45N62J309J763J524J227J513K223L030L955M770M807
60223E14231L925K963K660K765K723K606K767L152L575M140M803N036M605M294
60209E64245N021O430P254P007O558O764P250P042N986M974M775N154N321M884
60195F48665M061L145K213J355P61M03mn83j152j682k506l771n016n675n718n481
60179F29015n198n035n221n629n604m670l253k123j419q07l38l86q49j096q87
$$ y = [648721, 631944, 616314, 602751, 591700, 582723, 575146, 568557, 562489, 556273, 549627, 542957, 536697, 530788, 525109, 519932, 515509, 511626, 507976, 504634, 501746, 499106, 496498, 494207, 492745, 492216, 492248, 492379, 492222, 491490, 490256, 489116, 488788, 489460, 490580, 491225, 490812, 489699, 488961, 489247, 489989, 490222, 489955, 489971, 490356, 490201, 489057, 487748, 487202, 487303, 487548, 488110, 489419, 491182, 492706, 493933, 495446, 497669, 500699, 504654, 509424, 514231, 518156, 521119, 523779, 526544, 529267, 531873, 534640, 537792, 541367, 545507, 550310, 555346, 559951, 564245, 569266, 575696, 582950, 589957, 596515, 603279, 610529, 617571, 623557, 628531, 633306, 638460, 643781, 648665, 652726, 655871, 658084, 659439, 660200, 660603, 660599, 660016, 658864, 657182, 654676, 650905, 645889, 640214, 634496, 629015, 623817, 618782, 613561, 607932, 602328, 597658, 594405, 592282, 590863, 590056, 589718, 589332, 588483, 587387, 586500]
60164E86500o57q03j110j172r44o91o28p12o70k61L49O75N42M01P03J292J770
60147E84584K126K520K787K746K723L182L978M598M976N495O262O974P454P769
60133F48174P841P509O922O391N916N250M296L030J336n74j841j816r71l10q1
60118F91072K03O86R95J056J231J589J808J843J923J868J170j59j546k731l921
60103F97087n066n743n933o123o448o482o070n653n582n684n694n431m566k903
60089F19709j017J94P73J634L052M146M259L947M055M554M828M599L987L125K136
60074F63981J127r8j810l645m753n002n361o554p982q524p948o977o354o389p041
60059E86670p889q207p569o268m897l742k808k075j441p13P3O13Q94J375K347
$$ y = [586500, 585843, 585040, 583930, 582758, 581814, 581123, 580495, 579783, 579113, 578852, 579201, 579876, 580418, 580819, 581522, 582814, 584584, 586710, 589230, 592017, 594763, 597486, 600668, 604646, 609244, 614220, 619715, 625977, 632951, 640405, 648174, 656015, 663524, 670446, 676837, 682753, 688003, 692299, 695329, 696665, 696091, 694250, 692434, 691463, 691153, 691072, 691275, 691961, 692956, 694012, 695243, 696832, 698640, 700483, 702406, 704274, 705444, 705285, 703739, 701008, 697087, 692021, 686278, 680345, 674222, 667774, 661292, 655222, 649569, 643987, 638303, 632609, 627178, 622612, 619709, 618692, 618886, 619659, 621293, 624345, 628491, 632750, 636697, 640752, 645306, 650134, 654733, 658720, 661845, 663981, 665108, 665010, 663200, 659555, 654802, 649800, 644439, 637885, 629903, 621379, 613431, 606454, 600100, 593711, 586670, 578781, 570574, 563005, 556737, 551840, 548098, 545290, 543215, 541774, 541061, 541134, 541747, 542641, 544016, 546363]
60044E46363L448M247M921N912P086P797P719P186O613N888M579K660Q31o8K1
60029F15203K53k60j694l683n845p843r196r604r336q968q845q975r194r101q268
60014E14644o892n807n330m720l433k242k124k564k243j081k23o8K46J162J904
59999D81229J826J353J025O75J53l8M72J325K136L096M264N069N128M884M858
59984E17455M900M730M556M540M317L638K903K422J794O38o00j299j584j932k286
59969E44192k271j925j537j069l76K84N98P89J280K005K570K924L262L439L054
59954E57219K105J066L39n1k09j72j1K2l94j321k336k737k279j534j270j581k090
59937E44766k695l543m341m465l876l219k860k533k040j623j387j018l59L43R97
$$ y = [546363, 549811, 554058, 558979, 564891, 571977, 579774, 587493, 594679, 601292, 607180, 611759, 614419, 615250, 615182, 615203, 615456, 615196, 613502, 609819, 603974, 596131, 586935, 577331, 567995, 559027, 550182, 541207, 532013, 522912, 514644, 507752, 501945, 496615, 491895, 488462, 486220, 484096, 481532, 479289, 478208, 477985, 477917, 478163, 479325, 481229, 483055, 484408, 485433, 486108, 486261, 486223, 486695, 488020, 490156, 493252, 497516, 502585, 507713, 512597, 517455, 522355, 527085, 531641, 536181, 540498, 544136, 547039, 549461, 551255, 551893, 551293, 549994, 548410, 546478, 544192, 541921, 539996, 538459, 537390, 537014, 537298, 537896, 538685, 539965, 541970, 544540, 547464, 550726, 554165, 557219, 559324, 560390, 560729, 560678, 560469, 560297, 560286, 560308, 559914, 558593, 556257, 553520, 551241, 549707, 548437, 546856, 544766, 542071, 538528, 534187, 529722, 525846, 522627, 519767, 517234, 515194, 513571, 512184, 511166, 510807, 511150, 512147]
59922E12147J830K781L357L417L394L554L655L654L991M862N773O180N976N238
59908E69809M172L473L856M948N493M954M091L603L219K504J619O92o09k191l175
59893F06458l088k648k597k541j732l24R59J821K409K819L174L701M286M577M817
59878F22091N680O896P137N933M520L976L619K379O31n99j387k498l809m545m648
59863F45376m710m789m528m082l889l739l151k454k370k724k577j568k00J141
59849F05736K532L995N408O950Q870J0870J2213J2306J0810P661L602K20j333
59836F89840j313n86N31J929K906K755J672J91j775m390o884q198q287p875p312
59821F53204o688o500p056p624p302o389n768n297m222k822k208k551k886k790
$$ y = [512147, 513977, 516758, 520115, 523532, 526926, 530480, 534135, 537789, 541780, 546642, 552415, 558595, 564571, 569809, 573981, 577454, 581310, 586258, 591751, 596705, 600796, 604399, 607618, 610122, 611741, 612433, 611824, 609633, 606458, 603370, 600722, 598125, 595584, 593852, 593528, 594487, 596308, 598717, 601536, 604710, 608411, 612697, 617274, 622091, 627771, 634667, 641804, 647737, 652257, 656233, 659852, 662231, 662862, 662263, 660876, 658378, 654569, 650024, 645376, 640666, 635877, 631349, 627267, 623378, 619639, 616488, 614034, 611664, 608940, 606363, 604795, 604595, 605736, 608268, 612263, 617671, 624621, 633491, 644361, 656574, 668880, 679690, 687351, 690953, 691173, 689840, 688527, 687941, 688472, 690401, 693307, 696062, 697734, 697925, 696150, 691760, 684876, 676678, 668391, 660516, 653204, 646516, 640016, 632960, 625336, 618034, 611645, 605877, 600580, 596358, 593536, 591328, 588777, 585891, 583101]
59807E83101k855l322l499k957k191j708j350q95n78o71j151j942k921l706m015
59792E49340m136m463m763m611m176l849l405k519j708j702k150k095j506j174
59778E07083j248j135p26m68k94K17O80L29l75n2J400K445K116J261J065J598
59762E13896K379L127L457K913J921J625K266K893L096L743N263O536O489N739
59748E65343N522N846N838N294M799M675M751M860M792M115K773J549J250J655
59734F23062J909J633J155P81M87J93j05m38p49p87l51M67J375K037K165J761
59718F34595J222Q39L46n52j317j077L5Q94R00O90R92J659K202K530K678K474
59702F49110K048K017K650L394L750M014M587N165N278N180N407N714N185L349
$$ y = [583101, 580246, 576924, 573425, 570468, 568277, 566569, 565219, 564324, 563746, 563075, 561924, 559982, 557061, 553355, 549340, 545204, 540741, 535978, 531367, 527191, 523342, 519937, 517418, 515710, 514008, 511858, 509763, 508257, 507083, 505835, 504700, 503974, 503506, 503212, 503429, 504109, 504438, 504063, 504011, 505411, 507856, 509972, 511233, 512298, 513896, 516275, 519402, 522859, 525772, 527693, 529318, 531584, 534477, 537573, 541316, 546579, 553115, 559604, 565343, 570865, 576711, 582549, 587843, 592642, 597317, 602068, 606928, 611720, 615835, 618608, 620157, 621407, 623062, 624971, 626604, 627759, 628540, 629027, 629220, 629115, 628677, 627928, 627141, 626790, 627257, 628632, 630669, 632834, 634595, 635817, 636656, 637002, 636450, 635133, 634056, 634091, 634985, 635885, 636575, 637567, 639226, 641428, 643958, 646636, 649110, 651158, 653175, 655825, 659219, 662969, 666983, 671570, 676735, 682013, 687193, 692600, 698314, 703499, 706848]
59688G06848P39j610k927l153k919k922l071k582j205N8j5j399k861l418l310
59673F76253l428m188n161n718n784n837o216o676o750o338n693m986m255l597
59659F01626l099k624j917r13K88J580K742L472L746L827L710L045J909J079R36
59644F19407P52k37j601k487l013l846m808n141m881m699m529l650k200j196r07
59629E76964n26K71P12L59r4K1L52L44K5n07j487k787l675l857l918m224m248
59612E53725l560k698k316k227j904j316o28K52J242J840J853J783J945J845R83
59597E50819l19j460k217k392j542K40J928K675K783K882K830K149J069K31l02
59582E59374r07j592k074k522l405m680n652n773n166m403l967l870l680l097
$$ y = [706848, 707587, 705977, 703050, 699897, 696978, 694056, 690985, 688403, 687198, 687256, 687241, 685842, 682981, 679563, 676253, 672825, 668637, 663476, 657758, 651974, 646137, 639921, 633245, 626495, 620157, 614464, 609478, 605223, 601626, 598527, 595903, 593986, 593073, 593361, 594941, 597683, 601155, 604901, 608728, 612438, 615483, 617392, 618471, 619407, 620159, 619922, 618321, 615834, 612821, 608975, 604167, 599026, 594145, 589446, 584917, 581267, 579067, 577871, 576964, 576438, 576709, 577421, 577780, 577686, 577707, 578059, 578403, 578428, 577921, 576434, 573647, 569972, 566115, 562197, 557973, 553725, 550165, 547467, 545151, 542924, 541020, 539704, 539076, 539328, 540570, 542410, 544263, 546046, 547991, 549836, 550819, 550500, 549040, 546823, 544431, 542889, 543129, 545057, 547732, 550515, 553397, 556227, 558376, 559445, 559676, 559374, 558467, 556875, 554801, 552279, 548874, 544194, 538542, 532769, 527603, 523200, 519233, 515363, 511683, 508586]
59568E08586k456k286k426k156j348p47q26r85l97Q60J930K121J505Q23R09J803
59552E04910K530K291J684J883K775L076K424K037K829M112M912N420O342P749
59538E54974R535J2104J5591J8970K0769K0185J6962J1189M114j746m601n014
59526F73032m589l705j744J034L359M617N321N847N870N236M364L390J740r50
59512G02822m059o547p994q793r522j0374j1069j1243j0889j0292r563q509p014
59499E86954n262l509j962r43p03r66j070p50k47L61J277K298K791K678K687L224
59483E86858L733L771L928N057P128R487J1759J3842J5529J6720J7603J8023J7153
59470G30591J4336J0023N302R04k922n963q021q977q566o563l525p25J205L001
$$ y = [508586, 506130, 503844, 501418, 499262, 497914, 497167, 496341, 495356, 494959, 495819, 497749, 499870, 501375, 502198, 503107, 504910, 507440, 509731, 511415, 513298, 516073, 519149, 521573, 523610, 526439, 530551, 535463, 540883, 547225, 554974, 564509, 576613, 592204, 611174, 631943, 652128, 669090, 680279, 684393, 682647, 678046, 673032, 668443, 664738, 662994, 664028, 667387, 672004, 677325, 683172, 689042, 694278, 698642, 702032, 703772, 702822, 698763, 692216, 684222, 675429, 665907, 655533, 644464, 633221, 622332, 612040, 602477, 593968, 586954, 581692, 578183, 576221, 575278, 574575, 573609, 572539, 571789, 571542, 571903, 573180, 575478, 578269, 580947, 583634, 586858, 590591, 594362, 598290, 603347, 610475, 619962, 631721, 645563, 661092, 677812, 695415, 713438, 730591, 744927, 754950, 760252, 761156, 758234, 752271, 744250, 735273, 726707, 720144, 716619, 715894, 717099, 720100]
59456G20100N585Q721J1476J3520J5248J6976J8677K0234K1482K2115K1994K1234
59444I17362J9769J7174J3141P751J190o079j2726j7016j8345j7726j6500j5288
59432H72707j4485j4639j5730j6898j7557j7982j8253j7549j5259j2001q726n473
59420F98155j728K551O935J0985J4377J7246K0525K4992K9748L2985L4322L4523
59408I25616L2400K4610J0285o013j8091k3620k4155k1383j6035r469l292K440
59396H73293Q067J1250P848l057j6894k7505l2230l2534l1052k9153k6809k3677
59384F77547k0044j6685j3933j1389q920p127o267n456l902k136r84j06J197K331
59370E84126K197J190Q63J730K842L482L916M409M721M723M581M364M295N037
$$ y = [720100, 725685, 734406, 745882, 759402, 774650, 791626, 810303, 830537, 852019, 874134, 896128, 917362, 937131, 954305, 967446, 975197, 976387, 970308, 957582, 940566, 922221, 904495, 887995, 872707, 858222, 843583, 827853, 810955, 793398, 775416, 757163, 739614, 724355, 712354, 703628, 698155, 696427, 698978, 705913, 716898, 731275, 748521, 769046, 794038, 823786, 856771, 891093, 925616, 958016, 982626, 992911, 986898, 968807, 945187, 921032, 899649, 883614, 874145, 870853, 873293, 881360, 892610, 900458, 897401, 880507, 853002, 820772, 788238, 757186, 728033, 701224, 677547, 657503, 640818, 626885, 615496, 606576, 599449, 593182, 587726, 583824, 581688, 580704, 580598, 581795, 584126, 586323, 587513, 588376, 590106, 592948, 596430, 600346, 604755, 609476, 614199, 618780, 623144, 627439, 632476]
59356F32476O756Q414R214J0059J2142J4688J5926J5932J6518J8389K0416K1888
59344H02818K3452K5290K6287K5806K4678K3600K1958J9014J5086J0757O069J187
59332A026002l171o688r938j3298j6274j8398j9840k0736k0846k0359j9952j9635
59320H36867j8583j6664j5010j4348j3917j2799j1315j0158r121p660o100n166
59308F96026m769m179l172k139j200O9J935M064N883P241Q695J1061J4534J8208
59294G52257K0725K1220J9462J5446R478K552m044r415j3052j4520j3888j2232
59282G73989j0803r763q393o413m255k192o6K106M040N728P375Q913J0266J1783
59268G82315J3613J4976J4997J3950J2619J0875Q104M722J809o46l587p000r736
$$ y = [632476, 639232, 647646, 656860, 666919, 679061, 693749, 709675, 725607, 742125, 760514, 780930, 802818, 826270, 851560, 877847, 903653, 928331, 951931, 973889, 992903, 1007989, 1018746, 1024815, 1026002, 1022831, 1016143, 1006205, 992907, 976633, 958235, 938395, 917659, 896813, 876454, 856502, 836867, 818284, 801620, 786610, 772262, 758345, 745546, 734231, 724073, 714952, 707292, 701192, 696026, 691257, 687078, 683906, 681767, 680567, 680636, 682571, 686635, 692518, 699759, 708454, 719515, 734049, 752257, 772982, 794202, 813664, 829110, 838588, 841140, 837096, 827681, 814629, 800109, 786221, 773989, 763186, 753423, 745030, 738617, 734362, 732170, 732104, 734210, 738250, 743978, 751353, 760266, 770532, 782315, 795928, 810904, 825901, 839851, 852470, 863345, 871449, 876171, 877980, 877334, 873747, 866747, 857011]
59255H57011j1401j2893j4661j5930j6152j5858j5533j4855j3651j2397j1177
59244G02503r316o707m410l211k542j444J95J953L566M812N465N830O485P196
59230G10375P013N712M195L059J866K09j643l609o140r068j1166j1660j1259j1020
59216F66864j1092j1136j1045j0545r006o361l548j386K27J554K378K612K691
59203F12207K747K338J583J533K682M013M364L930L646L794M008M070L858L200
59189F57973K355K094K712L528L944M200M570M601L980L372L514M064M192L845
59175G08944L605L640L612L416L349L588L977M278M489M964O145P878R204R383
59161G80472Q829Q346P734O230M058K266R42r40l651o057p355q152r216j0354
$$ y = [857011, 845610, 832717, 818056, 802126, 785974, 770116, 754583, 739728, 726077, 713680, 702503, 693187, 686480, 682070, 678859, 676317, 674873, 675068, 677021, 680587, 685399, 690864, 696694, 703179, 710375, 717388, 723100, 727295, 730354, 732220, 732429, 730786, 727177, 721037, 711969, 700803, 689143, 677884, 666864, 655772, 644636, 633591, 623046, 614040, 607679, 604131, 602745, 602972, 604526, 606904, 609516, 612207, 614954, 617292, 618875, 620408, 623090, 627103, 631467, 635397, 639043, 642837, 646845, 650915, 654773, 657973, 660328, 662422, 665134, 668662, 672606, 676806, 681376, 685977, 689957, 693329, 696843, 700907, 705099, 708944, 712549, 716189, 719801, 723217, 726566, 730154, 734131, 738409, 742898, 747862, 754007, 761885, 771089, 780472, 789301, 797647, 805381, 811611, 815669, 817935, 818877, 817937, 814286, 808229, 800874, 792722, 783506, 773152]
59147G73152j1117j1511j1394j0303q620p682p974q250p320n666m386l577k757
59134F72595k073j981k269k268j710p27N21J762K646L207L703L979L777L730M799
59119F89691O600P669P668P871Q896R641R323Q895R396J0250J0462J0198R898
59106H06458R047P213N290M324L899L043J903J236Q88P7j322k843m255n354n626
59091H23978n023m407m273l886k716j765k269l758m759m841m733m931n362o105
59077G65150p260q386q961r138r305r302q805q030p315o619n953n717n912n775
59063F58672m841l681k951k569k400k724l370l480k873k528k925l207k827k557
59049F15739k850k714j512l92m05o71o5O55L41k24L95J669J908J019K97M4m61
$$ y = [773152, 762035, 750524, 739130, 728827, 720207, 712525, 704551, 696301, 688981, 683315, 678929, 675352, 672595, 670522, 668541, 666272, 664004, 662294, 661567, 662088, 663850, 666496, 669703, 673406, 677385, 681162, 684892, 689691, 696291, 703960, 711628, 719499, 728395, 738036, 747359, 756254, 765650, 775900, 786362, 796560, 806458, 815505, 822718, 828008, 832332, 836231, 839274, 841177, 842413, 843301, 843378, 842056, 839213, 834958, 829604, 823978, 818955, 814548, 810275, 806389, 803673, 801908, 799639, 795881, 791122, 786281, 781548, 776617, 771255, 765150, 757890, 749504, 740543, 731405, 722100, 712798, 703993, 695963, 688648, 682029, 676076, 670359, 664447, 658672, 653831, 650150, 647199, 644630, 642230, 639506, 636136, 632656, 629783, 627255, 624330, 621123, 618296, 615739, 612889, 610175, 608663, 608271, 607866, 607195, 607130, 607785, 608126, 607902, 608297, 609966, 611874, 612893, 613190, 613234, 612773]
59032F12773r79m59R31J895K131K700M169O017P869R875J1849J3369J4662J6132
59018G02934J7235J7091J5930J4590J2943J0334P193M566K335m49l569n678o286
59005G89169o113n480m075k355j444j192k4K730N680P187P145O420N546M612L673
58990H11479K772J945J327Q56Nj594l513n102o321p319p671o954n604m265k716
58975G67325m59K050L841M797N545O397P326Q602J0368J2013J2892J3237J3520
58962H67454J3560J3199J2943J2838J1684Q764N371L060J269j583n457r026j1950
58949I22126j4779j7091j7874j7464j7148j6939j5756j3565j1423r510p127m586
58937G58864l056k483j734q80j195k665l640l486l453m279m896m414l640l657
$$ y = [612773, 611794, 611335, 612266, 614161, 616292, 618992, 623161, 629178, 637047, 646922, 658771, 672140, 686802, 702934, 720169, 737260, 753190, 767780, 780723, 791057, 798250, 802816, 805151, 804702, 801133, 795455, 789169, 783056, 777576, 773501, 771146, 769702, 768510, 768486, 771216, 776896, 784083, 791228, 797648, 803194, 807806, 811479, 814251, 816196, 817523, 818379, 818384, 816790, 813277, 808175, 801854, 794535, 786864, 779910, 774306, 770041, 767325, 766866, 768916, 772757, 777554, 783099, 789496, 796822, 805424, 815792, 827805, 840697, 853934, 867454, 881014, 894213, 907156, 919994, 931678, 940442, 945813, 948873, 950142, 948559, 943102, 934076, 922126, 907347, 890256, 872382, 854918, 837770, 820831, 805075, 791510, 780087, 770577, 763450, 758864, 755808, 753325, 751591, 750711, 749516, 746851, 743211, 739725, 736272, 731993, 727097, 722683, 719043, 715386]
58923G15386m239m628m746m811m756m547m275l640k243m97P01J100J041N65j02
58908F80309K85K691N892P678P905Q509J0502J2948J5042J7031J8597J8438J6386
58895H22213J4155J3139J2882J2501J2181J2437J3225J4498J6458J8725K0374
58884I82788K1221K1936K2486K1823J9456J6038J2045P276J995k814o827j0694
58872A106729j4609j7834j9961k1314k1823k0993j9291j8027j7456j6446j4447
58861I04528j2277j0643r358q420q312q836r112r085r480j0118r998r265r175
58848G80449r701r290p622o463o890p702p642p247p317p373o897o532o796o983
58834F75994o535o081o044n621m315l137l025l345l095k452j948j261L9J506K554
$$ y = [715386, 711147, 706519, 701773, 696962, 692206, 687659, 683384, 679744, 677501, 677004, 677705, 678805, 679846, 680411, 680309, 680594, 683285, 689177, 696855, 704760, 713269, 723771, 736719, 751761, 768792, 787389, 805827, 822213, 836368, 849507, 862389, 874890, 887071, 899508, 912733, 927231, 943689, 962414, 982788, 1004009, 1025945, 1048431, 1070254, 1089710, 1105748, 1117793, 1125069, 1127064, 1124250, 1117423, 1106729, 1092120, 1074286, 1054325, 1033011, 1011188, 990195, 970904, 952877, 935421, 918975, 904528, 892251, 881608, 872250, 863830, 855518, 846682, 837570, 828485, 819005, 808887, 798889, 789624, 780449, 770748, 761458, 753836, 747373, 740483, 732781, 725139, 717892, 710575, 703202, 696305, 689773, 682977, 675994, 669459, 663378, 657334, 651713, 647398, 644261, 641236, 637891, 634796, 632344, 630396, 629135, 629174, 630680, 633234]
58819F33234L265L670L345K497K256K994L605L270K705K655K515J534K38m91p85
58804F66507j150j441j450j636k289k843k861k855l331l882l982l824l718l532
58790F27713l270l267l317k667j319j51O47J910L832N402O065O527P166P274O544
58775F59089N836N609N016L548K031J071m9j875l595m405m736n090m988m172l613
58760F49677m102m956n186m892m551l940k767j411k22R32J837J823J037O26J041
58745F24946J499J670K350L799N087N847P009Q905J0262J0145R382R045R032Q994
58731G17972R203R590R418Q702Q384Q413P486N408L683K908J804j45j449j261
58717G90116q99j261j052O35K265K390K136K992M002L443J747M64l86j771l671
$$ y = [633234, 636499, 640169, 643514, 646011, 648267, 651261, 654866, 658136, 660841, 663496, 666011, 667545, 667783, 667292, 666507, 665357, 663916, 662466, 660830, 658541, 655698, 652837, 649982, 646651, 642769, 638787, 634963, 631245, 627713, 624443, 621176, 617859, 615192, 613873, 613722, 614369, 616279, 620111, 625513, 631578, 638105, 645271, 652545, 659089, 664925, 670534, 675550, 679098, 681129, 682200, 682151, 680276, 676681, 672276, 667540, 662450, 657462, 653290, 649677, 645575, 640619, 635433, 630541, 625990, 622050, 619283, 617872, 617650, 618582, 620419, 622242, 623279, 623905, 624946, 626445, 628115, 630465, 634264, 639351, 645198, 652207, 661112, 671374, 681519, 690901, 699946, 708978, 717972, 727175, 736765, 746183, 754885, 763269, 771682, 779168, 784576, 788259, 791167, 792971, 792826, 791377, 790116, 789217, 787956, 786904, 787539, 789804, 792194, 794330, 797322, 801324, 804767, 806514, 806978, 806592, 804821, 801150]
58702H01150n531p633j0256j2615j4123j5484j7071j7788j6998j5932j5505j4590
58690F37624j2285j0046r429r414q272o488n579n369m781m146m380m954m811m257
58676E43413m012l495j964k05P93J553K739L616L756M580P076R656J0599J0856
58662E88961J2026J3224J2718J1046R638P842M333K10k461m115o552r231j0004
58649F27635q895p971p860p385o318n550m797l034j030o33j584j734m57P61J128
58634E72276J434K017K239K170K577L122K560Q73o81j508j972k032j437q49r32
58619E79857q74M39K372L649M613O327Q212Q873Q547Q411Q253P160N794N430N445
58604F62508M269K246R69L88p47k177k610k455l264m760n243m612m323m466l586
$$ y = [801150, 795619, 787986, 777730, 765115, 750992, 735508, 718437, 700649, 683651, 667719, 652214, 637624, 625339, 615293, 605864, 596450, 588178, 581690, 576111, 570742, 565961, 561815, 557435, 552481, 547670, 543413, 539401, 535906, 533942, 533737, 534530, 536083, 538822, 542438, 546194, 550774, 557850, 567506, 578105, 588961, 600987, 614211, 626929, 637975, 647613, 655455, 659788, 659998, 657537, 653422, 646870, 637639, 627635, 618740, 610769, 602909, 595524, 589206, 583656, 578859, 575825, 574795, 574162, 572578, 570844, 570387, 571148, 572276, 573710, 575727, 577966, 580136, 582713, 585835, 588395, 589268, 588587, 587079, 585107, 583075, 581638, 580789, 579857, 578983, 579422, 581794, 585443, 590056, 596383, 604595, 613468, 622015, 630426, 638679, 645839, 651633, 657063, 662508, 666777, 669023, 669992, 670380, 669633, 667456, 664846, 662391, 659127, 654367, 649124, 644512, 640189, 635723, 632137]
58589F32137j377R91L089N353P265P951Q248R674J1678J2465J2100J2074J2299
58576G33947J1414R720Q808Q554P450N804N500O626P404P574Q838J1740J4995
58563H48374J8050K1506K4867K6802K7681K8990L0132K8905K5330K1804J9137
58552A121578J5603J0480N397J489j872m812o268o325o658p937r195j0212j2042
58539A089226j4799j7397j9753k2723k5703k6994k6654k6243k5723k3605k0237
58528H39395j7704j6218j3819j0175p357o222n256l622k331j646l99J395K219
58515G58260J943K120K873K628J432J240K283K463J119L1o8n74j774j994j015
58500G70967q08j833k143j317j583l615m863l802k351k199k045n64R22R84O39
$$ y = [632137, 630760, 631751, 634840, 640193, 647458, 655409, 663657, 673331, 685009, 697474, 709574, 721648, 733947, 745361, 755081, 763889, 772443, 779893, 785697, 791197, 797823, 805227, 812801, 821639, 833379, 848374, 866424, 887930, 912797, 939599, 967280, 996270, 1026402, 1055307, 1080637, 1102441, 1121578, 1137181, 1147661, 1153058, 1154547, 1152675, 1147863, 1141595, 1135270, 1128612, 1120675, 1111480, 1101268, 1089226, 1074427, 1057030, 1037277, 1014554, 988851, 961857, 935203, 908960, 883237, 859632, 839395, 821691, 805473, 791654, 781479, 774122, 767900, 762644, 759022, 756691, 755045, 754646, 756041, 758260, 760203, 762323, 765196, 767824, 769256, 770496, 772779, 775242, 776361, 776392, 776324, 775750, 773976, 771982, 770967, 770159, 768326, 766183, 764866, 763283, 759668, 754805, 751003, 748652, 746453, 744408, 743844, 744766, 745750, 746389]
58485G46389J273K403L325M820P529J0647J3538J6574J9419K0796K0784K0835
58473H88332K0780J8582J3857Q702M204p18o136j0072j1832j3027j4140j3408
58461H85124j0528q017p296o599m371j551R83M074P727J0086J0553J0862J1544
58448I02591J0565P035K939l26l801p693r955r951j0021j1336j1656r362o383
58435H42646m812l792k012k36P92K042L822M712M714O220R922J3061J3696J3428
58421I04203J3880J3954J2691J1315J0240P523K676j502l243m558p311j0056j1185
58408I38627j1760j2697j2696j1366j0805j1621j1085p928n047m672m666k695
58396H31589k55O99J426L390N023M847M456N164N140L102J322J574J684m35k785
$$ y = [746389, 747662, 750065, 753390, 758210, 765739, 776386, 789924, 806498, 825917, 846713, 867497, 888332, 909112, 927694, 941551, 950253, 954457, 953739, 947603, 937531, 925699, 912672, 898532, 885124, 874596, 866579, 859283, 852684, 848313, 846762, 847745, 851819, 859546, 869632, 880185, 891047, 902591, 913156, 920191, 923130, 922804, 919003, 911310, 901355, 891404, 881383, 870047, 858391, 849029, 842646, 837834, 834042, 832030, 831794, 832586, 834628, 838450, 843162, 847876, 854096, 864018, 877079, 890775, 904203, 918083, 932037, 944728, 956043, 966283, 973806, 976482, 974980, 971737, 967179, 959868, 949812, 938627, 926867, 914170, 901474, 890108, 879303, 867682, 856597, 848669, 843622, 838950, 834284, 831589, 831334, 832033, 833459, 836849, 841872, 846719, 851175, 856339, 861479, 864581, 865903, 867477, 869161, 868726, 865941]
58381H65941k926k179k492k449k81K286L013L098M497O174O537O766Q291R778
58367I06054R854R991J1581J3300J4197J5886J8748J9798J7573J5194J5196J5428
58355A082800J3612J1595J1168J0076O460K985K119J521j190l306j644J741L408
58342A141345M281O507Q424P897P114Q832J1271J1712J1651J3381J5140J4721
58330A262276J4213J5905J7318J5622J3050J2507J1775P893L326J849K057R86
58318A378777K13K199M459L852K913N259Q528Q678P624R521J2863J3590J2808
58305A471284J4196J6666J6879J6186J7882K0393K0233J8920J9858K1280J9577
58294A673354J6672J6779J8684J8552J7561J9291K2355K3118K2927K5265K8586
$$ y = [865941, 863015, 860836, 858344, 855895, 855614, 857900, 860913, 864011, 868508, 874682, 881219, 887985, 896276, 906054, 915908, 925899, 937480, 950780, 964977, 980863, 999611, 1019409, 1036982, 1052176, 1067372, 1082800, 1096412, 1108007, 1119175, 1129251, 1135711, 1138696, 1140815, 1142336, 1141146, 1137840, 1136196, 1137937, 1141345, 1145626, 1152133, 1160557, 1168454, 1175568, 1184400, 1195671, 1207383, 1219034, 1232415, 1247555, 1262276, 1276489, 1292394, 1309712, 1325334, 1338384, 1350891, 1362666, 1370559, 1373885, 1375734, 1377791, 1378777, 1378990, 1381189, 1385648, 1389500, 1392413, 1397672, 1406200, 1414878, 1422502, 1432023, 1444886, 1458476, 1471284, 1485480, 1502146, 1519025, 1535211, 1553093, 1573486, 1593719, 1612639, 1632497, 1653777, 1673354, 1690026, 1706805, 1725489, 1744041, 1761602, 1780893, 1803248, 1826366, 1849293, 1874558, 1903144]
58283A903144K9251K8560K9682L0905K9386K7882L0046L3017L2656L1943L5694
58272B242166M1178M3000M3059M6340N0879N1746N1062N4136N9380O2042O4006
58261B808994O9547P5382P5686P3162P4227P7102P5894P2498P2801P4974P3481
58250C623748P0833P3201P8304Q0185Q1743Q9452R9873J05064J07361J14682J25314
58239D649760J31865J36267J45698J57684J64830J70270J82295J97737K07468
58230F143874K14203K27500K45302K58613K70182K89588L14054L33883L52639
58221H649838L81399M17366M49649M81456N24004N73553O18550O64376P25466
58212A3485657P98506Q70653R48572J049973J172368J301898J447278J631084
$$ y = [1903144, 1932395, 1960955, 1990637, 2021542, 2050928, 2078810, 2108856, 2141873, 2174529, 2206472, 2242166, 2283344, 2326344, 2369403, 2415743, 2466622, 2518368, 2569430, 2623566, 2682946, 2744988, 2808994, 2878541, 2953923, 3029609, 3102771, 3176998, 3254100, 3329994, 3402492, 3475293, 3550267, 3623748, 3694581, 3767782, 3846086, 3926271, 4008014, 4097466, 4197339, 4302403, 4409764, 4524446, 4649760, 4781625, 4917892, 5063590, 5221274, 5386104, 5556374, 5738669, 5936406, 6143874, 6358077, 6585577, 6830879, 7089492, 7359674, 7649262, 7963316, 8297199, 8649838, 9031237, 9448603, 9898252, 10379708, 10903712, 11477265, 12095815, 12760191, 13485657, 14284163, 15154816, 16103388, 17153361, 18325729, 19627627, 21074905, 22705989]
58204B2705989J853866K104139K397913K768652L225693L768222M435391N296814
58196D8556679O404925P813782R634602J2004699J5001825J8642217K2914847
58189A40973576K7685788L2553406L6894459M0004627M0993488L8596385L1600554
58182C89302283J9981895N649609q272227j9152602k6001420k9289281l0102664
58175C02115593k9534088k8418950k7161962k5722716k3909159k1719283j9361597
58168A26287838j7033339j4813293j2743097j0881007r252883p836007o614937
58161D7113275n596422m761471m058749l456380k954974k544636k194023j888724
58153A9657896j639471j444380j278962j130233j007309r11568q26936p46203
$$ y = [22705989, 24559855, 26663994, 29061907, 31830559, 35056252, 38824474, 43259865, 48556679, 54961604, 62775386, 72409988, 84414687, 99416512, 118058729, 140973576, 168659364, 201212770, 238107229, 278111856, 319105344, 357701729, 389302283, 409284178, 414933787, 406661560, 387508958, 361507538, 332218257, 302115593, 272581505, 244162555, 217000593, 191277877, 167368718, 145649435, 126287838, 109254499, 94441206, 81698109, 70817102, 61564219, 53728212, 47113275, 41516853, 36755382, 32696633, 29240253, 26285279, 23740643, 21546620, 19657896, 18018425, 16574045, 15295083, 14164850, 13157541, 12245973, 11419037, 10672834]
58145A0672834o78637o25306n72851n17289m69662m33034l96608l57216l24593
58136F297638l01030k76794k50025k31082k22707k14763k02790j93704j89236
58127D215507j81281j67780j56662j50172j41132j28104j18807j15055j09336
58118B947178r9569r2659r0255q5395p6539p0911p0480o8255o1844n7475n7225
58107B116571n5209m9880m7341m8975m8241m3333m0895m3346m4414m1204l9115
58096A614618m0698m0785l6936l4018l4187l2671k7706k4572k5438k5028k0632
58085A271947j6966j6753j5811j2017j0115j2891j5920j5710j5208j6833j7793
58074A105930j6622j6891k0244k2710k1836k0576k0631j8991j4755j2141j3032
$$ y = [10672834, 9994197, 9368891, 8796040, 8278751, 7809089, 7376055, 6979447, 6622231, 6297638, 5996608, 5719814, 5469789, 5238707, 5016000, 4801237, 4598447, 4404743, 4215507, 4034226, 3866446, 3709784, 3559612, 3418480, 3290376, 3171569, 3056514, 2947178, 2847609, 2754950, 2664695, 2579300, 2502761, 2431850, 2361370, 2293115, 2231271, 2173796, 2116571, 2061362, 2011482, 1964141, 1915166, 1866925, 1823592, 1782697, 1739351, 1694937, 1653733, 1614618, 1573920, 1533135, 1496199, 1462181, 1427994, 1395323, 1367617, 1343045, 1317607, 1292579, 1271947, 1254981, 1238228, 1222417, 1210400, 1200285, 1187394, 1171474, 1155764, 1140556, 1123723, 1105930, 1089308, 1072417, 1052173, 1029463, 1007627, 987051, 966420, 947429, 932674, 920533, 907501]
58063I07501j3360j0711q684r812j0842r156p521q443r667r219r161j0669j0957
58050G79299q746p276q472r412p945o472o905p112n651m819n918o512n443n415
58036F83201p693r359q704q143q985q674o267n162p181r177q842q549j0061j0653
58022E65751q334n930o123p024o400n824o826p321n683m279n116n914m270k019
58008D84688j686k175j545p21r90j027L39J481J177J240L019M485L735K361K398
57993D96779L059L096L333M261M265K731J732K299K370P26o49n02p94k679l896
57978E16131k921j952k808l610k676j905l048m161l281k195k957l904k811j061
57964D76841r77j669j148n6J06J32J224K168J532M46L37K35q96j571m34R90J049
$$ y = [907501, 894141, 883430, 874746, 864934, 854092, 844936, 837415, 828972, 819305, 810086, 800925, 790256, 779299, 770553, 763277, 754805, 745393, 737448, 730976, 724071, 716959, 711308, 706489, 700571, 694059, 688616, 683201, 675508, 666149, 657445, 649302, 640317, 631643, 625376, 620214, 613033, 603856, 595014, 586465, 576404, 565751, 557417, 551487, 545364, 538340, 531940, 526116, 519290, 511969, 506286, 502007, 496891, 490977, 486707, 484688, 483002, 480827, 479282, 478561, 477571, 476544, 476883, 478364, 479541, 480781, 483800, 488285, 492020, 494381, 496779, 499838, 502934, 506267, 510528, 514793, 517524, 519256, 521555, 523925, 524651, 524002, 523500, 522706, 520027, 516131, 513210, 511258, 508450, 504840, 502164, 500259, 497211, 493050, 489769, 487574, 484617, 480713, 477902, 476841, 475864, 474195, 473047, 472991, 473097, 473229, 474453, 476621, 478153, 478599, 478936, 479171, 478275, 476704, 476270, 477260, 478309]
57947D78309R47K215L658L789L734M792N581M722L845M869O629P304P783R480
57933E47657J1090J0871R919R922R762P636M590K581R13k104n675p989r498j1525
57919E78150j3195j2956j1743j1527j1997j1554j0326r394q338o309m187l131
57907D63493k331p25O10L87k01N59J751J425n7r98j331j950k343j548k61L33O50
57890D57463J355J547N14k71N68J671J103m60j234j417k102k758k458k139l034
57875D48348m353m953n692p467q755p892o147n522n318l861k070j898k661k265
57861C79494r37m03m19O46K613M015M963O486P831P516O292O088O700O389N046
57846D42320L927L026J542K12K13N74m36k118k422j546j503k668l705m252m787
$$ y = [478309, 479256, 481471, 485129, 488918, 492652, 497444, 503025, 507747, 511592, 516461, 523090, 530394, 538177, 547657, 558747, 569618, 579537, 589459, 599221, 606857, 611447, 614028, 614941, 612837, 607162, 599173, 589675, 578150, 564955, 551999, 540256, 528729, 516732, 505178, 494852, 485458, 477120, 470811, 466624, 463493, 461162, 460437, 461047, 461434, 461233, 461792, 463543, 464968, 464911, 463913, 462582, 460632, 458289, 456741, 456480, 456813, 457463, 458818, 460365, 460879, 460608, 461176, 462847, 463950, 463490, 462256, 460839, 458737, 455979, 453521, 451382, 448348, 443995, 439042, 433350, 425883, 417128, 409236, 403089, 397567, 392249, 388388, 386318, 384420, 381759, 379494, 378557, 378154, 377735, 378381, 380994, 385009, 389972, 396458, 404289, 411805, 418097, 424185, 430885, 437274, 442320, 446247, 449273, 450815, 451027, 451240, 451814, 451378, 449260, 446838, 445292, 443789, 441121, 437416, 433164, 428377]
57831D28377m487k219Q08K333K516L318M945N884N904O023N927M497K601K258
57817D68685L241L459K593K264K705K363R40j54o87k075m698p252r083j0686j1726
57802D39889j1128r326q049p602o686m930l343k340j563j484k736m034l402j389
57788C71877l97q95j007J14J340K196L638N705P023P207P435Q149Q462Q165Q105
57773D37117Q242P602O365N754N627M506K195J17j092k142l262m120n407p938
57759D53564j0310j0288q541p956r140r734q610p385p047o352m710l576l634l507
57745C52774k606k422l446l624j733K69L00o35m22Q40J643J673J576J309N72L
57729C46071L16R74J038O17M46P39J356K306L285L510K722J676J070P64L82j33
$$ y = [428377, 423890, 421671, 422479, 424812, 427328, 430646, 435591, 441475, 447379, 453402, 459329, 463826, 466427, 468685, 471926, 475385, 477978, 480242, 482947, 485310, 486250, 486096, 485409, 483334, 478636, 471384, 462301, 451615, 439889, 428761, 419435, 411386, 403784, 397098, 392168, 388825, 386485, 384922, 383438, 380702, 376668, 373266, 371877, 371480, 370585, 369578, 369692, 371032, 373228, 376866, 382571, 389594, 396801, 404236, 412385, 420847, 429012, 437117, 445359, 452961, 459326, 465080, 470707, 475213, 477408, 477525, 476433, 474291, 471029, 466909, 461502, 453564, 443254, 432966, 424425, 416469, 407329, 397595, 388985, 381600, 374553, 368201, 363491, 359915, 356281, 352774, 350168, 347746, 344300, 340676, 338943, 339212, 339512, 338877, 338455, 339295, 340938, 342611, 344187, 345496, 346068, 346071, 346387, 347361, 348399, 349016, 349462, 350201, 351557, 353863, 357148, 360658, 363380, 365056, 366126, 366890, 367272, 367139]
57713C67139p85j439j473m90O24N85m78j358j735k186k493j807m98O6j45L59K056
57696C55942L683M394M792N222M903L457J620j12j946l518l931l539l789m776
57682C62402m841l227j196K78K000M801Q037J0833J3422J6440K0355K6107L4725
57669D90136M5557N6409O5981P4432Q0869Q1994P4318N6647L0492p9k8750m9710
57657I78296o1532o6968o8501o6128n9919n2055m4696l7836l0892k4724k0478
57646D44567j7700j5124j2345r707p511o212o203o785o437m740k766j203L03J639
57632C49776J870R78J20l61j289k496k557j372p12j316j801j428j482k583l223
57617C32124k539k079k948l577k484j092j383k638k954k465k536k989k620j566
$$ y = [367139, 366354, 364915, 363442, 362952, 363576, 364161, 363683, 362325, 360590, 358404, 355911, 354104, 353606, 353672, 353527, 353886, 355942, 359625, 364019, 368811, 374033, 378936, 382393, 384013, 383901, 381955, 378437, 374506, 370967, 367178, 362402, 357561, 354334, 353138, 353416, 355416, 360217, 368254, 379087, 392509, 408949, 429304, 455411, 490136, 535693, 592102, 658083, 732515, 813384, 895378, 969696, 1026343, 1056835, 1056756, 1028006, 978296, 916764, 849796, 781295, 715167, 655248, 603193, 558497, 520661, 489769, 465045, 444567, 426867, 411743, 399398, 389691, 382180, 375968, 369765, 362980, 356543, 351803, 349037, 347834, 348137, 349776, 351646, 352624, 352744, 352383, 351094, 348598, 346041, 344669, 343957, 342641, 340840, 339412, 337930, 335347, 332124, 329585, 327506, 324558, 320981, 318497, 317405, 316022, 313384, 310430, 307965, 305429, 302440, 299820, 298254]
57603B98254r19o54j6P58R53R60J603K435K386J481N06l63j244j656j326j095
57587C02063j664k224j727o74k23l43k13K70O42Q03O71j46j307j450j23J193J210
57570B96758P24R91J560J403Q99R91J318R79K94J17K71K51N63J668K547K059R08
57553C14301N13P07M11j55J34J187J828J715J549J611J637J805K510L466M185
57538C37404M862N671N981N380M704M697M645L684K511K199K320J813Q86L81J23
57523C87261l97o44r5K51p43k230k604k022j681j451l90J013J366P70M55M89J8
57506C79366n61J6J458K191J983K081K706K667J720J114J408J712J513J366J363
57491D02103Q07j47k68P56J763K054K235K670K683J963J272J062P84J95P9R23
$$ y = [298254, 297335, 296681, 296665, 297423, 298376, 299336, 300939, 303374, 305760, 307241, 307747, 307384, 306140, 304484, 303158, 302063, 300399, 298175, 296448, 295774, 295551, 295208, 294995, 295265, 295907, 296710, 297381, 297235, 295928, 294478, 294355, 295548, 296758, 297482, 298473, 300033, 301436, 302335, 303326, 304644, 305623, 305917, 306034, 306305, 306556, 307119, 308787, 311334, 313393, 314301, 314814, 315521, 315932, 315777, 315911, 317098, 318926, 320641, 322190, 323801, 325438, 327243, 329753, 333219, 337404, 342266, 347937, 353918, 359298, 364002, 368699, 373344, 377028, 379539, 381738, 384058, 385871, 386757, 387138, 387261, 386864, 386220, 386125, 386376, 385633, 383403, 380799, 378777, 377096, 375645, 375255, 376268, 377634, 378404, 378859, 379348, 379366, 378805, 378821, 380279, 382470, 384453, 386534, 389240, 391907, 393627, 394741, 396149, 397861, 399374, 400740, 402103, 402910, 402763, 402495, 403251, 405014, 407068, 409303, 411973, 414656, 416619, 417891, 418953, 419737, 419932, 420011, 420934]
57475D20934J960K282K021J860K045K377K546K333J969K157L080L682K945J482
57461D53673P88J184J760K078K559L188L266K569J678J043P32R46J711K308K104
57446D81587J728K187L239L890M121M521M699L786K393K136L209M125M089L903
57432E29613M270M814N144N371N241M222K752K109K657L497M015M467M854M700
57418E87726M131L873L960L764L403L701M622N221N269N417N686N327M429M031
57404F50560M369M589M376M334M520M309L967M570O059P064P119P189P608P461
57390G28094O593O291P092P783P480O958O970O956O507O460P363Q317Q554Q721
57376H30139R425R847R099P792P027O865O873P169P773P952P314O698O997P898
$$ y = [420934, 422894, 425176, 427197, 429057, 431102, 433479, 436025, 438358, 440327, 442484, 445564, 449246, 452191, 453673, 454461, 455645, 457405, 459483, 462042, 465230, 468496, 471065, 472743, 473786, 474518, 475464, 477175, 479483, 481587, 483315, 485502, 488741, 492631, 496752, 501273, 505972, 509758, 512151, 514287, 517496, 521621, 525710, 529613, 533883, 538697, 543841, 549212, 554453, 558675, 561427, 563536, 566193, 569690, 573705, 578172, 583026, 587726, 591857, 595730, 599690, 603454, 606857, 610558, 615180, 620401, 625670, 631087, 636773, 642100, 646529, 650560, 654929, 659518, 663894, 668228, 672748, 677057, 681024, 685594, 691653, 698717, 705836, 713025, 720633, 728094, 734687, 740978, 748070, 755853, 763333, 770291, 777261, 784217, 790724, 797184, 804547, 812864, 821418, 830139, 839564, 849411, 858510, 866302, 873329, 880194, 887067, 894236, 902009, 909961, 917275, 923973, 930970, 938868]
57362I38868Q657R161R441R131Q320P951Q494R159R233R124R320R432R251R469
57348A065011J0369J0934J0429R784J0095J0776J0578R655R224R679J0373J0886
57336A187793J1338J1707J1820J1847J2114J2658J3383J4194J4670J4325J3612
57325A329461J3725J4959J6146J6316J5853J5403J4835J4087J3916J4715J5549
57314A494965J5457J4859J4709J5064J5485J6079J7015J7759J7890J7964J8582
57303A675828J9203J8943J8084J7766J8528J9901K1083K1455K0932K0294K0449
57292A892466K1073K0934J9930J9535K0559K1909K2471K2765K3559K4199K3871
57281B133271K3339K3858K5216K6448K7585K9145L0635L1261L1477L2192L2987
$$ y = [938868, 947525, 956686, 966127, 975258, 983578, 991529, 1000023, 1009182, 1018415, 1027539, 1036859, 1046291, 1055542, 1065011, 1075380, 1086314, 1096743, 1106527, 1116622, 1127398, 1137976, 1147631, 1156855, 1166534, 1176907, 1187793, 1199131, 1210838, 1222658, 1234505, 1246619, 1259277, 1272660, 1286854, 1301524, 1315849, 1329461, 1343186, 1358145, 1374291, 1390607, 1406460, 1421863, 1436698, 1450785, 1464701, 1479416, 1494965, 1510422, 1525281, 1539990, 1555054, 1570539, 1586618, 1603633, 1621392, 1639282, 1657246, 1675828, 1695031, 1713974, 1732058, 1749824, 1768352, 1788253, 1809336, 1830791, 1851723, 1872017, 1892466, 1913539, 1934473, 1954403, 1973938, 1994497, 2016406, 2038877, 2061642, 2085201, 2109400, 2133271, 2156610, 2180468, 2205684, 2232132, 2259717, 2288862, 2319497, 2350758, 2382235, 2414427, 2447414]
57270B447414L2848L2203L2443L3594L4257L3794L3004L2497L1901L0985L0184
57259B805124K9688K9112K8383K7966K7974K7926K7566K7187K7064K7204K7703
57248C112897K8673K9817L0694L1251L1584L1543L1162L1097L1813L2738L2989
57237C456258L2534L1848L0963K9794K8942K9136L0116L1154L2230L3687L5072
57226C801734L5599L5569L6090L7410L8638L9139L9211L9210L9022L8521L7777
57215D217920L6711L5230L3711L2688L2039L1189K9999K8871K8108K7737K7740
57204D561943K7871K7549K6626K5877K6019K6706K7199K7593K8442K9608L0429
57193D865862L0761L0938L1051L1116L1619L2811L3878L3855L3109L2832L3285
$$ y = [2447414, 2480262, 2512465, 2544908, 2578502, 2612759, 2646553, 2679557, 2712054, 2743955, 2774940, 2805124, 2834812, 2863924, 2892307, 2920273, 2948247, 2976173, 3003739, 3030926, 3057990, 3085194, 3112897, 3141570, 3171387, 3202081, 3233332, 3264916, 3296459, 3327621, 3358718, 3390531, 3423269, 3456258, 3488792, 3520640, 3551603, 3581397, 3610339, 3639475, 3669591, 3700745, 3732975, 3766662, 3801734, 3837333, 3872902, 3908992, 3946402, 3985040, 4024179, 4063390, 4102600, 4141622, 4180143, 4217920, 4254631, 4289861, 4323572, 4356260, 4388299, 4419488, 4449487, 4478358, 4506466, 4534203, 4561943, 4589814, 4617363, 4643989, 4669866, 4695885, 4722591, 4749790, 4777383, 4805825, 4835433, 4865862, 4896623, 4927561, 4958612, 4989728, 5021347, 5054158, 5088036, 5121891, 5155000, 5187832, 5221117]
57182E221117L3553L2929L1470K9405K6890K4307K1924J9491J6864J4579J2996
57171E485525J1426R204O941N576M728L437J982J389J463R79l31j609k549l599
57157E524562m489m267k970j691p49O27K522L927M539N334O735P725P480O503
57143E555788N389L735J051k274n736r413j3233j6472j8664k0275k1834k3142
57131E434920k3701k3192k1190j7314j2109o874k324J697M981O559O065M489L141
57118E355148K687L580O440J1572J8841K8221L9479N1345O2256P2173Q2577R4649
57106E828968J08857J26405J49316J78697K14704K58669L13525L81666M64467
57097H025274N64564O86409Q33465J006732J206556J432762J681057J941434K201882
$$ y = [5221117, 5254670, 5287599, 5319069, 5348474, 5375364, 5399671, 5421595, 5441086, 5457950, 5472529, 5485525, 5496951, 5506155, 5513096, 5518672, 5523400, 5526837, 5528819, 5530208, 5531671, 5532650, 5532319, 5530710, 5528161, 5524562, 5520073, 5515806, 5512836, 5511145, 5510396, 5511023, 5513545, 5517472, 5522011, 5527345, 5534080, 5541805, 5549285, 5555788, 5561177, 5564912, 5565963, 5563689, 5557953, 5548540, 5535307, 5518835, 5500171, 5479896, 5458062, 5434920, 5411219, 5388027, 5366837, 5349523, 5337414, 5330540, 5328216, 5329913, 5334894, 5341453, 5347518, 5352007, 5355148, 5357835, 5361415, 5367855, 5379427, 5398268, 5426489, 5465968, 5517313, 5579569, 5651742, 5734319, 5828968, 5937825, 6064230, 6213546, 6392243, 6606947, 6865616, 7179141, 7560807, 8025274, 8589838, 9276247, 10109712, 11116444, 12323000, 13755762, 15436819, 17378253, 19580135]
57088A9580135K451449K678456K869204L011340L096062L115809L065618K950738
57080D2818811K783945K561595K242829J768194J111463L13227n37453j348807
57072E1713804k054225k612917l006351l241290l346340l355527l293411l174810
57064B7628933l012123k817717k601464k370752k133220j897140j669525j455711
57056I671281j260320j086584r34832q03199o89880n93588n12248m42956l83452
57047B964222l32574k89166k51732k19266j91436j67731j47294j29630j14647
57038A120746j01829r0383q0191p1634o4318n7073m9427m1978l4925k7342j8474
57027D83172q626J853J3506K6792M0945N4402O5321P0780O6685N0387K3636p750
$$ y = [19580135, 22031584, 24710040, 27579244, 30590584, 33686646, 36802455, 39868073, 42818811, 45602756, 48164351, 50407180, 52175374, 53286837, 53600064, 53062611, 51713804, 49659579, 47046662, 44040311, 40799021, 37452681, 34097154, 30803743, 27628933, 24616810, 21799093, 19197629, 16826877, 14693657, 12796517, 11126992, 9671281, 8410961, 7324377, 6389545, 5586346, 4896466, 4302878, 3790630, 3347674, 2964222, 2631648, 2342482, 2090750, 1871484, 1680048, 1512317, 1365023, 1235393, 1120746, 1018917, 928534, 848343, 776709, 712391, 655318, 605891, 563913, 528988, 501646, 483172, 474546, 476399, 489905, 516697, 557642, 612044, 677365, 748145, 814830, 865217, 888853, 881103]
57015H81103l7095n9532p2894p7788p6967p3380o8344o1881n4357m6832l9979
57004B12054l3735k8125k3550k0112j7380j4987j2914j1136r680q979r439j0547
56992A1470C70a0065q910p028m911k604k82K111M844P773h917B339J0686Q112
56978B1137L467k338p441D510f396j0265r275q089o469m395k210k29J629L678
56964d2021N991Q413J1011b532A4921K0427K2541K4114K5404K5713K3823J9082
56952A76025J1778K934n834j2750j6908j8701j8946j7982j6059j3846j1873r861
56940D7977p324m322j114K426O303J0081J3694J7888K2897K7447L0093L0689K9334
56927B26069K4753J5648L279q935j8489k5050k8875k9844k8371k5776k3095k0486
$$ y = [881103, 844008, 784476, 711582, 633794, 556827, 483447, 415103, 353222, 298865, 252033, 212054, 178319, 150194, 126644, 106532, 89152, 74165, 61251, 50115, 40435, 31456, 22017, 11470, 370, -10065, -18975, -26003, -30914, -33518, -33800, -31689, -26845, -19072, -8917, 2339, 13025, 21137, 24604, 22266, 14825, 4510, -6396, -16661, -25936, -34025, -40494, -44889, -47099, -47328, -45699, -42021, -36030, -27617, -16606, -2532, 14921, 35348, 57889, 82003, 107407, 133120, 156943, 176025, 187803, 190737, 184903, 172153, 155245, 136544, 117598, 99616, 83557, 69711, 57838, 47977, 40653, 36331, 35217, 37643, 43946, 54027, 67721, 85609, 108506, 135953, 166046, 196735, 226069, 250822, 266470, 269749, 260814, 242325, 217275, 188400, 158556, 130185, 104409, 81314, 60828]
56915F0828j8024j6017A2467D0a0408r065q262p280n818m293k920j635q45r80
56901e1506j299n59R92J811J412J093J981L871O411R855a2002E508K0168K2906
56887D8582K6522L0350L3269L4727L4066L0175K2905J3845M933k909r162j2989
56875B54314j4142j3689j2820j1597r535o649l204P67N092R410J4061K0063K7604
56862B59675L5480M2678M9380N5527N9373N8401N1188L7836J9752j38j7964l0925
56850F20263l8560m1739m1332l8328l3976k8846k2570j5156p536k4Q502J8879
56838C79577L0301M1770N3748O6905Q0152R1164R7913R8235Q8908O7617L6254
56827A132544J055l0965n5382p1023p8892q0776p8139p1945o3353n3854m4323
$$ y = [60828, 42804, 26787, 12467, 40, -10408, -19473, -27735, -35015, -40833, -45126, -48046, -49681, -50526, -51506, -52805, -53364, -52372, -50561, -49149, -48056, -46075, -42204, -35793, -25938, -12002, 5508, 25676, 48582, 75104, 105454, 138723, 173450, 207516, 237691, 260596, 274441, 279374, 276465, 267303, 254314, 240172, 226483, 213663, 202066, 192531, 185882, 182678, 183445, 188537, 197947, 212008, 232071, 259675, 295155, 337833, 387213, 442740, 502113, 560514, 611702, 649538, 669290, 669152, 651188, 620263, 581703, 539964, 498632, 460304, 426328, 397482, 374912, 359756, 352220, 352196, 360698, 379577, 409878, 451648, 505396, 572301, 652453, 743617, 841530, 939765, 1028673, 1096290, 1132544, 1133599, 1102634, 1047252, 976229, 897337, 816561, 738422, 666477, 603124, 549270, 504947]
56816E04947l4653k4754j5064n506M999J7062K9704M1576N2400O2095O9160P1063
56804G73029O5678N1836K9718K192k5049m6464n9886o6307o7423o4636n9559n3655
56792D79474m7261m0106l2573k5492j8927j2326n513J365Q508J6043K3258K9232
56780C75682L3772L6601L6126L0342J8992M014j1776k5631l5274l9863m0625l9527
56768C42833l7446l4337l0658k7310k4463k1618j8676j6031j3744j1694j0195
56757I6661r487q868p450n547m289m002m006l801l470l055k492k031j850j605
56743C4708j041o54q36r76m43J62k7n60l90K60K62m61r00o52l33k64j73j19m50
56724B7113q01m40M15Q45P74R74J530J691J327J173J435J462J121J207K108L110
$$ y = [504947, 470294, 445540, 430476, 424970, 429969, 447031, 476735, 518311, 570711, 632806, 701966, 773029, 838707, 890543, 920261, 922453, 897404, 850940, 791054, 724747, 657324, 592688, 533129, 479474, 432213, 392107, 359534, 334042, 315115, 302789, 297276, 298641, 307149, 323192, 346450, 375682, 409454, 446055, 482181, 512523, 531515, 535529, 523753, 498122, 462848, 422985, 382360, 342833, 305387, 271050, 240392, 213082, 188619, 167001, 148325, 132294, 118550, 106856, 96661, 87174, 78306, 70856, 65309, 61020, 57018, 53012, 49211, 45741, 42686, 40194, 38163, 36313, 34708, 33667, 33013, 32177, 31201, 30758, 30920, 30893, 30333, 29943, 30203, 30465, 30004, 29104, 28452, 28119, 27855, 27682, 27563, 27113, 26312, 25872, 26287, 27132, 27906, 28880, 30410, 32101, 33428, 34601, 36036, 37498, 38619, 39826, 41934, 45044]
56708D5044L465L222K737K181J806J858J999J604O83q7l34k02K23R34J487J390
56692F8010R11P23Q84R73R34R65Q31L04j02J76O12K58p32j355j274r70o84l13
56674G0151p7j52JQ04J512J291Q02J253K395L053L132L357L445K504J081P39J505
56657I6796J810J114O33J102J756J994K176K232J315n16j884k017j551r92q3Q26
56641A04711O61m54q96l5O77kj337k037j988j528m94Q84J455O68m77r02q13o93
56623I7400k36P18J332R49J74k01l98q88j406j630j943k567k821k171j242r58
56607H4112j371k015k638k952k487j387n31l49l24p6Q0J64R17K465L765M036L801
56590H5210L719L455K517J239K33l51m00K94J219J312N48J78P18J055L39n62n10
$$ y = [45044, 48509, 51731, 54468, 56649, 58455, 60313, 62312, 63916, 64599, 64512, 64178, 63976, 64199, 65133, 66620, 68010, 68921, 69644, 70528, 71501, 72435, 73400, 74231, 74535, 74433, 74609, 75221, 75479, 74747, 73392, 72118, 71148, 70464, 70151, 70074, 69922, 69923, 70727, 72239, 73530, 74332, 75585, 77980, 81033, 84165, 87522, 90967, 93471, 94552, 95291, 96796, 98606, 99720, 100353, 101455, 103211, 105205, 107381, 109613, 110928, 110412, 108528, 106511, 104960, 103968, 103885, 104711, 105372, 104918, 104022, 103987, 104664, 104662, 103325, 101288, 99300, 97772, 97278, 98162, 99617, 100285, 99808, 98906, 98093, 97400, 97164, 97882, 99214, 100163, 100337, 100136, 99738, 98850, 97444, 95814, 93871, 91304, 88483, 86312, 85070, 84112, 82741, 80726, 78088, 75136, 72649, 71262, 70731, 70382, 70058, 69982, 70062, 70226, 71143, 73608, 77373, 81409, 85210, 88929, 92384, 94901, 96140, 96373, 96022, 95622, 95916, 97135, 98447, 98995, 99173, 99891, 100946, 101285, 100723, 100213]
56573A00213J86O68J008J585J972J663J126J094J413J689K272L637N303O383O719
56558A36931O774O904P283P833P816O334L787J835J329J346R12M07L73J89q71
56543A89182k236k878k790k632k533k316k215k464k668k374j730j042l96j09o52
56528A60147j570j577k93J185K044K727L441L153J264r84k004j850j579j672k130
56513A60302l161m458m828l768k495k299k675k418j629j259j327j060m11j47n78
56498A27789j169j225m04J033K074J715L03p22p41n74p67o75N4N53K55m9L41P32
56480A28523L53k86m32l14k62J84J175J774J510J365K018K507J895J013R79J341
56464A43343J139O50N74N64J28j64J75L89p7k22Q34K065K099J320P31J07r48j387
$$ y = [100213, 100399, 101067, 102075, 103660, 105632, 107295, 108421, 109515, 110928, 112617, 114889, 118526, 123829, 130212, 136931, 143705, 150609, 157892, 165725, 173541, 179875, 183662, 185497, 186826, 188172, 189084, 189491, 189864, 190053, 189182, 186946, 184068, 181278, 178646, 176113, 173797, 171582, 169118, 166450, 164076, 162346, 161304, 160908, 160799, 160147, 158577, 157000, 156707, 157892, 159936, 162663, 166104, 169257, 170521, 169537, 167533, 165683, 164104, 162432, 160302, 157141, 152683, 147855, 144087, 141592, 139293, 136618, 134200, 132571, 131312, 129985, 128925, 128514, 128367, 127789, 126620, 125395, 124991, 126024, 128098, 129813, 130116, 129394, 128653, 128079, 127312, 126637, 126691, 127244, 127499, 127450, 127791, 128523, 128876, 128590, 128158, 127844, 127582, 127766, 128941, 130715, 132225, 133590, 135608, 138115, 140010, 141023, 142002, 143343, 144482, 145132, 145706, 146270, 146398, 146234, 146409, 146798, 146721, 146499, 147333, 149398, 151497, 152817, 153548, 153655, 152707, 151320]
56446A51320k91J141J246M82K58L11m20j296p76Q67J929J938J760J567Q92K15
56430A61143M12R92Q23J87J82O00M56K7K86Q52O80K59Q19J762J307n22j922k205
56412A66138k340k611k127q32J65N87J298K352K736K258J918K055J955J450J176
56397A76178J131O58L0K24J055J284P47O37J440K286K611K810K927K278P50p82
56381A96264j525j326k44J199J798J013N4K59J006P93k78r72j164j557j719o30
56365A92971J083J690J005M42N95Q22J041J730K260J423l36j266q89j94M43J406
56349B04226K105J465O0n03k73o38j480j223J81R91P13Q03J869K709K687K700
56333B16392L152L211K715K590K899K580J585J150J538J745J743K611M094M483
$$ y = [151320, 151029, 152170, 153416, 153898, 154156, 154467, 154047, 152751, 151975, 152842, 154771, 156709, 158469, 160036, 160928, 161143, 161555, 162547, 163370, 163557, 163739, 164339, 164795, 164822, 165108, 165960, 166640, 166899, 167718, 169480, 170787, 170265, 168343, 166138, 163798, 161187, 159060, 158228, 158393, 158980, 160278, 162630, 165366, 167624, 169542, 171597, 173552, 175002, 176178, 177309, 177967, 177997, 178221, 179276, 180560, 181307, 181944, 183384, 185670, 188281, 191091, 194018, 196296, 197046, 196264, 194739, 193413, 193169, 194368, 196166, 197179, 197233, 197492, 198498, 199291, 199013, 198041, 196877, 195320, 193601, 192971, 194054, 195744, 196749, 197191, 197786, 198608, 199649, 201379, 203639, 205062, 204726, 203460, 202571, 202377, 202820, 204226, 206331, 207796, 207856, 207353, 207080, 206442, 204962, 203739, 203920, 204911, 205624, 206427, 208296, 211005, 213692, 216392, 219544, 222755, 225470, 228060, 230959, 233539, 235124, 236274, 237812, 239557, 241300, 243911, 248005, 252488]
56319B52488L467K639K627K249J165P37J382J596N91l90l70M1L88J256K467K793
56303B75126K328K864M920O739P226P501Q353Q484O687L803J255n85j557j168
56289C31976J05Q32Q42J545L319M611M463L868L822M076M536N721P093P248O467
56274C90524O689Q206R083Q634Q635R989J1118J1136J1732J4088J6578J7405J7325
56261E41142J7954J9431K1439K4429K8215L1432L3855L7251M2558M8432N3946
56250I00084O0249O7963P5408Q1285Q6746R2866R8375J01965J04591J07213J08206
56239A884951J05333R8662Q9525P8162O4380M9014L2888J5722k276j9254l3765
56228B363342m6387n7955o7805p5217q0753q4802q6673q6463q5804q5335q3579
$$ y = [252488, 255955, 258594, 261221, 263470, 264635, 265372, 266754, 268350, 268941, 268551, 268181, 268222, 268610, 269866, 272333, 275126, 277454, 280318, 285238, 291977, 299203, 306704, 315057, 323541, 330228, 334031, 335286, 334701, 333144, 331976, 332081, 332913, 333755, 335300, 338619, 343230, 347693, 351561, 355383, 359459, 363995, 369716, 376809, 384057, 390524, 397213, 405419, 414502, 423136, 431771, 441760, 452878, 464014, 475746, 489834, 506412, 523817, 541142, 559096, 578527, 599966, 624395, 652610, 684042, 717897, 755148, 797706, 846138, 900084, 960333, 1028296, 1103704, 1184989, 1271735, 1364601, 1462976, 1564941, 1669532, 1776745, 1884951, 1990284, 2088946, 2178471, 2256633, 2321013, 2370027, 2402915, 2418637, 2416361, 2397107, 2363342, 2316955, 2259000, 2191195, 2115978, 2035225, 1950423, 1863750, 1777287, 1691483, 1606148, 1522569]
56217A522569p9780p5609p2363o8882o4027n8936n4909n1223m7023m3215m0450
56206H66152l7403l3168k9230k6931k5035k2059j8966j7223j6033j3939j1532
56195F14633j0265r984r657r131q435o934m773l428l365l088j927j442k459l207
56181E36538k278r27n26k50O68J023J63j93J033K073J438N73R74J469R73J122
56165E43873L241N419N626N174O000P091O857O547P865R587R997J0450J2904J5998
56151F56629J7279J7441J8850K1456K3715K5938K9443L3893L8681M5313N5260
56140I83898O7091P8731R0739J04229J17439J27518J33811J36350J33353J23756
56130B096915J10390R7285Q5611P5217O7555O3348N9595N2740M3059L2545K0835
$$ y = [1522569, 1442789, 1367180, 1294817, 1225935, 1161908, 1102972, 1048063, 996840, 949817, 906602, 866152, 828749, 795581, 766351, 739420, 714385, 692326, 673360, 656137, 640104, 626165, 614633, 604368, 594384, 584727, 575596, 567161, 560227, 555454, 552026, 548661, 545573, 543646, 542204, 539745, 536538, 534260, 533333, 532807, 532557, 533225, 534248, 534411, 534218, 535251, 537324, 538762, 539335, 540309, 541778, 542751, 543873, 547114, 552533, 558159, 563333, 569333, 576424, 583281, 589828, 597693, 607280, 617277, 627727, 640631, 656629, 673908, 691349, 710199, 731655, 755370, 781308, 810751, 844644, 883325, 928638, 983898, 1050989, 1129720, 1220459, 1324688, 1442127, 1569645, 1703456, 1839806, 1973159, 2096915, 2207305, 2304590, 2390201, 2465418, 2532973, 2596321, 2655916, 2708656, 2751715, 2784260, 2805095]
56119B805095P137o147j6030k3450l1436m0849n1614o5684q4120j03179j17653
56108B272070j26530j31419j31698j25818j15579j04378r2677p9472o6490n6427
56098A241582m8610m0753l3315k7884k3245j7528j2355j0193r612p762n449m853
56086A000023m519j857J473K141J225K158M459N177M812O008P901P679O389P296
56072A050365R717J0437J0008J1651J4923J6459J6196J6995J8951J9785J9923
56061A215410K1537K3508K3036K1103K0710K1072J9389J6786J6388J7151J5923
56050A432013J3988J4985J7904J8951J8693K0450K3281K3801K3340K5693K9295
56039A662394K9456K7052K6989K9285K9859K9071L0982L5021L6896L7065L9740
$$ y = [2805095, 2812232, 2806085, 2790055, 2766605, 2735169, 2694320, 2642706, 2577022, 2492902, 2389723, 2272070, 2145540, 2014121, 1882423, 1756605, 1641026, 1536648, 1443971, 1364499, 1298009, 1241582, 1192972, 1152219, 1118904, 1091020, 1067775, 1050247, 1037892, 1027699, 1018087, 1010325, 1004876, 1000023, 995504, 993647, 995120, 997261, 998486, 1000644, 1005103, 1010280, 1015092, 1021100, 1029001, 1036680, 1043069, 1050365, 1060082, 1070519, 1080527, 1092178, 1107101, 1123560, 1139756, 1156751, 1175702, 1195487, 1215410, 1236947, 1260455, 1283491, 1304594, 1325304, 1346376, 1365765, 1382551, 1398939, 1416090, 1432013, 1446001, 1460986, 1478890, 1497841, 1516534, 1536984, 1560265, 1584066, 1607406, 1633099, 1662394, 1691850, 1718902, 1745891, 1775176, 1805035, 1834106, 1865088, 1900109, 1937005, 1974070, 2013810]
56028B013810M4141M5492M4156M5022M8303M9779M9617N1926N6082N7572N6947
56017B562847N8775O2541O3981O4344O8395P4401P6599P6460Q0477Q7825R1870
56006C368515R3004R7757J05781J10443J12104J17714J27190J33606J37165J45029
55996D548308J56813J64680J68639J76861J89712J98798K03394K12210K26989
55987F246404K40309K51474K68252K90839L11082L29569L55891L89939M21494
55978I105253M50445M87809N34438N79529O22906O76925P43470Q12234Q84946
55969A4897955R76634J089442J211670J346521J513588J718234J950889K221304
55961B6926237K559971K981674L486868M106641M906586N942634P263317Q963224
$$ y = [2013810, 2057951, 2103443, 2147599, 2192621, 2240924, 2290703, 2340320, 2392246, 2448328, 2505900, 2562847, 2621622, 2684163, 2748144, 2812488, 2880883, 2955284, 3031883, 3108343, 3188820, 3276645, 3368515, 3461519, 3559276, 3665057, 3775500, 3887604, 4005318, 4132508, 4266114, 4403279, 4548308, 4705121, 4869801, 5038440, 5215301, 5405013, 5603811, 5807205, 6019415, 6246404, 6486713, 6738187, 7006439, 7297278, 7608360, 7937929, 8293820, 8683759, 9105253, 9555698, 10043507, 10577945, 11157474, 11780380, 12457305, 13200775, 14013009, 14897955, 15874589, 16964031, 18175701, 19522222, 21035810, 22754044, 24704933, 26926237, 29486208, 32467882, 35954750, 40061391, 44967977, 50910611, 58173928, 67137152]
55953F7137152J1175592J3994946J7455335K1564255K6235594L1137619L5687574
55946B24388067L9190202M0791595L9253870L3191901K2126161P500173p620732
55939C98821237k0183096k8650640l3157769l4627233l3981322l1945143k9108249
55932A87167785k5917401k2662934j9543776j6707683j4217218j2049377j0168551
55925F5900845q566828p227761o105126n159881m379653l745942l218314k766778
55917B4730562k388475k078760j815016j581710j384124j224331j087434r62844
55909A2207868q56648p71943o97568o26380n65392n18377m76317m33839l97861
55900F863543l71636l46551l17747k92295k74212k56305k34294k14772k01804
$$ y = [67137152, 78312744, 92307690, 109763025, 131327280, 157562874, 188700493, 224388067, 263578269, 304369864, 343623734, 376815635, 398941796, 406441969, 398821237, 378638141, 349987501, 316829732, 282202499, 248221177, 216276034, 187167785, 161250384, 138587450, 119043674, 102335991, 88118773, 76069396, 65900845, 57334017, 50106256, 44001130, 38841249, 34461596, 30715654, 27497340, 24730562, 22342087, 20263327, 18448311, 16866601, 15482477, 14258146, 13170712, 12207868, 11351220, 10579277, 9881709, 9255329, 8689937, 8171560, 7695243, 7261404, 6863543, 6491907, 6145356, 5827609, 5535314, 5261102, 5004797, 4770503, 4555731, 4353927]
55891D353927j89283j73552j60591j53568j45814j33105j21105j13865j06290
55882C056754r4612q3585p6679o9497n9262n1205m9414n0399n1259n5165o3199
55871B352478o9687p1177p1774p4459p5423p1981o7949o6043o2794n6018m9777
55860A615396m7099m4982m1273l9227m0633m1370l8469l4957l3440l1463k7471
55849A195012k4765k5320k5943k4541k3947k5642k6161k3642k1607k2243k2269
55838I28932j9547j7470j8488j9365j7373j5306j5867j6534j4603j2070j1144
55827G51165r955o996n008o242q342q895r493j1588j2890j1749j0627j1474j2052
55814F25854j0439q742q791q581o586n132n818o003l520p10L6M63K523M408M345
$$ y = [4353927, 4164644, 3991092, 3830501, 3676933, 3531119, 3398014, 3276909, 3163044, 3056754, 2962142, 2878557, 2801878, 2732381, 2673119, 2621914, 2572500, 2522101, 2470842, 2415677, 2352478, 2282791, 2211614, 2139840, 2065381, 1989958, 1917977, 1850028, 1783985, 1721191, 1665173, 1615396, 1568297, 1523315, 1482042, 1442815, 1402182, 1360812, 1322343, 1287386, 1253946, 1222483, 1195012, 1170247, 1144927, 1118984, 1094443, 1070496, 1044854, 1018693, 995051, 973444, 951201, 928932, 909385, 891915, 873427, 854062, 836689, 821383, 805516, 788982, 774379, 762309, 751165, 741210, 734214, 729206, 722964, 714622, 705727, 696234, 684646, 671756, 660007, 649380, 637906, 625854, 615415, 606673, 597882, 589301, 582715, 577583, 571765, 565762, 562242, 561532, 561568, 562031, 564554, 568962, 573307]
55799E73307M376O468Q522P976N848L802Q71l501o862p664q120r929j0884r171
55785E55039p124p057p212n629m372n859q358r092q708q787p983m462N06N043
55771D75945R949J6023K0970K2418K1242J8640J2896K800q446j6453k0490k2093
55759E33401k1576j9218j7169j6695j5951j3534j1478j1619j1981j0285q089p826
55747C67980q451p795o654o665o597m730k617k574l379k393j62Q92O16L23m46
55732C17348k740n143n453m196l477l670m051m978o627p263n775m106m308n138
55718B50423m544l387l364l273r73K656N152O373P660Q603Q006O665N925M865
55704B90787K027j404l251l852m908o314p105p890r298r662p508m719l953m510
$$ y = [573307, 577683, 584151, 592673, 600649, 606497, 610299, 611170, 607669, 600807, 593143, 585023, 575094, 564210, 555039, 547915, 540858, 533646, 528017, 523645, 517786, 509428, 500336, 491628, 482841, 474858, 470396, 470902, 475945, 485894, 501917, 522887, 545305, 566547, 585187, 598083, 600883, 592437, 575984, 555494, 533401, 511825, 492607, 475438, 458743, 442792, 429258, 417780, 406161, 394180, 383895, 375806, 367980, 359529, 351734, 345080, 338415, 331818, 327088, 324471, 321897, 318518, 316125, 315963, 316855, 317471, 317794, 317348, 314608, 309465, 304012, 299816, 296339, 292669, 288618, 283640, 277013, 269750, 263975, 259869, 255561, 250423, 245879, 242492, 239128, 235855, 234882, 237538, 242690, 249063, 256723, 265326, 273332, 279997, 285922, 290787, 292814, 291410, 288159, 284307, 279399, 273085, 265980, 258090, 248792, 239130, 231622, 226903, 222950, 218440]
55690B18440m106l032k941l129j834P3N05J11J001K682L064K570L261M732M775
55675B26172L571L273L772K844L46j459j803k099k624k054n22J07o03j137r26
55660B26858q96j048k83J149J762J457J563K216K282J825K018K700K553J635J177
55645B46968R78l71k728m409m956n401n944n788n214n343n999o137o059o751p443
55630A75403o530m562l491l295k249l81M16j71l95L42O86J70k2M63N22q1l13j43
55612A56369p31j938k246j499j180j585j351l08r1j202k031j627j014r63p85k70
55596A37548n13j817k797k527j764j231o00J43J81n34q48l09K67N54J293K558
55580A29604L269L049K789K884K701K311K917M816O746P794Q431R106R486R630
$$ y = [218440, 214334, 211302, 208361, 205232, 203398, 203471, 203976, 204087, 205088, 207770, 210834, 213404, 216665, 221397, 226172, 229743, 233016, 236788, 239632, 239978, 238519, 236716, 234617, 231993, 229939, 229417, 229524, 228921, 227784, 226858, 225962, 224914, 224631, 225780, 227542, 228999, 230562, 232778, 235060, 236885, 238903, 241603, 244156, 245791, 246968, 247946, 247575, 244847, 240438, 235482, 230081, 224137, 218349, 213135, 207792, 201793, 195656, 189597, 182846, 175403, 168873, 164311, 160820, 157525, 155276, 154895, 155311, 155140, 154745, 155087, 155773, 155943, 155921, 156384, 156906, 156825, 156512, 156369, 155638, 153700, 151454, 149955, 148775, 147190, 145839, 145531, 145440, 144238, 142207, 140580, 139566, 138603, 137818, 137548, 137035, 135218, 132421, 129894, 128130, 126899, 126299, 126442, 126623, 126089, 125241, 124932, 125199, 125753, 127046, 129604, 132873, 135922, 138711, 141595, 144296, 146607, 149524, 154340, 161086, 168880, 177311, 186417, 195903, 205533]
55566B05533J0223J1058J0811Q881O078L188K69k403m339n914p850r612j0028
55553B15895r513r601j0246r799p920o219n498m691l197k087k081k361k219k097
55539A38366k095j386R9J101J026P61Q22M90m23q17k25K22k47q51r01j048j835
55522A33059k538k484k128j955j654j241j566k814l818l763l276l060k714j788
55508I8260p67k56k25o28j627k743l031k506k048j620j92K090L423K734R50o30
55492I1184j699k070j273J76P97K85L0P87J537J552J692K563L152K587J718J568
55476A04586J633J036J62k06k21k86j20L79L65p13k100k885l210l390k967j643
55460I0420j36Q23J384J708J353L42l05o5J67m10j222j452j313j244r92m53k90
$$ y = [205533, 215756, 226814, 237625, 246506, 252584, 255772, 256041, 253638, 249299, 243385, 235535, 225923, 215895, 206382, 196781, 186535, 176736, 168816, 162597, 157099, 152408, 149211, 147124, 145043, 142682, 140463, 138366, 136271, 134885, 134984, 136085, 137111, 137872, 138694, 139184, 138761, 137944, 137719, 137941, 137694, 136843, 135942, 134894, 133059, 130521, 128037, 125909, 123954, 122300, 121059, 119493, 116679, 112861, 109098, 105822, 102762, 100048, 98260, 97493, 97237, 97012, 96384, 94757, 92014, 88983, 86477, 84429, 82809, 82617, 84707, 88130, 90864, 91814, 91184, 89485, 87415, 86142, 86318, 87115, 87400, 87430, 88217, 89754, 91306, 92998, 95561, 98713, 101300, 103018, 104586, 106219, 107255, 107417, 107211, 106990, 106704, 106584, 106963, 107328, 106615, 104515, 101630, 98420, 95030, 92063, 90420, 90284, 91107, 92491, 94199, 95552, 95894, 95589, 95524, 95691, 95281, 94059, 92607, 91294, 90050, 89058, 88605, 88315]
55443H8315o47m09J073K592K664J556O04L00K09R1kk24o03o74j44O14J177J507
55425I7999J367L67j016j505p43J69M76Q67K065L492M239M363M360M325M281M404
55409A29510M329L334J688N43L7j077l202m940n237m874m796m538l563k630k446
55394A02138k317j531q30j050j511j241o71o07n52L05J376J500Q16K84O5k85o10
55377I5279n48m89q72j162p47k51o37j555j895j446q95o27n81p56r25m03R08J927
55359H4325J802J161J042J350J376J030N63j10q33q76j91lr67j844j321o5M82
55342H6921L15L18M04l2n27j81O09P12J76j2K82L86L29P71J574J939J743J483
55324I7210J073L3j288j971j858j479r10O8R29Q49J7o23q31j119j607j884j885
$$ y = [88315, 87668, 87259, 88332, 90924, 93588, 95144, 95748, 96048, 96257, 96348, 96346, 96122, 95519, 94845, 94701, 95315, 96492, 97999, 99366, 99733, 98717, 97212, 96469, 96638, 97114, 97981, 100046, 103538, 107777, 112140, 116500, 120825, 125106, 129510, 133839, 137173, 138861, 139404, 139441, 138364, 135162, 130222, 124985, 120111, 115315, 110777, 107214, 104584, 102138, 99821, 98290, 97460, 96410, 94899, 93658, 92987, 92380, 91828, 92133, 93509, 95009, 95825, 96109, 96174, 95889, 95279, 94731, 94242, 93370, 92208, 91461, 91210, 90573, 89018, 87123, 85677, 84782, 84155, 83574, 82818, 81893, 81490, 82398, 84325, 86127, 87288, 88330, 89680, 91056, 92086, 92649, 92539, 91706, 90830, 90639, 90636, 89669, 87825, 86504, 86439, 86921, 87236, 87554, 87958, 87926, 87399, 87218, 87827, 88539, 88715, 88703, 88985, 89371, 89700, 90471, 92045, 93984, 95727, 97210, 98283, 98316, 97028, 95057, 93199, 91720, 90810, 90878, 91807, 92656, 92673, 92050, 91219, 90100, 88493, 86609, 84724]
55307H4724j836j528o84K26N07K89J00j58q09j406j274o36j16M29J384K164J919
55290H3295J057Q06J370J824J615J026L46k97n20j51J88n3l30L5M61N0o86n66
55272H9470K06L17m95j195j251j083p33K87J642K219J792J304J197Q44j3n47j94
55255I3767L89L14l28p04k44Q00J477R84k29o81K35J269J086K14j6L12L5r41j535
55236I6204j307q42m21K14P88O93K31K34M49j24j275j575n94L96L73j97m66k82
55218I2499K61J112J712J300J77m57k19L7k57n83m22k1K57L78K24k26l03O60J885
55199I8014J890P04n3L37P69L07m19o01n85r26j278j136p72n61k53L61Q26P49
55181I7373M56L68L83L59M38N34K97o5J81J048J567J202N95M39N04L52P8j29l95
$$ y = [84724, 82888, 81360, 80676, 80902, 81409, 81698, 81798, 81640, 80831, 79425, 78151, 77515, 77399, 77828, 79212, 81376, 83295, 84352, 85158, 86528, 88352, 89967, 90993, 91339, 91042, 90522, 90371, 90559, 90506, 90176, 90211, 90672, 90722, 90036, 89470, 89676, 89993, 89498, 88303, 87052, 85969, 85236, 85523, 87165, 89384, 91176, 92480, 93677, 94521, 94508, 93961, 93767, 94156, 94470, 94142, 93438, 93194, 93994, 95471, 96455, 96226, 95545, 95780, 97049, 98135, 98349, 98333, 98645, 98680, 97739, 96204, 94897, 94055, 93634, 93848, 94636, 95329, 95560, 95794, 96243, 96119, 94844, 93269, 92675, 93071, 93444, 93247, 92781, 92499, 92760, 93872, 95584, 96884, 97061, 96604, 96385, 96422, 96165, 95582, 95160, 95139, 95396, 95774, 95998, 95772, 95469, 96129, 98014, 99904, 100608, 100555, 100892, 101661, 101968, 101549, 100948, 100363, 99437, 98159, 97023, 96251, 95690, 95437, 95798, 96624, 97373, 97829, 98197, 98580, 98939, 99377, 99911, 100208, 100143, 100324, 101372, 102939, 104141, 104736, 105175, 105679, 106031, 106109, 105980, 105585]
55162A05585o10l12M14Q18O24M22N10M18N6J48Q89J238M16p99j265j055j007j305
55144A05185j484j387j236j092q41m68Q1Q60J455J138m4j023r49j51N64Q71P88
55127A02267L23k51m27k75m90j204j500o98O01J379J449J151N45l38r37o28M62
55110A01429J629K318K315J723J033P91Q55O02J8r9N06R68N65j43j86M87J195
55093A16006J483J318Q09L03K14L17j79j329k042j535n18j29l90n63m69n04p03
55076A12089o82l73k8L29Q22J244J217P56K61rj02j98m71q97j123q48m44n98j235
55057A09710j504j084o30o50p54n65m48o47n58K53J014P19l20q78m96J89O03P93
55039A04747R20Q99P27N69M63L16K16L68P60J053Q64R4q10r91j2J401J975J359
$$ y = [105585, 104975, 104663, 105077, 105895, 106519, 106941, 107451, 107869, 107925, 108073, 108962, 110200, 110616, 109817, 108552, 107497, 106490, 105185, 103701, 102314, 101078, 99986, 99145, 98677, 98758, 99618, 101073, 102211, 102167, 101144, 100195, 100044, 100608, 101479, 102267, 102590, 102339, 101912, 101637, 101147, 99943, 98443, 97745, 98346, 99725, 101174, 102325, 102870, 102532, 101595, 100967, 101429, 103058, 105376, 107691, 109414, 110447, 111238, 112093, 112695, 112713, 112614, 113120, 114088, 114653, 114510, 114324, 114811, 116006, 117489, 118807, 119616, 119919, 120133, 120450, 120271, 118942, 116900, 115365, 114847, 114718, 114328, 113765, 113296, 112792, 112089, 111407, 111034, 111006, 111335, 112157, 113401, 114618, 115374, 115635, 115626, 115524, 115326, 114855, 113958, 112835, 111987, 111543, 110945, 109710, 108206, 107122, 106492, 105842, 105088, 104523, 104075, 103428, 102870, 103123, 104137, 104856, 104536, 103658, 103162, 103351, 103954, 104747, 105667, 106566, 107293, 107862, 108325, 108641, 108857, 109225, 109985, 111038, 111902, 111996, 111186, 110195, 110183, 111584, 113559, 114918]
55021A14918L91k19o60j240j627j434q70l32R9L40J81j53j0O34R02M05L1O15J582
55002A13553J816J212M86lk52K6R94J937J949J173N27L42J58k67o12o52n29l51
54984A21507j42r2k89l41J44Q03Q53K16l33j50N62J085R18J78m75m04L20J027
54966A25387J280J189Q29N8q33j009k57M93M40J00L70J003J036L52k18j75J51
54949A30196L71M63L91N4l42m72m65p79j450k005k062j592o96M04J188J204O20
54932A25028R4J38Q51K018L104L481L066K570K678L309M089N042O335P577Q227
54917A77607Q338Q320Q083P059N089K645K46j918l850n584p091q028p872o669
54903A76375n341m807m967n040m544l523k181q56p3p4m71p71r53j110r85m22J46
$$ y = [114918, 115309, 115090, 114430, 113190, 111563, 110129, 109259, 108927, 109026, 109366, 109547, 109394, 109384, 110018, 110920, 111325, 111356, 111971, 113553, 115369, 116581, 117067, 117064, 116812, 116838, 117832, 119769, 121718, 122891, 123418, 123760, 123918, 123651, 123039, 122387, 121858, 121507, 121365, 121273, 120984, 120643, 120787, 121590, 122443, 122659, 122326, 122176, 122738, 123823, 124741, 124919, 124444, 124040, 124360, 125387, 126667, 127856, 128685, 128743, 127910, 126901, 126644, 127137, 127577, 127677, 128047, 129050, 130086, 130438, 130220, 130045, 130196, 130567, 131030, 131421, 131475, 131133, 130661, 130196, 129417, 127967, 125962, 123900, 122308, 121612, 122016, 123204, 124408, 125028, 125122, 125260, 126111, 128129, 131233, 134714, 137780, 140350, 143028, 146337, 150426, 155468, 161803, 169380, 177607, 185945, 194265, 202348, 209407, 214496, 217141, 217387, 215469, 211619, 206035, 198944, 190916, 183044, 176375, 171034, 166227, 161260, 156220, 151676, 148153, 145972, 145116, 145043, 144969, 144498, 143727, 142774, 141664, 140679, 140257, 140403]
54886A40403K55J78N10J340K382L512M576N136N097N154N945P073P698P656P217
54871B04132O251M470K195n1k286m553o121o255n483m998n043n010m868n132n500
54856A61748m933l331j930j662k140k623k960l148k905k194j502j202j240j623
54842A28355k434l181k932j549m7O79Q34J071J507J802J699J113R8r62j559j633
54826A22861j481j133l33P22J354J334J092Q37K41o74j124o78o9k06q18q55K4
54809A21094R95J203Q05P02J410K394K602J684M28j41P4L61K39r9l30m60o40q34
54791A31487q43m65L31J191J576J353R74P82N87K44J34M97Q03N54K17N44J347
54774A41313J917K286K964L683L732L498M288O356Q349R130R086R108R264R085
$$ y = [140403, 140658, 140836, 141346, 142686, 145068, 148580, 153156, 158292, 163389, 168543, 174488, 181561, 189259, 196915, 204132, 210383, 214853, 217048, 216997, 214711, 210158, 204037, 197782, 192299, 187301, 182258, 177248, 172380, 167248, 161748, 156815, 153484, 151554, 149892, 147752, 145129, 142169, 139021, 136116, 133922, 132420, 131218, 129978, 128355, 125921, 122740, 119808, 118259, 118212, 118891, 119725, 120796, 122303, 124105, 125804, 126917, 127015, 126053, 124494, 122861, 121380, 120247, 119914, 120636, 121990, 123324, 124416, 125253, 125494, 124820, 123696, 123018, 122949, 122743, 121925, 121070, 121094, 122089, 123292, 124097, 124799, 126209, 128603, 131205, 132889, 133317, 133176, 133250, 133611, 133850, 133751, 133421, 132961, 132321, 131487, 130644, 130179, 130510, 131701, 133277, 134630, 135604, 136386, 136973, 137217, 137351, 137848, 138651, 139205, 139422, 139966, 141313, 143230, 145516, 148480, 152163, 155895, 159393, 163681, 170037, 178386, 187516, 196602, 205710, 214974, 224059]
54760B24059Q347P028N118K880P43j335l699o037p476p838p888q022p745o877
54746A91258o090n720n077l813k821k863l191k662j565j098j497j856j582j003
54732A50420n16m4N79J322K125K889L458L864M404N126N607N647N749O335O882
54717B03847O494N034L084J106p65k392l731m994o175o738o378n756n696n961
54703A70979n748n092m750m687l902k094m58j65p85j007m64N0m1l11j47K82K94
54686A41954l55j195j721j872j772j350o01N5R4m23q92r08o46l99j89K1Q8j06
54668A29783l90n09l85p6K87M67K97RK9L82N83L21j50m48n24m08M7Q34J467J392
54648A33008O41k09n76l09K67N90L90Q2L10J069J590J255K36q82j714k039j706
$$ y = [224059, 232406, 239434, 244552, 247432, 248175, 246840, 243141, 237104, 229628, 221790, 213902, 205880, 198135, 191258, 185168, 179448, 174371, 170558, 167737, 164874, 161683, 159021, 157456, 156358, 154861, 153005, 151423, 150420, 149904, 149860, 150439, 151761, 153886, 156775, 160233, 164097, 168501, 173627, 179234, 184881, 190630, 196965, 203847, 210341, 215375, 218459, 219565, 218800, 216408, 212677, 207683, 201508, 194770, 188392, 182636, 176940, 170979, 165231, 160139, 155389, 150702, 146800, 144706, 144248, 144083, 143298, 142291, 141827, 141877, 141836, 141525, 141378, 141660, 141954, 141599, 140404, 138683, 136811, 135039, 133689, 133088, 133143, 133237, 132814, 131922, 131014, 130368, 129969, 129780, 129801, 129889, 129783, 129393, 128884, 128499, 128423, 128710, 129177, 129474, 129483, 129512, 129894, 130477, 130798, 130648, 130200, 129676, 129268, 129315, 130149, 131616, 133008, 133649, 133440, 132864, 132555, 132822, 133412, 133802, 133884, 134194, 135263, 136853, 138108, 138344, 137462, 135748, 133709, 132003]
54631A32003r54m74p12j318j555j126l15M21P38N45P6k68l37k67q3L35P98P67
54613A28274O7p16q42j58Q60J509J270K13q51j108o45r7M50J361K199J827K56
54596A33869q21j94J138J474Q01L64N10M34j70o47o56p18j150j492j336q56k62
54579A30288M72J047Q79R7k86K67J023J089O72N23O62M63j40m88k59J4k14o51
54561A35458o32j44J75qk43m5L23L13N9K62R96J380P32m26j018p30j48K12M12
54542A36928P03J156J703K236K550K474K108J714J364R78N98M27N65Q70J071R43
54526A58388M49j61n48o94r17j348j672j600j225p27l0P92J204P87j22q17j097
54509A50662j195j165q78n23m97p42q44p14o58p03m50K19Q37R85Q14P29Q60J068
$$ y = [132003, 131049, 130575, 129863, 128545, 126990, 125864, 125549, 125970, 126708, 127253, 127329, 127061, 126724, 126457, 126374, 126709, 127507, 128274, 128341, 127625, 126783, 126625, 127485, 128994, 130264, 130477, 129626, 128518, 127873, 127776, 128226, 129587, 131786, 133613, 133869, 133048, 132854, 133992, 135466, 136267, 136631, 137141, 137575, 137405, 136758, 136102, 135384, 134234, 132742, 131406, 130550, 130288, 130760, 131807, 132686, 132783, 132497, 132764, 133787, 134876, 135548, 136071, 136733, 137196, 137056, 136568, 136309, 136323, 136109, 135458, 134826, 134682, 134857, 134849, 134606, 134561, 134884, 135197, 135256, 135518, 136514, 137894, 138626, 138200, 137182, 136452, 136304, 136516, 136928, 137631, 138787, 140490, 142726, 145276, 147750, 149858, 151572, 152936, 153914, 154512, 154939, 155504, 156374, 157445, 158388, 158837, 158676, 158128, 157434, 156517, 155169, 153497, 151897, 150672, 149945, 149915, 150707, 151911, 152698, 152576, 151759, 150662, 149467, 148302, 147424, 146901, 146404, 145662, 144818, 144104, 143446, 142743, 142293, 142512, 143349, 144334, 145148, 145877, 146737, 147805]
54491A47805J120P74Op42q57k50N58J082J250J075M59m23r68p44J0P07J035J087
54473A52984J090J244J595J834J517P18J98N25J238J332N25m19p56o41p04j023
54457A61257j003k76P45J354J304Q22J65m73p53m58O4J31l99r46j061r76r85q49
54439A57663l08K16J22l73n03j07J31k55q46r87n34K31J006J450J234N01o8%L84
54420A58957M57J57j01j52k52m77m70K8P02R86O64J2n42o50j47P89J578J645R91
54401A64175J95k44l54l58k18K06O74P17K86j30j02L10P86J114J108O09k64j009
54383A67501j138o21J94R08J205R57M00K4O2K16M5m43q28p38j63N24Q59P39N94
54364A70297Q08J055P16n9l97j2K81j31n81j36Q40J147N27m2J07M36J94m73q41
$$ y = [147805, 148925, 149699, 149705, 148963, 148106, 147856, 148414, 149496, 150746, 151821, 152280, 151857, 150889, 150145, 150155, 150862, 151897, 152984, 154074, 155318, 156913, 158747, 160264, 160982, 161180, 161705, 162943, 164275, 164800, 164381, 163625, 162984, 162280, 161257, 160254, 159978, 160723, 162077, 163381, 164203, 164368, 163895, 163142, 162684, 162748, 162879, 162480, 161534, 160473, 159497, 158512, 157663, 157355, 157571, 157693, 157320, 156817, 156710, 156841, 156586, 155740, 154753, 154219, 154450, 155456, 156906, 158140, 158641, 158573, 158573, 158957, 159414, 159571, 159470, 159318, 159066, 158589, 158119, 158147, 158849, 159835, 160499, 160511, 159969, 159319, 159172, 159961, 161539, 163184, 164175, 164370, 164126, 163772, 163414, 163196, 163402, 164076, 164793, 165079, 164949, 164847, 165157, 165943, 167057, 168165, 168774, 168510, 167501, 166363, 165742, 165936, 166844, 168049, 169006, 169406, 169430, 169492, 169708, 169753, 169310, 168482, 167744, 167581, 168105, 168964, 169703, 170297, 171105, 172160, 172876, 172817, 172420, 172408, 172689, 172558, 171977, 171841, 172681, 173828, 174355, 174313, 174420, 174856, 175050, 174577, 173736]
54345A73736o12j13K59L62K44pk96n11m99r8O71J517K091K215J857J126M40L88
54327A82770J006J479J005k19j336j968k411k805k770k131j398j170j393j463
54313A67196r02J54J061J188N45j91m39l97n73r12q75l94m0j47l88l99k90k54
54295A63943j82p3l08j035j643j418n19K71O18R16J462J888J724J151Q20J067
54279A68682J550J672J142J41q75j388j079j40P39R47N45R3n1K5J80M40O76N63
54261A73862J05j48K47J036J643J840J638R81m2q71r99o19k97j68K3K44J78j84
54243A78469n52q69j282j612j470r28m78k71rL12L07m5k09J2P7m48j217j672j733
54224A66382j546j016j42N88O94L48N2j16m49r06r98m07N37J116Q27j98j275j731
$$ y = [173736, 173124, 173011, 173270, 173632, 173876, 173869, 173573, 173062, 172563, 172465, 173136, 174653, 176744, 178959, 180816, 181942, 182382, 182770, 183776, 185255, 186260, 186041, 184705, 182737, 180326, 177521, 174751, 172620, 171222, 170052, 168659, 167196, 166294, 166448, 167509, 168697, 169242, 169051, 168612, 168215, 167642, 166730, 165855, 165461, 165421, 165274, 164886, 164487, 164197, 163943, 163761, 163688, 163380, 162345, 160702, 159284, 158765, 159036, 159654, 160570, 162032, 163920, 165644, 166795, 167615, 168682, 170232, 171904, 173046, 173187, 172312, 170924, 169845, 169705, 170444, 171391, 171936, 172029, 171978, 172003, 172183, 172623, 173299, 173862, 173967, 173819, 174066, 175102, 176745, 178585, 180223, 181204, 181162, 180291, 179292, 178673, 178376, 178208, 178231, 178475, 178653, 178469, 177917, 177048, 175766, 174154, 172684, 171756, 171278, 171007, 170998, 171310, 171617, 171572, 171363, 171375, 171452, 171004, 169787, 168115, 166382, 164836, 163820, 163678, 164266, 164960, 165308, 165360, 165244, 164795, 163889, 162891, 162484, 163021, 164137, 164964, 164766, 163491, 161760]
54206A61760j431p27J6O42J071J262J300J194P00k48r80o49N46J386J130M12K52
54189A67636P12J097R83N31O8j17J87Q10J140Q07J52l10n93r71j305j239q71o40
54171A68077o83q09r65j222j395j247j034j215j617j508o55K86O80O92P93R52
54155A59130P57J77k77j35M72Q98O03k28p25k23Q91J515J089K26j64l8p5n68r43
54136A62382n35N18J443J722J522J274J055O07j51q17q36r4R11J516J430Q22K8
54119A72797o52r45o96j04L46M41N11R15J376J294O59J25M3l9n80j179j072j99
54101A73041P04R98O63J6o04r06q52p57q44p98k19N32N83k23j000r62l24K05M14
54082A69667N68P87R38R95J072J143J068Q62P17P40Q20Q22P64Q29J100J323J049
$$ y = [161760, 160329, 159602, 159618, 160260, 161331, 162593, 163893, 165087, 165787, 165539, 164559, 163910, 164456, 165842, 166972, 167384, 167636, 168348, 169445, 170428, 170959, 171027, 170910, 171097, 171907, 173047, 173854, 174006, 173696, 173103, 172132, 170827, 169588, 168717, 168077, 167394, 166585, 165620, 164398, 163003, 161756, 160722, 159507, 157890, 156382, 155727, 156013, 156693, 157385, 158178, 159130, 159887, 160064, 159787, 159652, 160124, 161022, 161625, 161397, 160672, 160449, 161340, 162855, 163944, 164170, 164006, 163968, 163893, 163325, 162382, 161847, 162365, 163808, 165530, 167052, 168326, 169381, 169988, 169837, 169020, 168184, 168090, 169001, 170517, 171947, 172769, 172797, 172145, 171200, 170504, 170400, 170746, 171187, 171698, 172613, 173989, 175283, 175942, 176067, 176110, 176071, 175491, 174312, 173240, 173041, 173745, 174743, 175406, 175422, 174818, 173912, 173060, 172303, 171459, 170661, 170442, 170974, 171557, 171334, 170334, 169372, 169048, 169253, 169667, 170235, 171022, 171960, 172955, 174027, 175170, 176238, 177100, 177817, 178557, 179377, 180199, 180963, 181792, 182892, 184215, 185264]
54065A85264K41m71m27K35P39O34J79k10m39m82k25K67O51P96J007J541K207K653
54047A94160K774K632K335K159K413K937L138K872K856L825N583P366Q791J0048
54033B53889J1370J2799J4307J5702J6481J6142J4583J1944Q281L794q36m722
54021C73734p388q791r025q344p331o549o038n565n213n302n774o112o002n637
54007B80663n306n039m784m621m578m472m077l427k822k563k653k730k416j765
53993B29410j235j095j079q62o26q05j362j663j214k98K55j22j141j916j867j284
53977B13096q50p44n90k49r7l87q35j124j309j381j028k17M49N46M94P93J072
53960B07639O70j74o08m21j08K39J053K249K996K864K356J987J620J126R34J435
$$ y = [185264, 185505, 185034, 184607, 184842, 185581, 186215, 186394, 186184, 185745, 185263, 185038, 185305, 185956, 186752, 187759, 189300, 191507, 194160, 196934, 199566, 201901, 204060, 206473, 209410, 212548, 215420, 218276, 222101, 227684, 235050, 243841, 253889, 265259, 278058, 292365, 308067, 324548, 340690, 355273, 367217, 375498, 379292, 378456, 373734, 366346, 357555, 348530, 340186, 332855, 326306, 320268, 314703, 309490, 304188, 298414, 292302, 286300, 280663, 275357, 270318, 265534, 260913, 256335, 251863, 247786, 244359, 241537, 238974, 236321, 233591, 231175, 229410, 228175, 227080, 226001, 225139, 224513, 223708, 222346, 220683, 219469, 219171, 219426, 219304, 218163, 216247, 214380, 213096, 212246, 211502, 210912, 210663, 210566, 210179, 209344, 208220, 206911, 205530, 204502, 204285, 204734, 205280, 205774, 206567, 207639, 208309, 208135, 207527, 207106, 206998, 207237, 208290, 210539, 213535, 216399, 218755, 220742, 222362, 223488, 224422, 225857]
53944B25857K318L097L735M284M358L712K930K894L671M439M503L871K968K184
53930B74821J710J451J107N57J56L56J130K014K618K896K997L121L426L833M033
53915C06226L954L995M481N060N114M680M483M912N551N850N822N736N459M631
53901C75954L388K450K330K684K686K037J368J518K476L281L058J885L71j320
53887D04166l499o069q212r337r744r992r942r063p454n875m725l607k071j99
53873C14377J844M234P051R769J1677J2469J1927R409M462k005p912j1705j3453
53860C52144j4129j4295j3863j2778j1353r958q749p723o838o024n212m426l775
53847B33021l320k984k506j596k50R80J288L45j228k318k301j552j002j124j516
$$ y = [225857, 228175, 231272, 235007, 239291, 243649, 247361, 250291, 253185, 256856, 261295, 265798, 269669, 272637, 274821, 276531, 277982, 279089, 279646, 279802, 280158, 281288, 283302, 285920, 288816, 291813, 294934, 298360, 302193, 306226, 310180, 314175, 318656, 323716, 328830, 333510, 337993, 342905, 348456, 354306, 360128, 365864, 371323, 375954, 379342, 381792, 384122, 386806, 389492, 391529, 392897, 394415, 396891, 400172, 403230, 405115, 405486, 404166, 400667, 394598, 386386, 377049, 367305, 357313, 347371, 338308, 330854, 324979, 320254, 316647, 314576, 314377, 316221, 320455, 327506, 337275, 348952, 361421, 373348, 382757, 387219, 385214, 377302, 365597, 352144, 338015, 323720, 309857, 297079, 285726, 275768, 267019, 259296, 252458, 246434, 241222, 236796, 233021, 229701, 226717, 224211, 222615, 222365, 223345, 224633, 224978, 223750, 221432, 219131, 217579, 216577, 215453, 213937]
53832B13937j440p72j24j4k12j45L22P98R49P78L92j14n12n34k72j20k34l27j18
53813B12238K54M47L92L78P71J639K611L149L165L125L358L510L143K639K800
53798B43619L647M381M635M885N381N485M729L740L367L402L003K093J455J530
53784B95352J813J656R93J55n96j114j292j172j046j260j948k856l449l340k727
53769B79169k207k077k128k220k605l331l804l447k640k398l095l990m079l183
53755B37965k048j534j760k001j552o22q7l69r74j307j394j469j367q53j54L73
53739B20847P90J201J191K93j011j545p88N27J338J356J172J474K250K730K218
53724B34043J053M00Q66J774K148J906J607J479J398J403J553J485R57M96P20
$$ y = [213937, 212497, 211725, 211601, 211587, 211375, 211230, 211552, 212350, 213299, 214077, 214469, 214355, 213843, 213309, 213037, 212917, 212683, 212356, 212238, 212492, 212939, 213331, 213709, 214480, 216119, 218730, 221879, 225044, 228169, 231527, 235037, 238180, 240819, 243619, 247266, 251647, 256282, 261167, 266548, 272033, 276762, 280502, 283869, 287271, 290274, 292367, 293822, 295352, 297165, 298821, 299814, 299969, 299373, 298259, 296967, 295795, 294749, 293489, 291541, 288685, 285236, 281896, 279169, 276962, 274885, 272757, 270537, 267932, 264601, 260797, 257350, 254710, 252312, 249217, 245227, 241148, 237965, 235917, 234383, 232623, 230622, 229070, 228448, 228361, 227992, 227018, 225711, 224317, 222848, 221481, 220628, 220474, 220847, 221637, 222838, 224029, 224322, 223311, 221766, 220978, 221505, 222843, 224199, 225371, 226845, 229095, 231825, 234043, 235096, 235496, 236362, 238136, 240284, 242190, 243797, 245276, 246674, 248077, 249630, 251115, 252072, 252568, 253288]
53709B53288J203J018L53M43J764L218L604L016K308J933J811J848J987K077K097
53694B81968K276K751L382L995M370L969K358J61j142q43Q5K40n19j247j339j033
53678B99432o86l21N6K16Q2p8j4J52Q1l00o99p47l93L5J08l19r82j394j278q95
53658B92056r08j598k323k102q67L72Q27Q01Q82Q78L84j08K88J274J407L9j666
53641B89636k089r30Q01K051K434K080J368P38M31L86M53N78P56R59J211J477
53625C02340J602J527J530J870K334K517K445K480K692K859L048L527M121M290
53611C39182L998L846M155M541M669M735M885M787M246L655L370L106K471J779
53597C93425J707K320K878K603J386j91j345j656j304o91l0M94M67k86j203j600
$$ y = [253288, 254491, 255509, 255862, 256305, 258069, 261287, 264891, 267907, 270215, 272148, 273959, 275807, 277794, 279871, 281968, 284244, 286995, 290377, 294372, 298742, 302711, 305069, 305230, 304088, 303245, 303330, 303570, 303051, 301804, 300465, 299432, 298746, 298425, 298481, 298697, 298779, 298701, 298687, 298839, 298920, 298620, 297921, 297174, 296781, 296816, 296924, 296605, 295623, 294229, 292951, 292056, 291148, 289550, 287227, 285125, 284258, 284630, 285457, 286258, 287140, 288018, 288402, 288294, 288582, 289856, 291263, 291302, 289636, 287547, 286617, 287418, 289469, 291903, 293983, 295351, 296089, 296520, 296906, 297359, 297937, 298693, 299652, 300863, 302340, 303942, 305469, 306999, 308869, 311203, 313720, 316165, 318645, 321337, 324196, 327244, 330771, 334892, 339182, 343180, 347026, 351181, 355722, 360391, 365126, 370011, 374798, 379044, 382699, 386069, 389175, 391646, 393425, 395132, 397452, 400330, 402933, 404319, 404128, 402783, 401127, 399823, 399132, 399102, 399596, 400063, 399777, 398574, 396974]
53581C96974j703k246l067l112k003o39J85P35J353J521Q26L5K49J392K509L136
53565C96145L472L491K906J954J274R55M04p03j916k613k609k147j685j742k450
53550C94736l201l123k056p45L1K46N13J331K507L294L175K563K478L407M737
53535D09893N539N601N420N449N827O600P798R199J0382J1041J1205J1134J1127
53522E16215J1305J1627J2153J3137J4547J5737J6124J6143J6808J8293J9700
53511F81789K0464K1202K2636K4478K5949K6849K7452K7786K7680K7245K6733
53500I60263K6100K5172K4053K2997K2198K1850K2054K2402K2249K1717K1684
53489A212739K2389K2854K2243K0998J9910J8957J7981J7634J8446J9555J9643
$$ y = [396974, 395271, 393025, 389958, 386846, 384843, 384204, 384389, 385124, 386477, 387998, 388824, 388859, 389108, 390500, 393009, 396145, 399617, 403108, 406014, 407968, 409242, 410197, 410601, 409898, 407982, 405369, 402760, 400613, 398928, 397186, 394736, 391535, 388412, 386356, 385611, 385642, 385888, 386401, 387732, 390239, 393533, 396708, 399271, 401749, 405156, 409893, 415432, 421033, 426453, 431902, 437729, 444329, 452127, 461326, 471708, 482749, 493954, 505088, 516215, 527520, 539147, 551300, 564437, 578984, 594721, 610845, 626988, 643796, 662089, 681789, 702253, 723455, 746091, 770569, 796518, 823367, 850819, 878605, 906285, 933530, 960263, 986363, 1011535, 1035588, 1058585, 1080783, 1102633, 1124687, 1147089, 1169338, 1191055, 1212739, 1235128, 1257982, 1280225, 1301223, 1321133, 1340090, 1358071, 1375705, 1394151, 1413706, 1433349]
53478A433349J8765J7926J7248J5883J3703J1673J0405R439Q170O382L792J93
53466A566928l684o514p992r200j1032j3115j4686j5655j6366j7011j7713j8657
53454A415303j9808k0971k2242k3741k4886k4855k3899k3252k3377k3274k2108
53443A162890k0545j9801j9919j9809j8586j6259j3446j0914r113p797o382m823
53431I95496l687l156k594j450J17J855L958O386Q333R155R466J0509J2677J5213
53417A062278J7201J8328J8877J9469K0686K2595K4742K6802K8913L1110L2947
53406A323948L4066L4744L5440L6246L7284L9090M1915M5040M7571M9662N2128
53395A777134N4989N7264N8284N8490N8764N9583O0958O2524O3488O3067O1354
$$ y = [1433349, 1452114, 1470040, 1487288, 1503171, 1516874, 1528547, 1538952, 1548391, 1556561, 1562943, 1566735, 1566928, 1563244, 1556730, 1548738, 1539538, 1528506, 1515391, 1500705, 1485050, 1468684, 1451673, 1433960, 1415303, 1395495, 1374524, 1352282, 1328541, 1303655, 1278800, 1254901, 1231649, 1208272, 1184998, 1162890, 1142345, 1122544, 1102625, 1082816, 1064230, 1047971, 1034525, 1023611, 1014498, 1006701, 1000319, 995496, 991809, 988653, 986059, 984609, 984726, 986581, 990539, 996925, 1005258, 1014413, 1023879, 1034388, 1047065, 1062278, 1079479, 1097807, 1116684, 1136153, 1156839, 1179434, 1204176, 1230978, 1259891, 1291001, 1323948, 1358014, 1392758, 1428198, 1464444, 1501728, 1540818, 1582733, 1627773, 1675344, 1725006, 1777134, 1832123, 1889387, 1947671, 2006161, 2064925, 2124508, 2185466, 2247990, 2311478, 2374545, 2435899]
53384B435899N9308N7570N5722N3075M9801M6713M4125M1470L8088L4017K9780
53373B945568K5682K1574J7187J2479P580K586k541q038j4373k1964l0554l8966
53361B916220m5841n0735n4303n7360o0010o1784o2404o2141o1588o1114o0527
53350B278413n9277n7112n4483n2164n0554m9582m9171m9310m9687m9670m8928
53339A708475m7655m6010m3828m1096l8302l5866l3590l1103k8574k6379k4291
53328A311781k1649j8318j5067j2816j1905j2071j2774j3340j3200j2270j1009
53317A157362r904r019q074o869n509m271l350k597j587k4J884L589M762N617
53303A122010O626Q064R858J1779J3678J5569J7534J9518K1260K2574K3644K4917
$$ y = [2435899, 2495207, 2552777, 2608499, 2661574, 2711375, 2758088, 2802213, 2843683, 2881771, 2915788, 2945568, 2971250, 2992824, 3010011, 3022490, 3030070, 3032656, 3030115, 3022077, 3007704, 2985740, 2955186, 2916220, 2870379, 2819644, 2765341, 2707981, 2647971, 2586187, 2523783, 2461642, 2400054, 2338940, 2278413, 2219136, 2162024, 2107541, 2055377, 2004823, 1955241, 1906070, 1856760, 1807073, 1757403, 1708475, 1660820, 1614810, 1570982, 1529886, 1491584, 1455718, 1422128, 1391025, 1362451, 1336072, 1311781, 1290132, 1271814, 1256747, 1243931, 1232026, 1219955, 1207181, 1193841, 1180641, 1168371, 1157362, 1147458, 1138439, 1130365, 1123496, 1117987, 1113716, 1110366, 1107769, 1106182, 1106158, 1108042, 1111631, 1116393, 1122010, 1128636, 1136700, 1146558, 1158337, 1172015, 1187584, 1205118, 1224636, 1245896, 1268470, 1292114, 1317031]
53291A317031K6633K8584L0341L1552L1965L1415L0053K8383K6829K5298K3531
53280A631615K1630J9853J7948J5350J2209R481P563N433J939k495o309q834j0893
53267A714490j3300j5799j7876j9731k1814k4007k5959k7775k9721l1525l2706
53256A454277l3380l4086l4986l5694l5850l5328l4049l2183l0453k9633k9661
53245A088974k9665k9002k7909k7066k6855k7067k7130k6610k5632k4660k3740
53234G93638k2361k0287j8122j6489j5222j3899j2712j2003j1372j0208q929q591
53222F23443r301j0051j0220j0263j0627j0988j0974j0794j0708j0589j0383j0369
53210D98176j0538j0369r669q909q353p614o536n808n981o547o644o221n780n486
$$ y = [1317031, 1343664, 1372248, 1402589, 1434141, 1466106, 1497521, 1527574, 1555957, 1582786, 1608084, 1631615, 1653245, 1673098, 1691046, 1706396, 1718605, 1728086, 1735649, 1741082, 1743021, 1740526, 1734217, 1725383, 1714490, 1701190, 1685391, 1667515, 1647784, 1625970, 1601963, 1576004, 1548229, 1518508, 1486983, 1454277, 1420897, 1386811, 1351825, 1316131, 1280281, 1244953, 1210904, 1178721, 1148268, 1118635, 1088974, 1059309, 1030307, 1002398, 975332, 948477, 921410, 894280, 867670, 842038, 817378, 793638, 771277, 750990, 732868, 716379, 701157, 687258, 674546, 662543, 651171, 640963, 632034, 623443, 614142, 604091, 593871, 583608, 572981, 561993, 551019, 540225, 529517, 518928, 508545, 498176, 487638, 477269, 467600, 458691, 450338, 442724, 436188, 430380, 424399, 417852, 411208, 404987, 399207, 393721]
53196C93721n247n286n790o314o305o009o046o303n997m913l781l251l197l216
53182C22066l253l338l184k526j739j596k305l073k903j752o35m20q75j115p28
53167B92624m6M95P31O24K22j87m19p72j492k005j542n32l51j383k395k281j508
53150B79783j103j156j173j177j414j542j144o29o32q29m13M05N63j78q32o71
53134B67858j42L9j48l94p00j095j246q60j73L95P91J170J447J384R95N41J66
53117B70028j78m45m45j47J51J07k59o06p92j052j548j957j824j228o89n00m99
53100B58117n48p08r29j010j023j178j240o82K74N55l51j538j781r97L0Q59J472
53083B49322J610R23k68j119j261r77n38J30R97J738K087K013J506O34k42o89
$$ y = [393721, 388474, 383188, 377398, 371084, 364779, 358770, 352724, 346421, 340424, 335511, 331730, 328479, 325282, 322066, 318813, 315475, 312291, 309765, 308026, 306430, 304125, 301052, 298149, 296397, 295762, 295342, 294467, 293352, 292624, 292578, 293073, 293804, 294428, 294650, 294463, 294044, 293272, 291780, 289775, 288233, 287701, 287350, 285967, 283572, 281291, 279783, 278680, 277524, 276351, 275174, 273760, 272218, 271074, 270445, 269813, 268984, 268571, 268976, 269539, 269361, 268529, 267858, 267716, 267755, 267607, 267213, 266513, 265418, 264172, 263312, 263139, 263534, 264325, 265495, 266942, 268326, 269321, 269862, 270028, 269850, 269405, 268960, 268813, 268964, 269071, 268812, 268206, 267414, 266362, 264814, 262857, 261033, 259805, 259116, 258616, 258117, 257569, 256861, 255932, 254922, 253899, 252721, 251481, 250799, 251073, 251628, 251277, 249739, 247958, 246961, 246991, 247850, 249322, 250932, 251855, 251587, 250468, 249207, 248230, 247692, 247822, 248819, 250557, 252644, 254657, 256163, 256797, 256555, 255866]
53067B55866o72n10l74j84R4L11L27J05k22k81K60J096J408R41M61O82J160R58
53049B61426P3n82m68M6L66K70j56o16p22m70m38r99j654j739j457j423j521j149
53031B48787m25q8k28k05O3j21q87j240m94N99Q15K4q75j126p03m3L95M91O08
53012B45347J150J868K055J491P33L23K33K66L92M31K1p69j242q92l1O61Q56N94
52994B53487J25r2L15J032J267Q32M26N50P95O33L50N43J112J442J292R35O65
52977B65709O32R50J484J759J530J239J415J874K061J989K171K604K573J663N14
52962B90167J47P65J554J598Q11j73q36j320k004k763l035k563j745j119q55r21
52946B77708j378k163k787k649j670m63J73j10r12j420j080j24P37J026P92L11
$$ y = [255866, 255194, 254684, 254310, 254126, 254220, 254531, 254858, 254963, 254741, 254460, 254720, 255816, 257224, 258165, 258626, 259308, 260468, 261426, 261499, 260917, 260449, 260495, 260861, 261131, 260975, 260359, 259637, 259167, 258729, 257730, 256076, 254337, 252880, 251457, 249936, 248787, 248362, 248274, 248046, 247841, 247904, 247783, 246896, 245656, 245162, 245761, 246576, 246600, 245725, 244599, 243896, 243853, 244248, 244739, 245347, 246497, 248365, 250420, 251911, 252644, 252967, 253200, 253466, 253858, 254289, 254310, 253541, 252299, 251407, 251376, 252037, 252893, 253487, 253612, 253520, 253835, 254867, 256134, 256966, 257392, 257942, 258737, 259370, 259720, 260263, 261375, 262817, 264109, 265044, 265709, 266341, 267291, 268775, 270534, 272064, 273303, 274718, 276592, 278653, 280642, 282813, 285417, 287990, 289653, 290167, 290314, 291079, 292633, 294231, 295042, 294869, 294033, 292713, 290709, 287946, 284911, 282348, 280603, 279484, 278629, 277708, 276330, 274167, 271380, 268731, 267061, 266598, 266771, 266661, 265749, 264329, 263249, 263125, 263862, 264888, 265680, 265991]
52930B65991j54l16mN13O38M9r28j679j811j311m67L10P61R36R32O29M1l54r5
52911B63681M94O40K29n7J59L71J4p52j422j799j882j612j097p51p24n91K1Q31
52893B55753J309J377J320J240R90N14q2n99p44l46K96N70K98o5k00l76q59j322
52875B59074j340r85n09J51R89J459J049J46l00O1O98J025R78Q01P46R77J467
52858B66487J881J856J392P68J78l58q60j334j762j966j760j375j392j975k546
52843B57234k537k140j916j966k021k006k017j889j362n87L0L63N78O80N66L83
52827B41393M21O12O04K82q6k49j82j5J1m18j300k066k047j110L27J733K659K877
52809B43446K695K788L341L584K774J277O8n62j082j660j887j651j482j805k381
$$ y = [265991, 265837, 265521, 265517, 266030, 266668, 266717, 265789, 264110, 262299, 260988, 260521, 260831, 261592, 262528, 263460, 264089, 264130, 263776, 263681, 264175, 264815, 265044, 264987, 265146, 265517, 265531, 264779, 263357, 261558, 259676, 258064, 256967, 256216, 255492, 254901, 254922, 255753, 257062, 258439, 259759, 260999, 261989, 262503, 262421, 261822, 261078, 260732, 261028, 261598, 261896, 261831, 261631, 261255, 260396, 259074, 257734, 256749, 256240, 256391, 257380, 258839, 259888, 260034, 259734, 259795, 260493, 261518, 262496, 263297, 264043, 265020, 266487, 268368, 270224, 271616, 272384, 272562, 272204, 271344, 270010, 268248, 266282, 264522, 263147, 261755, 259780, 257234, 254697, 252557, 250641, 248675, 246654, 244648, 242631, 240742, 239380, 238793, 238823, 239186, 239764, 240444, 241010, 241393, 241814, 242426, 243030, 243312, 243226, 242977, 242795, 242780, 242791, 242373, 241073, 239007, 236960, 235850, 236177, 237910, 240569, 243446, 246141, 248929, 252270, 255854, 258628, 259905, 259973, 259411, 258329, 256669, 254782, 253131, 251649, 249844, 247463]
52794B47463k731k699k395j946j497j149q98q53j336k279k791k014l07J062J454
52779B27084J346J271J176J010J080J380J349P75L32N97J112J058M41k6j9R2j07
52762B39951n61q75p07j23K30k96j375j749p10R12J763J636J394J489J382O01
52746B42962m22r00o22PN29P63P90Q31J059J383J596J696J809J785J224J68o02
52729B54056k98R76K346L065L055K631K085J553J002K25q86k000k487k132j515
52714B61676j342j595j598r75j58K28J29n5j69m46r94j434j337p65j87Q1Q2k1
52696B51120j40j12K89R80J400J111M25R4L23N76M89M56R70J736K021J673J201
52679B64612R06N57K2l26j66J97K00k95r27j251j011k45O22R73O04l4l87m37n04
$$ y = [247463, 244732, 242033, 239638, 237692, 236195, 235046, 234148, 233295, 231959, 229680, 226889, 224875, 224568, 225630, 227084, 228430, 229701, 230877, 231887, 232967, 234347, 235696, 236471, 236803, 237400, 238512, 239570, 240011, 239985, 239966, 240058, 239951, 239390, 238515, 237808, 237685, 237915, 237619, 236244, 234495, 233785, 234697, 236460, 238096, 239490, 240979, 242361, 242962, 242540, 241640, 241018, 241025, 241554, 242317, 243107, 243938, 244997, 246380, 247976, 249672, 251481, 253266, 254490, 254658, 254056, 253758, 254734, 257080, 260145, 263200, 265831, 267916, 269469, 270471, 270696, 269810, 267810, 265323, 263191, 261676, 260334, 258739, 257141, 256166, 256008, 256236, 256365, 256310, 256141, 255695, 254701, 253267, 251930, 251165, 250978, 251059, 251141, 251120, 250980, 250868, 251157, 252137, 253537, 254648, 255073, 255167, 255490, 256066, 256555, 257011, 257981, 259717, 261738, 263411, 264612, 265518, 266075, 266097, 265771, 265605, 265802, 266002, 265707, 264780, 263529, 262518, 262273, 262895, 263868, 264472, 264438, 264051, 263614, 263110]
52660B63110o10m46O5N64Q25J112J770K612L091L088L115L472L548K488M62j306
52644B86960j979j959j935j798j213o83j022j942k252j562p73n69m30L65J569
52629B70777K463K837K845K433J566O24o1p47j744k675k887k362j656j186r79
52614B69248q64n05L78J405J646Q17j13j68L31M06p5m46l93j59J96P96J286J115
52596B74901M81J74M40P82Q42P31M77kl49l4P26J084P64L66L50N52P60R90J011
52577B85046M85k28k54M62R29N24k10o17q49j175j280r16n75p48j085j036q05
52560B77668r14j239j220q40o29q25j092j016m85K86Q07N90k64r67r01l32L2j13
52542B68546n07q02p91m35M2K70J85O6N7M2J32O63J430J599Q53K8l5L30K80j76
$$ y = [263110, 262500, 262054, 262119, 262683, 263508, 264620, 266390, 269002, 272093, 275181, 278296, 281768, 285316, 287804, 288266, 286960, 284981, 283022, 281087, 279289, 278076, 277393, 276371, 274429, 272177, 270615, 269842, 269273, 268843, 269208, 270777, 273240, 276077, 278922, 281355, 282921, 283545, 283484, 282737, 280993, 278318, 275431, 273069, 271413, 270227, 269248, 268384, 267879, 268257, 269662, 271308, 272125, 272012, 271844, 272175, 272581, 272506, 272060, 271667, 271508, 271704, 272500, 273786, 274901, 275382, 275556, 275996, 276778, 277620, 278351, 278828, 278826, 278477, 278443, 279169, 280253, 281017, 281383, 281733, 282285, 283045, 284035, 285046, 285531, 285303, 285049, 285511, 286440, 286964, 286754, 286137, 285288, 284113, 282833, 281917, 281342, 280594, 279509, 278473, 277668, 276754, 275515, 274295, 273455, 272826, 272001, 270909, 269893, 269408, 269694, 270501, 271091, 270827, 269860, 268959, 268627, 268659, 268546, 268039, 267237, 266446, 266011, 266053, 266323, 266508, 266574, 266631, 266673, 266805, 267468, 268898, 270497, 271350, 271378, 271343, 271673, 271953, 271777]
52522B71777l06J32O53R08J057J312J686K162K592K549J846J111J231K249L330
52507B94289L773L520K747J600M00m78j088j820k742l473l758l692l328k574j635
52492B81741j070j110j315j197q33o09n76m16J14Q89J551J799J614J277J125J256
52476B84240J488J570J370R52N67N24R15J474J799J716J406J330J896L023M021
52461C08291M197L631K994K573K002J097L13j19q23k395m274n319n294m955m791
52446B97128m477l731k852k129j401o07j66l66p74p66l79k01n06r20r43n32l9
52429B76339K29K99L62M24K76j67n88n79j37L24M92M63N64Q61J033O76j06o13
52411B80152k00J039K512L951N476O831P429P423P978R686J1304J0992Q490N183
$$ y = [271777, 271471, 271603, 272256, 273164, 274221, 275533, 277219, 279381, 281973, 284522, 286368, 287479, 288710, 290959, 294289, 298062, 301582, 304329, 305929, 306329, 305851, 304763, 302943, 300201, 296728, 292970, 289278, 285950, 283376, 281741, 280671, 279561, 278246, 277049, 276216, 275607, 275031, 274615, 274729, 275618, 277169, 278968, 280582, 281859, 282984, 284240, 285728, 287298, 288668, 289620, 290187, 290711, 291626, 293100, 294899, 296615, 298021, 299351, 301247, 304270, 308291, 312488, 316119, 319113, 321686, 323688, 324785, 325098, 324979, 324156, 321761, 317487, 312168, 306874, 301919, 297128, 292651, 288920, 286068, 283939, 282538, 281931, 281765, 281399, 280625, 279859, 279480, 279279, 278773, 277853, 276910, 276378, 276339, 276568, 276867, 277229, 277653, 277929, 277762, 277174, 276595, 276458, 276782, 277274, 277737, 278301, 279162, 280195, 280871, 280765, 280152, 279952, 280991, 283503, 287454, 292930, 299761, 307190, 314613, 322591, 332277, 343581, 354573, 363063, 368246]
52397C68246K167o66l550o015p515q165q315p961p036n807m602l487k462j640
52383C03192r73j89P09J302J397J361J559J909K251K747L422L844L712L410L483
52368C33136L821L880L507L000K528J996J354O26k95j403k269k437k042j579j118
52353C42705l73M83P68L01j00M04J548K284K023J174N05L85P18J290J985K701
52337C58801L242L371L017K469K350L200M929O750P847Q157Q404R217J0407J1300
52323D43461J1644J1852J2380J3123J3551J3261J2332J1352J1063J1697J2553
52312E78269J2674J2076J1862J2749J3988J4368J4003J4207J5580J7029J7231
52301G34036J6368J5737J5962J6411J6357J5880J5253J4069J1686Q402N425L522
$$ y = [368246, 370413, 369747, 366197, 360182, 352667, 344502, 336187, 328226, 321190, 315383, 310781, 307294, 304832, 303192, 302219, 302030, 302739, 304041, 305438, 306799, 308358, 310267, 312518, 315265, 318687, 322531, 326243, 329653, 333136, 336957, 340837, 344344, 347344, 349872, 351868, 353222, 353848, 353553, 352150, 349881, 347444, 345402, 343823, 342705, 342332, 342815, 343583, 343884, 343784, 344188, 345736, 348020, 350043, 351217, 351722, 352107, 352825, 354115, 356100, 358801, 362043, 365414, 368431, 370900, 373250, 376450, 381379, 388129, 395976, 404133, 412537, 421754, 432161, 443461, 455105, 466957, 479337, 492460, 506011, 519272, 531604, 542956, 554019, 565716, 578269, 590943, 603019, 614881, 627630, 641618, 655986, 669989, 684196, 699776, 716805, 734036, 750404, 766141, 782103, 798514, 814871, 830751, 846004, 860073, 871759, 880161, 885586, 889108]
52289H89108K194N40j469l030l629l598l512l579l819m331n070n533n181m058
52275H45033k738j681r32l60J23O85J563K809M217N580O807P699P938P516P017
52260H91276P151Q048R190J0107J0845J1772J3029J4323J5203J5406J4984J4141
52248A035475J3016J1618R961Q139O228M212K113J54j350k298k945l648m526n402
52234A070747o069o569p165p900q329p923o870o145o426p191p301o498n678n624
52220I75059o010o004n363m407l331k127j070n69n12k47O14J772K694L140L175
52205I56814L033L064L440L870L935L744L797M225M604M656M566M537M621N101
52191A014007O329P848Q472P804O808O277N496L488Q87p39j162j744l392n517
$$ y = [889108, 891302, 891842, 890373, 887343, 883714, 880116, 876604, 873025, 869206, 864875, 859805, 854272, 849091, 845033, 842295, 840614, 839682, 839322, 839445, 840130, 841693, 844502, 848719, 854299, 861106, 868805, 876743, 884259, 891276, 898427, 906475, 915665, 925772, 936617, 948389, 961418, 975741, 990944, 1006350, 1021334, 1035475, 1048491, 1060109, 1070070, 1078209, 1084437, 1088649, 1090762, 1090916, 1089566, 1087268, 1084323, 1080675, 1076149, 1070747, 1064678, 1058109, 1050944, 1043044, 1034715, 1026792, 1019922, 1013777, 1007351, 1000160, 992859, 986361, 980683, 975059, 969049, 963045, 957682, 953275, 949944, 947817, 946747, 946178, 945666, 945419, 946033, 947805, 950499, 953639, 956814, 959847, 962911, 966351, 970221, 974156, 977900, 981697, 985922, 990526, 995182, 999748, 1004285, 1008906, 1014007, 1020336, 1028184, 1036656, 1044460, 1051268, 1057545, 1063041, 1066529, 1067416, 1066677, 1065515, 1063771, 1060379, 1054862]
52177A054862p257q580r609r949r360q361p473o541n419m642m614m655l715j770
52163I62917K93J897L056L678L524K904K513K476K209J460P25L80J35k90n41k28
52147I87108L45O38P01R58J473J941K243K339J814K79j690k810k528j614r60m21
52131I89816O42K143L362M104N032O752R080J1405J3366J5011J6544J8183J9997
52118A115437K1696K2745K2841K2142K1041J9845J8777J7946J7229J6384J5352
52107A331435J4310J3380J2598J2172J2274J2595J2532J2071J1838J2023J1825
52096A469053J0522Q532O738N156L035K0l537p267j0881j3734j5171j5514j5783
52083A421169j6281j6186j4961j3314j2250j1762j1049r658p774n835m229l109
$$ y = [1054862, 1047605, 1039025, 1029416, 1019467, 1010107, 1001746, 994273, 987732, 982313, 977671, 973057, 968402, 964687, 962917, 963210, 965107, 968163, 971841, 975365, 978269, 980782, 983258, 985467, 986927, 987652, 988032, 988167, 987877, 987336, 987108, 987453, 988091, 988792, 989750, 991223, 993164, 995407, 997746, 999560, 999839, 998149, 995339, 992811, 991197, 990237, 989816, 990458, 992601, 995963, 1000067, 1005099, 1011851, 1020931, 1032336, 1045702, 1060713, 1077257, 1095440, 1115437, 1137133, 1159878, 1182719, 1204861, 1225902, 1245747, 1264524, 1282470, 1299699, 1316083, 1331435, 1345745, 1359125, 1371723, 1383895, 1396169, 1408764, 1421296, 1433367, 1445205, 1457228, 1469053, 1479575, 1488107, 1494845, 1500001, 1503036, 1503056, 1499519, 1492252, 1481371, 1467637, 1452466, 1436952, 1421169, 1404888, 1388702, 1373741, 1360427, 1348177, 1336415, 1325366, 1315708, 1307934, 1302099, 1297870, 1294761]
52071A294761k084m32J907L970M938N254N942P162Q170Q620R061J0052J1387J2416
52057A381124J2692J2203J1404J1043J1475J2046J1612R834P411M984K418m61
52045A487785l088m710n431o087p194q532r698j0551j1048j1104j0803j0418j0093
52032A379028r789r565r581r661r334q632q409r301j0618j1045j0367r710r779
52019A253237r767q600o675n349n075n000m464l864l706l752l716m090n508p691
52005A175980r849j1813j3970j6275j8201j9710k1319k2957k3548k2337k0027
51994I75974j8032j6931j6283j5595j4825j4003j3071j2239j2007j2557j3412
51983H17019j4016j4386j4993j6065j7206j7718j7248j6149j5210j4901j4879
$$ y = [1294761, 1292677, 1292245, 1294152, 1298122, 1303060, 1308314, 1314256, 1321418, 1329588, 1338208, 1347269, 1357321, 1368708, 1381124, 1393816, 1406019, 1417423, 1428466, 1439941, 1451987, 1463599, 1473433, 1480844, 1485828, 1488246, 1487785, 1484697, 1479987, 1474556, 1468469, 1461275, 1452743, 1443045, 1432494, 1421446, 1410342, 1399539, 1389121, 1379028, 1369239, 1359674, 1350093, 1340432, 1331098, 1322466, 1314057, 1304756, 1294138, 1283093, 1272726, 1263016, 1253237, 1243470, 1234870, 1228195, 1222846, 1217771, 1212771, 1208307, 1204443, 1200737, 1196985, 1193269, 1189179, 1183671, 1175980, 1166131, 1154318, 1140348, 1124073, 1105872, 1086162, 1064843, 1041886, 1018338, 996001, 975974, 957942, 941011, 924728, 909133, 894308, 880305, 867234, 854995, 842988, 830431, 817019, 803003, 788617, 773624, 757559, 740353, 722635, 705387, 689238, 674028, 659127, 644248]
51972F44248j4355j2925j0862q615o294l763j017J767M349O485P960Q808R296
51959F25082R464Q872P094M399J492j330m245p071q932r137q060o678n501m362
51945F01087l081j716j71J946M730P604R807J1067J1686J2104J2605J3229J3670
51932F94567J3348J1857R390O518L545K88l409p200j0482j3015j5004j6607j7615
51919F56181j7793j7334j6726j6207j5569j4492j2893j0909q767o755n153m009
51907E09574k997j642L31K821N435P646R104R827J0036R732Q646O669M150J554
51893E80886r76l462n588o699o327m643k302J09K593N632R459J3415J6370J7747
51879F16214J7751J6493J3600R166M538J234o74k291m086n359n700n936p045q817
$$ y = [644248, 629893, 616968, 606106, 597491, 591197, 587434, 586417, 588184, 592533, 599018, 606978, 615786, 625082, 634546, 643418, 650512, 654911, 656403, 655073, 650828, 643757, 634825, 625688, 617628, 610950, 605449, 601087, 598006, 596290, 596119, 598065, 602795, 610399, 620206, 631273, 642959, 655063, 667668, 680897, 694567, 707915, 719772, 729162, 735680, 739225, 739513, 736104, 728904, 718422, 705407, 690403, 673796, 656181, 638388, 621054, 604328, 588121, 572552, 558060, 545167, 534258, 525491, 518736, 513583, 509574, 506577, 504935, 505266, 508087, 513522, 521168, 530272, 540099, 550135, 559867, 568513, 575182, 579332, 580886, 579910, 576448, 570860, 564161, 557834, 553191, 550889, 550998, 553591, 559223, 568682, 582097, 598467, 616214, 633965, 650458, 664058, 673224, 677762, 678996, 678322, 676031, 671945, 666586, 660886, 654950, 647905, 639088]
51865F39088j0331j1300j2085j2670j2492j1369r877q521p077n132k910j120j72
51852E34032J53K26J34k67j100k346l831n190o044o376o596o974p171o601n303
51837D76746m061l561l737m001l813k837j082R03K247K618K562K607K427J420
51823D68438j87j503k084k208k074j606j092j148j662j496J63K666M566N110M608
51808D70491L680K683J659M15j218k917l848l516k441j588j298j166q53n18l97
51793D59168m14l64k63k99n89j048j441j565j474j450j710k176k624k919l015
51778D37817k805k140j055J55J127J755K294L061M013M840N516O472P960R546
51764D78556J0610J1056J0986R989P549M102Q28j761m158o595q330q742q344q028
$$ y = [639088, 628757, 617457, 605372, 592702, 580210, 568841, 558964, 550443, 543366, 538234, 535324, 534204, 534032, 534185, 534411, 534545, 534278, 533178, 530832, 527001, 521811, 515767, 509391, 502795, 495821, 488650, 482049, 476746, 472685, 469124, 465387, 461386, 457573, 454736, 453654, 454557, 456804, 459422, 461984, 464591, 467018, 468438, 468251, 466748, 464664, 462456, 460382, 458776, 457684, 456536, 454874, 453378, 453541, 456207, 460773, 465883, 470491, 474171, 476854, 478513, 478928, 477710, 474793, 470945, 467429, 464988, 463400, 462102, 460936, 460083, 459565, 459168, 458754, 458390, 458127, 457828, 457239, 456191, 454750, 453185, 451711, 450261, 448551, 446375, 443751, 440832, 437817, 435012, 432872, 431817, 431972, 433099, 434854, 437148, 440209, 444222, 449062, 454578, 461050, 469010, 478556, 489166, 500222, 511208, 521197, 528746, 532848, 533676, 531915, 527757, 521162, 512832, 504090, 495746, 487718]
51750D87718p942p793p658p624p174n832m152l112k673j894l89J253K671M381
51736D39780O795R369J1178J1901J1833J1301J0457R400Q131O587M972L904L939
51723E49547N014O505P622P624N865K225k397o209p737p026n570m782m774m842
51709E41065m794n136n967o485n971m646l032j118J170L031L300J845k16j775
51695E11271k598k880k573j493J93J892K825K410O92j590l578n001o075o887p166
51680D79442o708n633m186k524q26O23J559J881J736J510J607K129K950M136O002
51665D83698Q566J1256J3333J4259J3626J1248P608L572o18n293r877j2489j1992
51652E26897r619p385n544l010K54K884M096M350L760J450k786p428j0640j1959
$$ y = [487718, 479776, 471983, 464325, 456701, 449527, 443695, 439543, 436431, 433758, 431864, 431475, 432728, 435399, 439780, 446575, 455944, 467122, 479023, 490856, 502157, 512614, 522014, 530145, 536732, 541704, 545608, 549547, 554561, 561066, 568688, 576312, 582177, 584402, 582005, 575796, 568059, 561033, 555463, 550681, 545907, 541065, 536271, 531135, 525168, 518683, 512712, 508066, 505034, 503916, 505086, 508117, 511417, 513262, 513046, 511271, 508673, 505793, 503220, 501727, 501920, 503812, 506637, 509047, 509739, 508149, 504571, 499570, 493495, 486608, 479442, 472734, 467101, 462915, 460391, 459565, 460188, 461747, 463628, 465364, 466874, 468481, 470610, 473560, 477696, 483698, 492264, 503520, 516853, 531112, 544738, 555986, 563594, 567166, 566548, 561255, 551378, 538889, 526897, 517278, 509893, 504349, 501339, 501593, 504477, 508573, 512923, 516683, 518133, 515347, 507919, 497279, 485320]
51638D85320j1970j1256j0239r351q599p595o385n545n072m045k019R9J279J712
51624D06334K195K824L121K976K669K359K180K402K861K778J752M48l41p84j447
51609D32327k241k738l067l571l960l675k794j757n89P57J746J973K225L696O301
51594D24633Q808J0542J1848J2897J3220J2506J0899Q277M442K20k702l573l263
51581E08754k687j543P90L949P001R615J2059J4463J6671J8460J9430J9094J7758
51568F43814J6725J7029J8159J8668J7862J6279J4879J4497J5998K0033K6258
51557H40201L3295L9679M4629M7743M8263M5163L8067K7959J6770O108l629j2879
51545A171369k1829l0017l6858m2117m5717m7576m7900m7211m5786m3393l9902
$$ y = [485320, 473350, 462094, 451855, 442504, 433905, 426310, 419925, 414380, 409308, 405263, 403244, 403343, 404622, 406334, 408529, 411353, 414474, 417450, 420119, 422478, 424658, 427060, 429921, 432699, 434451, 434899, 434558, 433774, 432327, 430086, 427348, 424281, 420710, 416750, 413075, 410281, 408524, 407935, 408692, 410438, 412411, 414636, 418332, 424633, 433441, 443983, 455831, 468728, 481948, 494454, 505353, 513630, 518072, 518292, 515590, 512017, 508754, 506067, 504524, 505314, 509263, 516264, 525879, 537938, 552401, 569072, 587532, 606962, 626056, 643814, 660539, 677568, 695727, 714395, 732257, 748536, 763415, 777912, 793910, 813943, 840201, 873496, 913175, 957804, 1005547, 1053810, 1098973, 1137040, 1164999, 1181769, 1187877, 1184248, 1171369, 1149540, 1119523, 1082665, 1040548, 994831, 947255, 899355, 852144, 806358, 762965, 723063]
51534G23063l5843l1874k8017k3947j9815j6207j3358j1022r133p974p548p331
51522E10994o929o529o320n903m730k993j603j272j852k557k643j968j118r43
51508D63634j773l100m102m472m486m412m162l532k609j713j088p59n72l55q4
51493D26415O4q5m14n61k20O07J686K706L421L750L792L696L543L449L564L725
51477D59138L316J937J72q85r81j049j986l652n385o862p912q091p214n980n245
51462D09321m904m262l324k778k740k567k087j963k437k673j970p91J42J050K521
51447C80538M338N822P049Q685J0789J2729J4353J6163J8022J8587J6698J2947
51435E26720R189O701N290M128K906J815O91j236m452q219j1029j2055j1832j1317
$$ y = [723063, 687220, 655346, 627329, 603382, 583567, 567360, 554002, 542980, 533847, 525873, 518325, 510994, 504065, 497536, 491216, 485313, 480583, 477590, 475987, 474715, 472863, 470306, 467663, 465695, 464577, 463634, 461861, 458761, 454659, 450187, 445701, 441289, 437127, 433595, 430986, 429273, 428185, 427426, 426854, 426499, 426415, 426479, 426394, 425980, 425419, 425199, 425806, 427492, 430198, 433619, 437369, 441161, 444857, 448400, 451849, 455413, 459138, 462454, 464391, 464563, 463678, 462697, 461648, 459662, 456010, 450625, 443763, 435851, 427760, 420546, 414566, 409321, 404417, 400155, 396831, 394053, 391313, 388746, 386659, 384696, 382259, 379586, 377616, 376825, 376967, 378017, 380538, 384876, 390698, 397747, 406432, 417221, 429950, 444303, 460466, 478488, 497075, 513773, 526720, 535909, 542610, 547900, 552028, 554934, 556749, 557440, 556204, 551752, 543533, 532504, 520449, 508617, 497300]
51421D97300j0742r715q106o334m845l760l028k595k384k353k564k908k888j977
51407D33101l22J185J698J161L10j7M05J145J743K277L033L781L946L587L576
51392D60609M432N541O110O389P242Q819J0487J2053J4179J7501K1888K6848L2161
51379F34259L7885M4048N0480N6777O2413O7048P0368P1441O8693O1330N0416
51368A275158L7840K4503J0377l879j6847k8026l8217m7696n5205n9638o1687
51357A036683o2720o2754o0746n6520n1218m5944m0937l6067l1362k6860k2654
51346E38901j9160j6768j5208j3769j2123j0416q627o608m712l573l075k366j217
51333D21279n05q22j357r54J83O88j89j792k944l013k076o68M10O17K21qJ45P3
$$ y = [497300, 486558, 476843, 468737, 462403, 457558, 453798, 450770, 448175, 445791, 443438, 440874, 437966, 435078, 433101, 432779, 433964, 435662, 436823, 437133, 437116, 437521, 438666, 440409, 442686, 445719, 449500, 453446, 457033, 460609, 465041, 470582, 476692, 483081, 490323, 499142, 509629, 521682, 535861, 553362, 575250, 602098, 634259, 672144, 716192, 766672, 823449, 885862, 952910, 1023278, 1094719, 1163412, 1224742, 1275158, 1312998, 1337501, 1347878, 1343999, 1327152, 1299126, 1260909, 1213213, 1158008, 1098370, 1036683, 973963, 911209, 850463, 793943, 742725, 696781, 655844, 619777, 588415, 561555, 538901, 519741, 502973, 487765, 473996, 461873, 451457, 442830, 436222, 431510, 427937, 424862, 422496, 421279, 420774, 419952, 418595, 417641, 417824, 418512, 418323, 416531, 413587, 410574, 408498, 407830, 408240, 408857, 409078, 409070, 409215, 409288]
51315D09288o59j547j823j526j343j561j809j784j677j668j551j097n18j62qK35
51299C90790N67N86j7j030j866k119j928j781j903j935j371k04J098K194L126
51284C84207L942M561N138O075P299Q018P625O528N544M719L437J558k10j230
51270D47211j664k076k667l156l132k419j307l85j5j4j63p36j981l249l471k607
51254D18169j885k154k826k897k428k240k533k667k220j551j132r03n18J18P41
51239C93074J029Q35L54O4K94Q27J064O90o4q19j429j817j734j037j52K19NM6
51221C91449J087K699L653L347K435J881J864J918J743J370P92O4l81r7O64J181
51205D15669J230J315J754K128J947J366Q64N70L47L23P74J512J786J046l37j313
$$ y = [409288, 408629, 407082, 405259, 403733, 402390, 400829, 399020, 397236, 395559, 393891, 392340, 391243, 390725, 390563, 390555, 390790, 391357, 391943, 391926, 390896, 389030, 386911, 384983, 383202, 381299, 379364, 377993, 377789, 378887, 381081, 384207, 388149, 392710, 397848, 403923, 411222, 419240, 426865, 433393, 438937, 443656, 447093, 448651, 448441, 447211, 445547, 443471, 440804, 437648, 434516, 432097, 430790, 430405, 430390, 430376, 430213, 429477, 427496, 424247, 420776, 418169, 416284, 414130, 411304, 408407, 405979, 403739, 401206, 398539, 396319, 394768, 393636, 392733, 392215, 392333, 393074, 394103, 394938, 395292, 395356, 395650, 396477, 397541, 398231, 398167, 397348, 395919, 394102, 392368, 391331, 391179, 391398, 391403, 391449, 392536, 395235, 398888, 402235, 404670, 406551, 408415, 410333, 412076, 413446, 414238, 414302, 413921, 413824, 414488, 415669, 416899, 418214, 419968, 422096, 424043, 425409, 426273, 426843, 427190, 427513, 428287, 429799, 431585, 432631, 432294, 430981]
51189D30981j218m82q2k49k09N99J549J675J186J140J755K036J324K54l34o61
51173D39264j400k438l043k962k642k477k502k618k702k507j889j065k84N56J584
51158D12875K506K915K843K578K184J596J015O99N66M48N30R90J420J211M42k35
51142D34583n16p12j087j612k275l054l525l079j770l88M28P60Q92Q48O52N97
51126D20742R52J610K269K745L059L311L567L631L125K003Q59K97J92Ql26m45
51110D47599k94j38N2N41J117J211Q41O66R25J159J202J556K368K930K739K223
51094D66697J848J275K08o80n67K67J006J595K475L314L204K090R69M60J33m86
51078D83808j135j465j753k380l027k967k005o84K68N73N63Q71J837L127M143
$$ y = [430981, 429763, 429281, 429199, 428950, 428741, 429340, 430889, 432564, 433750, 434890, 436645, 438681, 440005, 440259, 439925, 439264, 437864, 435426, 432383, 429421, 426779, 424302, 421800, 419182, 416480, 413973, 412084, 411019, 410735, 411291, 412875, 415381, 418296, 421139, 423717, 425901, 427497, 428512, 429211, 429777, 430225, 430755, 431745, 433165, 434376, 434818, 434583, 434067, 433355, 432268, 430656, 428381, 425327, 421802, 418723, 416953, 416565, 416993, 417753, 418645, 419493, 420145, 420742, 421694, 423304, 425573, 428318, 431377, 434688, 438255, 441886, 445011, 447014, 447873, 448170, 448362, 448370, 448044, 447599, 447305, 447167, 447219, 447760, 448877, 450088, 450929, 451595, 452520, 453679, 454881, 456437, 458805, 461735, 464474, 466697, 468545, 469820, 470028, 469348, 468781, 469048, 470054, 471649, 474124, 477438, 480642, 482732, 483701, 484161, 484294, 483808, 482673, 481208, 479455, 477075, 474048, 471081, 469076, 468392, 468660, 469233, 469796, 470667, 472504, 475631, 479774]
51063D79774M746N342O255P352Q440R593J0890J2022J2400J1661R969P977O502
51050E92923O105O918Q819J1541J4381J6225J6455J5740J5267J5112J4064J1274
51038G44824P415L791R11j431l196m094m533n734q571j2628j6598j9353k0471
51025F60332k0103j8688j6777j4792j2795j0565p987n388l310j834l24J801M147
51012E53717N642N866N620N792O164N865M814M032M453N922P572Q759R373R580
50998F43171R638R834J0435J1544J3033J4541J5649J6274J6791J7462J7899J7434
50986H13705J6081J4638J3717J3143J2545J2000J1712J1425J0724R637Q450P147
50974I54924N542L894K829K711L585N655R184J3819J8596K2895K6964L1258L5784
$$ y = [479774, 484520, 489862, 496117, 503469, 511909, 521502, 532392, 544414, 556814, 568475, 578444, 586421, 592923, 599028, 605946, 614765, 626306, 640687, 656912, 673367, 689107, 704374, 719486, 733550, 744824, 752239, 756030, 756941, 755510, 752314, 748220, 743687, 737953, 729382, 716754, 700156, 680803, 660332, 640229, 621541, 604764, 589972, 577177, 566612, 558625, 553237, 549927, 548093, 547769, 549570, 553717, 559359, 565225, 570845, 576637, 582801, 588666, 593480, 597512, 601965, 607887, 615459, 624218, 633591, 643171, 652809, 662643, 673078, 684622, 697655, 712196, 727845, 744119, 760910, 778372, 796271, 813705, 829786, 844424, 858141, 871284, 883829, 895829, 907541, 918966, 929690, 939327, 947777, 954924, 960466, 964360, 967189, 969900, 973485, 979140, 988324, 1002143, 1020739, 1043634, 1070598, 1101856, 1137640]
50961A137640M0312M4766M8989N2442N4580N5292N4677N2793M9874M6525M3159
50950A681049L9520L5221L0521K6069K2117J8548J5581J3725J3003J2877J3020
50939A921251J3470J3777J2702R326M046j866p340j1830j5037j7024j8510k0432
50927A882533k3123k6206k9354l2715l6531m0567m4179m6807m8341m9039m9171
50916A456500m8786m7839m6383m4493m2035l8868l5287l1943k9062k6159k2846
50905A042799j9610j7298j6003j4992j3708j2344j1247j0312r227q035p121o736
50893H96166o692o487n683m334l013k251j938j526q02j29K33N86J393K634L816
50878H71973M492M564M331M346N002O095O999P478P917Q582R158R476J0151J1822
$$ y = [1137640, 1177952, 1222718, 1271707, 1324149, 1378729, 1434021, 1488698, 1541491, 1591365, 1637890, 1681049, 1720569, 1755790, 1786311, 1812380, 1834497, 1853045, 1868626, 1882351, 1895354, 1908231, 1921251, 1934721, 1948498, 1961200, 1970526, 1974572, 1972706, 1965366, 1953536, 1938499, 1921475, 1902965, 1882533, 1859410, 1833204, 1803850, 1771135, 1734604, 1694037, 1649858, 1603051, 1554710, 1505671, 1456500, 1407714, 1359875, 1313492, 1268999, 1226964, 1188096, 1152809, 1120866, 1091804, 1065645, 1042799, 1023189, 1005891, 989888, 974896, 961188, 948844, 937597, 927285, 918058, 910023, 902902, 896166, 889474, 882987, 877304, 872970, 869957, 867706, 865768, 864242, 863440, 863311, 863544, 864130, 865523, 868157, 871973, 876465, 881029, 885360, 889706, 894708, 900803, 907802, 915280, 923197, 931779, 940937, 950413, 960564, 972386]
50864I72386J4035J5768J6960J8598K1177K3971K6220K8242L0824L4173L8160
50853A240514M3077M9242N6159O2914O9465P6706Q5054R3639J01246J07601J13279
50842B098896J18717J23615J27177J28626J27510J23798J17554J08576R6594Q2127
50832C253190O6732N1952L7986K3946R583l640j3608j9446k2003k2478k1036j7106
50820C324072j0702l035M126R435J2193J2000Q514J621q208j9898l2244m4676
50808C253198n7407p0654q3813r5694j05474j12923j17726j19278j17475j13141
50798B259613j07141r9614r0566q0805p1352o2242n2829m3222l4473k7102k0429
50787A569838j3809p673k791Q53L708N641O174N427M157K833J349l82k105l635
$$ y = [972386, 986421, 1002189, 1019149, 1037747, 1058924, 1082895, 1109115, 1137357, 1168181, 1202354, 1240514, 1283591, 1332833, 1388992, 1451906, 1521371, 1598077, 1683131, 1776770, 1878016, 1985617, 2098896, 2217613, 2341228, 2468405, 2597031, 2724541, 2848339, 2965893, 3074469, 3171063, 3253190, 3319922, 3371874, 3409860, 3433806, 3443389, 3439749, 3426141, 3406695, 3384692, 3362214, 3341178, 3324072, 3313370, 3310335, 3314461, 3323896, 3336089, 3348089, 3356603, 3358224, 3350016, 3330118, 3297874, 3253198, 3195791, 3125137, 3041324, 2945630, 2840156, 2727233, 2609507, 2490229, 2372754, 2259613, 2152472, 2052858, 1962292, 1881487, 1810135, 1747893, 1695064, 1651842, 1617369, 1590267, 1569838, 1556029, 1548356, 1545565, 1546418, 1550126, 1555767, 1561941, 1567368, 1571525, 1574358, 1575707, 1575325, 1573220, 1569585]
50773A569585n127o767q581j0625j3032j5710j8256k0333k1964k3428k4994k6737
50761A374031k8353k9182k8692k7079k5211k3881k3109k2189k0392j7650j4675
50750A113618j2186j0032p373l894m40K035L804O086R468J3353J6941K0171K3375
50737A174926K6681L0143L4057L8602M3446M8110N2598N7189O1800O5926O9164
50726A702642P1434P2698P2889P2186P0940O9070O5817O0383N2757M3635L3580
50715B388031K2499J0178k841j5094k5016l1826l5594l6571l4760l0303k4061
50704B184642j7465j1550o283r99M465R233J1917J1591Q175K257n282j3635k2374
50691B154692l1432m0536m8832n5261n9296o0959o0278n7236n2338m6678m1086
$$ y = [1569585, 1564458, 1557691, 1549110, 1538485, 1525453, 1509743, 1491487, 1471154, 1449190, 1425762, 1400768, 1374031, 1345678, 1316496, 1287804, 1260725, 1235514, 1211633, 1188524, 1166335, 1145943, 1128293, 1113618, 1101432, 1091400, 1084027, 1080133, 1079693, 1081728, 1085532, 1091618, 1101086, 1114439, 1131380, 1151551, 1174926, 1201607, 1231750, 1265807, 1304409, 1347855, 1395965, 1448563, 1505752, 1567552, 1633478, 1702642, 1774076, 1846774, 1919663, 1991849, 2062789, 2131859, 2197676, 2258059, 2310816, 2354451, 2388031, 2410530, 2420708, 2417867, 2402773, 2377757, 2345931, 2310337, 2273766, 2239006, 2208703, 2184642, 2167177, 2155627, 2149344, 2148345, 2152810, 2162043, 2173960, 2185551, 2193726, 2195983, 2190701, 2177066, 2154692, 2123260, 2082724, 2033892, 1978631, 1919335, 1858376, 1798098, 1740862, 1688524, 1641846, 1600760]
50680A600760l5594k9916k4019j7839j0948l120N068J2762J9868K6935L4094M0519
50668A618570M5057M7080M6815M5164M3045M0577L7057L2167K6953K2961K0577
50657B026023J8842J6898J4827J2982J1322R753Q544P915P632P371P206P501Q642
50644B165458J0920J4361J8505K2790K7202L2023L6982M1291M4625M7294M9259
50633B510710M9890M9090M7759M6685M5749M4757M4012M3359M1643L7869L1824
50622B993347K2426P047j5304m0579o1722p4383p9133p8237p2678o3099n1373
50611B486312l9470k7972j7091q077k093J482L976N028K854l151j1563k0808l0562
50598B338865m0865n0924n9553o6150p0744p3472p4466p3970p2203o9300o5484
$$ y = [1600760, 1565166, 1535250, 1511231, 1493392, 1482444, 1479324, 1484392, 1497154, 1517022, 1543957, 1578051, 1618570, 1663627, 1710707, 1757522, 1802686, 1845731, 1886308, 1923365, 1955532, 1982485, 2005446, 2026023, 2044865, 2061763, 2076590, 2089572, 2100894, 2110647, 2119191, 2127106, 2134738, 2142109, 2149315, 2156816, 2165458, 2176378, 2190739, 2209244, 2232034, 2259236, 2291259, 2328241, 2369532, 2414157, 2461451, 2510710, 2560600, 2609690, 2657449, 2704134, 2749883, 2794640, 2838652, 2882011, 2923654, 2961523, 2993347, 3015773, 3022820, 3007516, 2966937, 2905215, 2830832, 2751699, 2673462, 2600784, 2537685, 2486312, 2446842, 2418870, 2401779, 2393702, 2391609, 2393091, 2397067, 2402095, 2404949, 2401798, 2390235, 2369427, 2338865, 2298000, 2247076, 2187523, 2121373, 2050629, 1977157, 1902691, 1828721, 1756518, 1687218, 1621734]
50587A621734o1055n6142n0791m5270l9895l4607k9228k4137j9976j6644j3289
50576A230700r594o281l915j976J80K077K790K511K458L235M179M601M872N908
50562A241745Q017J0722J3405J5806J8093K0748K4200K8415L2933L7365M1561
50551A493010M5217M7705M8585M8006M6288M3407L9351L4847L1182K9119K8389
50540A935106K8398K9133L1081L4461L8903M3919M9348N5229O1506O8074P5033
50529B450191Q2530R0397R8283J06176J14413J22926J30870J37326J42013J44874
50519C619999J45255J42159J35242J24916J11531R5129P6139N5439L3366R492
50509D548667j6048m1577o4987q5411j03066j17723j28303j33933j34658j30919
$$ y = [1621734, 1560679, 1504537, 1453746, 1408476, 1368581, 1333974, 1304746, 1280609, 1260633, 1243989, 1230700, 1221106, 1214825, 1210910, 1208934, 1209114, 1211191, 1213981, 1216492, 1218950, 1222185, 1226364, 1230965, 1235837, 1241745, 1249762, 1260484, 1273889, 1289695, 1307788, 1328536, 1352736, 1381151, 1414084, 1451449, 1493010, 1538227, 1585932, 1634517, 1682523, 1728811, 1772218, 1811569, 1846416, 1877598, 1906717, 1935106, 1963504, 1992637, 2023718, 2058179, 2097082, 2141001, 2190349, 2245578, 2307084, 2375158, 2450191, 2532721, 2623118, 2721401, 2827577, 2941990, 3064916, 3195786, 3333112, 3475125, 3619999, 3765254, 3907413, 4042655, 4167571, 4279102, 4374231, 4450370, 4505809, 4539175, 4548667, 4532619, 4491042, 4426055, 4340644, 4237578, 4119855, 3991552, 3857619, 3722961, 3592042]
50499C592042j22950j10946r5360p6850n6212l4495j2915P437K5572M0392N0798
50488C206513N5942N5104M7632L3540J4149q437l2427n6471p8905r7813j12081
50477C026746j21813j27551j29674j28762j25818j21605j16243j09733j02508
50468A943039r5113q7824q0805p4164o7589o0541n3175m6475m1046l6345l1591
50457A268371k6856k2564j8519j4278j0120o813m558k877j416j69J013K384L840
50444A167438N079O231P728R556J1145J2051J2278J1958J1253J0584J0400J0702
50432A286403J1182J1740J2384J2770J2510J1878J1516J1530J1522J1546J2192
50421A417173J3641J5381J7214J9729K3456K8176L3417L9110M5339N1988N8917
$$ y = [3592042, 3469092, 3358146, 3262786, 3185936, 3129724, 3095229, 3082314, 3089751, 3115323, 3155715, 3206513, 3262455, 3317559, 3365191, 3398731, 3412880, 3404443, 3372016, 3315545, 3236640, 3138827, 3026746, 2904933, 2777382, 2647708, 2518946, 2393128, 2271523, 2155280, 2045547, 1943039, 1847926, 1760102, 1679297, 1605133, 1537544, 1477003, 1423828, 1377353, 1336307, 1299962, 1268371, 1241515, 1218951, 1200432, 1186154, 1176034, 1169221, 1164663, 1161786, 1160370, 1160201, 1161214, 1163598, 1167438, 1172517, 1178748, 1186476, 1196032, 1207177, 1219228, 1231506, 1243464, 1254717, 1265301, 1275701, 1286403, 1297585, 1309325, 1321709, 1334479, 1346989, 1358867, 1370383, 1381913, 1393435, 1404981, 1417173, 1430814, 1446195, 1463409, 1483138, 1506594, 1534770, 1568187, 1607297, 1652636, 1704624, 1763541]
50410A763541O5935P2301P6948P9645Q1275Q2405Q2321Q0107P6040P1071O5354
50399B596943N8313M9811M0263K9647J7354L224j1964k7207m1896n5574o7604
50388B591310p7396q4530q8569q9183q6579q1459p4367o5472n5070m3860l2441
50377A812384k0984r547J462J1328J9178K4135K5722K4257K0347J3904M330p948
50365A918568k0849l2137m1132m8332n3856n7177n8233n7823n6680n4907n2488
50354A384954m9762m7010m4213m1494l9333l7874l6462l4358l1551k8526k5506
50343I68865k2456j9501j6817j4302j1915r999q751p557n647l352j856j598j753
50330H43361j473q97n00j65N15J508K545L676N135O844Q532J0125J1631J2953
$$ y = [1763541, 1829476, 1901777, 1978725, 2058370, 2139645, 2222050, 2304371, 2384478, 2460518, 2531589, 2596943, 2655256, 2705067, 2745330, 2774977, 2792331, 2795555, 2783591, 2756384, 2714488, 2658914, 2591310, 2513914, 2429384, 2340815, 2251632, 2165053, 2083594, 2009227, 1943755, 1888685, 1844825, 1812384, 1791400, 1781853, 1783315, 1794643, 1813821, 1837956, 1863678, 1887935, 1908282, 1922186, 1926516, 1918568, 1897719, 1865582, 1824450, 1776118, 1722262, 1665085, 1606852, 1549029, 1492349, 1437442, 1384954, 1335192, 1288182, 1243969, 1202475, 1163142, 1125268, 1088806, 1054448, 1022897, 994371, 968865, 946409, 926908, 910091, 895789, 883874, 873875, 865124, 857567, 851920, 848568, 846712, 845114, 843361, 841888, 840991, 840491, 840326, 840841, 842349, 844894, 848570, 853705, 860549, 869081, 879206, 890837, 903790]
50316I03790J4185J5796J8015K0307K1958K2913K3380K2878K0412J5639R375K897
50304A111545k784p063r794j1319j2031j1933j0928r383p855o444n008l932l820
50291A009251m490m987m854m579m542m331l482k154o11J287L475N177N661N081
50277I95902L931K176l18k810m011l453j893l42Q51J892L031M178M829M365K785
50262A011113J036K27N47J319J957K478L037L501L629L344K659J541N5j539k868
50247A032036l619l691l343l081l181l364l132k358j348l34P62K103L690N415
50233A016555P105Q540R612J0589J1971J4066J6747J9765K3074K6717L0424L3500
50221A228665L5208L5339L4312L2730L0865K8699K6288K3905K1815K0194J9176
$$ y = [903790, 917975, 933771, 951786, 972093, 994051, 1016964, 1040344, 1063222, 1083634, 1099273, 1108648, 1111545, 1108761, 1101698, 1091904, 1080585, 1068554, 1056621, 1045693, 1036310, 1028455, 1022011, 1017003, 1013071, 1009251, 1004761, 999774, 994920, 990341, 985799, 981468, 977986, 975832, 975221, 976508, 979983, 985160, 990821, 995902, 999833, 1002009, 1001691, 998881, 994870, 991417, 989524, 989182, 990033, 991925, 994956, 999134, 1003963, 1008328, 1011113, 1012149, 1012376, 1012923, 1014242, 1016199, 1018677, 1021714, 1025215, 1028844, 1032188, 1034847, 1036388, 1036443, 1034904, 1032036, 1028417, 1024726, 1021383, 1018302, 1015121, 1011757, 1008625, 1006267, 1004919, 1004585, 1005347, 1007450, 1011140, 1016555, 1023660, 1032200, 1041812, 1052401, 1064372, 1078438, 1095185, 1114950, 1138024, 1164741, 1195165, 1228665, 1263873, 1299212, 1333524, 1366254, 1397119, 1425818, 1452106, 1476011, 1497826, 1518020, 1537196]
50210A537196J8641J7931J6141J2779P851J337o760j5757k4309l1543l7626m2761
50198A453120m6268m7280m5946m3093l9040l3626k7285k1209j6310j2818j1011
50187A109234j1530j4588j9362k4515k8875l1525l1913l0324k7798k5179k2545
50176H41080j9782j7175j5015j3038j0904q865p476o722o008m992l982l413l303
50163G20405l299k975k074o11J025K295K959L258L684M560N845P214Q293Q837
50149G59416Q803Q276P399O314N085L679K030J87j668l223m083l990l153k142
50135G82930j239n1J862M135N793O335O124N725N325N045N228O003O929P534P987
50120H55665Q798J0045J1421J2946J5024J7722K0494K2931K5471K8989L3883L9876
$$ y = [1537196, 1555837, 1573768, 1589909, 1602688, 1610539, 1611876, 1605116, 1589359, 1565050, 1533507, 1495881, 1453120, 1406852, 1359572, 1313626, 1270533, 1231493, 1197867, 1170582, 1149373, 1133063, 1120245, 1109234, 1097704, 1083116, 1063754, 1039239, 1010364, 978839, 946926, 916602, 888804, 863625, 841080, 821298, 804123, 789108, 776070, 765166, 756301, 748825, 742103, 736095, 731103, 727121, 723708, 720405, 717106, 714131, 712057, 711446, 712471, 714766, 717725, 720983, 724667, 729227, 735072, 742286, 750579, 759416, 768219, 776495, 783894, 790208, 795293, 798972, 801002, 801189, 799521, 796298, 792215, 788225, 785072, 782930, 781691, 781640, 783502, 787637, 793430, 799765, 805889, 811614, 816939, 821984, 827212, 833215, 840144, 847678, 855665, 864463, 874508, 885929, 898875, 913899, 931621, 952115, 975046, 1000517, 1029506, 1063389, 1103265]
50108A103265M6476N3293N9863O5591P0122P3524P5781P6348P4671P1145O7194
50097A837273O4109O2093O0604N9230N7804N5858N2441M6550L7567K5401J0652
50086B369582n439k1527l6708n0337o1598o9817p5161p8428q0014p9659p7239
50075A733655p3180o7871o1407n4246m7483m1840l6959l2297k8279k5711k4445
50064A239937k3473k2294k1353k0939k0550j9573j8084j6536j5171j4028j3216
50053A034720j2734j2304j1677j0950j0316r663q695p376o032n038m477m017l041
50040I28400j054J815M733O768P633P774P897Q421R377J0543J1592J2192J2094
50027A028185J1295J0002Q445O714M856L082J640N15n43j604k519l360m586o373
$$ y = [1103265, 1149741, 1203034, 1262897, 1328488, 1398610, 1472134, 1547915, 1624263, 1698934, 1770079, 1837273, 1901382, 1963475, 2024079, 2083309, 2141113, 2196971, 2249412, 2295962, 2333529, 2358930, 2369582, 2364143, 2342616, 2305908, 2255571, 2193973, 2124156, 2048995, 1970567, 1890553, 1810894, 1733655, 1660475, 1592604, 1531197, 1476951, 1429468, 1387628, 1350669, 1318372, 1290093, 1264382, 1239937, 1216464, 1194170, 1172817, 1151878, 1131328, 1111755, 1093671, 1077135, 1061964, 1047936, 1034720, 1021986, 1009682, 998005, 987055, 976739, 967076, 958381, 951005, 944973, 939935, 935458, 931441, 928400, 927346, 929161, 933894, 940662, 948295, 956069, 963966, 972387, 981764, 992307, 1003899, 1016091, 1028185, 1039480, 1049482, 1057927, 1064641, 1069497, 1072579, 1074219, 1074734, 1074191, 1072587, 1070068, 1066708, 1062122, 1055749]
50013A055749q197r437j0267j1284j2407j2796j2082j1005j0399r982q737o256
50001I32900l146o7L095O861J1233J5454J8733K0918K2346K3256K3719K4227K5769
49988A125298K8852L2664L5766L7558L8500L8826L7852L5004L0946K7023K3887
49977A492176K1280J8996J7389J6809J7086J7681J7888J6738J3160O704k165j2529
49965A641213k3648l4830m5080n3267n8645o1055o0739n8234n4305m9597m4220
49954A097593l7908l0756k3565j7321j2399q500n297k890j512j063j163j626k548
49941I51045l855n047n700o077o925q626j0829j3017j5097j7173j9034k0241k0703
49928G98721k0762k0517j9433j6983j3603j0592q896q224p511o097m177k241m79
$$ y = [1055749, 1047552, 1038115, 1027848, 1016564, 1004157, 991361, 979279, 968274, 957875, 947893, 939156, 932900, 929754, 929687, 932782, 939643, 950876, 966330, 985063, 1005981, 1028327, 1051583, 1075302, 1099529, 1125298, 1154150, 1186814, 1222580, 1260138, 1298638, 1337464, 1375316, 1410320, 1441266, 1468289, 1492176, 1513456, 1532452, 1549841, 1566650, 1583736, 1601417, 1619305, 1636043, 1649203, 1655907, 1653742, 1641213, 1617565, 1582735, 1537655, 1484388, 1425743, 1364688, 1303949, 1245715, 1191410, 1141813, 1097593, 1059685, 1028929, 1005364, 988043, 975644, 967144, 961847, 958957, 957445, 956382, 955219, 953593, 951045, 947190, 942143, 936443, 930366, 923441, 914815, 903986, 890969, 875872, 858699, 839665, 819424, 798721, 777959, 757442, 738009, 721026, 707423, 696831, 687935, 679711, 672200, 666103, 661926, 659685, 659206]
49915F59206J075K200K631K462K127J986K160K779M044N917P966R658J0795J1540
49901G26546J2259J3323J4870J6461J7248J6673J4960J2650R919O786L752J570
49889H67017J52j629m675q583j2222j4956j6754j7482j6940j5629j4670j4637
49877G28992j5017j5109j4863j4423j3417j1514r319p931p523p063n659l561j590
49864F02003p4J177K240L014L690M733O372Q369J0416J2441J4425J6127J7207
49851G02140J7520J7111J6021J4207J1802R211O866M856K938Q86j332l749o519
$$ y = [659206, 660281, 662481, 665112, 667574, 669701, 671687, 673847, 676626, 680670, 686587, 694553, 704211, 715006, 726546, 738805, 752128, 766998, 783459, 800707, 817380, 832340, 844990, 854909, 861695, 865447, 867017, 867169, 865540, 860865, 852282, 840060, 825104, 808350, 790868, 773928, 758299, 743629, 728992, 713975, 698866, 684003, 669580, 656163, 644649, 635330, 627399, 619876, 612813, 607154, 603593, 602003, 601929, 603106, 605346, 608360, 612050, 616783, 623155, 631524, 641940, 654381, 668806, 684933, 702140, 719660, 736771, 752792, 766999, 778801, 788012, 794878, 799734, 802672, 803558, 802226, 798477, 791958]
$$ [...]
##END NTUPLES=NMR SPECTRUM
##END=
