##TITLE=AC1406_BRAA12215_7653149_5PJ1xK5njd
##JCAMPDX= 6.0         $$ Bruker NMR JCAMP-DX V2.0
##DATA TYPE= NMR SPECTRUM
##DATA CLASS= NTUPLES
##ORIGIN= BRUKER
##OWNER= Administrator
$$ 1.72 TOPSPIN		Version 2.1
$$ 2013-04-11 16:44:16.557 -0700  Administrator@X
$$ Compression mode = diff/dup
##.OBSERVE FREQUENCY= 400.02188249412
##.OBSERVE NUCLEUS= ^1H
##.ACQUISITION MODE= SIMULTANEOUS (DQD)
##.ACQUISITION SCHEME= undefined
##.AVERAGES= 8
##.DIGITISER RES= 22
##SPECTROMETER/DATA SYSTEM= spect
##.PULSE SEQUENCE= zg30
##.SOLVENT NAME= COFFEE_meoh
##.SHIFT REFERENCE= INTERNAL, COFFEE_meoh, 1, 14.98509
##AUDIT TRAIL= $$ (NUMBER, WHEN, WHO, WHERE, PROCESS, VERSION, WHAT)
$$ ##TITLE= Audit trail, TOPSPIN		Version 2.1
$$ ##JCAMPDX= 5.01
$$ ##ORIGIN= Bruker BioSpin GmbH
$$ ##OWNER= Administrator
$$ $$ E:\/data/COFFEE/nmr/AC1406_BRAA12215_7653149_5PJ1xK5njd/50/pdata/1/auditp.txt
$$ ##AUDIT TRAIL=  $$ (NUMBER, WHEN, WHO, WHERE, PROCESS, VERSION, WHAT)
(   1,<2013-04-11 16:44:06.927 -0700>,<Administrator>,<X>,<go>,<TOPSPIN 2.1>,
      <created by zg
	started at 2013-04-11 16:43:01.042 -0700,
	POWCHK enabled, PULCHK disabled,
       configuration hash MD5:
       33 CF 6A 21 5C D3 B9 40 6C 15 AA 8D 27 A2 4F 13
       data hash MD5: 64K
       C8 08 D9 F0 CD ED BB D5 0A 83 BB 6D DF 51 99 0B>)
(   2,<2013-04-11 16:44:10.311 -0700>,<Administrator>,<X>,<proc1d>,<TOPSPIN 2.1>,
      <Start of raw data processing
       efp LB = 0 FT_mod = 6 PKNL = 1 PHC0 = 0 PHC1 = 0 SI = 32K 
       data hash MD5: 32K
       EE C3 07 01 17 69 10 BE 25 D3 9B A3 6C FE C7 83>)
(   3,<2013-04-11 16:44:10.766 -0700>,<Administrator>,<X>,<proc1d>,<TOPSPIN 2.1>,
      <pk PHC0 = 98.83301 PHC1 = 0 
       data hash MD5: 32K
       FF 72 26 64 48 E4 88 DB 26 88 C8 29 53 38 72 8A>)
(   4,<2013-04-11 16:44:10.993 -0700>,<Administrator>,<X>,<proc1d>,<TOPSPIN 2.1>,
      <abs ABSG = 1 
       data hash MD5: 32K
       C4 C1 69 8F D9 20 99 93 67 9E 0E ED DB 20 05 46>)
(   5,<2013-04-11 16:44:11.145 -0700>,<Administrator>,<X>,<proc1d>,<TOPSPIN 2.1>,
      <abs ABSG = 2 
       data hash MD5: 32K
       B4 44 55 54 58 0D 51 93 B5 62 E6 94 F2 AA 49 B9>)
(   6,<2013-04-11 16:44:11.281 -0700>,<Administrator>,<X>,<proc1d>,<TOPSPIN 2.1>,
      <abs ABSG = 3 
       data hash MD5: 32K
       5A 15 04 3B EA A1 DB 7E 27 21 B8 D6 17 41 E1 04>)
(   7,<2013-04-11 16:44:11.433 -0700>,<Administrator>,<X>,<proc1d>,<TOPSPIN 2.1>,
      <abs ABSG = 4 
       data hash MD5: 32K
       23 C4 EE A9 13 A8 A4 B9 3F 9E 92 02 05 0E 8F EA>)
(   8,<2013-04-11 16:44:11.584 -0700>,<Administrator>,<X>,<proc1d>,<TOPSPIN 2.1>,
      <abs ABSG = 5 
       data hash MD5: 32K
       EF A8 4A 9D 6C CF 98 E6 EA B8 D1 47 90 45 91 A1>)
$$ ##END=
$$ 
$$ $$ hash MD5
$$ $$ E0 60 39 9A 5E D2 85 FF 63 D7 00 69 55 DD 4D 5F
##$RELAX= 
##$RELAX= 
##$RELAX= 
##$RELAX= 
##$RELAX= 
##$RELAX= 
##$RELAX= 
$$ Bruker specific parameters
$$ --------------------------
##$DU= <E:\>
##$EXPNO= 50
##$NAME= <AC1406_BRAA12215_7653149_5PJ1xK5njd>
$$ [...]
150 150 150 150 150 150 150 150
##$TP07= 0
##$TPNAME0= <>
##$TPNAME1= <>
##$TPNAME2= <>
##$TPNAME3= <>
##$TPNAME4= <>
##$TPNAME5= <>
##$TPNAME6= <>
##$TPNAME7= <>
##$TPOAL= (0..7)
0.5 0.5 0.5 0.5 0.5 0.5 0.5 0.5
##$TPOFFS= (0..7)
0 0 0 0 0 0 0 0
##$TUNHIN= 0
##$TUNHOUT= 0
##$TUNXOUT= 0
##$USERA1= <user>
##$USERA2= <user>
##$USERA3= <user>
##$USERA4= <user>
##$USERA5= <user>
##$V9= 5
##$VALIST= <valist>
##$VCLIST= <CCCCCCCCCCCCCCC>
##$VD= 0
##$VDLIST= <DDDDDDDDDDDDDDD>
##$VPLIST= <PPPPPPPPPPPPPPP>
##$VTLIST= <TTTTTTTTTTTTTTT>
##$WBST= 2048
##$WBSW= 25
##$XGAIN= (0..3)
0 0 0 0
##$XL= 0
##$YL= 0
##$YMAX_a= 609458
##$YMIN_a= -519779
##$ZGOPTNS= <>
##$ZL1= 120
##$ZL2= 120
##$ZL3= 120
##$ZL4= 120
##$ABSF1= 14.98509
##$ABSF2= -5.573092
##$ABSG= 5
##$ABSL= 3
##$ALPHA= 0
##$AQORDER= 0
##$ASSFAC= 0
##$ASSFACI= 0
##$ASSFACX= 0
##$ASSWID= 0
##$AUNMP= <proc_prof1d_extract_pilot.lims>
##$AXLEFT= 0
##$AXNAME= <>
##$AXNUC= <1H>
##$AXRIGHT= 0
##$AXTYPE= 0
##$AXUNIT= <>
##$AZFE= 0.1
##$AZFW= 0.1
##$BCFW= 0
##$BC_mod= 0
##$BYTORDP= 0
##$COROFFS= 0
##$CY= 15
##$DATMOD= 1
##$DC= 0
##$DFILT= <>
##$DTYPP= 0
##$F1P= 0
##$F2P= 0
##$FCOR= 0.5
##$FTSIZE= 32768
##$FT_mod= 6
##$GAMMA= 0
##$GB= 0
##$INTBC= 1
##$INTSCL= 1
##$ISEN= 128
##$LB= 0
##$LEV0= 0
##$LPBIN= 0
##$MAXI= 10000
##$MC2= 0
##$MEAN= 0
##$ME_mod= 0
##$MI= 0
##$NCOEF= 0
##$NC_proc= -8
##$NLEV= 6
##$NOISF1= 0
##$NOISF2= 0
##$NSP= 0
##$NTH_PI= 0
##$NZP= 0
##$OFFSET= 14.98509
##$PC= 1
##$PHC0= 98.83301
##$PHC1= 0
##$PH_mod= 1
##$PKNL= yes
##$PPARMOD= 0
##$PPDIAG= 0
##$PPIPTYP= 0
##$PPMPNUM= 2147483647
##$PPRESOL= 1
##$PSCAL= 4
##$PSIGN= 0
##$PYNMP= <proc.py>
##$REVERSE= no
##$SF= 400.02
##$SI= 32768
##$SIGF1= 0
##$SIGF2= 0
##$SINO= 400
##$SIOLD= 32768
##$SPECTYP= <>
##$SREGLST= <1H.CDCl3>
##$SSB= 0
##$STSI= 32768
##$STSR= 0
##$SW_p= 8223.68421052631
##$SYMM= 0
##$S_DEV= 0
##$TDeff= 65536
##$TDoff= 0
##$TI= <>
##$TILT= no
##$TM1= 0
##$TM2= 0
##$TOPLEV= 0
##$USERP1= <user>
##$USERP2= <user>
##$USERP3= <user>
##$USERP4= <user>
##$USERP5= <user>
##$WDW= 1
##$XDIM= 32768
##$YMAX_p= 460953016
##$YMIN_p= -771215
##$CURPLOT= <Network HP LaserJet P1505>
##$CURPRIN= <$Network HP LaserJet P1505>
##$DFORMAT= <normdp>
##$LAYOUT= <+/1D_H.xwp>
##$LFORMAT= <normlp>
##$PFORMAT= <normpl>
##$SURQMSG= 1
$$ End of Bruker specific parameters
$$ ---------------------------------
##NTUPLES= NMR SPECTRUM
##VAR_NAME=  FREQUENCY,     SPECTRUM/REAL,   SPECTRUM/IMAG
##SYMBOL=    X,             R,               I
##VAR_TYPE=  INDEPENDENT,   DEPENDENT,       DEPENDENT
##VAR_FORM=  AFFN,          ASDF,            ASDF
##VAR_DIM=   32768,         32768,           32768
##UNITS=     HZ,            ARBITRARY UNITS, ARBITRARY UNITS
##FACTOR=    0.250966925370066, 1,           1
##FIRST=     8223.43324360094, -70656,       -180804
##LAST=      0,             147820,          -253001
##MIN=       0,             -771215,         0
##MAX=       8223.43324360094, 460953016,    0
$$ Real data points
##PAGE= N=1
##DATA TABLE= (X++(R..R)), XYDATA
$$ [...]
19558b23184A44085D6159c8014C4980i2770l5127F6817D857c06219J02796B06276
19546a84050A91829D3847d49963g5246B31831r5980J14855b22652B77193a28285
19535E1a3231o8474H6679C0345b7347q9643k3939n6389B46487e5653H5729a53318
19522a74911j0119B17074n4415g5538j60809L2968a6583C4315b53036j36172h8123
19510B45272e3410k3437A08535b85116B68494b666A3023a16052e6677B2947J28001
19499A50948b98046f2296A1221f3217A8899b32174B93513a01910B3781a18214
19488b45077B551J76200e5706b1262j38244L7526k19043J08234B52067a04428
19477a44940a4121A88163a59271B19428R3227F8886a6210m3233j8512J5835j89744
$$ plain form
19558 -223184 144085 46159 -38014 34980 -92770 -127897 66817 4857 -306219 -203423 206276
19546 -184050 191829 43847 -449963 -75246 231831 135851 250706 -222652 277193 -128285
19535 51 -13231 -81705 86679 30345 -27347 -116990 -140929 -197318 246487 -55653 85729 -153318
19522 -174911 -185030 217074 162659 -75538 -236347 -203379 -16583 34315 -253036 -389208 -88123
19510 245272 -53410 -76847 108535 -285116 268494 -2666 13023 -116052 -56677 22947 150948
19499 150948 -298046 -62296 11221 -63217 18899 -232174 293513 -101910 23781 -118214
19488 -245077 2551 178751 -55706 -21262 -159506 -121980 -341023 -232789 252067 -104428
19477 -144940 -14121 188163 -159271 219428 312655 68886 -16210 -59443 -77955 -62120 -251864
19466b51864j06899h6184J6127a3651C0814a304c36C74150E6307R3909a49821
19454i1532d5224k75080A18080a57589G8388h4491k4631j14378B629f6045j80682
19443b46727A76215l1880C2934J57270p4507d2999J0718j45064B22705h940A2782
19431c36750g9563I2841O2594E1981a37787A31153b8067k21772P9014j69766B10047
19419a00137M4001E6585c36661a07716a6463k91915i8275B0132c17090R4003A7626
19407E9274a356D8749a79368m2866A29421D8556i9229c7208l15403a02318D9710
19395a09190p4362G2698b61050A5264d5451H3801a29042f3648L079p4412I1064
19383G8370a09910C64818F135c6820F9854m337h8115F5261d8821k6571B83445
$$ plain form
19466 -251864 -358763 -86184 -70057 -13651 30814 -1304 -336 374150 56307 150216 -149821
19454 -91532 -45224 -320304 118080 -157589 78388 -84491 -109122 -223500 2629 -66045 -246727
19443 -246727 176215 144335 32934 190204 115697 -42999 -32281 -177345 222705 -8940 12782
19431 -336750 -79563 92841 155435 51981 -137787 131153 -28067 -249839 -170825 -340591 210047
19419 -100137 -56136 56585 -336661 -107716 -16463 -308378 -98275 20132 -317090 -223087 17626
19407 59274 -1356 48749 -179368 -222234 129421 48556 -99229 -37208 -352611 -102318 49710
19395 -109190 -183552 72698 -261050 15264 -45451 83801 -129042 -63648 -60569 -134981 91064
19383 78370 -109910 364818 6135 -36820 69854 65517 -88115 65261 -48821 -75392 283445
19371b13545f8147p1642B27210b10566b2076d057A06761b79500E3782b96559N2410
19360b44149A24244b35319C71724c11161A51111f6703J0697D8813a02577H696
19349b50556i8485H8844J8049d1514I9505g3976k89052B15595b94630J8818j35385
19338d11197J35511J13914n521f4075A62995b84380C0964a07756G7005h8103K0441
19327f7662G981Q420J83904E4278C985O0558f0610B7621J16911c79744B08349
19315b9252k7425j74226B45818C1554e5459j354A43283d34610A7137a03293M0577
19304f2716E6299b57756B79683b5380l01665B17564c25194a62153o0479B0215
19293b07417h6229b3115r1507k14982A36129F0865b09785a7688B24436b97415
$$ plain form
19371 -213545 -68147 -139789 227210 -210566 -22076 -4057 106761 -279500 53782 -296559 -244149
19360 -244149 124244 -235319 371724 -311161 151111 -66703 -56006 48813 -102577 8696
19349 -250556 -98485 88844 106893 -41514 99505 -73976 -363028 215595 -294630 -275812 -411197
19338 -411197 -275686 -161772 -167293 -64075 162995 -284380 30964 -107756 77005 -88103 -67662
19327 -67662 7981 16401 200305 54278 3985 64543 -60610 27621 144532 -379744 208349
19315 -29252 -56677 -230903 245818 31554 -55459 -56813 143283 -434610 17137 -103293 -62716
19304 -62716 56299 -257756 279683 -25380 -327045 217564 -325194 -162153 -222632 20215
19293 -207417 -86229 -23115 -114622 -329604 136129 60865 -209785 -17688 224436 -297415
19282A59399A4327J62269d2936k67983A1732b04856B25982c08225B03546p4389
19272A29157a06721c1495A07636f7842k45283G2933f9646l0989o8398H0305a02369
19260a96656A02601i2004C43544q2850e1732j26626M3675B06647j8156b03474
19249e35940a73073B49353b28159B15135A02906g4096B8737K80695F3263a86544
19238E7518B900a30945f860L3A72060g3787l91953b18681K2138d7824n4043A55572
19225i4502j8372k26113c0882k82286J29917A11462a34040B4880f8768j11398
19215a80166c3150A39281d06887a74919I4274A9364K45992C1507K0887b39140
19204D4105a83670j65857b5340m6190p7585G3626a33818j10370a07765c4884j4284
$$ plain form
19282 159399 14327 176596 -42936 -310919 11732 -204856 225982 -308225 203546 129157
19272 129157 -106721 -31495 107636 -67842 -313125 72933 -69646 -100635 -169033 80305 -102369
19260 -196656 102601 -92004 343544 260694 -51732 -178358 -134683 206647 188491 -203474
19249 -535940 -173073 249353 -228159 215135 102906 -74096 28737 309432 63263 -186544
19238 57518 2900 -130945 -6860 -6827 172060 -73787 -465740 -218681 -196543 -47824 -101867 155572
19225 -94502 -112874 -338987 -30882 -313168 -183251 111462 -134040 24880 -68768 -180166
19215 -180166 -33150 139281 -406887 -174919 94274 19364 265356 31507 52394 -239140
19204 44105 -183670 -349527 -25340 -71530 -149115 73626 -133818 -244188 -107765 -34884 -49168
19193d9168B56385b8673j60002A34224a99545R8074C9158c28205i8545A53348
19182g4350A8663a55038j02079O1586j06998a29258L2949a058n666o5144K2788
19171d9080o7347I9335e52217c7980F3576a26681K3602D6445J17737J16937H0883
19159a21460j31973f9597L2292I517a35371H996b46184A4296a32177k56156H7956
19147A27467a99712c9798j08493f211m4403q60F1130N1694R4666p9267B8743K32554
19135B61297a5873A8257a21627k1586p9999R7873c5954j08383j3081P4873j10201
19124a92746f7604l30374J51519c9222l1657A35314J6999a64002A93415P7516
19114B70931H1710c89959J36094H7491c54553a76371h018A81939a65988j31652
$$ plain form
19193 -49168 256385 -28673 -188675 134224 -199545 -101471 39158 -328205 -98545 153348
19182 -74350 18663 -155038 -257117 -195531 -302529 -129258 -96309 -1058 -6724 -71868 -49080
19171 -49080 -116427 99335 -552217 -37980 63576 -126681 -103079 46445 164182 281119 80883
19159 -121460 -253433 -69597 -37305 9517 -135371 8996 -246184 14296 -132177 -388333 87956
19147 127467 -199712 -39798 -148291 -6211 -50614 -51474 61130 112824 207490 128223 28743 261297
19135 261297 -15873 18257 -121627 -143213 -223212 -125339 -35954 -144337 -157418 -82545 -192746
19124 -192746 -67604 -397978 -246459 -39222 -70879 135314 152313 -164002 193415 270931
19114 270931 81710 -389959 -253865 87491 -354553 -176371 -8018 181939 -165988 -297640
19104b97640A47886C094a46255B26660a28803M2488k18785H4252a02186A73120
19093B5753h8006B38697O0477i3264A17554L1658a81728N7003A73538k5434C6991
19081B14572C9800n233i5650G7497J57488i7784I137K2967a08513j42040M6229
19070b04324N9654C9404J51152a43171e3644F488f5509B19686B011Q2823l9866
19059D4968i4775E9679J74377GO7298h3727b7189j50150O8868A40179d7641A18314
19046a26662M9449C16761a04950j10792p105B4420K04553a27410j02408A50498
19035C77683G1907a0243m69052H4499i6921A28502D0517c67956A13182E3225J27066
19024A80291b76338R9333F0692e9586A15807i5176C1665c99925J83483I2837C2769
$$ plain form
19104 -297640 147886 3094 -146255 226660 -128803 -86315 -305100 84252 -102186 173120
19093 25753 -88006 238697 299174 -93264 117554 149212 -181728 -124725 173538 148104 36991
19081 214572 39800 34567 -95650 77497 234985 -97784 9137 32104 -108513 -250553 -204324
19070 -204324 -144670 39404 190556 -143171 -53644 6488 -65509 219686 2011 84834 44968
19059 44968 -94775 59679 234056 7 67305 -83727 -27189 -177339 -108471 140179 -47641 118314
19046 -126662 -77213 316761 -104950 -215742 -222847 24420 228973 -127410 -229818 150498
19035 377683 71907 -10243 -479295 84499 -96921 128502 40517 -367956 113182 53225 180291
19024 180291 -276338 -177005 60692 -59586 115807 -95176 31665 -399925 -216442 92837 32769
19012H741a14229l8457A23781h7429c357A04980f0386H1404a91181A5793f4563
19000a12421A73842g4739B44760a58922f5685q058K4509A85787b28625K8629E2979
18988a72059Q0778c5008n1729B2131c8133E9445B7059O4140g3601m57939d0869
18976B0311J9761a92872F106L03014E7286L4205g9528b3983A19908f6189B06591
18964A43890R0244a49690q3273L0961j20948Q942B17J46500b49547A20718c09285
18952A1491b67886a2623K776p8274A57608a51372j72371J51546E1201g5642A56560
18940a23913c9282J4521j96252O3007M8522j3888L3245j09981A95164D9001h9782
18928B11345f4033q1753r6183K0240A78699d206B29782i9782D4906J2398M9981
$$ plain form
19012 8741 -114229 -152686 123781 -87429 -3357 104980 -60386 81404 -191181 15793 -64563
19000 -112421 173842 -74739 244760 -158922 -65685 -73743 -49234 185787 -228625 -199996 52979
18988 -172059 -91281 -35008 -86737 22131 -38133 59445 27059 91199 -73601 -531540 -40869
18976 20311 40072 -192872 6106 309120 57286 91491 -79528 -23983 119908 -66189 206591
18964 143890 234134 -149690 -232963 -202002 -322950 -314008 217 146717 -249547 120718 -309285
18952 11491 -267886 -12623 -9847 -88121 157608 -151372 -323743 -172197 51201 -75642 156560
18940 -123913 -39282 -24761 -221013 -158006 -109484 -123372 -90127 -200108 195164 49001 -89782
18928 211345 -64033 -145786 -241969 -221729 178699 -4206 229782 -99782 44906 57304 107285
18917A07285j0599a04420n247B7273P9792A7246L14271a16932N6978B52904A8883
18905B5192b44542a13292k16723f5229j29564G257b20292d3067D0276K99897a43690
18893A56343a19446j03433F8818c99765b4844j85226D9994K4290c94873Q1823
18883c13050h6018k65203A22319h8731k08215F8091c13521h7007A1647M3031a76493
18871c4748G9324h7437k72938c3301C6401J04414a44870f9024D5037h9794B54497
18859b88738G2701b92E309J98143b11762K7139A81732b41071C16547c40937j62530
18848e03467E1381P620H087a74320f3994j77349f5353r4316A10605a29530e7374
18836D7559R8539J39234b27183Q6993A51730a41350o3388j764m1180h7304l15128
$$ plain form
18917 107285 96686 -104420 -109667 27273 107065 17246 331517 -116932 -59954 252904 18883
18905 25192 -244542 -113292 -330015 -65229 -194793 7257 -220292 -43067 40276 340173 -143690
18893 156343 -119446 -222879 68818 -399765 -24844 -210070 49994 74284 -394873 -313050
18883 -313050 -86018 -351221 122319 -88731 -296946 68091 -313521 -87007 11647 54678 -176493
18871 -34748 79324 -87437 -360375 -33301 36401 140815 -144870 -69024 45037 -89794 254497
18859 -288738 72701 -292 5309 203452 -211762 -184623 181732 -241071 316547 -340937 -503467
18848 -503467 51381 59001 8087 -174320 -63994 -241343 -65353 -159669 110605 -129530 -57374
18836 47559 146098 285332 -227183 -140190 151730 -141350 -204738 -206502 -247682 -87304 -402432
18825d02432a43525B36945j1542d004H4156a59042p7036g078B3864a18019H5097
18813B7030K10717a4418j33249a9498F6504R7078D066J85157D0034c80795c0530
18801b20536i6356c9137j30617B2707J74441G0763d7909M459A12892b27821J06245
18790a21576m4091j58126A38742a32702C36593a13134a4860A25309R224a15987
18779b91265I3475a11010k65010D2487g5195j8474A70523O8411b04765q9885J43214
18768a51436I0896K9273R6643b2490B964J21290a64973F6366E641c19953a26429
18756G8525a78957h5929k70999J54416d8377k89233i3636k44756a5068k9623o640
18745e1331A47239n6755b31311P1436A9938P4590a27100H5653a5306k91680H533
$$ plain form
18825 -402432 -143525 236945 225403 -4004 84156 -159042 -236078 -7078 23864 -118019 85097
18813 27030 237747 -14418 -147667 -19498 66504 163582 4066 189223 40034 -380795 -30530
18801 -220536 -96356 -39137 -169754 22707 197148 70763 -47909 -43450 112892 -227821 -121576
18790 -121576 -165667 -323793 138742 -132702 336593 -113134 -14860 125309 134533 -115987
18779 -291265 93475 -111010 -376020 42487 -75195 -93669 170523 238934 -204765 -294650 -151436
18768 -151436 90896 120169 216812 -22490 2964 124254 -164973 66366 5641 -319953 -126429
18756 78525 -178957 -85929 -356928 -202512 -48377 -337610 -93636 -338392 -15068 -44691 -51331
18745 -51331 147239 90484 -231311 -159875 19938 94528 -127100 85653 -15306 -306986 8533
18733a12486l00818A29773J0621J3652C4495J17436o8174P4157J837a32676l71163
18722e03839d120j21701C354b43403J00968d9665j95134P0067a9003l99096d8462
18710F1977b17980C9140c4209j57956A56593J37946E87Q4578l1422L3294j5068
18699G1969I669P6227J90813A15847g8772E6201a40288p2617C01032A36911a6045
18687A75759a96420A0721b81468e1748A48922O6159L5786a1198j86744m2416f3647
18675b57425A63482b53818G8438c95369a81311j94509R373a67577B40663c05144
18664b1470A6541a4229C7928K1721a29774k09050N8180B4371M288R9118a26980
18652b74608N2606F3434a15235L705H5659a41840N1768j0720n0020I8491b64463
$$ plain form
18733 -112486 -413304 129773 140394 154046 34495 151931 83757 157914 159751 -132676 -503839
18722 -503839 -4120 -125821 3354 -243403 -142435 -49665 -244799 -174732 -19003 -418099 -48462
18710 61977 -217980 39140 -34209 -192165 156593 294539 587 85165 53743 87037 71969
18699 71969 9669 85896 276709 115847 -78772 56201 -140288 -212905 301032 136911 -16045
18687 175759 -196420 10721 -281468 -51748 148922 215081 250867 -11198 -197942 -240358 -63647
18675 -257425 163482 -253818 78438 -395369 -181311 -375820 -366447 -167577 240663 -305144
18664 -21470 16541 -14229 37928 59649 -129774 -338824 -280644 24371 28659 127777 -126980
18652 -274608 -222002 63434 -115235 -111530 85659 -141840 -90072 -100792 -150812 98491 -264463
18640H168b36925h4573B61161A5934J37804c0278j56567D4216a30162a3551N943
18629g608r2106j40381B0262b5038A46081o7277A344M11214b69434j3545G7288
18617a14526A15528a07241b2179r5292n0646n6579q1784d0522q3091j46619A22279
18605a54791d614B23181a01028l9468D2963a23830B38334K4291a70609d8750p429
18594e6179A31760b1434j37676I7637D0368a36420d9125b4561P336k12355m7400
18583b76980J19698B92018a95002j1333A38592B2451M9185C2296c1720A77851
18572G2621g2113k14205a10266a0452l3340n5539L6951j77979I2997b26026A07011
18560i8160A0332a08226c3376A16145a42158I8935A3602a62354D5855Q3862a3953
$$ plain form
18640 8168 -236925 -84573 261161 15934 153738 -30278 -186845 44216 -130162 -13551 -7608
18629 -7608 -99714 -240095 20262 -25038 146081 78804 1344 412558 -269434 -282979 77288
18617 -114526 115528 -107241 -22179 -117471 -168117 -224696 -306480 -40522 -123613 -270232 122279
18605 -154791 -4614 223181 -101028 -140496 42963 -123830 238334 262625 -170609 -48750 -56179
18594 -56179 131760 -21434 -159110 97637 40368 -136420 -49125 -24561 -17225 -229580 -276980
18583 -276980 -157282 292018 -195002 -206335 138592 22451 71636 32296 -31720 177851
18572 72621 -72113 -286318 -110266 -10452 -43792 -99331 -62380 -240359 92997 -226026 107011
18560 -98160 10332 -108226 -33376 116145 -142158 98935 13602 -162354 45855 129717 -13953
18548d00246B5429i3086A61283a4582k57381g4587k76070B6976L19567a91529
18537a26080j31883i368G2838K65143b92885d4748m4003a7339k19304b0344A08708
18525c33369J64035B9516J72186c000j67142n9265F1971c08567J5577J06983m1277
18514b27284E5215J22333b58168h1439A23249K35503D350b57232B50433b4461
18503i5773q6992m58393C0609g7739k5590A14397i393q8209j59065A03104b53146
18491h5475A13515a10325k0383G9466k8421b55159A87241i1240j75303D9968c61403
18479A1227J9007a70194j53681E52c90384a23765A47229a8998A33962a34724C13538
18467I9538d4184k95274A93788h3373p9647A34224d29285f1550A34278b46917
$$ plain form
18548 -400246 25429 -93086 161283 -14582 -271963 -74587 -350657 26976 346543 -191529
18537 -126080 -257963 -9368 72838 337981 -292885 -44748 -88751 -17339 -236643 -20344 108708
18525 -333369 -169334 29516 201702 -3000 -170142 -229407 61971 -308567 -292990 -186007 -227284
18514 -227284 55215 177548 -258168 -81439 123249 358752 4350 -257232 250433 -24461
18503 -95773 -182765 -641158 30609 -77739 -103329 114397 -9393 -97602 -256667 103104 -253146
18491 -85475 113515 -110325 -130708 79466 51045 -255159 187241 -91240 -266543 49968 -361403
18479 11227 30234 -170194 -323875 552 -390384 -123765 147229 -18998 133962 -134724 313538
18467 99538 -44184 -339458 193788 -83373 -163020 134224 -429285 -61550 134278 -246917
18456a26225B29370q2951N2759N3398h0244J4007j89198J02943p2750O5774A24867
18444A0933a63204H9907a02141N122A1876J4022N1656D539K84689B409d24138
18432b5714B51114b02813f9370F734L1797a3383j7109D5393a79327P4479A76113
18420H3483a2417o0924K1028r9676I832J07043C0464a98372b5828q5906j96893
18409c08627d1132H8292m1420a26579k19155A13905P5183b63697A94439a11290
18398b48365a18754E9779e49249B71836a32999b3033k07592F5303P6587B9102
18387H7333c56039a8008I4332b77976a27566E4874J29742b06230P3524k56667
18377c89373g9973j9049J6232J6667A00224K74968H9764a58032P1332C9571a48461
$$ plain form
18456 -126225 229370 146419 199178 252576 -80244 -66237 -255435 -152492 -225242 -159468 124867
18444 10933 -163204 89907 -102141 -97019 11876 25898 77554 4539 289228 2409 -424138
18432 -25714 251114 -202813 -69370 6734 38531 -13383 -30492 45393 -179327 -104848 176113
18420 83483 -12417 -73341 -52313 -151989 9832 116875 30464 -198372 -25828 -111734 -308627
18409 -308627 -41132 88292 46872 -126579 -345734 113905 189088 -263697 194439 -111290
18398 -248365 -118754 59779 -549249 271836 -132999 -23033 -230625 65303 141890 29102
18387 87333 -356039 -18008 94332 -277976 -127566 54874 184616 -206230 -132706 -389373
18377 -389373 -79973 -99022 -82790 -66123 100224 375192 89764 -158032 -86700 39571 -148461
18365I938N5566J34573C3594L3950a25767A11931a49678q4384d4561E7574B7575
18353b60601c0668A56397J80809b71465c0349j10489o1123l0909A93203C9146
18342e964F9321J08803c1749p410C75024b03349j4933i5198D5521a9222p1001
18331i0223B88568j16397a00159r579D7629c52229A44747c16787A03969l3884
18321G0085a84923B9877a42822k9954k1043g7299K1460A05299B8302b21075B23495
18309D1476d5469j66813g6513H758P2222a16453C32413c0306r7298C01232a22120
18297d4356j79059a03703j10924l6282C3651M6765M9345L1324e9923F2309a06508
18285B53655I0998b38623H6290a04340l47158E00273a46431H5080c39273c5729
$$ plain form
18365 9938 65504 200077 33594 67544 -125767 111931 -149678 -234062 -44561 57574 27575
18353 -260601 -30668 156397 337206 -271465 -30349 -140838 -201961 -232870 193203 39146
18342 -5964 69321 178124 -31749 -39159 375024 -203349 -218282 -95198 45521 -19222 -90223
18331 -90223 288568 172171 -100159 -109738 47629 -352229 144747 -316787 103969 70085
18321 70085 -184923 29877 -142822 -172776 -193819 -77299 -55839 105299 28302 -221075 223495
18309 41476 -45469 -212282 -76513 8758 80980 -116453 332413 -30306 -127604 301232 -122120
18297 -44356 -223415 -103703 -214627 -250909 33651 80416 129761 161085 -59923 62309 -106508
18285 253655 90998 -238623 86290 -104340 -451498 500273 -146431 85080 -339273 -35729
18274A1555M40589B45b17447J8849A19742a7924m36851a9976o983k77818H139
18262d9898k65479a03131j00607d7345l65026a39480j75193B1116a21447A2959
18251h9099l4182A15768B1550c0912B39401e2930A660N6815c18752g7444j23833
18240b01277B1152J31419a32864f3777B14667E2420d68409b20539e1713F8753
18229A44247m380P500c11119B7245f8081p7470D0765j6887b40835r316C9953a1706
18216a73514P5648j11471B31145a67361e0029A91739E691e9541E6475K97643e3406
18204B4353K48305a73225j30356C22447F4772a69714M1599j30169c4161k84448
18194c18609J7324k7I9823a6888k51899K0631d2330E9854a86569d975k80040i9606
$$ plain form
18274 11555 452144 245 -217447 -198598 119742 -17924 -454775 -19976 -26959 -304777 8139
18262 -49898 -315377 -103131 -203738 -47345 -412371 -139480 -314673 21116 -121447 12959
18251 -89099 -123281 115768 21550 -30912 239401 -52930 1660 58475 -318752 -77444 -201277
18240 -201277 21152 152571 -132864 -63777 214667 52420 -468409 -220539 -51713 68753
18229 144247 139867 147367 -311119 27245 -68081 -145551 40765 23878 -240835 -250151 39953 -11706
18216 -173514 -97866 -209337 231145 -167361 -50029 191739 5691 -59541 56475 354118 -53406
18204 24353 272658 -173225 -303581 322447 64772 -169714 -128115 -258284 -34161 -318609
18194 -318609 -301285 -301312 99823 -16888 -268787 -248156 -42330 59854 -186569 -4975 -285015 -99606
18181c66188A3495K22254d5637A23195L8245a6710l39116a10713C1013e7727i573
18169c18208C0637g7244L294E1913k1436b8769r4019G0741J5117e2057D09428
18157a8946A21242a22302m6936A22553Q0476c39373f3644j15215O2674E5433a61384
18145b6179c121j24761j6049B16958L2591g2055A55831F9889f0739j80205A21632
18133f793j77938a3388G2743A2769K8579A0125d8790H8918c2389E0085K80026
18122C30111a21621A9389f6931A12582B1168a57603b258A866c61146N6086A6458
18110C38911a09747M2161d400A59864a84242P2445A16666c0837j93836E2618J409
18099E4027J10466i4047I7749B5233b72763g3949r1064d2715o9612b5685j8939
$$ plain form
18181 -366188 13495 235749 -45637 123195 161440 -16710 -355826 -110713 31013 -57727 -9573
18169 -318208 30637 -77244 -73950 51913 30477 -28769 -122788 70741 85858 -52057 409428
18157 -18946 121242 -122302 -169238 122553 203029 -339373 -63644 -178859 -116185 55433 -161384
18145 -26179 -3121 -127882 -143931 216958 249549 -72055 155831 69889 -60739 -240944 121632
18133 -6793 -184731 -13388 72743 12769 41348 10125 -48790 88918 -32389 50085 330111
18122 330111 -121621 19389 -66931 112582 21168 -157603 -2258 1866 -361146 -305060 16458
18110 338911 -109747 -67586 -4400 159864 -184242 -111797 116666 -30837 -224673 52618 54027
18099 54027 164493 -94047 97749 25233 -272763 -73949 -165013 -42715 -112327 -25685 -44624
18088d4624j03791O2347k225j46947A39193a93673O8792A16053e3714Q02b3795
18076b9230J2140A14487A0954b54827B19925a29561H4546J5532c09664A49512
18065g9148A27422C6626c72551a25424E6041b8521E1592a39018N1690A89176a39594
18053a20216q6780C4157L5053r003I198i8388A00704K55261B2151L52369c38018
18041F9603l3829a14710j6949B10727o0770d06318A27617N3519E7564b23049M0838
18030a82211M6496D1554j5327a15778E1735L7781J21010R2733a76551N2063K7059
18019i7429r6126R204a2553A03970l2149O5207h8368A80704a12725F6989J64715
18008B31704b14485f101A58277F1742f2597D2189a03980B87408l3509q3926j0348
$$ plain form
18088 -44624 -148415 -86068 -88293 -235240 139193 -193673 -124881 116053 -53714 -52912 -23795
18076 -29230 -17090 114487 10954 -254827 219925 -129561 84546 100078 -309664 149512
18065 -79148 127422 36626 -372551 -125424 56041 -28521 51592 -139018 -87328 189176 -139594
18053 -120216 -206996 34157 69210 60207 9198 -98388 100704 355965 22151 374520 -338018
18041 69603 35774 -114710 -131659 210727 149957 -406318 127617 181136 57564 -223049 -182211
18030 -182211 -135715 41554 26227 -115778 51735 89516 210526 303259 -176551 -124488 -97429
18019 -97429 -193555 -184351 -12553 103970 71821 137028 -88368 180704 -112725 66989 231704
18008 231704 -214485 -6101 158277 61742 -62597 42189 -103980 287408 253899 169973 159625
17997A59625F3496a77433j94103a64316A65431A4460L07440l9527c82137A9344
17986a73148A06346L6418E2292A2547J46196d26131J82533R2406B29940b69152
17975d5414k87369J02035g0962C39326h7130B37948G8339a93576a5622j85020
17965b00642J0083j274b4023j50924K0178b3210k68297h6891A8157d4720F7965
17953b94165a05575A40144A192b13731H7996C2365a80993g5250q4300B85895b22674
17941b1004C9883L13313A42865D834K27126b35534j25698a00893L3887B6005a47060
17929h3627B74418a77355B46995i8465d7831L895k7560E1305d2301E5445f1965
17917D0830c14002J43972a4490A85773i0133B05936a99573M359A2947a57973K6617
$$ plain form
17997 159625 63496 -177433 -371536 -164316 165431 14460 321900 282373 -382137 19344
17986 -173148 106346 142764 52292 12547 158743 -426131 -243598 -151192 229940 -269152
17975 -45414 -332783 -230748 -70962 339326 -87130 237948 78339 -193576 -15622 -200642
17965 -200642 -190559 -191833 -24023 -174947 -154769 -23210 -291507 -86891 18157 -44720 67965
17953 -294165 -105575 140144 1192 -213731 87996 32365 -180993 -75250 -159550 285895 -222674
17941 -21004 39883 353196 142865 4834 231960 -235534 -361232 -100893 -67006 26005 -147060
17929 -83627 274418 -177355 246995 -98465 -47831 -43936 -71496 51305 -42301 55445 -61965
17917 40830 -314002 -170030 -14490 185773 -90133 205936 -199573 -195214 12947 -157973 -131356
17906a31356m4666A29591K3515a37470B05202b04619A44367g2564c113A61876
17895A93726a34805G1687N0824J59612b57060B90909l0710d591C23316B5610N8647
17884H4257K49689b19685G2131f8092o5539M9607B4509L5823h0874r420j66582
17873b56876R1716k9324r6252J28650e3121J6593k02153A30881A3124O6447L000
17862H2571M2733K33385c9425A19830b16732Q7919A15550J00353a55646I7387
17851a03851c6029l9307r4017f7130a658B8055J76816I3656c8952j14744I1665
17839h2058b1217j45017K4224j00427b0048j5075A5329c23464H64a97083A09204
17827a158k21004A46660b15159r5808I7225c8649j41247C4321G739b66765n5427
$$ plain form
17906 -131356 -176022 129591 153106 -137470 205202 -204619 144367 -72564 -3113 161876
17895 193726 -134805 71687 122511 282123 -257060 290909 260199 -4591 323316 25610 84257
17884 84257 333946 -219685 72131 -68092 -133631 -84024 24509 60332 -80874 -90294 -256876
17873 -256876 -165160 -194484 -290736 -162086 -53121 -36528 -238681 130881 13124 79571 82571
17862 82571 125304 358689 -39425 119830 -216732 -128813 115550 215903 -155646 97387
17851 -103851 -36029 -75336 -169353 -67130 -1658 28055 204871 93656 -38952 -153696 91665
17839 -82058 -21217 -166234 -142010 -242437 -20048 -35123 15329 -323464 864 -197083 109204
17827 -1158 -222162 146660 -215159 -310967 97225 -38649 -179896 34321 7739 -266765 -322192
17816c22192A84176B0046J66100a27671q3923a7975A03377R6810a62948d5763
17805B54214H2733K09533J20626c5508k1412B9747K75643a65045L520M8470j01910
17794b14965a4289B01737K2655c28241J23128j12340J53500M4636A94285C5811
17783H8561a27446A07084J74837f0027B12507k3530a29269A8709g8504K2850B06220
17771B04503i5904A2378c5812C2627N9734e4457B04662H1296J04701a8157D4430
17759E4350M0356J80046h29F1933R7444b88209C198J35836c9949C81205c31935
17747a29508F4181b13953A55525C1363L48024j59909c37254a53218G7298B7152
17736C4655j7272L2512j9306J89614q5577a17565E5087J15606D9605c32052A39870
$$ plain form
17816 -322192 184176 20046 186146 -127671 -211594 -17975 103377 200187 -162948 -45763
17805 254214 82733 292266 412892 -35508 -56920 29747 305390 -165045 -161525 -113055 -214965
17794 -214965 -14289 201737 224392 -328241 -205113 -317453 -163953 -119317 194285 35811
17783 88561 -127446 107084 281921 -60027 212507 188977 -129269 18709 -78504 -55654 206220
17771 204503 -95904 12378 -35812 32627 92361 -54457 204662 81296 185997 -18157 44430
17759 54350 94706 274752 -829 61933 159377 -288209 3198 139034 -39949 381205 -331935
17747 -129508 64181 -213953 155525 31363 379387 219478 -337254 -153218 77298 27152
17736 34655 17383 49895 30589 220203 134626 -117565 55087 170693 49605 -332052 139870
17724G380g002A43604b8582I5913J28201g0949D06193b34622f1641k55203a02330
17712A31197b52060j6867A09682J72678e8474A56056o6023J22756d05035B20259
17701B9827Q8974E368d5517B62315b65181G0694C1813a05332F90a84149A8779
17689A9664a24270E281k031b72765h6685a7922k16482B84516C9376L15187a93219
17677A37766o5233a79118O4165P107A92534n0876i3726J3871B54073B5665a36352
17665C3997R5954a6029E2416b73035B87486a00469E8899A2969a29815e5851F8927
17653D3202a20898D61308A33832P6859c6423B32067a21047A99526p6978d1489
17642a15825A1170c8706o8691C98278i866L719A7348K0590j7991e423p2339j14229
$$ plain form
17724 7380 -7002 143604 -28582 95913 224114 -70949 406193 -234622 -61641 -316844 -102330
17712 131197 -252060 -268927 109682 282360 -58474 156056 90033 212789 -405035 220259
17701 29827 118801 5368 -45517 262315 -265181 70694 31813 -105332 690 -184149 18779
17689 19664 -124270 5281 3250 -272765 -86685 -17922 -234404 284516 39376 354563 -193219
17677 137766 72533 -179118 -114953 -107846 192534 141658 -93726 -79855 254073 25665 -136352
17665 33997 129951 -16029 52416 -273035 287486 -100469 58899 12969 -129815 -55851 68927
17653 43202 -120898 461308 133832 210691 -36423 232067 -121047 199526 122548 -41489
17642 -115825 11170 -38706 -107397 398278 -9866 -6147 17348 37938 19947 -5423 -77762 -191991
17630a91991b4206j26598H1662b20725A51947a0798j4352j0820o1434I6863K0515
17619A17378H579J41093D2680b40399H3161b93748C36077g1539j78258B93307
17608C06452E5748a29279A81861N3830c3311l3401O475o3190B26841c3216j16358
17597a49574n2463O0306K9934H3078d1983j07195o6196m6168A25442a49207m5210
17586a94417M1721p032K7335E1817a75982o4968A22445a18858G9808c8627C06218
17574B12860a01r948l733N190l619j68329A72388J3362D2619a433C90203I1317
17561a88568Q0535p7575C0564J38182a72374B06100b9638A27824c3609B06866
17550c03517f9486D2629g2423B74951a51759D6811M7616J28981p5268f0290j23123
$$ plain form
17630 -191991 -24206 -150804 81662 -220725 151947 -10798 -25150 -35970 -97404 96863 117378
17619 117378 8579 149672 42680 -240399 83161 -293748 336077 -71539 -249797 293307
17608 306452 55748 -129279 181861 235691 -33311 -66712 -60237 -123427 226841 -33216 -149574
17597 -149574 -202037 -141731 -111797 83078 -41983 -149178 -215374 -261542 125442 -149207 -194417
17586 -194417 -152696 -159728 -132393 51817 -175982 -240950 122445 -118858 79808 -38627 306218
17574 212860 -101 -10049 -13782 -8592 -12211 -180540 172388 185750 42619 -1433 390203 91317
17561 -188568 -108033 -185608 30564 168746 -172374 206100 -29638 127824 -33609 206866
17550 -303517 -69486 42629 -72423 274951 -151759 46811 94427 223408 148140 -60290 -183413
17539a83413Q5729B09703F0296J84691g2185q0913A13997K14608a72F0851N5268
17528A16119l2670O1428g5825O773a0168k3219B48433K96232c8469F211J04248
17517A10459M4859H004J48808J25494b16420C3171A2534J84218b90434A02327
17506b09426a5706A35094J97036d8605J286B48124A15727J9819a30426n0985B82169
17494i1922B38563B1094b52595b5791J1329F8529J98967c1551B51703F8175R2263
17483A60438c7227B45479H03J93632C078a7822j27484f9797j04252b5370n9466
17472h4836D07355A17082E5861o36h8626A65057K45629G1793a0065A45956l5900
17461A10056B5770a75327A70580b85220A4686N0401L19928j13472j25873J1871
$$ plain form
17539 -183413 -97684 209703 60296 244987 -72185 -153098 113997 328605 -172 60851 116119
17528 116119 83449 144877 -75825 -69052 -10168 -33387 248433 544665 -38469 6211 110459
17517 110459 155318 8004 156812 282306 -216420 33171 12534 196752 -290434 102327
17506 -209426 -15706 135094 332130 -48605 -47319 248124 115727 135546 -130426 -181411 282169
17494 -91922 238563 21094 -252595 -25791 -14462 68529 267496 -31551 251703 68175 160438
17483 160438 -37227 245479 803 194435 3078 -17822 -145306 -69797 -174049 -25370 -84836
17472 -84836 407355 117082 55861 55225 -88626 165057 410686 71793 -10065 145956 110056
17461 110056 25770 -175327 170580 -285220 14686 65087 385015 271543 145670 157541
17451A57541J00108j04588K05170K94237A24231c8194C62256j46742d9393B49125
17440B07588I7082K95728j63799k4881J96952A87389m4232A5084N35355e86A91099
17428A97684J01236g5635a7273B37246K24474A91329D9450K70435f845D3925M99726
17417E43651c6101I0780j4646n568K28928q092A36445J06562m0865G5598P331
17406H2929K00817j31595E7881c88482J33086A17071R3850I4973O3994P3027j03680
17395A28314K3817D7732a27149e9979B46277J4926h7363a7909q6007B44066b45228
17383A50248Q2806q5713l1058o983O8684G7562f242B73828D9885M6100J21522
17372B17507I4566b9790m0832A51733B4113K8222K81612G988R1143c9579A18927
$$ plain form
17451 157541 257649 153061 358231 652468 124231 -38194 362256 215514 -49393 249125
17440 207588 97082 392810 229011 204130 401082 187389 143157 15084 550439 -586 191099
17428 197684 298920 -75635 -17273 237246 461720 191329 49450 319885 -6845 43925 543651
17417 543651 -36101 90780 76134 70566 299494 291402 136445 243007 202142 75598 82929
17406 82929 283746 152151 57881 -388482 -255396 117071 210921 94973 158967 231994 128314
17395 128314 152131 47732 -127149 -59979 246277 261203 -87363 -17909 -103916 244066 -245228
17383 150248 233054 147341 116283 109300 177984 77562 -6242 273828 49885 95985 217507
17372 217507 94566 -29790 -70622 151733 24113 52335 333947 7988 99131 -39579 118927
17360B43918r3193C5867K91217A36632j4186B7967P3738e3850j27948C22270p9070
17349B43200H857J97148a52301b9277B96475b8397A31705L7702J65975n9697J55569
17338D31254I7794J14746o6039k1025J7639K6307C5079J75992J68447j30344m7078
17327B02096K07679A17207J24358G172J68590J15869h9438a2003B09339n1336
17317A58003J49153B3273L0251e6209A24245D6208c5546k12557E10995A10060
17306B91791j45081B7817K95231m8724a47762E8904K96271p2491a7169D43710
17295A85443B2380M37144m116A65304J5961k0733h189E6172a38368k9091G6901
17283A29533Q0590m0662K69136Q2691D0897J9249G371K98445j10459G8828L31737
$$ plain form
17360 243918 150725 35867 327084 136632 122446 27967 101705 -53850 -181798 322270 243200
17349 243200 8857 206005 -152301 -29277 296475 -28397 131705 169407 335382 275685 431254
17338 431254 97794 212540 146501 125476 143115 169422 35079 211071 379518 249174 202096
17327 202096 409775 117207 241565 7172 175762 291631 -89438 -12003 209339 158003
17317 158003 307156 23273 53524 -56209 124245 46208 -35546 -248103 510995 110060
17306 291791 146710 27817 323048 274324 -147762 58904 355175 282684 -17169 443710
17295 185443 22380 459524 455408 165304 181265 160532 -8189 56172 -138368 -167459 76901
17283 129533 210123 169461 438597 521288 40897 60146 7371 305816 195357 78828 410565
17272D10565A51100J08732b3584J716A96373J7766q3873d7834B03523J98086j99304
17261B02305I3921K87280j86498a47279A01568e1622F59441B19720I5298j8963
17251G6335K89267j68574I1656J42248M91184D9975J20525n503l3024o5766J13397
17240A79604M5527J58979a04734A02156M4250f8760E9177J16194a31476B05715
17229B39515n5977m1097E6154J61482a00442N658C02511H6554J40943g9848C58650
17217A3834M8104O5950a60814D29598o6306j10891o763J84972A79136E126K74009
17206B79135a12010C35195E9008L48718d6613B65391O5320D4311J26089C1802
17195B72061b2008C55907F6422J67416L7069J24684q6400f5503D82113A60338
$$ plain form
17272 410565 151100 259832 -23584 -21868 196373 214139 130266 -47834 203523 401609 202305
17261 202305 93921 381201 194703 -147279 101568 -51622 659441 219720 95298 76335
17251 76335 365602 197028 91656 233904 725088 49975 170500 164997 131973 66207 179604
17240 179604 225131 384110 -104734 102156 146406 -68760 59177 175371 -131476 205715
17229 239515 183538 142441 56154 217636 -100442 -94784 302511 86554 227497 -79848 358650
17217 13834 61938 127888 -160814 429598 363292 252401 245638 430610 179136 5126 279135
17206 279135 -112010 335195 59008 407726 -46613 265391 330711 44311 170400 31802
17195 272061 -22008 355907 66422 233838 270907 395591 309191 -65503 482113 160338
17184C41130G1716J7994B6874R4942J30402Q0073E3428J49093H2947h2109e796
17172B20049j4250p6734C5083a73045C07964r9988L13157A10161J66333r3029
17162A83465B0204K75339j7580l7621j18898K55579j11202J55214m382j00245
17152C16408o6399o959f0445E7247c8871E06222b804C25658I7358l7015J31845
17141A92188L28326A83654M1732J35067n467o7330j21739N38716l42582A38691
17130D28721j11914L0703j7289J73859J15144f945B22970A06649J68353r3320
17120A81682o7182J90750j0534j13323l0451a08365C18422a4274J345A80444N6008
17109B36452P6020A03964N5850L00588B02145r830M51182A42546N00125l16604
$$ plain form
17184 341130 71716 89710 26874 121816 252218 332291 53428 202521 82947 -82109 -5796
17172 220049 205799 129065 35083 -173045 307964 207976 521133 110161 276494 183465
17162 183465 20204 295543 277963 240342 121444 377023 265821 421035 416653 316408
17152 316408 250009 243050 -60445 57247 -38871 506222 -2804 325658 97358 60343 192188
17141 192188 520514 183654 225386 360453 354986 287656 165917 704633 362051 138691
17130 428721 316807 347510 330221 504080 619224 -6945 222970 106649 275002 181682
17120 181682 114500 305250 294716 181393 150942 -108365 318422 -14274 -12929 180444 236452
17109 236452 312472 103964 159814 460402 202145 192315 643497 142546 642671 326067
17099C26067b06741B4898K49382K89300A18532Q9436L40882a25618B75281q5077
17089A90204J54801J34571L0201j49678J59105k42328J28967L03939A90780K23272
17079D14052J3939K28663C27608P0484I5969N48912l09783M3410q7558M208J1334
17068C06492j31310L38384O1251K1270B91615K87961k06176J65532n5345J85759
17058F69346r9122n8839A85048L14049r1716J94597j48381m0999J73752J49860
17048G36210j12682B20802P05239D62031j42747J65047N5760j378j14430k5884
17038C98399r5639L44396l17823K44686A09154J94404J36457r3321j124N3395
17028C98965Q0149L36311l53306J5505L63120l22284k5073K96570j64649B55164
$$ plain form
17099 326067 -206741 24898 274280 563580 118532 207968 548850 -125618 275281 190204
17089 190204 345005 479576 509777 360099 519204 276876 405843 709782 190780 414052
17079 414052 427991 656654 327608 398092 95969 644881 335098 378508 290950 295158 306492
17068 306492 175182 513566 574817 596087 291615 579576 373400 538932 483587 669346
17058 669346 570224 511385 185048 499097 407381 601978 453597 412598 586350 736210
17048 736210 623528 220802 926041 462031 319284 484331 540091 538713 424283 398399
17038 398399 302760 647156 329333 574019 109154 303558 440015 346694 345570 398965
17028 398965 479114 815425 462119 477624 840744 518460 493387 789957 625308 255164
17017H09039C87350M3990L58799l1562K11541m61405L08205B72957L02603m7151
17007E28409k8807K6485j14465Q2857q0611L16856j3198Q9735o3733n6972P1794
16996G58350k96450K12944O7513k7579j81475O2282K51850l31376L35088m18298
16986D32849O8563N8799J96927j67149L08675j53737k00637K63731l34190J89216
16976F63047k6518K50991k8865k91043K28363j46215q0514L07720j90339M77195
16966A163822l66247L08357q0916q0566m9739J21067k74552R4637l1286O1190
16956H65767k73143L9659K13458J02915l25902L53404l22489K76674k11572K63878
16946I82649J78311k97093K46364j94471N3614K80755l06615M84145k53408l07261
$$ plain form
17017 809039 387350 431340 790139 758577 970118 508713 816918 272957 575560 528409
17007 528409 499602 526087 411622 494479 413868 730724 717526 807261 743528 686556 758350
16996 758350 461900 674844 742357 714778 533303 595585 847435 516059 851147 432849
16986 432849 501412 560211 757138 589989 898664 744927 544290 808021 473831 663047
16976 663047 636529 887520 858655 567612 795975 649760 569246 876966 686627 1163822
16966 1163822 797575 1105932 1025016 944450 894711 1015778 741226 835863 804577 865767
16956 865767 592624 632283 845741 948656 622754 976158 653669 930343 718771 982649
16946 982649 1160960 863867 1110231 915760 969374 1250129 943514 1427659 1174251 866990
16936H66990L98051l12354J13135J89343k42509j18112L19895k72133m1947M10939
16926A311298k09682o9418M13434l50840K06892n8676j1147J71N658K50713J8800
16915A507203n8510N1860k23416o8069P4062r7280J22409J92194j62567n9768
16905A278118J14299J66860j06943K13570m61635N26951k61391j99783K50767
16896A520813k32L16447j65317j87948j43225J21205J45490J99764j95200O7285
16886A679082k41560L35592N2119J64120k04160j23930K60902j22741J85007j61062
16876A823369P1364J30581k38227N13498l67022J73829K58998l9539r5081j18554
16866B113216k07660K52366O4921K26720J23075K51065J86917q31644L67700J84937
$$ plain form
16936 866990 1265041 952687 1065822 1255165 1012656 894544 1214439 942306 900359 1311298
16926 1311298 1101616 1032198 1445632 1094792 1301684 1243008 1231861 1232032 1237690 1488403 1507203
16915 1507203 1448693 1500553 1277137 1209068 1283130 1185850 1308259 1500453 1337886 1278118
16905 1278118 1392417 1559277 1452334 1665904 1204269 1731220 1469829 1270046 1520813
16896 1520813 1520581 1837028 1671711 1483763 1340538 1461743 1607233 1806997 1611797 1679082
16886 1679082 1437522 1773114 1825233 1989353 1785193 1661263 1922165 1799424 1984431 1823369
16876 1823369 1894733 2025314 1787087 2300585 1933563 2107392 2366390 2326851 2231770 2113216
16866 2113216 1905556 2157922 2222843 2449563 2572638 2823703 3010620 2178976 2546676 2731613
16856B731613j32393J76358k4624j30779L96674J25080m9688k04265L6176R1055
16846C015207M6363K7166q9939K97532K4236j19314p9361N48471O3529k35350
16836C498540J12935q665J94080m26247M17061k3657p5906M08765p3092R5671
16826D119485J21098Q1574j15616P2699J82499j01720K49482j78544L81269r0524
16816D721702L78431q7005J99729K09292o6982l6067L78054K94351N8180K6863
16806F076548O7053Q0616J50121l30409N04901O055K61465L36673K08862l87642
16796F974243Q35609j09942K69459P7730N49481j4013J42455L00055L83426Q7349
16786I495852M7846O84863j1927L97358k8026M12965P12694J0060M97917L14293
$$ plain form
16856 2731613 2599220 2775578 2750954 2620175 3016849 3141929 3092241 2887976 2924152 3015207
16846 3015207 3061570 3088736 2998797 3296329 3320565 3201251 3121890 3670361 3733890 3498540
16836 3498540 3611475 3602810 3796890 3370643 3787704 3764047 3688141 4096906 4023814 4119485
16826 4119485 4240583 4322157 4206541 4279240 4461739 4360019 4609501 4430957 4812226 4721702
16816 4721702 5100133 5013128 5212857 5422149 5355167 5319100 5697154 5991505 6049685 6076548
16806 6076548 6143601 6224217 6374338 6043929 6548830 6554885 6816350 7153023 7361885 6974243
16796 6974243 7809852 7699910 7969369 8047099 8596580 8582567 8725022 9025077 9408503 9495852
16786 9495852 9543698 10228561 10216634 10613992 10585966 10998931 11711625 11721685 12219602 12533895
16776A2533895N93760M76877Q4577L16297N29272O51239P28572N60651M07930
16767A6883070P34609L99551N87180Q44344M10748R58778J227221N62138N05586
16758B3113225J169968J293564J424336O87626J114588J416909J058445J556506
16750C2835167J729488J727886J462361J696624K503913J932167K349048K789512
16742D9026166K648729K605669K811378L864012L199718M268807L872126M395344
16734G6691949M600292N140038N253418N960230N791233O678534O596305O919798
16726A23631797P080127P212224P346062P509998P040168O416633N895456N125596
16718A77258061M116262L148131J225258Q33013j044796k196797l343208m582917
$$ plain form
16776 12533895 13127655 13604532 13689109 14005406 14534678 15185917 15914489 16475140 16883070
16767 16883070 17617679 18017230 18604410 19448754 19859502 20818280 22045501 22607639 23113225
16758 23113225 24283193 25576757 27001093 27688719 28803307 30220216 31278661 32835167
16750 32835167 34564655 36292541 37754902 39451526 41955439 43887606 46236654 49026166
16742 49026166 51674895 54280564 57091942 60955954 64155672 68424479 72296605 76691949
16734 76691949 81292241 86432279 91685697 97645927 103437160 110115694 116711999 123631797
16726 123631797 130711924 137924148 145270210 152780208 159820376 166237009 172132465 177258061
16718 177258061 181374323 184522454 185747712 186580725 185535929 183339132 179995924 175413007
16710A75413007n577876o066247o325495p526572p232764p491795p372394p070031
16702A20749833o895371o816253o372001o022724n521648n546179m818100m811697
16694G3945860m362528l872070l964567l007168l749112l057101k857831k416231
16686D6659252k427928k217575k273165j782837j794789k170458j030319j725347
16678C1236834j784112j071630r68614j276400j301452j240090q78057j023023
16670B1693456p86872p62302n97227r41689n81735m16922n95074o94073o36397
16661A5681165p06310m49556l78557p88935r0920r68848L4913l44568j14613p01509
16651A1172262k25531n84725j91974k67497l39169j57360r6139j31049n38287
$$ plain form
16710 175413007 169835131 163768884 157443389 149916817 142684053 135192258 127819864 120749833
16702 120749833 113854462 107038209 100666208 94643484 89121836 83575657 78757557 73945860
16694 73945860 69583332 65711262 61746695 58739527 54990415 51933314 49075483 46659252
16686 46659252 44231324 42013749 39740584 37957747 36162958 33992500 32962181 31236834
16678 31236834 29452722 28381092 27412478 26136078 24834626 23594536 22716479 21693456
16670 21693456 20906584 20144282 19547055 18605366 18023631 17606709 17011635 16317562 15681165
16661 15681165 14974855 14525299 14146742 13357807 13266887 12298039 12332952 11988384 11873771 11172262
16651 11172262 10946731 10362006 10170032 9902535 9563366 9406006 9309867 9178818 8640531
16642H640531j13372n33513R1762m13991k55349J06951m19192j32186J6741j67424
16632F820958l97802k68161j08118J35910l89731L42268n58779r3551J43374k91547
16622E334821j71540L7952k31000p548l1828k21524j98164K00796l68978j58575
16612D184412o7011j36485P1049J23468n88791K23990j5049k15856J68998k72314
16602C476411j41321K16669Q7854r5743m03555L52902m01717o2852q4345J08404
16592C052707l18473K00370l05243q1351N04172n20955M16685m37040J11103r3808
16582B528167K00187r7986l57306M8127J89294m76480M2608Q0939J99565l7223
16572B319892n74626M39857k65750R6710p2707J03626j02373j43678J43225l70155
$$ plain form
16642 8640531 8527159 7993646 8085408 7671417 7416068 7523019 7103827 6971641 6988382 6820958
16632 6820958 6423156 6154995 6046877 6182787 5793056 6135324 5576545 5482994 5626368 5334821
16622 5334821 5163281 5201233 4970233 4962685 4930857 4709333 4511169 4711965 4342987 4184412
16612 4184412 4117401 3980916 4051965 4175433 3586642 3810632 3795583 3579727 3748725 3476411
16602 3476411 3335090 3551759 3639613 3543870 3140315 3493217 3091500 3028648 2944303 3052707
16592 3052707 2734234 2934604 2629361 2548010 3052182 2531227 2947912 2510872 2621975 2528167
16582 2528167 2728354 2630368 2273062 2321189 2510483 2034003 2076611 2157550 2357115 2319892
16572 2319892 1745266 2185123 1919373 2016083 1943376 2047002 1944629 1800951 1944176 1574021
16562A574021J88387j93976M32586k61826J1588K2019m1199j79304J03878K11430
16552A867604l82109L5562J44775K49277j47723J20256m11173r9636L45544l24009
16542A398368M7961J36260p4564j22220J08837r7769o7095n3864J00845p6502
16532A300257M4274J03330k9136P69k35602R4089j26319R3373j85464j64965L71305
16521A265911l35158K16983j19500K6210o5243J35902l04119J19812P2317j2581
16511A000534L4668K11958J1423n73435K41480J00790j98067Q2903k43362K73115
16501I42007j07220n1862L50395l76161L9464j20371J63303J61342k34928Q2629
16491H48598J40224k64433k80977K28805K46378Q6647p4964j84896j56167Q2897
$$ plain form
16562 1574021 1762408 1568432 2001018 1739192 1750780 1772799 1731600 1552296 1656174 1867604
16552 1867604 1485495 1521057 1665832 1915109 1767386 1887642 1476469 1376833 1722377 1398368
16542 1398368 1446329 1582589 1508025 1385805 1494642 1396873 1329778 1275914 1376759 1300257
16532 1300257 1344531 1447861 1418725 1419494 1183892 1277981 1151662 1245035 1059571 894606 1265911
16521 1265911 930753 1147736 1028236 1054446 989203 1125105 820986 940798 1013115 1000534
16511 1000534 1035202 1247160 1258583 685148 926628 1027418 829351 912254 668892 942007
16501 942007 834787 782925 1133320 757159 796623 676252 839555 1000897 765969 848598
16491 848598 988822 724389 443412 672217 918595 1005242 930278 745382 589215 672112
16481F72112K38365l98282A79817M90619l6999P7910p964j04451K14461o8318
16471G45075r9153j17848j5612J10309J23534K810k20372K13443k91649O19901
16461A070438C93807L87112k36516J77293j27251J59470j79116o9493J66264B86212
16450F09432j42392j07038j15338M20285o3760j63981K77336C09827m302L34452
16440F39977j03507j90923J46964j40603M9554K64169k32669L3097L52711l93474
16430D25296n1906L55857k35978A43550J61551P0762J28677k22317M94743k76186
16420E00780M587A43685K02289J45250K46416j69529B08152K52954m806j66586
16410B89714N8332L86528k57639A59104o922L60188M3012k07779K8062j00881
$$ plain form
16481 672112 910477 512195 179817 670436 633437 711347 703383 598932 813393 745075
16471 745075 645922 528074 512462 622771 746305 749115 528743 742186 450537 1070438
16461 1070438 393807 780919 544403 721696 594445 753915 574799 505306 671570 286212
16450 609432 467040 360002 244664 664949 601189 437208 714544 309827 305525 639977
16440 639977 536470 345547 492511 351908 401462 665631 432962 466059 818770 425296
16430 425296 373390 729247 493269 143550 305101 375863 504540 282223 776966 500780
16420 500780 505367 143685 345974 491224 737640 568111 208152 461106 456300 289714
16410 289714 348046 734574 476935 159104 152182 512370 555382 347603 375665 274784
16400B74784L33821O8673B92201K26095K29182C21265M0957j2308A73820l8426
16390A35394J475J00366J02381b2443D55452j43526J6521p3684M2870j20803q723
16379A68107L04188M8867j64366A41529K12870D5743J31824K35208Q4725k24641
16369B72859M223o3463N609J14613P178K8154A4235M42418j52259r6898r0229
16358A17267K43592g3693A34208J16496K08891a01612E48861A90666K81941O1881
16348E34488B15103J75653j78473E7776K28440A29773a02637B76381J21541m1173
16338C56749J8062A86686k1835G2562Q4491N8788p9316K36698j12591j476A06419
16326B63539J4442A899J88704C1776J45931Q2341G7422j0565P5695J06400n3676
$$ plain form
16400 274784 608605 677278 292201 518296 747478 321265 362222 349914 173820 135394
16390 135394 136869 237235 339616 -22443 455452 311926 328447 254763 297633 176830 168107
16379 168107 472295 521162 356796 141529 354399 45743 177567 412775 497500 272859
16369 272859 277082 213619 219228 333841 341019 369173 14235 456653 304394 207496 117267
16358 117267 360859 -73693 134208 250704 459595 -101612 548861 190666 472607 534488
16348 534488 215103 390756 212283 57776 286216 129773 -102637 276381 397922 356749
16338 356749 374811 186686 164851 72562 157053 215841 136525 373223 260632 259156 106419
16326 263539 277981 1899 190603 31776 177707 260048 77422 66857 142552 248952 195276
16315A95276K64478j35034M5890d5122i553D33319A29255J26422J80210i895A89052
16303A07998L2227L85941A82463r166J45213k6098r8460K61420k15828A09876
16292C85084b08869C60756m5247e0800C68795j77542K11572G8045b8364A14908
16281C9009d1475B86862J12155j73000h2874B59569R6952B796b88675C32036A36304
16269F7781a48577C37901H7167J81016I2202A0280M71349E839J59402G6158J04271
16258A80429M2210I0605b23077A45954E1403a31976A67606J51204a99141D81690
16247A49107c49545E1526d3781A47795h107B29457A04967g3148j02982C52312
16236H1883E170J85996H8796M3987n1475J50425A9370J01294N7077G8901a7864
$$ plain form
16315 195276 459754 324720 370610 -45122 -9553 433319 129255 255677 435887 -9895 189052
16303 107998 140225 526166 182463 173297 318510 292412 193952 455372 239544 109876
16292 385084 -208869 360756 315509 -50800 368795 191253 402825 78045 -28364 114908
16281 39009 -41475 286862 399017 226017 -82874 259569 356521 2796 -288675 332036 136304
16269 67781 -148577 337901 87167 268183 92202 10280 481629 5839 165241 76158 180429
16258 180429 222639 90605 -223077 145954 51403 -131976 167606 318810 -199141 481690
16247 149107 -349545 51526 -43781 147795 -8107 229457 104967 -73148 -176130 352312
16236 81883 5170 191166 88796 132783 81308 231733 19370 120664 177741 78901 -17864
16224D4323i410j18315B37858o8416d9139A85637J0354K21098a6682m5427A73334
16212A63964a53323B20159r1609m7660g1136c5262j6678j4712A06924a276j49740
16201a51016A92450f2024B58811a02115A81804a09645A61127K77169H2052A1099
16190B96769a90246P1323A5673a3694H0024Q3937J38013o1788A05644b89095h3393
16178c4645A12356P9755k1202l2663a46848A09970O8432f6216H0098e0291B32857
16166C63915A07853c3311B3088L1689J29046b75314A64749J27662b03754R0236
16156a13518A43009e9337B2096a33779J2269B22725b03666A03204J0256b41024
16145g0726E3100h8448j36517A45289a69896d1837B4224J23282E7085J15649a87525
$$ plain form
16224 44323 -9410 -127725 237858 169442 -49139 185637 195991 417089 -16682 -62109 173334
16212 163964 -153323 220159 128550 80890 -71136 -35262 -51940 -66652 106924 -1276 -151016
16201 -151016 192450 -62024 258811 -102115 181804 -109645 161127 438296 82052 11099
16190 296769 -190246 -118923 15673 -13694 80024 163961 301974 240186 105644 -289095 -83393
16178 -34645 112356 192111 170909 138246 -146848 109970 178402 -66216 80098 -50291 232857
16166 363915 107853 -33311 23088 54777 183823 -275314 164749 292411 -203754 -113518
16156 -113518 143009 -59337 22096 -133779 -121510 222725 -203666 103204 113460 -241024
16145 -70726 53100 -88448 -224965 145289 -169896 -41837 24224 147506 57085 172734 -187525
16133B41867H7748K57103A06745K69050a27272N5515D4836J4296e5748j85851
16123b41599A6175O0168J4445J4858b01399j3083q976O5962B54854b51655f7989
16111H998a92977b623l53445B45004b13423O6531J556E2017A7885a35033A29730
16099E8541J04519E6922K3065g0755O857p8803A14527c68617A17160j9498e7838
16087A28275l410B4184a9411B6019J05571l0093R7141H1339A9672b29572O9321
16076a60251b9930n5020B38g0044C49097r5208H3064p500J5740a70924A86644
16064I84a949l48398A50950b57314B47293i7624j52375h8965J3813B29848a37649
16052G0079h2605A79093e8804k42328g3407k62404J65781C01961A8002b12818
$$ plain form
16133 241867 87748 344851 106745 375795 -127272 -71757 44836 59132 -55748 -241599
16123 -241599 16175 76343 90788 105646 -201399 -214482 -223458 -157496 254854 -251655 -67989
16111 8998 -192977 -2623 -356068 245004 -213423 -146892 -145336 52017 17885 -135033 129730
16099 58541 163060 56922 79987 -70755 -63898 -142701 114527 -368617 117160 97662 -57838
16087 128275 124865 24184 -19411 26019 131590 101497 198638 81339 19672 -229572 -160251
16076 -160251 -29930 -84950 238 -70044 349097 253889 83064 75564 91304 -170924 186644
16064 984 -1949 -350347 150950 -257314 247293 -97624 -249999 -88965 -75152 229848 -137649
16052 70079 -82605 179093 -58804 -301132 -73407 -335811 -170030 301961 18002 -212818
16041b10204A67241b5230A944c689j03985C0450a57801D1209g4744l2515j3689
16030a20948E9014b77392B5191b39425e9578A67385Q6684d4898j22562G87K89280
16019B90067A08901K1172b06513d2398l1306j78552H6621a8146C01063a79365
16008A69093e7071J907j2024A65548A2197e8362j44312R1391A38902d795j4386
15997a9181B13485l8030b81361a23959D6203d08177g6697E1833Q3291b27889B7226
15985A73417a11540l2601B67586K00581j89269l5031b49835C30638o4077d2361
15974a03489B18780n3621d2255k41441O5203A49802b24996A46467J87474h9408
15963A29678a64098H2866K7381l359a64313F1171b33119p4874I8934K7812b08188
$$ plain form
16041 -210204 167241 -25230 1944 -3689 -107674 30450 -157801 41209 -74744 -107259 -120948
16030 -120948 59014 -277392 25191 -239425 -59578 167385 254069 -44898 -167460 787 290067
16019 290067 108901 130073 -206513 -42398 -73704 -252256 86621 -18146 301063 -179365
16008 169093 -57071 -55164 -67188 165548 12197 -58362 -202674 -111283 138902 -4795 -19181
15997 -19181 213485 175455 -281361 -123959 46203 -408177 -76697 51833 135124 -227889 27226
15985 173417 -111540 -144141 267586 468167 278898 243867 -249835 330638 266561 -42361
15974 -103489 218780 165159 -42255 -283696 -218493 149802 -224996 146467 333941 -89408
15963 129678 -164098 82866 110247 106888 -164313 61171 -233119 -307993 98934 126746 -208188
15951c36841j43645K21475A55243K0674e3526j55502C13864j37082i3963j75848
15941b69811G3237a0577A41577a31650M7061m410j53741C1326K61476c3377q7526
15930a20903q724A60449E5473c07509D5249h1279l084b478A11176a31482o8663
15919b00145K3855Q6355A74797a2954A47101e5249A61969c6246j16074B9184J07978
15908A37162O5391k3833f3018B833M7426a30666A2893L53996a19456C85116c9265
15896e091A25554b76126g1079J1833A59613R876a75367C06339j22022b99923a3474
15884A7369L15030c938o4907k72717d620j41167L1905j9697e0994o8900k8041
15873a47935a0791A35500F25J33572C3374J70083B9402J4919J32970b03357j10429
$$ plain form
15951 -336841 -480486 -259011 155243 175917 -53526 -209028 313864 176782 -93963 -269811
15941 -269811 73237 -10577 141577 -131650 -84589 -88999 -242740 31326 292802 -33377 -120903
15930 -120903 -129627 160449 55473 -307509 45249 -81279 -84363 -2478 111176 -131482 -200145
15919 -200145 -176290 -89935 174797 -12954 147101 -55249 161969 -36246 -152320 29184 137162
15908 137162 202553 178720 -63018 2833 50259 -130666 12893 366889 -119456 385116 -39265
15896 -5091 125554 -276126 -71079 -59246 159613 169489 -175367 306339 184317 -299923 -13474
15884 17369 332399 -3938 -68845 -341562 -4620 -145787 -113882 -133579 -50994 -119894 -147935
15873 -147935 -10791 135500 625 134197 33374 203457 29402 44321 177291 -203357 -313786
15862c13786d9011c407o5792a4197j35751j91104C01661h4564A64799J70829e5030
15850g0081A94216a39380B6355e7858A06274b92331b7028M331k65806L7404b0269
15838A50213b52718L5147A3690K52185F4502b51459A44044a1088j75195A81683
15827E0387O040i7049j26321A02523e6014C4905f9785A32538J8052f2048m62564
15816e24612d800r4860l8412a182l5726A30780N244b99705A02380c93265a26324
15804H1030b23730a07695D5457a51698B89782c0384r4840l29626J45646D45772
15793A36048M7924m114a52334e06B6769f0888B5185b41460a3638l00035d3982
15781A42590a7060H9930R6409c09384B2750a81009A14114d27740B08777a12975
$$ plain form
15862 -313786 -49011 -3407 -69199 -14197 -149948 -341052 301661 -84564 164799 335628 -55030
15850 -70081 194216 -139380 26355 -57858 106274 -292331 -27028 -22697 -288503 -251099 -20269
15838 150213 -252718 -217571 13690 265875 64502 -251459 144044 -11088 -186283 181683
15827 50387 56427 -97049 -223370 102523 -56014 34905 -69785 132538 150590 -62048 -524612
15816 -524612 -4800 -99660 -138072 -1182 -36908 130780 136024 -299705 102380 -393265 -126324
15804 81030 -223730 -107695 45457 -151698 289782 -30384 -125224 -454850 -309204 445772
15793 136048 183972 179858 -152334 -506 26769 -60888 25185 -241460 -13638 -313673 -43982
15781 142590 -17060 89930 186339 -309384 22750 -181009 114114 -427740 208777 -112975
15770E8801b46047L1207C8347i8284A21478c70304A569g1145A09015b10946J03336
15759a07610A89420G2803a24078A35758e8036C23705h3588H7130c13260A57884
15748A34142m942a82791a4036E97611C9947A9196b6165B43150b09366C536b32578
15736F3075J47979G2667a72840j25208b7194j16347N4011a0069B09654f9811p3441
15725a43252A22078j0362l5881M9551a78641q786B1806c6928q4180I1087J26798
15714B17885b13968A63880H0358I265d6890r3683k1484B6839g8305L3465l0233
15703g5073A11888c39564J61303B57845A15936O4406o6346E2106b35044D76879
15692c50108A13641J1819l5255a05949A76788m2176a77421L9640C219K8127J35883
$$ plain form
15770 58801 -246047 -214840 38347 -98284 121478 -370304 1569 -71145 109015 -210946 -107610
15759 -107610 189420 72803 -124078 135758 -58036 323705 -83588 87130 -313260 157884
15748 134142 129200 -182791 -14036 597611 39947 19196 -26165 243150 -209366 3536 -232578
15736 63075 211054 72667 -172840 -298048 -27194 -143541 -89530 -10069 209654 -69811 -143252
15725 -143252 122078 111716 75835 125386 -178641 -187427 21806 -36928 -121108 91087 217885
15714 217885 -213968 163880 80358 9265 -46890 -140573 -162057 26839 -78305 -44840 -75073
15703 -75073 111888 -339564 -178261 257845 115936 180342 113996 52106 -235044 476879
15692 -350108 113641 125460 90205 -105949 176788 134612 -177421 -137781 3219 31346 167229
15681A67229n2523b8675A51940f0854g382j79913I8351g9991D4062g3191A21339
15669C1718e3985A90272b34359B01602a23703a1523j8596G1484K6698P7552a39024
15657i6851k22967I3278b19718A83279A2674i3381j4795A77070p5079l77J63683
15646B65297B9867L47368j65747D857a44537c3968o4086c134r4326j21554G2520
15634a31934C7197L1841d07601b8103A5964J34431q999J06750H8897b2251n33651
15623e55902B82012j27622a85121Q4693a2387j26965A02391a16029i351A02639
15612C2304a5188A62161a346k38146n3297O5368A29249a62176A90779m518A7853
15600b02631B7257c7950g174m4985K0592I900a64274K7071r7309N4841A08846
$$ plain form
15681 167229 114706 -28675 151940 -60854 -7382 -187295 98351 -79991 44062 -73191 121339
15669 31718 -53985 190272 -234359 201602 -123703 -11523 -30119 71484 98182 175734 -139024
15657 -96851 -319818 93278 -219718 183279 12674 -93381 -108176 177070 101991 101614 265297
15646 265297 29867 377235 211488 4857 -144537 -33968 -98054 -3134 -97460 -219014 72520
15634 -131934 37197 69038 -407601 -28103 15964 150395 141396 248146 88897 -22251 -555902
15623 -555902 282012 154390 -185121 -100428 -12387 -139352 102391 -116029 -9351 102639
15612 32304 -15188 162161 -1346 -239492 -292789 -227421 129249 -162176 190779 186261 17853
15600 -202631 27257 -37950 -7174 -52159 -31567 9900 -164274 -137203 -234512 -179671 108846
15588a44247l6524D83090I209M3451g0096I682a91183F8574h7341B28679b4581
15576E5550K7910b74820A66382o6748k0255l6453J74099J831A5471J85183B3560
15564A48409j2799b12348J7629D1757a97131H9323b23698a075k27094e4588A39549
15552C4640b00657B4546a78925d9228j69459A38874a23095A83667i5820A48746
15541b5414B46202j09764a73345A71808C4823q79O5657a77537p008n0156N4635
15530a80066H3704e7685A11489K66989g3273E3026A5133a38861k2345G1058M7303
15519A18361c9959D7700K00405a35825A10532e4489m0882M6965a5586m19594A35269
15507C10478A5110b03020R7386r0774n5326A08258a88430A6493a29108n730j14791
$$ plain form
15588 -144247 -180771 483090 9209 52660 -70096 9682 -191183 68574 -87341 228679 -24581
15576 55550 83460 -274820 166382 99634 79379 42926 217025 218856 15471 200654 23560
15564 148409 135610 -212348 -194719 41757 -197131 89323 -223698 -1075 -228169 -54588 139549
15552 34640 -200657 24546 -178925 -49228 -218687 138874 -123095 183667 -95820 148746
15541 -25414 246202 136438 -173345 171808 34823 33944 99601 -177537 -184545 -234701 -180066
15530 -180066 83704 -57685 111489 378478 -73273 53026 15133 -138861 -161206 71058 118361
15519 118361 -39959 47700 248105 -135825 110532 -54489 -95371 -48406 -15586 -435180 135269
15507 310478 15110 -203020 -105634 -196408 -251734 108258 -188430 16493 -129108 -134838 -249629
15496b49629B06835I37b00911j64405B30182G6365j385a69842A80595c6058j98259
15485b34317i2804F0038K3571A6373b4849l01277B6753Q8430a34790l15331D4348
15473I121h7874q3095A07391k2048h8355I4865a09456j82881A62218l4382A0968
15461a90794I6591A0612K03350b27537G0763l1633J85365b96446H5998d69378
15450a92112A10106b29438A58267a69626c202l03537A31589b86254h1714j16983
15440a98697e8351j41814A15201b77880a26788c59C6823d1132B07311G3533b63513
15428B07090F9818J64807a76840c4157F1061B2656a69092r4975A66243a23371
15417b11485A56771o5700Q8182R835d0709I8418M0667n4782b40990B53776a14839
$$ plain form
15496 -249629 206835 937 -200911 -365316 230182 76365 74980 -169842 180595 -36058 -234317
15485 -234317 -92804 60038 83609 16373 -24849 -326126 26753 115183 -134790 -450121 44348
15473 9121 -87874 -170969 107391 85343 -88355 94865 -109456 -292337 162218 127836 10968
15461 -190794 96591 10612 213962 -227537 70763 39130 224495 -296446 85998 -469378
15450 -192112 110106 -229438 158267 -169626 -3202 -306739 131589 -286254 -81714 -198697
15440 -198697 -58351 -200165 115201 -277880 -126788 -359 36823 -41132 207311 73533 -263513
15428 207090 69818 234625 -176840 -34157 61061 22656 -169092 -264067 166243 -123371
15417 -211485 156771 91071 179253 189088 -40709 98418 139085 84303 -240990 253776 -114839
15405h4340n0015p8308c5379a3632p4492G7703d2270B17455a00574m0314J4731
15394a26157N8054A47999a91475P5652B96873E4389A2224b58281b0566j12668
15384a33234A35173c96823A68699m1565G280b24330h1604d0721j03333I1787h6845
15372B15413c88785a4310a092j74868c9358k37783e9246G1600i8535E534b5973
15360A81740K55689j56195j35878b00576B11345q9788b01690C6910a93533i6729
15349C55073b05865A06625d8932A85347k4248J06200e485o937C22154a88266O8594
15338a19672I67g7543a1763j26426l7222A0304b83304D0819K26383a4868p2878
15327h7746A83891n2847a10063A71105J79426j27055J33138c8705A70461o574
$$ plain form
15405 -84340 -134355 -212663 -35379 -13632 -88124 77703 -42270 217455 -100574 -140888 -126157
15394 -126157 -68103 147999 -191475 -115823 296873 54389 12224 -258281 -20566 -133234
15384 -133234 135173 -396823 168699 127134 7280 -224330 -81604 -40721 -144054 91787 -86845
15372 215413 -388785 -14310 -1092 -175960 -39358 -277141 -59246 71600 -98535 5534 -25973
15360 181740 437429 281234 145356 -200576 211345 121557 -201690 36910 -193533 -96729
15349 355073 -205865 106625 -48932 185347 161099 267299 -5485 -12422 322154 -188266 -119672
15338 -119672 967 -77543 -11763 -138189 -175411 10304 -283304 40819 267202 -14868 -87746
15327 -87746 183891 131044 -110063 171105 350531 223476 356614 -38705 170461 163887
15317A63887e671j12891M55k2840A11604f1433r8260C04275G9197e2690I7623
15305F2329J16426H6685A0589D037L27340B6492i0649c7748I1330a2931H219L02905
15293C11124q4220N659k6245b7229l9319j94219A20577n7340J62162a13701c9104
15281C57093a80523F4182k2897a33250A98383I7724h3359B10686p7954j5967b82953
15269B31973d567j6523q4896A46837E2706c1693A26913k3408J14889q2951d5647
15257D50145a45183A59739K37512d5650l74H492K80372a14972G34802Q53176k29651
15246A358327j63702M94696n29466C75973j80899q7551m7221L86372B3266J38005
15236A61271d8382A16611c46499D6375J81975b02522j55868A35589c1348q6277
$$ plain form
15317 163887 -5671 -118562 -118107 -140947 111604 -61433 -159693 304275 79197 -52690 97623
15305 62329 178755 86685 10589 4037 331377 26492 -90649 -37748 91330 -12931 8219 311124
15293 311124 226904 232563 206318 -27229 -66548 -260767 120577 63237 225399 -113701 -39104
15281 357093 -180523 64182 41285 -133250 198383 97724 -83359 210686 132732 116765 -282953
15269 231973 -4567 -21090 -105986 146837 52706 -31693 126913 103505 218394 135443 -45647
15257 450145 -145183 159739 397251 -45650 -46024 8492 288864 -114972 734802 1587978 1358327
15246 1358327 1194625 1689321 1159855 375973 195074 107523 60302 446674 23266 161271
15236 161271 -48382 116611 -346499 46375 228350 -202522 -358390 135589 -31348 -117625
15226a17625j25659B30434q3392b1504j6224B9269a2610k5543j55376J1644j10640
15215b92525B1573a1474A06941d9825j93578A12095P6342j4494I325K69852A1459
15203e7142B00493K0631a9855q0874d3703I5920j3206J27036p3250c8483A6118
15191b08219i6905k0125N4599j10552b9144a2036k65116a1945H6427c608o78p34
15179e020C67447j15174a47050b244C39299i450j38862A83856O667M6529H5892
15167b54059J22648l6595b3315j71126A4438K70116j3080C8097K4267h8188L7782
15156e0406A98439k4295a19021b6991A07590J40757b23029B81726k4533b98613
15145a73500C71155B9771c9087D4147J20488a25572D08707a35467B5775K58745
$$ plain form
15226 -117625 -243284 230434 147042 -21504 -37728 29269 -12610 -38153 -193529 -181885 -292525
15215 -292525 21573 -11474 106941 -49825 -243403 112095 188437 173943 9325 279177 11459
15203 -57142 200493 221124 -19855 -100729 -43703 95920 82714 209750 136500 -38483 16118
15191 -208219 -96905 -117030 -62431 -172983 -29144 -12036 -277152 -11945 86427 -3608 -4286 -5020
15179 -5020 367447 252273 -147050 -2244 339299 -9450 -148312 183856 190523 237052 85892
15167 -254059 -131411 -168006 -23315 -194441 14438 284554 271474 38097 62364 -88188 -50406
15156 -50406 198439 174144 -119021 -26991 107590 248347 -223029 281726 257193 -298613
15145 -173500 371155 29771 -39087 44147 164635 -125572 408707 -135467 25775 284520
15135B84520a79397B90321a4453C88599A13724m2936D268c3555j28021a7339C67084
15123G7843B3073J54352h1640A96903j2689M12543A43409E6268M76305F7329M1764
15112A09093n0864M52355j41997G3564K79321H7596a29808A81219o3711K3729
15102A41237B4506R2966J13727n8441a22761J7700I5390Q2519C0214c5467B76207
15090C6969J15628h8765C58101A8175L3148J98884j02509o0479b275A68972n9804
15079A09168a3672C94625L2862h4420A46763P8370e8764F4129a94727A81370r746
15068A71624m3069L1845b13952F5021K4998O6463b6148K719B45050j16801b7992
15056B92949A00949K50537I4275Q0052K99831D6102a7758B3032J67434I5059a17254
$$ plain form
15135 284520 -179397 290321 -14453 388599 113724 70788 4268 -33555 -161576 -17339 367084
15123 77843 23073 177425 -81640 196903 184214 596757 143409 56268 532573 67329 109093
15112 109093 58229 510584 368587 73564 352885 87596 -129808 181219 117508 141237
15102 141237 24506 117472 231199 172758 -122761 -105061 95390 177909 30214 -35467 276207
15090 36969 152597 -88765 358101 18175 51323 250207 147698 87219 -2275 168972 109168
15079 109168 -13672 394625 427487 -84420 146763 225133 -58764 64129 -194727 181370 171624
15068 171624 128555 160400 -213952 65021 90019 156482 -26148 -23429 245050 128249 -27992
15056 292949 100949 351486 94275 174327 474158 46102 -17758 23032 190466 95059 -117254
15044B73221d2883G4473Q241g5553A20380O4476o2153R6762M656N2848a6530A08985
15031A63252J21890A40874Q2910L7965A9072M93223A87713q1422R2647E4027k77
15020E3750L39218A9149Q8575J26555m3960L2253I9779J66722h4464o5600B89394
15008d4642A84865N6778J83493d0679B35526l174R6996H2890M38582j48604j77349
14997A95519J15637j32212g1393L0921o5322D5311Q1920J7478N842J74251j40886
14986A83916N3771J522A08308L99630j69619G8785J2389l7022K04860j018o546
14975B51448K5247A14513N0797K14203j29698J75544E6288c3208H9487M98562
14965E88049A78146A7025J23548K19123a90717b5805D49771E3884K97825m2029
$$ plain form
15044 273221 -42883 74473 82714 -75553 120380 184856 122703 219465 224121 276969 -16530 108985
15031 163252 285142 140874 223784 261749 19072 512295 187713 106291 198938 54027 53750
15020 53750 392968 19149 107724 234279 190319 222572 99779 266501 -84464 -150064 289394
15008 -44642 184865 241643 425136 -40679 235526 232352 329348 82890 521472 372868 195519
14997 195519 311156 178944 -71393 -40472 -105794 45311 127231 144709 150551 324802 183916
14986 183916 237687 239209 108308 507938 338319 78785 91174 54152 259012 257994 251448
14975 251448 276695 114513 165310 379513 249815 425359 56288 -33208 89487 588049
14965 588049 178146 17025 140573 359696 -190717 -25805 449771 53884 351709 309680
14955C09680c5540C40458o6778o2147p2137J78334A31857L42637B01642R1026
14945B92668M30992I9372K00740e3282I4480K05579k6415m9974q4383P3953G9239
14933B60788k3346K45393G866J63816J4616J71519G7214R9884J18800p917p801
14922B80180M8565K02431p4178A76558J69919j72265K55966E1535M47547k4792
14912D74290k23545I9967J67082j6810j11053J62220D662M25334C5925M11924
14902D47849G9204K70988r680j02807D9287J75246f3075A96658J36841B0302L56160
14891C76462j41238o9533p0363Q0948G4326J41433J99473M3111j98245m6616K30061
14880D43543o25I9241K0433L50726L9386n6802C3376N56810k80060r5464D1780
$$ plain form
14955 309680 -35540 340458 273680 211533 139396 317730 131857 474494 201642 292668
14945 292668 723660 99372 300112 -53282 94480 300059 273644 223670 139287 213240 79239
14933 260788 237442 482835 7866 171682 186298 357817 77214 177098 295898 287981 280180
14922 280180 328745 531176 456998 176558 346477 174212 430178 51535 499082 474290
14912 474290 250745 99967 267049 250239 139186 301406 4662 429996 35925 447849
14902 447849 79204 350192 340512 237705 49287 224533 -63075 196658 333499 20302 376462
14891 376462 235224 165691 95328 176276 74326 215759 415232 458343 260098 213482 443543
14880 443543 442918 99241 119674 470400 509786 452984 33376 590186 310126 214662 41780
14868C4469K26260A2538K14573J50790K6258o2047J32531m9710A92211J54183
14858C46394k298j12003N0205l2406H1920J99112J68776R7576q3712m3463L8014
14847D58223j6018F2567K4523N13418J32928a81945F08195B28640R2029Q170M6178
14836C75017k9336J40514j01948J38177k10196J94641j36246j08612J50969q4350
14826C28630L15610k86791J14180p0454J83011p937k11835L7201J31866B52372
14815D32355R7091k48203J86355B08336K23117o3817J16762p4987K17787k28718
14805C98480M3328J99906k26891k621J50781k53691o6376K08562m4155A83202
14794E67389j83112K18230k99500K22902J7041j6251P4791M2689k1185r4482j75959
$$ plain form
14868 34469 260729 12538 227111 377901 404159 342112 474643 424933 192211 346394
14858 346394 344096 232093 282298 249892 81920 281032 449808 547384 463672 420209 458223
14847 458223 442205 62567 87090 600508 733436 -181945 608195 228640 320669 328839 375017
14836 375017 345681 486195 384247 522424 312228 506869 370623 262011 412980 328630
14826 328630 644240 357449 471629 401175 584186 576249 364414 401615 533481 252372
14815 432355 529446 281243 467598 208336 431453 367636 484398 409411 627198 398480
14805 398480 441808 641714 414823 412202 562983 309292 242916 451478 407323 183202
14794 567389 384277 602507 303007 525909 542950 526699 601490 644179 622994 528512 352553
14783C52553K94409k13608O2054K09990r5989n9126Q6545p7789q1320j58254N5933
14772C75398J06554K77844k07960k22030K53770m1384j2848K09905j00474k27987
14762D10788l5790K16585j77667j62658N5223L24189l9931j88148K3468j0159
14752D15900K43771p0606J53654k99173J11425p2828j07171J13376J02241L31639
14742I22228j99797r7699J1166o1382j09016J9747L05446j06905q4702R8656j24667
14731E73075J77547K3276o7506B75554M16352k09676K16578J19430l34917O0371
14721E43692J10671j2589R8946j42920R8453K37331l33413O2908R0667m1536R3363
14710H05573k24721J25898J63402k62914K86672o1819k7494j12580J68374k06654
$$ plain form
14783 352553 646962 433354 495408 705398 609409 550283 636828 559039 477719 319465 375398
14772 375398 481952 759796 551836 329806 583576 542192 529344 739249 638775 410788
14762 410788 374998 591583 413916 251258 306481 630670 590739 402591 426059 415900
14752 415900 659671 589065 742719 443546 554971 482143 374972 488348 590589 922228
14742 922228 722431 624732 635898 574516 465500 485247 790693 683788 599086 697742 573075
14731 573075 750622 773898 706392 275554 691906 482230 698808 818238 483321 543692
14721 543692 654363 641774 740720 597800 696253 933584 600171 663079 753746 712210 805573
14710 805573 580852 706750 870152 607238 893910 832091 804597 692017 860391 653737
14700F53737J42592k53480J85045J99627o9903q5709J19911p0892j3615M0076
14690H47389k03347L03659j17693j55846K15274j26410l25672J59871M53371k31879
14680H18717J10135o2138K11088k01845k94784L23231k93702K34682k20865L02592
14670I27111M0226r0211n1407K37111k1721j9275O7341j29572k25848K88381K6262
14659A048398O7170L11913m80610J83511J89899l55866L21960j70312J82470J11690
14649A410223m79361J29889Q9131j40865J3862J70996l42646K07627L8717k88546
14639H09027J52628J67312K62010n46859J63294M22784k46730j01362r2448J43374
14629A133030l6957J670J68370L9313k50181J14687O3340j02016N7962K00193
$$ plain form
14700 653737 796329 542849 727894 927521 857618 771909 891820 820928 807313 847389
14690 847389 644042 947701 830008 674162 889436 763026 437354 597225 1050596 818717
14680 818717 928852 866714 1077802 875957 581173 904404 610702 845384 624519 927111
14670 927111 967337 877126 825719 1062830 1041109 1021834 1089175 959603 733755 1022136 1048398
14659 1048398 1115568 1427481 946871 1130382 1320281 964415 1286375 1116063 1298533 1410223
14649 1410223 930862 1060751 1149882 1009017 1022879 1193875 851229 1058856 1097573 809027
14639 809027 961655 1128967 1390977 844118 1007412 1430196 1183466 1082104 989656 1133030
14629 1133030 1096073 1097743 1266113 1305426 1055245 1169932 1233272 1131256 1189218 1389411
14619A389411j01414j18522J64674O1972J1533j75851M12573k60403O2437o6389
14609A380021L1024j46228K67025l5712l26607L25967j53503N24154l10707n63637
14599I91797M14823M9754M1816j44927K21504j51432J24387J49996j67042m3573
14589A487103J45019J80039j23700p6674k72452M28807k61815K41086O0352j42911
14579A664854R1066P5270N0356k09845K22473j0109j74221r0665L5476L49365
14569B004020m8833J78530P5941j38024J88854k64359J86084j12422L84855l67353
14559B087293K94571j60814J63753J92140L03067k4384O7763P67786J99161P82987
14549D673323J323805K516770R902118J9920462M458320k0124992j1217804E466928
$$ plain form
14619 1389411 1287997 1169475 1334149 1396121 1407654 1231803 1644376 1383973 1446410 1380021
14609 1380021 1411045 1264817 1531842 1496130 1169523 1495490 1341987 1866141 1555434 991797
14599 991797 1406620 1456374 1498190 1353263 1574767 1423335 1547722 1697718 1530676 1487103
14589 1487103 1632122 1812161 1688461 1611787 1339335 1768142 1506327 1747413 1807765 1664854
14579 1664854 1755920 1831190 1881546 1671701 1894174 1884065 1709844 1619179 1654655 2004020
14569 2004020 1955187 2133717 2209658 2071634 2260488 1996129 2182213 2069791 2454646 2087293
14559 2087293 2381864 2221050 2384803 2576943 2880010 2855626 2923389 3691175 3890336 4673323
14549 4673323 5997128 8513898 18416016 38336478 42794798 22669806 11452002 5466928
14540C146532q74295m57211J51451k10284j35110K98709l36449J23707J01339
14531A808389q8830L23339j6710J47493p9423n3437L7857L09008m96426L11333
14521B202593O3243k48731L10464o1352J20043k33269J40303j2004m243K85769
14511B562816k21250K08626j15548J42540J22549j61759n9544J84575o4852M0456
14501B638609J37746J75181K8891Q7601l28736M27962l29946p7391N05756l99063
14491B866610J26734J46583o3504O9788j25772j5152J02473K17953J63949k55365
14481C234297K59105k05663j24887J18163L41152J96627m40042N82016l04219
14472C656549j2446k15901M59075j36348J49173l26620L01652J58266j07813N13156
$$ plain form
14540 3146532 2272237 1815026 1966477 1756193 1621083 1919792 1583343 1707050 1808389
14531 1808389 1719559 2042898 2026188 2173681 2094258 2040821 2078678 2387686 1891260 2202593
14521 2202593 2265836 2017105 2327569 2266217 2386260 2152991 2293294 2281290 2277047 2562816
14511 2562816 2341566 2550192 2434644 2577184 2699733 2537974 2478430 2663005 2598153 2638609
14501 2638609 2776355 2951536 2980427 3068028 2739292 3167254 2837308 2759917 3265673 2866610
14491 2866610 2993344 3139927 3076423 3146211 3020439 3005287 3107760 3325713 3489662 3234297
14481 3234297 3493402 3287739 3162852 3281015 3622167 3818794 3378752 3960768 3656549
14472 3656549 3644103 3428202 3887277 3750929 3900102 3573482 3875134 4033400 3925587 4438743
14462D438743j57410n0501p4411N50809m5639J2554l29606K65234J41538n1258
14452D700053J68076j54593j72430J34519O3768J32430n6534M24921q7174k1771
14442E131265J19026K01992l0577n4346L30394l21561P0773Q0103n0740M46869
14432E923198j77747J56373K66935M7294J24578Q6066q2378J43422j85286M77135
14422F779590j4410L0214K63769l3181j25118J52111K42903J85840L51264p8439
14412G754543k57838N30047k41668K11001L40613p3321M00903k67560L65059K70739
14402I032518j79790N21115M9034j22777R4813N28458J79353L7934J82294J18232
14392A0441184J88473M83498j71048M52904l69684L32851j30044M85805N34079
$$ plain form
14462 4438743 4281333 4230832 4156421 4707230 4661591 4674145 4344539 4609773 4751311 4700053
14452 4700053 4868129 4713536 4541106 4675625 4739393 4871823 4815289 5240210 5153036 5131265
14442 5131265 5250291 5452283 5421706 5367360 5697754 5376193 5446966 5527069 5476329 5923198
14432 5923198 5745451 5901824 6168759 6216053 6340631 6426697 6344319 6487741 6302455 6779590
14422 6779590 6765180 6795394 7059163 7025982 6900864 7052975 7295878 7481718 7832982 7754543
14412 7754543 7496705 8026752 7785084 7996085 8336698 8263377 8664280 8396720 8761779 9032518
14402 9032518 8852728 9373843 9422877 9300100 9394913 9923371 10102724 10140658 10322952 10441184
14392 10441184 10629657 11113155 10942107 11395011 11025327 11358178 11228134 11713939 12248018
14383A2248018j16261L13144J61871M86123M9385M76734K61590k03891M40639
14374A4117352M02647R5285M07316M89562n3192L94958N79222J63857M43180M6894
14364A7087081L69442N14301L72230N07494N92326J78147L47694P12550L21866
14355B1003131N08589K86231N66485N38672N52610O80670M27153O01397R34671
14346B6099609L74799R45643K00252J368995M79587O64031O87031J245887P41210
14337C2807044J008302N68645J178528J101209J143573J130364J098908J273787
14329D1310360J658068J133704J476576J469872J559514J415164J628272J688052
14321E3339582K219076K238252J819883K158015K343860K266975K752786K794641
$$ plain form
14383 12248018 12131757 12444901 12606772 13092895 13142280 13619014 13880604 13676713 14117352
14374 14117352 14519999 14615284 15022600 15512162 15458970 15853928 16433150 16597007 17040187 17087081
14364 17087081 17456523 17970824 18343054 18850548 19442874 19621021 19968715 20681265 21003131
14355 21003131 21511720 21797951 22364436 22903108 23455718 24136388 24563541 25164938 26099609
14346 26099609 26474408 27420051 27620303 28989298 29468885 30132916 30819947 32065834 32807044
14337 32807044 33815346 34383991 35562519 36663728 37807301 38937665 40036573 41310360
14329 41310360 42968428 44102132 45578708 47048580 48608094 50023258 51651530 53339582
14321 53339582 55558658 57796910 59616793 61774808 64118668 66385643 69138429 71933070
14313G1933070K492575L284858L089703L454666L379078L791534M051946M340356
14305I9817786M294618M520867N651307N089453N620375O270383O370839O717179
14297A44352807P612076P990371Q301663Q903837R300118J0317491J0197637J1497507
14289B18473507J1932618J2526482J3187970J3843063J4704032J5222766J4988540
14282C14878978J6019456J5945133J6049677J6095217J5873765J4506764J4094604
14275D23463594J2625864J0642553Q675499N545506p40112k242432k136108m833302
14267D51001062k732678m278373p622488r545049j2379464j4269890j5542946
14260C84630174j6039880j6361820j6346975j6158270j6001898j5211161j3979120
$$ plain form
14313 71933070 74425645 77710503 80800206 84254872 87633950 91425484 95477430 99817786
14305 99817786 104112404 108633271 114284578 119374031 124994406 131264789 137635628 144352807
14297 144352807 151964883 159955254 168256917 177160754 186460872 196778363 206976000 218473507
14289 218473507 230406125 242932607 256120577 269963640 284667672 299890438 314878978
14282 314878978 330898434 346843567 362893244 378988461 394862226 409368990 423463594
14275 423463594 436089458 446732011 455407510 460953016 460212904 457970472 455834364 451001062
14267 451001062 448268384 443990011 436367523 426822474 414443010 400173120 384630174
14260 384630174 368590294 352228474 335881499 319723229 303721331 288510170 274531050
14253B74531050j4183771j3490790j2898904j2400189j1849657j0539938j0684503
14246A88483298r321559r110829q296043p671221p826446p125663p015235n910781
14238A26205521n586909n132675n531434m882088m737525m188115m224128k989004
14230H8933643l763780l928515l299386k637126k884098k920608k781837k414113
14222F4304180k290986k292743j936786j783289k173935j564661j741154j896520
14214D8624106j213341j131224j866972j019673k001711j098390j072386k21804
14206C8998605j460550j047543j450722r08493p77410q21206o41763n62717j559915
14197B9768286n44833r96808o81947l17778p20082o82576m20901r83018m6200
$$ plain form
14253 274531050 260347279 246856489 233957585 221557396 209707739 199167801 188483298
14246 188483298 179161739 170050910 161754867 154083646 146257200 139131537 132116302 126205521
14238 126205521 120618612 115485937 109954503 105072415 100334890 96146775 91922647 88933643
14230 88933643 85169863 81241348 77941962 75304836 72420738 69500130 66718293 64304180
14222 64304180 62013194 59720451 57783665 56000376 53826441 52261780 50520626 48624106
14214 48624106 47410765 46279541 44412569 43392896 41391185 40292795 39220409 38998605
14206 38998605 37538055 36490512 35039790 34131297 33353887 32532681 31890918 31328201 29768286
14197 29768286 29223453 28226645 27544698 27226920 26506838 25824262 25403361 24420343 24374143
14188B4374143j324888l89875l98017m66063n24140m25961o36762k57432p45916
14179A9205089j07501l75119l54822q18280j59169o80100l9795l01820l75277
14170A5993206j42296l33635n5389n48261P706p15146j65432j92611n87533p8849
14160A3181760m1522k31428j82991j73693k92283n42641K06425k34776m62838
14151A1226013j66261k90548o334J0553n92572K31767n89999J16700k86393J48672
14141I801598k15945l01331J79949k67731J85922p69920J5425R9838l38179J4852
14131H404478P653m53051R6067j117j54218l20393k95507n3915O2546J62730k96004
14120G159269j7477k51760k27880K77645L9860m12609j9379q7633N1565k22763
$$ plain form
14188 24374143 23049255 22659380 22261363 21795300 21271160 20845199 20208437 19951005 19205089
14179 19205089 19097588 18722469 18367647 17549367 17390198 16710098 16670303 16368483 15993206
14170 15993206 15850910 15517275 15461886 14913625 14921331 14206185 14040753 13848142 13260609 13181760
14160 13181760 13140238 12908810 12725819 12552126 12259843 11717202 11923627 11688851 11226013
14151 11226013 11059752 10769204 10762870 10773423 10180851 10412618 9822619 9939319 9652926 9801598
14141 9801598 9585653 9284322 9464271 9196540 9382462 8612542 8627967 8727805 8389626 8404478
14131 8404478 8412131 7959080 8055147 8054030 7899812 7579419 7283912 7229997 7292543 7455273 7159269
14120 7159269 7141792 6890032 6662152 6939797 6979657 6567048 6547669 6460036 6511601 6288838
14110F288838J9988J78987o18255L62625k59802q6190j34197l7667p7261j56950
14100E480116m7425R4975j88872p3205Q4100J02644l81694J15777j25223l27621
14090D733572o9634K50298m4877l7739k51450n4392J5815K56623m02743M7197
14080D442670R8459l14238J34984j77815J78927m0063r7450Q168l31241R5064
14070C997465K2117k46397n2233J36487N0530K59786n35083J1466l30525M67158
14060C780771k03433K58660l09663j47306K82956k52722J08683k46397K2848k68229
14050C026168L53364m02328N6743j13022L87343l02629J01699k06321k36524L17122
14040B981615j98503J72024m5472K9693k76545K01621p0652K74370n89629L99741
$$ plain form
14110 6288838 6308826 6487813 5869558 6232183 5972381 5886191 5751994 5714327 5637066 5480116
14100 5480116 5432691 5527666 5338794 5265589 5349689 5452333 5070639 5186416 5061193 4733572
14090 4733572 4663938 4914236 4869359 4831620 4580170 4525778 4541593 4798216 4395473 4442670
14080 4442670 4541129 4226891 4361875 4184060 4362987 4322924 4225474 4233642 3902401 3997465
14070 3997465 4019582 3773185 3720952 3857439 3907969 4167755 3632672 3644138 3313613 3780771
14060 3780771 3577338 3835998 3526335 3379029 3661985 3409263 3517946 3271549 3294397 3026168
14050 3026168 3379532 2977204 3033947 2920925 3308268 3005639 3107338 2901017 2664493 2981615
14040 2981615 2783112 2955136 2909664 2939357 2662812 2864433 2793781 3068151 2478522 2878263
14030B878263j3431k39270j81711n2607J65100o908K9233j93983j24797K24547
14020B484436r1237l03243K78572j99431J59595J59881m1869j5421j84161k01677
14010B045445j48069K16367N9892J62011k33502j79619J92029k81693J42937k970
14000A972828P3243k65625l3653J34622L7592j36984j31009J19314q1158J02351
13990A791521K28179K77883J618899P635074K0410806J3073371j9861202j1294644
13982A3879887n464974k786422j189574n71471n65604o6524m63081O2606m50430
13973B384413J09240k17105n7198K96950k69768L51676m94736L2082o7201l67180
13963A701173O39908m19000L6777m4338l00876K18628J31605k33283J49435J29469
$$ plain form
14030 2878263 2864832 2625562 2443851 2391244 2556344 2549436 2578669 2384686 2259889 2484436
14020 2484436 2393199 2089956 2368528 2169097 2328692 2488573 2446704 2431283 2247122 2045445
14010 2045445 1897376 2113743 2173635 2335646 2102144 1922525 2114554 1832861 1975798 1972828
14000 1972828 2046071 1780446 1746793 1881415 1919007 1782023 1651014 1770328 1689170 1791521
13990 1791521 2019700 2297583 3916482 11551556 31962362 45035733 25174531 13879887
13982 13879887 8414913 5628491 4438917 3867446 3301842 3235318 2772237 2834843 2384413
13973 2384413 2493653 2276548 2219350 2516300 2246532 2598208 2103472 2135554 2068353 1701173
13963 1701173 2341081 1922081 1958858 1914520 1613644 1832272 1963877 1730594 1880029 2009498
13953B009498k43253j29567O3322k1619L659L33924m90917L03261k14346l2178
13943A581784K03714Q0822p4913l00138o6808j03619K24055R8251j25999j8167
13933A498982j5800k68263K24283j55262K53190k26413K84635l26807J52103q7510
13923A333138r1036L58674k68258N2759K4175k66949M52746m41883K87929n1677
13913A389618k53017Q2020L00561k30628L6836j77355q7464L07860j45194K0697
13903A243934j45851J95873k2769j73646L05227m19735N24568j04716l39055J39496
13893A203326k92795N4662K73824q5663l26436L17466m2948L21981n12176K54238
13883A165479k6720j61677K75780Q6349r6235k28551J18880M33j06816P4089J04132
$$ plain form
13953 2009498 1766245 1636678 1700000 1678381 1682040 2015964 1525047 1828308 1613962 1581784
13943 1581784 1785498 1866320 1791407 1491269 1424461 1320842 1544897 1643148 1517149 1498982
13933 1498982 1483182 1214919 1439202 1283940 1537130 1310717 1595352 1268545 1420648 1333138
13923 1333138 1242102 1600776 1332518 1385277 1409452 1142503 1595249 1153366 1441295 1389618
13913 1389618 1136601 1218621 1519182 1288554 1325390 1148035 1060571 1368431 1223237 1243934
13903 1243934 1098083 1293956 1271187 1097541 1402768 983033 1507601 1402885 1063830 1203326
13893 1203326 910531 965193 1239017 1153354 826918 1144384 1101436 1423417 911241 1165479
13883 1165479 1138759 977082 1252862 1339211 1242976 1014425 1133305 1133738 1026922 1101011 1205143
13872A205143k20853Q5279n5660J24905J43957k92158k153K7427Q8630k08113
13862H96404J44438j85072Q0817r1087J80521k63879j06413M54810k0604m50491
13852F39444L81638k00211J68275j19864J63681J13715r2248J2622j87297L9873
13842I19628J22142J08590k68897j12327j76060K66996J37435M0503J6851l02246
13832G52615L20139n12640K00603j15369J96819j69193O7301j20180K07859p062
13822H20892m8701m355M4424k7456k05066M36235m8254l21428j34657M69729k33014
13811G48349k06514M42545j14918k88681J0444Q95617F90742j8399L06953l16342
13801F62954R4889J02634k17297J20346K08441o851l11926K61927l52660Q4817
$$ plain form
13872 1205143 984290 1069569 1013909 1138814 1282771 990613 988460 1015887 1104517 896404
13862 896404 1040842 855770 936587 845500 1026021 762142 655729 1110539 1089935 639444
13852 639444 1021082 820871 989146 869282 1032963 1146678 1054430 1067052 879755 919628
13842 919628 1041770 1150360 881463 769136 593076 860072 997507 1038010 1054861 752615
13832 752615 1072754 560114 760717 645348 842167 672974 740275 620095 827954 820892
13822 820892 772191 767836 812260 784804 579738 1015973 967719 646291 511634 981363 748349
13811 748349 541835 984380 869462 580781 591225 1486842 690742 672343 979296 662954
13801 662954 757843 860477 643180 763526 971967 965116 653190 915117 562457 647274
13791F47274j00310J15984B39093L15713r7297J51530p4223A24383M75786q8165
13781E12004J10736K268J44936q6838J02627K38732C84243J09545P6843K70023
13771H40654j61323j19840l8539J95094l3496k31541n3843J60898N7975K01699
13761H17738C15648J30783r4334J69225J16818l1021j08628j7917J61298J76594
13751H18466l82424J99118j49018L25873l27840A38935M04947B69087M63145J88771
13741I21003D38605J59342J39503J5945l64609N53715C42578L04764l02282P2555
13731D17615o8008o2746M37385B95892P6780J30810J5845K07274O7755k73202
13721E21154J14096j72476N2025l7299l2705J27169A15303J79812K97056B26656
$$ plain form
13791 647274 546964 662948 239093 554806 457509 609039 534816 124383 600169 512004
13781 512004 622740 625008 769944 683106 785733 1024465 384243 493788 570631 840654
13771 840654 679331 559491 520952 716046 682550 451009 397166 558064 616039 817738
13761 817738 315648 446431 352097 521322 638140 607119 498491 480574 641872 818466
13751 818466 436042 635160 486142 812015 484175 138935 543882 269087 732232 921003
13741 921003 438605 597947 737450 753395 388786 942501 342578 647342 345060 417615
13731 417615 349607 286861 724246 295892 372672 503482 519327 726601 794356 521154
13721 521154 635250 462774 514799 477500 444795 571964 115303 295115 592171 226656
13710G08468j21949M9668k48687P9484M52746l05663B42012N74761M3932B49616
13699F36674k92029M75885B83745K49624j96946J60007m3239m726J19087L39652
13689I07204j65303k3361j44500k73538K04484n3313j42523K70831r3996p152
13679D78833J77735A53071J73937J57515B28847L58339J70968l78035J76862j64288
13669C92693A45103K32616q7633m6294L77141p9410B38558J76042O0442J93194
13659F68236j50560M303A03973M14921A83760N1075J68446j47510P0649K66725
13649E93145k66925k7971J78292n126J09830k71843L23520k70735Q4149j31860
13639C14476J56388O7257k39829K40172B45038r3353K90013A56848Q8336M4466
$$ plain form
13710 708468 586519 636187 387500 466984 919730 614067 242012 816773 860705 249616
13699 636674 344645 820530 283745 533369 336423 496430 453191 448465 567552 907204
13689 907204 741901 718540 574040 300502 504986 451673 309150 579981 485985 478833
13679 478833 656568 153071 327008 484523 228847 587186 758154 380119 556981 392693
13669 392693 145103 377719 290086 243792 620933 541523 238558 414600 475042 668236
13659 668236 517676 521979 103973 518894 183760 234835 403281 255771 326420 593145
13649 593145 326220 298249 476541 471415 581245 309402 632922 362187 446336 314476
13639 314476 470864 538121 298292 538464 245038 151685 441698 156848 245184 289650
13629B89650N2785L47625j95478M4134M673J01570I8427k8330J18345L319J20338
13618C12099L50535j90758K1889q602j51011j27931M8100N1039J35589j26604
13608C14345F0129L40886I9313K57158K46599j55712N7157B46399d0043h383D10170
13596C77635l8948J11538k464A86337K81337H9726K47889J77847j70887j28240
13586B16335K88727J99484I3214K0622N7695K16288j45856K43700A89432K14684
13576D04116d693E14598N9656A85136l534L78369A37789K7797K43569A59118C3841
13564B21771L49204B22714K91280m9361q9878k2837M3436p2120A28150J60719
13554B88869K28231j55501j47919I5395K4767L58442A00739J63521l1401L33507
$$ plain form
13629 289650 342435 690060 494582 538716 543389 644959 98427 70097 188442 191761 312099
13618 312099 662634 471876 493765 485163 334152 206221 254321 305360 440949 314345
13608 314345 60129 401015 99313 356471 603070 447358 504515 246399 -40043 -8383 410170
13596 377635 338687 450225 447761 186337 467674 89726 337615 515462 344575 216335
13586 216335 505062 704546 93214 113836 171531 387819 241963 485663 189432 404116
13576 404116 -4693 514598 574254 185136 181602 559971 137789 165586 409155 159118 33841
13564 221771 570975 222714 513994 464633 374755 351918 395354 323234 128150 288869
13554 288869 517100 361599 213680 95395 120162 478604 100739 264260 232859 566366
13544E66366A65767k1824K62687j9826k594J11103A91303a69843A30498P1424
13534B01922L05005A71820K79872A27766a35782I0931N8935k083N89479C12631
13523A00013K38077E7798L16071r6068m3307A10939O4438K04451j24129m8038
13513B07661N8754K44631i0222A37840K28826j07622O0848A26834J37595K2408
13503B86837J22577A59492J18649r7529I218M01020j76958A00117M15364A46180
13492D06939a22171C37943j522A7781K14549k7507n662f856A99156P4738i822
13480F0156a23946G0328Q1507m9870L29821a1609A74285a13402C25329m8972D8722
13468C938M21901j78425A15463K81947j44846o0294K67002A02254J62450d2036
$$ plain form
13544 566366 165767 143943 406630 386804 384210 495313 191303 -169843 130498 201922
13534 201922 506927 171820 451692 127766 -135782 90931 149866 147783 737262 312631
13523 100013 338090 57798 373869 277801 234494 110939 175377 379828 255699 207661
13513 207661 266415 511046 -90222 137840 366666 259044 319892 126834 264429 286837
13503 286837 409414 159492 278141 180612 9218 410238 233280 100117 515481 146180
13492 406939 -122171 337943 336421 17781 232330 204823 199161 -6856 199156 273894 -9822
13480 60156 -123946 70328 151835 101965 431786 -11609 174285 -113402 325329 276357 48722
13468 3938 425839 247414 115463 397410 252564 192270 459272 102254 264704 -42036
13457H4771N04882B25301n6873E5780K93468o3274P5642r6961D6387J82150L65182
13446E93719k20682o9655A18820K68590j81428J30966e4812A62328m4983M82672
13436F00017G4362J55486N6576p6194F0234K51689q0596m1923m1122K6528K60834
13425D35644d3558A75271K63401B2855J57355D7900K37123K4324K0506A51922
13414f8301F0458J92968G4700K33421j09703b6493F4348Q6777a31181b5346j27347
13403a52693B50345I5885K84877h6607C56053B2139K21066e6723E0993b17555
13392a73542D4412K82286E1886j2067K82441A53753K79941k04665a55784b5869
13381E64927A04155a64458A94298a4289E3503J92416d9581C17992j40641J5677
$$ plain form
13457 84771 589653 225301 168428 55780 349248 285974 361616 264655 46387 228537 593719
13446 593719 373037 303382 118820 387410 205982 336948 -54812 162328 117345 600017
13436 600017 74362 229848 286424 210230 60234 311923 231327 189404 148282 174810 435644
13425 435644 -43558 175271 438672 22855 180210 47900 285023 309347 329853 151922
13414 -68301 60458 253426 74700 308121 198418 -26493 64348 151125 -131181 -25346 -152693
13403 -152693 250345 95885 380762 -86607 356053 22139 243205 -56723 50993 -217555
13392 -173542 44412 326698 51886 39819 322260 153753 433694 229029 -155784 -25869
13381 564927 104155 -164458 194298 -14289 53503 245919 -49581 317992 177351 193028
13371A93028N00505B12072o4013D895M9068d0996A88152K84338o1607n5862B1512
13359B13228K11544H3503O2877F7722R2830j8466D6022c0905A09893A1077f9870
13347B91822j4469M1201n6111K22080F7794M22449B43088A09045L00560q8468
13337C21137J83911a10151D25133k01565L40N999n2637L7721b36761B7443L63294
13326C90737i5208B63416D0846J66542e6076B35133k522F5731J00592J12948H5948
13314F0263K18330N46n0661K10496A39141O6759b1709A20625J84020A30839l1760
13303I9079c3101D9752L10967C8367G095N5412K4598l9502J70756J79590I7826
13291E5360g1958A44970k2186F0681J52251i6241B248J43349c7499l02404A18867
$$ plain form
13371 193028 693533 212072 148059 4895 53963 -40996 188152 472490 410883 355021 21512
13359 213228 424772 83503 146380 67722 160552 142086 46022 -30905 109893 11077 -69870
13347 291822 277353 318554 262443 484523 67794 490243 243088 109045 409605 321137
13337 321137 505048 -110151 425133 223568 223908 229907 177270 214991 -236761 27443 390737
13326 390737 -95208 263416 40846 207388 -56076 235133 232611 65731 166323 279271 85948
13314 60263 278593 279139 228478 438974 139141 205900 -21709 120625 304645 130839 99079
13303 99079 -33101 49752 360719 38367 7095 62507 87105 47603 218359 397949 97826
13291 55360 -71958 144970 122784 60681 212932 -96241 2248 145597 -37499 -339903 118867
13279A58533J43721p0668j0085q4525g7337A48085K7804a92042E76845I0454b1658
13267C83O2635N849L80168A74330b5823m5835L1718A27150K31274M6667D6688
13255A32726k676l8582B5063P2903a40579J7281I3910L71912A14847b34347A61219
13243B47970A07901j0981Q1350c3399q8026A62584P6419o4359M2880D6038M91986
13232E38024d9721H4993N3028a40640A81067e6017k4760k7931A09731P258J37664
13221B54653l8477a32878C45443b13323C0664J79329b25406A97400n7797E7450
13210A08514C4861K47872b43436C63319j48827B2352b0554h451k66539C6470L3036
13199F9506k3166J85499A03760K28221j33771A9794J33698k8747a135A80258C8914
$$ plain form
13279 158533 302254 231586 221501 136976 -77337 148085 175889 -192042 576845 90454 -21658
13267 383 63018 68867 449035 174330 -25823 -71658 -39940 127150 358424 405091 46688
13255 132726 130050 91468 25063 97966 -140579 -123298 93910 465822 114847 -234347 161219
13243 247970 107901 96920 178270 -33399 -121425 162584 239003 174644 217524 46038 538024
13232 538024 -49721 84993 138021 -140640 181067 -56017 -80777 -108708 109731 116989 254653
13221 254653 216176 -132878 345443 -213323 30664 209993 -225406 197400 139603 57450
13210 108514 34861 282733 -243436 363319 214492 22352 -20554 -8451 -274990 36470 69506
13199 69506 46340 231839 103760 331981 198210 19794 153492 124745 -1135 180258 38914
13187a08649K6845C81080A42749o8056G920J24049i7811A71444M102D8819a29887
13175B52312d77B62281r0746J09975q2645I5885E394J53873B1128e218j32423
13164a37641D06613E5431M6763Q238b208A85854a02145E0457i5496C19693a70489
13152c39729B9467L40492k9938h3241B85564D8446J58759L9184E3066b52773a15848
13140D6997J56809l9634b7362k2827H5278J67248I1183J76368B9889b0126h526
13128a22748A24680J46754b41582q8431C72208g6261A21755a1141m47447a03843
13117B0154b51506I3747J61517h292j58464K3381A71486b99094E925R9459N60968
13106F66352B0432b48429B22347N5437a14318A90706l2179d9723j24167B44700
$$ plain form
13187 -108649 -81804 381080 142749 74693 7920 131969 -97811 171444 175546 48819 -129887
13175 252312 -477 262281 171535 281510 198865 95885 5394 159267 21128 -5218 -137641
13164 -137641 406613 55431 102194 110432 -2208 185854 -102145 50457 -95496 319693 -170489
13152 -339729 29467 369959 340021 -83241 285564 48446 207205 246389 53066 -252773 -115848
13140 46997 203806 164172 -27362 -50189 85278 252526 91183 267551 29889 -20126 -8526
13128 -122748 124680 271434 -241582 -330013 372208 -76261 121755 -11141 -458588 -103843
13117 20154 -251506 93747 255264 -8292 -166756 -143375 171486 -299094 5925 105384 666352
13106 666352 20432 -248429 222347 277784 -114318 190706 158527 -49723 -173890 244700
13095C5923c1739k6767E0162c1697j13705A26104k4141O1878p6106i8177A15959
13083B07038G0661a39808q6556A92164A0916c80314C36277A45072K33474c0671
13072A46139J04498A17989K7452a98080k55926A15541j2772f8102A33031n4125
13062G8906p008J08857O1834a97244J4642A30776b51629e797n2424a8728B79820
13050C5027J1755b70473B63234h508B37840I5991f8081b8671m5263c5046C4458
13038E2922K65036H5767J19078f3634C05515K82350g0597A32732B3739K23369
13028B47108d6240A37994J65083D1172b64737D4430K84642p1283H0085d8424B09568
13016A88586l1375J39655o8159J5423e0442D5983K31560F5420Q4601C8008J75071
$$ plain form
13095 35923 -31739 -58506 50162 -31697 -145402 126104 101963 163841 87735 -98177 115959
13083 207038 70661 -139808 -226364 192164 10916 -380314 336277 145072 378546 -30671
13072 146139 250637 117989 145441 -198080 -454006 115541 102769 -68102 133031 78906
13062 78906 71898 180755 242589 -197244 -182602 130776 -251629 -5797 -58221 -18728 279820
13050 35027 46782 -270473 263234 -8508 237840 95991 -68081 -28671 -73934 -35046 34458
13038 52922 317958 85767 204845 -63634 305515 587865 -70597 132732 23739 247108
13028 247108 -46240 137994 303077 41172 -264737 44430 329072 257789 80085 -48424 209568
13016 188586 157211 296866 228707 244130 -50442 45983 277543 65420 150021 38008 213079
13005B13079J14345j11081l1710m6377g4010C79027b12899A57953R8295q0261
12995A75987g3058r9229J5400J8869N8582J6937M329j9657A95249H0005a8814
12983A21876Q458K72852c09301I4891K09051a07119B41560j14008M29847A51274
12972A17270g5590L3884E03476B17260O2371A09596h9488I4809K43599E9136M3766
12961A02902d1338A72795c9133e221j82263A54249Q5140q4630D3940N8039a9099
12949B19450J1037f9175c529G8087j9248d9747p0144G8193C8269O5914K08182
12938C12365b61137r3222I1845a75369B87834d09626A52289k0887G527P9729a54303
12926a86676C3147a04222D6596P8809J5638K7055A3085b54915A67118C3868b35855
$$ plain form
13005 213079 327424 216343 184633 138256 -74010 379027 -212899 157953 256248 175987
12995 175987 -73058 -172287 -156887 -138018 -79436 -62499 -58170 -77827 195249 80005 -18814
12983 121876 130334 403186 -309301 94891 303942 -107119 241560 127552 557399 151274
12972 117270 -75590 -41706 503476 217260 279631 109596 -89488 94809 338408 59136 102902
12961 102902 -41338 172795 -39133 -5221 -187484 154249 239389 154759 43940 101979 -19099
12949 219450 230487 -69175 -3529 78087 58839 -49747 -119891 78193 38269 104183 312365
12938 312365 -261137 -354359 91845 -175369 287834 -409626 152289 131402 7527 87256 -154303
12926 -186676 33147 -104222 46596 125405 141043 168098 13085 -254915 167118 33868 -235855
12914H0201l0725a4322A40443I819J18943c0082A76671l2604l1628A1655A102
12902d7615q0305A7428a56647A09147k3563C5203L19456G3015c37897i6398B00553
12890H5827L3117J59104o8661a81698k55206A03417K62229G644g6355C03458k5115
12879B78343K16137g0470R195A03650e7207j64562g8923C29267b1693j622B05659
12867e8010m860p4955o7827A88431q8734a80002H6126b899B04969k9865J68578
12856C43682j44406J81967j16452H2294e6760A39554F2081A6036i8200Q638L9171
12845e0391E9663M8975a60180j12613P12h402B68683G1198J11242D5059J33598
12834A78657d04846A39760j8905J60487c29788f2136I6289b54765B19006Q375
$$ plain form
12914 80201 49476 -14322 140443 9819 128762 -30082 176671 144067 112439 11655 1102
12902 -47615 -127920 17428 -156647 109147 85584 35203 354659 73015 -337897 -96398 200553
12890 85827 118944 278048 209387 -181698 -436904 103417 365646 7644 -76355 303458 278343
12879 278343 494480 -70470 -61275 103650 -57207 -221769 -78923 329267 -21693 -23315 205659
12867 -58010 -62870 -137825 -205652 188431 99697 -180002 86126 -2899 204969 175104 343682
12856 343682 199276 381243 264791 82294 -56760 139554 62081 16036 -98200 -89562 -50391
12845 -50391 59663 108638 -160180 -272793 -272081 -8402 268683 71198 182440 45059 178657
12834 178657 -404846 139760 120855 281342 -329788 -62136 96289 -254765 219006 227381
12824B27381R4988H7608k447a14302A88958G1574n536L2566d5468r6778P0914
12813g1332j40799B1710b74168b4669B77748e6486K5563j92495i7924A46508e6719
12801A35270K69841a47402n6376h9903k971A39235c1344E0103Q4753d9821A16750
12789B37925k2174c86055d3627j03400e951F7826a21577A59410R50J93767j03830
12778B50297h3117A69086a89327b5187j08215A24735i7766k61469h6234G8008
12767D6949i2506c8629l1920A11863D5026J02302f5307j10907A25651K77727A66992
12755b64347G9916a92883H0518J23758a3938k40554A38642K64643A0701K47946
12745B58647h2660A6230J13788c445D0221K55655j47116h890k1309j12727A65331
$$ plain form
12824 227381 322369 87608 85161 -114302 188958 71574 66038 98604 -45468 -142246 -71332
12813 -71332 -212131 21710 -274168 -24669 277748 -56486 -30923 -223418 -97924 146508 -56719
12801 135270 405111 -147402 -203778 -89903 -92874 139235 -31344 50103 134856 -49821 116750
12789 237925 215751 -386055 -43627 -147027 -5951 67826 -121577 159410 160360 354127 250297
12778 250297 -83117 169086 -189327 -25187 -133402 124735 -97766 -359235 -86234 78008
12767 46949 -92506 -38629 -70549 111863 45026 147328 -65307 -176214 125651 403378 166992
12755 -264347 79916 -192883 80518 204276 -13938 -254492 138642 403285 10701 258647
12745 258647 -82660 16230 130018 -3445 40221 295876 148760 -8890 -30199 -142926 165331
12733B1027a88756A7681a6632A33695K51817i388G0775c66255C18499k8378a13539
12721b64551C5666a70328C3647L859a4963p2263a8800C05157F0202J02437k2479
12710A40160b23563A8704K4901b9688m5256B91454L794F1418j9377L43413A89521
12698H1021l196J24086G6062B8777J04627C8253c68432A7800L44861A72636c6056
12686c47863b1955C8076c05602A49511D6305J46814C8155J63220G1344j8934a1174
12674A22549n5618K68966j57475A9959J05939L1844i1983c9174A70428f9538C30162
12662B78018p8648P3376a41858G7474k1695N1257f8084B81532F9693K15364A30515
12650A62511J70602l0776j5617H7347K10669A06554L3297N4805G2977a16270K9150
$$ plain form
12733 21027 -188756 17681 -16632 133695 385512 -9388 70775 -366255 318499 290121 -113539
12721 -264551 35666 -170328 33647 37506 -14963 -87226 -18800 305157 60202 162639 140160
12710 140160 -223563 18704 43605 -29688 -74944 291454 295248 61418 42041 385454 189521
12698 81021 77825 201911 76062 28777 133404 38253 -368432 17800 362661 172636 -36056
12686 -347863 -21955 38076 -305602 149511 46305 193119 38155 201375 71344 52410 -11174
12674 122549 66931 335897 178422 19959 125898 157742 -91983 -39174 170428 -69538 330162
12662 278018 199370 272746 -141858 77474 55779 107036 -68084 281532 69693 285057 130515
12650 162511 333113 302337 286720 87347 298016 106554 139851 194656 72977 -116270 -87120
12639h7120B41474b56163e4174A29326P7879Q018G1527a3886B8331N1964J49777
12628B30072o5074J78729E5874A8047E829O1303M03512A06067a6925B0738c3421
12616E01551B4989b32142E5599O1732J6977i6931A277a72976f8557K1465k46166
12605b93258I8999K56255A41354l3014D604J37338L77537B3268L4144a45270D16292
12593A11217k3106a52104c2026B14052d1124A18088R7630d9514D8526g8224B16969
12581e381F1379f4284A3816M63070b45869D8552j940K4300M7630E1481a37580
12569B70018c2222A70221G8282b47513B35494k3361a68926B99268a19940B04530
12558a47483B34910e5092a36l21783J9092C80033j18849a94021B38739E3482J18068
$$ plain form
12639 -87120 241474 -256163 -54174 129326 207205 215223 71527 -13886 28331 80295 230072
12628 230072 164998 343727 55874 18047 5829 67132 470644 106067 -16925 20738 -33421
12616 501551 24989 -232142 55599 117331 134308 -96931 1277 -172976 -68557 -47092 -293258
12605 -293258 98999 355254 141354 108340 4604 141942 519479 23268 57412 -145270 416292
12593 111217 88111 -152104 -32026 214052 -41124 118088 215718 -49514 48526 -78224 216969
12581 -5381 61379 -64284 13816 476886 -245869 48552 46612 70912 118542 51481 -137580
12569 270018 -32222 170221 78282 -247513 235494 212133 -168926 299268 -119940 204530
12558 -147483 234910 -55092 -136 -321919 -302827 380033 261184 -194021 238739 53482 171550
12547A71550c08410A39253e5432j7573F7727R7268f8094n3041A44117a72602M7083
12536a25519A34068F6892a25436B462a79189B38579D9441M7210K4116g0661J5084
12525e5577E7242h4059r3721A45409K13027A66019b34917B20287h3980F3302a39047
12513e9418A69244H3018J17758a6221B1302M6485J88337a86884B10469b29425
12502D7443b687C03799a1219q3470C5651J93778a7364G3722M0507m5405K09559
12491B78383D519e4327A02905e8319j38813A30112d21253E7591c05636d0667B53593
12479A11514Q7969q8626a63702a026l50385f1917D3575R773b68637B07978a75948
12467c00966F9011C1703a19796I0915O4522h3033A15845L6729J2540j092N8856
$$ plain form
12547 171550 -308410 139253 -55432 -73005 67727 164995 -68094 -121135 144117 -172602 -125519
12536 -125519 134068 66892 -125436 2462 -179189 238579 49441 96651 120767 -70661 -55577
12525 -55577 57242 -84059 -177780 145409 358436 166019 -234917 220287 -83980 63302 -139047
12513 -59418 169244 83018 200776 -16221 21302 67787 256124 -186884 210469 -229425
12502 47443 -2687 303799 -11219 -94689 35651 229429 -17364 73722 114229 68824 278383
12491 278383 4519 -54327 102905 -58319 -197132 130112 -421253 57591 -305636 -40667 253593
12479 111514 199483 110857 -163702 -1026 -351411 -61917 43575 53348 -268637 207978 -175948
12467 -300966 69011 31703 -119796 90915 155437 -83033 115845 152574 165114 164022 222878
12456B22878a08491j42531A25291b10789j4656L5275C77823A43774b77357C12291
12445B08780J02260b75058H7362b10212J9113B88797B2854J46247f5239J5659
12435d9580n964H1762b12082b4615l7851C7784J22084N7885b12211a00494j6035
12424a16529r4105R4048A15590c03088B67903A9510M23936a12221A32223a7881
12413C33560f0511A76315b28126R3227B9504J81282E6000B480a65570C46754A19354
12401E7a7687A33780g0551k41358i7429o4097k19430J21390h478B9108N6791i810
12388E7504b8056r1272C0298a14373m3979A75729d49828d6340j040j18221H6920
12376b2241A17043K11104a05228M855D10991b06633O1548I9657B027i4929a7527
$$ plain form
12456 222878 -108491 -251022 125291 -210789 -225445 -190170 377823 143774 -277357 312291
12445 208780 311040 -275058 87362 -210212 -191099 288797 22854 169101 -65239 -49580
12435 -49580 -55544 81762 -212082 -24615 -62466 37784 159868 217753 -212211 -100494 -116529
12424 -116529 -210634 -116586 115590 -303088 267903 19510 443446 -112221 132223 -17881
12413 333560 -60511 176315 -228126 -134899 29504 210786 56000 2480 -165570 346754 119354
12401 57 -17687 133780 -70551 -311909 -97429 -161526 -380956 -259566 -8478 29108 85899 -9810
12388 57504 -28056 -119328 30298 -114373 -158352 175729 -449828 -46340 -47380 -165601 86920
12376 -22241 117043 328147 -105228 -100373 410991 -206633 -145085 99657 2027 -94929 -17527
12364A26539d0959m6718F8593e7345a3194j7912B6298d6164D6246a48872m5974
12353a94846g4371C5231e926m9679A47280e2354A3968c1357j74002j38312c1629
12341B12486I3503a40155D04851j97004f7553B35092a32253C66485b4628k12220
12331b36848i861j32895F6263c4488G3098K35271a2942k06877P0499B29248K6245
12320B55493A22811M7476q3135c0557A7334N5830a17751A66460N3228c906A16014
12308B1364a37984J7064g405A8076a17884N4916a8830j63323p3005A19955f9249
12296b13385o4192A31627c24903J51433I5984O6872d9452G6124c101q5725j65747
12285b54573G6532C1461K20583I3599L5587d6205L08A5112N3328J23283H3539
$$ plain form
12364 126539 -40959 -87677 68593 -57345 -13194 -31106 26298 -46164 46246 -148872 -194846
12353 -194846 -74371 35231 -5926 -55605 147280 -52354 13968 -31357 -205359 -343671 -31629
12341 212486 93503 -140155 404851 207847 -67553 235092 -132253 366485 -24628 -236848
12331 -236848 -9861 -142756 66263 -34488 73098 308369 -12942 -219819 -149320 229248 255493
12320 255493 122811 170287 87152 -30557 17334 73164 -117751 166460 219688 -3906 116014
12308 21364 -137984 -120920 -7405 18076 -117884 -62968 -18830 -182153 -255158 119955 -69249
12296 -213385 -277577 131627 -324903 -173470 95984 162856 -49452 76124 -3101 -88826 -254573
12285 -254573 76532 31461 252044 93599 129186 -46205 -45897 15112 68440 191723 83539
12273C08794j27465a25230G3202P4216b54953B32014a19840D3878J109K22060
12263B67047q1669b42523A48815K5529G7167A5773K23050N659b9821p8895A29987
12251i4195C88b57573D15930F6764a12805A05275a6069A08003a63907N5712M295
12240a03900m864j29071D9612b4574h426A09204a13540A31215a02060j077B00296
12228A28323n942P106J43567j34256K58616A27909K70388j79597M41707j95545
12218D64862B13650m3212N0385B6642J85610A9642Q9288J20123c5845A56516a7407
12206e7440C66779A47589a9306C73873K32444A04873J54342C6590K77060L8926
12196C52576A25887K30862J20613A02000j4597P7276i8152C6781K27203H3346
$$ plain form
12273 308794 181329 -125230 73202 147418 -254953 232014 -119840 43878 44987 267047
12263 267047 185378 -242523 148815 174344 77167 15773 238823 244482 -29821 -108716 129987
12251 -94195 388 -257573 415930 66764 -112805 105275 -16069 108003 -163907 -108195 -103900
12240 -103900 -108764 -237835 49612 -24574 -8426 109204 -113540 131215 -102060 -103137 200296
12228 128323 122381 129487 273054 138798 397414 127909 398297 218700 660407 464862
12218 464862 213650 170438 220823 26642 212252 19642 108930 229053 -35845 156516 -17407
12206 -57440 366779 147589 -19306 373873 606317 104873 259215 36590 313650 352576
12196 352576 125887 356749 477362 102000 87403 164679 -98152 36781 263984 83346
12185H1026a68042H7923P6002L27636m2855A20097L23250a44542B55897C3989
12174H8442E839K42797p8823E5808i7171n4944I2325M9004m0498M0110k6969R6274
12162B10246l7043K0296D1529M17533a19414m4499D4257c27607B2311a17522j57850
12151b75372i6886A42526C4061M5389K3878k5756l6454I477Q6517b01060C22779
12139H0305J10501K9018m7653b26300j04418I5164J50988Q9514a11101l7906C9070
12127a5675B44661G0155A9776L29514n7645j36734h5478A93963B6680K2523c33194
12115G471J72339L7212k7499d5680J104B00277P1097b25786C1140k628M4252b04766
12102F6110J0301a68982e9863k9044m281N374p9888p7883R3725A88350b18898
$$ plain form
12185 81026 -168042 87923 163925 491561 448706 120097 443347 -144542 255897 33989
12174 88442 5839 248636 169813 55808 -97171 -152115 92325 141329 100831 140941 113972 210246
12162 210246 173203 193499 41529 459062 -119414 -163913 44257 -327607 22311 -117522 -275372
12151 -275372 -96886 142526 34061 79450 103328 77572 41118 9477 95994 -201060 322779
12139 80305 190806 219824 172171 -226300 -330718 95164 246152 335666 -111101 -149007 39070
12127 -15675 244661 70155 19776 349290 291645 154911 -85478 193963 26680 49203 -333194
12115 7471 179810 217022 189523 -45680 -44576 200277 271374 -225786 31140 28512 72764 -204766
12102 66110 76411 -168982 -59863 -88907 -93188 -87814 -167702 -245585 -151860 188350 -218898
12090c21747A27790g71215I1295a22781A27854J03636a82940C07426c50732F5852
12079B03055a98726A52943m026F3770N1620J40842P1991Q1336h5257C72934c04139
12067I5049O2488M28565J002309K65086H47495l71563E4408N0729a30383K0189
12057a10194n9602g3236a0705B10935a49823M7039a4909j35065A42630B5461b59481
12045a55676H9999L48692c37167A12941A928Q5451b45635e7825l62123e0942o076
12034e7018k327k205j68150B73689g3892B78773a579A2085K047b17973m9062d9992
12021d4532C5331d5425j11B54186E9261M8372n3805b55557D21640c802j66284
12010a70086m689A06264a93263h4037D6891j7348a30042D3250Q0199b583B18678
$$ plain form
12090 -321747 127790 -771215 91295 -122781 127854 231490 -182940 307426 -350732 65852
12079 203055 -198726 152943 148917 63770 115390 256232 328223 409559 -85257 372934 -304139
12067 95049 157537 586102 1588411 1853497 847495 475932 54408 105137 -130383 -110194
12057 -110194 -169796 -73236 -10705 210935 -149823 -102784 -14909 -149974 142630 25461 -259481
12045 -155676 89999 438691 -337167 112941 1928 87379 -245635 -57825 -419948 -50942 -57018
12034 -57018 -59345 -61550 -229700 273689 -73892 278773 -1579 12085 14132 -217973 -267035 -49992
12021 -44532 35331 -45425 -45536 254186 59261 107633 53828 -255557 421640 -3802 -170086
12010 -170086 -174775 106264 -193263 -84037 46891 29543 -130042 43250 123449 -2583 218678
11998f6154A7272J06200k0925a2075B15652c7466A68862J54798Q0791B2235b8168
11986a79804F3113a02189A3247J72694I16c6635k8776E3172c3180p3913L6097
11975g0996K1958a077A18522n9143O685L0722a59880h988D9918e3972p9883d5837
11962D1677a38623M4151E905J97653B2875b14991o5593Q9604e5060j2234A5254
11950g8566j41157A00451a6650j6621k5310A01235D9005K07027b1688k05833P6638
11939a50883Q37g2970j62124h8736C2457b9926m8487O198p2632h376j52608B72418
11926b395o7688A19640f0288o3051k82283J59397B84655h148j29187l9234I0930
11914A95709K18882a21522C2938J83130c33039b4561I7852d2355A34270J77656
$$ plain form
11998 -66154 17272 123472 102547 -12075 215652 -37466 168862 323660 404451 22235 -28168
11986 -179804 63113 -102189 13247 185941 916 -36635 -65411 53172 -33180 -107093 -70996
11975 -70996 -49038 -1077 118522 59379 66064 96786 -159880 -8988 49918 -53972 -133855 -45837
11962 41677 -138623 -94472 5905 203558 22875 -214991 -280584 -190980 -55060 -67294 15254
11950 -78566 -219723 100451 -16650 -33271 -58581 101235 49005 256032 -21688 -227521 -150883
11939 -150883 -150046 -72970 -235094 -88736 32457 -29926 -78413 -72215 -144847 -8376 -160984 272418
11926 -2395 -70083 119640 -60288 -123339 -405622 -246225 284655 -8148 -137335 -176569 90930
11914 195709 414591 -121522 32938 216068 -333039 -24561 97852 -42355 134270 311926
11904C11926B5287a35186m4726C2573K22732j09459C8434K41055b8366l08957
11894c37323a14489A00309j6391a70463H9945n182K69095A55264a21319J1839
11884a09480E9551b50462A27787P0463a12254j28659g1610j56239f81j8514M684
11873a4511j11579a2689A97494d0884A46744o4003J5071a7148A09564R7824q4396
11862A22992B2805a64397j48217F7305N1475b67093A22383j7139C0625a39252
11851A20887a3599j39285j00M6824I2862h5626c5224l6141L0617j77546A7595
11839d3928J4965A6507c1167B127a26169j48471A92372h5427J2198j54449f2939
11827C1562c23263c9650q2894p134j3218q6156c1933B96659b57035C3178H79R133
$$ plain form
11904 311926 25287 -135186 -179912 32573 255305 145846 38434 279489 -28366 -337323
11894 -337323 -114489 100309 83918 -170463 89945 84763 353858 155264 -121319 -109480
11884 -109480 59551 -250462 127787 198250 -112254 -240913 -71610 -227849 -681 -19195 -14511
11873 -14511 -126090 -12689 197494 -40884 146744 82741 97812 -17148 109564 207388 122992
11862 122992 22805 -164397 -312614 67305 118780 -267093 122383 105244 30625 -139252
11851 120887 -13599 -152884 -152984 -106160 92862 -85626 -35224 -71365 -40748 -218294 17595
11839 -43928 -28963 16507 -31167 2127 -126169 -274640 192372 -85427 -73229 -227678 -62939
11827 31562 -323263 -39650 -122544 -129678 -142896 -229052 -31933 296659 -257035 33178 879 10012
11815A0012c67233B86908b16002d0537n9040M0531a6038l4489J9269j4416l3051
11804g8725F4832a10268k1957f777k07276A0167a49399k25251J21385i4863L8849
11793e6014q4860A62752c19694J57859p041A74428m2262j4203d7634J4303j62805
11782a96136d7342q9084A38449a87749G961J54717C4983b65640K7719R0859d3222
11770F4126K0349a10032J4409j4290b1707A16269i006a702j59658f6393A28656
11758f8736o709k8248A97860J259a32103L9682P88k3974b4603A01277b03066F0919
11745g3998a1242j83440A70774J5478M2364C8693b7987m735A20666a75248A01923
11733C28856c4785C3429i699B28178b95738A77496A8695J12653K25743b13079
$$ plain form
11815 10012 -367233 286908 -216002 -40537 -99577 -59046 -16038 -50527 -31258 -45674 -78725
11804 -78725 64832 -110268 -132225 -6777 -214053 10167 -149399 -374650 -253265 -94863 -56014
11793 -56014 -140874 162752 -319694 -161835 -168876 174428 132166 117963 -47634 -33331 -196136
11782 -196136 -47342 -136426 138449 -187749 7961 162678 34983 -265640 -237921 -147062 -43222
11770 64126 84475 -110032 -95623 -109913 -21707 116269 -9006 -1702 -161360 -66393 128656
11758 -68736 -75445 -103693 197860 199119 -132103 -92421 -91633 -115607 -24603 101277 -203066 60919
11745 -73998 -11242 -194682 170774 186252 228616 38693 -27987 -32722 120666 -175248 101923
11733 328856 -34785 33429 -9699 228178 -295738 177496 18695 131348 357091 -213079
11722B30336b40892e8668j30929C3619a47810B9599d8770l33199A16706b02398
11711b0134J620k4395B35215A00473c2787j29691C24184b83880B52e562k47429
11700b52991B9715a35953B30531p0642a04815B0834J51646b26844A00608C4993
11689h5175A77724p6476D2019e7384A2989c09371d4884A35765o0360K26690c6440
11677B59369A10573b12246A73378q1875Q287J57819L2290B1768b49645A05333
11666B59620A10374n431p809k8472K3068e4093j70512f0198k4519B24121g5284
11654i3005E0939g4724C0199f3615k17832H3011c6831o0939F8917e0497A27105
11642a30143A23171i0668A24058J81355A21389A3120P5685K31406j41193E0518
$$ plain form
11722 230336 -240892 -58668 -189597 33619 -147810 29599 -48770 -381969 116706 -202398
11711 -20134 -18514 -42909 235215 100473 -32787 -162478 324184 -283880 252 -5562 -252991
11700 -252991 29715 -135953 230531 159889 -104815 20834 172480 -226844 100608 34993
11689 -85175 177724 101248 42019 -57384 12989 -309371 -44884 135765 75405 302095 -36440
11677 259369 110573 -212246 173378 91503 99790 257609 289899 21768 -249645 105333
11666 259620 110374 104943 97134 68662 91730 -54093 -224605 -60198 -84717 224121 -75284
11654 -93005 50939 -74724 30199 -63615 -281447 83011 -36831 -97770 68917 -50497 127105
11642 -130143 123171 -90668 124058 305413 121389 13120 88805 320211 179018 50518
11631b09890K2251A60702B7998L1519P6284a49317b8181A4692J2169a31475o8951
11620b00426C94356b83392Q6508B1224c4169A68931a18685H1953K6971J45936
11610B54860D1960J00213b07605i6449n0750J6728G6917e2917A94307b23877G2176
11598C30281c1033j19055A5206a46840g1133J2184B00901J11060f6940C617c0000
11586C63636O4323A46583b65166J00795C6920d20330A21219b03121a6337A34691
11575F0998L97929A77611H2666J75589K37266a35282B31598j111K2037j11051
11565A41473A8239b5169q1061I395e8667A93103a0405A80865b6113G8167g0335
11553A68208K29468G1775a00021I7853M9006h1216C90660A92031A8690K28608
$$ plain form
11631 -209890 -187639 160702 27998 59517 135801 -149317 -28181 14692 26861 -131475 -200426
11620 -200426 394356 -283392 -196884 21224 -34169 168931 -118685 81953 108924 254860
11610 254860 41960 142173 -207605 -96449 -147199 -130471 76917 -52917 194307 -223877 72176
11598 330281 -31033 -150088 15206 -146840 -71133 -58949 200901 311961 -66940 3617 -30000
11586 363636 427959 146583 -265166 -164371 36920 -420330 121219 -203121 -16337 134691
11575 60998 458927 177611 82666 258255 495521 -135282 231598 230487 252524 141473
11565 141473 18239 -25169 -106230 9395 -58667 193103 -10405 180865 -26113 78167 -70335
11553 168208 397676 71775 -100021 97853 146859 -81216 390660 192031 18690 247298
11543B47298g963j32305b2630i960A46885F8650J36950q4318c1389j29273B24504
11531A17488L43826e44D87747F4295a84035L6093A95852M4512B4511L16504b8423
11519B9107M23112F630R3410e2067E879f8851A66770L8689J16486f0172B36707
11507A07466J76558d1400A76383a56828N8732B16156q0268K8414J801p4657a0605
11495h4074A67387m0599a92805D16368i3623K6481F2015J66090a16672A51294
11484B09275o2917h123H0994M11237e6115B44362O946q5007e643B54148j0815
11473B43333b997A56525K37102A66793Q9213I3615B2787K15331j12881A2950b5319
11461B65936b6706j53615A96895a41989D81888B39005H9407L58204F8503a53331
$$ plain form
11543 247298 -7963 -140268 -22630 -9960 146885 68650 205600 121282 -31389 -160662 224504
11531 117488 461314 -544 487747 64295 -184035 -147942 195852 240364 24511 341015 -28423
11519 29107 452219 6630 100040 -52067 5879 -68851 166770 205459 321945 -60172 236707
11507 107466 284024 -41400 176383 -156828 -98096 216156 135888 164302 166103 91446 -10605
11495 -84074 167387 126788 -192805 416368 -93623 -67142 62015 228105 -116672 151294
11484 209275 146358 -8123 80994 492231 -56115 244362 251308 166301 -5643 254148 243333
11473 243333 -2997 156525 393627 166793 256006 93615 22787 238118 125237 12950 -25319
11461 265936 -26706 -180321 196895 -141989 481888 239005 89407 447611 68503 -153331
11450B23990N1810R5977h7028B52527A8054K06098c6606C8947b1884j3928H2565
11438b8452A28885e000G3509K02722j09747a60543G4685b9366C2988a8292j90101
11427b08393e4162D5885J35971L8551A08426C0366J79154a52421E2874a29591
11416G064L89566I52a49747G9621D169a38355A22633c01508J47335L9394B24936
11404g7081l25462D49588R8936A61771M4386B9796h3879a6527F9543A2799P5073
11393H7872f6545C5169K1221l115a9751B12648b01071h917C32069b75718l0114
11382c05832a9203C63256A79615h1386q0450d2609B81799a67866p1909A8377K85972
11371C04349j38020n6738D1936J43189J20322c3908r5981l058C86261c3521j45840
$$ plain form
11450 223990 275800 371777 -87028 252527 18054 224152 -36606 38947 -21884 -35812 82565
11438 -28452 128885 -5000 73509 276231 166484 -160543 74685 -29366 32988 -18292 -208393
11427 -208393 -54162 45885 181856 220407 108426 30366 209520 -152421 52874 -129591
11416 7064 396630 952 -149747 79621 4169 -138355 122633 -301508 -154173 -114779 224936
11404 -77081 -402543 449588 548524 161771 206157 29796 -83879 -16527 69543 12799 87872
11393 87872 -66545 35169 56390 53275 -19751 212648 -201071 -8917 332069 -275718 -305832
11382 -305832 -19203 363256 179615 -81386 -161836 -42609 281799 -167866 -239775 18377 304349
11371 304349 166329 109591 41936 185125 305447 -33908 -129889 -132947 386261 -33521 -179361
11360a79361B596J5801a25155L0389H6011c802l92096i1907F0458A9532K29205
11349B48737a83873J0930j89073B23262b46433f699p0362A55739b66821D9303
11338e6088B74261b5271q3009m49143h221B85386c9606H652J53413H571L7156
11327D5727h8125A00869L73030d22284A27239c5223B6382K4400b6884G9985b21442
11315D5228i1428A65406b04597c1907A08858a51964d202A50515R5593a4202G0063
11303G905h224j6222m2485B9837P3986a729B41556a88676B26699d15677A4743
11291c48219A30985c7905A06605K56094A6801a19876R928F7849a8260H3915a73301
11279b53697C01879l8688J23448b44077G0823j523B0327e4920A41900a27014m9448
$$ plain form
11360 -179361 2596 18397 -125155 -94766 86011 -3802 -395898 -91907 60458 19532 248737
11349 248737 -183873 -172943 -362016 223262 -246433 -6699 -77061 155739 -266821 49303
11338 -56088 274261 -25271 -108280 -557423 -8221 285386 -39606 8652 162065 8571 45727
11327 45727 -88125 100869 473899 -422284 127239 -35223 26382 50782 -26884 79985 -221442
11315 45228 -91428 165406 -204597 -31907 108858 -151964 -4202 150515 246108 -14202 70063
11303 7905 -8224 -24446 -66931 29837 103823 -1729 241556 -188676 226699 -415677 14743
11291 -348219 130985 -37905 106605 362699 16801 -119876 -109948 67849 -18260 83915 -173301
11279 -253697 301879 263191 386639 -244077 70823 69300 20327 -54920 141900 -127014 -176462
11268a76462l7595d6484r6074N8222A9252a69205j64514f6132l66055c9544k51527
11257b91071e1201n8979j15504K9913C62779j2903c3667j22662b8480C1866a52350
11245e5508F3735b7792A03057c11449A17073Q854a67639e161k89528c8513I3025
11233a11828B0795J23564k8987k3554C4576h5637C60064a36947C16590A39610
11222E5161B5790K51536j19303G2032g6799H7345a58433b3365l6746A44830b6001
11210E616d2522I3964b83058P2013o4397A49399a13241c7574k48998a26613A88954
11198a61967c4992F8901O7387b24255f0016b5643o7146k03968A94714K5718c20728
11186a04504A31749a55154A9535a79271a5047G497a30489j92773a05426p9837
$$ plain form
11268 -176462 -214057 -46484 -142558 -84336 19252 -169205 -333719 -66132 -432187 -39544 -291071
11257 -291071 -51201 -110180 -225684 -195771 362779 349876 -33667 -156329 -28480 31866 -152350
11245 -55508 63735 -27792 103057 -311449 117073 125927 -167639 -5161 -294689 -38513 93025
11233 -111828 20795 144359 115372 91818 34576 -85637 360064 -136947 316590 139610
11222 55161 25790 277326 158023 72032 -76799 87345 -158433 -23365 -60111 144830 -26001
11210 5616 -42522 93964 -283058 -211045 -275442 149399 -113241 -37574 -286572 -126613 188954
11198 -161967 -34992 68901 136288 -224255 -60016 -25643 -92789 -296757 194714 220432 -320728
11186 -104504 131749 -155154 19535 -179271 -15047 7497 -130489 -323262 -105426 -185263
11176a85263P5775j40130F8617d08323e8277A76729b01567j1900A37211B674g8976
11164g5298a5720A44702a27646k00579C71633a30746A8586a67183A5106d2713
11153h6265I2471j231J45675I3969N1935a81361B59336b17452H1422g9015I8008
11141e999A55669a4821A85764K00669G6082B8329a53084G709b46303n3549a20455
11129i9602C06098f103A58489C1139J00441j6978M5283D5802i9062l0207j8135
11118a47404E8359a49847b6684k5367A88M8152b626D18287F6573j6742a00646
11106a00195b9645D79686H3927M04743a66672c1003B93814C0776i1173A48461
11095A04110a03874I5070J47086b0063C09223g652G6002k4897J61291J15989A11706
$$ plain form
11176 -185263 -109488 -249618 68617 -408323 -58277 176729 -201567 -213467 137211 2674 -78976
11164 -75298 -15720 144702 -127646 -328225 371633 -130746 18586 -167183 15106 -42713
11153 -86265 92471 91240 236915 93969 145904 -181361 259336 -217452 81422 -79015 98008
11141 -5999 155669 -14821 185764 386433 76082 28329 -153084 7709 -246303 -299852 -120455
11129 -99602 306098 -6103 158489 31139 131580 114602 159885 45802 -99062 -129269 -147404
11118 -147404 58359 -149847 -26684 -52051 188 48340 -2626 418287 66573 49831 -100646
11106 -100195 -29645 479686 83927 488670 -166672 -31003 293814 30776 -91173 148461
11095 104110 -103874 95070 242156 -20063 309223 -7652 76002 51105 212396 328385 111706
11083a3005k7583B71744J866H4036e1030p2920F5445P2025K21086d26659C84074
11071H4285R4307J12704J27308j20964j29715J13519J08703j74933J04650N8565
11061C78429P7416k22416L36291j27919l0804J50045k29872K91729r6224K31966
11051G58641l07383K92165j79315K92156o5022q484n2955p8549P3943l50549L17232
11040F91880K27444D01907L61796o4651o848J73077j1536m9183O8713l81923L99568
11029H90920l15769j32362J29275k68928L24008O1537j75000P0988j37288O222
11019D53603J83242j27196p1409M4458P9101R3203K04646k43897j49339J14194
11009E80606j8779k74609K44830L3003l3137k02719M72213k11967k14032L86152
$$ plain form
11083 -13005 -40588 271744 273610 84036 -51030 -123950 65445 137470 358556 -426659 384074
11071 84285 178592 291296 418604 297640 167925 281444 390147 215214 319864 378429
11061 378429 455845 233429 569720 441801 410997 561042 331170 622899 526675 758641
11051 758641 451258 743423 564108 856264 791242 782758 729803 651254 725197 374648 691880
11040 691880 919324 401907 763703 699052 692204 865281 853745 804562 873275 491352 890920
11029 890920 575151 442789 572064 303136 627144 688681 513681 584669 447381 453603
11019 453603 636845 509649 438240 482698 561799 655002 859648 615751 466412 580606
11009 580606 561827 287218 532048 565051 531914 329195 801408 589441 375409 761561
10999G61561k46277L24080k00310l0303L24868D30557l4980M33145Q1699l77339
10989E33082k3010L30742R6432k9320l20737K57250J84044L2833k45023K35536
10979A051829J53353J49438J78117J37328J10657L77304K63297J99687N3503J96139
10969B870652k68191j11522k93118L98679q41765l634j91600j7795j77209j00040
10959A264457L07015j40121L51823m07419J06362k23721k66931N9341m54771n504
10949E90531J83519j87186J1434A77433L03520e1812G9549R3153j5762L30810
10939D87750A60169J48323j51405A4962L00648B2225a42500B99772O1318i3452
10928C0530J66122H5595i4046q8250B62128l8090b65288C9349J32255J41403n0344
$$ plain form
10999 761561 515284 839364 639054 608751 933619 430557 395577 828722 910421 533082
10989 533082 510072 840814 937246 907926 587189 844439 1028483 1061316 816293 1051829
10979 1051829 1205182 1354620 1532737 1670065 1780722 2158026 2421323 2621010 2674513 2870652
10969 2870652 2602461 2490939 2197821 2596500 1754735 1751101 1559501 1541706 1364497 1264457
10959 1264457 1571472 1431351 1783174 1375755 1482117 1258396 991465 1050806 596035 590531
10949 590531 774050 586864 598298 177433 480953 -51812 79549 172702 156940 487750
10939 487750 160169 308492 157087 14962 315610 22225 -142500 299772 361090 -93452
10928 30530 196652 85595 -94046 -182296 262128 224038 -265288 39349 171604 313007 262663
10917B62663i1299B49421L9991g9781I921a65302a5535o6624C65995H131J13176
10906A21307P6858b37094D3119c7772r4231I8346J14251G9866h4925B41203F5742
10894A50756b09767g9624b4141k6692A09394P2359a58484A90678l5366a10972
10883d8473b3562k9976E9734L20894c03436B91016d77791A44515b73319A82315
10872a99769A91581a89681A71186b93300B26984a17941B00254a91845O5349C15908
10861i7622A68596G5604e09403D6081p838g9406A5590N7534J35739G1654c73436
10849A97342e6333j03072k0146k9055B33570i7466a7877o4873L9152r3238K2027
10838a14809p5105H0931a99665E4233J03144B4090a47702j86546G4377a09731
$$ plain form
10917 262663 -91299 249421 289412 -79781 9921 -165302 -15535 -82159 365995 8131 121307
10906 121307 198165 -237094 43119 -37772 -132003 98346 212597 79866 -84925 241203 65742
10894 150756 -209767 -79624 -24141 -50833 109394 181753 -158484 190678 155312 -110972
10883 -48473 -23562 -53538 59734 380628 -303436 291016 -477791 144515 -273319 182315
10872 -199769 191581 -189681 171186 -293300 226984 -117941 200254 -191845 -126496 315908
10861 -97622 168596 75604 -509403 46081 38243 -79406 15590 73124 208863 71654 -373436
10849 197342 -56333 -159405 -179551 -208606 233570 -97466 -17877 -82750 -43598 -136836 -114809
10838 -114809 -189914 80931 -199665 54233 157377 24090 -147702 -334248 74377 -109731
10827A0832b74158A44290j9455a54482B28923a20051F7321L9797c23310g0500
10816a14128l0129g1500l8953A27608K28350j74887a9680k73396b7789n9327F7900
10804c41803c1641j6463o1980J872A36096A9370a76064k408C12242C7889c4038
10792A11329A3422N2289L3070a95806A10542d7524A49317a80084g4998r1733N6392
10781a10339D2939c8620D6212b41132F8960d1340l43862h305A82985a82906n884
10770a88790C1078a89103A18541b61570A81941b87623C22736g9511A34507b95860
10759d4942A91365i2440B70520A21551J68754b26796B01260h6329D72780a58822
10748A23618a48266G9192e2769j60596b1367l5790A66709C50e9197A46707a96521
$$ plain form
10827 10832 -274158 144290 124835 -154482 228923 -120051 67321 107118 -323310 -70500
10816 -114128 -144257 -71500 -110453 127608 355958 181071 -19680 -293076 -27789 -87116 67900
10804 -341803 -31641 -48104 -110084 -108212 136096 19370 -176064 -178472 312242 37889 -34038
10792 111329 13422 65711 98781 -195806 110542 -47524 149317 -180084 -74998 -166731 -110339
10781 -110339 42939 -38620 46212 -241132 68960 -41340 -385202 -8305 182985 -182906 -188790
10770 -188790 31078 -189103 118541 -261570 181941 -287623 322736 -79511 134507 -295860
10759 -44942 191365 -92440 270520 121551 290305 -226796 201260 -86329 472780 -158822
10748 123618 -148266 79192 -52769 -213365 -21367 -57157 166709 350 -59197 146707 -196521
10736c28078I3951a57282o3064D3773a20563B6923J18915J64265a45410A48677
10725A34133O4931I6370O6142l193a29807d8890F6973b48346b9128r6667d2206
10713h7719O823A19591b20540A83630b92824F7078h8312A04017k2417P6853C540
10701H5805j2718g2110k2976m088l1573A01511a23390l7535F687a34669B7142
10689A98187D6766M4347b23367J11346j1152A85974d7921C4234a14801e913k57825
10678b63738c328k14740f5265A04850b78809B21528b15202K7829B31302b11580
10667c07640J49071L879l9865c1963j66760B83820b21742f628l8570j81353a07517
10655a5107C9034j2612e6903A74339K6755b46171A40193h4084k05800e8289I421
$$ plain form
10736 -328078 93951 -157282 -220346 43773 -120563 26923 145838 310103 -145410 148677
10725 134133 199064 96370 162512 159319 -129807 -48890 66973 -248346 -29128 -125795 -42206
10713 -87719 -80896 119591 -220540 183630 -292824 67078 -88312 104017 81600 158453 3540
10701 85805 73087 -72110 -95086 -99174 -130747 101511 -123390 -160925 6687 -134669 27142
10689 198187 46766 91113 -223367 -112021 -123173 185974 -47921 34234 -114801 -5913 -263738
10678 -263738 -3328 -218068 -65265 104850 -278809 221528 -215202 -187373 231302 -211580
10667 -307640 -158569 -154690 -194555 -31963 -198723 283820 -221742 -6628 -45198 -226551 -107517
10655 -15107 39034 26422 -56903 174339 201094 -246171 140193 -84084 -289884 -58289 9421
10643B55895a53051A03088a30579A4375c4182j78086P2558A45162e5257l00878
10633c56135J30544N1398A85464a95388B3709J7919c84528b9089B17217a66069
10622b08031C06058E4482b9086e394j38853I8310A2244b9487G4357f532A19143
10610H8922B4586d9377e604l15146A33850b28229A94369R5256d85781f9425C1873
10598a05821q202c9217a8101B24546r711h5208H6480g3977l2383B22703h1860
10586A48415b2599G3721d39064J31284B49705a69959p34h5094A1126M5338j6274
10575D0190d7509q6938A6403c1242j29246e3577j86212M3466c8597a4552D12118
10563d36682d204A822P8453l9505J86591a61190n717H9227O1802c3923j1493q5837
$$ plain form
10643 255895 -153051 103088 -130579 14375 -34182 -212268 -139710 145162 -55257 -356135
10633 -356135 -225591 -174193 185464 -195388 23709 41628 -384528 -29089 217217 -166069
10622 -208031 306058 54482 -29086 -5394 -144247 98310 12244 -29487 74357 -6532 119143
10610 88922 24586 -49377 -5604 -320750 133850 -228229 194369 289625 -485781 -69425 31873
10598 -105821 -114023 -39217 -18101 224546 214835 -85208 86480 -73977 -106360 222703 -81860
10586 148415 -22599 73721 -439064 -307780 249705 -169959 -170693 -85094 11126 56464 40190
10575 40190 -47509 -134447 16403 -31242 -160488 -53577 -239789 -196323 -38597 -14552 412118
10563 -436682 -4204 1822 80275 40770 227361 -161190 -166907 89227 151029 -33923 -45416 -131253
10551a31253j4838e7732C1560L204K60847i1628B50921I2222a30132I3348B4597
10539f4987n3984k42796i0780B16603F7979O2581c56207a28626B06380e4954j18183
10528a73137j10773A07975E2327k1577O7781A7534b33796B49172a11922A29979
10517A05480c27813A22628m6639j9647g6383A00845L7814G42a18858B1599d6532
10505H4344d35928a78762J4271B08094a9255k10662A27934a82612C3395g4686
10494a59358r1567B58155d6563A37253b59361e7567k9341G6877M178a03860K924
10483a00936n2447A36220P0498J67981A370P6712f0042B7948L04096n2773G2725
10471B03111P2263a03613A12678A8059f2861j71347A445c4963a6997j45915q735
$$ plain form
10551 -131253 -146091 -57732 31560 34764 295611 -91628 250921 92222 -130132 93348 24597
10539 -64987 -118971 -361767 -90780 216603 67979 130560 -356207 -128626 206380 -54954 -173137
10528 -173137 -283910 107975 52327 30750 98531 17534 -233796 249172 -111922 129979
10517 105480 -327813 122628 75989 56342 -76383 100845 138659 742 -118858 21599 -46532
10505 84344 -435928 -178762 -164491 208094 -19255 -229917 127934 -182612 33395 -74686
10494 -159358 -250925 258155 -46563 137253 -259361 -57567 -86908 76877 81055 -103860 -100936
10483 -100936 -153383 136220 206718 374699 1370 78082 -60042 27948 332044 279271 72725
10471 203111 275374 -103613 112678 18059 -62861 -234208 1445 -34963 -16997 -162912 -171647
10460a71647O6178j37667A20383d7902a5236j21472j74022b281l00447c8010B6612
10448A8726e4413j18078a1586A14547J28661B0176b64927j3175A9088J33137b39577
10436c1538r4143E2843a95454a2969q66A58526f0440A91662L4576o7922a35286
10424a43116j93317A1388J44019b06505a7432j98229f2997a7448A71226e1838
10413A29330a8216j41240a8350D0249O6825a25324D24449G2669N1266d04283a13906
10401a82985A06846a68479h3889B81032c6120B42459c5937A88374m1476L53644
10391E00542I9704d9444B49864J12536A0474e4685E6861e4140p1864F846J79383
10380A86229K1618p7744J900o3504K7638D6585K27298C7836L42121j72551L50853
$$ plain form
10460 -171647 -105469 -243136 120383 -47902 -15236 -136708 -310730 -2281 -302728 -38010 26612
10448 18726 -54413 -172491 -11586 114547 243208 20176 -264927 -278102 19088 152225 -239577
10436 -31538 -125681 52843 -195454 -12969 -13835 158526 -60440 191662 226238 158316 -135286
10424 -143116 -336433 11388 155407 -206505 -17432 -215661 -62997 -17448 171226 -51838
10413 129330 -18216 -159456 -18350 40249 107074 -125324 424449 72669 123935 -404283 -113906
10401 -182985 106846 -168479 -83889 281032 -36120 242459 -35937 188374 146898 500542
10391 500542 99704 -49444 249864 362400 10474 -54685 56861 -54140 -126004 6846 186229
10380 186229 207847 130103 132003 68499 96137 46585 273883 37836 379957 207406 558259
10369E58259B09578J41349J36799j8982M8171l4625e0135B81150n7064h966A63699
10357A1663f9485I5455J37226I5210J93971k2777J49431K81089q0600A75113D6920
10345C50179J5829j48199K34304E4M06754C6528K05999F2301J42203n8939J9261
10334A64826K75468A02505O328P7231k3148a2690A5919e4951A66989J32343M9651
10323C48983j39523N7469E0101h1760A70064M8334D7428J39996k6995a39699f1197
10311C12878a36952B14594F0706H745e3584j14673A63483h5114A07734g4756j33744
10300b08500A56308A0226K91154e852A29649a14582A03532l5963a62183O388j90174
10289c45969G34a19164B7366c26375a14171A33271O2510n5268i1040A27093c90374
$$ plain form
10369 558259 209578 350927 487726 468744 516915 482290 -50135 281150 224086 -8966 163699
10357 11663 -69485 95455 232681 95210 289181 266404 415835 696924 616324 175113 46920
10345 350179 366008 217809 452113 54 406808 36528 242527 62301 204504 145565 164826
10334 164826 440294 102505 108833 186064 162916 -12690 15919 -54951 166989 299332 348983
10323 348983 209460 266929 50101 -81760 170064 218398 47428 187424 160429 -139699 -61197
10311 312878 -136952 214594 60706 8745 -53584 -168257 163483 -85114 107734 -74756 -208500
10300 -208500 156308 10226 301380 -5852 129649 -114582 103532 67569 -162183 -155795 -345969
10289 -345969 734 -119164 27366 -326375 -114171 133271 195781 140513 -91040 127093 -390374
10277h3810p6301j20126B96978c6807B61462a23753k17290A32288f5211E6663
10266f6932l4602B29917h265k21176B12088D6495L30682j59201N2654C8612K8889
10255F7501J59380Q8109C1856g3944A83708a8877A00859k205a60757o5954g8899
10243A32988N2980J3133n9254a04922B82755a32660E1584K825b24648a04854F1431
10231d2982l04575E6095c5638n2418d2632k31311E0701Q8023B6596b86519O3475
10220b23044J03531p197d4559p1643o3589H547c24956b4566A10217e3037E9773
10208G454d7375q485j61059d6000A77677B0146a24859B16629B3263a05497J3492
10197i2005j58252a886I7909a87957j2989A31117a41149P972O6532k4905m9736
$$ plain form
10277 -83810 -160111 -280237 296978 -36807 261462 -123753 -341043 132288 -65211 56663
10266 -66932 -101534 229917 -8265 -229441 212088 46495 377177 217976 270630 38612 67501
10255 67501 226881 314990 31856 -73944 183708 -18877 100859 98654 -160757 -226711 -78899
10243 132988 185968 199101 139847 -104922 282755 -132660 51584 54409 -224648 -104854 61431
10231 -42982 -347557 56095 -35638 -88056 -42632 -273943 50701 138724 26596 -286519 -223044
10220 -223044 -119513 -126710 -44559 -116202 -179791 8547 -324956 -24566 110217 -53037 59773
10208 7454 -47375 -55860 -216919 -46000 177677 20146 -124859 216629 23263 -105497 -92005
10197 -92005 -250257 -1886 97909 -187957 -200946 131117 -141149 -133177 -66645 -91550 -141286
10186a41286a349l1132k15646C67238A8789O2772J33620a0461r4212c2588A07678
10174a01655H9863a40613k13328A1850a57605a2104B9271h3131j30153M4026E4373
10162A33378b30951e0537L765C2069n740a34653K0344a5873k0752A68304M651
10151A72955a70390M8307A39780b38619k1889C31468b74006g5731J5077B61450
10140B40340a49962a549k42647j39593e3307j08351E8721h0839n3885a0315I3140
10128d31863f0228o4732o5601l8483R8370c4274A27214J24188c95317G6083a03237
10116A3848h3157n9294k5332j3714c2602k9580e467k17282A8809r064b27258N3425
10104a73833A5140a74286d9690A41278h9570J6209j03952b0091A14868K03324
$$ plain form
10186 -141286 -1349 -32481 -248127 367238 18789 81561 215181 -10461 -104673 -32588 107678
10174 -101655 89863 -140613 -353941 11850 -157605 -12104 29271 -83131 -213284 -169258 54373
10162 133378 -230951 -50537 -46772 32069 26329 -134653 -114309 -15873 -36625 168304 172955
10151 172955 -170390 -122083 139780 -238619 -260508 331468 -274006 -75731 -60654 261450
10140 240340 -149962 -1549 -244196 -383789 -53307 -161658 58721 -80839 -134724 -10315 93140
10128 -431863 -60228 -124960 -190561 -229044 -130674 -34274 127214 251402 -395317 76083 -103237
10116 13848 -83157 -142451 -167783 -181497 -32602 -62182 -5467 -222749 18809 9745 -227258 -173833
10104 -173833 15140 -174286 -49690 141278 -89570 -73361 -177313 -20091 114868 318192
10094C18192J6622j17540a98477D3657f6582E2184N6401d2701k01531L9315A27932
10082b14186A22282a04095K4454k53014a3995p0563b1316C18394i7399B24543
10071A2292c00828a26952e5097j99005j70304C7676K35694I9780a02835k8974
10061a31809B66880g0193j84782k14261A21647a22872c7517k65410G161b12095
10050F8540K11609h9314j09704B02496c4097j06482M0432d2749j91491k63233
10040d97473d1928A04417a11430q2547m303E7834J44032a33994e2558j73885n7427
10029b83870E2094A0939b28254P3478B14049f6658j57215a103C54783G675d24786
10017a44546A20731d1616j84920j67161a26172A6495i4843B51742a4369l1330
$$ plain form
10094 318192 334814 217274 -198477 43657 -66582 52184 108585 -42701 -244232 -204917 127932
10082 -214186 122282 -104095 -79641 -332655 -13995 -84558 -21316 318394 -97399 224543
10071 12292 -300828 -126952 -55097 -254102 -424406 37676 273370 99780 -102835 -131809
10061 -131809 266880 -70193 -254975 -469236 121647 -122872 -37517 -302927 7161 -212095
10050 68540 280149 -89314 -199018 202496 -34097 -140579 -100147 -42749 -234240 -497473
10040 -497473 -41928 104417 -111430 -193977 -198280 57834 201866 -133994 -52558 -226443 -283870
10029 -283870 52094 10939 -228254 -154776 214049 -66658 -223873 -1103 354783 7675 -424786
10017 -144546 120731 -41616 -226536 -393697 -126172 16495 -94843 251742 -14369 -45699
10007d5699B2922L47344b14006C7333K20709b31111A06002b6100D6538a38150
9996c1850k46319a05936m7564m8877i1916j44484H070b07046A85424j731g6407
9984a32648j13121N4109d4467l2401j4376k95488d6370k9960E1212J22247o0014
9973A13445b8107B8703R6035b44017A04649g066j2564l7006j22932e3916H6946
9961i6297m16374J59683A45759d3793j30283q4502E3860f4145E3960a02179B46785
9949A1349g0950q6219O0302k29440A42095B1016J09536E574K37888C0204J2262
9938D2466b36970A33802b21816B11728K74425a76896A30064a42035A28889a38427
9927c44796a56321A15298a07329n243b3497j77295J5818e1460C1475b33055Q5107
$$ plain form
10007 -45699 22922 370266 -214006 37333 258042 -231111 106002 -26100 46538 -138150
9996 -31850 -278169 -105936 -153500 -202377 -91916 -236400 8070 -207046 185424 183693 -76407
9984 -132648 -245769 -191660 -44467 -76868 -91244 -386732 -46370 -76330 51212 173459 113445
9973 113445 -28107 28703 124738 -244017 104649 -7066 -19630 -56636 -179568 -53916 86946
9961 -96297 -512671 -352988 145759 -43793 -174076 -258578 53860 -64145 53960 -102179 246785
9949 11349 -70950 -157169 -96867 -326307 142095 21016 130552 5574 243462 30204 42466
9938 42466 -236970 133802 -221816 211728 486153 -176896 130064 -142035 128889 -138427
9927 -344796 -156321 115298 -107329 -112572 -23497 -200792 -184974 -51460 31475 -233055 -147948
9916a47948B12779f7547J7213G3573K9028a28226d2313r0871b8342A38246a24606
9904A24683a10044J8915j438F4201i7470A88844L0991d3845A42811m7558l9034
9893E6219k6435b31599e8583C12151c7425A1452J04842k8860C488a72280P4023
9882i8257J9498q8610L2751L3069j9964A62335c87658f4098A69247a1700H30b93574
9869i0578B31792G8579f6959B52229c9107G5968e9053A7043b2008j65322H2783
9857B80208j34755k5315j3176a16378j6265o8951R3274N1784b1111B49802e9459
9845a40290l58297a11005A80519n4181k8976L7878a53847q2635q8182Q4851B44070
9833a99363g8425I7529F381a95870D0360r709f0034A49093n7603O9970h2006m7784
$$ plain form
9916 -147948 212779 -67547 -50334 73573 102601 -128226 -42313 -133184 -28342 138246 -124606
9904 124683 -110044 -91129 -92567 64201 -97470 188844 219835 -43845 142811 95253 56219
9893 56219 29784 -231599 -58583 312151 -37425 11452 116294 87434 3488 -172280 -98257
9882 -98257 -78759 -167369 -134618 -101549 -121513 162335 -387658 -64098 169247 -11700 830 -293574
9869 -90578 231792 78579 -66959 252229 -39107 75968 -59053 17043 -22008 -187330 82783
9857 280208 145453 120138 106962 -116378 -132643 -201594 -108320 -56536 -21111 249802 -59459
9845 -140290 -498587 -111005 180519 126338 97362 135240 -153847 -236482 -324664 -239813 244070
9833 -199363 -78425 97529 6381 -195870 40360 30651 -60034 149093 91490 161460 -82006 -129790
9821a29790A80149b46547B16515c8103a2982G5848i5157B16872b10521A27965
9810b3769l3093H6208a778D2208b15436H1324K7164e627A66943d32476A39460
9798c47745f4971m06085h8914n1169p5389O411j3318c2680I6381b75291a30988
9786f3048o6734L0705M0347j69391P3248g6568J6110a9458B8174J6111d8615j68677
9774b17292j6495h1610o2142A39928a46012L5663H4317c12797H4468a08276A33221
9762G0075P1085B1905a3957E9769a16688k39807b5160A69930b29577A43369D2886
9750b4378A0242M3522L15459b48458m7948A05239a80706A7900K74587b33854B2410
9738A4722g6212F7858A368a10862j20290r6305a15015d2194a2462B58481a62692
$$ plain form
9821 -129790 180149 -246547 216515 -38103 -12982 75848 -95157 216872 -210521 127965
9810 -23769 -56862 86208 -1778 42208 -215436 81324 108488 -5627 166943 -432476 139460
9798 -347745 -64971 -471056 -88914 -140083 -215472 -209061 -222379 -32680 96381 -275291 -130988
9786 -63048 -129782 -99077 -58730 -228121 -154873 -76568 -60458 -19458 28174 44285 -48615 -217292
9774 -217292 -233787 -81610 -143752 139928 -146012 -110349 84317 -312797 84468 -108276 133221
9762 70075 141160 21905 -13957 59769 -116688 -356495 -25160 169930 -229577 143369 42886
9750 -24378 10242 53764 369223 -248458 -296406 105239 -180706 17900 292487 -233854 22410
9738 14722 -76212 67858 1368 -110862 -231152 -327457 -115015 -42194 -12462 258481 -162692
9726b69788B8876J72374c54538G360P8811B0202P4990g3638q3575A04054c27742
9714A80187m0406a93057D0774h8220a1752G461d9865o2452A8131c02792J02649
9703b00143P9989N6314j12947j24384C485a59924I0298A989L8961f0666j02031
9692a62697O674A10062R1150b19277n0737A51840h6154j01423J1223c6772B0722
9680A3639a84212f6221A08784a41470l4929M9686B52366c6993o2B81041j16305
9669A64736A4258c9092l07316m3860D236H42c79349a37907r8166o2459D6126J885
9657D8011b47422L0468g5135c3493j46107b9626C6510M2260l1748K77616a24582
9645a551B7106Q0686j7322B2692a2094j72521j10506J33127L9985q6651B33553
$$ plain form
9726 -269788 28876 201250 -354538 7360 86171 20202 95192 -73638 -157213 104054 -327742
9714 180187 139781 -193057 40774 -88220 -11752 7461 -49865 -112317 18131 -302792 -200143
9703 -200143 -120154 -63840 -176787 -301171 3485 -159924 90298 1989 40950 -60666 -162697
9692 -162697 -156023 110062 201212 -219277 -270014 151840 -86154 -187577 -176354 -36772 20722
9680 13639 -184212 -66221 108784 -141470 -176399 -126713 252366 -36993 -37055 281041 164736
9669 164736 14258 -39092 -346408 -390268 4236 842 -379349 -137907 -236073 -298532 46126 48011
9657 48011 -247422 -216954 -75135 -33493 -179600 -29626 36510 78770 47022 324638 -124582
9645 -1551 27106 107792 90470 22692 -12094 -184615 -295121 -161994 -122009 -208660 233553
9633a10220r2563E426b05419L1017j73270h7355n9397f0004j83034f0761l95930
9622d56691D7795k3579b89174P242K9490q4146i7296j09600A48814A7084A721
9610b68164C03948R5243H1802d09763A99316a83626L2987f4870C8533a25552j81349
9599c06901e1397C0343L18267F7368a13496n3728j39425C14809L0436c06672A89880
9587h2471b6271A17809A3160a37447I9906a57766A16464D6939O5044c00624i0424
9575E1419Q1860a29779D57012A38668a67511J1178C42816a75072m1605R0714E517
9563B44788r6942a48442H6799a45629M6715r2661h0572j16593A81875a05416K3688
9552h1728C22512b16031N4521b2429j31015j38645A49388a13081p5154h3015A41834
$$ plain form
9633 -110220 -202783 5426 -205419 -174402 -347672 -87355 -146752 -60004 -243038 -60761 -456691
9622 -456691 47795 24216 -289174 -281932 -252442 -336588 -97296 -206896 148814 17084 1721
9610 -268164 303948 399191 81802 -409763 199316 -183626 -150639 -64870 38533 -125552 -306901
9599 -306901 -51397 30343 348610 67368 -113496 -167224 -306649 314809 345245 -306672 189880
9587 -82471 -26271 117809 13160 -137447 99906 -157766 116464 46939 111983 -300624 -90424
9575 51419 133279 -129779 457012 138668 -167511 -156333 342816 -175072 -216677 -125963 5517
9563 244788 147846 -148442 86799 -145629 -98914 -191575 -80572 -197165 181875 -105416 -81728
9552 -81728 322512 -216031 -161510 -22429 -153444 -292089 149388 -113081 -188235 -83015 141834
9540b68082l11259a32214A6953M3094a31991H6873f1155c0114j33316H7962b17109
9528b8428j39619q0015h3943j49849C18172a95675j02548l7367J31175D136a64294
9516e9462M576k09270J08565b9016m8539j16306A25612K57419a87117O450M6981
9505a33686j68653A03974d6694A28325c0619E8882f3086E6659J41478g3842b0720
9493G9185d6572j72042i1756G3617c653k02506Q3829e9516J0476A3595c65937
9481B97985d2686j61818k26847A29129c6137A84150a45779n375O1003o6503L6107
9470a20547d3851D9725Q264c66079B7437i0441b9499j40364E0013h496E6368A3677
9457i8382e252B23611l0066a879A71537F7792J26699c59430a26745A28261D7635
$$ plain form
9540 -268082 -579341 -132214 16953 60047 -131991 86873 -61155 -30114 -163430 87962 -217109
9528 -28428 -168047 -248062 -83943 -233792 318172 -195675 -298223 -335590 -204415 4136 -164294
9516 -59462 -54886 -264156 -155591 -29016 -77555 -193861 125612 383031 -187117 -180667 -133686
9505 -133686 -302339 103974 -46694 128325 -30619 58882 -63086 56659 198137 -73842 -20720
9493 79185 -46572 -218614 -91756 73617 -3653 -206159 -122330 -59516 -49040 13595 -365937
9481 297985 -42686 -204504 -431351 129129 -36137 184150 -145779 -151154 -90151 -156654 -120547
9470 -120547 -43851 49725 57989 -366079 27437 -90441 -29499 -169863 50013 -8496 56368 13677
9457 -98382 -5252 223611 193545 -1879 171537 67792 194491 -359430 -126745 128261 47635
9445a98061B1050O82J07562a35777j9767A19430E324a85887a7698B97470b31352
9433B08388b93306G4320L9111L2833a23045F1437b35967M2781i4581j29120d0414
9421c66969a04866o4796D3314h7418k30906e2672E6614L7573N0074b89806B02596
9409B9182e4301H2124B8560a63187K6449F4904N5563b75725i6248A003J16129
9398A17132a18500A11550m5244J46743H9697B1849a46879N7678A3365h2431k51915
9387c34346C6656K01476A0541D692R9549b64641a21056A05401a83400A9556K1101
9376D0657a82568L2166C2559a65564D2350c62547a17563k21698F2693b09022A11195
9364a72799a2893m719D4645L04324c25714B5665c74169I364K40393j13740b35220
$$ plain form
9445 -198061 21050 21732 129294 -135777 -155544 119430 5324 -185887 -17698 297470 -231352
9433 208388 -293306 74320 113431 146264 -123045 61437 -235967 -193186 -94581 -223701 -40414
9421 -366969 -104866 -169662 43314 -87418 -318324 -52672 56614 94187 144261 -289806 202596
9409 29182 -54301 82124 28560 -163187 -136738 64904 120467 -275725 -96248 1003 117132
9398 117132 -118500 111550 66306 213049 89697 21849 -146879 -89201 13365 -82431 -334346
9387 -334346 36656 238132 10541 4692 104241 -264641 -121056 105401 -183400 19556 40657
9376 40657 -182568 -150402 32559 -165564 42350 -362547 -117563 -339261 62693 -209022 111195
9364 -172799 -12893 -17612 44645 348969 -325714 25665 -374169 9364 249757 136017 -235220
9352e79498a93774B9610e65038b38282H0571a35322M2223k01780B2871J00590
9342A23461D5404b82899f2080m4132J026J7087A05947a77040j46781a17905c1363
9330b84295P4539d4805o4111l33568a77825O9397I9161J69042a85324i04m4799
9319d5703o2481P805c4318A26454c33746A51545l3782J24170r3618a0204B2690
9307I1951C2700I47a61021H430b09441Q8924A02484a3309j18063G1823J48238
9296B20061a94373m1989O0951M0108r1684k6316K8284M8290Q6855K1134j70724
9285b39464e1586p7678B24628b68825A79371d46902a18855N1770h742B44789c25790
9273g2011c2850m325l25196a72804l59820J76265h4660F1489J11737a69727A14789
$$ plain form
9352 -579498 -193774 29610 -565038 -238282 80571 -135322 -93099 -294879 22871 123461
9342 123461 45404 -282899 -62080 -106212 -105186 -88099 105947 -177040 -323821 -117905 -31363
9330 -284295 -209756 -44805 -108916 -442484 -177825 -108428 99161 268203 -185324 -904 -45703
9319 -45703 -108184 -100379 -34318 126454 -333746 151545 117763 241933 148315 -10204 22690
9307 91951 32700 947 -161021 8430 -209441 -120517 102484 -13309 -131372 71823 220061
9296 220061 -194373 -236362 -175411 -135303 -226987 -253303 -225019 -176729 -89874 -68740 -239464
9285 -239464 -51586 -129264 224628 -268825 179371 -446902 -118855 -67085 -8742 244789 -325790
9273 -72011 -32850 -37175 -362371 -172804 -532624 -356359 -84660 61489 173226 -169727 114789
9261b20125p8563A95530i7200j44648C0693g2031k43305G344a18970A94456B3766
9249h990B56258a59598g7638L552n1809B47621o1713b44727C1024b16575I7960
9237B3106a34710G2012c39965D0549j6K46740e7460k34051A9355N9962a67837
9225b43496O2969A76600a70119O2232A71898d0579A27902a39939n1494i3636c3094
9213c80198h7560P998A62256f8657F6245b73780Q4115D0405i1696l3317A88413
9201b68910a14130M2072j36748A64177a09048d4490n28l125j79066c9987B5455
9189C2161k829e2023k8016B7151L6096b2783q6004o3257M8784k63595A58545b74953
9176B3311R025O2912K9643b53078e7050G8180d4133A0558a21787j13529G4098
$$ plain form
9261 -220125 -298688 195530 -97200 -241848 30693 -72031 -315336 7344 -118970 194456 23766
9249 -8990 256258 -159598 -77638 -74086 -125895 247621 185908 -244727 31024 -216575 97960
9237 23106 -134710 72012 -339965 40549 40533 287273 -57460 -291511 19355 79317 -167837
9225 -243496 -180527 176600 -170119 -107887 171898 -40579 127902 -139939 -191433 -93636 -33094
9213 -380198 -87560 -79562 162256 -68657 66245 -273780 -189665 40405 -91696 -125013 188413
9201 -268910 -114130 -72058 -208806 164177 -109048 -44490 -45018 -48143 -227209 -39987 25455
9189 32161 29332 -52023 -80039 27151 63247 -22783 -108787 -172044 -123260 -386855 158545 -274953
9176 23311 32336 95248 124891 -253078 -57050 78180 -44133 10558 -121787 -235316 74098
9164a09091j17792Q4768e5464M140B70442A08103B7594b76805G5246d1615p1366
9153a12981j52553n5457A13624K2175a32409l56950f7916n8278A47390O0165a27618
9141a31839F9728h4493C73468c2432n4734m04g753A95865D5083O1278m7570a09399
9128A02499b41061A18639b50097J8136d8857J4953A38819g3809k93542A18760
9117B6783J19096O4662d9806g162A72165a62725k13982A40447J06650b39514B69422
9105c7145m737E6799a05185q9375A24693a28508c3244j70196B1749b21716D9904
9093c4615A44869a27112P208K2936E7164A0692J47797b47168d5767D5556c8051
9081C0356b51692m8963c7172o6832H2694K6361a26278c3557B62379B452c7357
$$ plain form
9164 -109091 -226883 -142115 -55464 -51324 270442 108103 27594 -276805 75246 -41615 -112981
9153 -112981 -265534 -320991 113624 135799 -132409 -489359 -67916 -126194 147390 207555 -127618
9141 -131839 69728 -84493 373468 -32432 -87166 -87570 -7753 195865 45083 106361 58791 -109399
9128 102499 -241061 118639 -250097 -231961 -48857 -33904 138819 -73809 -367351 118760
9117 26783 145879 210541 -49806 -7162 172165 -162725 -376707 140447 247097 -239514 269422
9105 -37145 -41882 56799 -105185 -194560 124693 -128508 -33244 -203440 21749 -221716 49904
9093 -34615 144869 -127112 -119904 -96968 57164 10692 158489 -247168 -45767 45556 -38051
9081 30356 -251692 -300655 -37172 -104004 82694 109055 -126278 -33557 262379 2452 -37357
9069A29582a10882A84965H3195d5812D98b72194k45435A04206K6216a17977j29052
9058b47029B45187o0021c6161J6800j05606A48557B9413a16299p4658G6660b08801
9046A58471a7322D7440c28195a29130b972A58382n9944b28920Q1937M918a1456
9034G1025a65884e5755q3491k6829D0598a00758A03366b45858I4604d9267k43386
9023b92653A97988D1595h1825A3149c71960i1834r1754D1280c03146A14167k7531
9012H6636R0170G2036L6253e7168j01452C46776b57486f7292o688A08791a32642
9000C1117J05166f049B03206d23550c1353E6054A1248c86123a07683k06387f719
8988a96953A26951J08463a68500N1442I8378a6458B12068H9229e8985A1793J74303
$$ plain form
9069 129582 -110882 184965 83195 -45812 498 -272194 -517629 104206 130422 -117977 -247029
9058 -247029 245187 185166 -36161 -19361 -124967 148557 29413 -116299 -190957 76660 -208801
9046 158471 -17322 47440 -328195 -129130 -2972 158382 98438 -228920 -146983 -142065 -11456
9034 71025 -165884 -55755 -139246 -166075 40598 -100758 103366 -245858 94604 -49267 -292653
9023 -292653 197988 41595 -81825 13149 -371960 -91834 -183588 41280 -303146 114167 86636
9012 86636 176806 72036 108289 -57168 -158620 346776 -257486 -67292 -73980 108791 -132642
9000 31117 136283 -6049 203206 -423550 -31353 56054 11248 -386123 -107683 -314070 -6719
8988 -196953 126951 235414 -168500 -117058 98378 -16458 212068 89229 -58985 11793 186096
8977A86096b47007A52119j5701J82588I364b35541C7798K32611f4604A31153b53228
8965d8421l53429A58708b9301B9394K9666b7511m0556B48527c343j69082I7158
8953A91439d9496q7657E1779c8677j36k79346j02213b0556j37807A79769d7542
8941b3819l5663j64211j91012B30617b8850L742B75966A26621I768b9259B79639
8929H7970a88724c1891B2862d1124D0285L69532J895386O172828k594595B108120
8918A119768C86153j51258m8690F409a17904G6875a00528C6578A2175R7458M2498
8907A52131Q1172E2796c52991M6974J19008G9532b42317B116b62942B22733a83222
8895c25733B67850c71169q8060A9010J18058a88277R3556F506J16946f8174c1583
$$ plain form
8977 186096 -247007 152119 136418 319006 9364 -235541 37798 270409 -64604 131153 -253228
8965 -48421 -401850 158708 -29301 29394 59060 -27511 -68067 248527 -3343 -172425 97158
8953 191439 -49496 -137153 51779 -38677 -38813 -318159 -420372 -20556 -158363 179769 -47542
8941 -23819 -59482 -223693 -414705 230617 -28850 -25108 275966 126621 9768 -29259 279639
8929 87970 -188724 -31891 22862 -41124 40285 409817 2305203 8478031 5883436 2108120
8918 1119768 386153 234895 186205 6409 -117904 76875 -100528 36578 12175 109633 152131
8907 152131 233303 52796 -352991 -306017 -187009 79532 -242317 2116 -262942 222733 -183222
8895 -325733 267850 -371169 -459229 19010 137068 -188277 -94721 6506 123452 -68174 -31583
8883B7848a90378i58j07778j39607M9301G7333b91920C83630i9238j45731i8893
8871a61638k3758b4782j50946D8363c24028a21015I214J62200a91287f9021O006
8860f3015m9754j35183L1005D1753J40118C2903K2943b63086A90093g9933m0158
8849a20091A13045J1840k1448c25277A48298i2017J8852j29669M4931b0249j97647
8838b17896C72230a26139I3893k6114a20051e7127A42852L64848a24284k4880
8828a49164H5295i8501B0630a07307k37165E0718c71489A16630b70859J13702
$$ plain form
8883 27848 -190378 -958 -108736 -248343 -199042 77333 -291920 383630 -99238 -244969 -98893
8871 -161638 -185396 -24782 -175728 48363 -324028 -121015 9214 171414 -191287 -69021 -63015
8860 -63015 -112769 -247952 -216947 41753 181871 32903 55846 -263086 190093 -79933 -120091
8849 -120091 113045 124885 103437 -325277 148298 -92017 -73165 -202834 -157903 -20249 -217896
8838 -217896 372230 -126139 93893 67779 -120051 -57127 142852 507700 -124284 -149164
8828 -149164 85295 -98501 20630 -107307 -344472 50718 -371489 116630 -270859 -157157
$$ [...]
##END NTUPLES=NMR SPECTRUM
##END=
