##TITLE=AC1406_BRAA12215_7653149_5PJ1xK5njd
##JCAMPDX= 6.0         $$ Bruker NMR JCAMP-DX V2.0
##DATA TYPE= NMR SPECTRUM
##DATA CLASS= NTUPLES
##ORIGIN= BRUKER
##OWNER= Administrator
$$ 1.72 TOPSPIN		Version 2.1
$$ 2013-04-11 16:57:19.202 -0700  Administrator@X
$$ Compression mode = diff/dup
##.OBSERVE FREQUENCY= 400.02188249412
##.OBSERVE NUCLEUS= ^1H
##.ACQUISITION MODE= SIMULTANEOUS (DQD)
##.ACQUISITION SCHEME= undefined
##.AVERAGES= 64
##.DIGITISER RES= 22
##SPECTROMETER/DATA SYSTEM= spect
##.PULSE SEQUENCE= noesygpps1d.comp
##.SOLVENT NAME= COFFEE_meoh
##.SHIFT REFERENCE= INTERNAL, COFFEE_meoh, 1, 14.96084
##AUDIT TRAIL= $$ (NUMBER, WHEN, WHO, WHERE, PROCESS, VERSION, WHAT)
$$ ##TITLE= Audit trail, TOPSPIN		Version 2.1
$$ ##JCAMPDX= 5.01
$$ ##ORIGIN= Bruker BioSpin GmbH
$$ ##OWNER= Administrator
$$ $$ E:\/data/COFFEE/nmr/AC1406_BRAA12215_7653149_5PJ1xK5njd/52/pdata/1/auditp.txt
$$ ##AUDIT TRAIL=  $$ (NUMBER, WHEN, WHO, WHERE, PROCESS, VERSION, WHAT)
(   1,<2013-04-11 16:57:12.622 -0700>,<Administrator>,<X>,<go>,<TOPSPIN 2.1>,
      <created by zg
	started at 2013-04-11 16:45:43.011 -0700,
	POWCHK enabled, PULCHK disabled,
       configuration hash MD5:
       33 CF 6A 21 5C D3 B9 40 6C 15 AA 8D 27 A2 4F 13
       data hash MD5: 64K
       C5 AA 48 B5 12 B9 5C 38 22 D0 B1 31 9D 1E 6E F5>)
(   2,<2013-04-11 16:57:16.428 -0700>,<Administrator>,<X>,<proc1d>,<TOPSPIN 2.1>,
      <Start of raw data processing
       efp LB = 0.3 FT_mod = 6 PKNL = 1 PHC0 = 0 PHC1 = 0 SI = 128K 
       data hash MD5: 128K
       AB 45 CA 2D 7A C2 98 29 9E F0 C6 F0 64 31 78 C0>)
(   3,<2013-04-11 16:57:17.444 -0700>,<Administrator>,<X>,<proc1d>,<TOPSPIN 2.1>,
      <pk PHC0 = -79.16199 PHC1 = 0 
       data hash MD5: 128K
       D0 29 36 A5 4D 4E 1C 18 83 B9 8E C7 34 FC F5 77>)
(   4,<2013-04-11 16:57:18.156 -0700>,<Administrator>,<X>,<proc1d>,<TOPSPIN 2.1>,
      <abs ABSG = 1 
       data hash MD5: 128K
       20 D8 55 82 DF 8E 01 4F E3 70 43 61 CE 6E B8 3D>)
(   5,<2013-04-11 16:57:18.338 -0700>,<Administrator>,<X>,<proc1d>,<TOPSPIN 2.1>,
      <abs ABSG = 2 
       data hash MD5: 128K
       AB 62 CF 47 57 08 5A B2 99 49 71 D2 97 59 78 AF>)
(   6,<2013-04-11 16:57:18.505 -0700>,<Administrator>,<X>,<proc1d>,<TOPSPIN 2.1>,
      <abs ABSG = 3 
       data hash MD5: 128K
       F8 39 C9 DD D9 9F D1 86 F8 26 2B B0 F1 3C 2B C4>)
(   7,<2013-04-11 16:57:18.687 -0700>,<Administrator>,<X>,<proc1d>,<TOPSPIN 2.1>,
      <abs ABSG = 4 
       data hash MD5: 128K
       16 27 54 33 D3 D1 30 72 D3 54 29 94 52 08 7E 69>)
(   8,<2013-04-11 16:57:18.869 -0700>,<Administrator>,<X>,<proc1d>,<TOPSPIN 2.1>,
      <abs ABSG = 5 
       data hash MD5: 128K
       3F 33 F7 E8 AD 6E 5C 35 6C FC 9A 58 1C 18 BB A2>)
$$ ##END=
$$ 
$$ $$ hash MD5
$$ $$ 49 C8 D1 15 65 A1 8A 6E 01 5F 10 96 F0 E8 F0 BD
##$RELAX= 
##$RELAX= 
##$RELAX= 
##$RELAX= 
##$RELAX= 
##$RELAX= 
##$RELAX= 
##$RELAX= 
$$ Bruker specific parameters
$$ --------------------------
##$DU= <E:\>
##$EXPNO= 52
$$ [...]
##$TP07= 0
##$TPNAME0= <>
##$TPNAME1= <>
##$TPNAME2= <>
##$TPNAME3= <>
##$TPNAME4= <>
##$TPNAME5= <>
##$TPNAME6= <>
##$TPNAME7= <>
##$TPOAL= (0..7)
0.5 0.5 0.5 0.5 0.5 0.5 0.5 0.5
##$TPOFFS= (0..7)
0 0 0 0 0 0 0 0
##$TUNHIN= 0
##$TUNHOUT= 0
##$TUNXOUT= 0
##$USERA1= <user>
##$USERA2= <user>
##$USERA3= <user>
##$USERA4= <user>
##$USERA5= <user>
##$V9= 5
##$VALIST= <valist>
##$VCLIST= <CCCCCCCCCCCCCCC>
##$VD= 0
##$VDLIST= <DDDDDDDDDDDDDDD>
##$VPLIST= <PPPPPPPPPPPPPPP>
##$VTLIST= <TTTTTTTTTTTTTTT>
##$WBST= 2048
##$WBSW= 25
##$XGAIN= (0..3)
0 0 0 0
##$XL= 0
##$YL= 0
##$YMAX_a= 5608966
##$YMIN_a= -12039511
##$ZGOPTNS= <>
##$ZL1= 120
##$ZL2= 120
##$ZL3= 120
##$ZL4= 120
##$ABSF1= 14.96084
##$ABSF2= -5.597342
##$ABSG= 5
##$ABSL= 3
##$ALPHA= 0
##$AQORDER= 0
##$ASSFAC= 0
##$ASSFACI= 0
##$ASSFACX= 0
##$ASSWID= 0
##$AUNMP= <proc_prof1d_extract.lims>
##$AXLEFT= 0
##$AXNAME= <>
##$AXNUC= <1H>
##$AXRIGHT= 0
##$AXTYPE= 0
##$AXUNIT= <>
##$AZFE= 0.1
##$AZFW= 0.1
##$BCFW= 0
##$BC_mod= 0
##$BYTORDP= 0
##$COROFFS= 0
##$CY= 15
##$DATMOD= 1
##$DC= 0
##$DFILT= <>
##$DTYPP= 0
##$F1P= 0
##$F2P= 0
##$FCOR= 0.5
##$FTSIZE= 131072
##$FT_mod= 6
##$GAMMA= 0
##$GB= 0
##$INTBC= 1
##$INTSCL= 1
##$ISEN= 128
##$LB= 0.3
##$LEV0= 0
##$LPBIN= 0
##$MAXI= 10000
##$MC2= 0
##$MEAN= 0
##$ME_mod= 0
##$MI= 0
##$NCOEF= 0
##$NC_proc= -2
##$NLEV= 6
##$NOISF1= 0
##$NOISF2= 0
##$NSP= 0
##$NTH_PI= 0
##$NZP= 0
##$OFFSET= 14.96084
##$PC= 1
##$PHC0= -79.16199
##$PHC1= 0
##$PH_mod= 1
##$PKNL= yes
##$PPARMOD= 0
##$PPDIAG= 0
##$PPIPTYP= 0
##$PPMPNUM= 2147483647
##$PPRESOL= 1
##$PSCAL= 4
##$PSIGN= 0
##$PYNMP= <proc.py>
##$REVERSE= no
##$SF= 400.020009698986
##$SI= 131072
##$SIGF1= 0
##$SIGF2= 0
##$SINO= 400
##$SIOLD= 131072
##$SPECTYP= <>
##$SREGLST= <1H.CDCl3>
##$SSB= 0
##$STSI= 131072
##$STSR= 0
##$SW_p= 8223.68421052631
##$SYMM= 0
##$S_DEV= 0
##$TDeff= 65536
##$TDoff= 0
##$TI= <>
##$TILT= no
##$TM1= 0
##$TM2= 0
##$TOPLEV= 0
##$USERP1= <user>
##$USERP2= <user>
##$USERP3= <user>
##$USERP4= <user>
##$USERP5= <user>
##$WDW= 1
##$XDIM= 131072
##$YMAX_p= 413567229
##$YMIN_p= -12569
##$CURPLOT= <Network HP LaserJet P1505>
##$CURPRIN= <$Network HP LaserJet P1505>
##$DFORMAT= <normdp>
##$LAYOUT= <+/1D_H.xwp>
##$LFORMAT= <normlp>
##$PFORMAT= <normpl>
##$SURQMSG= 1
$$ End of Bruker specific parameters
$$ ---------------------------------
##NTUPLES= NMR SPECTRUM
##VAR_NAME=  FREQUENCY,     SPECTRUM/REAL,   SPECTRUM/IMAG
##SYMBOL=    X,             R,               I
##VAR_TYPE=  INDEPENDENT,   DEPENDENT,       DEPENDENT
##VAR_FORM=  AFFN,          ASDF,            ASDF
##VAR_DIM=   131072,        131072,          131072
##UNITS=     HZ,            ARBITRARY UNITS, ARBITRARY UNITS
##FACTOR=    0.0627417313425164, 1,          1
##FIRST=     8223.62146879497, -374,         -55753
##LAST=      0,             1911,            -56542
##MIN=       0,             -12569,          0
##MAX=       8223.62146879497, 413567229,    0
$$ Real data points
##PAGE= N=1
##DATA TABLE= (X++(R..R)), XYDATA
$$ [...]
67881 87572 86425 85689 85317 85110 85086 85464 86152 86621 86608 86675 87644 89493 91244 92061 92138 92321 93019 93758 93787 92946
67861 92946 91828 91153 91103 91256 91072 90341 89200 87852 86401 84934 83688 83002 82980 83208 82974 81921 80424
67844 80424 79193 78585 78467 78629 78975 79278 79094 78261 77270 76882 77394 78525 79930 81536 83330 85154 86960
67827 86960 89115 92165 96233 100799 105166 109018 112476 115696 118625 121134 123274 125320 127528 129742
67813 129742 131199 130903 128523 124869 121167 117827 114234 109837 104957 100297 96070 92124 88610 85928
67799 85928 84068 82557 81052 79578 78135 76592 75100 74127 73845 73842 73680 73404 73305 73409 73444 73129 72370 71363
67781 71363 70557 70263 70266 70190 70228 70940 72190 72913 72427 71449 71247 72130 73373 74349 75132 76041 77182 78462 79638
67762 79638 80419 80860 81565 83045 85022 86841 88426 90209 92209 93835 94694 94902 94467 93102 91043 89343
67746 89343 88789 88944 88863 88413 88274 88785 89426 89548 89163 88817 88901 89181 88869 87160 83939 80036 76668 74507
67728 74507 73289 72235 70789 69006 67380 66352 65957 65888 65743 65081 63496 61122 59048 58643 60094 61996
67712 61996 62836 62586 62398 62967 63886 64559 65014 65555 66191 66819 67602 68691 69789 70417 70504 70331 69994 69361 68544
67693 68544 67985 67897 67974 67849 67607 67546 67653 67582 67066 66114 64860 63525 62511 62203 62566 63204 63929 65052 66873
67674 66873 69047 70735 71320 70843 69854 69034 68875 69380 69996 70086 69517 68656 67810 67022 66468 66651 67826 69481
67656 69481 70803 71576 72235 73007 73474 73184 72311 71364 70516 69664 68989 68926 69459 69977 70073 70117 70610 71311 71523 71105
67636 71105 70639 70535 70558 70424 70351 70698 71453 72454 73756 75343 76757 77537 77839 78084 78164 77592 76415 75304
67618 75304 74613 74043 73546 73875 75602 78009 79622 79766 79070 78494 78386 78595 79024 79702 80510 81124 81306 81124
67600 81124 80823 80467 79760 78300 76054 73521 71408 70162 69755 69763 69665 69236 68671 68260 68039 67975 68311 69255 70344
67581 70344 70693 70092 69344 69192 69418 69479 69534 70166 71313 72205 72360 72037 71668 71358 71020 70533 69704 68481 67285
67562 67285 66658 66554 66477 66349 66686 67741 69124 70524 72153 73998 75206 74843 72997 70581 68295 66342
67546 66342 64944 64449 64813 65514 66045 66214 65958 65275 64472 64081 64284 64609 64403 63487 62295 61468 61391 61988 62876
67527 62876 63691 64281 64587 64527 64079 63407 62756 62332 62361 63051 64242 65242 65340 64513 63445 62865 62973 63457 63833
67508 63833 63824 63533 63242 62958 62409 61655 61420 62371 64232 66050 67253 67911 68014 67200 65486 63691 62623 62237
67490 62237 61993 61789 61950 62498 63016 63291 63522 63681 63132 61321 58633 56179 54751 54288 54336 54660 55292 56269
67472 56269 57607 59337 61271 62915 63969 64811 66078 67698 68763 68507 67026 64934 62818 61338 61213
67457 61213 62512 64271 65461 66176 67235 68804 70124 70608 70451 69994 69240 68310 67752 67874 68172 67931 67180
67440 67180 66685 67124 68523 70307 71700 72301 72455 72867 73751 74692 75395 76072 76806 77107 76545 75406 74182
67423 74182 72775 70832 68624 66952 66206 66050 66001 65820 65376 64625 63804 63213 62737 61977 60927 60135 60079 60682
67405 60682 61503 62166 62576 63012 63950 65513 67139 68079 68153 67665 66795 65576 64363 63685 63574 63672 64037 65106
67387 65106 66625 67393 66557 64608 62604 60980 59699 59024 59353 60457 61631 62512 63194 63619 63574 63323 63534
67370 63534 64350 65102 65247 65114 65313 65768 65835 65241 64433 63974 63948 64065 64104 64074 64065 64150 64427 64975 65704 66320 66571
67349 66571 66524 66450 66426 66138 65207 63703 62250 61577 61929 62894 63789 64236 64345 64384 64426 64441 64593 65182 66302 67829
67329 67829 69800 72475 75804 79056 81297 82219 82222 81725 80676 78882 76600 74529 73203 72508 71872 70880
67313 70880 69675 68764 68510 68817 69280 69609 69860 70257 70749 70898 70379 69591 69434 70379 71978 73526 74858 76144
67295 76144 77169 77472 77196 77151 77813 78749 79330 79527 79595 79364 78422 76845 75246 74095 73360 72817 72375 72117
67277 72117 72227 72834 73722 74304 74219 73779 73458 73128 72381 71620 72135 74722 78681 82554 85528 87696 89191
67260 89191 89694 88882 86991 84667 82436 80431 78591 76929 75581 74665 74248 74462 75408 76741 77576 77239
67244 77239 76143 75447 75668 76077 75782 74989 74591 74751 74662 73894 73253 73827 75552 77280 78116 78145 77823 77243 76345
67225 76345 75484 75307 76024 77114 77838 77845 77206 76124 74843 73740 73225 73443 74202 75234 76421 77674 78735
67208 78735 79317 79447 79521 79882 80459 80910 81096 81186 81272 81097 80364 79242 78292 77889 77907 78093 78512 79391 80632 81777
67188 81777 82488 82872 83212 83573 83807 83877 84003 84504 85594 87222 89009 90403 91046 91035 90696 90153 89360 88487
67170 88487 87990 88070 88323 88187 87582 86885 86355 85976 85781 85948 86447 86991 87537 88494 90117 91914 93056 93236
67152 93236 92808 92202 91625 91338 91694 92656 93612 93972 93769 93476 93333 93143 92663 92018 91726 92375 94189 96674
67134 96674 98736 99393 98593 97349 96943 97908 99688 101266 102098 102470 103027 104101 105561 107142 108639 109806
67118 109806 110311 109981 109049 108066 107542 107601 107885 107875 107471 107227 107811 109308 111278 113448 115876 118305 119828
67101 119828 119680 118174 116434 115263 114645 114300 114257 114696 115571 116645 117757 118806 119613 120058 120389 121151 122705
67084 122705 124881 127139 129001 130220 130763 130826 130857 131272 131987 132486 132567 132836 134095 136350 138793 140787 142418
67067 142418 143910 144934 145023 144423 144056 144541 145658 146957 148610 151273 155088 159112 162043 163482 164223 165217
67051 165217 166527 167592 168290 169201 170761 172637 174189 175222 175963 176551 176906 177018 177085 177375 178125 179459 181259
67034 181259 183205 185085 186891 188490 189514 189912 190371 191756 194202 197074 199767 202127 204187 205947 207562
67019 207562 209363 211459 213581 215495 217376 219582 222178 224794 226967 228604 230229 232672 236285 240414
67005 240414 243914 246291 248202 250755 254489 259079 263848 268375 272707 277096 281588 285980 290145 294220
66991 294220 298317 302270 305969 309741 313904 318053 321359 323742 326206 329708 334154 338909 343855 349350
66977 349350 355309 361026 366015 370546 375155 379983 384880 389880 395288 401400 408336 416045 424200 432189
66963 432189 439522 446323 453143 460206 467133 473679 480482 488605 498295 508594 518312 527089 535378 543735
66949 543735 552457 561674 571332 581147 590897 600842 611596 623480 636206 649220 662219 675265 688565
66936 688565 702189 716003 729915 744233 759531 775972 792954 809755 826409 843583 861656
66925 861656 880296 898988 917548 936071 954802 974268 995122 1017546 1040974 1064656 1088366
66914 1088366 1112411 1137187 1162914 1189548 1216698 1243805 1270724 1298051 1326680 1357047 1388948
66903 1388948 1421881 1455318 1488775 1521990 1555168 1588909 1623788 1660027 1697469 1735777 1774746
66892 1774746 1814485 1855168 1896513 1937719 1978192 2018180 2058373 2098947 2139347 2179058 2218171
66881 2218171 2256958 2295234 2332495 2368551 2403566 2437520 2470049 2501009 2530830 2559934 2587931
66870 2587931 2613723 2636388 2655723 2672051 2685860 2697669 2707727 2715583 2720312 2721461 2719545 2715336
66858 2715336 2708964 2700106 2688751 2675185 2659313 2640590 2618779 2594334 2567822 2539382 2508988 2476940
66846 2476940 2443735 2409575 2374292 2337789 2300374 2262545 2224416 2185508 2145353 2104327 2063547
66835 2063547 2023707 1984398 1944962 1905654 1867243 1829652 1791809 1753060 1714009 1675681 1638488
66824 1638488 1602432 1567687 1534339 1501819 1469277 1436436 1403696 1371488 1339929 1309026 1278804
66813 1278804 1249226 1220325 1192410 1165838 1140492 1115692 1090765 1065603 1040678 1016644 993952
66802 993952 972733 952897 934161 916001 897808 879374 861128 843619 826824 810319 794041
66791 794041 778429 763668 749235 734409 718937 703094 687441 672649 659135 646642 634571
66780 634571 622864 612092 602390 592909 582756 572016 561365 551098 541116 531485 522348 513516 504772
66767 504772 496406 488809 481657 474201 466336 458742 451830 445129 437891 429851 421277 412735 404935 398324
66753 398324 392574 386825 380619 374317 368505 363323 358576 354154 350026 346021 341959 337896 334055 330504
66739 330504 327050 323462 319716 315975 312355 308778 305123 301456 297934 294530 291044 287411 283714 279881
66725 279881 275747 271586 268107 265629 263575 261152 258214 255144 252216 249530 247272 245446 243516 240795
66711 240795 237192 233207 229369 225993 223256 221035 218853 216395 213884 211569 209264 206920 205154 204358
66697 204358 203598 201395 197560 193347 189868 187332 185840 185691 186459 186823 185955 184371 182890 181464 179654
66682 179654 177620 175923 174717 173743 172801 171798 170607 169309 168267 167658 167211 166617 165760 164371 162100 159328
66666 159328 157237 156532 156566 156228 155169 153631 151748 149780 148486 148336 148580 147962 146227 144193 142521 141194
66650 141194 140122 139470 139208 138983 138581 138062 137427 136548 135460 134337 133328 132778 133271 134795 136122 135806 133794
66633 133794 131357 129511 128313 127617 127420 127188 125929 123567 121462 120839 121307 121606 121295 120891 120675 120297 119585
66616 119585 118986 118922 119188 119205 118600 117403 115944 114644 113710 112924 111886 110517 109184 108271 107791 107504 107236
66599 107236 107012 106968 107304 108207 109594 110877 111227 110260 108432 106593 105238 104330 103745 103499 103481 103405 103259 103489
66581 103489 104370 105394 105697 105003 103809 102764 102228 102315 102821 103100 102499 101103 99656 98623 97740 96661 95573
66564 95573 94845 94425 94008 93561 93342 93494 93963 94643 95339 95703 95508 94917 94199 93305 91998 90338 88721 87453
66546 87453 86605 86274 86628 87544 88475 88848 88493 87647 86728 86164 86178 86598 87008 87212 87400 87756 88089 88084 87757 87384
66526 87384 87018 86373 85239 83800 82424 81326 80563 80206 80310 80771 81356 81871 82136 81915 81161 80372 80370 81504
66508 81504 83182 84432 84785 84399 83496 82120 80491 79123 78330 77889 77482 77225 77421 77983 78508 78839 79110
66491 79110 79182 78602 77335 76143 75845 76413 77145 77526 77544 77312 76857 76335 76051 76106 76339 76717 77499 78778 80099
66472 80099 80836 80840 80491 80156 79852 79487 79210 79326 79888 80495 80616 80091 79210 78303 77499 76999 77217 78221 79241
66453 79241 79339 78635 78314 79206 80902 82521 83777 84816 85491 85499 84987 84398 83810 83044 82299 82038 82223 82262 81862
66434 81862 81372 81147 81095 81039 81019 81026 80961 81084 81965 83526 84660 84356 82895 81388 80371 79487 78462 77651 77408
66415 77408 77467 77340 77080 77162 77648 77853 77156 75955 75427 76195 77527 78142 77610 76573 75717 75059 74327 73538 72927
66396 72927 72603 72535 72702 73099 73758 74832 76363 77896 78685 78466 77702 76947 76358 76031 76244 76956 77487 77238
66378 77238 76492 76006 76051 76307 76490 76521 76234 75525 74818 74850 75857 77387 78943 80411 81710 82436 82107 80659
66360 80659 78571 76571 75167 74288 73477 72578 72056 72381 73317 74229 74902 75562 76172 76396 76389 76949 78500 80315
66342 80315 81239 80922 79938 78848 77700 76466 75485 75098 75094 74906 74386 73978 73994 74065 73706 73134 72998 73331 73434
66323 73434 72938 72403 72512 73164 73814 74278 74720 75133 75404 75694 76206 76743 76938 76790 76488 75953 75102 74347 74206
66304 74206 74481 74476 73987 73451 73123 72817 72500 72455 72657 72689 72477 72467 72796 72946 72612 72295 72542 73040 73023 72341 71636
66283 71636 71607 72400 73619 74682 75263 75470 75511 75299 74737 74241 74366 74917 75116 74857 75024 76153 77510 78048
66265 78048 77791 77576 77837 78250 78343 77871 76777 75320 74094 73526 73456 73534 73722 74106 74585 75226 76489 78503
66247 78503 80446 81329 81160 80652 80033 79004 77780 77260 77919 79269 80659 81951 83161 84045 84504 84905 85539
66230 85539 86062 85939 85230 84514 84061 83417 81991 79915 78180 77764 78610 79632 79859 79346 78787 78554 78541 78710
66212 78710 79222 80001 80672 81029 81173 81112 80688 80011 79552 79628 80075 80517 80652 80274 79469 78878 79227 80405 81495
66193 81495 81960 82272 83066 84211 85167 85845 86499 87051 87119 86597 85729 84733 83786 83262 83468 84131 84588 84535 84253
66174 84253 84100 84109 84144 84123 84062 84139 84657 85623 86403 86239 85157 84013 83552 83760 84190 84581 85010 85767 87156 89075
66154 89075 90703 91104 90360 89651 89920 90908 91820 92474 93151 93722 93660 92893 92005 91527 91502 91813 92435 93215 93844
66135 93844 94235 94572 94866 94847 94481 94155 94109 94100 93920 93918 94550 95728 96955 97937 98653 98969 98673 97856 96907 96072
66115 96072 95332 94723 94491 94847 95753 96966 98137 98915 99214 99324 99565 99942 100383 101107 102312 103530 103896 103243
66097 103243 102489 102630 103630 104633 105085 105270 105779 106740 107613 107723 107001 106138 105888 106219 106438 106187 105920 106197
66079 106197 106829 107139 106915 106679 106989 107838 108898 110052 111400 112789 113678 113605 112770 111956 111734 111818 111337 109782
66061 109782 107582 105697 104752 104653 104955 105444 106246 107367 108360 108681 108373 108130 108511 109321 109954 110157 110137 110062 109873
66042 109873 109606 109602 110269 111827 114223 117071 119719 121663 122925 123787 124270 124222 123800 123414 123205 123094 123354 124526
66024 124526 126548 128526 129713 130239 130540 130630 130425 130365 131056 132428 133747 134421 134455 134246 134283 134937 136226 137845
66006 137845 139643 141833 144507 147198 149317 150774 151858 152779 153824 155658 158879 163338 168343 173414
65992 173414 178348 182753 186210 188920 191544 194212 196309 197386 197795 198089 198172 197375 195175 191736 187909
65977 187909 184729 182514 180428 177263 172758 167770 163160 159084 155513 152795 151187 150246 149236 147983
65963 147983 146850 145988 145055 143721 142167 140994 140739 141451 142645 143714 144438 144991 145475 145784 146049 146873 148774
65946 148774 151513 154319 156659 158516 160009 161143 162140 163690 166492 170437 174431 177289 178863 180065
65932 180065 181705 183561 184910 185715 186746 188481 190501 192250 193926 196194 199277 202821 206481 210135
65918 210135 213563 216415 218729 221126 224242 228040 231932 235537 239182 243492 248467 253088 256070 257054
65904 257054 256896 256734 257021 257561 258150 258803 259468 259914 259934 259407 258197 256233 253647 250530 246586 241467 235494
65887 235494 229648 224616 220163 215670 210935 206104 201181 196118 191240 187084 183776 180997 178501 176203
65873 176203 173741 170565 166731 163122 160469 158564 156860 155481 155065 155741 156882 157845 158439 158627 158276 157345
65857 157345 155933 154028 151639 149305 147943 147884 148461 148887 149170 149735 150555 151236 151772 152608 153907 155273 156369
65840 156369 157425 158929 160973 163071 164484 164714 163856 162568 161656 161591 162460 164206 166766 169990 173660 177661
65824 177661 182090 187171 193072 199735 206784 213665 219989 225692 230829 235314 238904 241326 242338 241868
65810 241868 240197 237889 235437 233016 230561 227833 224444 220199 215517 211202 207669 204722 202144 200011
65796 200011 198246 196476 194633 193097 191874 190304 188221 186702 186847 188348 190216 192445 195764 200022
65782 200022 204166 207929 212370 218418 225975 234823 245330 257659 271067 284611 297799 310071 320376
65769 320376 327935 332745 334738 333102 327167 317498 305390 291757 277208 262716 249401 237854 228351
65756 228351 221363 217132 215049 214269 214802 217305 222027 228714 237425 248592 262269 278046 295717 315266
65742 315266 336120 357063 377008 395251 411045 423703 433240 440082 443884 443438 438083 428536 415899
65729 415899 400638 383072 364199 345206 326514 308019 290019 273180 257740 243494 230589
65718 230589 219598 210560 202523 194479 186520 179691 174722 171159 167783 163775 159359 155330 152089 149413
65704 149413 147161 145775 145698 146499 147060 146772 146153 146100 146848 147934 148919 149662 149949 149400 148047 146647 146041 146277
65686 146277 146735 147120 147910 149651 152131 154631 156946 159782 163967 169461 175373 180954 186398 192613 200394
65671 200394 210080 221904 236262 253306 272491 292889 313958 335785 358551 382045 405620 428223
65659 428223 448458 465124 478059 488122 495985 501201 502933 501469 498570 496211 495295 495628 496780 498718
65645 498718 501708 505787 510335 514219 516413 516449 514198 509407 501683 490844 476955 459982 439768 416541
65631 416541 391344 365765 341285 318745 298135 278798 260124 242319 226332 212871 201651
65620 201651 191934 183618 177233 172761 168994 164507 159100 153867 149872 147163 145053 142946 140647 138256
65606 138256 136106 134635 134008 133908 133888 133830 133848 133950 134086 134356 134837 135297 135501 135694 136414 137856 139825 142194
65588 142194 144819 147039 148056 148105 148557 150403 153170 155891 158650 162485 168072 175293 184036 194680 207573
65573 207573 222555 239264 257552 277368 298437 320284 342439 364441 385610 404894 421046
65562 421046 433148 441059 445213 445878 442816 435777 425059 411344 395171 376918 357137 336552 315754
65549 315754 295181 275371 256975 240526 226294 214264 204052 195064 187018 180220 175049 171276
65537 171276 168232 165516 163296 161969 161840 162979 165040 167257 168931 169907 170355 170268 169500 168092 166136 163472
65521 163472 160020 156296 153057 150412 147857 145216 142952 141364 140034 138305 135967 133285 130780 129103
65507 129103 128676 129267 130274 131485 133035 134573 135289 135078 134909 135414 135838 135113 133532 132409 132380 132975 133858
65490 133858 135542 138575 142708 147285 152009 157018 162477 168336 174180 179210 182681 184602 185671 186359
65476 186359 186454 185744 184702 183971 183393 182097 179512 175903 171912 167983 164265 160700 157093 153389 150008
65461 150008 147593 146269 145420 144312 142675 140563 138078 135546 133543 132321 131432 130383 129482 129451 130353 131496
65445 131496 132406 133342 134706 136487 138492 140561 142352 143434 143944 144708 146370 148825 151845 155682 160413
65430 160413 165094 168330 169687 169982 170191 170495 170371 169153 166508 162767 158844 155564 153056 151037 149493
65415 149493 148671 148517 148541 148304 147779 147311 147494 148842 151155 153402 154683 155134 155459 155822 155851 155594 155682 156537
65397 156537 158063 160111 162518 164709 166137 167321 169544 173116 176730 178958 179615 179194 177863 175853 174110
65382 174110 173541 173830 173819 172923 171458 169809 168090 166520 165394 164606 163881 163499 164122 165715 167339 168318 169059
65365 169059 170325 172201 174269 176543 179592 183765 188748 194084 199840 206518 214440 223495 233507 244548
65351 244548 256641 269243 281311 291943 300774 307746 312733 315573 316259 314947 311895 307522 302379
65338 302379 296834 290846 284153 276660 268595 260379 252388 244677 236904 228737 220412 212644 205891 200001
65324 200001 194728 190242 186800 184214 182023 179999 178102 176067 173519 170544 167737 165548 163830 162139
65310 162139 160220 158117 156040 154288 153127 152576 152306 151833 150816 149260 147556 146330 146090 146950 148740
65295 148740 151319 154600 158336 162174 165985 169910 173883 177332 179625 180694 180931 180514 179258 177221 175042
65280 175042 173329 171960 170466 168867 167595 166620 165339 163604 162243 162083 162885 163763 164314 164715 164928 164598
65264 164598 163749 162919 162334 161496 159917 157927 156465 156265 157392 159355 161482 163349 164968 166469 167666
65249 167666 168151 167802 166840 165426 163497 161073 158409 155774 153374 151494 150378 149938 149830 149839 149880 149792 149576
65232 149576 149721 150742 152375 153778 154499 154688 154398 153509 152435 152000 152224 152005 150516 148303 146507 145540
65216 145540 144990 144290 142991 140929 138657 137266 137301 138322 139814 141747 143722 144536 143628 142325 142527 144421
65200 144421 146472 147386 147094 146001 144429 142940 142244 142468 143074 143591 143898 143885 143521 143239 143566 144346 145041 145753
65182 145753 147227 149695 152475 154844 156642 157860 158384 158390 158373 158471 158306 157741 157271 157398 158063 158897 159567 159708
65164 159708 159065 158002 157426 157905 159246 161057 163250 165698 167908 169399 170156 170446 170477 170399 170365 170410 170581 171217
65146 171217 172752 175190 178208 181846 186606 192726 199902 207829 216445 225379 233817 241310 248284 255372
65132 255372 262670 269994 277387 284879 291967 297803 301811 303969 304734 304848 304872 304793 304372 303841 303618 303178 301089
65115 301089 296653 290842 284964 279041 272335 264945 257841 251389 244816 237366 229252 221177 213417 205770
65101 205770 198150 190880 184429 178974 174256 169969 166284 163762 162595 162157 161583 160589 159520 158826 158841 159808
65085 159808 161617 163544 164684 164760 164245 163715 163337 162958 162362 161386 160090 158967 158743 159803 161832 164059
65069 164059 165793 166769 167132 167159 167024 166834 166787 167071 167576 167926 167953 167929 168216 168847 169628 170452 171371 172473 173812
65050 173812 175174 175870 175180 173297 171455 170652 170524 169973 168651 167160 165845 164192 161751 159079 157231
65035 157231 156540 156298 155582 154078 152134 150248 148659 147280 145873 144264 142501 140896 139973 140147 141290
65020 141290 142656 143432 143450 143231 143313 143686 143993 144111 144326 144947 145956 147157 148536 150290 152501 154974 157438
65003 157438 159874 162553 165788 169603 173536 176818 178971 180295 181563 183156 184712 185663 185827 185281 184116
64988 184116 182676 181732 181900 182981 184331 185716 187365 189283 191168 193034 195301 198027 200512 201902 201877
64973 201877 200609 198483 196055 193843 191900 189816 187354 184712 182040 179075 175579 171863 168634 166516
64959 166516 165805 166355 167505 168440 168826 168852 168612 167940 166957 166215 165895 165402 164154 162383 160698 159277 158018
64942 158018 157137 157001 157495 158073 158356 158272 157799 157019 156332 156165 156497 157003 157568 158322 159269 160259 161275 162379
64924 162379 163373 163795 163308 161975 160224 158667 157756 157419 157233 157090 157388 158383 159686 160681 161109 160927 160062
64907 160062 158780 157986 158546 160481 163255 166592 170496 174731 178955 183303 188263 194007 200368 207343 215066
64892 215066 223272 231353 239018 246427 253695 260743 267668 274719 281790 288358 293906 298030 300186 299966
64878 299966 297712 294272 289968 284344 277164 269156 261408 254397 247942 241911 236646 232756 230588 229852
64864 229852 229796 229886 230196 230869 231393 230864 228907 225896 222254 218024 213198 208020 202750 197475 192304 187450
64848 187450 183043 179137 175934 173665 172188 171006 169796 168675 167951 167837 168277 168807 168822 168356 168278 169122 170070
64831 170070 169866 168562 167351 166750 166088 165052 164517 165216 166585 167723 168722 170195 172070 173809 175462 177628
64815 177628 180568 184124 188328 193365 199056 205091 211757 219738 229136 239231 249282 258964 267929 275456
64801 275456 280809 283648 283918 281644 277009 270477 262754 254652 246895 239797 233162 226698 220530 215193
64787 215193 211246 208985 208272 208367 208200 207238 205991 205272 205103 204823 204154 203604 203767 204733 206365 208625 211394
64770 211394 214411 217777 222167 228077 234980 241715 247725 253579 260187 267814 276042 284420 292778 300931
64756 300931 308468 315085 321006 326806 332787 338679 343966 348409 352240 355881 359377 361963 362319 359534
64742 359534 353817 346061 336831 326233 314748 303557 293648 284969 276906 269362 262876 257808 253864
64729 253864 250545 247730 245685 244635 244393 244354 243912 242984 242015 241406 241135 241130 241817 243916 247746 252986 259102
64712 259102 265704 272450 278911 284644 289278 292514 294140 294096 292381 288969 283924 277531 270144 262001 253399
64697 253399 244946 237347 230903 225466 220863 217067 213846 210598 206827 202710 199001 196371 194906 194216
64683 194216 193930 194095 195095 197168 200058 203213 206362 209792 214085 219674 226646 234843 244033 254026 264685
64668 264685 275780 286779 296790 304772 309935 311996 311063 307308 300933 292569 283474 274886 267140 259799
64654 259799 252829 247196 243833 242277 240908 238588 235650 233201 231879 231558 231941 233045 235120 238355 242706
64639 242706 247933 253833 260494 268302 277668 288776 301551 315641 330335 344671 357859 369570
64627 369570 379635 387509 392224 393068 390263 384853 377902 369733 359980 348362 335424 322395 310271
64614 310271 299087 288233 277444 267315 258746 252075 246898 242601 238809 235392 232364 229922 228308
64601 228308 227434 226754 225703 224214 222648 221318 220258 219319 218283 216969 215510 214564 214967 217032 220255
64586 220255 223748 226929 229938 233588 238885 246341 255685 266308 277853 290179 302901 315414 327329
64573 327329 338508 348619 357114 363776 368873 372567 374566 374550 372480 368173 361072 351046 339125 326908
64559 326908 315351 304566 294490 285098 276021 266775 257612 249548 243228 238251 233925 230179 227247
64546 227247 224920 222846 221394 221444 223147 225543 227740 229916 232633 235515 237380 237670 237047 236277 235121
64531 235121 232831 229434 225853 222801 220191 217751 215681 214300 213364 212220 210606 209024 208248 208583 209597
64516 209597 210494 210807 210734 210770 211047 211274 211331 211626 212627 214310 216362 218797 222035 226371 231682 237739 244617
64499 244617 252619 261842 271915 282181 292092 301367 309700 316471 320997 323071 323009 321115 317450 312303
64485 312303 306569 301268 296849 293261 290565 289020 288536 288445 288013 286971 285427 283465 281017 278018 274465
64470 274465 270349 265674 260684 256041 252628 250994 250929 251704 252871 254750 258032 262900 268600 273800 277299
64455 277299 278513 277582 275218 272401 269954 268161 266759 265429 264369 264163 264983 266125 266697 266670 266946 268387
64439 268387 271168 275040 279783 285217 291178 297754 305299 314063 324091 335642 349271 365219 383168
64426 383168 403042 425804 452998 485760 524738 570831 625470 690215 766465 855429 957641
64415 957641 1072108 1195961 1324904 1453966 1578490 1695468 1804274 1905518 1998568 2080224
64405 2080224 2145862 2191655 2215825 2218537 2201386 2166896 2117706 2055462 1980167 1890715 1786543
64394 1786543 1669339 1543457 1414592 1287874 1166891 1053918 950439 857286 774660 702363
64384 702363 640001 586904 542007 504040 471933 445046 423008 405257 390794 378483 367674
64373 367674 358389 350767 344444 338615 332583 326118 319352 312504 305583 298249 290138 281496 273345 266702
64359 266702 261742 257853 254337 250813 247184 243647 240752 239123 239086 240644 243622 247602 251981 256481 261447
64344 261447 267177 273073 277845 280468 280594 278315 274147 269130 264195 259322 253916 248160 243232 239921
64330 239921 237644 235297 232602 230180 228735 228619 229928 232474 235744 239155 242317 244912 246641 247552 248152
64315 248152 248892 249692 250229 250493 250815 251489 252506 253455 253591 252346 249951 247194 244334 240729 235877 230335
64299 230335 225077 220349 215804 211526 208172 206101 204947 204122 203218 201934 200215 198636 198080 198698 199610
64284 199610 200002 200281 201745 205217 210231 215524 220175 224328 228946 234838 241929 249533 257220 265097 273143
64269 273143 280674 286822 291412 294955 297789 299545 299680 298289 296172 294181 292730 291927 291910 292809 294383
64254 294383 295853 296231 294925 292063 288165 283389 277223 269195 259873 250808 243249 237204 231981 227322
64240 227322 223523 220641 218222 215921 213953 212778 212656 213566 215159 216734 217718 218385 219559 221387 222941
64225 222941 223479 223543 224173 225435 226532 227184 227987 229246 230255 230184 229178 228064 227262 226460 225230 223533 221606
64208 221606 219661 217851 216323 215201 214535 214327 214554 215104 215734 216170 216336 216425 216706 217267 218030 219047 220666
64191 220666 223346 227356 232722 239422 247598 257567 269589 283503 298564 313714 327959 340305 349478
64178 349478 354204 354092 350043 343491 335302 325612 314600 303012 291880 281927 273286 265576 258205 250741
64164 250741 243153 235705 228716 222529 217561 214094 211917 210370 208866 207327 206091 205575 206077 207698 210210
64149 210210 213005 215419 217299 219205 221927 225685 229885 233730 236998 240051 243130 245942 248022 249263
64135 249263 249796 249530 248150 245652 242630 239910 237970 236758 235883 234904 233560 231949 230519 229813 230141 231490
64119 231490 233723 236772 240588 244976 249672 254705 260650 268340 278173 289646 301567 312726 322469
64106 322469 330696 337345 342001 344219 344316 343570 343389 344387 346486 349721 354430 360659 367821 375103 381799
64091 381799 387117 390145 390462 388467 384793 379658 373215 366164 359319 352587 345065 336370 327326 319017
64077 319017 311596 304432 297160 290107 283764 278331 273805 270174 267323 265065 263425 262665 262838 263497 264119
64062 264119 264702 265633 266999 268396 269502 270512 271821 273525 275471 277632 280154 283115 286416 289789 292845
64047 292845 295419 298115 302171 308310 315941 324032 332582 342498 353957 365631 375911 384325 391332
64034 391332 397194 401648 404385 405226 403878 400086 394263 387727 382078 378242 376027 374573 373333 372629 373136
64019 373136 374931 377357 379710 381522 382083 380415 376184 370273 363957 357782 351707 345902 340788 336402
64005 336402 332278 327995 323437 318631 313787 309420 305976 303379 301335 299948 299554 300037 300924 302149 304089
63990 304089 306770 309681 312650 316192 320592 325157 328979 332180 335849 340841 347058 353860 360842 368109
63976 368109 375968 384358 392609 399966 406428 412860 420076 428082 436497 445439 455574 467366 480716
63963 480716 495427 511594 529359 548583 569079 591040 615019 641594 671321 704981 743657
63952 743657 788545 840896 902163 973935 1057734 1155133 1268077 1398546 1547431 1713977 1896724
63941 1896724 2094758 2307525 2533638 2770570 3015448 3265190 3515382 3759667 3990865
63932 3990865 4202566 4389601 4547910 4674811 4769043 4829637 4854731 4842120 4790939 4702346
63922 4702346 4578768 4423393 4240670 4036566 3817691 3590027 3358313 3126117 2896297
63913 2896297 2671679 2455392 2250328 2058292 1880156 1716809 1569447 1438698 1323966
63904 1323966 1223881 1137070 1062247 998001 942975 896133 856569 823167 794693 770129 748780
63893 748780 730134 713702 698841 684734 670803 657212 644619 633314 622976 613494 605568 600037
63881 600037 596796 594919 593906 594518 598238 606021 617602 631837 647707 665061 684546 707022 733071
63868 733071 762835 795933 831584 869145 908586 950109 993265 1036865 1079957 1122503 1164758
63857 1164758 1206248 1245581 1281062 1311215 1335022 1352082 1362469 1366123 1362549 1351482 1333693 1310695
63845 1310695 1283524 1252189 1216434 1176748 1134384 1090523 1045681 999938 953542 907165 861593
63834 861593 817407 775087 735223 698259 663960 631469 600141 570115 541931 515895 492094
63823 492094 470824 452448 436729 422678 409296 396359 384336 373673 364301 355780 347735 340105
63811 340105 333035 326613 320718 315121 309747 304857 300915 298129 296154 294378 292579 291070 290098 289367 288430
63796 288430 287302 286256 285132 283341 280622 277343 273857 270055 265828 261584 257896 254847 252119 249608
63782 249608 247585 246312 245821 246062 246920 248033 248840 248948 248354 247303 246052 244792 243625 242519 241347 240035
63766 240035 238625 237225 235948 234918 234265 234053 234204 234454 234507 234269 233902 233558 233172 232640 232113 231837 231773 231620
63748 231620 231267 230888 230548 230068 229494 229360 230159 231710 233392 234906 236556 238796 241674 244733 247332 249126
63732 249126 250419 251966 254291 257202 260110 262703 265126 267574 269998 272353 274961 278431 283128 288754
63718 288754 294534 299846 304611 309033 313100 316527 319112 320900 321957 322148 321195 318875 315274 311077 307477
63703 307477 305345 304457 303866 303083 302476 302419 302671 302970 303768 305780 308989 312596 315886 318769 321549 324540
63687 324540 327950 331826 336010 340247 344186 347176 348370 347461 345213 342882 341073 339527 337952 336564
63673 336564 335690 335274 335078 335151 335768 337016 338670 340503 342442 344320 345639 345878 345106 344048 343309 342611 341049
63656 341049 338037 333770 328880 324036 319800 316351 313183 309628 305908 303126 301811 301058 299678 297785
63642 297785 296529 296584 297614 299102 300839 302600 304142 305748 308095 311291 314682 317917 321613 326524 332504
63627 332504 338797 345015 351361 358117 365431 373489 382423 392075 402220 413042 425092 438770 454059
63614 454059 470799 488986 508739 530214 553639 579349 607659 638645 671919 706527 741129
63603 741129 774345 804889 831379 852367 866898 875058 877782 876211 871438 864764 857640 850986 844644
63590 844644 837721 829383 819153 806561 790948 771850 749520 724913 699186 673266 647824 623467
63578 623467 600858 580580 562898 547640 534411 522958 513280 505347 498939 494005 491049 490782 493234
63565 493234 497464 502379 507663 513654 520459 527553 534418 541237 548629 556734 565013 573219 582332 594063
63551 594063 609465 628521 651242 678515 711384 749985 793908 843097 896992 952289 1002536
63540 1002536 1040987 1063978 1071679 1066629 1052428 1033215 1012851 993821 977073 962860 951305 942154
63528 942154 934525 927098 918247 906062 888951 866586 840004 810540 778914 745508 711082 676818
63516 676818 643834 612917 584500 558496 534246 511081 489076 469065 451838 437462 425361
63505 425361 414829 405376 396806 389191 382748 377523 373124 368865 364234 359219 354198 349660 346079 343844
63491 343844 343104 343626 344870 346175 346946 346896 346295 345823 345934 346495 347323 348835 351739 356074 361029 365793 370150
63474 370150 374155 377750 380943 383899 386471 387974 387882 386541 384752 382766 380033 375966 370737 365335 360919
63459 360919 357949 355780 353315 350169 347056 344962 344266 344750 346066 347884 349947 352321 355379 359330 364070
63444 364070 369617 376245 383937 392312 401516 412620 426652 443811 464268 489173 519988 557104
63432 557104 599681 646089 693290 736230 769585 790801 800916 802586 798418 791215 784224 780065
63420 780065 780016 784877 795803 813565 837552 866260 898472 933408 969999 1006448 1040313 1068751
63408 1068751 1089202 1100567 1103726 1100732 1093632 1084130 1073686 1063274 1053089 1042748 1031579 1018492
63396 1018492 1002039 981202 956056 927354 895648 861203 824684 787502 751341 717385 685966
63385 685966 656902 630197 606341 585692 567742 551462 536463 523390 513051 505600 500740 498233
63373 498233 497865 499300 502327 507016 513387 521206 530353 541090 553695 568121 584281 602439 623043
63360 623043 646337 672303 700733 731251 763566 797870 834685 874096 915265 956502 995381
63349 995381 1028939 1054690 1071834 1081107 1083472 1079755 1071615 1061670 1051874 1042419 1032762 1022831 1012410
63336 1012410 1000104 984024 963280 938098 909045 876992 843377 809466 775592 742025 710231
63325 710231 682228 658852 639703 624675 614531 609930 610858 616745 625752 633710 635313 627426 610797
63312 610797 588328 562670 535902 510176 487210 467269 449572 433606 419503 407318 396636
63301 396636 387023 378477 371332 365791 361573 357950 354319 350701 347474 344705 342164 339924 338277 336909
63287 336909 334845 331591 327809 324407 321464 318532 315519 312675 310042 307610 305794 304992 304760 304106 302769
63272 302769 301607 301488 302261 303117 303582 303825 304240 305105 306535 308365 310029 310877 310843 310685 311394 313392 316421
63255 316421 320116 324353 328942 333313 336916 339844 342737 346008 349462 352783 356146 360118 365079 370959
63241 370959 377455 384359 391677 399578 408350 418371 430000 443266 457617 472167 486439 500845
63229 500845 516238 532997 550649 568295 585202 601027 615826 629985 644048 658486 673657
63218 673657 689879 707360 726027 745588 765657 785583 804229 820288 832959 842115 847708 849287
63206 849287 846326 838835 827411 812717 795107 774847 752600 729521 706716 684666 663429 643462
63194 643462 625803 611136 599040 588732 580355 574931 573011 574055 577338 582815 590664 600513 611722
63181 611722 624219 638446 654501 671698 689047 705884 722087 737972 754089 770886 788356
63170 788356 805960 822901 838545 852737 865767 877820 888312 895855 899027 897076 889934 877874
63158 877874 861488 841822 820036 796830 772305 746404 719350 691728 664412 638440 614683
63147 614683 593441 574440 557270 541784 527979 515682 504540 494358 485325 477847 472162 468127
63135 468127 465278 463031 460908 458767 456854 455520 454856 454655 454752 455212 456136 457510 459454 462325 466267 470731
63119 470731 474841 478260 481416 484817 488442 491876 494799 497202 499329 501579 504255 507310 510392 513167
63105 513167 515460 517113 518046 518535 519070 519766 520181 520004 519612 519639 520232 521112 522191 523650 525325 526501 526573
63088 526573 525740 524844 524562 524889 525369 525722 526121 526852 527800 528583 529275 530682 533507 537336 540860 543232 544919
63071 544919 547114 550612 555453 561281 567589 573783 579591 585637 593202 603111 615034 628112 642076
63058 642076 657426 674725 694146 715717 739615 766020 794965 826448 860498 896990 935633
63047 935633 976192 1018407 1061558 1104532 1146717 1188605 1231094 1274303 1317449 1359873 1401818
63036 1401818 1444125 1487346 1531193 1574773 1617358 1658935 1699706 1738866 1774216 1803304 1824638
63025 1824638 1837485 1840953 1834090 1816776 1789804 1754084 1710503 1660731 1607326 1552556 1497546 1442863
63013 1442863 1389472 1338734 1291926 1250178 1214434 1184972 1161239 1142655 1129363 1121793 1119759 1122599
63001 1122599 1129981 1141981 1158347 1178233 1200741 1225277 1251238 1277786 1304218 1330420 1356814
62990 1356814 1383975 1412244 1441446 1470843 1499542 1527057 1553308 1577946 1599796 1617049 1627961
62979 1627961 1631362 1626697 1613876 1593210 1565374 1531201 1491398 1446585 1397737 1346392 1294053 1241437
62967 1241437 1188751 1136844 1087545 1042453 1001699 964345 929784 898198 869772 844104 820637
62956 820637 799157 779494 761043 743044 725246 707981 691578 675993 661035 646666 632902
62945 632902 619606 606625 594021 581941 570334 559096 548493 538993 530545 522451 514321 506742
62933 506742 500434 495025 489489 483793 479266 476972 476345 475899 474783 473131 471346 469750 468676 468238 468032
62918 468032 467517 466608 465502 464160 462564 461276 460961 461269 460945 459294 456907 454654 452698 450911 449610
62903 449610 449117 449010 448534 447670 447080 447101 447412 447801 448639 450302 452617 455167 457744 460157 461894 462445 461919
62886 461919 461009 460354 460143 460306 460835 461862 463498 465598 467633 468996 469607 470053 470900 472022 472865 473165 472929
62869 472929 471943 470003 467706 466228 465941 465867 465064 464003 463844 464719 465608 465791 465599 465600 465853 466347 467553 470025
62851 470025 473701 477896 481786 484782 486809 488469 490561 493172 495554 497122 498220 499515 500945 501725
62837 501725 501225 499555 497473 496030 496017 497305 498865 499840 500444 501412 502773 503781 504076 504282 505279 507339
62821 507339 510160 513300 516258 518478 519690 520099 520022 519537 518816 518505 519280 520940 522440 523028 523077 523536 524818
62804 524818 526580 528441 530416 532524 534497 536284 538588 542408 547957 554316 560274 565409 570398 576469
62790 576469 584477 594325 605360 617552 632077 650378 672774 698545 727344 759911 797174 839345
62778 839345 886298 938317 995835 1058624 1125711 1195907 1267982 1340449 1411584 1479605 1542571
62767 1542571 1598318 1644944 1681285 1706636 1720193 1721265 1709968 1687274 1654372 1612349 1562492
62756 1562492 1506409 1445697 1381741 1315925 1249765 1184692 1121858 1062108 1005916 953317 904124
62745 904124 858229 815569 775966 739311 705826 675817 649169 625411 604216 585517 569181
62734 569181 555029 543183 533866 526702 520637 514823 509279 504504 500737 497881 495829 494564 494014 494062
62720 494062 494638 495730 497430 499985 503572 507932 512527 517248 522740 529822 538814 549622 562198 576571
62706 576571 592598 610095 629318 651069 676278 705554 738992 776171 816386 859239 905176
62695 905176 955294 1010385 1070169 1133423 1198701 1264678 1329905 1392484 1450243 1501192 1543785
62684 1543785 1576814 1599256 1610225 1609030 1595368 1569702 1533471 1488689 1437234 1380605 1320280
62673 1320280 1257957 1195182 1133021 1072355 1014287 959910 909674 863229 819926 779350 741551
62662 741551 706951 676012 648784 624833 603787 585731 570811 558524 547765 537617 527880 518766
62650 518766 510295 502051 493496 484600 476191 469345 464204 459669 454667 449540 445696 443976 443885 444376 444850
62635 444850 445245 445641 446130 446785 447514 448055 448156 447660 446501 445007 444062 444441 445836 447046 447335 447173 447429
62618 447429 448333 449609 451245 453557 456630 460120 463651 467219 471170 475869 481291 486956 492449 497941
62604 497941 503871 510161 516356 522774 530915 542203 556599 572930 590397 609311 630586 654946
62592 654946 682574 712988 745222 778407 812204 846400 880187 912168 940968 965503 984759
62581 984759 997840 1004393 1004611 998745 986982 969915 948698 924386 897427 868070 837025 805336
62569 805336 773734 742523 712115 683256 656537 631918 608998 587668 568250 550993 535710
62558 535710 522038 509924 499622 491170 484058 477538 471235 465312 459981 454990 449832 444499 439785
62545 439785 436545 434723 433405 431870 430253 429067 428490 428437 428980 430145 431412 431963 431563 430768 430153 429725
62529 429725 429310 429189 430015 432261 435995 441040 447135 454037 461736 470631 481344 494266 509264 525860
62515 525860 543813 563644 586493 613253 643816 677323 713038 750638 789639 828976 867404
62504 867404 904098 938526 969803 996444 1016917 1030472 1037416 1038538 1034283 1024707 1010353 992825
62492 992825 974086 955371 937246 920591 906808 896925 891036 888957 890986 897676 909222 925412
62480 925412 945886 970138 997533 1027477 1059116 1090495 1118545 1140586 1155813 1164957 1168774 1167163
62468 1167163 1159332 1144091 1120255 1087638 1047929 1004054 958474 912325 866050 820167 775286
62457 775286 732013 691232 654082 621250 592529 567326 545339 526474 510466 496992 485982
62446 485982 477433 471003 466163 462704 460773 460429 461482 463727 466909 470395 473372 475778 478650 483025
62432 483025 488524 493484 496534 497549 496954 494703 490549 485005 479315 474342 469910 465415 460631 455651
62418 455651 450414 444754 438918 433621 429474 426494 424235 422267 420427 418633 416664 414292 411585 408898
62404 408898 406509 404425 402668 401480 400989 400837 400502 399962 399743 400342 401884 404269 407256 410345 412954 414867
62388 414867 416298 417538 418844 420645 423388 427064 431274 435841 440953 446541 452078 457256 462494 468473
62374 468473 475570 483914 493483 503744 513714 522961 532237 542641 554482 567450 581599 597508 615603
62361 615603 636035 659247 686155 717638 754166 795917 842911 894945 951594 1012049 1074623
62350 1074623 1136559 1194809 1247035 1291770 1328049 1355490 1374523 1385823 1389500 1385321 1373639 1355346
62338 1355346 1330833 1299788 1262399 1220211 1175387 1129562 1083788 1039121 996703 957366 921559
62327 921559 889510 861104 835660 812163 789813 768267 747441 727243 707500 688040 668766
62316 668766 649671 630714 611749 592723 573947 556049 539624 525021 512386 501680 492634 484924
62304 484924 478431 473196 469076 465647 462469 459274 455927 452491 449424 447396 446670 446812 447179 447600 448393
62289 448393 449823 451769 453949 456285 458888 461720 464514 467191 470244 474355 479491 484651 488781 491839
62275 491839 494680 497967 501522 504745 507384 509764 512475 516084 521138 528223 537827 549993 564265 580243
62261 580243 598300 619605 645374 676343 712977 755763 804941 860069 920155 984088 1050691
62250 1050691 1118434 1185178 1248068 1303733 1349211 1383298 1406839 1421389 1427736 1425876 1415776 1397412
62238 1397412 1370378 1334389 1290312 1240090 1185595 1128118 1069022 1010124 953091 898933 848301
62227 848301 801818 759804 722066 688313 658511 632577 609963 589819 571439 554496 539069
62216 539069 525472 513823 503694 494469 486012 478609 472251 466520 461247 456757 453165 449944 446579
62203 446579 443299 440744 439139 438144 437386 436851 436862 437904 440334 444135 449026 454862 461771 469869 479065
62188 479065 489158 499825 510547 520969 531394 542545 554756 567776 581374 595473 609558
62177 609558 622672 634456 645671 657250 669400 682154 696241 712655 731736 753492 778651
62166 778651 808508 843615 883284 926538 972969 1022263 1073267 1123810 1171298 1213328 1247986
62155 1247986 1273911 1290328 1297246 1295764 1287870 1275393 1258933 1237860 1211318 1179052 1141416 1099169
62143 1099169 1053646 1006959 961562 919256 880548 845070 812656 783900 759561 739630 723263
62132 723263 709566 698096 688577 680576 673728 668031 663663 660722 659293 659536 661433 664734 669445 676148
62118 676148 685496 697477 711470 726779 742583 757363 768986 775867 778042 776999 774551 771940 769736
62105 769736 768114 766821 764954 761227 754782 745681 734524 721955 708960 697315 688890 684188 682058
62092 682058 681168 681354 683242 686972 691806 696824 701673 706745 712909 720923 730810 741858 753293 764839
62078 764839 776622 789001 802710 818692 837259 857647 878825 900575 923363 947355 972072
62067 972072 996998 1022112 1047770 1074394 1102336 1131824 1162899 1195306 1228230 1260099 1289004
62056 1289004 1313585 1333203 1347255 1354999 1356579 1353624 1347960 1339818 1327935 1311137 1289124 1261912
62044 1261912 1229596 1192982 1153629 1112808 1070895 1028122 985383 943861 904247 866741 831507
62033 831507 798658 768036 739565 713786 691576 673160 657599 643436 629802 616860 605273
62022 605273 595338 586676 578664 570994 563749 557051 550783 544576 538005 530922 523736 517253 512103 508373
62008 508373 505873 504541 504410 505415 507493 510759 515346 521218 528332 536763 546289 556030 564879 572270
61994 572270 578212 582726 585642 586855 586300 583716 578925 572366 564852 556707 547603 537430 526827 516598
61980 516598 506978 497791 489024 480855 473330 466384 460137 454815 450272 445837 440911 435729 431370 428707
61966 428707 427375 426080 424000 421520 419366 417513 415497 413429 411970 411356 411175 411159 411521 412381 413539 415100
61950 415100 417623 421218 425068 428444 431815 436479 443364 452672 464318 478052 493288 509512 526944
61937 526944 546243 567374 589234 610613 631278 651867 672989 694632 716217 736898 755850
61926 755850 772560 786923 798974 808481 814958 818104 818058 815091 809281 800795 790435 779573 769457
61913 769457 760831 754252 750380 749697 752366 758617 768884 783082 800053 818262 836823 855294 872703
61900 872703 887543 898717 905736 908020 904961 896975 885628 872148 856501 838488 818950 799052
61888 799052 778944 758209 737439 718255 701638 687069 673571 660830 648878 637306 625405
61877 625405 612868 600028 587606 576462 567309 560273 554877 550674 547690 545984 545119 544553 544489 545783
61863 545783 548905 553386 558499 564173 570950 579291 589211 600559 613390 628092 645255 665351 688375
61850 688375 713926 741805 772280 805453 840493 876009 911226 946238 980842 1013559 1042230
61839 1042230 1065304 1082183 1092551 1095969 1092280 1082182 1067246 1049413 1030318 1010960 992146 975353
61827 975353 962805 956371 956588 962903 974464 990149 1008247 1026962 1045250 1062449 1077030 1086470
61815 1086470 1088698 1083134 1070103 1049892 1022919 990360 954003 915622 876742 838645 802098 767266
61803 767266 734253 703547 675537 649925 626171 604446 585561 569927 557033 546061 536528 528122
61791 528122 520355 512804 505622 499517 495124 492450 490870 489649 488514 487760 487800 488682 490102 491813 493763
61776 493763 495818 497606 498812 499531 500158 500929 501759 502529 503335 504299 505281 506047 506649 507377 508235 508857 509181 509938
61758 509938 511995 515254 518573 520937 522442 524039 526495 529713 532879 535137 536203 536435 536285 535736 534416
61743 534416 532165 529269 526155 523075 520074 517028 513697 510029 506490 503812 502311 501629 501185 500656 500008
61728 500008 499419 499289 499950 501184 502350 503217 504382 506569 509804 513563 517486 521525 525553 529317 532831
61713 532831 536379 539956 542922 544493 544539 543684 542495 540693 537449 532534 526881 521699 517226 512764 507860
61698 507860 502841 498065 493274 488111 482886 478312 474655 471560 468617 465704 462777 459674 456247 452560
61684 452560 448945 445921 443918 442916 442424 441930 441235 440272 438904 437206 435758 435223 435610 436214 436320 435769
61668 435769 434849 433872 432979 432222 431714 431640 432068 432754 433250 433284 432962 432563 432267 432108 432043 432000 431998 432252 433028 434367
61648 434367 436132 438268 440745 443305 445714 448367 452091 457079 462402 466882 470148 472546 474396 475747
61634 475747 476501 476328 474722 471630 467840 464257 460966 457490 453769 450270 447172 444101 440835 437800 435620
61619 435620 434513 434289 434676 435495 436716 438386 440323 441841 442098 440780 438237 434916 430905 426078 420410
61604 420410 414037 407222 400389 394000 388306 383318 378997 375251 371711 367752 362965 357582 352350 347954
61590 347954 344467 341355 338091 334798 332088 330172 328433 326137 323346 320796 318981 317660 316219 314205
61576 314205 311595 308827 306555 305120 304238 303388 302395 301397 300401 299253 298013 296995 296360 295901 295279 294323
61560 294323 293143 292135 291740 292045 292756 293713 295095 296788 297996 298086 297593 297691 298693 299758 300124 300012 300096
61543 300096 300667 301604 302744 303993 305387 307158 309454 311969 314344 316995 320872 326087 331296 334861 336243
61528 336243 335925 334435 332035 329085 326117 323494 321262 319315 317476 315459 312965 309826 306078 302098
61514 302098 298667 296528 295714 295569 295552 295731 296293 296953 297154 296628 295531 294218 293113 292524 292321 292012 291281
61497 291281 290240 289032 287647 286371 285941 286756 288281 289703 290868 292041 293095 293647 293896 294541 295757
61482 295757 296854 297194 296957 296727 296728 296790 296771 296709 296741 297115 298087 299545 300825 301195 300602 299780 299556 300081 300835 301312
61462 301312 301555 301895 302369 302716 302943 303468 304442 305331 305547 305300 305317 305828 306364 306607 306903 307670 308754 309680 310258
61443 310258 310641 311017 311562 312543 314101 316061 318267 320981 324585 328882 333137 336893 340398 344000 347499
61428 347499 350361 352308 353395 353703 353409 353096 353525 354930 356792 358494 360008 361809 364277 367251 370067
61413 370067 371984 372754 372828 372757 372375 370881 367860 363936 360246 357542 355974 355251 354667 353298 350745 347555
61397 347555 344576 342092 340000 338501 337956 338131 338318 338264 338358 338747 338911 338472 337861 337806 338469 339484 340511 341451
61379 341451 342369 343560 345418 347907 350350 352126 353415 354940 357042 359375 361488 363407 365489 367873
61365 367873 370198 371953 373096 374203 375903 378307 381189 384471 388117 391721 394851 397859 401731 406926
61351 406926 412939 419312 426432 434824 444142 453511 462564 471509 480310 488391 495172 500495 504622 508098
61337 508098 511530 515129 518521 521243 523261 524727 525540 525573 525041 524101 522299 519087 514821 510585 506942
61322 506942 503468 499671 495707 491889 488051 483977 480166 477660 477090 478209 480394 483336 487077 491473
61308 491473 495994 500373 505357 512325 521907 533372 545689 558749 572870 587278 599882 608761 613414
61295 613414 614521 613072 609994 606010 601364 595867 589522 582852 576386 570052 563406 556336 549249 542628
61281 542628 536651 531277 526584 522962 520933 520670 521759 523608 526028 529207 533177 537714 542820 548889
61267 548889 556118 563985 571502 577897 583013 587404 592175 598400 606411 615781 626104 637443 649718
61254 649718 662042 673136 682294 689552 695078 698861 701005 701842 701555 699948 696778 692128 686342 679717
61240 679717 672368 664326 655720 646956 638680 631317 624630 617960 611084 604660 599649 596428 594674 593954
61226 593954 594093 594964 596343 598151 600592 603755 607235 610415 613049 615320 617445 619560 621963 625073 628962
61211 628962 633253 637610 642029 646448 650376 653228 654862 655553 655668 655627 655975 657128 659209 662508 667905
61196 667905 676340 687899 701933 718096 736730 758042 781276 804937 827433 847320 863388 875137
61184 875137 883197 889001 893954 898849 903801 908450 912267 914894 916265 916494 915695 913935 911142 907060 901476
61169 901476 894588 886895 878579 869211 858297 845991 833030 819946 806527 792088 776248 759409
61157 759409 742578 726699 712130 698702 686177 674651 664605 656639 651101 647869 646559 646855 648446
61144 648446 650521 651683 650632 646793 640155 630910 619628 607465 595601 584557 574525 566126 560102
61131 560102 556300 553710 551728 550803 551665 554552 559396 566106 574300 583385 593455 605604 620775 638625
61117 638625 658045 678479 700242 723779 749141 776024 803869 832028 860254 888866 918055
61106 918055 947197 975244 1001636 1026391 1049452 1070422 1088871 1104417 1116427 1124016 1126534 1123892
61094 1123892 1116420 1104584 1088878 1069807 1047977 1024192 999320 973959 948341 922546 896627
61083 896627 870619 844755 819679 795936 773310 751257 730112 711059 694644 680131 666758
61072 666758 654751 644468 635437 627135 620028 614767 610885 607416 604411 602698 602408 602904 604011 606140
61058 606140 609186 612440 615724 619565 624152 629190 634917 642178 651191 661260 672020 684045 697877
61045 697877 713372 730392 749202 769738 791337 813697 837414 863202 891175 921111 952674
61034 952674 985232 1018319 1052404 1088318 1125957 1164701 1205133 1248770 1295669 1343819 1391406
61023 1391406 1438171 1484030 1528416 1572216 1618708 1671098 1730479 1797375 1873448 1959721 2054515
61012 2054515 2155404 2262637 2379316 2509782 2660179 2839585 3058503 3327644 3661241
61003 3661241 4081587 4619446 5313392 6212794 7377981 8868492 10725748 12961389 15539944
60994 15539944 18335179 21084466 23417708 25001789 25721480 25748859 25439264 25149410 25120964
60985 25120964 25463396 26155442 27012676 27684256 27765732 26994313 25379092 23163142 20668217
60976 20668217 18157529 15792152 13652567 11767714 10133185 8727873 7528756 6515111
60968 6515111 5665258 4956520 4368800 3884528 3485312 3152204 2869793 2627754 2418502
60959 2418502 2235700 2075059 1934056 1810101 1700383 1603419 1518953 1446127 1383197 1328876
60949 1328876 1282119 1240548 1200944 1161757 1123532 1086601 1050081 1013680 978791 946830 917644
60938 917644 890313 864449 839963 816493 793860 772360 752040 732387 713197 695065 678523
60927 678523 663391 649433 636896 625930 616085 606928 598622 591438 585198 579585 574515 569855 565229
60914 565229 560472 555896 551913 548714 546386 544835 543548 542049 540600 539810 539522 538941 537951 537300 537194 536691
60898 536691 535003 532576 530238 528043 525599 522895 520047 516691 512456 507795 503762 501005 499285 497863
60884 497863 496100 493883 491566 489319 486671 483195 479466 476572 474652 472854 470911 469761 470136 471481
60870 471481 472918 474538 477011 480482 484571 489056 493991 499506 505847 513196 521157 529015 536768 545056
60856 545056 553699 561336 567193 572237 577646 583079 587601 591592 596377 602313 608495 614110 618928 622615
60842 622615 624823 626023 627124 628113 628059 626639 624697 622958 621085 618468 615351 612694 611359 611748 613832
60827 613832 617302 621896 627697 634866 643212 652452 662780 674555 687434 700464 713226 726303 740398
60814 740398 755493 771150 787125 803325 819438 835006 849755 863621 876584 888569 899447
60803 899447 909041 917144 923470 927560 928944 927611 924144 919085 912280 903212 891902 879133 865815
60790 865815 852402 838903 825144 811022 796735 782753 769397 756505 743650 730562 717207
60779 717207 703735 690544 678140 666647 655683 644928 634473 624402 614545 605071 596711 589742
60767 589742 583189 575912 568216 561467 556179 551361 545837 539360 532234 524680 517004 509795 503445 497711
60753 497711 492037 486084 479826 473458 467342 461737 456524 451473 446835 443315 441336 440583 440272 439551 437757
60738 437757 434753 431081 427382 423655 419488 415019 411090 408295 406381 404810 403504 402735 402567 402710 402835
60723 402835 402878 403105 403848 405055 406205 406852 407062 407035 406554 405297 403540 401980 400781 399274 396698 392899
60707 392899 388303 383633 379631 376595 374016 371034 367335 363385 359843 357078 355114 353600 351883 349593
60693 349593 347168 345328 344110 342880 341247 339468 338013 337280 337682 339349 341666 343716 345238 346645 348167
60678 348167 349718 351606 354454 358071 361176 362760 363197 363688 365097 367628 371015 374526 377201 378584 379029
60663 379029 379095 378986 378806 378918 379673 381066 382876 384948 387191 389592 392303 395393 398547 401479 404593 408636
60647 408636 413684 419127 424689 430616 436595 441349 443821 444187 443232 441317 438384 434466 429711 424347 418967
60632 418967 414276 410171 405684 400334 394955 390604 387200 383925 380557 377659 375712 374711 374498 374885 375480
60617 375480 375781 375515 374755 373878 373411 373527 373604 372761 371026 369433 368770 368844 369231 369903 370623 370554 369233 367388
60599 367388 366088 365589 365610 366129 367056 367706 367572 367288 367853 369159 370249 370875 371770 373322 374931 375865 376058
60582 376058 375835 375517 375489 376123 377447 379187 381184 383379 385496 387272 389005 391372 394757 399287 405475
60567 405475 414070 425054 437363 449935 462621 475786 489365 502651 514717 524655 531492 534345
60555 534345 532963 528101 521142 513212 504783 496285 488783 483527 480870 480180 480915 483203 487200 492672 499621
60540 499621 508705 520399 534219 549353 565664 583363 601996 620316 636886 650294 659208 663075
60528 663075 662631 659117 653127 644834 635089 625478 617228 610621 605424 601318 597855 594589 591310 587921
60514 587921 584271 580533 577398 575345 573966 572693 571879 572393 574325 577017 580354 585157 592257 602042 615052
60499 615052 632132 653684 679560 710116 746533 789546 838329 891202 947008 1005151 1064385
60488 1064385 1122035 1174484 1218243 1250692 1270113 1275323 1265607 1241228 1203876 1156301 1101528 1042522
60476 1042522 982249 923429 868003 817000 770794 729286 692080 658839 629402 603392 580100
60465 580100 559181 541042 525961 513173 501552 490959 482107 475165 469316 463788 458534 453707 449172
60452 449172 444786 440641 436755 432918 429044 425305 421851 418699 415883 413337 410764 408107 405985 405081
60438 405081 405181 405460 405535 405530 405231 404152 402529 401306 400884 400693 400282 399951 399925 399747 399044 398204 397699 397284 396477
60419 396477 395439 394809 394955 395811 397191 398870 400543 402003 403212 404126 404750 405405 406475 407839 409054 410206
60403 410206 411936 414381 416762 418375 419431 420514 421752 422987 424227 425448 426373 426994 427917 429687 432094
60388 432094 434648 437396 440702 444382 447628 449827 451093 451985 453001 454279 455627 456854 458132 459797
60374 459797 461752 463410 464459 465384 466943 469267 471790 473933 475639 477193 478627 479427 479050 477779 476699
60359 476699 476546 476933 477140 477229 477739 478655 479504 480334 481666 483573 485781 488760 493611 500528 508306 515696
60343 515696 522353 528133 532575 535693 538237 540398 541064 539233 535489 531266 527211 523091 518774 514451
60329 514451 510247 506418 503536 501757 500279 498269 495903 493791 491815 489420 486689 484207 482071 479947
60315 479947 477914 476348 475052 473444 471710 470983 472149 475121 479380 484698 491136 498957 508783 521535
60301 521535 537965 558265 581820 606966 631152 651870 667527 677323 680746 677701 668965 655980
60289 655980 640295 623421 606729 590875 575678 561210 548617 539073 532175 526313 520526 515075
60277 515075 510190 505297 499785 493741 487544 481420 475754 471185 467927 465388 462822 460040 457264 454780
60263 454780 452955 452090 451874 451447 450404 449412 449329 449977 450206 449111 446801 444115 441960 440940 441238 442630
60247 442630 444644 446770 448501 449340 448946 447316 444724 441499 438023 434926 432997 432616 433331 434338 435407
60232 435407 436978 439272 441795 444108 446620 449928 453670 456908 459587 462662 466533 470294 473026 475032
60218 475032 477126 479358 481293 483122 485609 489112 493369 498162 503536 509416 515567 521972 528838 536209
60204 536209 543861 551430 558352 564027 568514 572738 577463 582334 586514 589939 593213 596483 599282 601446
60190 601446 603308 604884 605569 604909 603045 600210 596425 591967 587526 583480 579355 574375 568333 561761 555491
60175 555491 550141 545806 542107 538729 535838 533673 531892 529825 527429 525480 524651 524758 525043 524808 523731
60160 523731 521949 520051 518664 517924 517552 517481 518031 519377 521205 523038 524646 526085 527572 529381 531610
60145 531610 534077 536691 539770 543605 547862 551957 555980 560589 565945 571456 576787 582397 588620 594846
60131 594846 600205 604728 609187 613951 618517 622153 624520 625645 625688 624996 624246 624221 625273 626934 628187 628365
60115 628365 627893 628050 629824 632984 636199 638066 638096 636877 635339 633949 632621 631224 629720 627746 624506
60100 624506 619493 613087 606117 599047 591922 584867 578205 572258 567449 564385 563274 563366 563571 563728 564785
60085 564785 567689 572480 578449 584595 589868 593631 596285 599089 602923 607344 610961 612542 611701 608825
60071 608825 604597 599448 593429 586650 579700 573296 567478 561528 554775 547219 539358 531714 524633 518241
60057 518241 512428 507068 502292 498319 495012 491899 488741 485851 483743 482688 482693 483732 485876 489229 493734
60042 493734 499004 504534 510219 516437 523383 530556 537163 542828 547580 551424 554405 556885 559106 560505
60028 560505 560008 557157 552611 547498 542536 537696 532270 525340 516600 506795 497039 487839 479088 470815
60014 470815 463305 456592 450452 444923 440291 436558 433486 431231 430269 430554 431347 432080 432903 434167 435827
59999 435827 437567 439069 440025 440282 440138 440093 440277 440579 441365 443380 446751 450735 454794 459382 465250 472294
59983 472294 479485 485679 490375 493920 497188 500704 503975 505980 506396 505885 505129 504079 502395 500160 497844
59968 497844 495851 494378 493437 492850 492452 492380 492970 494405 496718 499984 503987 507871 510753 512704 514474 516232
59952 516232 517306 517303 516678 515916 514847 513176 511131 509141 507385 505944 504934 504170 503155 501646 499753 497263
59936 497263 493529 488383 482588 477045 472098 467942 465057 463708 463468 463700 464135 464679 465210 465904 467223 469167
59920 469167 471086 472638 474348 476762 479717 482995 487013 492106 497612 502482 506493 510171 513879 517728
59906 517728 522133 527601 533914 540123 545436 549741 553307 556324 558644 559731 559003 556486 552876 548803
59892 548803 544435 540083 536648 534909 534738 535519 537010 539336 542436 546069 550120 554466 558798 563044 567620
59877 567620 572844 578420 583937 589410 594724 599025 601443 602169 602037 601250 599303 596100 592319 588614 585060
59862 585060 581500 577869 574084 570095 566154 562660 559717 557254 555486 554772 555048 555986 557813 561432 567458
59847 567458 575502 584665 594417 604652 614909 623825 629619 631324 629618 626419 623677 622616 623758 627015
59833 627015 631472 635524 637661 637055 633517 627383 619662 611740 604532 598161 592542 587654 582939 577206
59819 577206 569809 561543 553852 547550 542789 539687 538185 537546 536785 535578 534215 532852 531363 529763 528199
59804 528199 526627 525004 523681 523121 523284 523593 523326 521731 518143 512595 506105 499861 494263 489117 484412
59789 484412 480326 476734 473315 470019 466924 463879 460775 457918 455559 453366 450999 448979 448255 449011 450522
59774 450522 452122 453709 455351 456978 458518 459896 460952 461720 462564 463635 464590 465362 466793 469749 473906
59759 473906 478147 481924 485422 488634 491259 493536 496272 499895 504167 508803 513659 518343 522483 526506
59745 526506 531296 536915 542377 546888 550604 554013 557354 560888 564962 569359 573156 575679 577147 578142
59731 578142 578900 579401 579643 579507 578753 577540 576616 576659 577579 578654 579191 579002 578427 577941 577584 576922 575784 574806
59713 574806 574824 575923 577581 579494 581644 583714 585217 586251 587452 589028 590476 591373 591932 592641 593877
59698 593877 595918 598750 601786 604441 607231 611657 618577 627039 634949 640535 643085 642795 640412 636878
59684 636878 633055 629706 627481 626613 626706 627155 627616 627729 626743 624031 619902 615311 610813 606265 601388 595999
59668 595999 589867 583043 576304 570589 566007 562005 558357 555227 552401 549432 546576 544740 544307 544825 545908
59653 545908 547568 549559 551438 553571 557056 562075 567174 570639 571944 571397 569266 565879 561939 557984
59639 557984 553899 549417 544691 540047 535694 532053 529816 529206 529730 531016 533285 536462 539461 541043 541003
59624 541003 539997 538571 536946 535346 533882 532259 530047 527086 523302 518480 512670 506559 500961 496125
59610 496125 491901 488330 485694 484091 483376 483429 484257 485861 488159 490914 493700 496115 498017 499321 499661
59595 499661 498766 497195 496096 496074 496790 497860 499528 502072 505039 507506 508804 508757 507543 505571 503181 500268
59579 500268 496461 491797 486857 482210 478128 474830 472283 469681 465878 460761 455600 451732 449433 448341
59565 448341 448258 448946 449733 450007 449874 449853 450187 450808 451694 452879 454298 455888 457604 459183 460244 460809 461392
59548 461392 462392 463784 465481 467554 469967 472624 475849 480356 486613 494771 505312 519122 536690
59535 536690 557674 581022 604505 624097 635355 636551 630089 620385 610880 603249 598186 595805 595721
59522 595721 597649 601703 607681 614585 621420 627910 633852 638356 640482 640191 637992 634038 628221 620812
59508 620812 612291 602845 592592 581980 571482 561247 551488 542770 535410 529081 523536 519186 516339
59495 516339 514449 512876 511948 512431 514278 516674 519051 521342 523487 525404 527357 529760 532721 536174 540250
59480 540250 545165 551162 558960 569687 583781 600333 618008 636040 653740 669690 682327 690949
59468 690949 695475 695743 691905 685099 676878 668247 659962 653200 648959 647166 647362 649905 655471 663710 673612
59453 673612 685005 698541 714225 731216 749209 768871 790567 813552 836661 858792 878315
59442 878315 892895 900569 900610 893215 879245 860803 841260 823660 808890 795639 782017 767006
59430 767006 750653 733398 715599 697674 680394 664593 650611 638430 628427 621521 618374 618989
59418 618989 623351 631852 644737 661796 683117 709471 741381 778311 818973 861072 899663 927062
59406 927062 936777 928078 906093 877799 848934 823839 805774 796343 795629 803191 817523 833860 844082
59393 844082 840726 821609 790529 754074 717954 685317 657017 632804 612322 595213 580751 568034
59381 568034 556715 547164 539772 534456 530879 528746 527740 527468 527615 527968 528340 528763 529617 531185 533220
59366 533220 535317 537571 540315 543371 546229 548942 552219 556475 561361 566439 571876 578186 585639 594202
59352 594202 603917 615166 628568 644510 662680 682237 702598 723868 746345 769952 794347 819159
59340 819159 843756 867184 888824 908662 926412 940744 949997 953453 951510 945011 934936 922273
59328 922273 907475 890332 870937 850361 829759 809308 788863 769133 751213 735249 720576
59317 720576 706930 694515 683050 671878 661034 651248 642846 635574 629504 625154 622572 621187 620647
59304 620647 621058 622370 624499 628178 634805 645246 659456 677237 698366 721640 744484 763807 776873
59291 776873 781737 777967 767301 752867 737384 722335 708481 696218 685487 676193 668804 663790
59279 663790 660612 658213 656441 656002 657095 659344 663147 669765 679572 691303 703560 716160 729547
59266 729547 743689 758012 771708 783712 793046 799534 803605 805226 803753 798874 790912 780091 766482
59253 766482 750901 734875 719363 704324 689778 676309 664190 652989 642477 633124 625378 619312
59241 619312 615213 613547 613951 615229 616809 619281 623181 628192 633902 640247 646695 652085 655971 659169
59227 659169 662338 664916 666056 665645 663698 659681 653237 644884 635374 625147 614878 605539 597174 588617
59213 588617 579309 570483 563643 558730 554785 551665 550007 550038 551420 553822 556772 559398 561204 562758 564930
59198 564930 567919 571654 576458 582362 588308 592983 596166 598514 600417 601898 603215 604766 606633 608877
59184 608877 611919 615935 620280 624216 627835 631591 635384 638832 642008 645111 647838 649941 652032 654947
59170 654947 658589 662236 665788 669818 674592 679952 686099 693646 702688 712435 721868 730307 737375 742954
59156 742954 747192 750119 751225 749747 745375 738474 729775 720098 710182 700498 691260 682616 674518 666463
59142 666463 658021 649775 643011 638134 634068 629705 625277 621711 619181 617007 614644 612178 610092 608934
59128 608934 608935 609665 610485 611529 613663 617207 621387 625474 629743 634854 640973 647996 655908 664350 672568
59113 672568 680420 688789 698374 708697 718871 728514 737299 744472 749747 753962 757973 761579 764357 766727
59099 766727 769075 770515 769836 767323 764456 761976 759274 755568 750800 745423 740121 735634 732285 729739
59085 729739 727512 725338 722710 718884 713915 708819 703933 698032 690103 681122 672810 665317 657456 648727
59071 648727 639714 630813 622067 614162 608160 604041 600525 596487 591768 586777 582183 578867 577165 576194
59057 576194 574689 572357 569666 566702 563248 559628 556378 553339 550226 547831 547388 548773 550529 551725
59043 551725 552681 553854 555125 556386 557814 559340 560660 561790 562812 563214 562443 561047 560235 560401 561080 562251
59027 562251 564463 567754 571760 577034 584879 595590 608075 621542 636268 652192 668027 682564
59015 682564 695920 708655 720368 729902 736454 739892 740328 737912 732857 725626 717372 710012 705107 702584
59001 702584 701290 700840 702130 705899 711649 718243 724788 730635 735354 739140 742613 745894 748391 749696
58987 749696 749983 749275 747062 743056 737769 731919 725806 719569 713584 708232 703645 699980 697621 696913 698013
58972 698013 701078 706240 713330 721902 731517 741685 751798 761698 772156 784125 797558 811510 825203
58959 825203 838241 849912 859233 865839 870027 871743 870235 864919 855978 843950 829368 813006 795902
58946 795902 778876 762427 747110 733487 721686 711501 702988 696480 692074 689477 688205 687421 685949
58933 685949 683154 679567 675955 672088 667304 661904 656955 652847 649152 645776 643041 640591 637467 633569
58919 633569 629958 627333 625177 622796 620257 617901 615804 614219 613845 615163 617960 621743 626172 631088
58905 631088 636714 643847 653182 664490 677095 690918 706169 722209 737850 752684 766944 780097
58893 780097 791038 799894 808318 817541 827490 838321 851437 868085 887942 909890 933197 957064
58881 957064 979818 999590 1015386 1026956 1034243 1037581 1037728 1034845 1027856 1015523 997922 976498 953089
58868 953089 929382 906825 886352 868197 852201 838110 825545 814078 803522 793802 784514 775083
58856 775083 765396 755831 746612 737627 728744 719841 710665 701315 692594 685126 678393 671547 664869 659300
58842 659300 654706 649883 644319 638581 632799 626215 618653 611118 604328 597843 591276 585317 580857 577914
58828 577914 575999 574735 573687 572464 571396 571273 572056 572808 573235 574168 576080 578315 580411 583035 586787
58813 586787 591110 595178 598967 602650 605786 607965 609558 611019 612090 612318 611705 610315 607954 604846 601759
58798 601759 598914 595564 591335 587056 583508 580175 576144 571546 567196 563399 559969 557016 554920 553855
58784 553855 553910 555340 558210 562159 566850 572146 577682 582924 587979 593519 599506 604779 608319 610073 610150
58769 610150 608239 604487 600061 596047 592408 588589 584467 580134 575489 570674 566289 562666 559568 557025
58755 557025 555703 555950 557218 558917 561084 563750 566405 568588 570338 571761 572950 574517 577268 581086
58741 581086 585241 589939 596296 604427 613034 621389 630164 639548 648154 654896 660656 666989 674328 682439
58727 682439 691376 700762 709217 715696 720490 723915 725136 723420 719569 714999 710436 706603 704973 706398
58713 706398 709908 714147 719122 725240 731631 736925 740878 743769 744967 743650 740307 735968 730364 722321
58699 722321 711628 699133 685311 670132 654205 638768 624472 611078 598285 586184 575088
58688 575088 565494 557833 551721 546053 540342 535194 530908 526560 521307 515662 510588 506163 502024 498242
58674 498242 494878 491626 488769 487475 488200 489932 492017 495547 501755 510313 520483 532625 546963 562053
58660 562053 576159 589127 601189 610957 616576 618207 617541 615434 611750 606896 601609 595628 588336 580421
58646 580421 573291 567145 561164 555168 549555 543967 537719 531280 525835 521613 518115 515638 515021 516059
58632 516059 517599 519010 520243 520774 519900 517910 515682 513420 510949 508858 508028 508419 509485 511290 514111
58617 514111 517591 521549 526910 534468 543479 552795 562437 572566 581955 589325 595272 600871 605272 606853
58603 606853 606083 604921 603782 601445 597731 594001 590959 588017 584939 582198 579701 576935 574398 573152
58589 573152 573064 573262 574172 577299 583095 590812 600254 611746 624508 636977 648703 660169 671003 680339
58575 680339 688651 697082 705053 710738 713920 716216 718477 720321 722476 727222 735887 747905 762825 781305
58561 781305 803571 828724 856081 885541 916240 946374 974567 999878 1020666 1035449 1044959 1051328
58549 1051328 1055128 1055259 1051776 1046502 1040586 1033794 1026568 1020193 1014161 1005782 993471 978412 961986
58536 961986 943619 922288 898447 873340 847935 823463 801519 782627 765948 750976 738229
58525 738229 727768 718633 710403 703905 699740 697401 696405 697016 699309 702686 706585 710571 713750 715457
58511 715457 716389 717581 718495 717906 716333 715507 715518 714784 712948 711489 711061 710512 709031 707172 705252 702841
58495 702841 700254 698509 697382 695604 693304 692035 692023 691750 690756 690412 691374 692704 694268 697611 703660 711880
58479 711880 722451 736826 755188 775608 796594 818125 839350 857767 871791 881827 887844 888393
58467 888393 883232 874592 864473 852838 839685 826660 815240 805299 796733 790539 787187 785895 786553
58454 786553 790367 797701 807352 818723 832292 846954 859451 867718 872491 874573 873058 867505 859270
58441 859270 849235 836718 822129 808222 797121 788363 781283 776811 775295 775028 774713 775216 777347 780321
58427 780321 783960 789956 799163 810024 821333 834137 849126 864629 878998 892492 904909 913916
58415 913916 917819 917726 915010 909135 900049 890111 881200 872170 861489 850155 839664 829305 818059
58402 818059 807219 798658 792229 787068 783651 782404 782146 781975 782925 785884 789811 793777 798497 803951 808004
58387 808004 809524 810463 812577 814495 814443 813450 813359 813958 814629 816511 820404 824653 827702 830647 834799 839002
58371 839002 842010 845235 850432 856751 862771 869317 877657 887059 896744 908089 922230 937687 952937
58358 952937 968972 986624 1003733 1017742 1028783 1037641 1043343 1045576 1046743 1048542 1049244 1047449 1045607
58345 1045607 1046346 1048197 1048699 1049048 1051753 1056180 1060514 1065919 1074677 1086151 1098390 1111754 1127223 1143209
58331 1143209 1157884 1172648 1189499 1207024 1222651 1236692 1250318 1261849 1269081 1273273 1276856 1279327
58319 1279327 1279325 1278494 1279206 1280625 1281021 1281660 1284351 1287687 1289979 1293394 1300693 1310438 1319988 1330610 1344730
58304 1344730 1360671 1375267 1389428 1405965 1424074 1441045 1457267 1474419 1490987 1504778 1517702
58293 1517702 1532806 1548842 1563060 1576935 1593548 1611743 1628669 1645766 1666269 1689051 1710931
58282 1710931 1732796 1757336 1783007 1806526 1829081 1853752 1879188 1902446 1925684 1953132 1983742
58271 1983742 2013879 2045001 2081322 2122023 2163306 2206183 2254576 2307588 2361396 2416939 2477875
58260 2477875 2542745 2607072 2671319 2738702 2807205 2872225 2935138 3000528 3066912 3129294 3189073
58249 3189073 3252146 3318853 3385249 3452598 3525906 3604661 3684855 3768482 3860960 3960942 4063076
58238 4063076 4168974 4284702 4409525 4538476 4673930 4822715 4983781 5151190 5327252
58229 5327252 5519661 5727666 5944809 6173525 6422701 6692580 6977005 7278810 7607337
58220 7607337 7962634 8338834 8741475 9183878 9668119 10188435 10751898 11375600 12064726
58211 12064726 12815195 13637484 14555295 15581469 16720051 17992415 19435553 21074990
58203 21074990 22928628 25039159 27473446 30291741 33556265 37378935 41932925 47428836
58195 47428836 54141359 62487248 73053510 86558904 103833603 125793210 153268620
58188 153268620 186701649 225862928 269547935 315054390 357732124 391522477 410953751
58181 410953751 413567229 400934649 377480018 348153803 316658404 285011268 254066230
58174 254066230 224248501 196023780 169966464 146557094 125994083 108207679 92995040
58167 92995040 80098700 69213296 60019931 52250178 45696172 40169244 35489266 31513485
58159 31513485 28138320 25267501 22805670 20682601 18853497 17271118 15881465 14647937
58151 14647937 13554639 12582187 11701825 10895886 10162725 9497559 8887087 8325733 7818476
58142 7818476 7363662 6949364 6569608 6228176 5923395 5644436 5385497 5148866 4931009
58133 4931009 4720054 4510618 4308192 4115949 3929949 3750127 3583136 3430664 3286434
58124 3286434 3147881 3019729 2903256 2793072 2687465 2591126 2504587 2421417 2339106 2262757
58114 2262757 2194779 2130501 2067148 2007806 1953306 1899218 1844231 1792967 1747282 1702953 1657897
58103 1657897 1615506 1576912 1538057 1497531 1459531 1425983 1393269 1359694 1328635 1301229 1273396
58092 1273396 1243373 1215090 1190856 1167648 1143895 1123007 1106681 1091305 1074593 1059489 1047883
58081 1047883 1036519 1022735 1008539 995434 980733 962608 943559 925441 906071 884122 862490
58070 862490 843481 825286 806332 788555 773253 758175 741818 726454 714024 703105 692597
58059 692597 684243 678815 673765 667203 660325 653791 645866 636316 627789 621079 613399 603621 594639 588113
58045 588113 581583 573524 566556 562464 558469 551912 544613 539138 534472 528798 523106 518695 514286 508723
58031 508723 503441 499312 494188 486473 478040 470718 463042 453416 443446 435131 427630 419765 412887 408300
58017 408300 404575 400267 396674 395101 394038 391869 389687 388610 387028 383527 379993 378687 378574 377574
58003 377574 376263 376210 376692 376147 375246 375625 377079 378576 380454 383162 385417 386056 386200 387376 389092 390323
57987 390323 391632 393567 394782 394104 392883 393029 394130 394537 393861 392447 389911 386091 382032 378392 374458
57972 374458 370162 367103 365995 365215 363540 362078 361661 360826 358623 357056 358193 360853 362686 363678 365060
57957 365060 366495 366958 366912 367153 366885 365270 363501 363103 363606 364043 365234 368271 372171 375388 378406 382599
57941 382599 387796 393108 398944 406063 413836 421534 430043 440285 451184 461262 470867 480731 489687
57928 489687 496047 500004 502468 502780 499840 494326 487504 478929 467671 454853 442682 431667 420871
57915 420871 410144 400152 390928 382290 374922 369326 364558 359697 355531 353210 352334 352042 352638 354306 355598
57900 355598 355247 354298 354413 355249 355559 355591 356225 356879 356610 356264 357255 359077 360215 360635 361211 361583 360835 359567
57882 359567 359098 359217 358712 357390 355654 352945 348597 343380 338208 332318 324774 316793 310329 305296 300400
57867 300400 295731 292174 289208 285785 282657 281324 281382 281412 281794 284020 287781 291463 295150 300411 307269
57852 307269 314000 319902 325794 331761 336839 340953 344899 348334 350073 350375 350682 351005 349854 346891 343382
57837 343382 339872 335678 330985 327207 324839 322971 321274 320547 320928 321564 322450 324721 328651 333147 337646
57822 337646 342767 348644 354328 359331 364240 369370 374235 378677 383090 387304 390614 393017 394948 395697
57808 395697 393612 388082 379940 370013 358825 347728 338466 331279 324847 318214 311410 304339 296766 289419
57794 289419 283370 278270 272892 267383 263184 260672 258843 257488 257630 259433 261736 264211 268024 273616
57780 273616 279673 285183 290967 298319 307499 318283 330596 343870 356912 369006 380077 389469 395927
57767 395927 399232 400460 400137 397473 392007 384618 376278 367050 356998 346961 337704 329173 321046 313173
57753 313173 305222 296951 289119 283164 279680 278117 277912 278777 279847 279970 279072 277989 276808 274692 271469
57738 271469 268007 264795 261595 258762 257391 257752 258916 260282 262094 264146 265501 265934 266225 266544 265981
57723 265981 264204 262152 260520 258952 257298 256268 256071 255748 254659 253551 253392 254188 255575 257578 260047
57708 260047 262206 263334 263275 262147 260500 259865 261900 266636 272601 278839 285707 293612 302354 311851 321959
57693 321959 331245 337473 339849 339442 337012 331970 323998 314122 303476 292378 281324 271525 263676 257458
57679 257458 252867 250846 252006 256016 262819 273227 287967 307669 334366 371280 420345 481305
57667 481305 553649 637079 728265 818224 894396 945200 963311 947538 903648 842115 772995
57656 772995 702700 635130 573460 519316 471937 430138 394267 364961 341186 321074 303814
57645 303814 289272 276642 265059 254905 247037 241149 236191 231907 228698 226331 223949 221147 218171
57632 218171 215358 213123 212039 212205 212909 213468 213835 213944 213287 211697 209675 207374 204275 200522 197429 195750
57616 195750 194525 192656 190585 189355 188910 188447 187715 186936 186242 186080 187247 189500 191140 191077 190356 190409 190880
57599 190880 190619 189913 189995 190780 190741 188947 185984 182948 180504 178726 177044 174625 171527 168950 167645 166833
57583 166833 165499 163858 162428 160621 157709 154556 152828 152816 153411 153895 154375 154589 153698 151437 148522 145780
57567 145780 143591 142037 140876 139555 137898 136506 135893 135755 135731 136229 137602 139112 139688 139256 138485 137812
57551 137812 137608 138559 140765 143068 144452 145501 147252 149240 150154 150010 150094 150901 151649 151902 152302 153398 154823
57534 154823 155847 155835 154061 150006 144079 137372 130698 124404 118896 114414 110414 105993 100966 95901 91253
57519 91253 87247 84436 83539 84671 87240 90494 93788 96780 99939 104406 110619 117521 123761 129221 134588
57504 134588 140088 145552 151135 156913 162157 166014 168618 170591 171932 172362 172317 172522 172906 172973 172820 172725 172184
57487 172184 170530 168211 166245 164671 162686 160087 157413 154898 152468 150575 149805 149770 149464 148573 147342
57472 147342 145500 142638 139443 137117 135574 133534 130522 127476 125243 123773 122972 123096 123910 124552 124645 124702
57456 124702 125212 126118 127271 128501 129198 128784 127770 127450 128454 130406 132884 135663 138071 139254 139332 139348
57440 139348 139903 140726 141613 142773 144127 145285 146346 147783 149458 150695 151434 152295 153367 153960 153728 153114
57424 153114 152510 151869 151298 151144 151367 151665 152212 153329 154505 154796 154198 153519 152916 151770 150173 149270 149801
57407 149801 151373 153401 155684 157761 158839 158754 158077 157071 155546 153874 152940 152819 152606 151890 151218 150828
57391 150828 150221 149490 149760 151588 153973 155634 156391 156707 156835 157069 157891 159198 160138 160398 160890 162511 164826
57374 164826 166606 167126 166500 165320 164368 164124 164165 163608 162312 161084 160569 160672 161173 161979 162605 162361 161333
57357 161333 160294 159458 158291 156804 155948 156339 157606 159372 161773 164573 166911 168553 170375 172961 175672
57342 175672 177701 179102 180164 180694 180664 180690 181183 181751 182075 182587 183653 184904 185978 187108 188350 189050 188817
57325 188817 188282 188119 187998 187181 185516 183236 180389 177170 174210 171925 170081 168419 167090 166059 164881
57310 164881 163487 162445 161917 161207 159853 158345 157239 156431 155885 156119 157240 158362 158787 159007 159839 161332
57294 161332 163208 165532 168146 170209 171179 171623 172349 173350 174272 175156 176046 176622 176978 178047 180513 183996
57278 183996 187938 192467 197693 203087 208442 214537 221919 229846 237377 244702 252351 259920 266695 272876
57264 272876 279068 285072 290184 294120 296723 297478 296421 294913 294381 294766 295161 295265 295136 294265 292295 290158
57248 290158 289141 289128 289030 288579 288432 288819 289433 290443 292276 294440 295891 296627 297717 299681 301979 304270
57232 304270 307003 310428 313948 316855 319068 320865 322484 324154 326009 327883 329569 331271 333420 336180
57218 336180 339561 343728 348735 354195 359712 365348 371182 376779 381616 385696 389276 392491 395682 399468
57204 399468 403888 408113 411708 415439 420063 425110 429891 434964 441414 449212 457503 466025 475063 484363
57190 484363 493423 502601 512693 523607 534668 546043 558574 572242 586089 599761 613985 629356
57178 629356 645721 662937 681234 700536 720223 739766 758969 777581 795393 812657 829755
57167 829755 846606 863082 879808 897751 917194 937908 959997 983645 1008217 1032560 1056043
57156 1056043 1078548 1099784 1119657 1139003 1158874 1179328 1199998 1221519 1245053 1270509 1296576
57145 1296576 1322591 1349132 1376604 1404534 1432476 1460525 1488533 1515826 1542074 1567715 1593380
57134 1593380 1619551 1646780 1675482 1705508 1736690 1769599 1804953 1842586 1882032 1923737 1968527
57123 1968527 2016119 2065578 2117202 2172691 2233402 2299663 2371700 2449895 2534025 2623637 2719278
57112 2719278 2822132 2932460 3049885 3175356 3311469 3460768 3625275 3807901 4012857
57103 4012857 4244571 4508074 4811136 5164767 5581515 6075150 6662945 7367480 8216680
57094 8216680 9244346 10491059 12002055 13822194 15991980 18544344 21497491 24844807
57086 24844807 28550080 32551898 36772612 41129251 45547134 49964840 54308268 58434785
57078 58434785 62093616 64956582 66718472 67202790 66405804 64467421 61607772 58070865
57070 58070865 54089241 49864297 45556507 41284949 37135315 33171814 29446612 26002542
57062 26002542 22869783 20061443 17573387 15389296 13487072 11841999 10426313 9209042
57054 9209042 8159082 7249775 6460875 5776938 5184877 4673054 4231290 3850544 3522445
57045 3522445 3239227 2993722 2779231 2589845 2421086 2269801 2133327 2009277 1896215
57036 1896215 1793635 1700740 1615703 1536515 1461977 1391438 1324305 1260682 1202430 1153051 1116537
57025 1116537 1096537 1096257 1118049 1161312 1218781 1274222 1306057 1297301 1244659 1158504 1054282 944317
57013 944317 836141 734675 643178 562778 493007 433013 381793 338005 300614 269419 244299
57002 244299 224401 208717 196754 187827 180440 173462 167421 163526 161721 160762 159977 159853 160958 163370
56988 163370 167333 173594 182740 194761 209451 226709 246095 266208 284556 298099 304481 303265
56976 303265 295954 284698 271257 257164 243930 232366 222186 212961 205097 199214 195046 191816 189512
56963 189512 189039 191200 196272 204559 216674 233012 253269 276391 300506 322849 340153 349540 349461
56950 349461 340400 324897 306338 287207 268512 250837 235144 222099 211282 201897 194016 188559
56938 188559 186317 187604 192693 202008 215911 234722 258860 288487 322824 359637 395034 423824
56926 423824 441094 444383 434533 414426 387378 356660 325418 295890 268871 244431 222904 204657
56914 204657 189306 175836 163408 151765 141179 132346 125915 121642 118313 114954 111724 109211 107342
56901 107342 105607 103994 103017 102998 103880 105660 108623 113242 120048 129292 140604 153447 168153 186045
56887 186045 208247 234787 264894 297118 328660 355472 374122 383390 383847 376678 363586 347085
56875 347085 329787 313480 299231 287736 278949 272057 266664 263650 264249 268981 278354 294000 318071
56862 318071 351691 394746 446689 506394 571001 635243 691800 732514 750872 745149 719474 681235
56850 681235 637347 592598 549939 510882 475940 445747 421578 404383 394138 390995 396311 411560
56838 411560 437138 473533 522924 588015 669421 764964 870190 977197 1073252 1143492 1177253
56827 1177253 1172349 1134172 1072118 996462 916013 836602 761383 692431 631469 579360 536053
56816 536053 501420 475565 458479 450349 452335 466192 492993 532866 585689 650796 725383 803424
56804 803424 876000 932589 963611 964266 936910 889137 829268 763817 697856 635327 578239 526898
56792 526898 481592 443226 412091 387293 367996 354360 346898 345943 352291 367305 391591 424032
56780 424032 462390 503843 544177 577295 597007 599858 586424 560310 526132 487916 448524 409929
56768 409929 373460 339672 308499 280054 254898 233094 213611 195501 179216 165862 155488
56757 155488 147064 139802 133468 127666 122052 117166 113812 111607 109262 106373 103750 101865 100220 98464
56743 98464 96944 95760 94394 92769 91688 91731 92463 93130 93369 92968 91739 89956 88305 87159 86464 86288
56727 86288 86724 87339 87591 87730 88338 89147 89490 89797 91283 94003 96626 98383 99886 101699 103533 105337
56711 105337 107735 110708 113172 114624 115998 118087 120314 121971 123534 125722 128175 130102 131498 132709
56697 132709 133469 133372 132851 132756 133290 134031 134664 135136 135461 135853 136641 137662 138191 137824 136979 136221 135666 135266 135071
56678 135071 134909 134418 133613 132842 132079 131092 130348 130702 132001 133146 133892 135430 138607 142657 146419 149823
56662 149823 153452 157507 161952 166920 172324 177701 182985 188680 194844 200816 206376 212166 218318 223757
56648 223757 227599 230263 232353 233396 232674 230550 228007 225461 222812 219975 216538 211544 204611 196829
56634 196829 189788 184001 178838 173558 167953 162451 157958 154999 152771 149834 145988 142490 140070 137950
56620 137950 135337 132610 130249 127860 125227 123185 122325 121800 120577 118902 117428 115829 113597 111433 110390
56605 110390 110158 109528 108227 107136 106942 107567 108689 109955 110988 111942 113639 116402 119249 120989 121565 121588
56589 121588 121216 120416 119700 119588 119816 119925 120190 121097 122524 124227 126528 129608 132698 134937 136462 137728
56573 137728 138419 138079 137245 136852 137019 137431 138362 140204 142501 144646 147158 151108 156547 162594 168873 175811
56557 175811 183642 192023 200395 207970 213685 217122 219245 221368 223658 225360 226150 226382 226321 225919 225139 223829
56541 223829 221657 218758 215986 213882 211997 209825 207669 205797 203523 200126 196038 192156 188586 185046
56527 185046 181918 179852 178837 178505 178782 179438 179755 179595 179939 181346 182766 183021 182547 182367 182226 181235 179608
56510 179608 178149 176686 174657 172767 172350 173312 174261 174515 174528 174494 174018 173149 172486 172217 172113 172306 173039 173884
56492 173884 174254 174336 174565 174729 174622 174846 175709 176147 175317 174478 175468 177786 179132 178653 177811 178013 179131 180445
56474 180445 181486 181777 181210 180819 181878 184126 186107 187146 187768 188349 188768 189296 190437 191921 193079 194012
56458 194012 195148 196016 195945 195623 196315 197840 198987 199700 201092 203337 205353 206651 207883 209509 211435 213856
56442 213856 216787 218920 218790 217086 215935 215876 215494 214120 212787 212162 211590 210727 210244 210338 210327 210264 211172 213074
56424 213074 214534 214833 214957 215790 216944 218098 219893 222633 225494 227796 229824 231721 232851 232862 232202 231050
56408 231050 228964 226033 223134 220633 218035 215266 212902 210902 208565 206050 204434 203944 203684 203496 204377
56393 204377 206569 208932 210823 212912 215427 217208 217312 216156 214417 212242 210202 209471 210306 211666 212919
56378 212919 214486 216254 217017 216277 215116 214518 214225 213905 213958 214416 214506 214029 213736 213711 212933 211196 209891 210064
56360 210064 211135 212242 213364 214455 215119 215938 218433 222849 227528 231301 234839 238763 242244 244579 246476
56345 246476 248552 250036 250202 249694 249339 248971 248506 248760 250144 251772 252814 253437 253654 252839 251235 250306 250562
56328 250562 250670 249742 248786 248798 249223 249579 250900 254130 258570 263260 268295 273477 277335 279050 279937 281519
56312 281519 283508 285051 286468 288244 289763 290631 291912 294558 297928 301325 305546 311363 317964 324537
56298 324537 331890 340606 348872 354179 356222 356425 355662 354259 353220 353471 354457 355119 355658 357002 359279 362088
56282 362088 365493 369574 373884 378443 384138 391039 397642 402975 408064 413988 420080 425638 431873 440291
56268 440291 450426 461028 472241 484736 497884 510916 524928 541701 561242 582372 605076
56257 605076 630495 659141 690821 725863 765081 809058 858562 914828 978304 1048099 1123738
56246 1123738 1206192 1295936 1391392 1490621 1593027 1697752 1801892 1902070 1996440 2083335
56236 2083335 2159407 2221184 2267408 2297947 2311688 2307582 2286767 2251648 2203829 2144768 2077377
56225 2077377 2004817 1928442 1848649 1766828 1684781 1603279 1522975 1445646 1372750 1303808 1237926
56214 1237926 1175657 1117649 1062945 1010702 962213 919048 880336 844061 809864 778497 749779
56203 749779 723392 700500 682210 667344 653797 641011 629137 617213 604570 592733 583470 576053
56191 576053 568796 561990 556798 552550 547837 543195 540043 537971 535679 533564 532751 532652 532133 532004 533581
56176 533581 535842 536779 536552 536623 536968 537079 538454 542780 548585 552979 555906 559458 563822 567422 570530 575273
56160 575273 582180 589916 598270 608410 620265 632488 644885 658363 672976 688459 705958 726498
56148 726498 748713 770981 794867 823402 857103 895146 939502 994159 1060818 1139014 1229903
56137 1229903 1335879 1456202 1586236 1720717 1854492 1980724 2092717 2188448 2270763 2343501
56127 2343501 2410245 2475601 2543086 2611076 2673876 2726760 2767287 2793024 2802415 2797837 2783749 2761331
56115 2761331 2727925 2681005 2618909 2538406 2436409 2314921 2180866 2041039 1900567 1765479
56105 1765479 1641911 1532098 1434828 1350005 1278962 1220564 1171346 1129789 1096508 1070215 1047800
56094 1047800 1028615 1014411 1004776 996843 989752 985131 982923 981026 979277 979445 981055 981633 981358 982956
56080 982956 986757 990363 993379 997782 1003408 1007977 1011889 1018035 1026493 1034383 1041398 1050346 1061752 1073187
56066 1073187 1084465 1098182 1114478 1130606 1146257 1163857 1183054 1200686 1216890 1235264 1256035
56055 1256035 1275083 1290785 1305713 1320456 1332142 1340609 1349864 1361705 1373844 1385722 1399991 1416764
56043 1416764 1432736 1447607 1465001 1485566 1505789 1525152 1547480 1573394 1598593 1621697 1646658
56032 1646658 1675248 1704488 1733865 1767525 1806589 1846696 1885975 1928049 1974349 2021006 2066343
56021 2066343 2113764 2164184 2213349 2259864 2308170 2360483 2413729 2467501 2526581 2592159 2659028
56010 2659028 2724972 2794310 2868782 2944089 3019163 3099393 3186606 3275472 3364000 3457727 3559265
55999 3559265 3664043 3770972 3886501 4013155 4145001 4279664 4423371 4578711 4739550
55990 4739550 4904162 5081060 5275182 5480868 5695371 5926273 6178250 6445998 6727977
55981 6727977 7033283 7366933 7722981 8100691 8512271 8965772 9456573 9985286 10566721
55972 10566721 11210963 11914182 12679709 13529050 14480229 15536470 16709915 18034612 19542208
55963 19542208 21249954 23190108 25426770 28028760 31058842 34615359 38860506 43996957
55955 43996957 50270277 58043550 67854297 80387563 96440527 116912190 142684398
55948 142684398 174328103 211785876 254084293 298864617 341822304 376905783 398050593
55941 398050593 401782979 388769056 363079986 329964714 293943577 258146300 224477789
55934 224477789 193922026 166805661 143087698 122587702 105053503 90162301 77570193
55927 77570193 66965501 58058517 50562742 44226981 38864789 34327164 30469830 27168487
55919 27168487 24339040 21915497 19825003 18003307 16414253 15032401 13821560 12747348
55911 12747348 11794299 10952514 10200830 9518571 8900414 8344520 7838148 7368634 6936520
55902 6936520 6544295 6183244 5844031 5529414 5244013 4981493 4733693 4502743 4292581
55893 4292581 4097583 3910848 3735227 3575282 3426377 3282300 3146108 3023273 2911166
55884 2911166 2805164 2708344 2625580 2554311 2490079 2434740 2390082 2349212 2303313 2251892 2198403
55873 2198403 2141284 2077538 2010010 1942929 1874724 1802766 1730662 1663618 1601053 1540670 1485174
55862 1485174 1437900 1396151 1355737 1317899 1285097 1254283 1221210 1187477 1156658 1127292 1096272
55851 1096272 1065464 1038388 1013687 988105 962665 939771 917526 892997 868119 846385 826641
55840 826641 805923 785472 768077 752251 734813 716762 701070 687087 672500 658419 647219
55829 647219 637626 627058 616576 608564 601832 593852 585498 578687 571692 561802 550419 540602 531704
55816 531704 521330 510476 501738 494298 485641 476559 469678 464609 459162 453851 450701 449100 447233 446161
55802 446161 448168 452479 456819 461750 469276 478485 486624 493111 498636 501882 501220 498165 495167 491445
55788 491445 485003 477169 470940 466258 461145 456188 453432 451761 447651 439990 430500 420270 409693 401005
55774 401005 397137 398510 404191 415255 433610 458278 485756 512661 534929 546451 543051 527200
55762 527200 505343 481491 456665 432779 412392 395229 379074 363856 351259 340885 330522
55751 330522 319776 309936 300745 290884 281202 273916 268914 264220 259718 257067 256305 255965 256255 258692 262673
55736 262673 265611 266410 265929 264327 260945 256504 252491 248710 244152 239598 236384 233330 228133 221221 215027
55721 215027 210088 205165 200566 197820 196445 194618 192846 193490 196846 201119 206120 213394 222646 231568
55707 231568 239376 247046 253843 257204 256611 254325 251655 247588 241579 234587 226809 217414 207132 198241
55693 198241 191370 185082 179045 174688 172201 169831 166869 164627 163789 163442 163348 164523 166959 169428 172108
55678 172108 176733 183412 189921 194832 198825 202229 203926 203540 202268 200721 198257 195197 193216 192691 191968
55663 191968 190155 188461 187995 188404 189413 191508 194281 196212 196906 197602 198912 200108 201165 203225 206335
55648 206335 208912 210206 211196 212341 212634 211626 210225 208675 205802 201135 195794 190497 184634 178039 171699
55633 171699 165970 160126 154325 149975 147365 145025 142244 140096 139147 138259 136714 135528 135538 136048 136420 137290
55617 137290 139166 141397 143356 145040 145829 144512 141367 138436 136901 135902 134594 133404 132430 130626 127627
55602 127627 124575 122163 119670 116910 115221 115273 115637 114789 113055 111484 110270 109338 109032 109185 108889 108103
55586 108103 108119 109591 111599 113417 115628 118656 121832 124898 128892 134558 141351 148864 157730 168273
55572 168273 179943 193012 209179 229406 252619 277341 302792 327300 347534 360881 367435 368545
55560 368545 364731 356055 343115 326518 306666 284978 263886 244677 226792 210041 195663 184052
55548 184052 173418 162288 151752 143625 137764 132844 128567 125433 123315 121768 120899 120697 120441 119958
55534 119958 120421 122741 126120 129277 131959 134110 134871 133767 131828 130162 128394 125767 122776 120346 118305
55519 118305 116003 113632 111671 109857 107855 106144 105075 103934 102108 100407 100027 100959 102403 104010 105740
55504 105740 107341 108859 110742 112587 112949 111422 109646 109071 108931 107761 105687 103698 101692 99002 96110
55489 96110 94127 93012 91767 90021 88107 86003 83478 80904 78797 76888 74628 72142 69747 67088
55475 67088 63751 60236 57392 55403 54204 54181 55428 56951 57698 57871 58300 59113 60019 61286 63303 65611
55459 65611 67341 68319 68984 69668 70619 72159 74059 75362 75473 74843 74053 73034 71805 70993 70860 70710 70061
55442 70061 69490 69533 69739 69617 69530 69802 70010 69984 70419 71581 72546 72749 72998 73961 74969 75533 76613 78915 81277
55423 81277 82439 83193 85035 87751 90207 92558 95679 99151 101910 104396 108051 112882 117328 120406 122287
55408 122287 122979 122107 119975 117355 114241 110140 105483 101372 98061 95018 92268 90302 88801 86898 84733
55393 84733 83383 83224 83553 83873 84388 85145 85761 86162 86728 87731 89239 91318 93599 95082 95265 94961 95139
55376 95139 95533 95410 94974 94724 94144 92442 90183 88708 88255 88049 87905 88302 89030 89187 88404 86896 84569
55359 84569 81416 78549 77372 77809 78580 79029 79393 79568 79107 78352 78126 78316 78099 77500 77334 77707 77986 78201
55341 78201 78942 79854 79810 78780 78028 78179 78474 78290 77989 77849 77442 76596 75848 75519 75300 75140 75532 76542 77476
55322 77476 77845 77873 77846 77737 77637 77706 77714 77438 77456 78548 80375 81822 82582 83298 84178 84735 84924 85281 85749 85657
55302 85657 85056 84847 85256 85431 84902 84278 84092 84087 84046 84260 84726 84909 84740 84875 85555 86157 86285 86320 86427 86043
55282 86043 84898 83654 82950 82584 82209 82125 82785 84075 85522 86763 87542 87717 87515 87340 87262 87184 87387 88152
55264 88152 88958 88931 88140 87520 87398 87074 86039 84686 83527 82508 81444 80387 79352 78280 77400 76998 76878
55247 76878 76695 76699 77278 78003 78087 77637 77349 77127 76271 74981 74317 74575 75050 75540 76593 77979 78509 77902 77350
55228 77350 77579 77796 77357 77037 77566 78196 77987 77575 78320 80279 82233 83324 83631 83428 82796 81922 81081 80351
55210 80351 79716 79310 79224 79327 79490 79666 79663 79302 78976 79474 81011 82920 84481 85511 86036 86017 85629 85250 84944
55191 84944 84445 83722 83026 82392 81744 81397 81669 82110 82061 81938 82815 84628 85975 85984 85286 84768 84526 84486 84930 85793
55171 85793 86471 86925 87982 89865 91391 91378 90140 88904 88431 88757 89534 90046 89615 88558 88096 88802 89895
55154 89895 90554 91022 91793 92573 92794 92475 91905 91149 90434 90335 90906 91328 91030 90460 90141 89789 89110 88684 89175
55135 89175 90232 91026 91366 91510 91397 90875 90281 89998 89801 89279 88634 88369 88469 88442 87995 87314 86936 87482 89059
55116 89059 90776 91515 91369 91450 92028 91959 90491 88572 87578 87677 88356 89639 91693 93823 95006 95058 94485 93597
55098 93597 92628 92228 92879 94120 95149 95884 96680 97427 97763 97892 98302 98918 99278 99370 99582 100003 100456 101010 101814
55079 101814 102573 102796 102434 101829 101256 100910 100968 101189 100869 99749 98582 98164 98249 98049 97478 97136 97280 97523 97491
55060 97491 97240 97057 97193 97608 97719 96763 94760 92791 91957 92410 93597 94931 95939 96413 96872 98212 100330
55043 100330 101764 101308 99439 97532 96337 95892 96214 97086 97617 97015 95655 94617 94395 94680 95141 95742 96457
55026 96457 97224 98007 98489 98101 96765 95171 93858 92558 90944 89416 88527 88199 88118 88348 88863 89104 88738
55009 88738 88263 88154 88068 87681 87582 88403 89694 90689 91547 92775 94032 94686 95043 95811 96786 97326 97779 99060
54991 99060 101055 102771 103925 105043 106089 106434 106329 106943 108643 110435 111507 112173 112869 113298 113141 112723
54975 112723 112419 112106 111642 111276 111177 111229 111538 112476 113841 114631 114132 112766 111493 110829 110758 111208 112202 113712
54957 113712 115546 117268 118328 118548 118376 118323 118322 118062 117720 117764 118182 118546 118749 119023 119307 119280 119054 119110 119461 119529
54937 119529 118990 118143 117389 116920 116994 117846 119142 120128 120571 121053 122148 123739 125369 126879 128539 130903 134641
54920 134641 140160 147243 155289 163881 172797 181515 189118 194797 198198 199301 198220 195090 190072 183565
54906 183565 176465 169738 163552 157316 150863 144957 140198 136140 132220 128815 126462 124640 122436 120086
54892 120086 118683 118540 118957 119509 120478 121929 123450 124925 126590 128219 129256 130018 131718 134940 138958
54877 138958 143027 147534 153374 160752 169080 177596 185675 192823 198614 202503 203811 202283 198549 193530
54863 193530 187598 180892 174205 168669 164586 161352 158511 156069 153847 151470 149121 147324 145829 143629
54849 143629 140385 136907 133906 131141 128219 125362 122878 120602 118406 116665 115637 114913 113960 112828 111938
54834 111938 111516 111523 111726 111652 111007 110292 110453 111627 112803 113055 112576 112182 112279 112689 113085 113207 112988 112675 112626 112899
54814 112899 113365 114086 115080 115839 115798 115269 115092 115319 115191 114663 114942 116899 119729 121935 123078 123903 125090
54797 125090 126488 127479 127689 127338 127024 126960 126578 125275 123414 122024 121564 121694 122211 123281 124580 125142 124598
54780 124598 123877 124194 125837 128224 130580 132290 133243 134201 136273 139744 143934 148342 153134 158378 163804
54765 163804 169709 177110 186360 196473 206418 216229 226041 234839 241088 244078 243877 240556 234367 226237
54751 226237 217236 207798 198100 188775 180482 173199 166741 161521 157864 154886 151148 146441 142044 139122
54737 139122 137634 136893 136406 135895 135139 134236 133699 133986 135117 136853 139073 141850 145256 149142 153191 157294
54721 157294 161840 167302 173511 179694 185372 190747 195918 200141 202345 202070 199531 195055 188934 181717
54707 181717 174178 166980 160564 155207 150940 147540 144784 142586 140768 138934 136810 134470 132097 129770
54693 129770 127707 126399 126173 126768 127464 127499 126387 124212 121797 120185 119693 119685 119398 118738 118173 118192 118921 119931
54675 119931 120370 119778 118791 118513 119079 119466 118880 117666 116586 115850 115272 114777 114331 113864 113605 113978 114843 115445
54657 115445 115471 115561 116256 117094 117303 116871 116312 115861 115497 115372 115612 116027 116484 117214 118313 119383 120098 120614 120979
54638 120979 120783 120003 119581 120371 121958 123268 123911 124157 124038 123391 122482 121706 120849 119518 118165 117795 118620
54621 118620 119807 120611 121071 121475 121819 121987 121961 121648 120852 119561 118049 116728 116018 116155 116877 117566 117922 118173
54603 118173 118389 118169 117441 116967 117434 118560 119766 121137 122860 124215 124247 123182 122135 121495 120710 119599
54587 119599 118779 118532 118280 117569 116760 116350 116338 116664 117602 119214 120893 121909 122076 121580 120558 119211 118018
54570 118018 117448 117581 118177 118954 119664 120129 120380 120588 120843 121149 121618 122447 123675 125107 126374 126964 126490 125276
54552 125276 124380 124564 125415 125975 126018 126106 126500 126785 126632 126286 126084 126100 126523 127868 130424 133783 137170 139980
54534 139980 141902 142891 143295 143736 144597 145755 146896 147845 148514 148780 148598 148065 147264 146222 145074 144067 143264
54517 143264 142370 140970 138874 136269 133652 131580 130357 129885 129861 130037 130296 130651 131243 132103 132780 132557 131319
54500 131319 129960 129599 130541 132215 133850 134854 134884 134132 133417 133469 134142 134681 134716 134525 134380 134193 133913 133799
54482 133799 134053 134513 134946 135482 136554 138381 140619 142567 143748 144261 144495 144660 144867 145493 146903 148732
54466 148732 150038 150437 150538 150930 151304 151091 150419 149839 149453 148949 148238 147499 146859 146585 147240 148994 150998 152141
54448 152141 152248 151925 151477 150749 149874 149285 148870 147888 145957 143594 141607 140385 139867 139699 139338 138433 137159
54431 137159 135902 134778 133873 133702 134714 136433 137854 138753 139896 141774 143854 145436 146602 147855 149182
54416 149182 149978 149809 148922 147988 147429 147086 146626 146196 146306 146951 147352 146910 145984 145261 144813 144371 144127 144543 145642
54397 145642 147205 149391 152306 155177 156904 157409 157588 157934 158119 158008 158100 158600 158926 158493 157348 155714 153617
54380 153617 151330 149589 148897 148987 149283 149503 149603 149619 149780 150362 151216 151847 152065 152114 152101 151835 151406 151329 151847 152564
54360 152564 152991 153103 153222 153736 154969 156839 158608 159510 159671 159836 160215 160280 159821 159409 159603 160399 161695 163503
54342 163503 165395 166484 166454 166018 165919 166102 166304 166848 168166 170002 171694 173011 174197 175349 176150 176122 174950
54325 174950 172761 170289 168492 167778 167724 167576 166709 164743 161761 158495 155831 153927 152287 150702 149601
54310 149601 149388 149984 151098 152320 152946 152405 151058 149820 148906 147709 146088 144835 144611 145296 146699 148882
54294 148882 151280 152541 152049 150785 149974 149679 149485 149680 150680 151911 152389 152083 151754 151703 151652 151621 151974 152681
54276 152681 153324 153787 154247 154593 154570 154412 154597 154995 155005 154553 154293 154675 155425 156071 156491 156752 156905 157224 158290
54257 158290 160505 163563 166576 168683 169634 169817 169753 169608 169304 168957 168805 168710 168190 167056 165604 164091 162507
54240 162507 161034 160084 159651 159238 158766 158838 159618 160123 159356 157643 156151 155475 155379 155517 155612 155213 154093 152774
54222 152774 152023 151899 151904 151795 151580 150976 149690 148235 147555 147764 147950 147442 146648 146359 146775 147544 148336 149055 149682
54203 149682 150136 150208 149639 148458 147211 146596 146843 147636 148601 149658 150913 152361 153700 154424 154290 153769 153707
54186 153707 154385 155244 155751 156089 156629 157165 157184 156637 155914 155226 154459 153463 152105 150347 148658 148012 148792 149977
54168 149977 150113 149039 147978 147916 148533 148812 148121 146533 144619 143162 142668 142960 143481 144019 144838 146037 147180
54151 147180 147686 147320 146263 145012 144303 144759 146355 148353 149879 150531 150483 150177 149972 149903 149760 149393 148907 148520
54133 148520 148367 148492 148840 149183 149251 149072 148993 149240 149722 150373 151369 152831 154555 156205 157516 158250 158378 158397
54115 158397 158950 159926 160514 160416 160356 160951 161764 162103 162121 162330 162521 162086 161173 160595 160621 160671 160216 159329 158292 157292
54095 157292 156595 156503 157024 157933 159100 160384 161390 161813 161883 161995 162089 161963 161931 162444 163165 163273 162697 162284 162545
54076 162545 163014 163124 163066 163355 164052 164874 165741 166806 168105 169467 170694 171674 172417 173076 173821 174634 175310 175647
54058 175647 175599 175319 175136 175344 175876 176340 176467 176326 176016 175516 175012 175000 175847 177632 180541 184779 189729 193929
54040 193929 196552 198401 200794 204074 208007 213067 220163 229368 240000 251930 265741 281441 297975
54027 297975 314171 329309 342454 352046 356663 355891 350394 341669 331742 322371 314209 306992 300487 294739
54013 294739 289470 284013 278012 271659 265186 258698 252539 247135 242375 237780 233361 229657 226796 224228
53999 224228 221544 218896 216405 213889 211480 209805 209161 209007 208645 207950 207097 206042 204644 202963 201152
53984 201152 199325 197679 196418 195467 194594 193863 193522 193456 193219 192660 191985 191205 190155 189096 188637 188887 189336
53967 189336 189723 190390 191551 192822 193756 194327 194686 195000 195638 196880 198270 198936 198813 198837 199680 200981 202123
53950 202123 203084 204147 205489 207411 210277 213739 216706 218615 220192 222495 225784 229789 234430 239582
53936 239582 244663 249104 252874 256027 258202 259240 259845 260956 262702 264491 265924 267080 268162 269434
53922 269434 271319 274011 277056 279727 281777 283564 285626 288337 291789 295786 300167 305254 311527 318671
53908 318671 325402 330666 334621 338086 341438 344428 346677 347897 347893 346839 345325 343840 342446 341216 340556
53893 340556 340755 341518 342313 342892 343204 343164 342782 342111 340806 338214 334205 329385 324164 318249 311528 304815
53877 304815 299075 294475 290865 288676 288543 290481 294279 300434 309762 322108 336059 349690 360883
53864 360883 367186 366584 358907 346032 330468 314072 298001 283118 269981 258645 248817 240167 232532
53851 232532 225957 220559 216276 212834 210001 207683 205766 204245 203543 204155 205644 206580 205941 204226 202641
53836 202641 201629 200755 199723 198771 198139 197745 197451 197275 197302 197600 198124 198527 198404 197943 197912 198646 199460 199499 198739
53817 198739 197698 196683 195938 196049 197373 199317 200939 202048 203041 203983 204732 205769 207953 211338 215047
53802 215047 218396 221453 224434 227350 230412 233971 237828 241299 244264 247471 251396 255418 258664 261248
53788 261248 264121 267816 271799 275047 277059 278227 279262 280308 280791 280238 278944 277529 276130 274495 272675
53773 272675 271080 269843 268619 267075 265158 262857 260125 257065 253815 250265 246281 242174 238436 235039
53759 235039 231552 227994 225012 222980 221426 219577 217122 214246 211319 208763 206885 205550 204305 202965
53745 202965 201818 201071 200421 199403 197960 196539 195825 196434 198469 201203 203456 204508 204491 203872 202899 201733
53729 201733 200760 200427 200880 201954 203351 204693 205653 206282 207109 208655 210934 213581 216426 219657 223396 227308
53713 227308 230799 233555 235772 237830 239878 241835 243721 245755 248087 250601 253050 255235 257022 258393
53699 258393 259547 260799 262274 263890 265705 267989 270808 273841 276731 279365 281636 283234 283897 283653 282627
53684 282627 280980 279195 278031 277775 277848 277456 276368 274821 273092 271541 270678 270641 270895 270868 270601 270376 270155
53667 270155 269931 270169 271145 272233 272637 272576 272872 273481 273392 272039 269966 267895 265964 264154 262750 261966 261642
53650 261642 261603 261903 262522 263235 263912 264516 264737 264228 263350 263096 263969 265468 266884 268058 269068 269766 270089 270350
53632 270350 270784 271166 271342 271746 272847 274368 275661 276737 278309 280741 283505 285894 287953 290386 293692
53617 293692 297708 302023 306465 311013 315364 319007 321775 324049 326320 328824 331694 335063 338743 342170
53603 342170 345039 347750 350873 354385 357840 360976 363752 365986 367526 368636 369740 370805 371422 371440 371057
53588 371057 370408 369486 368395 367225 365749 363695 361187 358508 355637 352560 349793 347972 347044 346556 346526 347268
53572 347268 348445 349266 349708 350691 352863 356080 360183 365179 370228 373510 373961 372485 370681 368954 366633
53557 366633 363489 360168 357282 354890 353002 351916 351788 352238 352641 352690 352509 352374 352484 353073 354532 357137
53541 357137 360614 364236 367506 370474 373304 376036 379103 383451 389462 396155 402288 408021 414686 423041
53527 423041 432694 443131 454282 465922 477528 489074 501150 513986 527132 540412 554461 569977
53515 569977 587137 605967 626451 647946 669422 690760 712971 736675 761209 785755 810406
53504 810406 835416 860302 884552 908473 932403 955780 977937 999289 1020670 1041955 1062384
53493 1062384 1081951 1101439 1121182 1140778 1159983 1179082 1198289 1217411 1236127 1254135 1271245
53482 1271245 1287841 1304902 1322819 1340526 1356660 1371362 1385935 1400745 1414467 1425631 1434012
53471 1434012 1440169 1444424 1446769 1447225 1445755 1442046 1435722 1426624 1414826 1400682 1384952 1368541 1351953
53458 1351953 1335136 1317803 1299683 1280533 1260267 1239065 1217061 1194107 1170257 1146376 1123632
53447 1123632 1102302 1081574 1060687 1039826 1019710 1000784 983124 966813 952010 938847 927497
53436 927497 918219 911041 905440 900602 896138 892459 890336 890127 891535 894057 897466 901784 907109 913790
53422 913790 922415 933144 945227 957871 971461 987100 1004832 1023407 1042272 1062742 1086283 1112412
53410 1112412 1139444 1166854 1195673 1226670 1259411 1293325 1328676 1366073 1405738 1447710 1492107
53399 1492107 1538804 1587294 1637220 1688600 1741329 1794972 1849396 1905070 1962300 2020589 2079189
53388 2079189 2137856 2196501 2254402 2310453 2364087 2415388 2464327 2510540 2553965 2594985 2633579
53377 2633579 2668841 2699924 2727107 2751280 2772543 2790000 2802923 2811338 2815144 2813416 2805111 2789920
53365 2789920 2767793 2738164 2700583 2655938 2606235 2553139 2497461 2439936 2381511 2322706 2263586
53354 2263586 2204745 2147431 2092278 2038604 1985526 1933113 1881970 1832309 1783956 1736648 1689748
53343 1689748 1642294 1594080 1546312 1500538 1457351 1416645 1378529 1343191 1310336 1279655 1251572
53332 1251572 1226720 1204970 1185706 1168717 1153925 1140478 1127125 1113499 1100229 1087831 1076202
53321 1076202 1065134 1054481 1043874 1033124 1022926 1014349 1007579 1001963 997327 994327 993339 993891 995560
53308 995560 998610 1003350 1009500 1016625 1024642 1033553 1043253 1053958 1066409 1081219 1098320 1117248 1137647
53295 1137647 1159353 1182387 1206952 1233120 1260501 1288658 1317722 1347916 1378469 1407756 1434751
53284 1434751 1459690 1483139 1505155 1525615 1544598 1562004 1577327 1590177 1600458 1607806 1611538 1611544
53272 1611544 1608593 1603336 1595689 1585609 1573648 1560087 1544216 1525290 1503659 1480205 1455152 1428343
53260 1428343 1400215 1371483 1341996 1310953 1278281 1244945 1211750 1178686 1145689 1113280 1082053
53249 1082053 1052064 1023154 995428 968943 943190 917429 891544 866219 842153 819307 796998
53238 796998 774629 752124 729750 707867 687074 668299 652199 638418 625903 614100 603415
53227 603415 594246 586069 577901 569366 560807 552527 544375 535993 526989 516979 505905 494357 483137
53214 483137 472422 461737 450827 440149 430352 421650 413952 407227 401379 395962 390407 384559 378677
53201 378677 372935 367140 360992 354427 347617 340835 334383 328495 323170 318264 313834 310212 307503 305218
53187 305218 302721 299964 297414 295267 293079 290322 286951 283321 279831 276854 274632 273004 271522 270130
53173 270130 269374 269617 270311 270487 269773 268556 267397 266726 266848 267664 268469 268553 267947 267115 266072 264486 262580
53156 262580 261094 260178 259081 257297 255400 254253 253855 253427 252299 250270 247440 244237 241481 239919 239600
53141 239600 239920 240263 240470 240783 241473 242441 243175 243237 242808 242462 242405 242285 241843 241305 240935 240646 240371 240437 241165 242351
53121 242351 243509 244400 244940 244849 243960 242782 242180 242376 242674 242383 241670 241265 241503 241979 242126 241894 241691 241734 241633
53102 241633 240700 238642 235891 233319 231645 230970 230708 230062 228761 227351 226662 227001 227937 228749 228956 228571 228105
53085 228105 228175 228828 229347 229069 228268 227869 228284 228976 229297 229332 229684 230713 232174 233479 234145 234087 233631 233190 232975
53066 232975 232995 233112 232980 232233 231054 230271 230492 231351 232078 232576 233348 234530 235731 236730 237604 238139 237998 237631
53048 237631 238116 239659 241044 241135 240325 239831 240003 240034 239125 237335 235333 233699 232520 231433 230084 228598
53032 228598 227436 226840 226705 226920 227361 227612 227303 226767 226652 226785 226256 224901 223734 223453 223449 223053 222884 223877
53014 223877 225607 226729 226851 226898 227719 229239 230992 232610 233653 233784 233325 233069 233359 233852 234244 234636 235032
52997 235032 235096 234729 234450 234847 235933 237260 238452 239360 239898 240004 239792 239574 239618 239853 239901 239573 239234 239426 240186
52978 240186 241095 241978 243012 244060 244621 244835 245832 248394 251747 254391 255839 256826 258080 259656 261353 262965
52962 262965 264123 264571 264721 265333 266514 267536 267748 267131 265943 264355 262600 260928 259272 257374 255414
52947 255414 254035 253492 253153 252118 250088 247529 245183 243585 242795 242463 242297 242395 242931 243622 243880 243464 242656
52930 242656 241793 241035 240606 240854 241816 243001 243730 243637 242879 242034 241718 242010 242314 242026 241196 240363 239931 240006 240586
52911 240586 241446 242050 242056 241723 241362 240686 239366 237991 237636 238523 239899 241202 242428 243230 242781 241012 239132
52894 239132 238275 238309 238565 239039 240104 241582 242920 243978 244862 245193 244412 242795 241380 240706 240237 239278 237958
52877 237958 237002 236847 237289 237783 237825 237218 236282 235770 236250 237459 238447 238583 238316 238708 240233 242384 244540 246739
52859 246739 249214 251513 252793 252917 252657 252601 252448 251688 250494 249394 248325 246586 243803 240516 237632 235442
52843 235442 233371 230692 227352 224019 221337 219356 217808 216728 216397 216696 216912 216386 215177 213957 213423
52828 213423 213867 215101 216647 218157 219736 221678 223788 225170 224927 223025 220411 218359 217688 218352 219564
52813 219564 220387 220451 220228 220667 222523 225891 230207 234658 238608 241623 243195 242821 240584 237411 234356 231767
52797 231767 229453 227449 226098 225341 224510 223018 220962 218868 217131 215862 215006 214418 213944 213545 213241 213005
52781 213005 212951 213461 214736 216206 216898 216526 215801 215483 215601 215850 216227 216850 217461 217639 217386 217183 217517 218577
52763 218577 220217 221907 222906 222850 222153 221557 221327 221094 220437 219330 218070 217035 216608 217050 218240 219596 220401
52746 220401 220325 219666 219105 219198 220011 221186 222308 223267 224351 225981 228195 230382 231743 232128 232238 232860 234146
52729 234146 235821 237785 240075 242470 244576 246224 247396 247917 247666 246975 246273 245464 244264 243034 242508 242590
52713 242590 242325 241321 240342 240013 239780 238879 237638 236890 236574 235933 234891 234166 233916 233303 231812 230263 229878
52696 229878 230735 231712 231921 231705 232134 233733 235912 237697 238842 239982 241651 243508 244829 245533 246247 247394
52680 247394 248674 249556 249909 249845 249311 248241 247033 246427 246741 247449 247687 247071 245870 244538 243350 242510 242250
52663 242250 242546 242886 242659 241835 241075 241081 241931 243120 244154 245055 246296 248268 250842 253479 255727 257420 258352
52646 258352 258118 256525 254058 251591 249686 248390 247562 247031 246472 245519 244164 242815 241914 241742 242581 244688
52630 244688 247897 251444 254416 256430 257884 259563 261825 264050 265083 264361 262386 259860 256813 253111
52616 253111 249432 246914 245833 245430 245132 245178 245787 246450 246548 246163 245825 245825 246154 246757 247484 248070 248460 248872 249340
52597 249340 249571 249518 249613 250133 250772 251246 251838 252877 254020 254676 254909 255380 256513 258122 259734 260895 261324
52580 261324 261145 260877 260854 260838 260438 259717 259023 258478 257997 257593 257275 256912 256573 256739 257663 258724 258972 258188 256903
52561 256903 255511 253952 252262 250817 249838 249104 248328 247522 246835 246270 245676 244864 243743 242551 241893 242276 243556
52544 243556 244949 245625 245216 243999 242745 242179 242304 242413 241989 241310 240899 240739 240522 240429 241039 242509 244322
52527 244322 245825 246661 246738 246337 246193 246981 248608 250394 251894 253075 253785 253732 253209 253214 254470 256637 258851
52510 258851 260754 262733 265333 268744 272701 276661 280065 282509 283642 283037 280508 276601 272485 269134
52496 269134 266739 264930 263336 261773 260140 258405 256704 255299 254332 253674 253055 252408 252000 252074 252460 252832
52480 252832 253380 254738 257004 259245 260469 260819 261335 262697 264702 266857 268908 270666 271893 272585 273127
52465 273127 274005 275520 277739 280451 283203 285653 287940 290408 292963 294929 295523 294262 291162 286916 282719
52450 282719 279328 276360 272992 269297 266217 264158 262404 260260 258087 256665 256050 255652 255181 254831 254645
52435 254645 254229 253236 251787 250341 249373 249191 249780 250693 251264 251122 250514 250063 250130 250452 250501 250210 250115 250630 251426
52416 251426 251874 252022 252661 254362 256832 259408 261843 264269 266738 269279 272469 277446 285029 294887 305701
52401 305701 316099 325186 332253 336410 336934 333907 328202 320910 313050 305683 299634 294911 290879 287316
52387 287316 284801 283708 283376 282878 282248 282273 283274 284776 286294 287778 289278 290740 292276 294131 296312
52372 296312 298662 301299 304513 308187 311764 314829 317307 319149 320358 321296 322365 323267 323199 321898 319947
52357 319947 317933 315975 314236 313265 313345 314033 314727 315253 315594 315560 315147 314871 315288 316443 318087 320088 322328
52340 322328 324515 326493 328462 330668 333154 336050 339693 344160 349097 354270 359891 366096 372611 379384
52326 379384 387085 396392 407113 418620 430801 443958 457918 471943 485500 498599 511370 523812
52314 523812 536063 548546 561650 575397 589380 602906 615463 627315 639428 652480 666138
52303 666138 679606 692627 705520 718479 731376 744156 756894 769386 781046 791231 799380 804979
52291 804979 807798 808084 806267 802599 797471 791756 786256 780875 774991 768580 762350 756778 751735 747192
52277 747192 743521 740802 738543 736540 735448 735962 737886 740581 743950 748384 754010 760635 768278 777073
52263 777073 786689 796464 806168 816071 826206 836219 846165 856810 868653 881201 893741 906376
52251 906376 919580 932962 945287 955765 964545 971744 976774 979113 979219 977997 975664 971750 966124
52238 966124 959439 952542 945818 939137 932086 924252 915663 907003 899094 892125 885584 878856 871637 863906
52224 863906 855981 848539 842144 836771 832177 828580 826358 825196 824349 823810 824337 826053 827995 829571 831596
52209 831596 835114 839873 844818 849518 854140 858435 861909 864847 868070 871605 874584 876685 878766 881713
52195 881713 885477 889690 894476 900053 906097 912174 918410 925118 931928 937879 942260 944983 946260 946319 945350
52180 945350 943262 939520 933604 925700 916667 907358 898218 889467 881213 873347 865788 859039 854041 851150
52166 851150 849595 848392 847599 848209 850838 854943 859383 863362 866747 869844 873057 876426 879325 880835 880613
52151 880613 879161 877181 875119 873487 872975 873629 874450 874601 874726 876138 878796 881083 881778 881246 880298 878858
52135 878858 876569 873947 871987 870951 870501 870875 873043 877645 884501 893323 904267 917478 932707 949644
52121 949644 968281 988516 1009755 1031355 1053346 1076257 1100144 1123999 1146366 1166448 1184542
52110 1184542 1201350 1217122 1231559 1244369 1255588 1265286 1273395 1280094 1286144 1292522 1299690 1307409 1315178
52097 1315178 1322673 1329776 1336308 1341760 1345299 1346110 1343774 1338188 1329201 1316706 1301188 1283782 1265583
52084 1265583 1247201 1229256 1212820 1198811 1187082 1176661 1166961 1158391 1151733 1147195 1144253 1142283
52072 1142283 1141312 1142089 1145281 1150606 1157029 1163882 1171344 1179603 1188200 1196723 1205683 1215867 1227024 1237968
52058 1237968 1247992 1257408 1266647 1275632 1284370 1293463 1303424 1313777 1323243 1330574 1335018 1336382 1335103
52045 1335103 1332017 1327602 1321473 1312875 1301634 1288468 1274535 1260929 1248380 1236992 1226179 1215238
52033 1215238 1204161 1193715 1184538 1176297 1168027 1159278 1150626 1142859 1135927 1129011 1121562 1113825 1106304
52020 1106304 1099089 1091997 1085020 1078342 1072098 1066385 1061332 1056956 1053150 1049989 1047684 1045876 1043375 1039075
52006 1039075 1032837 1024943 1015064 1002557 987649 971371 954219 935775 915979 895950 876971 859234
51994 859234 842165 825626 810166 796309 784037 772853 761953 750521 738267 725663 713439
51983 713439 701961 691188 680854 670389 658986 646255 632635 618722 604349 588883 572483
51972 572483 556574 542905 532457 525285 521045 519334 519758 521942 525548 530271 535877 542296 549502 557244
51958 557244 565002 572259 578685 583948 587412 588225 585861 580597 573459 565623 557884 550663 544410 539772
51944 539772 537311 537210 539351 543560 549701 557639 567270 578480 590992 604352 618219 632561 647232
51931 647232 661259 672806 680106 682539 680794 676005 668732 658734 645566 629355 611047 592004 573425
51918 573425 556034 540094 525583 512409 500565 490137 481175 473625 467393 462439 458731 456198 454860
51905 454860 455000 457051 461200 467191 474560 483039 492572 502963 513581 523392 531178 535832 536769 534270
51891 534270 529337 523074 516336 510004 505309 503499 505277 510794 520052 532949 548870 566500 584005
51878 584005 599254 610188 615770 616846 615602 613844 611953 609494 606250 602311 597638 592038 585336 577254
51864 577254 567446 556082 544130 532571 521560 510795 500508 491574 484767 480399 478478 478676 480120
51851 480120 481833 483477 485201 486728 487075 485358 481498 476045 469713 463204 456989 450949 444477 437182
51837 437182 429375 421858 415510 411131 409223 409628 411515 413945 416384 418667 420731 422540 424043 425117
51823 425117 425618 425537 424952 423900 422443 420777 419047 417253 415668 415166 416539 419487 422842 425885 428915
51808 428915 432307 435589 437853 438642 438061 436326 433655 430420 427027 423688 420597 418206 417032 417230 418496
51793 418496 420284 421900 422528 421520 418821 415069 411236 408138 406154 405264 405233 405679 406072 405936 405189 404065
51777 404065 402487 399911 396208 392466 390376 390785 393251 396915 401324 406441 412492 419979 429350 440364
51763 440364 452097 463657 474463 483794 490653 494406 495172 493319 489000 482430 474200 464977 455163 445083
51749 445083 435210 425911 417298 409502 402842 397531 393559 391045 390289 391256 393439 396556 401035 407501 416065
51734 416065 426332 437736 449583 461056 471400 479913 485872 489181 491287 494693 501037 510052 520478
51721 520478 531077 540188 545407 544994 539494 531221 522419 514469 508253 504015 500807 496998 491607 484746
51707 484746 477006 469169 462444 458145 456834 458165 461432 465658 469304 470774 469565 466518 462896 459617
51693 459617 457327 456478 457176 459296 462696 466763 469877 470107 466676 460277 452025 442840 433854 426385 421002
51678 421002 417277 414813 413841 414429 415824 417255 418795 420833 423204 425669 428894 434152 442107 452559
51664 452559 465264 480138 496324 511658 523534 530168 531004 526368 517169 504840 491141 477840
51652 477840 466509 458437 454338 454006 456449 460616 465891 471615 476211 477424 473886 466278 456541 446045
51638 446045 434937 423191 411632 401595 393818 388037 383561 380014 377470 376037 375418 375071 374744 374660
51624 374660 375022 375592 376089 376777 378219 380516 383246 386191 389526 393072 395856 396842 395944 393975 391717 389361
51608 389361 386732 383761 380615 377512 374516 371592 368897 366912 366166 366840 368792 371919 376292 382020 389314
51593 389314 398640 410386 424129 438430 451470 461708 468030 469895 467820 463521 459063 455758 453924
51580 453924 453536 454779 457983 463344 470878 480647 492967 508211 526119 545279 563725 580481 596438
51567 596438 613362 631957 651001 668306 682400 693559 703860 716422 734202 758915 790902
51556 790902 829854 875173 925218 976382 1023628 1062488 1090653 1107766 1114170 1110248 1096639 1074406
51544 1074406 1044684 1008450 966799 921228 873472 825149 777662 732292 690248 652641 620291
51533 620291 593304 570821 551500 534412 519297 506023 494265 483842 474919 467487 461032 455071
51521 455071 449746 445496 442424 440317 438965 437929 436349 433661 430398 427675 425870 424364 422571 420556
51507 420556 418491 416131 413148 409582 405713 401820 398265 395437 393372 391771 390544 389986 390156 390506 390513 390423
51491 390423 390941 392331 394078 395493 396424 397429 399306 402349 405988 409302 411962 414424 417171 420009 422335
51476 422335 423827 424557 424562 423607 421445 418111 413882 409045 403736 398072 392353 386986 382098 377394 372595
51461 372595 367876 363655 360041 356835 353993 351698 349893 348157 346237 344462 343421 343400 344266 345802 348075
51446 348075 351652 357424 366018 377351 391024 407047 425679 446244 466440 483318 495108 502154
51434 502154 506297 509483 512714 515972 518706 520113 518962 513789 503972 490697 476462 463489 452799
51421 452799 444532 438445 433854 429696 425204 420439 415989 412296 409412 407149 405284 403728 402602 401996
51407 401996 401667 401179 400373 399445 398633 398120 398165 398818 399568 399852 400043 401340 404436 408776 413428 418084 422912
51390 422912 427981 433397 439617 447093 455773 465446 476496 490054 507542 530234 558982 594059 635460
51377 635460 683435 738348 799854 866634 936997 1008911 1078940 1142026 1193428 1230901 1254522
51366 1254522 1264819 1261846 1245774 1217439 1178162 1129706 1074413 1014786 952825 890194 828908
51355 828908 771087 717937 669538 625819 587153 553800 525357 501141 480718 463715 449488
51344 449488 437347 426948 418192 410868 404637 399254 394613 390607 387100 384010 381424 379624 378868 379005
51330 379005 379323 378944 377430 375026 372469 370632 370033 370437 371082 371534 372059 372947 373831 374144 373967 373776 373443
51313 373443 372160 369509 366103 363053 361184 360797 361670 363079 364216 364795 365022 364952 364343 363246 362202 361568
51297 361568 361026 360028 358467 356591 354632 352765 351213 350097 349422 349372 350312 352231 354523 356693 359133 362860
51281 362860 368559 376058 384474 392604 399432 404676 408776 412006 413761 413171 410375 406674 403213 399917
51267 399917 396046 391577 387608 385297 384708 384921 385178 385569 386418 387349 387361 385844 383128 379953 376740 373544
51251 373544 370326 366945 363150 358972 354986 351831 349595 348041 347305 347841 349647 352005 354184 356013 357570
51236 357570 358744 359453 359989 360705 361543 362241 362878 363753 364731 365187 364800 364049 363718 364171 365293 366888 368839
51219 368839 371032 373395 375942 378533 380687 381914 382163 381732 380786 379305 377546 376141 375545 375604 375908 376427
51203 376427 377534 379450 381913 384462 386872 389161 391229 392765 393606 393996 394204 393994 392896 391153 389889
51188 389889 389955 390904 391660 391979 392639 394197 396238 398080 399612 401051 402270 402850 402586 401594 400080 398270
51172 398270 396411 394538 392420 389901 387130 384233 381060 377607 374500 372640 372397 373421 375141 377171
51158 377171 379339 381683 384377 387384 390156 391960 392526 392188 391396 390371 389175 387942 386932 386477 386803
51143 386803 387765 388881 389752 390315 390495 389881 388142 385673 383394 381862 380872 380007 379251 378910 379182 380004 381256
51126 381256 382989 385469 388925 393198 397683 401734 405094 407863 410195 412229 414129 415887 417119 417340
51112 417340 416532 415260 414174 413488 412967 412290 411439 410788 410850 411909 413901 416562 419454 421967 423689 424896
51096 424896 426279 427952 429167 429323 428928 429125 430464 432529 434527 435896 436578 437153 438477 440732 443009
51081 443009 444240 444224 443248 441186 437836 433949 430892 429176 428146 427269 426781 426799 426760 426368 426344 427509 429665
51064 429665 432113 434974 439190 445421 453621 463708 475910 490041 504742 517805 527442 533367 536803
51051 536803 539565 543198 548949 557959 570659 585909 601513 616135 630327 645253 660667 674668
51039 674668 685213 691443 693782 693462 692078 690905 689940 687525 681166 669085 651335 629711 606632
51026 606632 584041 563182 545042 530449 519576 511660 505588 500740 497200 495354 495432 497291 500443
51013 500443 504337 508734 513640 518864 523908 528544 533203 538446 544193 549867 555309 561165 568246 576678
50999 576678 585854 595022 603919 612923 622784 634140 647181 661663 677229 693672 710894 728610
50987 728610 746164 762742 777844 791532 804181 816078 827301 837876 847862 857266 865826 872790
50975 872790 876986 877559 875015 871318 868699 868481 871302 877970 889334 905374 925352 949152 977853
50962 977853 1012452 1052456 1096252 1142622 1191388 1242609 1295560 1348587 1399749 1447628 1491665
50951 1491665 1531790 1567779 1599126 1625569 1647472 1665599 1680709 1693511 1704841 1715689 1727160
50940 1727160 1740288 1755397 1771281 1785245 1794323 1796668 1792064 1781624 1767228 1750747 1733217 1714635
50928 1714635 1694591 1672823 1649069 1622844 1593774 1561875 1527122 1489007 1447130 1402194 1355931
50917 1355931 1309951 1265001 1221387 1179630 1140483 1104534 1072025 1042905 1016863 993483 972588
50906 972588 954356 938888 925665 913642 902014 890811 880648 871959 864662 858500 853412 849348
50894 849348 845932 842566 838853 834831 830956 827965 826472 826441 827186 828184 829576 831544 833565 834962 836040
50879 836040 837866 840829 844177 847234 850262 853730 857399 860804 864207 868401 873802 880275 887730 896331
50865 896331 906158 917057 928860 941544 955271 970510 987972 1008114 1030862 1056105 1084371 1116768
50853 1116768 1154326 1197644 1247094 1303104 1366169 1436697 1514796 1600218 1692609 1791709 1897118
50842 1897118 2007962 2123185 2242003 2363341 2484655 2602005 2711701 2811401 2899355 2973517
50832 2973517 3032282 3075678 3104934 3120984 3124168 3115381 3096970 3072429 3045590 3019957 2998215 2982131
50820 2982131 2972938 2971501 2977714 2990017 3005870 3022355 3035928 3042183 3037022 3018416 2986606 2942609
50808 2942609 2886909 2819498 2740517 2650773 2552092 2447289 2339456 2231267 2125134 2023646
50798 2023646 1929168 1843099 1765969 1698144 1639912 1591044 1550929 1519085 1495040 1477922 1466874
50787 1466874 1461688 1462163 1466985 1474192 1482799 1492889 1503902 1513997 1521630 1526785 1530053 1531425 1530827 1528976
50773 1528976 1526597 1523158 1517391 1508838 1498043 1485303 1470142 1452128 1431480 1408576 1383420 1355967
50761 1355967 1326715 1296666 1266759 1237436 1208794 1181083 1155015 1131412 1110584 1092259 1076133
50750 1076133 1062136 1050130 1039868 1031592 1026262 1024706 1026746 1031595 1038877 1048769 1061324 1076349 1094100
50737 1094100 1115603 1141925 1173335 1209362 1249495 1293667 1342123 1394980 1451888 1512027 1574461
50726 1574461 1638485 1703629 1769419 1835211 1900135 1963011 2022346 2076571 2124288 2164140 2194480
50715 2194480 2213528 2220090 2214165 2196817 2169740 2135228 2096459 2057281 2021194 1990391 1965762 1947631
50703 1947631 1936265 1931769 1933782 1941365 1952971 1966490 1979493 1989557 1994360 1991676 1979797 1958077
50691 1958077 1926858 1886886 1839241 1785929 1729884 1673845 1619471 1567750 1519789 1476666 1438931
50680 1438931 1406916 1381372 1363252 1352979 1350471 1355653 1368336 1387754 1412979 1443781 1480424 1522498
50668 1522498 1568520 1616658 1665151 1712013 1755211 1793585 1827090 1856017 1880648 1901894 1921326
50657 1921326 1939955 1957466 1973089 1986717 1998646 2008828 2017072 2023631 2028999 2033448 2037386 2041941
50645 2041941 2048579 2058264 2071472 2088777 2110799 2137648 2168980 2204548 2244174 2287152 2332118 2377566
50633 2377566 2422171 2464805 2504894 2543023 2580731 2619348 2659195 2699864 2740646 2779720 2812499
50622 2812499 2831197 2827250 2795674 2738206 2662674 2579214 2496564 2420647 2354969 2301263 2259973
50611 2259973 2230779 2212938 2205212 2205786 2212546 2223138 2234537 2243018 2245126 2238609 2222242 2195223 2157396
50598 2157396 2109756 2054005 1991587 1923796 1852748 1781275 1711412 1643475 1577142 1513039 1452744
50587 1452744 1397385 1346866 1300651 1258935 1222704 1192662 1168435 1148977 1133567 1122080 1114297
50576 1114297 1109437 1106583 1105270 1105319 1106352 1107856 1109619 1111706 1114052 1116500 1119255 1122915 1127928 1134313
50562 1134313 1142067 1151560 1163374 1177944 1195530 1216421 1240991 1269577 1302350 1339232 1379866 1423667
50550 1423667 1469821 1517116 1563834 1607995 1647896 1682536 1711820 1736599 1758543 1779720 1802102
50539 1802102 1827313 1856556 1890482 1929182 1972551 2020758 2074332 2133855 2199732 2272286 2351910
50528 2351910 2439034 2533950 2636688 2747101 2865063 2990455 3122645 3259824 3399023 3536906
50518 3536906 3670465 3796897 3913108 4015642 4101071 4166404 4209364 4228597 4223630 4194513 4141621
50507 4141621 4066012 3969953 3857024 3731835 3599595 3465507 3334195 3209741 3096315 2998225
50497 2998225 2918885 2859950 2821893 2805147 2809995 2835308 2877894 2933103 2995517 3058900 3116171
50486 3116171 3160162 3184785 3185826 3161321 3111629 3039084 2947307 2840644 2723807 2601352 2477052
50475 2477052 2353697 2233319 2117351 2006617 1901643 1803180 1712129 1628800 1552594 1482687
50465 1482687 1418865 1361411 1310332 1265041 1224761 1189022 1157710 1130786 1108082 1089403 1074693
50454 1074693 1063898 1056544 1051621 1048169 1045979 1045504 1047046 1050244 1054405 1059092 1064286 1070205 1077127 1085261
50440 1085261 1094634 1105091 1116335 1127921 1139294 1150104 1160525 1171090 1182195 1193906 1206119
50429 1206119 1218573 1230692 1241855 1252033 1261837 1271780 1281843 1292075 1303321 1316907 1333664 1353646
50417 1353646 1376877 1404046 1436391 1475068 1520714 1573394 1632739 1698093 1768635 1843446 1921522
50406 1921522 2001721 2082649 2162566 2239542 2311836 2378309 2438498 2492190 2538643 2576050 2601808
50395 2601808 2613517 2609792 2590241 2555052 2504982 2441685 2367665 2285843 2199330 2111483 2025570
50384 2025570 1944105 1868758 1801136 1743309 1697237 1663888 1643208 1634697 1637523 1650111 1670163 1695264
50372 1695264 1723191 1751403 1776496 1794568 1802316 1797965 1781454 1753985 1717289 1673003 1622488 1567176
50360 1567176 1509012 1450345 1393184 1338572 1286836 1238401 1193994 1153774 1116562 1080460 1044418
50349 1044418 1008960 975410 944828 917827 894825 875798 859871 845727 832587 820542 809978
50338 809978 801063 793845 788310 784071 780382 776882 774068 772609 772359 772513 772610 772915 773780 775229 777378 780714
50322 780714 785514 791364 797792 805199 814609 826524 840544 856240 873872 893918 916173 939634
50310 939634 963018 984920 1003537 1016755 1022961 1021911 1014854 1003883 991075 977944 965350 953746
50298 953746 943497 934948 928179 922805 918265 914410 911630 910176 909502 908620 907068 905138 903130 900927
50284 900927 898598 896943 896974 899060 902894 907835 912662 915511 915041 911833 907885 904589 901878 899450 897835
50269 897835 897721 898923 900697 902630 904585 906152 906842 906689 906187 905801 905993 907382 910296 914216 918121 921297
50253 921297 923480 924526 924486 923851 923096 922098 920518 918639 917208 916475 916053 915739 915749 915998 915930 915500 915767 918024
50235 918024 922612 928880 935970 943339 950901 959163 969101 981522 996573 1014101 1034333 1057860 1084929
50222 1084929 1114952 1146698 1178813 1210155 1239840 1267162 1291644 1313258 1332584 1350653 1368539
50211 1368539 1387007 1406305 1426012 1444987 1461461 1473189 1477664 1472708 1457316 1431979 1398121 1357397
50199 1357397 1311742 1263670 1215964 1170966 1130372 1095452 1066953 1044830 1028504 1017329 1010229
50188 1010229 1004816 997518 985126 966207 941262 912101 881221 851051 823058 797496 774107 752820
50176 752820 733690 716629 701628 689032 679173 671727 665718 660216 654894 649978 645838 642710 640680
50163 640680 639736 639639 639845 639897 640016 640942 642962 645516 648212 651841 657720 666175 676343 687337 698793
50148 698793 710156 720300 728248 733749 736866 737603 736268 733626 730238 726109 721411 717098 714247 713133
50134 713133 713378 714727 717230 720926 725719 731362 737293 742833 747877 753063 758906 765201 771650 778607
50120 778607 786607 795559 805127 815680 828185 843232 860860 881326 905444 934057 967646 1006563
50108 1006563 1051260 1102155 1159475 1223112 1292147 1364490 1437393 1508507 1576429 1640589 1701150
50097 1701150 1759012 1815440 1871453 1927645 1984245 2040648 2094682 2142719 2180760 2205483 2214640
50086 2214640 2207158 2183201 2144006 2091581 2028583 1958096 1882972 1805354 1727106 1650519 1577915
50075 1577915 1510512 1448227 1390856 1339027 1293697 1255089 1222404 1194338 1169564 1146852 1125055
50064 1125055 1103189 1080645 1057496 1034541 1012778 992769 974540 957897 942560 928149 914447
50053 914447 901681 890201 879842 870075 860783 852491 845637 840021 835232 831320 828806 828216 829777 833280
50039 833280 838055 843316 848771 854772 861725 869626 878331 887933 898518 909742 921000 931896 942188
50026 942188 951331 958463 963071 965415 966167 965727 964052 961057 956928 951980 946348 939989 932865 924925 915908
50011 915908 905548 894151 882779 872531 863695 855744 848073 840504 833227 826692 821662 819177 820272
49998 820272 825713 835824 850332 868400 889008 911368 934949 959408 984873 1012185 1042442 1076198
49986 1076198 1113261 1153026 1194455 1235744 1274681 1309664 1340132 1365911 1386721 1402747 1415435
49975 1415435 1427180 1440203 1455738 1473893 1493690 1512991 1528619 1536866 1534340 1518938 1490445 1450329
49963 1450329 1400944 1344927 1285086 1224204 1164589 1107858 1055229 1007790 966391 931580 903777
49952 903777 883142 869051 860082 854891 852847 853521 855828 858193 859462 859314 857984 855970 853841 851758
49938 851758 849154 845268 839941 833367 825105 813935 798979 780584 759945 738285 716605 695739
49926 695739 676202 658234 642264 629001 618704 610761 604501 600154 598354 598778 600019 600981 601813 603167
49912 603167 605041 606766 607847 608469 609413 611781 616550 623887 632927 642536 652331 662837 674894 689179
49898 689179 706027 725033 744700 762934 778143 789773 797919 802907 805290 805661 804100 800073 793163
49885 793163 783597 771849 758132 742690 726287 709833 693561 676990 659779 642340 625617 610507
49873 610507 597492 586518 577171 569122 562380 557062 553081 550305 548768 548379 548589 548871 549562 551756 556143
49858 556143 562377 569795 578437 589024 602130 617649 634907 652959 670808 687645 703001 716594
49846 716594 728067 737009 743261 747101 749005 749221 747506 743240 735843 725239 712098 697635 683037
49833 683037 668936 655449 642740 631376 621970 614558 608605 603671 599848 597513 596901 597965 600382
49820 600382 603602 607291 611971 618850 628704 641082 654813 668939 682803 695678 706966 716717 725450
49807 725450 733438 740591 746908 752505 757078 759760 759682 756421 750014 741009 730608 720279 710864 702141
49793 702141 693240 683252 671694 658947 646320 635192 625889 617816 610711 605215 601944 600503 599711
49780 599711 598457 596110 592639 588743 585549 583703 582935 582766 583404 585682 590341 597603 607097 617896 628915
49765 628915 639615 650074 660098 668744 675247 680133 684737 689694 694380 697818 699556 699567 697690 693424
49751 693424 686145 675513 661968 646857 631879 618358 606969 597836 590504 584113 578143 573075 569846
49738 569846 568522 567870 566435 563812 560768 558360 557137 556995 557557 558543 559786 561002 561862 562543 563976 567196
49722 567196 572508 579605 588442 599452 612762 627579 642723 657521 671824 685200 696470 704209
49710 704209 707703 707424 704650 700596 695742 689819 682297 672974 662294 651240 640865 631777 624071 617689
49696 617689 612618 608595 604839 600467 595298 590069 585758 582769 580860 579798 579973 582212 586917 593474
49682 593474 600734 608053 615609 623751 632516 642142 653608 668012 685419 704679 724348 743245 760049
49669 760049 773004 780628 782760 780749 776676 772445 769317 767849 768109 770004 773471 778306 783677 787722
49655 787722 787817 781713 768939 751162 731061 710733 691163 672815 656143 641410 628495 617292
49643 617292 608115 601383 596953 594079 592144 591234 591852 594074 597119 599765 601207 601468 601008 600044 598342
49628 598342 595587 591775 587191 582096 576512 570356 563734 557096 551036 545901 541679 538251 535586 533629
49614 533629 532168 531052 530401 530379 530878 531732 533156 535548 538716 541712 543747 545028 546376 548111 549716
49599 549716 550597 550852 551058 551521 551945 551920 551515 551294 551793 553091 554864 556691 558245 559396 560373 561712 563763
49582 563763 566217 568342 569760 570793 571999 573667 575881 578716 581986 585087 587574 589884 593079 597804
49568 597804 603886 611024 619412 629423 640978 653585 666669 679525 691210 700928 708415 713559 715844
49555 715844 714825 711094 706086 700678 694642 687782 680983 675486 671601 668796 666843 666077 666513 667451 668185
49540 668185 668614 668909 668975 668562 667678 666680 666053 666206 667322 669407 672594 677354 684145 692953 703541 716100
49524 716100 731207 749097 769363 791390 814514 837583 858956 877238 891679 901780 907199 908556
49512 908556 907827 907397 908960 913508 921616 932885 945405 956537 964199 967057 963982 954275 938458 918169
49498 918169 895191 871090 847585 826347 808177 792922 780327 770307 762288 755100 747956 741005
49486 741005 734586 728579 723024 718774 716706 716495 716839 716976 717387 718835 721088 722969 723559 723153 722910 723672
49470 723672 725320 727315 729547 732348 735870 739933 744378 749158 754083 758985 764185 770161 776494 781703
49456 781703 784536 785037 783971 781604 777553 771575 764001 755540 747059 739337 732614 726409 720125 713706
49442 713706 707462 701550 696096 691588 688555 686875 685929 685472 685930 687738 690830 694913 699964 706343 714579
49427 714579 725071 737892 753121 771581 794803 823665 857446 895022 936398 981131 1024462
49416 1024462 1056669 1068542 1058160 1031951 999446 967683 939938 917545 901228 890929 885657
49405 885657 884303 886574 892835 902991 915692 928942 941560 953789 966318 979075 991422 1003270
49393 1003270 1015299 1027983 1040903 1053214 1064288 1073572 1080282 1083737 1083817 1080758 1074736 1065980 1055098
49380 1055098 1042817 1029479 1015178 1000364 985889 972472 960510 950438 942808 937805 935058 934144
49368 934144 935013 937676 941749 946577 951605 956319 960027 962070 962288 960972 958344 954336 948965 942692 936152
49353 936152 929606 922846 915736 908757 902864 898763 896395 895175 894639 894778 895808 897813 900562 903489 905882
49338 905882 907282 907694 907182 905328 901540 896027 890049 884833 880461 876167 871489 866705 862302 858561 855790
49323 855790 854461 854804 856490 858886 861573 864507 867820 871560 875530 879286 882402 884826 886873 888878
49309 888878 891010 893408 896241 899425 902482 904958 906927 908871 911058 913280 915361 917768 921499 927322
49295 927322 935222 944566 954676 965102 975523 985662 995453 1005113 1014879 1024722 1034434 1043880 1052905
49282 1052905 1060955 1067186 1071335 1074498 1078744 1085690 1095521 1107441 1120694 1134594 1147569 1156885 1160033
49269 1160033 1156343 1147052 1134056 1119058 1103625 1089066 1075834 1063465 1051523 1040411 1031113 1024559
49257 1024559 1021612 1023296 1030654 1044454 1065127 1092493 1125206 1160909 1197400 1233088 1265656 1290920
49245 1290920 1304397 1304322 1292410 1271636 1244262 1212290 1178511 1145856 1115918 1088873 1064727 1044042
49233 1044042 1027518 1015527 1008130 1005142 1006061 1010240 1017191 1026410 1036870 1047086 1055847 1062732 1067778
49220 1067778 1070993 1072470 1072794 1072893 1073324 1073889 1074159 1074231 1074648 1075577 1076367 1076262 1075423 1074986 1076152 1079519 1085301
49203 1085301 1093738 1104876 1118046 1131946 1145490 1158527 1171613 1185133 1198728 1211622 1223304
49192 1223304 1233749 1243120 1251592 1259493 1267190 1274569 1280969 1285957 1289984 1293898 1298084 1302554 1307763 1314644
49178 1314644 1323674 1334521 1346961 1361815 1380692 1405168 1436522 1475881 1523883 1579803 1640832
49167 1640832 1701973 1756672 1798298 1822181 1827192 1815947 1793674 1766439 1739422 1715872 1697173
49156 1697173 1683663 1675125 1670596 1668357 1666755 1665107 1663599 1662439 1661397 1660124 1658633 1657348 1656829 1657557
49142 1657557 1659916 1664198 1670488 1678454 1687489 1697269 1708046 1720116 1733157 1746569 1760344 1774976
49130 1774976 1790336 1805312 1818945 1831442 1843606 1855750 1867705 1879533 1891586 1904085 1917252
49119 1917252 1931629 1947570 1964521 1981499 1998399 2016293 2036423 2059588 2086682 2119237 2159238
49108 2159238 2208972 2271282 2349099 2443539 2551892 2667338 2781172 2887125 2985630 3083866
49098 3083866 3188527 3295365 3385848 3437031 3437699 3396211 3333055 3265513 3197931 3123922 3035826
49087 3035826 2932498 2820310 2708822 2605865 2515508 2438792 2375108 2322945 2280314 2245341
49077 2245341 2216697 2193522 2175127 2160783 2149495 2139821 2130216 2119891 2109220 2099069 2089794 2081069
49065 2081069 2072471 2063922 2055581 2047590 2039984 2032680 2025576 2018823 2012898 2008263 2005006 2002996 2002185 2002464
49051 2002464 2003407 2004587 2006140 2008538 2011742 2015060 2018008 2020875 2024247 2028456 2033807 2040857 2050014 2061149
49037 2061149 2074110 2089358 2107640 2129121 2153155 2178580 2203679 2226147 2243941 2256447 2264393
49026 2264393 2268581 2269147 2266067 2259780 2251126 2241157 2231241 2222782 2216432 2211820 2208365 2206037 2205113 2205644 2207592
49011 2207592 2211246 2216990 2224687 2233593 2242854 2251908 2260651 2269545 2279442 2290886 2303494 2316165 2327846
48998 2327846 2338043 2346820 2354642 2362067 2369238 2375620 2380473 2383587 2385310 2385951 2385500 2384039 2382076 2380156
48984 2380156 2378221 2375605 2371722 2366666 2361072 2355510 2350177 2345168 2340781 2337328 2334719 2332479 2330125 2327313
48970 2327313 2323684 2318925 2313159 2306975 2300881 2294921 2288969 2283233 2278253 2274579 2272564 2272271 2273421 2275578
48956 2275578 2278684 2283298 2290101 2299172 2309863 2321295 2332988 2345301 2359394 2376423 2396428 2418142
48944 2418142 2440166 2462163 2484633 2507794 2531237 2554687 2578656 2604132 2631853 2661977 2694300
48933 2694300 2728608 2764917 2803385 2844000 2886517 2930849 2977288 3026059 3076747 3128591 3181346
48922 3181346 3235455 3291241 3348324 3406109 3464487 3523526 3582512 3639810 3694013 3745043 3793777
48911 3793777 3840717 3885495 3927894 3968860 4009898 4051473 4092540 4131769 4168776 4203888 4237192
48900 4237192 4268389 4297398 4324576 4350193 4374066 4395861 4415540 4433334 4449344 4463326 4474986
48889 4474986 4484440 4492199 4498505 4502868 4504553 4503337 4499230 4491459 4478591 4460098 4437207 4411664 4384144
48876 4384144 4354492 4322874 4289496 4253363 4212550 4166165 4115164 4060897 4003731 3943799 3882337
48865 3882337 3821197 3761168 3701620 3641957 3582858 3525849 3472042 3421519 3373681 3327989 3284484
48854 3284484 3243808 3206764 3173776 3144695 3118924 3095633 3074041 3053834 3035448 3019792 3007556
48843 3007556 2998752 2992908 2989579 2988647 2990177 2994111 3000133 3007909 3017477 3029321 3043897 3060993 3079691
48830 3079691 3099067 3118864 3139393 3160846 3182919 3205135 3227306 3249549 3272003 3294761 3318019
48819 3318019 3342061 3367018 3392727 3418845 3445022 3470995 3496604 3521723 3546259 3570383 3594779
48808 3594779 3620308 3647116 3674313 3700923 3726969 3753200 3779944 3806907 3834192 3862746 3893407
48797 3893407 3926022 3959870 3994499 4029586 4064331 4097642 4128908 4158184 4185680 4211480 4235785
48786 4235785 4258955 4281083 4301594 4319300 4332770 4340824 4342877 4338886 4329000 4313434 4292687 4267531
48774 4267531 4238530 4205802 4169443 4129902 4087797 4043675 3998191 3951993 3904994 3856177 3804728
48763 3804728 3751152 3696678 3641869 3586553 3531006 3476292 3423239 3371769 3321653 3273442 3228237
48752 3228237 3186848 3149457 3115821 3085445 3057608 3031426 3005987 2980588 2955201 2930729 2908508
48741 2908508 2889392 2873454 2860512 2850648 2844094 2840825 2840320 2841524 2843065 2843725 2842862 2840319 2836178 2830913
48727 2830913 2825624 2821566 2819280 2818452 2818601 2819515 2820985 2822537 2823667 2824072 2823588 2822314 2820963 2820644 2821948
48712 2821948 2824395 2827045 2829521 2832277 2836003 2840922 2846564 2852070 2856796 2860685 2864099 2867388 2870745 2874284
48698 2874284 2877970 2881634 2885439 2890284 2897310 2906906 2918461 2931073 2944087 2956960 2969120 2980184
$$ [...]
##END NTUPLES=NMR SPECTRUM
##END=
